##TITLE=Analysis number 329347
Compound Code cc 53001
Book Reference 407/159
Project Code adrs
Chemist Name andyw
##JCAMPDX= 6.0         $$ Bruker NMR JCAMP-DX V2.0
##DATA TYPE= NMR SPECTRUM
##DATA CLASS= NTUPLES
##ORIGIN= Bruker BioSpin GmbH
##OWNER= nmr
$$ XWIN-NMR		Version 3.5
$$ Tue Aug 21 12:18:25 2007 GMT Daylight Time (UT+1h)  MAYBRIDGE\nmr@NMR_250MHZ
##.OBSERVE FREQUENCY= 250.131544655141
##.OBSERVE NUCLEUS= ^1H
##.ACQUISITION MODE= SIMULTANEOUS (DQD)
##.ACQUISITION SCHEME= undefined
##.AVERAGES= 16
##.DIGITISER RES= 18
##SPECTROMETER/DATA SYSTEM= dpx250
##.PULSE SEQUENCE= zg30
##.SOLVENT NAME= DMSO
##.SHIFT REFERENCE= (INTERNAL, DMSO, 0, 16.522)
##AUDIT TRAIL= $$ (NUMBER, WHEN, WHO, WHERE, WHAT)
$$ ##TITLE= Audit trail, XWIN-NMR		Version 3.5
$$ ##JCAMPDX= 5.01
$$ ##ORIGIN= Bruker BioSpin GmbH
$$ ##OWNER= nmr
$$ C:\u/data/dgb/nmr/ADRS/960/pdata/1/auditp.txt
$$ ##AUDIT TRAIL=  $$ (NUMBER, WHEN, WHO, WHERE, WHAT)
(   1,<2007-08-21 12:17:16.72 +100>,<MAYBRIDGE\nmr>,<NMR_250MHZ>,
      <created by zg, POWCHK disabled, PULCHK disabled
       configuration hash MD5:
       76 6E 9A 78 1E 09 19 81 EC 84 63 8F B0 6A 59 2D
       data hash MD5: 64K
       BB F1 3B 18 D4 A6 B6 98 DD C0 D8 B7 D8 D3 D1 B1>)
(   2,<2007-08-21 12:17:47.75 +100>,<MAYBRIDGE\nmr>,<NMR_250MHZ>,
      <Start of raw data processing
       ef LB = 0.3 FT_mod = 6 PKNL = 1 SI = 32K 
       data hash MD5: 32K
       74 BE E2 02 FF 7A 78 D0 CA C3 BF 65 9C 04 CD 84>)
(   3,<2007-08-21 12:17:53.24 +100>,<MAYBRIDGE\nmr>,<NMR_250MHZ>,
      <apk 
       data hash MD5: 32K
       E4 A6 8A B7 22 E4 F9 5F 87 CE 1C 27 16 4C FB 03>)
(   4,<2007-08-21 12:17:58.58 +100>,<MAYBRIDGE\nmr>,<NMR_250MHZ>,
      <abs ABSG = 5 
       data hash MD5: 32K
       DD FE 4B 84 03 46 01 3A 06 7F 08 CB 21 7B 87 D3>)
$$ ##END=
$$ 
$$ hash MD5
$$ 2C 21 2F 22 D5 D2 D1 45 33 4B B2 26 C8 53 E6 B0
##$RELAX= 
##$RELAX= 
##$RELAX= 
##$RELAX= 
##$RELAX= 
##$RELAX= 
##$RELAX= 
$$ Bruker specific parameters
$$ --------------------------
##$DU= <C:\u>
##$EXPNO= 960
##$NAME= <ADRS>
##$PROCNO= 1
##$TYPE= <nmr>
##$USER= <dgb>
##$AMP= (0..31)
100 100 100 100 100 100 100 100 100 100 100 100 100 100 100 100 100 100 
100 100 100 100 100 100 100 100 100 100 100 100 100 100 
##$AQSEQ= 0
##$AQ_mod= 3
##$AUNM= <au_zg>
##$AUTOPOS= <14 >
##$BF1= 250.13
##$BF2= 250.13
##$BF3= 250.13
##$BF4= 250.13
##$BF5= 500.13
##$BF6= 500.13
##$BF7= 500.13
##$BF8= 500.13
##$BYTORDA= 1
##$CFDGTYP= 0
##$CFRGTYP= 5
##$CHEMSTR= <none>
##$CNST= (0..31)
1 1 145 1 1 1 1 1 1 1 1 1 1 1 1 1 1 1 1 1 1 1 1 1 1 1 1 1 1 1 1 1 
##$CPDPRG= <>
##$CPDPRG1= <>
##$CPDPRG2= <>
##$CPDPRG3= <>
##$CPDPRG4= <mlev>
##$CPDPRG5= <mlev>
##$CPDPRG6= <mlev>
##$CPDPRG7= <mlev>
##$CPDPRG8= <mlev>
##$CPDPRGB= <>
##$CPDPRGT= <>
##$D= (0..31)
0 1 0 0 0 0 0 0 0 0.06 0 0 0 0 0 0 0.0002 0 0 0 0 0 0 0 0 0 0 0 0 0 0 
0 
##$DATE= 1187695033
##$DBL= (0..7)
120 120 120 120 120 120 120 120 
##$DBP= (0..7)
150 150 150 150 150 150 150 150 
##$DBP07= 0
##$DBPNAM0= <>
##$DBPNAM1= <>
$$ [...]
##$SUBNAM7= <"">
##$SUBNAM8= <"">
##$SUBNAM9= <"">
##$SW= 20.6930455092707
##$SWIBOX= (0..15)
0 0 3 0 0 0 0 0 0 0 0 0 0 0 0 0 
##$SW_h= 5175.983436853
##$TD= 65536
##$TD0= 1
##$TE= 296.16
##$TE2= 300
##$TE3= 300
##$TEG= 300
##$TL= (0..7)
0 120 120 120 120 120 120 120 
##$TP= (0..7)
150 150 150 150 150 150 150 150 
##$TP07= 0
##$TPNAME0= <>
##$TPNAME1= <>
##$TPNAME2= <>
##$TPNAME3= <>
##$TPNAME4= <>
##$TPNAME5= <>
##$TPNAME6= <>
##$TPNAME7= <>
##$TPOAL= (0..7)
0.5 0.5 0.5 0.5 0.5 0.5 0.5 0.5 
##$TPOFFS= (0..7)
0 0 0 0 0 0 0 0 
##$TUNHIN= 0
##$TUNHOUT= 0
##$TUNXOUT= 0
##$USERA1= <user>
##$USERA2= <user>
##$USERA3= <user>
##$USERA4= <user>
##$USERA5= <user>
##$V9= 5
##$VALIST= <valist>
##$VCLIST= <CCCCCCCCCCCCCCC>
##$VD= 0
##$VDLIST= <DDDDDDDDDDDDDDD>
##$VPLIST= <PPPPPPPPPPPPPPP>
##$VTLIST= <TTTTTTTTTTTTTTT>
##$WBST= 1024
##$WBSW= 4
##$XGAIN= (0..3)
0 0 0 0 
##$XL= 0
##$YL= 0
##$YMAX_a= 216452
##$YMIN_a= -198580
##$ZGOPTNS= <>
##$ZL1= 120
##$ZL2= 120
##$ZL3= 120
##$ZL4= 120
##$ABSF1= 16.522
##$ABSF2= -4.171173
##$ABSG= 5
##$ABSL= 3
##$ALPHA= 0
##$AQORDER= 0
##$ASSFAC= 0
##$ASSFACI= 0
##$ASSFACX= 0
##$ASSWID= 0
##$AUNMP= <proc_1d>
##$AZFE= 0.1
##$AZFW= 0.1
##$BCFW= 0
##$BC_mod= 0
##$BYTORDP= 0
##$COROFFS= 0
##$CY= 12.5
##$DATMOD= 1
##$DC= 0
##$DFILT= <>
##$DTYPP= 0
##$F1P= 14.0000005364418
##$F2P= -0.99999901652339
##$FCOR= 0.5
##$FTSIZE= 32768
##$FT_mod= 6
##$GAMMA= 0
##$GB= 0
##$INTBC= 1
##$INTSCL= 1
##$ISEN= 128
##$LB= 0.3
##$LEV0= 0
##$LPBIN= 0
##$MAXI= 10000
##$MC2= 0
##$MEAN= 0
##$ME_mod= 0
##$MI= 0
##$NCOEF= 0
##$NC_proc= -5
##$NLEV= 6
##$NOISF1= 0
##$NOISF2= 0
##$NSP= 0
##$NTH_PI= 0
##$NZP= 0
##$OFFSET= 16.522
##$PC= 1
##$PHC0= -50.43755
##$PHC1= 9.792433
##$PH_mod= 1
##$PKNL= yes
##$PPARMOD= 0
##$PSCAL= 4
##$PSIGN= 0
##$REVERSE= no
##$SF= 250.13
##$SI= 32768
##$SIGF1= 0
##$SIGF2= 0
##$SINO= 400
##$SIOLD= 32768
##$SREGLST= <1H.DMSO>
##$SSB= 0
##$STSI= 32768
##$STSR= 0
##$SW_p= 5175.98343685301
##$SYMM= 0
##$S_DEV= 0
##$TDeff= 65536
##$TDoff= 0
##$TI= <Analysis number 999999
Compound Code 99
Book Reference 9
Project Code 9>
##$TILT= no
##$TM1= 0
##$TM2= 0
##$TOPLEV= 0
##$USERP1= <user>
##$USERP2= <user>
##$USERP3= <user>
##$USERP4= <user>
##$USERP5= <user>
##$WDW= 1
##$XDIM= 32768
##$YMAX_p= 324427063
##$YMIN_p= -643147
$$ End of Bruker specific parameters
$$ ---------------------------------
##NTUPLES= NMR SPECTRUM
##VAR_NAME=  FREQUENCY,     SPECTRUM/REAL,   SPECTRUM/IMAG
##SYMBOL=    X,             R,               I
##VAR_TYPE=  INDEPENDENT,   DEPENDENT,       DEPENDENT
##VAR_FORM=  AFFN,          ASDF,            ASDF
##VAR_DIM=   32768,         32768,           32768
##UNITS=     HZ,            ARBITRARY UNITS, ARBITRARY UNITS
##FACTOR=    0.157963299565203, 1,           1
##FIRST=     4132.6476996994, 0,             0
##LAST=      -1043.33573715361, 0,           0
##MIN=       -1043.33573715361, -643147,     0
##MAX=       4132.6476996994, 324427063,     0
$$ Real data points
##PAGE= N=1
##DATA TABLE= (X++(R..R)), XYDATA
$$ [...]
15764c67221k4208J61775J50739j17657j02783J18464K23308K07142k13629j36828
15754a00898q8473N7354M084J75252K35715L17510K72816q7414l53095k31424
15744B01427n8904O9612n6099p2866p901L6574j07911k3679K12190o0114j44500
15733a2171r9747j31753k0109Q6823R4305j16720J5256j6684j0843K8626P4277
15722a08740J04761j00331j73653Q6400N6471J5131L7750K8463M2919j01960M5679
15711f7110J54410n7392n7506j0951k4788m8733j42302M0274K18158n2889k4257
15700g3086L3471N5840N0768J07379M1472J5576l074k14487m8703l7961J56384
15689H3579M4856n4581n3499m4519J13872k9803r7994q1565j31313J76644N7164
$$ y = [-367221, -391429, -229654, -78915, -196572, -299355, -180891, 42417, 249559, 35930, -100898, -189371, -132017, -127933, 47319, 283034, 600544, 873360, 785946, 432851, 201427, 142523, 212135, 156036, 83170, 75269, 111843, 3932, -19747, 192443, 132329, -12171, -111918, -243671, -263780, -176957, -82652, -199372, -184116, -200800, -211643, -183017, -108740, -3979, -104310, -277963, -191563, -135092, -119961, -82211, -53748, -10829, -112789, -67110, 87300, 29908, -27598, -38549, -63337, -112070, -254372, -214098, 4060, -48829, -73086, -39615, 16225, 66993, 174372, 215844, 231420, 228346, 13859, -34844, -72805, 83579, 128435, 73854, 20355, -24164, 89708, 59905, -38089, -119654, -250967, -74323, -17159]
15678a7159R790O0293L116R1342j22937j16346o7904j74547j259O5119K56698
15667a3794J23312N6003o4746m9621j21653j997r9230O9964J77053p4345r006
15656h060J51607N108k02976n4701J65152N007j28676j92472q908L9640J33855
15645i5424Q3877j14217J22031P4340l3831j5378K13590P755k83221j76062l2352
15634b48892j50766J30659J59080R6399J68709M0040j36352j71389j09271k6455
15624b48238J46693J45894O166m460j02668Q5699N3929q2308L0983O8023Q094
15613A07807j42652r9491k723q9239J64186P2108j10209J4047K5352L4154q0094
15602a06754N5153n9397j13J8791j08930o1501J31390L27095O5321M6559J9752
$$ y = [-17159, -7369, 52924, 56040, 147382, 24445, -91901, -159805, -334352, -335611, -270492, -13794, 109518, 165521, 100775, 51154, -70499, -72496, -171726, -101762, 75291, 946, -8060, 143547, 148655, -54321, -109022, 56130, 61137, -67539, -260011, -268919, -229279, -95424, -11547, -125764, -3733, 70607, 36776, 21398, 234988, 242743, -40478, -216540, -248892, -399658, -268999, -109919, -13520, 155189, 195229, 58877, -112512, -221783, -248238, -101545, 44349, 50515, 46055, -56613, 29086, 83015, 707, 31690, 99713, 107807, -34845, -134336, -137059, -226298, -62112, 9996, -100213, -86166, -60814, -26660, -106754, -51601, -110998, -111111, -92320, -201250, -262751, -131361, 195734, 261055, 307614, 327366]
15591C27366j7321j22399q0768J5809J07214o1394p6494n8003j20027M3142Q3859
15580D0984p0390k4632O6210m1368m6068j5651q2675Q196J04616j6881L8504k0482
15568e9637m2611j219p8203R2375Q7142L3569j59083j0072j8500m7730J64184
15557c9785P7550O6615J10633P2154j36116k02721r6297m9275j42331J32622J72413
15546c4538j23628k5208j3553L8549J06187J91427J6201L3349N6166j92474n8333
15535e855p7752p2722J11692k6252k24278r7030J67269l7029j8376P6437j5749
15524b19645l8327J07518k4110P3258j95563j58748K32558J0838q0315o3442J3714
15513c42264J08146J7389N408P5821p0062R6795J71040J64718j280O6573J024
$$ y = [327366, 310045, 187646, 106878, 122687, 229901, 168507, 92013, 34010, -86017, -42875, 40984, -29406, -54038, 12172, -29196, -75264, -90915, -173590, -165394, -60778, -77659, -39155, -59637, -102248, -103467, -181670, -89295, -2153, 31416, -127667, -137739, -156239, -203969, -39785, 37765, 104380, 215013, 287167, 151051, -51670, -147967, -197242, -339573, -206951, -34538, -158166, -183374, -196927, -158378, -52191, 139236, 155437, 188786, 244952, 52478, -5855, -83607, -156329, -44637, -70889, -295167, -392197, -224928, -261957, -280333, -203896, -219645, -257972, -150454, -174564, -101306, -296869, -455617, -223059, -212221, -292536, -355978, -342264, -234118, -216729, -211321, -135500, -205562, -108767, 62273, 226991, 225711, 292284, 293308]
15502B93308j16547j27344l298j86696n4142O0198j3110J1593M7178O4485N5340
15491C0965K9104k8673N4079K058m7097k1595p6320J112L1927J6301J07028j41234
15479d2345K8001J56938o5912r7977m9867J62320j06589n5369K8324K29305P8943
15468B65772k40598j97224J7540J92981K22051j0249n2446j16224k4449O9224
15458A26378J0697m6607k9529j81456r6415K21659R4653q796j7484j08820O2810
15447B7090j7767n9372j23232M9493J80234O1250N0342o3873k3389k3676p4577
15436a7477j00601M4641J45401j9214N4766R7116j39837m13385j98678J54809
15426c92459K65708J31175N2119J0202o5433L3511M473p2068k4584J71329l9309
$$ y = [293308, 176761, 49417, 46119, -140577, -194719, -134521, -147631, -136038, -88860, -24375, 30965, 60069, 31396, 85475, 87533, 40436, 18841, -57479, -56367, -24440, -8139, 98889, -42345, -14344, 142594, 76682, -21295, -71162, 91158, -15431, -70800, -42476, 186829, 265772, 25174, -172050, -154510, 38471, 260522, 250273, 197827, 81603, 57154, 126378, 137075, 90468, 60939, -120517, -216932, 4727, 99380, 90584, 73100, -35720, 27090, 9323, -50049, -173281, -123788, 56446, 117696, 168038, 104165, 80776, 57100, -17477, -118078, -73437, 71964, 52750, 107516, 204632, 64795, -348590, -547268, -392459, -126751, 4424, 56543, 66745, 1312, 34823, 39296, -32772, -57356, 113973, 74664]
15415G4664m1485Q5869m7316r859n060O4634J4238L0554j26804P012j35259k27797
15403c16609j03789K02866K06046l8130n6280N3979j11402M0767R5166L5033l2414
15392b4767k13044Q1010L1624N2317K0405J17592K9439M2495J11909J29161j33767
15381B44374k32718j50544J35355J28938j09673l8721j49005j19277O9290l5017
15371b56998k51696n8944K49065K37371J37169r5987j59783N7195J6681j15285
15361b41212J15510M6317M0814j9751P6454J44421J2048k20392n2561L7663P4614
15350A3925L8317K9320m9249M1913M9578k4782q2975M8724J67691O1419o9745
15339B24136l4253M8082q7717Q8008J21589n8795r5385J06938q434m3732K278
$$ y = [74664, 33179, 119048, 71732, 61873, 56813, 121447, 135685, 166239, 39435, 46447, -88812, -316609, -420398, -217532, -11486, -49616, -105896, -51917, -163319, -122552, -27386, 7647, -24767, -237811, -156801, -125177, -72860, -52455, 65137, 94576, 137071, 248980, 378141, 244374, 11656, -138888, -3533, 125405, 15732, -22989, -171994, -291271, -221981, -256998, -508694, -567638, -318573, -81202, 55967, -40020, -199803, -142608, -125927, -241212, -125702, -79385, -38571, -58322, 18132, 162553, 174601, -45791, -98352, -60689, 13925, 52242, 81562, 32313, 74226, 123804, 99022, 16047, 64771, 232462, 293881, 224136, 189883, 237965, 150248, 238256, 359845, 301050, 205665, 312603, 304169, 260437, 262715]
15328B62715J3398j08701K6810p846M0125j30993l7458n938M0721n2735k12339
15317a72241J69493K81517k9505k04582j11171K10532J68907q7587j61605q820
15307E4938M1392N1042j320J0531j12594j20216k4596L1507k4349J21780Q23r6674
15295f7736K9963N373J11483j9198Q3528j021j61611j05805M0400p4961J3946
15284a45639L8645j12735J19162K0695K2687J27805K7097o1982o1785J01690O3474
15273A39114j32904p4334J32202n0997J1327K9813o625p6523L0427K2654o4790
15262d0636j7755R5750N7723j37366j9859l3368l3491L19736m2269j56365K4520
15251A6620r5778j3955O596M4884j4440O8458k5450q2954R6327N98j45839m4406
$$ y = [262715, 276113, 167412, 194222, 186376, 226501, 95508, 58050, 52112, 92833, 40098, -172241, -2748, 278769, 249264, 44682, -66489, 144043, 312950, 225363, 63758, 54938, 96330, 147372, 146052, 156583, 43989, -76227, -100823, -69316, -93665, 28115, 28938, -67736, -37773, -32400, 79083, 59885, 143413, 142392, -19219, -125024, -84624, -159585, -145639, -106994, -219729, -100567, -79872, -57185, 70620, 97717, 35735, -26050, 75640, 139114, 6210, -68124, 64078, 13081, 24408, 54221, 47596, -28927, 1500, 24154, -40636, -58391, 37359, 95082, -42284, -62143, -95511, -129002, 190734, 148465, -7900, 16620, -79158, -93113, -86517, -41633, -56073, 12385, -13065, -96019, 308, 906, -144933, -189339]
15239a89339Q6887L3446K2216O0586R1886Q4723m6413J9664O3144j92658j5650
15228A8492o0988R415Q3928L508J0427n588O2151K607j27066k52018n1328N3846
15216b52614N9091n3387K91424J28804j82128j51945P1473m3789n958J56033O7684
15205H4688m1643N1532K24338N9514r0391n6127j45396N4410p5468m0141p1326
15194d6010j6815R8167J99426p5589k91425j68478P8924K32988n5531q7586q4730
15183b16659M5150n1800J38146J64502K5328k6557k1524j34660r7249K1761J37547
15172a6015P8846J29142j44728l3698j3089m7455p8760k7236n60j1071K6485J11265
15160b6874P9624L3142l1502m8300l7579K194q9976p3697K4313q6811K4648K6232
$$ y = [-189339, -102452, -69006, -46790, 13796, 105682, 190405, 143992, 163656, 226800, 34142, 18492, -42496, -33081, 50847, 54355, 64782, 59194, 121345, 123952, -3114, -255132, -306460, -252614, -193523, -246910, 44514, 173318, -8810, -160755, -89282, -133071, -139029, 17004, 84688, 43045, 94577, 318915, 378429, 288038, 231911, 86515, 140925, 65457, 25316, -46010, -62825, 35342, 234768, 159179, -132246, -300724, -221800, 11188, -44343, -131929, -216659, -171509, -223309, -85163, 79339, 104667, 78110, 56586, -78074, -175323, -153562, -16015, 62831, 191973, 47245, 13547, 458, -46997, -125757, -152993, -153553, -164624, -138139, -26874, 52750, 85892, 54390, 6090, -31489, -29295, -119271, -192968, -168655, -255466, -230818, -204586]
15148b04586J84524J75169K1646m3863M4742q2552L0731m1015J2073N4025r9267
15137E1627j33655O4210J08497p9184k08885J20707J03920k225k8186N7920K4856
15126G9602o1026m8330q9118J6065O6294l5848J7289M7139l0912n2435O330n6923
15114a41873j9610K16068K29002l4176j54225N4005l2046q4158N9637j25994j58217
15103a91587P71M3766j8321p9575K28255l891N1625O4367K20863j39320j15279
15092F1674o4333J1969n5434n2006P2302J26877r2610o9888J30209p4762j45856
15081a51858k83042J8041J02697J22578J46759n6204J22791J82836j36685r3081
15071b5168Q2885p2415J78926Q3051p6186k2889J00541J16116j8715k52760j19636
$$ y = [-204586, -20062, 155107, 176753, 132890, 177632, 95080, 125811, 84796, 96869, 150894, 51627, -82028, -17818, 90679, 11495, -197390, -76683, 27237, 25012, -3174, 54746, 79602, 18576, -29754, -118872, -102807, -36513, -72361, -55072, -7933, -38845, -91280, -84950, -141873, -161483, 54585, 283587, 249411, 95186, 149191, 117145, 32987, 92624, -33370, -191587, -190816, -147050, -165371, -244946, -16691, -20582, 31043, 95410, 316273, 176953, 61674, -2659, 9310, -46124, -98130, -25828, 101049, 8439, -61449, 68760, -6002, -151858, -434900, -416859, -314162, -191584, -44825, -101029, 21762, 204598, 67913, -25168, 57717, -14698, 164228, 247279, 171093, 148204, 248745, 364861, 346146, 93386, -26250]
15060b6250p163P560Q4108j51757k56656m7088J74800J13928o466N1055J86622
15049A22693j10258J2441M5336P8070l2307P5439N1550k38895o0231J5321j48319
15038a89160j02897J37029m5716M5536J19260R8501P7820j0987J32007k0558O5537
15027C06372q2552m790r6638j968N0169n1777n5765N4845L0387k3298m8111o0849
15015A6025J16856Q2960j04059l7021R024r7476L0522J09098j4082p9377r3780
15004f1310o6673o7081O5045J63251J28976j14617J4532m9937n2790j2171j98567
14993b51342q1378P4957L5713n3090J23940M6850L4592J48964n53j14718j60167
14982a96232j7367n804l4999M6003J14008L9304J24736J2253j57137j05315q7153
$$ y = [-26250, -33413, -25853, 58255, -93502, -350158, -397246, -222446, -108518, -114984, -63929, 122693, 12435, 24876, 70212, 148282, 115975, 191414, 242964, 4069, -56162, -40841, -189160, -292057, -155028, -200744, -155208, -35948, 62553, 140373, 129386, 261393, 240835, 306372, 223820, 219030, 122392, 120424, 170593, 118816, 63051, 117896, 148283, 124985, 76874, 16025, 132881, 215841, 111782, 74761, 83785, -13691, 16831, 125929, 111847, 32470, -61310, -127983, -195064, -130019, 33232, 162208, 47591, 62123, 12186, -40604, -52775, -251342, -332720, -257763, -222050, -275140, -151200, -104350, -69758, 79206, 78653, -36065, -196232, -213599, -219403, -254402, -208399, -94391, -55087, 69649, 81902, -75235, -180550, -267703]
14971b67703j34147J788N7918O0789J08369J1715N5443O6714Q3503j99948N6667
14960i8892o1386J8662j08771j05157K39442K8257p0387j14683k8140R0298K6621
14949a84136j45240J33724q320L2566P9600j788Q0005m42L7144P5331j14508j12748
14937a28812L1774l0998K1583Q6703o1778n4911M8667r377K084p9634Q8186l2660
14925a19173j05548L9308M0780N6798Q4610K007j38470J11675K30687p2802n0416
14914G9456M3308r8354K1777r0993Q9285K01599k8609j16819M3974Q4927J8598
14903B48149j9949j14650P3420p7317m3062l7446P0711j09518q04J47352J37827
14892B74713J08036M4366m3042n7825j10311n9913L4096j87560k42349N4472K17583
$$ y = [-267703, -401850, -400062, -342144, -281355, -172986, -161271, -105828, -39114, 44389, -155559, -98892, -160278, -141616, -250387, -355544, -116102, -87845, -158232, -272915, -301055, -210757, -184136, -329376, -195652, -203972, -171406, -91806, -93594, -13589, -14031, 23113, 98444, -16064, -128812, -97038, -128036, -106453, -19750, -81528, -136439, -87772, -97149, -95065, -174699, -86513, -119173, -224721, -185413, -144633, -87835, -3225, -1218, -139688, -28013, 202674, 129872, 79456, 122764, 24410, 46187, -44806, 44479, 246078, 217469, 100650, 144624, 229551, 248149, 228200, 113550, 186970, 109653, 66591, 29145, 99856, -9662, -10466, 136886, 274713, 382749, 427115, 384073, 326248, 215937, 156024, 190120, 2560, -239789, -185317, 32266]
14881C2266J48906J02959K0148J7928o131p1745j89525M7344O7191k31356m4936
14870a06951L7574J6974n5468j0111n7789L6506n8353q7677q1820K3825p034J27760
14858b22564R7429J34569k5925R6886o1269M6350M1581R3964K8827N3383J2493
14847B95724K460l401n289j41893J1166J39217l3697j16951m4982Q0547j3558
14836A69343k61990J6158m6206m0462O1113J6844j98010J98017J52485k6778M9155
14825H9669J23914j24936o6435O9621K5211j81073o7900M3848j3261j9489M4402
14814g6429J2207m1707O1108K8783k26172j12495K28041L9862k8701Q4924l1087
14803f1666q4454J93486J26771N4063n0295j37182j02739L9471K24O7047q0883
$$ y = [32266, 181172, 284131, 304279, 322207, 316076, 244331, 54806, 102150, 169341, -62015, -106951, -69377, -52403, -107871, -117982, -175771, -139265, -197618, -285295, -367115, -343290, -350324, -222564, -125135, 9434, -16491, 80395, 19126, 65476, 107057, 201021, 229848, 283231, 295724, 298184, 294783, 289494, 147601, 158767, 297984, 264287, 147336, 102354, 182901, 169343, -92647, -76489, -122695, -163157, -102044, -85200, -283210, -85193, 67292, 40514, 89669, 213583, 88647, 22212, 91833, 117044, -64029, -131929, -88081, -101342, -120831, -76429, -64222, -105929, -44821, -16038, -242210, -354705, -126664, -86802, -115503, -30579, -61666, -146120, 47366, 174137, 228200, 177905, 40723, -62016, -22545, -22321, 44726, -36157]
14792c6157O846Q5319r2316R354N9770k1442j386J8350J09717q4236j28465j87841
14780b62487m7665J97948M5367P9195l1361L9418J0904J9050O6636p1011K9282
14769G5276j9569j64808M4605J00468J4593l8963j49280Q305r8939J55316k3900
14758i6896K5415j8470L2514l3647p7398P8503P6072J28350k7231m5265p6334
14747c4387J22185r9896j9951K5932M3601k08395j7596R0558J01037R1173l7075
14736E7186J20621m2948j86806j42821M3510J88021J50482N6289q0364M7602j28970
14725H1802j26745Q6463J34915K14854M0127j39856j77570p1680j28488p8461
14715a64639P8041M8204O5765q1004m7583J19832J43355j40158r1991M9398J78075
$$ y = [-36157, -29311, 56008, -36308, -26954, 32816, 11374, 9988, 28338, 138055, 53819, -74646, -262487, -310152, -112204, -66837, 12358, -19003, 20415, 31319, 50369, 117005, 45994, 75276, 55707, -109101, -64496, 35972, 50565, 11602, -137678, -129373, -228312, -72996, -96896, -71481, -89951, -57437, -91084, -168482, -89979, -13907, 114443, 87212, 41947, -34387, 87798, -12098, -32049, -6117, 37484, -170911, -188507, -97949, 3088, 94261, 57186, 177807, 134859, -51947, -194768, -151258, 36763, 187245, 243534, 163170, 210772, 81802, -44943, 41520, 176435, 391289, 431416, 291560, 113990, 42310, -86178, -164639, -86598, -38394, 27371, -53633, -101216, 18616, 161971, 21813, -70178, -20780, 157295]
14704A57295l2407l8216n289l0401P8538J25155j1862K0407p6237M8822j05085
14693A30720j3339l5430l7498K3336J0724R2786J30885P8719j43594m5368N4002
14682B45943J77q7802j41861q1677J1941L8204M5029o8581n2490o1653k7154Q1963
14670i7961J36341j9580j6807J37805j4832q481j21057J72700J42549o3782n5236
14659A91659L9135k62711k35248M9730J56153J75078j18605J36746R3083k8288
14649A96732k5786j73613j62386P7058J46527j8391o0553J898j34470j25349Q7155
14638a91178J55374n9885P728n4835J7493R4297K95978J53350r1109q3522j47475
14627I6216j12013M378m7135J08995K2574n7087q1723k1823J10802J32034K36724
$$ y = [157295, 124888, 86672, 81383, 50982, 129520, 254675, 242813, 263220, 186983, 235805, 130720, 117381, 81951, 44453, 67789, 78513, 171299, 302184, 380903, 237309, 191941, 245943, 246120, 158318, 16457, -65220, -53279, -15075, 29954, -38627, -91117, -152770, -179924, -97961, 38380, 18800, 1993, 139798, 124966, 116485, -4572, 168128, 310677, 246895, 191659, 230794, -31917, -267165, -217435, -61282, 113796, -4809, 131937, 225020, 196732, 170946, -2667, -165053, -87995, 58532, 40141, -20412, -18514, -152984, -278333, -191178, -35804, -95689, -87961, -142796, -125303, -31006, 264972, 418322, 327213, 243691, 96216, -15797, -11419, -58554, 50441, 73015, 15928, -65795, -87618, 23184, 155218, 391942]
14616C91942O1179k43482j14451j3946r2839n0611r4272L134J12559n9669m7532
14605a47988J43941Q2959O8548J5643q5535l4809L3554J56104j0087j43657j42248
14594f3575o6833p4596k4736O0722j30338r1335K86673J74442K5969M0729J6353
14583A53475K46005o9693r3072j42109L9294R6090j20153j45327m0366m2004J03929
14572a3931j1985j57062q2878L9221J19183L7070M7392K4406Q8775L4526j25288
14561e71p7898j46825J9969J05467J6791P0835K3662M0739L9794M2175r790j01510
14549B2838j98777L0249K14812J76654M5799j33282l639J50297m2978L4200j16620
14538A79553j25978j74249l207M7127j9963o5704O1972J78200P7910l3561J04629
$$ y = [391942, 453121, 209639, 95188, 81242, -11597, -62208, -156480, -153346, -40787, -100456, -147988, -4047, 78912, 147460, 163103, 77568, 42759, 76313, 232417, 222330, 78673, -63575, -130408, -205004, -229740, -169018, -299356, -390691, -104018, 70424, 96393, 137122, 153475, 399480, 329787, 236715, 94606, 133900, 229990, 109837, -35490, -75856, -117860, -13931, -25916, -182978, -265856, -226635, -107452, -70382, -22990, 1416, 90191, 124717, -571, -78469, -225294, -205325, -99858, -83067, -12232, 11430, 52169, 91963, 134138, 124348, 22838, -175939, -145690, 69122, 245776, 291575, 158293, 154654, 304951, 261973, 296173, 179553, 53575, -120674, -123881, -76754, -96717, -162421, -100449, 77751, 155661, 122100, 226729]
14527B26729O7117P3916Q5613k89989l8670j4946q5430M764k45556j65549K40275
14516a41726J21786j45655J20731J15646J9781r2969J2546J05784p032k6006r5970
14505a3084J04469L3464r2566K6933q3571j67541P7893N8189K2341K07787q6180
14494H8134k7117j01867r0295J21633j2730j3406K11035j16622j40265j6437Q977
14483h8960N7693k7620n0645l1044j6900m0448L6693M1213r8156M740P9488k8368
14471a62314Q7305N6417J01394o2004l0718P7509k6239Q6742M1697o6637o5696
14460C7456J79403o4189q7288j96830R8607J74703K7920p9616J14311n4808j13193
14449C6476o2636j46824p0766K23787K91807N629l17422o6631j6551q5661J22881
$$ y = [226729, 293846, 367762, 453375, 163386, 124716, 109770, 24340, 29104, -216452, -382001, -141726, -19940, -165595, -44864, 70782, 90563, -2406, 10140, 115924, 108892, 82886, -13084, 91385, 124849, 32283, 59216, -24355, -191896, -114003, -55814, -33473, 174314, 88134, 61017, -40850, -131145, -9512, -22242, -35648, 175387, 58765, -81500, -97937, -88960, -31267, -58887, -109532, -140576, -157476, -197924, -161231, -120018, -218174, -213434, -133946, -162314, -75009, -18592, 82802, 20798, -9920, 67589, 41350, 128092, 169789, 103152, 37456, 216859, 152670, 65382, -131448, -32841, 141862, 169782, 90166, 204477, 149669, 36476, -26160, -172984, -243750, -19963, 271844, 277473, -39949, -106580, -123131, -208792, -85911]
14438h5911O4166j52099J41305J39972n4548j76989K0601J11227N0262O597j26526
14427f1943j50023M2093j9666M0250O5483R6794M868K7703p9521j8720K3492N7075
14415B7885J4109l1651k4610j23835N7897J11270l8101M7823r1120q2390L5194
14404i7529j5575P6993J16887J788N0522n4645l5702r6448p0669l8432R3209J97164
14392A27563R6872P6239N8729J17633M3333o7608j67671j18730j00982j27037
14382f1659l0016p6497J4152R0237O7977L2941o5813r5723o8923j1774J42765
14371f2333J04734j3435m5204l1155k2418Q050M8935K25326m997j91622j37534
14360a21653p2140J64332J60696O8414n7545j39093o8949J84637R5850r9432j4542
$$ y = [-85911, -21745, -173844, -32539, 107433, 52885, -124104, -103503, 7724, 57986, 64583, -61943, -211966, -169873, -189539, -149289, -83806, 12988, 17856, 45559, -33962, -52682, -29190, 27885, 41994, 10343, -14267, -138102, -80205, 31065, -7036, 40787, -50333, -132723, -97529, -113104, -36111, 80776, 82564, 133086, 78441, 42739, -53709, -124378, -162810, -69601, 127563, 224435, 300674, 359403, 477036, 520369, 452761, 285090, 166360, 65378, -61659, -91675, -168172, -154020, -63783, 4194, 37135, -28678, -124401, -193324, -205098, -62333, 42401, 28966, -16238, -47393, -69811, -61761, -12826, 212500, 207503, 15881, -121653, -193793, -29461, 131235, 199649, 142104, 3011, -65938, 118699, 214549, 115117, 100575]
14349A00575P7932Q2473j62144L7557P9904j08340k3612j37790J30609j965r0227
14338a5028R5976j28030n6890K7730M2337J52465R7443R3742n4704q0870j22109
14327E2062j62672L4366L0414q8153j42567k9441K1739J30535J06370j23532R304
14316a61575J13534n2775m6452K5309J91232K32237J17952j17242o8587L8774
14306B72407m0940j18288R7824L1449j13712p9305J5889k7324o9465q1992P931
14295a05526j64288N0819J74358M2360p1581M0489J67340j9926j62227j20197
14285a68379r6998J39153J43463j24148m721J26677J2978j62043O4754J01705
14275C2441J6790J0558j38983l1922J9530l1839j74662m7075O5488k7135l1482
$$ y = [100575, 178507, 260980, 98836, 136393, 216297, 107957, 84345, -53445, 77164, 75199, -15028, 80948, -47082, -103972, -76242, -33905, 118560, 216003, 309745, 255041, 174171, 52062, -110610, -76244, -45830, -133983, -276550, -305991, -284252, -153717, -47347, -170879, -161575, -48041, -100816, -147268, -121959, 69273, 301510, 419462, 302220, 233633, 272407, 231467, 113179, 211003, 242452, 128740, 49435, 65324, 38000, -31465, -113457, -105526, -269814, -218995, -44637, -2277, -73858, -33369, 133971, 114045, -48182, -168379, -265377, -126224, 17239, -106909, -111630, 15047, 28025, -134018, -69264, 32441, 49231, 59789, -79194, -111116, -91586, -123425, -298087, -345162, -279674, -306809, -338291]
14264c38291K34069J41757j1213j16449k8807M1343R1443L6366n2278J09980j52863
14253d4943p5812j9773J39841J39888R2350j36218p7167m5135j68377r968M9337
14242a55977J00529L4210J39209j71382j63931k4082P7644K5080J25202K49131
14232B35633m1214j42205j748r5362q852Q5933l0736n7543M1229J94228J7186
14221A96549n7886P5335j17827Q9919R8057o4881j36687j8711q6216O5753J16671
14210A60076P825o8695k01618P2269j22266j41441o6574R2726J30378M0262p2677
14199a69735p857J606O5079O4818p144p8550k2321l4130M9686q9J53118J27851
14187A42332J31171k4336k57736o4664R7310j56409m8739J92577J49034o0397
$$ y = [-338291, -104222, 37535, 26322, -90127, -118934, -77591, 13852, 50218, -2060, 107920, -44943, -120755, -140528, -687, 139201, 231551, 95333, 18166, -26969, -195346, -205314, -155977, -55448, -21238, 117971, -53411, -217342, -241424, -163780, -138700, -13498, 235633, 194419, 52214, 50466, -44896, -53748, 32185, 1449, -56094, -14865, 179363, 196549, 138663, 213998, 96171, 186090, 284147, 219266, 82579, 63868, -22348, 43405, 160076, 167901, 99206, -102412, -30143, -152409, -293850, -360424, -267698, -137320, -97058, -169735, -177592, -175986, -110907, -46089, -53233, -131783, -154104, -188234, -138548, -138637, 14481, 142332, 273503, 249167, -8569, -73233, 24077, -132332, -181071, 11506, 160540, 100143]
14177A00143j05653q5913m6418j19870L5821J45620J4812m153p3984j27532n6590
14166c23717K33856R5211J17466K6766n1124m8969k5639M2690j7992k2863o746
14155A8939o0653k55j71579n8014k2787J09789Q3152J32891J52328N7261j16012
14144A25060j57318k9749N2834P0403J52863J27196j90804j38924K9766L0833
14134G2160r5035o8118l5370l4602J10639P8114o2398j73193j9179J40566J45791
14123E9375O1901k9463m8005n5776M9632N6690m2723k7065n3765j00997L5590
14112i4606J63388L1778j36944m1722l5218R8245P4225n8934k87049j37870J36122
14101b88585J48944j6587o1532j10016J79555n263J4071j8861Q0249N9411j41275
$$ y = [100143, -5510, -91423, -137841, -257711, -221890, -76270, -61458, -65611, -139595, -267127, -323717, -89861, 5350, 122816, 149582, 98458, 49489, 23850, 66540, 48548, 25685, 18939, -41714, -41969, -213548, -271562, -294349, -184560, -101408, 31483, 183811, 241072, 125060, -32258, -62007, -9173, 61230, 214093, 341289, 150485, 11561, 41327, 72160, -22875, -90993, -126363, -160965, -50326, 27788, -34610, -207803, -226982, -86416, 59375, 121276, 91813, 43808, -11968, 37664, 94354, 51631, 24566, -29199, -130196, -94606, 68782, 100560, -36384, -78106, -113324, -15079, 59146, 212, -286837, -424707, -288585, -139641, -156228, -217760, -327776, -148221, -153484, -139413, -158274, -78025, -18614, -159889]
14090a59889L9480K93525J97781n2675r0932j36950K9229p7688l7841O8411N6107
14079A28558J346q9867k85546o5462J42913J99078N0589p3425J25223J15566Q700
14068B57673o8392P7279p6921j14997P4296J29255K7873r9012j48498j12415Q8901
14057C5042j8355M2997J16686p2391j55414R0874O9364j16514j32270n0373k0286
14046b10640J15170J87604J27834Q4556M2618r9068j12064j95877j39405j00045
14036b99317P6492P5971P3965Q2615J1037k29049l3304R9244j7844J03995N4629
14025a566Q0248j01198j11959j57441J86106O0746n1969J01731j2826k2028j7406
14014d7562q1491k1835M4371o0208L6818J46324j1623J12462J09122j73784N137
$$ y = [-159889, -120409, 173116, 370897, 318222, 227290, 90340, 119569, 41881, 4040, 72451, 128558, 129904, 40037, -245509, -310971, -168058, 31020, 81609, 8184, 133407, 248973, 257673, 189281, 266560, 189639, 74642, 148938, 278193, 306066, 207054, 58556, -53859, 35042, 16687, 59684, 176370, 103979, -51435, 39439, 108803, -7711, -139981, -190354, -210640, -95470, 92134, 219968, 304524, 347142, 248074, 136010, -59867, -199272, -299317, -222825, -146854, -72889, 9726, 20763, -208286, -241590, -142346, -160190, -56195, -1566, 78682, -22516, -134475, -291916, -105810, -45064, -97033, 4698, -8128, -30156, -47562, -129053, -150888, -106517, -166725, -129907, 16417, 4794, 117256, 226378, 52594, 57731]
14003E7731o7515r926O4091O1294k2079P9478M7879k26152O6255Q0423J6420n6841
13991I1058r2171L2578Q1703r3456l1343K4455J12946L7912l6774j54286k20376
13980b47754Q471J20215R5471L7675m4609K20201J31756q9839j42487N6412k7169
13969A18343q8715q5099l4666K1364K47643O7333p1508K5617l313J361j23327
13958G5033j72437O9595Q6194N1102j0467q4267P0717j7759n3062m0704q0172
13947a06227o693J30093J86311o9446o5241N723r5501l2670L7760o753k2715R5930
13935E0571J05649q934k2504J9656l7066o1273j34280q1293K33256J58993N6903
13924B79678R0659k12412j84342K3303p2771R2999J79720K6686N0512O0285q0000
$$ y = [57731, -9784, -19710, 44381, 105675, 83596, 163074, 210953, -15199, 51056, 131479, 147899, 91058, -1113, 31465, 113168, 19712, -11631, 12824, 125770, 163682, 126908, -27378, -247754, -239283, -119068, -23597, 14078, -30531, 189670, 321426, 231587, 89100, 145512, 118343, 29628, -55471, -90137, -68773, 178870, 246203, 174695, 200312, 196999, 198360, 75033, -97404, -27809, 58385, 109487, 99020, 14753, 85470, 67711, 14649, -26055, -106227, -112920, 17173, 203484, 134038, 68797, 74520, -20981, -53651, -15891, -22644, -45359, 50571, 156220, 147286, 124782, 144438, 107372, 46099, -88181, -169474, 63782, 222775, 279678, 370337, 157925, -26417, -3114, -75885, 17114, 196834, 223520, 274032, 334317, 254317]
13913B54317j79129n1632j04344O5741P0333n0249N0650R6264P7198J24907k3134
13902C30922n0826k1990j93392N2057J32281m5283p7491j92126N5305K07619J00591
13891B97667q2032j52875M5310O1256k6805J54245q3168k36775j10856R8736m230
13880c9527M3049J03572q7658k45335P7933K19590J3053n804P285p5615m702K8433
13868C4274q2228j74081l4890O8989J59543J26515l5823o9916J88910j4869j76229
13857i805P3335J00226J17458M9903m2669j28868p8686J08776J33858m1886j50038
13846A31604J6350K2605J3401j35228M5511q2382k5029m558m616q6940O9127O6861
13834B6706j13101j6302N9758M6912J22928N5533J94563J11161j62967j95871
$$ y = [254317, 75188, 23556, -80788, -15047, 55286, 5037, 55687, 151951, 229149, 354056, 330922, 280096, 258106, 64714, 116771, 249052, 203769, 126278, -65848, -10543, 197076, 297667, 215635, 62760, 108070, 169326, 142521, 296766, 213598, -23177, -134033, -35297, -39527, 3522, 107094, 19436, -225899, -147966, 71624, 84677, 78873, 86158, 10543, 5841, 34274, -47954, -222035, -256925, -187936, -28393, 98122, 62299, -7617, 181293, 166424, -9805, 63530, 163756, 281214, 331117, 288448, 159580, 80894, 189670, 323528, 281642, 131604, 147954, 170559, 183960, 48732, 94243, 11861, -13168, -17726, -22342, -109282, -40155, 26706, -86395, -102697, -42939, 3973, 126901, 182434, 376997, 488158, 325191, 129320]
13824A29320K9944j29641j71605q8248K4128o078n999M1422J00822P3721P8441
13813G6227Q645j59700r019L0354O9245L0059K1742K27020j15406j21562J20857
13802A78462K309O3543n6938l7661M9539q7277j51162n3524J36671O4621k8725
13791G9858P0356l5238J5100N6911o7094J37248p5402r0149m4583J5605O8259
13780A30871j44004o5809N3599k7545n441J0449j47021j32127J17176O8561q6009
13769b27300K00222K03346L5644j49383n2778L5545R7471m4472j06559p270R2212
13758G6678Q0104m573m2460q4355M9082L4118R5045j12979O2127o9737j27792
13747d4742n2058Q9631J68767n6870J09517m6366j6979Q048m7068m6813J63560
$$ y = [129320, 159264, 29623, -141982, -230230, -206102, -212180, -218179, -176757, -75935, -2214, 76227, 84872, -74828, -83847, -53493, 15752, 45811, 67553, 294573, 179167, 57605, 178462, 180771, 244314, 187376, 149715, 199254, 111977, -39185, -92709, 43962, 108583, 79858, 150214, 114976, 130076, 186987, 119893, 257141, 181739, 91590, 47007, 62612, 130871, -13133, -78942, -25343, -52888, -58329, -47880, -194901, -327028, -209852, -141291, -227300, -27078, 176268, 211912, 62529, 9751, 45296, 142767, 98295, -8264, -15534, 76678, 156782, 152209, 109749, 25394, 74476, 108594, 203639, 90660, 152787, 83050, -44742, -96800, -7169, 161598, 104728, 214245, 167879, 150900, 158948, 111880, 65067, 228627]
13736B28627j92224k04055j68613j5733J13159J85187P9972j1579J50790N3032
13726B18563Q118J9527m256j75614q7955Q8256P8382R1088K3047j12093k12525
13715f5462l3743K8543P9467J2251n2062J91088J01862Q7604P8094K1003r084
13704D39561J3528j26833j31281j7598M2871j35601N0401o4204j27939J40446
13694H3351R3624j42823K9732K324j66022L4397J27540O9309n4499R6345m6934
13683A26344m4949Q7104P7208l072L0405J3169k29635R9995K01499j37208m2854
13672A78006k4061o8504l7105L0445j78074o4265L3554k5499J32076K44253o5548
13661A55278R4463K15597K746k08003j86684L5602N5889o2053j32437j05218j75923
$$ y = [228627, 36403, -167652, -336265, -351998, -238839, -53652, 26320, 14741, 165531, 218563, 226681, 246208, 241952, 66338, -21617, 66639, 145021, 236109, 259156, 147063, -65462, -99205, -70662, 8805, 21056, -31006, 160082, 261944, 349548, 427642, 448645, 439561, 453089, 326256, 194975, 177377, 220248, 84647, 135048, 70844, -57095, 83351, 176975, 34152, 63884, 66208, -99814, -65417, 62123, 131432, 76933, 173278, 126344, 81395, 168499, 245707, 242635, 273040, 286209, 56574, 156569, 358068, 220860, 178006, 153945, 85441, 48336, 78781, -99293, -163558, -130004, -155503, -23427, 220826, 155278, 249741, 465338, 468084, 260081, 73397, 108999, 164888, 102835, -29602, -134820, -310743]
13650c10743L2161K64074m4692l961R7932p244j97103p1829R0017J91707N5277
13639I5596r7373n5882m7184o194p779J06026k002J45610R1937p7322j14741P987
13627C8679P1570J45109M5624L4761j28365R439J9708J5481k3250j24618m4029
13616F0109R305j52950o5812K1572J29616Q1011k2763j6069J23340O4162J11134
13605C42655r0238j38683Q60o653Q7005k7741K20314k0359k18904p1796j51847
13594g5387l2458R5534l4538p5318j60103Q4217J64316N4413N39K7145m8590j87617
13582a87847l5568L06672k0349n0604M2795J12925j44163r3729M2751m23j22261
13571a49801J8985O4854j02693n7880o6198R2553M7198N4180M3890j8991P8237
$$ y = [-310743, -278582, -14508, -59200, -63161, 34771, 27527, -169576, -241405, -151388, 40319, 95596, -1777, -57659, -104843, -111037, -118816, -12790, -14792, 130818, 222755, 145433, 30692, 38679, 110249, 255358, 300982, 335743, 207378, 216817, 236525, 252006, 228756, 104138, 60109, 69414, -83536, -149348, -127776, 1840, 82851, 60088, 44019, 167359, 231521, 342655, 252417, 113734, 114594, 107941, 194946, 167205, 387519, 367160, 148256, 76460, -75387, -107845, -12311, -46849, -122167, -282270, -198053, -33737, 20676, 21215, 48360, -230, -187847, -223415, 83257, 62908, 12304, 55099, 168024, 23861, -69868, -27117, -27540, -149801, -130816, -65962, -168655, -226535, -292733, -200180, -152982, -98802, -54912, -73903, 4334]
13560D334N2930N8153j52295o6622K41988J69789Q5980Q9221j55300k93962j06772
13549g2556m3293k5361O0080J03437N1515q683J40830K4435j00917q4985j04745
13538f0243Q6042M8305J30802l2395k3275J9248p9586Q259l4637o1217k7187r5453
13526a21337J8117M0315Q4419j17395R429J13639N6539k9275k07843k3098J82393
13515E903P113L5881M505o7173K683K06380J46631k64407k73909p2888o2042N2154
13503b79169J24397J50040j80053j3761Q5132J55508l0367P0796L3574j08335
13493G762J98702O6521k0270O067m1412O5950j17782k905R823J6666j30639j9260
13481C9223l4971J53744N8890j55861q9072J29984J3273j5338j56649j02939N8872
$$ y = [4334, 57264, 115417, -36878, -103500, 138488, 308277, 394257, 483478, 328178, 34216, -72556, -115849, -141210, -81130, 22307, 73822, 65139, 205969, 230404, 129487, 44502, -60243, 25799, 74104, 204906, 172511, 149236, 168484, 88898, 97157, 62520, 1303, -25884, -121337, -103220, -62905, 21514, -95881, -86452, 27187, 83726, 54451, -153392, -176490, 5903, 13016, 48897, 53402, -13771, -11088, 195292, 341923, 77516, -196393, -269281, -331323, -279169, -154772, -4732, -184785, -198546, -113414, 42094, 11727, 82523, 116097, 7762, 206464, 272985, 252715, 258782, 217370, 283320, 165538, 162633, 172456, 189122, 58483, 39223, 4252, 157996, 216886, 61025, -28047, 101937, 115210, 99872, -56777, -159716, -100844]
13470a00844J56748O3722R6233N0043J7775K3569J61718M2628k0219j03114j89681
13459A98578Q218L3070j71410p8818n5580k9449J41363O1826j8910o5890q6273
13448f3275p4581n3648K0705j06126J7422N3651K65990J22666m735K18772n7260
13437C39581Q0208q9576k15800j88153k8232P3799N9959J5264K82482J39734j75218
13426B94048j90401q5442j6660p2182j46247R0275J34407J63736N9308R1353q4108
13415B38087j08475n0544o9029p316R7668M8827J80110N2584j21299j72226L424
13404I1811J24629K7273m1402k4755M9698k0282k5693j59259l8708J46650J75783
13393C05745K0173j75032j29279j9465q9631k6361o8094J15815Q8163p3025l3798
$$ y = [-100844, 55904, 119626, 215859, 265902, 283677, 307246, 468964, 511592, 491373, 388259, 198578, 206796, 239866, 68456, -10362, -65942, -95391, 45972, 107798, 88888, 22998, -63275, -137856, -191504, -170799, -276925, -259503, -205852, 60138, 182804, 178069, 396841, 339581, 419789, 330213, 114413, -73740, -101972, -28173, 31786, 47050, 329532, 469266, 294048, 103647, 18205, 1545, -70637, -216884, -126609, 7798, 171534, 230842, 322195, 238087, 129612, 79068, 10039, 2723, 100391, 149218, 329328, 381912, 260613, 88387, 91811, 216440, 243713, 202311, 177556, 227254, 206972, 181279, 22020, -16688, 129962, 305745, 325918, 150886, 21607, 2142, -87489, -113850, -181944, -66129, 22034, -50991, -84789]
13382h4789K7790q1172o2901J28791P3246P7914N1915o7739J03424M5177k22503
13371a0847j19586P0810L12749j7752j51808J2364J2733l6477J5072J3265O4126
13360A64649j5727r5428R214M9834k5879J79200j1866l6077Q3939k9563j19501
13349A52795q9588J32087J07909Q0144o7494p0816j03488m7113K2051M162O1495
13338A82144J9051m7376o534k8826j08589r7818p9033j1884J10509J59048K4591
13327A15283L3843j11880j47212j4601J4127P6749l662P9321K20285j02793k42516
13316h3056O3832O8985J26992P9315j7744k9515n2197O039j22350q0896j35298
13305a75893l4184J54257L66366n939n683J14675K0106o5874q8460r8943j53224
$$ y = [-84789, -56999, -138171, -201072, -72281, 965, 78879, 130794, 63055, 166479, 211656, -10847, -130433, -59623, 253126, 235374, 83566, 95930, 108663, 72186, 87258, 100523, 164649, 148922, 53494, 62708, 112542, 86663, 265863, 253997, 217920, 301859, 272296, 152795, 63207, 195294, 303203, 383347, 315853, 245037, 141549, 94436, 116487, 120649, 182144, 201195, 153819, 147285, 118459, 9870, -87948, -166981, -178865, -68356, 90692, 115283, 149126, 37246, -109966, -124567, -110440, -33691, -37353, 41968, 262253, 159460, -83056, -19224, 49761, 176753, 256068, 238324, 208809, 156612, 162651, 40301, -40595, -175893, -210077, -55820, 310546, 304607, 298924, 413599, 433705, 367831, 279371, 180428, 27204]
13294B7204j36521K01318J69259k43303J4855K06169p0232k51643j84945o2161
13284c30000P9994J34214O9875J30006J32458J9430r9532q8351J4059q0252j23387
13273a41486N1286j44774J21173J09464M3074K54720P5990j45199k31083O1213
13263E4378L4129J03189R8426P0566r7358o7255p7736P1953j26996j10645k1650
13252f8999n6861J27616L8969J86734j82382r5133J15324O5497P5855J15076q0648
13241B41048j22579o6897K01159j4469o0346J05712n4415J1739N5030Q7003o1413
13230C21572r0395J1618q0914p6238R2268Q4017j9345O0616j15932j02446J0262
13219I5083R7642n8571n5107J4573j9403k17544r0617J33132J59945m2044l2758
$$ y = [27204, -109317, 92001, 261260, 17957, 32812, 238981, 168749, -82894, -267839, -330000, -250006, -115792, -45917, 84089, 216547, 235977, 136445, 48094, 62153, -18099, -141486, -90200, -234974, -113801, -4337, 38737, 293457, 369447, 224248, -6835, 54378, 88507, 191696, 290122, 360688, 263330, 196075, 118339, 190292, 63296, -47349, -68999, -125860, 1756, 40725, 227459, 45077, -50056, 65268, 130765, 206620, 321696, 241048, 118469, 51572, 252731, 238262, 177916, 283628, 229213, 240952, 295982, 382985, 321572, 231177, 242795, 161881, 85643, 177911, 261928, 242583, 303199, 187267, 84821, 95083, 192725, 134154, 79047, 93620, 74217, -143327, -233944, -100812, 59133, 17089, -15669]
13208a5669j4627K6101M7144r6802P0725j9347n8780k8304J71918K60699J07942
13197D51000n8706r7489j33243O6263M2284J25717J8965K6921r7648j62200p7376
13186A04488j21129q701Q4454P7854L0909j49327n1905M4973Q1270K00770j14157
13175A79499m5833M2853O8974k4748Q6111r9485m8627k9511L6324j6827j93678
13164d4948m9944K34244J01185K0292O8522n7814j00171Q868J57524o672j07083
13153B24003q0917R0428P9593K1332J8145j34884l4679q353M7954L0631j5326
13142B37927k59673o5948O6655Q8025J39734K32352j24260j62461r4608J9041
13132G6784K4320j3874j07792j73119J02626J97212J23896J74568k2302j25125
$$ y = [-15669, -30296, -4195, 42949, -53853, 16872, -2475, -61255, -89559, 82359, 343058, 451000, 392294, 294805, 161562, 227825, 270109, 395826, 414791, 441712, 344064, 181864, 104488, -16641, -25342, 59112, 136966, 167875, 18548, -33357, 11616, 92886, 293656, 179499, 133666, 176519, 245493, 220745, 306856, 207371, 158744, 129233, 165557, 148730, -44948, -94892, 139352, 240537, 260829, 329351, 271537, 171366, 180234, 337758, 331086, 224003, 143086, 233514, 313107, 334439, 352584, 217700, 183021, 174668, 222622, 253253, 237927, -21746, -87694, -21039, 66986, 206720, 439072, 314812, 152351, 57743, 76784, 101104, 87230, -20562, -193681, -91055, 106157, 230053, 404621, 382319, 257194]
13122B57194K9498J768l4794n2882m0295L8540q1032L3733k13696j07960o5867
13111b35793K1103J99215J14258L5437j01411L129J43012m5031J97851n581p5509
13100B50680R7103K1806J86186n086M3715J1277j21232o2141K639k88975L9472
13089A75444O7934j57816l9684j0276P3963J7538o5566n1081L1735N6703n9364
13078C9530L382j54522q2218J20016Q0540M7584L1616O8705j5852J5326R8764
13067B52871l7420m4712j57310j0406R9988L3869J491k0567N1414J43983J39645
13056D52846J09538j01301j74752k06713k92148k3403J19750J00869J4346K6979
13046B6011Q960L9139j1895q657N7727m8723M9209J8764K24265J66281j62505
$$ y = [257194, 286692, 288460, 253666, 200784, 160489, 199029, 117997, 151730, -61966, -169926, -235793, -214690, -15475, 98783, 134220, 32809, 35938, 178950, 133919, 331770, 326189, 250680, 347783, 369589, 555775, 550689, 594404, 605681, 484449, 422308, 424947, 135972, 175444, 243378, 85562, 45878, 35602, 109565, 127103, 61537, 10456, 42191, 98894, 39530, 42912, -111610, -193828, -73812, 6728, 54312, 85928, 154633, 138781, 154107, 252871, 215451, 170739, 13429, 3023, 103011, 136880, 138371, 117804, 169218, 313201, 452846, 562384, 461083, 286331, 79618, -212530, -235933, -116183, -15314, -968, 26011, 34971, 74110, 62215, 53558, 111285, 62562, 111771, 130535, 354800, 521081, 358576]
13035C58576j26035p3425j29030R3288P2961j43128N7643N3140o1346J73177j1881
13024B63940J65834R980j89796L8041R7325N4800k10461p1036L3081J36623Q1243
13013D09574k11540r3787j09185p0845k1205Q9272j6542K933J7604R1056J39199
13002B26534J23584J5643m5468N3619J11292k702j97930j79424p8708L7264m0292
12991B3412J87330M8925k76097J74540J18018j16745m8366n9612j46078o4837
12981a59510O2096J04463K10859R2698r6890j0385J09738J46136Q7655L4870n7962
12970E23768K5126j39501k07595j22344p0201m6570j49626M5300K82353P4264
12960B14974n4975K1448n2037R1066q805o3581p3079N4504K17237J15971l03384
$$ y = [358576, 232541, 159116, 30086, 123374, 196335, 53207, 110850, 163990, 102644, 275821, 263940, 429774, 439754, 249958, 287999, 385324, 440124, 229663, 158627, 191708, 328331, 409574, 198034, 104247, -4938, -75783, -96988, -7716, -24258, -21325, -3721, 87335, 226534, 350118, 365761, 320293, 373912, 485204, 482502, 284572, 105148, 26440, 63704, 23412, 210742, 259667, -16430, 158110, 276128, 159383, 111017, 51405, -94673, -159510, -97414, 7049, 217908, 310606, 213716, 203331, 313069, 459205, 546860, 581730, 523768, 548894, 409393, 201798, 79454, 9253, -37317, -186943, -141643, 140710, 214974, 159999, 181447, 129410, 220476, 211671, 148090, 75011, 129515, 346752, 462723, 159339]
12949A59339k09547J04744l473L6643J14493M0857j05332k7290O5033M4361J40152
12938C59980m0114j10723j02897k7817Q837m8584J91933J35011j52535k20596
12928g505J42408J7748l7965P1904q1715L2032O480J16658J08890P215j26268
12917B49882j02907N0143q754j24565n0891J12717O4225l8967j00703n7450J41909
12906A34639K88696o3316j60022L34R5858J27061L6655j5005m8456l2750j22122
12895B41572r3289r6195P2653L4328n3473o5954j2687M3859J60492K3775j28889
12884A26192k3721l4653R8543K13411m4428j92328j2226l033m5441N1892N7737
12873A91945r7418J84725J15763j22370M0713L9665P8986J4051j02881m2605o5739
$$ y = [159339, -50208, 54536, 51063, 87706, 202199, 243056, 137724, 110434, 175467, 219828, 359980, 319866, 209143, 106246, 78429, 87266, 38682, 230615, 365626, 213091, -7505, 134903, 152651, 114686, 186590, 104875, 136907, 143387, 260045, 368935, 376150, 249882, 146975, 197118, 188364, 63799, 12908, 125625, 189850, 150883, 50180, -7270, 134639, 423335, 360019, 199997, 200331, 296189, 423250, 459905, 444900, 396444, 363694, 241572, 148283, 52088, 124741, 159069, 105596, 39642, 26955, 70814, 231306, 255081, 126192, 102471, 67818, 166361, 379772, 335344, 143016, 130790, 127757, 82316, 134208, 191945, 94527, 279252, 395015, 272645, 313358, 353023, 432009, 446060, 343179, 300574, 234835]
12862B34835n3113o1356l2248K4472N5602J08420M3254p5120m8611R702N8080
12851B63917q5171O416J34542q9094M1853Q8487L9535j1573j43406j4359K8341
12840B59488J12463O7632r9151q2179O2945j1493n8585L8096m6415J96082p1351
12829C67532k16909j7199K84877J82232l4842o1830R3175j08472q8528K16985
12819F17021n6459j77057k19693J4339O4222J664l8124Q3870l1912K5069j2046
12808B70894o8601l5281n4656j8801j30455p0294J56257J81655q4139K1073L3385
12797B01037J42472j8100R3971M8917r1449j8516m1942J4668j6891j72285k04446
12786f2564l3655J0795J48079K81991P0208m6665p2952k7866P7466K2457n4711
$$ y = [234835, 181722, 120366, 88118, 112590, 168192, 276612, 319866, 244746, 196135, 205837, 263917, 178746, 185162, 319704, 230610, 272463, 360950, 400485, 388912, 245506, 231147, 259488, 371951, 439583, 340432, 258253, 321198, 309705, 251120, 289216, 242801, 438883, 367532, 150623, 133424, 418301, 600533, 565691, 503861, 597036, 488564, 400036, 617021, 560562, 383505, 163812, 178151, 242373, 244037, 205913, 289783, 257871, 282940, 270894, 202293, 167012, 112356, 93555, -36900, -107194, 49063, 230718, 146579, 167652, 201037, 343509, 325409, 419380, 468297, 376848, 358332, 316390, 331058, 314167, 141882, -62564, -96219, -85424, 62655, 344646, 414854, 368189, 295237, 267371, 344837, 367294, 312583]
12775C12583l5369k8955J6122l2350L9068O5668p0273n2692n192L8047m4564k53078
12763e0985J03907J31667J4175p039L3780k1216m6450J37540J56170j79984J53
12752B71718l584k903K33856M5245r2409q1874R53K9301O785o7120j36870l6576
12740A66522K79676J57695o4690k82213j15201p4025P1902J72124J09761j3384
12730D08167M3022j72693n3219N0794K06448r184j19930k3177N986J55492m6294
12719D45412k7356o0413J8090R054Q4555n5415r5010j8386J99569O3243j02579
12708D60764l0451P6725m7513j39101j50483N9012R7323O2790J42453J1464N5111
12697E98094n2733j49724j8928k270L1491l1682j34325O1445K87704Q2460k5635
$$ y = [312583, 277214, 248259, 264381, 232031, 271099, 336767, 266494, 213802, 208610, 246657, 202093, -50985, 52922, 184589, 198764, 191725, 225505, 204289, 157839, 295379, 451549, 271565, 271718, 268134, 265231, 499087, 544332, 451923, 370049, 371002, 400303, 407088, 339968, 203098, 166522, 446198, 603893, 539203, 256990, 141789, 67764, 139666, 311790, 421551, 408167, 451189, 278496, 225277, 276071, 482519, 473335, 353405, 330228, 336214, 491706, 445412, 418056, 357643, 375733, 384787, 469342, 413927, 318917, 300531, 500100, 563343, 460764, 430313, 507038, 459525, 320424, 169941, 228953, 326276, 389066, 531519, 542983, 598094, 545361, 395637, 376709, 374439, 405930, 374248, 239923, 301368, 589072, 671532, 645897]
12686F45897p6243p0967n7640l9901K52595j1072j68746q1345l01697k44555R2143
12675f1531L64146J22289k5041M6940n1616M0178J50578j4306k34506J0381m3312
12664C04200J42106M0501j67290K0787N3705K1661J66352R0931j30056j81243
12654C61654R104J32695J10285O5058q2196j33638l0764R193J0360o2616n6555
12643C32580N4338j22536J48916o0248k42559k6273K26008K33721n172j17813
12633D20962n5158r3891m8659J43442K63256o1300j04757j98729o8808q6447R5708
12622B05619M9900P1034r6936m2288j13108M3527J35965r1040o2300J09662K32035
12611D42070J84623J5171j08405j75109n5224m6009J3700M9326J47682K1326j15700
$$ y = [645897, 569654, 498687, 441047, 401146, 653741, 642669, 473923, 392578, 90881, -153674, -61531, 302615, 424904, 399863, 446803, 395187, 435365, 585943, 571637, 337131, 347512, 304200, 446306, 486807, 319517, 340304, 394009, 415670, 582022, 672953, 542897, 361654, 370758, 503453, 613738, 678796, 596600, 462962, 432198, 441391, 451751, 389135, 332580, 386918, 264382, 413298, 353050, 110491, 84218, 310226, 543947, 538775, 420962, 365804, 271913, 223254, 366696, 629952, 568652, 463895, 265166, 196358, 109911, 205619, 255519, 326553, 229617, 187329, 74221, 117748, 253713, 162673, 100373, 210035, 442070, 626693, 641864, 533459, 358350, 303126, 257117, 270817, 320143, 467825, 489151, 373451]
12600C73451j1282M9608j6960J7023J37137J13472l4293j49041j6644N0956r9936
12589D13491l30805R6111K07211J55803j0860r8524q3922N2632N3007K3902L6676
12578E14722o4427m4862J50214j38438Q383l1786O5074j1896p3709o8913r8771
12567B05591M3221J31830Q7518l5961j37474P9735J33952J21782j0081k9288m5771
12556E45054k7026J61248J20845q8428o3091q2926N2008m5747q5297J09869P5517
12545F72026J00050o6276n0403J56900j4779k29811m0441K8578j16730q4630N9885
12534D14369J2041j33609Q3865J75255p6122K3363K22876J35666k43936m0180
12524E73588J16910J39027j2005j92043j12526j50041L1442J50566O2276J0249
$$ y = [373451, 362169, 411777, 394817, 411840, 548977, 662449, 628156, 479115, 462471, 513427, 413491, 82686, 178797, 386008, 541811, 530951, 432427, 348505, 401137, 454144, 478046, 514722, 450295, 405433, 555647, 417209, 425592, 393806, 458880, 446984, 373275, 304362, 205591, 248812, 380642, 468160, 432199, 294725, 374460, 508412, 630194, 620113, 590825, 545054, 518028, 679276, 800121, 711693, 648602, 565676, 617684, 571937, 486640, 596509, 672026, 772076, 705800, 655397, 812297, 797518, 567707, 527266, 555844, 439114, 354484, 414369, 426410, 292801, 376666, 551921, 475799, 499162, 722038, 857704, 613768, 573588, 690498, 829525, 817520, 625477, 512951, 362910, 394352, 544918, 607194, 617443]
12514F17443M516j0798o6074J08553Q0132p5501r9851r4119l9121N8116l7865
12503D45431O1297K68844k2524M2471r7568l0117N0047m7415k3836L5518j19740
12492E62408o6391M369L2189K0752k6506R9032J56174p1776o3336J2643k3668
12481F35890P4764J3894Q9638m4376r7804O8222j01809Q4438J80106J86220R3203
12470A182386r5058o3843p2188K0170J216p1860J82320n5932j00807M0535o4982
12459I01957o2311k73091j61074J47469J75724Q2384l3175M3410O7369j51245
12449G37417n1297R1160Q3262P0483J10501K05517l8156j27478m319J73795R0580
12438A341465r1266j39720r9747K0741j78833O1137J6430n9826R6686N1058O6335
$$ y = [617443, 621959, 611161, 545087, 653640, 733772, 658271, 558420, 464301, 425180, 483296, 445431, 506728, 775572, 753048, 795519, 697951, 667834, 717881, 670466, 646630, 682148, 562408, 496017, 500386, 532575, 553327, 526821, 625853, 782027, 710251, 646915, 659558, 635890, 710654, 724548, 814186, 769810, 672006, 740228, 638419, 722857, 902963, 1089183, 1182386, 1087328, 1023485, 951297, 971467, 972683, 900823, 1083143, 1027211, 926404, 966939, 901957, 839646, 566555, 405481, 552950, 728674, 811058, 777883, 821293, 888662, 737417, 686120, 777280, 860542, 931025, 1041526, 1247043, 1208887, 1081409, 1077090, 1250885, 1341465, 1250199, 1110479, 1010732, 1031473, 852640, 913777, 930207, 870381, 967067, 1018125, 1084460]
12427A084460J22531N1389j08946J21911j29586j34245K5015j49039j53085j25112
12417F05293J29110R1739p43j332j19653M1465J67051J14299j22027j74846M8973
12406G79329k7236n559J7951J83779K17155R5849p3119p6354l132o2426O124J86787
12394A239148J9122j39109j05588O0293q6859K0886J7678m980m0842P5691J08872
12383A164312M4965j01019j37010J25692j0275J68121l3834o9383P7213J08868
12373A337650P4496j32518r5161j91241M0336O3995J24839J24819J9183R5591
12363A461989l3938j12830J9732K5731p8728p616k9639p3397K6731o006O2616
12352A254645l2501k6610j28768P629J53076l6017J5091K13384k18163j17296
$$ y = [1084460, 1206991, 1258380, 1149434, 1271345, 1141759, 1007514, 1032529, 883490, 730405, 605293, 734403, 826142, 825399, 824067, 704414, 745879, 912930, 1027229, 905202, 730356, 779329, 752093, 746534, 764485, 948264, 1165419, 1261268, 1188149, 1111795, 1108663, 1046237, 1052361, 1239148, 1258270, 1119161, 1013573, 1073866, 987007, 1007893, 1025571, 1020591, 979749, 1055440, 1164312, 1209277, 1108258, 971248, 1096940, 1086665, 1254786, 1220952, 1151569, 1228782, 1337650, 1412146, 1279628, 1184467, 993226, 1033562, 1097557, 1222396, 1347215, 1366398, 1461989, 1428051, 1315221, 1334953, 1360684, 1281956, 1274340, 1244701, 1171304, 1198035, 1192029, 1254645, 1222144, 1195534, 1066766, 1074395, 1227471, 1191454, 1206545, 1419929, 1201766, 1084470]
12342A084470J79018J51793k1083o8934R1581J33091n8446j67801m5041J78630
12332A457278J37038j22559k5785O1416P7184o3239j05193j69451j37085P6081
12322A185685J54969l668J44001j52665m0621K36023K30213j6299k43415k1906
12312A472317R6033N1986o5205M9577J72758N1228j37924P1553l4239L5694L4894
12301A798672j667j50740p6168j16091m950J54257k0854Q3249L6828J19860j02059
12290A720337k6803L2474n2147j8632J120m3036K40423J12032m9321j07196k62668
12279A546583J32027K10925k9315m8885O5424L5999j07008r9102l563J44792m9174
12268A798703q1840J17323J46579J3643K6421L2938p6046n9467R2120O8451O4051
$$ y = [1084470, 1263488, 1415281, 1394198, 1325264, 1416845, 1549936, 1491490, 1323689, 1278648, 1457278, 1594316, 1471757, 1445972, 1507388, 1584572, 1521333, 1416140, 1246689, 1109604, 1185685, 1340654, 1336986, 1480987, 1328322, 1287701, 1523724, 1753937, 1737638, 1494223, 1472317, 1568350, 1620336, 1555131, 1604708, 1777466, 1828694, 1690770, 1762323, 1728084, 1763778, 1798672, 1797005, 1646265, 1570097, 1454006, 1449056, 1603313, 1582459, 1665708, 1702536, 1822396, 1720337, 1693534, 1726008, 1673861, 1655229, 1656349, 1613313, 1853736, 1965768, 1916447, 1809251, 1546583, 1678610, 1889535, 1860220, 1811335, 1876759, 1912758, 1805750, 1706648, 1703085, 1847877, 1798703, 1716863, 1834186, 1980765, 1994408, 2020829, 2053767, 1977721, 1918254, 2010374, 2078825, 2142876]
12257B142876J18150J75564j34219j5799J09389q7487k3731L5550J00424j43936
12247B276781l0652n6583j57995M2380Q0627J44840K13945m307j89545o7118J70885
12236B423258Q78L3230n2076k485k3891O8152N4299r6852n32J29904J9649j14044
12224B439490N77L0541J24174J11090N1524q6632N990K2013k08962j90705j15395
12213B183705O3780J31522J08318N2609L1K25400P4451Q1901J35795j3094l0615
12202C013803P7701J11470J22936j50240k61363j59057R7825J82001Q8218M3800
12192C167094k4830j1263K9899k2327j6772J60818J33417J46456P3930N0503L1185
12181C718110l5227k4714o3325j09602q9765j68551R8023K83438J13614j87255
$$ y = [2142876, 2261026, 2436590, 2302371, 2286572, 2395961, 2308474, 2284743, 2320293, 2420717, 2276781, 2246129, 2189546, 2031551, 2073931, 2154558, 2299398, 2513343, 2509036, 2319491, 2252373, 2423258, 2424136, 2457366, 2405290, 2402805, 2378914, 2447066, 2501365, 2404513, 2403981, 2533885, 2553534, 2439490, 2440067, 2470608, 2594782, 2705872, 2757396, 2670764, 2676754, 2698767, 2489805, 2299100, 2183705, 2247485, 2379007, 2487325, 2539934, 2539965, 2765365, 2839816, 2921717, 3057512, 3044418, 3013803, 3091504, 3202974, 3325910, 3175670, 2914307, 2755250, 2853075, 3035076, 3123294, 3167094, 3142264, 3131001, 3160900, 3138573, 3121801, 3282619, 3416036, 3562492, 3636422, 3686925, 3718110, 3682883, 3658169, 3594844, 3485242, 3395477, 3226926, 3324949, 3608387, 3722001, 3534746]
12171C534746o5178j6362m0246Q2590K04093N0361n675j9952J43481Q3310J38935
12160D090103J60373r4039j36187o3971J44883J88226Q1411j95158P6282P7316
12150D329239P1202K7036j19278p480R1196Q4623Q0405K07280J85012J7497j35226
12139D831506n6608L0462P1378J29519K7327j31457j93793J3304J17855M3508
12129D883001K07740J20056j18522R1882J39857l2456j27693J1519J98672K42548
12119E616604K46304J20642M7079k01043j77934M6664J99072J21197J41314J70124
12109F330023M3420K11238J47409m245L4704R9979Q8187O0718l5943l7790O6594
12098G004294M9050k6656r4108K50365Q1386M3531J21970J01019J7263J07932
$$ y = [3534746, 3469568, 3453206, 3412960, 3495550, 3699643, 3750004, 3744329, 3724377, 3867858, 3951168, 4090103, 4250476, 4156437, 4020250, 3956279, 4101162, 4289388, 4370799, 4175641, 4251923, 4329239, 4400441, 4427477, 4308199, 4300719, 4391915, 4476538, 4556943, 4764223, 4949235, 4966732, 4831506, 4774898, 4805360, 4876738, 5006257, 5033584, 4902127, 4708334, 4721638, 4839493, 4883001, 5090741, 5210797, 5092275, 5184157, 5324014, 5291558, 5163865, 5175384, 5374056, 5616604, 5862908, 5983550, 6030629, 5829586, 5651652, 5698316, 5897388, 6018585, 6159899, 6330023, 6373443, 6584681, 6732090, 6727845, 6762549, 6862528, 6950715, 7011433, 6975490, 6937700, 7004294, 7053344, 7026688, 6932580, 7182945, 7264331, 7307862, 7429832, 7530851, 7548114, 7656046]
12088G656046K597L4373J49130O4661J16392k976j972N1279Q0346J65782K62974
12077H578632J78368M2072K1667j5352j1145J55160J07425Q7948J67017Q3741
12067I395533N7721L22840J94905J06782J86307R253J58882K70318L52322K33584
12057A1288447j2828n9587K2336K05897J70294O8442J26638K52573K43678L26892
12047A2632782J79433j01478M2182K01867P6960N7771K23093K79318J09517J34516
12037A3835961K80813J36826Q4645K19486K70020J56834J48263J37771L83795
12028A5654414K98165J20450K84498L36153L53813L09020J88458J71549K31320
12019A7947840K08440L50227K60051L16422K44616L29762L94056L76110R1517
$$ y = [7656046, 7658643, 7693016, 7842146, 7906807, 8023199, 8020223, 8018251, 8069530, 8149876, 8315658, 8578632, 8757000, 8799072, 8820739, 8805387, 8794242, 8949402, 9056827, 9144775, 9311792, 9395533, 9453254, 9776094, 9970999, 10077781, 10264088, 10273341, 10432223, 10702541, 11054863, 11288447, 11275619, 11216032, 11238368, 11444265, 11614559, 11683001, 11809639, 12062212, 12305890, 12632782, 12812215, 12710737, 12752919, 12954786, 13031746, 13089517, 13312610, 13591928, 13701445, 13835961, 14116774, 14253600, 14338245, 14557731, 14827751, 14984585, 15132848, 15270619, 15654414, 15952579, 16073029, 16357527, 16693680, 17047493, 17356513, 17544971, 17716520, 17947840, 18156280, 18506507, 18766558, 19082980, 19327596, 19657358, 20051414, 20427524, 20519041]
12010B0519041K52795L45456L39211M12622N35986L31224L16473L84246N43728
12001B3980782N04109N68811K73413K12057M17701K27821L58551O62409N43917
11992B7749571N24565O78323O61188N10489M50336O42612M53393N21439M65869
11983C2657785O48581O64162O95444P19189O11623N06624O76902P15114M15075
11974C8310499P64355Q93391O14942O10842R53634R16384O71054P26754P12360
11965D5174215Q64949R10257R07355Q67163R42204Q01890Q62596R00299Q65128
11956E3096056Q90833R69698R66347Q28020J099655R57951R61874J131533R83386
11947F1885353R38964R10838J030031R94514J171887J152473P58083R35171R30916
$$ y = [20519041, 20771836, 21117292, 21456503, 21869125, 22405111, 22736335, 23052808, 23437054, 23980782, 24484891, 25053702, 25327115, 25539172, 25956873, 26184694, 26543245, 27205654, 27749571, 28274136, 28952459, 29613647, 30124136, 30574472, 31217084, 31670477, 32191916, 32657785, 33306366, 33970528, 34665972, 35385161, 35996784, 36503408, 37180310, 37895424, 38310499, 39074854, 39968245, 40583187, 41194029, 42147663, 43064047, 43735101, 44461855, 45174215, 46039164, 46949421, 47856776, 48723939, 49666143, 50468033, 51330629, 52230928, 53096056, 53986889, 54956587, 55922934, 56750954, 57850609, 58808560, 59770434, 60901967, 61885353, 62824317, 63735155, 64765186, 65759700, 66931587, 68084060, 68842143, 69777314, 70708230]
11938G0708230J016602R36114Q99788P67886Q34036Q82434Q52143Q79685P79556
11929G8556474N67150P19055P08848M85662N75969M76477L02177J42124K48775
11920H2782711K73072K67131K53058M0956Q7030K54290J20980P087m9260m27290
11910H3609765n09903l48930k50366m65662m89218o18908l81470m19027m65262
11901G9661019q23386q57798n34886o60720q85635r67656q76023q52051r52606
11892G2250258r68834r18332j072258r82472r76465p10786r22904j049095q92226
11883F3756886r20215q65907r69025j153470j025036q87935q25725r06160r72965
11874E5230448j095614j035617j226129q86988p91892q98894r09220r23389q39433
$$ y = [70708230, 71724832, 72660946, 73560734, 74328620, 75162656, 76045090, 76897233, 77776918, 78556474, 79123624, 79842679, 80551527, 81037189, 81613158, 82089635, 82391812, 82533936, 82782711, 83055783, 83322914, 83575972, 83616928, 83703958, 83958248, 84079228, 84086315, 84037055, 83609765, 83099862, 82750932, 82500566, 82034904, 81545686, 80926778, 80545308, 80126281, 79661019, 78837633, 77979835, 77444949, 76784229, 75898594, 74930938, 74054915, 73202864, 72250258, 71281424, 70363092, 69290834, 68308362, 67331897, 66621111, 65698207, 64649112, 63756886, 62836671, 61970764, 61001739, 59848269, 58823233, 57935298, 57109573, 56203413, 55230448, 54134834, 53099217, 51873088, 50986100, 50194208, 49295314, 48386094, 47462705, 46623272]
11865D6623272r15999n99227p74322o88595p29447r19830p48996o00755n08537
11856D0137564o29527q68642p69391o56783p57925n43770n17186o35753n72906
11847C4185681n63655o00429m51196n91252r18225n82498n44897m19015l66174
11838B9148340m46252n52060m71355n65800l34971l92215m38904n09395n27328
11829B4910060m21536m93460l37487k33009j88897n32192m17265m02317k89632
11820B1594265l75468k20372l59250l65010l16204m26384k39798j65592k32243
11811A8893944k98221l62463l45285l29041p1644M3189j72262m14247l67313k61108
11801A6315549j05212k35414k59846j44750k09742p3519j3360j72743l83905k92639
$$ y = [46623272, 45707273, 45108046, 44333724, 43645129, 42915682, 41995852, 41246856, 40646101, 40137564, 39508037, 38639395, 37870004, 37213221, 36455296, 35911526, 35394340, 34758587, 34185681, 33622026, 33021597, 32570401, 31979149, 31060924, 30478426, 29933529, 29514514, 29148340, 28702088, 28150028, 27678673, 27112873, 26777902, 26385687, 25946783, 25437388, 24910060, 24488524, 23995064, 23657577, 23424568, 23235671, 22703479, 22286214, 21883897, 21594265, 21218797, 20998425, 20639175, 20274165, 19957961, 19531577, 19291779, 19126187, 18893944, 18595723, 18233260, 17887975, 17558934, 17487290, 17530479, 17358217, 16943970, 16576657, 16315549, 16210337, 15974923, 15715077, 15570327, 15360585, 15287066, 15273706, 15100963, 14717058, 14424419]
11791A4424419k59461k70576m5166j5210k8773l44138l53850j82725r5270j73072
11781A2656178j86356k18944l02371k33630j07227j8702K5535P1568l52321l52819
11771A0980911o8397j63641j1268r0372j60932m3953j22394k27897j89743J21356
11761A0023670j68797m05061l0793j25169j81362j14415K560m1940j89538j18322
11751H650833K2845n6702K6228o1793j32650j49488k79947m0506o1431J3132n741
11740G924780n0658j15016m7517j17386j08595k16211m1851k3931R3913r3601
11730G203927j97278m3114j79040p0462n5756k87502j08568L9991N2979q036N3338
11719F400479l6017j77013j21186j14989j42391m5147q9547r7833n4093N0613
$$ y = [14424419, 14164958, 13894382, 13849216, 13834006, 13805233, 13461095, 13107245, 12924520, 12829250, 12656178, 12469822, 12250878, 11948507, 11714877, 11607650, 11588948, 11614483, 11686051, 11333730, 10980911, 10912514, 10748873, 10737605, 10647233, 10486301, 10442348, 10319954, 10092057, 9902314, 10023670, 9854873, 9449812, 9419019, 9293850, 9112488, 8998073, 9000633, 8958693, 8769155, 8650833, 8673678, 8616976, 8643204, 8581411, 8448761, 8299273, 8019326, 7978820, 7917389, 7930521, 7924780, 7874122, 7759106, 7711589, 7594203, 7485608, 7269397, 7227546, 7203615, 7297528, 7203927, 7006649, 6963535, 6784495, 6714033, 6658277, 6370775, 6262207, 6302198, 6355177, 6347141, 6400479, 6364462, 6187449, 6066263, 5951274, 5808883, 5763736, 5674189, 5576356, 5522263, 5572876]
11709E572876J8707K4782j88563n5171L11842N1789k70013j27345l194J3700J7813
11698E367223J6462j65280j89298j1218J61860p5602j13322j58617j51696o0691
11688D619821p7432j27194j87576O8470o2045r7053l3064q8486J58631K04943
11678D379015j3891N3331J01760O8724j80479j71051n4810j63219K3669m4297
11668C998752q0235O2915Q6755k5424m2355j36401o5440K06042r3454j39089m7309
11657C724757l5078J33359K5522j21519R4640J38225q3757k23216J24913J4840
11647C792686K3030k0616j9471J66717K47728j08314k43901p4784R460k87952
11637C484583j47029m4988L9116r7689j56608J2631p7706k9712o6649N4453P4390
$$ y = [5572876, 5591583, 5616365, 5427802, 5372631, 5684473, 5736262, 5466249, 5338904, 5335710, 5349410, 5367223, 5383685, 5218405, 5029107, 5017889, 5179749, 5104147, 4990825, 4832208, 4680512, 4619821, 4542389, 4415195, 4227619, 4296089, 4234044, 4136991, 4103927, 4015441, 4174072, 4379015, 4365124, 4418455, 4520215, 4588939, 4408460, 4237409, 4182599, 4019380, 4043049, 3998752, 3918517, 3981432, 4068187, 4042763, 4000408, 3864007, 3798567, 4004609, 3911155, 3772066, 3724757, 3689679, 3823038, 3848560, 3727041, 3821681, 3959906, 3876149, 3652933, 3777846, 3792686, 3815716, 3795100, 3775629, 3942346, 4190074, 4081760, 3837859, 3763075, 3772535, 3484583, 3337554, 3292566, 3331682, 3233993, 3077385, 3090016, 3012310, 2982598, 2915949, 2970402, 3044792]
11626C044792R6159j26576l1629j06790j15414j55211P0874j32761J9165N0267
11616B612876P3144o498n1345K9635j27795K8639J66636M821j1343j2934o2761
11605B643075M5878K8522k685j75920L2424j16168j30878j69300j09068P9097
11595B124977J93894J09646R9952q220L1200l9334m0944q6437J830p759j1357
11584B367448R5452K9691J09735O6234j80785n4485r2966j80756N62J72678m5793
11573B287015k01103l6943P2616L7935J3019o6479J00562Q2218j3884K2795M162
11562B301913N2521J6446j0808j02177j79202L2055l0566k06273j11073N6301
11552A819137J11684J57227M8742q8534R952k7590m4823m1548P3277J21894k21386
$$ y = [3044792, 3140951, 3014375, 2982746, 2875956, 2760542, 2605331, 2676205, 2543444, 2562609, 2612876, 2686020, 2679522, 2628177, 2657812, 2530017, 2558656, 2725292, 2730113, 2718770, 2705836, 2643075, 2688953, 2717475, 2714790, 2538870, 2571294, 2455126, 2324248, 2154948, 2045880, 2124977, 2318871, 2428517, 2528469, 2520249, 2551449, 2512115, 2471171, 2384734, 2386564, 2378805, 2367448, 2462900, 2492591, 2602326, 2668560, 2487775, 2433290, 2340324, 2159568, 2160130, 2332808, 2287015, 2085912, 2048969, 2121585, 2159520, 2172539, 2106060, 2206622, 2288840, 2274956, 2297751, 2301913, 2354434, 2370880, 2360072, 2257895, 2078693, 2110748, 2080182, 1873909, 1762836, 1819137, 1930821, 2088048, 2136790, 2048256, 2058208, 2030618, 1985795, 1944247, 2017524, 2139418, 1918032]
11541A918032k09079j69688M0264K4946m3823L7415r1603j0069J45315N2676j04112
11530A590274m9733K18101l0170j90770l4932N1734L331j08369J7207J99057K56679
11519A922409J79169j32881j33590j77476k2152k8346J79975K4897M5859R2120
11509A949984p7110j18028j0358J161l6627k4974o3744k37658L5516O276Q8101
11498A512539J45930j74039k33277j79624K14252L21249q5024j9365j85379j27454
11488A189808P9784Q6576L7773k6675N3095K7176J39564N6815j41174o7434q9994
11477A345314j25349J8218q3364M0180k9995j12216p7367J22741K08215Q9999
11467A396376K4243j79549o8655J71538o2971j13760K3J95426k4823j94106j58119
$$ y = [1918032, 1708953, 1539265, 1579529, 1604475, 1560652, 1598067, 1506464, 1496395, 1641710, 1694386, 1590274, 1540541, 1758642, 1728472, 1537702, 1502770, 1554504, 1557835, 1449466, 1466673, 1665730, 1922409, 2101578, 1968697, 1835107, 1657631, 1635479, 1607133, 1787108, 1812005, 1857864, 1949984, 1872874, 1754846, 1744488, 1745649, 1709022, 1684048, 1620304, 1382646, 1418162, 1424438, 1512539, 1658469, 1484430, 1251153, 1071529, 1285781, 1607030, 1522006, 1502641, 1317262, 1189808, 1269592, 1356168, 1393941, 1367266, 1420361, 1447537, 1587101, 1643916, 1502742, 1435308, 1345314, 1219965, 1238183, 1154819, 1194999, 1165004, 1052788, 975421, 1098162, 1306377, 1396376, 1420619, 1241070, 1172415, 1343953, 1280982, 1167222, 1167245, 1362671, 1337848, 1143742, 985623]
11456I85623J42655Q9726n969N3004n8934l9158M1684l0069J36222P1711k21066
11445A165429k04686N7889K2609N2951p7102L2632L9119J37158m8189P0219r691
11434A238338q794J0978L4726L919l6330n4264J511o4778q683R2995j85237J04597
11422A128978K4587l0306m1657q0865k0258L7692M9581o1987k6932J24086P2058
11411A174977M6204j66241J70360J37443j34210j75971j42216p2058M1165k6877
11401H52576m1507R9967l0369Q0980L6789l9461J03033j39463j46100Q6300K1236
11390H83981j457j00147q028O7275J17993j0914J1814J11520J690p7026q8956
11379I07745L039J4527N5619M2699p951K3738P109m6619J7313j43224K5899R697
$$ y = [985623, 1128278, 1218004, 1212035, 1265039, 1206105, 1166947, 1208631, 1178562, 1314784, 1386495, 1165429, 960743, 1018632, 1041241, 1094192, 1017090, 1049722, 1088841, 1225999, 1177810, 1248029, 1238338, 1229544, 1240522, 1275248, 1279167, 1242837, 1188573, 1190084, 1125306, 1116623, 1209618, 1024381, 1128978, 1153565, 1123259, 1081602, 1000737, 980479, 1018171, 1067752, 1005765, 978833, 1102919, 1174977, 1221181, 1054940, 1225300, 1362743, 1228533, 1052562, 910346, 838288, 879453, 852576, 811069, 911036, 880667, 961647, 998436, 958975, 1062008, 922545, 776445, 862745, 883981, 882524, 782377, 774349, 841624, 959617, 948703, 960517, 1072037, 1073727, 996701, 907745, 910784, 925311, 980930, 1023629, 1015678, 1039416, 1046525, 999906, 1017219, 873995, 899894, 909591]
11367I09591q9166k0217O0946j32214J7098K026L4797J9480J25454J25919n3438
11356A000276j34616n1607r1581j9980O1940j36398M4532O9798J59856l7106P665
11345H72779j12855n8942K0621r7387Q5282n7494r8019m6368K0488J75441q8452
11334F15094Q0357R6205J67794l6491j10431k2088q6866M2914J32373l5205p95
11323H42861N6540J19442J3785o3145k59137j40591J19787J8992R6060k6581n4621
11312G23392k1222J8911J31247p1494l3900K8364M1135r1515J62960k8553j15751
11301G43574R8158L1887j47220j13566O7967J90263L2226j44766m1451j35691
11291E81381L520Q8582L9408L0573j1275p2182j13122J22836L9411j66221m6560
$$ y = [909591, 820425, 800208, 861154, 728940, 746038, 748064, 782861, 802341, 927795, 1053714, 1000276, 865660, 814053, 722472, 702492, 764432, 628034, 672566, 742364, 902220, 865114, 872779, 759924, 700982, 721603, 624216, 709498, 652004, 553985, 507617, 528105, 703546, 615094, 695451, 791656, 959450, 922959, 812528, 790440, 703574, 746488, 878861, 843656, 842861, 899401, 1018843, 1032628, 969483, 710346, 569755, 689542, 708534, 804594, 778013, 723392, 702170, 721081, 852328, 780834, 746934, 775298, 816433, 724918, 887878, 859325, 743574, 841732, 873619, 726399, 612833, 680800, 871063, 903289, 758523, 717072, 581381, 584901, 673483, 712891, 743464, 732189, 660007, 546885, 669721, 709132, 542911, 496351]
11280D96351J35460K42903o8540j71325j53372N0600P8274J684J04670m2484p2599
11269F01622M3206K3969n3437j10951J27133J70986Q48p6981r0368j43322L4291
11258E26996R3573k8622j6921J50523J45260k58828p0634r000k09115J15849K51005
11247F90086P6654j2084k9449j14406j14459N1990m5614m8912J88865p4564k03553
11236C64554J3878j2837k8014k7452Q3072O360o247O5129P3236J03050o6339k5210
11224E43180m3205j7754J50114J09032Q2019k5837j25417j09586j2677Q6266k2114
11213F14021P9382l8701l05239j55278K8478j6150J7705K42450M0901j24027l6693
11202C46849k9534K9524R3312q5943J26655K20527n357j22793r1226N238J1319
$$ y = [496351, 631811, 874714, 806174, 634849, 481477, 532077, 610351, 612035, 716705, 674221, 601622, 644828, 668797, 615360, 504409, 631542, 802528, 803376, 726395, 636027, 492705, 526996, 620569, 591947, 575026, 725549, 870809, 611981, 541347, 532347, 323232, 439081, 690086, 766740, 754656, 725207, 610801, 496342, 548332, 502718, 453806, 642671, 568107, 364554, 378432, 365595, 337581, 310129, 393201, 399561, 393314, 458443, 531679, 634729, 568390, 543180, 499975, 482221, 632335, 741367, 823386, 797549, 672132, 562546, 549869, 636135, 614021, 693403, 654702, 349463, 194185, 222663, 206513, 224218, 466668, 507569, 383542, 346849, 317315, 346839, 440151, 354208, 480863, 701390, 696033, 573240, 482014, 487252, 498571]
11191D98571m9458L8380k00452J18423r0654L0138J54489N9293j4736n2727r8995
11180C92272R8487k140M8092O4260j61476M1532Q0162j87301j52361K8992P1400
11169C21919n3303O4660k3464M9639Q8551J60517j3441j22258r5944N0389J52275
11158E79540j14964n9391O1384n9572R770q3184l6303l1050J30969p0352M4126
11147C70973j83732j94510N7134o914J37170J62490j5957k3870J75822n6163o6380
11136C56063J20096J7671j63129n1259n6096J52594K839j05448r764Q2041m7592
11125B98016p072N6206L4704J0895P9183q6510r7182l5171k6944m6189Q9507j27241
11113A42202L1813J27723j36701j23035J37472Q4680l5587m3134j8218R5313l7651
$$ y = [498571, 449113, 487493, 287041, 405464, 314810, 344948, 499437, 558730, 543994, 491267, 392272, 490759, 488619, 536711, 600971, 439495, 481027, 561189, 373888, 221527, 250519, 321919, 268616, 333276, 309812, 359451, 448002, 608519, 595078, 472820, 376876, 427265, 579540, 464576, 405185, 466569, 406997, 416767, 333583, 297280, 266230, 397199, 326847, 370973, 187241, -7269, 49865, 42951, 180121, 342611, 326654, 302784, 478606, 422443, 356063, 476159, 493830, 330701, 279442, 223346, 375940, 378779, 273331, 263567, 345608, 298016, 290944, 347150, 381854, 392749, 471932, 385422, 288240, 253069, 226125, 179936, 269443, 142202, 174015, 301738, 165037, 42002, 179474, 264154, 228567, 185433, 167215, 262528, 224877]
11102B24877J1946r4603N0270O9251J36986r7636j86309M49M1722O2818K0204
11091B39975J46930J7678k04790r9758p6090J10435r617l702J82488K9452P6739
11080D09740l3403q004l7704K9912Q0682n3772j27179p7815J21932k4795p2574
11069B07020Q7422M602j99100j09006O4267J49247M6711J4883J19349K8226J95046
11058F08667n8399r8439J59470q6952r9012J73145j8104n0626L616K3186Q7939
11047F44491n4743l3885o0483j37479Q1196K69758J43276o5739k1196J08399M7365
11036I20960P6712N1370J6105K31714L26071j0211k09057j32372j06784O2820
11026A227328r0859k10455J8573K55705L41085L39597K20011L7773k08050l89885
$$ y = [224877, 236823, 142220, 192490, 261741, 398727, 301091, 114782, 115231, 156953, 219771, 239975, 386905, 404583, 199793, 100035, 23945, 134380, 124763, 121061, 303549, 333001, 409740, 376337, 368333, 330629, 360541, 441223, 387451, 260272, 182457, 304389, 279594, 207020, 294442, 299044, 99944, -9062, 55205, 204452, 251163, 266046, 385395, 413621, 608667, 550268, 451829, 611299, 524347, 425335, 598480, 580376, 529750, 533366, 556552, 644491, 589748, 555863, 495380, 357901, 439097, 708855, 852131, 786392, 765196, 873595, 920960, 997672, 1049042, 1065147, 1296861, 1622932, 1612721, 1403664, 1271292, 1164508, 1227328, 1136469, 926014, 944587, 1200292, 1541377, 1880974, 2100985, 2138758, 1930708, 1540823]
11016A540823l08508o7868J94878J01358j10529O5639R2647J82051o089l09681
11006A374721k58343j66923n2398J5778J6161p434n0379l5805q5453q1973O1896
10995G29848P164j21233J6488j1857k34636j73374j5207L6571J90980n3669k2277
10984C48798j50952Q1057L857Q109M4113n7750r1093m8720J11907r9144M0714
10973A90896L0095k272J17850N3735J51618r3307J6873j5250m9401o2796j35380
10962B02661q5543P8970N3027k9835n1063l6068Q8185r2795j27702L1935J03715
10951A35487M7565l2671m4433k2423J10091O244n4059n4217N325K8987O0793n4833
10939A31856J54484Q6878r3468p7097L0613l3882n4742j05705J21920J61969R4994
$$ y = [1540823, 1232315, 1164447, 1359325, 1460683, 1350154, 1415793, 1508440, 1690491, 1684402, 1374721, 1116378, 949455, 897057, 912835, 928996, 921562, 871183, 835378, 749925, 667952, 729848, 737012, 615779, 632267, 620410, 385774, 212400, 197193, 233764, 424744, 371075, 348798, 197846, 278903, 282760, 290869, 334982, 277232, 186139, 137419, 249326, 150182, 190896, 220991, 218719, 336569, 390304, 541922, 448615, 465488, 450238, 400837, 338041, 202661, 117118, 196088, 249115, 219280, 168217, 132149, 220334, 127539, -163, 31772, 135487, 183052, 150381, 105948, 83525, 193616, 199860, 145801, 91584, 96909, 125896, 186689, 131856, 286340, 373218, 279750, 202653, 233266, 199384, 144642, 38937, 160857, 322826, 417820]
10928D17820N5556r9860j47886j00660j45504J51301J83236M9943l7603l2119
10918B94224J5471k51232o5821J56609m5410O8042P550J86786O7287N8396q1172
10907D10730l2935k3653p6234m6198j00563r4864N994J7872r3233j12883K39997
10896I4030J16491j3429R5252M5453P7072k7785j15272l8868j87350q2805K36183
10885A98972J02180l4218j29196q3820J55676J85919O480N3705j37983l29384
10875a1669j26755P4713Q1088p9767l9447p9045L9561J94595J94568K21798k6409
10864D43231p5190l1179k26902q190M1131K183p0099N2955k8090P8464K67077
10853D45391L0747P3241J17984p4377l1085n5280k66187k4481K02698P690J5975
$$ y = [417820, 473376, 373516, 225630, 124970, -20534, 130767, 314003, 363946, 326343, 294224, 309695, 58463, -7358, 149251, 103841, 171883, 179433, 366219, 433506, 491902, 410730, 377795, 354142, 277908, 231710, 131147, 36283, 42277, 60149, -33084, -145967, 94030, 210521, 197092, 292344, 337797, 414869, 387084, 271812, 232944, 45594, -37211, 198972, 301152, 266934, 137738, 53918, 209594, 395513, 401993, 455698, 317715, -11669, -138424, -63711, 17377, -62390, -101837, -180882, -141321, 53274, 247842, 469640, 443231, 368041, 336862, 109960, 101770, 142901, 145084, 74985, 127940, 99850, 178314, 445391, 476138, 549379, 667363, 592986, 561901, 506621, 240434, 215953, 418651, 426341, 442316]
10842D42316J61713N277J256J37044K7254j25574k68244p9595j45058k47543m4563
10831a35717K18960P7333L6186J30704Q5299P3599K7965n0087k01772j81399q2531
10820a460n0306K2177Q7177M431J15421N4002p7529P5208k5719N1488r1346L1309
10808A94853K07481j693j17221P3690q0600j23361Q1977j62286P0677N1429K9801
10797B24747J7704Q0186m2859j68019M3325P5043n9598j85322j1084K25111J83485
10786C82719l2647K4442Q6235o41R3352l0326j77345l308J36521P401j06179J40431
10774E20655k0152k81217j069R5703p7037j07029j3167Q5147J01822m2339L6468
10763B97785Q6387r5886j44505m1182J82128J41160p3678J4853l7244l7002n3940
$$ y = [442316, 604029, 609306, 610562, 747606, 774860, 649286, 381042, 301447, 156389, -91154, -135717, 83243, 160576, 196762, 327466, 412765, 486364, 514329, 464242, 262470, 81071, -1460, -51766, -29589, 57588, 62019, 177440, 231442, 153913, 229121, 203402, 254890, 163544, 194853, 402334, 400641, 283420, 357110, 276510, 153149, 235126, 72840, 143517, 194946, 224747, 242451, 322637, 279778, 111759, 155084, 230127, 170529, -14793, -25877, 199234, 382719, 350072, 374514, 460749, 460108, 553460, 523134, 345789, 342481, 479002, 486403, 380224, 520655, 500503, 219286, 218217, 313920, 236883, 129854, 116687, 201834, 303656, 261317, 297785, 384172, 288286, 143781, 102599, 284727, 425887, 352209, 367062, 329818, 292816, 238876]
10752B38876o6357k22206k09219N4377J53774P6536J32053M8777m0240J92481
10742C58852K6905j53786K4102k7056j02914m532P0745J35254l9754L2423Q3342
10731D03581P0143J13082k2754J3453p4459q7233p9664l381J90423J07372r6171
10720E34392Q0465Q0858r5957j42934j0909R9113k24282j31470Q6070J41792o5984
10709C51154R8889J31386l9336j29926j34375k84297q1072J1863o3368J00145
10699c8937K55161J79334l660j71146P5172q9083j22801o9602j09430J04236J4908
10688B4152Q4908m587j4759j98722j46410Q7849K40678K58602k43449m0398J89665
10677B37529R0301r1228N6727L3916j2497n447n923j76232P1585Q7623R4865l2819
$$ y = [238876, 172519, -49687, -258906, -204529, -50755, 25781, 157834, 206611, 166371, 358852, 385757, 231971, 256073, 229017, 126103, 121571, 192316, 327570, 287816, 320239, 403581, 473724, 586806, 564052, 577505, 503046, 415813, 336149, 332768, 523191, 630563, 534392, 614857, 695715, 599758, 456824, 445915, 545028, 320746, 189276, 275346, 417138, 351154, 450043, 581429, 542093, 412167, 277792, -6505, -87577, -75714, -139082, -38937, 216224, 395558, 391898, 220752, 295924, 206841, 84040, 14438, -94992, 9244, 24152, 109060, 104473, 89714, -109008, -255418, -167569, 73109, 331711, 88262, 47864, 237529, 327830, 236602, 293329, 327245, 314748, 309301, 303378, 127146, 198731, 286354, 381219, 348400]
10665C48400P0198K06652Q3416j36852J14006Q4688j07838J23702L9108j10518
10655G14962r68J07013N0632P2417l0681N484R6793K25939K6066P4728K65517
10644A607902J01373o9856o5187l0131J46447J67093J27384K06326J64865L95121
10634B751337N15387N57702O00188Q77709P39038O65052N85859N27864O44655
10625H464791J097122J358639J773037K859987L728067M764855O730661R108225
10617C9885384J2058218J4809488J6463504J4410065P243008j478787o320238
10610I7070642o096500k716191J791714P525299J4576945K2720730L0509525L3944218
10602A99326382K6942183P208776j4527404k4017987k1232818j2700172k959203
$$ y = [348400, 418598, 625250, 708666, 571814, 685820, 770508, 662670, 786372, 825480, 714962, 713994, 821007, 871639, 944056, 913375, 918859, 1015652, 1241591, 1267657, 1342385, 1607902, 1709275, 1639419, 1574232, 1544101, 1690548, 1857641, 1985025, 2191351, 2356216, 2751337, 3266724, 3824426, 4424614, 5302323, 6041361, 6706413, 7292272, 7820136, 8464791, 9561913, 10920552, 12693589, 15553576, 19281643, 24046498, 30777159, 39885384, 51943602, 66753090, 83216594, 97626659, 104869667, 103390880, 97070642, 90974142, 88257951, 90049665, 97574964, 112151909, 134872639, 165382164, 199326382, 226268565, 233477341, 218949937, 194931950, 173699132, 160998960, 158039757]
10595A58039757P106996J8349456L0020445L9884377M2226833K8799199k390915
10588C22036148l3375179m4372107l8287113k6580880j4769060m185196N885452
10581A66352065J5025006K1845073K2373881J1260492j0504796k9909827l5127189
10574A61314705k9184932k0492121j2371983n726149n44414L574013O023004N274444
10566A07866567Q8439q550328j5378640j7075089j4691901j1303876q462639o072344
10558B6420189m512665l348640k495429j830431j610423j285498r45921q43978
10550I547204q66727r38306r01730n50035l26109l09380j74353l89936l11697
10541D778931l90242l20233m30350j87575o6849p8452l2882j12685N9524O7421
$$ y = [158039757, 165146753, 183496209, 213516654, 253401031, 295627864, 324427063, 322036148, 288660969, 244288862, 206001749, 179420869, 164651809, 160466613, 166352065, 181377071, 203222144, 225596025, 236856517, 226351721, 196441894, 161314705, 132129773, 111637652, 99265669, 93539520, 92995106, 96569119, 102592123, 107866567, 107955006, 99404678, 84026038, 66950949, 52259048, 40955172, 32492533, 26420189, 21907524, 18558884, 16063455, 14233024, 12622601, 11337103, 10391182, 9547204, 8680477, 7742171, 6840441, 6290406, 5964297, 5654917, 5480564, 5090628, 4778931, 4388689, 4068456, 3638106, 3450531, 3383682, 3305230, 3272348, 3159663, 3219187, 3286608]
10531C286608k0437j11071k33803l26311k06048P1852n958k8699n2750j2753j1939
10520B348691j86331q7047k5540R1179l0381n2395J0073q9207O2610n9905j36148
10509A845599q7570j09616L1568k175o1499R9390J00653j37115j50280K4042j59524
10498A393473q716m9077P0980k0129K7176K01761k8608q3183p0428p5399J61819
10487A519669J44293R7845j12108j50820k03413N5844P5039n5647N6848j49212
10477A278338k13785p0745J95560J28265p3742j68622j17561R2756L2736n0981
10467A032219K42073L70912k03745j62265k30847j52628P2452K10284P9j60191
10457A018343j73696K9483J72093J88485J22266k80477l29867j85825Q9635K66806
$$ y = [3286608, 3266171, 3155100, 2921297, 2594986, 2388938, 2460790, 2454832, 2426133, 2373383, 2360630, 2348691, 2162360, 2075313, 2049773, 2140952, 2110571, 2058176, 2068249, 1979042, 2041652, 1981747, 1845599, 1758029, 1648413, 1679981, 1677806, 1616307, 1715697, 1816350, 1679235, 1528955, 1552997, 1393473, 1384757, 1335680, 1406660, 1386531, 1413707, 1615468, 1586860, 1503677, 1433249, 1357850, 1519669, 1663962, 1761807, 1649699, 1498879, 1295466, 1351310, 1426349, 1370702, 1427550, 1278338, 1064553, 993808, 1189368, 1317633, 1243891, 1075269, 957708, 1050464, 1083200, 1032219, 1274292, 1645204, 1441459, 1279194, 1048347, 895719, 968171, 1178455, 1178534, 1018343, 844647, 874130, 1046223, 1234708, 1356974, 1076497, 746630, 560805, 650440, 917246]
10447I17246j0739q2906K8812Q4131Q4611N575k71412r6045l2888o8995o3283
10436D94107m2580j81119O7241J92544M4566o1956M5416R3124j5654p0253k1960
10425E43476p8936j64676M5367N0766L1768n6792l7603N0494R1805k5199j05078
10414C45392j18944M4315J20875j1473L3420K69185J42377r6856M5629r3598k29112
10403D51210j2435J48700r4644j39930q0277k2997J97611Q5540o765Q8476K6902
10392F41391m0610l17209j78398O7305J52072J94614J38444j73587j98118L3028
10382C18932R8Q0683J05687j88089m887O6508p1230O0426l7670k38665J15127
10371B06920J41070J45245K1892o7664p9039j7631J7533M7233J49563l7710l9728
$$ y = [917246, 906507, 823601, 852413, 936544, 1021155, 1026730, 755318, 659273, 626385, 557390, 494107, 451527, 270408, 337649, 530193, 574759, 512803, 558219, 651343, 635689, 565436, 543476, 464540, 299864, 345231, 395997, 427765, 370973, 333370, 383864, 475669, 450470, 345392, 226448, 270763, 391638, 380165, 413585, 682770, 825147, 728291, 773920, 680322, 451210, 438775, 587475, 492831, 352901, 272624, 249627, 447238, 532778, 526013, 614489, 641391, 600781, 283572, 105174, 172479, 324551, 519165, 657609, 484022, 285904, 318932, 319030, 399713, 505400, 317311, 312424, 378932, 307702, 368128, 330458, 91793, 206920, 347990, 493235, 515127, 447463, 368424, 350793, 368326, 415559, 565122, 527412, 487684]
10360D87684M498l6446p6202j17599L3749Q114K5334n9195j50789Q7463K29400
10349D36011L0841J17930k371k51366n0130J03919J63323k847m1686r4271j37618
10338B71735n4245J2464J54446M2910N4292R535j35506l5467j4572N0784J7862
10327C74238P9091Q7458l5626j33452J9460N463L4399J390J8235n0427m6605k06945
10315A46679k2460J5448M5345P3397P7506M1837Q489q0257j22533j3522j8620
10304A51309P4627m9275L0447J40842J6819j22107L3247J5273J10609k21652K893
10293A83032P8228j24593K3287o3721p310L7137P4231L771N4856k8276j7103j05580
10281A07959O4243J33771P947j04204O0815K04826j53115j46779n5639J14996
$$ y = [487684, 492182, 455736, 379534, 261935, 295684, 303798, 329132, 269937, 119148, 206611, 436011, 466852, 584782, 582411, 331045, 280915, 384834, 548157, 545310, 503624, 409353, 271735, 217490, 229954, 384400, 427310, 481602, 491137, 355631, 320164, 305592, 356376, 374238, 453329, 540787, 505161, 371709, 391169, 396632, 431031, 432421, 450656, 400229, 353624, 146679, 124219, 139667, 185012, 258409, 335915, 377752, 386241, 305984, 183451, 169929, 151309, 225936, 176661, 207108, 347950, 364769, 242662, 275909, 291182, 401791, 180139, 183032, 261260, 136667, 159954, 96233, 88923, 126060, 200291, 204062, 258918, 230642, 213539, 107959, 172202, 305973, 313920, 209716, 270531, 475357, 322242, 175463, 119824, 234820]
10271B34820J37970n670m5252J21109j7149j83801m3886L6907k5451J14108l021
10260C20684P8837J31913r8361L4221m1416j69158k44753o0281N3177L4073R4656
10249A33592m1162R690j4666l3433o1313J48599K26984N2546j85660l7222R4692
10238B92647j5639j48480j84994K5953R6742K05092O8460J7244J04244K2272L0698
10227E14239M4823J2947j2789j03896j57062j92709J1247J29592P0865K05188
10217E22445j47908j42601j6018N8290J86471m5770q622j4535N1480k5066k19285
10206A98881j09208L551J14970J10621o3473j25929L5206J2348m0093P3694J52818
10195C63386L9162r5652j14518p8482m1900L0065R9853J17294P2835J10916j53630
$$ y = [234820, 372790, 367120, 321868, 442977, 425828, 242027, 198141, 235048, 209597, 323705, 320684, 399521, 531434, 433073, 467294, 425878, 256720, 11967, -48314, 4863, 38936, 133592, 92430, 102120, 87454, 54021, -7292, 141307, 368291, 420837, 235177, 197955, 292647, 277008, 128528, -56466, -30513, 66229, 271321, 339781, 357025, 461269, 483541, 514239, 559062, 572009, 559220, 455324, 298262, 105553, 116800, 246392, 317257, 522445, 374537, 231936, 215918, 274208, 460679, 414909, 406287, 391752, 443232, 418166, 198881, 89673, 93224, 208194, 318815, 255342, 129413, 164619, 176967, 136874, 210568, 363386, 402548, 306896, 192378, 113896, 71996, 102061, 201914, 319208, 392043, 502959, 349329]
10184C49329j04595J0522R0960J76849O4192J80574J03405M3866j9456L0207j25878
10173G99975j19620l3032P6228r6506k4185J40011L15467K73599J66847N7202
10163A555986j82097k66543n9971L2551J03924N3705N9191J81707O8565K22580
10153A769598K25712j43688k03834r0636j23426j74282j33769j13552q7369O1934
10143I86688K06707K34830J44482j13593k04547j35650j50896P9841j45461j54886
10133G47515o1743J57151j83884o2701J9856k8639j70470p8679J0982o680Q9863
10122D32571J68986j29027n9133N0842j06765p3046N9433J79948M8423j09751
10112D62481j37345j41733O647k9847n9656p2138n812l3231N7610O4726J05414
$$ y = [349329, 244734, 255256, 346216, 523065, 587257, 767831, 871236, 915102, 895646, 925853, 799975, 680355, 647323, 723551, 627045, 602860, 742871, 1058338, 1331937, 1498784, 1555986, 1373889, 1107346, 1047375, 1079926, 1183850, 1237555, 1296746, 1478453, 1547018, 1769598, 1995310, 1851622, 1647788, 1557152, 1433726, 1259444, 1125675, 1012123, 924754, 986688, 1193395, 1428225, 1572707, 1459114, 1254567, 1118917, 968021, 1047862, 902401, 747515, 685772, 842923, 659039, 596338, 616194, 587555, 417085, 338406, 349388, 342708, 432571, 601557, 472530, 413397, 464239, 357474, 284428, 343861, 523809, 572232, 462481, 325136, 183403, 190050, 160203, 100547, 28409, 22597, -10634, 46976, 111702, 217116]
10101B17116K277K4364P2895N5805j54252J5744L3342J4795o9618j75674o7969
10090c1175K5573J35951J54859o0553J20271q266j43359k91433k2900k8173L4832
10079a14373J37468k9868N4098J36729p6306o8423j23731J1076k352m2975n7916
10068a76573P8567K29747K16263j91861j7353N8960p654K2051J96535J9486j85726
10057B42442K1815J1699r4000P2116o676j15022j33033Q122j3032r3353o6733
10046a65655K5832j0732J39913P0969l0086q0766K6670n3064o0804j6993k250
10035a56966p7493J24168Q1957J68018J39698N85J20080j24976k40292o0751m51
10024b6423P368J89435k8243j46773O7351O2103M0819K1094j14997j11324K786
$$ y = [217116, 219393, 243757, 316652, 372457, 218205, 233949, 267291, 282086, 212468, 36794, -31175, -5602, 130349, 285208, 224655, 344926, 336660, 193301, -98132, -121032, -149205, -114373, 23095, -6773, 47325, 184054, 107748, 39325, -84406, -73330, -75682, -118657, -176573, -98006, 131741, 348004, 156143, 138790, 197750, 190096, 212147, 408682, 428168, 242442, 264257, 275956, 181956, 254072, 247396, 132374, -659, 7463, -5569, -98922, -165655, -139823, -150555, -10642, 60327, 30241, -50525, -23855, -76919, -137723, -154716, -156966, -234459, -110291, -28334, 139684, 279382, 279967, 400047, 275071, 34779, -25972, -26423, -19055, 170380, 142137, -4636, 62715, 124818, 165637, 186731, 71734, -39590, -36804]
10013c6804Q2288J77615J53643j1580j12489M9041j97168j50544J06005n826p8724
10002b4543J9297R1649j41028j9193j63136J19819M0355L7023L3892L5339R3811
9991A23285N2256M6065j08378l9591m2129N7667J58643K5857O8586p7030j56767
9980A08464j27876J32144J22947j5962K096N795n672k03198O2709O7468R8672
9969B47587J1217p7574j81951k79937k4038K45956J89544m2785n9734O8616K25361
9958C22262k3664j18862J35386k1461j35710L8756L8229r5141j28884J4959j4096
9947A1774n6305M20N4168K8327O8744r3898n7012j3628q8538N3457N5380j20088
9935a57199J18234P691o2207l8542J46524Q5589L0038m3707O0218l5857k18221
$$ y = [-36804, 45484, 223099, 376742, 365162, 252673, 301714, 104546, -45998, 60007, 54181, -24543, -5246, 86403, -54625, -73818, -236954, -117135, -76780, -39757, -5865, 29474, 123285, 175541, 221606, 113228, 73637, 31508, 89175, 247818, 273675, 342261, 265231, 108464, -19412, 112732, 235679, 219717, 221813, 227608, 221936, 18738, 81447, 148915, 247587, 258804, 181230, -721, -280658, -304696, -58740, 130804, 88019, 28285, 96901, 322262, 298598, 179736, 315122, 293661, 157951, 196707, 234936, 139795, 10911, 25870, 11774, -44531, -44111, 10057, 38384, 107128, 13230, -43782, -57410, -145948, -92491, -37111, -157199, -38965, -31274, -93481, -132023, 14501, 100090, 130128, 86421, 146639, 110782, -107439]
9924a07439j01749J32880J62917O045j22843R3643K21018O3783m6719j37653N2089
9913B15972P5981P0131j26322o5177J8345J5573j43279p2426n0271P7625m6353
9902c0201n6030Q7023K2303M7678J48596j58199j31450n7347J42957J05730o788
9891A14272j47656r5704N6961K31305P4939n3080m5773k9912j57165P9027J21468
9880A48682j22599L9856K09824j450j10784p0392j45325r5215Q8843O3946O3041
9869F8427m9679Q0142p8422o602K6471J05215R0682j0630j10868o8919l1229k1198
9857f610n2716j52962J7747o6496j62706K9104n9314R4120K42798J71571J39095
9846A93631q2782j1014l6666Q9575J25074j00933k35449P845Q1770K4095k6545
$$ y = [-107439, -209188, -76308, 86609, 92654, -30189, 63454, 284472, 348255, 301536, 163883, 215972, 291953, 362084, 235762, 170585, 188930, 204503, 61224, -11202, -61473, 16152, -30201, -86231, 792, 23095, 70773, 219369, 61170, -70280, -127627, 15330, 121060, 114272, -33384, -129088, -72127, 159178, 234117, 181037, 135264, 105352, -51813, 27214, 148682, 26083, 65939, 275763, 274313, 163529, 93137, -52188, -147403, -58560, 5386, 68427, 18748, 98890, 20468, 13866, 40337, 145552, 236234, 225604, 114736, 45817, 14588, -6610, -59326, -212288, -194541, -261037, -423743, -394639, -453953, -359833, -117035, 54536, 193631, 110849, 99835, 63169, 152744, 277818, 176885, -58564, -50719, 31051, 55146, 28601]
9835B8601k7866k2544O287l2298n4885P3764m8418R3710Q0488j06973m7283j7465
9823g4882R5098J22133j33248k4367J44983J24405o9366p616r9608p6029m489
9812b986j1847k01153J09870n1435R4632K59998J25978j31805j83066o099j09544
9801a07457J04454L6251l4882j2035K0993P4793J11931J04475k7920K9001p0423
9790B29181J6606K505N5226k8971k6026j36872j90281N4680q0225k14647j46672
9779d65496J40392K96833J19383J55902l6725J53824N9876r8744n6033k1311L6538
9768B84439j69067J45167J26478k13942k70502j06215J94858k8888n9182K8004
9758f8850J25925l9519j45021j61936m2825J90273K05828J19304R8435p786j18316
$$ y = [28601, 735, -21809, -15522, -47820, -102705, -28941, -77359, 16351, 96839, -10134, -57417, -74882, 20216, 142349, 9101, -15266, 129717, 254122, 184756, 177140, 77532, 1503, -2986, -14833, -215986, -106116, -157551, -62919, 197079, 323057, 191252, 8186, 2087, -107457, -3003, 33248, -1634, -13669, 7324, 82117, 194048, 298523, 270603, 299604, 229181, 245787, 248292, 303518, 274547, 248521, 111649, -78632, -23952, -104177, -318824, -465496, -325104, -28271, 91112, 247014, 210289, 364113, 423989, 325245, 269212, 247901, 284439, 115372, 260539, 387017, 173075, -97427, -203642, -8784, -37672, -96854, -68850, 57075, 17556, -127465, -289401, -332226, -141953, 63875, 183179, 281614, 273828, 155512]
9747A55512q23j8093M1312j0611p2157j9530J09521K554k8668o8369n329m593
9735H0726J4998O2342J45675j66212k48124n4338J52935L5592j75240O3419J92364
9724A04137l1104p9138N0746R3455j28910k08691j07152M9053N1735J1750j8277
9713b12396K50992K8471k10912K1265J01150j3025n3555J66887J16660j00614
9703I4923j07816M9502l5436n3404k61317p1260J57926J37492M4019j821m0036
9692h7228q1830J47824P7930O6345m6639n718n0688J28457k9606k13175q0348
9681a74676J32772J71226n0715j28694j76553j19373J41689K27443J20086M0111
9671A83316p3017j38444n5475r5110N2666J43021J46286K5495j2288o9246R2806
$$ y = [155512, 154689, 136596, 177908, 167297, 95140, 75610, 185131, 187685, 159017, 90648, 85319, 80726, 95724, 158066, 303741, 137529, -110595, -164933, -11998, 23594, -151646, -88227, 104137, 73033, -6105, 44641, 138096, 9186, -199505, -306657, -257604, -205869, -194119, -212396, 38596, 67067, -143845, -122580, -21430, -34455, -88010, 78877, 195537, 94923, -12893, 36609, 1173, -52231, -313548, -384808, -226882, -89390, -45371, -47192, -87228, -169058, -21234, 56696, 123041, 76402, 70684, 19996, 148453, 118847, -94328, -174676, -41904, 129322, 78607, -50087, -226640, -346013, -204324, 23119, 143205, 183316, 110299, -28145, -83620, -178730, -126064, 16957, 163243, 188738, 176450, 107204, 200010]
9660B00010r1222K41717R4895J4774J08452O2012M26253N04791O58871J113188
9650C333741Q69990q87296j206055o51300m79509l27455p7357M663j26284j09638
9640C43500j01808O4585J81048j04917k64072p1563o241L9376J46055m3613o6255
9629A16095L7843o9006R0333J4373n5765k5898r6091k6586J33802P2949N0788
9618B42837M1862j39401L2108J05487L712J4237p6177k10453o3110J43755P7691
9607A72548j08362j02381N0296j22960j54866j3270P7290j27709Q9251P0016J33628
9596c6519R9779N7044J9554j91657J05040J60378m7887M869M6515J00986L0922
9585C49024m1631l4690k09577k44026K0530J11650p0258N9059K31383J43061j31398
$$ y = [200010, 108788, 350505, 445400, 460174, 568626, 630638, 1056891, 1561682, 2220553, 3333741, 4203731, 3316435, 2110380, 1459080, 979571, 652116, 574759, 579422, 453138, 343500, 241692, 306277, 487325, 382408, 118336, 46773, 40532, 79908, 225963, 182350, 116095, 153938, 84932, 175265, 189638, 133873, 107975, 11884, -14702, 119100, 192049, 242837, 284699, 145298, 177406, 282893, 286605, 300842, 224665, 14212, -48898, 94857, 172548, 64186, -38195, 12101, -110859, -265725, -278995, -201705, -329414, -240163, -170147, -36519, 63260, 120304, 139858, -51799, 53241, 213619, 165732, 170601, 217116, 318102, 349024, 307393, 272703, 63126, -180900, -160370, -48720, -118978, -59919, 171464, 314525, 183127]
9574A83127j72328M713j048r7328j25950P6672J45154k4351J05883J94926m9079
9563B40391j69472j1000J65931n8750j49804r1050J92260l6636o0938K6644j49899
9552a02323o4661N5717K1002o324N2822N6128n6011K04756R0519j27708P7770
9541B01687P171j26477q959K18701N7981K2071j15271k37634j03466J44836l9601
9530B1039q1596L1209O1237J14593L5510j01730O1604J10699r5516r7276m0302
9519A9471J23472o7993L961O1999J92348k1500k69765J4416J9145N5019p0780
9508E9793m2026J27711P1668o2925j29534n2557K05473K3942p8479n8221J9990
9497H4835j10739O0572Q206L4798q4447N1527j6520r4352p2030J94244Q9216K02934
$$ y = [183127, 10799, 15512, 14464, -82864, -208814, -132142, 13012, -11339, 94544, 289470, 240391, 70919, 59919, 225850, 167100, 17296, -73754, 118506, 81870, 20932, 47576, -102323, -166984, -111267, -90265, -96589, -43767, 12361, -43650, 161106, 251625, 123917, 201687, 208858, 82381, 73422, 292123, 350104, 372175, 256904, 19270, -84196, 60640, 21039, -60557, -29348, 31889, 146482, 181992, 80262, 141866, 252565, 157049, 59773, 19471, 142943, 74950, 78911, 140910, 333258, 311758, 41993, 56409, 75554, 130573, 59793, 17767, 145478, 217146, 154221, 24687, -27870, 177603, 201545, 123066, 64845, 84835, -25904, 34668, 42874, 77672, -6775, 44752, 28232, -66120, -138150, 56094, 145310, 348244]
9485C48244K3469j99988k00748j91389K25286Q5382p912J70083R5418r7257j45593
9474A04995Q7322P6196J61889J68801k54127k48974j6707n3331K24514L7957p2572
9463B15963o5887j13772k3338N2724j9828k9909J237K16307J11235j35178j91018
9452A8536P4911N9506N4493o839k19376k25838j6863J1680J81426J29551J8204
9441G9391k3975p6756O9838j38189j80659M8065L7785P8411R8263R8784J22388
9430B13346R3532m4816N7102l3052p2254j65281m6904o9835j47164o6247J37215
9419a44358k014J10933J00330M9871r4181j8781J98254r1392J8183K3391K77959
9408D28195K69769J19931J35582o055r4157n0471R2963p9039k75409j52811j97919
$$ y = [348244, 371713, 171725, -29023, -220412, 4874, 90256, 82344, 252427, 347845, 250588, 104995, 192317, 268513, 430402, 599203, 345076, 96102, 79395, 26064, 250578, 288535, 215963, 150076, 36304, 12966, 65690, 45862, 15953, 17190, 233497, 344732, 209554, 18536, 93447, 152953, 207446, 200607, -18769, -244607, -261470, -249790, -68364, 61187, 79391, 55416, -21340, 48498, -89691, -270350, -222285, -184500, -106089, -7826, 90958, 213346, 306878, 262062, 319164, 286112, 213858, 48577, 1673, -68162, -215326, -281573, -144358, -146372, -35439, 64891, 114762, 20581, 1800, 200054, 108662, 126845, 150236, 428195, 697964, 817895, 953477, 947422, 853265, 802794, 895757, 816718, 541309, 388498, 190579]
9397A90579k0006K5993j79551L48J34670K46361M6001j5304r2323k14474j14656
9386G638p985J35334J89651m4692j84513j66380k5847j04327N1605J33150R1781
9375G5415k0168P723m8542j82L8906k89622r0644r923N4293P4642J73768J97504
9363A63170O0445k0842n3042n1755j47832l6Q0211k9217R4946L0299m331J3930
9351A35946j05092j23761L4151J7514j25920j00582q910J30107Q5842k5007j62607
9340b48319k3075J3577R250r1453J31766N7831k0255j48412j92026N0460J74636
9329b86020J38609R8087M5374k5287O499j28575j7521J9597R5422J55222O2536
9318A63943l8277p9439k4093P4150J57209J40971j32219p0168l0056q909n1207
$$ y = [190579, 170573, 196566, 17015, 17363, 152033, 398394, 444395, 429091, 336768, 122294, 7638, -347, 134987, 324638, 279946, 95433, -70947, -96794, -201121, -149516, -16366, 75415, 55247, 62970, 14428, 14246, 53152, -236470, -327114, -337037, -282744, -208102, -34334, 163170, 223615, 202773, 149731, 97976, -49856, -49892, 30319, 1102, 96048, 126347, 122016, 135946, 30854, -92907, -58756, -41242, -167162, -267744, -276654, -146547, -60705, -85712, -248319, -271394, -257817, -248567, -340020, -208254, -150423, -170678, -319090, -511116, -460656, -286020, -147411, -49324, -3950, -29237, -22738, -151313, -168834, -149237, -53815, 101407, 163943, 125666, 46227, 22134, 96284, 253493, 394464, 262245, 192077, 162021, 153112, 101905]
9307A01905j85041n6163l0844J19024J80458m0954j69892o6223L3103j0224j02915
9296b27766q1066j78742R4514K64743J99618m7753j24048m7450O6809J07898n5265
9285b8508J53653j9507p9781k7170m7447p6876j02914K50554L33412k9639j59606
9274A66171q0076q1349q3662l3187J87976Q7226o1704j65575M7273Q7702J0161
9263H0956j98518k3288J04226k8227L5833J33499J14769P1107k7334M9484r1855
9252B20652j99445j0229k9888q6129Q0046J56872j4727j3272J60880k4716j41383
9241I8661l7633M5321j2888j00765R0460q4385j23879J04855J91497L8917L7951
9230B48112p6278p1641j30639o7152j29858P7751O5702L1533J07341k2147j6117
$$ y = [101905, -83136, -139299, -170143, -51119, 129339, 88385, -81507, -147730, -114627, -124851, -227766, -308832, -487574, -393060, -128317, 71301, 23548, -100500, -147950, -81141, 26757, -28508, 125145, 105638, 25857, -1313, -48760, -125636, -228550, 22004, 355416, 325777, 166171, 86095, 4746, -78916, -112103, 75873, 163099, 101395, -64180, -16907, 70795, 80956, -117562, -140850, -36624, -64851, -29018, 104481, 219250, 290357, 263023, 312507, 220652, 21207, 10978, -18910, -105039, -24993, 131879, 117152, 103880, 264760, 240044, 98661, 61028, 106349, 93461, -7304, 83156, -1229, -125108, -20253, 171244, 210161, 248112, 171834, 100193, -30446, -97598, -227456, -149705, -84003, -52470, 54871, 32724, 16607]
9219A6607P777j67327Q6846J0947Q4989J03267N3166r2982P5367k39678q0779
9208a41800Q5104j2445q6032R8345J23063n4898j60822R8764J17413n5598q1372
9197g0278J56753Q4491M2569J18785J7348j23087j70813j7587n1779l1532J2842
9186c2288O8340J10725j20539j65589L1406J09260n4710P0077q2584j22182j16177
9175c04261p4697J06034J2044P9279O6497M7996J38854R776k60939j79242J02226
9164b56433J56772P6537n6051j4601R1090j35076K297R6375O6815l3108j21162
9153a26545l1441J64993P3538K7931n8574o3306q8256O3156J13552M7531m3392
9142G9187L4907k3615m484p8658m8429j03879L962Q5998J01955K015O293o9462
$$ y = [16607, 24384, -142943, -56097, -45150, 39839, 143106, 196272, 103290, 178657, -61021, -141800, -56696, -69141, -155173, -56828, 66235, 11337, -149485, -50721, 66692, 11094, -70278, 86475, 170966, 213535, 332320, 349668, 226581, 55768, 38181, -13598, -45130, -32288, 36052, 146777, 26238, -139351, -107945, 1315, -53395, 16682, -65902, -188084, -304261, -378958, -272924, -260880, -181601, -115104, -67108, 71746, 81522, -179417, -358659, -256433, -99661, -23124, -79175, -93776, -2686, -137762, -135465, -39090, 27725, -5383, -126545, -157986, 7007, 80545, 108476, 49902, -13404, -101660, -38504, 75048, 122579, 79187, 114094, 90479, 85995, 7337, -41092, -144971, -141009, -55011, 46944, 48959, 55252, -14210]
9130a4210j03973o8760L9050J28626K02616P0733J20796k1054M6890j9044j98685
9119A82985n9071K4168J7181j38521p0612K7636q7286L6571J36831J34526m7050
9108A57358p0884j29122r7741K7267P3593J45714j8719l1949M0434r849j19437
9097c3335o6415L7531k4386L8966K96614Q7993j93076M6287Q6298p508p9005R861
9085A99825j12471k35775p5004J63609j4368P2117M4097j29374j45611O2984J9140
9074a50831M017k0882p8264l2876K76286N6158k3876o8994r9107Q6054J60515
9063A08200Q35J9503N7224j84304j13925J01590J98906r6653p7401q809l1786
9052b6620Q8138o0568o5065J4317P089J02381Q181Q420J4484M4233M5412j17542
$$ y = [-14210, -118183, -186943, -147893, -19267, 183349, 254082, 374878, 353824, 400714, 381670, 182985, 123914, 148082, 165263, 26742, -43870, -16234, -103520, -66949, 69882, 204408, 157358, 86474, -42648, -140389, -113122, -39529, 106185, 87466, 55517, 95951, 86102, -33335, -99750, -62219, -86605, -47639, 248975, 336968, 143892, 190179, 276477, 268969, 189964, 199825, 87354, -148421, -223425, -59816, -74184, -2067, 42030, -87344, -232955, -169971, -150831, -146814, -167696, -245960, -278836, -2550, 53608, 29732, -39262, -138369, -52315, 108200, 109035, 128538, 185762, 1458, -112467, -10877, 188029, 91376, 13975, 5166, -26620, 61518, 950, -64115, -49798, -42709, 59672, 67853, 76273, 90757, 134990, 180402, 62860]
9040F2860o8552K8146j4410Q0634J28373J38298j5055p0366n510j05820j20131
9029C8467l8635j07422n8900L9407R2047R3732K0117O4524j40356l8096J90694
9018A55579J05176o3726m9423q3597j2362L0551j52843o5156J24620m2843N4822
9007G98J10139o7519k15730L1550M1367L7234n70K4849o7454m5581l1254P1552
8995a10619K6528J6483j3158o6957J38042m2540j27760J68045o2824k4202M6258
8984e2704J19662L3402J03255M5432k23839j60073P6664l9563P6287K4251J53150
8973A55924R2409L7177j80926p7178j91553p4914P9039J16462J7769N8696K12281
8962B45186j8441L9311N0143r9604p4688Q4446J9444r2590r7492J06313j0327
$$ y = [62860, -5692, 22454, 8044, 88678, 217051, 355349, 340294, 269928, 264418, 158598, 38467, -168, -107590, -166490, -127083, -35036, 58696, 78813, 143337, 2981, -35115, 155579, 260755, 197029, 147606, 64009, 51647, 82198, -70645, -135801, -11181, -54024, 798, 110937, 43418, -172312, -140762, -99395, -62161, -62731, -37882, -105336, -150917, -182171, -110619, -84091, -67608, -80766, -147723, -9681, -52221, -179981, -11936, -74760, -98962, -52704, 66958, 100360, 203615, 249047, 25208, -134865, -58201, -97764, -21477, 2774, 155924, 248333, 285510, 104584, 27406, -164147, -239061, -160022, -43560, -25791, 32905, 245186, 226745, 266056, 316199, 216595, 141907, 226353, 245797, 153207, 55715, 162028, 151701]
8951A51701j94246r5527j07034q9815K55769J56802n5381j60368R1057L4707p3047
8940h5382l3168Q9847J18645j06101j55170P4473N6477L9612r1456n8452M5878
8929a04797q2589j169P5477K8252M0134P2346k1668n9922j08528o4229M9635r4182
8917b71240l4394J20976L0240J29859j924N8169L5570J2586l4925j24421p9511
8906a59015Q3980P2302p7473p187j40696P0224J25647o0930O5822K9815J06872
8895A09361L7796L7253l3758K1884j90813k90929n5749M6005M5760J64011J01911
8884g268o9583r4510r9273m6842P5153L5185J10180m2953n9475l6383m4207Q6778
8872a93198J03780M8096J39833n0869l6698Q4352O8241j42125k8937Q9565m5726
$$ y = [151701, -42545, -138072, -245106, -334921, -79152, 77650, 22269, -138099, -47042, -12335, -85382, -118550, -28703, 89942, -16159, -171329, -96856, -40379, -767, -92223, -150675, -104797, -187386, -188555, -113078, -84826, -44692, 27654, 5986, -53936, -162464, -226693, -177058, -271240, -305634, -184658, -154418, -24559, -26483, 31686, 67256, 79842, 44917, -79504, -159015, -75035, -2733, -80206, -87393, -228089, -157865, -32218, -93148, -27326, 2489, 109361, 147157, 184410, 150652, 172536, -18277, -309206, -364955, -318950, -273190, -109179, -7268, -76851, -171361, -270634, -317476, -242323, -207138, -96958, -139911, -199386, -235769, -279976, -193198, -89418, -41322, 98511, 47642, 10944, 95296, 163537, 21412, -7525, 82040, 36314]
8861C6314j56959q3671N8611Q5914K2658m4158k1827M3175l3315N1768n3343M6529
8849d8304N4275j2332K26865m3555l9005j0649j96720l6327J07790Q7881N0077
8838A39996p4165k3054J57469r537p643J7774l5207j43524m9867J37214J25724
8827B35180q0539Q3606n1309q0027M3005j23401m4962j2932p2099Q6250J19114
8816A01886J8769J1890N3279n395j22921j25814K1944J65511r9086k6446n7258
8805f3641k86011K3016N1996K5720j2493R3126J02132J31374j4735P1020l526
8794A17978o9374N6326p8015k8769j04554p2999J02190k3018j5997K79586Q7062
8783B50416j92368l9707J67408J5147j92090j05069k87136N6268K92509J69466
$$ y = [36314, -120645, -204316, -145705, -59791, -37133, -81291, -103118, -59943, -93258, -41490, -94833, -48304, 5971, -6361, 220504, 176949, 137944, 127295, -69425, -105752, 2038, 89919, 139996, 65831, 42777, 200246, 190709, 183066, 200840, 165633, 22109, -27758, 109456, 235180, 154641, 238247, 186938, 106911, 149916, 26515, -18447, -31379, -103478, -17228, 101886, 120655, 132545, 185824, 180429, 57508, -68306, -46362, 119149, 20063, -6383, -63641, -349652, -326636, -274640, -248920, -261413, -168287, -66155, 65219, 50484, 121504, 117978, 48604, 104930, 26915, -1854, -106408, -179407, -77217, -100235, -116232, 163354, 250416, 58048, 18341, 185749, 200896, 8806, -96263, -383399, -327131, -34622, 134844]
8773A34844l0061O5893j5072j3491P744k8685L7612l5830j74421j17024J02234
8762f6257J37410L4005j6041j52234m3361l0488l5669J72870J36068J4414m43
8751A50274l1583j91976N9207J14848k3327j44110o8781R353Q7421J1415J13697
8740H6438J90048J15418N6137j20680k31637j20470j14657J03894P4480n7919
8730a8948n9071m6634P6837l6380R3740K01016J57476J05943j15780l08183j66156
8719a16140L9898K45960M7128j8253N3570o786j1741m2205q8797n7622m9043l375
8707g406M5639K9566M1726L2296k14134k01557J43882J82457J5236j10810m5123
8696h8228L3816P1749K7535J14364K6496l8900p7742q8453j07380j21304J44216
$$ y = [134844, 104783, 170676, 155604, 142113, 149857, 121172, 158784, 122954, -51467, -168491, -66257, 71153, 105158, 89117, -63117, -106478, -136966, -172635, 235, 136303, 150717, 150274, 118691, -73285, -14078, 100770, 77443, -66667, -135448, -126095, -38674, -27259, 86438, 276486, 391904, 448041, 327361, 95724, -24746, -139403, -35509, 38971, -18948, -78019, -124653, -47816, -84196, 9544, 210560, 368036, 473979, 358199, 50016, -116140, -76242, 169718, 216846, 198593, 252163, 245377, 233636, 191431, 102634, 45012, -4031, -7406, 38233, 67799, 109525, 141821, -72313, -273870, -129988, 52469, 67705, -43105, -88228, -54412, 17337, 44872, 159236, 185732, 146832, 69090, -19363, -126743, -248047, -103831]
8685a03831L9938j16453K5359J89838k979j35237Q8342J76337r2566k28763k5546
8674a85561J43580J72801N1335o7330j4571J49395q799k33196j65373N3468L9928
8663f4323NO81J57216K4735O8764r996o2302q7632l5494P541j73923J26690J86871
8650A38833Q7354n1650J328N5222r3141J13868J2018k12799n0956P7655Q1427
8639A59159j2714k17198p9617Q2478k6102n6067L8003L4696L758p899L9403k6347
8627f8447p8534K2224O2597N2896j31433Q9958J49589M6270m6375n7710n5018
8616a3983J16374Q2306l2977q2682o9345p151j59537j80621K10685l3219J2665
8605a57485Q8122Q7892R1994M9204j42798j07736m7771l7116L1455J85964r4490
$$ y = [-103831, -63893, -180346, -154987, 34851, 31872, -103365, -15023, 161314, 68748, -160015, -185561, -41981, 130820, 182155, 114825, 100254, 249649, 240850, 7654, -157719, -104251, -64323, -64318, -63637, 93579, 118314, 187078, 177082, 114780, 27148, -8346, -805, -174728, -48038, 138833, 226187, 174537, 175865, 231087, 137946, 251814, 263832, 51033, 77, 77732, 159159, 146445, -70753, -150370, -67892, -93994, -150061, -112058, -77362, -73604, -81503, -42100, -68447, -146981, -124757, -62160, -9264, -140697, -50739, 98850, 145120, 98745, 41035, -13983, 102391, 184697, 151720, 69038, -307, -7458, -166995, -347616, -136931, -170150, -157485, -69363, 18529, 110523, 159727, 16929, -90807, -138578, -175694, -144239, 41725, -52765]
8594e2765j99453J90106J25500n9999O3557J45122K2698o0961j35465n5681o5532
8583h2873r1908N0142K16951j2932J73133n9647m6929K9316j70118j41029J83142
8572D7248R4283j577k071k579j78966q1428J10439J89273k1249j17912m4703n1506
8560f0748R9210l8778n2682Q4743m1799q7254K52835Q3396j98371j28826M4080
8549d4194M1254j9445k01158M5398k2039J0489m3066J6526m6564J8577J07872
8538a36350j07760n1166K19513K1623j31053M0584J31107R86j97638j44653J5836
8527c38971O2674J65258P2027m8958J32041J25129p3914m7019K0307K1410o5224
8516B4760M9473N2060Q5262p5057k2891r4404J22234N1423j21068L0965J40785
$$ y = [-52765, -252218, -62112, 63388, 3389, 66946, 212068, 234766, 173805, 38340, -17341, -82873, -174781, -124639, 92312, 79380, 252513, 192866, 145937, 175253, 5135, -135894, 47248, 141531, 139954, 137883, 135304, -43662, -125090, -14651, 174622, 153373, 35461, -9242, -60748, 38462, -316, -52998, 31745, -10054, -97308, 155527, 238923, 40552, -88274, -44194, -2940, -22385, -223543, -178145, -200184, -189695, -232761, -216235, -262799, -244222, -136350, -244110, -295276, -75763, -54140, -185193, -144609, -13502, -12516, -210154, -354807, -338971, -276297, -111039, -39012, -87970, 44071, 169200, 95286, 48267, 68574, 89984, 24760, 74233, 126293, 211555, 136498, 113607, 19203, 141437, 192860, 71792, 102757, 243542]
8505B43542K594k0237j29611m8890R7089J33566L9740j9189N2562j72470j01283
8494G7413J9769p4315j539J82149R6080r2249j69992j01404p725j23737j55211
8483c50761R5544j6765K11181j14225j00556J9993M232L0089j10636R6414K36875
8472A385J15074j03637j20365J7597m8599L8095j05549N9043j03300Q0855K91245
8461A21844J1955r4505j30748j10144R3623O0896R5044j59777j71070K41420R0107
8450D8645k51584j33996K08575L06819K1510q1571N4053O9255Q6402P6773j49058
8439B55823j09043J41778j14049k48974j52802P2620J13867J51481M4134L5317
8429A90152j12356p1373J05145o5451j35220J39879K8141l0188K8588n1139N7499
$$ y = [243542, 246136, 225899, 96288, 47398, 144487, 278053, 317793, 298604, 351166, 178696, 77413, 97182, 22867, 21328, 203477, 299557, 207308, 37316, -64088, -71813, -195550, -350761, -255217, -271982, -60801, -175026, -275582, -255589, -251357, -221268, -331904, -235490, 1385, 116459, 12822, -107543, -89946, -138545, -100450, -205999, -146956, -250256, -169401, 121844, 133799, 39294, -91454, -201598, -107975, -47079, 47965, -111812, -282882, -41462, 48645, -202939, -336935, -128360, 178459, 199969, 118398, 172451, 241706, 328108, 404881, 255823, 146780, 288558, 174509, -74465, -227267, -154647, -40780, 110701, 154835, 190152, 77796, 6423, 111568, 46117, -89103, 50776, 78917, 48729, 77317, 26178, 83677]
8418H3677m9552j61554J10352L2421r4163l7189o7395J40455P2515N5246j4459
8407G0354m6888p6638j16434J423p4016m5921P0392K43202J29330p2474N0526
8396A32856m7631j76517j36991k841j0455j5508q1936P8224J50680L2664J25151
8385D7696R611p2144j37346k09277k39711P7245J18802K20944K56595l3724n4172
8374a5481R592K2296j39570n8051J66767M1154M4734P5145P0305R7862K6205P0307
8362D11265j49473j73498j0622k6282q3878k4395K8928r0292o3201J1089N3221
8351a17138L8028l2970J34136J54168j06942n8672L4228M6984p0279J04651j07462
8340A8732n4817K7764j47078Q4634J52822M9985n8469K1857J8633p3219r7589
$$ y = [83677, 34125, -127429, -17077, 15344, -78819, -116008, -183403, -42948, 29567, 84813, 70354, 23466, -53172, -169606, -168183, -242199, -288120, -217728, 25474, 154804, 82330, 132856, 85225, -91292, -228283, -231124, -241579, -257087, -339023, -260799, -110119, -77455, 47696, 57307, -14837, -152183, -361460, -601171, -523926, -405124, -184180, 72415, 38691, -15481, -5889, 16407, -123163, -181214, -14447, 26707, 71441, 146586, 216891, 314753, 340958, 411265, 261792, 88294, 77672, 51390, -32488, -56883, -27955, -118247, -181448, -170359, -117138, -79110, -112080, 22056, 176224, 69282, 10610, 44838, 91822, 21543, 126194, 18732, -36085, -8321, -155399, -70765, 82057, 132042, 73573, 95430, 114063, 40844, -56745]
8329e6745j65788P6111j5126r877r6995l0322O9076J31765J5402j31333l0328
8318b44160N3222o5587k4762O3697Q6607R8216P9602N583J8306k15362j20742
8307b65380K34309R2365l6010K1492n3355Q962m2409n5152J04086J95432J2852
8296B17192p5464l01187J13194Q6493k3868o1327n4797J01091P7261p9633K64
8285g81l9024J52339K63783M9740k46275j95269Q1878q482j77696Q5920M211j79984
8273b09640Q7006J43179Q6550M2487j8686M9906j88102q8261q695k853j14964
8262b22073M5562K31838l5915n2616p8808p0972j05792J430M8628q7912K29635
8251i6995N1389k2325j35830l0918Q5874K5719L4340j1863K0347R6936L9512k00968
$$ y = [-56745, -222533, -146422, -161548, -171425, -268420, -298742, -229666, -97901, -82499, -213832, -244160, -190938, -256525, -281287, -217590, -130983, -32767, 46835, 52418, 70724, -144638, -265380, -31071, 61294, 25284, 46776, -6579, 2383, -40026, -95178, 8908, 204340, 217192, 141728, -159459, -46265, 40228, 16360, -44967, -99764, 1327, 78588, -1045, -781, -39805, 112534, 376317, 426057, 179782, -15487, 66391, 57909, -119787, -33867, -29656, -209640, -122634, 20545, 107095, 149582, 130896, 180802, -7300, -95561, -104256, -107109, -222073, -176511, 55327, 19412, -33204, -112012, -182984, -288776, -287346, -238718, -326630, -96995, -45606, -67931, -203761, -234679, -148805, -123086, -88746, -100609, -80262, 16674, 56186, -144782]
8239a44782O4598L05634N9927j01398k40456q4433j5043M3574j9456J7579K7590
8228h6666R4656m8412k8846l9842P7338N921N6348L6614M172k8897k9081J5373
8216B8678k18191l1079R9089P5192J7002J3581j034L4468n5559J37828J6438j46347
8204b9934j04922p5836J07471K11993O9006k13840Q34J02548M2505k4899n3374
8193C1552l0449k0228O7659j23719j85909j37161o2506J4937K16113K47721k07253
8182a89243j04977K02179O5653j5866j04931J72623J47930j70365j53761N8087
8172i2671j7130j00514J10720J18340p1926R994K23549R3823m6521k37709k20150
8161b30195K1664K09024j06522J474L0880K9903J84487j54125j3844n8394j1014
$$ y = [-144782, -80184, 225450, 285377, 183979, -56477, -140910, -155953, -112379, -131835, -114256, -86666, 7990, -40422, -69268, -109110, -31772, -25851, 30497, 67111, 71283, 42386, 13305, 28678, -189513, -220592, -121503, -46311, -29309, -15728, -16762, 17706, -37853, 99975, 116413, -29934, -134856, -210692, -103221, 108772, 177778, -36062, -35228, 67320, 109825, 84926, 31552, 1103, -19125, 48534, -75185, -261094, -398255, -460761, -445824, -229711, 18010, -189243, -294220, -92041, -26388, -42254, -147185, 25438, 173368, 3003, -150758, -92671, -109801, -210315, -99595, 18745, -53181, -43187, 180362, 274185, 227664, -10045, -230195, -208531, 493, -106029, -104555, -73675, -43772, 140715, -13410, -27254, -85648, -96662]
8150i6662m630J34502n0216j43690q2975Q9084J1987O0752P2815K23043K6301
8139B40311j1298m9983k99811k9239k5715P4240m9011o1369J4779Q206K6964J80977
8127A9051m1688L3817J4093n2442N1415P9835m0527o7745J0326R4443m7825r8179
8115d5426j59100M8566J27294R3760J51873J30747j17079j58173j59381N9620
8105b7299Q8587q2957j72945O2400k685Q5816Q4504j7711r9591k4093j30562r3991
8093c30527J33077p1008p1430Q8204K59930K10014J47681l443j25362o2415R5594
8082B70315q6431j59101O1778j04795o8600N4185n5755o0192p6092J42476Q1551
8071f61o1443n1197k8574j11193n8350J04369L1216L0600k2918Q648n914K7595
$$ y = [-96662, -101292, 33210, -17006, -160696, -243671, -154587, -142600, -81848, -9033, 214010, 240311, 229013, 179030, -120781, -150020, -175735, -101495, -150506, -211875, -197096, -188890, -161926, 19051, -22637, 11180, 25273, -27169, 24246, 104081, 63554, -4191, 6135, 100578, 52753, -45426, -204526, -155960, -28666, 65094, 216967, 347714, 230635, 72462, -86919, -27299, 61288, -21669, -194614, -132214, -134899, -49083, 35421, 17710, -81881, -105974, -236536, -330527, -197450, -268458, -339888, -251684, 8246, 218260, 365941, 362498, 237136, 174721, 270315, 183884, 24783, 86561, -18234, -86834, -32649, -88404, -148596, -224688, -82212, -661, -62104, -113301, -141875, -253068, -311418, -207049, -175833, -145233, -168151, -159503, -165417, -137822]
8059a37822L6110L7775j35616n3139K7240K11956J98102j3187j87134l4548P8543
8048B8280J06671j00187j63833M4553m5867r0241K3721n6025N3038J11048J5997
8037g2845L7118J3031m9445o0243J44932L9269k7263o9910j2395k0956K0748k19578
8025b77537j54857K51037J34171r258n0898K1998j7297j77801K0570K9028R7439
8014a33405N1649P5821N3831q5459J04391L6100n8668M1622O9650j62436q3733
8003i0637r8124J31514L6929M5988J03024K0226M6062j05863j21765j48652K59322
7992G8024J20993j91728O0765K4502l0040r4126j2737K36627r8468P567J52927
7981B54306r8896j30505m5085J7823J91241J4626l6651J1366j95134j79579m6109
$$ y = [-137822, -101712, -63937, -199553, -252692, -225452, -13496, 184606, 171419, -15715, -50263, 28280, 134951, 34764, -129069, -84516, -130383, -220624, -196903, -252928, -199890, -88842, -72845, -35727, -22696, -72141, -132384, 12548, 51817, 24554, -45356, -57751, -78707, -57959, -277537, -432394, -181357, -47186, -56444, -107342, -85344, -102641, -280442, -259872, -230844, -133405, -81756, -5935, 47896, -37563, 66828, 102928, 44260, 85882, 155532, -6904, -90637, -188761, -57247, -20318, 25670, 128694, 148920, 194982, 89119, -32646, -181298, 78024, 199017, 7289, 68054, 92556, 62516, -31610, -44347, 192280, 93812, 101379, 254306, 155410, 24905, -20180, -2357, 188884, 203510, 166859, 178225, -16909, -196488, -242597]
7970b42597J36189O1814M5589o0295o2090O1923O3592p4113j40529J77388j02943
7959a36072r3462K6529J21708p2116J01391m2117K6358M8229K42696R0301q1512
7948B31933r6150M9184l4437j25568p7084O1846K0210R0811Q6590k48033n1731
7937i2429j01928J79427J00903p7064j1923J06117Q5393j9640o7712k9050J16432
7926A88526j9352p3015o0967q4698J2059O6762o7343J05304l8744k3490r6439
7915i1397P35j8658P9140J3648k12331N0145K62413P5754r6645j01627k3620J12501
7903E0058q3758m3246K6547L2903j7428M0259O551l0121n0908L3427R6457R8704
7891A59445q1207j06961j30475L7007o1734m8645J924P0975K28399K3568o3227
$$ y = [-242597, -106408, -44594, 995, -59300, -121390, -59467, 4125, -69988, -210517, -33129, -136072, -229534, -203005, -81297, -153413, -52022, -94139, -67781, -19552, 223144, 313445, 231933, 135783, 184967, 150530, 24962, -52122, 9724, 29934, 120745, 207335, -40698, -92429, -194357, -14930, 85973, 8909, -3014, 103103, 188496, 168856, 101144, 72094, 188526, 169174, 96159, 35192, -49506, -37447, 29315, -38028, 67276, 28532, 5042, -91397, -90662, -109320, -30180, -16532, -228863, -178718, 83695, 159449, 62804, -38823, -62443, 50058, -33700, -76946, -50399, -17496, -34924, 5335, 11886, -18235, -69143, -35716, 60741, 159445, 78238, -28723, -159198, -122191, -183925, -232570, -230646, -159671, 68728, 92296, 29069]
7880B9069j04769m5742j34156J5909J34457M1751k6649K1497J60637P6556j56611
7869A1949j37268K7483L7542N4635r8272j11967j2594k22401K10668K06749M559
7858b8917l3336p8498J15085J48279J5389q3167L4807j153J886J01338Q3088l1855
7846B42946q4406m8043l846p6585r9432j32580K2781Q340r0538J42846k4840P1242
7834g2115j8564r375k8879J6871N306J27188P579j60535m1400j26804R2866J51600
7822e6262J39302o627j46837j78030J12767k9883m0994k0331K1590J04723J63652
7811F3070O272n0081o8342k5343K800k24096l9856J60311l8054J34000M4650K298
7799c2371J53331j9888j68414M5955N6945k3455n6118o3531j29693q649J10309
$$ y = [29069, -75700, -121442, -255598, -239689, -105232, -63481, -90130, -68633, 92004, 168560, 11949, -125319, -97836, -60294, -5659, -103931, -215898, -228492, -450893, -240225, -33476, -28917, -62253, -140751, -25666, 122613, 138002, 54835, 89642, 88489, 90375, 191713, 274801, 242946, 158540, 110497, 106651, 30066, -69366, -201946, -179165, -170825, -261363, -118517, -143357, -72115, -90679, -100054, -128933, -112062, -106756, 20432, 28011, -132524, -173924, -300728, -207862, -56262, 83040, 76413, -70424, -248454, -135687, -165570, -206564, -226895, -205305, -100582, 63070, 69342, 19261, -49081, -74424, -71624, -295720, -335576, -175265, -213319, -79319, -34669, -32371, 120960, 101072, -67342, -21387, 35558, 12103, -44015, -107546, -237239, -245888, -135579]
7788a35579J23956N3831l834r4969o8721L432j71507j45704r313J43251J10345
7777a94812j5407j266j02425J35277K19633p4021j1562J81243L02066J78234j57795
7766D59165j53962J9966j25558j98635m1909n2036L2701o6488j05434j38780k0783
7755c91753L4225K4131K91754J92890J42269L1485l8197r9738j02534L2105r9835
7744A6802K4700J1101L259l7386O3237j25594n4639O4520o35q9962q7788j1941
7732b24326O585q93j41292Q3053J14503Q7958M8832J04023o9028j33038n3871
7721a77494l8627O0239J32057O1665j55062P2258J44151K7630j31555m2948P7286
7710B9600j40639p2493O0880J002J01956J22916m4951m3066j14049O0635J36698
$$ y = [-135579, -11623, 42208, 38374, -56595, -125316, -121884, -293391, -439095, -448408, -305157, -194812, -210219, -211485, -313910, -178633, 41000, -33021, -44583, 136660, 438726, 616960, 459165, 305203, 325169, 199611, 976, -40933, -92969, -60268, -126756, -232190, -370970, -391753, -357528, -333397, -41643, 151247, 293516, 325001, 286804, 187066, 84532, 116637, 16802, 41502, 52603, 55862, 18476, 81713, -43881, -98520, -34000, -34635, -124597, -212385, -224326, -217741, -218634, -359926, -276873, -162370, -74412, -25580, 78443, 9415, -123623, -177494, -216121, -155882, -23825, 37840, -117222, -44964, 99187, 126817, -4738, -47686, 29600, -111039, -183532, -122652, -121650, -19694, 103222, 58271, 15205, -98844, -38209, 98489]
7699I8489J56245o7100k1577K1452j25046j43432l4967O493j13064N1427M4405
7688a26675O7315J37954k6495l5706K770k6022j1019n7033j5520j28946j75210
7677c94587j06750J38225J15474P3657O0945J29934o6442n5521r8156r8009O2862
7666b38368P3974J90214J17559p5292n5240L5647O3582o3706r6850Q9554J71382
7655B12456P88L2740p4432m8821j8590O955j8112j13717j43157K0460J0647R096
7643a23687J25134J35094Q7546J2101m29560k89468J58923K92082J41916L432
7633A13513j1291Q5569k84904k4302K61669J9815l3592j53042p476N480j79488
7622b08049j1313J14393o843l0864j09903m5973J39788J47581K7784j12932m200
$$ y = [98489, 254734, 187634, 166057, 187509, 62463, -80969, -115936, -109443, -222507, -171080, -126675, -59360, 78594, 52099, 16393, 19163, -6859, -17878, -74911, -90431, -219377, -394587, -501337, -363112, -247638, -173981, -113036, 16898, -49544, -105065, -203221, -301230, -238368, -164394, 25820, 143379, 68087, 12847, 48494, 112076, 48370, -48480, 41074, 212456, 213244, 245984, 171552, 122731, 104141, 111096, 92984, -20733, -163890, -143430, -132783, -123687, 1447, 136541, 224087, 236188, -193372, -482840, -323917, -31835, 110081, 113513, 102222, 187791, -97113, -121415, 140254, 160069, 126477, -26565, -34041, -28561, -208049, -219362, -104969, -111812, -142676, -252579, -298552, -158764, -11183, 16601, -96331, -100531]
7611a00531J21120n2652o3446j03546j2355J43936N3023m0363N6022J22442O1277
7600A84927k394k2173q1102q9911n5644O5211K00464j37771k1368O5926M5407
7589A51572k43470n2937L21724J85669j31891j23774j98333j84239j2240Q8470
7579a99449K8119p060Q2362R699J9149L9802J20230N7674J6508J51677m4741r2151
7567A81819l6931r3896j81659j35063j49294r7093K31335L04647O525J9888J0775
7556F1053M1601q3556j48250R518J49952R8915L5767o3564r5904j6621p312q82
7544a9283j0580q8705m3228j7281P5078J53009l3554j56617J0395K21557Q1634
7533A72425k1565M3805J81317k2699k00673k47014m6103J10228Q0769N8853n7401
$$ y = [-100531, 20589, -32063, -95509, -199055, -211410, -67474, -14451, -54814, 1208, 123650, 184927, 182533, 160360, 79258, -10653, -66297, -1086, 199378, 61607, 40239, 106165, 151572, -91898, -144835, 176889, 362558, 230667, 106893, -91440, -275679, -287919, -199449, -171330, -178390, -96028, -86329, -67180, -27378, 92852, 150526, 167034, 318711, 273970, 181819, 144888, 50992, -130667, -265730, -415024, -512117, -280782, 23865, 30390, 50278, 61053, 102654, 19098, -129152, -119634, 30318, 129233, 165000, 101436, 5532, -11089, -18401, -19283, -29863, -118568, -161796, -179077, -103999, 49010, 15456, -141161, -130766, 90791, 172425, 150860, 194665, 375982, 353283, 152610, -94404, -140507, -30279, 50490, 109343, 51942]
7522E1942q6647L0418R3440q8330l494k20350m0462j2498j07538L7599k7943J26203
7510b47660J44210J82654k2127m8679k3987Q478K6576m0359p6336k2235j08672
7499b28137J5612J25936J44068N940j65099j50398J13167L6099Q341J47347J7999
7488G0875j1346j93984L6067j5407K1549O5509J89759k8494k20132j96520j4915
7477b97039O1780O4057P5099k27145j5928K1106J63340p6682R4784Q820k3688
7466a51496J67590K36469j0606l2620p059j35461j81727J15836n2067Q3632M8927
7455H1418k9689j12908j30806M9710r0456J19920L0367k35036N1422J54959L5579
7444g5520p678k5547j63563j10853J8982q726q4434J01924M5854O9500O7416J41361
$$ y = [51942, -34705, -4287, 89153, 823, -2671, -223021, -263483, -275981, -383519, -345920, -373863, -247660, -103450, 79204, 57077, 8398, -15589, -7111, 19465, -20894, -97230, -119465, -228137, -212525, -86589, 57479, 63419, -101680, -252078, -138911, -102812, -94471, 52876, 70875, 59529, -134455, -98388, -113795, -92246, -26737, 163022, 134528, -85604, -282124, -297039, -235259, -171202, -96103, -323248, -339176, -318070, -154730, -231412, -136628, -127808, -151496, 16094, 252563, 241957, 209337, 202278, 66817, -114910, 926, -51141, 32491, 81418, 51729, -61179, -191985, -142275, -232731, -112811, -82444, -317480, -266058, -111099, -75520, -83198, -108745, -272308, -383161, -364179, -372905, -457339, -355415, -309561, -240061, -172645, -31284]
7432c1284J5908L7897J99962o6124O9360N2022k45840n9189j1224p1646M3990
7421f6168P6565L5091k5423k6445m0538m3183m0815M6126N3334p9475j10825J25229
7409i6527J22008j28914q729q833o0695J35867l5832j82156M7003m0029N0537
7398b06300R0320J59799J4714l0587j18122j88633K53812R4141M7556j27434k8243
7387c8977J0423J00366K09672L0919j60186j33225K8393j14002k36707O381J18940
7376a78003J33613J11082j08024M6257K4046j41828J2995J49134R1936J51730
7366B92938p1527j30814J00550k3947j40589j5596j02333k95629k06528N7523
7356e35952J91909J23180p1370j11981O2580K42582M6874k3574K0761j0915k9045
$$ y = [-31284, -15376, 22521, 222483, 156359, 225719, 277741, 31901, -27288, -38512, -110158, -66168, 10397, 45488, 20065, -6380, -46918, -90101, -130916, -84790, -31456, -110931, -221756, -96527, 25481, -103433, -112162, -120995, -181690, -45823, -81655, -263811, -216808, -256837, -206300, -115980, 43819, 58533, 27946, -90176, -278809, -24997, 69144, 116700, -10734, -38977, -28554, 71812, 281484, 312403, 152217, 18992, 47385, -66617, -303324, -296943, -178003, -44390, 66692, -41332, 4925, 28971, -112857, -99862, 49272, 141208, 292938, 221411, 90597, 191147, 167200, 26611, 11015, -91318, -386947, -593475, -535952, -344043, -220863, -292233, -404214, -341634, -99052, -52178, -75752, -54991, -65906, -94951]
7345i4951r6647m7485J21689j19904k9213J72195P0486j19834O2198k46k6515
7334a08227R1656O17p6334r3605j4810O8488O2800J486o7127p2533l3766p9365
7322c20720m6729J55781K10911j130l4020R4659K0508M4425p0455j73062j26777
7311b46609N0710Q3137J00733J7350k1940l1191k8471n9043m0289m1217K2842
7300a93988K6635K72094J25264j29636j63449j46985o3135k3200L7877J41347
7290a17176K14359k0416k18061M8205K44163L2336M2969L2211j95445K5694J12695
7279B01534K8568r6823k05932K23149J01755j61060J09614P7701p7792m8847p647
7268A44220L2985p8826l7465K7045K9135j35207P6735O1428n729K2577R5038n0384
$$ y = [-94951, -191598, -239083, -117394, -237298, -266511, -94316, -23830, -143664, -81466, -81712, -108227, -16571, -15954, -92288, -185893, -200703, -132215, -69415, -67929, -135056, -207589, -241355, -320720, -367449, -211668, -757, -1887, -35907, 58752, 79260, 123685, 53230, -119832, -246609, -195899, -112762, -12029, 5321, -16619, -47810, -76281, -135324, -175613, -216830, -193988, -167353, 104741, 230005, 100369, -63080, -210065, -273200, -296400, -258523, -117176, 97183, 76767, -141294, -93089, 151074, 183410, 226379, 258590, 63145, 88839, 201534, 230102, 133279, -72653, 150496, 252251, 91191, 200805, 278506, 200714, 151867, 144220, 177205, 98379, 60914, 87959, 117094, -18113, 58622, 120050, 114321, 136898, 231936, 181552]
7256A81552k56448j9208P8423j9000n002j4345M2949P3555j14263J1801J01841
7245F1855J14620Q7116J3209j03004J37927n1991j62432j63124k5833j6940P7723
7234c0874R3180k9587m3138J65514j30404j30804o6825K3433Q8439r823J4274
7223e6615J44030O8283p5620p0542l5769M7322N5932n9865k7400K0231K1247l898
7211B7336L2121m3559M6627j36513j47087R6974q1533l6438J00862K7606J75396
7200F1792J12940n6894p8544j34804l0004j8349j07335j2584K5732J45382J49194
7189E6526O0459j47295r968J45002J01086k7868l25n6103r4772j27146J03662
7178C258P8335j25190L8203J07867j1364K6011m4271M003Q6558m490j11123j25229
$$ y = [181552, -74896, -94104, -15681, -34681, -39683, -54028, -11079, 62476, -51787, -39986, 61855, 176475, 263591, 276800, 173796, 311723, 259732, 97300, -65824, -91657, -108597, -30874, 62306, 32719, -10419, 155095, 24691, -106113, -172938, -149505, -61066, -70889, -56615, 87415, 155698, 80078, 9536, -26233, 21089, 77021, 17156, -10244, 9987, 31234, 27336, 59457, 15898, 62525, -73988, -221075, -124101, -205634, -242072, -141210, -113604, 61792, 174732, 117838, 39294, -95510, -125514, -143863, -251198, -263782, -238050, -92668, 56526, 116985, -30310, -40278, 104724, 205810, 177942, 177617, 121514, 26742, -100404, 3258, 81593, -43597, -5394, 102473, 91109, 117120, 72849, 76852, 163410, 158920, 47797, -77432]
7166g7432o7694k941J47109l9506J3287j94808k7849K6117J27810R5027K2062
7155B1182j16716N0216L2554k2341k190k4220J2145J83542K18956l1519p070m5492
7143B69047j95172o4229L6250L3766l2050P8880N6628j72053J29957J87049j11983
7132B16090o3101P2092K5835J6490o2428p1280N869j4671O6321o203M2732k6430
7120B01316n332K3933o1702j9285m8937q3359l1146O2197j2741j33162R2308R2019
7108G6109o9144j50908k8156J60915R6227P2985K6468n5393k92178L8030L2300
7097i2745R4812O0163j32543o301M5594L6260n6905r2080j70961P0000r894K5412
7085b29188J22120J9962N5111P3274j84119j55157J92029J21181j05447j6778
$$ y = [-77432, -145126, -148067, -958, -40464, -27177, -221985, -249834, -223717, -95907, -880, 21182, -95534, -45318, -12764, -35105, -37295, -61515, -49370, 134172, 353128, 321609, 314539, 269047, 73875, 9646, 45896, 79662, 47612, 126492, 183120, 11067, 141024, 328073, 216090, 152989, 225081, 250916, 267406, 204978, 133698, 139567, 124896, 191217, 185014, 227746, 201316, 195984, 219917, 158215, 138930, 89993, 6634, -24512, 37685, 24944, -108218, -15910, 76109, 6965, -143943, -172099, -11184, 85043, 158028, 184496, 129103, -163075, -125045, -92745, 2067, 62230, -70313, -76614, -31020, 5240, -51665, -143745, -314706, -244706, -254600, -229188, -107068, -87106, -31995, 41279, -142840, -297997, -105968, 15213, -90234, -107012]
7075a07012o1440K6702J09125Q9550j45656J5772Q6603j38586k8014L3242m352
7064a24066r099l3953p0160m0910J50433J53765j22197p8234R4600q8736N4126
7053a14431j4677m280j46532K5548K6897Q5209J21977J61821O356p1551p092l0426
7041C8819n9494M8614j40325n6138M0475j8807l5155J9821O1558j06643j45888
7030c53163j13948m4216J45762L41496J46472j03149j383L6662J0569J07851k4828
7019A48125j5401K038j6320p1381o9232o8761L5311J31140R7673P2297l12221
7008f6732j42983J6967J3713j07390N623P1029J21876K4492k9712n5376L0237
6997a18256K26402K89729O104L8171j30513k4388k72002k25079K0627P4405j8955
$$ y = [-107012, -168452, -141750, -32625, 56925, -88731, -72959, 13644, -124942, -152956, -119714, -124066, -133165, -167118, -237278, -278188, -127755, 26010, -96187, -174421, -79821, -168557, -114431, -129108, -133388, -279920, -254372, -227475, -142266, -20289, 141532, 147888, 76337, 69245, 38819, -20675, 27939, -112386, -168524, -128049, -146856, -182011, -162190, -100632, -207275, -353163, -467111, -511327, -365565, -24069, 122403, 19254, 17871, 54533, 65102, 172953, 148125, 132724, 134762, 118442, 47061, -22171, -90932, -55621, 75519, 173192, 245489, -66732, -209715, -192748, -179035, -286425, -280802, -209773, -87897, -63405, -93117, -148493, -118256, 108146, 397875, 403979, 442150, 311637, 287249, 15247, -209832, -189205, -114800, -133755]
6986a33755k7023K4999N2842J5069J111j2680j671J04472n7814m0452j4578k2903
6974a12383j8951K336j39516K0312K3901O0927J18358J77120R204j40447j22011
6963a21150Q9212M3723L2243r9939j2305j42551J9173R3238J21919J16634m2312
6952I7885m3537n3008j13675N6270M5964J63237J16732n4690j67257M8098k24793
6941a28774j00982N5109n442L6206M6407J05723R0419p2584j23993p2021K04739
6930C4807O5066k23709l14356M2717O3583K38831Q9896l00J61531j02131j34400
6919g8465O1603l646l5757O1643r2263l864j82176N1143N7810J59082R2927Q868
6907I6905j27191O9806O9498P2185j08713k78089k3600Q7039R8410K0490J40435
$$ y = [-133755, -160778, -135779, -82937, -67868, -66757, -79437, -81108, 23364, -34450, -74902, -89480, -112383, -131334, -128998, -268514, -248202, -224301, -163374, -45016, 132104, 141308, 861, -121150, -31938, 11785, 44028, -55911, -68216, -210767, -191594, -98356, 23563, 140197, 97885, 54348, 1340, -112335, -56065, -10101, 153136, 269868, 215178, 47921, 96019, -128774, -229756, -174647, -180089, -143883, -97476, 8247, 98666, 26082, -97911, -169932, 34807, 99873, -123836, -438192, -395475, -331892, -93061, -3165, -3465, 158066, 55935, -78465, -16862, -20508, -56265, 5378, -86885, -90749, -272925, -221782, -163972, -4890, 88037, 96905, -30286, 39520, 109018, 181203, 72490, -205599, -229199, -142160, -43750, -23260, 117175]
6896A17175K7373j24129p691J19877J25491l8594q873n4138k2560M874l5808M6779
6884A49776l1129q5209j29491l0107M0073p0310J8537K17730M945K1043J65727
6873B71585n5327n7115J082j4956m710j57753r1584n6885k6228m854p8998j8436
6861b94179J19440N5514M8738L1415k1398r6447k1751P3700M2944P1490p0499
6850f1033j1376O1041L7883M0378j14897j25656j29642J16220k0336J48988J86492
6839A28062j75307m1375j00671p5383J09139k3124o6755Q4600R5482p7693L3063
6828a09962L185j34497P109M6638M225l4797M2438J01728j0834L0555q9823o7513
6816b11548O8077J40336Q5067m8273m2913n2590L991l5785j67818r974n518l897
$$ y = [117175, 144548, 20419, 12728, 132605, 258096, 219502, 210629, 156491, 133931, 138805, 102997, 149776, 118647, 33438, -96053, -126160, -86087, -156397, -137860, 79870, 84815, 105858, 271585, 216258, 159143, 160225, 145269, 140559, -17194, -108778, -165663, -191891, -196745, -275743, -294179, -174739, -119225, -70487, -39072, -60470, -156917, -178668, -104968, -62024, 9466, -61033, -72409, -11368, 26515, 66893, -48004, -173660, -303302, -187082, -207418, -58430, 128062, -47245, -88620, -189291, -264674, -155535, -178659, -245414, -160814, -65332, -143025, -109962, -106777, -241274, -234165, -187527, -183302, -218099, -175661, -73933, -84767, -54212, -144035, -211548, -143471, -3135, 81932, 33659, -9254, -61844, -57853, -93638, -261456, -271430, -276948, -280845]
6804b80845R0476K59127J45726N1616K2713r5020l2692J4904L3874L1517p1305
6793A70091l0551q7240j29890K1880o0531j4633J48716J51870O6704j19127j87257
6782f9968k0929m8070l3566R3673J11233o3479K6396P2080r9259p8390J23590
6771A3311Q2030o7356n6447P6431l112j44615p0914l239n6555K1427M0622m6751
6759b15168Q9978L6218J69532k5509j01513L9902N507J1480j33417J4483J04292
6748d215N2489R3147Q2142l7594j00177r6652M3527n8843O6338p5306j11302J0271
6736a36175R0541q6675r6148j5375J10933J9465N3630J15099j10461M2316J5840
6725B990j8166N6755p7416N5148q2474o3737J2397J22570Q7659R5790L6705p0970
$$ y = [-280845, -190369, 68758, 214484, 266100, 288813, 193793, 161101, 176005, 209879, 241396, 170091, 139540, 52300, -77590, -55710, -116241, -130874, 17842, 169712, 236416, 117289, -69968, -90897, -138967, -172533, -78860, 32373, -31106, -4710, 67370, -31889, -110279, 13311, 95341, 27985, -28462, 47969, 44857, -99758, -170672, -173911, -230466, -209039, -168417, -215168, -125190, -88972, 80560, 55051, -46462, -6560, -1053, 10427, -122990, -108507, -4215, 48274, 141421, 223563, 185969, 85792, -10860, 32667, -26176, 40162, -35144, -146446, -136175, -45634, -132309, -228457, -243832, -132899, -113434, -59804, 55295, -55166, -12850, 2990, -15176, 41579, -35837, 19311, -63163, -126900, -114503, 8067, 95726, 191516, 228221, 157251]
6713A57251j05914p3311j03486L4953J0825M0882N8275K9197o6198J09167J02490
6702A94131O5149m4931j17781j16639q8152J73649P6249O8593K24679R7129k68968
6691B63108j22636j82115k12479P5467P6278l3332k0421L2244M6368K858n3559
6680a28219M3266J29723K5716M3849O5182k01094o2661Q3054J8113q8142P6851
6669E638q7253j38422l9903n720o742J32707J73580K9072k39590l9339P0547n6888
6657b02313R4926K76383K106r6309o1491K0762j2793r2625o1136N7219J166n4239
6645a28344K0118n2160r2865J50855q11k6741Q7580K9062j7809p764m7533P9721
6633f691K48754J13743n6010k5140o645r8588J1080L5262k0086j11049r3791r9848
$$ y = [157251, 51337, -21974, -125460, -90507, -79682, -38800, 19475, 48672, -17526, 91641, 194131, 259280, 214349, 96568, -20071, -108223, 65426, 141675, 210268, 434947, 532076, 263108, 140472, -41643, -254122, -178655, -102377, -135709, -156130, -123886, -77518, -74660, -128219, -84953, 44770, 70486, 114335, 179517, -21577, -84238, -1184, 16929, -71213, 5638, -81615, -220037, -259940, -265660, -272402, -139695, 33885, 62957, -176633, -215972, -145425, -202313, -107387, 168996, 171102, 74793, 13302, 34064, 21271, -71354, -132490, -75271, -74105, -128344, -108226, -160386, -253251, -102396, -103207, -129948, -42368, -13306, -31115, -38879, -86412, -6691, 242063, 355806, 299796, 274656, 268011, 169423, 180503, 215765, 195679, 84630, -9161, -109009]
6621a09009r098J33711l3566m6515K632o896j42159j9558P4766P8577L1677j31965
6609a77403j04934j24457m2538J39252Q1098K4178J02542j9259Q2883J00865k39577
6598a77350j18598K31563Q7988k05082j05966M216R8256j16520J45387J54444
6588a662k02854o7703O7811K6935k29527K32704K15272p5508J2119K5786n571
6577b198r3364m2906o5107q2863j4744L9768j6594Q3373j8605j1573R2604J66148
6565C3939p6876j03894J57766Q0589K09553P19n2548N2011K3836r4074j51802
6554G9219p4326j28861j23459j04580M3655J36646j6070p2889L382K07326J50725
6543A00768N1978l7986j13253R2648o7186r9205n1015J01942J29409M6023j73356
$$ y = [-109009, -118107, 15604, -17962, -64477, -61845, -68741, -210900, -230458, -155692, -77115, -45438, -177403, -282337, -406794, -449332, -310080, -228982, -204804, -102262, -121521, -38638, 62227, -177350, -295948, -64385, 23603, -181479, -287445, -283229, -184973, -301493, -156106, -1662, -204516, -272219, -204408, -177473, -407000, -174296, 40976, -34532, -22413, 3373, -2198, -95562, -138468, -203575, -286438, -301182, -261414, -278008, -194635, -213240, -224813, -132209, 33939, -42937, -146831, 10935, 91524, 301077, 301796, 249248, 301259, 325095, 231021, 79219, 4893, -123968, -247427, -352007, -308352, -171706, -187776, -260665, -257283, -49957, 100768, 152746, 114760, 1507, 94155, 26969, -72236, -123251, -21309, 108100, 154123, -19233]
6532a9233j12368o8165j8310k4391j1784K41924o9275M5962m538L0661j25114
6521a34631Q9240P5388O2347j1336o4564m3679n7952j7690R9954r1683k7826K9845
6509i2587Q6986N8559p5939L9440O9928m1468m6233N1069L2939j20516k07q6205
6497a24234P4027j51428j23904P751O5544K66324j0773o7780j3232J07174r2273
6486f2804n4711o3857M9121p4468j15748J99060L29882J01572p4826p1546M1510
6475B03185j35051j10393j44537k5674Q4316k7729o7798J35242L5267J44256m380
6464H6704n9507j00431P5019j0845O4826p1836n7258o4819k33111Q7711K35253
6453d8294j10943j0019Q5650J99407q0827O3825J40157J8556l3912o2975j11268
$$ y = [-19233, -131601, -199766, -218076, -242467, -254251, -12327, -81602, -35640, -40178, -9517, -134631, -45391, 29997, 92344, 81008, 16444, -27235, -85187, -102877, -2923, -94606, -122432, -92587, -5601, 52958, -22981, 16459, 86387, 44919, -1314, 49755, 82694, -37822, -38029, -124234, -50207, -201635, -325539, -317788, -252244, 14080, 3307, -64473, -77705, 29469, -62804, -117515, -181372, -132251, -206719, -322467, -123407, 206475, 308047, 233221, 161675, 203185, 68134, -42259, -186796, -212470, -128154, -155883, -223681, -88439, -53172, 91084, 86704, 27197, -73234, 1785, -9060, 55766, -16070, -73328, -138147, -371258, -283547, -48294, -159237, -169256, -83606, 115801, 34974, 98799, 238956, 257512, 223600, 160625, 49357]
6442D9357j6213J23755k2316N7899j31043j05151o2441R5367j07737p6373K86900
6431I2004O447k06711n2457M8358L0074P1011P3980O9713j92858n3678Q9055J14531
6419H9469Q2573N4126q1105k02020P5064J05937n0447q916R21m3314P596j28130
6407i8246m8629p4647M6196N2851J6085J83979R4267L9033l4617j37636r8354
6396e9718o2959O1950J29141m8017L5182O2903q1634o1788K02451J7610r5664
6385I9457m8192P4764p705j59605j43815n2667J72730J09627m7792m0624J6981
6374b6841N060j21291m5801J5384R0478Q4595P7671j63560p2662K6412r8585j04999
6362c34139J54778J51990K29378N9286j13544k57912L9500Q4819M6012O4748k4866
$$ y = [49357, 33144, 156899, 134583, 192482, 61439, -43712, -106153, -10786, -118523, -194896, 92004, 98451, -108260, -160717, -112359, -82285, -11274, 62706, 132419, -60439, -114117, -25062, 89469, 172042, 226168, 145063, -56957, 18107, 124044, 73597, 64681, 65602, 22288, 29884, -98246, -146875, -221522, -175326, -122475, -106390, 77589, 171856, 210889, 176272, 38636, -59718, -122677, -60727, 68414, 20397, 55579, 118482, 36848, -24940, 177511, 195121, 99457, 51265, 126029, 118324, -41281, -185096, -237763, -65033, 44594, -3198, -43822, -26841, -21781, -143072, -188873, -173489, -83011, 1584, 79255, -84305, -156967, -130555, -229140, -334139, -179361, -27371, 202007, 261293, 147749, -110163, -70663, 14156, 60168, 124916, 100050]
6351A00050k28135p8211M198J00506J38934P3019k37995K7367Q6005q1890p0849
6340a67001j16959L1577J92590K45266L104J03607l4440O4659K3528q4264k22052
6329C9615j64222k3576N4171R6036L7212K248o2188n4153J15736O9380R0114k10860
6317a0487P0182J95905q7960k3349l9608j05700j2283P7651l5903J59208Q1370
6306B69026m8944j23709r4654M1275K9018n0700j05898n6727n418Q1888P1241
6295F398J43630J47739n236k9665j2381Q639j07842j27966n9148N9705K1992K9238
6283G5103j17814L8902P2531N0790O2866k7635p1291j57505r0599P7204R3981
6272F533j16308r5037j16182J7957j2806J49547N0269J15741N9915o5532J5824
$$ y = [100050, -128085, -206296, -202098, -101592, 37342, 110361, -127634, -100267, -14262, -96152, -167001, -283960, -252383, -59793, 185473, 188577, 292184, 257744, 322403, 345931, 261667, 39615, -124607, -148183, -94012, 2024, 39236, 41484, -20704, -74857, 40879, 110259, 200373, -10487, 59695, 255600, 167640, 144291, 104683, -1017, -13300, 64351, 28448, 187656, 269026, 220082, 96373, 1719, 42994, 72012, 21312, -84586, -141313, -146731, -64843, 6398, 150028, 297767, 292531, 262866, 250485, 259124, 151282, 23316, -35832, 23873, 45865, 75103, -42711, -3809, 68722, 119512, 182378, 154743, 83452, -74053, -164652, -87448, 6533, -109775, -204812, -320994, -303037, -315843, -166296, -116027, -286, 59629, -5903, 9921]
6261I921o7917j25248R477M4250O6677j1633J77432M712r8326L7438K9216p1059
6249D940j04655k5459J39472J41514o4275j78753m1271Q6846j12936J2350K10987
6238F8760M0911n233j41380j35476O9684N254l6290J75170k8894M4326n6653j04237
6226a04058J1681K0707R156k4188J68490L7562j41192j1299M8789K0961j67561
6215a30952N8922K8467j62619l2480J26332p4540L5689j8635j14513J24905M3390
6204a16034J00004j4304j42119J09593L36879j6552k64368j07368n1373k54465
6194d20107l8857J74813J10733k7837J9994k784o7661j16885o9379N7302J09457
6183b71211p7052K15758J2276N0740R8220m3214K2277j21847J3495k5697J365
$$ y = [9921, -57996, -183244, -173767, -129517, -62840, -74473, 102959, 107671, 9345, 46783, 75999, 4940, -99715, -125174, 14298, 155812, 91537, -87216, -128487, -41641, -154577, -142227, 68760, 109671, 104438, -36942, -172418, -102734, -97480, -133770, 41400, 12506, 56832, 179, -104058, -92377, -71670, -62514, -86702, 81788, 119350, -21842, -33141, 15648, 36609, -130952, -72030, -43563, -206182, -238662, -112330, -186870, -151181, -169816, -284329, -159424, -116034, -16030, -30334, -172453, -62860, 274019, 257467, -6901, -114269, -165642, -420107, -458964, -284151, -173418, -201255, -181261, -184045, -251706, -368591, -437970, -380668, -271211, -348263, -132505, -120229, -69489, 28731, -14483, 7794, -114053, -100558, -126255, -124890]
6172a24890j14224q2003L2096K41633P2244Q970j0794j52815m591J32643M9919
6161D8188R2583O1368o2029q1700p4746O4465j89846q1114k1642J01230M1502
6150a01741K2566L9567J89850p527k7559O7189j29713r0591o2253l4889j04087
6139b39188P2110J51335O275o977R1728m2180M5395N4503r8724j26959o7575k6264
6127a86521J83647o6928L7274J58662P99j36229M128Q2834r8627J06114L674p0743
6115A8084k14298N9271O2023Q7569k7534q8328o8251L3852j0743m1145J2149R8413
6103g8938M1422n9618K0728j00548O0393L8041M4144L6148j02077O5113J32653
6092I7461K7888r5357J2116m8748J9385n5759j12095k1649m0445J3285m5603J17900
$$ y = [-124890, -239114, -321117, -289021, -47388, 24856, 33826, 23032, -129783, -134374, -1731, 48188, 140771, 202139, 140110, 58410, -16336, 48129, -141717, -222831, -244473, -143243, -101741, -79175, -39608, 150242, 142715, 115156, 182345, 52632, -37959, -100212, -135101, -239188, -167078, -15743, -9468, -16445, 75283, 33103, 78498, 133001, 34277, -92682, -160257, -186521, -2874, -69802, -32528, 126134, 126933, -9296, -5168, 77666, -20961, 85153, 88827, 18084, -196214, -136943, -74920, 12649, -14885, -103213, -171464, -137612, -148355, -189500, -177351, -78938, -37516, -97134, -76406, -176954, -116561, -78520, -34376, 1772, -100305, -35192, 97461, 125349, 29992, 42108, -6640, 12745, -43014, -155109, -176758, -217203, -203918, -249521, -131621]
6080a31621K09593m4524j10496l6970p1292j82441L3913J43845o2803k95162q986
6069e56944K28496K57867j50162M9892J54876R6396J3323p1247q0647J9570m581
6058d3161n5836n570N5228m484j26581R488O8250r6527q6435J88923J51809R1174
6046A46278j32914j62512R7018M14P4307j4700j60624j87666o7448J66088K582
6035b39177j73455J55202J42548M0389R4632j28775j37865O0930R615q3116r1316
6024c50388N0476J32147P2984P7007k0916k2795R8351K442J36199L8360P1317
6013B85184J44370p3596j53862k3j59239k87522j60965J21552J80041K03995Q6591
6002A86526q5232j05557q8346o1360J75136L7080k4751q1579Q1220p5830K27O0475
$$ y = [-131621, 77972, 33448, -77048, -114018, -185310, -367751, -333838, -189993, -252796, -547958, -556944, -328448, -70581, -220743, -170851, -15975, 80421, 93744, 22497, -58150, -38580, -43161, -98997, -104567, -49339, -53823, -180404, -170916, -102666, -199193, -285628, -96705, 55104, 146278, 13364, -149148, -52130, -51716, 22591, 7891, -152733, -340399, -407847, -241759, -239177, -412632, -257430, -114882, -74493, 20139, -108636, -246501, -185571, -175956, -259072, -350388, -299912, -167765, -94781, -17774, -38690, -61485, 36866, 39308, 175507, 213867, 285184, 429554, 355958, 202096, 202073, 42834, -244688, -405653, -284101, -104060, 99935, 186526, 101294, -4263, -92609, -153969, 21167, 58247, 33496, -48083, 33137, -42693, -42466, 18009]
5990A8009l5479o8762O4442r947l4536k1039N460m4800j02421k4207J54102J51288
5978E2110R0626j1745o2831N6642m3516K3296O0823O2713n3174l1947Q6985j01593
5966A28389j02588Q8155J50815N519p7619o1503q5542p0994m0377Q8379J73746
5955A96380j02760k54618l8742m4340j02064k19092k2651K60089J1865J14607
5945b01326J37728K2414N3823M7534O9228L4753j35491Q8148j8025k4475p3322
5934I89N8817K73850O7504k83908j88922P0330o1513j35024r0262J17548J11352
5923e9239J33236J20735P7034l3557k92883j39413j1452K48386R4926j10375j51753
5912a24355N267N8694L7878j17185j17670M2229N6570J34876J45180N5612r631
$$ y = [18009, -17470, -86232, -21790, -31737, -66273, -87312, -81852, -126652, -229073, -253280, -99178, 52110, 142736, 130991, 68160, 124802, 81286, 104582, 165405, 228118, 174944, 142997, 229982, 128389, 25801, 113956, 264771, 270290, 192671, 131168, 45626, -25368, -65745, 22634, 196380, 93620, -160998, -199740, -244080, -346144, -565236, -587887, -327798, -315933, -201326, -63598, -41184, 12639, 60173, 129401, 164154, 28663, 116811, 98786, 74311, 989, 59806, 333656, 401160, 117252, -71670, -1340, -62853, -197877, -288139, -170591, -59239, 73997, 194732, 271766, 238209, -54674, -194087, -205539, 42847, 137773, 27398, -124355, -119088, -60394, -22516, -139701, -257371, -215142, -158572, -23696, 121484, 177096, 167465]
5901A67465n8761J06326M4734j15200l5363j88290n8575N390k5312P6657L1882
5890d9047L666J06029R1063j06353L9899K5444j43142j57683O7168M2421n663
5879h6198Q9812L5499O1161r4594m8487k1783J00607K5918l5393j08442j53698
5868b35598M4677L7881n0613R0557K21002m8119p6166o6695p3998J01082l3722
5857h9712Q6002Q0758q0657Q43P8228O1122o2871N0610o7080m6592N4493J62420
5845B27564m4400m7706n4083n7540j6336L9635l0937k1969J43529L1088o9490
5834I9355L5859K4099K4687p017l7568K2883m0166P2661j32675k95031J7909K00241
5822a4763K2195J34422j57173j94181O3240J19217m4283R69Q3684O7426P7844
$$ y = [167465, 108704, 215030, 259764, 144564, 109201, -79089, -137664, -132274, -157586, -80929, -49047, -45381, 60648, 151711, 45358, 85257, 110701, -32441, -190124, -122956, -80535, -86198, 3614, 39113, 100274, 5680, -42807, -64590, 36017, 61935, 26542, -81900, -235598, -190921, -153040, -203653, -113096, 107906, 59787, -16379, -83074, -157072, -55990, -89712, -3710, 77048, -3609, -2766, 75462, 136584, 73713, 124323, 57243, 10651, 65144, 227564, 183164, 135458, 81375, 23835, 7499, 47134, 16197, -5772, 137757, 168845, 99355, 135214, 159313, 184000, 176983, 139415, 162298, 122132, 194793, 62118, -232913, -215004, -14763, 7432, 141854, -15319, -209500, -146260, -27043, -71326, -70357, 13327, 80753, 158597]
5811A58597m9042m3886j7975P7016J55458k3396j25479j88766k87562K7425J25013
5800a92597J33054R0880J8076m6329q1322o1739J4503J07961J32645p2160j10755
5789f7783R4847O7245L9717O1542q3575j2525J20114j34993j25683J8606l8774
5778f1262p599k8503R8208J36927k5140k02853J04582o772n4162l6194Q8821N786
5766A1839J9142m036j17585M5922l498n0343M7270N5355j0546l8401J13803m6639
5754B2283j3121N3844p2820j8476n4610p2294K6316O7118J4696J3020J26489J28837
5742B21282N9056o4750j38849j2830j27637k14832j76512J8468L2811Q3035J272
5731c19486M4942J59094J04805M7824o8936K2962K2259n9275k7405J6432M0848
$$ y = [158597, 109555, 65669, 47694, 124710, 280168, 256772, 131293, -57473, -345035, -317610, -192597, -59543, 31337, 49413, 3084, -78238, -139977, -125474, -17513, 115132, 42972, -67783, 27064, 94309, 134026, 195568, 111993, 99468, 219582, 84589, -41094, -22488, -61262, -68861, -97364, 844, 137771, 112631, -90222, 14360, 7588, -46574, -82768, 6053, 11839, 30981, 26945, -90640, -44718, -48216, -98559, -51289, 4066, -6480, -44881, 68922, 22283, 9162, 63006, -9814, -28290, -82900, -155194, -128878, -61760, -47064, -34044, 92445, 221282, 280338, 215588, 76739, 63909, -63728, -278560, -455072, -436604, -403793, -320758, -319486, -274544, -115450, -10645, 37179, -31757, -8795, 13464, -45811, -73216, -56784, -15936]
5720a5936l003N8660O6514l0796J9872k20408p0293r4024M3790M1768K413J64641
5708c6802J93972j0431j31935J85073l0741K549j34434J881Q802M5808q7110J62353
5696A68985j04908j06364Q7690P6782q7256j38434K0317j7829K8293J2133l9274
5685i9865K5765j87418J28275Q271r0840k649J68859Q5561j20573L5396J21041
5674G1823Q5380q0679n3080j60799j24905j74272Q5067K20634L9983J7419O0690
5663a2739J06911o2199Q0759j24004j86499O3295J04035L8805j0136J06852o4771
5652D0309j65889M5944Q8433K266r4902N2308M9308l7061j51213J55059P6106
5641F0668j6931j14932J1263j31110j37293O4623J45836J38225R3784k1010l4687
$$ y = [-15936, -18939, 39721, 106235, 75439, 95311, -125097, -195390, -289414, -245624, -203856, -201443, -36802, 157170, 146739, 14804, 199877, 169136, 171685, 37251, 39132, 47934, 93742, 6632, 168985, 64077, -42287, 45403, 122185, 34929, -103505, -83188, -101017, -72724, -60591, -99865, -74100, -261518, -133243, -124972, -215812, -218461, -49602, 35959, -84614, -49218, 71823, 157203, 76524, 23444, -137355, -262260, -436532, -351465, -130831, -90848, -73429, -12739, 94172, 31973, 112732, -11272, -197771, -134476, -30441, 8364, -1772, 105080, 40309, -125580, -79636, 8797, 11063, -83839, -31531, 17777, -19284, -170497, -15438, 60668, 43737, -71195, -59932, -191042, -328335, -263712, -117876, 20349, 114133, 93123, 58436]
5630E8436N6895K1605k0528M928k5847k06457N650J49287K472j00219M8804k0500
5618b5474l7490O7576J04575r9831j25600j8889O8544K6244j9180m5492J55306
5607E0289l7258p1756j12647o2940r7958J50148N0158M4309K05061J68635l4406
5596B51635j64728k1499o3248q6907N2600Q0572P5775J3287j31580j85922J78728
5585a287R6941j18232j42417M9424J41496M8191k44362l7080Q8592K68643J8171
5574A68080l9879q4605P1887m7448N6101N5985j32626j92273j36047J8308R2352
5563a70165K04744J64037p7968k32638j09553P8470K71082J30574j79606j18350
5553c9373M9176Q1259P9489J4697k62958J0564M536J31983P576P38P1031j39575
$$ y = [58436, 115331, 136936, 116408, 121336, 95489, -110968, -105318, 43969, 46441, -53778, -4974, -25474, -62964, 4612, 109187, 9356, -116244, -135133, -66589, -40345, -59525, -105017, 50289, 13031, -58725, -171372, -234312, -332270, -182122, -131964, -87655, 117406, 286041, 251635, 86907, 65408, 2160, -84747, -32147, 48425, 124200, 137487, 5907, -180015, -1287, 95654, -22578, -164995, -115571, 25925, 74116, -170246, -207326, -118734, 149909, 168080, 128201, 43596, 115483, 68035, 124136, 180121, 47495, -144778, -280825, -262517, -170165, 34579, 198616, 120648, -111990, -221543, -143073, 128009, 258583, 78977, -39373, 9803, 91062, 170551, 185248, -77710, -67146, -62610, 69373, 76949, 77687, 148718, 9143]
5541I143j83106N2690k5897Q2584J15744o4009n0295j75884J24534m6492N8919
5530a02069J28940j74497k15989K00097j7126j1207K7749R2419p6304O1485J67079
5519H0577K1380q932j57210q9317j0611K09678L8907l7308j20251M1547l24k0032
5507e1896M3482m7991J4406P0764m7384K0605L3166j75009L347J89615J08601
5496A61706r8314K412o2413j03446j06143M2174P4265L9142J83263K0289j24083
5485B8852p8291R0618Q6782k3453q5675J35376J08320j35827j45123j26495M3865
5474a01051M4287K9633J22597k10114j66151j7398N6913j31934L3980R5718O880
5463b36640J41051J08313Q610p418j25697j03251j269K7160J25599p1296J7558
$$ y = [9143, -173963, -121273, -147170, -64586, 51158, -12851, -63146, -239030, -114496, -160988, -102069, 26871, -147626, -363615, -163518, -180644, -191851, -164102, -71683, -147987, -86502, 80577, 101957, 93025, -64185, -153502, -164113, 45565, 84472, 47164, -73087, -31540, -31864, -51896, -8414, -56405, -41999, 28765, -18619, 1986, 35152, -139857, -136510, 53105, 161706, 63392, 65804, 3391, -100055, -206198, -164024, -89759, -50617, 132646, 152935, 28852, -49439, 41179, 127961, 104508, 18833, 154209, 262529, 126702, -18421, -144916, -101051, -56764, -27131, 95466, -114648, -280799, -298197, -241284, -373218, -339238, -243520, -236640, -95589, 12724, 21334, 13916, -111781, -215032, -216301, -189141, -63542, -134838, -117280]
5452a17280P7122J3050r812j55647J7783K2933n4291N0699L0733r0762r5943J28827
5440a82588J09486J11657P1125L447o6323j35111j28762O5425J45198J2972k7603
5429b1077j26166q7594J15097J45432l0497R8096j59950o22J74001J8192J7598
5418A42510j15869p7467J35827P9958n2978l3576n2480J57805K07268m3592o8630
5407B78776l3495o6581K8342j1509m1167j17334o3445j1819j1881m221K8492L7369
5395A1527l2781k9926L8870l0193n2881J41948N5173k8146J7059J8486L9865L9883
5383A88884m1515n7912j75919m2005M9714J62753O9706j85215J9464R0000p8837
5372h82j13995P8149P8734L367j28555p0458Q693q6185l7105j6841O1256J24444
$$ y = [-117280, -40158, -27108, -36920, -192567, -174784, -151851, -206142, -155443, -124710, -215472, -311415, -182588, -73102, 38555, 109680, 113127, 46804, -88307, -217069, -151644, -6446, 6526, -21077, -147243, -234837, -119740, 25692, -4805, 93291, -66659, -67281, 106720, 124912, 142510, 26641, -50826, 85001, 164959, 111981, 78405, 25925, 183730, 390998, 347406, 278776, 245281, 178700, 207042, 195533, 154366, 37032, -26413, -38232, -50113, -54334, -25842, 11527, -21254, -51180, -12310, -42503, -95384, 46564, 101737, 73591, 90650, 109136, 149001, 188884, 147369, 89457, -86462, -128467, -78753, 84000, 153706, -31509, -12045, 77955, -882, -114877, -36728, 42006, 45373, -83182, -153640, -144947, -231132, -268237, -285078, -223822, -99378]
5360i9378P8944o5347M1765j00174j16455j9040M043o1188O4444K7342k2410k2439
5348b89893m851J87646P0715m9889R9708o9275j06458L8642J23524j63898p6190
5337b40219R7197L4930N0008l400L110q4813p3593j0202R0670J83907Q9279J0307
5325A47181n1130r4074l1192r0869J12917n8497J20242M3778o3989L9288j63376
5314h9721o0906O4365l075O1212m3901J30912M0088J4426K769M5024j41988j9269
5302f4Q0684M5726n2285p3967K9772K1953j00730J14061K24838k943k44750j91930
5290a49635k0202K98901R0508j76663l3673j7758M4291k09863j93265N5107J55684
5279a56568N4572P2788n6626n7137j05682p4857K26985K13271o3768p642j02362
$$ y = [-99378, -20434, -85781, -44016, -144190, -260645, -279685, -275642, -336830, -272386, -245044, -267454, -289893, -294744, -107098, -36383, -86272, 13436, -55839, -162297, -123655, -131, -164029, -240219, -143022, -108092, -58084, -61484, -58374, -143187, -216780, -226982, -136312, 47595, 136874, 147181, 96051, 1977, -29215, -120084, -7167, -65664, 54578, 98356, 34367, 73655, -89721, -150627, -86262, -89337, -28125, -72026, 58886, 98974, 113400, 116169, 161193, 19205, -64, 80620, 126346, 74061, 94, 29866, 51819, -48911, 65150, 289988, 287045, 42295, -149635, -169837, 129064, 219572, 42909, 9236, -8522, 35769, -174094, -367359, -312252, -156568, -101996, -29208, -85834, -142971, -248653, -323510, -96525, 116746, 52978, 45336, -57026]
5268e7026K2340K0580K7885m0908o7541M662Q13k14573l4002N7038J05347J48872
5256b6513n2840j49996P444Q1014J08668K7484j3678j80066L8460R7765J64664
5245A02406K9998J99403p6882k19595j0258n4230M2488L1194K8171O1450R415
$$ y = [-57026, -34686, -14106, 13779, -27129, -94670, -90008, -89195, -303768, -337770, -280732, -175385, -26513, -79353, -229349, -221905, -140891, -32223, -4739, -18417, -198483, -160023, -62258, 102406, 132404, 331807, 254925, 35330, 25072, -29158, 13330, 44524, 72695, 134145, 143560]
$$ [...]
##END NTUPLES=NMR SPECTRUM
##END=
