##TITLE=Analysis number 329320
Compound Code cc 53006
Book Reference 407/171/2
Project Code adrs
Chemist Name andyw
##JCAMPDX= 6.0         $$ Bruker NMR JCAMP-DX V2.0
##DATA TYPE= NMR SPECTRUM
##DATA CLASS= NTUPLES
##ORIGIN= Bruker BioSpin GmbH
##OWNER= nmr
$$ XWIN-NMR		Version 3.5
$$ Tue Aug 21 09:10:24 2007 GMT Daylight Time (UT+1h)  MAYBRIDGE\nmr@NMR_250MHZ
##.OBSERVE FREQUENCY= 250.131544655141
##.OBSERVE NUCLEUS= ^1H
##.ACQUISITION MODE= SIMULTANEOUS (DQD)
##.ACQUISITION SCHEME= undefined
##.AVERAGES= 16
##.DIGITISER RES= 18
##SPECTROMETER/DATA SYSTEM= dpx250
##.PULSE SEQUENCE= zg30
##.SOLVENT NAME= CDCl3
##.SHIFT REFERENCE= (INTERNAL, CDCl3, 0, 16.522)
##AUDIT TRAIL= $$ (NUMBER, WHEN, WHO, WHERE, WHAT)
$$ ##TITLE= Audit trail, XWIN-NMR		Version 3.5
$$ ##JCAMPDX= 5.01
$$ ##ORIGIN= Bruker BioSpin GmbH
$$ ##OWNER= nmr
$$ C:\u/data/dgb/nmr/ADRS/950/pdata/1/auditp.txt
$$ ##AUDIT TRAIL=  $$ (NUMBER, WHEN, WHO, WHERE, WHAT)
(   1,<2007-08-21 09:09:07.71 +100>,<MAYBRIDGE\nmr>,<NMR_250MHZ>,
      <created by zg, POWCHK disabled, PULCHK disabled
       configuration hash MD5:
       76 6E 9A 78 1E 09 19 81 EC 84 63 8F B0 6A 59 2D
       data hash MD5: 64K
       DC A1 EF A8 FD CE 75 55 47 C1 70 0D 69 B6 7E BF>)
(   2,<2007-08-21 09:09:34.78 +100>,<MAYBRIDGE\nmr>,<NMR_250MHZ>,
      <Start of raw data processing
       ef LB = 0.3 FT_mod = 6 PKNL = 1 SI = 32K 
       data hash MD5: 32K
       83 EA 48 66 77 6C D4 12 E0 F8 A8 0D E8 59 A4 40>)
(   3,<2007-08-21 09:09:40.38 +100>,<MAYBRIDGE\nmr>,<NMR_250MHZ>,
      <apk 
       data hash MD5: 32K
       4E 74 33 90 A5 0B FC 07 BD 7D E5 6A 83 45 40 95>)
(   4,<2007-08-21 09:09:45.71 +100>,<MAYBRIDGE\nmr>,<NMR_250MHZ>,
      <abs ABSG = 5 
       data hash MD5: 32K
       40 7A 02 AB A4 2B 3F 71 56 AF A6 EB 65 47 32 11>)
$$ ##END=
$$ 
$$ hash MD5
$$ 08 B4 B2 8B 2C 3A 45 C9 3C 83 B3 E0 17 52 14 3E
##$RELAX= 
##$RELAX= 
##$RELAX= 
##$RELAX= 
##$RELAX= 
##$RELAX= 
##$RELAX= 
$$ Bruker specific parameters
$$ --------------------------
##$DU= <C:\u>
##$EXPNO= 950
##$NAME= <ADRS>
##$PROCNO= 1
##$TYPE= <nmr>
##$USER= <dgb>
##$AMP= (0..31)
100 100 100 100 100 100 100 100 100 100 100 100 100 100 100 100 100 100 
100 100 100 100 100 100 100 100 100 100 100 100 100 100 
##$AQSEQ= 0
##$AQ_mod= 3
##$AUNM= <au_zg>
##$AUTOPOS= <1 >
##$BF1= 250.13
##$BF2= 250.13
##$BF3= 250.13
##$BF4= 250.13
##$BF5= 500.13
##$BF6= 500.13
##$BF7= 500.13
##$BF8= 500.13
##$BYTORDA= 1
##$CFDGTYP= 0
##$CFRGTYP= 5
##$CHEMSTR= <none>
##$CNST= (0..31)
1 1 145 1 1 1 1 1 1 1 1 1 1 1 1 1 1 1 1 1 1 1 1 1 1 1 1 1 1 1 1 1 
##$CPDPRG= <>
##$CPDPRG1= <>
##$CPDPRG2= <>
##$CPDPRG3= <>
##$CPDPRG4= <mlev>
##$CPDPRG5= <mlev>
##$CPDPRG6= <mlev>
##$CPDPRG7= <mlev>
##$CPDPRG8= <mlev>
##$CPDPRGB= <>
##$CPDPRGT= <>
##$D= (0..31)
0 1 0 0 0 0 0 0 0 0.06 0 0 0 0 0 0 0.0002 0 0 0 0 0 0 0 0 0 0 0 0 0 0 
0 
##$DATE= 1187683744
##$DBL= (0..7)
120 120 120 120 120 120 120 120 
##$DBP= (0..7)
150 150 150 150 150 150 150 150 
##$DBP07= 0
##$DBPNAM0= <>
##$DBPNAM1= <>
$$ [...]
##$SUBNAM7= <"">
##$SUBNAM8= <"">
##$SUBNAM9= <"">
##$SW= 20.6930455092707
##$SWIBOX= (0..15)
0 0 3 0 0 0 0 0 0 0 0 0 0 0 0 0 
##$SW_h= 5175.983436853
##$TD= 65536
##$TD0= 1
##$TE= 295.16
##$TE2= 300
##$TE3= 300
##$TEG= 300
##$TL= (0..7)
0 120 120 120 120 120 120 120 
##$TP= (0..7)
150 150 150 150 150 150 150 150 
##$TP07= 0
##$TPNAME0= <>
##$TPNAME1= <>
##$TPNAME2= <>
##$TPNAME3= <>
##$TPNAME4= <>
##$TPNAME5= <>
##$TPNAME6= <>
##$TPNAME7= <>
##$TPOAL= (0..7)
0.5 0.5 0.5 0.5 0.5 0.5 0.5 0.5 
##$TPOFFS= (0..7)
0 0 0 0 0 0 0 0 
##$TUNHIN= 0
##$TUNHOUT= 0
##$TUNXOUT= 0
##$USERA1= <user>
##$USERA2= <user>
##$USERA3= <user>
##$USERA4= <user>
##$USERA5= <user>
##$V9= 5
##$VALIST= <valist>
##$VCLIST= <CCCCCCCCCCCCCCC>
##$VD= 0
##$VDLIST= <DDDDDDDDDDDDDDD>
##$VPLIST= <PPPPPPPPPPPPPPP>
##$VTLIST= <TTTTTTTTTTTTTTT>
##$WBST= 1024
##$WBSW= 4
##$XGAIN= (0..3)
0 0 0 0 
##$XL= 0
##$YL= 0
##$YMAX_a= 273392
##$YMIN_a= -164183
##$ZGOPTNS= <>
##$ZL1= 120
##$ZL2= 120
##$ZL3= 120
##$ZL4= 120
##$ABSF1= 16.522
##$ABSF2= -4.171173
##$ABSG= 5
##$ABSL= 3
##$ALPHA= 0
##$AQORDER= 0
##$ASSFAC= 0
##$ASSFACI= 0
##$ASSFACX= 0
##$ASSWID= 0
##$AUNMP= <proc_1d>
##$AZFE= 0.1
##$AZFW= 0.1
##$BCFW= 0
##$BC_mod= 0
##$BYTORDP= 0
##$COROFFS= 0
##$CY= 12.5
##$DATMOD= 1
##$DC= 0
##$DFILT= <>
##$DTYPP= 0
##$F1P= 14.0000005364418
##$F2P= -0.99999901652339
##$FCOR= 0.5
##$FTSIZE= 32768
##$FT_mod= 6
##$GAMMA= 0
##$GB= 0
##$INTBC= 1
##$INTSCL= 1
##$ISEN= 128
##$LB= 0.3
##$LEV0= 0
##$LPBIN= 0
##$MAXI= 10000
##$MC2= 0
##$MEAN= 0
##$ME_mod= 0
##$MI= 0
##$NCOEF= 0
##$NC_proc= -5
##$NLEV= 6
##$NOISF1= 0
##$NOISF2= 0
##$NSP= 0
##$NTH_PI= 0
##$NZP= 0
##$OFFSET= 16.522
##$PC= 1
##$PHC0= -30.44776
##$PHC1= -1.152256
##$PH_mod= 1
##$PKNL= yes
##$PPARMOD= 0
##$PSCAL= 4
##$PSIGN= 0
##$REVERSE= no
##$SF= 250.13
##$SI= 32768
##$SIGF1= 0
##$SIGF2= 0
##$SINO= 400
##$SIOLD= 32768
##$SREGLST= <1H.CDCl3>
##$SSB= 0
##$STSI= 32768
##$STSR= 0
##$SW_p= 5175.98343685301
##$SYMM= 0
##$S_DEV= 0
##$TDeff= 65536
##$TDoff= 0
##$TI= <Analysis number 999999
Compound Code 99
Book Reference 9
Project Code 9>
##$TILT= no
##$TM1= 0
##$TM2= 0
##$TOPLEV= 0
##$USERP1= <user>
##$USERP2= <user>
##$USERP3= <user>
##$USERP4= <user>
##$USERP5= <user>
##$WDW= 1
##$XDIM= 32768
##$YMAX_p= 522641966
##$YMIN_p= -1057082
$$ End of Bruker specific parameters
$$ ---------------------------------
##NTUPLES= NMR SPECTRUM
##VAR_NAME=  FREQUENCY,     SPECTRUM/REAL,   SPECTRUM/IMAG
##SYMBOL=    X,             R,               I
##VAR_TYPE=  INDEPENDENT,   DEPENDENT,       DEPENDENT
##VAR_FORM=  AFFN,          ASDF,            ASDF
##VAR_DIM=   32768,         32768,           32768
##UNITS=     HZ,            ARBITRARY UNITS, ARBITRARY UNITS
##FACTOR=    0.157963299565203, 1,           1
##FIRST=     4132.6476996994, 0,             0
##LAST=      -1043.33573715361, 0,           0
##MIN=       -1043.33573715361, -1057082,    0
##MAX=       4132.6476996994, 522641966,     0
$$ Real data points
##PAGE= N=1
##DATA TABLE= (X++(R..R)), XYDATA
$$ [...]
23133a50910r8425j76542J07614K68821J56477L9803q4912k2248R5869j3991j16953
23122D603l883Q9929k12099j03983M0741L60801r3389k51549K6824L0376L45210
23111B33581K2506j78115j12580K0090j22861j21236J21832K93644k04469j27260
23101a74868L6507j44994m5373J40128L2382J14278M0283J75839j06702j47133
23091g9653k80609k75412j06986J05784K19935J01686K10367J04637P0729m5923
23081B4555j6240J33417r7954k17451q663K38427o570q8148k2718j73045j48429
23070c82819M4702L66238J80985L6950J29016r9923j55330l3472Q8990J9440L3944
23059B28721k24708p6480l1731M9899J98280n2124j07807O1672R93k0529l4293
$$ plain form
23133 -150910 -249335 -425877 -318263 -49442 107035 146838 61926 39678 135547 121556 4603
23122 4603 720 90649 -121450 -225433 -184692 176109 82720 -168829 -142005 -111629 233581
23111 233581 256087 77972 -34608 -14518 -137379 -258615 -136783 156861 -47608 -174868
23101 -174868 -138361 -283355 -328728 -188600 -156218 -41940 -1657 174182 67480 -79653
23091 -79653 -360262 -635674 -742660 -636876 -416941 -315255 -104888 -251 70478 24555
23081 24555 8315 141732 43778 -173673 -182336 56091 49521 -38627 -61345 -234390 -382819
23070 -382819 -338117 28121 209106 246056 375072 275149 119819 86347 175337 194777 228721
23059 228721 4013 -72467 -104198 -54299 143981 91857 -15950 45722 46715 26186 -8107
23048h107l32371k45321K54288J90354k8969L4344J8038J85898N8399R066k4162
23037A11457l03697j21330N5960K04660J62636J38017Q1175j91470p7134J16480
23027A76754O2350K7442k71760l2047k5671K43180J33009j46248j06908r0245
23017c0144N0642M2352P4855L4341j33187O8055o0841O4134O2280n4247k60012
23006a41772k22629r5191P1591K47829J47679P0876N4450k52704j79284O4715
22996b34440o7918j32690J14005J86454P7799k0770J38273K16325j33736k3718
22986A19584q5843j75160P980J00095J72346J32054j3068j30582k6868J08719
22976B09257m4688N6544J56776j23091p4688Q4481j26210P4215O7285j62922j9965
$$ plain form
23048 -8107 -340478 -585799 -331511 -141157 -170126 -135782 -117744 68154 126553 135619 111457
23037 111457 -192240 -313570 -257610 -52950 109686 247703 328878 137408 60274 176754
23027 176754 239104 266546 -5214 -37261 -62932 180248 313257 167009 60101 -30144
23017 -30144 20498 62850 137705 172046 38859 106914 46073 110207 172487 118240 -141772
23006 -141772 -364401 -459592 -388001 -140172 7507 78383 132833 -119871 -299155 -234440
22996 -234440 -302358 -435048 -321043 -134589 -56790 -77560 60713 277038 143302 119584
22986 119584 33741 -141419 -133439 -33344 139002 271056 257988 127406 100538 209257
22976 209257 164569 221113 377889 254798 180110 264591 138381 212596 279881 116959 96994
22965I6994q8370j35909l25608J94390L14522J91059j66829l8949Q8195P2814
22955B02309m6445K5222p0227m902M288j24203O0412J15958M4787k97107k08729
22944b98637J78801K04589M2549j48716P8436R437k89224j68868N4647K67511
22934f9475Q6383n2866O272J13086J14191k19389l43969J67152J62100J74755
22924A38240P2855k27599k86973l8065J10742J13155L25716K00032j62638k86118
22914d0653j13121j8093M8656J9937k20009L0816j28307n9781J16519L31975P7782
22903D5721j31568K05642J26646K32475J1279l32243m4346J69801N5114r1795
22893B46726l1393L29085K93115k0909l79242j74537k3530K70207m9003k27776
$$ plain form
22965 96994 8624 -127285 -452893 -258503 56019 247078 80249 41300 129495 202309
22955 202309 155864 181086 110859 105957 110245 -13958 46454 162412 207199 -89908 -298637
22944 -298637 -119836 84753 127302 -21414 57022 66459 -222765 -391633 -336986 -69475
22934 -69475 16908 -35958 -29686 83400 197591 -21798 -365767 -198615 -36515 138240
22924 138240 211095 -16504 -303477 -341542 -230800 -117645 208071 408103 245465 -40653
22914 -40653 -153774 -171867 -123211 -103274 -323283 -292467 -420774 -480555 -364036 -32061 45721
22903 45721 -85847 119795 246441 478916 490195 157952 113606 283407 338521 246726
22893 246726 215333 544418 837533 816624 437382 262845 239315 509522 460519 232743
22883B32743j16316j09682l3862K5298p6078m3337J1751J71008J4089j66526r6301
22872a87213m9739k4463m8265l4851K48619R6495P6207K23048M9433o0254j32180
22861A56837J06632j0630M4159j86604q2550L8642L5291j6744j69520j71662r3280
22850c49429k9717K13451J154J01461J05857O265m0394m34074R31J17957J43505
22839a63033Q2016M7631J26148r8390k39869K58426p1494n7120J09770R1703L8112
22828A23900Q3343m9134j45702K30777J17170N948k72138j41435L5755J51406
22818A39890k40104k6495J6629p5353N8684l0162k1678J32520k1464L03559J34048
22807C70074k70983N7303m9961r6566k67555j41976K24325J00601J66585m9615
$$ plain form
22883 232743 116427 6745 -27117 -1819 -77897 -121234 -109483 61525 75614 -90912 -187213
22872 -187213 -236952 -261415 -309680 -344531 -95912 583 76790 299838 349271 289017 156837
22861 156837 263469 252839 296998 110394 27844 66486 101777 85033 -84487 -256149 -349429
22850 -349429 -379146 -165695 -164541 -63080 42777 49042 8648 -425426 -424495 -306538 -163033
22839 -163033 -81017 -33386 92762 -5628 -245497 12929 -58565 -115685 -5915 85788 123900
22828 123900 207243 158109 12407 243184 360354 366302 94164 -47271 -11516 139890
22818 139890 -100214 -126709 -110080 -185433 -126749 -156911 -178589 -46069 -67533 236026 370074
22807 370074 99091 156394 106433 9867 -257688 -399664 -175339 -74738 91847 42232
22797D2232R0036L45824q5766j63960j11822r5508j5376N5747j71006j76587J981
22786b84205J33161j31075p9747M4171k7385R327J70760J77918K9128j15351M9909
22775b3389j70576q3115J08127J40820o0115q7468J47947J67154q182P164j44965
22764f598j39903o4208N5953O0672r1655j9040K42307l70308l00214J58123L69908
22753a04963J10609J38414J9026q9141j24845n3429l3859p5274M8405K49403m640
22742G9706n5025n9053q9684j37279m0203J27077J05872q4721J0912K28403J66203
22731B52208j99394p8764l662J12815Q3451k28736k28721J72601K28220r8556
22721A1462K820q0640N6741j09000q4236j02980J09230J64520L8660K29503o5003
$$ plain form
22797 42232 132268 478092 392326 228366 116544 21036 5660 61407 -109599 -286186 -284205
22786 -284205 -151044 -282119 -361866 -317695 -345080 -335753 -164993 12925 42053 -73298 -23389
22775 -23389 -193965 -277080 -168953 -28133 -88248 -175716 -27769 139385 131203 138367 -6598
22764 -6598 -146501 -210709 -154756 -94084 -185739 -204779 37528 -332780 -632994 -474871 -104963
22753 -104963 5646 144060 163086 73945 -50900 -104329 -138188 -213462 -165057 84346 79706
22742 79706 24681 -34372 -124056 -261335 -301538 -174461 -68589 -153310 -142398 86005 252208
22731 252208 52814 -25950 -29612 83203 166654 -62082 -290803 -118202 110018 11462
22721 11462 14282 -66358 -9617 -118617 -202853 -305833 -196603 -32083 6577 236080 171077
22710A71077l71206k67619j1038J60531J39221L25421J11551P77N40p5000j18150
22699F6105j36685O9903O0683j61035k11265K1416J55771j02025j28460P5313
22689b90279k64519l958J63256O1495J85409j21081J28657K37029k9565K7194
22679I3638q3412n9165j87956M4496q3118O9758j51697O1787j9579j71546K55528
22668b31266K78923P0481l7194j92327r9108R0548J31450k55580J7985L52000
22658A25912j1673Q8140j11973l13528O0732l7368k4970j63822q4463k7863K92979
22647b07897L12287M02m3250J42154K2046m6351j19549O4513J67820j73347k43042
22636a24214J19168J20158M9100J38110o9279k9920j1279m2841k905j62899N1978
$$ plain form
22710 171077 -200129 -467748 -478786 -318255 -179034 146387 257938 258715 259255 184255 66105
22699 66105 -70580 -677 60006 -101029 -312294 -290878 -135107 -237132 -365592 -290279
22689 -290279 -554798 -558756 -395500 -334005 -148596 -269677 -141020 96009 66444 93638
22679 93638 10226 -48939 -236895 -192399 -275517 -205759 -357456 -295669 -315248 -486794 -231266
22668 -231266 47657 118138 80944 -111383 -210491 -119943 11507 -244073 -226088 125912
22658 125912 114239 202379 90406 -223122 -162390 -199758 -224728 -388550 -473013 -500876 -207897
22647 -207897 104390 104792 61542 203696 225742 179391 59842 124355 292175 118828 -124214
22636 -124214 -5046 115112 164212 302322 233043 203123 191844 149003 146098 -16801 35177
22625C5177O4766J98487j17688j76582k36921J7839P0278J43956l6722j19209
22615a56619N6839j4501J47000L4512R2482M1455O5068r9579n5523K45532q1417
22604B75249n3367j92322k22485p8176J71096Q8350J3210o6037n7631j34630P2688
22593a84055k4965k71517L06825J76509J25099q6649J14674l2980q8222k31447
22583a96728K39149R9967k41493J28020K04067L23612j6965l62123o5086n3450
22573E8970J94986O909p7666j17175K1349J63251P2640j25739m5972n376o752
22562A39425j25485n9359j00554o0710N2564K53479j056o7676n5650J00947K9337
22551A05262Q807k27874p1922j15219j3036n5406j0894K32580J58886l33j9579
$$ plain form
22625 35177 99943 298430 180742 4160 -232761 -214922 -144644 -688 -37410 -156619
22615 -156619 -99780 -114281 32719 67231 159713 201168 266236 166657 111134 356666 275249
22604 275249 221882 29560 -192925 -271101 -100005 -11655 1555 -64482 -122113 -256743 -184055
22593 -184055 -209020 -480537 -173712 2797 127896 41247 155921 122941 34719 -196728
22583 -196728 42421 142388 -99105 28915 232982 556594 539629 177506 112420 58970
22573 58970 253956 260865 183199 66024 87373 250624 323264 197525 151553 146177 139425
22562 139425 13940 -45419 -145973 -206683 -154119 99360 98304 30628 -25022 75925 105262
22551 105262 114069 -113805 -185727 -300946 -313982 -369388 -380282 -147702 11184 10851 -8728
22540h728O779K17688L1782k11947j97464r7336J62116N5111j11804k7706k2338
22529b03847o090j52851R172m0028j2177J47065k66321j5246J46418J59981l4960
22518b68884k56316M8088J20350J60226J55194l2923m7997J01010j4056J28014
22508I2706p9596L7767P7175m3800O6835j31168l5281N4611j16529o2045m3385
22497a82710r77K19409J39456o7180O5549j16338J7514M8944k38577J07690P2710
22486F5490j46365l1624l971J59161R1974o3412p3050M1493j58097P1812J26513
22475G9924N0305R9957j91993j81371p3135O7642l024l0447Q1219K21988P0545
22464A91610M8382K6841p02n7154r0740j24674o0893k489K9598P4596j8069l46124
$$ plain form
22540 -8728 -1949 215739 247521 35574 -161890 -259226 -97110 -41999 -153803 -181509 -203847
22529 -203847 -209937 -362788 -353616 -393644 -405821 -258756 -525077 -540323 -393905 -233924 -268884
22518 -268884 -525200 -477112 -356762 -196536 -41342 -74265 -122262 -21252 -35308 92706
22508 92706 13110 50877 128052 84252 151087 19919 -15362 39249 -77280 -139325 -182710
22497 -182710 -183687 35722 175178 107998 173547 57209 74723 123667 -114910 -7220 65490
22486 65490 -80875 -112499 -116470 42691 134665 71253 -1797 39696 -118401 -46589 79924
22475 79924 130229 230186 38193 -143178 -216313 -148671 -151695 -182142 -100923 121065 191610
22464 191610 239992 266833 266131 208977 118237 -6437 -67330 -69819 -40221 34375 16306 -329818
22452c29818K5371J40649K20160j13770k11536m9018L17416J23863r1330l4564
22442b577j42736j36123M4926J44298K55110K8763P2992k3962j10293j90442n9030
22431a19074j69766m2154L7057J37358L30747J81296j59404k57011k95636j93828
22421e50415J98288J87196L1941j4909o2845J9511o490j09222n4528q9305J08384
22410c42394K18830L48047K5646j9285l41313j83876K69306K23349Q0237J8861
22400B97408j87443j67320N0716j69888j34129J88415R6778J4165P8276n5334
22390A1644M1791J36925L0931j5241l4560j9670o5970J56610k92808j51655L11552
22379A09549q0886j03215J36369k0727K1819p6309k3915J01982m5924j77434J00009
$$ plain form
22452 -329818 -304447 -163798 56362 -57408 -268944 -317962 -546 123317 31987 -2577
22442 -2577 -145313 -281436 -236510 -92212 162898 191661 264653 240691 130398 -60044 -119074
22431 -119074 -288840 -330994 -293937 -156579 174168 355464 196060 -60951 -356587 -550415
22421 -550415 -352127 -164931 -132990 -147899 -210744 -191233 -197723 -306945 -361473 -450778 -342394
22410 -342394 -123564 224483 250129 230844 -110469 -294345 -25039 198310 278547 297408
22400 297408 109965 -57355 -6639 -176527 -310656 -122241 -25463 -11298 66978 11644
22390 11644 53435 190360 221291 206050 171490 151820 85850 242460 -50348 -202003 109549
22379 109549 28663 -74552 61817 41090 62909 -13400 -37315 64667 18743 -158691 -58682
22368e8682K37145n1682j78322j75373j28806K49197N4970j93487O6012J03353
22358g5675j27204m4918K60616K19404k2718n31402k20932J4497Q1531Q6708J29894
22347b30199j7256J28058P6291q3295o5058r4202L0840K03954M7530l77931q5586
22336d66854M7100o1077P3144K21553L0711j79189J13638J11271k9414J71967
22326C2850K56692m1400r4274r2562J10227j6019J7925j94405j15022J04107K7425
22315d456R7938K34709J5866j56927L8396k2991j23512j32848J30243k5095j35072
22304h3749N5122Q0305L2081L4510J33518j26070j79193k13592J45941J31970
22294A0843R5945j53884O8665J77683p4570j54788J53820k81474j77810P963n3931
$$ plain form
22368 -58682 178463 126781 -51541 -226914 -355720 -106523 -51553 -245040 -179028 -75675
22358 -75675 -202879 -247797 12819 232223 209505 -321897 -542829 -528332 -446801 -360093 -230199
22347 -230199 -247455 -119397 -43106 -126401 -191459 -285661 -254821 -50867 -3337 -381268 -466854
22336 -466854 -419754 -480831 -407687 -186134 -155423 -334612 -220974 -109703 -139117 32850
22326 32850 289542 248142 153868 61306 171533 155514 173439 -20966 -135988 -31881 -4456
22315 -4456 93482 328191 344057 187130 225526 202535 79023 -53825 76418 51323 -83749
22304 -83749 -28627 51678 83759 118269 251787 125717 -53476 -267068 -121127 10843
22294 10843 106788 -47096 21569 199252 124682 -30106 123714 -157760 -335570 -327607 -381538
22283c81538L7842n3467Q5615j08930j41982l7668M12246K63244M5178n8883q1341
22272a9684J9973J41365K62773m3682j5967Q1977m877n6134j84024k15528o0462
22261i4270O610p1351Q7425Q2135q2573j37457L8079k12612q0716o5635j6868
22250e47233K00432O9195J13032q1936k454J54647l3346j20681J7514q0779j46817
22239d58426j14011l0082K44232k0935j41494L7063J18748J85093Q060J06427
22229f5325j34573J74626K16059j58035r2299l5275Q4612J62257O0743j34689
22219G8101R2312j5790j99033l07542j49755K58752L99614j27246k53605R4713
22209a29479K516J59308K30701O4839k01210m3892L7556k32888j80934q4757J40255
$$ plain form
22283 -381538 -343696 -397163 -311548 -420478 -562460 -600128 -187882 75362 120540 61657 -19684
22272 -19684 289 141654 404427 360745 344778 426755 421878 365744 181720 -33808 -94270
22261 -94270 -87660 -159011 -71586 10549 -72024 -209481 -171402 -384014 -464730 -530365 -547233
22250 -547233 -346801 -277606 -164574 -246510 -248964 -94317 -127663 -248344 -230830 -311609 -458426
22239 -458426 -572437 -602519 -358287 -379222 -520716 -483653 -364905 -179812 -171752 -65325
22229 -65325 -199898 -25272 190787 32752 -59547 -94822 -10210 152047 212790 78101
22219 78101 170413 154623 -44410 -351952 -501707 -242955 156659 29413 -224192 -129479
22209 -129479 -126963 32345 263046 327885 126675 82783 120339 -112549 -293483 -378240 -237985
22198b37985M07000m859m17336k53595K45566J19990J05630n0987j17843n126
22188b09545O2320N2064m2190R393l1072J11785O6310Q7434q1080k0819J42846
22177A47446m939K5249l9065k13792O788J80974L4026n057n9955j54997O1270
22166b2052J2201r1046Q2531k59820J37917O4300L4329p4828l5207j2647R6189
22155f8133k10072M385R6448K08711p198l3900K89099q5284k88155r9745q1919
22144b75763j08515K88730J59691m0007k0124P0783M3508J47313l476L9337p2496
22133B28981Q0586K20616J4364j98097O9220k78335k5751K78878k9147k48171
22123A13144l37893n9480R2057J23889M3323R9408j30410P6333K26688O9231q2814
$$ plain form
22198 -237985 169015 164156 -253180 -506775 -261209 -141219 -35589 -86576 -204419 -209545
22188 -209545 -147225 -95161 -137351 -127958 -159030 -47245 19065 106499 25419 4600 147446
22177 147446 142507 167756 128691 -85101 -78313 102661 136687 131630 71675 -83322 -22052
22166 -22052 -9851 -100897 -18366 -278186 -140269 -75969 -41640 -116468 -151675 -164322 -68133
22155 -68133 -278205 -273820 -177372 31339 24141 -9759 279340 194056 -94099 -193844 -275763
22144 -275763 -384278 -95548 64143 24136 4012 74795 118303 265616 262140 301477 228981
22133 228981 309567 530183 544547 346450 415670 137335 111584 390462 361315 113144
22123 113144 -224749 -284229 -192172 -68283 -24960 74448 -55962 20371 247059 316290 233476
22112B33476n239J5771j98483K0995m4060n5651J0339J52303P7848j79708O9922
22101I7513R5574J35124P3292j75550r9847o3818j02034l9405k72535p0790J03169
22090c19307p9906l9280L24429j4712K65238O070j61782j82932J54007K38411
22080A90236j80775j20469K5866J4359j1314j31254L30734M00965K8128l04920
22070B41556K3044J51795j89879l57805p6539k8806M6351j3376q9076l2083q1611
22059d06429R2961K03186K28085k5542j43393r0873K11541L8516l1111J1264N2361
22048A40566J96267n4789j74960m6067k25394J01516L72859q7645k24261L4768
22038C2860r5095k41732r7816J79689N614O4795K6649L6018l2308j99425j3611
$$ plain form
22112 233476 228237 244008 45525 66520 22460 -33191 -22852 129451 207299 27591 97513
22101 97513 193087 328211 401503 225953 126106 62288 -39746 -79151 -351686 -422476 -319307
22090 -319307 -399213 -438493 -114064 -128776 136462 142532 -19250 -202182 -48175 190236
22080 190236 9461 -111008 -85142 -70783 -82097 -213351 117383 518348 546476 241556
22070 241556 264600 416395 226516 -131289 -207828 -236634 -190283 -203659 -292735 -324818 -406429
22059 -406429 -313468 -110282 117803 92261 -51132 -142005 69536 108052 76941 88205 140566
22048 140566 336833 282044 107084 61017 -164377 -62861 309998 222353 -1908 32860
22038 32860 -62235 -303967 -401783 -222094 -216480 -151685 -125036 -89018 -121326 -320751 -334362
22027c34362Q8716j933J1698J83179J23473J28052L5780o3836J607k1288K06186
22016C57272K9168k94850J22114K7547j79396R8634j22352r6629J18500J45081
22006B05089R1464j46238k63514L3725L2598R5770n2959N0596K56775j06939K206
21995A98573J4275q2611q6695j64632j61042k8033j0788K29277J43835j07165
21985e5006r8629k21166p5089r3108K09409K78145J08148j95947K31687N9275
21975A47719J67478l1049n22j41737R5132j40330o8903m7578J7515K5506j67561
21964a44330q8069N6212K31014N7482j1738l04213k50629L5493K71777J31855
21954a5146j61294j01164J28387L84816j68675j22633J02091J5141k4883J81628
$$ plain form
22027 -334362 -245646 -247579 -235881 -52702 70771 198823 234603 170767 172374 151086 357272
22016 357272 386440 91590 213704 241251 61855 160489 38137 -58492 60008 205089
22006 205089 296553 150315 -113199 -79474 -46876 48894 -4065 46531 303306 196367 198573
21995 198573 212848 130237 43542 -121090 -282132 -310165 -320953 -91676 52159 -55006
21985 -55006 -153635 -374801 -449890 -542998 -333589 -55444 52704 -143243 88444 147719
21975 147719 315197 284148 283626 141889 237021 96691 27788 -19790 -2275 23231 -144330
21964 -144330 -232399 -176187 54827 112309 100571 -203642 -454271 -418778 -147001 -15146
21954 -15146 -176440 -277604 -149217 235599 66924 -55709 46382 61523 36640 218268
21944B18268j88792M1183P9929m7519n8900j81842J17150j52962l33181m0138
21934e46804Q0304J93282J74791J42534K23050o4947k7651j57631J85990j07252
21924I5666k40652j4905M0112j68701k7883J02141k584Q3923N2470N0803j23315
21913a52925J8682J00981l8452q4026j68257M6730L22557K15565q8977j62796
21903I082J30008R234j70540M1462j10120L2322j35313K6545J87035P8035j00302
21892b552p4295k4235L1613J3011j4715p5980j43709J83710K28595j11830J46373
21881A55986J90927J81682j0106k17669j67366j86785j40J81948l5987j23759
21871c1269k5003o5036l7247J55050J69174K22361l3590o4749j23762j18989n5881
$$ plain form
21944 218268 29476 70659 150588 103069 44169 -137673 -20523 -173485 -506666 -546804
21934 -546804 -466500 -273218 -98427 44107 267157 202210 174559 16928 202918 95666
21924 95666 -144986 -159891 -119779 -288480 -316363 -214222 -216806 -132883 -80413 -29610 -152925
21913 -152925 -134243 -33262 -71714 -155740 -323997 -277267 45290 260855 171878 9082
21903 9082 139090 148324 -22216 19246 -90874 -58552 -193865 -167320 19715 97750 -2552
21892 -2552 -76847 -101082 -69469 -56458 -71173 -147153 -290862 -107152 121443 9613 155986
21881 155986 346913 528595 518489 300820 133454 -53331 -53471 128477 92490 -31269
21871 -31269 -56272 -121308 -158555 -3505 165669 388030 354440 289691 165929 46940 -8941
21860h941j01996j55547k4444q4889K3276L5129P8063k774L6725r105N1481n9838
21848b22860k25957J98998O4445j17920M4445M3894j51810J75346L46365n6387
21838I8559j54750Q2702j93719j12245o0198l0168K2985J25522j85248j93615
21828f00175m7579K31213K90758m7479J52502Q9176P4236J23200J02484k6090
21818C42246K10677k03526j05723J04268k63191l33356N451K51776K21920J56653
21808C87195j64462m022J749j25067k97406M8332J36104n5433j2039j49590K10004
21797b4635J82164p0713p9931n5978k6464J59266K3946n5042l81244j76546L04663
21786b00514K12288O7852J37094k9058k40301J31039r7922j59963q423J38366
$$ plain form
21860 -8941 -110937 -266484 -290928 -375817 -352541 -317412 -239349 -242123 -205398 -214503 -163022 -222860
21848 -222860 -448817 -249819 -185374 -303294 -258849 -214955 -366765 -191419 154946 98559
21838 98559 -56191 26511 -167208 -279453 -339651 -369819 -346834 -221312 -406560 -600175
21828 -600175 -647754 -416541 -125783 -173262 -20760 68416 142652 265852 368336 342246
21818 342246 552923 349397 243674 347942 84751 -248605 -243154 8622 230542 387195
21808 387195 222733 218711 220460 95393 -202013 -153681 -17577 -73010 -85049 -234639 -24635
21797 -24635 157529 86816 6885 -49093 -75557 83709 107655 52613 -328631 -505177 -200514
21786 -200514 11774 79626 216720 187662 -52639 78400 -19522 -179485 -187908 -49542
21776d9542Q3581p6550J18633O5594j86895k28064L25382J46054j8366l7831q9432
21765E2564k19070J3044N3039K9904k44301n357Q5654Q7851p1511j02902r895
21754c30980P5824K63891L02642o2427l13004O8564r8606J30287K65203n2228
21744B49166N6500k04575m20110k4835J52466m6685k4718L85693Q3631p5310q0319
21733E0904j34888o1161N7565K47078N3875j29221q5340O5765q2057k2555j26723
21722a66758o2622R7324J05571P4956O8790O7318j96807j01701l34495q2051J26044
21711d04431N832K29616r3568j39289L9657K55462n7980k3515J27273R0719J09524
21700A39300K1919n2248N6497r7952r6754R3667J84235j51147n9433J49353Q8484
$$ plain form
21776 -49542 34039 -42511 76122 141716 -45179 -273243 52139 198193 179827 141996 52564
21765 52564 -166506 -153462 -100423 -70519 -314820 -320177 -234523 -146672 -218183 -321085 -330980
21754 -330980 -255156 8735 311377 248950 -64054 4510 -94096 36191 301394 249166
21744 249166 305666 101091 -319019 -343854 -191388 -238073 -262791 122902 206533 131223 50904
21733 50904 -83984 -145145 -87580 159498 213373 84152 -1188 64577 -17480 -40035 -166758
21722 -166758 -229380 -132056 -26485 48471 117261 184579 -12228 -113929 -448424 -530475 -404431
21711 -404431 -398599 -168983 -262551 -401840 -362183 -106721 -164701 -188216 -60943 29776 139300
21700 139300 161219 108971 165468 67516 -29238 64429 248664 97517 38084 187437 275921
21689B75921l2408J84716j50583O9541O6497p2564p8804j1752k0217j40551k24766
21678a34970k6404M8127J15915k49029q2651J02871n8431R1308J92765k315J72747
21667A69933N1922M7686J08426j16868j00115R1221J6229j95105j12793l41442
21657c80906R0063L97401P4299p3010k42214j42314K36539R0830q7004j33743
21647a70059J06556J21771j62163j19349P9432J88429J24918L6137j23183l6791
21637D5698K01172J01270j89881M8566K55787N9594j15872j97229j34614l9239
21627C5252J49528J81212n0071o0246j21170k9423K42830J02243J0434n1855q3880
21616C24854j56975j91546q2187r4033Q9666R2393l2289j080R0743m6992J6378
$$ plain form
21689 275921 243513 428229 277646 347187 413684 341120 262316 250564 230347 89796 -134970
21678 -134970 -161374 -113247 2668 -246361 -329012 -226141 -284572 -193264 -499 -2814 169933
21667 169933 221855 269541 377967 261099 160984 252205 268434 73329 -39464 -380906
21657 -380906 -290843 106558 180857 107847 -134367 -276681 -40142 50688 -36316 -170059
21647 -170059 -63503 58268 -103895 -223244 -143812 44617 169535 205672 82489 45698
21637 45698 246870 348140 158259 206825 462612 522206 406334 209105 74491 35252
21627 35252 184780 365992 315921 255675 134505 105082 347912 450155 460589 408734 324854
21616 324854 167879 -23667 -105854 -199887 -110221 -17828 -50117 -51197 39546 -7446 8932
21605H932l01049j0851J93467J17350M4800J59621Q4038k8439q0506J3248j02199
21594I8412j38500q7081K16337J04128O2442k71234n2157R843k9520K7119K98997
21583B38786o3197l04597J10439M84976j12543m14274k5767N512J80167K37281
21573C36783j24041l46563L3559J10865k1115n1904O1550K82691K64980J33722
21563F80527o3404j87460k30091j37034m8149l76352j11634K15208L26193j64640
21553i6836o6300J25099R9269k12780J4550J85597K74575Q906k28620j33601J9994
21542a0147P6650J64731k8491k04763l66487j41476J65262K10592O3541l3708
21532a04296n2605k03361j78803J57591K37249o9772j49967P7275R0670p9916
$$ plain form
21605 8932 -292117 -302968 -109501 7849 52649 212270 296308 267869 187363 200611 98412
21594 98412 -40088 -127169 89168 193296 255738 -15496 -67653 -57810 -87330 -60211 238786
21583 238786 175589 -129008 -18569 466407 353864 -60410 -86177 -80665 99502 336783
21573 336783 212742 -133821 -100262 10603 -10512 -62416 -866 281825 546805 680527
21563 680527 617123 429663 199572 62538 14389 -361963 -473597 -258389 67804 -96836
21553 -96836 -163136 -38037 61232 -151548 -136998 48599 323174 332080 103460 -30141 -10147
21542 -10147 66503 231234 202743 -2020 -368507 -509983 -344721 -134129 -70588 -104296
21532 -104296 -156901 -360262 -539065 -381474 -144225 -213997 -363964 -286689 -196019 -275935
21522b75935K49330K18541l26063k10432J69730n2093J44724j73838k69346l6830
21512e62212O5521J63859O1217J62492J37774q5244J08685O0030N720L9530l2110
21501A25262o1679k11528k49790j00793L6504K62112K60443N4923j17898n715
21491h159l70R6548O7885j36415k82782j04598J81801J67169J13448k50818o6101
21480b22392o9970j12095J68792j025l8406L7184n4410m5680J18203J04218J8766
21469i6815m5521j67525j22662O7551L58785K03212m616J02701m0881k89381j21918
21458a57070J36208l2576K31753l06014j1986L0161L6358J2924K91690K89658
21448E21106j62787k90650k1007q8642j22429j0437P9944j94948n8284L22428
$$ plain form
21522 -275935 -26605 191936 -134127 -344559 -174829 -226922 -82198 -256036 -525382 -562212
21512 -562212 -496691 -332832 -271615 -109123 28651 -56593 52092 112122 117842 157372 125262
21501 125262 63583 -147945 -397735 -498528 -462024 -199912 60531 115454 -2444 -8159
21491 -8159 -8529 88019 155904 19489 -263293 -367891 -186090 -18921 94527 -156291 -222392
21480 -222392 -292362 -404457 -235665 -236690 -275096 -237912 -292322 -338002 -219799 -115581 -96815
21469 -96815 -142336 -309861 -432523 -364972 -6187 197025 192409 295110 254229 -35152 -157070
21458 -157070 -20862 -53438 178315 -127699 -139685 -109524 -73166 -60242 231448 521106
21448 521106 358319 67669 46662 -41980 -164409 -174846 -94902 -289850 -348134 -25706
21438b5706K20908j80076k1102K10572q5677k00620J85635J24078Q7108n3068
21428B62052j57935n9989k10828q9949m140J12335P6972J06360j90234j0386Q6945
21417g8797N5668j78055M9612k8930p1784J89265K82986L3908l77105l1438o2320
21406b16990J90878J13149L18871j02204q6496O7574j0365M0001j2432o1828k08657
21395C1501j07593J76534K61205j25287k83805j82693J34963m6615j65643R8399
21385b09034J50718R3439J8719l4495O4322L39426K49888j89264l39825n9601
21375H4293J37381j48646j17195l2130R1329J99524J74269k23451l0739N095j63025
21364b3295k04223l3740K29160J25390K9809k7778j79295q8033k3284j1205J40502
$$ plain form
21438 -25706 195202 15126 -5976 204596 118919 -81701 103934 228012 315120 262052
21428 262052 104117 44128 -166700 -256649 -260789 -148454 -71482 34878 -155356 -165742 -78797
21417 -78797 -23129 -201184 -151572 -180502 -252286 -63021 219965 253873 -123232 -154670 -216990
21406 -216990 -26112 87037 405908 303704 217208 284782 274417 314418 301986 240158 31501
21395 31501 -76092 100442 361647 236360 -47445 -230138 -95175 -141790 -307433 -209034
21385 -209034 -58316 35123 53842 19347 83669 423095 672983 483719 143894 84293
21375 84293 221674 73028 -44167 -76297 15032 214556 388825 165374 134635 139730 -23295
21364 -23295 -227518 -261258 -32098 93292 123101 95323 -83972 -172005 -195289 -206494 -65992
21353f5992P8549K03467J7975j43916j8857j6284O9947K85907J0353j09459L00632
21342F12322j51424j10106Q8703L95265J50000k34873k18596n4198N8539m3927
21332D91705j24672m6510j31824j44670R7835K53875J27110J15025J82650K1898
21322H42422M703q2815l7044k78764q379L20369n3458k92563k64675l45254j4320
21311b09778J51627K07351j41074Q9966J09628j40243p9070J17605j49414P4054
21301C0652L08115j4077j59189J12590R2531J02138l06302j79582n4605Q2186
21291A4457j9339l3623k06555J9705M455J85210j19039j87435r0077K24342K38708
21280C0809J61310P6503j58161j70277l4340K59787j4355k06725R2386J08645
$$ plain form
21353 -65992 12557 216024 233999 90083 71226 54942 124889 410796 421149 311690 612322
21342 612322 460898 350792 439495 834760 984760 749887 531291 477093 535632 491705
21332 491705 367033 320523 188699 44029 141864 395739 522849 637874 820524 842422
21322 842422 847125 764310 727266 448502 440123 760492 707034 414471 149796 -195458 -209778
21311 -209778 -58151 149200 8126 98092 207720 67477 -11593 106012 -43402 30652
21301 30652 338767 324690 165501 278091 370622 472760 166458 -13124 -67729 14457
21291 14457 -4882 -38505 -245060 -225355 -220900 -35690 -154729 -342164 -432241 -207899 30809
21280 30809 192119 268622 110461 -59816 -94156 165631 151276 -55449 36937 145582
21270A45582J3565l8709m6781j02304m7343q3083m0892Q0655Q4332J407k9934
21259f3505J1863Q1434n376K05274j71135j62599m2463J40996K17819j89788l05497
21248b82977k11316K82147J91589R1429k96836l3071J13873j50642n6622M6882
21238c05544k6407l4236J8480j8488j01160k3189j9489K8520J63576J96313j39910
21227b61534r3283j71100J52644L33139j6687j98101M638n7937J43442K10221
21217D5442K05692j64186j29884p0519P9554J59568J54600J07918n6759j23192
21207B08234Q0440Q3526k20199k62631j74791j81291K81864J06873k22685j21209
21197d21869J96387J10444L03700O0426j94278k61693M7398j31565K88241K31024
$$ plain form
21270 145582 159147 120438 73657 -28647 -75990 -159073 -199965 -119310 -34978 -33571 -63505
21259 -63505 -51642 29792 24416 229690 58555 -104044 -146507 -5511 212308 22520 -282977
21248 -282977 -494293 -212146 -20557 70872 -225964 -259035 -145162 -295804 -352426 -305544
21238 -305544 -331951 -366187 -347707 -366195 -467355 -490544 -510033 -481513 -317937 -121624 -261534
21227 -261534 -354817 -525917 -373273 -40134 -56821 -254922 -250284 -308221 -164779 45442
21217 45442 251134 86948 -42936 -113455 -33901 125667 280267 388185 331426 208234
21207 208234 288674 372200 152001 -110630 -285421 -466712 -184848 -77975 -300660 -421869
21197 -421869 -225482 -115038 188662 249088 54810 -206883 -159485 -291050 -2809 228215
21187B28215Q7740N860j6195P7067J38597j96708L0588Q6473n328j7684k93792
21176A24833o699K18169K71882q813j56822k19555n02964l06941J32234N9859
21166c94817K84158L81620J82548j64548j97741M5279K29508j86429k78013m1914
21156a40349q6778J72554J63492J9729o3207k65489J13538J19088j04075L19j11022
21145a82200j8604K4735n4855p3995J98476L6891L09981J926L7709N5171J01527
21134D36762O5842J9936n6097m6853j90591p2924J48597j45011j19720K64026
21124C03967l1138k44230j24928j78587Q0350J69917J32326O8996j25947k9987
21114B0739M5103Q121k13746j94390K2160m732P4636j79139J16296J25921k26657
$$ plain form
21187 228215 315955 321815 305620 382687 521284 324576 355164 441637 436309 418625 124833
21176 124833 118134 336303 608185 599372 442550 222995 -279969 -586910 -454676 -394817
21166 -394817 -110659 270961 453509 288961 91220 136499 366007 179578 -98435 -140349
21156 -140349 -227127 -54573 108919 128648 65441 -200048 -86510 32578 -71497 -71178 -182200
21145 -182200 -200804 -176069 -230924 -304919 -106443 -69552 240429 242355 280064 335235 436762
21134 436762 502604 522540 466443 419590 228999 156075 304672 159661 39941 303967
21124 303967 272829 28599 -96329 -274916 -194566 -24649 107677 176673 50726 20739
21114 20739 65842 73963 -139783 -334173 -312013 -316745 -242109 -421248 -304952 -179031 -405688
21103d05688J1918Q0501J47792J63220j24910m0720L06164k7555l50334l63733
21093f03345J42936L8257J64830j90329l3968M4463J60996K88660J44033k40433
21083h3900m5636m7492J52378p0327K3310J11594N1549l5154p7767l7623J35094
21072G6026r4588k00871J99325m1472q5983j29884k8195J43813J59535J62419
21062A60125j34550j30441j8176L22765r0206L9287n0589j58193m3398J23168
21052A9792K84128J07407l7182j1881p2003M4334j28491r5346O0670j33413j70
21041C7845L5325j6766l8750q8277j8010R6136M13951J06271k48550j09369L5969
21030B05775K7799j02762k55015j82651O7134R4690J9311j70731J09J59293j7131
$$ plain form
21103 -405688 -393770 -313269 -165477 -2257 -127167 -167887 138277 110722 -239612 -603345
21093 -603345 -460409 -422152 -257322 -447651 -481619 -437156 -276160 12500 156533 -83900
21083 -83900 -129536 -177028 -24650 -94977 -71667 39927 91476 56322 -21445 -59068 76026
21072 76026 -18562 -219433 -20108 -61580 -147563 -277447 -305642 -161829 -2294 160125
21062 160125 25575 -104866 -123042 199723 109517 148804 98215 -59978 -103376 19792
21052 19792 303920 411327 374145 362264 290261 334595 206104 110758 171428 38015 37845
21041 37845 73170 56404 17654 -70623 -88633 7503 421454 527725 279175 169806 205775
21030 205775 233574 130812 -124203 -306854 -239720 -145030 -125719 -296450 -296341 -137048 -154179
21019a54179j2647K21878L44859q794l42077j81020K08900L77006J44598o4929
21009E33595r6780o9305p4186j40565m1503J05948N9925n7958q8349j05083r711
20998A6028K27049j06961j90492K4413J35766j52202l45659p8011K65857K69770
20988F5558N5328j3698q4879k06444j21026N2758N7601j6320p8794K83334J05161
20977I8579J17027J01178j62710j4479j94154n3211J91386J3045J12864J18077
20967C27602L2241L4865k50700j4375R6878p4064J8591P186j38023n557P1186
20956A05830J84005j3149K01815n0313P6128J22173J44369j48969k65007j9971
20946C36911K76477K375j93212l12569m4857J02921k43370n3458K15692m4653
$$ plain form
21019 -154179 -166826 55052 399911 391117 49040 -131980 76920 453926 598524 533595
21009 533595 436815 367510 293324 152759 111256 217204 277129 219171 130822 25739 16028
20998 16028 243077 136116 -54376 -29963 105803 -46399 -392058 -470069 -204212 65558
20988 65558 120886 107188 22309 -184135 -305161 -252403 -194802 -211122 -289916 -6582 98579
20977 98579 215606 316784 154074 139595 -54559 -107770 83616 96661 209525 327602
20967 327602 359843 394708 144008 129633 226511 152447 171038 178224 40201 34644 105830
20956 105830 289835 276686 478501 428188 504316 626489 770858 621889 356882 336911
20946 336911 613388 615763 422551 109982 65125 168046 -75324 -128782 86910 42257
20936D2257J40440J88929n2756n9189L5824K31727M2492j57233l64534k72305
20926b24348J63892p3509m8961J12838q0521R8956l142j53641r1834J04550P8694
20915a17026J4027l01473p9930Q3724O3390J20867J13495J02486j37283n0779
20905a88502l3815K86959K53961j35902j70919k4264K93653K02923J17317k51697
20895C49714m33575j29243k674J92143J00756P4931L02217P3797j02752j84017
20885B41297k2226p9320j21372M7780L5759P5657R9784J63743j97289k00644J87234
20874B30403j68754k0736n108r3336k3962J3644o7450J79481J79261K84350j25198
20863C82595n8143K3045k72043Q9440K27682k99252o2111k1459k4462J49254K15299
$$ plain form
20936 42257 182697 371626 318870 259681 295505 527232 569724 412491 47957 -224348
20926 -224348 -60456 -133965 -182926 -70088 -150609 -51653 -54795 -208436 -300270 -195720 -117026
20915 -117026 -102999 -404472 -484402 -400678 -337288 -216421 -102926 -440 -137723 -188502
20905 -188502 -222317 64642 318603 182701 11782 -12482 281171 484094 601411 349714
20895 349714 -83861 -213104 -215778 -23635 77121 152052 454269 528066 425314 241297
20885 241297 219071 139751 18379 66159 101918 177575 277359 441102 243813 43169 230403
20874 230403 61649 40913 35805 -57531 -81493 -67849 -135299 44182 223443 507793 382595
20863 382595 324452 347497 75454 164894 392576 93324 31213 9754 -14708 134546 349845
20852C49845J95419J1379K8722N439O2831k07000K2163o494Q3942p509M4062K97757
20840H80556m0821o7972l5498M0655m120J95056p909k6031l8182j69433j38758
20829E87543P6279l5496j12274K57543J35982o8874p4611J4688P7692m5482j79670
20818F33320j5495J22884J32117J88955r6772R8003N6346m3967P530j1404J19775
20807A191292J99848J27592J46059O0972O9617J21735p8436R7686J26273L9201
20797B101839K13993K41179J27422J48199N6349J11781L87796N68117M52579K67788
20787D677042K79732M17780N69009M16198O55843Q23678J026083J469641J694861
20778A2029867J977687K909465L729103M466916N053617N012646N230360O913758
$$ plain form
20852 349845 545264 556643 585365 590804 653635 446635 468798 462304 546246 538737 582799 880556
20840 880556 839735 771763 736265 776920 772800 967856 959947 933916 895734 726301 587543
20829 587543 663822 628326 516052 773595 909577 840703 766092 780780 858472 812990 633320
20818 633320 617825 740709 872826 1061781 965009 1063012 1119358 1075391 1082921 1071517 1191292
20807 1191292 1391140 1518732 1664791 1725763 1795380 1917115 1838679 1936365 2062638 2101839
20797 2101839 2315832 2557011 2684433 2832632 2888981 3000762 3388558 3956675 4409254 4677042
20787 4677042 4956774 5374554 5943563 6359761 7015604 7839282 8865365 10335006 12029867
20778 12029867 14007554 16917019 20646122 25113038 30166655 35179301 40409661 47323419
20770D7323419Q954861R897118Q183924M286527K712079M928328Q024196Q214905
20762A02525357M067599j758697l163729n54157K144466K406254P12623l66249
20754A06013467O33803R37582k019919l175959r50016J649665K585157j409613
20746A04264167p829847j0045731o889097l663822l550477o815408r866542r484647
20738D6118596p353287n403873m366386m515392m474425l782355k703990j870515
20730A1648373j696930j444812r61790o56125l86637n33825m36676k01779j67606
20721E162193m75669m81359m17704n16190l04597n3173M9009p2244j58906j74939
20711B556421n4537j2039q7916m19598j71595l34405j72476J40430M8685j66875
$$ plain form
20770 47323419 56278280 66175398 74359322 78645849 81357928 86286256 94310452 102525357
20762 102525357 106592956 104834259 101670530 101116373 103260839 105667093 106379716 106013467
20754 106013467 106647270 107584852 105564933 102388974 101438958 103088623 105673780 104264167
20746 104264167 96434320 86388589 79499492 75835670 72285193 65469785 55603243 46118596
20738 46118596 38765309 33361436 28995050 24479658 20005233 16222878 13518888 11648373
20730 11648373 9951443 8506631 7544841 6888716 6502079 5968254 5531578 5329799 5162193
20721 5162193 4686524 4205165 3787461 3271271 2966674 2913501 2962510 2890266 2731360 2556421
20711 2556421 2501884 2489845 2401929 1982331 1810736 1476331 1303855 1444285 1492970 1326095
20701A326095n3730k76652k88035j9809J0709J49533k30315n3526k4321k9125
20691E10824J03929O3859Q0783Q5910j60397n3450j00575L1139j86658j77652
20681A97712n4108j8244K12117J27496L2995J22938j72698k18921j78856O7067
20671A17498J57425Q145j0838J03171n0510j75521p1288j06202k4748J43602K04836
20660B95570j23747j48513k30792n9530j95662J86488K70161L52594O1167k00601
20650B07135j75260J14149J83755l6078j57043J15175J46834n5691J28170O3232
20640E34378j37907o5496J20431k05536o6305p9854j89323J22344K76411N7059
20630C66202Q7619j07751K8701J29597J8395j38032J10249P6714j0296k47411
$$ plain form
20701 1326095 1272365 995713 707678 687869 698578 848111 617796 564270 539949 510824
20691 510824 614753 678612 759395 845305 684908 631458 530883 562022 375364 197712
20681 197712 143604 125360 337477 464973 497968 620906 448208 229287 50431 117498
20671 117498 274923 283068 272230 375401 324891 149370 78082 -28120 -52868 90734 295570
20660 295570 171823 23310 -207482 -267012 -462674 -276186 -6025 346569 407736 207135
20650 207135 31875 146024 329779 293701 136658 251833 398667 342976 471146 534378
20640 534378 396471 330975 451406 245870 179565 99711 -89612 32732 309143 366202
20630 366202 453821 346070 374771 504368 522763 384731 494980 571694 561398 313987
20620C13987j01277j39688j97385P409j25866j930N6137j7123J53808l3090M9370
20609c5648K67869J03537j44733j40092k47053j88630K7968R9779n2502R8878
20599b10627J27011J365L1334m7105j64160q387L96717L7105R8193J30668q9461
20588C02653m08153j76730J22546K29390K03629J25307o2046p8775o187k98339
20578d6705m057J61248Q7421o110k27316j44190j50082K3569J49508K03706K34082
20567B81074j89107j2297p5320L4609J15035N7183j36447l15336m888j28118J74769
20556a98843K98762O4653N0287M1089k72367n8164M9186n7018q3893J24583N7763
20545A6038k8982L139m0100J84270n7684j03291L7863l3996k53717J69054P5653
$$ plain form
20620 313987 212710 73022 -124363 -116954 -242820 -244750 -188613 -205736 -51928 -85018 -35648
20609 -35648 232221 335758 191025 50933 -196120 -384750 -356782 -257003 -309505 -210627
20599 -210627 -83616 -82251 -50917 -98022 -262182 -270569 126148 163253 261446 392114 302653
20588 302653 -105500 -282230 -159684 69706 273335 398642 336596 257821 251634 -46705
20578 -46705 -50762 110486 197907 191797 -35519 -179709 -329791 -306222 -156714 46992 281074
20567 281074 91967 79670 4350 38959 153994 211177 74730 -240606 -245494 -373612 -198843
20556 -198843 99919 164572 214859 255948 -16419 -74583 -25397 -82415 -166308 -41725 16038
20545 16038 -12944 -9805 -49905 134365 76681 -26610 11253 -22743 -276460 -107406 -31753
20534c1753R278n5799J14574J19507o8265k34002J30614j31139j60815M5445j64819
20523d27174N6471K40247k1041j12675J52877J57906n1249K9337L3954j66581
20513a07928J58815J80715j00108j56246R0993J9882l1817k0001K26251L81437
20503F41993m5752k16989q1466k21618o770J73959N8206j68449m9189J07964r1986
20492I9903j73993J06777k58157j24981O1886J13516R5080l8283P5661J46456
20482A03865j04231j93798L17340J72087j80714J43031j22533j36108m2764O9998
20472B6173O5580l91447l06260l5601r237J58611P4707L41359L83469Q8980r6987
20461B99347K8767m74899j52107J91190J34219r9894J47604L45767m2858k33346
$$ plain form
20534 -31753 -22475 -78274 36300 155807 87542 -146460 -15846 -146985 -307800 -262355 -427174
20523 -427174 -370703 -130456 -151497 -264172 -111295 46611 -4638 24699 58653 -107928
20513 -107928 50887 231602 131494 -24752 66241 86123 54306 34305 260556 641993
20503 641993 596241 379252 297786 76168 69398 243357 301563 133114 83925 191889 99903
20492 99903 -74090 32687 -225470 -350451 -288565 -175049 -79969 -118252 -42591 103865
20482 103865 -366 -194164 123176 295263 114549 257580 135047 -1061 -43825 26173
20472 26173 91753 -299694 -605954 -641555 -650792 -492181 -417474 -76115 307354 396334 299347
20461 299347 328114 -146785 -298892 -107702 26517 -73377 74227 419994 377136 143790
20451A43790j15663M4025J20302O4953j62228k6979r5965J94657o663L4197J25767
20440C20193K03926j28647k61089M9914L9069j27667j2736j80417M1062J16885
20430F0493l14320r2813M6086J98363J07595J37698R807p3929J1253r0672L3268
20419C2829N8038j24468j47906j10602n0564K2931J86789J23758L8448l01455
20409b72202J36144J53494p759m3243n1812j38727N3759j79886J63142J27617
20399e9473M8102r3225R3450k11003k1028J27019j38040L12319r7389O2646K33509
20388B56887R3498k90153k09230J56596j02642n6928J94149K89404l12780r3671
20378g4870K13490J55154m5542P8127k18196o7507j29163j4143J93836k61651
$$ plain form
20451 143790 28127 72152 192454 257407 95179 68200 -27765 166892 160229 194426 320193
20440 320193 524119 395472 134383 184297 223366 95699 82963 -97454 -56392 60493
20430 60493 -253827 -346640 -300554 -102191 5404 143102 152909 78980 90233 -439 32829
20419 32829 90867 -33601 -181507 -292109 -342673 -319742 -132953 -9195 29253 -272202
20409 -272202 -136058 17436 9677 -33566 -85378 -224105 -170346 -350232 -187090 -59473
20399 -59473 -11371 -104596 -11146 -222149 -243177 -116158 -254198 58121 -39268 23378 256887
20388 256887 350385 60232 -148998 7598 -95044 -151972 42177 331581 18801 -74870
20378 -74870 138620 293774 248232 326359 108163 40656 -88507 -102650 91186 -170465
20368a70465p0682R5037l6309o336M9865p432l6389j25975K44389R4357k68236
20357b38176k1474P0385j82212O324K08846q2938j52350P4024m7439J90799J35108
20346c9103o5272l16912P4330J95078M08980L7800m9326J22386J861m06314j65987
20335b02479J09792R8370J89547o8303k59446L3738M6399l4686m0734p8932r656
20324b16390L5689N5410o6298j017J1905N4024L8024k2047k46249N7309O5841
20313b33799q4618J31085K63725J25873l7068L816J40061L9019o871N639l3222
20302C13640j67158O99o415j51458R9949O760P8332J61169j98202j6648R4092
20291B14760k01312r6715r4446P9857J10781N888r7420M1737P8288l49613j08118
$$ plain form
20368 -170465 -241147 -146110 -182419 -188755 -138890 -146322 -182711 -308686 -64297 30060 -238176
20357 -238176 -259650 -189265 -371477 -365153 -156307 -239245 -391595 -317571 -365010 -174211 -39103
20346 -39103 -104375 -421287 -346957 -151879 257101 294901 245575 367961 369822 -36492 -202479
20335 -202479 -92687 5683 195230 126927 -132519 -98781 -52382 -87068 -127802 -206734 -216390
20324 -216390 -180701 -125291 -191589 -192606 -180701 -126677 -88653 -110700 -356949 -299640 -233799
20313 -233799 -318417 -187332 76393 202266 165198 169014 309075 348094 341223 346862 313640
20302 313640 146482 147181 140766 -10692 89257 96017 174349 335518 137316 120668 214760
20291 214760 13448 -83267 -177713 -97856 12925 18813 -78607 -36870 41418 -308195 -416313
20280d16313K39974J38451M180P4544Q0378l1959J34489L697n2166R4363M5321
20269C14959K09488j48954l19624k05176j51913j23451M4778k304R6391J09504
20259a76302P2059O3017Q301L17386K11449P6594k44935r7373J01456M273j69047
20248A66878k65929j8404r3348l4261J78104K58207k75076j59238m2239J59134
20238a26172M2657k7674J06421j44771m9351J0984k44498k3051l7026j04349K19968
20227c76862N6850O7J66509J7205J83264J96795K40646o593l03331k40303k14875
20216b80628o4521K21853L10632N4435j74088j27122l2555J76521m3672j0778
20206C0077J0148J41389K15299N0648j78159k53431j9355K25738j02021k70798
$$ plain form
20280 -416313 -176339 -37888 -33708 40836 121214 89255 223744 227441 175275 269638 314959
20269 314959 524447 375493 55869 -149307 -301220 -424671 -379893 -382197 -285806 -176302
20259 -176302 -104243 -41226 -32925 284461 495910 572504 327569 230196 331652 335925 166878
20248 166878 -99051 -117455 -210803 -245064 -66960 191247 -83829 -243067 -285306 -126172
20238 -126172 -83515 -111189 -4768 -149539 -198890 -187906 -432404 -455455 -492481 -596830 -376862
20227 -376862 -320012 -319945 -153436 -136231 47033 243828 484474 477881 174550 -65753 -280628
20216 -280628 -345149 -123296 187336 241771 67683 -59439 -91994 84527 40855 30077
20206 30077 40225 181614 396913 447561 269402 15971 -3384 222354 120333 -150465
20196a50465J49587L64628J52709o3178j18565k95815M6127N3027L53659K80675
20186G72389O9154j65182m13033k9768r2195J22657L14359O1624j4446l5268R9702
20175F89993r2080m14735j43759M06798J05966k24139K3370J34635L1589J36504
20165F54142k44737k39782l9073J25978J80628k503K6347q7907j13907m3659j94113
20154B1414K7932m871J52321p0850O5887n5085m817J94526k1325j01951r1607
20143A11574j8477m2228j24358q9076L24184O652j61577j33271L748O1260k306
20132f3875j03318O9930k249q3655K30P1560l9889j06872j18799J09453J34345
20121a33139K7047J38462J22677l9703o831j873k56977r2964R1387J1573K13307
$$ plain form
20196 -150465 -878 363750 516459 453281 334716 38901 85028 138055 491714 772389
20186 772389 841543 676361 263328 233560 141365 264022 578381 640005 625559 590291 689993
20175 689993 597913 183178 39419 446217 552183 328044 351414 486049 517638 654142
20165 654142 409405 169623 130550 256528 437156 434653 461000 373093 259186 215527 21414
20154 21414 49346 44475 196796 125946 191833 136748 131931 326457 305132 203181 111574
20143 111574 93097 50869 -73489 -162565 161619 168271 6694 -126577 -122829 -61569 -63875
20132 -63875 -167193 -97263 -99512 -183167 -182937 -111377 -151266 -258138 -376937 -267484 -133139
20121 -133139 -106092 32370 155047 115344 108513 106640 -150337 -243301 -151914 -140341 72966
20110G2966J23380J72816K78731j62900k44063j70882p6365O8890K0202L36150
20100D18925J09557j74530k75962p9482J97517N0584l0045J16837l42287q2396
20090i1282q8174N8894j21377j47208J07537J79636K03190Q3260k95970N5121
20080e6373m6139R2265j21015J13135o72k09255M514q1912K37533J98187j56320
20069b6052j51439Q3433L3144J44473Q8528j52824j53325J27773M0767j38580
20059a04102j15649J15126N9873J08611r3590j21637J19029p3292J5251K3149
20049f7231p9342J089r8177r3285p794P6599O4178J28227L61444J13678k13835
20038A85551o9281j66547R436K12049k60661K3717L0376p1154J95494J58547j29106
$$ plain form
20110 72966 196346 369162 647893 484993 240930 70048 -6317 62573 82775 418925
20100 418925 528482 353952 77990 -1492 196025 246609 216564 333401 -8886 -91282
20090 -91282 -179456 -120562 -241939 -389147 -281610 -101974 101216 184476 -111494 -56373
20080 -56373 -102512 -10247 -131262 -18127 -18799 -228054 -223540 -305452 -67919 130268 -26052
20069 -26052 -177491 -94058 -60914 83559 172087 19263 -134062 -6289 34478 -104102
20059 -104102 -219751 -104625 -44752 63859 -29731 -151368 -32339 -105631 -90380 -67231
20049 -67231 -146573 -145484 -243661 -336946 -344740 -268141 -203963 -75736 285708 399386 185551
20038 185551 116270 -50277 -40841 171208 -89453 -65736 -35360 -106514 88980 247527 118421
20027A18421n164J18647J48572k8700k01012q3342J11924l403k23715j20269N8850
20016a09191J58212P9053N6652r4440j03432L84544k9154j41383o5378m8732J1207
20005I7958O7084j22556O4203j24646J19756J43357o8235N8668m6511k61832o1686
19994a34440L81147P2813k3172j26853K33111l5080m0041j51296n7898j34340
19984a6049k8170p523j04705J47728J13659J7182K88294M3161n21141k93090L0210
19973c30444l0883o1581M2029J81017P9015Q0887l4322j94736L11977K93889r3007
19962B43841j55571j94818j72974j8978J45494P2407J3547K89200K17985l2544
19952D07589l22251m8299K7307j24882j20605j8822k15839j0028J39491L5959
$$ plain form
20027 118421 113257 231904 380476 351776 150764 67422 179346 175943 -47772 -168041 -109191
20016 -109191 49021 128074 184726 90286 -13146 371398 342244 200861 135483 86751 97958
20005 97958 165042 42486 106689 -17957 101799 245156 176921 235589 189078 -72754 -134440
19994 -134440 246707 319520 296348 169495 402606 367526 327485 176189 118291 -16049
19984 -16049 -44219 -51742 -156447 -8719 104940 122122 410416 453577 -67564 -360654 -330444
19973 -330444 -361327 -422908 -380879 -199862 -120847 -39960 -74282 -269018 42959 336848 243841
19962 243841 88270 -106548 -279522 -298500 -153006 -80599 -67052 222148 440133 407589
19952 407589 85338 37039 64346 -60536 -181141 -199963 -415802 -425830 -286339 -250380
19942b50380p6258M8615J24799J66022p1631L0905J1351k41467K37033Q4842J05375
19931A69206l9960J93186J43526j30038k07259l3730K63568l3563k13474j3426
19921I8036j87298p3410J2307j04076j786o5946J40775J85793J4558J5544N6380
19910I0877K9313j24025M490J57665r4836j75696J00227L2867q6772p9982j72812
19899c18684n7970J30315J70708o2620P7291n7610J5247K77531K99338K32275
19889G05821j2076j92397j92802l43059j26923J42368r3588J42774O5589j79701
19879h3994O4555R7063K6401k2835j19227j53670Q8639K8015K13291K87406P5970
19868E01614n3962K6360n159L1617J59893p706K86593J61447q5574k44461j75791
$$ plain form
19942 -250380 -326638 -278023 -153224 12798 -58833 -27928 -16577 -258044 -21011 63831 169206
19931 169206 129246 322432 465958 335920 128661 94931 358499 324936 111462 98036
19921 98036 -89262 -162672 -150365 -254441 -256227 -322173 -181398 4395 18953 34497 90877
19910 90877 120190 -3835 655 158320 63484 -112212 -11985 20882 -65890 -145872 -318684
19899 -318684 -376654 -246339 -75631 -138251 -60960 -118570 -103323 174208 473546 705821
19889 705821 693745 501348 308546 -34513 -161436 -19068 -112656 30118 95707 -83994
19879 -83994 -19439 77624 104025 81190 -38037 -191707 -103068 -75053 138238 425644 501614
19868 501614 447652 474012 468853 500470 660363 652657 939250 1100697 1015123 770662 594871
19857E94871k75818J2703K11399N848M2763J08258K38829J00410j70909K1457
19847H89811P8359N1912j07029l80894k40349j41665J47428L83500J96609J83880
19837A061562k49790l64513j68738L7283J717O4555Q7447R5825q5417j01133P480
19826C86278k6165o530R3773M6003J87834l156l5388p8901P1455J32095K92355
19815A059653n3857j47021j34215j07226j93270J19341J54721K15909J50224J04562
19805A168821L207j90161R8301k9675j11053m4910K22663J70215N0487m3177k48588
19794A046130j72700j93579k9768K44829K6467j08564n8128j76283l99849N0674
19784B29229K60018j86519k0394L0744j30467q2120J92832J48513k59653o5268
$$ plain form
19857 594871 319053 331756 543155 549003 591766 700024 938853 1039263 868354 889811
19847 889811 968170 1020082 913053 532159 291810 150145 297573 681073 877682 1061562
19837 1061562 811772 447259 278521 315804 317521 382076 469523 565348 479931 378798 386278
19826 386278 360113 353583 447356 493359 681193 678037 642649 563748 635203 767298 1059653
19815 1059653 1005796 858775 724560 617334 424064 543405 698126 914035 1064259 1168821
19805 1168821 1172028 981867 1080168 1050493 939440 894530 1117193 1287408 1337895 1294718 1046130
19794 1046130 873430 679851 650083 894912 921379 812815 754687 578404 178555 229229
19784 229229 489247 302728 282334 313078 182611 100491 293323 441836 182183 116915
19774A16915r449m5596L108p3194M5434K72522O0982K7064n7414J7598J5038J07523
19762D80531J01552R3389j35420k02060O9725k2125j18889j54626J19635J40067
19752C71779R450m4851J09409K93055M1575j61583j73734l8509Q0030p3766r7995
19741C14860N486j5153J5283k35804j11269N846K9016K8063q0292r4361J76964
19730C8639K6855p680K65123l0551L1251L6649J6640k49263j85415j16091P9657
19719i4186K96229l9289J31613J57641j08175O097j24587m85067O1080L93818
19709A95174Q8763j85513k7293J06513p7737R0948Q4770K18034P0124k84573M399
19698B83609J73451j56073l8452N2811L5306j15587j10701k03337J04943J67497
$$ plain form
19774 116915 107466 61870 64978 -8216 37218 309740 370722 397786 340372 357970 373008 480531
19762 480531 582083 675472 540052 337992 407717 385592 266703 112077 231712 371779
19752 371779 381229 336378 445787 738842 780417 618834 445100 406591 486621 412855 314860
19741 314860 320346 305193 320476 84672 -26597 -20751 8265 36328 -43964 -138325 38639
19730 38639 65494 57814 322937 292386 323637 360286 376926 127663 -57752 -173843 -94186
19719 -94186 202043 162754 294367 452008 343833 349930 225343 -259724 -198644 195174
19709 195174 283937 98424 71131 177644 99907 190855 275625 493659 563783 279210 283609
19698 283609 457060 300987 262535 315346 350652 235065 124364 -78973 25970 193467
19688A93467k7148j48481K8869k6375k21716L1290J13836j66264j24220r9636
19678d46378m0443P0271L31568M55746n6921K8883r7361j03124Q3933k17504q5339
19667g6669J53543J76861j58233q994J46581j24235k79262j11734k0860M64559
19657A61557K70483r9116j51315N7840k0509l65986M8283J54124j7035J2146k0601
19646B9871R2694J50717k19444q5205k4332j22791M680J05905j02049J49305K61683
19635B41034l4904K25849R1000P0530J43213j42274m52350l90767j15607R8528
19625b65748K48293J08632N5701N4203Q3736l3437k20179k8513k71417J66742
19615a01987q2320N0411K80680J82423r0574j39417o0842K48031K40665n1376
$$ plain form
19688 193467 166319 17838 46707 20332 -201384 -170094 -56258 -222522 -346742 -446378
19678 -446378 -486821 -416550 -84982 370764 313843 342726 245365 142241 226174 8670 -76669
19667 -76669 76874 253735 95502 86508 233089 108854 -170408 -282142 -303002 161557
19657 161557 432040 332924 181609 239449 218940 -147046 -98763 55361 38326 50472 29871
19646 29871 122565 273282 53838 -31367 -55699 -178490 -173810 -67905 -169954 -20649 241034
19635 241034 206130 431979 522979 593509 736722 594448 142098 -248669 -364276 -265748
19625 -265748 -17455 91177 146878 201081 284817 251380 31201 2688 -268729 -101987
19615 -101987 -184307 -133896 146784 329207 238633 99216 38374 286405 527070 475694
19605D75694j37659j34964j6284J17269J397K28872J23903J49757k46442n6107
19595E05436L8944o8616r8402L11923j66883o18357J46911K59514j04288J76946
19585C83128J77532j62094j26460j9434r0644r2332J06065Q9781K73379j29534
19575D09387k78166O7450L49070k32055j32079o7599j86298r3602J79339o288
19565I159n5150J39701j50080L62183L80384j93408q6001J56961M06457j07980
19555H62226l38498k59547K22571J04431J01277k9567n1476l7317J84670n333
19545G53437r0029L24611K34792N8002j49727k53951m8553J75051l5881m00545
19535E67207j27249L69495K52927l49433p7899N5821J74993n4163l43876k94722
$$ plain form
19605 475694 338035 203071 186787 304056 305453 534325 658228 807985 561543 505436
19595 505436 544380 475764 377362 689285 522402 -95955 50956 310470 206182 383128
19585 383128 560660 398566 272106 252672 162028 69696 175761 265542 538921 409387
19575 409387 131221 198671 547741 315686 183607 116008 -70290 -163892 15447 9159
19565 9159 -45991 93710 -56370 305813 686197 492789 406788 563749 970206 862226
19555 862226 523728 264181 486752 591183 692460 662893 611417 574100 758770 753437
19545 753437 663408 988019 1222811 1280813 1131086 877135 828582 1003633 967752 567207
19535 567207 439958 809453 1062380 712947 635048 690869 865862 811699 467823 173101
19525A73101j31841o2684K00710M9988p2893K7558K31117K25867m9069j24896
19515D66958M8369j85943P1652L35101K87547k319k28808j54599J7285m2786J5381
19504F27838l2923m6689J37311P3369j18040L5566J17171O4012L8970m8288L9343
19493H87640L6586J01428J82604J54195Q6872Q56j43965j61554o9491k0862j85057
19482H69252j60554J34377j34796K8779n6323j32595j45013L8013L9324l19965
19472A60499j21489J64941L97315j0426j2645k07005j14184K52446m5894o463
19462D57095P1372j14049j39564N4792O7736J62332J24891k37051p3156N9807
19452D34205M217R0285O457K71878O5598k47754P317N6455M7946j27619k14456
$$ plain form
19525 173101 41260 -21424 179286 229274 156381 183939 415056 640923 591854 466958
19515 466958 515327 329384 401036 736137 1023684 1021365 792557 637958 655243 612457 627838
19504 627838 594915 548226 685537 758906 640866 676432 793603 857615 896585 848297 887640
19493 887640 924226 1025654 1208258 1362453 1449325 1450181 1306216 1144662 1075171 1054309 869252
19482 869252 708698 843075 708279 737058 680735 548140 403127 441140 480464 160499
19472 160499 39010 203951 601266 590840 578195 371190 257006 509452 463558 457095
19462 457095 528467 414418 274854 329646 397382 559714 684605 447554 374398 434205
19452 434205 438422 528707 535164 807042 872640 624886 632203 688658 736604 608985 394529
19441C94529n2421J86348N1180k14105J75556L56169N671j00230j67102k40899
19431C94696J31677k06858J17916K80074L33202R9393j37495k13004j01210J08898
19421H07289J61560l2338L1017j5372j40087J24836J9395n8704M1241J16873K9540
19410A085250l181m6486L2177J86518j23333j96498j43471J33329J75359J667
19400A101331n0607j423M6984K41759K9029Q4189J80135j9391j73499j27552K83205
19389A594160R1727J69480K17698J39406J85895K23473L07203M53735K70335J98959
19379C852071L46134L31609J82193K14173M27881M03123K87696o4335J38039K02689
19369F321273O74656J099524J818072K386196L166096M170272N131076N505982
$$ plain form
19441 394529 342108 528456 579636 365531 541087 897256 902927 802697 635595 394696
19431 394696 526373 319515 437431 717505 1050707 1150100 1012605 799601 698391 807289
19421 807289 968849 936511 967528 952156 812069 936905 956300 897596 938837 1055710 1085250
19410 1085250 1082069 1035583 1067760 1254278 1130945 934447 790976 924305 1099664 1101331
19400 1101331 1050724 1049301 1096285 1338044 1367073 1451262 1631397 1612006 1438507 1310955 1594160
19389 1594160 1685887 1855367 2073065 2212471 2398366 2621839 2929042 3382777 3653112 3852071
19379 3852071 4198205 4529814 4712007 4926180 5354061 5757184 6044880 5980545 6118584 6321273
19369 6321273 6995929 8095453 9913525 12299721 15465817 19636089 24767165 30273147
19361C0273147L886179n08688l973185l661165j551982K67132J541927L554350
19353B9827715N672826R173555J3962236K1319884L1482036M3866491N3139395
19346B08444138M9261481J8599089k0500169l3861783l5886820m1751211l8808563
19339A05496162k6108481j3928978n766587P08089O160292R659903R827438L571243
19331H9619081q555441j7088427j6563039j1886963p765202m647145l157915k134609
19323A7820340j695029q79165n79322k45090N8824j01205L31470Q41742Q33304
19314A6385869Q41839J107975J368987K202020L384552M669500O879299J0148758
19306D6988799J3429853J6457277J6437980R702360k176970r215013o421924P18378
$$ plain form
19361 30273147 34159326 33650638 29677453 26016288 24464306 24731438 26273365 29827715
19353 29827715 35500541 44674096 58636332 79956216 111438252 155304743 208444138
19346 208444138 257705619 276304708 255804539 221942756 186055936 144304725 105496162
19339 105496162 79387681 65458703 59692116 60400205 66560497 76220400 86047838 89619081
19331 89619081 81063640 63975213 47412174 35525211 27760009 23112864 19954949 17820340
19323 17820340 16125311 15246146 14666824 14421734 14480558 14379353 14710823 15552565 16385869
19314 16385869 17227708 18335683 19704670 21906690 25291242 29960742 36840041 46988799
19306 46988799 60418652 76875929 93313909 103016269 100839299 91624286 85202362 85920740
19298H5920740P629412J5187845K4960116L6503107M6218479M9296756M0792179
19291C06508634K5618532J2090278j8055341o1384983p2169516n2674780l1744783
19284A08188041j8503742j0814946o014236j802396K167765L947715J953056O09591
19276G9730848K345365L174313k026365j0868136j4314834j1941035q925460p038699
19268C0135997n460958m372728k943427k052896j341701j000061n79112k89116
19260A2095998k79668l98207j81481m29714l83477k20030N6432P39154R94643
19251A1993650J313778K309237L165518M284095N588586O617609O914864O995463
19243D9182800P819259R192735Q255149K897505j183335l34161J322857j630001
$$ plain form
19298 85920740 93550152 108737997 133698113 170201220 216419699 265716455 306508634
19291 306508634 332127166 344217444 326162103 264777120 192607604 139932824 108188041
19284 108188041 89684299 78869353 72855117 71052721 73220486 77168201 79121257 79730848
19276 79730848 82076213 85250526 83224161 72356025 58041191 46100156 37174696 30135997
19268 30135997 24675039 20302311 17358884 15305988 13964287 12964226 12385114 12095998
19260 12095998 11816330 11418123 11236642 10806928 10423451 10203421 10259853 10999007 11993650
19251 11993650 13307428 15616665 18782183 23066278 28654864 35272473 42187337 49182800
19243 49182800 57002059 66194794 74449943 77347448 76164113 75829952 77152809 75522808
19235G5522808o955648o998940l609367q92168q0713N81344J803086L872770O353366
19226F9596538O327534J558577k800161j791711k50873l403702r111643j0408535
19218D9716024q224104p052847o929153o413733m774964l519775k477526j366088
19210H957834j098102j011223r68658o04997p09701k72681m49560k75125j71314
19201C396473j04779k79466l04720k64441n2718k74041j47786j42215j2585j89100
19191A624622j73553L0188J15984j0004j27710j78106j03116j29161k72751N8124
19181H34517J41561K8542Q0681J61044j4923o6708j819k56846N6791K38349N8875
19170A260064j39202j93352O0586j24145Q4179J29468P1198j74044n5413R9816
$$ plain form
19235 75522808 68567160 61568220 57958853 57066685 56985972 57567316 59370402 63243172 69596538
19226 69596538 75924072 77482649 74682488 72890777 72639904 69236202 60124559 49716024
19218 49716024 41491920 34439073 27509920 21096187 16321223 12801448 10323922 8957834
19210 8957834 7859732 6848509 5879851 5274854 4565153 4292472 3842912 3567787 3396473
19201 3396473 3291694 3012228 2707508 2443067 2390349 2116308 1968522 1826307 1813722 1624622
19191 1624622 1451069 1481257 1597241 1587237 1459527 1281421 1178305 1049144 776393 834517
19181 834517 976078 1004620 1085301 1246345 1231422 1164714 1162895 906049 962840 1201189 1260064
19170 1260064 1120862 927510 988096 863951 948130 1077598 1148796 974752 919339 1019155
19160A019155j23907p7444j13969J75149R3928j38597j24204P3056l8656j59480
19150E85031j96557M5480K41614K1356j6112o0265L4247Q8580k7280Q0785j1717
19139G85162j86361j89357j55046p5272P5765K12646J06618K7633K3303o1597
19129E63494j18957K15842o6216j41821k16918j08617K85343K35901J07827j98402
19119E57476j089j25241J16034r6387R3864Q3137j67200j75315q9071P6616J22346
19108C95170k8874M6923m8706R2462k0654p6305J0988m045J873K23281m3507j12884
19096D35722j90082J31133J56462J48432N9543Q0299p7861N5871L31713L960k60008
19085H75184j83590p7665K7420P0931q845j46345k0060J04469q3120J45540N0616
$$ plain form
19160 1019155 895248 817804 703835 878984 972912 834315 710111 783167 744511 585031
19150 585031 388474 433954 675568 696924 680812 620547 654794 743374 716094 796879 785162
19139 785162 598801 409444 254398 179126 254891 467537 574155 601788 625091 563494
19129 563494 444537 660379 594163 452342 235424 126807 412150 648051 755878 557476
19119 557476 556387 431146 547180 450793 544657 627794 460594 285279 196208 272824 395170
19108 395170 366296 413219 364513 456975 436321 360016 371004 366959 368832 592113 548606 435722
19096 435722 245640 376773 533235 681667 741210 821509 743648 799519 1131232 1135192 875184
19085 875184 691594 613929 641349 712280 703435 557090 537030 641499 558379 703919 754535
19074G54535P5587R7550J18539j23665j02065J49342J77455K20978L13079l73001
19064A308334k89697j59609J7152K88622L0165N2251K78039J63193J10222j94155
19054A604517j02206Q3250k0979J47015j15802Q7945L7056J73364L60856K05870
19044B460886R3246J73772L61173L39313M27246K00334L96795N19068P10597P62748
19034F445178Q84140J049460J502506J993536K563756L654694N447238O749516
19026C0290024P898389Q679012R110645J1056127J3575398J3500154R297515N307704
19018A08714968N551781Q032270O491032j336317r150382j0186195o986166n943133
19010I5187858r767140j4471701j3699199j0148176p745629p239202o725298n789816
$$ plain form
19074 754535 830122 927672 1046211 922546 820481 969823 1147278 1368256 1681335 1308334
19064 1308334 1018637 859028 876180 1164802 1194967 1247218 1525257 1688450 1798672 1604517
19054 1604517 1502311 1585561 1564582 1711597 1595795 1683740 1720796 1894160 2255016 2460886
19044 2460886 2554132 2727904 3089077 3428390 3855636 4055970 4452765 4971833 5682430 6445178
19034 6445178 7329318 8378778 9881284 11874820 14438576 18093270 23540508 30290024
19026 30290024 38188413 46867425 55978070 67034197 80609595 94109749 103407264 108714968
19018 108714968 114266749 122299019 128790051 127453734 118303352 108117157 101130991 95187858
19010 95187858 85420718 70949017 57249818 47101642 39356013 32116811 25391513 19601697
19002A9601697l926517k796021k252134j540988r82067q94617n26102m08336l42329
18993E932586k26949j78159j28559R6573k62708M3176Q6356j95395j8298M76078
18983E624701K29385p3531N40944P65823R07433J250815J877519K529859L580067
18974A7233015M252142M854682N610225O464621P435311R095942R167530O485512
18966G0598980L402937L757572N163677M273164m95858n916951o966670n013295
18958F8803556m271557o672952r956109r740350p080229n048351m646308m659368
18950A6728332m329871k723418j757994j445989j139473o13215n16763l93655
18942C807954l91811m92915k60258j13113j31170k74383k66567k16919N8834l01875
$$ plain form
19002 19601697 15675180 12879159 10627025 9086037 8103970 7209353 6683251 6274915 5932586
18993 5932586 5705637 5527478 5398919 5495492 5232784 5275960 5362316 5166921 5148623 5624701
18983 5624701 5854086 5780555 6321499 7087322 7994755 9245570 11123089 13652948 17233015
18974 17233015 21485157 26339839 31950064 38414685 45849996 54945938 64113468 70598980
18966 70598980 74001917 77759489 82923166 87196330 86700472 80783521 73816851 68803556
18958 68803556 64531999 57859047 47902938 38162588 31082359 26034008 21387700 16728332
18950 16728332 12398461 9675043 7917049 6471060 5331587 4718372 4201609 3807954
18942 3807954 3416143 2923228 2662970 2549857 2418687 2144304 1877737 1660818 1719652 1417777
18932A417777j33782j60321n5007k19860j26017K06637J53533p5089j28323J8267
18922H97815K4162L9338r4945J0287N5290k92926k68748j17562J57427R1788q5973
18911D15953j44233J05990J36504k32871P8193L0969o0715k73013r7623Q3396
18901D2550J21826j27579J27564k4483J08538r9366p5584k1699n4928J67748l3893
18890A30694r598J58260N532m0779M6611L140M3814j5339k15691j90375K22329
18879A38598K42900K4083k5678r4050P266N7888j45090P727J43299j05303l12716
18868f1076q917M6348K23979q7925r3899J66057q5329l59647O8577L36250J21997
18857B66415K3465j22286j71993k0599N0384j73049J45453Q0299j92458q9547
$$ plain form
18932 1417777 1283995 1123674 1068667 848807 722790 929427 1082960 1007871 879548 897815
18922 897815 921977 961315 866370 876657 931947 639021 370273 252711 410138 501926 415953
18911 415953 271720 377710 514214 281343 359536 390505 329790 56777 -40846 42550
18901 42550 164376 36797 164361 139878 248416 149050 73466 51767 -3161 164587 130694
18890 130694 121096 279356 284888 244109 290720 293860 337674 322335 106644 -83731 138598
18879 138598 381498 405581 379903 285853 293119 351007 205917 213644 356943 251640 -61076
18868 -61076 -69993 -23645 200334 112409 18510 184567 99238 -260409 -191832 144418 266415
18857 266415 289880 167594 -4399 -24998 25386 -147663 -2210 78089 -114369 -203916
18847b03916J56848J16386o5065K34327K38655K89210j8240M03199O5881n969
18837A211316k14113j64202j15747j59442J3444J33294M4409j85908p5091J30428
18827F18388K17941J07590q1435l30921m61219k61665J19665J455Q8046O5532
18817H3377o5354j66569R9146J73959m2619O7977K00807N0060r9907j37796j05086
18806E7995P8265j0013J0871r3861J44786J09353O0068J02418k1657o1373p4860
18795C01992k9227j37189P2198J07348K11940J45384j29931J3317P8810K06029
18785H40671M8507R2049o599j93365r9384j48347k00569p753J81338j68477J24731
18774D62802K30785J11869K18450J49140J3999M81410K88874K74319P43745O14400
$$ plain form
18847 -203916 -47068 69318 4253 238580 477235 766445 748205 1151404 1217285 1211316
18837 1211316 997203 833001 717254 557812 571256 704550 748959 563051 487960 618388
18827 618388 836329 943919 862484 531563 70344 -191321 -71656 -70201 17845 83377
18817 83377 18023 -148546 -49400 124559 81940 149917 350724 400784 300877 163081 57995
18806 57995 136260 126247 137118 43257 188043 297396 357464 459882 438225 376852 301992
18795 301992 272765 135576 207774 315122 527062 672446 542515 555832 634642 840671
18785 840671 889178 981227 974628 781263 681879 533532 332963 325210 506548 338071 462802
18774 462802 693587 805456 1023906 1173046 1187045 1668455 1957329 2231648 2975393 3589793
18764C589793l51616j143846o95432l47262j64594k17282P1462Q6529j98057j96380
18754D33315k0595P3010j2232q6122K30257n5198J45267J192k3098l3539j25207
18743E27050k9781j08255j83972j52686P0930M04720L9953j91418L2441Q1016
18733D89998j56367k04476o1532n0113k91444L3686j836J81097P7128k8720k81668
18722b94247k39025R8212J57543R4639J34374K09216j49934j79918R0988J48724
18712G0572J79395p3891q8413l341L46485L97961k63383k1477Q664o9108l69276
18701A14188m4226R2407k10904j27419Q2070J64604J28072J30391j22167j79620
18691B7396k67195l977K82611J01775O0853L7214j36340j75016N6296K10279k320
$$ plain form
18764 3589793 3238177 2094331 1398899 1051637 887043 669761 741223 827752 629695 433315
18754 433315 412720 485730 473498 387376 617633 562435 707702 708894 685796 652257 527050
18743 527050 497269 389014 205042 52356 123286 528006 567959 376541 408982 489998
18733 489998 333631 129155 67623 17510 -273934 -240248 -242084 -60987 16141 -12579 -294247
18722 -294247 -533272 -435060 -277517 -182878 -48504 160712 10778 -169140 -78152 70572
18712 70572 249967 176076 87663 84322 430807 828768 565385 543908 552572 483464 114188
18701 114188 69962 162369 -48535 -175954 -93884 70720 198792 329183 207016 27396
18691 27396 -239799 -243776 38835 140610 201463 238677 102337 -72679 -16383 193896 191576
18680A91576Q7288R1065k38420j8236J07849K64443m9613k41622j08653J4146
18670I9823J74308K61876n30239k66005Q4523J73726K05725q2279k59484n7872
18660a95898M81421J93271J28065m45351N3535Q5706k7744j19327j26397O7690
18650I4971K94230l41746j65814K16059Q654j76409m33637K0935L87302k7358
18640a22813k61478k50115Q7581J27114r3626O3476J96218P2582k02572J34599
18630b49034J27098K7996r393j22716k97958J49240M22450R6634k44825J89226
18620H8718L4474p9638j14732m5989L30073K63471k60684k22384j74348m3872
18610b24911K21941M26142L38849O7286k2414J39118J22558R8284J90301q9737
$$ plain form
18680 191576 278864 369929 131509 113273 221122 485565 435952 194330 85677 99823
18670 99823 274131 536007 5768 -260237 -175714 -1988 203737 121458 -138026 -195898
18660 -195898 285523 478794 606859 161508 215043 300749 273005 153678 27281 94971
18650 94971 389201 47455 -118359 97700 106354 -70055 -503692 -482757 -95455 -122813
18640 -122813 -384291 -634406 -546825 -419711 -513337 -449861 -253643 -181061 -383633 -249034
18630 -249034 -121936 -93940 -103333 -226049 -524007 -374767 47683 144317 -100508 88718
18620 88718 123192 43554 -71178 -117167 212906 476377 215693 -6691 -181039 -224911
18610 -224911 -2970 423172 762021 829307 806893 946011 1068569 1166853 1357154 1267417
18600A267417j30657l9401P1786j82296k83197l37162J50976J31238j13551j13921
18590D21232o6563M59720P383p4075j5009o2230J33293j19150r8761J82629K9916
18579G98385j22188j7117J78083l079j25586l61294r9399m3755O7737n7049l11505
18568i6767L27440K22951r7796M3038L0369L4310J972j74031j65394l5534J57996
18557B48554K20026l6609J01197r293n5503k11622j99046o9510l8765L69209J10684
18546D29322K73880K38528l3943j8895j13990N7449K41294k10902j05834J60535
18536I17444K16758p9193k43933J3861L8305m7202J09065J71221j32313k43370
18526G20643j50437l79838o9876L53736L33358n9566r2145L68034R37330O92648
$$ plain form
18600 1267417 1136760 1097359 1169145 986849 703652 366490 517466 648704 535153 421232
18590 421232 354669 814389 821772 747697 732688 670458 803751 684601 585840 768469 798385
18579 798385 676197 659080 837163 834084 708498 347204 247805 204050 271787 214738 -96767
18568 -96767 230673 453624 355828 398866 429235 463545 465517 291486 126092 90558 248554
18557 248554 468580 431971 533168 523875 468372 256750 57704 -11806 -50571 318638 429322
18546 429322 703202 941730 907787 888892 774902 832351 1073645 862743 756909 917444
18536 917444 1134202 1055009 811076 824937 863242 816040 925105 1096326 964013 720643
18526 720643 570206 190368 120492 474228 807586 748020 655875 1023909 1961239 2653887
18516B653887N10670M27143P9062p29283n99893m17771k89832j35217j19782j00444
18506A278540J50071r6700J32453O6257n5978J7328j82489k94310J2118p7440
18496I49850l28810Q8705J20366m2433r8960J54332K19968j91214n2461j55777
18486F63566l45822Q1315J09743j92961l1443N7270J07873J83823J25478M9642
18476H08484K05765J80271N13461m6553l81772j07336J81598j2145o1778q5658
18466A194337J79193M78769N97452N16388O13155N89021L41672l5007r41827j475845
18456B057308o79515l66324j42982m5657j67454J8798J64069L2868J40455O1055
18446A072621K03297J24945j79301l9531q8734r1228R7899k01494k14484k5132
$$ plain form
18516 2653887 3164557 3591700 3670762 2941479 2341586 1923815 1633983 1498766 1378984 1278540
18506 1278540 1428611 1331911 1464364 1530621 1474643 1491971 1309482 1015172 1027290 949850
18496 949850 621040 709745 830111 787678 688718 843050 1063018 871804 819343 663566
18486 663566 317744 399059 508802 315841 284398 341668 449541 633364 758842 808484
18476 808484 1014249 1194520 1707981 1661428 1279656 1172320 1353918 1341773 1279995 1194337
18466 1194337 1373530 1852299 2449751 2966139 3579294 4168315 4509987 4474980 3533153 2057308
18456 2057308 1377793 1011469 868487 822830 655376 674174 838243 871111 1011566 1072621
18446 1072621 1275918 1400863 1221562 1182031 1093297 1002069 1099968 898474 683990 658858
18436F58858L540n1756K3330l6170L5502j73668q6939j70781j09291n0428R8641
18425A40838o6286j68834J17175P8356R4598j12682R5496L14893Q2162J48323
18415G24039J60521L3781J982k99260l44526j84400k47067K77975L55855k4417
18405D54483j08638k9374m2969O4889J00582l69427j62154M2675p154j90436K55462
18394G939L4725l5841J12595q5516K8413R9996J0887M6084m4731R8866j65552
18383A07865n7163P57j8232n5071J46258O7412Q763P056j90124j24929k54552
18372c61960n4181j74882J82925M17067J74222j46728j01495j63943J9918K83169
18362G4112L68585O962k54397j9243N2539m2250k63490l6906L91148J46094k15277
$$ plain form
18436 658858 662398 610642 633972 597802 633304 459636 372697 201916 92625 42197 140838
18425 140838 74552 -94282 22893 101249 195847 83165 178661 493554 575716 724039
18415 724039 884560 918341 920323 621063 276537 92137 -154930 123045 478900 454483
18405 454483 345845 316471 273502 338391 438973 69546 -92608 -49933 -57087 -247523 7939
18394 7939 42664 6823 119418 33902 62315 162311 173198 219282 174551 273417 107865
18383 107865 50702 51459 33227 -21844 124414 191826 200589 207645 17521 -107408 -361960
18372 -361960 -416141 -591023 -408098 8969 183191 36463 -65032 -228975 -209057 74112
18362 74112 442697 449659 195262 176019 228558 186308 -77182 -114088 277060 423154 207877
18351B07877l7069j0831Q0505J3393j06204L4532p3825J06644r3887p8659J72896
18340B15372J25151j91945j20823J54438J92886M85563N3185N9172j3836K7470
18330I86633j0282k18322k14769K16495R1912m6533k79492m3360o581p7620j07960
18319B90121L9146J21210K42627K19696L3888l6748k64951n8225k802k39142j99442
18308A45378P8887M1791k07616k58000Q1653L14043L2841k14134k25993L04575
18298I3425O6201M105Q9643K37796j60598m04789k18506Q4076M26152K77728k9887
18287D65346K33515q7195J91415Q3417l40167k13129K73207K3093o6437K2528
18277E85593J03935j4095k10950j47332O1875L597j63778k60069n4195K95695
$$ plain form
18351 207877 170808 159977 240482 253875 147671 182203 108378 215022 121135 42476 215372
18340 215372 340523 148578 27755 182193 375079 860642 913827 972999 959163 986633
18330 986633 976351 758029 543260 759755 851667 805134 525642 482282 475701 398081 290121
18319 290121 329267 450477 693104 912800 946688 909940 644989 586764 583962 344820 145378
18308 145378 224265 266056 58440 -199560 -117907 196136 228977 14843 -211150 93425
18298 93425 159626 163731 253374 491170 330572 -74217 -292723 -208647 217505 495233 465346
18287 465346 698861 611666 803081 886498 546331 333202 606409 629502 563065 585593
18277 585593 689528 675433 464483 317151 379026 382623 218845 -41224 -95419 200276
18267B00276J30486J90035K73096l6030m45925o9300J65215q8758j98253j5956
18257A04886J35382l794n5790K55498K55140j40598o3913M1150K5495J60114r9127
18246F14443J23450K71542j67982j77939L3380J22968O2229K9086M2433p7053
18236H76557k49481r5873l5343L2060q3490k0028m1571l6365K01410J42950L28684
18225A019510j2884j75956J28241j29355j39678r5989Q3214q3760r1433K33651
18215G35561L01868p1483n07912k88155P8740N4380K67493L42360k23987l07642
18205C81223Q6015J08858m3986Q8884K15129J87975k5848k3158K1898Q7078l73956
18194G10112j31980r5233J80666J67362q238O6186K5366J33653r5909J2109N0246
$$ plain form
18267 200276 330762 520797 793893 757863 311938 242638 407853 319095 120842 104886
18257 104886 240268 236474 180684 436182 691322 550724 486811 527961 553456 713570 614443
18246 614443 737893 1009435 841453 663514 696894 819862 882091 911177 953610 876557
18236 876557 627076 531203 495860 527920 444430 424402 382831 346466 547876 690826 1019510
18225 1019510 1006626 830670 958911 829556 689878 593889 677103 593343 501910 735561
18215 735561 1037429 965946 458034 169879 248619 302999 570492 912852 688865 381223
18205 381223 467238 576096 532110 620994 836123 1024098 998250 975092 996990 1084068 710112
18194 710112 578132 482899 663565 830927 822689 888875 914241 1047894 951985 964094 1014340
18183A014340n1635o0341J632k15224l0543L26354K19763q1297j76067K6693p8408
18172H95267J81730M39667P5257j80136j23857R0693p0480k02399J83284K28775
18162A517801J75681K59862K27632m06261k34476j08559n8159J88677J75085J62132
18152A899415L03101P8431q3455L6286K01203M2296J28582K24711l5536N0393
18142B845427L31194O8944m5235K77573J06938k0507j44465J23611L31400K76954
18132D151834M28779M44885N62541N86900N98505M10300O97253Q09919P29259
18123I420175J164897J568026K234301K243466K740154L786947M669298O340909
18115C4168173R163742J4028851K1778227L2323613M9677659P7355864J04072922
$$ plain form
18183 1014340 962705 902364 903996 688772 658229 984583 1204346 1123049 946982 973675 895267
18172 895267 1076997 1516664 1591921 1411785 1287928 1378621 1308141 1105742 1289026 1517801
18162 1517801 1693482 1953344 2180976 1774715 1540239 1431680 1373521 1562198 1737283 1899415
18152 1899415 2202516 2280947 2197492 2233778 2434981 2477277 2605859 2830570 2795034 2845427
18142 2845427 3176621 3245565 3200330 3477903 3584841 3564334 3419869 3543480 3874880 4151834
18132 4151834 4580613 5025498 5588039 6174939 6773444 7183744 7880997 8690916 9420175
18123 9420175 10585072 12153098 14387399 16630865 19371019 23157966 27827264 34168173
18115 34168173 43331915 57360766 79138993 111462606 161140265 238496129 342569051
18108C42569051J15564070O4508845j01625106j58786252j03797753n4362524
18102A04070331k9165912j7242315j0397247n702331k436036R36024L238373M251625
18094D7552512J676377l717696o207203m281969j816414N16695K547924M781795
18086D1052021P499749J1114057J6746119K5868279L8452253N2411599O1003481
18079B54147558M9563627O9757l7880163l9727808m5647916m8407002l5092469
18072I7025584k0388492r902658l333544J948047P073598R991722R100377M95802
18064I2010436j3855067j9932972j5993891j0358047o472181m015200k394187
18057A8988891j462327j043796q08544q86591r09740o88745P3979M12351L06649
$$ plain form
18108 342569051 458133121 522641966 421016860 262230608 158432855 104070331
18102 104070331 74904419 57662104 47264857 41562526 39126490 40062514 43300887 47552512
18094 47552512 49228889 45511193 39303990 35022021 33205607 33722302 36270226 41052021
18086 41052021 48551770 59665827 76411946 102280225 140732478 193144077 254147558
18079 254147558 303711185 303780942 265900779 226172971 180525055 132118053 97025584
18072 97025584 76637092 66734434 63400890 65348937 72422535 82414257 91514634 92010436
18064 92010436 78155369 58222397 42228506 31870459 25398278 21383078 18988891
18057 18988891 17526564 16482768 15674224 14787633 13877893 13189148 13263127 13675478 13982127
18048A3982127N40565P52887J073661J119956J752473L028541M502369O624033
18040C3376612R470693J3075808J5762485J4271021N359784q074658j2430884
18033G0810861p730994j087394N556282J2896348K1711183L1298904M0072233
18026A73527423M2240712K9293194J6019753O418005l1850694o6943493n7943803
18019A10761097l5948224k0670004j2227491p725571m984040l172617j982796
18012B4050354r28229O70472K328827L250192K943463o97698n918429o875825
18004A8823127m982093k980267j564913r25958m72281o33205j137771j329187
17996D797452r42001l70453O7838k03665k93109o1030k48097k62053j65874m3044
$$ plain form
18048 13982127 14522692 15275579 16349240 17469196 19221669 22250210 26752579 33376612
18040 33376612 42847305 55923113 71685598 85956619 91316403 83241745 70810861
18033 70810861 63079867 61992473 67548755 80445103 102156286 133455190 173527423
18026 173527423 215768135 245061329 261081082 267499087 235648393 168704900 110761097
18019 110761097 74812873 54142869 41915378 34189807 29205767 26033150 24050354
18012 24050354 23122125 23792597 26121424 29371616 32315079 31617381 25698952 18823127
18004 18823127 13841034 10860767 9295854 8369896 7897615 7264410 6126639 4797452
17996 4797452 3855451 3484998 3552836 3349171 3056062 2995032 2746935 2484882 2319008 2275964
17986B275964j1027k18259r7540K80323K80323J16887J54555k89745k66805N6460
17976B281136J95724P79518P08008M90683N61349O825n24627o91712n76441p51605
17966B478858m27217k79665L3993p3704r2615L91991L06995q6230k82972j41884
17956A827550k09106k39526k97103l00977j16242K8317j55733m6484J15079J10975
17946G16750J8523m9148O0635j63992j15658J8645M2916j24880n341J6477J78370
17935E93297K77242K1667l8931j7176K58822K53731m45734k29457M6268N4867
17925G74596J49001K82314L25345M00310M99664P08539N29797J78268j44230l24706
17915C378898p49442r93159n62107l19558k44622n7301o6936J96420L3177p9585
$$ plain form
17986 2275964 2264937 2046678 1949138 2229461 2509784 2626671 2781226 2491481 2224676 2281136
17976 2281136 2476860 3256378 3964386 4455069 5016418 5023243 4498616 3806904 3230463 2478858
17966 2478858 2051641 1771976 1805969 1732265 1639650 2031641 2338636 2252406 1969434 1827550
17956 1827550 1618444 1378918 1081815 780838 664596 692913 537180 490696 605775 716750
17946 716750 735273 686125 746760 582768 467110 485755 528671 403791 398450 414927 593297
17935 593297 870539 892206 853275 836099 1094921 1348652 902918 673461 719729 774596
17925 774596 923597 1205911 1531256 1931566 2431230 3139769 3669566 3847834 3703604 3378898
17915 3378898 2629456 1636297 1074190 754632 510010 452709 385773 582193 615370 535785
17905E35785k85509o7969L54856J07295j48485O2101K3013q0468K5803l8804j43458
17894C44160k23987j1571q662J36080J73570j83954k69944J52753P4453K2581
17884B05479q5690J5630j7951q5042l30748k13694J34048K63976M7081m411K653
17873f8669J74127n573N2223k04325P3519j46341K8275K69811j00466j8677j0649
17862D3255k27683n127p7860P7076O1881R0772J91927J56497q1419N2733k09218
17851G2834L3424o2153q9053O4491j37245j14498N5939J06467J87222k00777n0955
17840a34304Q0811J21094m7430N2194Q8586k57834R1397l0075l28396K7521K34077
17829a02359P8687K99219K91284j69357p6479p0519r9068m0372j01877J2562M3741
$$ plain form
17905 535785 250276 182307 537163 644458 495973 558074 581087 500619 526422 487618 344160
17894 344160 120173 108602 99940 236020 409590 225636 -44308 108445 182898 205479
17884 205479 119789 135419 117468 32426 -298322 -512016 -377968 -113992 -66911 -71322 -68669
17873 -68669 105458 99885 152108 -52217 21302 -125039 -96764 173047 72581 53904 43255
17862 43255 -184428 -189555 -267415 -190339 -128458 -37686 154241 310738 229319 282052 72834
17851 72834 106258 44105 -44948 19543 -117702 -232200 -176261 -69794 117428 -83349 -134304
17840 -134304 -53493 67601 20171 72365 160951 -96883 -5486 -35561 -363957 -336436 -102359
17829 -102359 -23672 275547 566831 397474 320995 250476 151408 111036 9159 21721 65462
17818F5462l32976J21442J38816l5339P5893K6826j28581J40007p5078o0030L6351
17807b7207J1178j33218J0307J5392k7784o4960j4282l2069K11362k18868l9526
17796c09675M2716J61531K34978k7610k61329Q5421J77976l39369j43252N7893
17786c20720o599P3060K23574Q2918j99515l37689O1709J25328K01891K23119
17776A27076R7734o066o5132l04093j46469L6980j14801l26944j04011K67606
17766e38120J57340J66679J00574N1965l428K0464j7292Q6513J0433m6534o3178
17755g4584l2141Q5243o561j33118r5253J52177K45292j46479j28560M9123j95458
17744b80319L4997O7068J97126K372l9034k34946j79903J64374P3585O8094L61456
$$ plain form
17818 65462 -267514 -146072 -7256 -42595 33298 60124 -68457 71550 -3528 -63558 -27207
17807 -27207 -16029 -149247 -138940 -123548 -151332 -216292 -230574 -262643 -51281 -270149 -309675
17796 -309675 -266959 -105428 129550 101940 -159389 -73968 104008 -235361 -378613 -320720
17786 -320720 -327319 -254259 -30685 52233 -147282 -484971 -423262 -297934 -96043 127076
17776 127076 224810 218744 153612 -150481 -296950 -259970 -374771 -701715 -805726 -538120
17766 -538120 -380780 -214101 -113527 -61562 -64990 -44526 -61818 24695 35128 -11406 -74584
17755 -74584 -106725 -21482 -28043 -161161 -256414 -104237 141055 -5424 -133984 -84861 -280319
17744 -280319 -245322 -178254 18872 21244 -17790 -252736 -432639 -268265 -194680 -126586 234870
17733B34870J3537q7868j55779j89100J9468L4145n4867Q1689j7456Q3156j62033
17722b00238k62379j38553L44246O3992l67156P7148J99128M2438j38337k0612
17712d00323L3138K94497K14544Q309O573m6239j76744k25344j2179J55881J67444
17701A9557J84041o6564j48603N4719J69671p4974l0285k1140l5087l38375n8964
17690c46004K28658J42012J39483j56478m05891K42606K65559j81727o1502R8727
17680c4557n8830r0706J79857L66j32989j40365m7844j44766J52032O6721K16210
17669c4871R634l20970J37452L13565j06812m5706j58263j8171L03727j12962
17659c3377J50574O7162o0345N4375m9054K144j15487p1947J02018K05685K56331
$$ plain form
17733 234870 248407 160539 4760 -184340 -164872 -130727 -185594 -103905 -121361 -38205 -200238
17722 -200238 -462617 -601170 -256924 -192932 -560088 -482940 -283812 -241374 -379711 -400323
17712 -400323 -367185 -72688 141856 150165 156738 110499 -66245 -291589 -303768 -147887 19557
17701 19557 203598 137034 -11569 43150 212821 137847 107562 86422 51335 -287040 -346004
17690 -346004 -117346 24666 164149 7671 -398220 -155614 109945 -71782 -133284 -34557
17680 -34557 -93387 -184093 -4236 -3870 -136859 -277224 -325068 -469834 -317802 -251081 -34871
17669 -34871 -25237 -346207 -208755 104810 -2002 -47708 -205971 -224142 79585 -33377
17659 -33377 117197 184359 124014 178389 129335 131479 15992 -55955 46063 251748 508079
17648E08079j51989k7575j33470j93745o2454j7762n7632P7257q5209j16587j31484
17637c92571N5771M3973J86376K48468J94637J52034j21012j61005j3774r1212
17627A01685P9859j82227k25840K3568k65283k4298N6816o6357J12284K71757
17617a18036J17713L06722n9927j03927k66363J55750K09511k54701j49905L7524
17607a25639N2955k67645l3912J80537J92959k07289l4692J18880M2661K09414
17597A28229P1529j28460q0494J32774J16194m7905j54774j05183J05053J29533
17587A66496J83153J00244k34593N810j19002j39610K5022J79223J45709Q8471
17577D00923k73056j15252J25187M1798P0115J91979K6213J30014J94930K49067
$$ plain form
17648 508079 356090 328515 195045 1300 -61154 -78916 -136548 -59291 -144500 -261087 -392571
17637 -392571 -336800 -292827 -106451 142017 336654 488688 367676 206671 192897 101685
17627 101685 181544 -683 -226523 -202955 -468238 -492536 -435720 -502077 -389793 -118036
17617 -118036 -323 306399 246472 142545 -123818 31932 241443 -13258 -163163 -125639
17607 -125639 -72684 -340329 -374241 -193704 -745 -208034 -242726 -123846 -81185 128229
17597 128229 199758 71298 -9196 123578 239772 191867 37093 -68090 36963 166496
17587 166496 349649 449893 215300 221110 102108 -37502 -12480 166743 312452 400923
17577 400923 127867 12615 137802 179600 249715 441694 467907 597921 792851 1041918
17567A041918j75723k51576p3790J16427M7237j7279J26705N9883q0649j27214
17557F65939j21967O8409Q0511l9865J48813J46938j63815m26150k91265k34148
17547a66600l9768k6867J98932J29965K2910J08141J23995o4899j66100k63895
17537a44186m7846J89753K75521M3682k90879j83871j40377J35606J18851p4925
17527a18671p8817L8017k6049k78537K4012J80193K67295J81011J1794J18101
17517C18349j72979j9242J60944j6491K75575K32816Q5406o2204l80261l25996
17507I5917r1320o4920Q9175J49538J03947l9758K6403K49633J49844K63372k2157
17496I09674O2252L1190K112j12926m65054l09976M7052K2288l09933k96285L3148
$$ plain form
17567 1041918 866195 614619 540829 657256 704493 687214 813919 873802 793153 665939
17557 665939 543972 612381 692892 653027 801840 948778 784963 358813 67548 -166600
17547 -166600 -206368 -233235 -34303 95662 118572 226713 350708 285809 119709 -144186
17537 -144186 -192032 -2279 273242 316924 26045 -157826 -298203 -162597 -43746 -118671
17527 -118671 -197488 -159471 -185520 -464057 -440045 -259852 7443 188454 200248 318349
17517 318349 145370 126128 287072 270581 546156 778972 864378 802174 421913 95917
17507 95917 4597 -60323 28852 178390 282337 242579 268982 518615 668459 931831 909674
17496 909674 971926 1003116 1005228 892302 427248 117272 164324 186612 -123321 -419606 -386458
17485c86458Q3329p4765N643K28687K85410q2981k10228k63689K22751P2996j44711
17474b64016j20234J97353K67816J36864l46237j61883j43069K4822J75605L18805
17464H5826r2127K8743n7436k28656K5086Q200k7151K38881M6064l7552p8777
17453h8899P4977K07421J18128R9204q1763l8503K4381L44513L47899M93618N88183
17442B089159L48840K90615n57302r78721n79539k36653j328m2802j77355j5772
17432A39142N6809k603l1394l82334j39306O5685J64293q6640j99501J68299K62210
17421A4660M96333K6251j78615m483l24260j46933Q5311L4443j70251J35552l0777
17410f2769L4300Q5451O6221J6284j17574l1462M9494m1557j97593j5040n8101
$$ plain form
17485 -386458 -303129 -377894 -372251 -143564 141846 58865 -151363 -415052 -192301 -119305 -264016
17474 -264016 -384250 -186897 80919 217783 -128454 -290337 -433406 -408584 -232979 85826
17464 85826 -6301 22442 -34994 -263650 -238564 -230364 -257515 -18634 27430 -10122 -88899
17453 -88899 -13922 193499 311627 410831 329068 290565 314946 659459 1007358 1500976 2089159
17442 2089159 2437999 2728614 2171312 1192591 613052 376399 375071 332269 154914 139142
17432 139142 195951 193348 161954 -220380 -359686 -294001 -129708 -216348 -415849 -247550 14660
17421 14660 510993 537244 358629 354146 29886 -117047 -31736 2707 -167544 -31992 -62769
17410 -62769 -28469 56982 123203 139487 21913 -9549 39945 -1612 -199205 -214245 -272346
17399b72346n9925J32020J49994P0673K1400l09023j30320j7114M1783K35124
17389a37734M17612K9483j01124M5867J86224j71847k14244n1577K3732K3475
17379D9867j88875j15677J99403j00019p6734k24770J35654K5646r8278N4232
17369c39551P9063K58050j15008k4739N7832j67866n00J92051L12594j61067j00624
17358i765k13166k3367r9069o8832J05414L95317L53693k1061k02551j69117j5172
17347C2324j54146j35000J48778J18449M6943p7760J1464L1234k22681j38779
17337c39174K89807O0994N2367K08664k4083J91934J08207l02405j20574l1412
17327I4325j11685k36689J5561J5693j12947J1641J60877J43730N2655l0448Q3361
$$ plain form
17399 -272346 -332271 -200251 -50257 20416 41816 -267207 -397527 -414641 -372858 -137734
17389 -137734 279878 309361 208237 254104 440328 268481 54237 2660 26392 49867
17379 49867 -139008 -254685 -55282 -155301 -232035 -456805 -321151 -295505 -393783 -339551
17369 -339551 -260488 -2438 -117446 -142185 -84353 -252219 -252719 -60668 251926 90859 -9765
17358 -9765 -222931 -246298 -345367 -414199 -308785 86532 440225 419164 216613 47496 32324
17347 32324 -121822 -256822 -108044 10405 57348 -20412 -8948 22286 -200395 -339174
17337 -339174 -49367 11627 63994 272658 248575 440509 548716 246311 125737 94325
17327 94325 -17360 -254049 -238488 -222795 -335742 -324101 -163224 -19494 33161 2713 86074
17316H6074J98558Q7408j44453k24806k77062R7894j0156j11884J13422J30293
17306e4712j04224M8239N6538j14190k06143m9565P8971J47343J50284q7780k0915
17295a56154k12652j71970M02546L32957j80091M2076n5957k44224k46693Q2044
17285d08118L2698J43880Q301O724J98407O3840J1493m28109j96585J96198o8126
17274d39397R661L8043K98625J18913p6173j06542j64686O1875J12704J15554
17264c1423l4532m8387J54454Q9055n6349M6357L9598q9817K1966J90812J17199
17253C98933l70876k17106P5910p3627J09650J02305j72590j97690k1663j28951
17243d95705Q7149J82427K76767J82090j61805j34916l10580j4431K53211K64042
$$ plain form
17316 86074 284632 372040 227587 2781 -274281 -176387 -186543 -298427 -185005 -54712
17306 -54712 -158936 -110697 -54159 -168349 -374492 -424057 -345086 -197743 -47459 -135239 -156154
17295 -156154 -368806 -540776 -138230 194727 14636 56712 755 -243469 -490162 -408118
17285 -408118 -375420 -231540 -223239 -216515 -18108 45732 57225 -370884 -567469 -371271 -439397
17274 -439397 -429736 -391693 -93068 25845 -50328 -156870 -321556 -259681 -146977 -31423
17264 -31423 -65955 -114342 40112 129167 72818 119175 158773 68956 90922 281734 398933
17253 398933 28057 -189049 -113139 -186766 -77116 25189 -147401 -345091 -366754 -495705
17243 -495705 -408556 -226129 50638 232728 70923 -63993 -374573 -389004 -135793 128249
17233A28249k87074o2127o5356j13509j43602K8153J85318J03977p2731K02333
17223i6369K62557m2610N400j22961l43886j62421K38952J52585M0851j52824
17213b20726j93204K32872K20827j00441K30601n9009r4968j77295N9863K13852
17203A12372q3193r5898O1162k05490O9761L2363k17647M8876P4782J9830q7643
17192b70725J03650J74868L02955m6167l87571j96915K47462J45739j02546J89860
17182A60610P8372j9923m2873k36995k20340l9683J28939j17135l5466J21173
17172b23321J62664j70600j28814J96825J73717o7221p5063p8589p4896M199O4903
17161b16196k58176q7274R7546M46235j09834j16158j42431J46935J88664M3285
$$ plain form
17233 128249 -158825 -220952 -286308 -399817 -543419 -515266 -329948 -225971 -298702 -96369
17223 -96369 166188 123578 128978 6017 -337869 -500290 -261338 -108753 -67902 -220726
17213 -220726 -413930 -181058 39769 -60672 169929 110920 15952 -161343 -101480 112372
17203 112372 29179 -66719 -5557 -211047 -141286 -108923 -326570 -277694 -202912 -183082 -270725
17192 -270725 -167075 7793 310748 264581 -122990 -319905 -72443 73296 -29250 160610
17182 160610 238982 219059 176186 -60809 -281149 -320832 -191893 -309028 -344494 -223321
17172 -223321 -60657 -231257 -360071 -163246 10471 -56750 -131813 -210402 -285298 -281099 -216196
17161 -216196 -474372 -561646 -464100 -17865 -127699 -243857 -386288 -239353 -50689 -7404
17151g404m0353o5640K72740r3112j05711J46280M9617q7082o515k30704r2451
17140b60335k10486m5610l5350k9432J22814J91065N1942J7652K41938L58J26228
17129A70784m4657j51004l4288Q0537j26777k25955k25479o2986J29338n0011
17119e40498p4047J33360L88183j07835k20625j5800L27456J95896J82925K326
17109B71341j77895J1719N9472k5421O8505j17072j9441J6727k11884n1530j2174
17098a87653J43075J2686R9627k16889j27399L3572J35217R1775J96371L607q7913
17087I6076L2135O5931o6236j99498j68396J63248N9132r6422o5957o5419J28195
17076a17211k0521l9742J64567Q7514k00676k87734J20561M61262Q3868j28173
$$ plain form
17151 -7404 -47757 -113397 159343 66231 -39480 106800 156417 69335 62820 -167884 -260335
17140 -260335 -470821 -516431 -551781 -581213 -458399 -267334 -215392 -197740 44198 44556 170784
17129 170784 126127 -24877 -59165 21372 -105405 -331360 -556839 -619825 -490487 -540498
17119 -540498 -614545 -481185 -93002 -200837 -421462 -437262 -109806 86090 269015 271341
17109 271341 93446 105165 164637 139216 207721 90649 71208 87935 -123949 -175479 -187653
17098 -187653 -44578 -31892 67735 -149154 -276553 -242981 -107764 -15989 180382 183989 96076
17087 96076 128211 194142 127906 -71592 -239988 -76740 -17608 -114030 -179987 -245406 -117211
17076 -117211 -137732 -177474 -12907 74607 -126069 -413803 -293242 168020 251888 123715
17066A23715M4920k87565k21386P8956K19421R8200o5717J15513p8400l7749N464
17055d628J0676N5531J09301Q6420N5656j46130l59559j25183j11407q4238K29696
17044b83865K99088J37906m7514j42335j48154O7548l4898J89109P045p8086J1246
17033b2910N7616K4603k2700k10314j14726K71503N8818j25196j23076m4901P4582
17022a76701l012n0743l5953J68995j34956O0717q5156k5898o9257R8374J70036
17011h3554P6165m9258J10710K94056k6304j55261q755k1634j90879k69970N3430
17000b71254K24408M31550J67230k45232k43304j16112J74389o4344k44598J21976
16990f5291j62397O7920P387m8801K2490n7331j22422M8713O0568Q4187J63622
$$ plain form
17066 123715 168635 -118930 -340316 -261360 -41939 56261 -9456 106057 27657 -10092 -4628
17055 -4628 6048 61579 170880 257300 312956 166826 -192733 -317916 -429323 -513561 -283865
17044 -283865 15223 153129 105615 -36720 -184874 -117326 -152224 36885 43930 -34156 -22910
17033 -22910 34706 59309 36609 -173705 -288431 -16928 41890 -83306 -206382 -251283 -176701
17022 -176701 -179713 -230456 -266409 -97414 -232370 -171653 -256809 -282707 -351964 -253590 -83554
17011 -83554 -7389 -56647 54063 348119 321815 166554 157799 136165 -54714 -324684 -271254
17000 -271254 -46846 384704 551934 306702 63398 -52714 121675 57331 -187267 -65291
16990 -65291 -227688 -159768 -152381 -201182 -178692 -236023 -358445 -309732 -249164 -164977 -1355
16979a355J27842j05816l08912J07423J40650n7202J11905l7004m5337r0228j79567
16968c37601j08053l4811K26769J90945L72295J07666k96736p4313k05741O3396
16958i6184J14828k4736J33496J09156J0604k43129j47096J54930j11444r0r6744
16947a96409Q3184j40327k6655m2476L5328L70242Q541J13571K422J3517k00572
16936B0366j97947O0802R7629j11606Q7681K0523J3793P8245K43079K19963o7916
16925D64612j51026j10288k27908j93765o1013p7516K53641r509J05342R0870
16915H3440K0248o4237l8780K37496J80357J09624m37028l5418P9766J31356k56633
16904A0191j06116M00541K04123o0470o3379r0212J8964O9727l82115M1366j55851
$$ plain form
16979 -1355 126487 20671 -288241 -180818 -40168 -97370 14535 -22469 -67806 -158034 -337601
16968 -337601 -445654 -480465 -253696 -62751 309544 417210 120474 46161 -159580 -96184
16958 -96184 18644 -6092 127404 236560 247164 4035 -143061 11869 -99575 -99665 -196409
16947 -196409 -113225 -253552 -280207 -322683 -287355 82887 91428 204999 207421 220938 20366
16936 20366 -177581 -116779 -19150 -130756 -43075 -22552 -8759 69486 312565 532528 464612
16925 464612 313586 203298 -24610 -218375 -279388 -356904 -103263 -112772 -7430 83440
16915 83440 103688 39451 671 238167 418524 528148 91120 55702 135468 266824 10191
16904 10191 -95925 304616 508739 448269 384890 294678 313642 383369 1254 42620 -113231
16893a13231J40559J5723l55706j26567R8764O0041J58879l4695j19867j3163
16883b89263K45699J97511j57079j77589o8973J15509o3671K7958j1648J58177
16873b3369J05033j63582j25303J03167Q8028k3767L21824K29835k0231p0230
16863D21405j79287p6657k08137m0628K5964J12254M8688r4238o4632j34708J98074
16852H098j22009j60496K29445l3986M942K15583n7504j39224J45070N3401m4958
16841I8362o8804J79589J81220R7250p3055J8961l25600j15230k4921j80114m7606
16830b59948O3108R4526j1406O5874M0772N6421j33509l5091j37986N15J88538
16819f8186J20905j08517n1520o7693J03100P5453J15985n3544j93614j08203
$$ plain form
16893 -113231 27328 43051 -312655 -439222 -340458 -280417 -121538 -156233 -276100 -289263
16883 -289263 -43564 153947 -3132 -180721 -249694 -134185 -197856 -169898 -181546 -23369
16873 -23369 81664 -81918 -207221 -104054 -16026 -39793 282031 511866 491635 421405
16863 421405 242118 165461 -42676 -83304 -57340 54914 103602 9364 -55268 -189976 8098
16852 8098 -113911 -274407 -44962 -78948 -74006 141577 84073 -55151 89919 143320 98362
16841 98362 29558 209147 390367 487617 414562 433523 107923 -7307 -32228 -212342 -259948
16830 -259948 -196840 -102314 -113720 -47846 -7074 49347 -84162 -119253 -257239 -256724 -68186
16819 -68186 52719 -55798 -107318 -175011 -71911 3542 119527 65983 -127631 -235834
16809b35834p3051q2545J92732Q3844k11048N3746K19611j15464Q7552J92590
16799A12133k7787o0594R0207J67765j72480r7278J92489K1098J32015J42324
16789D99892l7914k67309j59261j225Q3195p1953j43722n9721j47510J24449M1439
16778a39640r9443J42440K94694J33398j52418p3037J22648p5054Q9657K23631
16768D66876j5468j57663J70809q3907m08215j95590K41539K17457j42878k5554
16758F7406k3455K387j40922r0537J21605J18442R9623Q6060K8127j37261j16288
16747A5187j05918j80388p9644K54172J13454j30241j73181o8583L84630J28426
16737A57914j16482j10406k83947J60810j41708p7801K55616K65605N599m7410
$$ plain form
16809 -235834 -308885 -391430 -198698 -114854 -325902 -272156 -52545 -168009 -80457 112133
16799 112133 84346 23752 113959 281724 109244 11966 204455 225553 357568 499892
16789 499892 461978 194669 35408 34183 117378 45425 -98297 -158018 -305528 -181079 -139640
16778 -139640 -239083 -96643 198051 331449 179031 105994 228642 153588 243245 466876
16768 466876 451408 293745 464554 380647 -27568 -223158 18381 235838 92960 67406
16758 67406 43951 46338 -94584 -185121 -63516 54926 154549 240609 268736 131475 15187
16747 15187 -90731 -271119 -350763 -96591 16863 -113378 -286559 -355142 29488 157914
16737 157914 41432 -68974 -352921 -192111 -333819 -411620 -156004 109601 115200 67790
16727F7790r4942n2151R7106Q8222j56552l80537Q3145J98532N6342L9490j7451
16716g1006J05859J3183p1135j56754P5990Q9521m4606j28020O7454r3669J02147
16705a11036J25410J30631p7598N1854j72330j53625j70856K68969K80195l330
16695A68284j87417L6678R2737l6618n2174L28837l1175l15575j81127J56601
16685b0949P3298n1681M0832P8794R9987k01100k72994N7123K38178j08385J73053
16674A06156P4729m23802o5850N8274J62043J11142r1772K42210j69532p3468
16664f9870Q6276k51258p0597Q599J45854j70150n829J06186R8003M5072J18899
16653D1185R4910j46344P6675M8023m5316k40745p7923J82001J63228K2056q6387
$$ plain form
16727 67790 -27152 -79303 17803 106025 -50527 -431064 -347919 -149387 -93045 -53555 -71006
16716 -71006 34853 48036 -23099 -179853 -103863 -14342 -58948 -186968 -119514 -213183 -111036
16705 -111036 14374 145005 67407 119261 -53069 -206694 -377550 -108581 171614 168284
16695 168284 -19133 17545 110282 73664 21490 350327 319152 3577 -177550 -20949
16685 -20949 52349 668 41500 120294 220281 19181 -253813 -196690 41488 -66897 106156
16674 106156 180885 -242917 -308767 -250493 -88450 22692 -69080 173130 3598 -69870
16664 -69870 16406 -234852 -305449 -296850 -150996 -321146 -326975 -220789 -122786 -77714 41185
16653 41185 136095 -10249 66426 114449 69133 -171612 -249535 -67534 95694 117750 31363
16642C1363j8601R1920l00926O4089J24937j21701R29K1859Q9086j17585j91049
16631c25679m3194P3149r4067M730j59395R7606L14593K8806J32780J53555j10415
16620G2469K572j96574j58345K72778J30631K12660K8010q3541j62707j19356
16610a403j20780m4292K57683J00539J9562K97169l08047l27053j6890O7500J13264
16599C7252P4492R1756q7840O9705L9864o8101j45974n8653j247j17528r229M1020
16587a34483q3611l7532L23687K52302j44348j11102j28250K1220Q8188L7292
16577H3363j92212j4487J77113J61856O0973j01304j66859J06857k63739j81937
16567c30376k01041L745J12598N977J6565K94990L02703J13322j1848j02192O8197
$$ plain form
16642 31363 12762 104682 -196244 -132155 -7218 -128919 -127990 -106131 -17045 -134630 -325679
16631 -325679 -368873 -295724 -389791 -385061 -544456 -446850 -132257 -103451 29329 182884 72469
16620 72469 75041 -121533 -279878 -7100 123531 336191 364201 280660 117953 -1403
16610 -1403 -122183 -166475 91208 191747 211309 508478 200431 -126622 -143512 -76012 37252
16599 37252 111744 203500 115660 185365 225229 157128 11154 -47499 -48746 -166274 -175503 -134483
16587 -134483 -218094 -255626 68061 320363 176015 64913 -63337 -42117 46071 83363
16577 83363 -108849 -123336 53777 215633 276606 175302 8443 115300 -148439 -330376
16567 -330376 -531417 -527672 -415074 -409097 -392532 -97542 205161 318483 306635 204443 272640
16556B72640J88315p5454k15920r6091P8881J60415k97036O0777N5852j69471
16546c7092O6780j02997j59883J88147L27481j21486k11875M1459L2425q3010
16536f0051N7366j44071j69898J02515L41167q131k10045j77984J62050L9962
16526f7120j04841J32140M4588k3604J51468O0937K1531j03410p9257j02237L6203
16515c3602J03762j1174j00763K72060R7240l23302N7222K01145j92924m4661
16505B5003M7217j0344j66522O7900K27942L15119r0132l90658o9931J00670m8703
16494G561j9456j01655j88765j20184J34044j79711M626J45385q3450L3749R5457
16483b72399j80233K39459Q6218q9248J30733J06330o9011l10021l9023M1572
$$ plain form
16556 272640 460955 385501 169581 73490 152371 312786 15750 76527 132379 -37092
16546 -37092 29688 -73309 -233192 -45045 282436 160950 -50925 -9466 22959 -60051
16536 -60051 -2685 -146756 -316654 -214139 127028 118897 -91148 -269132 -107082 -67120
16526 -67120 -171961 -39821 4767 -18837 132631 193568 215099 111689 32432 -69805 -33602
16515 -33602 70160 58986 -41777 230283 327523 4221 61443 262588 69664 25003
16505 25003 72220 61876 -104646 -36746 191196 506315 416183 25525 -44406 56264 7561
16494 7561 -11895 -113550 -302315 -422499 -288455 -468166 -463540 -318155 -401605 -367856 -272399
16483 -272399 -452632 -213173 -126955 -216203 -85470 20860 -48151 -358172 -397195 -355623
16473c55623J79443K45164J59074J53592j08553j73440j641p5186Q0647J58234
16463B61711j11082j07679L3400J30648J35375Q0905j70465k63011o3062l30948
16453d04208k29993K28548K26926K7806j37336J81169M7967J04747o9764r2502
16443a16640K0855J54312J38145J59401Q2827k65566l39550j74423p862K2448
16433c26053K97769K42922N6764j62378K9415N8334k40108j265k02151j28885
16423c75636R7518r1004M6901O9785N2220K29768P0079m1804l4019j28238N1545
16412e2885p5463r5968k7265K36340J48508N5907j43724N9895j7374l13065K71765
16401D6671K28057l21136j85976p47L95840N0700q0001j29108R408m4527P4610
$$ plain form
16473 -355623 -176180 68984 228058 381650 273097 99657 98016 22830 103477 261711
16463 261711 150629 42950 76350 206998 342373 423278 252813 -10198 -73260 -404208
16453 -404208 -634201 -405653 -178727 -150921 -288257 -107088 -59121 45626 -24138 -116640
16443 -116640 -95785 58527 196672 356073 438900 173334 -166216 -340639 -348501 -326053
16433 -326053 -28284 214638 271402 109024 138439 196773 -43335 -44600 -246751 -375636
16423 -375636 -278118 -369122 -322221 -252436 -200216 29552 99631 57827 23808 -104430 -52885
16412 -52885 -128348 -224316 -251581 -15241 133267 189174 45450 105345 87971 -225094 46671
16401 46671 274728 -46408 -232384 -233131 162709 213409 133408 4300 13708 -30819 43791
16390D3791M5781J18734N8617k17387k14158j29683j51490M3085L30553j41379
16380b13536j5518J59531J25940Q2273M4294J3429k7681J36468l0904j51072j35115
16369a1891J8272J64379j91723O3501J16918q6749l4477m3212j52126q3317J12553
16358a27872r4467j60889J41714K96871J31109q5847j40085p7040K0827k4029
16348a19708j29456J49904K49840J09087j21798k55887k70569J96002K35607R123
16338E2145J6111O4268q9545j13289M4142j43343j04170k50284o4846K18904N3966
16327c15941j25309p591K33603O3284J2477K59011J20540j75124k50906k17581
16317d03537K72383m5500J64079K87789J06354l70595j40645Q1216J24843j02868
$$ plain form
16390 43791 89572 208306 266923 49536 -164622 -294305 -445795 -402710 -72157 -213536
16380 -213536 -229054 -69523 56417 138690 182984 196413 168732 305200 274296 123224 -11891
16369 -11891 6381 170760 -20963 42538 159456 72707 38230 -4982 -157108 -240425 -127872
16358 -127872 -222339 -383228 -241514 55357 186466 100619 -39466 -116506 -95679 -119708
16348 -119708 -249164 -99260 150580 259667 137869 -118018 -388587 -192585 43022 52145
16338 52145 68256 132524 42979 -70310 -26168 -169511 -273681 -523965 -588811 -369907 -315941
16327 -315941 -441250 -448841 -215238 -151954 -139477 119534 240074 64950 -185956 -403537
16317 -403537 -131154 -176654 -12575 275214 381568 10973 -129672 -48456 76387 -26481
16307b6481q0241n4006k08465R1631M460J05559J52339j20987l99644k75805J13209
16296f98431K43349K78633K54586j791k8567j25148L3527o2851n5526J08975K05525
16285A52281r8538K973K2025j10895R8003K20024l8182j98385j75817j01992J5623
16274b12880J44819J20452J50335J6285O842m0291j63092j10176k3997J52012
16264D0309j63782j38685p0873P6239K39936m9604J07849J7616J30795J98409
16254C88209l0196k77261k00936l3790J10431j6902j3387P0295J13412n1710n7242
16243I23p1470J08189p5718L0833k00015J71127J80753q7372K3188m1803j00541
16232f1906j05423P9259J15904j82913m2022K70771L9686k51717n1928J79612
$$ plain form
16307 -26481 -106722 -160728 -369193 -277562 -273102 -167543 -15204 -136191 -535835 -811640 -698431
16296 -698431 -455082 -176449 78137 76346 47779 -77369 -43842 -106693 -162219 -53244 152281
16285 152281 53743 56716 78741 -32154 65849 285873 247691 49306 -126511 -228503 -212880
16274 -212880 -68061 52391 202726 219011 225853 185562 22470 -87706 -111703 40309
16264 40309 -123473 -262158 -333031 -256792 -16856 -66460 41389 59005 189800 388209
16254 388209 358013 80752 -120184 -153974 -43543 -60445 -73832 -3537 109875 58165 923
16243 923 -70547 37642 -38076 -7243 -207258 -36131 144622 57250 80438 38635 -61906
16232 -61906 -167329 -88070 27834 -155079 -197101 73670 113356 -138361 -190289 -10677
16222a0677L52656J37840j19766k20637J14234o1136j6980k76735j46077Q8954
16212a58324J14205J66790q1455j70138j0321K22790R7955Q5322j8373K4039j00021
16201A72469j90289J88036M4040M4686j2171J83889k07703k43381k15962p2084
16191c08470N6069p2947P7097K09079n5564p5143j02426O1202J76170J20500p742
16180G7825J13275J64695J03827L810l08571k08290J74431J51171j51788j45792
16170b5407m6898n8518J80729R6190p3418Q2153j58227j51919J34598j57278k10119
16159c88114J77654J17040J30094j46075j78697N6877J16852Q7514L3889N5842
16149F2876r3696k34839j16828K22193K59571J7384l02188J1892L2903P1843o5488
$$ plain form
16222 -10677 341979 479819 360053 139416 253650 192514 175534 -101201 -247278 -158324
16212 -158324 -44119 122671 41216 -128922 -139243 83547 181502 266824 248451 272490 172469
16201 172469 -17820 170216 214256 258942 246771 430660 222957 -20424 -236386 -308470
16191 -308470 -252401 -325348 -248251 -39172 -94736 -169879 -272305 -211103 -34933 85567 77825
16180 77825 191100 355795 459622 463432 154861 -53429 121002 272173 120385 -25407
16170 -25407 -72305 -130823 49906 146096 72678 154831 -3396 -155315 -20717 -177995 -388114
16159 -388114 -210460 -93420 36674 -109401 -288098 -231221 -114369 -26855 7034 62876
16149 62876 -30820 -265659 -382487 -160294 99277 116661 -185527 -173635 -140732 -68889 -134377
16138a34377K8647J90200q0168k30754q9341Q9386j64766r2011J61298l2632j90382
16127e44900r3064L49275J75259J1647J76136J92088P1185j81192m19793O444
16117b56915K73205O973m7855r0365M8728J10106j75146m5867k58311j83402L94872
16106b23977L82865j4375j65629j69058q324q6147P4352r5370j32304J76397L30146
16095F8576M3652k12785k46052p6701p2104K13825J92417K05511L6077K4945K68778
16084D46139J50615n1855j2670j00083k81474l30160J4365j03715J6038L4239
16074b18561q3400l8406J26011J63404J77105K9901K5416k04983j89013j27400
16064c39926k68889j15685J74962K21095L81853l4544j8542j98504K3584J3739
$$ plain form
16138 -134377 -105730 84470 4302 -226452 -315793 -226407 -391173 -483184 -321886 -354518 -544900
16127 -544900 -637964 -288689 -113430 -101783 74353 266441 337626 156434 -263359 -256915
16117 -256915 16290 23263 -24592 -114957 -66229 43877 -131269 -177136 -435447 -618849 -223977
16106 -223977 158888 144513 -21116 -190174 -198498 -284645 -210293 -305663 -437967 -261570 68576
16095 68576 112228 -100557 -346609 -423310 -495414 -281589 -89172 116339 152416 177361 446139
16084 446139 596754 544899 532229 432146 150672 -179488 -165123 -268838 -252800 -218561
16074 -218561 -301961 -340367 -214356 -50952 126153 156054 181470 -23513 -212526 -339926
16064 -339926 -608815 -724500 -549538 -328443 53410 18866 324 -198180 -174596 -160857
16054a60857k96336J78205N5908r5433N9179L28589j00260q5915r9169l2502J44579
16043a04012K5065K11892Q0393m5648j99192j66615L1451J87896j24280p3745
16033a76795M3286R8638J78106N8029p4894l55991l659O4666J4775L872J31325
16022a8642J49612l83046j85273J01438M9174k0423k469J55805j6606N7408K40964
16011A27942N9280j55503p430K7734k91804N7171K25628p7387j95617n8294K280
16000b86000J82053q2506J30984j4684J53678K8637n4600j86764l0430K47766
15990H8134O0725j51742n3228J64J7202M28708N7549m07974l35681R5872R1951
15979a08320J63189K38780p4650l51262O1466L8709n5242L1008J33859r7620k94169
$$ plain form
16054 -160857 -457193 -278988 -223080 -318513 -259334 69255 -31005 -116920 -216089 -248591 -104012
16043 -104012 -78947 132945 213338 167690 -31502 -198117 -166666 21230 -103050 -176795
16033 -176795 -133509 -34871 143235 201264 126370 -229621 -233280 -168614 -153839 -149967 -18642
16022 -18642 130970 -252076 -437349 -335911 -286737 -307160 -309629 -153824 -170430 -113022 127942
16011 127942 187222 31719 24289 52023 -239781 -182610 43018 -34369 -229986 -288280 -286000
16000 -286000 -103947 -186453 -55469 -70153 83525 112162 57562 -129202 -159632 88134
15990 88134 148859 -2883 -56111 -55947 -38745 389963 447512 39538 -296143 -200271 -108320
15979 -108320 54869 293649 218999 -132263 -70797 -32088 -87330 -56322 77537 -20083 -314252
15968c14252N4745J33694K73375J70836Q3495j30666q6520j14293J2784j07310
15958b4112l9607K41098k6839M637O9549J00317j2055j01953oR0604q8335j07402
15946A05896J19444O2722O4236Q7829J21346Q465j06448m43122j53368K65798
15936A32798J92579J21356J5648J1420r8120j05420o9175J82642J03318m9251
15926D37795k86346j58251K4829J37977J02449R1562j73166m43502J14550n8261
15916b10364K22770j902o9793k32031r3890L58464J19889Q1858m2077j10228K02476
15905B25172K40771k16510m22182k91235q4746M49312K88689N2889l55402l22359
15895d35601l29800J76597j052O0165J81977K73777J19421Q627m0736J03741k34669
$$ plain form
15968 -314252 -259507 -125813 147562 318398 401893 271227 184707 70414 83198 -24112
15958 -24112 -63719 177379 150540 155177 224726 325043 312988 211035 211029 301633 213298 105896
15946 105896 225340 288062 352298 440127 561473 569938 463490 20368 -133000 132798
15936 132798 325377 446733 462381 473801 375681 270261 201086 383728 487046 437795
15926 437795 151449 -6802 18027 156004 258453 350015 176849 -266653 -152103 -210364
15916 -210364 12406 10504 -59289 -291320 -385210 -26746 93143 175001 132924 22696 225172
15905 225172 465943 249433 -172749 -463984 -548730 -99418 189271 242160 -113242 -435601
15895 -435601 -765401 -588804 -589856 -529691 -347714 -73937 45484 54111 13375 117116 -117553
15884a17553j08765k03628K9710K72494J07315J63002J22883k2896k92816r529
15874e9783p6193K07031J23109j90878k47741j12909K8986j50265k7622K37957
15864b68308O5640K7608L9582l001K9157p9603m2874K04195L4670Q549J00569
15853A16184J17053K22561k08920j36824k45931j51260N2950P4464J67584J96948
15843B04809n1269J61562l131j65990q1350M4359j25758k253K40124J17701N1909
15832C90713k63046j08819k01284j9357j3228j73968K79193J29323k08819J57828
15822c1464J60032j76843l26480j11992M4460K60840J52419n208q8141j33702
15812b56079q9386J16334J86776K66452L9676j8612n7685l7443j72819m5617K29069
$$ plain form
15884 -117553 -226318 -429946 -400236 -127742 -20427 142575 265458 242562 -50254 -59783
15874 -59783 -135976 71055 194164 3286 -244455 -357364 -328378 -478643 -506265 -268308
15864 -268308 -202668 -175060 -135478 -138479 -109322 -188925 -231799 -27604 7066 15615 116184
15853 116184 233237 455798 246878 110054 -135877 -287137 -234187 -159723 7861 204809
15843 204809 153540 315102 311971 145981 64631 108990 -16768 -19021 221103 338804 390713
15832 390713 127667 18848 -182436 -201793 -215021 -388989 -109796 19527 -189292 -31464
15822 -31464 128568 -48275 -374755 -486747 -442287 -181447 -29028 -34236 -122377 -256079
15812 -256079 -345465 -229131 -42355 224097 263773 245161 187476 150033 -22786 -68403 160666
15801A60666J1775J58719j0193r0976m1263L0580J96390J56875j36641J19515
15791E55447j41096K4065r3556l00823j10888j06625K0476J23912J6221L58951
15781C46084R6002k43507l22834j10920J90121P1635k1796J11443L6329p4001
15771G8556n9474J99622L43843j2330q6874M4509n8994j03824k80755q0068K9089
15760A3300l6149L0362q8470j05848m7060J00896K00426P0401j06575j19094J75782
15749H7971o8905m3095J41553k4806p6268q8850j64913Q9927M0529k8531k57620
15738c93008m08182k04397K03178O7692K48164P9475J52051J52797j92014K03037
15728i1207J22104j51798j21217m56359L64375K76698R7126J86253K20536J32799
$$ plain form
15801 160666 172441 331160 320967 229991 188728 219308 415698 572573 435932 555447
15791 555447 414351 438416 344860 44037 -66851 -173476 -153000 -29088 -12867 346084
15781 346084 442086 198579 -124255 -235175 -45054 26581 4785 116228 152557 78556
15771 78556 19082 218704 562547 550217 463343 507852 448858 345034 64279 -15789 13300
15760 13300 -22849 7513 -80957 -186805 -233865 -132969 67457 137858 31283 -87811 87971
15749 87971 19066 -24029 117524 92718 16450 -72400 -237313 -147386 -106857 -135388 -393008
15738 -393008 -801190 -1005587 -802409 -734717 -486553 -407078 -255027 -102230 -294244 -91207
15728 -91207 30897 -120901 -242118 -698477 -334102 -57404 39722 225975 446511 579310
15718E79310P3306l79174m35818o468J27035q4041l28130k6792Q2317J23436J99309
15707g5710L75176P8374k72112m81843k61124K41982K04128J68444J54677k29373
15697i7381K23224K95101k49966j37979j68491j77551q5367p4815j6704L69602
15687a20327K67366q648o252j40348k49576J19099J86875J15702k4826j4246M3371
15676A68190O8960j65021j8773l635k7101J63424k6542j35098N6188K21720L334
15665C05646p4483l6563m4669p7035k93435j37597P8158J00126M8396N764J00714
15654b4978P7510M3830p4172Q9227J9922p1094N1280k3953Q2160j48986j74531
15643a53785j66256n2694J33966j6182l2885J06125k93803j13647L59353M71819
$$ plain form
15718 579310 652616 273442 -162376 -168844 -41809 -125850 -453980 -480772 -398455 -275019 -75710
15707 -75710 299466 377840 105728 -376115 -637239 -395257 -191129 -22685 131992 -97381
15697 -97381 125843 420944 170978 32999 -135492 -313043 -398410 -473225 -489929 -120327
15687 -120327 147039 138391 132139 -8209 -257785 -138686 48189 163891 139065 124819 168190
15676 168190 237150 72129 53356 49721 22620 186044 159502 24404 80592 302312 305646
15665 305646 231163 194600 149931 72896 -220539 -358136 -279978 -179852 -131456 -125692 -24978
15654 -24978 52532 96362 22190 111417 131339 60245 111525 87572 169732 20746 -153785
15643 -153785 -320041 -372735 -238769 -254951 -287836 -181711 -475514 -589161 -229808 242011
15633B42011P8776n1761k65298k82613J35120j0919M9805l3772O1228o5213k41719
15622c84355J60745j1350k7624P5991j51867R893K43142J96120j04598l03881
15612b97784k18905J59510J79838p2549l0607L82586K00059l9948j8120j05709
15602A38371k11565J10131j9295M0696j7188j72945m8535j24950J0483J59312
15592a35485j23187J00596K05707L55241p5728j69580j30094j2576K41510L3267
15582B89671j81335j88996r8875J95099j81539J66636J48275m4147r5590O7975
15572G7174j50772j8947L4032Q8796n0758o3690J03551j79299l7011K4277r6559
15561b69206J57561M4578j44700p0611J14957j8952J26927n4666m6748p9575J40441
$$ plain form
15633 242011 320787 269026 3728 -278885 -143765 -154684 -104879 -138651 -77423 -142636 -384355
15622 -384355 -223610 -234960 -262584 -186593 -338460 -328567 -85425 110695 6097 -297784
15612 -297784 -516689 -357179 -177341 -249890 -280497 102089 302148 262200 244080 138371
15602 138371 -73194 36937 17642 58338 41150 -131795 -180330 -305280 -294797 -135485
15592 -135485 -258672 -158076 47631 402872 327144 157564 27470 14894 256404 289671
15582 289671 108336 -80660 -179535 15564 -165975 661 148936 104789 9199 77174
15572 77174 -73598 -92545 -58513 30283 -20475 -84165 19386 -159913 -196924 -172647 -269206
15561 -269206 -111645 -67067 -211767 -282378 -167421 -186373 -59446 -114112 -160860 -240435 -99994
15550i9994J50649k95614j29856j8555J85371M2926l9163R0801J56713K00777
15540B44055Q1739k84868j4066J57508q3760k71186j20787J1958O1100J55580
15530f2727k9930n2028p3926o6366P5079R0962q2057J87539K92703K53804r774
15519E23279j22161r0698q9837j56876n3269L61835O4677m47914k84419n0660
15509c46043J63540Q1116P2596K85345q8245O9347j30059n9561J42124J12649
15499C02809k66429j93654P5600J88987J83286K11317j74888k68302l9108j17014
15489i7396l5971P6786J97820k7826j21456k8k0152J74694j05913j13302J1222
15478f1522K38306p103j84687m8359P4965J25110P2980Q5754j77038j9062n1981
$$ plain form
15550 -99994 50655 -244959 -374815 -393370 -207999 -165073 -204236 -113435 43278 244055
15540 244055 325794 40926 26860 184368 100608 -170578 -291365 -279407 -218307 -62727
15530 -62727 -92657 -144685 -218611 -284977 -209898 -118936 -200993 -13454 279249 533053 523279
15519 523279 401118 310420 220583 63707 10438 372273 436950 -10964 -295383 -346043
15509 -346043 -182503 -101387 -28791 256554 168309 237656 107597 48036 190160 302809
15499 302809 36380 -157274 -81674 107313 290599 501916 327028 58726 19618 -97396
15489 -97396 -133367 -56581 141239 113413 -8043 -8071 -28223 146471 40558 -72744 -61522
15478 -61522 176784 169681 -15006 -63365 11600 136710 209690 295444 118406 99344 47363
15467D7363O5124J3581L1852q6056j04920P4411O4277j29284k6879J73471Q7475
15456B10415m3052m2838j33979J99666l8508j51188j2705N2952k65504O078K84132
15445F5469j87785N033O8631J79916J57700p1714j13112j13217J35878J26317
15435B53116P0176p6626j85804O1292K70376k17545q8029J2069p2534o436r2285
15424g2230j49926M170K10502J24152P532k04414O4744K536n4772j21650L40854
15413A51498K56430q5363r614P8155K4875j9704j56704k68693j67584J17103M9383
15402c0218K47204q8753n7379K15667p2730l01114p2336J82692K04477j38084
15392H9426k58308R9783N1028M7835j16451J62225K7111r0174K35943J77765Q2193
$$ plain form
15467 47363 112487 126068 157920 71864 -33056 41355 105632 -23652 -50531 122940 210415
15456 210415 167363 124525 -9454 190212 151704 516 -12189 40763 -224741 -218663 65469
15445 65469 -122316 -117283 -48652 131264 288964 217250 104138 -9079 126799 253116
15435 253116 323292 246666 60862 122154 392530 174985 86956 99025 26491 20055 -72230
15424 -72230 -222156 -217986 -7484 116668 124200 -80214 -15470 -12934 -67706 -189356 151498
15413 151498 407928 322565 312951 391106 415981 396277 239573 -29120 -196704 -79601 -30218
15402 -30218 216986 128233 70854 286521 213791 -87323 -159659 23033 227510 89426
15392 89426 -168882 -69099 -18071 29764 -86687 75538 102649 12475 248418 426183 508376
15381E08376j36067p3899J66153j76571r9106M6926l14451J36580j5334J14270
15371A56877m2246j43770q8636J62440j46136l17325R1388P6963K15680Q2362
15361D7597r0171K133j49126L7047P1239P9496J93482m8909p2859j7550m8503
15350C876K39450l8955l42690J3298o480K5322K22096k0824k87094j92290K20907
15339a63384L35692q0650k0319n3768j41575n7493j93917J61832m1868J1473L49024
15328A05047Q6885m3209j29235J9296j23339N1347K9370J65138K40442n8740m3339
15317B99663J6683p3989q4051k91884l48086K40844m8558J78065j21460k13593
15307d46366M7422K43804L85099J36893J06435J69881M5878o758n4181k14710
$$ plain form
15381 508376 372309 298410 464563 287992 188886 235812 -78639 57941 42607 156877
15371 156877 114631 -29139 -117775 44665 -101471 -418796 -327408 -250445 -34765 47597
15361 47597 -42574 -40441 -189567 -152520 -81281 -1785 191697 142788 69929 52379 3876
15350 3876 243326 204371 -138319 -125021 -131501 -106179 115917 95093 -192001 -384291 -163384
15339 -163384 172308 91658 71339 17571 -124004 -181497 -375414 -213582 -255450 -243977 105047
15328 105047 191932 148723 19488 38784 -84555 -33208 -3838 161300 401742 343002 299663
15317 299663 316346 242357 158306 -133578 -481664 -240820 -289378 -111313 -232773 -446366
15307 -446366 -398944 -155140 229959 366852 473287 643168 689046 682288 628107 413397
15297D13397l09799n2285K10123J9445j58834l17496k92813l7340K17903J25178
15287a82521K19210J70906Q773L0960o9364l04470J59242m4032q5408j67036j97745
15276d61485J95538J46583N4638J84789O0902p3872j22272J30935l0454M0621
15266A25923O0211n7240N2829J08335R792j37264o9519R8061j01515j01167Q4767
15255G3213j52137q2718J06392O1866L913R5973O4547j25781k4509r833p0346
15244e9420o2236L9237j82217n3921M39842J95738n2764p5931j30090L155J73301
15233B34694l8001j55763l05769p710m3919n5148J95384k69341j29602K10750
15223c64425P9294o8777j14888J03223r0562K8736j16850M0491L6359N7503J72971
$$ plain form
15297 413397 103598 51313 261436 280881 122047 -195449 -488262 -525602 -307699 -182521
15287 -182521 36689 207595 216368 247328 177964 -126506 32736 -11296 -96704 -263740 -461485
15276 -461485 -265947 -119364 -64726 120063 180965 107093 -15179 115756 85302 125923
15266 125923 186134 128894 181723 290058 299850 162586 93067 191128 89613 -11554 73213
15255 73213 -78924 -161642 -55250 6616 10529 106502 171049 45268 20759 10926 -59420
15244 -59420 -121656 -82419 -264636 -318557 121285 317023 264259 188328 58238 61393 234694
15233 234694 196693 40930 -264839 -272549 -316468 -371616 -176232 -445573 -575175 -364425
15223 -364425 -285131 -353908 -468796 -365573 -456135 -427399 -544249 -503758 -467399 -409896 -236925
15212b36925K68923j42649j17143q1564M3486q0218J7670J75481K58520K13517
15202C19098J06152k12025n8062o8764l96062P437L10307K77942P7713L9002k01952
15191B00786k5461n6713l72027p1195K4591L08704K1885P1087n6537j34074Q4970
15180c984K86784Q5642j29784k9639l4855j34761j45997j14801m3440l4875K12791
15169h6919L45512l4993Q431J82023j71431j02311k8814N8517q4369j65691l7143
15158a17188M6580k5615R20l7639J1684J13165K02718K9215K61032r3758k80502
15147A10612j65789J13727J59462j99198J8612j15093j74353J00310k6165p0176
15137b48051N7932q1381l0517J40598k5794R7820k6137Q457q6151o4806p9578
$$ plain form
15212 -236925 31998 -110651 -227794 -309358 -265872 -346090 -328420 -152939 105581 319098
15202 319098 425250 213225 155163 86399 -309663 -302226 8081 286023 363736 402738 200786
15191 200786 175325 118612 -253415 -324610 -300019 8685 30570 101657 45120 -88954 -3984
15180 -3984 282800 368442 238658 209019 174164 39403 -106594 -221395 -264835 -299710 -86919
15169 -86919 258593 223600 232031 414054 242623 140312 111498 170015 85646 -80045 -117188
15158 -117188 -70608 -96223 -95303 -132942 -121258 -8093 194625 223840 484872 391114 110612
15147 110612 -55177 58550 218012 18814 37426 -77667 -252020 -151710 -177875 -248051
15137 -248051 -190119 -271500 -302017 -161419 -187213 -89393 -115530 -107073 -193224 -258030 -337608
15126c37608J048j25187o2192J54102K478j64773K16469j368J13674J30704J70786
15115I8133N1260p5211Q7605k01202R0068L49997r7185n4218N6473J81341k2951
15104D64110o0243m11574r3435J10250R6512J49462M2356l5344M6589j60526N5470
15093B03627j83867j02719j32334k07025N7619J89154J08681j39973J3457m4437
15083b37817j60981P2696J28224j54067j7180L58811L18574J9349j26081j36317
15073F5211J22337L25580R7932j87075l4533r3268J26582K41660o0421r6998k79522
15062B27485l6998j79924q9815k13677J1058O5410J11829K06196P5551j05765
15052G1350j26823J0324j61846J41332Q6289p7673L4451j82824M6024M8630J9149
$$ plain form
15126 -337608 -336560 -461747 -523939 -369837 -367359 -532132 -315663 -317031 -203357 -72653 98133
15115 98133 149393 74182 161787 -39415 50653 400650 303465 249247 305720 487061 464110
15104 464110 403867 -7707 -101142 9108 105620 255082 297438 262094 308683 148157 203627
15093 203627 19760 -82959 -215293 -422318 -364699 -175545 -66864 -206837 -193380 -237817
15083 -237817 -398798 -326102 -197878 -351945 -369125 -10314 308260 327609 201528 65211
15073 65211 187548 513128 611060 423985 389452 296184 422766 664426 604005 507007 227485
15062 227485 190487 10563 -79252 -292929 -281871 -216461 -104632 101564 177115 71350
15052 71350 -55473 -45149 -206995 -65663 20626 -57047 -22596 -205420 -159396 -110766 -91617
15041i1617Q0476J66158k16040k38581n8338K02384K04614M1054j1017m2607J13524
15030A50010j22252j20484j28278N1859K47629Q6976j41487N9857l4822J22540
15020A71548Q6459J3731M3833J79822l5493k60791n7648J63594j375J9135k33864
15009H8951j0822o0291k0225j89784n6097P4042j03244J12712L21044J00147l14918
14998e8485j41911J37707q3527n9378j26772P176P4980j6947Q2698J78893J11490
14987A05924M1450k08954N7589J71906L4914p5074k53351J0762L2869j54789n6153
14976b92907L09463K17338j6702K9545k4546L5602O0955k77712j42744j3415J47058
14965C1935Q3730L6001J22555J60557j22587j11598m6689j06498Q101P1796k5132
$$ plain form
15041 -91617 -11141 155017 -61023 -299604 -357942 -155558 49056 90110 79093 36486 150010
15030 150010 27758 -92726 -221004 -169145 78484 165460 23973 83830 49008 171548
15020 171548 258007 271738 315571 495393 459900 199109 141461 305055 303680 322815 88951
15009 88951 78129 17838 -2387 -192171 -248268 -174226 -277470 -164758 156286 256433 -58485
14998 -58485 -200396 -62689 -146216 -205594 -332366 -325190 -250210 -267157 -184459 -5566 105924
14987 105924 147374 -61580 -3991 167915 202829 127755 -125596 -114834 -81965 -236754 -292907
14976 -292907 16556 233894 217192 246737 222191 257793 318748 41036 -101708 -115123 31935
14965 31935 115665 151666 274221 434778 312191 200593 153904 47406 55507 127303 102171
14954A02171p0569k15696j25584j7344n8092L2541J70669J8166p0266p9036j12658
14943d25698J02726J9171l0819k0978J10082k5368J44419K05606m9240L0464n4481
14932E884L3399K3799n0379K3721J42601j58682l04490j07032J27492k2676J05810
14921a80553j53259N7915J24617M0747K00425J41192K0336j84995l11369q3838
14911c28782K7008R4109j32571j72J29982l9862o8080J07734J35105q1937N7413
14900a00053J63318M6648P5529R1311n7637p1948j24703r2058M01637N6355j93550
14889A94849k49845N4484J21877L2084j4707P2471j05673o8140J54496J80999
14879C72895N6793q8307J0558Q9521j17339q3667J6806k19823j18082m9592k26624
$$ plain form
14954 102171 31602 -184094 -309678 -327022 -385114 -352573 -181904 -163738 -234004 -313040 -425698
14943 -425698 -322972 -303801 -334620 -355598 -245516 -270884 -126465 79141 29901 60365 5884
14932 5884 39283 63082 12703 36424 179025 20343 -284147 -391179 -263687 -286363 -180553
14921 -180553 -333812 -275897 -151280 -110533 89892 231084 251420 66425 -244944 -328782
14911 -328782 -301774 -207665 -340236 -340408 -210426 -250288 -318368 -210634 -75529 -157466 -100053
14900 -100053 63265 109913 185442 276753 219116 147168 22465 -69593 332044 388399 194849
14889 194849 -54996 -512 121365 153449 138742 211213 105540 37400 191896 372895
14879 372895 429688 341381 351939 441460 324121 240454 257260 37437 -80645 -130237 -356861
14868c56861N6429J16041n7090n1033K92631M95232m7589j17134k21924k0337
14858H8365m0748j52487j46841J1141r7220k55531M6775K80464K45638K23137
14848B02693q2541j16730P7613O5438J35681k14774j82172J507K5464l1820J12960
14837f681o4692j09960n5898K1911J72641L185j40227j06061J7945J81699K38753
14826A52615j90122j17476r4559j40114q2402O4925J85276R5120K0553Q9814J50352
14815A33982O3276m4537k20222o6148M9085J18289N0833p5333o2363J25890j4933
14804E7819L7122K58890J34533k32249k71779J58399K22042m4154k30764q8616
14794A243N9564K1940n3332o704j1245j27587J4358K56341k4422l38529j52374
$$ plain form
14868 -356861 -300432 -184391 -241481 -292514 117 495349 447760 330626 108702 88365
14858 88365 47617 -104870 -251711 -240570 -337790 -593321 -546546 -266082 -20444 202693
14848 202693 120152 3422 81035 146473 282154 67380 -114792 -113285 -87821 -119641 -6681
14837 -6681 -71373 -181333 -237231 -215320 -42679 -39494 -179721 -285782 -267837 -86138 152615
14826 152615 -37507 -154983 -249542 -389656 -472058 -407133 -221857 -126737 -106184 -16370 133982
14815 133982 197258 152721 -67501 -133649 -84564 33725 84558 9225 -53138 72752 57819
14804 57819 94941 353831 488364 256115 -15664 142735 364777 320623 89859 1243
14794 1243 60807 82747 29415 22711 11466 -116121 -101763 154578 130156 -208373 -360747
14783c60747J13766J73928J52060k9920J07990J19261M2186k39974j68800R8490
14773H240J66992j71390n767M7128j05524l8950q5561M4682j7443j05436k4395
14762b87424M2694j56814N5727m0236N9607J90335J69499r9637q9171Q0651K7330
14751d7439p2811P1555L99613Q7685k47104r8386j30398J36577K12414J70368
14741D82074j15633k11373l2020q2017M3374K60832k7419j17716m5196N204M4219
14730B04329K28185J00179n8458K29060n1425k67614j37722J79737r7585j89025
14720A39661j20793l671j1376K19721J2770k56973j7323L9938J6322L5651q5992
14709c2065j08254j85573l094J91709J89240j36741j77259l1231J56602p2750
$$ plain form
14783 -360747 -246981 -73053 79007 49087 157077 276338 318524 78550 -90250 8240
14773 8240 175232 3842 -1925 45203 -60321 -99271 -184832 -140150 -157593 -263029 -287424
14762 -287424 -244730 -401544 -345817 -386053 -326446 -136111 33388 -66249 -155420 -74769 -47439
14751 -47439 -120250 -48695 350918 438603 191499 93113 -37285 99292 311706 482074
14741 482074 366441 155068 123048 41031 84405 345237 317818 200102 154906 160110 204329
14730 204329 432514 532693 474235 703295 651870 384256 246534 426271 328686 139661
14720 139661 18868 15197 3821 223542 236312 -20661 -37984 1954 18276 53927 -32065
14709 -32065 -140319 -325892 -328986 -137277 51963 -84778 -262037 -293268 -136666 -209416
14699b09416J80423M3703J75242K9725l42269J7363M2889J2021J1142k73090J90405
14688a21862K35701K78639J56426j3612n45971m56193j48460L40039L65629K67437
14678C57773j37144k56278j8058l87556j6830L29423j7207m3743l49j15495j29246
14667d34710j881L11685K838q7872o1452R647L7147j94542K56607J81618j40950
14656a21865L0582O6761K4403j7652J53482Q1985M2967O1366k28426m8842O9314
14645A14075j25901o5921k7733R1868M8724k31301r644J17423L0420K706J4748
14634d0536k5310J09266k31282q9221J17916L4157q4413L816K06387L2542n0900
14623a7578j11271L098j41655O5412J54543j1037j95774r5703n2796K19716N9590
$$ plain form
14699 -209416 -28993 14710 189952 219677 -122592 -105229 -62340 -50319 -39177 -312267 -121862
14688 -121862 113839 392478 548904 535292 -10679 -466872 -615332 -275293 90336 357773
14678 357773 220629 -35649 -53707 -441263 -458093 -128670 -145877 -189620 -189969 -305464 -434710
14667 -434710 -436591 -124906 -122068 -209940 -271392 -261745 -224598 -419140 -162533 19085 -121865
14656 -121865 -91283 -24522 -119 -17771 135711 217696 260663 322029 93603 44761 114075
14645 114075 -11826 -77747 -105480 -13612 35112 -196189 -205833 -88410 -57990 -55284 -40536
14634 -40536 -65846 43420 -187862 -277083 -159167 -125010 -209423 -205607 780 33322 -17578
14623 -17578 -128849 -125751 -267406 -201994 -47451 -58488 -254262 -349965 -402761 -183045 -123455
14612a23455K30185J34029o3048K4264q7180O121j8251j78937p7179l5663J58230
14601c0884J66719l5513j96629j16790Q06k9349l197P3149K86100N9474l18366
14590a44480j535L17350L2872J23889k30184j37825p4802L982o8742o1848K41589
14579B66j24946R2585J377m3338p5745P7407L1921N7726k4601l2563M8069J86716
14567A94874K30841o7546J22131m2808k60555j34418l27204K8505J50267L1652
14557g4261O1341J71298j38274j46684J2621j00795o3775J36671Q581J59506j5121
14546A1108k51362k05403J3960J09196K18025j61528r4526K10058K89285K65947
14536D04760l2040R8428j06806o6989L6288j14719j38766J06528O9737j5792J41378
$$ plain form
14612 -123455 106730 240759 177711 201975 114795 120916 102665 -76272 -153451 -189114 -30884
14601 -30884 135835 100322 -96307 -213097 -212291 -241640 -244837 -171688 114412 173886 -144480
14590 -144480 -146015 171335 204207 328096 97912 -39913 -114715 -110733 -179475 -241323 266
14579 266 -124680 -32095 -30718 -74056 -149801 -72394 -40473 17253 -7348 -39911 8158 194874
14567 194874 425715 358169 480300 437492 176937 42519 -284685 -256180 -105913 -74261
14557 -74261 -12920 158378 20104 -126580 -113959 -214754 -278529 -141858 -133277 26229 11108
14546 11108 -240254 -445657 -431697 -322501 -104476 -266004 -360530 -150472 138813 404760
14536 404760 372720 471148 364342 297353 333641 218922 80156 186684 256421 240629 382007
14525C82007q5046j52098P2838l6298N8463o53K8898j19558l31903k05206J32351
14514b56205Q9860m2535j55149j50099J44868L54251L62444j4162k31981j87993
14504h6701L0525r0256l7220j16247j72867J09348M2405P4042K02413K7044k53109
14493b70623M5089J31705j72333O7023J30785J46190J97621M2785J32979n5041
14483C96180k62112p7854k6400j27834j30467l0288J75976J93800K7321J25736
14473B64058L6671k61600n5329q4859r715J65140r9834K4915J78464N5315l1632
14462A81594k908j15516m1008j1148K21101K63530O1993j06091j53140L2793j03210
14451B27990m8619N7489j24461l40695O6176L265n8226j31085K45652K2874j24218
$$ plain form
14525 382007 296961 144863 217701 181403 239866 239213 268111 148553 -183350 -388556 -256205
14514 -256205 -166345 -208880 -364029 -514128 -369260 -15009 347435 333273 101292 -86701
14504 -86701 -56176 -146432 -183652 -299899 -472766 -363418 -321013 -246971 -44558 -17514 -270623
14493 -270623 -225534 -93829 -266162 -199139 -68354 77836 275457 318242 451221 396180
14483 396180 134068 56214 29814 -98020 -228487 -258775 -82799 111001 138322 264058
14473 264058 300729 39129 -16200 -101059 -110774 54366 -45468 -20553 157911 213226 181594
14462 181594 178686 63170 22162 11014 232115 495645 557638 451547 298407 331200 227990
14451 227990 179371 236860 112399 -228296 -162120 -158855 -217081 -348166 -102514 -79640 -203858
14440b03858J29599R1477J18526K35066J14122K1375k43595n4069J54466j19968
14430B43141j73322m3463r3393M5430N8976J88525L24166k46063k5502J2585m1740
14419B49340N0325o4626p490O8162r5087l47539k49976n9411J27734n031R9730
14408b33869K17139J34894l81885k26860m6662K22769K10628J72278J34355j17722
14398H5065j6737j00565r43R2375N0409L0298l999L4348o5547N7299k44642p3491
14386a56130J94815o3286j52148J33115J96704n8065J75319j4964k03318l79686
14376c27644j06089K18126R9205j28798R2974J90046L4257m4165Q69J527p1264
14365d0956n4632R421m3244N8737R344m2254N4788J02282R3100O0483j01208j40397
$$ plain form
14440 -203858 -74259 17218 135744 370810 484932 506307 262712 208643 363109 243141
14430 243141 69819 26356 -67037 -21607 37369 225894 550060 303997 278495 291080 249340
14419 249340 299665 235039 227549 295711 200624 -146915 -396891 -456302 -328568 -333599 -233869
14408 -233869 -16730 118164 -263721 -490581 -537243 -314474 -103846 68432 202787 85065
14398 85065 68328 -32237 -33180 59195 109604 139902 135903 170251 104704 162003 -82639 -156130
14386 -156130 38685 -24601 -176749 -43634 153070 95005 270324 255360 52042 -327644
14376 -327644 -433733 -215607 -116402 -245200 -152226 37820 72077 27912 28781 30308 -40956
14365 -40956 -95588 -86167 -129411 -70674 -61330 -103584 -48796 53486 146586 207069 105861 -34536
14353c4536j57356J12178K8501k5860p5690k77162j52489J63065j04015P266J21142
14342c94956N195Q3496Q6714J01955j16393k5859K86725r3154k81147P1231J51438
14331a24755j8490J35848l1806k34584j68831q4963o3319K79547K37805J23079
14321D9531R8236M3620j62202j79060J36612K4545j50112j01773q4870L80538
14311E5065J49465q0512k62457r4224j19358L47012J08626Q6543k74318j88653
14301b72811K10878Q2245j6659r1887l4248P2541J04678j15471o7016J09527p7073
14290i5296L7218J13969j19636j37237j0110K47691J90068k14549j37846m126
14280a29854K24033J30927L7813l49024r6783K19575j15704j71963n1430K31774
$$ plain form
14353 -34536 -191892 -79714 -51213 -77073 -152763 -429925 -582414 -419349 -523364 -516098 -394956
14342 -394956 -389761 -306265 -219551 -117596 -233989 -259848 26877 -66277 -347424 -276193 -124755
14331 -124755 -143245 -7397 -39203 -273787 -442618 -527581 -590900 -311353 -73548 49531
14321 49531 147767 191387 29185 -149875 -13263 11282 -138830 -240603 -325473 55065
14311 55065 204530 124018 -138439 -232663 -352021 -5009 103617 190160 -84158 -272811
14301 -272811 -61933 20312 3653 -88234 -122482 -49941 54737 -60734 -127750 -18223 -95296
14290 -95296 -58078 55891 -63745 -200982 -211092 36599 226667 12118 -125728 -129854
14280 -129854 94179 225106 262919 -86105 -182888 36687 -79017 -250980 -302410 -70636
14270g0636J79127M0564m3819k06321j21586J07066j16905j02558Q9979j16435
14260c61524j80147q555J64418O2874P5764J49567j5727Q9746K53083j16544K09863
14249C22818K66821k62191l89513R8509L21223l3746j10778j26520q673j45360
14239f7410N120m0556J13787R34m3564r1800Q286n6496m4775m4339P5862J62681
14227b2270j10188k22463J33852M26755q6616J27821o084R7315k17146m0856j46666
14216f6546K5360K50436m8738j34257j26914j0679o091L2755J9592J3154r5021
14205a46949J18574R2983K03296J42072O7064j45503J26809j21289m6874j42k57943
14194C2098o4585k4407k26888R772J94490O4516N3019J20842M964k20790K8790
$$ plain form
14270 -70636 108491 149055 105236 -101085 -222671 -115605 -232510 -335068 -245089 -361524
14260 -361524 -541671 -550226 -385808 -322934 -247170 -97603 -113330 -23584 229499 112955 322818
14249 322818 589639 327448 -62065 36444 357667 323921 213143 86623 77950 -67410
14239 -67410 -62290 -102846 10941 11875 -31689 -123489 -115203 -171699 -216474 -260813 -184951 -22270
14227 -22270 -132458 -354921 -221069 205686 119070 246891 240807 338122 120976 80120 -66546
14216 -66546 -41186 209250 160512 26255 -100659 -111338 -117429 -84674 -65082 -51928 -146949
14205 -146949 -28375 64608 267904 409976 477040 331537 458346 337057 290183 290041 32098
14194 32098 -32487 -56894 -283782 -274010 -79520 -15004 38015 158857 163821 -56969 -28179
14183b8179K20944P7646p5043P1971J87451J44946Q737k59449k58476j26668k7992
14172f4112j36345j76365J20468J64625Q1439j49844J06769m3835j29727k428
14162b29355N610n9638J81128J20810P089K0116j46369j46505J71579L1399j1028
14151e5164q6020m2282K0076J13612n4513r013J99725o8642p2531N2585J96938
14140A94771Q2056L6115k65349j19632l8172j72724N0158J47241J24933J30598
14130A69995j98329J9234J42127K35848J81818o2663r8140k43678j02173J29706
14120A73745q9357j29468r1244K96473J69317l9186j03378j76315J1463K9648
14110E1698q167J0538O0049j41455j08588k23973p6310R1155J55419J61504o6912
$$ plain form
14183 -28179 192765 270411 195368 267339 454790 599736 608473 349024 90548 -36120 -64112
14172 -64112 -200457 -376822 -256354 -91729 -10290 -160134 -53365 -97200 -226927 -229355
14162 -229355 -223745 -283383 -102255 18555 25644 45760 -100609 -247114 -75535 -44136 -55164
14151 -55164 -141184 -183466 -163390 -49778 -104291 -113304 86421 17779 -54752 -2167 194771
14140 194771 276827 312942 47593 -72039 -110211 -282935 -232777 -85536 39397 169995
14130 169995 -28334 -9100 133027 368875 550693 488030 389890 146212 44039 173745
14120 173745 84388 -45080 -136324 160149 329466 290280 186902 10587 22050 51698
14110 51698 43531 54069 114118 -27337 -135925 -359898 -436208 -345053 -189634 -28130 -95042
14099i5042P513K5788K05434Q6089j40168r5989J56090K0639n8703J9373K7694
14088A58718J61990j46424n2189j0636r4240N3552L14883j36818j97415j22295
14078g0874J18333J15294O639k59227p4696M8403Q7124L86685m5226j11058k08956
14067g559l6269k01303M1099L18515K6006p5584l1615R6683o9018J04078m5960
14056A19073l06366P6998O2106j80300j7463N3092Q9813l6853L56816J40836K50620
14045F08372r1674l91294k2027Q6784R9312p8542N1685J42622l12263J48853R572
14034B51400k3491j5379J58853k76767k97927J66462P7436m8674L8671k35139
14024b04555k19200L09245L39230k74626j45337N2585N5198Q0540J52065J71502
$$ plain form
14099 -95042 -87529 -61741 143693 229782 89614 -6375 149715 170354 111651 131024 158718
14088 158718 320708 174284 122095 111459 17219 70771 385654 248836 51421 -70874
14078 -70874 47459 162753 169392 -89835 -164531 -116128 -29004 357681 312455 201397 -7559
14067 -7559 -43828 -245131 -204032 114483 140489 64905 33290 129973 60955 165033 119073
14056 119073 -187293 -110295 -48189 -228489 -245952 -192860 -103047 -139900 216916 357752 608372
14045 608372 516698 125404 103377 190161 289473 210931 262616 405238 92975 241828 251400
14034 251400 227909 212530 371383 94616 -203311 -36849 40587 -8087 30584 -204555
14024 -204555 -423755 -114510 224720 -49906 -195243 -142658 -87460 -6920 145145 316647
14014C16647j31415o7313k7933p658j35739L1385l9432R3187r9293j90768l0457
14003b88789J94035J05495j053n1062R0553N3587j98073k16579L6895K28126j81425
13992b28290n3330J22545J62541K11933j9408q023j2009R7312J62540r2324j51992
13981A91495l0026k24432N9129J63457o5391l169n27j7905j16338Q1191k6234
13970A1250O412k21979k33246L02674K18421J15467j78961k69180J96963K5562
13960b6617J66180K68130O5899K1732j40708l81894n3688J38000J75774J74403
13950D07211l7936l8992Q3693K9798k7265l1212k3717j71757k04151N3923K65460
13939C05055j90329o8023J07804k81177j32544K17338K01500K90010J47893j18440
$$ plain form
14014 316647 185232 117919 89986 82328 -53411 -22026 -61458 31729 -67564 -258332 -288789
14003 -288789 -94754 10741 9688 -41374 49179 102766 -95307 -311886 -274991 -46865 -228290
13992 -228290 -281620 -159075 3466 215399 195991 187968 175959 273271 435811 343487 191495
13981 191495 161469 -62963 -3834 159623 94232 91063 90536 72631 -43707 37484 11250
13970 11250 17662 -204317 -437563 -134889 83532 198999 20038 -249142 -52179 -26617
13960 -26617 139563 407693 473592 495324 354616 -27278 -80966 57034 232808 407211
13950 407211 369275 330283 413976 443774 416509 385297 361580 189823 -14328 39595 305055
13939 305055 114726 46703 154507 -126670 -259214 -41876 159624 449634 597527 479087
13929D79087k59134k49854o4648m5372j12352l4060J2250j46789K6763R9619J35280
13918a59210J05951M6507j68865L5479J48533n7723N4944l9824R931o4674M17633
13907C28682M7799k99235m18889m7011N3113L74234J67814J58939j23913j79600
13897F1933m9434l9488L2409K49795J17538o3966k34390k12539J37358K38233
13887B37449J31309p7914J19383q7757k4M1821q8926J34079K52739j35648k05284
13876C21227o4165j0743J288l8471k35980j00154J10197L6332L1048j9232J24497
13865A55844P8747J2769M3658m191r0466J05933j838n1357j73034j33348O9906
13854A2623j31457j52752J69665K57986P802M3571k5860p5228l2988m2340r1020
$$ plain form
13929 479087 219953 -29901 -94549 -139921 -252273 -286333 -274083 -420872 -394109 -294490 -159210
13918 -159210 -53259 -6752 -175617 -140138 8395 -49328 5616 -34208 -24277 -88951 328682
13907 328682 376481 77246 -341643 -388654 -335541 38693 206507 365446 241533 61933
13897 61933 12499 -26989 5420 255215 372753 308787 74397 -138142 -784 237449
13887 237449 368758 290844 410227 322470 322446 364267 275341 409420 662159 526511 321227
13876 321227 257062 246319 247607 209136 -26844 -126998 -16801 19531 50579 31347 155844
13865 155844 234591 247360 291018 286827 196361 302294 300456 249099 76065 -57283 12623
13854 12623 -118834 -271586 -101921 156065 163867 207438 181578 106350 73362 31022 -59998
13843e9998N016K09697K1145k71539j37303N8007q5036j27847K51644J81804J00155
13832A45745m2851j24725n2347r028l6014J2945J4769j17831K5918m6689J03794
13821a26314m4105J26006O4762j9890o3336j32793J75726K61104j14768k68051
13811a41659J7058K29747k11662k29138j4168P6603M3802K00948K72472q3360
13801A60643r104M5407J83097q4262n8111K9206l6696K50331o7441k19768J6237
13790B09539q0451J79963J78782q0446l5306j89082m0398r8171j78857J33689
13780g38J07311j63920q5635R1895J10393L6128k29831k51785P3919P3632J69413
13769f9218j06965J80631J5499p5215R3528P3307k03186o4059J77552k49791j20089
$$ plain form
13843 -59998 -54982 154715 175860 -95679 -232982 -174975 -260011 -387858 -136214 45590 145745
13832 145745 102894 -21831 -74178 -83206 -119220 -106275 -91506 -209337 -183419 -230108 -126314
13821 -126314 -170419 -44413 20349 459 -62877 -195670 -19944 241160 126392 -141659
13811 -141659 -124601 105146 -106516 -335654 -349822 -273219 -229417 -28469 244003 160643
13801 160643 151539 196946 380043 295781 237670 266876 230180 480511 413070 193302 209539
13790 209539 129088 309051 487833 407387 372081 182999 142601 44430 -134427 -738
13780 -738 106573 -57347 -142982 -51087 59306 95434 -134397 -386182 -312263 -238631 -69218
13769 -69218 -176183 4448 19947 -55268 38260 111567 -91619 -155678 21874 -227917 -348006
13758c48006K81271P1711J54566J84015j0629k66060p2441p8824m8656n8121M9722
13747a41452J99349r0084K2682J12406J25972l7726R8361L6579q1620J3010l12501
13736e5024J62369L12817K09114k33503k57350n0280o6366o1863o1139o8967o7519
13725b37711r3916k07494m7615L51833J70264j19238m1330J44119q3982J47083
13715a7987j1314j21029o7705J42437Q6262r5920J70460K16508j9844l07849n3226
13704g9207J45125J71291J00789L3088j54589j70166o4258K38268R9651J08534
13694D28526l11453l22512j9820j172K33741J60052J02354Q8423j57696j91789
13684H654k69880j49211Q479K2146n2682J65851O5188L5599l8624j11948k1972
$$ plain form
13758 -348006 -66735 4976 159542 343557 332928 66868 -5573 -84397 -133053 -191174 -141452
13747 -141452 57897 -32187 -9505 102901 228873 191147 289508 326087 244467 257477 -55024
13736 -55024 107345 420162 629276 395773 138423 88143 21777 -40086 -101225 -170192 -237711
13725 -237711 -331627 -539121 -586736 -234903 -64639 -183877 -225207 -81088 -165070 -17987
13715 -17987 -29301 -150330 -218035 -75598 10664 -85256 85204 301712 281868 -25981 -79207
13704 -79207 65918 237209 337998 371086 216497 46331 -17927 220341 319992 428526
13694 428526 117073 -205439 -225259 -226431 7310 167362 269716 358139 200443 8654
13684 8654 -261226 -410437 -401958 -379812 -432494 -266643 -201455 -165856 -204480 -316428 -338400
13673c38400J63038R7633p08J4155j66294j8459K99744q315k42110j81653K08632
13662a72737L54324J38773J4527K2464j31541j30464Q0108K5950r2809j05311
13652C284n9184q3879M1301Q0490j7493K02057o550k65207o7287M4963r5886K19554
13640c837M6310k21048L4539J80172m4518J99980R6001j15595J33170r1964k88017
13629g4807o8219r488J01319K00515k4691j59373k14041j7816K51052n2286k13430
13618b81265K45413J26554M1833J71568L3248O1855J02429q2705K705m3862k01393
13607A76380O0293M7172p9551j16651P5551r4190N8906O1190j83100l7332K4497
13596f835O9580j67168l02562o1686K39170J0447j36430K792K68070Q4764k30444
$$ plain form
13673 -338400 -175362 -77729 -78437 -64282 -230576 -249035 50709 42394 -199716 -381369 -172737
13662 -172737 181587 320360 334887 357351 225810 95346 175454 201404 108595 3284
13652 3284 -55900 -139779 -98478 -17988 -35481 166576 160026 -105181 -172468 -127505 -223391 -3837
13640 -3837 42473 -178575 -144036 36136 -8382 191598 287599 172004 305174 213210 -74807
13629 -74807 -143026 -152514 -51195 149320 124629 -34744 -248785 -266601 -15549 -67835 -281265
13618 -281265 -35852 90702 132535 304103 337351 399206 501635 418930 421635 377773 176380
13607 176380 236673 283845 204294 87643 163194 69004 127910 189100 6000 -31332 -6835
13596 -6835 62745 -104423 -406985 -468671 -229501 -219054 -355484 -352692 -84622 142 -230302
13585b30302J56996l9368J09885J25966M68538n8596k56200l68683l9114L9600
13575i1278L970L5224j06187O0530J02530Q1389p4118n0125R5822K07041K9482
13564B94280j39118J00251r65j37912J86006k7374r2452k4428l26570J35064K70412
13553B37194k4289n5748j22526o4362m291q827O8984o126j91840k10822J51161
13542b31492J16023l320j70983J06092J1213p1110K54497k3054j60417j44893
13532c17444R2373P0721J00847q0494m1422K61020N7468k9600p9986j32853j31229
13521b30599K36109K4483j50334J85079J61605L3717m0001q0724k48911J0409
13511i9167J1844J9882o6878k61077L2675j2017R4499Q7394J25930p8600J13800
$$ plain form
13585 -230302 -73306 -112674 -2789 123177 591715 533119 276919 -91764 -130878 -91278
13575 -91278 -87308 -52084 -158271 -97741 4789 86178 12060 -38065 57757 264798 294280
13564 294280 155162 255413 254448 116536 302542 275168 182716 158288 -168282 -33218 237194
13553 237194 212905 157157 34631 -29731 -34022 -42849 26135 20009 -171831 -382653 -231492
13542 -231492 -115469 -118789 -289772 -183680 -172467 -243577 10920 -12134 -172551 -317444
13532 -317444 -225071 -154350 -53503 -133997 -175419 85601 143069 113469 33483 -99370 -230599
13521 -230599 5510 29993 -120341 64738 226343 260060 220059 139335 -109576 -99167
13511 -99167 -87323 -67441 -134319 -395396 -362721 -374738 -280239 -192845 -66915 -145515 -31715
13500c1715N2332n7796j50222p9125K49644J93632j90952O6754K04102J14327
13490C70981N6917n7950k27602k93879j72338L16518J30473j1691J9290J8590
13480A49309k00080j68875K04521J51312p9414R3752j70329j90297M0588J59822
13470i691R8048j21965k2346q5542k08026J11526M6229j92908J52946m4818J0391
13459b66156J13349L33446N533M0001j21951j45090j68383L1970N5608Q4828K34932
13448A98087K9087n2723K3820K52265K65641j96548l32540k40537K37428r8461
13438H5519k40326Q2622K16509j07772o2369J72126Q803j28084j21235n6215K70618
13427A20196j02975j50534O0828K2958r8579L78822R4519o5969J40579k5015j0584
$$ plain form
13500 -31715 20617 -37179 -187401 -266526 -16882 176750 -14202 52552 256654 370981
13490 370981 427898 369948 142346 -151533 -323871 -7353 123120 111429 130719 149309
13480 149309 -50771 -219646 -15125 136187 56773 150525 -19804 -210101 -169513 -9691
13470 -9691 88357 -33608 -55954 -141496 -349522 -237996 -191767 -384675 -231729 -276547 -266156
13459 -266156 -152807 180639 186172 226173 104222 -40868 -209251 -177281 -121673 -36845 198087
13448 198087 227174 174451 198271 450536 716177 519629 187089 -53448 183980 85519
13438 85519 -154807 -72185 144324 36552 -25817 146309 155112 27028 -94207 -150422 120196
13427 120196 17221 -133313 -72485 -49527 -148106 230716 325235 259266 399845 374830 364246
13416C64246K1288N8900j06639o6645k20268j2057Q182J14052P0807r753J66716
13405C88829m631k83130k87623j4030l7041J36572k5823L5242O5155j51469j69535
13394c47484N0546J59492j38334J51156J05588M1527o8013m1941M6752K98023
13384B57312j19006j910j47611M9755R0127j86722M0079N1571Q7902J05931L0155
13373B57583m2257n9232l5040m7507O3936K17412J07796M0902N9053o612q559
13362E47475o9728l73890k07553R0537o1864J13843J85871j24890l02953M3091
13352a60061P7606J34087R8226l2005L9615k3666r9785n6548n4025J70469K5316
13341A19229k07660J7814M4091j59495j45788L2863L22108N8110j84501J08749
$$ plain form
13416 364246 385534 444434 337795 271150 50882 38825 47007 161059 231866 222113 388829
13405 388829 384198 101068 -186555 -200585 -237626 -101054 -126877 -91635 -26480 -177949 -347484
13394 -347484 -296938 -137446 -275780 -124624 -19036 22491 -45522 -87463 -40711 257312
13384 257312 138306 136396 -11215 38540 128667 -58055 -17976 33595 121497 227428 257583
13373 257583 215326 156094 121054 73547 137483 354895 462691 503593 562646 556034 547475
13362 547475 477747 103857 -103696 -13159 -75023 38820 224691 99801 -203152 -160061
13352 -160061 -82455 51632 149858 117853 157468 133802 34017 -22531 -76556 93913 119229
13341 119229 -88431 -70617 -26526 -186021 -331809 -298946 23162 81272 -103229 5520
13331E520r12l4472p96r6060M0387O4407p3276j74038M39861J48943j2835L3407
13319C40136J0312j93607j57041J61558p3831j81540j07286j02997K4178P088
13309b73030K09072R1217j77105K4618O5861r8478j52696l184O6490O2905Q3727
13298a00603p4822J02777K62041L2260J2726o5853j01629l49595O6624K28427
13288A2353J78002n1541K3632l5601o3544N6665K4397l0520o8613o3964o0460
13277g9194r2851J6911J49736J21602j67764n1552J77378M4642l35370k4284j62248
13266d02994J625L11603j9959K9164k8982J77009L04003j15625l39625J34705
13256E0924j20486l27089J31014K43256K1120j75299J59514J13248K23678O5879
$$ plain form
13331 5520 4608 -29864 -30660 -126720 -86333 -21926 -95202 -269240 170621 319564 306729 340136
13319 340136 350448 156841 -200 161358 87527 -94013 -201299 -304296 -280118 -273030
13309 -273030 -63958 27259 -149846 -125228 -59367 -157845 -310541 -313725 -247235 -184330 -100603
13298 -100603 -175425 -72648 189393 221653 234379 168526 66897 -282698 -216074 12353
13288 12353 190355 138814 162446 126845 63301 119966 144363 113843 45230 -18734 -79194
13277 -79194 -172045 -155134 -5398 116204 -51560 -103112 74266 118908 -216462 -240746 -402994
13266 -402994 -401369 -89766 -109725 -80561 -109543 67466 371469 255844 -83781 50924
13256 50924 -69562 -396651 -265637 -22381 -1261 -176560 -17046 96202 319880 385759
13246C85759k45283j56034J73232J75050j26342j79112L0604n6699R1664J61001
13236B53840O934q5654l02974m1865K03714N2251L973k39163m7707N6667K79660
13225A39676m9176j32284l1284J26041l5512o4259j01134k14032K0815J30820
13215b10329J63998J22776L8762N5139k29685k7809M7450O6002J97974n4541j40555
13204B9182m8394L7437o7973l1383J97941j19854o2801j8965J00481J4316m0696
13193a0709J66708J59034l8040j43358j06267R914j1755j40985q5090J93948J04461
13182I7861K2500j29954q7463k78965R7985K32358K5552j51220J18232p2512J4042
13171a11584J17509N0181M328m5401K23904j62189j55672q2137M1978K67722N3621
$$ plain form
13246 385759 140476 -15558 157674 332724 206382 27270 57874 1175 92839 253840
13236 253840 260774 175120 -127854 -169719 33995 86246 90219 -148944 -196651 -139984 139676
13225 139676 90500 -41784 -73068 52973 17461 -46798 -147932 -361964 -341149 -210329
13215 -210329 -46331 76445 115207 170346 -59339 -87148 -39698 26304 224278 169737 29182
13204 29182 -19212 18225 -49748 -81131 116810 -3044 -65845 -84810 15671 29987 -10709
13193 -10709 155999 315033 276993 133635 27368 37282 25527 -115458 -200548 -6600 97861
13182 97861 120361 -9593 -97056 -376021 -278036 -45678 -20126 -171346 -53114 -125626 -111584
13171 -111584 5925 56106 60434 15033 238937 76748 -78924 -161061 -119083 148639 202260
13160B02260N4973j79151o4566N8717j31554J80N4979J59203j68395j46207K98743
13149A39182J10457m0643M8912l7928m075J16113l2897k14999K7317J34383j37663
13138A08159p8403L8704O6209J01706K8351j89470l6083j35536q5383Q7137J52513
13127E7904j35228l6377k3113k37158j27220J55895J9706N5826J40545J17429
13117a1791N3156k61291j76480K822N0910J29893j1326J2801P6592L2089m8080
13106a50705J19999Q2558K5553o3943J54542j52536j44605K46613k7110j51714
13096f1348J30938J86692J89296o7754j04204k60710p1191J78955k3722j80549
13086h3597j20449K11342J9150n8615l8040r3523j1724M5665l2489j07594j63281
$$ plain form
13160 202260 257233 78082 13516 72233 -59321 -59141 -4162 155041 -13354 -159561 139182
13149 139182 249639 208996 257908 219980 215905 332018 299121 84122 111439 245822 108159
13138 108159 29756 68460 134669 236375 264726 75256 39173 -96363 -181746 -94609 57904
13127 57904 -77324 -113701 -136814 -373972 -501192 -345297 -325591 -269765 -129220 -11791
13117 -11791 41365 -219926 -396406 -393584 -342674 -212781 -224107 -211306 -134714 -102625 -150705
13106 -150705 -30706 51852 77405 13462 168004 15468 -129137 117476 90366 -61348
13096 -61348 69590 256282 445578 377824 273620 12910 -58281 120674 96952 -83597
13086 -83597 -204046 7296 26446 -32169 -70209 -163732 -175456 -129791 -162280 -269874 -433155
13075d33155M8695M83184l9935j72001O0495m2710J29263O9936O7725J34713j97186
13064A09024k9162N9999N783N5447j17293J00037l0301k04025J07467Q3832j61838
13053b1030l9519J03783K35917l8515p157r1709p3847m9982J26601j01449J670
13042D4763P3764j94880j5173N1258n4589j70243J48060J98509l6420j24655k21381
13031c00987q4814K38207K8052N9496K07947j4370k6096j96570Q4407j1432L1949
13020A5789R8758j35229q6204M7369J25162R9754Q415r2049N4226L2451k32403
13009f3961j33078K0868j07649r0017n348J19713J15297J08303J60346J74604
12999B99078R3779M5090m3228M3641j28332l04767j38169m0880p2341P3379K85297
$$ plain form
13075 -433155 -384460 98724 58789 -113212 -52717 -95427 33836 103772 171497 306210 109024
13064 109024 79862 139861 145644 201091 83798 183835 153534 -50491 56976 140808 -21030
13053 -21030 -60549 43234 279151 240636 233479 141770 67923 17941 144542 43093 44763
13042 44763 118527 -76353 -91526 -40268 -94857 -265100 -117040 81469 45049 -79606 -300987
13031 -300987 -385801 -147594 -119542 -60046 147901 133531 107435 -89135 -4728 -16160 15789
13020 15789 114547 -20682 -106886 -59517 65645 165399 173814 81765 135991 168442 -63961
13009 -63961 -197039 -176171 -283820 -373837 -379185 -259472 -144175 -35872 124474 299078
12999 299078 392857 437947 394719 438360 310028 5261 -132908 -173788 -246129 -172750 112547
12988A12547J14608r8323j38928j88287o9440K82607J98051K47101k59220l7728
$$ plain form
12988 112547 227155 128832 -10096 -198383 -267823 14784 212835 459936 200716 162988
$$ [...]
##END NTUPLES=NMR SPECTRUM
##END=
