##TITLE=Analysis number 328535
Compound Code cc 53013
Book Reference 407/145
Project Code adrs
Chemist Name andyw
##JCAMPDX= 6.0         $$ Bruker NMR JCAMP-DX V2.0
##DATA TYPE= NMR SPECTRUM
##DATA CLASS= NTUPLES
##ORIGIN= Bruker BioSpin GmbH
##OWNER= nmr
$$ XWIN-NMR		Version 3.5
$$ Wed Jun 13 14:00:44 2007 GMT Daylight Time (UT+1h)  MAYBRIDGE\nmr@NMR_250MHZ
##.OBSERVE FREQUENCY= 250.131544655141
##.OBSERVE NUCLEUS= ^1H
##.ACQUISITION MODE= SIMULTANEOUS (DQD)
##.ACQUISITION SCHEME= undefined
##.AVERAGES= 16
##.DIGITISER RES= 18
##SPECTROMETER/DATA SYSTEM= dpx250
##.PULSE SEQUENCE= zg30
##.SOLVENT NAME= CDCl3
##.SHIFT REFERENCE= (INTERNAL, CDCl3, 0, 16.522)
##AUDIT TRAIL= $$ (NUMBER, WHEN, WHO, WHERE, WHAT)
$$ ##TITLE= Audit trail, XWIN-NMR		Version 3.5
$$ ##JCAMPDX= 5.01
$$ ##ORIGIN= Bruker BioSpin GmbH
$$ ##OWNER= nmr
$$ C:\u/data/dgb/nmr/ADRS/840/pdata/1/auditp.txt
$$ ##AUDIT TRAIL=  $$ (NUMBER, WHEN, WHO, WHERE, WHAT)
(   1,<2007-06-13 14:00:24.83 +100>,<MAYBRIDGE\nmr>,<NMR_250MHZ>,
      <created by zg, POWCHK disabled, PULCHK disabled
       configuration hash MD5:
       76 6E 9A 78 1E 09 19 81 EC 84 63 8F B0 6A 59 2D
       data hash MD5: 64K
       B3 A2 F1 9C 4C 8C DF 8D 89 CF FB 33 A6 0D 41 D5>)
(   2,<2007-06-13 14:00:36.40 +100>,<MAYBRIDGE\nmr>,<NMR_250MHZ>,
      <Start of raw data processing
       ef LB = 0.3 FT_mod = 6 PKNL = 1 SI = 32K 
       data hash MD5: 32K
       68 73 37 69 C6 43 8F EF 4C BA 1F 19 CF 16 4C 3A>)
(   3,<2007-06-13 14:00:38.09 +100>,<MAYBRIDGE\nmr>,<NMR_250MHZ>,
      <apk 
       data hash MD5: 32K
       57 E1 01 87 7F 29 A8 22 56 5C 6C B0 1B 48 07 76>)
(   4,<2007-06-13 14:00:38.78 +100>,<MAYBRIDGE\nmr>,<NMR_250MHZ>,
      <abs ABSG = 5 
       data hash MD5: 32K
       EA 9F 16 20 1F 49 73 9F 0A 26 6E 14 DA 4B CD B7>)
$$ ##END=
$$ 
$$ hash MD5
$$ 77 E8 68 64 52 6F 57 3F 88 BB B8 15 12 ED B9 5E
##$RELAX= 
##$RELAX= 
##$RELAX= 
##$RELAX= 
##$RELAX= 
##$RELAX= 
##$RELAX= 
$$ Bruker specific parameters
$$ --------------------------
##$DU= <C:\u>
##$EXPNO= 840
##$NAME= <ADRS>
##$PROCNO= 1
##$TYPE= <nmr>
##$USER= <dgb>
##$AMP= (0..31)
100 100 100 100 100 100 100 100 100 100 100 100 100 100 100 100 100 100 
100 100 100 100 100 100 100 100 100 100 100 100 100 100 
##$AQSEQ= 0
##$AQ_mod= 3
##$AUNM= <au_zg>
##$AUTOPOS= <34 >
##$BF1= 250.13
##$BF2= 250.13
##$BF3= 250.13
##$BF4= 250.13
##$BF5= 500.13
##$BF6= 500.13
##$BF7= 500.13
##$BF8= 500.13
##$BYTORDA= 1
##$CFDGTYP= 0
##$CFRGTYP= 5
##$CHEMSTR= <none>
##$CNST= (0..31)
1 1 145 1 1 1 1 1 1 1 1 1 1 1 1 1 1 1 1 1 1 1 1 1 1 1 1 1 1 1 1 1 
##$CPDPRG= <>
##$CPDPRG1= <>
##$CPDPRG2= <>
##$CPDPRG3= <>
##$CPDPRG4= <mlev>
##$CPDPRG5= <mlev>
##$CPDPRG6= <mlev>
##$CPDPRG7= <mlev>
##$CPDPRG8= <mlev>
##$CPDPRGB= <>
##$CPDPRGT= <>
##$D= (0..31)
0 1 0 0 0 0 0 0 0 0.06 0 0 0 0 0 0 0.0002 0 0 0 0 0 0 0 0 0 0 0 0 0 0 
0 
##$DATE= 1181739624
##$DBL= (0..7)
120 120 120 120 120 120 120 120 
##$DBP= (0..7)
150 150 150 150 150 150 150 150 
##$DBP07= 0
##$DBPNAM0= <>
##$DBPNAM1= <>
$$ [...]
##$SUBNAM7= <"">
##$SUBNAM8= <"">
##$SUBNAM9= <"">
##$SW= 20.6930455092707
##$SWIBOX= (0..15)
0 0 3 0 0 0 0 0 0 0 0 0 0 0 0 0 
##$SW_h= 5175.983436853
##$TD= 65536
##$TD0= 1
##$TE= 297.16
##$TE2= 300
##$TE3= 300
##$TEG= 300
##$TL= (0..7)
0 120 120 120 120 120 120 120 
##$TP= (0..7)
150 150 150 150 150 150 150 150 
##$TP07= 0
##$TPNAME0= <>
##$TPNAME1= <>
##$TPNAME2= <>
##$TPNAME3= <>
##$TPNAME4= <>
##$TPNAME5= <>
##$TPNAME6= <>
##$TPNAME7= <>
##$TPOAL= (0..7)
0.5 0.5 0.5 0.5 0.5 0.5 0.5 0.5 
##$TPOFFS= (0..7)
0 0 0 0 0 0 0 0 
##$TUNHIN= 0
##$TUNHOUT= 0
##$TUNXOUT= 0
##$USERA1= <user>
##$USERA2= <user>
##$USERA3= <user>
##$USERA4= <user>
##$USERA5= <user>
##$V9= 5
##$VALIST= <valist>
##$VCLIST= <CCCCCCCCCCCCCCC>
##$VD= 0
##$VDLIST= <DDDDDDDDDDDDDDD>
##$VPLIST= <PPPPPPPPPPPPPPP>
##$VTLIST= <TTTTTTTTTTTTTTT>
##$WBST= 1024
##$WBSW= 4
##$XGAIN= (0..3)
0 0 0 0 
##$XL= 0
##$YL= 0
##$YMAX_a= 446022
##$YMIN_a= -400925
##$ZGOPTNS= <>
##$ZL1= 120
##$ZL2= 120
##$ZL3= 120
##$ZL4= 120
##$ABSF1= 16.522
##$ABSF2= -4.171173
##$ABSG= 5
##$ABSL= 3
##$ALPHA= 0
##$AQORDER= 0
##$ASSFAC= 0
##$ASSFACI= 0
##$ASSFACX= 0
##$ASSWID= 0
##$AUNMP= <proc_1d>
##$AZFE= 0.1
##$AZFW= 0.1
##$BCFW= 0
##$BC_mod= 0
##$BYTORDP= 0
##$COROFFS= 0
##$CY= 12.5
##$DATMOD= 1
##$DC= 0
##$DFILT= <>
##$DTYPP= 0
##$F1P= 14.0000005364418
##$F2P= -0.99999901652339
##$FCOR= 0.5
##$FTSIZE= 32768
##$FT_mod= 6
##$GAMMA= 0
##$GB= 0
##$INTBC= 1
##$INTSCL= 1
##$ISEN= 128
##$LB= 0.3
##$LEV0= 0
##$LPBIN= 0
##$MAXI= 10000
##$MC2= 0
##$MEAN= 0
##$ME_mod= 0
##$MI= 0
##$NCOEF= 0
##$NC_proc= -4
##$NLEV= 6
##$NOISF1= 0
##$NOISF2= 0
##$NSP= 0
##$NTH_PI= 0
##$NZP= 0
##$OFFSET= 16.522
##$PC= 1
##$PHC0= -54.90751
##$PHC1= 6.646551
##$PH_mod= 1
##$PKNL= yes
##$PPARMOD= 0
##$PSCAL= 4
##$PSIGN= 0
##$REVERSE= no
##$SF= 250.13
##$SI= 32768
##$SIGF1= 0
##$SIGF2= 0
##$SINO= 400
##$SIOLD= 32768
##$SREGLST= <1H.CDCl3>
##$SSB= 0
##$STSI= 32768
##$STSR= 0
##$SW_p= 5175.98343685301
##$SYMM= 0
##$S_DEV= 0
##$TDeff= 65536
##$TDoff= 0
##$TI= <Analysis number 999999
Compound Code 99
Book Reference 9
Project Code 9>
##$TILT= no
##$TM1= 0
##$TM2= 0
##$TOPLEV= 0
##$USERP1= <user>
##$USERP2= <user>
##$USERP3= <user>
##$USERP4= <user>
##$USERP5= <user>
##$WDW= 1
##$XDIM= 32768
##$YMAX_p= 420091697
##$YMIN_p= -147459
$$ End of Bruker specific parameters
$$ ---------------------------------
##NTUPLES= NMR SPECTRUM
##VAR_NAME=  FREQUENCY,     SPECTRUM/REAL,   SPECTRUM/IMAG
##SYMBOL=    X,             R,               I
##VAR_TYPE=  INDEPENDENT,   DEPENDENT,       DEPENDENT
##VAR_FORM=  AFFN,          ASDF,            ASDF
##VAR_DIM=   32768,         32768,           32768
##UNITS=     HZ,            ARBITRARY UNITS, ARBITRARY UNITS
##FACTOR=    0.157963299565203, 1,           1
##FIRST=     4132.6476996994, 0,             0
##LAST=      -1043.33573715361, 0,           0
##MIN=       -1043.33573715361, -147459,     0
##MAX=       4132.6476996994, 420091697,     0
$$ Real data points
##PAGE= N=1
##DATA TABLE= (X++(R..R)), XYDATA
$$ [...]
18675A44051k6079j3099J3519P3338M9026M3516K9623M0767r661J1642R637k2914
18663C43366l0348n2841M162J9312L6603n463k5894J1705J2572L6331J5368R167
18651C74040J6984J9218n244L992J5434j7142l2016P163n8439l5511l5357q730
18639B44392k4606o857P152R149l2063l7168P369M1916p250j6342l1478o721j8679
18626A28814N57L2073j0748m9131n375J1981j7070J1484o270K4405K2015R938
18614A52673J6688M5413J9926j9563j628p959J8593j5366l3925k1270j1087M022
18602A46517j5365k3639K0084Q156L0814j5160j7426L132J4693M6355J6819k6823
18590A88157J1244K0838J0604N758L3038N4293k702j4614J1253k9611K8997L243
$$ plain form
18675 144051 117972 104873 118392 191730 240756 284272 313895 354662 345001 356643 366280 343366
18663 343366 313018 260177 264339 283651 320254 314791 288897 300602 313174 349505 364873 374040
18651 374040 391024 410242 404998 408990 424424 407282 375266 382429 323990 288479 253122 244392
18639 244392 219786 212929 220081 229230 197167 159999 167368 209284 202034 185692 154214 147493 128814
18626 128814 129371 161444 150696 101565 96190 108171 91101 102585 96315 120720 142735 152673
18614 152673 169361 214774 234700 215137 213509 205550 224143 208777 174852 153582 142495 146517
18602 146517 131152 107513 127597 135753 166567 151407 133981 137113 151806 198161 214980 188157
18590 188157 199401 220239 230843 236601 269639 323932 321230 306616 317869 288258 317255 320498
18578C20498p885J4465J6322K8609O4566K8008J3286K6527K8666K1572Q471j1399
18566E51706J6622J8894q492m5238m1886l0122m4861l7504l2454k1799K771o0930
18554B66707j0655O3296J0973j6496p447j0834m2258j8808j01N121K1279K8025
18542B88802m275r130M2287M721k14J9542Q523K5745Q580L7318j5052k9931J110
18529C78026O0972K9304J4274J391K1213L6713N8154M4476j7836P3077J12295
18518H12059J21160N2109O7211R4547M8246k8308J6413N817o6200l4959j7029
18507A071066j1663r175k2778m0915m5530n1258l5908j0694l0364j2767j0072
18496G89942l5540j8876J6528J5733K4446l2959K3209J5522K8215L9958N6314
$$ plain form
18578 320498 312613 327078 343400 372009 436575 464583 477869 504396 533062 554634 563105 551706
18566 551706 568328 587222 578730 533492 491606 461484 416623 379119 346665 324866 327637 266707
18554 266707 256052 319348 330321 313825 306378 295544 253286 234478 234377 239498 260777 288802
18542 288802 284527 275397 317684 322405 322191 341733 350256 376001 384581 421899 406847 376916 378026
18529 378026 438998 468302 482576 483967 505180 541893 600047 644523 626687 699764 812059
18518 812059 933219 985328 1052539 1147086 1195332 1167024 1183437 1189254 1123054 1088095 1071066
18507 1071066 1059403 1050228 1027450 986535 941005 889747 853839 843145 812781 800014 789942
18496 789942 754402 735526 752054 767787 792233 759274 782483 798005 826220 866178 922492
18485I22492M8854L1986L5582Q5895Q7983O5874O0423R4000J30606J99131J65586
18474A928412J55527K21258K76916L36955L59701M08512M47519M77594M84206
18465E096600N26331O41556Q18068J099425J586891K253255K687882K585923K583433
18456A9879364K995100L444487K648611J616714J463711K345273M532363Q116660
18448D7042283J3400999J7564924J7393306J8023440K2671021K6092971J6327393
18441A78516337L861657j615663o029339j1416732j6513668j8900917j7639337
18434A10262338j4166419j1331127q842553n531405k384301k393288m453328n849939
18426E5309978o349964o127573o117431o069267n615629m527270l178356k104046
$$ plain form
18485 922492 971346 1003332 1038914 1124809 1212792 1278666 1339089 1433089 1563695 1762826 1928412
18474 1928412 2083939 2305197 2582113 2919068 3278769 3687281 4134800 4612394 5096600
18465 5096600 5622931 6264487 7082555 8181980 9768871 12022126 14710008 17295931 19879364
18456 19879364 22874464 26318951 28967562 30584276 32047987 34393260 38925623 47042283
18448 47042283 60443282 78008206 95401512 113424952 136095973 162188944 178516337
18441 178516337 182377994 180762331 174732992 163316260 146802592 127901675 110262338
18434 110262338 96095919 84764792 75922239 70390834 68006533 65613245 61159917 55309978
18426 55309978 48960014 42832441 36715010 30645743 25030114 20502844 17324488 15220442
18418A5220442j399596q59965n21627l92940k83517j05440J12188L09623P10450
18409A2789618J245728K101882L396738M830062N436282N139696N300554O351378
18401D6591938O562682M237119K409083K624681M825111O968020Q174521J1289406
18393I3682561J6720743J8334750J2566482Q520231R778381P189156n189080j3962806
18385A47640418j8722984j8617944j7552647j6763701j5326274j2614970q706519
18378C9335379n267316k718329j349182j710408k312837k604904k598024k483204
18370A8291175k465372k410713k208654j784210j329765r03591p50745o68293
18362E769832n45781m69342m38257l85902l28606k89882k56545k45314j87101
$$ plain form
18418 15220442 13820846 12960881 12439254 12046314 11762797 11657357 11769545 12079168 12789618
18409 12789618 14035346 16137228 19533966 24364028 29800310 34940006 40240560 46591938
18401 46591938 53154620 57391739 59800822 62425503 67250614 74218634 82393155 93682561
18393 93682561 110403304 128738054 141304536 149824767 159603148 166792304 161603224 147640418
18385 147640418 128917434 110299490 92746843 75983142 60656868 48041898 39335379
18378 39335379 34068063 31349734 30000552 28290144 25977307 23372403 20774379 18291175
18370 18291175 15825803 13415090 11206436 9422226 8092461 7188870 6438125 5769832
18362 5769832 5224051 4754709 4316452 3930550 3601944 3312062 3055517 2810203 2623102
18353B623102j77498j64852j37287j28257j38686r2007j8363n5391q5827n7546
18343A567388m5194p6894n9552j1574l0815l1383p7023n2461m1307j9999K1604
18332A142790R893j7111K926j5319j5584m78J0278J8915J5026J04899M7431K4071
18320A327737K0071J5301J4349J3674r4538j12225q4828q3669p8977r7093p1851
18309G67951l9507j7200l7600l5435k5662N246j5582J824j7690p132k47k2853
18297E56113l8206k9143l0539J3487k0477j2650j0262k3705k0171m438K0990r305
18285C91694L6267L3686j654l4024O272j1339l1736l0954r979J492J668K9998
18273C81391K7040L297q600j2882k6668J5262j5625j8381j7480o172l0701n4125
$$ plain form
18353 2623102 2445604 2280752 2143465 2015208 1876522 1784515 1766152 1710761 1624934 1567388
18343 1567388 1522194 1445300 1385748 1374174 1343359 1311976 1234953 1182492 1141185 1121186 1142790
18332 1142790 1152683 1135572 1138498 1123179 1107595 1107117 1117395 1136310 1151336 1256235 1303666 1327737
18320 1327737 1347808 1363109 1377458 1391132 1296594 1184369 1099541 1015872 936895 839802 767951
18309 767951 728444 711244 673644 638209 612547 617793 602211 604035 586345 579213 578966 556113
18297 556113 517907 488764 458225 471712 451235 438585 428323 404618 384447 380009 400999 391694
18285 391694 427961 461647 459993 425969 432241 420902 389166 358212 348233 349725 351393 381391
18273 381391 408431 411728 403128 390246 363578 378840 363215 344834 327354 321182 290481 236356
18261B36356l4885q286m714K8668j3458l6246k6376L422o724j1584j8332J3017
18249A20858N5655m567k011K4948K1359K807j1544M905k3634J4209J7643L2791
18237B53419N2760L3368L2632r64p1313j02722j3353L428l6343J907K3992O398
18225A83209L2035L1095k3189O36l019k3064j6165L0757J9157n159K1159M3416
18213B90868M445L3486L7716K5815M7445R6804N5035p24P692N8299O1704n181
18201G13404n2395l5929n6047k8596n5012k1249k2670j8896n9349p0603j4432
18190B78226J1354M3682M1974j4984n7662l4072K0409o700m6071m1382o059l7799
18178A50916O791M428K9382M862J1035M7417M7481m721m3037j6485j7018j6993
$$ plain form
18261 236356 201471 193185 188471 217139 203681 167435 141059 144481 137757 126173 107841 120858
18249 120858 176513 171946 169935 194883 216242 219049 207505 212410 188776 202985 220628 253419
18237 253419 306179 339547 372179 371215 299902 197180 183827 187255 150912 152819 176811 183209
18225 183209 215244 246339 223150 223786 220767 197703 181538 212295 231452 226293 247452 290868
18213 290868 295313 328799 366515 392330 439775 536579 591614 590890 598582 656881 718585 713404
18201 713404 661009 625080 569033 540437 485425 464176 441506 422610 363261 292658 278226
18190 278226 289580 333262 375236 360252 302590 268518 288927 282227 236156 194774 188715 150916
18178 150916 157707 162135 191517 196379 207414 254831 302312 297591 254554 238069 221051 204058
18166B04058J4895J2032J0849L7240K2237L7007J8628K0309L9629L6254J2717
18155D65855M6604N2162N4255j388o242J9742J2447L7973m8991q0935n3716n7011
18143D40755o3137K7237Q492O974P410M822k6974j5695L0205M5777O178M569K6989
18130E03602J7657K1825J3680P2301P6359L7432N4118J15083J28252J12730J31671
18119A284710K07051L16307M13647O73527Q98751J355065K157944L669632O891576
18110A7868210J4415709K7177109J9581714m018217j3745020k1993057j6376938
18103B2909510q550133m548167k635066j641531j092153p51961n91689m98419
18095B600391m22741l65012k62674j98395j65233j40770j09025p6005m9667n5196
$$ plain form
18166 204058 218953 230985 241834 279074 301311 338318 356946 377255 416884 453138 465855
18155 465855 512459 564621 618876 617488 611246 630988 643435 681408 632417 551482 497766 440755
18143 440755 377618 404855 413347 420321 427731 432553 405579 389884 420089 465866 472044 476613 503602
18130 503602 521259 543084 556764 629065 705424 742856 796974 912057 1040309 1153039 1284710
18119 1284710 1491761 1808068 2221715 2895242 3793993 5149058 7307002 10976634 17868210
18110 17868210 32283919 59461028 79042742 75024525 61279505 39286448 22909510
18103 22909510 14359377 9811210 7176144 5534613 4442460 3690499 3098810 2600391
18095 2600391 2177650 1812638 1549964 1351569 1186336 1045566 936541 860536 810869 755673
18085G55673p9233k1863k0673o5165p6415o5634o2497m3578J4761j9482J1006
18074C26900K9460j1308l9698m1650j1342Q197R705l8472m5964k3717K561k9228
18062A35444j3288J1989l3976J0136K1303P403M866k2903K3865p848k9507O103
18050A13587j5743J500P530M2182J0244l4219J4916K6150j1135m353k9995k0227
18038A00437n182j5341J1954K7224M3255m512m3049m6301q2967m0647L7165L8503
18026B0539K5472J4818K6303R131m1831J2778K0600j3797q318K1432O697N824
18014I9648J4502q475l2917j6657K4027k204j1649k9575j2542M2127K8722j1314
18002H3693j0465o838j3346o145K1319J2635m054J031m0355l830M724Q081k2602
$$ plain form
18085 755673 676440 654577 633904 568739 492324 426690 364193 320615 335376 315894 326900
18074 326900 356360 345052 305354 263704 252362 260559 270264 231792 185828 162111 164672 135444
18062 135444 122156 134145 100169 110305 131608 139011 143877 120974 144839 136991 107484 113587
18050 113587 97844 99344 106874 149056 159300 125081 139997 166147 155012 150659 120664 100437
18038 100437 95255 79914 91868 119092 162347 157835 114786 68485 -14482 -55129 -17964 20539
18026 20539 46011 60829 87132 96263 54432 67210 87810 74013 65695 87127 93824 99648
18014 99648 114150 105675 72758 56101 80128 77924 66275 36700 24158 66285 95007 83693
18002 83693 73228 66390 53044 46899 68218 80853 76799 77830 37475 33645 38369 46450 23848
17989B3848j4078R949K5002O1808L8709J9434k6353o2314p3137j3523k347J9461
17977F459J5498K4139P2R765j3389k4980Q739J4003N996k7008J294L3965J9236
17964G3789o002J9495l2842k0190K1876o028M3243j465J8488K8095J5578k389
17952A51648K8109O4135Q0461M9849J4399M5897J7578P6279O8037J3283K230L5431
17940F47336O8928L5482K6448O020N553j4261o537o2001r4776q3817n6113r0222
17928C82040n8664p9062n6361n0543j0322L7621J05O386L5662k4567j6904J97
17916A65588m9659N019J6333k0918O578j4816l2082k032J7420K9272M4100K9162
17904A93965K2772L3410M8004L7253M1084M5995N5006K8021N4159Q6982K3134
$$ plain form
17989 23848 9770 19719 44721 106529 145238 164672 138319 76005 2868 -10655 -13002 6459
17977 6459 21957 46096 46168 55933 42544 17564 26303 40306 46302 19294 20588 54553 73789
17964 73789 67787 87282 54440 34250 56126 50098 93341 91876 110364 138459 154037 151648
17952 151648 179757 243892 324353 374202 388601 434498 452076 528355 596392 609675 611905 647336
17940 647336 716264 751746 778194 784214 789767 775506 768969 706968 612192 528375 472262 382040
17928 382040 323376 244314 187953 137410 127088 164709 164814 171200 206862 182295 165391 165588
17916 165588 115929 120948 137281 116363 122941 108125 76043 74011 91431 120703 164803 193965
17904 193965 216737 250147 298151 335404 376488 422483 477489 505510 559669 646651 669785
17893F69785k9874l344j6247r815l6650o1143n6854m1278J6358J1559M8450M8719
17881E39666L4499N2108N088p281m7356l5088o7901q7022p4468p4006q1093n8481
17869I8665k3351l0469J4531O408n91q704j9715l584J6181K0804q488L6375R042
17856A07104p721m0692O044p858P479j8995R914L6272o031J7112m133m9499p945
17843D1051M0682M055p302k4362m1730n483L947K3717J052R150K849P023Q913
17830F3562J3133l9168k4838M930K0262K5331m5680l6652J9038k0052K0838M2522
17818D3226j2023k0028j8566L4625k3997k9362P111K9513j9964l4492k1204M4124
17806b1037J2923M1158K3590P757Q046J1797J2322j1887l0949n1914p232m2274
$$ plain form
17893 669785 639911 636567 620320 610505 573855 512712 455858 414580 430938 442497 490947 539666
17881 539666 574165 626273 631361 624080 576724 541636 473735 386713 312245 238239 157146 98665
17869 98665 75314 44845 59376 65784 65193 56489 36774 33190 49371 70175 61687 98062 107104
17856 107104 99383 58691 64735 56877 64356 45361 55275 91547 85516 102628 98495 48996 41051
17843 41051 81733 85788 78486 54124 12394 6911 10858 34575 35627 44777 47626 54649 63562
17830 63562 76695 37527 12689 17619 37881 63212 17532 -19120 -82 -20134 704 43226
17818 43226 31203 11175 -7391 27234 3237 -26125 -19014 10499 -9465 -43957 -65161 -21037
17806 -21037 -8114 33044 56634 64391 72437 84234 96556 84669 53720 1806 -5426 -47700
17794d7700q275L2218L9928M982R284o519j7367J9891L7970j3236R827l268k0420
17781C7315l9907M785N9656K8929j3233j1212J0612l5099m0883o563J9605k1731
17769g726j3265K1034l1341o846K1693K8917k9862k1667l742J6118K070k326R989
17756a6954k3692K7174J2150Jl9002P961m370l3585r080N9696L8925J2246O988
17743C8458J1183k6820l7052J5926N236j4298j8202O944O716K9149M2297m7291
17731A2246k3107J4067M3908N745q142p370j404k1115k9676K3451m528k0513L031
17718a3407m933J0711M157M85j2629k3867M871j2783M5358M4589J3913j5027j42
17705D1296j7941L891J6122k3254O167J3408j7926k4874m648J8378l841Q76m0723
$$ plain form
17794 -47700 -55975 -23757 16171 21153 30437 23918 6551 26442 64412 51176 61003 57735 37315
17781 37315 -2592 2193 61849 90778 77545 66333 76945 41846 963 -5600 14005 -7726
17769 -7726 -20991 43 -31298 -38144 -16451 12466 -17396 -39063 -42805 -26687 -24617 -26943 -16954
17756 -16954 -40646 -13472 -1322 -1321 -40323 -32362 -36732 -70317 -79397 -19701 19224 31470 38458
17743 38458 49641 22821 -14231 1695 6931 -7367 -25569 -18625 -11909 17240 59537 12246
17731 12246 -10861 3206 47114 52859 44717 37347 35943 14828 -14848 8603 4075 -16438 -13407
17718 -13407 -18340 -7629 -3472 -2987 -15616 -39483 -34612 -47395 -2037 42552 56465 41438 41296
17705 41296 23355 27246 43368 20114 26281 39689 21763 -3111 -7759 10619 6778 7654 -33069
17692c3069k1644K9144K4666k4632j098m393J2483L2965K699k9521p1024n3945
17680a37369J6446N3520N1815O040j5770n924J4194L1623j5034j7771J539O499
17668a0192J256j1857J2295J4344J6448j9055k3845M775K7617k6364j2941L8719
17656A1200K1404l1191J0377K8796j6420l2432J090j007K7713J8878K021l2266
17644H163M117M1143J0170j8111l1842m757j5672M944R399R380N086L694o781
17631A8933j7750K8164R972j1090l8721J2709K8479q629m765j5279K6675j2410
17619A6288K4255M324l3796o896J7303l1961k170J1420L1299J1170k0769J1644
17607C2111o737j6819N129m966J4779J9674n576L2259k8857m2306j249K896J9362
$$ plain form
17692 -33069 -54713 -25569 -903 -25535 -26633 -31026 -18543 14422 17121 -12400 -83424 -137369
17680 -137369 -120923 -67403 -15588 -9548 -25318 -31242 -17048 14575 -459 -18230 -16691 -10192
17668 -10192 -8936 -20793 -8498 5846 22294 3239 -20606 -15831 11786 -14578 -27519 11200
17656 11200 32604 1413 11790 40586 24166 -8266 -7176 -8183 19530 38408 40429 8163
17644 8163 12280 53423 63593 45482 13640 8883 -6789 -1845 7554 16934 22020 25714 18933
17631 18933 1183 29347 39319 28229 -10492 2217 30696 22067 17302 2023 28698 16288
17619 16288 40543 44867 11071 4175 21478 -10483 -12653 -1233 30066 41236 20467 32111
17607 32111 25374 8555 13684 8718 23497 43171 37595 69854 40997 -1309 -2558 338 19700
17594A9700J7412j8933j0440P998L368K3313L1361k1028l6489J4826k2410q607
17582G1L7605l337q451k8052j011K4568k7945o4714j3661J6431J5014j651j2071
17569f7204K202L284K7165K2447J6750l785j8356L0919L5087K3942j1206L680
17557F4925p079N46k4044j77M48j052n163j9370k8609q026j6606j5055J8421K3568
17543a7273L6595O853q055k5124j8466k1148J7914L0516m134K1982L5457j1901
17531D3216k353j9591l0692p991R071r658J0250j014l0463K7468k7971K6393J9141
17518E806k4273K7610j9586L638J4333j624k8977L7155j33M304j9251k2132K1556
17505a574J216o544L660k4871l8214O728N34k0266K2525K9277j1389j4950m977
$$ plain form
17594 19700 37112 18179 7739 15737 19105 42418 73779 52751 16262 31088 8678 71
17582 71 37676 34339 25888 -2164 -3175 21393 -6552 -71266 -84927 -68496 -53482 -55133 -67204
17569 -67204 -65002 -61718 -34553 -12106 4644 859 -17497 13422 48509 72451 61245 64925
17557 64925 57846 58392 34348 34171 34619 33567 28404 9034 -19575 -27601 -44207 -59262 -40841 -17273
17543 -17273 19322 26175 18120 -7004 -25470 -46618 -28704 1812 -2322 19660 55117 43216
17531 43216 40863 21272 -9420 -17411 -8340 -17998 -7748 -8762 -39225 -11757 -39728 -13335 5806
17518 5806 -18467 9143 -10443 -6805 7528 5904 -23073 14082 13949 18253 -998 -23130 -1574
17505 -1574 -358 -6902 -3242 -28113 -66327 -59599 -59065 -79331 -56806 -27529 -38918 -53868 -58845
17492e8845k5474K3369L2704J5397K0108J7078k3484l4435J7281K5438l4545k8342
17480e3750p812R842O912K8001L7371J0028n104k486l4177j1110J406k189k7801
17467e0869k5156K3894N8161p26l1415L670K105O1038M349j8360k7960l3300J1646
17454b2923K8134j0160j6404j2566M9863L5392j0998J2632K2333k319K6657J32403
17442B32044J85012J4828o9307j07580j07922n9857l7936k3545j3162k970j552
17431H053l794p968L700K7709R909m7138o788r69o942m716M2901K3903j927k663
17417C3270N301j6858l4382Q473K8202k1907K962k5459k9781Q759K1112o864K3493
17404c679M2360K9355N971K712l6668m8933k106J3989J8148k8947l308N872j9491
$$ plain form
17492 -58845 -84319 -60950 -28246 -12849 7259 24337 853 -33582 -16301 9137 -25408 -53750
17480 -53750 -61562 -51720 -44808 -16807 20564 30592 25488 23002 -11175 -22285 -20879 -23068 -50869
17467 -50869 -76025 -52131 6030 5304 -26111 -22441 -20336 40702 45051 26691 -1269 -34569 -22923
17454 -22923 5211 -4949 -21353 -33919 15944 51336 40338 52970 75303 72984 99641 232044
17442 232044 417056 431884 362577 254997 147075 87218 49282 25737 12575 9605 8053
17431 8053 4259 -3709 -9 27700 37609 -9529 -16317 -17286 -24228 -28944 13957 37860 35933 33270
17417 33270 38571 21713 -12669 -4196 24006 2099 5061 -20398 -50179 -41420 -20308 -27172 -3679
17404 -3679 38681 68036 74007 76719 40051 -8882 -10988 3001 21149 -7798 -11106 -5234 -24725
17391b4725J8777k6647l1430q169J9039L6478J8844K3851J8132P034k0312k4017
17379F855m27k444r545l0539k5071K9993J887k1892K118J8874J2460k0291J8093
17366a9929N227n783J6941L1114k605q557K2302J7686j0326l3293l6846J321J6507
17353f241k285k975L2970J2336J613L1677k9397n6617N048J4859L4794L0343j1740
17340E4385k4244k8937P693j3430k748J6272J6629J41j2522O763j1027K9730k1090
17327A7615k3229N883j6158R556p810o821N5428N115M631O4389m1892p7721o2768
17314g3782N3386M1816j1702L745j966J3948K0048J3636r771m813l9922j0782
17302f159L9568O077p309j837K938J0331J3887j0426j797K1393K7228L348o386
$$ plain form
17391 -24725 -5948 -32595 -64025 -72194 -53155 -16677 2167 26018 44150 51184 30872 6855
17379 6855 6428 3984 -5561 -36100 -61171 -31178 -29291 -51183 -49065 -30191 -17731 -38022 -19929
17366 -19929 -14702 -20485 -3544 27570 24965 16408 38710 56396 46070 12777 -24069 -22748 -6241
17353 -6241 -8526 -11501 21469 33805 35418 67095 37698 -18919 -13871 988 35782 66125 54385
17340 54385 30141 1204 8897 -4533 -7281 8991 25620 25761 13239 20002 8975 38705 17615
17327 17615 -5614 269 -15889 -6333 -14143 -20964 34464 39579 44210 108599 66707 -11014 -73782
17314 -73782 -20396 21420 9718 13463 11497 25445 45493 59129 49358 44545 4623 -6159
17302 -6159 33409 39486 32177 30340 33278 43609 57496 47070 45273 66666 93894 97242 90856
17289I0856j1281j9592k9793p221K1560j0220j7011K6331J492o932m213N315k7946
17276A1345k9856L680K139J0488K8897r295K684L7867r057l7399k0697j3079L0138
17263G855K3676o315m238j1548k5948K1724j4976j3367j222L4704J4407L5229
17251E9981j0010m6422J3360N589p984o370M082k3539k6697k286L2351L6246K2001
17238E0302j2039p672j4101K1648j0933J8012k252J5533l8327l1896j0472j0879
17226c3076L2456M4655l1573P809l202k8677m1669l0244m824P436L2451K4514
17214b3944K3091M1455j2984J0289K3574N555j8340j4193J9480j858l500n0514
17202a889l4422n172J5842j5918j3894n839L9370K5287l358P746O451J2230L152
$$ plain form
17289 90856 79575 59983 30190 22969 44529 34309 17298 43629 45121 38189 33976 39291 11345
17276 11345 -18511 -14831 -12692 -2204 26693 17398 20082 57949 48892 11493 -9204 -22283 7855
17263 7855 31531 25216 20978 9430 -16518 5206 -9770 -23137 -24359 10345 24752 59981
17251 59981 49971 3549 16909 22498 14514 8144 12226 -11313 -38010 -40296 -7945 28301 50302
17238 50302 38263 30591 16490 38138 27205 45217 42965 58498 20171 -11725 -22197 -33076
17226 -33076 -620 44035 12462 20271 17069 -11608 -53277 -83521 -88345 -80909 -48458 -23944
17214 -23944 -853 40602 27618 37907 61481 67036 48696 34503 53983 52125 48625 -1889
17202 -1889 -36311 -41483 -25641 -41559 -55453 -61292 -21922 3365 7 7753 14204 26434 29586
17189B9586J907J6279J1727J1910M454l8703k9954j6441K2047k5015k5758Q991
17177b8970L4408K4068j8964q206q342p994J1073K7322K5800P458j2918j1677
17165C3058m2050K23j2603o386P558R95k534K3711m051J9757J5882j3920j047
17152A8593o213l8875m6823J0573K7681M4490r736p864l2887O977L2944K3289
17140B2149p995l643P973r307J5951j8328l2314j4589K5005K2490P933j2621L5736
17127C8440k2954l5877l3449N66K7839j0208k6420M085N9836J5268l2485n0827
17115f6186m5558N1464M564j8058J4514K2072k903l216K1307J0742J972k6907
17103c6193K6431M4586K6870l2442l4546l5719O179l8558p633N6811K0597J6551
$$ plain form
17189 29586 31493 47772 59499 71409 75863 37160 7206 -9235 12812 -12203 -37961 -28970
17177 -28970 5438 29506 10542 2336 -6006 -14000 -2927 24395 50195 57653 44735 33058
17165 33058 -8992 -8769 -21372 -27758 -20200 -19205 -21739 1972 -2079 17678 33560 19640 18593
17152 18593 12380 -26495 -73318 -62745 -35064 9426 -310 -8174 -41061 -34084 -1140 22149
17140 22149 14154 10511 18484 9177 25128 6800 -25514 -40103 -15098 7392 15325 2704 38440
17127 38440 15486 -20391 -53840 -53274 -25435 -35643 -62063 -57978 1858 17126 -15359 -66186
17115 -66186 -111744 -60280 -55716 -73774 -59260 -37188 -40091 -43307 -22000 -11258 -9286 -36193
17103 -36193 -9762 34824 61694 29252 -5294 -41013 -34834 -73392 -81025 -24214 -3617 12934
17091A2934J1223l481l856k3818j5506K1979k5556l802m89J4920J6210p241J2523
17078F040j4901j7262j4184Q050p994J4074l223O707K6727J386k1690o601m9462
17065g2333l547M9681J8694l0354J1230J9119j2686P04L0023J8783J4104l6784
17053F634l4481L316J9257J9562P708p189J5769j6074n5111j1636K4112O317O707
17040a5109k40m529p632K095J1179J5425P522Q94J6030K8930l004n6859k0635
17027b5933K2678J6313Q238n992k187l5020J7056J7505J1669K598n283K9774J8728
17014G0144j8316m1721k9774J9758M275J297p015M517K1027J0906K003K4604J6453
17001G8158L175m3020j7970k5617J2489K9049K4325R545m6313j5591j169J4399
$$ plain form
17091 12934 24157 20676 16820 -6998 -22504 -525 -26081 -29883 -30372 -15452 758 -6483 6040
17078 6040 -8861 -26123 -40307 -32257 -40251 -26177 -29400 -22693 4034 5420 -16270 -22871 -72333
17065 -72333 -75880 -26199 -7505 -37859 -26629 -7510 -20196 -19492 10531 29314 43418 6634
17053 6634 -27847 -24531 -5274 14288 21996 14807 30576 14502 -40609 -52245 -28133 -21816 -15109
17040 -15109 -15349 -19878 -27510 -25415 -14236 1189 8711 9605 25635 54565 51561 -5298 -25933
17027 -25933 -3255 13058 21296 15304 13117 -21903 -4847 12658 24327 26925 21642 51416 70144
17014 70144 51828 10107 -19667 91 4366 5663 -1352 3165 24192 35098 37101 61705 78158
17001 78158 81333 38313 20343 -5274 7215 36264 60589 70134 23821 8230 7061 21460
16989B1460N173j7714l7315l2687L4288O133N610L5137J6959j5823l4082k8665
16977d1526J1464K216r746j8104L3164O3276m261k5593p875n493K5124J0581j6165
16964A7062k3515J7759J6536m2994J550Q482N939k2657J1882k8234j7654L6179
16952a9665N025k869j569M377J9068J9480n087j7727q329K9902K2146N307L4127
16939H4186j6447m9376m08k6395j1390m237j2739L730K2353J5686p440l1179j1431
16926d5087K0389j2332K9938K5632k8427q434K0244j8187l3637J0269J4595r219
16914c4256o304o998K0601j0137k8209K4893K2862J5034q79L632K0360N145j045
16901B4699K5949N423j3603l4332j2393L8686j8579l2897L400L2683Q32k9986
$$ plain form
16989 21460 26633 8919 -28396 -61083 -26795 -20662 -15052 20085 37044 21221 -12861 -41526
16977 -41526 -30062 -27846 -37592 -55696 -22532 40744 36483 10890 3015 -2478 22646 33227 17062
16964 17062 -6453 11306 27842 -15152 -13602 -5120 819 -21838 -9956 -38190 -55844 -19665
16952 -19665 -14640 -17509 -19078 -14701 4367 23847 18760 1033 -7296 22606 44752 50059 84186
16939 84186 67739 18363 17955 -8440 -19830 -24067 -36806 -33076 -10723 4963 -2477 -33656 -45087
16926 -45087 -24698 -37030 -7092 18540 -9887 -18321 1923 -16264 -49901 -39632 -25037 -34256
16914 -34256 -40560 -47558 -26957 -37094 -65303 -40410 -17548 -2514 -3393 239 20599 25744 24699
16901 24699 50648 56071 42468 8136 -4257 34429 15850 -17047 -13647 19036 19868 -10118
16889a0118J29l237k3126M06o469L2793J0549p398j693J0792J127N037j8032o2854
16875g2094l7407P807K9660j1166M1745j8433l9488k103K4797p245k182M1122
16863d4987L1880J3227O01O682r063j8602k270k3308k7232k1934L2193J2174L1892
16850a8747j629J6807K6488j9507J0240L4722l8134n419K1230j2059k5440j3757
16838b5205K7939J0151K927j8557k2906k0221M9976j0906j0058M076l422j6090
16826c2296K215p027mP77M4918K5468K1519j5794n504r740n499K9669j2194o545
16812B9963K2939M2947l5218m7498j5459J3078n004M17J0965l0791L128P690M328
16799A485o465j5108r246K7548K1817K3529L1768l0777l2074n836N625n5129l4762
$$ plain form
16889 -10118 -9989 -13226 -36352 -35946 -42415 -9622 927 -6471 -8164 2628 3755 8792 -9240 -72094
16875 -72094 -109501 -101694 -72034 -83200 -41455 -59888 -99376 -101479 -76682 -83927 -86109 -44987
16863 -44987 -13107 120 721 7403 -1660 -20262 -22532 -45840 -73072 -95006 -62813 -50639 -18747
16850 -18747 -20376 -3569 22919 3412 13652 48374 10240 4821 26051 13992 -11448 -25205
16838 -25205 2734 12885 15812 -2745 -25651 -45872 4104 -6802 -16860 -12784 -16206 -32296
16826 -32296 -30081 -37108 -37112 -36335 8583 34051 55570 39776 34272 24532 19033 48702 36508 29963
16812 29963 52902 95849 60631 13133 -2326 10752 5748 6165 17130 -13661 -10533 -2843 1485
16799 1485 -4980 -20088 -29334 -1786 20031 43560 75328 44551 12477 6641 12266 -42863 -77625
16786g7625N0833K2207l2937j5057R337J7330Q5k2507k6042k5604M3739M4494
16774a1747p588L3720K0613j2504k0450m771J2296l1501l6228n63J603N876P346
16761d3898J5598k8705J3071L2626K2594K0159k770m2698n4834k8560L923l1122
16749a24616J1761J3073K3082N0062M1059K7623j9155M459J1480l3279k4983R531
16737i903j7131P955J9745l32j4788j8337j0634J0603L7404j8398k9872M92J3010
16724c0186l259K1064J7657J4137K0425n353j9117J789k5631j314J6523l2699
16712b5964L1598J1086j6604J2966k2881j6825K0859j4917j425j6899K3357J3850
16700a799K696l3490k3377L8377J3615J8769k170l3370k0903L670l0209Q685K6704
$$ plain form
16786 -77625 -26792 -4585 -37522 -52579 -43242 -25912 -25827 -48334 -74376 -99980 -56241 -11747
16774 -11747 -19335 14385 34998 22494 2044 -2727 9569 -21932 -58160 -58723 -57120 -51244 -43898
16761 -43898 -28300 -57005 -43934 -11308 11286 31445 28675 -14023 -68857 -97417 -93494 -124616
16749 -124616 -112855 -99782 -76700 -26638 14421 42044 22889 27348 38828 5549 -19434 -9903
16737 -9903 -27034 -19079 666 334 -14454 -32791 -43425 -32822 4582 -13816 -43688 -43196 -30186
16724 -30186 -33445 -12381 5276 19413 39838 34485 15368 17157 -8474 -9788 6735 -25964
16712 -25964 5634 16720 116 13082 -9799 -26624 -5765 -20682 -22107 -39006 -15649 -1799
16700 -1799 897 -32593 -55970 -17593 -3978 14791 12621 -20749 -41652 -37982 -68191 -59506 -32802
16687c2802M7509L8383K4550l1372n0663j1399Q886J2128K052M365j4636j853
16675d852k6828q298j491R893l244J258K2575K5323j0068j8269n1707m5360L6907
16662g4161M9646L4529l839p53J1475L0729j3220l2633l2285J6603K2203k3942
16650a5648k9425K298K1565j0536k0273O823M0523M641j6125L4485K5077j0836
16638C2569k0027M956L6080K9919j2019m6236j6655j0057J5062j7210l3478K568
16626c4528O866j329L4786L578J6633n968m0619k4991N070J1435j5650P922M2719
16613E924N6074j3407n0472q888m061J1819L5241M435J9600j6200m7736l3208
16601d0879M49K6497K3801j1544k87q640k5761j1041J1669n245m38J4021r278
$$ plain form
16687 -32802 14707 53090 77640 46268 -4395 -15794 -6908 5220 7272 11637 -2999 -4852
16675 -4852 -31680 -39978 -41469 -31576 -34820 -33562 -10987 14336 4268 -14001 -65708 -111068 -74161
16662 -74161 -24515 10014 6175 5422 16897 47626 34406 1773 -30512 -13909 8294 -15648
16650 -15648 -45073 -42775 -21210 -31746 -52019 -45196 -4673 -32 -16157 18328 43405 32569
16638 32569 12542 17498 53578 83497 71478 25242 8587 -1470 13592 -3618 -37096 -34528
16626 -34528 -27662 -28991 5795 9373 26006 20038 -20581 -45572 -40502 -29067 -44717 -36795 5924
16613 5924 61998 48591 -1881 -10769 -14830 -3011 32230 36665 56265 40065 -7671 -40879
16601 -40879 -40430 -13933 9868 -1676 -1963 -10603 -36364 -47405 -35736 -40981 -41419 -27398 -36676
16588c6676j7831L1156J8172j0333k3032l636L7355n39k4364K4843j2357k4402
16576d1644L0865n428q330J8646J0822k0013l052l0945O526j1521j7554l0182
16564a01810L9367K7578L6547l479Q846k08j0184k376o593r067J5842J1914m684
16551A693k8576j2773L655K1585Q265k1668K1795J1314j1899l8109M427L1438
16539h853j5806k1954O8019J6291j7282L9561j349k3069j6557j9806q896J0140
16527D39N3231K5263l1559p5856l2399l678j2059N5528J4579l0402O2640k8122
16515b395k2093q955j3088q498Q785J3017J5690n565P591J2756k3966n104j4077
16502d5902K9956L8143P436l8879j3081l7207M236J8048j9785J1307m0849k2317
$$ plain form
16588 -36676 -54507 -23351 -5179 -15512 -38544 -42180 -4825 -5364 -29728 -4885 -17242 -41644
16576 -41644 -10779 -16207 -24537 -5891 4931 -15082 -18134 -49079 -42553 -54074 -71628 -101810
16564 -101810 -62443 -34865 1682 -1797 7049 6841 -3343 -5719 -12312 -21379 -5537 6377 1693
16551 1693 -26883 -39656 -36001 -14416 -6151 -27819 -6024 5290 -6609 -44718 -40291 -8853
16539 -8853 -24659 -46613 21406 37697 20415 59976 58627 35558 19001 -805 -9701 439
16527 439 53670 78933 47374 -28482 -60881 -64559 -76618 -21090 -6511 -36913 25727 -2395
16515 -2395 -24488 -33443 -46531 -55029 -46244 -33227 -17537 -23102 -15511 -2755 -26721 -31825 -45902
16502 -45902 -15946 22197 29633 -9246 -22327 -59534 -55298 -37250 -57035 -45728 -86577 -108894
16490a08894M6871J9693J3003L9203P555k2429k4443K0428M8087K9258p3144m2638
16478d7450K5046R809l331j920R095P774L0269O1118n958l0712q262K7807j9791
16465E3494m1233l4484j5070L3539J7115k3850m275J3444K3073L260j176j9424
16453D413P28k7929l9097J2081M4973J0154K1944K2647k7199m2979k6730q622
16441e5616k807L48M1500L9672j1839l4182j6905J2961L6179O353j848k4811o976
16428a7971K5805J4846n3836l876L1118j4717j2085j6420j1916N456N060l651
16416e2187R929J2144j6944j6789L3029N0410n950l8731M676r661k8082l022M3348
16403a7830N6994j9474k8894j0045j9193k9443L918k2548j4710M6745L019j476
$$ plain form
16490 -108894 -62023 -42330 -29327 9876 17431 -4998 -29441 -9013 39074 68332 -4812 -47450
16478 -47450 -22404 -12595 -15926 -17846 -8751 -977 29292 90410 84452 53740 45478 73285 53494
16465 53494 12261 -22223 -37293 -3754 13361 -10489 -14764 -1320 21753 25013 23837 4413
16453 4413 5141 -22788 -61885 -49804 -4831 5323 27267 49914 22715 -20264 -46994 -55616
16441 -55616 -58423 -58075 -16575 23097 11258 -22924 -39829 -26868 9311 15664 13816 -10995 -17971
16428 -17971 7834 22680 -31156 -35032 -3914 -18631 -30716 -47136 -59052 -53596 -48536 -52187
16416 -52187 -42258 -30114 -47058 -63847 -30818 19592 13642 -25089 -20413 -30074 -58156 -61178 -17830
16403 -17830 39164 19690 -9204 -19249 -38442 -67885 -63967 -86515 -101225 -54480 -51461 -52937
16391e2937j876m3046l2376N864L9586O0529n915j4102Q873J3462j2137j023K5666
16378i432j0326l637O2611J358k503J6038k3733j1105L806J0903J4436J1285J2055
16365G1756l0615j9948K4072M237k699K9579P30j6327M563j8246J537J6103L1057
16352I5799P392j4461l5374K368k2212n8219l1138j0941J9913k9476n4169M6417
16340h4101M5103J6181j4921K0112l807m0206j0301K4247L8439K6172K2980k7983
16328A1915l7995q26l061l3466L206R855k9892J1065L3190M3184L328q698l452
16315a647k3914m8259J8705L1808k856K8050J5414k963J0102p867K3013Q297j344
16302D6539l5839o3784n7399R030M2743M2646o604j8239M6061L4426j4422k6401
$$ plain form
16391 -52937 -54813 -97859 -130235 -124371 -84785 -24256 -30171 -44273 -35400 -21938 -34075 -35098 -9432
16378 -9432 -19758 -23395 39216 40574 38071 54109 30376 19271 23077 33980 48416 59701 71756
16365 71756 41141 21193 45265 49502 46803 76382 77112 60785 65348 47102 48639 64742 95799
16352 95799 103191 88730 53356 55724 33512 -24707 -55845 -66786 -46873 -76349 -130518 -84101
16340 -84101 -38998 -22817 -37738 -17626 -21433 -61639 -71940 -47693 -9254 16918 39898 11915
16328 11915 -26080 -26906 -29967 -63433 -60227 -50372 -80264 -69199 -36009 7175 10503 1805 -1647
16315 -1647 -25561 -73820 -55115 -23307 -26163 1887 17301 14338 24440 16573 39586 47883 46539
16302 46539 10700 -53084 -110483 -101453 -58710 -16064 -22668 -40907 5154 39580 25158 -1243
16290a243k662k2375K2435M2161k6354n1479j2266K0845J0753N5066O134m1803
16278g88j6178J5821O344k7153j1571L821J0906N770r177J3895q164k8201L3250
16265a1425L4438j2949j7539n228j1683L999N2152J2632j2674k3451k1689J1027
16253b390j6814l1937J1085l868k8248L3008K9284k0294J3145L3063m596k7300
16241a5862J4393K2886l422p007l202k964l8519j5711l1749k7800R882L1836K987
16228f4252K2635j2299k1153k9374K0134K0994J0979M976J7228J1830l8978n354
16216f2634N459R365M336K6256O373J4873R078j0502l2604L9417J3761l0666k2172
16203b9660K0731k5587k5055J4324M851O6196M3106o535m8083J1459L3662j8884
$$ plain form
16290 -1243 -3905 -26280 -3845 38316 11962 -39517 -51783 -30938 -20185 34881 41015 -788
16278 -788 -16966 -1145 5199 -21954 -33525 -29704 -18798 -13028 -22205 -8310 -16474 -44675 -11425
16265 -11425 23013 10064 -7475 -12703 -24386 -20387 31765 44397 31723 8272 -13417 -2390
16253 -2390 -19204 -51141 -40056 -43924 -72172 -39164 -9880 -30174 -17029 16034 11438 -15862
16241 -15862 -1469 21417 17995 10988 7786 4822 -33697 -49408 -81157 -108957 -99075 -67239 -64252
16228 -64252 -41617 -53916 -75069 -104443 -84309 -63315 -52336 -47360 -30132 -18302 -57280 -62634
16216 -62634 -57175 -47810 -43474 -17218 -10845 4028 13106 2604 -30000 9417 23178 -7488 -29660
16203 -29660 -8929 -34516 -59571 -45247 -40396 25800 68906 62371 14288 25747 59409 40525
16191D0525m0994n8099j4712J0819J7847K3532K8005r481q261j0761R35l2288
16179e2933l5476K3623K6742K455j0484K8788L7011j1773m3253j3063m299J2581
16167d0081M874K69l864m123J457O501k159K703M4230M0778l7794j8978J9268
16154A3081k1056j84J3051j8597j4855L3877m1502j7926p437J702p613K5343O9450
16141B7334l360p296j3747j9897J4226k3554O938J1114m598J3913j7733k861q398
16128b7919j4235J4051j2540K8730N8782q898n2146j0740m3171L137N3215N4381
16116D2647k513O188k898J0229k2381n5970j2640k325j9136M6489J0383O112j1203
16103g018l88j9892k4081L8638K5300l8354m1229J1324L0841M8153K2889J9242
$$ plain form
16191 40525 -469 -58568 -73280 -62461 -44614 -21082 6923 -2558 -10819 -21580 -20645 -52933
16179 -52933 -88409 -64786 -38044 -35589 -46073 -17285 19726 7953 -35300 -48363 -52662 -40081
16167 -40081 -35207 -34938 -38802 -42925 -41468 -34967 -37126 -34423 9807 50585 12791 -6187 13081
16154 13081 -7975 -8159 4892 -13705 -28560 5317 -36185 -54111 -61548 -59846 -67459 -42116 27334
16141 27334 23974 16678 2931 -16966 -2740 -26294 -19356 -8242 -12840 1073 -16660 -19521 -27919
16128 -27919 -42154 -28103 -40643 -11913 46869 37971 -14175 -24915 -68086 -64949 -11734 42647
16116 42647 40134 46322 43424 53653 31272 -24698 -37338 -39663 -58799 -12310 -1927 4185 -7018
16103 -7018 -7406 -27298 -51379 -12741 12559 -25795 -67024 -55700 -24859 23294 46183 65425
16091F5425p443q629J981K3030n7408k3445q563J2339P664k383k357j8392j3144
16078c1325K6176m645k6868k854L034J3177M2470K3536J6518m1525l8143K7475
16066G026J3546Q580k1853P755k7167k0509K9023L551J9442K1884L9232L6294
16054A16804k0236m7156o1305n827p829J2493K4361k780j2235L0846J1980l5706
16042C410J0580P799l468l216n903R545m884L526L445K4908R995P536J7524k2167
16028E8630l1838k5668l610J2679K7682K7638Q979P015J8279J1516k6845m0610
16016D3847J0813k2699p320Q908m414r481k5446j939J0600K198o883J3818L9613
16003E1615J1353k1586j1363m769J5807O677j8205j1137J1125k2504j5640j8794
$$ plain form
16091 65425 57982 49353 51334 74364 16956 -6489 -15052 -2713 4951 2568 211 -18181 -31325
16078 -31325 -5149 -9794 -36662 -39516 -36482 -23305 19165 42701 59219 17694 -20449 7026
16066 7026 20572 29152 7299 15054 -12113 -32622 -3599 -48 19394 41278 80510 116804
16054 116804 96568 49412 -11893 -17720 -25549 -13056 11305 8525 -3710 27136 39116 3410
16042 3410 13990 21789 18321 15105 9202 18747 13863 17389 20834 45742 55737 63273 80797 58630
16028 58630 26792 1124 -2486 10193 37875 65513 74492 81507 99786 111302 84457 43847
16016 43847 54660 31961 24641 33549 29135 19654 -5792 -7731 2869 5067 -1816 12002 51615
16003 51615 62968 41382 30019 25250 41057 47734 29529 18392 29517 7013 -8627 -27421
15991b7421J8267J7962r799k7479j6454J7565O1062P57P462L1941o152m3751k7333
15978c373N131p022J2263r297j1430P810q986k2691k4111J2155Q15K9100r755
15965b9391l6307J2038N9708K0218j3370K8740J5535k4785j3143M433k423j4847
15953F406j351P98j4219J7934K4895r472M5k5620k6560k9049l1111J8378L0343
15940c8583m89J2457k0630J1853L1954J9220l5144Q685M3009J3612j6546j326
15928B8072l7064k265P747J4381j340J9365K7981l3033J7778J1143q094j0013
15916C4658J753L833J4866l8948j1681K2045l4695l4394k308K2704O931K938L1330
15903A9032r549j8126N519J8011m861j2977k5598k1355R688N387P727L1638j8294
$$ plain form
15991 -27421 -9154 8808 -991 -28470 -44924 -27359 33703 34460 41922 73863 67711 23960 -3373
15978 -3373 1758 -5264 6999 -2298 -13728 -5918 -14904 -37595 -61706 -49551 -48736 -19636 -29391
15965 -29391 -65698 -53660 6048 26266 12896 41636 57171 32386 19243 23676 21253 6406
15953 6406 5055 5853 -8366 9568 34463 24991 25036 -584 -27144 -56193 -87304 -68926 -38583
15940 -38583 -39072 -26615 -47245 -35392 -3438 15782 -19362 -10677 32332 45944 29398 28072
15928 28072 -8992 -11257 -3510 10871 9531 28896 56877 23844 41622 52765 44671 34658
15916 34658 36411 40244 55110 16162 4481 26526 -8169 -42563 -44871 -22167 -15236 -12298 19032
15903 19032 9483 -8643 -3124 14887 10026 -2951 -28549 -49904 -40216 -34829 -27102 4536 -13758
15890a3758k947j008l0943l2133L1205L6372m817j8052N502N015j6246J5425j4463
15877d0848j4395l595K849O7115J7607n38j0586n0456J8002j5728O813L690j5925
15864c5995L313N0935j3548l1433K1376k3372l2963J9798N4901j855k1303j390
15852a1536K051P257r275j5002j185K9435J0365L5515K2224l3776j9651k7594
15840a1172l1381L4053o785l6935O398J5310J4756p737k1022Q430K3110nj3926
15827b6906K206K8426L777k0647J4295K4945J8265l1617j6767k4080n295O71M0924
15814H197L4534J7675K4698m0861l0488j796J8914J6652k8665l2689K0350L5429
15802D1950k2406m7512k5123M8808J9241K8662J4106l0763m5936m1604K7079o090
$$ plain form
15890 -13758 -16705 -17713 -48656 -80789 -49584 -13212 -18029 -36081 -30579 -25564 -41810 -26385 -40848
15877 -40848 -55243 -58838 -55989 11126 28733 28195 17609 -32847 -14845 -30573 -23760 -20070 -35995
15864 -35995 -32682 18253 4705 -26728 -5352 -28724 -61687 -41889 13012 11157 -10146 -11536
15852 -11536 -9485 -2228 -11503 -26505 -27690 1745 12110 47625 69849 36073 16422 -11172
15840 -11172 -42553 -8500 -15285 -52220 -45822 -30512 -15756 -23493 -44515 -36085 -12975 -12980 -26906
15827 -26906 -24700 3726 7503 -13144 1151 26096 44361 12744 -4023 -28103 -33398 -32727 8197
15814 8197 42731 60406 85104 44243 13755 11959 30873 47525 18860 -13829 6521 41950
15802 41950 19544 -27968 -53091 -4283 14958 43620 57726 26963 -18973 -60577 -33498 -39588
15790c9588k1572R762Q730K3411J7099j5491n1579l0607L6057N6649L8319n730
15778B5460Q242j9300j8768K8382L4949j7162j4158K021j951j9877n4099k0206
15766f6467J9099L342Q40m174M1110L6708P119J0313k6700o447j4194J2142J2295
15753B4986M914L2610k2031k6578p171m2482m2731L6443L4254L558M1823l076
15741C4519l0633l371l7034J5237K7408Q302K1703m3243J2640K3413j5237j6040
15729b336m2032k2213k7470N86O0078L9044k3734K0212n778q438Q975L4130q279
15716B2745k5511j3584j1158n680J3909J5759r262m280j2047j7661j8508R027
15704e6251M4402j2461p755N930P781k1143l5790K8925M1883j418m631J8595K3599
$$ plain form
15790 -39588 -61160 -51398 -42668 -19257 -2158 -17649 -69228 -99835 -63778 -7129 31190 25460
15778 25460 33702 14402 -4366 24016 58965 41803 27645 29666 27715 7838 -46261 -66467
15766 -66467 -47368 -44026 -43186 -47360 -6250 30458 37577 47890 21190 14743 549 12691 24986
15753 24986 29900 62510 40479 13901 6730 -35752 -78483 -42040 -7786 -4228 37595 34519
15741 34519 3886 515 -36519 -21282 6126 14428 36131 -7112 5528 28941 13704 -2336
15729 -2336 -44368 -66581 -94051 -93465 -33387 5657 -18077 2135 -3643 -12081 -3106 31024 22745
15716 22745 -2766 -16350 -27508 -33188 -19279 -3520 -12782 -17062 -29109 -46770 -65278 -56251
15704 -56251 -11849 -24310 -32065 -26135 -18354 -39497 -75287 -46362 -4479 -5897 -10528 8067 31666
15691C1666k0020J4349L1945l9959m7935l4815L0610P91k0076K9952O333n341
15679b2500L364L0438L011O136j2317m0059k0935r789o827p744N7882K0426m366
15666c280N108n5187Q918J5335l1520J939O184M1609k3872l2152L6262J0687J1844
15653h125J9947n557j9409m1572l1860q203K8844L7156K417k5613p102K7443R18
15640c0716K0754P9n416J7695j5914k1558J380L0567J2933k9342j7245J0447p6
15627b6412J4212K3136j0201k1902K3622K1777r284k9222J5342Q547j6403j0949
15615a7737K1825J9823K3849Q004l3055l7552O445M7688l8234k8751Q860K0129
15603A294j525m917L9171j0391o446J0443j970m9147N34K0420p187p871l8666
$$ plain form
15691 31666 11646 25995 57940 17981 -29954 -64769 -34159 -33368 -53444 -23492 -17159 -22500
15679 -22500 -19136 11302 14313 20449 8132 -31927 -52862 -62651 -69478 -77222 -19340 1086 -3280
15666 -3280 1828 -53359 -44441 -29106 -60626 -58687 -52503 -10894 -34766 -66918 -30656 -19969 -8125
15653 -8125 11822 6265 -13144 -54716 -86576 -94779 -65935 -28779 -26362 -51975 -59077 -31634 -30716
15640 -30716 -9962 -9883 -15299 2396 -13518 -35076 -33696 -3129 9804 -19538 -36783 -26336 -26412
15627 -26412 -12200 10936 735 -21167 2455 24232 14948 -14274 1068 9615 -6788 -17737
15615 -17737 4088 23911 47760 55764 22709 -14843 -8398 39290 1056 -27695 -18835 1294
15603 1294 -231 -5148 34023 23632 17186 27629 25659 -23488 -22954 -2534 -9721 -17592 -56258
15590e6258j4632Q50j0437k713R514O5320L3875j3435k0443R386j1269n0912j2747
15577g3901L7399L7970l1704M384J7729J1337k2797k5241J2318L4060l3592j9967
15565e2005K5444L1662K9569J7435j9291m2435l4063K5855n560j1326K082L0396
15553b237J9731m9290p4k7596l62K5420j1551O757j4901R113K1923J2765K9115
15540A8813K6593r4j1806j1395k1219n0862j680N0502J7056m1215j4962k3819
15528f4088Q714J3532r166k3554Q217k868o059K2726J1307j693n740r363L3107
15515b4928N752M6448L8834m9350l5035j8109M1770K3389n7207m4208r139L5033
15503d6750o929M781J3881n881Q222q348r749M7296q426K0446l265j0187J263
$$ plain form
15590 -56258 -70890 -70040 -80477 -83190 -73676 -8356 25519 12084 -8359 1027 -10242 -61154 -73901
15577 -73901 -36502 1468 -30236 -25852 -8123 3214 -19583 -44824 -32506 1554 -32038 -52005
15565 -52005 -26561 5101 34670 52105 32814 -9621 -43684 -17829 -23389 -34715 -32633 -2237
15553 -2237 17494 -31796 -31870 -59466 -59828 -34408 -45959 -39202 -54103 -44990 -23067 -10302 18813
15540 18813 45406 45312 33506 22111 892 -49970 -51650 -1148 15908 -25307 -40269 -64088
15528 -64088 -55374 -41842 -51008 -74562 -66345 -69213 -75272 -52546 -41239 -42932 -48672 -58035 -24928
15515 -24928 -19176 27272 66106 16756 -18279 -36388 5382 28771 -28436 -72644 -81783 -46750
15503 -46750 -53679 -48898 -35017 -40898 -32676 -41024 -50773 -3477 -11903 8543 5278 -4909 -3646
15490c646l7822j5374L3312R582o987J0082L091J8165k8672k8588n398L8666J3147
15477d42L8938K0640k3290o0298l3043J3903L5907p105l351r980N745K0120l939
15464f195m2422j8170M121L476j0343L2228n474j2781P049J8922J5963J9468n29
15451E313l97j1285p103k9895K946p571K476O408K0095J7772j0269j169p228n458
15437b5365J957J592j3498M724r040j389p823J9134j1176k3940j0875P336J0489
15424e7874J0714O4121O041j3268j5523J624J5757O918m839m5283l3987L3257
15412c2342L7596L3998p80n618J0655K5138m4289o150J3021j8861j9583M316n707
15399h606J1946K5947Q771K2467k243j8734k3425n988J8475p544k9517j7031r33
$$ plain form
15490 -3646 -41468 -56842 -23530 -13948 -20935 -10853 -7762 10403 -18269 -46857 -52255 -13589 -442
15477 -442 38496 59136 35846 -24452 -57495 -43592 -7685 -14790 -18141 -28121 -22376 -2256 -6195
15464 -6195 -48617 -66787 -62666 -59190 -69533 -37305 -42779 -55560 -48511 -29589 -13626 5842 5313
15451 5313 4916 -6369 -13472 -43367 -40421 -47992 -45516 -39108 -19013 -1241 -11510 -12679 -19907 -25365
15437 -25365 -23408 -21816 -35314 -30590 -39630 -41019 -48842 -29708 -40884 -64824 -75699 -68363 -57874
15424 -57874 -47160 16961 23002 9734 -5789 -4165 11592 18510 13671 -31612 -65599 -32342
15412 -32342 5254 39252 38472 32854 43509 68647 24358 18208 31229 12368 -7215 -2899 -8606
15399 -8606 3340 29287 38058 60525 58282 39548 16123 10135 28610 21066 -8451 -25482 -26415
15386b6415j9444J475j0293r518K1685K7038J7537n946l6936q864R786M1234N485
15373F824n467m7617m5510M232K7530K3795Q0168M5534k9868j174j4098k4486
15361A9863r096l6115j4528J6254J0581j2570J2758J1504K3946k0762k4807o56
15349b3628J6788K656m594k1852P646L6542R300J1508k1510j1384j1245K8132
15337A8359J5679M41J2798j6372k3013j6209j7368q971K4491N669m677J2051l515
15324f37k9501J2762Q106l0318j6605j306J4090R032J8741m388m2197J68K5362
15311c6691K7928L5171L9779o984L462m1887k0329r645k5312o781O851l677L4799
15298c316K8371k0577n6580o578K9520l4812J2842J8706r726J1362L1479j529
$$ plain form
15386 -26415 -45859 -44384 -54677 -64195 -42510 -15472 2065 -3881 -40817 -49681 -39895 1339 6824
15373 6824 1357 -46260 -91770 -87538 -60008 -36213 43955 89489 59621 58447 44349 19863
15361 19863 10767 -25348 -39876 -23622 -13041 -25611 -12853 -1349 22597 1835 -22972 -23628
15349 -23628 -6840 -4184 -8778 -30630 -22984 13558 22858 34366 12856 1472 -9773 18359
15337 18359 34038 34479 47277 30905 7892 -8317 -25685 -34656 -10165 -4496 -9173 2878 -637
15324 -637 -30138 -17376 -9270 -39588 -56193 -57499 -43409 -34377 -15636 -20024 -62221 -62053 -36691
15311 -36691 -8763 26408 66187 59203 62665 20778 449 -9196 -34508 -41289 -34438 -38115 -3316
15298 -3316 25055 4478 -52102 -58680 -29160 -63972 -51130 -32424 -42150 -30788 691 -838
15286h38j5224j0422j0977K764q898q771l2760j1079K1122l1857n960N0114L4325
15273b8461k8159O797m190j7105J0191p159j3933M7107L3031k560k6184J7206
15261a3419L1199p083n9082K099K1576l356j7093L0563l324J2802j4390k5514
15249d5022R680K174k9271J0716J9058J2075K6059j128m627K5451l736k5395k0608
15236b4574m989O189j1802k3223M1348N6751m051k4750k5055k2766j960K1116
15224a7766R426k4750k788L9711q508J88j1778r800k3507k5328J3342J5047Q549
15211c7962p71k234M4166J5141k0224J5415j6581l7639k7995l3132j2471K3678
15199i0609N4934J6045L5791k8757k0389K2487J2108J259l5363P304L4852N217
$$ plain form
15286 -838 -16062 -26484 -37461 -34697 -43595 -52366 -85126 -96205 -75083 -106940 -112900 -62786 -28461
15273 -28461 -56620 -49823 -54013 -71118 -60927 -68086 -82019 -34912 -1881 -4441 -30625 -13419
15261 -13419 17780 10697 -48385 -46286 -24710 -28066 -45159 -14596 -17920 -5118 -19508 -45022
15249 -45022 -35342 -33168 -62439 -51723 -32665 -20590 5469 4341 -286 25165 21429 -3966 -24574
15236 -24574 -29563 -23374 -35176 -58399 -17051 39700 35649 10899 -14156 -36922 -38882 -17766
15224 -17766 -8340 -33090 -35878 3833 -4675 -4487 -16265 -26065 -49572 -74900 -61558 -46511 -37962
15211 -37962 -38733 -40967 3199 18340 -1884 13531 -3050 -40689 -68684 -101816 -114287 -90609
15199 -90609 -35675 -19630 16161 -12596 -32985 -10498 1610 2869 -32494 -25190 9662 14879
15187A4879K1049k6146j4651k5553q147L8322K5104m330k5021P190K1020n677
15175A8039l0968J5099K694L6414r296l9074k541L7343J4530M068m7531m4556
15163d5779N803J4969J1367p330l4258l8140L4527K5396J5842K2251k1003L0430
15151A4075P235m8374l0229j6841J3813j3730J9801J7825L2365k638J720l819
15139h797j7487K7266j2343m007k3785L031J3491J8167l1182M509l53p363L8087
15126g66M7226n4741m4593P472J6346o483K0304K9448K1100l8901j1239O837K2842
15113A4852k2597k2166j2505J6608J9404J3406Q551m7881n239k6115R018M675
15101d9989O286P024L4031M670m940k4094K3699M4064m657o115j9843j9821R208
$$ plain form
15187 14879 35928 9782 -4869 -30422 -38569 -247 24857 20527 -4494 2696 23716 18039
15175 18039 -12929 2170 4864 41278 31982 -7092 -9633 27710 42240 46308 -1223 -45779
15163 -45779 -39976 -25007 -13640 -20970 -55228 -93368 -58841 -33445 -17603 4648 -16355 14075
15151 14075 21310 -27064 -57293 -74134 -60321 -74051 -54250 -36425 -4060 -6698 -4978 -8797
15139 -8797 -26284 982 -11361 -15368 -39153 -36122 -22631 -4464 -35646 -31137 -31490 -38853 -766
15126 -766 46460 -8281 -52874 -45402 -29056 -35539 -15235 14213 35313 -3588 -14827 -7990 14852
15113 14852 -7745 -29911 -42416 -25808 -6404 7002 15553 -32328 -37567 -63682 -54664 -49989
15101 -49989 -43703 -36679 -2648 2022 -2918 -27012 -3313 40751 36094 29979 10136 -9685 -477
15088d77N0684J0902k1031k4874k175J7289R014o236k6974m8583m3154J5295N9315
15075a1005N970Q062L7017r177k4468K7310O1j6295J8958k6069m3933K5611K00
15062g758k8176Q569K7070l6702k3255L1810J0910J2942M003K941J7211k4759
15050e194k2519m2782k9331M9389M0493K3373j7948k629M4257j1197j0312j2913
15038B687Q054J3706O467j6546J2467n5r303k330J1850j8971K1456J1277n154
15025C5605K0750J2521R599K344j0229j8670K3784k3132Q568K989k0453J2211
15013E5887k3279l8401j1729o506K2784J8817o376j0304K445l3696m6041J9761
15001e6638J2776j145R384J1517J7462L3828k3226l58K1914j1582l2771Q83k0999
$$ plain form
15088 -477 50207 61109 40078 15204 13029 30318 39332 33096 6122 -42461 -85615 -70320 -11005
15075 -11005 -5035 3027 40044 30867 6399 33709 33770 17475 36433 10364 -33569 -7958 -7758
15062 -7758 -35934 -27365 -295 -36997 -60252 -28442 -17532 -4590 -587 2354 19565 -5194
15050 -5194 -27713 -70495 -99826 -50437 -9944 13429 -4519 -7148 37109 25912 15600 2687
15038 2687 10741 24447 30914 14368 26835 26780 17477 15147 26997 8026 29482 40759 35605
15025 35605 56355 68876 78475 80819 70590 51920 75704 52572 61140 64129 43676 55887
15013 55887 32608 -5793 -17522 -24028 -1244 17573 11197 893 3338 -30358 -76399 -56638
15001 -56638 -43862 -45007 -35623 -24106 -6644 27184 3958 3600 25514 13932 -18839 -17956 -38955
14988c8955j1973k0752k7350M651L6328L2648L2450J51K0120r907o781j7846q447
14975a5663L393k1945m3977m440j6530L2490N3658K2720m1764k1395J2905L5927
14963d621N3312J326k9583l2291l2053K501l4837k1531J5665J7293K7834P556
14951b9429K8551R976k4106j6849p109l4088K0615M8658J5619J163J3679J0116
14939C6796n942k1749k7014L696K8406N1613L2481l0303m1684L2460r834j414
14927D7512m0974l9210j2660j7061Q713R178O79l520N4024J6510k3471r032k4974
14914c4286k6243m211J9877l230j1452L746J1454J2888N993p649j754l0215J1976
14901e3106M530N761k213J2870L029L8630O46j4907j7313J0445J3645J971l806
$$ plain form
14988 -38955 -50928 -71680 -99030 -94379 -58051 -25403 7047 7198 27318 17411 10630 -7216 -15663
14975 -15663 -12270 -34215 -78192 -82632 -99162 -66672 -13014 9706 -32058 -53453 -40548 -4621
14963 -4621 48691 50017 20434 -11857 -43910 -41409 -76246 -97777 -82112 -64819 -36985 -29429
14951 -29429 -878 9098 -15008 -31857 -38966 -73054 -52439 -3781 11838 13001 26680 36796
14939 36796 30854 9105 -17909 -14213 14193 65806 98287 67984 26300 58760 48926 47512
14927 47512 6538 -32672 -45332 -62393 -53680 -44502 -43823 -47343 6681 23191 -280 -9312 -34286
14914 -34286 -60529 -64740 -44863 -48093 -59545 -55799 -44345 -31457 -25464 -33113 -34867 -65082 -53106
14901 -53106 -48576 -42815 -45028 -32158 -29129 9501 10147 -4760 -22073 -11628 2017 3988 182
14888A82o20K7419l6424l2806M86L62R555J8383Q926J7136K4381j8546l6037j1211
14874b8814K769J8777L1098j3687k9515L015N4138J1327l2262k1586J0324l0974
14862b5390L3722J1398j1809M423q524L9611L2018j6522m2455m8963m0169L2727
14850c9933n868J8616J2867J5017L898o346j3893k0518J4213R757J9672L0290
14838C7772k6499j2231K4963k9803l1742j6526n669J099J3797K2645k3811k9480
14826g5485L3752r919J1621K9592J4333k4338j5624O490L0380R949j6089k8202
14814c3540l254J2898l787l0748J2694J9894R449j6081r230j14K5092K0484L1906
14801C5663q711l6340k5195K952M0190J8231k4198r04J6239J9230K1816J4043
$$ plain form
14888 182 -438 26981 -9443 -42249 -41763 -41401 -31846 -13463 -4537 12599 36980 18434 -17603 -28814
14874 -28814 -26045 -7268 23830 10143 -19372 -16357 37781 49108 16846 -4740 5584 -25390
14862 -25390 8332 19730 7921 12344 3820 43431 75449 58927 16472 -32491 -72660 -39933
14850 -39933 -45801 -27185 -14318 699 4597 -1749 -15642 -36160 -21947 -12190 7482 37772
14838 37772 11273 -958 24005 -5798 -37540 -54066 -59735 -58636 -44839 -22194 -46005 -75485
14826 -75485 -41733 -51652 -40031 -10439 3894 -20444 -36068 -29578 802 10751 -5338 -33540
14814 -33540 -36794 -23896 -27683 -58431 -45737 -25843 -16394 -32475 -41705 -41819 -16727 3757 35663
14801 35663 26952 -9388 -34583 -31631 8559 26790 2592 1688 17927 37157 58973 73016
14789G3016l3943p354j4911l9161j9032o130J4724L8893K0329O7k9251J897J4467
14776A3611j3099K1297P823m1582q236p856r60k4496j7340L7426M2401o238K4680
14763B7431K7067j4366n802j2927K6973J1317k5093J0026n102j7435m0000j5489
14751c3400l4258L6223K357N877K1370J4141L4248O40m4158l1793K5898L1846
14739B8991j4605r060r308r36K1940N249j715J2420j4694m565N080K2048j7454
14726B3391k5019j4656K9747M6181j5901k1153m951M7444R018k7387j6871p473
14714B2370m3120n659L3757P334k313l6278J2968j2387j827K0139J255l9367J779
14701d1349P980K678J9091j784M224j2552K1915L3245j1561q385K0262l3389l7449
$$ plain form
14789 73016 39073 31719 16808 -22353 -41385 -47515 -32791 6102 26431 26498 -2753 -856 13611
14776 13611 512 21809 29632 -11950 -20186 -28042 -29002 -53498 -70838 -33412 8989 2751 27431
14763 27431 54498 40132 34330 21403 48376 59693 34600 44626 39524 22089 -17911 -33400
14751 -33400 -67658 -31435 -29078 -23201 -1831 12310 46558 47198 3040 -28753 -2855 28991
14739 28991 14386 5326 -3982 -4918 17022 22271 20556 32976 18282 13717 18797 40845 23391
14726 23391 -1628 -16284 13463 59644 43743 22590 17639 65083 74101 46714 29843 22370
14714 22370 -20750 -26409 7348 14682 12369 -23909 -10941 -23328 -25155 -5016 -3761 -43128 -41349
14701 -41349 -33369 -30691 -11600 -13384 -9160 -21712 203 33448 21887 13502 33764 375 -37074
14688c7074j6594J181k535L3879M1012k4049j189J0761p397m468j5644L7510J7184
14675C2577l323Q009J2563k1076j8696k3727L4165M203k3659l1856J0073J3930
14663f817J3655J7512K65m5037R335K4183K3248l5927r267q96L205O2653K4111
14650H0223j3492j4247j3116m4165K2056J5356j3110j6048j1354J8271K1730k117
14638B9987n5556j7522j9418J8340J8164L226L1745j6307k8157L496k2109l0567
14626h4678K7699K9245J0919L34o455J7043l5002k0715L2248Q167j3489P489k5352
14613e2547k5959K0404J4183K777j3531K1173k0942j0005J0179J5509J6652o795
14601b8902l760l5197J4727j0166j5649k630K9784J020j1078O1045K0654n0734
$$ plain form
14688 -37074 -53668 -52487 -55022 -21143 19869 -4180 -5369 5392 -2005 -6473 -22117 15393 32577
14675 32577 29254 37263 49826 28750 10054 -13673 20492 24695 1036 -30820 -20747 -6817
14663 -6817 6838 24350 24615 -20422 -11087 13096 36344 417 -8850 -9746 -6541 56112 80223
14650 80223 66731 52484 39368 -4797 17259 32615 19505 3457 -7897 10374 32104 29987
14638 29987 -25569 -43091 -62509 -44169 -26005 -22779 8966 -7341 -35498 -32002 -54111 -84678
14626 -84678 -56979 -27734 -16815 -16481 -22936 -5893 -40895 -61610 -29362 -21195 -34684 -27195 -52547
14613 -52547 -78506 -58102 -43919 -41142 -54673 -33500 -54442 -64447 -54268 -38759 -22107 -28902
14601 -28902 -32662 -67859 -53132 -63298 -78947 -81577 -51793 -50773 -61851 -806 19848 -30886
14589c0886o946k0958L863K1069J0032P777k4431J8553M8886m254k6467K5031
14577B1269J8741l4982k2040k5860m5849L0789K7913k7446L7535K6260P942M452
14565A8724Q596m8951k078L4514j0781j096J3942P470Q552M1650l9844n5282j8325
14552d2909j1660o360L7124j5794k8959Q578J8936l576n542M4190Q474k627L5208
14539C5083k2852m952j944m094R867j7514j9476j0546l0679k2831N683M0753L3637
14526i865r931l2810p519j9860k437M1709L9947j9562J9614J9045r457q743j0438
14513a0307l254K0258j7273l807J9553J8322m383J3490n19j6438L944j4923p819
14500c156L1508n747r920k502Q337N5816o965k3720n58l4332j3096L4537l014
$$ plain form
14589 -30886 -37832 -58790 -54927 -33858 -23826 -16049 -40480 -21927 26959 22705 -3762 21269
14577 21269 40010 5028 -17012 -42872 -88721 -57932 -30019 -57465 -19930 6330 14272 18724
14565 18724 27320 -21631 -23709 10805 24 -1072 12870 20340 28892 70542 30698 -24584 -42909
14552 -42909 -54569 -60929 -23805 -39599 -68558 -59980 -41044 -44620 -50162 -5972 2502 -125 35083
14539 35083 12231 7279 5335 1241 11108 -6406 -25882 -36428 -67107 -89938 -84255 -43502 -9865
14526 -9865 -19796 -52606 -60125 -79985 -82422 -40713 -766 -20328 -714 18331 8874 131 -10307
14513 -10307 -13561 6697 -10576 -14383 5170 23492 19109 32599 32080 15642 19586 4663 -3156
14500 -3156 28352 22605 12685 10183 18520 74336 67371 43651 43093 8761 -4335 30202 27188
14487B7188j7208k857L977J1978k2821n949K1388J2328q810m287j625O1842l891
14474G1253k397J2703R820j5239l034M032l2937j3470L2559L3012o0990o6063
14462c0751R283L1597j3734j5209J466K3538J4705j6210j8392J8236L0726o60
14450C4595j8609K2099L1952j6986l949j6665j4276K009J4547Q590m8047k0938
14438b5678J3488j4247K3208J4150j0168j1680K5661L0502j388k5056k7591K5667
14426A6868N1253k7650J7895O3949q234m8036p088j2854l494o455k3404k5885
14414a3135k4189L3769K6746N5498n441l8688m8024j0277o069J4289J3738j1667
14402a3450M4341n468j8655q615k3613j3745L1009j7640k5623k2957K613K2050
$$ plain form
14487 27188 9980 7123 11100 23078 257 -5692 15696 28024 19214 14927 13302 75144 71253
14474 71253 68856 81559 91379 76140 73106 77138 44201 30731 63290 96302 35312 -30751
14462 -30751 -21468 10129 -3605 -18814 -17348 6190 20895 4685 -13707 4529 35255 34595
14450 34595 15986 38085 70037 53051 49102 32437 18161 20170 34717 43307 -4740 -25678
14438 -25678 -12190 -26437 -3229 10921 753 -10927 14734 45236 43848 18792 -8799 16868
14426 16868 68121 40471 58366 122315 114081 66045 58957 46103 42609 36154 12750 -13135
14414 -13135 -37324 -3555 23191 78689 73248 34560 -13464 -23741 -29810 -15521 -1783 -13450
14402 -13450 30891 25423 6768 -1847 -25460 -39205 -8196 -25836 -51459 -74416 -71803 -49753
14390d9753N4906L1579m1566n337P029l3492l4723O649N2269j1155j4546K5727
14378a2413j6878m1700J2847L7646l1742J361J7933J0875m607K5014Q221n284
14366A273j3904L4851k2794m2218j4779K8095P710N797L6981j5254M643P926r898
14353H429j4361o073J4823j89r989j7386k2644j254o107K477n200M1907N6275
14340D0708O959l138k2564K3530R117K20p0577n8596J5060J2672K6324L9727L120
14327B2562k6977j3938j9663M840n560j11K7236j299m6106L5496L1144p324l8180
14314c7880j6806J6596J7208K7787L3277n211k240m2649j6882j1470j7997j1273
14302f7540j3979M7196M4861o469j6313R559m9p667K3413j031O736j7317K5140
$$ plain form
14390 -49753 5153 36732 -4834 -10171 -3142 -36634 -71357 -64708 -12439 -23594 -38140 -12413
14378 -12413 -29291 -70991 -58144 -20498 -52240 -50879 -32946 -22071 -26678 -1664 6557 1273
14366 1273 -12631 22220 -574 -42792 -57571 -29476 -21766 -15969 21012 5758 10401 18327 8429
14353 8429 -5932 -12005 2818 2629 -7360 -24746 -47390 -48644 -54751 -52274 -57474 -15567 40708
14340 40708 47667 44529 21965 45495 54612 54832 -15745 -74341 -59281 -46609 -20285 19442 22562
14327 22562 -4415 -18353 -38016 -33176 -38736 -38847 -11611 -12910 -59016 -23520 7624 300 -37880
14314 -37880 -54686 -38090 -20882 6905 40182 34971 32731 -9918 -26800 -38270 -56267 -67540
14302 -67540 -81519 -34323 10538 4069 -12244 -2685 -2734 -10401 13012 11981 18717 1400 26540
14289B6540N175Q038l916m0309J1911j8587O385K4424j123J5311M788k4958j5675
14276a996k9395N730O921q814K0363R279R947l160j1314k273J2715k7561j7220
14263c6778m81K0008Q486o9182K346p08J8647J7189k6869J3344J1528p66l7916
14250h1152j3310L5281J9731R89J4718M132Q519j6504M879J0393M276K3702J3924
14237B9578j3622n3577M798L9362m600k5615L1206J8304p795J447l185k8697P490
14224d906k587J9159j1298l2520O219K3756M9K6191j111k267J4379k1248j6598
14211b782j7521K5037J8844J0887j1383j6851k3752k7406k5985o94k2228O008
14199h7826L8639j6300M629L4514N1179P731l846q214k3007n520J6452N459n0825
$$ plain form
14289 26540 31715 39753 35837 -4472 7439 -11148 -4763 19661 18538 33849 38637 13679 -1996
14276 -1996 -31391 -25661 -18740 -27554 -7191 2088 12035 8875 -2439 -4712 8003 -19558 -36778
14263 -36778 -37259 -17251 -8765 -77947 -75601 -76309 -57662 -40473 -67342 -53998 -42470 -43236 -81152
14250 -81152 -94462 -59181 -39450 -38461 -23743 -19611 -11092 -27596 -22717 -12324 -8048 15654 29578
14237 29578 15956 -37621 -32823 6539 1939 -23676 7530 25834 18039 19486 16301 -12396 -4906
14224 -4906 -7493 11666 368 -32152 -25933 -2177 -2128 24063 22952 20685 35064 13816 -2782
14211 -2782 -20303 4734 23578 34465 23082 6231 -17521 -44927 -70912 -71606 -93834 -87826
14199 -87826 -49187 -65487 -60858 -26344 24835 32566 28720 20506 -2501 -8021 8431 13890 -36935
14186c6935m7224K4119J7397J3027K2353L0941k5047k1406m626j5478J3291k505
14174c2093R720Q821J7856o34j9752o23J4151p381o024Q454K3922J5266L249k4397
14160A0535L312R519j7200m355K6179K3542K9164P784m199L8570K6783Q7104J06868
14147C43606P8067P9222Q5784Q1066O1925L2674j359j0110p1470j02675q1204
14136D95526o7539j03495o5268n6488n5548p2251l1353L5886K5229j9252k7057
14125E8390J8085j9649j1779J5687p749j4786l4084k9007p926K0408J0944m496
14113e962R052l4240k4638o294M040j0454K2302M251L4560J9633J0858j2800M0325
14100E0633k6672J904j4878j9644l1365j5384k1548O17M2547J3702K44j5946K8201
$$ plain form
14186 -36935 -84159 -60040 -42643 -29616 -7263 23678 -1369 -22775 -27401 -42879 -29588 -32093
14174 -32093 -22373 -13552 4304 3670 -16082 -16705 -2554 -9935 -15959 -7505 16417 31683 34932 10535
14160 10535 13847 23366 6166 1811 27990 51532 80696 88480 84281 122851 149634 236738 343606
14147 343606 421673 500895 586679 667745 729670 762344 760985 750875 679405 576730 495526
14136 495526 427987 324492 259224 202736 147188 74937 43584 79470 104699 85447 58390
14125 58390 76475 56826 45047 60734 52985 38199 4115 -24892 -32818 -12410 -1466 -5962
14113 -5962 3090 -31150 -55788 -62082 -58042 -68496 -46194 -41943 -7383 12250 23108 10308 50633
14100 50633 23961 25865 10987 -8657 -40022 -55406 -76954 -76337 -33790 -20088 -19844 -35790 -7589
14087g589l8048K3054M2011K632k0923O558K760P379m139l1187p1607k7262M4271
14074g2090K1672J6550L1115j74j2144k5838J364J891j0416J0222k9613K1204
14062d6257P732K7116M2387Q481j6839r199j7269L494l7350m9281K2695M3914
14050b0376n21k1564J2808J8272L2674R234J2942J5951j5568n0426P792j8955
14038a7737R15K4744J8696J0196j2457l5090j5621K2748J5937J2625j3979l1840
14026b0863k1447q237j9036k6878L6664N4039K4817K4512j3172K432j4335Q295
14014B6791r081N648M1144m6456l0868K0775J088J8858j9560o774K4034l2936
14002g337r907j349k812J4820J7921P638q629p135m0177l0648K8113L3169K5030
$$ plain form
14087 -7589 -45637 -22583 19428 22060 1137 7695 10455 17834 13695 -17492 -89099 -116361 -72090
14074 -72090 -50418 -33868 -2753 -2927 -15071 -40909 -39545 -37654 -48070 -37848 -67461 -46257
14062 -46257 -38525 -11409 30978 39459 22620 13421 -3848 -354 -37704 -86985 -64290 -20376
14050 -20376 -20897 -42461 -29653 -11381 21293 30527 43469 59420 43852 -6574 1218 -17737
14038 -17737 -16822 7922 26618 36814 24357 -10733 -26354 -3606 12331 24956 10977 -20863
14026 -20863 -42310 -50547 -69583 -96461 -59797 -5758 19059 43571 30399 32831 18496 26791
14014 26791 17710 23358 64502 18046 -12822 7953 9041 27899 8339 1565 25599 -7337
14002 -7337 -17244 -18593 -21405 -6585 11336 18974 10345 3210 -36967 -67615 -39502 -6333 18697
13989A8697R652K1590k019o35q685N285O958l028K395k5447m2440k889L5843J7414
13975C2691L8105l896J556l0974j5354J2449n681k7765j2025j3251L0451M3143
13963D9449N3347L5707M9781N5776K9325R437l1311p381k8858l4924n1427l9396
13951H9525j5904L1510L1473L2365N016q143m4434p566L9659K9014M0890j9582
13939B03823n016J4118J9734L2931M642k5583K7852l3341K2092l956j2519J4635
13927B59412p417l1052l7689m2019j5768p214J7738o269l0729l4193n005n1163
13915H632m7850K3500N1345J4041o255k5453m0628K6504L6843M93l948k6944P126
13902A7406J527J7512r142r826M985n0209k2611L2493k300p686L3242K2729l3052
$$ plain form
13989 18697 28349 49939 47920 47285 38600 43885 50843 47815 50210 24763 -17677 -20566 15277 32691
13975 32691 70796 66900 68456 37482 22128 34577 28896 1131 -10894 -24145 6306 49449
13963 49449 102796 138503 188284 244060 273385 282822 251511 244130 215272 180348 128921 89525
13951 89525 73621 105131 136604 168969 173985 165842 121408 113842 153501 182515 223405 203823
13939 203823 198807 212925 232659 265590 270232 244649 272501 239160 261252 257296 244777 259412
13927 259412 251995 220943 183254 141235 125467 118253 135991 129722 98993 64800 59795 8632
13915 8632 -39218 -15718 35627 49668 43413 17960 -22668 3836 40679 41172 37224 10280 17406
13902 17406 18933 36445 27303 17477 22462 -27747 -50358 -17865 -20165 -27851 5391 28120 -4932
13889d932k2476K740j7580K3477M560j0068n153O353J7892Q040r864K1279M895
13876A9163q70J2905l9756J2151j33j2730L8435j7015m236n995j8316J2450n663
13863i610J637Q801J4342N122J6746Q758K2034J6002m792k5023l1932J3857R839
13850D5781l3288J9068K7337j5104k8586O814K3311O75l1035j1241L0053j7409
13838A6376n5007M4814J4674j659r228l0452M135L7517R175R146m7978l478N528
13825f437N134J3656p322m53j2033l784P36P542J4283L4930R925Q436L2261K2594
13811A19468j5081k1749J1538J5721j52K5329M9635L1210k5386l198k4605j670
13799A61060Q760p473k634n0768l509N168k190k5514o980j0185K0916p565n5113
$$ plain form
13889 -4932 -27408 -24668 -42248 -18771 -14211 -24279 -29432 -23079 -5187 2853 -7011 14268 19163
13876 19163 18293 31198 -8558 3593 3460 -9270 29165 12150 7914 1919 -16397 -3947 -9610
13863 -9610 -7973 828 15170 20292 37038 45796 67830 83832 79040 54017 22085 35942 45781
13850 45781 12493 31561 58898 43794 15208 22022 45333 46008 14973 3732 33785 16376
13838 16376 -38631 6183 20857 19198 9970 -20482 -16347 21170 30345 39491 -8487 -11965 -6437
13825 -6437 -1303 12353 5031 4578 -7455 -11239 -10503 -2961 11322 46252 56177 64613 96874 119468
13811 119468 104387 82638 94176 109897 109745 135074 184709 215919 190533 187335 162730 161060
13799 161060 169820 162347 159713 108945 105436 110604 108414 82900 75920 65735 86651 79086 23973
13786B3973M299N5537k119k3253q520J9585n210j9382j9551J3305k3203R834M9724
13773G5019q284k9423k2728L8438L4289O7977R4682R6534M6936N8437J21643M3129
13761F16649O867j7232p7788n5906k7045J7816l6090o0584n6131q899M364l3362
13749B72659n6438J503l9600k3889m0601j0947L7050n283j7524l2217p1993J539
13737A4259K8404J1187K5223M0493J0475j3753K0967O052M0616Q1450O9724M3819
13725C78916O8857M3105J1831m3397l9484k7720j0745o3040j12495p6720k6956
13714A02152k8834o685O528J0436j0083n0104m022P075n628P441K7391l712j9763
13701C2192p556M6360O2569L9979l8723o1989l5435k4591N43m7086r915N862K1671
$$ plain form
13786 23973 28272 83809 81690 58437 49917 69502 64292 44910 25359 38664 15461 25295 75019
13773 75019 66735 37312 14584 53022 87311 155288 249970 346504 393440 451877 573520 616649
13761 616649 623516 606284 528496 472590 445545 463361 427271 366687 310556 301657 306021 272659
13749 272659 216221 217724 178124 154235 113634 102687 139737 134454 116930 84713 12720 14259
13737 14259 42663 53850 79073 119566 130041 116288 137255 143307 183923 265373 335097 378916
13725 378916 447773 490878 502709 459312 419828 392108 381363 318323 205828 129108 102152
13714 102152 73318 66633 73161 83597 73514 23410 19388 26463 20835 28276 55667 51955 32192
13701 32192 24636 70996 133565 173544 134821 72832 37397 12806 13349 -33737 -43652 -37790 -16119
13688a6119K9344k7316M468L9296L3271j2987k0896l1805k8798m2536j340M6006
13676b9412L707J5926k6596j4243J8804k7209K0007J9542l0221L1962L1405n598
13664H074K207L323J2944K3937J677l2950O304j6256r856p129J0147l48l4208
13651c2134J6736L700j1672J4083J3897K3510j3906r584J5573o806P197l1302
13639a0708m72p687k0726j9502K2278L3420l503k0034j8308j8306L0047J7536
13627a5965k2245n952J6158M640m733L8720j0384k08p263K7815R313p005j8669
13614D222R822r212j6953j4430N893m532K4826M693j0254K3983L6325j7959j2809
13601B3615J1681l8571j8395K9998m725K638k7474j2686K5534N4045j566l7760
$$ plain form
13688 -16119 13225 -14091 -9623 29673 62944 49957 29061 -2744 -31542 -74078 -75418 -29412
13676 -29412 -25705 -9779 -36375 -50618 -31814 -59023 -39016 -19474 -49695 -17733 13672 8074
13664 8074 10281 13604 26548 50485 52162 19212 25516 9260 -596 -7725 2422 2074 -32134
13651 -32134 -15398 -11698 -23370 -9287 4610 28120 14214 4630 20203 13397 20594 -10708
13639 -10708 -11180 -18867 -39593 -59095 -36817 -3397 -6900 -26934 -45242 -63548 -33501 -15965
13627 -15965 -38210 -44162 -28004 -23364 -28097 10623 239 31 -7232 20583 29896 22891 4222
13614 4222 14044 4832 -12121 -26551 -20658 -25190 -364 4329 -5925 18058 54383 36424 23615
13601 23615 35296 -3275 -21670 8328 3603 6241 -21233 -33919 -8385 45660 44094 6334
13589F334k8003J3666R006j020J9234N165k7432j9803k3566N967l811Q543K0552
13576a5168L0843K4909j5184r316J0841J9947l5556n9921K7493P242m8576P080
13564e5366M434L8750J3075K6151n619q112l218j7070J6037p210j5674O3216R596
13551E8990L440J0335K777J3738R106j4962j1403p377J0801m6531J518K0573k525
13538D8480L137J8673j4883k60J5976l6023k4377j5228R902k996R492j1472O371
13525F792L1582j9864n1882J2395N0320L0405l7063n615K2094K4209k1961l8690
13513B722J8528J5559O90r123k1212k8798K5119J8734L258K3285l0839l9890j6848
13500c8815j3057O239P822K2348N082k1510J1714J1258J3197k381M141r008j735
$$ plain form
13589 6334 -21669 -8003 1003 -17 19217 24382 -3050 -22853 -46419 -40452 -44263 -35720 -15168
13576 -15168 15675 40584 25400 16084 26925 46872 11316 -48605 -21112 -13870 -62446 -55366
13564 -55366 -50932 -12182 893 27044 21425 13313 10095 -6975 9062 1852 -13822 49394 58990
13551 58990 62430 72765 75542 89280 98386 83424 72021 64644 75445 28914 30432 51005 48480
13538 48480 51617 70290 55407 55147 71123 35100 10723 -4505 5397 2401 11893 421 6792
13525 6792 38374 18510 -33372 -20977 29343 59748 22685 17070 39164 63373 41412 2722
13513 2722 21250 36809 37499 28376 7164 -21634 3485 22219 25477 48762 17923 -21967 -38815
13500 -38815 -51872 -45633 -37811 -15463 -10381 -31891 -20177 -8919 4278 1897 6038 -2970 -4705
13487d705o85j4853J7909j8292K7464q879j8887j9406K8140K3703j3289J5010
13475A3230K2913o559l8221l621j530j7319q271j9564J6485N3464J9251j8458
13463A1800k7975k5928J4292P652K2198Q762J2927p593l9224J2162K2787K1871
13451C3731O075k053R26q666k1651Q242k1523p646K0345q609K4458J2261L9143
13438G5033l812n7254l4664R642J6700l0508R545q524J9274J6243j6895k2007
13426b7227P653K3008N41J3527L4147k008j8889K0091k4281n1781j8756L6357
13414g618K4040J0997Q438p670M7810J6624n4640m5454K182J2384J1950j4669
13402D374k201K291L6620p375k4693n735J383K0715M0161K058n2502n8151j8787
$$ plain form
13487 -4705 -5390 -20243 -2334 -20626 6838 -2041 -20928 -40334 -12194 11509 -1780 13230
13475 13230 36143 29584 -8637 -12258 -13788 -31107 -39378 -58942 -42457 11007 30258 11800
13463 11800 -16175 -42103 -27811 -20159 2039 10801 23728 16135 -23089 -10927 11860 33731
13451 33731 39806 37753 38679 30013 8362 16604 -4919 -12565 7780 -829 23629 35890 75033
13438 75033 71221 13967 -20697 -11055 5645 -24863 -15318 -23842 -4568 11675 -5220 -27227
13426 -27227 -19574 3434 3975 17502 51649 49641 30752 50843 26562 -25219 -43975 -7618
13414 -7618 16422 27419 35857 28187 75997 92621 37981 -7473 -5291 7093 19043 4374
13402 4374 2173 4464 41084 33709 9016 3281 4664 25379 65540 67598 15096 -43055 -61842
13389f1842O700O8440J9527q094P791j9210O395l751l0996l2124K577M490N1995
13376A1898k4501l7750M3118K1752j8287r193O1302R742o492O692r349M784q429
13363D5287j928j2272k1719L355l5915K846M0618L8023m199n0828j0886K3570
13351A5952J7072l1619J9748L7851k7239n3333J4570J7962J913k3865k0183q500
13339c9671J2727K4472K1228K7943L4374m4798k4992J2723N588l2901m3991k2090
13327f9388N3148J2196K2086K8624o285j7812n1530j8080K9265K5964P820o210
13315I798J8087M5280n520j1553k370j7560J7220M8259m0713P46N0039M4658J0591
13302A66962M641J1026R9480J30305J10333J65605J76891K14332K85233K75494
$$ plain form
13389 -61842 -55142 13298 32825 24731 32522 13312 19707 15956 -15040 -47164 -44587 -40097 11898
13376 11898 -12603 -50353 -7235 14517 -3770 -12963 48339 58081 51589 58281 48932 53716 45287
13363 45287 43359 31087 9368 12723 -23192 -20346 20272 58295 54096 3268 -7618 15952
13351 15952 33024 1405 21153 59004 31765 -21568 -6998 10964 12877 -10988 -31171 -39671
13339 -39671 -26944 -2472 18756 46699 81073 36275 11283 24006 29594 -3307 -47298 -69388
13327 -69388 -16240 -4044 18042 46666 40381 22569 -28961 -47041 -17776 8188 16008 9798
13315 9798 27885 73165 67645 56092 53722 36162 53382 101641 60928 61674 111713 156371 166962
13302 166962 171603 182629 282109 412414 522747 688352 865243 1079575 1364808 1640302
13292A640302K21840J88540J42183P3643p7040j83412k62560k63069k42238k17603
13282A020586k02661j93224j22501j18485p2187m7902n7138m2054m753k4676k8738
13271A06267l5404k8155k5645N2830K0162K283j0193j7265k4623k4616P913M2022
13259F5576N849j8492Q691P711m8023m0212K3003N4728J8326j9634l6779n5222
13247c4478k7911L0378P7174J1635k8928k050j4008K3372J993k6574l1086J8889
13235a594J5734J9576Q733K7978K9592o3j9736j4955j2423l601q954q792k4269
13222G226L6344K9528J2975r05j7897k8985J4418k9037j2488k5766m55j823R533
13209g332k1128L6305K7411L6658N304j781j4527j1591P60j6739k9098k097J4101
$$ plain form
13292 1640302 1862142 2050682 2192865 2266508 2189468 2006056 1743496 1480427 1238189 1020586
13282 1020586 817925 624701 502200 383715 311528 263626 206488 164434 159681 135005 106267
13271 106267 70863 42708 17063 69893 90055 92338 82145 64880 40257 15641 23554 65576
13259 65576 71425 52933 61624 69335 21312 -18900 4103 58831 77157 57523 20744 -34478
13247 -34478 -62389 -32011 45163 56798 27870 25820 11812 35184 37177 10603 -20483 -1594
13235 -1594 14140 33716 42449 70427 100019 99956 80220 65265 52842 49241 40287 31495 7226
13222 7226 43570 73098 86073 85168 67271 38286 52704 23667 11179 -14587 -15042 -16865 -7332
13209 -7332 -28460 7845 35256 71914 77218 75437 60910 49319 50079 33340 4242 2145 16246
13196A6246J8848n4243n5336J6710M1554J3335q631K2887j304l4033k1181M1766
13184c382L6456j4412J0008j5663Q996L0810O422j6315Q29j4461k9177j0174K7846
13171A7783j7177m943J4161j9193K3962K4299l6831j0427J2096J0347J3341J1175
13159C8593K110p205K987O899K0455P57M256J5283J3915K6226j3633q4577l4406
13146h340l980J8218j0169K990N374K2030N1760K3151O359O165J5696J7219m6939
13133I9534k3434K0194K3277K0787P67k0970K4325N2742K9784n476J1342K5490
13121B58362L6937N3148M9224o171k8602l7594j2308J168k4805n0195p1048j0084
13109A58032K7017l1655m7591N728J2544k3393m12Q09l0641l054J3884K957K9740
$$ plain form
13196 16246 35094 -19149 -74485 -57775 -16221 -2886 -11517 11370 10066 -23967 -45148 -3382
13184 -3382 33074 18662 28670 13007 22003 52813 59235 42920 43749 29288 111 -10063 17783
13171 17783 606 -4337 9824 -9369 14593 38892 2061 -8366 3730 14077 27418 38593
13159 38593 40703 33498 36485 43384 63839 64596 68852 84135 98050 124276 110643 26066 -8340
13146 -8340 -12320 5898 -4271 -1281 4093 26123 77883 101034 107393 113558 129254 146473 99534
13133 99534 76100 96294 119571 140358 141125 120155 144480 197222 227006 221530 232872 258362
13121 258362 295299 348447 397671 391500 362898 325304 312996 314164 289359 239164 168116 158032
13109 158032 185049 153394 105803 111531 124075 100682 100270 101079 70438 67384 81268 84225 113965
13096A13965L372k0296k7306m5218j9459r871p437J3166K0868J7231j1060K9273
13084E7228k650N023K9081L5808k995k8132m1646J1229L0473m1953l4086J0960
13072B8340M7614p116p939R248n226j1163P0508L0053j9991k1347M2507J4155
13060A69643K0038j8061J7914m241K2332P318m5548J7253J8513N453j1722l145
13048A95747l6920k630k1994J718R764k496J2117K0305K7855k876p873k6219n8431
13035A08067o0610J2734M0650p895r099J2562J1924j1817J7421O4841N3301O640
13023B38719o3341j1290K6935K2184L303L4669J270j7127J3203O113K7069J0072
13011B91779J694N2015M8473L2525Q925J3770m6822m0262K6225O4739J9246P1381
$$ plain form
13096 113965 117337 97041 69735 24517 5058 -4813 -12250 916 21784 39015 27955 57228
13084 57228 54578 59601 88682 124490 121495 93363 51717 62946 93419 51466 17380 28340
13072 28340 75954 68838 60899 70147 64921 53758 124266 154319 134328 112981 155488 169643
13060 169643 189681 171620 189534 185293 207625 214943 169395 186648 205161 210614 198892 195747
13048 195747 158827 156197 134203 135921 145685 143189 155306 175611 203466 200590 192717 166498 108067
13035 108067 47457 60191 100841 92946 83847 96409 108333 96516 113937 178778 232079 238719
13023 238719 175378 164088 191023 213207 216510 251179 252449 235322 248525 254638 281707 291779
13011 291779 293473 345488 393961 426486 435411 449181 402359 362097 388322 453061 472307 543688
12999E43688Q6768P3646R8704J18037R7743M2050K1847K5957k156j11291j45139
12988H49854j43018j37044r0775j39341j04196k9379j9353Q283j6259j7160J3305
12977A74917J197j8394l177N094N32k8380Q35j9969J8066N743m519R905N6395
12964A98245N8866J9231l8156K1946q685O944K1178K099j7807K1395O217l3939
12952B57534K0424J3410N66L3216M9474M0479r620L1862K7728L9332J5163O90
12940E20258l36k180J4388J5643l2926n2834J9124O9974J1653p655J4231L7665
12928F07005n61K279L0122N9582P5513P2120L7269L5260M2415N1302L1366L7017
12916A080689N9692L9940O6396O4369P5898L8988O0333R9301R6332R8949J19394
$$ plain form
12999 543688 630456 704102 802806 920843 1018586 1060636 1082483 1108440 1106284 994993 849854
12988 849854 706836 569792 479017 339676 235480 206101 186748 195031 178772 161612 174917
12977 174917 176114 157720 154543 159637 160169 131789 132624 112655 130721 136464 131945 141850 198245
12964 198245 257111 276342 238186 260132 251447 258391 279569 281668 263861 285256 291473 257534
12952 257534 277958 291368 291934 325150 374624 415103 405483 437345 465073 504405 519568 520258
12940 520258 519922 517742 532130 547773 514847 462013 481137 551111 562764 555109 569340 607005
12928 607005 606444 608723 638845 698427 773940 846060 883329 918589 961004 1012306 1043672 1080689
12916 1080689 1140381 1180321 1246717 1311086 1386984 1425972 1486305 1585606 1681938 1780887 1900281
12905A900281J47362J38011J12651J43239J93688J56559J45653J90097L10227
12896C437768L18919L43003L46577M02234M51554N54883O77593P56049R43480
12887H232060J173654J438577J701781J957884K255768K580371K896767L335572
12879B5572434L987418N054087O886802J0062653J5353439K3171029L2576401
12872A22664263M0964855M7036841M9356173M8788010M4935595L6941511K3757811
12865D14445059N646638j2230959k8041435l8464261m5023932m7890590m7730028
12858B00710492m3997113l6770733k8174090k0038183j3708497r578987p105329
12851D1337560n544443m536818l892006l411781l038013k702226k401384k041691
$$ plain form
12905 1900281 2047643 2185654 2298305 2441544 2635232 2791791 2937444 3127541 3437768
12896 3437768 3756687 4099690 4446267 4848501 5300055 5854938 6532531 7288580 8232060
12887 8232060 9405714 10844291 12546072 14503956 16759724 19340095 22236862 25572434
12879 25572434 29559852 34613939 41500741 51563394 66916833 90087862 122664263
12872 122664263 163629118 210665959 260022132 308810142 353745737 390687248 414445059
12865 414445059 420091697 407860738 379819303 341355042 296331110 248440520 200710492
12858 200710492 156713379 119942646 91768556 71730373 58021876 48442889 41337560
12851 41337560 35793117 31256299 27364293 23952512 20914499 18212273 15810889 13769198
12843A3769198j705168j427351j164072r13531p64082o75376n77372m82633m20430
12834E639183l81379l51262k84641k50858k27245k36298k02013j52422j77100
12825C375965j48867j50401j34934j07529j32126j29304n0792m8983p1693l8282
12815B363054m913k5586n5589k9583r7894j12425q8416q7601r332m6239n2487
12804A752989j016r176o14k8840m1528p6611k7746m9013n3154p4562p6942q1864
12792A231923l0431o01j9706k316P7041J97825J40714o4459j52646j43600j41004
12781A092740q2006k6606l4919k712o369l6348J2630r31m5384m5459n554J2628
12769H31710K4841k5388m6530k4963l2731m9057l4487L6198M6509j7457Q513j1008
$$ plain form
12843 13769198 12064030 10636679 9472607 8559076 7794994 7119618 6542246 6059613 5639183
12834 5639183 5257804 4906542 4621901 4371043 4143798 3907500 3705487 3553065 3375965
12825 3375965 3227098 3076697 2941763 2834234 2702108 2572804 2522012 2473029 2401336 2363054
12815 2363054 2358141 2332555 2276966 2247383 2149489 2037064 1948648 1861047 1851715 1805476 1752989
12804 1752989 1751973 1742797 1742183 1713343 1671815 1595204 1567458 1518445 1465291 1390729 1313787 1231923
12792 1231923 1201492 1200891 1181185 1178869 1255910 1453735 1594449 1529990 1377344 1233744 1092740
12781 1092740 1010734 984128 949209 946497 940128 903780 916410 915479 870095 824636 819082 831710
12769 831710 856551 831163 784633 759670 726939 677882 643395 679593 726102 708645 717158 706150
12757G06150l1553J8418Q773N474O8927M9803K2506R544R812r954L5317n256K0292
12744I08253J33359J84464J95347K14313K51389K38224J88980K28565J42775O883
12734B692552r8535j93354k10135k55150l18779l16736k15239j70809j35502j10021
12724F68292j08501r3575n4989j1965k4516p1643p9226K802p432m1970M44j446
12712A76275M872N1168J730L949N1099K6721L106M5779K2327l5396j0800L563
12700C44393j0293J2165j6351n931r898j9491n040l6410L5757J9081k6929n1508
12688B29545j144k1856m0627J3163K0968K482J7898k2772j72p916j7007l1604
12676A40958j4246j7077k860K245K6097n433K0866L9398N0744K2827j9929J3623
$$ plain form
12757 706150 674597 693015 701788 707262 776189 825992 848498 858042 867854 857900 893217 887961 908253
12744 908253 1041612 1226076 1421423 1635736 1887125 2125349 2314329 2542894 2685669 2692552
12734 2692552 2594017 2400663 2190528 1935378 1616599 1299863 1084624 913815 778313 668292
12724 668292 559791 466216 411227 399262 374746 303103 223877 226679 219247 177277 177721 176275
12712 176275 181147 232315 234045 237994 289093 315814 318920 364699 387026 351630 340830 344393
12700 344393 334100 346265 329914 323983 314085 294594 289554 253144 288901 307982 281053 229545
12688 229545 228401 206545 165918 179081 200049 202531 220429 197657 197485 189569 172562 140958
12676 140958 126712 109635 106775 109020 135117 129684 150550 189948 240692 263519 243590 257213
12664B57213K2295n322p490J2592k1035l8616j8143p443k1081k0196l631R35L3375
12651A83453m6053k7055p859N669K7617p206M746j4432P434m4083n3886k505R069
12638C4909J1953L1939N2777K9648n7792m9037M4294K1840j3104M612J1577k1116
12626A02500J0721N8788r056k9281L169J5019j4966q472J8471N180K2542K8166
12614B02781J7092M3339j4115k4411j1924k7371r834k6080j9178l7774j4628p551
12602G0346J2188J5013J1757K7841N1136P719m7077o938j3225l2719k4729J8341
12590H9653J3971J3754M0352P148J2824P28M075l9390l1695k5942J156J3857l1403
12577F9088K115M3180J9392k6571m2750J4761J6173K640L4071J527l0333M897
$$ plain form
12664 257213 279508 274186 266696 279288 258253 219637 201494 194051 172970 152774 149143 150078 183453
12651 183453 137400 110345 102486 108155 135772 128566 133312 118880 126314 82231 28345 25840 34909
12638 34909 46862 78801 131578 161226 103434 54397 98691 120531 107427 112039 123616 102500
12626 102500 113221 172009 162953 133672 136841 151860 136894 128422 146893 152073 174615 202781
12614 202781 219873 263212 249097 224686 212762 185391 175557 149477 130299 92525 77897 70346
12602 70346 82534 97547 109304 137145 188281 196000 148923 141985 128760 96041 71312 89653
12590 89653 103624 117378 157730 164878 177702 178430 182505 143115 111420 85478 86634 100491 69088
12577 69088 71203 114383 133775 107204 64454 79215 95388 98028 132099 133626 103293 108190
12565A08190r587p383j8415J8782j0422j3596n186J7905J7324k735j1387l6182
12553D7308k3783R27L0160K4023J3731L138n3396l8772L2469K20P237M0832j8793
12540F5301m0358k8176j0831L882J6741N123K3164k0527r532N721K4611K3699
12528E8818P055j1981k3775o204j8165N334Q0J3440K157K3550J1044p2j9677p824
12514C3780M381J1911K8250J3860j1346l2040j4556j6601K068m839J609R483l471
12501B2489J5460K4816j5490j6779m013L5379M5822j8861k5181o265j3761Q610
12489E2226M0633L5397k9656m410J8798j1L2809k547k4631n2467j3055Q943n538
12476E6491m323L7965L2675l7199j8881j5193Q390J8684R627k4616m960l8620
$$ plain form
12565 108190 98603 91220 72805 91587 81165 67569 62383 80288 97612 94877 83490 47308
12553 47308 23525 24452 54612 78635 92366 95504 42108 3336 35805 36025 43262 84094 65301
12540 65301 24943 -3233 -14064 -10182 6559 11682 34846 14319 4787 10508 35119 58818
12528 58818 65873 53892 30117 23913 5748 11082 11162 24602 26759 50309 61353 61281 41604 33780
12514 33780 38161 50072 78322 92182 80836 48796 34240 17639 19707 14868 16477 25960 22489
12501 22489 37949 62765 47275 30496 26483 61862 107684 88823 63642 57377 43616 52226
12489 52226 92859 128256 98600 94190 112988 112977 145786 143239 118608 66141 53086 62029 56491
12476 56491 52168 90133 122808 85609 66728 51535 59925 78609 88236 63620 58660 20040
12464B0040j898K1105m4349L235J9204J136O329K7297K6299Q9J8636J5646k1053
12451I1716l140L8653P0500M0164M7486N9209M9263J18911J73382K11456K33060
12440A130660K44706K76574K27230J84426J46915R1114o902j05532j79318k53412
12430A756461k80178k36827k10855k14573j70073j49669r0600M965l4945o6925
12420C06781l1570n2817k0354m6448n6973n737k754P26k2210P135K3573m449m4336
12407E0567n373L2445L8516K5545J6391R143l8495l4350j0962j5381M0988n478
12395A03556l4778j1171L4964J8634j5633j9105l2668R33R582J9523k0128j9936
12383C3773J0524K2151m0189k2836L149R201k2889l4652J6711N3704K9121J2293
$$ plain form
12464 20040 18142 39247 -5102 -1867 17337 18473 24802 52099 78398 78487 97123 112769 91716
12451 91716 88576 127229 197729 237893 285379 344588 393851 512762 686144 897600 1130660
12440 1130660 1375366 1651940 1879170 2063596 2210511 2301625 2294723 2189191 2009873 1756461
12430 1756461 1476283 1239456 1028601 814028 643955 494286 403686 408651 373706 306781
12420 306781 275211 222394 202040 155592 98619 92882 90128 90854 68644 75779 99352 94903 50567
12407 50567 45194 77639 116155 141700 158091 167234 128739 94389 83427 68046 109034 103556
12395 103556 68778 57607 92571 111205 95572 76467 43799 44732 54314 73837 53709 33773
12383 33773 44297 66448 26259 3423 6572 15773 -7116 -41768 -25057 28647 57768 70061
12371G0061J1236O958O272r989k0128j4439k4220N1061K975m3001J9086k6109
12359B9763J845j7811J1304L3324q873K66J365M5854k2293k5372R407O83m4126
12346A5336k3143O937L9232L1260l064q712L972J2484n034k1499j8231J6410R585
12333E5533j5984j8737l7818l532k4807N667L4290J4061j1964K4658J3030j0225
12321B4172J011n000P029j3514k4180K6879M7984k2319M127j2056k5981k1848
12309a3696J0124K1976p90L2175j881k6535m2664j4498L2379k569R307K2913j8119
12296H122p274L3152R606j1367k0651n911K2406k5807l5958J7735j7821j1918
12284d5686j756J0605M761K4843J5793K9673P541Q857k00K4674N817n5540l1432
$$ plain form
12371 70061 81297 88255 94527 84538 64410 49971 25751 76812 79787 36786 55872 29763
12359 29763 31608 13797 25101 58425 49552 49818 51183 97037 74744 49372 58779 59462 15336
12346 15336 -7807 -870 38362 69622 66558 57846 61818 74302 69268 47769 29538 45948 55533
12333 55533 39549 20812 -17006 -20538 -45345 -39678 -5388 8673 -3291 21367 34397 24172
12321 24172 25183 20183 27212 13698 -10482 16397 64381 42062 46189 34133 8152 -13696
12309 -13696 -3572 18404 17614 49789 47908 21373 -21291 -35789 -3410 -5979 3328 26241 8122
12296 8122 848 34000 43606 32239 11588 5677 28083 2276 -33682 -15947 -33768 -45686
12284 -45686 -47442 -36837 -32076 -7233 8560 38233 45774 54631 54431 79105 84922 29382 -2050
12271b050K3823J1049J5789j5606N385J6518m389K3174j3398n7498k7607L3545
12259H735K3426K5130k1433k7809L4984J5144l6134k8544R989j1799J8039K7263
12247C6991M0301k3630n1501P019L0670N748j2130j1443L4607l8527m958Q421
12235B1568j6982Q945K6568K1423L9319k6917n2891k2561L2054r94k5089m7817
12223d3374j5597K8472K1476J0063J2841j1195o782M2119L8353J9545k6749K3258
12211I2430J2246l3841n2369j6776L1469r926J4740N816O508J2123j4399K7014
12199G5035K9942J0480q2330m0830J1924O574Q463K7456J7610j5522L1621k2215
12187E8208n4062j4302K7036K0219J4034K0716n972K599j869j6675k3713q932
$$ plain form
12271 -2050 21773 32822 48611 33005 38390 54908 50519 73693 60295 2797 -24810 8735
12259 8735 32161 57291 35858 8049 43033 58177 22043 -6501 3488 -8311 9728 36991
12247 36991 77292 53662 2161 9180 39850 45598 33468 22025 56632 18105 13147 21568
12235 21568 4586 13531 40099 61522 100841 73924 21033 -1528 30526 29532 4443 -43374
12223 -43374 -58971 -30499 -9023 1040 13881 2686 -4096 38023 76376 95921 69172 92430
12211 92430 104676 70835 18466 1690 33159 23233 37973 43789 50297 62420 48021 75035
12199 75035 104977 115457 33127 -7703 4221 10795 19258 46714 64324 48802 80423 58208
12187 58208 4146 -10156 16880 37099 51133 71849 65877 68476 66607 49932 26219 17287
12175A7287M6969L4141j3900n9934M629J0471k0145J3291J6117k2748M971l086
12163B8063p797j7532M1512M6759N189o0832K533Q36k3997k396p930l7766j2803
12150d6161L0648M1256l4059J2879L20R990k812k7278J1366J9305J5599k2994
12138H059p951m376J3430R65j6023p524J9542K5894K037K7846L3123R596k2769
12125H1849m7879j0515k1987l9706L1813L4420N2495L3436k4324n9015j2313K6789
12113D5063K9421l0002j1388l2562m2124p480O250K6364J50n6297K701M1538L6322
12100G956m522o244k4859k3460p851K8731O831n976R632L3065N838n1481k7221
12087e9561N6183k5307m1349K6757N2546K0517L238q530J4541k3641j1786k0486
$$ plain form
12175 17287 64256 98397 84497 24563 29192 39663 19518 32809 48926 26178 31149 28063
12163 28063 20266 2734 44246 91005 96194 35362 37895 38731 14734 12338 4408 -33358 -46161
12150 -46161 -15513 25743 -8316 4563 4883 14873 12061 -15217 -3851 15454 31053 8059
12138 8059 108 -4268 9162 10127 -5896 -13420 6122 32016 34053 61899 95022 104618 81849
12125 81849 33970 23455 1468 -38238 -6425 27995 80490 113926 89602 30587 18274 45063
12113 45063 74484 44482 33094 532 -41592 -49072 -42822 -16458 -16308 -72605 -69904 -28366 7956
12100 7956 3434 -2810 -27669 -51129 -58980 -30249 -23418 -29394 -19762 13303 19141 -32340 -59561
12087 -59561 -3378 -28685 -70034 -43277 9269 29786 33024 24494 39035 15394 3608 -16878
12075a6878n824j0060j0296J1294l9735n940J9662P022j5310M4982M8259J3548
12063D0724M008l5542l1306M2542l686l5367O362J4327K2402j573K2925m459J6548
12050E7905J5638p243j090K320j961n8940l7079J2094L8202K2424l7653k668J1358
12037A3307J6649l15k841J2105L614k2485r644q72j1893k1909J005M0317J8521
12024C5559j164K799l8007q305j3147m311J1659M1273J0319J354l2540j212O713
12011A0990l3399j977o389j1430N4031L3511M051M55o374O614q058M62l09l1279
11997A0899n19k1202j1034P635l5281l631J1475k0649J7052N3750K7597k2214
11985A3878m7820j0122J8158M6587N3961r69k6230k7790j6092Q798j9459r318
$$ plain form
12075 -16878 -22702 -32762 -43058 -31764 -71499 -77439 -57777 -50755 -66065 -21083 27176 40724
12063 40724 44732 9190 -22116 20426 16740 -18627 -12265 2062 24464 22891 45816 41357 57905
12050 57905 73543 66300 65210 67530 65569 6629 -30450 -18356 19846 42270 4617 1949 13307
12037 13307 29956 29641 26800 38905 42519 20034 10390 9518 -2375 -24284 -23279 17038 35559
12024 35559 34395 37194 -813 -9118 -22265 -26576 -14917 26356 36675 38029 5489 4277 10990
12011 10990 -22409 -24386 -30775 -42205 11826 45337 49388 49843 43469 50083 42025 42487 42178 10899
11997 10899 10380 -10822 -21856 -14221 -49502 -53133 -41658 -62307 -45255 8495 36092 13878
11985 13878 -33942 -44064 -25906 20681 74642 73673 47443 19653 3561 12359 -7100 -16418
11973a6418L1784J3748J8982J3461J6074j6958o844j6304l3793J4078L2831n1587
11961i46J4318J7514j2624j6747M7508J8673J4518k4805j3883l7603j4894K8614
11949A9643K0311R997r987j5067l16P481l1815m348P931J0391R639j8372j5529
11936a0041n779q329j8425l8008j9310M195M3995K8191M9718J5294p992j8149
11924A5360n723r906n304k8509P526J7609j902k2183N540J702O179q244K1095
11911f760J7894J2450l1346O039M81j7661J124N1329j4319j5570j9383k8263K0091
11898b3894L3654m1813r407L170K0202J8227K1998j3989j4258l102M63P300m1122
11885d2571r799J4881O303N3212k0738J047M289N267l5025k0962L3465L4465R462
$$ plain form
11973 -16418 15366 29114 48096 61557 77631 60673 53829 37525 3732 17810 50641 -946
11961 -946 13372 30886 18262 1515 49023 67696 82214 57409 43526 5923 -8971 19643
11949 19643 39954 49951 39964 24897 24581 32062 247 -4101 3830 14221 23860 5488 -10041
11936 -10041 -15820 -24149 -42574 -80582 -99892 -95697 -51702 -23511 26207 41501 33509 15360
11924 15360 9637 -269 -5573 -34082 -26556 -8947 -10849 -33032 -27492 -25790 -19611 -27855 -6760
11911 -6760 11134 23584 -7762 -1723 -1242 -18903 -17779 33550 19231 3661 -15722 -43985 -23894
11898 -23894 9760 -32053 -41460 -38290 -18088 139 22137 8148 -6110 -9212 -8749 -1449 -42571
11885 -42571 -52370 -37489 -31186 22026 1288 2335 6624 11891 -23134 -44096 -10631 23834 33296
11872C3296m327L714j1531l9103j7485K4232m575l1023o904K3154R510J9387M7943
11859D6288L5196j2831l1957m0171k6080K104M1005k1809l421k812j3886K8220
11847a54R21J9529p649j6287l341K4903L316m018O163M247l3154n7429Q492K1930
11833c2531K2145j751n394K4839J9337J3956p973j7020k267j3774m153K5561O146
11820B7121l1192r268k5210k6030K7708N53l3801K6146K4770N10o158K445K3083
11807F77L9589M3695j1524k3089o1068m6605K4977K89K7893J4405k9977k9924
11795e0662R642J1552J7045k1836K3732J3146k2586j2714M335j9673J3459k483
11783c7043j4063j1005N236L183n731j0690J4484N343q356j4176j5096J8127J8600
$$ plain form
11872 33296 28969 32683 21152 -17951 -35436 -11204 -15779 -46802 -53706 -30552 -21042 -1655 46288
11859 46288 81484 68653 36696 -3475 -29555 -27451 13554 -8255 -11676 -14488 -28374 -154
11847 -154 767 20296 12647 -3640 -6981 17922 21238 17220 23383 27630 -5524 -62953 -54461 -32531
11833 -32531 -10386 -12137 -17531 7308 26645 40601 32628 15608 13341 -433 -4586 20975 27121
11820 27121 -4071 -13339 -38549 -64579 -36871 -36318 -70119 -43973 -19203 -18693 -24851 -22406 677
11807 677 40266 83961 72437 49348 -11720 -58325 -33348 -33059 -5166 9239 -20738 -50662
11795 -50662 -41020 -29468 -12423 -34259 -10527 2619 -19967 -32681 -28346 -48019 -34560 -37043
11783 -37043 -51106 -62111 -56875 -53692 -59423 -70113 -55629 -50286 -58642 -72818 -87914 -69787 -51187
11770e1187j0343r990R365O420R187L5119K1067j3788j3553J3010K860R249o851
11757E65j7565q09j2083l8990J9403J5047J8147Q75j501J1550O493J6907j6335
11744A704K134j1629J2984L1021n997m7673n5691J7792J2013J3555j1564P275
11732c4076r720Q654R969l5151n467r610j5712k884K5004M3162L3598l4785m1365
11719f8383N828O561n53l637K8195K6369j1220K9645K2764l4854j0184j2369j4841
11706c6679L6987R078p0302p707k95L0781R676j5084j6463Q686K5969J8282M740
11693b331j4200k3093m1999K4860O1300L2070N026j8032j4623j1196k1349J2328
11681a1239j594l4254l5289j6032k2174K6192N5756J5970K5772K4573n408N886
$$ plain form
11770 -51187 -61530 -71520 -62155 -55735 -46548 -11429 9638 -4150 -17703 -4693 -1833 7416 565
11757 565 -17000 -17809 -29892 -68882 -49479 -34432 -16285 -15410 -16911 -5361 1132 18039 1704
11744 1704 3838 -7791 5193 36214 30217 -17456 -73147 -55355 -43342 -29787 -41351 -34076
11732 -34076 -43796 -35142 -25173 -60324 -65791 -75401 -91113 -93997 -68993 -25831 7767 -27018 -68383
11719 -68383 -62555 -55994 -56547 -60184 -31989 -5620 -16840 12805 35569 715 -9469 -21838 -36679
11706 -36679 308 9386 -60916 -68623 -68918 -38137 -28461 -43545 -60008 -51322 -25353 -7071 -2331
11693 -2331 -16531 -39624 -81623 -56763 4537 36607 41633 23601 8978 -2218 -23567 -11239
11681 -11239 -12833 -47087 -82376 -98408 -120582 -94390 -38634 -22664 3108 27681 22273 28159
11669B8159n470j9051l3904J0264P918j898j9574R248K1335M467R547n8389k2762
11656g0110K6327M2485j1560k2977l644K0214L9846L4768n192j3096M240l8639
11644B662m592j3137L1016R519N514k8268k1822M0191o877m400m194K4864k3180
11631G296k5286L8552L0152Q668j1212o2960j7457J8457L5581J1856k3770m2773
11619c2896K504O722n371j3954n659k808J2517j3232L1424K4652j5109k6997j4008
11606e2215K0089p162k004L9652J3389P249l1354k8333J9469J3991Q969M084j5560
11593i736j5470J6456j0699j8789P330L846j8123M009L0608k309N505N28l0204
11580c7048k1020j4557O607M4498k046J017l2638J6796K5583k0526K0317J3429
$$ plain form
11669 28159 22689 3638 -30266 -20002 -12084 -13982 -33556 -24308 -2973 1494 11041 -47348 -70110
11656 -70110 -43783 -1298 -12858 -35835 -39479 -19265 20581 55349 50157 37061 41301 2662
11644 2662 -1930 -15067 15949 25468 30982 2714 -19108 21083 14206 9806 5612 30476 7296
11631 7296 -17990 20562 50714 59382 48170 -14790 -32247 -13790 21791 33647 9877 -32896
11619 -32896 -30392 -23670 -29041 -42995 -48654 -51462 -38945 -52177 -20753 3899 -11210 -38207 -52215
11606 -52215 -32126 -39288 -41292 -1640 11749 18998 -12356 -40689 -21220 -7229 1740 5824 -9736
11593 -9736 -25206 -8750 -19449 -38238 -30908 -27062 -45185 -41176 -10568 -12877 -7372 -6844 -37048
11580 -37048 -58068 -72625 -66018 -21520 -23566 -22549 -55187 -38391 -12808 -33334 -13017 412
11568D12m47k623l089J3015J4452K2233k5395j2930J000r179L8010J3871R83l3014
11554A7299K6099k3644j5531k2258J2421k1019J9273K9191L892l537k4704J211
11542a307N0518J9707j8773m732K170m738O007j8155j8098K0803J9006p989n4409
11529i990j8471J2488L2243J3478o552K7560m4840k4604k9034l5753L9908K333
11517d1234J8061J0025k9201n003K0146K4178q21j9745J1355l6075j0097O7452
11505I041L1927L4887l703q4094m7211J4617K4024J5342J0391r438J002j7672
11493b0887l9350j3624K5575M0997J9009k0619j7473K0473K5113k3439L115k0484
11481b1594j7846r971J3979J7915j844J2604n464O090J7973J5392q941q216l343
$$ plain form
11568 412 -35 -2658 -5747 7268 21720 43953 18558 5628 6628 -2551 35459 49330 50313 17299
11554 17299 43398 19754 4223 -18035 -5614 -26633 -7360 21831 25723 22186 -2518 -1307
11542 -1307 49211 68918 50145 45413 47583 42845 48852 30697 12599 33402 52408 44419 -9990
11529 -9990 -28461 -15973 16270 29748 23196 50756 5916 -18688 -47722 -83475 -43567 -41234
11517 -41234 -23173 -13148 -42349 -47352 -27206 -3028 -3849 -23594 -12239 -48314 -58411 9041
11505 9041 40968 75855 72152 -11942 -59153 -44536 -20512 -5170 5221 -4217 -3215 -20887
11493 -20887 -60237 -73861 -48286 -7289 11720 -8899 -26372 -5899 19214 -4225 -1110 -21594
11481 -21594 -39440 -49411 -35432 -17517 -19361 -6757 -12221 -6131 11842 27234 18293 10077 6734
11468F734k4632j8976R521N8205N232n3309r033l2531R407L7418K3796P208j551
11455A7489j6427Q309J6216K0725n903N246l5792l7262M614K8333r829q793J081
11442a1993J9867k634k1827K918L6860k8744R27P642K0359q459q229j0843O905
11429B749k6306l4391K962J9890K3477j6527K6906O332k5870j3847l745L405O77
11416c4288j8393J771k417J6095m970k7321K8717K6311j3355p595j4524J8377
11404c1592j5248j6744l7771J1615K5273M0438L6105R694k9016k1658J8023N120
11392e761o446N115j0296M031P659k6430P154M8608J117j3349J476K0429j3163
11379B0144k331j6048j2848k7517K2681K4429j087O338q063k1863M131M818p688
$$ plain form
11468 6734 -17898 -36874 -27353 30852 36084 -17225 -26258 -58789 -49382 -11964 11832 19040 17489
11455 17489 1062 9371 25587 46312 40409 45655 9863 -27399 -22785 5548 -4281 -13074 -11993
11442 -11993 7874 5240 -16587 -13669 23191 -5553 -4626 3016 23375 14916 6687 -4156 2749
11429 2749 -23557 -57948 -54986 -35096 -11619 -28146 -1240 5092 -20778 -34625 -38370 -34965 -34288
11416 -34288 -52681 -50910 -53327 -37232 -42202 -69523 -40806 -14495 -27850 -35445 -49969 -31592
11404 -31592 -46840 -63584 -101355 -89740 -64467 -24029 12076 21770 -7246 -28904 -10881 -5761
11392 -5761 -12207 -7092 -17388 -13357 -5698 -32128 -24974 23634 24751 11402 12878 33307 20144
11379 20144 17813 1765 -11083 -38600 -15919 8510 7423 13761 5698 -16165 -12034 -7216 -14904
11366a4904j3477L0710Q310j5333m3016k0974K1882K1722J1460J1892j4027L1681
11354A5926N129k6727o946K6369J0602l4445j1124k3707J1003L5911k3607m2303
11342f3919n1155K6437K0483L1617M022R227K942j2428N309k608n110L3321L6867
11329C5005p145j8543J7231R242j2420l0148j1991M1808j36k235K413l2825K5533
11316A5789l0594n0793M1292N5518K2203j2459k7314J3233j0617K2186j303l5010
11304B131P434J5649J2786l3593k833L4349m734j9026j1848m162L2119O611m6510
11291a1627j7608k895k1364N620J378j5356k960L610J3556r480J9424J4065k6502
11278e0139l8093L3576Q5625O888l5335r180L7846m691Q152P090m7502k4338N546
$$ plain form
11366 -14904 -28381 2329 10639 -4694 -47710 -68684 -46802 -25080 -13620 -1728 -15755 15926
11354 15926 21055 -5672 -12618 13751 24353 -10092 -21216 -44923 -33920 1991 -21616 -63919
11342 -63919 -115074 -88637 -68154 -36537 -32515 -23288 -20346 -32774 -27465 -30073 -35183 -1862 35005
11329 35005 27860 9317 26548 35790 23370 -6778 -18769 23039 22903 20668 23081 -9744 15789
11316 15789 -14805 -65598 -24306 31212 53415 40956 13642 26875 16258 38444 37141 2131
11304 2131 9565 25214 38000 4407 1574 35923 31189 12163 315 -3847 28272 34883 -11627
11291 -11627 -29235 -32130 -53494 -47874 -46496 -61852 -64812 -61202 -47646 -57126 -37702 -23637 -50139
11278 -50139 -88232 -54656 30969 37857 2522 -6658 31188 26497 34649 41739 -5763 -30101 -24555
11265b4555j7445O591O197L0727K0458l192k5310j3531Q555j9038l3822K5168
11253c9197J9798J9657N716n255q068l9521P837K3955J2052J7180j532m28r244
11240B950J246L4264J0546k6110m1822j3490K3083K8565j2206k2792R686J2311
11228F231j7646j2482J5041J5681L435j7838j3165L1655K6110q502j9112j4677
11216e269q618k496l695R082P4J3951P167J3261j3456J8215o154J0871J2371L510
11202D8814l4331k0283L1474J5731j6414l0967J0453P506k2179j3773J8784l6933
11190d2118O255j518j0409J2349M3492l3458J6227k5467m2759L1974L2841j1479
11178b4070k3207L2389K8478P503j3366j8503L4028L2852k8706k5555J8493J826
$$ plain form
11265 -24555 -42000 -35409 -29212 1515 21973 18781 -6529 -20060 -11505 -30543 -64365 -39197
11253 -39197 -19399 258 5974 719 -7349 -46870 -39033 -15078 -3026 14154 12622 12194 2950
11240 2950 4196 38460 49006 22896 -18926 -32416 -9333 19232 7026 -15766 -6080 6231
11228 6231 -11415 -23897 -8856 6825 10260 -7578 -20743 10912 37022 28520 9408 -5269
11216 -5269 -13887 -16383 -20078 -10996 -10922 3029 10196 23457 10001 28216 22062 32933 45304 48814
11202 48814 14483 -5800 25674 41405 24991 -5976 4477 11983 -10196 -23969 -5185 -42118
11190 -42118 -35863 -37381 -47790 -35441 8051 -25407 -9180 -34647 -77406 -45432 -12591 -24070
11178 -24070 -47277 -14888 13590 21093 7727 -10776 23252 56104 27398 1843 20336 22162
11166B2162K6198n810n2794M441O942J95J3361j2362k9442j3506K2742k7053l0516
11153g5442L747R307K9048L7718J2855j1153P459k0427K0986j5416l7955j0630
11141d9903J1877M172K0823Q978j8723J0162j5773k1626J4449Q568J4373J6942
11129D319M0825m436j8241m2941j9574P284K5653P071J0046l651K3114L102Q444
11116D1015J6105k0943l3033l9727j8135O049L1490J1709k4R498J1485j2848O391
11103I032j3596j1988q040j5048M7254P232r024k9842k3709k041K5399Q819j9923
11090c5475K2623K55j23J175l249O099J5048l1851J2032J0877p310J4661J1500
11077A6262L595k4281r21j7557j4747J6298q503j5065L2561K8480k8988j8726
$$ plain form
11166 22162 48360 42550 -10244 -5803 1139 1334 14695 2333 -27109 -40615 -17873 -44926 -75442
11153 -75442 -71695 -62388 -33340 4378 17233 6080 13539 -6888 14098 -1318 -39273 -49903
11141 -49903 -38026 -33854 -13031 -4053 -22776 -12614 -28387 -50013 -35564 -26996 -12623 4319
11129 4319 45144 40708 22467 -20474 -40048 -32764 -7111 -40 10006 6355 29469 32571 41015
11116 41015 57120 36177 3144 -36583 -54718 -48669 -17179 -5470 -5494 4004 15489 2641 9032
11103 9032 -4564 -16552 -24592 -39640 7614 14846 5822 -24020 -47729 -49770 -24371 -15552 -35475
11090 -35475 -12852 -12597 -12720 -11545 -14794 -8695 6353 -25498 -13466 -2589 -9899 4762 16262
11077 16262 19857 -4424 -5345 -22902 -37649 -21351 -29854 -44919 -12358 16122 -12866 -31592
11065c1592O902o966m046J6434j0969l1786j1333K3820M4118J3370l634N730J7500
11052B7548j5161k0482K58K8000J2308L761p760k9596J6865k6023n4469l661J7477
11039e0935J8281J8702K1714j5928j3810J8769K7756J9035K0299j0931l0734l8551
11027a6333k7649L4757J5279l8900k3020J5544K4090m185J1795M556k3935j0785
11015c8786o351J6950n201J7538K4031j3536n662m3O517J7291J6633j5667l000
11002A0714L715J6324Q628M6624j2202o3371j0148j5935k9339n942j0841J9100
10990d2673K6132L8056R007K5075J6630J3548J3587j7801l6831M234l0674J7114
10978C5404M2367j1704J9301j4849k1551P081L4351M6323P954J3382O5675J22577
$$ plain form
11065 -31592 -24690 -31656 -35702 -19268 -30237 -62023 -73356 -49536 -5418 7952 4318 10048 27548
11052 27548 12387 -8095 -7837 20163 32471 36232 28472 -1124 15741 -10282 -64751 -68412 -50935
11039 -50935 -32654 -13952 7762 -8166 -21976 -3207 24549 43584 63883 52952 22218 -16333
11027 -16333 -43982 -9225 6054 -32846 -55866 -40322 -16232 -20417 -8622 -4066 -28001 -38786
11015 -38786 -45137 -28187 -33388 -15850 8181 -5355 -11017 -11060 -4543 12748 29381 13714 10714
11002 10714 14429 30753 39381 86005 73803 10432 284 -15651 -44990 -50932 -61773 -42673
10990 -42673 -16541 21515 30522 55597 72227 85775 99362 81561 44730 48964 18290 35404
10978 35404 77771 66067 85368 70519 48968 56049 90400 136723 144677 158059 223734 346311
10966C46311J30650J8839o0723p4176o6640q1475o9428q022m087j6347J2475J9909
10954A47286j5864j0452J6563l5562m4499m374N456Q89p604k2826K8338L3238
10942I0589K7211k2125R040L813o9672l1643N3545L1324P318r372j8593K0910
10930I2345K7576L4791n530L5279Q7197J26449J30748K26863L67240L08244N1768
10919A482970j44731l19486l20191j86667j24319q6120n8485m1838l2635n3496
10909A15002k3121k2154j0405Q420l2435m4678K6905M1880J2624k2508J8762P248
10897G5540L292P728l4388l6759J7436K4398j8504K8531K2947M2175R7103N6038
10885B85537R1074Q8480M6015L8779J7771j7918L5173K38870L58392L20819L7472
$$ plain form
10966 346311 476961 495800 435077 360901 294261 212786 143358 135336 131249 114902 127377 147286
10954 147286 131422 120970 137533 101971 57472 53098 58554 59443 51839 29013 57351 90589
10942 90589 117800 95675 104715 108528 38856 7213 60758 92082 99400 90028 71435 92345
10930 92345 119921 154712 149182 184461 271658 398107 528855 755718 1122958 1431202 1482970
10919 1482970 1338239 1018753 698562 511895 387576 301456 242971 201133 168498 115002
10909 115002 91881 69727 59322 67742 35307 -9371 17534 59414 72038 49530 68292 75540
10897 75540 78832 86560 52172 15413 32849 57247 38743 67274 90221 132396 229499 285537
10885 285537 376611 465091 511106 549885 567656 549738 584911 823781 1182173 1502992 1540464
10874A540464j68181l00603l48114k47582j78961p9487j5416m9043l2484j9163
10864A01430k215Q950k4081k1681j3080m1990o186Q235K6197L3706J788P729m8872
10851B9930m9327J4487J8841j2062k7395L1477J9445K1447N0182J566R110k6925
10839H0776m7341l4374N1919N6456N5479P9336O4677R4702O7730K1093p3540p7796
10827C39117o1860l9794o1166o8346m8591k0544N451j7215J1032K9157K104k8326
10815D1019j9085j8197k932N583P532K7897J8574j1254n219l0693n3366K3894
10803a6247K6182k4894J6169n401j2227j6340M6402r19j5143K5870p236m2328
10791b6112L232m422m482M513K1350J4952j7130j7027M4776J3003j4430j2237
$$ plain form
10874 1540464 1372283 1071680 723566 475984 297023 217536 202120 153077 120593 101430
10864 101430 99215 108165 84084 62403 49323 7333 1147 9382 35579 69285 71073 78802 29930
10851 29930 -19397 -4910 13931 1869 -25526 5951 25396 46843 97025 98591 107701 80776
10839 80776 33435 -939 50980 107436 162915 242251 306928 401630 469360 490453 416913 339117
10827 339117 277257 237463 176297 107951 59360 38816 44267 27052 38084 67241 69345 41019
10815 41019 21934 3737 805 6388 13920 41817 60391 49137 43918 13225 -40141 -16247
10803 -16247 9935 -14959 1210 -4191 -16418 -32758 13644 12725 -2418 23452 16216 -26112
10791 -26112 -22880 -27302 -31784 -27271 -5921 9031 -8099 -25126 19650 32653 18223 5986
10779E986K805q000q206j4165M829J4261l985J7693j9000J111J0480l706m3809
10766d3706J9740P239J4074j0795K533J5450J6100J3505k7045j671J3861J2135
10754C1420j1420l4211j4757N6675K8211j5493l9895k2178J4594L7642l2088j9185
10742b0685q10k6073M145M8189O1060j7700k4063L578j2401K732m0074k034O532
10729a7604j9680K5632M7662Q051j0435l4843k1290J5530J3788m2590j6508M6196
10717f091L8246P221j9926M599N338J3202L9092m0548k2566j1984k1522K8515
10705A3576j5613l5434K3912K7089J2894O866l0354n623J7859j5565r379j4371
10693b4143J353K600m2035P457K6184L2826j5802k4464P847K241j7539n722M3265
$$ plain form
10779 5986 8791 791 -7415 -21580 -16751 -2490 -6475 11218 -7782 -6671 3809 103 -43706
10766 -43706 -23966 -16727 -2653 -13448 -10915 4535 20635 34140 7095 5424 19285 31420
10754 31420 20000 -14211 -28968 27707 55918 40425 530 -21648 -7054 30588 -1500 -20685
10742 -20685 -21495 -47568 -43423 4766 65826 48126 24063 27641 15240 17972 -22102 -24136 -17604
10729 -17604 -37284 -11652 36010 44061 33626 -1217 -22507 -6977 6811 -35779 -52287 -6091
10717 -6091 32155 39376 19450 24049 29387 42589 81681 41133 18567 6583 -14939 13576
10705 13576 -2037 -37471 -13559 13530 26424 33290 2936 -2687 15172 -393 -9772 -24143
10693 -24143 -22790 -20190 -62225 -54768 -28584 4242 -11560 -36024 -28177 -25936 -43475 -49197 -5932
10680e932J3426J1759k3351k1285k8395o563q869P139N4503O472j3996R17k5745
10667c9920K8846L1952J9451j5330L2073j5076l7262Q238j0954k9070j8209K9314
10655a5947L8497l381l9184o866P884r917M0290J5409o1017J406Q311j0808l6682
10642g2005J5973J7910M8484J7640l4641o196j4584r888K0687o278K8158J2399
10630A7659m253M98J3781l8525k089p213J9387J2382N413j4335j3285M838p462
10617a3204j9800M535R296R878K563j6809k7243J1803L9153j663J6137l0846k7221
10604d3421J4100L1119K0397L4191L397l3724j5169j2159P672L383J6346J4926
10592D1058j657j9274J74N359Q957k2403k3515R792L0582J1086j5431j2141j1575
$$ plain form
10680 -5932 7494 19253 -4098 -25383 -53778 -60341 -69210 -62071 -7568 -1096 -15092 -14175 -39920
10667 -39920 -11074 20878 40329 24999 57072 41996 4734 12972 2018 -27052 -45261 -15947
10655 -15947 22550 19169 -20015 -26881 -18997 -28914 11376 26785 -34232 -32826 -24515 -35323 -72005
10642 -72005 -56032 -38122 10362 28002 -6639 -12835 -27419 -37307 -16620 -22898 5260 17659
10630 17659 13406 13904 27685 -10840 -12929 -20142 -755 11627 17040 2705 -10580 -5742 -13204
10617 -13204 -33004 -28469 -19173 -9295 -6732 -23541 -50784 -38981 172 -1491 14646 -16200 -43421
10604 -43421 -29321 1798 22195 56386 59783 26059 10890 -1269 6403 9786 26132 41058
10592 41058 39401 20127 20301 25660 34617 12214 -11301 -1509 29073 40159 24728 12587 1012
10579A012P839r059j5251J954P544l4665O317N8818q455P605J4755l350k3200
10566A1864o418Q327K0687j517k4682q130j2438m0208k9801L4350K1970L3649
10554G653J0886K2959n368J2832j1053j902k6715J5302J3363n523k4886j6313
10542h765L9223O1317O0004P4873R3507R2493L1468o1483j06982j07806o2177
10531A05672l1812k4339k4878l70l0524n008J2752O727k152J7704n497j769k2992
10518f486M7376J7676j7728k7273j4364j1208j2791J2192L7027o477r487k9801
10506b1344J9274K2138k685J0336l9452k91N039k6545J2391p753k630N1283K3651
10493D3412k5544j1122o094P072L4060M4091J2142j0033k5635j8402n0475O471
$$ plain form
10579 1012 8851 -208 -15459 -13505 -5961 -40626 -34309 24509 16054 23659 38414 35064 11864
10566 11864 5446 13773 34460 32943 8261 131 -12307 -52515 -82316 -47966 -25996 7653
10554 7653 18539 41498 36130 48962 37909 36007 9292 24594 37957 32434 7548 -8765
10542 -8765 30458 91775 151779 226652 320159 412652 444120 382637 275655 167849 105672
10531 105672 73860 49521 24643 24273 -6251 -11259 1493 8220 6068 23772 18275 16506 -6486
10518 -6486 40890 58566 40838 13565 -799 -12007 -24798 -12606 24421 17944 8457 -21344
10506 -21344 -2070 20068 17383 27719 -11733 -12024 -6985 -33530 -21139 -28892 -31522 19761 43412
10493 43412 17868 6746 652 7724 41784 85875 98017 87984 62349 43947 -6528 -57
10481e7M5470j050R551k2126p423k6755J7120J1836j9550j0099k3296j0982L2222
10468e139K3380k050j7178L058K6874M504J0829K99P595K2315J4337M1783J6091
10455A46698j9744J2083J386L6073K0130P6952J34276J66607K00475K67594K55058
10444A297588K64192K72116K35112J43913N1840k0265j11071j67508k32387k42840
10434A490690k93544k28557k09876j99508j77967j27883n8818L7703r549n9227
10424A63464m6382K134J6878L520k7247p2948j536M1423J2341l1283j4833J1090
10412E6621N0004J234l7130j7222J2538k7233j5880K8799J40k9401m3015j645
10400b2190L3003J3107K498j4254L4306M2306M2008L399J1482K7413j7579Q439
$$ plain form
10481 -57 45413 44363 53914 31788 24365 -2390 14730 26566 7016 -3083 -26379 -37361 -5139
10468 -5139 18241 16191 -987 2071 28945 33449 44278 44577 52172 74487 88824 130607 146698
10455 146698 126954 139037 140423 176496 196626 273578 407854 574461 774936 1042530 1297588
10444 1297588 1561780 1833896 2069008 2212921 2264761 2244496 2133425 1965917 1733530 1490690
10434 1490690 1197146 968589 758713 559205 381238 253355 194537 232240 222691 163464
10424 163464 117082 119216 136094 139614 112367 39419 37883 79306 91647 60364 45531 56621
10412 56621 106625 107859 70729 53507 66045 38812 22932 51731 51871 22470 -20545 -22190
10400 -22190 10813 23920 26418 12164 46470 88776 130784 134183 145665 173078 155499 163938
10388A63938K1918m162N940R517J4217k5994J1500l8751m4279n2628j961J0922
10376G0177j4696k7254P062k707q89K5218O532o3392k8039m737J6949J223p026
10363b1579L565J3820O0195l449q022J8723M4832k289K0153N7282K9371K4970
10351B37572O2662Q901k8355k3492j7099j7987o346J150j5593k3156j0194j8097
10339A49966j0290L4420l0993p6147l0279J2788P338j2232j3343k2545k2024K2235
10327H894L192n844R515J3028j3927l4868k1242j3531L3692K7976L2553k5481
10315A3957m0717l790J1502J1740M5731J0771j8856M830L3164j9451l0207M0492
10303E9166o144n6565k9303Q383J6377p083J604p488J7917N084J6306m9714k7171
$$ plain form
10388 163938 185856 181694 187634 197151 211368 185374 196874 158123 113844 61216 59255 70177
10376 70177 55481 28227 35289 32582 31693 56911 63443 51 -27988 -32725 -15776 -14553 -21579
10363 -21579 -18014 -4194 56001 52552 44530 63253 108085 105796 125949 183231 212602 237572
10351 237572 300234 309135 280780 257288 240189 222202 215856 217006 201413 178257 168063 149966
10339 149966 139676 174096 143103 66956 36677 49465 56803 44571 31228 8683 -13341 8894
10327 8894 12086 6242 15757 28785 14858 -20010 -41252 -54783 -21091 6885 39438 13957
10315 13957 -26760 -30550 -19048 -7308 38423 49194 30338 35168 68332 48881 18674 59166
10303 59166 53022 -3543 -32846 -24463 -8086 -15169 -13565 -21053 -3136 1948 18254 -31460 -58631
10290e8631J872K0009m377j7058j486K9770K7082n291j4463M1259o489j4330P006
10277D873k8242n428k5176M857L5683O2008p446p842N64l4317O71M6754N6241
10264A03200m684o0611j9529j5390J7555K2518m382N820M4166o939k8818j1235
10252D1671J8887K520l9990J3399L1968k3698k0291J08o8j3662J353L0447R309
10239E1953k5869M81j3742j8715K2416J7235n501J4092P215K5470l5607k1750
10227A7678J0941N863p420N878J6902J2629l3331l1026R831L2989k3137j7202
10215E95L1116j6805L3531n1657n0293N8070J3678J210j431k297L1704L94k5764
10202B2051k9792k9173L6950K7584j2074k3823K2843J4462Q311j8935M4730P405
$$ plain form
10290 -58631 -56759 -36750 -41127 -58185 -59671 -29901 -2819 -8110 -22573 18686 12197 -2133 4873
10277 4873 -23369 -28797 -53973 -49116 -13433 48575 41129 33287 33851 -466 205 46959 103200
10264 103200 98516 37905 18376 2986 20541 43059 38677 44497 88663 81724 52906 41671
10252 41671 60558 63078 23088 36487 68455 44757 24466 24574 24506 10844 12197 42644 51953
10239 51953 26084 26565 12823 -5892 16524 33759 28258 42350 49565 75035 39428 17678
10227 17678 28619 34482 27062 32940 49842 62471 29140 -1886 7945 40934 17797 595
10215 595 31711 14906 48437 -3220 -53513 4557 18235 19445 18014 15717 47421 47815 22051
10202 22051 -7741 -36914 36 27620 15546 -8277 14566 29028 37339 18404 63134 70539
10190G0539O63K5460q069j8814k1011j558O1890o651n843L3593j3129n7927k1913
10177C7230k0718q714j5230j9748K160P312r304N2158K0643m061K2671r122K8852
10164H4129j8056k0610j0391n154l8469k3355M2252L3610j8136l5351N037L1182
10152B6688O077k2662J4441J317j6013J1544n79J2385L4684Q909o261j957m894
10139F3679l9290j2785K6286p710k5580K212J424o2987R564L3899K9218L696r379
10126A2247j9087J744L2516L9380o854J498m4k4462k5206J5458j3205J4800K0418
10113D9203K6993n084k550j2283l0511m918K9866k7031k9803o090J1227J4266
10101A3285l1159J5290N5678m587k7968J9149K2665n0285l9211j1783M0412M6532
$$ plain form
10190 70539 71202 96662 88593 69779 48768 47210 109100 102449 96606 130199 117070 59143 37230
10177 37230 16512 7798 -7432 -27180 -25020 -17708 -27012 25146 45789 41728 64399 55277 84129
10164 84129 66073 45463 35072 29918 -8551 -31906 10346 43956 25820 -9531 -4494 26688
10152 26688 32765 10103 24544 25861 9848 21392 20813 33198 67882 76791 70530 68573 63679
10139 63679 24389 11604 37890 30180 4600 6812 8236 -54751 -45187 -11288 17930 21626 12247
10126 12247 -6840 -5096 27420 66800 59946 61444 61400 36938 11732 27190 13985 28785 49203
10113 49203 76196 71112 68562 56279 25768 20850 50716 23685 -6118 -12208 -981 13285
10101 13285 -17874 -2584 53094 48507 20539 39688 62353 12068 -27143 -38926 1486 48018
10089D8018o1363j5988J1520q707J0717K5303q719M130j269j3305j0071Q096J0578
10076a060p771m01R679P423N4026M2326m8833l9665L927K1378J3009l536J8524
10063F9026j4118k811k3097K977n371K480j5600p997K8259K2145j3308l2293j6542
10050f250L5691O430l4000R488J5023k4211J3516M3765M427l6431K3023J3988
10038F4459l5139J8263J0761N4161K9102p18k9310l1354J0219k1603n319j5439
10026D8083l8192p603J0288j4785j8089j393J0237K6905k0152j0271J9851k884
10014A995J4490K0691K1059O467k0246k0639J5355M837j6026l7469n617O910J3098
10001D905J6940j8839n842P66p027j6657K3583J6463m6296Q521J4408K8324L4845
$$ plain form
10089 48018 -13345 -29333 -17813 -26520 -15803 9500 781 4911 3642 -9663 -19734 -11638 -1060
10076 -1060 -8831 -9232 447 7870 61896 104222 55389 15724 19651 41029 54038 50502 69026
10063 69026 54908 52097 29000 31977 26606 29086 13486 5489 33748 55893 42585 10292 -6250
10050 -6250 29441 35871 1871 11359 26382 2171 15687 59452 63879 27448 50471 64459
10038 64459 29320 47583 58344 112505 141607 140889 111579 80225 90444 68841 63522 48083
10026 48083 9891 2288 12576 -2209 -20298 -21691 -11454 15451 -4701 -14972 4879 1995
10014 1995 16485 37176 58235 64702 44456 23817 39172 44009 27983 -9486 -15103 -8193 4905
10001 4905 21845 3006 -2836 -2070 -9097 -25754 -2171 14292 -32004 -23483 -9075 19249 54094
9988E4094K3829l5057n7085K809J3344k7916L1616K9475K7256K6994k1902Q948
9976G6405p059j8956k9101j4616K149q219N1895M1076k7412J3841J1778J1791
9964A03572L6338M9735N3491N8899K6734Q373l2905o1498p5307m5650K5789K5976
9952A73547j829k5150l6648l4757n327J938J150L1122L8835J4631j6552l7472
9940A03488J2349M965K2775l0818n1124R757O8074K7453o6004k7579K7563O175
9928A07074j8860l5401k1686L8664L4312O435o8311q3410Q707N8362K9678j364
9916E4200l7885K7910K6417l6397k1000j478j7774J1333K5135K7473k892k8089
9904B6953P008L3724K5787k2606k4600q074l092J5535O1057k482l2787O11m34
$$ plain form
9988 54094 77923 42866 -14219 -11410 1934 -25982 5634 35109 62365 89359 67457 76405
9976 76405 69346 50390 21289 6673 8822 603 52498 93574 66162 80003 91781 103572
9964 103572 139910 189645 243136 302035 328769 337142 304237 242739 167432 121782 147571 173547
9952 173547 171718 146568 109920 75163 69836 71774 72924 104046 142881 157512 140960 103488
9940 103488 115837 120802 143577 112759 61635 71392 139466 166919 100915 73336 100899 107074
9928 107074 88214 52813 31127 69791 104103 110538 42227 -41183 -32476 25886 55564 54200
9916 54200 16315 44225 70642 34245 13245 11767 -6007 5326 30461 57934 55042 26953
9904 26953 33961 67685 93472 70866 46266 38192 35100 50635 111692 109210 76423 77034 76600
9891G6600K5821J6017j1844p171j2327k1874k6655J9057M0021N0988N7352M7528
9879B53513L6888K4359J2590L4444L583j2316l0033J2105M2831M7263O1161J8365
9867E04753r581j6906k2054L1111M6816J64471K33465L44002M20573M73605L72024
9856B542279L4293k39806m57044n07425m07910l29974j81650o1023l5783k320
9846C53637M7222N1368N604k128j4012o941l45M9396J7475k9431k5902k0652n6472
9833C68819o2633J9977J832r093k8310m9715q883P5682P3077N3220m636o8080
9821C61257r9291n0417m6408k4958k7373n145L1365k2533k5805j4967M398L643
9809H3766j5040N428m450n162L5449k116j6566l2557J3478p249n065k2978n417
$$ plain form
9891 76600 102421 118438 106594 99423 87096 65222 38567 57624 97645 148633 205985 253513
9879 253513 290401 314760 327350 361794 365377 353061 323028 335133 377964 425227 486388 504753
9867 504753 495172 478266 456212 487323 534139 698610 932075 1276077 1696650 2170255 2542279
9856 2542279 2576572 2336766 1879722 1372297 964387 634413 452763 391740 355957 353637
9846 353637 400859 452227 457831 455703 441691 434750 434405 483801 501276 471845 445943 425291 368819
9833 368819 306186 326163 327995 318902 290592 240877 231994 307676 380753 433973 429337 361257
9821 361257 261966 211549 165141 140183 112810 107665 139030 116497 90692 75725 80123 83766
9809 83766 68726 74154 69704 64542 99991 97875 81309 48752 62230 54981 49916 26938 21521
9796B1521N2341L1781j2026m1252l3471J3706L1876J0046l2155R269N1269J5799
9784A18704q440l2005j2400j3882J5379J8602j3351J0641L78k0512o729R115L0676
9771I6176j0331J1359J6271K0772o790j0835j3943J5018K455K1958j0647l5518
9759I5945J6988L445n309j5790J6944j6894j0731k8011k1565K0625M0989m624
9747I2012j6373J1017K7566M8181j7219j5887J9085k3688n0599K5590L1197j994
9735A28888k0623o7110j2289M0296J0947Q12J6822K8285j6562K7186J5004k4822
9723A26834n1704J0914J1177M978p479j412J2451N0371m770N584M6429L8887L6591
9710B78851L2699O4989K5217R41J584l9943j7278n3405o8392L584o156k2889M941
$$ plain form
9796 21521 73862 105643 93617 52365 18894 32600 64476 74522 42367 51636 102905 118704
9784 118704 110264 78259 65859 51977 67356 85958 72607 83248 83626 63114 56385 65500 96176
9771 96176 85845 97204 113475 134247 127457 116622 102679 117697 120152 142110 131463 95945
9759 95945 112933 116378 111069 95279 112223 95329 84598 56587 35022 55647 96636 92012
9747 92012 75639 86656 114222 162403 145184 129297 148382 124694 74095 99685 130882 128888
9735 128888 108265 41155 28866 69162 80109 80921 97743 126028 109466 136652 151656 126834
9723 126834 75130 86044 97221 102199 94720 93308 105759 156130 151360 156944 203373 242260 278851
9710 278851 311550 376539 401756 402697 404281 364338 347060 293655 225263 228847 222691 199802 204743
9697B04743k922n2864p4507j6341L7260J4359K5257j7716m8259k8501j0749L0214
9685E9974O188j7181r888j007K7373L0791l0695j3337O174L9993O277r520j0108
9672H5034J673m109j0356l0637j3732M1787K0948J9520M0748K6947J8964K1757
9660B18544K4055J2535L5600K6984N6800L162r426j4682r150J8188L68m2459l2988
9647B87531n0623p2774p8211l2734M6533M2295R85k1590l0744J0174j5796r666
9635G5380p23M949Q013M9373M1821J9013M406m5893l6270j8071K862K9461q688
9622A25633j3362j8665l3890P583n824l93L1336k4339l8352k2031m330O981L6474
9609D6821K736k7318K419O724J0012J7540M9746L5380m1506n0702l693K920L4178
$$ plain form
9697 204743 201821 148957 74450 58109 95369 109728 134985 117269 69010 40509 29760 59974
9685 59974 66162 48981 39093 38086 65459 96250 65555 52218 58392 98385 104662 95142 85034
9672 85034 86707 82598 72242 41605 27873 69660 90608 110128 150876 177823 196787 218544
9660 218544 242599 255134 290734 317718 374518 377680 368254 353572 344422 362610 362978 320519 287531
9647 287531 236908 164134 85923 53189 99722 142017 143002 121412 90668 100842 85046 75380
9635 75380 74657 79606 87619 136992 178813 197826 202232 156339 120069 101998 104860 134321 125633
9622 125633 112271 93606 59716 67299 61475 61082 92418 68079 29727 7696 3366 10347 46821
9609 46821 49557 22239 24658 31382 41394 58934 108680 144060 102554 51852 48159 51079 85257
9596H5257J8663k4649k4245L8455K8309R96k933Q836o152m6435P05j3241j4991
9583D8575p545K6536J8139J5908K249K495n831k6330K0105k3580m803K3381K7493
9570A16792L8435L7038N4284j1096o2848k3733R846R850l0201j4782n588l883
9558A14114J104J3435o8938M634M3790J6518k6938n7769l217J4877M1257P1j99
9545I2739j2246k4305j3350K5047l3924P734O1881n831j943M275L5700R234j9502
9532A25509l6881K1446K4446J2352j7554R603j1894k820l590K972J0218j9916
9520A13891j4797N953L6184j1360M7575J5568n8851l3571k2804k8327K6232K3953
9508I9646L3786J1616j2296L0751L3116n721l064l5543j0676l10k7173J2285K4188
$$ plain form
9596 85257 103920 79271 55026 93481 121790 122786 119853 128689 122537 76102 76807 63566 48575
9583 48575 41030 67566 85705 101613 103862 106357 100526 74196 94301 70721 65918 89299 116792
9570 116792 155227 192265 246549 235453 172605 148872 158718 168568 138367 123585 117997 114114
9558 114114 115218 128653 59715 64349 108139 124657 97719 39950 36733 51610 92867 92938 92739
9545 92739 80493 56188 42838 67885 33961 41695 103576 97745 95802 100077 135777 145011 125509
9532 125509 88628 110074 134520 146872 129318 138921 127027 124207 120617 123589 133807 113891
9520 113891 99094 105047 141231 129871 177446 193014 134163 100592 77788 49461 75693 99646
9508 99646 133432 145048 132752 163503 196619 190898 187834 152291 141615 141305 114132 126417 150605
9495A50605K5917l4115m8545J6889p682p603L0683K8521K1683R099l0726J4995
9483A69721J3504o765m5877n2272K0682n216J7093J6158k0061l0385L4007L4908
9471A45497K920k7572k921K9604R038j4714l1701K135L269j6414K0028j0709J6145
9458A24605L1069m812N169K2479K4854K8427N116l2866K351N0428q227o0861K519
9445A90251J0457Q084K5369m5756m0373j7963J2545M2578K7656k7096J0066j8735
9433A77083l4544J2335R304j4789j2765O33J995O204j8519l3045L2M0078J4711
9420A48713j6005J6449O604q569l920q44K4847M474J7989L7953J1807j7492K0314
9407B42320l7728m9333J2485M583L0113J079m091J1409m846Q18l4207j0838j2904
$$ plain form
9495 150605 176522 142407 93862 110751 103069 95466 126149 154670 176353 185452 154726 169721
9483 169721 183225 176460 130583 78311 98993 93777 110870 127028 106967 76582 110589 145497
9471 145497 148417 120845 117924 147528 156566 141852 110151 112286 115555 99141 119169 108460 124605
9458 124605 155674 150862 156031 178510 203364 231791 236907 204041 206392 256820 248593 187732 190251
9445 190251 200708 208792 234161 188405 148032 130069 142614 185192 212848 185752 195818 177083
9433 177083 142539 154874 164178 149389 136624 137257 139252 145456 126937 93892 93924 134002 148713
9420 148713 132708 149157 155761 147192 143272 142428 167275 171749 189738 227691 239498 222006 242320
9407 242320 204592 155259 167744 172327 202440 203519 199428 210837 205991 206809 172602 161764 148860
9394A48860R744K3965m924K7455R917K8904k291j4100j2267K3242k6874J459K3829
9381B36919j4033m300J6460J5766k639k7493m5265p696L4425K0263O516j4440
9369B14483l2162K848M0324J6302Q703m38R412k8235m5341L400K4945J1101M33
9356B25775j5399J5794O735J5564K9227j1500m0455j6548K2675L4079N02k5784
9344B40665K5108L2256L292J563j1999J035K1276J7867m1658j2334j5195J5713
9332B77589j7273J0317L6155N844j1041N350l5150k3107L3352J9579j3916j2357
9320B75342L7649l0841l4667M251O081J5079L582K79j8650J7609p321k0312L5025
9307B83106K8085j4534k313L4190Q429p027k2895m267j7026k2506N897R194L7097
$$ plain form
9394 148860 158604 182569 177645 205100 215017 243921 241630 227530 215263 238505 211631 213090 236919
9381 236919 222886 218586 235046 250812 248173 220680 175415 167719 202144 222407 228923 214483
9369 214483 182321 185169 225493 241795 250498 250060 259472 231237 185896 189296 214241 225342 225775
9356 225775 210376 226170 232905 248469 277696 266196 225741 209193 231868 265947 266449 240665
9344 240665 265773 298029 301321 302884 290885 291920 313196 331063 289405 277071 261876 277589
9332 277589 260316 270633 306788 312632 301591 306941 271791 248684 282036 301615 287699 275342
9320 275342 312991 282150 247483 251734 257815 272894 276476 276755 258105 275714 268393 248081 283106
9307 283106 311191 296657 294344 328534 336963 329936 307041 302774 285748 263242 269139 278333 315430
9294C15430m885l572k144K6252N272p401J4884j1033l6225o200M973j987M0695
9281C34059K0748l067j5057j1309j9238M2509K9128J3197l5973o470l3259k0544
9269B94724J4047J6243r848m203K5128M0812P1277N0206L525o639j2351j7218
9257D65703m5744r931l1599l3929K7911M6018J8068j6601M763K1325j4032J8244
9245D50196j134K0320K9920j9024M229L5324o341j0938j7541p078l743j5416J576
9232D60350j132q757k2748L1024M4719Q171m680O821R772j0763K2061L003R84
9219E38825j4773J9749K5234M2280j7946l7276P027K2438j6968l3251k7469l288
9207E04582O028P172K5539J7457K5953R862L2157k241k9952l2710o0056K5590
$$ plain form
9294 315430 310545 306973 304829 331081 336353 328952 343836 332803 296578 290378 295351 293364 334059
9281 334059 354807 351740 336683 325374 306136 348645 377773 390970 354997 348527 315268 294724
9269 294724 308771 325014 315166 310963 336091 376903 448180 498386 501911 495272 482921 465703
9257 465703 419959 410028 378429 344500 372411 418429 436497 419896 424659 445984 431952 450196
9245 450196 449062 469382 499302 480278 484507 519831 513490 502552 485011 477933 474190 458774 460350
9232 460350 459218 450461 427713 458737 503456 511627 506947 513768 523540 512777 534838 537841 538825
9219 538825 524052 543801 569035 611315 593369 556093 563120 585558 568590 535339 507870 504582
9207 504582 510610 517782 543321 560778 586731 596593 628750 626509 596557 563847 503791 529381
9195E29381M8279L3032n225Q438J2209l629J4693K3677M0434L0482K4505l154
9183G53122J1987o02K8809M6729k6947k1027l3424K0883K7953J0084o7607j3202
9171G36758J2992O678j6041r44L308p165J0065L7453N5j662J0540Q098k53J7664
9157H17546N768k417p998j6050k2678K7628L6519L2762J7511r986J9552N369N3108
9144I56634J8231j417N558k6543P506J0061l7422m105J7485L376R412P859J3169
9131I79804J6978L0637k3397j2837K2301R0556J1030j5315j0535J0700m481J8446
9119A113887K7419M6017K4614J4325J0290q09m818J2238l1917j8923J9355N6767
9107A268445J05232J2962k6808j1851j5595K5834K5002J4446Q790K5379L4653
$$ plain form
9195 529381 577660 610692 605467 613905 626114 622485 637178 660855 701289 731771 756276 753122
9183 753122 765109 764507 793316 840045 813098 792071 758647 779530 807483 817567 749960 736758
9171 736758 749750 756428 740387 739443 742751 735586 745651 783104 783159 781497 792037 800135 799882 817546
9157 817546 823314 820897 812899 796849 774171 801799 838318 871080 888591 878605 898157 903526 956634
9144 956634 974865 973448 979006 952463 959969 970030 932608 928503 945988 949364 958776 966635 979804
9131 979804 996782 1027419 1004022 991185 1013486 1104042 1115072 1099757 1089222 1099922 1095441 1113887
9119 1113887 1141306 1187323 1211937 1226262 1236552 1235743 1230925 1243163 1211246 1192323 1211678 1268445
9107 1268445 1373677 1386639 1359831 1347980 1332385 1358219 1383221 1397667 1406457 1431836 1466489
9096A466489j986J7997N6127N1979L6463M244M044O174K1097K8490M3082J3937
9084A748137m753J7172K6768J7879J9533L0203M4674J2057K2712O2727L9734J4907
9072B051750K0918K8732J5785M4391J3261L3531M7114K9371L8296M5256N6106
9061B424511M0782K9560K0969O9862N9382M972j862K2637L9715O3027M9346L1564
9049B854465N667j7188K5535M0644P6491O6827j89L4750O7731N0883L2827N1104
9037C289547L2000L8428O3851M1198N8804P6509O2972L7278P5563P0209O9924
9026C916283O8141O5534P9938J22449P2812N4305Q6082J21761J05210R2050R6423
9015D880988R8547J01284J54246J27376J02987J65528J61799J03555J38634J10279
$$ plain form
9096 1466489 1464503 1482500 1538627 1590606 1627069 1631313 1635357 1641531 1662628 1691118 1734200 1748137
9084 1748137 1743384 1760556 1787324 1805203 1824736 1854939 1899613 1911670 1934382 1997109 2036843 2051750
9072 2051750 2072668 2101400 2117185 2161576 2174837 2208368 2255482 2284853 2323149 2368405 2424511
9061 2424511 2465293 2494853 2515822 2585684 2645066 2650038 2648176 2670813 2710528 2773555 2822901 2854465
9049 2854465 2860132 2842944 2868479 2909123 2985614 3052441 3052252 3087002 3154733 3205616 3238443 3289547
9037 3289547 3321547 3359975 3423826 3465024 3523828 3600337 3663309 3700587 3776150 3846359 3916283
9026 3916283 3984424 4049958 4129896 4252345 4325157 4379462 4465544 4587305 4692515 4784565 4880988
9015 4880988 4979535 5080819 5235065 5362441 5465428 5630956 5792755 5896310 6034944 6145223
9005F145223J24681J83541J59802J71705J74587J35545J74927K23998K47040K55016
8995G996065K00226J95372K38084K68436K34039K91020L18190K84030K61617L14898
8985A0601977L09064L47198L63621M24863M13623M08365M39849M93078N14289
8976A4315927N35114O05622N80195O40782P04244P40190P78493P51448P48626
8967B0400641P37667P89720R11269R98610J066173J155139J184770J228213J301511
8958B9773713J344871J478417J604513J728349J842064J932875J995125K117033
8950D3816960K281373K422599K521349K635970K775351K963304L033908L142211
8942F5593025L254384L376947L431526L417899L415522L382378L274918L069116
$$ plain form
9005 6145223 6269904 6453445 6613247 6784952 6959539 7095084 7270011 7494009 7741049 7996065
8995 7996065 8196291 8391663 8629747 8898183 9132222 9423242 9741432 10025462 10287079 10601977
8985 10601977 10911041 11258239 11621860 12046723 12460346 12868711 13308560 13801638 14315927
8976 14315927 14851041 15456663 16036858 16677640 17381884 18122074 18900567 19652015 20400641
8967 20400641 21138308 21928028 22839297 23837907 24904080 26059219 27243989 28472202 29773713
8958 29773713 31118584 32597001 34201514 35929863 37771927 39704802 41699927 43816960
8950 43816960 46098333 48520932 51042281 53678251 56453602 59416906 62450814 65593025
8942 65593025 68847409 72224356 75655882 79073781 82489303 85871681 89146599 92215715
8934I2215715K854126K545235K214861J838333J346700Q35862L65179j44095o43636
8925A03428280j165806j651511k029495k381923k681826k954354l113764l243002
8917H4206599l329616l376206l355640l324604l252268l174307l062161k917372
8909E8414425k804829k684948k569329k438307k278915k157231k063156j990753
8901C9426957j846943j745878j654847j514816j417928j381690j281164j212719
8893B7370972j141137j096095j070078r76139r11415q60241q26293p70259p05401
8884A9013914o61059o68879o58644o06032n80663n78410n32710m56081m34931
8875A3836505m61213m40733l83874l27134l38786l69319l77002l39330l35801
$$ plain form
8934 92215715 95069841 97615076 99829937 101668270 103014970 103850832 104216011 104071916 103428280
8925 103428280 102262474 100610963 98581468 96199545 93517719 90563365 87449601 84206599
8917 84206599 80876983 77500777 74145137 70820533 67568265 64393958 61331797 58414425
8909 58414425 55609596 52924648 50355319 47917012 45638097 43480866 41417710 39426957
8901 39426957 37580014 35834136 34179289 32664473 31246545 29864855 28583691 27370972
8893 27370972 26229835 25133740 24063662 23087523 22176108 21315867 20489574 19719315 19013914
8884 19013914 18352855 17683976 17025332 16419300 15838637 15260227 14727517 14271436 13836505
8875 13836505 13375292 12934559 12550685 12223551 11884765 11515446 11138444 10799114 10463313
8866A0463313l28402k91433k77556k70677k13109k00842k08218k26599k03713
8857H242764k41191k41442k00779j93504j72415j61919j38847j60809j57811j38676
8847F435371j89552j52286j38182j34999j37735j24419q8244j21716j06050p9668
8837E162520j20451j27478r6692p0936r7765j01338m1786q6249q5279p6564p0401
8826D187581p9066n7273j12597j08755n9988m0783m7161l1042p9399j06033q6744
8815C378740m0647m7527m9521n5426n7426k7182m1648m6476o1904p5354n5939
8804B819690n523m2327p5134m3614k7052l7840m3473m4960l8585k9204l9544l4897
8792B357537n1714r3588l9920k382q325l7125j4778k7020m1942O239m2879n3623
$$ plain form
8866 10463313 10134911 9843478 9565922 9295245 9082136 8881294 8673076 8446477 8242764
8857 8242764 8001573 7760131 7559352 7365848 7193433 7031514 6892667 6731858 6574047 6435371
8847 6435371 6245819 6093533 5955351 5820352 5682617 5558198 5469954 5348238 5242188 5162520
8837 5162520 5042069 4914591 4817899 4746963 4649198 4547860 4506074 4419825 4334546 4257982 4187581
8826 4187581 4108515 4051242 3938645 3829890 3769902 3729119 3681958 3650916 3571517 3465484 3378740
8815 3378740 3338093 3290566 3241045 3185619 3128193 3101011 3059363 3012887 2950983 2875629 2819690
8804 2819690 2814167 2771840 2696706 2653092 2626040 2588200 2544727 2499767 2461182 2431978 2392434 2357537
8792 2357537 2305823 2212235 2172315 2169933 2161608 2124483 2109705 2082685 2040743 2046982 2004103 1950480
8780A950480O787j2664l2161n4119n4744k9960k4701k9918O512m4349m7486K3294
8768A656971j0310m197o751m8167k7623M901k2723k2268k1783n2500r205J1365
8756A447710j1400J558j8882l3796l5590J9571K5563r501m4553j6666j7969j9528
8744A286517O659j2787o251l5257l2601k8219J1812k3965j030M373p519J3969
8732A175701J5838j0726m788P883m2687k5540j5901j5450l3554k6067J976j4608
8720A012077k5947j7060n020J4914O708k6410k3565j3863J7513m777j2484K308
8708I24394R17l501J6354k19l341J974l2525j9476k1777J2084p083l0652K6705
8695H63854J478k6088l2457J3068J9745p3o251j3553j3822j7011J8668p580K4851
$$ plain form
8780 1950480 1957267 1944603 1912442 1858323 1803579 1773619 1748918 1719000 1725512 1681163 1633677 1656971
8768 1656971 1646661 1642464 1635713 1587546 1559923 1564824 1542101 1519833 1498050 1445550 1436345 1447710
8756 1447710 1436310 1437868 1418986 1385190 1349600 1369171 1394734 1385233 1340680 1324014 1306045 1286517
8744 1286517 1293176 1280389 1274138 1238881 1206280 1178061 1189873 1165908 1164878 1169251 1161732 1175701
8732 1175701 1191539 1180813 1176025 1183908 1141221 1115681 1099780 1084330 1050776 1024709 1026685 1012077
8720 1012077 986130 969070 964050 978964 985672 959262 935697 921834 939347 934570 922086 924394
8708 924394 925311 921810 938164 937945 934604 936578 904053 884577 862800 874884 867801 837149 863854
8695 863854 865332 839244 806787 819855 839600 839527 833276 819723 805901 788890 807558 799978 824829
8682H24829M7488m2324m0363l3937p848R459k0140r953k222J0668J4158j5063
8670G34752J5397J0058l4141j5363N618l4403k8377K6072N676p602k5556j8035
8658F34096k6355r035M9792M8579P378l122j3219Q967k355k9012k0982k5082K1569
8645F41219m88N6552k875n8301R585M9845k064k6135k0823k8350m1457P723j0291
8632E74140m1037K8241M8209L5787p975j85l2820j6654j4382J0400j5747j7139
8620E50838J2691j1309J4925M4126J3449l5966j581O756N0592K421m9146j3234
8608E84562K4801L7759N2182L1355N151J2010K491o963j0959K3986J0103L0232
8596G96710M1364M1976K4248L6248K8203K2825n224m0362j1686k0055l8160m7579
$$ plain form
8682 824829 872317 829993 789630 755693 747845 757304 737164 727211 724989 735657 749815 734752
8670 734752 750149 760207 726066 710703 716321 681918 653541 679613 685289 677687 652131 634096
8658 634096 607741 598706 648498 697077 704455 701333 688114 697081 694726 665714 644732 619650 641219
8645 641219 640731 697283 694408 636107 645692 695537 693473 667338 646515 618165 576708 584431 574140
8632 574140 533103 561344 609553 645340 637365 637180 604360 587706 573324 583724 567977 550838
8620 550838 563529 552220 567145 611271 624720 588754 587173 593929 644521 646942 597796 584562
8608 584562 609363 647122 699304 730659 735810 747820 750311 743348 732389 756375 766478 796710
8596 796710 838074 880050 904298 940546 968749 991574 986350 945988 934302 914247 876087 828508
8584H28508p5174l8376m0128m6131J709k5694j7555M018m2210p522j0567n7407
8572D73471m4999K4603K5068k6077j4764m844L2123j4570l603K0728r991j9629
8560D37516j2921n817j4156j5748M9615M528R506l4393j7623K3379q320k1964
8548C93602J6344L4190j1950j6710j5202o1761r323P915M3008L0232q059l0935
8536C71351l5106l7282J9218j4208K5852J0977j8885k3135K8585K871j2141J2450
8524C30547M722Q18K2520R252j627n27k107J1971k209j1342J2518R964j6124k7626
8510C40750L3132O211J7397k7927m6687j4510j7739k225j1774K4715L2657k1504
8498C12496M8424P3736j9322k9904k2928j224q365Q940m1146j3662P0160J14962
$$ plain form
8584 828508 753334 714958 674830 628699 630408 604714 587159 591177 548967 541445 530878 473471
8572 473471 428472 453075 478143 452066 437302 432458 464581 450011 446408 467136 457145 437516
8560 437516 424595 418778 404622 388874 438489 443017 452523 418130 400507 423886 415566 393602
8548 393602 409946 444136 432186 415476 400274 338513 329190 337105 380113 410345 402286 371351
8536 371351 336245 298963 318181 303973 329825 340802 321917 298782 327367 330238 318097 330547
8524 330547 335269 336087 358607 367859 366232 365705 363598 375569 373360 362018 374536 384500 368376 340750
8510 340750 373882 380093 397490 369563 322876 308366 290627 288402 276628 301343 334000 312496
8498 312496 360920 434656 415334 385430 362502 361278 352913 361853 320707 307045 377205 492167
8486D92167K1973n28J6807J4060O3776O3991O0188J38927K28724L07246L30028
8475A737359J48909j47566k65067l26336k59063j65758j20086q7437p9322M127
8465D39760l0917k9178J3866k5755J5028Q726Q36k6286K8263k943n5281l1219
8453C04900M3047J9878J1482J5215j8815k856J9793l9596k029k105J8215N6772
8441D23901J27359J00892Q2777P1283N0785L5661L9878J79812M24399P39930Q04492
8430C081169L27975j49531n88565p13121n69669l75721j97445j11901r1724p2674
8420E38793l9494o2262l3765k5376j3998R091J0137j1143m7802j9481k2876J1040
8408B92864l6738m614q410k3545R441M8169L3814J6688j6666J8211J8176J3635
$$ plain form
8486 492167 514140 513612 530419 544479 608255 672246 732434 871361 1100085 1407331 1737359
8475 1737359 1886268 1738702 1473635 1147299 888236 722478 602392 514955 435633 439760
8465 439760 408843 379665 393531 367776 382804 391530 392366 366080 394343 391400 336119 304900
8453 304900 347947 367825 379307 394522 375707 372851 392644 353048 351019 348914 367129 423901
8441 423901 551260 652152 734929 806212 856997 892658 932536 1112348 1536747 2276677 3081169
8430 3081169 3409144 3259613 2671048 1957927 1388258 1012537 815092 703191 611467 538793
8420 538793 499299 437037 403272 377896 363898 372989 383126 371983 324181 304700 281824 292864
8408 292864 256126 251512 243102 219557 228998 277167 310981 327669 311003 329214 347390 361025
8396C61025K6515K0502J6824K9568L3969N8754O5037J08415J84336K52216K75945
8385A433106J92123l7443k07059k72666k75371k36257j36906n1779k0809k0205
8375C66734k1950J8532p329l5229j8983k9944k4838k9928l1725k9106K5439K3655
8363B05328J1246j6258j9532O666J2924l3296m075Q0271L4054q488n2142Q212
8351B24910n502r282J6186L1836J949k0316j6548k9455K3942Q716k0469l1194
8339A74773J0112K7939j0265J744k2300N86p753j8837j321J2237L0630J2212j4834
8326A94923j5685K508J201J5333K8281l7944l3131o509K7993J9880K406k9872
8314A69384l5456M766J166J5069J2415J2148N7313J590k1973j5186q837j6896
$$ plain form
8396 361025 387540 408042 424866 454434 488403 547157 612194 720609 904945 1157161 1433106
8385 1433106 1625229 1587786 1380727 1108061 832690 596433 459527 407748 386939 366734
8375 366734 344784 363316 355987 320758 301775 271831 246993 217065 185340 156234 181673 205328
8363 205328 216574 200316 180784 187450 200374 167078 163003 243274 277328 268840 216698 224910
8351 224910 219408 210126 226312 258148 260097 239781 223233 193778 217720 226436 205967 174773
8339 174773 184885 212824 202559 204303 182003 182589 174836 155999 154678 166915 197545 209757 194923
8326 194923 179238 181746 182947 198280 226561 188617 155486 148977 176970 196850 199256 169384
8314 169384 133928 138694 139860 154929 167344 179492 236805 238395 216422 201236 192399 175503
8302A75503l2316N570j5363n066r673K4618K2603L3295q176l4191J7761L9499
8290B14064m163p4044q535N162K338J0978M069j5902m5756R989L4256r372k5974
8277I7110J7992n576j9067k6103K8750K9796P468L6466J9320j6445j6226k630
8265A50855l2539k6956r902K0397J8765P314k2323j6205n2430J7751M8786L6307
8253A39820O400l3546J0612j9841n2180k6436M5812M592k2850m684P559M4791
8241A00049Q789q337M1497M6317l3098l3417J5876r460n514o893m268L0318k5963
8228A15896l113q871k189J5121M4199J8023l9181k1675j6977j5172N0948J4478
8216A51487m1053j6019M203R304k4966L555j9583j2837K8809P750K8158L386k9636
$$ plain form
8302 175503 143187 148757 133394 128328 118655 143273 165876 199171 190995 156804 174565 214064
8290 214064 209901 135857 127322 132484 134822 145800 149869 133967 88211 98200 132456 123084 97110
8277 97110 115102 109526 90459 64356 93106 122902 130370 166836 186156 169711 153485 150855
8265 150855 118316 91360 81458 101855 120620 127934 105611 89406 36976 54727 103513 139820
8253 139820 146220 112674 123286 103445 51265 24829 70641 75233 52383 47699 55258 100049
8241 100049 108838 100501 141998 188315 155217 121800 137676 128216 122702 115809 111541 141859 115896
8228 115896 112783 103912 101723 116844 161043 179066 139885 118210 101233 86061 137009 151487
8216 151487 110434 94415 98618 107922 82956 86511 66928 54091 82900 90650 118808 122194 92558
8203I2558k1162J7814L5146l042j8636m0707J4090N3010P151j2647k9757k1863
8191G1955K2783N0443K8535j2857Q935K0122k9190l2874r205M2185J7302m9299
8179A28835l6495l9439j6385Q40O6770l286j3300j5360L1654R218J3351K8698
8167A55101L264j1304K593k1785J6028J5068R181k9692n5964O12J8410J4967k097
8154A14382j793k153j240J0925K333k5980k6320j0938J6462P445j4170m903n085
8141E8965K542K7361k0282k5249J9686n806K5991J3332k7837K4651P88l982m349
8128H5811m566K0988J467j1451k6419k709N596N1934k2399o8570k1954L0608K9918
8115F8254j189j005J3805r288l3116J298K3236N0965N159m4050O263Q204k1546
$$ plain form
8203 92558 71396 89210 124356 121314 102678 61971 76061 129071 136222 123575 93818 71955
8191 71955 94738 145181 173716 160859 169794 189916 160726 127852 118647 160832 178134 128835
8179 128835 92340 52901 36516 37356 104126 100840 87540 72180 103834 113052 126403 155101
8167 155101 158365 147061 149654 127869 143897 158965 168146 138454 82490 83102 101512 116479 114382
8154 114382 112589 110436 109196 120121 122454 96474 70154 59216 75678 83123 68953 64050 58965
8141 58965 61507 88868 68586 43337 63023 57217 83208 96540 68703 93354 94142 90160 85811
8128 85811 81245 102233 103700 92249 65830 63121 68717 120651 98252 29682 7728 38336 68254
8115 68254 67065 66060 79865 70577 37461 38759 61995 112960 118119 74069 80332 88536 66990
8102F6990L5072L3380j262p474j3091p3091m4504j1588R745L4191J9506m639J1349
8089E4584J0807o949J8322J2725J8961j0945r776k1250j1210M991M1475L7566
8077A39301M026j9393L8719J882l0599l6154j7890p900J5033J4054J6682k6573
8065I1188l6229r26K8063R643K8125K7198j2299O49J3894j6270l4812p407Q486
8052I9303L2706O375k8019m0354o1057J561M5821j515O265L5809L9974j9520j2584
8039A04765P869O413L6598j0247K1469k4443m5401O938J2835J997K797J6469k088
8026A35971j1845N642k4384P432l018j5513K8863L3557k1707l5609J8704j7842
8014A00251J1174L125J8027J008K5229J8610K2135J2766j5625Q868M6140R569
$$ plain form
8102 66990 102062 135442 134180 126706 113615 40524 -3980 -15568 -5823 28368 47874 43235 54584
8089 54584 65391 58442 76764 89489 108450 97505 87729 66479 55269 60260 101735 139301
8077 139301 143327 123934 162653 164535 133936 97782 79892 71992 87025 101079 117761 91188
8065 91188 54959 54033 82096 91739 119864 147062 134763 135412 149306 133036 98224 90817 99303
8052 99303 132009 138384 110365 70011 8954 10515 56336 54821 61086 96895 136869 117349 104765
8039 104765 112634 119047 155645 145398 166867 142424 97023 103961 116796 118793 121590 138059 135971
8026 135971 124126 129768 105384 112816 109798 94285 123148 156705 134998 99389 118093 100251
8014 100251 111425 114550 132577 133585 158814 177424 199559 212325 196700 205568 251708 261277
8002B61277l9975l4506m1751J0682K8071L9470R166O852K7251j2122k5749k0550
7990B08116j6075k0362j6397J1260O101o266k7781K4557k9364k3562k0421j7224
7978G2582N0433M7110k1332m2134p900q075j8162K8307j945k4353J4957M2374
7966A31862K5938J4940K4827J4055j6078l535L9716K5928q458j9046m4565M1303
7954B26887L6889r051j8356r667L20k7542l9497l406M35K3375j9255m0015j7954
7941A03163k442R372j5056j8998K5215K1480m482k6192r279j3589M2762M1960
7929A53914M1479j9774j305J489K0008K5118l4969k4071j9411j8795L0100P846
7917A61629K0798o469l3629j1894j2656J8049K4161k3690k9087K6070r696o035
$$ plain form
8002 261277 221302 186796 145045 155727 183798 223268 232434 239286 266537 254415 228666 208116
7990 208116 192041 171679 155282 166542 172643 166377 138596 163153 133789 110227 89806 72582
7978 72582 123015 170125 148793 106659 98759 90684 72522 100829 98884 74531 89488 131862
7966 131862 157800 172740 197567 211622 195544 192009 231725 257653 249195 230149 185584 226887
7954 226887 263776 254725 236369 226702 227022 199480 159983 156577 157012 180387 161132 121117 103163
7941 103163 100721 110093 95037 76039 101254 122734 118252 92060 82781 69192 111954 153914
7929 153914 195393 175619 174314 175803 195811 220929 185960 161889 142478 123683 153783 161629
7917 161629 182427 175958 142329 130435 117779 135828 159989 136299 107212 133282 123586 117551
7905A17551J1561J9071l5279p911M901l4499K574J5909K364k7949L34k427j0498
7892E5702j0433J3670L0691J42k4754j9277j070j803J2142k3693O803O039J1542
7879E5701o648l8188K3260M9833O10j3230j4240L5785M3494n044k1851n4943l0963
7866B3576J4195k1042l1112n125O179j828J8286L8286L4386L228m3908j0191l343
7853B1587J5535J6497l1544j216J9744J5864p313j1439J9001Q851j8539q389O205
7840D4844J6923k0253L6424P963m704o408m6251m0088q805R132K6685L1079L513
7827E0054k274K8248K661l7084o47J5429j5981j7657L0374O091J8995n507m315
7814F8387m272l8969k7282O770K1640O742J8570J46j1177r530K0376j3247L229
$$ plain form
7905 117551 129112 148183 112904 104993 109894 75395 77969 93878 96242 68293 68627 66200 55702
7892 55702 45269 58939 89630 89772 65018 45741 44671 42868 55010 31317 38120 44159 55701
7879 55701 49053 10865 34125 83958 84568 71338 57098 92883 136377 131333 109482 54539 23576
7866 23576 37771 16729 -14383 -19508 -13329 -15157 3129 41415 75801 79029 35121 24930 21587
7853 21587 37122 53619 22075 20859 40603 56467 49154 37715 56716 65567 47028 38639 44844
7840 44844 61767 41514 77938 85901 81197 74789 28538 -11550 -20355 -11223 15462 46541 50054
7827 50054 47780 76028 78689 41605 40958 56387 40406 22749 53123 59214 78209 72702 68387
7814 68387 64115 25146 -2136 4634 26274 33016 51586 51732 40555 31025 51401 38154 41383
7801D1383L499n956J3600l1392k740j2300K07N014J7760l8174k358K8687L1327
7788D8557j4435j2401M344k372M808K0546k786K6741L5115P636l9009l6911q125
7775C1708l9307l322K2041k379l890m1914J7752M3712J8922O630k629k4952n28
7762B1844K2522R104k3386m8523l4914J9120L2310J1021j0147q15Q077m057O97
7749B853J8979J3894J443j097j3574k6652R98l737q48Q136J3813L4352l354k4756
7735B0450J6835O648l5056j9791N5488M564J3383k4425l1601j0457R03j0602q335
7722b1996l835K1703j0450l7880L6584j4917k1265K7222N2155J0168k3959n475
7710H055M0186M305o819j5109l3856k2650k405K1191k1486p558j0461J2013R934
$$ plain form
7801 41383 44882 38926 52526 21134 18394 6094 6301 11315 29075 -9099 -11457 17230 48557
7788 48557 34122 21721 26065 23693 28501 49047 46261 73002 108117 115753 76744 39833 31708
7775 31708 -7599 -10921 11120 8741 4851 -37063 -19311 24401 43323 49953 47324 22372 21844
7762 21844 44366 53470 30084 -18439 -53353 -34233 -1923 9098 -1049 -1864 6213 2156 2853
7749 2853 21832 35726 37169 36072 22498 -4154 -3156 -6893 -7741 395 14208 48560 45206 20450
7735 20450 37285 43933 8877 -10914 44574 49138 62521 38096 6495 -3962 -3059 -13661 -21996
7722 -21996 -25831 -4128 -14578 -52458 -15874 -30791 -52056 -24834 27321 37489 13530 8055
7710 8055 48241 52546 45727 30618 -3238 -25888 -28293 -7102 -28588 -36146 -46607 -34594 -24660
7697b4660j8072K6169K5775j072K9763n041k291o240J1442j225j3606k1805J8249
7684A7386L275P231p657m1810j7994K3624J7138q661j1397K8001J2793k8853p528
7671a4452Q634P602L6573l3531k0437L3685r532j493K1127k4555k0710K0255k282
7658H84j0522K4039k9596L7117M2273K6225l5979j6576J6985m2220j1075J9248
7646B0803K9706J3572n327q731n908J5482J2354m859j4366Q790K2142k0918m0599
7633B2141k0461J198j9451L3357k680J0182j5751p597N3443M5335l3550m5167
7621B0999K4764k3596l0337O695K1606Q746k7054j1679J3506r517l3847k0851
7609f0565M1676J7361J0799J2295J0884R784j3630J3289K1453Q788o343m4459
$$ plain form
7697 -24660 -42732 -16563 9212 8140 37903 32862 30571 24331 35773 34548 20942 -863 17386
7684 17386 20661 27892 20235 -21575 -39569 -15945 1193 -7468 -18865 9136 21929 -6924 -14452
7671 -14452 -5818 1784 38357 4826 -15611 18074 8542 7049 28176 3621 -17089 3166 884
7658 884 -9638 14401 -15195 21922 64195 90420 54441 37865 54850 12630 1555 20803
7646 20803 50509 64081 58754 50023 44115 59597 71951 67092 52726 61516 83658 62740 22141
7633 22141 1680 2878 -16573 16784 14104 24286 8535 938 54381 99716 66166 20999
7621 20999 45763 22167 -8170 -1475 20131 28877 1823 -9856 3650 -5867 -39714 -60565
7609 -60565 -18889 -1528 9271 21566 32450 42234 28604 41893 63346 72134 65791 21332
7597B1332l9386J5607J4552K7629l7732q091K0495j693l452L5730j6745o1440
7585c3194j3395K8462p090J8564L0397M616r243k2238P912J5472P850k9329j5882
7572a7098L0075J9566k3343M216j4521j3356K8071J9518j977J5199M7447k4059
7560F9738k2457l8447k3629l43j4666K0390M4132l9378j3767K6431K3734j4007
7548A7731K4162J6499n674n7253m0965K5420o150k6074p760L0467J2825K5234
7536H462L9302j5714l9697l7014M1284L5427p402N214l4295P11j5936J2060L9003
7523C1405j2574n2571j5791J8314K3593j9288N773m181M1754k8339l7454j2384
7511f1743K2717L401n1492j2095N6260N4072J357O937l0422k655j3052J4165k6927
$$ plain form
7597 21332 -18054 -2447 12105 39734 2002 -6089 14406 12713 9261 44991 28246 -33194
7585 -33194 -46589 -18127 -25217 -6653 23744 28360 19117 -3121 4791 20263 28113 -1216 -17098
7572 -17098 12977 32543 9200 13416 -1105 -14461 13610 33128 31151 46350 93797 69738
7560 69738 47281 8834 -14795 -15138 -29804 -9414 34718 -4660 -18427 8004 31738 17731
7548 17731 41893 58392 52718 -4535 -45500 -20080 -26230 -52304 -60064 -29597 -16772 8462
7536 8462 47764 32050 -7647 -44661 -3377 32050 24648 29862 -4433 -3722 -19658 -7598 31405
7523 31405 18831 -33740 -49531 -31217 -7624 -26912 -21139 -25320 16434 -11905 -49359 -61743
7511 -61743 -39026 -35625 -87117 -99212 -42952 11120 12477 19414 -11008 -13663 -26715 -12550 -39477
7498c9477L427L7486Q566k355o84P064R05o18N707l7835j0749P488Q461J5031
7484B417J6240J6440M7155k1971k6492j0266K8638k0906k1621j0222j921P195
7472D686J5090N934J2485n379j0345l5668m153q146R157p253J1641J7297k5107
7459a9761N318J2566n192J1482L757o577P625J0369J4175k7339J2596K616o134
7446A5501k3481O373J4165p946m6911M596k6710k8375O373J8580J4452J8807K2929
7433a1647J5420L7041O556J4434l9758n243K5436m468m841J2885J3366j2164j6711
7420C0306j8383J6528k3262l13j5974j2726K3409N825M6744K1843j1349p747j7445
7407C7456j0092j0340k2656M277L6089j0013L895J8762k5574p063j7005m256R338
$$ plain form
7498 -39477 -36050 1436 10002 7647 6963 14027 14932 14314 20021 -17814 -28563 -21075 -12614 2417
7484 2417 18657 35097 82252 60281 33789 23523 52161 31255 9634 -588 -2509 4686
7472 4686 19776 25710 38195 32816 22471 -13197 -17350 -25496 -16339 -23592 -11951 5346 -19761
7459 -19761 -14443 -1877 -7069 4413 8170 1593 9218 19587 33762 6423 19019 21635 15501
7446 15501 -7980 -1607 12558 4612 -42299 -37703 -64413 -92788 -86415 -67835 -53383 -34576 -11647
7433 -11647 3773 40814 47370 61804 22046 16803 42239 37771 32930 45815 59181 47017 30306
7420 30306 11923 28451 5189 4876 -11098 -23824 -415 5410 52154 73997 62648 54901 37456
7407 37456 27364 17024 -5632 -1355 34734 24721 28616 47378 21804 14741 -2264 -6520 2818
7394B818j2925R993K1357n063k097L4697J739l6569l2353j2593J5278L2318K3238
7381C9838k6371k4767O464K2894P471j5040l4524K8668J7864K4464l981O510J0673
7368F0163N576l570K2441m4384m1544q082k6079O072j1754j8766n8530K5176M8514
7355d4767K4899L4481J4723n4048j6680p951K7312M5181K2025J8023J852k5933
7343C9117j2285j3185j2388Q660R273M788L1799j8010k4116j4740J0811K5187
7331C4911r723k7530l4670K7787N729o415q106r866k2993Q51Q150K8331K3097
7318I553J7864L238n7295j9511L2957J2064l7481K4152M4545k5849j7401R840
7306c324o100k5780Q943j5088m687k7062k3743L1431L8323J7961K0679M5189k0613
$$ plain form
7394 2818 -10107 -114 21243 16180 14083 48780 50519 13950 -18403 -30996 -15718 16600 39838
7381 39838 13467 -11300 -4836 18058 25529 10489 -24035 4633 22497 46961 42980 49490 60163
7368 60163 65739 62169 84610 40226 -1318 -9400 -35479 -29407 -41161 -59927 -118457 -93281 -44767
7355 -44767 -19868 14613 29336 -24712 -41392 -49343 -22031 23150 45175 63198 65050 39117
7343 39117 26832 13647 1259 9919 19192 23980 55779 37769 13653 -1087 9724 34911
7331 34911 25188 -2342 -37012 -9225 -3496 -9911 -18017 -27883 -50876 -50025 -41875 -13544 9553
7318 9553 27417 30655 -26640 -46151 -13194 -1130 -38611 -14459 30086 4237 -13164 -3324
7306 -3324 -9424 -35204 -26261 -41349 -46036 -73098 -96841 -65410 -27087 -9126 11553 56742 36129
7293C6129J7877m639m6047r756K7485N60j4567j4675k8823j5252k3284P099M820
7280f3073M034m8696L0072M4374j0963K764N7275N5644J5156m4291n3823j5269
7268b6796L4138L0579J3304l0679l7175k9168m6078J7391K8160J0487Q562j2595
7256c9870l2070j1087L1985n794K172L2478L2810N949j968K3041j228m3354j5421
7243b2357q597k6424l8339j773k5311M7895N0701j4178P011Q555J2793P0924Q707
7230F9607l3312k2435j9802J9186L8288J5840l3441J1181L391p1704l5834N3352
7218e683O067j4938K2842J8974L667l1490k1757k7612j3603L0728K5832l4150
7206d1123M0799N2829L2709j6447l4326j6090k0080k6693P415K817K7826L8612
$$ plain form
7293 36129 54006 49367 3320 -6436 21049 21609 7042 -7633 -36456 -51708 -74992 -67893 -63073
7280 -63073 -59039 -107735 -77663 -33289 -44252 -41488 15787 71431 86587 42296 -11527 -26796
7268 -26796 7342 37921 51225 20546 -16629 -45797 -91875 -74484 -46324 -35837 -27275 -39870
7256 -39870 -71940 -83027 -51042 -56836 -54664 -22186 10624 16573 14605 37646 36418 -6936 -22357
7243 -22357 -30954 -57378 -95717 -97490 -122801 -74906 -24205 -38383 -31372 -22817 -10024 60900 69607
7230 69607 36295 13860 -5942 13244 51532 67372 33931 45112 48503 -23201 -59035 -5683
7218 -5683 384 -14554 8288 27262 30929 -561 -22318 -49930 -63533 -32805 -6973 -41123
7206 -41123 -324 52505 85214 68767 34441 18351 -1729 -28422 -21007 -18190 9636 48248
7194D8248p5k8300j9253m735J0874j2268M0004Q869k9544N727k3036l2647K9152
7181f984o349j7928L6683M1502J5405k7276j0870k5453n263N1661o8461m6599
7169f9932K0615L3200M1088j1093k4181K0354K5641M4844J7024M470l3132l4850
7157C4048l4811p768j7333k1529m338k4862L3852K8684k2422j2078Q217k2146
7145f2486L786J5070N4322K0915m856K010k8115m1528J2003j10K0707m727l860
7132a6869J7635j3473r249L0895K4525m2136k0051K5583P146j3629m4038K095
7120e1566K7593l189n214p044j6609O044K2357q381j7110n486R951K3748K7170
7107B264J7144l3915m0799K9776L7103m0823j0118j3823m924K3872K9116J2900
$$ plain form
7194 48248 48173 19873 620 -4115 6759 -5509 34495 43364 13820 19547 -3489 -36136 -6984
7181 -6984 -13333 -31261 5422 46924 62329 35053 24183 -1270 -6533 45128 -23333 -69932
7169 -69932 -49317 -16117 24971 13878 -10303 10051 35692 80536 97560 102030 68898 34048
7157 34048 -763 -8531 -25864 -47393 -51731 -76593 -42741 -14057 -36479 -48557 -40340 -62486
7145 -62486 -58700 -43630 10692 31607 26751 28761 646 -40882 -28879 -28989 -8282 -13009 -16869
7132 -16869 766 -12707 -21956 8939 33464 -8672 -28723 -3140 4006 -9623 -53661 -51566
7120 -51566 -23973 -27162 -32376 -39420 -56029 -49985 -27628 -36009 -53119 -58605 -48654 -24906 2264
7107 2264 19408 -14507 -55306 -25530 11573 -29250 -39368 -53191 -58115 -34243 -5127 7773
7095G773P380j8730J7480M1335j722k4465m0454J0350J6005l7919K763J3476K5097
7082A8369j5838P809K0210l7972l0306m87N452J1201n214l2364N2993L0818j812
7069B2859p39L2609K8831k879p618o2200K5394L1760n7966k7536J067j01r407
7056b5926K9391J5948k49l2135l7563K2327M4783k8942l3837j772J5576K7250
$$ plain form
7095 7773 15153 -3577 13903 55238 53516 29051 -11403 -1053 14952 -22967 -20204 -6728 18369
7082 18369 2531 10340 30550 -7422 -37728 -38215 -32763 -21562 -26776 -59140 -6147 24671 22859
7069 22859 22120 54729 83560 80681 73063 10863 36257 68017 10051 -17485 -16418 -16519 -25926
7056 -25926 3465 19413 19164 -12971 -50534 -28207 16576 -12366 -46203 -47975 -32399 -5149
$$ [...]
##END NTUPLES=NMR SPECTRUM
##END=
