##TITLE=Analysis number 329375
Compound Code cc 53026
Book Reference 407/167/1
Project Code adrs
Chemist Name andyw
##JCAMPDX= 6.0         $$ Bruker NMR JCAMP-DX V2.0
##DATA TYPE= NMR SPECTRUM
##DATA CLASS= NTUPLES
##ORIGIN= Bruker BioSpin GmbH
##OWNER= nmr
$$ XWIN-NMR		Version 3.5
$$ Thu Aug 23 16:01:41 2007 GMT Daylight Time (UT+1h)  MAYBRIDGE\nmr@NMR_250MHZ
##.OBSERVE FREQUENCY= 250.131544655141
##.OBSERVE NUCLEUS= ^1H
##.ACQUISITION MODE= SIMULTANEOUS (DQD)
##.ACQUISITION SCHEME= undefined
##.AVERAGES= 16
##.DIGITISER RES= 18
##SPECTROMETER/DATA SYSTEM= dpx250
##.PULSE SEQUENCE= zg30
##.SOLVENT NAME= CDCl3
##.SHIFT REFERENCE= (INTERNAL, CDCl3, 0, 16.4489)
##AUDIT TRAIL= $$ (NUMBER, WHEN, WHO, WHERE, WHAT)
$$ ##TITLE= Audit trail, XWIN-NMR		Version 3.5
$$ ##JCAMPDX= 5.01
$$ ##ORIGIN= Bruker BioSpin GmbH
$$ ##OWNER= nmr
$$ C:\u/data/dgb/nmr/ADRS/1070/pdata/1/auditp.txt
$$ ##AUDIT TRAIL=  $$ (NUMBER, WHEN, WHO, WHERE, WHAT)
(   1,<2007-08-23 16:00:37.36 +100>,<MAYBRIDGE\nmr>,<NMR_250MHZ>,
      <created by zg, POWCHK disabled, PULCHK disabled
       configuration hash MD5:
       76 6E 9A 78 1E 09 19 81 EC 84 63 8F B0 6A 59 2D
       data hash MD5: 64K
       B4 E9 66 83 1F 29 EF 04 F7 44 38 FB 1E 10 7D 87>)
(   2,<2007-08-23 16:01:05.67 +100>,<MAYBRIDGE\nmr>,<NMR_250MHZ>,
      <Start of raw data processing
       ef LB = 0.3 FT_mod = 6 PKNL = 1 SI = 32K 
       data hash MD5: 32K
       EB A4 1A 2C AB AC 03 7A 89 6D 67 3C 9A 4C F4 A8>)
(   3,<2007-08-23 16:01:10.92 +100>,<MAYBRIDGE\nmr>,<NMR_250MHZ>,
      <apk 
       data hash MD5: 32K
       87 DA 90 C2 79 E5 CD 66 21 08 58 69 6A F9 56 92>)
(   4,<2007-08-23 16:01:15.92 +100>,<MAYBRIDGE\nmr>,<NMR_250MHZ>,
      <abs ABSG = 5 
       data hash MD5: 32K
       56 76 2A 3A 49 64 0E 84 F6 9D 57 31 33 16 9B D6>)
$$ ##END=
$$ 
$$ hash MD5
$$ 6B 5C EF 00 5F 92 7C 07 D6 B3 C1 87 CE CF 6E B2
##$RELAX= 
##$RELAX= 
##$RELAX= 
##$RELAX= 
##$RELAX= 
##$RELAX= 
##$RELAX= 
$$ Bruker specific parameters
$$ --------------------------
##$DU= <C:\u>
##$EXPNO= 1070
##$NAME= <ADRS>
##$PROCNO= 1
##$TYPE= <nmr>
##$USER= <dgb>
##$AMP= (0..31)
100 100 100 100 100 100 100 100 100 100 100 100 100 100 100 100 100 100 
100 100 100 100 100 100 100 100 100 100 100 100 100 100 
##$AQSEQ= 0
##$AQ_mod= 3
##$AUNM= <au_zg>
##$AUTOPOS= <27 >
##$BF1= 250.13
##$BF2= 250.13
##$BF3= 250.13
##$BF4= 250.13
##$BF5= 500.13
##$BF6= 500.13
##$BF7= 500.13
##$BF8= 500.13
##$BYTORDA= 1
##$CFDGTYP= 0
##$CFRGTYP= 5
##$CHEMSTR= <none>
##$CNST= (0..31)
1 1 145 1 1 1 1 1 1 1 1 1 1 1 1 1 1 1 1 1 1 1 1 1 1 1 1 1 1 1 1 1 
##$CPDPRG= <>
##$CPDPRG1= <>
##$CPDPRG2= <>
##$CPDPRG3= <>
##$CPDPRG4= <mlev>
##$CPDPRG5= <mlev>
##$CPDPRG6= <mlev>
##$CPDPRG7= <mlev>
##$CPDPRG8= <mlev>
##$CPDPRGB= <>
##$CPDPRGT= <>
##$D= (0..31)
0 1 0 0 0 0 0 0 0 0.06 0 0 0 0 0 0 0.0002 0 0 0 0 0 0 0 0 0 0 0 0 0 0 
0 
##$DATE= 1187881234
##$DBL= (0..7)
120 120 120 120 120 120 120 120 
##$DBP= (0..7)
150 150 150 150 150 150 150 150 
##$DBP07= 0
##$DBPNAM0= <>
##$DBPNAM1= <>
$$ [...]
##$SUBNAM7= <"">
##$SUBNAM8= <"">
##$SUBNAM9= <"">
##$SW= 20.6930455092707
##$SWIBOX= (0..15)
0 0 3 0 0 0 0 0 0 0 0 0 0 0 0 0 
##$SW_h= 5175.983436853
##$TD= 65536
##$TD0= 1
##$TE= 297.16
##$TE2= 300
##$TE3= 300
##$TEG= 300
##$TL= (0..7)
0 120 120 120 120 120 120 120 
##$TP= (0..7)
150 150 150 150 150 150 150 150 
##$TP07= 0
##$TPNAME0= <>
##$TPNAME1= <>
##$TPNAME2= <>
##$TPNAME3= <>
##$TPNAME4= <>
##$TPNAME5= <>
##$TPNAME6= <>
##$TPNAME7= <>
##$TPOAL= (0..7)
0.5 0.5 0.5 0.5 0.5 0.5 0.5 0.5 
##$TPOFFS= (0..7)
0 0 0 0 0 0 0 0 
##$TUNHIN= 0
##$TUNHOUT= 0
##$TUNXOUT= 0
##$USERA1= <user>
##$USERA2= <user>
##$USERA3= <user>
##$USERA4= <user>
##$USERA5= <user>
##$V9= 5
##$VALIST= <valist>
##$VCLIST= <CCCCCCCCCCCCCCC>
##$VD= 0
##$VDLIST= <DDDDDDDDDDDDDDD>
##$VPLIST= <PPPPPPPPPPPPPPP>
##$VTLIST= <TTTTTTTTTTTTTTT>
##$WBST= 1024
##$WBSW= 4
##$XGAIN= (0..3)
0 0 0 0 
##$XL= 0
##$YL= 0
##$YMAX_a= 186251
##$YMIN_a= -111051
##$ZGOPTNS= <>
##$ZL1= 120
##$ZL2= 120
##$ZL3= 120
##$ZL4= 120
##$ABSF1= 16.44891
##$ABSF2= -4.244263
##$ABSG= 5
##$ABSL= 3
##$ALPHA= 0
##$AQORDER= 0
##$ASSFAC= 0
##$ASSFACI= 0
##$ASSFACX= 0
##$ASSWID= 0
##$AUNMP= <proc_1d>
##$AZFE= 0.1
##$AZFW= 0.1
##$BCFW= 0
##$BC_mod= 0
##$BYTORDP= 0
##$COROFFS= 0
##$CY= 12.5
##$DATMOD= 1
##$DC= 0
##$DFILT= <>
##$DTYPP= 0
##$F1P= 14.0000005364418
##$F2P= -0.99999901652339
##$FCOR= 0.5
##$FTSIZE= 32768
##$FT_mod= 6
##$GAMMA= 0
##$GB= 0
##$INTBC= 1
##$INTSCL= 1
##$ISEN= 128
##$LB= 0.3
##$LEV0= 0
##$LPBIN= 0
##$MAXI= 10000
##$MC2= 0
##$MEAN= 0
##$ME_mod= 0
##$MI= 0
##$NCOEF= 0
##$NC_proc= -5
##$NLEV= 6
##$NOISF1= 0
##$NOISF2= 0
##$NSP= 0
##$NTH_PI= 0
##$NZP= 0
##$OFFSET= 16.44891
##$PC= 1
##$PHC0= -39.3583
##$PHC1= 5.45052
##$PH_mod= 1
##$PKNL= yes
##$PPARMOD= 0
##$PSCAL= 4
##$PSIGN= 0
##$REVERSE= no
##$SF= 250.130018280032
##$SI= 32768
##$SIGF1= 0
##$SIGF2= 0
##$SINO= 400
##$SIOLD= 32768
##$SREGLST= <1H.CDCl3>
##$SSB= 0
##$STSI= 32768
##$STSR= 0
##$SW_p= 5175.98343685301
##$SYMM= 0
##$S_DEV= 0
##$TDeff= 65536
##$TDoff= 0
##$TI= <Analysis number 999999
Compound Code 99
Book Reference 9
Project Code 9>
##$TILT= no
##$TM1= 0
##$TM2= 0
##$TOPLEV= 0
##$USERP1= <user>
##$USERP2= <user>
##$USERP3= <user>
##$USERP4= <user>
##$USERP5= <user>
##$WDW= 1
##$XDIM= 32768
##$YMAX_p= 524917814
##$YMIN_p= -948732
$$ End of Bruker specific parameters
$$ ---------------------------------
##NTUPLES= NMR SPECTRUM
##VAR_NAME=  FREQUENCY,     SPECTRUM/REAL,   SPECTRUM/IMAG
##SYMBOL=    X,             R,               I
##VAR_TYPE=  INDEPENDENT,   DEPENDENT,       DEPENDENT
##VAR_FORM=  AFFN,          ASDF,            ASDF
##VAR_DIM=   32768,         32768,           32768
##UNITS=     HZ,            ARBITRARY UNITS, ARBITRARY UNITS
##FACTOR=    0.157963299565203, 1,           1
##FIRST=     4114.36609883571, 0,            0
##LAST=      -1061.6173380173, 0,            0
##MIN=       -1061.6173380173, -948732,      0
##MAX=       4114.36609883571, 524917814,    0
$$ Real data points
##PAGE= N=1
##DATA TABLE= (X++(R..R)), XYDATA
$$ [...]
##PAGE= N=2
##DATA TABLE= (X++(I..I)), XYDATA
25931 1628449 1431182 1252934 1065963 893054 1170639 1415016 1229184 1092237 1092172 937460
25921 937460 1146250 1112988 940494 872113 1038989 1304008 1424596 1480671 1531256 1330804
25911 1330804 1057948 1209281 1312650 1206456 965135 740972 1020870 1150917 1250824 1494248
25901 1494248 1459183 1368230 1191703 1212826 1595825 1711101 1639034 1637240 1566855 1386832 1343028
25890 1343028 1391294 1321000 1219069 1392070 1366844 1290350 1197357 1269934 1402092 1334395 1196286
25879 1196286 1578271 1487130 1712477 1885710 1694014 1578898 1692408 1345059 1134348 1245056
25869 1245056 1238486 1331359 1454086 1607087 1643229 1448282 1402865 1242313 1015211 1116558
25859 1116558 1462122 1424676 1510142 1673226 1689009 1742969 1678626 1567084 1543258 1471806 1279769
25848 1279769 1371929 1482696 1352058 1290575 1357524 1256164 1151582 952479 1080982 1549325
25838 1549325 1674519 1456880 1359213 1355985 1387048 1193373 1433136 1449970 1272456 1431345
25828 1431345 1295251 1021687 1291440 1405585 1300749 1101314 1134595 1234488 1193414 1054388
25818 1054388 1097948 1371157 1443098 1340559 1478669 1573498 1546749 1256240 1231522 1642741
25808 1642741 1719737 1753914 1317242 928497 1079355 1139876 1291123 1602064 1571096 1430637
25798 1430637 1368685 1148383 897465 784141 811985 1199333 1429495 1425123 1642677 1656515
25788 1656515 1494593 1331791 1375762 1313299 1469562 1458814 1544068 1431777 1384918 1472035
25778 1472035 1465500 1285509 1128772 1120500 1291199 1512207 1499704 1472639 1372722 1354679 1393756
25767 1393756 1220757 1238598 1315188 1165789 1104714 1085160 1366763 1433076 1175969 1135564
25757 1135564 1188555 1269356 1233505 1007273 1018804 855986 811901 945593 1024176 1022019 988570
25746 988570 964828 867014 938726 769101 1003421 1186668 1215863 1017244 1026388 1141196 1220226
25735 1220226 1289321 1223312 1069889 901002 887571 1335473 1451078 1242157 1004599 1018222
25725 1018222 1204119 1072152 988564 1095717 1372637 1530035 1406689 1395877 1454817 1638239
25715 1638239 1689100 1881161 1897114 1589984 1338255 1245779 1294746 1283450 1203597 1209558 1110291
25704 1110291 1155423 1320246 1523521 1666828 1987788 1814050 1393644 1224060 1300435 1442456
25694 1442456 1490476 1571520 1637793 1618944 1504884 1354017 1203721 1338289 1486282 1444496
25684 1444496 1139724 1087200 1130610 968574 1091167 1335590 1313356 1165425 1160176 1113238
25674 1113238 1291362 1286139 1090574 1018392 1171553 1248349 1208679 1165062 1120348 884521 992693
25663 992693 1340740 1303982 1181904 1319933 1351149 1167740 1431561 1596594 1665816 1646433
25653 1646433 1271109 1198963 1383310 1290076 1295119 1337914 1347173 1484908 1541447 1435011 1266955
25642 1266955 1281490 1288485 1094602 1158990 1304160 1282216 1126063 1198172 1424941 1476471 1489864
25631 1489864 1410223 1400897 1302846 1436494 1486678 1561782 1362016 1371407 1452270 1541308 1377609
25620 1377609 1326959 1085331 1090426 1022175 936839 1014224 1251451 1161240 1159838 1271899 1267172
25609 1267172 1217455 903489 616242 841455 922198 1148472 1209048 996617 1127292 1367370
25599 1367370 1320600 1239768 1260806 1203868 1037510 930433 848748 1060208 1341841 1388552
25589 1388552 1594633 1694365 1703138 1780192 1348361 1188735 1125510 1156399 1187428 1382953 1692111
25578 1692111 1598772 1416878 1275750 1428330 1556814 1591151 1443951 1380469 1679942 1800046
25568 1800046 1801386 1948047 1859066 1681041 1418007 1504680 1712336 1731682 1799525 1667175
25558 1667175 1571462 1501082 1263733 1265808 1284239 1083971 924320 1065878 996514 767461
25548 767461 697981 754514 935428 1177973 1124953 1213674 1253055 1438142 1566430 1520341 1208313
25537 1208313 1138518 1382416 1379109 1357569 1477728 1410050 1378874 1538598 1531497 1511019 1443893
25526 1443893 1582603 1490502 1376932 1440774 1367185 1307199 1234334 1594234 1874520 1754686
25516 1754686 1843689 1882966 1828590 1581518 1406844 1138976 1288927 1560499 1603266 1305322
25506 1305322 1225892 1328580 1273412 1359699 1558674 1457250 1200843 1251572 1334671 1415114
25496 1415114 1411500 1284081 1382173 1454449 1522727 1530480 1461603 1282190 1367041 1217396 978416
25485 978416 1155616 1123531 1031003 1208489 1253954 1333793 1456502 1464093 1506191 1553235 1422256
25474 1422256 1435145 1280541 1251422 1395933 1571105 1397095 1279167 1365823 1382706 1387012
25464 1387012 1351363 1331054 1326084 1177896 942868 1008696 1191637 1291393 1246675 1279342 1298427
25453 1298427 1332528 1568165 1791622 1666909 1510216 1534300 1561189 1612998 1540532 1446473
25443 1446473 1422252 1625172 1584941 1241745 1415486 1451943 1421931 1505041 1439774 1413084 1220568
25432 1220568 1583074 1599042 1798040 1825724 1716074 1543591 1301302 1085100 1178871 1458071
25422 1458071 1617720 1778969 1589253 1493393 1540718 1415149 1432707 1154528 770006 939582
25412 939582 1276521 1574894 1482556 1300473 1327390 1553082 1513038 1571793 1700754 1807807
25402 1807807 1645359 1460015 1502552 1317130 1330826 1276004 1426748 1519234 1338724 1322920
25392 1322920 1399603 1357337 1286984 1379092 1332547 1421617 1420780 1506163 1506339 1706383 1777268 1776147
25380 1776147 1728914 1542931 1295938 1364131 1333838 1321486 1030140 757593 850685 1021804
25370 1021804 1037172 1200159 1330373 1376659 1467871 1578709 1647741 1513560 1501546 1667818
25360 1667818 1785757 1683516 1557478 1641636 1735106 1518407 1530387 1785698 1681777 1530676
25350 1530676 1515702 1572086 1454207 1252044 1143780 1240138 1478847 1499676 1681172 1737674
25340 1737674 1743111 1723563 1706254 1799893 1650158 1419684 1216069 1173414 1474256 1470947 1526793
25329 1526793 1627642 1577113 1600424 1458591 1412663 1534536 1410908 1366691 1490582 1611614
25319 1611614 1666272 1565284 1377196 1286250 1181339 1236241 1254650 1227720 1190258 1297719
25309 1297719 1328288 1222460 1071885 1125082 1160893 1047096 863131 884331 1227682 1407885
25299 1407885 1348033 1485474 1583601 1649523 1590135 1607648 1465171 1357378 1325686 1459800
25289 1459800 1474312 1462309 1220456 1434726 1679068 1753495 1633645 1493086 1282340 1441553
25279 1441553 1324329 1300237 1473406 1517335 1432671 1277452 1141900 1124059 1218178 1401899
25269 1401899 1516885 1505821 1394606 1437995 1588102 1441931 1317970 1282579 1174619 1212633
25259 1212633 1417862 1538306 1135507 1060504 1140816 1314531 1336065 1176293 1292732 1472336
25249 1472336 1330225 1167560 1097841 1179230 1346524 1429994 1342209 1494153 1860572 1927658
25239 1927658 1745401 1535048 1226245 1302381 1511116 1749597 1821474 1538823 1468166 1399593
25229 1399593 1416934 1458999 1435242 1343764 1336863 1234257 1074660 1138487 1457909 1707877 1691919
25218 1691919 1870249 2125280 1826752 1577163 1633177 1651067 1625344 1608541 1319840 1275235
25208 1275235 1048638 1203332 1580758 1629012 1647323 1654175 1351788 1403402 1363805 1242960
25198 1242960 1195548 1084561 1037117 984193 1334822 1617729 1391619 1336287 1563184 1452367
25188 1452367 1554618 1694720 1612889 1639773 1484967 1392320 1345627 1388089 1373053 1222610
25178 1222610 1296411 1271403 1445176 1618384 1683424 1517527 1517084 1674714 1699626 1781241 1731884
25167 1731884 1563306 1316791 1245641 1339851 1415076 1500135 1649136 1587309 1396688 1190184
25157 1190184 1031865 1324221 1512677 1316696 1200756 1182856 1180617 1143077 1223695 1206826
25147 1206826 1219410 1324515 1452630 1401546 1583493 1803867 1804871 1711643 1465712 1226725
25137 1226725 1296443 1476365 1568006 1362139 1336707 1261808 1128751 1365209 1547460 1256286
25127 1256286 1358808 1339468 1373200 1718277 1785328 1749247 1809163 1745298 1520842 1325792
25117 1325792 1359300 1638678 1374414 1209075 1258586 1346440 1286235 1402223 1411120 1350482 1647626
25106 1647626 1801487 1906149 1883379 1615170 1503410 1692084 1645037 1474794 1237857 1188259
25096 1188259 1044026 870580 895319 830060 1096299 1233998 1356845 1434582 1562241 1605392
25086 1605392 1629604 1580717 1527663 1468528 1467789 1533798 1608970 1573670 1526070 1645928 1792924
25075 1792924 1602615 1452445 1348636 1443975 1537658 1615614 1474774 1534138 1419577 1064591
25065 1064591 1004199 1041794 1418215 1551679 1575455 1515001 1740056 1789576 1803693 1561990
25055 1561990 1364035 1482982 1354883 1309302 1532746 1694221 1563468 1390471 1337835 1412950
25045 1412950 1372131 1278959 1291362 1131995 1095702 1261907 1305629 1186407 971618 914021
25035 914021 910555 1149197 1392093 1342212 1076365 1216691 1178998 936293 921757 1222177
25025 1222177 1365748 1466073 1574924 1544207 1262983 1352519 1406216 1259689 1287903 1379087
25015 1379087 1279518 1279604 1287262 1354781 1488686 1267631 1452677 1483209 1397758 1305375 1308113 1374725
25003 1374725 1244114 1211962 1168643 1188264 1193903 1093755 1158176 1559721 1639054 1466220 1361674
24992 1361674 1209257 1178664 1432935 1704989 1921512 1763430 1569115 1583452 1692405 1672836
24982 1672836 1328127 1095525 912402 1039507 1210208 1248497 1316913 1486516 1609087 1611962
24972 1611962 1453909 1337037 1481553 1488940 1378233 1585806 1633199 1439402 1530200 1257555
24962 1257555 1325135 1433913 1301689 1413512 1489495 1413050 1277292 1489244 1537333 1485240
24952 1485240 1751124 1786401 1764401 1607630 1593236 1601701 1466785 1381043 1550111 1425305
24942 1425305 1345924 1350852 1365071 1510939 1627330 1528181 1368460 1246824 1168342 1130779 1269029
24931 1269029 1771665 1820624 1638541 1412947 1464003 1468383 1212981 1087599 1143396 1171846
24921 1171846 1137118 1153683 951724 894815 1241288 1438955 1409699 1476330 1518813 1350918
24911 1350918 1395216 1624774 1615013 1489972 1562430 1593824 1391936 1376345 1484855 1508728 1387114
24900 1387114 1336593 1482423 1441538 1319475 1451245 1624196 1715192 1886466 1749750 1596886
24890 1596886 1568064 1379981 1340869 1326911 996065 1206837 1476113 1590508 1385096 1393525
24880 1393525 1534851 1590892 1449247 1638343 1579365 1468486 1467849 1260642 1204380 1214218 1389468
24869 1389468 1304930 1235465 1383712 1461103 1271184 1260622 1371918 1620441 1741400 1732463
24859 1732463 1875421 1923400 1817595 1629834 1474600 1587726 1629300 1457111 1211274 1131386
24849 1131386 1512491 1755766 1398959 1249937 1261768 1125924 1118775 1053755 1236101 1215185
24839 1215185 1147560 1242935 1353544 1478751 1701698 1850747 1714257 1562906 1755192 1709940
24829 1709940 1564014 1570274 1504820 1508023 1561846 1704964 1699429 1627163 1568457 1263639 1184293
24818 1184293 1091977 786001 1083285 1474632 1687653 1596952 1477501 1806221 1867566 1575894
24808 1575894 1565880 1759837 1790734 1846761 1716579 1694725 1774599 1676253 1558794 1317645
24798 1317645 1122358 1320101 1373608 1486873 1540733 1572491 1891749 1801836 1585842 1367581
24788 1367581 1345171 1495327 1599439 1887810 1803249 1351220 1403589 1630292 1641353 1606062
24778 1606062 1400974 1513659 1604279 1455185 1434780 1597373 1693828 1728382 1423679 1201234
24768 1201234 980293 972042 1237567 1257878 1408302 1458468 1443449 1733148 1816749 1746586 1744873
24757 1744873 1446455 1079796 1320062 1692252 1635522 1494636 1733611 1837310 1793976 1776663
24747 1776663 1528909 1579124 1448759 1244502 1390707 1528473 1302813 1446585 1624511 1912590
24737 1912590 1824666 1905225 2015621 1941280 1725584 1571689 1574007 1538332 1326736 1272265 1626873
24726 1626873 1887624 1910350 1909397 1648464 1316015 1320945 1714350 2140308 2039317 1816147
24716 1816147 1692639 1622640 1427112 1307196 1198491 1372006 1400228 1447619 1220811 1122715
24706 1122715 1128073 1186337 1210320 1317396 1378938 1654501 1846595 1957535 1790383 1524599
24696 1524599 1474480 1650765 1559512 1332921 1192080 1352075 1500159 1570233 1671363 1486254
24686 1486254 1402056 1704765 1480233 1451185 1539299 1534475 1402318 1431705 1484304 1565636 1728542
24675 1728542 1686416 1406110 1214176 1341881 1514427 1534269 1569868 1416234 1324553 1151043
24665 1151043 997734 1098668 1329673 1316633 1210579 1131865 1178565 1439844 1617354 1641266
24655 1641266 1589595 1538942 1506155 1578124 1409424 1484483 1469201 1242716 1267613 1382932 1383779
24644 1383779 1517793 1567772 1779739 1765759 1510838 1447544 1499270 1493921 1287636 1115579
24634 1115579 1323121 1380203 1281757 1358134 1454996 1563792 1628466 1701772 1842818 1775214 1987110
24623 1987110 1853951 1303145 1394711 1473742 1656207 1717490 1810955 1634482 1701778 1876066
24613 1876066 1782165 1599275 1570624 1290493 1389696 1621632 1755697 1941599 1846920 1698926
24603 1698926 1603272 1667453 1725134 1645802 1704374 1840867 1559156 1307134 1209728 1321602
24593 1321602 1395515 1147247 1242570 1379428 1258614 1265600 1353527 1487103 1390157 1451915 1534227
24582 1534227 1659296 1550662 1567035 1596610 1568934 1625743 1656585 1900186 1929291 1761114
24572 1761114 1713472 1496516 1408665 1357593 1301221 1281192 1369040 1571855 1559344 1635578 1850976
24561 1850976 1624341 1369023 1282718 1132162 1072250 1305733 1477333 1613319 1709328 1610063
24551 1610063 1487812 1528224 1488531 1519746 1661305 1685232 1680908 1537375 1635739 1703716 1580772
24540 1580772 1547916 1506093 1295274 1366143 1612848 1674184 1631324 1381675 1229741 1402299
24530 1402299 1705493 1823195 1588649 1222631 1296726 1359565 1361827 1546245 1556410 1414997
24520 1414997 1384281 1467720 1553622 1428434 1409461 1457394 1648767 1693415 1782405 1783673 1843351
24509 1843351 1864391 1615369 1432917 1204234 1241438 1241918 1166686 1116138 1507850 1738066 1704532
24498 1704532 1621299 1691681 1857078 1838343 1666809 1621223 1789551 1892545 1871034 1772518
24488 1772518 1810219 1720289 1618049 1810393 1818507 1654956 1426062 1390333 1246368 1308355
24478 1308355 1540761 1490802 1404653 1629362 1665522 1731779 1864117 1718179 1698276 1883130
24468 1883130 1723253 1712911 1451352 1216055 1308604 1554057 1678242 1936548 1869674 1907353
24458 1907353 1693232 1478689 1411071 1606727 1369048 1075990 1200237 1454330 1626504 1400602
24448 1400602 1422876 1571974 1698245 1656463 1210805 1085337 1249517 1367716 1448720 1313604
24438 1313604 1376976 1372493 1480017 1650450 1597860 1489496 1649813 1694914 1522717 1446851
24428 1446851 1538221 1604592 1822736 1726581 1603893 1493107 1402312 1091912 1039914 1153384
24418 1153384 1157389 1045640 1318331 1551084 1315562 1669922 1812474 1890970 1798797 1510066
24408 1510066 1427550 1412259 1325289 1189663 1273623 1322577 1464526 1401078 1436381 1606876 1718520
24397 1718520 1839186 1740279 1576460 1221047 849186 998717 1142825 1026877 964107 1249933
24387 1249933 1473285 1629275 1628684 1558876 1491070 1499933 1655459 1694552 1604741 1581404 1476984
24376 1476984 1600809 1317190 1301618 1457854 1657250 1643354 1568932 1428626 1146838 1139568
24366 1139568 1264220 1371786 1514508 1581939 1582542 1539446 1516707 1877886 2277932 2039617
24356 2039617 1969353 1914443 1758357 1860178 1785502 1530694 1455159 1532782 1686827 1856157
24346 1856157 1858669 1956603 2022278 1774212 1763438 1862036 1870509 1739083 1472660 1480410 1412333
24335 1412333 1406314 1471006 1236724 1081873 1052024 1186006 1211954 1234916 1442651 1388199 1568952
24324 1568952 1714423 1574625 1503534 1620908 1862017 1889813 1699485 1471733 1587577 1503543
24314 1503543 1429635 1434663 1531820 1524591 1600675 1552644 1721878 1616646 1250499 1045251 1212781
24303 1212781 1184084 1043164 1252021 1352198 1349179 1470841 1790913 1913048 1648912 1460017
24293 1460017 1473374 1814663 1845023 1572711 1443993 1506170 1533918 1386526 1359997 1477667
24283 1477667 1538756 1581295 1580068 1602068 1821518 2008524 1857957 1623969 1385523 1457337
24273 1457337 1268884 1369706 1525206 1474851 1520397 1611099 1727015 1410817 1150452 1339777
24263 1339777 1415107 1463960 1485704 1273322 1261208 1354940 1611364 1590794 1441262 1691522
24253 1691522 1547912 1631206 1395052 1319357 1397797 1355520 1261394 1338468 1243909 1407572 1634630
24242 1634630 1707335 1502336 1395823 1528754 1458061 1416717 1473593 1521315 1453785 1721535
24232 1721535 1690000 1687597 1545980 1464125 1471296 1381527 1191156 1245508 1301389 1195546 1107618
24221 1107618 1238948 1198279 1016413 1005391 1204542 1201537 854423 762869 947766 1283104
24211 1283104 1638063 1720460 1636001 1446350 1517869 1706733 1840440 1629533 1601637 1706171
24201 1706171 1836436 1780718 1702131 1513818 1245514 1095670 1253638 1280425 1477179 1382750
24191 1382750 1509228 1800598 1866818 1876319 1810460 1898386 1561459 1383063 1495152 1761498
24181 1761498 1885114 1952031 1908208 1967065 2025646 1948809 1831263 1772654 1610690 1492264
24171 1492264 1419108 1487303 1490105 1654436 1810751 1868624 1937055 1841537 1758234 1959004 2073632
24160 2073632 2001456 1953627 1975438 1739941 1463682 1545263 1604666 1571754 1579147 1600933 1762507
24149 1762507 1578390 1714230 1782940 1672757 1603493 1836016 1827807 1838186 1805588 1518964
24139 1518964 1246403 1229644 1396384 1698760 1720700 1560372 1370113 1356698 1478920 1600439
24129 1600439 1666292 1802232 1810253 1730555 1879135 1879654 1838179 1775621 1793747 1892333 1803748
24118 1803748 1916543 1896817 1876684 1866080 1975431 1899661 1998445 2135653 1806202 1646506
24108 1646506 1808651 1906897 1845562 1673794 1726246 1558572 1383799 1485855 1515138 1657138
24098 1657138 1882794 1925699 2005741 2007755 2089002 2178273 2169450 2145014 2031631 1904880 1903828
24087 1903828 2129880 2203696 1855829 1530934 1550447 1626648 1487504 1765638 1773692 1548580
24077 1548580 1376045 1481099 1698372 1660071 1556184 1305240 1183505 1366510 1481350 1576809
24067 1576809 1636585 1645347 1533441 1752924 1623667 1532126 1629597 1694195 1564042 1298487
24057 1298487 1357314 1640317 1812167 1732709 1606975 1761530 1788758 1903491 1894251 1915250
24047 1915250 1787274 1458365 1249582 1098827 1140977 1102856 1280052 1528843 1587057 1484947
24037 1484947 1561069 1547647 1331200 1394352 1623106 1811181 1699143 1617196 1651484 1727595
24027 1727595 1806643 1500148 1276301 1245822 1315468 1391816 1507090 1505409 1155342 1091322 1092750
24016 1092750 1248992 1306539 1395253 1552864 1419007 1286194 1459390 1382248 1252005 1192317
24006 1192317 1248445 1162534 1166471 1184460 1151025 1257201 1453832 1462186 1513867 1534436 1521920
23995 1521920 1643219 1676909 1813749 1721137 1547203 1499875 1313646 1261129 1372300 1477312
23985 1477312 1636281 1628169 1610778 1671074 1740807 1762866 1721112 1424076 1381274 1525132 1712004
23974 1712004 1764889 1767201 1637937 1512488 1649714 1648575 1658832 1879467 1842273 1584808 1478526
23963 1478526 1415004 1701417 1710283 1551590 1459336 1602492 1340531 1169147 1250068 1475254
23953 1475254 1757313 1687289 1515063 1586720 1860474 1698357 1689870 1619280 1594161 1783155
23943 1783155 1798291 1685210 1906878 1816348 1598179 1279730 1311496 1405403 1416607 1206686
23933 1206686 1271603 1751744 1875318 1695401 1716979 1865678 1846616 1833240 1735214 1908895
23923 1908895 1642883 1600832 1814937 1719820 1770800 1843101 1851036 1817781 1895089 2005966 1807653
23912 1807653 1883645 2012867 1841609 1910045 1835738 1819521 1790094 1655326 1472126 1356605
23902 1356605 1544009 1564447 1672220 1835660 1697267 1620733 1680893 1718374 1622995 1662278
23892 1662278 1331652 1321259 1513393 1695558 1714818 1692211 1567916 1720427 1879924 2005849
23882 2005849 2158391 2344606 2041047 1920888 1674520 1385004 1440970 1707784 1882327 2126900
23872 2126900 2156936 2335867 2256957 1924905 1872619 2050762 1859325 1869677 1920085 1989512
23862 1989512 2198866 2154170 1990951 1797423 1657346 1638500 1770690 1839311 1746821 1631949
23852 1631949 1826707 2138318 2348636 2276396 2071789 1745537 1588252 1620210 1727075 1606946
23842 1606946 1515509 1588127 1795515 1869720 1775804 1694002 1636460 1808274 1941325 2051462
23832 2051462 2048605 1812921 1800424 1756150 1881694 1963236 1931026 1905757 1715567 1822275 2127949
23821 2127949 2163912 1803517 1832245 1822631 1771770 1535579 1546522 1610293 1635985 1423531 1505186
23810 1505186 1650548 1728101 1721921 1931060 2097504 2039140 2060557 1785674 1421912 1422423 1475347
23799 1475347 1592019 1594586 1535316 1504387 1775452 1689908 1824415 1861221 1785705 1738939 1618628
23788 1618628 1638905 1679081 1891259 1862790 1722214 1549016 1482951 1428165 1569708 1794880
23778 1794880 1912892 2027407 1835128 1896937 2005996 1775114 1394505 1440459 1627675 1662404
23768 1662404 1739227 1817323 1840593 1911857 1926638 2239346 2327491 2133773 1948340 1919970 1794846
23757 1794846 1839885 1696821 1854200 1987543 1882569 1939395 2075259 2092585 2007722 1816730
23747 1816730 1724157 1790463 1619422 1785846 1774427 1611239 1696067 1732897 1810672 1983649
23737 1983649 1991440 1930853 1742158 1796694 1871391 1884285 1945059 2130182 2371916 2340090 2050861
23726 2050861 1784678 1837861 1737206 1636104 1938881 2071350 2232434 2422996 2299704 2024447
23716 2024447 2017151 1939422 2008977 2201691 2181417 1979424 1689762 1673350 1798611 1748803 1697095
23705 1697095 1567631 1612822 1703684 1843969 1730288 1475658 1347988 1464769 1739476 1799772
23695 1799772 1899632 2062644 2134318 1890500 1738392 1659355 1596643 1834233 1927625 2122461
23685 2122461 2218858 2136856 2024154 1890025 1806047 1742698 1689025 1826851 2060256 2122051
23675 2122051 1965975 2019425 2027101 1718839 1721242 1921911 1973199 1938092 2077501 2196068 2104492
23664 2104492 1951642 2022733 1991681 1732751 1646840 1731532 1901979 2149447 2258949 2035636
23654 2035636 1845271 1795930 1671497 1655947 1585653 1648908 1519699 1402466 1444344 1475195
23644 1475195 1614008 1895012 2251287 2221138 2158956 1966540 1888904 1743642 1743444 1685988 1487694
23633 1487694 1405682 1598915 1812281 2048833 2264408 2332837 2091345 1918734 2182164 2324500
23623 2324500 2201043 2115092 2213637 2285443 2334034 2224106 2027532 1881499 1851112 1769367
23613 1769367 1974978 2069000 1992551 1957389 2036418 2082526 2093640 2040729 1765892 1694080 1645861
23602 1645861 1515503 1546046 1787593 1685032 1577228 1484389 1506494 1450518 1471665 1624756
23592 1624756 1905681 1963323 1835627 1865509 1941302 1790974 1767060 2021172 2033587 2002940
23582 2002940 1968668 1980269 1991938 1997599 2006158 2085118 2013014 1744187 1611511 1774651 1760595
23571 1760595 1724837 1857572 1811163 1783553 1737888 1771500 1871099 1697096 1706857 1688908 1526439
23560 1526439 1308598 1144977 1144614 1355243 1504363 1521875 1637654 1749258 1720099 1799112
23550 1799112 1906810 2017037 1738499 1515582 1723663 1883746 1744778 1567855 1610718 1725125
23540 1725125 1941195 1947028 1757226 1690432 1620344 1685395 1582335 1653966 1834252 1878817 1638487
23529 1638487 1732794 1813245 1808602 1865248 1810433 1774993 1826772 2045786 2095369 2078459 1860839
23518 1860839 1724351 1751071 1887302 1942515 1946130 1652905 1476534 1585643 1844037 1711522
23508 1711522 1830879 1952252 1845853 1728312 1886032 1996654 1895509 1872244 1773286 1813972
23498 1813972 1857265 1781170 1690985 1897347 1986148 1758262 1754579 1883794 2003709 2059007 2011613
23487 2011613 2031866 1860296 1675740 1899367 1992921 1907107 1865494 1809976 1847949 1899964 1844921
23476 1844921 1769718 1657964 1757738 1573989 1487865 1528924 1890982 1942563 1936156 1811968 1851292
23465 1851292 1745934 1638037 1793029 1937995 1891240 1641397 1521549 1676462 1672934 1742057
23455 1742057 1729112 1669602 1618830 1612466 1430505 1348657 1257736 1655946 2078019 2093477 2236841
23444 2236841 2194583 2186914 1985333 1685461 1724903 1986114 1905610 1912764 1927895 2163832 2113138
23433 2113138 1895544 1996032 2116653 2136754 2145084 1983936 1910060 2009953 2062284 1810917
23423 1810917 1798338 1797696 1910294 1882286 2039841 2203796 2031639 1904174 2064828 2060606 1937980
23412 1937980 2069409 2282817 2384854 2212890 2056635 2165213 2281203 2164063 2025912
23403 2025912 1886875 1817922 1976450 2164052 2040219 1962375 2004531 1868948 1901534 1817525
23393 1817525 1904522 1986955 2052083 2075872 1994021 1850957 1605963 1353283 1263975 1378288
23383 1378288 1518561 1586989 1780092 1776525 1849784 1677106 1940489 2222740 2189380 1858924
23373 1858924 1933494 1904119 1734580 1717029 1738577 1835655 1959302 1977656 2040325 2206611 2217489
23362 2217489 1982553 1617469 1638972 1852844 1746048 1757999 1922315 1869477 1575276 1634072
23352 1634072 2049791 2095468 1932382 1900302 1843749 1781348 1714040 1679173 1601659 1748580 1940356
23341 1940356 1930363 1847562 2031306 2054804 2001178 1811773 1715322 1712684 1562114 1711521 1771511
23330 1771511 1462830 1531859 1841901 1940004 1887054 2009825 1952043 2060658 2135227 2068238
23320 2068238 2111881 2100165 2017885 2070371 2319706 2386067 2241946 2129340 2011945 1837989
23310 1837989 1728533 1672286 1685149 1835694 1757738 1469706 1573169 1551408 1646690 1689273
23300 1689273 1864325 2016349 1733584 1748062 1740130 1810526 1875968 1793772 1891063 2329422 2465963
23289 2465963 2101162 2006318 1826845 1536692 1540185 1769378 2089932 1927379 1833728 1793002
23279 1793002 1825935 1833983 1920957 2031896 2072612 2116412 1949288 1964761 1842554 1588811 1553153
23268 1553153 1698012 1899308 1931472 1819667 1874289 1954785 1963594 2089236 1994988 1841724
23258 1841724 1738988 1883782 1925992 1844545 1796311 1573798 1549027 1673884 1518678 1592295
23248 1592295 1661235 1877112 1860340 1694156 1733138 1828091 1531146 1597970 1832861 1897208
23238 1897208 1847413 1823724 1855628 1846917 1853015 1933788 2111632 1936518 1784171 1779259 2040465
23227 2040465 2059367 1979093 2195632 2348456 2174851 2163654 2028984 1841681 1719873 1740204
23217 1740204 1931933 2227994 2332536 2311296 2404828 2528427 2441268 2252867 2046183 2114724
23207 2114724 1968203 1850011 2023370 2136565 1931433 1940049 1957596 1903341 1820622 1922380
23197 1922380 1944423 1826007 1744025 1797420 1903715 2015215 1993829 1889584 2110894 2310653
23187 2310653 2276252 2065763 1953522 1957791 2110230 2127398 2047548 1995656 1942097 2192339 2068631
23176 2068631 1827939 1853426 1923027 1915720 1878118 2042992 2295868 2325064 2164108 2113889 2196371
23165 2196371 2343231 2273351 1983932 2029478 2073179 1824917 1932115 2172721 2273500 2091191
23155 2091191 2181613 2204406 2220886 2411444 2556612 2342739 2386636 2472286 2415357 2236337
23145 2236337 2327397 2246523 2218224 2224209 2383882 2192846 2042964 2081039 2303144 2084423
23135 2084423 2282510 2282913 1989971 1812103 1892072 2060708 2024579 1900826 1924392 1773922
23125 1773922 1785347 1844843 2205595 2091164 2010942 2007638 2083172 2073772 1889302 1903744 1615311
23114 1615311 1524616 1849100 2042878 2262107 2224090 2152566 1871345 1964450 1950976 1754691
23104 1754691 1658646 1797135 1907167 2037539 2005281 1920118 1899944 1924347 1953207 2012573 1666270
23093 1666270 1890346 2124900 1827777 1615129 1681079 1718660 1896950 1971090 2103051 2044285
23083 2044285 1878257 1803546 1653960 1708391 1800726 1785880 1680398 1504728 1810876 2006712
23073 2006712 1995710 2020879 1982191 1888020 1956054 1911571 2083972 2097766 1887210 2048856 1974634
23062 1974634 1966174 1958748 1883162 1919825 2092356 2202826 2213567 2205216 2214451 2200038 2338473
23051 2338473 2579010 2412216 2299130 2242303 2043019 1936881 1759234 1621753 1541319 1804913
23041 1804913 1743446 1709916 1807549 1796669 1883794 1990531 1884711 1614291 1569600 1742348
23031 1742348 1897192 2184959 2150344 1844968 2163712 2280814 2023084 1761239 1796205 2063810
23021 2063810 2198309 2152568 2173188 2095895 2071286 2287580 2271968 2240027 2452363 2552919
23011 2552919 2677310 2441799 2142190 2248671 2196573 1842306 1770774 2020121 2221672 2182975
23001 2182975 2148851 2012103 2103306 2114535 1943292 2187141 2343085 2438756 2504644 2181923
22991 2181923 2038000 2037189 2091288 2183616 1999974 1963758 2227107 2132413 1975482 1833334 1761469
22980 1761469 2098775 2327858 2263411 2269463 2335303 2081460 1958671 1960371 2084372 1934113
22970 1934113 1999997 2069195 2016906 1962847 1991382 2406150 2581658 2425246 2343021 2164803
22960 2164803 1965396 1850532 1945509 1859948 1807733 1865490 1963254 2266728 2382805 2200028
22950 2200028 2244556 2163352 2109018 2239484 2139432 1953405 1848824 1821658 1855861 1909571
22940 1909571 1921982 1858213 1724186 1854631 2158703 2271415 2139668 2133425 1998113 1909902
22930 1909902 2100378 1995521 2038111 2031936 1984304 1936539 2040519 2066713 2137432 1952392 1935556
22919 1935556 2102306 1952649 2089150 2159062 2186095 2337931 2299347 2231436 2222742 2089887
22909 2089887 2042364 2081917 2067051 2046664 2035666 2047771 2148921 2248947 2335636 2085129 2054494
22898 2054494 2151257 2638633 2615478 2513921 2431287 2271648 2330753 2461441 2488194 2479846 2408228
22887 2408228 2230240 2011848 2162804 2218764 2245681 2124348 2056728 2167772 2266792 2085198
22877 2085198 2217335 2037134 1981463 2243407 2354764 2297216 1959666 1873813 2206593 2405225
22867 2405225 2283107 2115941 2073580 2225641 2289609 2227021 2179358 2036485 2031343 2036840 2164581
22856 2164581 2078589 1942516 1840262 1967329 1989942 2015877 2010816 1758183 2008620 2215116
22846 2215116 2369167 2413405 2463002 2274508 2041703 1998017 2193771 2402829 2522235 2388423
22836 2388423 2498230 2517276 2324842 2441987 2539311 2544523 2462351 2447876 2472209 2285031 2325690
22825 2325690 2359289 2422599 2353931 2208858 2317961 2411607 2644389 2539242 2304870 2235837
22815 2235837 2261293 2388248 2327803 2279376 2420949 2384326 2245171 2370899 2419169 2485678
22805 2485678 2644143 2477527 2159581 2095328 2207650 2215180 2242546 2148009 1903632 1823850
22795 1823850 2029026 2303400 2579227 2590293 2278696 2123134 2019487 2059145 2068922 2081577
22785 2081577 2277914 2343083 2288629 2383365 2180350 2065546 2123051 2117119 1994476 2023339 2098135
22774 2098135 2263936 2267614 2408915 2691272 2684290 2600127 2567684 2397076 2388897 2464498 2507128
22763 2507128 2509780 2678551 2670537 2503689 2448796 2493577 2395701 2312802 2063865 2120187 2008493
22752 2008493 2138281 2063280 1998991 2200785 2454080 2564471 2317755 1982864 1926756 1899953
22742 1899953 1888992 1919450 2100119 2051899 1882027 2030050 2355012 2490316 2575723 2545329
22732 2545329 2433990 2507727 2551450 2466852 2502466 2542234 2564826 2462956 2415805 2549721 2617183
22721 2617183 2471189 2464523 2379453 2344945 2286912 2378125 2387819 2439594 2514522 2613405 2580421
22710 2580421 2604308 2629371 2614503 2476378 2067355 1825882 2053033 2198625 2216181 2191788
22700 2191788 2171216 2124066 2025014 2177930 2218896 2427607 2251814 2051313 2173035 2384996
22690 2384996 2464460 2444573 2485407 2435409 2378986 2238938 2075483 2301035 2429844 2497859
22680 2497859 2564585 2368659 2323901 2193935 2269624 2340153 2381933 2431651 2488015 2256714 2216818
22669 2216818 2430846 2531702 2574865 2494780 2227370 1987264 2075602 2310033 2537092 2659152
22659 2659152 2640286 2602202 2333723 2071799 1842682 1970933 2308105 2321304 2212850 2281964
22649 2281964 2310674 2402765 2617177 2578919 2364265 2270447 2251833 2007523 1988713 2262113
22639 2262113 2218805 2332435 2271027 2421594 2515220 2470850 2531609 2545347 2366285 2473977
22629 2473977 2635337 2400420 2175206 2146749 1963570 1762504 1854035 2064457 2296365 2338734
22619 2338734 2303417 2533696 2577860 2239836 2155482 2281621 2402125 2567047 2483425 2656977
22609 2656977 2622771 2627339 2473643 2201267 2277108 2434645 2519873 2621130 2542479 2499582 2472804
22598 2472804 2423132 2630550 2474637 2347158 2347390 2272820 2305577 2260381 2242015 2254379 2150257
22587 2150257 2035438 2072051 2221698 2318013 2028853 1982998 2107593 2174107 2162248 2245979
22577 2245979 2253838 2128372 1951878 2101081 2072946 2067070 2215864 2313587 2385771 2229880 2182601
22566 2182601 2187159 2290657 2359966 2475050 2444113 2416756 2519692 2364747 2205293 2448545
22556 2448545 2557332 2432736 2448341 2645500 2642092 2602252 2662570 2475359 2283128 2128809
22546 2128809 1916077 1962411 2217360 2007177 1957457 2043230 2308415 2405805 2366338 2562121
22536 2562121 2745229 2510194 2260214 2125504 2179601 2013409 2071964 2115403 2190436 2137529
22526 2137529 2158807 2368659 2389165 2338601 2406467 2466617 2107084 1900679 1943060 2109248
22516 2109248 2125696 2019938 2147587 2224258 2420879 2447864 2659707 2802444 2697350 2401270
22506 2401270 2330333 2429777 2486652 2540253 2612071 2502922 2503360 2580652 2593033 2322555 2292405
22495 2292405 2289757 2074389 2298168 2373728 2423785 2523147 2075872 1816506 1886534 1904301 1984531
22484 1984531 2092178 2377181 2548473 2590129 2446507 2484670 2328310 2098845 2277168 2282185
22474 2282185 2175490 2281545 2505660 2607381 2619865 2628931 2564162 2492542 2462678 2699603
22464 2699603 2636539 2315210 2075821 2089198 2303678 2428047 2377525 2698998 2734628 2529791
22454 2529791 2536940 2584779 2592637 2622847 2720874 2793492 2857493 2860980 2694246 2662517 2696818 2657009
22442 2657009 2653700 2854442 3035153 2857242 2607775 2415306 2624741 2582513 2592536 2595957
22432 2595957 2634208 2575011 2534718 2534343 2650890 2678108 2794115 2794545 2774127 2672075 2581221
22421 2581221 2507095 2345001 2171523 2332427 2577706 2398818 2229338 2500459 2470530 2490158
22411 2490158 2514227 2455600 2368942 2427690 2536355 2905689 2832754 2655203 2765769 2759430 2773383
22400 2773383 2906600 3067502 2858171 2473567 2526515 2577747 2638280 2748190 2834278 2715713
22390 2715713 2440078 2376505 2502495 2698487 2566107 2469672 2467357 2312899 2267010 2362684
22380 2362684 2318828 2378598 2584973 2728439 2657077 2733892 2656411 2550415 2666472 2643439
22370 2643439 2696641 2808667 2753960 2766783 2527102 2354167 2054614 2073576 2374549 2706544
22360 2706544 2587320 2424843 2482728 2324487 2396098 2240881 2174687 2241858 2433218 2346707
22350 2346707 2346321 2548675 2711565 2732418 2609524 2519942 2540256 2643607 2729540 2659861 2552040
22339 2552040 2566899 2626927 2596896 2399197 2448586 2515771 2602339 2680239 2744883 2751816 2777680
22328 2777680 2695242 2626832 2543281 2470082 2321667 2141122 2116680 2269975 2305307 2267491 2499338
22317 2499338 2544735 2515715 2502172 2461827 2469306 2433529 2340362 2346945 2508296 2568055 2709379
22306 2709379 2579849 2608064 2788791 2835993 2770771 2791484 3096680 3133141 3083958 2918465
22296 2918465 2789586 2603145 2450999 2629012 2849974 2892022 2625710 2563466 2168110 2094879
22286 2094879 2308200 2444992 2574087 2691263 2842885 2740255 2461286 2550355 2568004 2739377
22276 2739377 2725701 2659178 2777925 2720621 2876511 3069098 2974847 2929152 2663049 2754555
22266 2754555 2654189 2501641 2382077 2428426 2381970 2496353 2351767 2321973 2361231 2219920
22256 2219920 2176364 2316149 2627390 2744941 2632521 2852726 2821001 2542408 2514705 2545522
22246 2545522 2603166 2799344 2986270 3002388 2995827 3065430 2911162 2851845 2871477 2703212 2752031
22235 2752031 3000725 3026448 3012824 2756418 2805148 2912731 2878816 2715090 2463262 2629700
22225 2629700 2695240 2613326 2570919 2799581 2933215 2751289 2678277 2587180 2777635 2831571
22215 2831571 2447155 2490339 2416754 2235245 2348614 2586506 2716537 2576795 2466999 2476123
22205 2476123 2692747 2790681 2781444 2666771 2570714 2498124 2607541 2660254 2627280 2983536 3295520
22194 3295520 3228234 2720379 2479658 2818519 2900691 2937062 2854014 2755872 2472003 2470972 2423010
22183 2423010 2539744 2897482 2938025 2633302 2662286 2928019 3089513 3211156 2948482 3081082
22173 3081082 3174447 2929884 2976999 3066801 3053482 2666422 2518921 2682098 2623434 2600245
22163 2600245 2875376 2944805 2946415 2767287 2817924 2891629 2626611 2500893 2697302 2893914
22153 2893914 2882914 2840789 2815106 2810250 2840820 2851583 2685465 2555564 2456060 2443342 2286218
22142 2286218 2079782 2157616 2543203 2510318 2377545 2241746 2028662 1848867 1901111 2542790
22132 2542790 2808618 2802580 2729691 2772301 2831667 2687734 2611988 2804607 2754830 2652416 2596716
22121 2596716 2575957 2627174 2649839 2761843 2943088 3138722 2970039 2882424 2884734 3218606
22111 3218606 3064694 2928889 2892527 2929451 2917265 2793814 2860569 2881240 2935547 2835549 2681758
22100 2681758 2581418 2594569 2759994 2770711 2921877 2925120 2952479 2952230 3212192 3399513 3256383
22089 3256383 2949755 2796255 2793834 2787523 2867408 2825265 2844284 2722969 2576917 2592659 2651575
22078 2651575 2634031 2737800 2771464 2511773 2485833 2760195 2997767 2989448 2899523 3122866
22068 3122866 3064974 2987254 3089430 3017939 2909322 2740385 2689146 2903953 3032862 3218166
22058 3218166 3378737 3338475 3279809 3074144 2906917 2954736 2894949 2876213 2844875 2641134
22048 2641134 2738061 2942238 3058110 3230080 3103401 2752282 2740534 2851754 2813620 2767408
22038 2767408 2920203 2983056 2775814 2699727 2764974 2809537 2781670 2832997 3086601 3073375 3343534
22027 3343534 3209368 3036787 2949324 2862554 3141175 3181060 2997784 2909739 2780578 2802307
22017 2802307 2728978 2822312 3085033 3098389 2992087 2982471 2942696 3398070 3385929 3084121 2798476
22006 2798476 2823719 2812130 2881517 2752042 2604414 2821785 2559666 2485147 2423760 2566578
21996 2566578 2696079 2681920 3009379 3054933 3094094 3069698 2851894 2827102 2823124 2742458 2788389
21985 2788389 2856063 3104531 3097231 3031642 3097751 3051723 2988842 3107237 3158507 3044296 2969701
21974 2969701 3016796 3085864 3004862 3055391 3197992 2974599 2801092 2885663 2690341 2816270
21964 2816270 3087934 3111816 2883038 2795221 2765536 2944324 2853904 3073161 3336625 3143037
21954 3143037 2808057 3023453 3145556 3198102 3173857 3086979 3037537 2913498 2751611 2919939
21944 2919939 2919819 3183041 3145578 3100290 3082853 3022463 2930197 3140956 3345175 3306216 3230833
21933 3230833 3008628 2907165 3063306 3057936 3053354 2871218 2847713 2778664 2840848 3150538 3285350
21922 3285350 3340301 3200205 3056505 3271514 3419451 3352689 3522291 3645384 3398512 3288513
21912 3288513 3390305 3608688 3489868 3105421 3044985 3047110 3139535 3352132 3676253 3621629
21902 3621629 3554561 3343972 3275086 3242077 3235337 3323623 3299431 3213839 3118927 3324719 3507608
21891 3507608 3514420 3303359 3115265 3193283 3060412 3165035 3287722 3227596 3198058 3083677
21881 3083677 3226089 3400111 3366228 3434136 3261142 3152573 3087922 3129652 3293357 3111726
21871 3111726 2946851 3065221 3122182 2901157 2646154 2999557 3115535 3067531 2957678 3211537
21861 3211537 3415729 3485841 3598139 3564066 3465767 3498573 3409213 3339361 3315952 3292424 3430739
21850 3430739 3539194 3673798 3674359 3407761 3260706 3259182 3405322 3235352 2793781 2577026
21840 2577026 2708095 2894975 2998398 2972026 2890766 3056856 3064279 2903113 3223259 3226389
21830 3226389 3239867 3316079 3229089 3272472 3086389 3024753 2785468 2750387 3085928 3212487
21820 3212487 3274547 3058767 3048992 3196620 3266248 3288232 3522899 3483414 3191103 3374686
21810 3374686 3267789 3264861 3415810 3473819 3255479 3260943 3139952 3342064 3569516 3520168
21800 3520168 3439318 3239616 3205825 3066362 2954280 3099819 3186325 3255178 3480232 3503960
21790 3503960 3530500 3554592 3431929 3317844 3382769 3555455 3473721 3287675 3032070 2891531
21780 2891531 2865407 2924747 3318744 3477226 3494314 3532984 3439330 3459905 3510854 3543648 3468193
21769 3468193 3358278 3298473 3417885 3155700 3062780 3405874 3576277 3549880 3373998 2996194
21759 2996194 2799671 2830648 3034603 3188095 3405062 3388627 3350037 3152931 3002189 2856007
21749 2856007 2899572 2974524 3051841 3186402 3278691 3242833 3244138 3279203 3303937 3442492 3550876
21738 3550876 3585384 3369287 3449971 3617516 3682064 3742436 3661213 3448703 3437227 3443999 3412558
21727 3412558 3520995 3444848 3125262 3107520 3395392 3582950 3763123 4079022 4113943 3819824
21717 3819824 3672337 3724498 3721392 3918383 3966630 3820501 3553204 3545540 3344141 3284377 3335506
21706 3335506 3308044 3161538 3184157 3462090 3614408 3797616 3759451 3748110 3438001 3399895
21696 3399895 3546353 3469195 3399584 3494342 3674516 3677632 3827245 3624435 3438810 3562250
21686 3562250 3623444 3728066 3669349 3487401 3494253 3556310 3958668 4041374 3939343 3770183
21676 3770183 3682396 3494595 3370084 3256149 3338038 3339797 3504024 3643363 3828544 3909781
21666 3909781 3724185 3461651 3357457 3298356 3016338 2696132 2890830 3356058 3404525 3341803
21656 3341803 3405410 3332575 3464155 3617987 3656190 3706284 3704060 3618511 3434569 3316169 3359770
21645 3359770 3368822 3606461 3859574 3859748 3613535 3519138 3163662 3311335 3591533 3666315 3600126
21634 3600126 3398238 3362214 3390403 3400192 3451139 3394542 3457875 3350023 3248422 3277019 3613620
21623 3613620 3715312 3565319 3562078 3476202 3318720 3117801 3065666 3152867 3282755 3242949
21613 3242949 3300464 3487505 3533534 3640094 3941541 3988870 4003677 4254127 4310081 4144053
21603 4144053 4156419 4080989 3920295 3681382 3561643 3747506 3861000 3661456 3642853 3983873
21593 3983873 4281781 4381338 4380845 4028413 3853467 3976119 3870914 3879380 4057597 3933467
21583 3933467 3799037 3940426 3847310 3917154 3912747 3700625 3545690 3717892 3775687 3793790
21573 3793790 3969655 4002251 4042439 4069230 4174082 4358477 4245338 3936009 3973047 3946701
21563 3946701 4004191 4058534 3983195 3925023 3925975 3862221 3903934 3827941 3833190 3840668 3879858 3812894
21551 3812894 3831911 3999360 4089269 3936968 3825415 3904924 4148291 4291147 4146396 4054210
21541 4054210 3949872 3775562 3738562 3880165 3983245 4036619 3940244 3811560 4052093 4076183
21531 4076183 4072854 3899961 3711928 3638352 3540251 3709441 3738614 3695699 3601004 3569229 3667963
21520 3667963 3768216 4016162 4028859 3982039 4109340 4092645 4057321 4109455 4027809 4012010 4004302
21509 4004302 3943547 3859609 3941750 4089413 4164703 4218482 4026593 3990434 3988158 4016981 4039079
21498 4039079 4035671 3848439 3773950 3618579 3765543 4053043 4230167 4219900 4190941 4090463
21488 4090463 3968381 3835537 3951954 3907041 4083987 4314159 4668219 4686215 4473181 4316215
21478 4316215 4208856 4144184 4048605 4212433 4256204 4090053 3647889 3808556 4181200 3994078
21468 3994078 3763348 3518615 3497481 3725012 3680712 3726871 4027381 4061895 3954933 3902420
21458 3902420 3912466 4043273 4127683 4215092 4173273 4034886 3838675 3703750 3742821 4018987
21448 4018987 4079007 3927415 3822263 3651431 3494866 3486917 3667797 3889662 4059085 4052601
21438 4052601 3744415 3975055 4060828 3993705 3906765 4011624 3998524 3948134 3869446 3625289
21428 3625289 3746830 4019866 4216116 4286805 4111515 4045690 4165746 4051522 4143362 4147799
21418 4147799 4314443 4153976 4313539 4427594 4424415 4307478 4255295 4371144 4358100 4324718
21408 4324718 4547419 4490556 4442526 4355779 4297518 4137873 4135214 4183086 4006798 3933145 3934133
21397 3934133 3990928 3764987 3826587 3964387 4158299 4267875 4223893 4199143 4341565 4323549
21387 4323549 4330568 4515912 4378265 4229499 4224575 4171017 4210283 4316845 4390550 4354438 4372540
21376 4372540 4444121 4435652 4426927 4584542 4580005 4589150 4375934 4388190 4512690 4406978 4368919
21365 4368919 4356005 4258840 4224491 4183978 4205610 4273699 4031865 3874298 3807921 4070318 4371182
21354 4371182 4519779 4603893 4701577 4749870 4584617 4672754 4395065 4306698 4296664 4571996
21344 4571996 4477644 4390494 4398681 4300431 4237172 4168897 4522020 4593571 4635020 4479507 4391010
21333 4391010 4378648 4372329 4368010 4359614 4390252 4552701 4760408 4672439 4637761 4370702 4584045
21322 4584045 4486183 4247889 4025629 4198164 4415100 4562587 4594765 4625203 4682199 4604046
21312 4604046 4621990 4530164 4446727 4600119 4589826 4518715 4549188 4780729 4812260 4572526 4607704
21301 4607704 4713978 4679538 4662777 4748961 4759350 4673196 4828502 4863630 4984439 4777502
21291 4777502 4582655 4625799 4757378 5047495 5032826 4922342 4846316 4777909 4849199 5010530
21281 5010530 4790568 4590729 4528986 4548024 4476056 4377093 4446462 4605474 4645805 4653376 4842294
21270 4842294 4949587 4960234 4926866 5005350 5033628 5031256 4726247 4641237 4921892 5057072 5213892
21259 5213892 5210393 5190752 5170535 5316307 5234979 5158099 5204920 5228674 5303332 5331997 5145475
21248 5145475 5040164 4795398 4747834 4920204 5222894 5232178 5216754 5243513 5100380 5008465
21238 5008465 5253173 5454212 5542139 5140667 4959798 4865317 4713352 5032048 5385413 5577131
21228 5577131 5387493 5416534 5489492 5275195 5181816 5322478 5789900 5659935 5543266 5687020
21218 5687020 5596023 5420376 5292435 5343856 5473448 5587452 5507291 5158024 5312187 5370216
21208 5370216 5207066 5265844 5314141 5593412 5560186 5586096 5581591 5518046 5532032 5478849 5347594
21197 5347594 5418299 5658600 5849618 5835177 5571471 5525857 5739997 5793455 5713327 5378428
21187 5378428 5359954 5352241 5332424 5201338 5086086 5209843 5111457 5206283 5382055 5387907 5401413
21176 5401413 5470441 5670599 5664738 5712122 5822464 5913999 5688364 5437526 5480240 5412181 5387149
21165 5387149 5482490 5494575 5608038 5682750 5664445 5620833 5615576 5752656 5868957 5917280 6112066
21154 6112066 6343198 6105807 5715133 5524134 5485129 5660344 5730514 5875338 5911447 5838840
21144 5838840 5832509 5764997 5908562 6071632 6101285 6010186 6043003 6094731 6077856 5854510 5921897
21133 5921897 6256054 6362623 6300418 6281458 6277234 6170378 6230560 6198510 6378227 6582034
21123 6582034 6403192 6206603 6101034 6144486 6125966 6157355 6153600 6147885 6236773 6341543 6076067
21112 6076067 6120630 6389022 6428644 6399960 6315773 6183124 6224382 6392115 6591584 6596378 6608007
21101 6608007 6621916 6617953 6576760 6252358 6308013 6415148 6479668 6429158 6688621 6695008 6646056
21090 6646056 6682355 6645010 6562991 6782233 6934131 6802732 6669152 6755255 6764232 6681862 6901671
21079 6901671 6914311 6918154 7154707 7196034 7228012 7052541 6804060 6880193 7122556 7257961
21069 7257961 7402443 7438927 7221438 7163637 7163639 7031345 6874192 6874752 7030949 7055064 7421022
21058 7421022 7515698 7426712 7364223 7157193 7143864 7267337 7556534 7621956 7623977 7768781 7765857
21047 7765857 7653306 7791755 7800015 8015495 7859751 7798800 7639025 7678392 7560490 7449183
21037 7449183 7672549 7861686 8006623 8233586 8147371 8157856 8083219 8027236 8088637 8242374
21027 8242374 8573716 8554261 8143213 7960811 8079937 8297245 8623053 8498436 8393786 8547631
21017 8547631 8177283 8065270 8407742 8653640 8841713 8821000 8748604 8802481 8790585 8599907
21007 8599907 9034694 9522209 9539199 9431992 9331945 9250858 9204810 9373030 9579386 9795773
20997 9795773 9841902 9731401 9383323 9252086 9365173 9738319 9598916 9702078 9825962 10073159
20987 10073159 10068388 9779866 9955340 10210298 10537989 10595699 10659341 10712615 10770022 10909662
20977 10909662 11232872 11246116 11190024 11214431 11429663 11452560 11438003 11569108 11619179 11687005
20967 11687005 11550270 11447535 11790124 12365397 12638720 12477039 12616788 12600312 12746077
20958 12746077 12811274 13060817 13441219 13499032 13783711 13934120 13893267 14002448 14164159 14265350
20948 14265350 14950279 15461348 15539669 15682742 15719940 15858404 16368068 16895517 17079403 17386079
20938 17386079 17490313 17469531 17677493 17990869 18592458 18977086 19196422 19462680 19808195
20929 19808195 20155814 20300167 20807585 21385249 21867883 22423579 23196587 24096150 25149437
20920 25149437 25836891 26665479 27545651 28565388 29463861 30544670 31743653 33252453 35178393
20911 35178393 36941295 38841547 40725593 42151714 43079513 43980704 45523121 47047253
20903 47047253 47158284 44811327 40562303 37851661 37541456 37292015 34433601 28255323
20895 28255323 21650736 17918053 16616412 15225613 12278392 8701517 6163115 4058213
20887 4058213 114860 -4450009 -7370979 -8170389 -9132699 -13000727 -20194298 -27036044
20879 -27036044 -29966759 -30225267 -30991669 -33674302 -37129474 -39391050 -39431756 -37932926 -36251224
20870 -36251224 -34946448 -33736401 -32135734 -30230107 -28421836 -26600582 -24907785 -23647896
20862 -23647896 -22375954 -21282664 -20155646 -18933289 -18021793 -17273069 -16684022 -15892575 -15235552
20853 -15235552 -14546999 -14087223 -13416330 -13001341 -12883456 -12275820 -11571718 -11240572 -10898789
20844 -10898789 -10552934 -10276779 -10132148 -9797699 -9371912 -9085868 -8727382 -8205734 -7934572
20835 -7934572 -7863219 -7756863 -7456955 -7299407 -7242046 -7313513 -7051088 -6588288 -6079783 -5826364
20825 -5826364 -5675782 -5505787 -5266589 -5197500 -5194222 -4751684 -4505487 -4485594 -4392331 -4302922
20815 -4302922 -4187272 -3913072 -3975725 -3939763 -3733284 -3651955 -3532907 -3558576 -3371513 -3038990
20805 -3038990 -3252720 -3649984 -3537556 -2930891 -2656407 -2754612 -2767163 -2866243 -2838809 -2703488
20795 -2703488 -2580663 -2503463 -2782362 -2632831 -2438573 -2423673 -2478360 -2246249 -1913486 -1661693
20785 -1661693 -1777293 -1781963 -1662464 -1568348 -1363956 -1333768 -1286950 -1245970 -1322569 -1256532 -1351360
20774 -1351360 -1319604 -882971 -779661 -933775 -1063085 -990311 -1078730 -1127857 -1053530 -1139452
20764 -1139452 -1255390 -1313102 -1172825 -901720 -622786 -549781 -871754 -1112654 -1055032 -854771
20754 -854771 -666011 -326681 -214421 -73091 84077 -155944 -450818 -432994 -464258 -325080
20744 -325080 -70245 22950 -151526 -124044 163923 225939 94428 115324 130003 89488 105384
20733 105384 228233 349372 339237 579474 534662 492132 735156 757861 1027073 1161555
20723 1161555 988842 941116 948610 1082367 946928 820231 823343 860740 541626 332142
20713 332142 576690 585163 798149 1048216 1023235 871679 911727 1117009 1139812 1068343 1130958
20702 1130958 803884 797777 1070472 1120814 1210073 1353243 1418656 1251828 1275041 1468195
20692 1468195 1660004 1574060 1337074 1491390 1443007 1343328 1511104 1783421 1785602 1552695
20682 1552695 1420112 1387150 1439273 1429114 1199654 1224927 1534466 1739387 1938369 2080570
20672 2080570 2021922 2101632 1948555 1938982 2097439 2196473 2308508 2213941 1914179 1923384 1926428
20661 1926428 1901214 1986541 2131913 2117075 1939836 1879195 1916364 2020547 1993477 2150363
20651 2150363 2218002 1917517 1918827 1923575 2141512 2198853 1909079 2124472 2228097 2202299 2182563
20640 2182563 2264984 2271513 2294635 2286065 2387733 2673374 2696082 2760031 2690268 2527844 2405696
20629 2405696 2328711 2218950 2178722 2042764 2135237 2368520 2264986 2118014 2235678 2417447
20619 2417447 2437811 2604064 2797638 2885415 2863716 2728514 2669259 2779810 2680507 2678668 2794175
20608 2794175 2643917 2383301 2421641 2812550 2829136 2820003 2712054 2486393 2321320 2436257
20598 2436257 2558806 2744625 2567924 2441448 2506849 2609668 2630713 2817318 2915878 3092352
20588 3092352 3297294 3082010 3060199 3291874 3386484 3472216 3559416 3461017 3354362 3127553
20578 3127553 2986820 3108945 3215076 3182233 3205181 3507757 3554548 3399883 3296798 3398031
20568 3398031 3435263 3434646 3448417 3415524 3254880 3469500 3498665 3589912 3610714 3685164 3621043
20557 3621043 3722850 3755469 3689818 3719408 3591057 3605220 3695326 3643613 3661417 3722110 3810868
20546 3810868 3735930 3671024 3653542 3703072 3622824 3575590 3434434 3503340 3613680 3615099 3532480
20535 3532480 3501088 3512435 3623794 3666643 3726570 3582888 3386022 3591107 3872014 3991325
20525 3991325 4058919 3968239 3612968 3780296 3927342 3802503 3778391 3857904 4192485 4218296
20515 4218296 4098137 4197443 4068697 3927583 3862408 3864010 3925935 3686340 3632622 3704217 3941359
20504 3941359 4181557 4154169 3908868 3688823 3911489 3981184 4092229 4077247 4078478 3984494
20494 3984494 3888283 4007912 4174927 4029924 3928446 3781776 3957519 4227525 4175411 4106661
20484 4106661 4031827 4142712 4139089 4178592 4236194 4323279 4431933 4362931 4369443 4374689 4180507
20473 4180507 4205273 4208359 4284840 4436051 4114812 4070943 3863329 3731476 3971623 4355385
20463 4355385 4235002 4177380 4205572 4330420 4263233 4098743 4024624 4024198 4022078 4093108 4229739
20452 4229739 4424000 4539953 4396241 4510490 4383589 4242987 4398982 4311391 4284315 4307838
20442 4307838 4368123 4493702 4550045 4572224 4563827 4536537 4497513 4684385 4924913 5119780 5243537
20431 5243537 5111946 4985389 4951470 4815661 4821589 4809293 4761637 4385532 4392774 4742474 4731915
20420 4731915 4745387 4912236 5073524 5003106 5012616 4963106 4798670 4741077 4779093 4909831 4965378
20409 4965378 5111024 5238479 5224079 5065024 5178162 5204907 5163019 5180465 5271615 5170791
20399 5170791 5061889 4834335 5016383 5114450 4924993 4990355 5126735 5153259 5222307 5391753
20389 5391753 5560322 5597480 5638355 5391286 5248707 5432339 5325109 5372943 5529950 5597722
20379 5597722 5606587 5680023 5756353 5807574 5713958 5555933 5420649 5321125 5220176 4927927 4845258
20368 4845258 5102417 5437345 5276207 5125852 5417498 5539971 5466425 5288391 5481011 5688379
20358 5688379 5623066 5482258 5352557 5465753 5549489 5615702 5427460 5479429 5672850 5856693
20348 5856693 5744440 5716523 5736800 6017792 5941453 6244426 6224073 6171300 5842167 5930520
20338 5930520 6082561 6118641 6075276 6080233 6144721 5999736 5725351 5695974 5703711 5981556 6172819
20327 6172819 6077937 5952778 5997625 6207539 6173273 6132259 6165541 6184097 6330785 6262457 6273473
20316 6273473 6590569 6605579 6461094 6652212 6553972 6263076 5769743 5809188 5783624 5669662
20306 5669662 5708785 5676952 5930278 5988686 5615920 5435553 5581334 5783796 5781895 5903926
20296 5903926 5727732 5976115 6030741 5919489 5910402 5820627 5885344 5994729 5980059 5971488 5863754
20285 5863754 5923582 5920433 5789803 5751711 5832199 6174697 6272062 6129346 6106604 6252966 6356886
20274 6356886 6294797 6363253 6281190 6266752 6123213 6273816 6485412 6557580 6557867 6770639 6652462
20263 6652462 6804142 6994285 6983892 6936787 7097578 7125041 6894612 6852290 6764625 6709381
20253 6709381 6601934 6667719 6732975 6864541 7183102 7072550 7119956 7120177 6832921 6528311
20243 6528311 6553615 6696691 6948116 7009132 6809191 6743270 6729336 6791728 6826411 6762741 6736069
20232 6736069 6896227 7113084 7214637 7223411 7200447 7128347 7104791 6916495 6817878 6635000
20222 6635000 6693795 6970297 7177170 7261975 7228157 7173425 7235628 7153222 7352138 7456476
20212 7456476 7491837 7440304 7537511 7528325 7413759 7217724 7339153 7403862 7280634 7429900
20202 7429900 7480246 7560944 7577778 7411826 7494449 7563914 7636470 7368648 7124128 7258878
20192 7258878 7363052 7364689 7381280 7631314 7526573 7525309 7474077 7276086 6984984 7067002 7213869
20181 7213869 7383378 7529190 7620634 7849152 7762718 7842850 7794711 7527359 7649379 7760674
20171 7760674 8081131 8326546 8392776 8369301 8539673 8544723 8466154 8398237 8203997 8052134
20161 8052134 8097230 8209045 8259513 8364023 8573478 8714206 8677105 8728632 8709898 8686975
20151 8686975 8413461 8431898 8335583 8260336 8142973 8012528 7858638 7719635 7896244 8043616
20141 8043616 8088513 8282506 8397966 8300147 8324488 8230015 8269642 8295003 8188528 8146291 8522725
20130 8522725 8681154 8612195 8482388 8627059 8974174 9061567 9197192 9120912 8943659 8807652
20120 8807652 8594335 8726342 8717681 8847152 9044682 9345824 9543930 9405024 9310284 9132079
20110 9132079 9111940 9071796 8972045 9079231 9215121 9249725 9225838 9318344 9465503 9678596
20100 9678596 9793654 9505096 9227912 9209894 9372822 9679035 9544558 9405591 9345170 9301941
20090 9301941 9497091 9729825 9721577 9507423 9694450 9902054 10169276 10288215 10628490 10696846
20080 10696846 10555994 10384827 10368307 10392889 10289991 10359106 10163144 10095603 10321816 10485729
20070 10485729 10561927 10585447 10477644 10420466 10205461 10189623 10327260 10218289 10274845 10236483
20060 10236483 10280746 10428449 10996240 11331897 11351122 11411244 11450772 11231995 11149685 11020066
20050 11020066 10893766 10880768 10896450 11070908 11241394 11260203 11536262 11524733 11560462 11780986
20040 11780986 11804134 11777737 11759602 11667571 11630510 11581515 11546213 11538889 11542379 11904880 11919496
20029 11919496 11873633 11981783 11991766 12050050 12046609 12022313 12256920 12500075 12451194 12342722 12414995
20018 12414995 12517089 12566872 12729416 12958895 12922556 12850421 12872022 12990699 12994594 12922457
20008 12922457 12858603 12973378 13158549 13084841 12821046 13157389 13158060 13068924 12960615 13173086
19998 13173086 13367022 13646264 13803969 13776530 13644499 13545892 13737087 13868235 13948665 14097875
19988 14097875 14249527 14258454 14122334 14337363 14567898 14541429 14717960 14608342 14762718 14857475
19978 14857475 14753538 14799210 14774104 14686372 14945408 14993565 14870945 14996483 15246559 15349757
19968 15349757 15548394 15655480 15570755 15733108 15649987 15580211 15588111 15822290 15930014 16254565
19958 16254565 16426551 16712276 16911591 16910244 16869138 16944763 16667961 16518381 16687999 16792063
19948 16792063 16940324 17178797 17352286 17461184 17670418 17802469 17809984 17830612 17971720 18172715
19938 18172715 18376125 18475312 18718078 18968993 19218481 19278688 19431383 19432927 19528135 19798250
19928 19798250 19829882 19894200 19871959 19875914 19851365 19868414 20261521 20436790 20650386 20995392
19918 20995392 21045734 21267262 21500124 21641540 22053925 22173832 22067880 21991327 22293492 22717725
19908 22717725 22998376 23114030 23454440 23879439 24192400 24485485 24729907 24948319 25364964
19899 25364964 25871713 26202333 26221144 26293282 26681627 27085235 27559922 27830288 27976045 28297294
19889 28297294 28645639 29207498 29778998 30136597 30469598 30988872 31416612 31865703 32364324
19880 32364324 32778314 33401862 34036124 34731993 35624894 36370966 37033649 37474362 38005833
19871 38005833 38639141 39423414 40678820 41900348 43228369 44527014 46011833 47741201
19863 47741201 49551413 51325635 52896217 53816300 53846189 53191525 53583547 56074141 59861668
19854 59861668 64717936 70165093 76338437 82294975 85515670 79653283 59754647 34674457
19846 34674457 19599061 14232696 7444839 -3160850 -9403963 -7573532 -1923350 4335170
19838 4335170 9726888 12751674 11952905 6997855 1423671 -1221272 -1274409 -213830 1398251
19829 1398251 3561203 5700632 7801858 10500471 13068825 15360368 17781834 20213503
19821 20213503 22364846 24307507 26260063 28229233 30353889 32718691 35558920 38649745
19813 38649745 42176436 45632784 49527527 54077229 58407103 61268735 61449977 56509693
19805 56509693 48353703 42702109 43046665 48046366 55990861 65340314 75933249 87080410
19797 87080410 96460415 97946015 84012722 57663635 25453840 -16642818 -63001201
19790 -63001201 -93489168 -100310415 -93224928 -81596176 -69777414 -59775015 -52340536
19783 -52340536 -48933218 -50379985 -53333713 -53804644 -51655041 -48926788 -46705368 -45496315
19775 -45496315 -44268195 -42375579 -39518029 -36321760 -33417104 -31042487 -29078048 -27353294
19767 -27353294 -26008321 -24380969 -22891776 -21729756 -20542627 -19350274 -18001445 -16724873
19759 -16724873 -15250819 -14137484 -13088197 -12167907 -11420725 -10610401 -9855481 -9226251 -8516895
19750 -8516895 -7923633 -7137427 -6386642 -5749461 -5229717 -4307795 -3320238 -2597175 -2256687
19741 -2256687 -1552133 -768074 -114781 509077 1186534 1854001 2452586 2856466 3475183
19732 3475183 4396318 5307617 5845882 6386999 7012713 7827406 8439997 9018421 9613285
19723 9613285 10233141 10967459 11661975 12282188 13043515 13817567 14818530 15727009 16384010
19714 16384010 17210884 18114876 19070479 20076188 21092185 22038192 23158510 24489303 25682646
19705 25682646 26747021 27962854 29043114 30476833 31915624 33684593 35690859 38109765
19697 38109765 40900566 43627278 46581512 50146295 53978779 57799169 61527750 63597501
19689 63597501 62559777 60000818 60017857 64341056 72395757 82695970 93797690 103061018
19681 103061018 104062796 87695679 50828253 5874096 -31550167 -60110243 -81170365
19674 -81170365 -89271842 -84684170 -74668898 -64200269 -54502900 -45818496 -39285509 -36198597
19666 -36198597 -37990792 -44562859 -51735341 -55025699 -53928432 -50442707 -46237452 -42055794
19658 -42055794 -38191555 -34608994 -31423087 -28769078 -26225613 -23907429 -21606211 -19467798
19650 -19467798 -17125091 -15043689 -12996082 -11000108 -8799901 -6279889 -3707112 -1120000
19642 -1120000 2009314 5213231 8295573 11318346 13345031 13139240 9549828 3835710
19634 3835710 -85587 321563 4022736 9247477 15019490 19021789 18164865 10243169
19626 10243169 171002 -6536752 -14786838 -32974350 -57106923 -72776664 -75319214
19619 -75319214 -70973082 -64613841 -58400847 -52763982 -48741513 -45901425 -44342787 -44479558
19611 -44479558 -44949344 -44700635 -43493964 -41758693 -39929756 -37890847 -36034901 -34457908
19603 -34457908 -33127839 -31991296 -31124824 -30145515 -29165879 -28264612 -27590038 -27123131 -26300690
19594 -26300690 -25435825 -24779821 -24152760 -23591649 -23301796 -22706772 -21885351 -21238865 -20868658
19585 -20868658 -20721353 -20263039 -19862821 -19384469 -19187536 -18816965 -18603113 -18242924 -17792074
19576 -17792074 -17371743 -17197482 -16855847 -16378307 -16146164 -15940788 -15914875 -15781056 -15224391
19567 -15224391 -14786181 -14429150 -14208184 -14097851 -13860706 -13572650 -13348896 -13134360 -12993373
19558 -12993373 -12748361 -12314114 -11889199 -11827080 -11849226 -11355614 -11202208 -11151823 -11236944 -11152198
19548 -11152198 -10728546 -10462995 -10343529 -10433523 -10136844 -9744561 -9637166 -9448512 -9295650
19539 -9295650 -9142253 -8905072 -8792445 -8849879 -8635051 -8674510 -8693976 -8574079 -8414955 -8183412
19529 -8183412 -8017039 -7671363 -7433337 -7350521 -7262140 -7286800 -7164543 -6988888 -6969383 -6888819
19519 -6888819 -6726860 -6439122 -6101915 -5623294 -5453190 -5562079 -5424600 -5256179 -5197141 -4904863
19509 -4904863 -4670031 -4782722 -4733844 -4637973 -4495002 -4244891 -4203202 -3862749 -3503938 -3410246
19499 -3410246 -3623510 -3529578 -3190758 -2872892 -2780134 -2740494 -2716246 -2396148 -2255755 -2285851
19489 -2285851 -2291055 -1999008 -1799756 -1847208 -1812302 -1571692 -1206770 -932225 -929516 -910139 -746377
19478 -746377 -518388 -242961 -265187 -104498 -50345 261664 660690 621963 639810 1047372
19468 1047372 1359119 1628004 1961658 2036896 2139565 2426989 2871335 3309220 3638592 4022364
19458 4022364 4253247 4538843 4854760 4908464 5207983 5521693 5900115 6414385 6724141 6927680
19448 6927680 7291688 7797702 8224957 8692226 9040429 9489243 10313967 11091649 11688231
19439 11688231 12429813 13487124 14834364 16151361 17243735 18215008 19000800 19318042 19270280
19430 19270280 19343129 18852172 16720659 13195045 10550055 9051474 7318762 4501618
19422 4501618 1857176 1222329 1547111 2340043 3091599 3629738 4234970 4872085 5100784
19413 5100784 3238083 -131452 -2390768 -3578910 -5474330 -8548779 -10948995 -11540579
19405 -11540579 -11263126 -10712369 -9971914 -8854897 -7254886 -5762300 -4372562 -3153658
19397 -3153658 -1955373 -374016 757632 1956785 3353251 4236724 5183103 6421317
19389 6421317 7543387 8701512 10066400 11491861 13434639 15459821 17569959 19798094
19381 19798094 21765726 22961085 23461979 23623407 23585244 21970369 17706148 11941767 7870056
19372 7870056 5000043 648837 -4560344 -8257759 -9028205 -8291902 -7350271 -6638351 -5654487
19363 -5654487 -4494410 -3769728 -5127175 -9408649 -14669124 -18357016 -21336099 -26294146
19355 -26294146 -32297304 -36496110 -38174277 -38582702 -37920163 -36570609 -34794639 -32516571
19347 -32516571 -30411613 -28857301 -27237224 -25663665 -24622303 -23516757 -22247147 -21201732
19339 -21201732 -20007925 -18942242 -18308200 -17700566 -17106400 -16618979 -16310419 -15918177 -15403411
19330 -15403411 -14982491 -14497192 -13939675 -13341861 -12718157 -12084831 -11623207 -11231242 -11050261
19321 -11050261 -10733402 -10369618 -10067588 -9819651 -9541167 -9226515 -8758061 -8228164 -7962294
19312 -7962294 -7866885 -7827322 -7689440 -7631653 -7484304 -7079743 -6639313 -6411423 -6443417 -6163641
19302 -6163641 -5908533 -5823801 -5501494 -5116031 -4918383 -4700829 -4387116 -4146909 -3763238 -3434997
19292 -3434997 -3106731 -2577186 -2383485 -2116601 -1569578 -1379965 -1224373 -1015325 -834827
19283 -834827 -587732 -275365 286111 727733 927462 1176418 1380949 1808434 2091026 2365640
19273 2365640 2702006 3179647 3686920 4145482 4438358 5027015 5591866 6166651 6722954
19264 6722954 7092289 7553364 8282564 9356062 10176671 10890649 11460584 12427444 13442543
19255 13442543 14458246 15888209 17516247 19187054 20938922 22997224 25192258 27819006
19247 27819006 30221804 32076972 33615319 34616632 35457852 35319084 32382146 26963255
19239 26963255 21436270 17092721 11728219 3154022 -7868718 -17222204 -23621036 -27986602
19231 -27986602 -33172862 -39444069 -43777204 -44895182 -43940545 -42560146 -41527791 -39870263
19223 -39870263 -37413775 -34852449 -32351667 -30206612 -28115690 -26315427 -24380671 -22619617
19215 -22619617 -21119427 -19911608 -18838668 -17582314 -16449085 -15462994 -14794889 -13924770
19207 -13924770 -12926297 -12133107 -11177874 -10033130 -8785355 -7995933 -7047640 -5808177 -4512501
19198 -4512501 -3093997 -1359197 475107 2113230 3686040 4904781 5789031 6655647
19190 6655647 7401868 7404886 5795826 2561797 -645582 -2942168 -6385650 -11692844 -17943293
19181 -17943293 -23021768 -25949032 -28040108 -30925908 -34302017 -36162103 -36444581 -35638816
19173 -35638816 -35099510 -34190726 -32831556 -31237147 -29865334 -28414404 -27158675 -26298970
19165 -26298970 -25656250 -24797607 -24075336 -23187934 -22411376 -22044435 -21692724 -21076341 -20715445
19156 -20715445 -20276436 -19946610 -19476051 -18754760 -18409050 -18205651 -17852625 -17511019 -17250078
19147 -17250078 -16839382 -16709026 -16635473 -16357312 -15942784 -15542301 -15205888 -14846654 -14766172 -14746920
19137 -14746920 -14861029 -14785128 -14577776 -14302459 -14103990 -13783120 -13771549 -13846887 -13495225 -13028055
19127 -13028055 -12903339 -12797100 -12618873 -12497170 -12624796 -12588526 -12428929 -12068871 -11702116
19118 -11702116 -11638522 -11831259 -11650545 -11481480 -11326670 -11275346 -11264308 -11333752 -11602946 -11534341
19108 -11534341 -11370522 -11195201 -10876716 -10662142 -10521317 -10409336 -10317050 -10227918 -10191009 -10256410
19098 -10256410 -10365249 -10294950 -10132195 -10310985 -10455629 -10507832 -10450546 -10120913 -9924339 -9876828
19088 -9876828 -9852378 -9696462 -9642758 -9619454 -9397624 -9067357 -8877777 -8648057 -8669169 -8861894
19078 -8861894 -8725710 -8760556 -8613960 -8647685 -8573369 -8257385 -8117137 -8195491 -8228278 -8223707 -8235276
19067 -8235276 -8117175 -8151239 -8086029 -7812663 -7507337 -7190323 -6949700 -6741113 -6895267 -6874474
19057 -6874474 -6688494 -6634446 -6669302 -6519234 -6365339 -6193696 -5936607 -5516179 -5384778 -5250714
19047 -5250714 -5169679 -5332467 -5287573 -5236204 -4901772 -4510703 -4364575 -3850322 -3269980 -2780503
19037 -2780503 -2746077 -3083547 -4432284 -6578055 -8189031 -9291364 -10392216 -11118481 -11326611
19028 -11326611 -11060493 -10581746 -10217697 -9648198 -9370612 -9443220 -9554507 -9732413 -10163739
19019 -10163739 -10100210 -9708683 -9494662 -9529795 -9316160 -8885543 -8758269 -8898502 -8753852 -8621753
19009 -8621753 -8292426 -7919353 -7546450 -7321954 -7002207 -6911583 -6750317 -6669623 -6449769 -6319952
18999 -6319952 -5885026 -5746950 -5949001 -5852034 -5361197 -5122558 -4850894 -4957573 -5434627 -5847362
18989 -5847362 -5797791 -5577179 -5184657 -4809792 -4622924 -4371928 -4804257 -5504818 -6430244 -7632505
18979 -7632505 -9384504 -11383889 -12160906 -12137897 -11926125 -11514969 -10810773 -10409276 -9848699
18970 -9848699 -9535218 -9387439 -9373103 -9436304 -9573553 -9521052 -9254658 -9106925 -8992526 -9040543
18960 -9040543 -8867265 -8591745 -8608567 -8381849 -8200370 -8170878 -8104188 -8025383 -8079634 -8225117
18950 -8225117 -8269849 -8223095 -8341953 -8171490 -7828564 -7475111 -7390913 -7215071 -7322731 -7339697
18940 -7339697 -7113685 -7015510 -7055417 -6972042 -7090681 -6996679 -6911195 -6901400 -6993258 -7114322 -7013789
18929 -7013789 -6845489 -6705973 -6542218 -6603378 -6635800 -6632469 -6570856 -6421178 -6314444 -6203707
18919 -6203707 -6085311 -5975096 -5949951 -6140075 -6199573 -6372575 -6114799 -5774964 -5834583 -6148906
18909 -6148906 -6418576 -6325724 -6350618 -6418708 -6179032 -6125254 -6021160 -5832964 -5667271 -5704454
18899 -5704454 -5829762 -6327016 -6397392 -6188036 -6148497 -5910765 -5781744 -5944251 -5939855 -5963965
18889 -5963965 -6130348 -6041137 -5738242 -5703641 -5814351 -5845271 -5902428 -5682723 -5350700 -5315646
18879 -5315646 -5498642 -5494157 -5376298 -5363120 -5274386 -5614064 -5817855 -5685631 -5514208 -5339913
18869 -5339913 -5146957 -5465073 -5535870 -5505967 -5284087 -5203131 -5118872 -4904782 -4681056 -4779801
18859 -4779801 -5010928 -5286898 -5393685 -5303591 -5291841 -5319681 -5150475 -4966678 -4846410 -4835217
18849 -4835217 -4839243 -4591634 -4600467 -4477751 -4370435 -4365696 -4564647 -4525540 -4477789 -4471698 -4286318
18838 -4286318 -4304914 -4343297 -4309082 -4342840 -4562692 -4755673 -4757213 -4949091 -4781872 -4373672
18828 -4373672 -4311587 -4414029 -4570125 -4690494 -4815061 -4660681 -4276691 -4259398 -4442323 -4719373
18818 -4719373 -4906727 -4967811 -4949730 -4839581 -4614061 -4551659 -4645904 -4457083 -4365241 -4396853
18808 -4396853 -4422291 -4380138 -4382605 -4282899 -4372280 -4291458 -4040459 -3953835 -3875146 -3979523 -4091913
18797 -4091913 -4212073 -3957362 -3717307 -3536715 -3305995 -3442372 -3810825 -4037677 -3847151
18788 -3847151 -3765155 -3877131 -3888648 -3897795 -3937924 -3973548 -3880179 -3595476 -3502122 -3522618 -3719440
18777 -3719440 -3702814 -3387004 -3241605 -3173088 -3212250 -3131660 -3110837 -2831502 -2692306 -2801325
18767 -2801325 -2777587 -3339233 -4465028 -5311843 -5130722 -4918882 -4832663 -4822608 -4690562 -4587490
18757 -4587490 -4303595 -4295862 -4508136 -4500776 -4228621 -4046578 -3900849 -3872982 -3908326 -3702659
18747 -3702659 -3511836 -3729893 -3962565 -4101911 -3996189 -4071709 -3959853 -3938677 -3837708 -3745465
18737 -3745465 -3778595 -3821140 -3852075 -3665413 -3489782 -3618731 -3753397 -3791592 -3875647 -3873823 -3564042
18726 -3564042 -3168770 -3195746 -3287150 -3329190 -3269132 -2888807 -2727988 -2958861 -3126077 -3341109
18716 -3341109 -3236569 -3077583 -3053229 -3009707 -2922531 -3117488 -3190076 -3294378 -3422698 -3515025
18706 -3515025 -3444536 -3434934 -3291437 -3237820 -3275391 -3073997 -2863462 -2891438 -3014102 -3001448 -3056706
18695 -3056706 -3037613 -3033779 -3008958 -2927609 -2887891 -3049679 -2989848 -2949934 -2844842 -2784995 -2991059
18684 -2991059 -2925032 -2915295 -2880811 -3058690 -3162632 -3164700 -2900122 -2525157 -2518821 -2643391 -2437002
18673 -2437002 -2351739 -2294729 -2318313 -2206904 -2323610 -2297175 -2412637 -2597840 -2865648 -2876549
18663 -2876549 -3175845 -3235168 -3164355 -3119672 -2699265 -2448115 -2587653 -2500095 -2778926 -3020838
18653 -3020838 -3085257 -3091455 -3044533 -3145767 -3138875 -2764648 -2767576 -2948332 -2968889 -2901420 -2577518
18642 -2577518 -2486173 -2522789 -2768091 -2679100 -2456445 -2237928 -2188007 -2421887 -2506173 -2361205
18632 -2361205 -2272355 -2533542 -2679635 -2695414 -2561667 -2555828 -2379615 -2250627 -2315953 -2414265
18622 -2414265 -2284357 -2151144 -2244829 -2556294 -2774962 -2608182 -2480896 -2329495 -2213354 -1989446
18612 -1989446 -1976489 -1976025 -2171637 -2250560 -2258437 -2203670 -1875263 -1980945 -2076467 -1979282 -2115556
18601 -2115556 -2131069 -2221730 -2199302 -2041882 -1937437 -1917615 -2021354 -2223678 -2547947 -2528224
18591 -2528224 -2694698 -2753961 -2716990 -2707721 -2456883 -2136807 -2055516 -1891029 -1761381 -1461384
18581 -1461384 -1526875 -1783461 -2085635 -2144338 -2151590 -2019791 -2166037 -2039182 -2095380 -2083232
18571 -2083232 -2128114 -1950621 -1965188 -1786932 -1773255 -1400514 -1447131 -1874185 -1730539 -1538565
18561 -1538565 -1570251 -1628887 -1540078 -1484363 -1720751 -1583884 -1493715 -1370164 -1529262 -1656690
18551 -1656690 -1682671 -1489871 -1660026 -1517744 -1384977 -1539935 -1721510 -1399710 -1292224 -1503737
18541 -1503737 -1852371 -1987082 -1865943 -1876463 -1959584 -1942897 -1907170 -1908419 -1892865 -1797549 -1970535
18530 -1970535 -2032570 -1973455 -1926814 -1613930 -1478427 -1714873 -1670457 -1446796 -1401698 -1420907
18520 -1420907 -1385096 -1610264 -1823092 -1877991 -1752427 -1671311 -1437631 -1405027 -1512833 -1587587
18510 -1587587 -1723653 -1631032 -1511070 -1362375 -1468506 -1493250 -1468694 -1431625 -1272409 -1178030
18500 -1178030 -1312117 -1529393 -1527812 -1130123 -1078948 -1155808 -1227106 -1307326 -1359642 -1188602 -1034206
18489 -1034206 -1060956 -1012015 -1192154 -1300548 -1189956 -1161587 -1155919 -1099472 -1298355 -1320438 -1395329
18478 -1395329 -1458778 -1246512 -914390 -790204 -732450 -862070 -892630 -833588 -621480 -475658
18468 -475658 -635805 -788266 -984055 -921332 -976398 -976601 -820430 -857817 -815735 -824127 -828928
18457 -828928 -723160 -743707 -641276 -541169 -482151 -426644 -448518 -625196 -721936 -774342 -441604
18446 -441604 -41930 111009 -180176 -362173 -227784 -235767 -307795 -339006 -451698 -462277
18436 -462277 -247211 -287765 -328304 -244369 -333322 -156029 -9551 172174 -66688 -196854
18426 -196854 -434711 -487857 -313437 -305429 -332665 -94193 76982 347934 173113 -8067
18416 -8067 -243773 -487327 -688102 -511331 -312385 -107003 -150180 71466 448808 624031
18406 624031 519252 281416 229635 11841 -295858 -195201 69757 141636 252045 160828
18396 160828 317411 431014 304626 230982 127168 -7526 -38018 100004 399518 408890
18386 408890 545847 508429 271304 226980 266610 402975 620282 741501 866683 776623
18376 776623 801436 608260 444071 541358 496870 593792 785037 883259 983988 938180 772307
18365 772307 912621 935928 775825 744250 705766 507577 134236 -4688 49455 445738
18355 445738 888847 810874 761727 866084 589580 806573 1271828 1478095 1204026 951284
18345 951284 844049 797502 817430 860084 872217 1022314 1315718 1393739 1596703 1758517
18335 1758517 1880531 1967227 2114422 2103383 1827408 1642647 1566749 1461528 1550218 1652731
18325 1652731 1718380 1772252 1610964 1618827 1812208 1631435 1449846 1662536 1742026 1849495
18315 1849495 2041831 2266563 2107145 2084292 2457635 2547032 2344521 2144478 2227127 2532413
18305 2532413 2602937 2499517 2240966 1935275 1863197 2036118 2165983 2256288 2376792 2546281
18295 2546281 2624931 2548621 2605916 2711406 2849360 2718327 2883819 3152097 3178784 3125968
18285 3125968 3053309 3188262 3340256 3298698 3328069 3328032 3056784 2880762 3062449 3393271 3643879
18274 3643879 3819336 3906019 3795341 3776222 3813528 3762740 3740763 3875606 3841486 3478813
18264 3478813 3116891 3220478 3594916 3983437 4161980 4139893 4212366 4609343 4776831 4828702
18254 4828702 4747117 4657604 4609866 4524574 4584226 4616393 4576113 4480214 4408020 4491993 4744212
18243 4744212 5003914 4925939 4710681 4926559 5216275 5588329 5580639 5770194 5918392 5663257
18233 5663257 5580553 5472796 5605228 5579262 5599758 5554182 5453837 5777939 6061600 6088849
18223 6088849 6310271 6466290 6525173 6592332 6854081 7216853 7269074 7303764 7307455 7148610
18213 7148610 7238732 7310613 7301544 7226844 7249660 7543213 7782325 7895036 8173511 8252306 8389587
18202 8389587 8591968 8609622 8614092 8710102 8895341 9270131 9351947 9269425 9373284 9707695
18192 9707695 9871689 10003888 10270310 10804527 11030646 11010881 10998182 11038222 11158135 11523014
18182 11523014 11774181 11898833 11985345 12199205 12436856 12824409 13276697 13630110 13879090
18173 13879090 13955802 14120154 14259961 14589905 14937808 15424813 15903424 16317793 16331615 16588514
18163 16588514 16572168 16726425 16990129 17460290 17963449 18280038 18705857 19335572 19748911
18154 19748911 20265517 20659861 21230003 21961306 22701754 23554029 24468831 25223629 25754871
18145 25754871 26320893 27233697 28245036 28878754 29409240 30323802 31396772 32657550 34001739
18136 34001739 35332557 36438128 37729977 39263016 40665796 42395468 44357065 46583303
18128 46583303 49085987 51627747 54549253 57868937 61332997 64904257 69189705 74214187
18120 74214187 80163612 86970438 94909057 104401454 115632084 128973077 145720940 166544090
18112 166544090 192899975 225608691 258575397 260847244 152364176 -82994676 -257134809
18105 -257134809 -277976764 -243377358 -207616974 -179157551 -156712657 -138692666 -124148748
18098 -124148748 -112432087 -102815919 -94969737 -88329910 -82464200 -77223789 -72673618 -68601409
18090 -68601409 -64798249 -61677611 -58948921 -56186198 -53779097 -51454481 -49226975 -47193029
18082 -47193029 -45424494 -43821825 -42442413 -40911340 -39711034 -38296498 -37297404 -36299784
18074 -36299784 -35108764 -34147500 -33331299 -32573082 -31780822 -31033365 -30298649 -29602531 -29135325
18065 -29135325 -28470262 -27630732 -27066235 -26562636 -26160506 -25794122 -25022998 -24318742 -24036157
18056 -24036157 -23840899 -23277813 -22888073 -22507202 -22160954 -21998492 -21521779 -21071404 -20895952
18047 -20895952 -20746319 -20386862 -20076350 -19734054 -19335215 -18904478 -18648944 -18549041 -18269327
18038 -18269327 -18079655 -17971931 -17830245 -17636380 -17175051 -16839042 -16449497 -16270201 -16246649
18029 -16246649 -16192230 -16227873 -16175249 -16062323 -15919463 -15646904 -15453846 -15275589 -15123028 -14917942
18019 -14917942 -14741293 -14633922 -14492070 -14269294 -14044867 -13727647 -13481048 -13643955 -13805979
18010 -13805979 -13887378 -13882292 -13932895 -13872593 -13724544 -13447785 -13238558 -12931404 -12513454 -12263545
18000 -12263545 -12198512 -12202566 -12230856 -12208303 -12239557 -12158645 -11996320 -11958635 -11929349 -11724524 -11544627
17989 -11544627 -11434591 -11429944 -11349907 -11372099 -11302852 -11252238 -11193449 -11105649 -11192892 -11272894 -11112215
17978 -11112215 -11203654 -11289025 -11157581 -11057304 -10698349 -10901775 -10936110 -10852007 -10598016 -10515173
17968 -10515173 -10255680 -9954441 -9958023 -10069265 -10343940 -10479971 -10250553 -10070181 -9897894 -9805567
17958 -9805567 -9612230 -9441097 -9558324 -9583937 -9764341 -9863718 -9771242 -9733115 -9883462 -9818777
17948 -9818777 -9597623 -9325999 -9256889 -9337530 -9351316 -9328114 -9208290 -9282330 -9191633 -8917632
17938 -8917632 -8668886 -8590392 -8764105 -8887455 -8801367 -8641707 -8662579 -8644041 -8398220 -8191475
17928 -8191475 -8358185 -8217191 -8342997 -8506854 -8363067 -8231304 -8105028 -7888589 -7853330 -7948820
17918 -7948820 -8036115 -8095232 -8241703 -8295247 -8308084 -8291837 -8194196 -8003221 -8073374 -8100026 -8142809
17907 -8142809 -8077668 -8057126 -8048724 -7841023 -7763390 -7619386 -7649655 -7516327 -7466435 -7411719 -7436576
17896 -7436576 -7525216 -7435106 -7421938 -7401864 -7179384 -7211821 -7324453 -7223567 -7173989 -7110598 -6863963
17885 -6863963 -7112953 -7338065 -7304229 -7118535 -7196158 -7143982 -7348871 -7357753 -7203950 -7203552 -6918747
17874 -6918747 -6663331 -6546542 -6672566 -6927018 -7228480 -7261227 -7256989 -7364567 -7293960 -6986089
17864 -6986089 -6945647 -6867896 -6902789 -6855312 -6693704 -6442831 -6419159 -6695470 -6823419 -6832341 -6853489
17853 -6853489 -6843180 -6832965 -6920159 -6889286 -6760281 -6608946 -6600861 -6618519 -6728811 -6765308 -6598275
17842 -6598275 -6295839 -6257382 -6190913 -6219151 -6251210 -6470049 -6366196 -6200970 -6289727 -6573281
17832 -6573281 -6645769 -6348382 -6156289 -5978778 -5955159 -6257925 -6284143 -6062937 -6080361 -6312214
17822 -6312214 -6316467 -6242499 -6183950 -6248558 -6320408 -6242078 -6087477 -5917992 -5715322 -5621206 -5653632
17811 -5653632 -5834389 -6058323 -6003346 -6166799 -5907230 -5931020 -6071888 -6290911 -6374643 -6308912
17801 -6308912 -6204987 -6000237 -5898601 -5759491 -5721549 -5507147 -5385287 -5379909 -5525119 -5690431
17791 -5690431 -5825334 -5734928 -5659946 -5670357 -5809040 -5843151 -5846984 -5819522 -5812276 -5928152 -5959538
17780 -5959538 -5644830 -5543594 -5506208 -5462742 -5501105 -5523508 -5462898 -5528851 -5769408 -5848902 -5538432
17769 -5538432 -5360280 -5636313 -5685853 -5617894 -5418923 -5535678 -5481747 -5235118 -5369645 -5436107
17759 -5436107 -5288253 -5018191 -5057706 -5139587 -5085405 -5119885 -5071777 -5112242 -5264411 -5356331 -5239383
17748 -5239383 -4920543 -4651328 -4744320 -4886367 -5003417 -5104420 -5211147 -5210454 -5359390 -5302895
17738 -5302895 -5199514 -5412666 -5364886 -5360327 -5289102 -5242605 -4972545 -4784008 -4709913 -4843498
17728 -4843498 -5001680 -5148710 -5112183 -5146860 -5182106 -5202892 -5177391 -4923491 -4801516 -4820316
17718 -4820316 -4902630 -4865254 -4828665 -4677519 -4301121 -4287626 -4589192 -5063654 -5004172 -5060169
17708 -5060169 -4960354 -4727056 -4629733 -4802329 -4679361 -4576216 -4551131 -4571466 -4529322 -4559737
17698 -4559737 -4590939 -4620099 -4658812 -4788011 -4860871 -4800450 -4583931 -4754564 -4816026 -4689772
17688 -4689772 -4938809 -4908811 -4786141 -4662885 -4612258 -4743125 -4672202 -4571814 -4557034 -4836456
17678 -4836456 -5074238 -5057596 -4637403 -4383807 -4254696 -4423266 -4327625 -4424587 -4757772 -4958744
17668 -4958744 -4928717 -4831601 -4512418 -4289077 -4466422 -4628359 -4617907 -4516225 -4622270 -4729951
17658 -4729951 -4757161 -4555396 -4580351 -4671291 -4621830 -4541365 -4618247 -4650137 -4515658 -4345581 -4480951
17647 -4480951 -4611205 -4611188 -4632532 -4568355 -4286290 -4454745 -4476135 -4440582 -4452510 -4424704 -4584150
17636 -4584150 -4459222 -4244650 -4137944 -4300960 -4272018 -4186055 -4093658 -3898748 -3760378 -3668758
17626 -3668758 -3591499 -3701645 -3860641 -4005802 -4099997 -4250910 -4367409 -4598920 -4341746 -4107732
17616 -4107732 -4088805 -4189873 -4252299 -4501614 -4530365 -4275324 -4042653 -3926203 -4188383 -4422200
17606 -4422200 -4319996 -4265316 -4215203 -4268956 -4187166 -4163807 -4118061 -4173399 -4302071 -4092222 -4101290
17595 -4101290 -4231363 -4256468 -4200369 -4070236 -4168638 -4301423 -3968971 -3717491 -3796878 -4004369
17585 -4004369 -3883552 -3900617 -3931517 -4021600 -4131364 -4171611 -4194946 -4123507 -4089296 -3886350 -3663956
17574 -3663956 -3680588 -3932342 -4069671 -4069737 -3944765 -3880823 -3949984 -3866398 -3963391 -3909347 -3927987
17563 -3927987 -3890496 -3792667 -3457712 -3425182 -3672114 -3733584 -3617629 -3742978 -3859269 -3833625
17553 -3833625 -3902643 -3977032 -4058411 -3927447 -4127177 -4370553 -4344371 -3935340 -3831356 -3791179
17543 -3791179 -3542020 -3464156 -3461323 -3547329 -3636176 -3488802 -3388018 -3323195 -3457351 -3607006
17533 -3607006 -3544510 -3534013 -3527987 -3422034 -3539660 -3632362 -3470581 -3381159 -3361386 -3261288 -3485816
17522 -3485816 -3693586 -3984631 -4062969 -3833051 -3976349 -3962067 -3800665 -3612752 -3486737 -3516583
17512 -3516583 -3405530 -3531182 -3591905 -3531116 -3321989 -3337918 -3265719 -3154481 -3182279 -3321696
17502 -3321696 -3332593 -3420300 -3364080 -3319677 -3396105 -3124146 -3098342 -3202491 -3277303 -3427137 -3457856
17491 -3457856 -3439649 -3479319 -3578894 -3557991 -3363588 -3368019 -3383495 -3532618 -3361119 -3038788 -2867387
17480 -2867387 -2856916 -3089418 -3296687 -3168821 -3113038 -2984963 -2900771 -2965943 -3196065 -3327610
17470 -3327610 -3285981 -3215207 -3122240 -2973259 -2963510 -3401325 -3555378 -3352536 -3125996 -3002049
17460 -3002049 -3054922 -2870647 -2797265 -2871905 -2813540 -2805158 -2843876 -2677606 -2584371 -2441793 -2701893
17449 -2701893 -3043801 -2866036 -2620224 -2601297 -2594030 -2451279 -2420305 -2703589 -3858801 -4761749
17439 -4761749 -4890051 -4763729 -4374287 -4392702 -4325716 -4120658 -3890877 -3863412 -3845281 -3860030
17429 -3860030 -3763993 -3699350 -3816332 -3727279 -3839094 -3830501 -3883781 -3969041 -3978071 -4124592 -4018442
17418 -4018442 -3823710 -3674545 -3351160 -3183325 -3365524 -3483056 -3459472 -3364233 -3440210 -3759526
17408 -3759526 -3743110 -3637215 -3547011 -3516109 -3538387 -3419592 -3520284 -3428951 -3244497 -3278701
17398 -3278701 -3530677 -3455677 -3596425 -3609452 -3452274 -3421965 -3533019 -3400316 -3359964 -3272596
17388 -3272596 -3328770 -3147240 -3173002 -3223037 -3078284 -3123055 -3183355 -3225735 -3200733 -3005464 -2911163
17377 -2911163 -2972987 -3073075 -3030484 -3140659 -3132256 -2897880 -2681291 -2615813 -3074275 -3259431
17367 -3259431 -3093722 -3138890 -3451061 -3642225 -3423463 -3021064 -2907445 -2970186 -2834198 -2736589
17357 -2736589 -2847303 -2864073 -2761699 -2884413 -3059429 -3075288 -2973332 -2916605 -2884532 -2963754
17347 -2963754 -3117954 -3125300 -3245962 -3394466 -3172650 -3224529 -3191294 -3157625 -3112086 -3094732 -3061824
17336 -3061824 -3049641 -3220223 -3292569 -3160633 -2921365 -2698436 -2756976 -3039746 -3109948 -3121566
17326 -3121566 -3056569 -3074673 -2879570 -2824004 -2721000 -2864676 -3142139 -3080873 -3054877 -3128801
17316 -3128801 -3081835 -3172566 -3197823 -3094766 -2951584 -2710291 -2663568 -2665097 -2895741 -3080676
17306 -3080676 -3200045 -3171486 -2942279 -3083529 -3017544 -2927896 -2962538 -2922261 -2870528 -2828730 -2849513
17295 -2849513 -2951010 -3055289 -3236229 -3152681 -3146550 -3181604 -2964839 -3054387 -3267692 -3204940
17285 -3204940 -3298295 -3055300 -2745569 -2614462 -2611214 -2678240 -2701080 -2980093 -2954491 -2957660 -3023074
17274 -3023074 -3202345 -3028621 -2896387 -2918293 -3112213 -3080060 -2996325 -3162671 -3407111 -3401573
17264 -3401573 -3230599 -3346075 -3086208 -3036962 -3065962 -3130119 -3060862 -3122380 -2991528 -2733058
17254 -2733058 -2487737 -2499739 -2270327 -2226116 -2269005 -2591339 -2755454 -2709968 -2587446 -2446547
17244 -2446547 -2500289 -2744526 -2981419 -3048361 -3125494 -3152932 -3008685 -2955238 -2933353 -2837362 -2950528
17233 -2950528 -2974138 -2800816 -2808514 -2819780 -2933392 -2963378 -2879576 -3010956 -3087455 -3271424 -3284275
17222 -3284275 -3158327 -3048322 -2898228 -2722275 -2889475 -3046381 -3144672 -3061352 -2923445 -2940001
17212 -2940001 -2695406 -2609017 -2490502 -2757106 -2968933 -2943366 -2700779 -2580139 -2749343 -2825911
17202 -2825911 -2778947 -2866126 -2781890 -2953313 -3144521 -3093894 -2774033 -2705517 -3030181 -2884175
17192 -2884175 -2799364 -2693689 -2398119 -2358961 -2311169 -2350523 -2366358 -2287547 -2122771 -2331800
17182 -2331800 -2612067 -2765901 -2919809 -3095724 -3108461 -2944319 -2896453 -2957371 -2904183 -2843341
17172 -2843341 -2889263 -2648531 -2659777 -2724326 -2574446 -2252130 -2388562 -2652072 -2751974 -2573407
17162 -2573407 -2282873 -2262777 -2298122 -2403499 -2558869 -2535716 -2432209 -2296556 -2322158 -2580932
17152 -2580932 -2520395 -2539451 -2798339 -2892035 -2908708 -2901885 -3039212 -3141973 -3178960 -2989180 -2721708
17141 -2721708 -2817252 -2700855 -2687543 -2601344 -2422931 -2380329 -2198817 -2258969 -2526083 -2463546
17131 -2463546 -2440998 -2808472 -2882462 -2975188 -3182310 -2984586 -2590198 -2453132 -2430278 -2645930
17121 -2645930 -2938461 -2761490 -2613855 -2658527 -2574242 -2599252 -2364279 -2339931 -2427544 -2377606
17111 -2377606 -2511615 -2532105 -2529107 -2575511 -2599283 -2666128 -2632456 -2640171 -2411537 -2432556 -2447180
17100 -2447180 -2600178 -2764184 -2729694 -2659532 -2896212 -2780732 -2745962 -2854656 -2862413 -2927219
17090 -2927219 -2713972 -2467336 -2554691 -2711782 -2689416 -2804089 -2845247 -2738324 -2703939 -2738693
17080 -2738693 -2678283 -2590046 -2654602 -2669058 -2763690 -2785782 -2822839 -2774144 -2424527 -2435773 -2509627
17069 -2509627 -2684752 -2726175 -2678036 -2719636 -2799876 -2849942 -2834799 -2844919 -2680104 -2510673 -2467791
17058 -2467791 -2600001 -2609875 -2454055 -2163746 -1966684 -1973307 -2078440 -2340662 -2614452 -2535019
17048 -2535019 -2437362 -2352342 -2425356 -2695953 -2575022 -2219337 -2269228 -2362330 -2370186 -2276189 -2301569
17037 -2301569 -2322608 -2204617 -2133513 -2361973 -2271985 -2079071 -2136011 -2434430 -2540115 -2345577
17027 -2345577 -2159434 -2265456 -2328124 -2279506 -2284180 -2484738 -2391403 -2323457 -2368652 -2370792 -2378998
17016 -2378998 -2437503 -2518204 -2584055 -2505068 -2508127 -2528328 -2312721 -2289583 -2142835 -2116946 -2262691
17005 -2262691 -2428763 -2531403 -2634297 -2738412 -2693465 -2488025 -2539323 -2541705 -2466505 -2531968
16995 -2531968 -2743245 -2625774 -2425609 -2306049 -2208025 -2065704 -2301053 -2441536 -2702678 -2712384
16985 -2712384 -2645241 -2517616 -2586438 -2312411 -2271666 -2481757 -2580521 -2508259 -2307578 -2261612
16975 -2261612 -2432546 -2375618 -2491085 -2486252 -2479355 -2375094 -2367652 -2446392 -2435407 -2367780 -2473600
16964 -2473600 -2483881 -2526042 -2581165 -2497962 -2386790 -2489636 -2457256 -2367711 -2614308 -2672587 -2438565
16953 -2438565 -2251370 -2466601 -2376102 -2316926 -2215432 -2091388 -2231814 -2319599 -2486738 -2427633
16943 -2427633 -2058981 -1994061 -2295208 -2454847 -2308651 -2312711 -2365117 -2331939 -2438938 -2629959
16933 -2629959 -2630977 -2452261 -2567240 -2319492 -2217540 -2215638 -2204496 -2309152 -2405968 -2048137
16923 -2048137 -1836911 -2005280 -2248818 -2274907 -2333049 -2291605 -2364298 -2397529 -2284122 -2333118
16913 -2333118 -2260695 -2165078 -2209750 -2250894 -2224277 -2279377 -2338717 -2310184 -2284366 -2350604 -2593147
16902 -2593147 -2927288 -2734863 -2647751 -2383210 -2187692 -1876101 -1898085 -2141565 -2055890 -2011072
16892 -2011072 -2035410 -2137077 -2283286 -2470946 -2277712 -2014522 -1941697 -2056364 -2217368 -2218347
16882 -2218347 -2419902 -2335014 -2227481 -2253909 -2365741 -2351691 -2280746 -2185625 -2266137 -2317235 -2365748
16871 -2365748 -2358298 -2164811 -2123269 -2256492 -2463076 -2465395 -2352051 -2190056 -2014834 -2090512
16861 -2090512 -1998386 -1921322 -1755666 -1669221 -1810399 -2006117 -2051897 -2167752 -2421523 -2646127
16851 -2646127 -2392148 -2206991 -2111571 -2274755 -2304635 -2177754 -2051555 -2259723 -2487945 -2606459
16841 -2606459 -2692179 -2486262 -2310533 -2205890 -2059821 -2073811 -2047605 -2059124 -2168504 -2168371 -2364777
16830 -2364777 -2406850 -2418303 -2141694 -2043424 -2079745 -2093083 -2213928 -2194659 -2370505 -2390526 -2280629
16819 -2280629 -2311691 -2428286 -2500735 -2458865 -2443072 -2508014 -2412079 -2346791 -2493255 -2612789 -2619709
16808 -2619709 -2566337 -2329838 -2246382 -2334028 -2248145 -2199975 -2324381 -2439676 -2372570 -2295582 -2261269
16797 -2261269 -2337707 -2354872 -2242283 -2286238 -2264293 -2189438 -2116756 -2076710 -1926123 -1998353 -2268549
16786 -2268549 -2176405 -2064023 -1936622 -1853627 -1853751 -1940377 -2070027 -2008556 -2086313 -2180937 -2329187
16775 -2329187 -2184460 -2320192 -2383747 -2368089 -2423161 -2226627 -1946378 -2125795 -2181830 -2084397
16765 -2084397 -2316890 -2409993 -2353326 -2484834 -2416451 -2239792 -2055654 -2032399 -2014635 -2182313
16755 -2182313 -2340546 -2388697 -2165863 -2173078 -2325217 -2255848 -2037348 -1646931 -1577557 -1571653 -1628841
16744 -1628841 -1554507 -1390307 -1332971 -1487004 -1891722 -2303110 -2303789 -2107209 -2049897 -2167971
16734 -2167971 -2141441 -1971719 -2061191 -2199810 -2260610 -2093356 -2181037 -2156376 -2152249 -2155014 -2337085
16723 -2337085 -2305408 -2192734 -2143182 -2149087 -2178346 -2223693 -2108131 -2171652 -2325176 -2435228 -2541041
16712 -2541041 -2523461 -2608758 -2425362 -2173976 -2043782 -2198458 -2051929 -1822193 -1495130 -1497431
16702 -1497431 -1777168 -1892458 -1896926 -1952854 -1795757 -1626609 -1702806 -1965586 -1939877 -1986969
16692 -1986969 -2298941 -2301058 -2187798 -2234367 -2315088 -2291245 -2171046 -2037364 -1964414 -1908987 -2052976
16681 -2052976 -2101836 -1891329 -1881410 -1831175 -1799313 -1835749 -1709310 -1723105 -1791186 -1944132 -2137928
16670 -2137928 -1968587 -1671733 -1694711 -1953507 -2181689 -2172626 -2034778 -2070044 -2056064 -2041239
16660 -2041239 -2140751 -2079430 -2061046 -2150078 -2075104 -1848800 -1745962 -1848728 -1814521 -1730641 -1937983
16649 -1937983 -1863769 -1919854 -1948736 -1955119 -1914987 -1691402 -1739607 -1766832 -1887360 -2160364 -2060334
16638 -2060334 -1775903 -1757007 -1959574 -1916505 -1793555 -1803403 -1835177 -1858086 -1644645 -1394356
16628 -1394356 -1407902 -1445083 -1548072 -1745717 -1918253 -1693696 -1731661 -1928268 -1797228 -1638344
16618 -1638344 -1565102 -1713252 -1994158 -1948194 -1783599 -1859699 -1861438 -1778269 -1717833 -1774870 -1777222
16607 -1777222 -1743730 -1855515 -1879125 -1626554 -1482052 -1658373 -1790272 -1815083 -1811322 -1789547
16597 -1789547 -1995513 -2001936 -2118677 -2255635 -2221494 -2393860 -2177933 -1955664 -1812476 -1632182
16587 -1632182 -1651911 -1601552 -1681705 -1720751 -1723824 -1958263 -1926755 -1576985 -1524363 -1657685 -1598739
16576 -1598739 -1725761 -1875150 -2021321 -1889857 -1812366 -1935067 -1887239 -1705819 -1784960 -1769847
16566 -1769847 -1852826 -1920995 -1953858 -1913189 -2033437 -2170606 -2011074 -1967455 -1946475 -2016802 -2127404
16555 -2127404 -2001412 -1845566 -1906632 -1699618 -1711739 -1826454 -1676720 -1574446 -1739695 -1967973
16545 -1967973 -1970238 -1962788 -1861407 -1801627 -1752920 -1534802 -1499021 -1598385 -1736553 -1855594 -1909527
16534 -1909527 -1741955 -1810380 -2013717 -2158099 -2015178 -1746545 -1854323 -2116043 -2190672 -2085159
16524 -2085159 -2164991 -2300055 -2111930 -1773677 -1770654 -1983319 -2113532 -1768208 -1545856 -1501704
16514 -1501704 -1548548 -1808186 -1941838 -1825789 -1527177 -1355618 -1628225 -1820399 -1723438 -1682997
16504 -1682997 -1622550 -1851832 -2009679 -1969113 -2013462 -2176601 -2225269 -1840991 -1581054 -1516678
16494 -1516678 -1620303 -1783928 -1868402 -1928174 -1841375 -1794455 -1912853 -1796221 -1473803 -1409208
16484 -1409208 -1688912 -1723956 -1644569 -1824576 -1796801 -1670660 -1545839 -1684564 -1891322 -1896333
16474 -1896333 -1743346 -1597514 -1654094 -1583633 -1587629 -1526036 -1628235 -1579611 -1532704 -1630943 -1632920
16463 -1632920 -1582856 -1659456 -1795328 -1757143 -1668527 -1578597 -1426962 -1474872 -1848251 -1900531 -1767742
16452 -1767742 -1724232 -1704794 -1687441 -1746855 -1592365 -1681308 -1609763 -1549162 -1419142 -1343783 -1482655
16441 -1482655 -1562825 -1730253 -1767102 -1726072 -1570179 -1428481 -1235383 -1468528 -1893380 -1807643
16431 -1807643 -1566365 -1489596 -1459618 -1607183 -1648592 -1499261 -1418968 -1579750 -1454636 -1515556
16421 -1515556 -1666679 -1628945 -1681710 -1819724 -1984523 -2125354 -2186390 -2024890 -1690173 -1429522
16411 -1429522 -1286712 -1274566 -1438072 -1573103 -1672646 -1666513 -1844559 -1842501 -1742183 -2065409
16401 -2065409 -2078212 -1908026 -1762406 -1708811 -1554486 -1511058 -1534011 -1780919 -1791128 -1657378
16391 -1657378 -1782573 -1805364 -1726706 -1730289 -1679427 -1687884 -1514455 -1608371 -1600347 -1618749 -1749467
16380 -1749467 -1746795 -1693135 -1540557 -1619987 -1628160 -1345055 -1332282 -1427242 -1783417 -1745117 -1623933
16369 -1623933 -1506082 -1635144 -1716210 -1535867 -1786928 -1961079 -1900147 -1985085 -1801527 -1670819
16359 -1670819 -1734868 -1844234 -1618005 -1592762 -1640517 -1686271 -1820245 -1680810 -1782233 -1536622
16349 -1536622 -1365923 -1459692 -1581193 -1769576 -1745558 -1613889 -1362766 -1299375 -1563578 -1501979
16339 -1501979 -1546992 -1578252 -1389028 -1368183 -1336121 -1337322 -1430026 -1477272 -1582716 -1607787 -1640355
16328 -1640355 -1651888 -1661456 -1578429 -1507600 -1486135 -1265749 -1401717 -1649704 -1553041 -1379976 -1179138
16317 -1179138 -1105166 -1052951 -1283051 -1317419 -1329664 -1103255 -1039259 -1254505 -1388921 -1501714
16307 -1501714 -1835288 -1819099 -1786997 -1745819 -1518548 -1390340 -1508420 -1634348 -1717158 -1557003
16297 -1557003 -1613252 -1533328 -1704343 -1851253 -1673731 -1494555 -1545281 -1638834 -1678640 -1913374
16287 -1913374 -2034414 -1960974 -1908517 -1618488 -1415605 -1550226 -1722242 -1736064 -1617859 -1623129
16277 -1623129 -1648938 -1861324 -1810463 -1411331 -1270814 -1370280 -1573819 -1554414 -1456562 -1613454
16267 -1613454 -1868506 -1936475 -1953600 -1813701 -1752818 -1543567 -1422547 -1438083 -1666576 -1570385
16257 -1570385 -1480604 -1326582 -1280193 -1451978 -1642719 -1845913 -2052016 -1895798 -1524896 -1525416
16247 -1525416 -1643092 -1311822 -1410658 -1582045 -1596159 -1557961 -1580246 -1612912 -1547403 -1408704
16237 -1408704 -1387503 -1593768 -1706256 -1684730 -1424985 -1331046 -1137945 -1513732 -1652439 -1460259
16227 -1460259 -1401639 -1536133 -1686656 -1691558 -1525501 -1375734 -1428361 -1702034 -1645425 -1326727
16217 -1326727 -1300285 -1255897 -1219054 -1368635 -1462034 -1520969 -1592456 -1526319 -1444433 -1651764 -1565836
16206 -1565836 -1772151 -2041418 -1903303 -2141883 -2095544 -1857915 -1776472 -1624753 -1271064 -1232749
16196 -1232749 -1509864 -1596247 -1699823 -1511208 -1373992 -1428389 -1467963 -1499107 -1664985 -1546647
16186 -1546647 -1331722 -1390357 -1433250 -1346428 -1294270 -1404425 -1536273 -1735202 -1688904 -1515922
16176 -1515922 -1664307 -1803530 -1619682 -1573186 -1470277 -1300695 -1296139 -1524604 -1503990 -1334307
16166 -1334307 -1447110 -1400108 -1539621 -1505353 -1606693 -1464078 -1787047 -1909775 -1678285 -1689802
16156 -1689802 -1888938 -1769400 -1358803 -1461263 -1529112 -1427799 -1496255 -1552078 -1492777 -1595882
16146 -1595882 -1762326 -1760602 -1607986 -1383204 -1456532 -1504916 -1637750 -1766985 -1703676 -1515186
16136 -1515186 -1423531 -1417887 -1368953 -1391501 -1786633 -1825217 -1509083 -1399577 -1165114 -1203430 -1278999
16125 -1278999 -1362820 -1420927 -1131449 -1049521 -1038706 -838651 -1158936 -1179343 -1241547 -1206521 -1119516
16114 -1119516 -1041948 -1251648 -1447205 -1608737 -1639662 -1906459 -1987969 -1867027 -1650887 -1622695
16104 -1622695 -1566336 -1485544 -1506168 -1506996 -1370961 -1492633 -1641703 -1485982 -1438985 -1588468 -1748884
16093 -1748884 -1751013 -1603054 -1496943 -1336149 -1318372 -1401518 -1185793 -1085181 -1166672 -1545711
16083 -1545711 -1770971 -1646152 -1548928 -1222420 -1072596 -1074255 -1125627 -962971 -1086006 -963390
16073 -963390 -1082768 -1223872 -1210005 -1477318 -1546938 -1265136 -1270302 -1323977 -1424170 -1461766 -1431700
16062 -1431700 -1402451 -1283330 -1156011 -1141777 -1278392 -1408381 -1663132 -1755293 -1652289 -1679164
16052 -1679164 -1524072 -1449212 -1471514 -1417161 -1474142 -1447884 -1362889 -1116040 -1092834 -1250551 -1319140
16041 -1319140 -1633813 -1771058 -1780814 -1483483 -1108437 -1138329 -1212924 -1364694 -1503728 -1573802
16031 -1573802 -1611818 -1683598 -1724442 -1348653 -1357163 -1528545 -1430791 -1372307 -1371184 -1122844 -1313247
16020 -1313247 -1513514 -1528203 -1405614 -1511997 -1473420 -1293921 -1329221 -1365078 -1365059 -1350839 -1376225
16009 -1376225 -1367015 -1676106 -1725980 -1499816 -1442057 -1316232 -1133569 -1096290 -1155248 -1342848
15999 -1342848 -1238447 -1179232 -1447300 -1483837 -1602914 -1774465 -1382193 -1318871 -1326249 -1285236
15989 -1285236 -1520757 -1523283 -1504588 -1662365 -1696035 -1549225 -1511486 -1420862 -1247145 -1137833
15979 -1137833 -1119919 -1201708 -1394986 -1513864 -1433468 -1478840 -1480718 -1481528 -1271030 -1148337 -1206749
15968 -1206749 -1369330 -1389677 -1555214 -1680534 -1736570 -1723797 -1649797 -1504074 -1455841 -1649949
15958 -1649949 -1549861 -1234535 -998078 -1021889 -1185877 -1354806 -1372297 -1166472 -1016967 -902652
15948 -902652 -1047749 -1284459 -1312850 -1327893 -1364437 -1187877 -1328317 -1460734 -1526271 -1547886
15938 -1547886 -1487000 -1188158 -1180469 -1566193 -1572843 -1500182 -1361167 -1511357 -1556639 -1685250 -1596583
15927 -1596583 -1585097 -1700718 -1742068 -1553487 -1475236 -1362510 -1519705 -1584803 -1298510 -1163108
15917 -1163108 -1353283 -1534544 -1538989 -1490320 -1416681 -1372612 -1444116 -1599710 -1584106 -1676611 -1695998
15906 -1695998 -1703008 -1757839 -1734369 -1866490 -1887154 -1793122 -1476210 -1279353 -1244815 -1241121 -1367778
15895 -1367778 -1455302 -1568502 -1650575 -1570409 -1555913 -1688750 -1625958 -1409721 -1386126 -1661123
15885 -1661123 -1551863 -1329946 -1353852 -1313379 -1210023 -1107005 -1375093 -1583593 -1652600 -1473085
15875 -1473085 -1301043 -992190 -917446 -1003278 -1232121 -1300218 -1430514 -1386981 -1287210 -1337514
15865 -1337514 -1223628 -1193246 -1342537 -1374767 -1479918 -1485020 -1329269 -1403968 -1333201 -1350315 -1256034
15854 -1256034 -1324349 -1272579 -1339388 -1336288 -1348708 -1385816 -1519191 -1483909 -1340447 -1187947 -1234431
15843 -1234431 -1316513 -1143788 -1110970 -1070631 -1136906 -1202786 -1246451 -1323975 -1320682 -1205545 -1112861
15832 -1112861 -1157659 -1153008 -1098152 -1206370 -1271471 -1172883 -1240779 -1192719 -1255763 -1158292 -1175956
15821 -1175956 -1240660 -1329617 -1195862 -1083029 -918335 -639972 -678753 -970939 -1100367 -1340653
15811 -1340653 -1412430 -1499742 -1156989 -1228510 -1093612 -899707 -766070 -933330 -1354890 -1252844
15801 -1252844 -1018713 -1118247 -1242519 -1413188 -1451460 -1489670 -1139119 -1226284 -1206615 -1195099
15791 -1195099 -1369904 -1543274 -1409531 -1210441 -1196062 -1342744 -1323316 -1329001 -1423232 -1322481
15781 -1322481 -1304421 -1292444 -1244194 -1317720 -1350854 -1314538 -1134191 -1120806 -1342703 -1462239 -1262351
15770 -1262351 -1218875 -1343270 -1330417 -1285043 -1129793 -979506 -1046893 -944066 -684511 -768111
15760 -768111 -938748 -919174 -1179151 -1593199 -1625060 -1613711 -1384218 -1473879 -1344243 -1366065
15750 -1366065 -1554838 -1345962 -1232042 -1211275 -1349272 -1111310 -1018454 -1097862 -1106979 -1271385
15740 -1271385 -1583918 -1631195 -1663861 -1482598 -1379304 -1552227 -1608861 -1553706 -1531515 -1549095
15730 -1549095 -1360678 -1274637 -1270985 -1320747 -1187151 -1049326 -973705 -849475 -977864 -1164400
15720 -1164400 -1201525 -1341342 -1497756 -1471731 -1429335 -1372271 -1339425 -1321233 -1151770 -1159931 -1155470
15709 -1155470 -1390242 -1435441 -1314057 -909586 -806514 -967959 -1181927 -1266014 -1227103 -1290119
15699 -1290119 -1369522 -1416591 -1317843 -1271728 -1041388 -921618 -927633 -1125347 -1318982 -1235279 -1046767
15688 -1046767 -974153 -1018067 -1055852 -971319 -1202002 -1150627 -1091095 -1062940 -926658 -886028 -991509
15677 -991509 -1256294 -1483702 -1394467 -1387589 -1223815 -1152270 -1116073 -1215636 -1370347 -1243569 -1097583
15666 -1097583 -1224833 -1430423 -1470536 -1263203 -1378124 -1661231 -1489911 -1130160 -938640 -909648
15656 -909648 -961383 -1156404 -1218889 -1331498 -1236628 -1156008 -1258815 -1362413 -1375981 -1390604 -1431546
15645 -1431546 -1587231 -1723791 -1637717 -1441310 -1258489 -1095431 -1046198 -1015138 -1193234 -1309351
15635 -1309351 -1200710 -1089784 -1022754 -1168999 -1339528 -1486089 -1401258 -1282255 -1326854 -1428479
15625 -1428479 -1460996 -1300741 -1353914 -1269614 -1229721 -1195841 -1235851 -1313233 -1261722 -1126137 -860883
15614 -860883 -1047138 -1334091 -1453931 -1304233 -1406237 -1357603 -1164797 -1166868 -965113 -1070599
15604 -1070599 -1332418 -1389386 -1315350 -1212330 -1056041 -1023481 -1157939 -1285194 -1430930 -1434375
15594 -1434375 -1609802 -1595440 -1513238 -1298193 -1112401 -1216317 -1269603 -1337126 -1257349 -982129
15584 -982129 -1002726 -1140719 -1290632 -1428542 -1308912 -1175211 -1225235 -1008385 -1027526 -1079600
15574 -1079600 -994661 -1117390 -1092925 -1021237 -1248960 -1292607 -1182125 -1113918 -1095778 -1182047 -1114193
15563 -1114193 -995607 -1358053 -1455211 -1507646 -1485473 -1560905 -1535699 -1414545 -1380891 -1086747
15553 -1086747 -924598 -1096026 -1339615 -1348083 -1172536 -1086196 -1167256 -1158182 -1233129 -1267778 -1382739
15542 -1382739 -1496180 -1396577 -1283547 -1383343 -1530581 -1597261 -1412923 -1251034 -1259710 -1303892
15532 -1303892 -1173122 -980100 -913911 -945511 -864865 -696199 -665186 -790913 -1071012 -1280406
15522 -1280406 -1169916 -1339164 -1461360 -1328688 -1245822 -1386319 -1349401 -1320198 -1401400 -996725
15512 -996725 -978905 -1101021 -1122625 -1101362 -1116170 -937318 -943127 -1058813 -1215230 -1191326 -1179064
15501 -1179064 -1185453 -1169983 -820488 -868346 -1077170 -1312128 -1465077 -1367826 -1173120 -1099540
15491 -1099540 -1226939 -1383917 -1339325 -1335382 -1413913 -1327389 -1143872 -1056813 -1243073 -1199930 -1156007
15480 -1156007 -1073359 -1024948 -1022772 -1159310 -1203033 -1121534 -1063252 -1103317 -1203914 -952941 -1215949
15469 -1215949 -1343607 -1140663 -1204337 -1224352 -1292661 -1394538 -1408651 -1640281 -1489975 -1167525
15459 -1167525 -895322 -976647 -1080639 -1116572 -934960 -853443 -1009813 -1005887 -997058 -858028 -836234
15448 -836234 -1332525 -1147303 -892957 -828035 -927145 -857524 -721321 -768248 -791779 -883452 -1139375
15437 -1139375 -1138932 -1181891 -1234790 -1029546 -1055355 -1193867 -1361143 -1259191 -1324963 -1120560 -1011740
15426 -1011740 -1085952 -1068578 -1073988 -1078227 -1083063 -1103640 -1139643 -1243115 -1124903 -1062907 -1259325
15415 -1259325 -1592898 -1505316 -1270348 -1024547 -1155591 -1081402 -1040230 -978488 -884876 -1073580
15405 -1073580 -1193413 -1024426 -994482 -1013338 -938149 -752472 -882887 -892123 -1093923 -1461852
15395 -1461852 -1449359 -1325120 -1317357 -1197867 -1243227 -1250329 -1253332 -1052534 -1023014 -1000241 -1022581
15384 -1022581 -1084506 -1131751 -977873 -875050 -719068 -758331 -929260 -1220588 -1160941 -889289
15374 -889289 -788679 -1004359 -1362543 -1384775 -1155424 -1059378 -894330 -750697 -845928 -810616
15364 -810616 -983541 -1176185 -1173369 -1026453 -920421 -712777 -648170 -619407 -772343 -731489
15354 -731489 -832491 -955256 -971196 -990338 -1010389 -838501 -645538 -678105 -777561 -965936
15344 -965936 -1180176 -1422184 -1647304 -1520226 -1135244 -1214118 -1132143 -1142022 -1079359 -1172349 -1273135
15333 -1273135 -1384902 -1398164 -1234651 -1089758 -980656 -868204 -844579 -786736 -983723 -1080261
15323 -1080261 -955295 -731038 -719691 -870099 -1064291 -1195494 -1432120 -1351330 -1193866 -825403
15313 -825403 -684180 -996167 -1017933 -957322 -1144312 -1384746 -1309550 -1129032 -1092393 -1165073
15303 -1165073 -973652 -751551 -768001 -1032168 -1160874 -1062513 -768631 -612662 -763927 -827798
15293 -827798 -900875 -867208 -1001171 -968207 -775018 -702049 -700935 -766700 -885609 -872278 -812378
15282 -812378 -917125 -1135863 -1110060 -994928 -970978 -814908 -765682 -795950 -551198 -657656
15272 -657656 -992357 -1003827 -1073462 -807188 -934515 -986085 -973509 -1113458 -1108538 -1081756 -964461
15261 -964461 -958842 -915869 -702398 -908461 -845204 -713388 -901574 -1204701 -1431149 -1279199
15251 -1279199 -1181466 -1320044 -1358121 -1504308 -1425510 -1382539 -1410647 -1433175 -1294313 -1033322
15241 -1033322 -970200 -670807 -540754 -886312 -1270806 -1151747 -1261295 -1370437 -1254997 -1086170
15231 -1086170 -1073268 -953145 -1060768 -1277159 -1554030 -1745868 -1613135 -1406998 -1102594 -969064
15221 -969064 -1061392 -1249003 -1420066 -1425240 -1045299 -891047 -1202460 -1171530 -912413 -884736
15211 -884736 -737216 -703967 -750272 -763059 -861843 -1211247 -1537957 -1473323 -1243443 -975134
15201 -975134 -632899 -700160 -795994 -660270 -756168 -1130339 -1042243 -1042033 -1195583 -1194533 -1088802
15190 -1088802 -950017 -898541 -807771 -833854 -876602 -916725 -934529 -789765 -643405 -584127 -610909
15179 -610909 -739620 -963860 -1068995 -859238 -822942 -726451 -814159 -996283 -852387 -1100835
15169 -1100835 -1506121 -1569980 -1318710 -1219982 -1149104 -979579 -863569 -878652 -854242 -737138
15159 -737138 -730200 -857906 -927156 -866694 -785909 -751314 -794384 -1073973 -1005507 -969037 -866472
15148 -866472 -708595 -830098 -1006384 -1039082 -1057716 -1018580 -803868 -829683 -1173500 -1167678 -1145450
15137 -1145450 -1361540 -1300779 -1216780 -1175517 -836974 -972398 -1053794 -1092800 -1085339 -924864 -700564
15126 -700564 -837731 -881607 -1025930 -1058790 -1098985 -1151603 -1046368 -989660 -1021245 -954302 -863170
15115 -863170 -716742 -695964 -708709 -817775 -979528 -1037925 -977984 -1050768 -991113 -983187 -1058108
15104 -1058108 -1009161 -1268569 -1273218 -1203402 -1043039 -868123 -916241 -769261 -874008 -906965
15094 -906965 -824634 -804411 -789857 -708256 -775914 -870361 -862294 -1079115 -1013531 -1049168 -886336
15083 -886336 -783551 -924244 -1325638 -1063712 -884530 -762805 -806821 -855255 -840477 -783892
15073 -783892 -912589 -1069526 -984293 -762412 -863279 -905579 -1177193 -1501935 -1375128 -1325898
15063 -1325898 -1308528 -1177659 -763290 -414046 -581076 -472040 -444553 -519973 -712195 -665894
15053 -665894 -731535 -588313 -503197 -454518 -463586 -359992 -501227 -572066 -456413 -384465 -687574
15042 -687574 -709085 -859501 -888322 -1008135 -948341 -604917 -376954 -296784 -147561 -219209
15032 -219209 -477987 -757719 -791725 -688604 -516522 -677523 -571308 -513308 -497197 -653824
15022 -653824 -568718 -536514 -614178 -267682 -353245 -437387 -402449 -274095 -117749 -129841 89533
15011 89533 413462 965384 1415889 1619936 1914171 2294862 2303686 1162605 -1712960 -4046957
15001 -4046957 -4412028 -4017484 -3578898 -3188407 -3010641 -2772386 -2253850 -2070306 -2175118
14992 -2175118 -2196319 -2117213 -2150448 -2125026 -2130702 -2018750 -2061774 -2190443 -2184330 -1996252 -1729390
14981 -1729390 -1433524 -1510916 -1694827 -1595271 -1563094 -1628001 -1326457 -1178613 -1325429 -1581328
14971 -1581328 -1509193 -1209146 -1348826 -1527978 -1320742 -1119645 -1154957 -1124837 -1148936 -1289951
14961 -1289951 -1259840 -1202884 -1178143 -1123212 -1265615 -1389300 -1347269 -1394089 -1403177 -1397952 -1228896
14950 -1228896 -1341704 -1405659 -1022841 -830789 -815881 -1139891 -1250083 -1224864 -1192392 -1055447
14940 -1055447 -1092690 -1141525 -1201431 -1179552 -1132505 -1023550 -933836 -939331 -1153342 -1154674 -1101358
14929 -1101358 -844711 -1066378 -988370 -1068497 -924213 -1074794 -1111803 -886832 -876897 -1052647
14919 -1052647 -1188351 -1034799 -1160715 -1240710 -991150 -943338 -1052093 -987075 -828895 -894710
14909 -894710 -1087053 -1278551 -1296759 -1164804 -1031977 -1102492 -1197735 -1281146 -1134945 -1027742
14899 -1027742 -852916 -811514 -1093577 -871965 -714708 -849429 -1139125 -1384906 -1377944 -1293297
14889 -1293297 -1160497 -1344306 -1404611 -1373958 -1205082 -989547 -798211 -697949 -766302 -999092
14879 -999092 -1057721 -1202585 -1352532 -1294220 -1384000 -1639411 -1664130 -1591071 -1519847 -1440535 -1406149
14868 -1406149 -1198890 -1182982 -1185772 -1177356 -1037633 -950332 -768042 -885501 -1008729 -853813
14858 -853813 -853754 -1059667 -1212590 -1260121 -1356962 -1182789 -1000993 -831258 -860385 -872676 -1110317
14847 -1110317 -925801 -880627 -833792 -982150 -1075806 -1053094 -882916 -896490 -869251 -800921 -995706
14836 -995706 -1172944 -1310104 -1393454 -1188591 -1041393 -1167552 -1302804 -1366293 -1021823 -795131
14826 -795131 -801301 -950663 -1109252 -1360340 -1172237 -1123052 -1064951 -947535 -1044729 -1048878 -1173350
14815 -1173350 -1073497 -878278 -925211 -957147 -903827 -1129386 -1043256 -1076001 -1117348 -1262004 -1247421
14804 -1247421 -1116952 -985283 -991257 -1093027 -1187814 -1142308 -801972 -551566 -676858 -587761
14794 -587761 -571394 -703940 -644405 -636855 -949018 -1010494 -1008891 -807575 -727295 -1046131 -1078471
14783 -1078471 -943870 -693216 -940353 -1090399 -962495 -1076521 -1286641 -1285438 -840773 -580336
14773 -580336 -739009 -952240 -1031204 -883451 -897315 -824462 -785226 -831503 -792662 -840324 -1084850
14762 -1084850 -1254599 -1197545 -1159003 -1170701 -925737 -966688 -1308932 -1311087 -1155078 -1234642 -1209871
14751 -1209871 -1227154 -1451686 -1392192 -1349074 -1322789 -1263619 -1152242 -1079311 -831620 -768761 -977206
14740 -977206 -1496973 -1286164 -1114654 -1153171 -1173026 -1067183 -1060506 -878409 -781283 -808660 -920591
14729 -920591 -1183540 -1285007 -1065283 -952315 -803086 -742344 -720610 -719565 -921027 -1105264
14719 -1105264 -1124448 -1064788 -1081952 -1020862 -1066454 -1149265 -1132819 -1186298 -1223694 -1177981 -1247967
14708 -1247967 -1342687 -1396699 -1127953 -1149744 -1177707 -1164939 -1119268 -980900 -788277 -783799 -966119
14697 -966119 -1122060 -1027592 -993844 -922252 -573175 -266868 -334467 -492086 -493740 -576465 -433783
14686 -433783 -581321 -489432 -578784 -871629 -1276614 -1244687 -941463 -735716 -600207 -493985
14676 -493985 -566169 -680533 -778525 -838995 -806388 -909176 -868532 -865381 -860392 -781103 -843289
14665 -843289 -767753 -674333 -851131 -773617 -915088 -1105053 -1189583 -1091996 -951220 -967773 -900176
14654 -900176 -961571 -1280616 -1555895 -1345737 -1147781 -1124549 -1110847 -1224500 -1301373 -1340598
14644 -1340598 -1220137 -1040664 -1072402 -1115328 -970441 -692937 -659113 -789221 -808443 -706008
14634 -706008 -512207 -548215 -660651 -666680 -840231 -1183674 -1256965 -1309364 -1325384 -1288031 -1221354
14623 -1221354 -1102436 -865601 -884547 -972468 -923484 -1041536 -967206 -995718 -1014679 -1183609
14613 -1183609 -1156623 -852202 -1010417 -969183 -1001144 -1008114 -1130794 -985316 -771721 -838518
14603 -838518 -635355 -658099 -653275 -653895 -674127 -598248 -752435 -1176834 -1122421 -1098163 -1019254
14592 -1019254 -899126 -1040713 -1133037 -983465 -735113 -908563 -886841 -753235 -503162 -589921
14582 -589921 -594689 -935214 -1139553 -1180803 -1113828 -1211294 -1209097 -1372182 -1346465 -1215371 -1185923
14571 -1185923 -1161049 -979400 -734491 -623460 -623798 -633068 -657937 -688081 -949841 -1120011 -937111
14560 -937111 -735578 -776515 -928454 -887232 -838408 -757736 -927129 -893788 -901259 -820876 -772278
14549 -772278 -855228 -852438 -1036029 -1312713 -1075447 -925547 -946560 -1228685 -1340520 -1217082
14539 -1217082 -1052115 -808420 -661906 -718265 -882986 -769327 -746179 -704074 -664082 -751769
14529 -751769 -995888 -973167 -726445 -462946 -332451 -512038 -707953 -629130 -630965 -866315
14519 -866315 -1124894 -1088537 -1146265 -1152743 -1273798 -1217803 -1088123 -1149865 -1126183 -989004 -736878
14508 -736878 -614789 -544171 -535557 -770803 -924554 -931402 -891128 -747738 -661548 -596278 -546826
14497 -546826 -540428 -568050 -628298 -641203 -825186 -932883 -803672 -601342 -843877 -884593 -926355
14486 -926355 -908629 -1055537 -1025963 -851485 -750786 -791562 -879561 -1171976 -1305782 -1159352
14476 -1159352 -849725 -723150 -805893 -883059 -896054 -726627 -437683 -467762 -464685 -681844
14466 -681844 -1000063 -1103789 -848289 -493751 -420763 -774491 -875387 -930839 -970993 -902597
14456 -902597 -726807 -840942 -927445 -1049469 -1036251 -1204664 -1260533 -1157160 -993998 -1038255
14446 -1038255 -1046895 -1004843 -973866 -1023129 -1286327 -1253325 -1303245 -1313413 -1085452 -1133242 -1018232
14435 -1018232 -1039898 -1091706 -1080586 -890738 -803034 -938947 -940813 -1041684 -987420 -978948 -998680
14424 -998680 -734015 -662389 -783503 -858313 -855648 -797227 -847190 -785362 -851172 -572301 -744934
14413 -744934 -767023 -902848 -1064495 -1237635 -1249761 -1240668 -1153363 -965605 -819776 -877574 -722764
14402 -722764 -667815 -1159307 -1399545 -1053730 -1084455 -1325988 -1167257 -982481 -794063 -623521
14392 -623521 -689205 -751884 -805645 -837597 -931232 -968478 -948237 -994337 -1079357 -992359 -787055
14381 -787055 -527110 -537620 -806807 -720192 -619498 -459700 -505157 -812906 -789950 -690406
14371 -690406 -751629 -910465 -973363 -922533 -1048131 -1147604 -990183 -772344 -722423 -799974 -902748
14360 -902748 -702984 -780467 -1074842 -1099700 -1071991 -793318 -817395 -995180 -1069937 -897208
14350 -897208 -898009 -950646 -964712 -987188 -987620 -852079 -758825 -782006 -784607 -714060 -736613 -890794
14338 -890794 -957238 -834241 -741985 -448374 -513086 -605110 -590976 -798624 -908295 -847637 -940141
14327 -940141 -1072336 -1170412 -1201218 -1156415 -809753 -695430 -783319 -745173 -828372 -1114028 -1191867
14316 -1191867 -936705 -647387 -617936 -699375 -921633 -1079711 -1128027 -1164041 -1237499 -1049594
14306 -1049594 -1139939 -1405695 -1354506 -1097456 -1103392 -944169 -775811 -766844 -786907 -705674 -690297
14295 -690297 -829220 -865827 -832352 -847010 -861003 -743494 -669010 -784423 -895536 -863076 -995924
14284 -995924 -1279504 -1395629 -1079427 -1068992 -1077932 -1040905 -1052841 -1280218 -1339518 -1029109 -967114
14273 -967114 -859200 -788546 -883632 -925719 -848898 -675927 -561399 -872440 -880297 -608751 -353109
14262 -353109 -415023 -663003 -835112 -915657 -840140 -966040 -892019 -653563 -819910 -741110
14252 -741110 -412093 -268827 -374082 -604319 -661011 -577482 -603868 -678684 -614193 -622263 -819984
14241 -819984 -723312 -615598 -524916 -348507 -481471 -814560 -895956 -945103 -811651 -703734
14231 -703734 -651678 -670917 -650493 -462190 -473798 -675150 -811221 -695629 -363477 -115830
14221 -115830 -257252 -545725 -610473 -645796 -861455 -1069367 -776120 -622010 -710087 -619190
14211 -619190 -505274 -186714 -419462 -875952 -967198 -627881 -595388 -777662 -689480 -662490
14201 -662490 -583745 -642454 -736599 -717138 -652953 -642829 -679561 -610665 -412049 -565085 -569020
14190 -569020 -721792 -881120 -938581 -848220 -783319 -907157 -827256 -635285 -440578 -493172
14180 -493172 -703029 -772303 -682892 -712085 -675162 -679390 -622740 -906099 -905221 -696601 -639931
14169 -639931 -513205 -339583 -550092 -817659 -723782 -779103 -900959 -727301 -682608 -688574
14159 -688574 -539187 -486392 -727213 -891939 -816692 -620600 -531612 -553030 -403349 -332610
14149 -332610 -579007 -656995 -684588 -746619 -738956 -829023 -1017667 -1000343 -999046 -900390 -885622
14138 -885622 -829997 -713920 -578610 -790020 -911931 -740907 -574070 -581596 -689337 -711942
14128 -711942 -633182 -609716 -531083 -781485 -916801 -937654 -958542 -867620 -657790 -543191 -641781
14117 -641781 -688679 -634069 -681722 -616804 -694231 -665821 -773268 -773220 -823491 -970262 -893328 -1059072
14105 -1059072 -960293 -820574 -809563 -834466 -635073 -541152 -587136 -475767 -539479 -504491 -472124
14094 -472124 -672143 -626849 -869892 -913248 -735044 -675682 -743188 -763246 -970949 -986569 -740850
14083 -740850 -696024 -682015 -883071 -1145137 -1280290 -1072266 -860216 -780335 -653733 -682177
14073 -682177 -673819 -597371 -656272 -774418 -958366 -974962 -908619 -711317 -560133 -538868 -471614
14062 -471614 -676222 -743502 -733723 -884434 -928547 -889257 -822410 -968611 -886096 -764144 -605626
14051 -605626 -478855 -565016 -578807 -548411 -518566 -600195 -708981 -1005267 -995493 -926938 -1027645
14040 -1027645 -1093000 -908302 -493016 -506091 -835471 -1014468 -868789 -955218 -850629 -956395
14030 -956395 -844292 -987704 -812607 -608011 -398929 -349909 -428932 -440152 -545475 -736953
14020 -736953 -903877 -870401 -973422 -858411 -872190 -1114448 -1004444 -976617 -878503 -952435
14010 -952435 -894208 -724815 -756609 -544086 -581087 -838902 -1023259 -967506 -890550 -803079 -784957
13999 -784957 -992627 -913474 -826719 -693051 -407841 -453894 -729879 -736121 -473689 -486850 -592173
13988 -592173 -488054 -701868 -810993 -667907 -559715 -885433 -817200 -779902 -846400 -753588
13978 -753588 -622567 -640116 -567656 -573939 -713466 -719001 -751686 -790949 -771156 -609133 -538467
13967 -538467 -524470 -857631 -907551 -931893 -820758 -549056 -531849 -494911 -353001 -405000 -469078
13956 -469078 -625716 -947431 -949058 -969709 -801623 -616012 -584135 -594394 -759205 -802999 -645476
13945 -645476 -491959 -535404 -527806 -771747 -996976 -1200396 -1080751 -1124237 -1092298 -961391
13935 -961391 -712344 -693312 -892182 -901915 -763927 -766187 -660845 -544890 -518186 -470828 -563640
13924 -563640 -723373 -921250 -1136652 -1067782 -1130572 -969754 -903856 -989122 -957258 -1065129
13914 -1065129 -1133794 -1218352 -965651 -886019 -873914 -968455 -968142 -1007659 -892304 -894493 -730968
13903 -730968 -726106 -703288 -669800 -510082 -516156 -813127 -937945 -870620 -963542 -889347 -939305
13892 -939305 -970735 -972561 -538523 -443387 -650814 -893881 -1041436 -918760 -686173 -293841
13882 -293841 -532415 -824911 -926729 -920819 -679175 -578809 -439744 -464589 -562060 -785008
13872 -785008 -803404 -804827 -680716 -563451 -722868 -900279 -1088908 -1118707 -802588 -557629
13862 -557629 -557105 -600362 -663537 -734281 -922240 -791926 -614922 -385142 -217860 -446183 -727163
13851 -727163 -822371 -483287 -346711 -559402 -676867 -845388 -783182 -739261 -817558 -806065
13841 -806065 -775515 -683862 -347108 -172974 -229213 -374565 -445362 -620744 -682098 -742414 -630990
13830 -630990 -519825 -661436 -831967 -1072681 -1044504 -735143 -748902 -693671 -646949 -540390
13820 -540390 -527587 -780591 -805552 -595524 -631776 -714557 -695159 -595310 -467786 -421308 -348998
13809 -348998 -525565 -644355 -731204 -678237 -507391 -491836 -742840 -826314 -840393 -915828 -1008406
13798 -1008406 -890224 -592521 -415208 -395868 -565062 -792220 -967908 -1035749 -1042416 -957390
13788 -957390 -769779 -685963 -808442 -578776 -427729 -411482 -585024 -619311 -435243 -468622
13778 -468622 -359965 -314341 -591447 -593232 -422293 -422865 -656917 -740119 -782989 -848712 -791152
13767 -791152 -717527 -634617 -575474 -538486 -339342 -349931 -616460 -720021 -706265 -695236 -486911
13756 -486911 -737366 -696908 -704133 -814517 -811375 -876539 -758775 -886528 -826000 -749733 -910907
13745 -910907 -1070970 -1145499 -1065688 -847175 -701032 -844779 -944386 -913123 -883366 -963185 -928232
13734 -928232 -711233 -650469 -651169 -728346 -671547 -570540 -383106 -472724 -565599 -690033 -881082
13723 -881082 -860950 -682906 -702688 -722916 -682249 -916938 -862441 -860445 -858837 -564240 -541455
13712 -541455 -806365 -757776 -611343 -684231 -688849 -668625 -560967 -626644 -837483 -839550 -865891
13701 -865891 -880804 -875868 -949154 -1086972 -1191122 -974125 -784201 -709235 -628505 -547440 -522570
13690 -522570 -532624 -597556 -529757 -662612 -956382 -1361866 -1337389 -1041670 -1137387 -1358742
13680 -1358742 -1288896 -1092627 -1106578 -1069690 -959421 -950031 -1019338 -859633 -797982 -736318 -461525
13669 -461525 -584884 -606277 -748504 -803286 -643679 -827456 -808762 -724696 -823260 -873964 -959399
13658 -959399 -912042 -973055 -996467 -968356 -888955 -833757 -994467 -1092362 -934257 -943360 -996583
13647 -996583 -1022335 -691116 -372284 -512230 -488059 -243021 -335768 -458449 -731569 -792657
13637 -792657 -847854 -969972 -951241 -806983 -695128 -696338 -451069 -262612 -359500 -464900
13627 -464900 -443476 -479803 -454197 -520615 -723925 -923440 -964043 -983153 -728035 -663869 -809922
13616 -809922 -840041 -956684 -912907 -763572 -803995 -876213 -850244 -886835 -886976 -783571 -607997
13605 -607997 -737539 -763771 -734762 -639313 -533225 -737744 -785042 -697099 -483032 -475636 -389912
13594 -389912 -362749 -673643 -752427 -833039 -930813 -859908 -845067 -1001887 -1162184 -999320 -765653
13583 -765653 -693780 -567066 -444978 -559610 -603780 -685042 -744153 -600793 -688599 -701140 -1001668
13572 -1001668 -1177860 -918603 -772269 -788042 -690041 -520707 -496232 -655899 -749969 -1042445
13562 -1042445 -1207921 -1005878 -814286 -914274 -943847 -651272 -510250 -588630 -473742 -549436
13552 -549436 -719787 -583438 -282137 -357035 -441562 -429802 -431770 -504011 -678265 -601319 -525961
13541 -525961 -482295 -493124 -424908 -426209 -634151 -758611 -606846 -549732 -489851 -595537 -631285
13530 -631285 -828679 -848630 -874178 -871836 -368750 -310853 -488224 -536390 -498280 -459708 -568855
13519 -568855 -766798 -807119 -771861 -866345 -867329 -705258 -741787 -851545 -813469 -738692 -926159
13508 -926159 -831640 -672690 -722890 -910712 -970188 -952066 -807751 -680386 -794392 -734970
13498 -734970 -668912 -662959 -753049 -961933 -846158 -858240 -751253 -563501 -472238 -261888 -543898
13487 -543898 -752727 -713376 -769220 -763577 -718476 -847240 -911890 -835221 -744010 -656970 -797566
13476 -797566 -629574 -474700 -433224 -362461 -403091 -497708 -653700 -605304 -730574 -660895 -637730
13465 -637730 -738110 -725473 -899020 -787176 -571833 -645151 -563912 -561020 -731634 -614310
13455 -614310 -522841 -726127 -775650 -805096 -656140 -568947 -452196 -411899 -324480 -680152 -966206
13444 -966206 -782897 -761788 -471915 -369591 -396675 -144938 -286599 -564868 -553191 -611000
13434 -611000 -569197 -790232 -827958 -775793 -804097 -837983 -869895 -898098 -1016455 -1326418 -1202940
13423 -1202940 -941533 -769894 -715429 -617630 -641221 -646258 -562575 -597286 -619760 -593456 -807072
13412 -807072 -581393 -565875 -553785 -545771 -515436 -721713 -953092 -721593 -635491 -634397 -646422
13401 -646422 -600156 -683171 -729691 -599799 -578333 -474510 -625354 -984750 -910824 -981149 -1016496
13390 -1016496 -881864 -595806 -514267 -493241 -563956 -585214 -508120 -423858 -110408 -184166 -502219
13379 -502219 -517572 -449815 -552563 -747133 -929554 -880420 -990027 -1045911 -860666 -821797
13369 -821797 -807687 -824246 -617811 -739408 -999288 -700337 -427644 -445571 -376625 -596090
13359 -596090 -992298 -1079280 -1056582 -968908 -774134 -808723 -803315 -852718 -888582 -1016657 -1176821
13348 -1176821 -1024213 -992085 -995382 -940993 -1019667 -824761 -797630 -659004 -614785 -836888 -824130
13337 -824130 -478245 -543357 -619596 -363019 -328238 -540361 -648949 -593697 -520110 -536142 -176800
13326 -176800 -94839 -344748 -613632 -657202 -708103 -801435 -671321 -659257 -504225 -588227 -689282
13315 -689282 -696287 -533526 -320754 -221657 -204494 -421143 -696885 -899831 -778940 -616091
13305 -616091 -551536 -596919 -398892 -152400 -110357 -212036 -187060 -187167 -512000 -560105 -515311
13294 -515311 -515721 -520980 -209818 -76924 -105636 -41809 -226684 -431457 -491820 -461412 -557440
13283 -557440 -685201 -665026 -780378 -888671 -919260 -805752 -711992 -771676 -630363 -543530
13273 -543530 -569776 -773581 -900810 -604938 -178976 -42904 -361142 -520585 -319117 -261324
13263 -261324 -471386 -411394 -254646 -377066 -538445 -672775 -346101 -410807 -349704 -509072
13253 -509072 -573094 -854931 -891753 -830252 -674397 -664844 -702516 -663029 -792410 -885264 -783491
13242 -783491 -608845 -571205 -762899 -727212 -508570 -543993 -628333 -606869 -755581 -1031758
13232 -1031758 -1127856 -978115 -898228 -698782 -523945 -895640 -1112911 -1189340 -1064822 -838087
13222 -838087 -899803 -848590 -927358 -1039054 -943113 -719010 -669454 -800657 -902225 -988165 -869897
13211 -869897 -671544 -639101 -601021 -702811 -748501 -829424 -735244 -686773 -574200 -549959 -702424
13200 -702424 -783384 -693730 -664950 -623283 -629243 -609812 -685122 -593265 -512381 -426258 -418729 -392633
13188 -392633 -382847 -259940 -48802 12031 -64814 -294576 -474050 -693877 -450899 -126362
13178 -126362 -79747 -331450 -579074 -735589 -530944 -576515 -681116 -621060 -605581 -629587
13168 -629587 -278877 -333093 -639740 -863966 -850404 -925666 -1041321 -889409 -696454 -849176
13158 -849176 -708724 -484080 -523457 -494195 -599541 -545956 -484037 -441139 -448327 -467381 -639201
13147 -639201 -626202 -698103 -763327 -727243 -701445 -324184 -383918 -450526 -612474 -496228 -536616
13136 -536616 -460754 -343119 -403439 -543059 -563488 -581606 -677665 -778147 -841509 -920848 -772138
13125 -772138 -777285 -591335 -682685 -834836 -940137 -988709 -886863 -648143 -578368 -752094
13115 -752094 -689686 -629470 -687262 -555613 -594440 -435581 -293023 -290374 -439915 -611016 -475349
13104 -475349 -302356 -312459 -356014 -540743 -443743 -347177 -400687 -577387 -733128 -680875 -730650
13093 -730650 -667704 -725792 -589365 -629751 -734858 -764479 -706527 -628028 -700262 -512658 -536289
13082 -536289 -350597 -520957 -836203 -865894 -858892 -672938 -500682 -306314 -96538 -149616
13072 -149616 -212424 -171345 -137011 -78060 -74246 -306300 -444799 -581007 -629985 -836554 -846957
13061 -846957 -746422 -699531 -847364 -826607 -716720 -628620 -460633 -538076 -664508 -488087
13051 -488087 -385732 -286514 -332287 -368775 -493326 -629498 -559987 -538135 -501080 -553159 -460623
13040 -460623 -384061 -502993 -561855 -505234 -553656 -623942 -669301 -582655 -680045 -930297 -1152929
13029 -1152929 -1183957 -1139783 -1020752 -725507 -627451 -572507 -495729 -476378 -563359 -535002 -467945
13018 -467945 -395250 -595931 -703592 -425151 -395797 -403305 -410896 -758642 -931585 -772678 -730272
13007 -730272 -749626 -789543 -811375 -687812 -854570 -1098931 -1203534 -1120389 -1106719 -1019487 -758117
12996 -758117 -863274 -743954 -431892 -33006 -116978 -208899 -126720 -345242 -437132 -612352
12986 -612352 -753619 -772269 -666432 -563225 -527707 -659537 -646923 -419837 -487122 -559257
12976 -559257 -443341 -507953 -483284 -578366 -518015 -465137 -481331 -718953 -825106 -703277 -667264
12965 -667264 -711295 -686655 -660813 -795385 -878452 -803662 -926244 -935737 -805335 -622739 -534231
12954 -534231 -505755 -304949 72684 41543 -263435 -329168 -263501 -421217 -304355 -543007
12944 -543007 -675875 -636172 -523279 -570350 -599773 -538971 -580406 -588165 -659092 -638808 -581617
12933 -581617 -366298 -361636 -488377 -615554 -522140 -506322 -547663 -383006 -292326 -122265 -128472
12922 -128472 -234391 -457239 -555390 -469629 -448092 -387833 -597466 -656031 -536438 -639543
12912 -639543 -857508 -887976 -713169 -875909 -697284 -424228 -328278 -704759 -824222 -991409
12902 -991409 -983326 -844716 -903718 -969447 -1060196 -854247 -667354 -510758 -304087 -171585
12892 -171585 109613 -70105 -248995 -449048 -504040 -324294 -150861 -250328 -361196 -593768
12882 -593768 -578602 -572734 -651894 -498480 -408129 -636755 -439569 -218528 -246201 -315541 -453383
12871 -453383 -275743 -270367 -486851 -486632 -307485 -558760 -511706 -563319 -527218 -391471 -476172
12860 -476172 -782181 -762126 -591590 -480164 -660967 -782034 -692307 -625693 -466910 -281466
12850 -281466 -234253 -312195 -462228 -626642 -726420 -846949 -662626 -728024 -745099 -728671 -788426
12839 -788426 -783593 -500706 -651951 -870319 -702725 -579811 -666537 -664308 -552400 -418656
12829 -418656 -249358 -277872 -460149 -515928 -455204 -289492 -405951 -686841 -683013 -729195 -802911
12818 -802911 -697993 -744808 -596366 -536143 -372178 -346483 -481730 -559310 -361091 -320771
12808 -320771 -388385 -367703 -481998 -535454 -520482 -376079 -440782 -543342 -409361 -397689 -473028
12797 -473028 -571149 -705100 -787477 -864533 -913273 -917430 -556162 -420113 -578280 -803814 -731283
12786 -731283 -771581 -667699 -739268 -797448 -933916 -804553 -843963 -825564 -689721 -663819 -677269
12775 -677269 -626342 -639707 -563869 -603340 -703413 -622140 -476618 -428570 -260106 -299038 -300743
12764 -300743 -413998 -640468 -656005 -541626 -290234 -159180 -215922 -249224 -92530 -115248
12754 -115248 -309231 -331693 -606736 -828098 -1112467 -1145189 -838446 -591709 -451812 -408693
12744 -408693 -415878 -517480 -559354 -673266 -757161 -901299 -917533 -849280 -746754 -560359 -497936
12733 -497936 -654442 -742030 -627027 -268240 -291446 -459501 -690979 -707809 -597571 -515184
12723 -515184 -580914 -200424 145293 76294 -214091 -445742 -390942 -606297 -736752 -736218 -753422
12712 -753422 -587237 -516488 -440681 -197908 -271517 -344528 -366310 -450095 -413722 -604868 -586428
12701 -586428 -698078 -470558 -397584 -538006 -312484 -322015 -348739 -180471 -121731 -41495 -121992
12690 -121992 -399204 -508835 -490302 -583168 -665377 -632391 -817862 -908906 -884515 -712682 -573471
12679 -573471 -497635 -407717 -248096 -501099 -535573 -435126 -148154 -117445 -227979 -563885
12669 -563885 -801904 -935068 -847611 -762574 -686910 -819537 -945693 -809151 -720729 -667225
12659 -667225 -909911 -1016805 -814842 -668687 -878146 -1114335 -924616 -721425 -611652 -524818
12649 -524818 -453971 -537046 -535814 -367991 -421919 -284178 -206450 -140886 79303 57610 -240490
12638 -240490 -282581 -517699 -805069 -832325 -551366 -439528 -523259 -569172 -621276 -579074 -715853
12627 -715853 -657326 -532458 -614077 -696463 -584160 -560256 -788348 -825670 -778337 -692591 -542088
12616 -542088 -521196 -671533 -722556 -760242 -755708 -926294 -940221 -797540 -685650 -580087 -346795
12605 -346795 -305542 -593325 -699535 -371859 -326491 -377384 -609683 -702763 -669893 -534679
12595 -534679 -475318 -432229 -283866 -147530 -285330 -392501 -543274 -245232 127634 113863
12585 113863 -14767 -347280 -477470 -593646 -411579 -245650 -264550 -353765 -370088 -387058
12575 -387058 -584408 -639774 -716291 -737800 -709642 -497880 -381630 -535621 -442617 -540163 -486722
12564 -486722 -618433 -810649 -805123 -944338 -1150776 -926760 -634781 -350438 -294754 -550119
12554 -550119 -550569 -500417 -699016 -934224 -841064 -630491 -698976 -620186 -673781 -937118 -777937
12543 -777937 -484637 -462409 -545306 -329916 -233362 -305085 -323099 -258153 -146883 -135312 -459979
12532 -459979 -806147 -876689 -859695 -798422 -632555 -646149 -596121 -624249 -486800 -427176 -413919
12521 -413919 -303059 -262757 -511403 -673829 -538050 -455887 -352892 -220392 -303868 -338109
12511 -338109 -431060 -667740 -547496 -334982 -83395 -153731 -282765 -433657 -561905 -588299
12501 -588299 -588096 -488125 -373764 -617319 -411990 -310399 -422224 -494028 -520016 -597149 -702321
12490 -702321 -654515 -612557 -304309 -348214 -524466 -591690 -469787 -331251 -343141 -395374 -299776
12479 -299776 -455201 -737810 -942461 -1004100 -1073652 -1085338 -907639 -649084 -523658 -381501
12469 -381501 -353099 -272690 -370533 -435496 -608265 -819869 -700861 -673544 -625368 -734818 -848797
12458 -848797 -621160 -400129 -445621 -267677 -188396 -208996 -107963 -97261 -392857 -488558
12448 -488558 -633302 -617224 -550038 -489713 -754007 -845473 -802455 -602023 -468988 -522619 -472343
12437 -472343 -283911 -235032 -189086 -386460 -461753 -754494 -762724 -450280 -151282 150917
12427 150917 176753 -153575 -453350 -574302 -451584 -504969 -576183 -372833 -205472 -76693
12417 -76693 -225307 -512360 -693774 -755385 -726699 -736690 -756455 -550979 -698028 -864129 -700218
12406 -700218 -489144 -476491 -482856 -633061 -746851 -439689 -373113 -445924 -445813 -425691 -391003
12395 -391003 -407721 -366483 -568641 -528560 -599368 -412011 -479005 -765532 -668488 -519697 -729837
12384 -729837 -965502 -846141 -605062 -469894 -599262 -608807 -673698 -432330 -352652 -613896
12374 -613896 -602576 -491187 -578401 -524479 -429449 -445885 -601050 -575640 -489093 -479325 -580720
12363 -580720 -584852 -705403 -754329 -614656 -581898 -569492 -530710 -302665 -225738 -127270 -344322
12352 -344322 -344865 -113179 17475 -259987 -507305 -618428 -783544 -886601 -665077 -633116
12342 -633116 -572098 -551963 -522033 -552445 -558833 -697495 -655587 -662630 -568383 -358183 -354071 -400159
12330 -400159 -528764 -641691 -508363 -715270 -838612 -736671 -570128 -570385 -681392 -482879
12320 -482879 -277930 -319044 -281975 -213765 68566 109357 -50642 -146222 -174770 82831 -28908
12309 -28908 -325728 -379752 -304115 -362618 -227230 -371190 -360163 -397810 -720173 -821770 -796952
12298 -796952 -805834 -998156 -952101 -982359 -1010816 -925879 -738002 -673235 -581797 -524533 -577423
12287 -577423 -669849 -734971 -594908 -824985 -960708 -954603 -847208 -658391 -696854 -805869
12277 -805869 -754095 -563498 -473865 -438203 -319813 -321267 -200878 -123999 -245434 -451085 -748573
12266 -748573 -775531 -605373 -670366 -440326 -519790 -804779 -683604 -396987 -45878 -117389
12256 -117389 -402794 -724328 -813984 -857711 -495388 -369469 -288572 -352630 -616533 -971803
12246 -971803 -869357 -731356 -574838 -164710 -95948 -121732 -2157 -109860 -284422 -415495
12236 -415495 -492109 -427127 -451861 -514906 -550991 -433789 -379831 -354638 -333177 -277068 -119275
12225 -119275 -234764 -513929 -592559 -685192 -544030 -357354 -246414 -247508 -423196 -291887
12215 -291887 -176695 -204005 -179226 -208476 -212150 -457834 -362940 -310792 -437776 -640875 -585550
12204 -585550 -459879 -376100 -271146 -221891 -556676 -631167 -287595 -158800 -368875 -593989
12194 -593989 -788079 -578232 -310437 -215603 -378708 -329761 -303363 -358612 -524210 -325396
12184 -325396 -409915 -443789 -213451 -336572 -385729 -339270 -275794 -281064 -83546 -71354 -191975
12173 -191975 -41734 36426 -239994 -301891 -391480 -395816 -368789 -409431 -445420 -387108 -368275
12162 -368275 -482751 -468085 -477083 -515249 -453052 -361047 -218452 -247058 -180311 -185523 -429225
12151 -429225 -330312 -479766 -390718 -222790 -174514 -305431 -535338 -575096 -366545 -82750
12141 -82750 -92621 -586659 -858766 -936948 -998472 -863702 -755383 -596140 -448157 -592074
12131 -592074 -539149 -578499 -652240 -695249 -729568 -748753 -781801 -512271 -382769 -522690 -578620
12120 -578620 -730707 -510757 -457234 -736220 -1050678 -1238225 -862190 -678408 -443371 -152168
12110 -152168 148329 187421 90498 -136110 -178448 -401810 -409963 -380215 -603670 -722716 -594001
12099 -594001 -512533 -257317 -313345 -483369 -503370 -495507 -595667 -646161 -830858 -882447 -688135
12088 -688135 -876259 -760983 -719374 -767180 -767061 -787291 -768870 -807338 -749049 -741936 -765700 -531913
12076 -531913 -375898 -477207 -739058 -932282 -809805 -566603 -560264 -555125 -556806 -405319 -521022
12065 -521022 -472312 -272907 -76180 -203355 -257591 -162483 -33341 -382256 -841754 -822035
12055 -822035 -800372 -761158 -684030 -677962 -614366 -654260 -576167 -485672 -300172 -237918 -267483
12044 -267483 -329426 -265817 -423535 -243576 -258790 -469895 -568860 -614477 -567506 -570148 -850327
12033 -850327 -872215 -881343 -911648 -983265 -861540 -847857 -703836 -452118 -510266 -442334 -436868
12022 -436868 -371141 -197045 -236138 -147342 -90122 -262026 -258334 -176302 -329347 -424632 -251325
12011 -251325 -308731 -551704 -671030 -674831 -570400 -362769 -573450 -563533 -460829 -726731
12001 -726731 -712041 -761326 -660189 -520522 -761422 -885323 -559051 -134113 -286617 -372641
11991 -372641 -488168 -969457 -1201591 -1306646 -1039038 -818545 -715213 -719338 -694142 -593464
11981 -593464 -289427 -371187 -489956 -482958 -412482 -412449 -583282 -534050 -651235 -735246 -868258
11970 -868258 -986147 -735337 -693280 -419890 -252178 -431246 -564957 -527445 -741276 -976176
11960 -976176 -717952 -446970 -489860 -535780 -646079 -580817 -640216 -426253 -549946 -689622
11950 -689622 -705503 -711166 -687697 -570220 -458535 -632641 -846299 -923807 -659199 -227826
11940 -227826 -207782 -543342 -620208 -464935 -294398 -337715 -439894 -619855 -729784 -651855
11930 -651855 -688706 -744017 -622306 -564876 -696910 -710593 -647492 -590305 -617318 -737442 -796342
11919 -796342 -831680 -794971 -526038 -459542 -475953 -523817 -448434 -451662 -548990 -486826 -123120
11908 -123120 42541 -146761 -46430 -139510 -163054 -116424 -195264 -105230 -189517 -335687 -229133
11897 -229133 -434590 -580338 -433883 -326288 -320139 -449640 -420773 -125142 -155456 -370453
11887 -370453 -508289 -428916 -446705 -501791 -536400 -558916 -547320 -420062 -358965 -438648 -409919
11876 -409919 -452369 -173724 -278014 -448977 -503345 -484380 -561407 -415793 -201128 -240058
11866 -240058 -251897 -278072 -318588 -559599 -628792 -426659 -336522 -351952 -222330 -154393 -286004
11855 -286004 -443112 -561113 -701464 -563173 -559182 -565847 -582429 -510215 -439640 -193842 -24115
11844 -24115 -187159 -240270 -144377 -12618 138604 506660 446156 260057 12312 -7076
11834 -7076 -253680 -573208 -675731 -493748 -583137 -585698 -550418 -522863 -358568 -290717 -295470
11823 -295470 -371067 -390384 -290856 -175607 -152312 -382272 -735935 -769747 -752039 -663601 -429496
11812 -429496 -352378 -216939 -212062 -346629 -376529 -294078 -186796 -299265 -465336 -636334
11802 -636334 -443387 -616493 -557431 -478395 -410138 -467718 -456148 -503353 -513433 -365904 -394764
11791 -394764 -167572 14636 -23987 -190151 -172024 -419848 -648350 -444487 -368103 -430801
11781 -430801 -470515 -342142 -326429 -422598 -396748 -477424 -263836 -145575 -60420 -216840 -327037
11770 -327037 -236729 -469488 -488309 -377659 -594452 -829555 -449273 -124677 -119725 -112943 -61368
11759 -61368 -188746 -232317 -52848 -155979 -10333 -80725 -113400 -417231 -586408 -525175
11749 -525175 -426517 -534532 -448213 -525952 -555172 -406280 -367301 -263524 -269510 -492877 -441895
11738 -441895 -424211 -529045 -433180 -181458 -182944 -220841 -457517 -353424 -109785 -12364 107783
11727 107783 -150086 -166784 -192073 -341905 -479370 -545102 -641197 -761289 -616531 -512720
11717 -512720 -415258 -278091 -255357 -257949 -558531 -419830 -166330 -156668 -9117 105238 -87174
11706 -87174 -172713 -92917 -336719 -548296 -728121 -698229 -378355 -376558 -370362 -170301 -227099
11695 -227099 -387949 -434310 -517079 -364690 -326030 -300869 -473380 -631296 -370633 -213815
11685 -213815 -188672 -244604 -296383 -540323 -736327 -638831 -659961 -344981 -172347 -229431 -458175
11674 -458175 -349858 -181652 -255686 -413599 -543148 -460533 -338956 -508224 -640050 -688939
11664 -688939 -705589 -745765 -800257 -824953 -726276 -713944 -655723 -702686 -532924 -522209 -659165
11653 -659165 -578172 -427673 -502680 -401904 -147396 -13606 -161856 -212254 -250400 -419776
11643 -419776 -385595 -358027 -73290 -52107 -162566 -212056 -233323 -515836 -840010 -725184
11633 -725184 -494581 -448952 -592808 -667894 -462502 -413121 -304195 -278178 -258003 -432558
11623 -432558 -679207 -708136 -310457 74608 135701 -21609 -281419 -396081 -291636 -494000
11613 -494000 -439139 -183748 -5291 -110251 -338496 -343082 -457617 -376578 -604374 -648503
11603 -648503 -493757 -372845 -466714 -491703 -398803 -631954 -667056 -444331 -416145 -428449 -363179
11592 -363179 -436438 -564354 -419483 -536293 -493206 -265927 -343719 -592565 -787014 -670738
11582 -670738 -418054 -296829 -394322 -334762 -313119 -258132 -167127 -248777 -247867 -224257 -403249
11571 -403249 -546979 -295611 -53962 90484 -38895 -345452 -519382 -543875 -318402 -137728
11561 -137728 -379536 -534894 -333076 -237327 -391953 -400783 -240047 -131143 -186144 -325711
11551 -325711 -135116 -73861 -88427 -285091 -378317 -192489 -256374 -169081 -127396 -107225 -317445
11540 -317445 -617023 -563153 -573725 -472374 -492677 -695630 -890688 -664609 -424207 -332977
11530 -332977 -650668 -489144 -469546 -323421 -234041 -355356 -429535 -413188 -309402 -345714
11520 -345714 -331790 -291031 -426399 -274142 -141835 -360223 -444261 -364972 -392620 -304196 -174105
11509 -174105 -105573 -206489 -423695 -444311 -307850 -253217 -244258 -372636 -154935 -83010 -228773
11498 -228773 -596521 -652770 -397695 -453860 -328069 -256335 -242262 -190152 -398396 -621257
11488 -621257 -706280 -494400 -72410 -4371 -447327 -569485 -557787 -525117 -466143 -275644
11478 -275644 -321507 -465749 -452454 -503803 -524117 -460656 -413926 -276166 -220141 -269244 -170225
11467 -170225 -74560 -20654 105603 176738 19269 256449 476923 249336 -151522 -327166
11457 -327166 -366092 -253317 -179108 -274671 -438590 -380852 -214173 -149205 -238285 -299355 -234212
11446 -234212 -197501 -120824 -39645 -193001 -360811 -278296 -223879 -505335 -709997 -713013 -348320
11435 -348320 -211126 -291016 -522379 -562804 -326919 -129407 -234470 -199190 -49411 -12179
11425 -12179 88969 -2455 -174656 -402522 -257488 -274645 -95547 -144359 -75163 10415 -158978
11414 -158978 -258499 -351273 -117323 73089 57918 71982 224375 166654 -57723 -205700
11404 -205700 -199749 -35261 50666 -169471 -188529 -103342 -229132 -346030 -427549 -426540 -467134
11393 -467134 -486692 -449790 -344204 -298476 -243803 -372515 -482685 -358936 -338203 -390149 -310650
11382 -310650 -366248 -213213 -150100 -261610 -248056 -433235 -369679 -326706 -174600 -171659 -132603
11371 -132603 -241123 -484679 -541475 -294577 -249975 -187951 -379351 -554799 -520016 -447279
11361 -447279 -538928 -695211 -571459 -573657 -493121 -472126 -472286 -244641 -307223 -443959 -487823
11350 -487823 -300778 -151158 -108774 -250979 -295580 -265009 -299885 -273955 -110906 97615
11340 97615 235632 83697 11029 -86517 -192608 -186294 -87213 -8177 116983 -30801 -170761
11329 -170761 -124695 -123519 -15318 121966 171981 -72788 -110942 -57155 -87699 -75566 -11206
11318 -11206 -142190 -247999 -413591 -195181 -308887 -465640 -431291 -250355 -210211 -347654
11308 -347654 -347564 -242358 -142248 2576 -1210 28454 -56962 -196696 -94248 -114744 -253286
11297 -253286 -605380 -820578 -873254 -684735 -682761 -297298 -339161 -444444 -319779 -351892
11287 -351892 -463431 -477725 -450310 -231272 39741 66044 -191800 -231107 -224332 -339064 -379747
11276 -379747 -359496 -722398 -1027637 -818992 -466903 -501556 -411568 -514819 -483261 -454939
11266 -454939 -537787 -487562 -359335 -319767 -352240 -399529 -529051 -459089 -340164 -349927 -305973
11255 -305973 -514187 -237154 -213014 -367606 -332197 -333216 -6104 154293 312259 154776
11245 154776 88127 -31294 -84085 -178129 -402375 -452342 -594703 -596930 -368467 -300638 -162370
11234 -162370 -313523 -65970 -10817 -49068 -298563 -419177 -531714 -471531 -314865 -313691
11224 -313691 -240275 -265705 -371368 -383259 -423850 -372828 -38493 -36667 -235952 -92758 -176056
11213 -176056 -159088 -132598 -56580 -108730 -156086 -90604 -72335 -178281 -2726 -83141 -126441
11202 -126441 -184533 -347268 -489682 -291498 -280999 -172879 -17845 50845 179425 62319
11192 62319 18834 -146277 -53538 -96383 -87679 -54216 -133815 -194532 -185524 -61501 -90015 -177264
11180 -177264 -96253 -148585 -131013 -161467 -55870 108848 559995 768536 713155 216030
11170 216030 -179799 -306028 -406498 -293913 -34768 26526 10374 -132107 -88801 -40847
11160 -40847 53090 -24707 -213160 -131841 -378264 -307461 -390127 -521601 -431769 -313169 -265676
11149 -265676 -246857 -15296 -2021 -60281 -191143 -174036 -237825 -88534 1881 -64232 -250957
11138 -250957 -368649 -180908 -305808 -217609 -335731 -352835 -262361 -351262 -251205 -216499
11128 -216499 -156935 -77004 -220654 -318903 -451675 -411433 -399890 -379609 -441822 -429031 -448059
11117 -448059 -329128 -2194 -252926 -140369 -116819 -100675 -11458 -385057 -531443 -710372
11107 -710372 -475290 -404557 -353176 -174368 -254061 -223027 -189585 -227297 -509794 -421717 -232871
11096 -232871 -216612 -95454 -111039 -259175 -260401 -360035 -276917 -72352 -146989 -161251 -195136
11085 -195136 -333445 -164806 201751 58072 -255038 -360251 -253653 -315221 -346677 -454489
11075 -454489 -398136 -386430 -464971 -419082 -148433 124510 -37710 -25319 355461 223478
11065 223478 -285536 -487232 -701499 -577507 -329337 -211550 -16823 -220405 -627343 -614042
11055 -614042 -370319 -5295 34897 91242 24219 -146880 -132006 -129784 -116841 -268516 -478017
11044 -478017 -360085 -277376 -106202 -234192 -507274 -469294 -464054 -370797 -164643 -81825 30648
11033 30648 -16214 -167433 -237509 -403446 -416473 -424377 -421830 -448608 -268764 -38976 -100449
11022 -100449 -188354 -367520 -445001 -420466 -478432 -402962 -162771 -111779 -104467 -208124 -43582
11011 -43582 -246206 2608 72207 99459 83786 -168750 -169508 -197554 -268526 -207253 15730
11000 15730 151411 88209 -160377 -11745 135903 47699 -138982 -239929 -338450 -355818
10990 -355818 -111076 273542 63330 -77188 -177289 -132287 -78879 -270252 -630087 -565757
10980 -565757 -300586 -155903 -55463 66946 -44375 -23379 20721 155115 325259 105339
10970 105339 53576 -5854 -88696 -155441 -211643 47862 265123 204148 65993 -123259 -138814
10959 -138814 -60510 106092 168981 81487 -68780 -498040 -511973 -367928 -151322 -77756
10949 -77756 -137693 -100216 -188237 -136142 -155140 -124399 3801 116949 -9128 -406364 -480902
10938 -480902 -467079 -380354 -232312 -32846 -89627 -351004 -333627 -140975 -35763 -189870
10928 -189870 -313975 -385199 -392308 -225936 -31111 123246 278825 -50694 -291271 -280535
10918 -280535 -325804 -369094 -381416 -486168 -256204 -285033 -396672 -215943 173594 192214
10908 192214 72021 60326 53650 -190005 -137121 -84465 11378 73007 63868 -35676 -62085
10897 -62085 -330994 -417523 -280534 -142626 199036 375565 506694 418717 338816 150126
10887 150126 58978 -92746 -224659 -1858 -74165 -311992 -370956 -434670 -372034 -516616
10877 -516616 -480268 -390906 -232986 -53471 -247922 -310350 -414343 -225798 -239637 -454357
10867 -454357 -371617 -288834 -165490 -130586 -489782 -474949 -294921 -71529 -160485 -254682 -216079
10856 -216079 6945 -44531 -166272 -9691 264745 394696 320618 185485 155584 77405
10846 77405 -89760 -50696 48801 40302 -138688 53323 170788 124338 68013 51264 181640
10835 181640 -10999 -235592 -251188 -98564 -1726 -109714 -312920 -80071 84467 209158
10825 209158 352027 274781 78472 26214 5171 83172 227932 195360 47912 43030 146123
10814 146123 63913 -68459 -482107 -542686 -172476 51475 162396 292961 310758 240868
10804 240868 16814 35579 1902 -284479 -534500 -394028 -288043 -391214 -556232 -456266
10794 -456266 -351154 -285154 -406732 -355170 -270259 -384550 -449856 -300779 -172790 -322366
10784 -322366 -272772 -47231 80234 147011 42009 87786 129551 76395 70324 155493 200714
10773 200714 55705 -109482 -168675 47341 57842 -54282 -142027 -189410 -15611 41162
10763 41162 -62334 37437 247445 378316 331422 245028 -6186 -17671 181006 40683
10753 40683 72864 144515 151905 153774 67374 128815 223542 331683 53061 -129214 -43098
10742 -43098 -318425 -326251 -123462 41615 100624 -31118 -162348 -118162 44035 216808
10732 216808 20328 178386 217374 70760 -154700 -138382 -169856 -72408 79040 35179
10722 35179 57500 279488 493625 500410 385988 92173 -201744 -225756 12507 325197
10712 325197 455445 264793 153904 166993 245033 330824 214006 347782 305464 283670
10702 283670 156774 228444 342098 309879 318547 319831 404793 488721 402941 471069 541794
10691 541794 537381 492310 246702 201164 79001 68253 190527 100333 73719 245785 251354
10680 251354 303186 338643 387977 245778 -61944 -65883 -42724 110126 30547 -194068 -373899
10669 -373899 -237160 -315705 -285634 -97482 6091 -26740 -204410 10915 -36882 63
10659 63 49985 107682 22666 103191 -23279 -67428 -24147 66043 287931 524246 406572
10648 406572 181946 -7566 -96683 142129 435180 612665 462319 486695 289307 405648
10638 405648 733336 643196 315025 169938 73391 -12603 -65730 14646 -88004 -41058 282910
10627 282910 245810 95018 337044 360063 105103 290016 326854 186902 109750 46136
10617 46136 -56788 -162268 -165946 9564 80133 -140972 -10633 342521 348510 73679 -64825
10606 -64825 -154929 -342356 -366776 -403060 -217973 -128377 -111237 -194256 -233766 -331756 -634881
10595 -634881 -342756 -19512 249547 447819 613382 474622 42056 34898 -150442 -315883
10585 -315883 -268838 -219601 -107466 -16753 -683 3744 -84055 -121158 35926 207996 393355
10574 393355 226243 -98180 -135859 -168193 -33790 96921 -104392 -20170 29292 84922
10564 84922 178509 128866 215217 236302 409717 338195 382383 489669 384286 275386 36829
10553 36829 -27760 -109718 125091 145088 -40050 -4821 -38648 11385 62460 -15635 -86086
10542 -86086 -132903 -91836 25280 248620 222948 143896 50343 -39302 -80847 104365 34630
10531 34630 128530 471180 556021 398847 318800 137742 -86224 -336891 -206851 105973
10521 105973 104465 163962 108802 179104 378175 240093 146678 -11609 -3404 -59529 -229240
10510 -229240 -212883 -357054 -419079 -495740 -412815 -415378 -270313 -404309 -307323 -507851 -579858
10499 -579858 -502103 -421295 -119923 13508 272708 220442 199955 151253 -150731 -398674
10489 -398674 -275662 -278479 -298356 -33633 266747 145310 40362 422599 465923 285161
10479 285161 85638 -3339 176208 187374 356906 467312 278129 190971 20193 33406
10469 33406 27767 -119178 -256070 -82037 -6597 82806 102784 75170 -13837 -116134 186867
10458 186867 436305 471647 290030 378990 561545 564204 746781 752462 723501 583570 609406
10447 609406 629095 640705 434493 242631 126815 60546 170103 367035 322068 265107
10437 265107 274651 242522 209192 199764 -14558 180618 82775 63978 84538 147312 349289
10426 349289 312604 46333 67058 235942 81270 49823 89400 181145 337497 225615
10416 225615 179968 362674 400639 389431 391081 308932 200964 146573 92496 37028 169151
10405 169151 296463 518109 698401 843405 714948 397195 362087 260537 276314 325344
10395 325344 269672 322813 127248 145744 337844 450762 436576 228050 160667 408538
10385 408538 765600 864160 647269 590300 603855 669267 648579 683023 480886 350328 335567
10374 335567 147251 76267 142264 85236 14814 -28031 163273 467947 757735 575016
10364 575016 353990 237817 85697 290808 223205 124604 197072 213816 236114 298789 254975
10353 254975 496466 736154 681557 486871 384266 390604 450180 695643 795977 827372
10343 827372 892996 679824 594460 212236 -198000 -114664 240461 306637 420371 458183
10333 458183 437446 429503 299915 277687 135022 -131937 -122555 -72051 -7189 -129199 -88215
10322 -88215 139006 229544 164180 17984 -57248 -143949 -159479 -176706 -478630 -516071 -473401
10311 -473401 -462099 -500010 -335291 -176764 42578 91980 280104 66984 -43206 -82573
10301 -82573 -216891 -292094 -391981 -626752 -671673 -606437 -373227 -448777 -551436 -393898 -185087
10290 -185087 -126905 -89071 -166093 -221992 -64698 71250 -96620 -112031 -83340 -34452 -49934
10279 -49934 -113555 -235427 -374713 -296353 -313697 -305100 -181651 -6220 113243 242988 78652
10268 78652 101826 258063 427026 450601 319125 322670 294990 -24176 -162195 -123024 -123775
10257 -123775 -153108 -259202 -150689 111189 -53600 28543 82966 169380 185818 348264
10247 348264 660054 635650 463162 307407 324988 289667 313080 632618 420130 72467
10237 72467 -112525 -60107 211958 188035 -100009 -104867 -130134 -330737 -225581 24676 284736
10226 284736 361025 202067 154035 176829 -51351 -125451 -304695 73710 253427 -43879
10216 -43879 -321122 -208493 -79947 -74240 -73872 133881 99309 -106205 -223939 30864 281453
10205 281453 230306 360306 384692 337110 451718 520788 505653 314972 74300 45961 -50248
10194 -50248 98625 295294 130180 92175 426902 411506 383016 460804 151444 21655
10184 21655 134310 138431 121942 18338 245842 360621 328954 407789 573699 726869 721646
10173 721646 496133 170465 51522 345993 530327 391615 213594 377253 171412 174653
10163 174653 337849 523597 600246 480274 688980 489511 344225 525499 519681 253345
10153 253345 249761 122508 -33785 -143653 -233769 -128634 37975 -111413 -71350 -88113
10143 -88113 89465 290283 519324 580545 217621 -76334 58518 185490 63426 147640
10133 147640 292322 324337 314560 347209 362377 226756 8671 -41689 107875 25768 102589
10122 102589 323405 427520 438256 388213 280676 333991 296758 152030 40188 171683
10112 171683 -74591 -325827 -297989 -160262 -21058 158344 300642 254508 234641 541654
10102 541654 523621 292936 221546 104000 324448 122800 177256 164754 449048 915154
10092 915154 797950 389582 249953 184656 434285 603687 511810 313034 347935 513593
10082 513593 501625 478081 530125 543434 409502 372038 243714 68462 39015 389426 385345
10071 385345 120814 435197 501316 213497 315497 515183 236899 291436 373987 280953
10061 280953 147376 208205 545005 451301 322644 468683 550118 564031 692861 697969 610457
10050 610457 411448 267552 244549 228015 361663 689157 899955 726756 427625 217920
10040 217920 53261 -36148 446667 425491 572576 503440 280813 103231 505100 566530
10030 566530 615390 842507 762186 495862 528250 590394 614275 656888 565188 584974 509560
10019 509560 477074 489691 572374 572326 681170 831314 833190 584897 394509 285812 367831
10008 367831 414672 613925 650259 605915 446708 349020 179878 188871 34455 354115 425818
9997 425818 631005 662096 796262 669396 596477 559791 336026 481927 859115 840061
9987 840061 673302 635187 761082 864827 524553 387341 580558 729526 655803 606833
9977 606833 658358 928875 754129 746747 742102 828738 773525 561510 593052 552512 415785
$$ [...]
##END NTUPLES=NMR SPECTRUM
##END=
