##TITLE=Analysis number 329665
Compound Code cc 54202
Book Reference 518/191
Project Code adrs
Chemist Name colinb
##JCAMPDX= 6.0         $$ Bruker NMR JCAMP-DX V2.0
##DATA TYPE= NMR SPECTRUM
##DATA CLASS= NTUPLES
##ORIGIN= Bruker BioSpin GmbH
##OWNER= nmr
$$ XWIN-NMR		Version 3.5
$$ Fri Sep 21 14:23:08 2007 GMT Daylight Time (UT+1h)  MAYBRIDGE\nmr@NMR_250MHZ
##.OBSERVE FREQUENCY= 250.131544655141
##.OBSERVE NUCLEUS= ^1H
##.ACQUISITION MODE= SIMULTANEOUS (DQD)
##.ACQUISITION SCHEME= undefined
##.AVERAGES= 16
##.DIGITISER RES= 18
##SPECTROMETER/DATA SYSTEM= dpx250
##.PULSE SEQUENCE= zg30
##.SOLVENT NAME= CDCl3
##.SHIFT REFERENCE= (INTERNAL, CDCl3, 0, 16.4496)
##AUDIT TRAIL= $$ (NUMBER, WHEN, WHO, WHERE, WHAT)
$$ ##TITLE= Audit trail, XWIN-NMR		Version 3.5
$$ ##JCAMPDX= 5.01
$$ ##ORIGIN= Bruker BioSpin GmbH
$$ ##OWNER= nmr
$$ C:\u/data/dgb/nmr/ADRS/2160/pdata/1/auditp.txt
$$ ##AUDIT TRAIL=  $$ (NUMBER, WHEN, WHO, WHERE, WHAT)
(   1,<2007-09-21 14:22:48.72 +100>,<MAYBRIDGE\nmr>,<NMR_250MHZ>,
      <created by zg, POWCHK disabled, PULCHK disabled
       configuration hash MD5:
       76 6E 9A 78 1E 09 19 81 EC 84 63 8F B0 6A 59 2D
       data hash MD5: 64K
       58 D3 7D 23 23 77 78 B8 74 7C F1 09 08 D1 1F A4>)
(   2,<2007-09-21 14:22:59.96 +100>,<MAYBRIDGE\nmr>,<NMR_250MHZ>,
      <Start of raw data processing
       ef LB = 0.3 FT_mod = 6 PKNL = 1 SI = 32K 
       data hash MD5: 32K
       94 83 59 0B 15 BC 52 57 A3 00 48 A2 89 F0 3C D6>)
(   3,<2007-09-21 14:23:01.52 +100>,<MAYBRIDGE\nmr>,<NMR_250MHZ>,
      <apk 
       data hash MD5: 32K
       4B B9 6C DA 9F 43 C6 5A 7B 2E 01 C0 0D 76 79 85>)
(   4,<2007-09-21 14:23:02.25 +100>,<MAYBRIDGE\nmr>,<NMR_250MHZ>,
      <abs ABSG = 5 
       data hash MD5: 32K
       03 4A 89 D1 4D 31 E0 26 40 63 C4 9C 0F 4D 23 A7>)
$$ ##END=
$$ 
$$ hash MD5
$$ E6 72 0B 7C 86 B6 C3 71 27 25 B3 1E 49 A0 3E 74
##$RELAX= 
##$RELAX= 
##$RELAX= 
##$RELAX= 
##$RELAX= 
##$RELAX= 
##$RELAX= 
$$ Bruker specific parameters
$$ --------------------------
##$DU= <C:\u>
##$EXPNO= 2160
##$NAME= <ADRS>
##$PROCNO= 1
##$TYPE= <nmr>
##$USER= <dgb>
##$AMP= (0..31)
100 100 100 100 100 100 100 100 100 100 100 100 100 100 100 100 100 100 
100 100 100 100 100 100 100 100 100 100 100 100 100 100 
##$AQSEQ= 0
##$AQ_mod= 3
##$AUNM= <au_zg>
##$AUTOPOS= <32 >
##$BF1= 250.13
##$BF2= 250.13
##$BF3= 250.13
##$BF4= 250.13
##$BF5= 500.13
##$BF6= 500.13
##$BF7= 500.13
##$BF8= 500.13
##$BYTORDA= 1
##$CFDGTYP= 0
##$CFRGTYP= 5
##$CHEMSTR= <none>
##$CNST= (0..31)
1 1 145 1 1 1 1 1 1 1 1 1 1 1 1 1 1 1 1 1 1 1 1 1 1 1 1 1 1 1 1 1 
##$CPDPRG= <>
##$CPDPRG1= <>
##$CPDPRG2= <>
##$CPDPRG3= <>
##$CPDPRG4= <mlev>
##$CPDPRG5= <mlev>
##$CPDPRG6= <mlev>
##$CPDPRG7= <mlev>
##$CPDPRG8= <mlev>
##$CPDPRGB= <>
##$CPDPRGT= <>
##$D= (0..31)
0 1 0 0 0 0 0 0 0 0.06 0 0 0 0 0 0 0.0002 0 0 0 0 0 0 0 0 0 0 0 0 0 0 
0 
##$DATE= 1190380967
##$DBL= (0..7)
120 120 120 120 120 120 120 120 
##$DBP= (0..7)
150 150 150 150 150 150 150 150 
##$DBP07= 0
##$DBPNAM0= <>
##$DBPNAM1= <>
$$ [...]
##$SUBNAM7= <"">
##$SUBNAM8= <"">
##$SUBNAM9= <"">
##$SW= 20.6930455092707
##$SWIBOX= (0..15)
0 0 3 0 0 0 0 0 0 0 0 0 0 0 0 0 
##$SW_h= 5175.983436853
##$TD= 65536
##$TD0= 1
##$TE= 297.16
##$TE2= 300
##$TE3= 300
##$TEG= 300
##$TL= (0..7)
0 120 120 120 120 120 120 120 
##$TP= (0..7)
150 150 150 150 150 150 150 150 
##$TP07= 0
##$TPNAME0= <>
##$TPNAME1= <>
##$TPNAME2= <>
##$TPNAME3= <>
##$TPNAME4= <>
##$TPNAME5= <>
##$TPNAME6= <>
##$TPNAME7= <>
##$TPOAL= (0..7)
0.5 0.5 0.5 0.5 0.5 0.5 0.5 0.5 
##$TPOFFS= (0..7)
0 0 0 0 0 0 0 0 
##$TUNHIN= 0
##$TUNHOUT= 0
##$TUNXOUT= 0
##$USERA1= <user>
##$USERA2= <user>
##$USERA3= <user>
##$USERA4= <user>
##$USERA5= <user>
##$V9= 5
##$VALIST= <valist>
##$VCLIST= <CCCCCCCCCCCCCCC>
##$VD= 0
##$VDLIST= <DDDDDDDDDDDDDDD>
##$VPLIST= <PPPPPPPPPPPPPPP>
##$VTLIST= <TTTTTTTTTTTTTTT>
##$WBST= 1024
##$WBSW= 4
##$XGAIN= (0..3)
0 0 0 0 
##$XL= 0
##$YL= 0
##$YMAX_a= 238814
##$YMIN_a= -312294
##$ZGOPTNS= <>
##$ZL1= 120
##$ZL2= 120
##$ZL3= 120
##$ZL4= 120
##$ABSF1= 16.44955
##$ABSF2= -4.243622
##$ABSG= 5
##$ABSL= 3
##$ALPHA= 0
##$AQORDER= 0
##$ASSFAC= 0
##$ASSFACI= 0
##$ASSFACX= 0
##$ASSWID= 0
##$AUNMP= <proc_1d>
##$AZFE= 0.1
##$AZFW= 0.1
##$BCFW= 0
##$BC_mod= 0
##$BYTORDP= 0
##$COROFFS= 0
##$CY= 12.5
##$DATMOD= 1
##$DC= 0
##$DFILT= <>
##$DTYPP= 0
##$F1P= 14.0000005364418
##$F2P= -0.99999901652339
##$FCOR= 0.5
##$FTSIZE= 32768
##$FT_mod= 6
##$GAMMA= 0
##$GB= 0
##$INTBC= 1
##$INTSCL= 1
##$ISEN= 128
##$LB= 0.3
##$LEV0= 0
##$LPBIN= 0
##$MAXI= 10000
##$MC2= 0
##$MEAN= 0
##$ME_mod= 0
##$MI= 0
##$NCOEF= 0
##$NC_proc= -3
##$NLEV= 6
##$NOISF1= 0
##$NOISF2= 0
##$NSP= 0
##$NTH_PI= 0
##$NZP= 0
##$OFFSET= 16.44955
##$PC= 1
##$PHC0= 156.3373
##$PHC1= 9.318511
##$PH_mod= 1
##$PKNL= yes
##$PPARMOD= 0
##$PSCAL= 4
##$PSIGN= 0
##$REVERSE= no
##$SF= 250.130018120223
##$SI= 32768
##$SIGF1= 0
##$SIGF2= 0
##$SINO= 400
##$SIOLD= 32768
##$SREGLST= <1H.CDCl3>
##$SSB= 0
##$STSI= 32768
##$STSR= 0
##$SW_p= 5175.98343685301
##$SYMM= 0
##$S_DEV= 0
##$TDeff= 65536
##$TDoff= 0
##$TI= <Analysis number 999999
Compound Code 99
Book Reference 9
Project Code 9>
##$TILT= no
##$TM1= 0
##$TM2= 0
##$TOPLEV= 0
##$USERP1= <user>
##$USERP2= <user>
##$USERP3= <user>
##$USERP4= <user>
##$USERP5= <user>
##$WDW= 1
##$XDIM= 32768
##$YMAX_p= 276451019
##$YMIN_p= -248343
$$ End of Bruker specific parameters
$$ ---------------------------------
##NTUPLES= NMR SPECTRUM
##VAR_NAME=  FREQUENCY,     SPECTRUM/REAL,   SPECTRUM/IMAG
##SYMBOL=    X,             R,               I
##VAR_TYPE=  INDEPENDENT,   DEPENDENT,       DEPENDENT
##VAR_FORM=  AFFN,          ASDF,            ASDF
##VAR_DIM=   32768,         32768,           32768
##UNITS=     HZ,            ARBITRARY UNITS, ARBITRARY UNITS
##FACTOR=    0.157963299565203, 1,           1
##FIRST=     4114.52639681678, 0,            0
##LAST=      -1061.45704003623, 0,           0
##MIN=       -1061.45704003623, -248343,     0
##MAX=       4114.52639681678, 276451019,    0
$$ Real data points
##PAGE= N=1
##DATA TABLE= (X++(R..R)), XYDATA
$$ [...]
28395 -63797 -45978 15775 77067 58449 28840 67311 63293 63703 59508 67333 36091 -57976 -71790
28382 -71790 -21856 -35276 -55967 -25894 -7857 -47656 -46277 -5405 36415 54468 -70520 -83376
28370 -83376 -32821 -10437 -14255 51986 55101 54434 33577 6612 15887 -45970 -70248 -121279 -83778
28357 -83778 -10995 23353 -15717 -51966 -40688 542 17214 48407 81284 93849 50766 59345
28345 59345 -5092 -32395 -44551 -40563 9104 20924 -9666 -1642 26335 6273 -4542 -19606
28333 -19606 35762 14850 13949 56396 72050 163081 152539 153869 220047 211906 170147 82969
28321 82969 35071 35970 53996 86447 53559 3786 32263 4673 57501 82889 23161 10095
28309 10095 18470 10102 18623 20563 49464 19863 -6587 -40403 7617 -26845 -23269 8776 -13176
28296 -13176 -21797 29085 37004 3215 -16133 -56985 -40061 24273 23767 15666 36234 69466 84405
28283 84405 41818 -49066 -17440 -32286 -52600 8167 13885 -55711 -59284 -20189 -10088 11048
28271 11048 44469 36021 -60336 -56158 -98869 -106709 -98420 -56455 -41661 21739 50581 25849
28259 25849 -12758 -5981 24011 54032 68465 59419 47230 16895 -19870 -21468 28800 97669
28247 97669 15770 -13929 46720 110629 79763 22414 -40711 31227 30337 -14718 42611 78016
28235 78016 120515 89728 -2194 -125762 -163660 -154282 -152487 -114528 -39223 -50810 -4361 -24083
28223 -24083 -46461 -83466 -138185 -114412 -89086 -36456 -31087 -26617 -14802 -28494 -23788 -19868
28211 -19868 -46354 -72264 -52102 -34860 -20728 45907 45581 58615 41577 -19872 -11227 30693
28199 30693 109943 59075 61847 68995 85222 101006 133143 166184 204539 208294 172199 59288
28187 59288 19952 15285 10236 -10065 73449 119575 65545 5919 665 -40617 -54343 -80315
28175 -80315 -106908 -92356 -60851 40128 12612 12701 39844 -57278 -108226 -77232 -40671 10224
28163 10224 38313 41983 32389 12914 8905 36926 35631 -1589 -18742 -37287 14015 126529
28151 126529 83523 -9587 -55410 -52348 -21286 55434 44267 17181 21148 95448 92832 61678
28139 61678 22670 -41469 -56424 -37247 -84822 -85117 -17879 9909 -25669 -89487 -114047 -131302
28127 -131302 -20944 111164 139424 125157 136148 129814 29965 18197 9440 -9144 14151
28116 14151 42954 -22277 -50554 -11322 44401 59153 63303 41539 19866 299 -49080 -23233
28104 -23233 13833 56054 77152 100991 78744 54488 59278 157794 166171 87332 83559 44307
28092 44307 -35064 -28264 7469 72142 32762 -3936 35068 41297 72147 76375 59711 -5977
28080 -5977 -21481 -37135 -9020 10541 56884 78883 24316 -46385 -9370 -8201 -74865 -89623
28068 -89623 2935 67917 61439 19105 -77044 -121143 -108186 -64029 -64576 -91603 -34458 45549
28056 45549 -17 19162 75408 80059 -13650 -70767 -126103 -70521 -34185 555 65199 50943
28044 50943 28616 28543 74998 59301 43796 7619 -87967 -90009 -85721 -95913 21953 47617
28032 47617 23908 63553 48854 -5973 64745 29695 41956 73040 9091 -49978 -84435 -67254
28020 -67254 -68649 -71750 -65730 -10149 78319 94188 46401 -1254 83484 56469 20926 -12581
28008 -12581 -68578 -44426 5197 8001 -4740 -20635 -75152 -56412 -11867 -44375 -24318 -72325
27996 -72325 -67908 -62664 -158868 -129150 -60701 -12405 -5353 -4871 22379 -18394 -6505 20443 86318
27983 86318 91219 103836 56137 -32537 39691 100867 137303 108930 118771 91869 57026 59443
27971 59443 53038 51284 157145 148358 116987 127968 109301 61831 28835 86844 68451 36371
27959 36371 78064 86895 17941 13596 68074 67764 15545 -11089 -13988 25130 45598 69242 91793
27946 91793 50019 53765 43252 -17545 -28211 67809 71388 37693 18402 -40864 -83106 -87428
27934 -87428 -45215 -19442 -77784 -101856 -67597 -21720 -12906 -47569 -67105 -5244 -6820 3817
27922 3817 -36234 -84622 -126242 -112609 -101610 -25134 26265 44761 40077 18391 -36545 -103778
27910 -103778 -147115 -101585 -29728 45693 49512 5514 12407 13870 32159 65891 23662 -61535
27898 -61535 -60740 -58183 -79207 -73220 -67646 -106039 -97319 -40614 13242 9789 29608 53454 22219
27885 22219 -26807 -9088 -4871 -77250 -76096 19385 81362 61203 82994 111714 106848 10498
27873 10498 -7556 33331 73944 74697 77628 64628 18591 -32373 -77996 -52641 -31978 -33591
27861 -33591 5165 31487 37048 50383 7333 -23705 -50031 -32477 40702 52635 61994 1355
27849 1355 -63798 -12313 -1922 16578 31728 35182 21305 48912 5952 -5840 13465 -6729
27837 -6729 49216 46148 64572 22428 413 540 -16893 -46571 -76216 -51388 30510 28094 71392
27824 71392 38912 -2224 -16469 -2333 -46649 -87100 -79252 -50709 12169 87129 74794 50168
27812 50168 25808 -10079 56874 63816 37335 15790 6152 -5103 -31410 21862 1288 -52670
27800 -52670 1224 11387 23561 56592 32169 34446 107458 86310 45246 41237 9671 -8568
27788 -8568 35370 52798 25763 21788 -48315 -32628 527 -33819 -46632 -28231 -28255 -78241 -113562
27775 -113562 -107458 -107589 -121044 -101787 -24006 5044 3983 47414 63637 39463 2146 -2020
27763 -2020 38168 37778 60815 51074 81666 69876 51842 35936 56456 71878 29236 40867
27751 40867 39273 23747 14244 2051 -11656 7334 -29535 -6100 -31512 -49973 -7454 24076
27739 24076 47273 57568 50742 60012 44204 -5255 -115904 -108899 -9287 -9750 -3254 71118 78519
27726 78519 33757 48782 67232 51157 26154 37883 69349 34264 17722 68020 75316 49113
27714 49113 -23379 -40496 -79551 -48092 14895 87901 36339 -66574 -80544 -108173 -117784 -92984
27702 -92984 -43149 8715 20623 24632 -26193 -34479 -8198 10503 163281 112755 59405 24378
27690 24378 -32416 -65760 -9755 30755 -24030 -37661 -30287 -22308 53146 4200 -27884 -83879
27678 -83879 -74824 -48498 -16242 8729 -11738 -9620 104902 149269 176624 144316 81856 72584
27666 72584 123775 41905 3798 -52502 -83099 -71346 -29180 31365 28759 59352 34851 -33640
27654 -33640 -673 17925 39637 20348 30516 26757 4953 75422 77386 59660 74043 106364
27642 106364 61249 48710 29955 80138 75046 59695 -12234 -25277 65370 80076 -1024 -45359
27630 -45359 -33660 2061 76283 134930 54156 -16996 -30838 -12529 10108 -19148 2910 22680
27618 22680 1785 -85253 -154135 -117863 -33697 -8624 19935 33060 29980 318 -44763 -32363
27606 -32363 -15084 -24606 -28866 -92035 -87013 -68031 -31878 6889 31371 7298 -33117 -94075
27594 -94075 -42127 -14718 -50914 -39670 -42170 -30061 -63647 -34435 31712 48914 7990 -9872
27582 -9872 -10441 -40128 -46842 -58196 -16349 -8706 -12398 21961 71634 119740 109936 46716 38890
27569 38890 79485 53805 37033 56314 59857 69921 -32795 -65450 -20752 -17857 -49560 -81310
27557 -81310 -39557 4338 73793 48219 5503 -96941 -105442 -52764 -14355 44783 28037 22427
27545 22427 21030 14524 -13488 14355 13576 -5352 27630 86308 135939 11417 -57933 -71634
27533 -71634 -33283 -48882 -87026 -69367 25229 86672 72902 86443 156172 94353 64001 67625
27521 67625 81482 15021 2464 24349 20104 33148 -3190 12838 -29282 -2039 -24783 -67382
27509 -67382 -105544 -84600 -76078 -68094 -14536 45297 50414 29378 -62112 -94443 -55905 -18925
27497 -18925 2739 -14928 -38549 52436 106383 121013 23443 -7332 6083 53640 63867 61720
27485 61720 82787 96518 53494 33040 65398 87800 69971 46989 46256 -21469 -2201 90910
27473 90910 39943 772 7682 31166 59042 37842 -21500 -79600 -85628 -22984 -30492 -88681
27461 -88681 -21683 -39929 -70259 -63538 13991 61281 25205 -63024 -101482 -101209 -98440 546
27449 546 73962 101685 17865 -32670 24679 -23685 -30896 -15577 -9298 60350 16081 43817
27437 43817 79817 104116 81053 29831 -2235 61220 67971 67186 75685 32892 7341 36396
27425 36396 71909 7756 -40729 -96945 -97234 -109226 -61573 -8443 5222 27038 16142 22858
27413 22858 21773 -4995 -36054 -1780 -73652 -59185 -89282 -77709 -99237 -116396 -72720 -63448
27401 -63448 6695 -10703 -62815 -16685 75602 58518 15120 6635 -10390 -8705 26935 -41763
27389 -41763 -65190 -20568 38572 61706 53445 -10456 -61988 -46906 8345 77779 53870 9553
27377 9553 -52075 -6728 72500 85913 69607 140616 89114 -7962 -1124 -5394 -43546 -127592
27365 -127592 -154876 -121551 -109721 -37452 15405 15912 25142 121495 110910 39002 -21894 -46085
27353 -46085 -29648 -21494 35509 56918 78301 87902 73653 29892 -15705 -27594 -53244 -86415
27341 -86415 -136161 -63082 -43414 14610 14333 5240 -9951 -54424 -76193 -76875 -14375 19456 6035
27328 6035 -29515 -64440 -60446 -15585 -58550 -53463 -37326 27964 14118 -19287 5357 -28951
27316 -28951 -64281 -61151 23916 70900 26893 -42662 -36928 23458 20868 24623 8618 -14857
27304 -14857 -4465 15592 20564 76233 84656 85848 71523 12399 -45969 -59604 -108964 -88714
27292 -88714 -7527 -41645 -17390 -23084 -8557 -35688 -17778 58368 74585 115208 109804 72162
27280 72162 17188 -13241 -6473 37957 86398 79382 1016 -85119 -96199 -14918 -40435 -101574
27268 -101574 -105178 -127081 -114414 -42953 -24225 -32968 -45411 -53013 -51874 -138124 -143220 -63215
27256 -63215 -21204 -64023 -3261 -5361 -58975 -85524 -120115 -146788 -107037 -98770 -97206 -120978
27244 -120978 -20835 -72070 -84835 -96791 -149425 -151800 -142913 -30577 -49380 -69002 -80102
27233 -80102 -60389 -3462 10885 -9781 42059 52450 26911 -6724 12099 71023 85429 17777
27221 17777 -558 42629 28297 -8374 -21572 -54020 -60029 -86373 -73248 -524 27004 41269
27209 41269 -44048 -86730 -18158 -18896 -52502 -76256 -96754 -101893 -133276 -91526 -72382 -10375
27197 -10375 -19563 74815 112522 71384 -9828 -37609 -46574 -54042 -73046 -36253 -46043 -15259
27185 -15259 89411 109661 118783 85730 -12306 -20852 -30796 -111004 -140790 -45833 22061 22388
27173 22388 -16242 -59556 -37579 -38590 -68724 -63029 -38965 20420 -7841 -42579 24833 -1090
27161 -1090 -9746 -15813 -90872 -112730 -133972 -162147 -145465 -37067 11813 -79112 -118360 -86720
27149 -86720 -20477 5795 63976 16720 5919 73372 161106 113621 23581 3041 -18113 61237
27137 61237 39148 16718 -16847 -23253 -32636 34402 39353 -41717 -69677 -53739 -23752 -311
27125 -311 36488 23079 -467 2854 27574 51080 4398 -52709 -42950 7784 67461 79870
27113 79870 62945 21185 28040 -26248 -111972 -128221 -95416 -102074 -70492 -47304 -53412 -7407
27101 -7407 -6053 4044 66754 52476 -20943 23875 78809 19283 -64659 -4946 95273 84539
27089 84539 5996 -27284 -29749 51567 70323 58222 54755 28444 54049 82893 31217 -65232
27077 -65232 -12718 62648 106537 137198 147063 146370 154301 101169 42338 -29932 -57306 3026
27065 3026 31814 52667 34878 86337 111961 106718 33459 6504 104608 163656 144937 39372
27053 39372 -56052 -35288 -7025 10195 -17023 7544 86 -48966 -52666 -5319 12024 47866
27041 47866 94772 133973 156789 72187 -44811 -64150 23808 41858 27482 74617 85848
27030 85848 72714 14794 12445 35732 90631 72602 41960 8463 -26550 -41555 -5603 -57225
27018 -57225 -75825 -52892 27688 27993 -53445 -62711 -8758 18224 48453 93155 103585 65640
27006 65640 55753 77998 41554 28995 125928 152265 118565 94362 28783 -37374 -61984 -20363
26994 -20363 25348 55095 52938 20740 -9541 -66957 -85616 -93842 -90410 -26673 -10667 -21393
26982 -21393 -24180 -17821 46169 55991 85266 170253 148490 99328 109641 124903 49774 -30784
26970 -30784 -36681 50200 56723 7585 28343 99409 67893 34265 47212 -44993 -74057 -62060
26958 -62060 28676 28190 -3231 14040 58717 56808 75854 59410 71459 106992 68211 22913
26946 22913 45378 62787 82623 31899 -13878 -31683 26777 39565 33428 72555 94703 119694
26934 119694 49635 25898 -8067 -20618 37643 43826 24713 4187 -495 -27277 -98023 -30408
26922 -30408 28655 99909 78585 83670 48994 40273 45287 14598 -5896 8099 -1483 18289
26910 18289 58378 57187 39799 26429 78652 109415 136125 181617 103994 41594 4597 2924
26898 2924 3494 -59733 -103105 -40637 25103 48901 -7207 -36431 -21160 -8651 30370 101229
26886 101229 115119 67194 20991 5157 -5195 -11309 -34557 -9823 -16073 -10734 -56404 -65048
26874 -65048 -75684 -79404 -119218 -88115 -51186 30460 -3089 -48581 28071 28541 25051 19508 51837
26861 51837 -8396 -37332 -436 -50393 -75812 5830 -24454 -48247 -8129 6266 66101 66093
26849 66093 -8373 -61776 -94935 -123946 -116311 -117596 -18835 49398 12662 47533 52590 -21883
26837 -21883 -37907 41073 60574 24965 -54423 -76579 -67062 -18067 48329 59877 67973 97209
26825 97209 91423 18563 1247 -36433 -34745 -10419 -21792 67348 141982 106429 64907 64947 46267
26812 46267 59104 -11729 -34985 -45853 -35384 -6627 -23238 -28895 -20505 -119216 -124885 1235
26800 1235 67973 62998 85409 122666 183012 195388 150157 51759 -60091 -28846 -46726 -43028
26788 -43028 5727 -16595 -26210 13263 -32031 -58501 -11696 -53377 -120513 -124807 -123348 -113602
26776 -113602 -132460 -82422 -27323 -20839 -8380 5394 14376 50697 45647 -45153 -98737 -74556
26764 -74556 -33979 -61682 -111149 -79018 -84619 -29736 -41437 -22093 -42513 -61281 -58919 -74663
26752 -74663 -120221 -136735 -55719 52457 27729 6210 -36514 -55624 -44720 -29531 -30374 60329
26740 60329 76288 36909 -52186 -111538 -86198 -25295 34617 -29441 -41231 41663 73545 36075
26728 36075 -54721 -89672 -38209 17828 -657 -34668 -12628 -16589 -43106 28570 12940 -4730
26716 -4730 -43435 9146 -37583 -21773 40700 125741 83801 23516 3573 -1224 -67448 -65937
26704 -65937 -4478 8415 68071 58223 23611 33388 104769 115542 64942 93414 144494 155821
26692 155821 123086 107247 110614 137238 148929 153991 146103 154062 83871 68970 47131 -75901
26680 -75901 -89691 -31360 12749 -12902 -40538 -52623 -97304 -100837 -126291 -52558 65138 59070
26668 59070 20244 31742 51328 64781 39531 90304 73220 48964 -42641 -6963 25581 16428
26656 16428 57546 58622 52812 79065 120810 68400 43083 35454 66407 70791 -21869 -9729
26644 -9729 25654 85384 151493 162114 129428 199038 159695 89439 290 -29438 -65149 -77467
26632 -77467 11023 43522 -28728 -28778 31712 59281 94030 116829 154339 68379 24641 77943
26620 77943 121047 161629 117668 55505 63964 93367 46726 78704 20709 14320 -17402 -109008
26608 -109008 -93266 20054 71455 134046 105268 78364 63503 3024 -57448 -73661 -159399
26597 -159399 -139083 -116562 -63665 18245 48074 31495 -30857 -31731 43067 105341 66301 68489
26585 68489 102882 93877 31121 -29068 -62668 48983 70837 33150 21682 45580 60372 34574
26573 34574 -16855 -87496 -129325 -142115 -127430 -43821 8263 22772 56394 80443 58874 79010
26561 79010 104300 101278 118423 107122 133494 112933 89551 122817 114466 77793 61923 38915
26549 38915 -3122 -63051 -92212 -70172 -72303 16832 114976 88002 103534 81375 19007 1356
26537 1356 -15076 -36495 23687 82138 98555 96469 87130 20333 -53086 -38960 -40315 -85434
26525 -85434 -104787 -96143 -64653 -38688 -3573 36624 75899 142514 54467 -15984 -95007 -148793
26513 -148793 -81574 -87781 -40958 -52343 -64982 -104905 -61609 -22125 3184 13791 56376 67719
26501 67719 10419 15271 -9442 -13570 21178 -6910 4710 24670 25753 11231 -50639 -97607
26489 -97607 -44581 8104 12619 86555 68390 18801 -36227 -42341 15756 63136 67702 73357
26477 73357 35873 -9694 -35334 -6738 42395 40758 844 15609 20946 -20241 -8866 -12153
26465 -12153 -20753 -26683 -22122 -85428 -73588 -70176 -93124 -119423 -64437 24627 9115 6950 4542
26452 4542 -41003 -61787 -15225 86312 176232 129247 71945 16391 50341 101749 35254 20361
26440 20361 69244 85670 69556 11851 -25709 -43302 -76366 -95408 -126645 -52015 -22844 22640
26428 22640 -26684 -75730 -120701 -136437 -140022 -85924 -26197 -18658 -26889 -19078 -42746 -13922
26416 -13922 -33698 -40677 -73898 -83325 -75845 -62266 -52107 -19058 -14971 -32747 -52940 -66361
26404 -66361 -78929 -94724 -85304 -25024 -17732 -80880 -69658 -60126 -84164 -72417 -21256 -11782
26392 -11782 -44887 -60460 -10447 36676 3491 -22581 -741 -31233 -72086 -72937 -63302 -53338
26380 -53338 -10576 3034 -21343 -24010 -76400 -30853 534 32475 42368 69012 61642 3436
26368 3436 -1588 33500 37607 89735 96170 41424 27106 15505 46926 28297 -18646 37172
26356 37172 19027 8678 -23750 -49027 -79983 -97454 -28477 65286 102742 33026 52498 85693
26344 85693 99471 131624 30459 -29394 -43139 -5667 72161 118854 110464 127318 131771 70376
26332 70376 30801 -29326 -93715 -44306 59510 113739 47307 -43357 -26484 26554 37776
26321 37776 9330 -28280 25338 49285 31687 105 51744 42672 27160 -13409 -33890 18251
26309 18251 38145 60367 48524 36134 25097 30844 60892 69476 65326 -2325 8749 32362
26297 32362 57993 -550 -55814 -57250 -14262 44558 82069 76968 153183 159616 95722 19511
26285 19511 21118 58523 22876 -19169 -48737 -75279 -90987 -38545 20055 70297 62811 84570
26273 84570 100065 71300 76137 65044 20470 55445 92249 41760 23521 87507 74502 47621
26261 47621 71714 87407 73311 53321 -5497 -27871 37489 62012 3643 17886 35687 7662
26249 7662 22395 20383 29677 16160 -2397 -1666 19507 28966 -20991 -101418 -53318 -24507 -52377
26236 -52377 -19421 -65661 -102138 -69140 -24672 13346 -7839 -36709 -16065 1440 -2021 31540
26224 31540 12352 -34483 -49842 -76151 -84461 -11161 3782 14283 -9607 -64975 -64294 -61700
26212 -61700 -29312 8556 -20006 36105 51754 18405 -30889 -25560 1176 26589 43032 46069
26200 46069 47891 33374 -11372 -95123 -61872 -29743 6817 62147 40584 -9846 -28818 -81786
26188 -81786 -93883 -61016 -30368 -1087 -10650 -30266 -47920 -81967 -67534 -22130 44559 51919
26176 51919 35506 57049 17559 16122 53226 43458 103508 97190 73143 17043 -519 -17698
26164 -17698 -1063 -45871 -84530 -95411 -59928 -94984 -77592 -59724 26801 54904 25441 10063
26152 10063 -53211 -6278 15237 -25416 -60185 -50622 21420 46249 57012 46232 27367 33087
26140 33087 -19213 -68849 -53730 -52398 -76716 -70847 -50561 -19303 85917 93264 62803 11335
26128 11335 -18873 -10094 3298 81367 127136 96283 119032 131206 75694 66922 54339 47076
26116 47076 23628 -27022 -9071 -34472 -20782 8512 -18981 -50513 -30162 -26368 -125805 -155243
26104 -155243 -113596 -103245 -95956 -61579 -67113 -108969 -94943 -69037 -68775 -93178 -75375 -15064
26092 -15064 6479 -58569 -87157 -20122 19160 9319 -36632 -58706 -16580 52037 65532 47984
26080 47984 -13002 -33414 -7494 17240 44740 66061 64047 59227 46946 54171 24776 39765
26068 39765 15127 -24100 -46596 18353 42480 18306 -48185 -63564 -39780 -42650 -61070 -69193
26056 -69193 -61258 -82327 -18555 12578 16769 11402 25374 -19700 -70915 -48511 -7526 -51288
26044 -51288 78143 90778 69788 37142 -15606 -69156 -28833 -7195 38528 82240 67104
26033 67104 96976 100600 87705 48841 67610 49618 89384 144103 104242 39765 4502 191
26021 191 66427 96042 90629 6155 -53848 -26258 55814 100317 76514 80350 57848 15985
26009 15985 35305 71388 34768 -26548 -65050 -106086 -108480 -26733 -6600 23314 70881 94538
25997 94538 73206 22998 -29415 -15411 -4222 -23689 4426 73096 29309 26235 23616 21804
25985 21804 100239 95456 78941 96206 65252 28065 26547 30856 78789 54667 25916 -28580
25973 -28580 -3888 46895 43441 37095 5063 -17534 5569 -23670 4661 10295 20345 77398
25961 77398 13255 15146 61300 4481 -11749 22130 4190 -46937 -12766 -874 16156 -378
25949 -378 -4914 -29088 -22336 -25976 -13281 23229 87814 93471 94492 94106 53583 40388 69726
25936 69726 88249 74651 -30956 -49858 6180 55061 23598 -60631 -64880 -59104 -1892 -43980
25924 -43980 -96896 -170688 -102526 33196 57230 61208 -20218 -41857 -29606 -62785 -23374 58779
25912 58779 -8350 -5963 -41644 -36182 -58219 -75233 -60397 -75742 -35938 -5889 2842 -54177
25900 -54177 -42643 -85720 -61513 12256 -4476 -13922 4605 -9551 -38644 -31966 -34600 -74478
25888 -74478 -69973 12226 -15397 -22314 -62647 -98821 -116841 -55704 -12454 -116863 -94756 -88299
25876 -88299 -80292 -14730 61912 25403 26506 49826 13854 26875 -3357 -44713 -49904 -53005
25864 -53005 -49032 -48366 -37091 -17989 28483 65483 81236 97079 39260 57215 79071 70008
25852 70008 78219 155761 133898 47772 -26321 -12321 -33828 -7604 62750 98105 46927 9878
25840 9878 23030 42920 40400 25011 33428 36288 47136 27227 -1866 8730 -24189 -70301
25828 -70301 -43985 -21290 -20800 -61617 -24788 -29123 -104852 -122649 -69543 -54436 -73997 -18300
25816 -18300 48001 35210 4223 -36755 -49790 -34525 -5717 40194 9665 1005 30241 -5168
25804 -5168 -28184 9885 22623 -30034 -29755 25833 3798 10938 -5465 -27820 172 5592 11458
25791 11458 38042 35607 53473 77047 17596 -30207 -2178 60952 45512 -36502 -100951 -102808
25779 -102808 -138742 -70255 -28444 -32580 -21410 34021 44645 12386 -49715 -10945 46933 65240
25767 65240 118463 95059 93965 88634 27491 -8926 12226 30012 60303 101386 78968 44170
25755 44170 4154 21694 33129 -67345 6517 79869 63436 44936 17470 -21358 -3650
25744 -3650 -21753 -16324 20416 55675 22803 -81341 -94454 -55829 -96240 -84484 -27350 -19330
25732 -19330 4745 60697 65266 58146 3117 -11204 -30959 -20819 -50229 -51688 -115147 -113578
25720 -113578 -66787 -30949 -57946 -109721 -43931 7703 21676 -33051 -99660 -110367 -85480
25709 -85480 -46880 -12430 72691 32006 -73149 -120820 -79988 -38378 -28699 57946 62147 -8359
25697 -8359 -64628 -22936 12738 5445 -8441 33539 7849 -31240 -54507 -54612 38868 64370
25685 64370 53854 -24440 -95534 -99176 -39226 159 40586 39392 28830 -9628 -15044 18253
25673 18253 -7564 -31600 -13353 -12302 -52921 -16848 20468 94440 62304 7553 -13256 -22391
25661 -22391 -14626 -37180 -56889 -28684 -7471 69745 131451 97317 55265 167 14488 58859
25649 58859 -1337 -44949 -25072 52418 110389 106164 52885 43925 36007 10459 -90993 -103197
25637 -103197 -123326 -98436 -35031 -30676 32032 42702 9938 -74070 -58614 -59419 -80389 -51517
25625 -51517 26125 12717 27125 21602 -18239 -43569 24178 13519 -39990 -64148 -75063 -39893
25613 -39893 -52315 -77317 -16131 18874 32562 1398 -12493 -46909 -27964 -29355 -52754 -75214
25601 -75214 -66785 -72502 -144542 -95495 -47087 -68152 -92903 -93703 -81365 -18019 -3979 -35479
25589 -35479 -2589 -26001 -83692 -118778 -162278 -130354 -124802 -84044 -41208 35430 29201 27619
25577 27619 13902 29665 92548 112209 82496 41320 -3034 31530 -44007 -79788 -49558 -17800
25565 -17800 -27057 -92879 -83591 -66848 -50562 -81239 -36533 -31820 -32824 18696 33785 886
25553 886 -41481 13683 -23380 -42951 -30158 -22957 -24755 27213 89850 128591 82031 65225
25541 65225 26740 15334 16315 17124 100755 92553 73771 25135 -33850 1346 25697 -5203 -2962
25528 -2962 -51762 -93098 -88147 -50977 1392 -63134 -131224 -129913 -104619 -56658 16324 31988
25516 31988 64224 119568 107914 77396 102701 128410 94341 52921 109982 164687 114736 132351
25504 132351 112155 6168 79408 142753 165511 111136 102077 114389 111083 81521 82837 66943
25492 66943 -27587 -84259 -121613 -108549 -49864 -12556 -59174 -22638 39608 -23070 -8381 39045
25480 39045 -1239 -33487 -67025 -5849 14284 60848 68337 65049 51921 -18514 -68245 -114742
25468 -114742 -127255 -103706 -79505 -62545 -17532 36235 37537 1987 -14949 22050 24910 338
25456 338 -11699 5249 -37407 -111786 -122807 -153024 -198182 -160134 -91306 -1454 23961 -21697
25444 -21697 -38521 -64884 -13084 -21376 -31502 -48327 -55130 -78440 -93204 -65311 -48310 -10343
25432 -10343 -23596 -48558 -84573 -93704 -30980 27885 16596 19950 7592 -19140 -34559 -12858
25420 -12858 23310 52832 121555 119553 -3727 -65604 -124294 -66618 -21028 -71775 -65113 24023
25408 24023 61484 68736 64968 36536 12042 31929 28684 -52391 -169302 -121494 -58644 -22014
25396 -22014 47036 90270 37951 -5512 -32206 -39685 16851 57453 46050 -47923 -67017 -58892
25384 -58892 -43300 -36026 -50355 -61297 -13251 30566 -47049 -74765 -75426 -80639 -137495 -76315
25372 -76315 -3344 -50627 -73812 -167449 -107032 -44739 -36918 -10176 15568 15502 29182 28479 15762
25359 15762 -8747 -24695 23705 34588 47370 47911 112653 107009 48297 2034 -5812 -35040
25347 -35040 -53423 -1979 62843 81595 68740 -14401 -11332 -6811 -35869 27095 46142 75719
25335 75719 -10229 -42411 -24445 -27308 -75557 -105670 -64638 138 32272 98530 116593 127687
25323 127687 227231 219758 115507 39111 10349 35069 12387 -29468 1047 41363 105924
25312 105924 115948 64378 25785 40941 85339 94648 33805 -7242 -27713 -66347 -54328 18525
25300 18525 11061 59587 38451 22776 26116 27512 48051 108899 86154 8615 -83337 -135409
25288 -135409 -99925 181 56433 105975 68546 -34584 -65690 -68015 -65922 -36347 24664
25277 24664 46475 137303 139048 140464 99878 31605 42151 58539 49964 64936 43812 55058
25265 55058 48845 28158 7333 -44865 -36045 -50937 -69142 -51161 69188 112508 107729 91741
25253 91741 28511 -8458 -99149 -115787 -49219 -58207 -74785 -47201 -6930 35029 33992 -104719
25241 -104719 -154295 -181974 -150666 -107054 -140034 -113139 25367 76918 8852 -47668 -21473
25230 -21473 -22298 -54396 -43651 -25366 -12566 -39214 -72106 -45519 -18072 -30127 21933 43691
25218 43691 55445 1085 -52815 -14621 35217 67808 46184 17703 -13910 67645 53726 12800
25206 12800 -4220 2176 -28262 -28571 -35776 -25889 14585 30369 -4447 -46656 660 44118 57324
25193 57324 85117 130630 71278 78713 85458 79331 29666 -18099 -74549 -30832 -59144 -57953
25181 -57953 -65301 -63129 -41590 -25508 -31848 -43563 43904 89479 110722 113617 97282 73770
25169 73770 35836 9809 73728 26596 34209 64848 24390 -49054 -34540 -39600 -8540 -5038
25157 -5038 1358 -50162 -70620 -62110 -100295 -98258 -15550 45285 67649 56016 17314 3467
25145 3467 9002 33947 15484 -32087 -10917 -3944 -114050 -138883 -103821 -103293 -90294 -64569
25133 -64569 -1369 1701 -62691 -13204 15012 32326 9504 -21756 -8932 -50910 -25 64695
25121 64695 20153 33749 95559 65812 25312 35273 40699 -27781 -68779 -65070 5596 11708
25109 11708 3312 51853 66573 -31421 -51943 -10880 5101 30223 63632 142298 126862 33458
25097 33458 -22261 -8856 72279 118205 46947 25284 43458 14372 7282 37017 54260 58137
25085 58137 51863 78816 34733 40922 56818 29527 1401 -76200 -119490 -116020 -97066 -9703
25073 -9703 13758 -7514 -28965 -35726 -84682 -122567 -155289 -180953 -110074 -29118 -20897 -24503
25061 -24503 -2468 -32216 -72339 -133231 -73092 -18732 -12333 -85308 -61452 -58809 -27568 -20370
25049 -20370 -20577 -31677 4678 42268 38589 -31008 1282 -18346 27542 70198 -5233 -90707
25037 -90707 -16383 -16475 -60983 -50269 -20499 66152 82141 -46849 -84725 -80067 -38767 -9809
25025 -9809 -39306 18283 76190 69668 54346 50751 19847 33513 48063 -19027 -97039 -113897
25013 -113897 -106993 -143432 -188689 -130128 -57435 42188 7458 22523 60456 108615 104294 52537
25001 52537 -30604 -20577 31655 22712 -22285 -80610 -74216 -34284 2267 16874 -35795 -23568
24989 -23568 -47062 -21008 61644 107464 87377 40919 -24325 -3834 1056 -44039 -70747 -71125
24977 -71125 -65542 -100359 -148023 -106507 -3355 681 -39908 -55622 -10960 -12938 -31711 -1791
24965 -1791 19160 -5475 32891 30704 6585 28942 -8547 27942 48331 27439 52399 20737
24953 20737 -63732 -102471 -40689 9742 -252 -34446 -15096 57157 78034 42686 71322 51688
24941 51688 30872 -63387 -82200 -23695 12851 58944 47300 104264 98906 57327 23855 -41927
24929 -41927 -43267 -57999 16031 116443 70718 35252 8014 -33404 -74465 -9829 29129 53365
24917 53365 -18829 -52536 -55675 -53025 -4611 4779 37536 26569 37744 78137 88972 76624
24905 76624 84038 71730 5062 -56797 -100299 -68973 -44848 -23145 70960 94486 80378 90285
24893 90285 102270 106471 87708 37642 -12443 36333 73306 9908 -13136 -58560 -5015 -11439
24881 -11439 7671 -23115 17445 81634 36840 -42139 -69355 -11264 -4055 13398 -20337 -2776
24869 -2776 -14903 -26494 -32767 -35463 -31263 -63607 -52659 -32330 -37478 -19270 27135 32259 90413
24856 90413 106705 64075 137167 150224 42683 -13735 -5915 44534 76249 80817 23851 -48234
24844 -48234 -124493 -67370 21152 8122 -27364 -39057 -66453 -67498 -113018 -114672 -67123 -68412
24832 -68412 -82133 -57910 -24770 -33978 -4310 3036 68173 95458 31220 9671 -2001 4543
24820 4543 2191 -59142 -127011 -125674 -73687 -40941 -351 -5307 8618 61028 76372 50877
24808 50877 40350 99097 132324 52096 -22838 -55285 -8415 66247 50908 84635 17688 -73107
24796 -73107 -52026 -73923 -69532 -17265 79020 -3487 -42796 33728 68982 39185 56263 106942
24784 106942 119271 111834 76089 77093 78166 91773 106753 73232 88143 106848 48060 -5473
24772 -5473 3866 -38827 9037 51475 35432 -3271 -58673 -50211 -68941 -46496 7509 44406
24760 44406 9697 -44036 -46707 -52971 -28869 20829 -18780 -43409 -66576 -94542 -116270 -81957
24748 -81957 -107044 -107273 -64677 38344 91302 65904 -14351 -52552 -16093 42520 72312 31144
24736 31144 -19043 -6422 97794 116845 28086 4308 -31891 -59060 -73228 -27447 16528
24725 16528 56769 50739 -15256 -30592 -17451 -14681 29532 12044 -4725 44420 -18866 -40975
24713 -40975 3133 24796 48410 48838 114771 109138 76758 92703 122987 120793 99451 45321
24701 45321 -19227 -68430 -35923 -3358 -56327 -46147 -39854 -14868 -9789 -20266 -80639 -92392
24689 -92392 -124826 -143055 -65667 13534 -19968 -9777 32642 12365 -86243 -57815 -39471 23871
24677 23871 25783 16217 -8924 -5543 66214 141023 157071 168135 205968 172122 116276 100911
24665 100911 85287 55958 32373 15218 15728 -2684 -24342 -48053 -61026 -65267 -52256 -32815
24653 -32815 -15638 38817 68125 88935 99378 86653 75742 98369 20004 -29156 -50239 -82566
24641 -82566 -60060 -58316 -35717 -34200 -58571 -62281 14428 59595 -7762 -105196 -100763 -58044
24629 -58044 -36679 16953 47797 95389 103773 33293 -14176 -46027 -106040 -38953 32878 21883
24617 21883 50328 23073 -34468 -60466 -67106 -72069 -85101 -19544 36483 38481 12320 40273
24605 40273 58049 53312 57134 74598 77514 47786 35068 57286 54782 41344 -3117 -4849 12522
24592 12522 30317 11287 -55354 -46205 -50410 -47809 -37280 9845 51495 60435 27186 -47355
24580 -47355 -88981 -73146 -21893 -23527 -85977 -55525 -29730 -10101 64114 109934 153672 161453
24568 161453 175076 168513 158848 50782 -14492 77259 165929 122341 73933 91963 118872 124760
24556 124760 120825 91302 24149 36322 45865 47750 40559 62546 73006 34626 18413 -626
24544 -626 -36957 -77901 -74800 -60173 -85667 -97990 -23019 34920 56349 35146 31967 -27882
24532 -27882 -6788 3135 -4638 39360 35538 3051 -53640 -81279 -74878 -61595 -52564 -65081 -40001
24519 -40001 -19519 -15122 -40429 -44554 -69953 -74544 -58260 -62741 -49638 -114177 -158144 -125612
24507 -125612 -93449 -8734 10090 -9420 8011 60527 66914 116108 59594 27567 42413 5771
24495 5771 -40040 -70646 -32761 -24643 -36195 -115519 -106852 -71272 -51089 -1430 -29565 -91988
24483 -91988 -59410 -16053 -24929 -43661 -32779 -47304 -96964 -96717 -22380 -21351 -59444 -36537
24471 -36537 9602 -21602 -59258 -12678 36912 31901 13684 -85280 -45141 -1979 70499 59170
24459 59170 297 -17779 16983 39048 21000 -27359 -66889 -106171 -113425 -61303 -57231 -16706
24447 -16706 -21668 -64224 -81199 -81209 -37539 -72910 -97744 -95736 -98807 -58931 31347 54440 -34642
24434 -34642 -151157 -184208 -145698 -110041 -19088 50489 60097 15284 9573 7540 55260 3505
24422 3505 -21277 -40181 17769 68809 73766 25744 552 37944 48088 22677 45586 84012
24410 84012 39741 35336 75913 93569 66076 -17360 -75346 -140072 -84415 -37191 -39543 -55278
24398 -55278 -21155 23138 77053 107516 92680 81267 48067 68687 16467 -67380 -75608 -5189
24386 -5189 -28355 -60113 -49994 -28092 9241 -28419 -32130 12146 25090 27000 -368 66749
24374 66749 69228 15538 3890 45522 59014 80139 25299 14709 23751 46158 40548 33745
24362 33745 64288 79502 10047 7359 2788 -98339 -39145 -6353 16660 -22265 12184 4882
24350 4882 22065 91697 44227 -45263 -30127 88220 35026 24000 87982 44197 -32214 -89378
24338 -89378 -24655 -30279 -88133 -62757 181 15785 53723 39950 -8476 -50061 -122495 -99249
24326 -99249 -46000 -17874 -12030 10674 53115 87051 136695 114516 76107 16599 689 -18312
24314 -18312 -33843 -3102 -28784 -117226 -74347 11130 54282 6736 -55854 -89117 -88030 -68293
24302 -68293 -49761 22673 30161 9135 535 -9025 27763 10200 -66451 -84754 -67279 -31175
24290 -31175 16975 84751 71558 12544 -16637 -84468 -109074 -105726 -67963 35534 74560 32843
24278 32843 14692 -39544 -14291 -4577 539 36560 -21005 -21867 -9848 -79209 -99276 -29394
24266 -29394 29567 9608 -5957 27705 44057 46484 14304 20317 79499 55089 22473 -5261
24254 -5261 38936 59821 34412 44774 -27980 -55037 3890 -6957 -19111 8504 -17270 1346
24242 1346 -2042 36114 -6667 -19755 -77194 -95064 -11192 -8821 -28875 13748 30692 -23584
24230 -23584 -12998 6294 20784 14949 -36552 -41545 -104959 -57751 -9930 22060 72406 146289
24218 146289 179556 105558 106601 130650 84756 -4461 -23775 -64756 15751 101374 48264 36291
24206 36291 77651 107462 39075 -77401 -76604 -52450 -61373 17817 13007 7095 -7389 -26094
24194 -26094 4427 -22044 -64177 -64488 -13682 15254 -5582 41971 3076 -53494 -18591 37699
24182 37699 13415 45163 81559 93864 42925 -18548 -72984 -69957 -27043 -41301 24829 69399
24170 69399 53078 4800 -14078 51450 26342 -28008 -22516 -12564 8212 -14498 -99000 -82987
24158 -82987 35928 74727 29733 -66708 -60473 -26804 66514 83452 76417 90032 74095 60093
24146 60093 18872 -11815 -8780 -3150 -32685 -63169 -134575 -23977 17390 -65060 -74062 -29052
24134 -29052 -31750 -6508 20237 76206 16484 -1310 38358 69257 73374 61850 17658 6604
24122 6604 14736 63153 63473 65169 33570 -43514 -65874 -87515 -75960 81042 99421 33465
24110 33465 47034 76588 62702 85071 124073 73696 28168 17748 -76589 -84488 -62552 -45744
24098 -45744 -45573 -29023 -58046 -104599 -118349 -74217 -51382 7189 15539 -61601 -66427 -41213
24086 -41213 -36599 -18590 4547 -64434 -169499 -143148 -111429 -94547 -118010 -90606 -72786 -65974
24074 -65974 -101771 -88341 -75190 -93795 -31746 13462 51809 51725 -31995 54528 72163 11370
24062 11370 23156 50490 7449 -13872 -42259 -113616 -93349 -75084 -31717 15980 37749 15054
24050 15054 -59775 -116774 -118972 -109899 -115549 -107893 -65465 -53655 -26573 4874 23183 18498 -28075
24037 -28075 13328 91109 160571 147197 113996 106620 26285 -17147 23335 50812 32994 86062
24025 86062 39426 592 -3621 -4565 -8417 17919 76686 64194 -19203 -29873 29348 29719 39527
24012 39527 24885 54620 62368 -16386 -55820 -78531 -69781 8856 -28641 -12572 32647 99598
24000 99598 89593 59734 33617 75762 100077 68950 -5359 -37303 -40280 -19542 12008 -27008
23988 -27008 -93876 -96698 -150704 -169356 -86374 -52220 1917 13052 30276 69839 43868 -24268
23976 -24268 -40818 -44166 23088 108430 95222 72412 34165 30259 45188 75368 93802 70930
23964 70930 -3730 -15842 -5442 20527 82657 82068 46467 65695 14337 -1700 -14297 -28582
23952 -28582 -35594 23507 64380 85709 21891 9197 31918 27000 7830 -21636 -38541 -56700
23940 -56700 -27569 4098 49818 49320 62746 61420 37266 45150 15648 16018 -15373 17582 44191
23927 44191 -4059 -72461 -127683 -103360 -105030 -20515 106107 87365 11593 -7753 30461 34821
23915 34821 -14077 -82234 -107661 -114288 -55300 32466 33278 48908 104117 142665 85700 28199
23903 28199 -65022 -53841 -28387 -46507 -75098 -47487 -41112 15544 7446 1478 -70605 -104708
23891 -104708 -65858 -11591 14927 -8392 9721 2551 -37868 -12823 -23951 3126 75763 61654
23879 61654 -21622 -98871 -139455 -108651 -97170 -57503 25384 28292 -68881 -128248 -100091 -43842
23867 -43842 -15010 8358 -15823 -84255 -92418 -32001 30227 24322 -534 -29896 -65594 1845
23855 1845 26380 11565 29338 18825 -97888 -70534 -32362 -51643 -71855 -60310 34165 91483
23843 91483 46767 -33841 -42984 -7888 11099 -9995 -57587 -7248 70066 63691 45480 42107
23831 42107 36800 34459 35921 111142 134701 78723 4908 19749 -125 -37965 -31314 41947
23819 41947 16067 -14979 40104 90606 73403 16211 -51157 -57343 -30677 -11638 18367 82527
23807 82527 66316 32457 76763 67409 5230 2952 92056 105205 42997 58578 101783 73440
23795 73440 12388 28665 64860 -16800 -15522 29534 -10273 -118028 -114217 -81056 -39891 49533
23783 49533 105284 80474 34406 34490 23540 18579 13925 -14683 -32440 1351 34303 -14941 5789
23770 5789 35469 -2630 6202 55442 74557 107428 123904 28495 33429 67694 1653 -55298
23758 -55298 -57060 -14782 33108 113244 95263 28357 -8560 30346 22768 5964 6619 -8046
23746 -8046 -10151 -2850 -55630 -58104 -691 32481 45624 44186 53177 9533 -28834 -25478 -23381
23733 -23381 -47357 -87615 -133256 -78465 -79683 -37729 -11729 -25534 -52691 3589 17243 -77510
23721 -77510 -99886 -103951 -81344 -83240 -93703 -91920 -39968 -16830 -64728 -6130 16582 -54463
23709 -54463 -17618 5725 53605 45558 56506 93529 127340 68521 28210 116282 154811 98817
23697 98817 3158 2826 60555 70147 -88 -10950 -44158 -62154 -73022 -16115 66648 60001
23685 60001 52954 9965 -9562 -62249 -41223 -57292 -58943 -65220 -57545 -2237 4091 -51967 -22503
23672 -22503 23984 6066 16950 -22126 -16955 -4351 -59957 -158230 -94958 -3609 41326 28389
23660 28389 -12034 22 -41830 -33622 -14513 -337 89308 76349 37576 62940 131256 80409
23648 80409 -34811 -75914 -34418 6426 -11579 -14896 -36821 -16797 -42048 -101005 -15567 34983
23636 34983 -20651 93734 132873 56953 99584 134486 154601 135545 107952 103952 108991 67049
23624 67049 -4372 -68941 -44676 -8833 -1704 -24409 -1100 18034 -20119 -43146 57656 33893
23612 33893 -30084 -47464 -79580 -114545 -101318 -92712 -105217 -77035 -33505 -96036 -137133 -81945
23600 -81945 -38124 35548 77381 89625 3795 -14547 36388 29494 51688 91158 80912 25796
23588 25796 -37808 -46301 -35378 -5689 11768 8871 -51797 -97937 -99059 -63979 -52459 -68316
23576 -68316 -42213 19939 70532 90528 67944 55296 100415 91568 16447 32558 -2250 -11186
23564 -11186 -37106 -23926 12200 -109579 -150861 -76886 -5620 -58690 -51110 -7331 -6606 -17848
23552 -17848 -5911 49989 108226 109865 102641 60653 38929 41281 65040 88321 123615 119291
23540 119291 81050 87058 71088 -2330 -37020 -43704 -23652 -6926 9830 44526 67987 67782
23528 67782 65258 126430 62996 33372 -2837 86953 102903 98831 37728 -61760 -39201 8229
23516 8229 31618 102848 106337 58523 1511 -8298 -25336 -79139 -46132 38931 90845 36528
23504 36528 47795 42241 2847 78003 117592 30563 -20626 7543 34908 -12239 2269 -33282
23492 -33282 -77047 -35965 60376 71164 94150 100574 78324 39820 41760 18338 -21351 -30362
23480 -30362 -59161 -35438 -17671 -2594 12981 118139 156603 164268 107527 74096 72058 82893
23468 82893 -6276 -76581 -22957 7235 -24737 -94344 -78625 -30254 20694 -13781 -86380 -57920
23456 -57920 -39998 -28434 36291 104456 105311 85571 116007 166779 122008 101654 160871 151434
23444 151434 116480 39361 -22781 -67269 -70496 -29249 6547 32122 20757 -4972 -55124 -59151
23432 -59151 -49519 1946 3556 -12418 -21079 -87533 -28531 -43826 -72697 -30576 -66546 -76640
23420 -76640 -61166 -11416 -23308 -4056 45135 37407 51600 69796 38758 -6490 -75567 -145417
23408 -145417 -189124 -140515 -60412 -16667 30258 -15641 5927 -6238 -43813 -31421 30869
23397 30869 50204 -8497 -33595 -57767 -18130 50741 23972 15984 4027 7326 52472 78049
23385 78049 7504 -70487 -71822 -69680 38344 71307 60591 -3210 29638 57649 87262 18600
23373 18600 -39354 1828 16205 -24795 -56003 6968 94345 132630 81315 6999 -62695 -56629
23361 -56629 -41096 -68512 -173326 -153926 -83729 14210 76340 78909 81778 26924 -18444 -24254
23349 -24254 -8297 4406 66646 71658 25395 113352 81566 19001 -5115 -66336 -124456 -78112
23337 -78112 -81972 -97766 -53339 -86199 -66397 8824 71962 42488 66751 7976 -3567 -19706
23325 -19706 55697 81772 137922 109068 90496 39801 -100001 -93537 -68207 -80817 -160975 -220478
23313 -220478 -149076 -65112 -103182 -119671 -63727 -9257 -20397 -78072 -123197 -62417 -19968
23302 -19968 -49652 -94377 -99264 -66096 14536 34621 73683 56959 36356 3789 -28866 9645
23290 9645 20594 40735 46463 15264 4338 20672 1866 -24218 -19136 -60898 44597 96804
23278 96804 53905 34083 16927 78939 96420 70824 43787 28446 45261 20195 -19947 -27953
23266 -27953 34768 67417 71107 34027 13724 33833 20383 29927 81985 59440 32410 36837
23254 36837 -18255 -76999 -6658 22623 56195 62724 55464 28506 40944 -1986 -52195 -23605
23242 -23605 -24981 34907 90915 73447 80788 67380 -21049 -42118 17630 44453 77043 42832
23230 42832 63895 91200 73444 60316 14701 -57463 -57656 -33950 23774 73867 33712 21810
23218 21810 -8852 -85190 -143610 -67207 -10915 34152 22416 39552 17234 10097 6902 -20443
23206 -20443 972 98122 142268 108911 58573 8636 52802 79564 27313 -20619 -35810 -84380
23194 -84380 -4938 24686 5745 -2072 -39046 -71284 -96097 -122261 -103701 -57934 -27053 -19421
23182 -19421 9609 -816 -6450 -25500 -18744 -10496 6311 -19899 20729 7706 4704 -4066 -54505
23169 -54505 -79241 -19860 -7872 26766 -30728 -41168 47080 54512 38847 -3558 -1009 -10255
23157 -10255 -15003 43353 66508 86919 69413 50934 53265 53070 -26087 -29915 -16432 -41210 5636
23144 5636 -12417 -57769 -10958 14611 44053 102745 98870 73619 42468 14955 69233 93549
23132 93549 105861 121691 122437 38940 -23469 -49808 -68604 -20626 9683 -34107 -71026 -83398
23120 -83398 -26588 -8876 -83892 -122015 -145329 -116047 -147598 -112867 -59766 -883 32823 1970
23108 1970 14779 10073 -9689 -61597 -96657 -63263 -79944 -12963 -14956 -52462 -6051 15561
23096 15561 19309 19202 18520 45260 60589 55914 16857 -38698 -10008 -489 -34980 34295 95421
23083 95421 99692 37112 -25785 26945 91068 86777 80283 41715 -17293 62 35138 33107
23071 33107 38551 -31581 -63271 -53469 -12169 -16851 -64948 -115593 -76753 -27373 25613 -10564
23059 -10564 -59810 -67547 -3340 35721 31658 -90837 -81946 -23885 -50516 -56612 -66027 -22419
23047 -22419 -36947 -7439 31236 59833 66787 39837 137481 179735 144597 103348 56177 23384
23035 23384 -28524 -24080 20315 24042 44384 -174 22429 18292 60558 35369 -58826 -39742
23023 -39742 -3413 -5682 27611 89865 95922 72350 42672 -1052 -20159 -17444 -6174 29907
23011 29907 3731 -15823 -34312 -55051 -111208 -66226 -52581 -21992 -39021 -7602 39483 85989
22999 85989 53802 4969 -10030 -13874 33971 48513 82074 103223 92861 34110 -49515 -83732
22987 -83732 -57083 -42840 -60710 -77455 -38354 21021 60580 69136 5067 -78830 -61106 -33136
22975 -33136 -104905 -89153 -114697 -60815 -37466 26782 34726 36336 41440 53109 46341 36571 76171
22962 76171 22357 -5197 -5185 -34313 -47886 -14377 -5959 -28635 -25861 19726 21961 44839 65418
22949 65418 3145 -42769 -72827 -61779 -4679 15158 57979 103000 97629 45220 -47029 -96763
22937 -96763 2622 81965 142859 71940 57031 28463 65276 94511 79800 44481 2103 -49353
22925 -49353 -32213 -15428 -59611 8169 28846 86104 113666 103925 93574 63219 5329 -92809
22913 -92809 -128550 -81241 -61942 -36546 -45658 29149 24611 -25561 -56286 -81844 -86472 -109489
22901 -109489 -37037 -14076 -14054 26370 20055 8068 -49401 -18423 34673 16473 -48550 -41006
22889 -41006 -34445 -48729 -48543 -27860 20971 19291 -77478 -57619 5582 20332 54786 91035
22877 91035 4600 -47794 -91194 -60907 -23229 -8543 49629 67420 72014 114386 132409 26177
22865 26177 -86726 -73843 -68811 -77357 -98248 -96468 -63598 -79579 -46222 -7927 8089 20744
22853 20744 72744 86387 86465 76206 56334 19799 62725 18848 -62651 -84165 -71002 -43108
22841 -43108 -31111 -55715 -64172 -73459 -58283 -45095 -92874 -101942 -56760 12781 31833 -11104
22829 -11104 -12723 5417 -24080 -29680 59799 122141 71564 79848 32295 32056 -9995 29136 15418
22816 15418 -12281 -30807 7444 42810 3912 -85987 -72912 -86003 21084 82759 16935
22805 16935 13594 -26616 -19385 26822 93077 99096 13067 -60973 -94514 -112605 -60517 -76752
22793 -76752 -73959 -17366 -34589 -63569 -47443 -85784 -104948 -57635 -74054 -119542 -186629 -177245
22781 -177245 -133485 -66951 1654 17731 17507 7808 -33180 -9382 20904 -8026 40263 20375
22769 20375 -13265 11048 39442 -50812 -91002 -80400 -71690 -117600 -93150 -56777 -81609 -142370
22757 -142370 -151507 -66184 -43851 28701 1031 6466 2444 16950 -20276 -81463 -105437 -61036
22745 -61036 -23129 -19743 -9175 -13707 -89308 -82094 -38226 -51598 -32434 -57026 -102704 -121943
22733 -121943 -176433 -205247 -212596 -134336 -53336 29562 10586 -18296 -58871 -73820 -49330 -115042
22721 -115042 -45565 -9159 -24737 -23886 14247 -27334 -91293 -81727 -67319 -36443 -64984 -43628
22709 -43628 -7002 5084 65398 97770 57194 -42292 -85825 -15739 -29384 -80282 4069 916
22697 916 -16751 -61122 -67354 -122678 -95488 -49250 26140 51738 68056 111821 101074 84097
22685 84097 64854 44381 31632 -36520 -61560 -66168 -94277 -52862 -34146 -5168 50327 63785
22673 63785 70283 85018 82041 17741 -15524 29606 69561 45349 18751 11941 15347 -1695
22661 -1695 3442 -14890 -38064 -114374 -121451 -29842 95938 57006 28029 4851 -54575 -51669
22649 -51669 4699 -47656 -104949 -118469 -64336 -5374 30601 65490 -3737 -48189 -33923 -62458
22637 -62458 -94406 -64729 -104581 -132045 -96594 -54146 -20418 -49713 -29356 27593 30253 25371
22625 25371 11134 -46571 -71125 -107468 -61273 -9264 23935 66870 111650 50270 -38327 -37689
22613 -37689 -4574 25580 81188 77899 54793 26890 -23159 -11331 17691 -7962 15903 92413
22601 92413 56902 87235 92895 19010 37578 51962 31533 99523 114324 67634 107471 93558
22589 93558 99273 72705 -31151 -87021 -36544 22025 30264 51214 80585 97672 59967 31149
22577 31149 37935 77761 11475 -71751 -55870 13008 32140 -18449 -9527 24196 15396 39771
22565 39771 26831 -10267 -3155 -50079 15505 21522 30737 42581 51199 69541 27821 -13860
22553 -13860 -9365 23656 -5452 -13610 -6804 57205 101316 103090 75915 73382 38951 23544 43104
22540 43104 83301 84387 10041 -52493 -34466 6819 -32618 -64384 -9447 33157 35856 -6548
22528 -6548 -40357 -125438 -149390 -115561 -91269 -86704 -24508 39420 129062 132307 109598 79598
22516 79598 11683 2931 7427 32830 104033 121852 18346 -55695 -24205 -25302 -68158 -63315
22504 -63315 -90433 -140026 -120622 -68508 -64344 -100378 -166827 -147798 -8720 -47777 -72628 -48773
22492 -48773 -39685 -34474 9587 -11168 -86631 -111320 -26529 72534 149737 111719 81542 -30326
22480 -30326 -109894 -105179 -112472 -100738 -51640 -73034 -24502 -42564 -8248 21768 -11569 -59392
22468 -59392 -73606 -43475 8666 -28788 -70071 -88530 -78701 -107642 -117826 -110388 -95674 -63696
22456 -63696 -6518 -29158 -85380 -139850 -128380 -112271 -109822 -48282 21482 32142 71501 7177
22444 7177 -33973 2114 19532 -16400 6871 31578 30609 -55222 5474 56925 90416 94363
22432 94363 97174 33790 18702 59220 44676 21692 -48944 -55999 -103291 -133818 -106642 -68333
22420 -68333 -45972 -41266 -18208 -24035 -9403 -64214 -46185 -61604 -15116 15310 -10134 -29887
22408 -29887 -23361 -1555 -6848 27393 42349 -24653 -113916 -137805 -129352 -142034 -164235 -104246
22396 -104246 -69955 -16117 -75222 -107730 -109982 -77636 -53899 -48181 -36093 -45694 -44316 2846
22384 2846 -4903 -11494 -52967 -17801 38748 58853 94594 72345 29495 20405 26778 -2256 -9797
22371 -9797 -79375 -97140 -60905 8045 12660 24362 -20631 -108832 -127835 -96712 -18923 -29602
22359 -29602 -28761 -12160 -26440 12394 47010 56057 4750 -23744 -21709 73974 118255 40674
22347 40674 -2864 19859 36314 47636 34883 -8069 3788 -20301 -35553 -78536 -60140 -46341
22335 -46341 -21103 90090 154563 105881 35975 48175 25716 79957 108659 110320 9999
22324 9999 -67671 -146723 -134382 -68683 -78165 -83505 -47582 -42599 -19002 15668 46396 53568 -119
22311 -119 -31457 -33777 -69217 -105758 -102384 -45662 -3705 584 -44591 -12827 14919 61090 18855
22298 18855 51787 46778 11491 -2842 -11314 -12579 12917 -5430 -42171 -29589 -79983 -70684
22286 -70684 -61926 -90902 -65041 -20641 10245 27646 -9280 -63528 -48723 -105583 -118104 -88803
22274 -88803 -24344 15884 41583 38258 28623 53097 99694 54116 -37573 -93593 -96266 -50985
22262 -50985 -54434 -43511 11698 63010 61871 27819 -13320 -73859 -61990 -36615 -40209 -37993
22250 -37993 63640 109873 2631 -57376 -53787 -84690 -163714 -206738 -164268 -126464 -88275
22239 -88275 -57261 -105224 -127939 -71470 -42028 -21324 -57211 -70657 -82249 -51278 -56931 -106758
22227 -106758 -120145 -87327 -119383 -135564 -92056 -117561 -200245 -158143 -110509 -89229 -67153
22216 -67153 -28862 32207 -15256 -49183 -89876 -93952 -43078 15538 78545 44647 -65202 -19175
22204 -19175 18763 9452 16562 -4152 -24997 -34487 -87581 -66411 6158 -13209 21123 17298
22192 17298 14848 2317 -12909 -50494 -8147 103988 33313 -80705 -58502 -45427 -20472
22181 -20472 51772 35461 39322 53896 35148 11714 42528 27948 8800 -12818 37353 32758
22169 32758 103066 106672 36537 46953 20987 -93167 -95180 49421 107020 53084 19504 39276
22157 39276 -23377 -69890 -40279 -60224 -93863 -72439 10367 28177 -15281 -31278 10209 77330
22145 77330 53442 17418 -65284 -127918 -80127 -74920 -122018 -76571 -62975 10523 11756 -11224
22133 -11224 -38399 -1337 22635 32576 56366 92042 70230 -49391 -47258 -66080 -94154 -112020
22121 -112020 -69371 -70156 -58080 -50315 -5709 51537 16080 -12021 -20367 -31637 -43168 -61205
22109 -61205 -52509 -67903 -108753 -114264 -41879 23012 35350 -8594 -94222 -117086 -42442 -36423
22097 -36423 -28687 6880 21114 28129 20260 34945 -66101 -123076 -128321 -92838 11259 84074
22085 84074 108491 36102 -2825 25482 48276 -14475 -30064 -54184 -75263 -54681 -27005 -36347
22073 -36347 -46224 13345 60994 18249 -35488 -54034 -43600 -108666 -76099 -91620 -44973 2357
22061 2357 -24877 -2996 22495 -27964 -20834 -54280 -81812 -12642 -30776 2448 -6804 -36147
22049 -36147 725 17435 15361 -2394 4255 -9057 -38286 -86061 -78641 -17578 8852 -10396
22037 -10396 -93515 -37520 -72475 -146145 -133881 -143951 -120530 -70666 -11675 44716 48698 56596
22025 56596 92337 68161 -11539 -42111 -53200 612 28520 30929 53422 -354 27632 43020
22013 43020 55343 47030 -48878 -109025 -55290 3600 77928 128447 120669 87753 100206 65656
22001 65656 21454 -49836 -96139 -53134 24967 -21632 -156957 -120572 -124435 -120100 -106245 -57995
21989 -57995 -20090 -19927 -19692 -20089 -39983 5699 57962 29737 -44672 -78623 -55876 -60606 -44339
21976 -44339 -41257 -65094 -56453 17969 14518 6700 39526 110467 74844 -3782 -131549 -169794
21964 -169794 -64553 27308 113426 82537 -8663 -2639 -68868 -87641 -61737 -11633 26298
21953 26298 61153 28971 -15263 -7572 54889 110892 98755 49155 31237 -38245 -21193 -26810
21941 -26810 -97994 -30323 62889 74359 13826 -84873 -104423 -77333 -40244 -38663 26672 106290
21929 106290 133079 95889 -20759 -83861 -53351 -48979 -50212 -9947 46052 78444 46681 -24797
21917 -24797 -38958 -49861 -40711 -8669 40409 69851 13476 3462 25743 29194 -1063 -46225
21905 -46225 -10864 62073 30598 -13055 -70289 -55364 -1642 52864 53282 88049 92563 81643
21893 81643 89736 35617 -4237 -31430 -18793 5019 14177 -20417 -6383 49111 50537 51095 -25747
21880 -25747 -59851 -30046 -20039 -39106 -2711 5837 -34327 36899 4928 -9828 10822 73752
21868 73752 58195 22838 -8292 -577 -77651 -54562 1946 55605 53375 12027 -78676 -112183
21856 -112183 -96179 -38083 -42150 -113479 -119239 -78342 3111 37038 14573 8657 -18209 -48738
21844 -48738 -72951 -111838 -81293 -6898 1598 50595 60107 28910 -8847 -1240 -26667 -11562
21832 -11562 -19837 -18948 112541 179127 64375 -4726 -20272 -8842 -5235 -75757 -134261 -104589
21820 -104589 -58526 1799 -3965 1373 -34368 -22420 15553 42381 54134 75919 42173 -4826
21808 -4826 -44344 -45926 -25737 -7105 26437 57510 -5190 -70316 -72349 -18317 -14964 -15118 15546
21795 15546 47386 16484 -12761 -45456 -39454 -67064 -86864 -82927 -37902 -57265 4432 39433
21783 39433 -26540 18133 49801 -25330 -62484 -51607 7729 118576 115416 44373 78827 55261
21771 55261 63948 4831 -1889 -38705 -45018 -22529 25281 68626 115860 25689 34266 118797
21759 118797 116506 64185 36475 4670 -97081 -115614 -97649 15802 60950 70139 -10419
21748 -10419 25818 51801 6877 -70105 -135510 -146440 -126505 21990 24996 -8863 29063 54152
21736 54152 38597 36467 38944 -15025 -24095 -3741 35969 45833 32424 -22073 -30811 41462 34415
21723 34415 30104 -36971 -44711 -71722 -60288 -3116 53073 34163 -8581 -53376 -63666 -70192
21711 -70192 -84492 -60280 -8556 -10351 -2332 -31377 9538 62571 88968 49911 29504 1920
21699 1920 -43611 -70815 -21539 -32184 2036 97111 110872 29871 57129 30109 -18367 -88787
21687 -88787 -71503 -26996 -9963 -32745 -23773 38473 28699 8919 6362 -21961 -45511 -76106
21675 -76106 -36371 -104507 -137419 -126255 -74745 3133 24968 -26371 -110138 -98440 -43766 -55059
21663 -55059 -113159 -147517 -67066 13634 67099 71660 14960 -20761 -52903 -29171 -22030 -12198
21651 -12198 -14005 -15009 2965 91322 123494 83196 77173 58629 10891 79557 83706 85872 90250
21638 90250 35441 34791 -40259 -61035 -34150 -34644 -69342 -89826 -99508 -95727 -87378 -94469 -128076
21625 -128076 -53237 16318 13913 2415 8072 72552 129628 151316 124224 102008 43390 -59404
21613 -59404 -84073 -55743 -71268 -67185 -72790 -80237 -28461 68526 70002 11576 61767 101654
21601 101654 68814 11408 29797 74191 45032 -33856 -26303 12911 9496 -97014 -116955 -81244
21589 -81244 -83213 -44047 -50297 -14266 28562 19355 -652 4539 -4879 -64966 -89191 -43513 -48384
21576 -48384 -17617 5882 40898 30039 18302 56558 31681 19824 33206 19173 25361 39317
21564 39317 2098 10228 -53966 -40995 -10088 -54255 -47496 -17589 -44956 -4974 19094 -18173
21552 -18173 -52085 -29544 -26472 377 5761 6828 -1572 -46481 -65178 -95834 -24323 -28510 -61219
21539 -61219 -35006 -13093 19392 28233 81797 53501 -27146 -22107 -29653 -12150 7540 -6251
21527 -6251 -4516 -25374 -68930 -69701 -31262 -78925 -86572 -65987 -74006 -62114 -85349 -66126 -22045
21514 -22045 11993 -11793 -62052 -72105 -52310 -68445 -63472 -3202 435 -52668 -78565 -60846
21502 -60846 -60965 -27251 -33069 -15742 -19674 34993 -33544 -28121 -84378 -108943 -78295 -88949 -91666
21489 -91666 -51268 -32871 -24657 -17903 -2215 16469 93398 152616 97432 39150 -34982 -149387
21477 -149387 -156144 -81753 -15893 26372 -1799 -377 28689 54904 17366 42261 55178 6846
21465 6846 -73738 -97426 -112684 -137842 -104676 -100474 -89495 -131272 -55202 9425 -7537 -14348
21453 -14348 17666 88097 89618 95116 70285 52435 -3592 -6323 -14638 -40511 -2477 -39741
21441 -39741 -102287 -45928 -38615 -46821 -30123 -6505 -17794 -31064 47863 79267 33094 -30058
21429 -30058 -76137 -45264 12555 -20973 -9977 36779 53256 32764 16613 -46593 -108635 -75678
21417 -75678 -82308 -75655 -58527 -48947 -85413 -139008 -141098 -79288 -50754 -60186 -35789 -23353 -68476
21404 -68476 -80763 -101573 -101622 -88237 -77262 -46337 -8979 73425 42179 48030 87437 25158
21392 25158 -59590 -44241 -8988 20889 2490 -60151 -23792 1852 -12564 44157 108435 93971
21380 93971 63392 31506 -19852 -124339 -196639 -106983 -47782 -59146 -46059 7971 37660
21369 37660 23900 22295 -10399 10080 56357 22245 -58689 12167 67618 24223 47974 58704
21357 58704 85028 85563 83671 80870 71850 37737 46534 42267 47133 16046 51772 72807 61538
21344 61538 38704 4851 -46361 -98499 -133118 -127166 -31587 70690 25824 42389 42442 -1095
21332 -1095 -13137 30756 25421 9697 -12522 -66710 -90415 -107610 -55799 -45375 -79739 -25543
21320 -25543 5331 17395 44471 32722 -26754 -51674 -26112 -54381 -95694 -109912 -27000 31236
21308 31236 46051 37165 11659 3094 80915 138658 130419 94247 49314 41169 -12100 -82468
21296 -82468 -98953 -12769 -32603 -24847 -30540 -49826 -50855 -2273 33638 58528 -12247 -80658
21284 -80658 -49762 -22502 -68264 -49536 23061 38214 -12560 -68737 -69274 -88024 -41196 19860
21272 19860 40378 42114 14934 1598 18510 15505 -59626 -129907 -83174 -9235 3847 59067
21260 59067 35162 -63105 -76100 -110838 -84134 -54602 -67873 -39354 36895 38259 37604 39789
21248 39789 1396 -73692 -72889 -38521 -59584 -93376 -105089 -70437 -89784 -139902 -163145 -100466
21236 -100466 -43369 682 25212 11316 2214 818 -5413 -4811 -50871 -48882 -39553 -44677 -31604
21223 -31604 -33648 -51837 -35962 -67877 -60207 -21048 71488 43639 29269 23289 -71453 -131317
21211 -131317 -114606 -114217 -89840 -95554 -77531 13794 34402 -35829 -120964 -80451 -23185 13832
21199 13832 19305 -13073 -8489 -31845 -51456 2113 18280 19257 16859 5358 -53562 -120043 -113971
21186 -113971 -59949 45299 93740 116481 49761 18337 -12068 1383 55788 81525 59834
21175 59834 75678 56025 -51662 -90078 -2210 17248 74147 24435 -87302 -40330 -610
21164 -610 -84009 -122147 -63286 27834 55592 65328 21399 -49650 -78449 -11593 17880 2084
21152 2084 3133 9605 22804 4629 -20927 -93667 -57899 -57619 -92907 -59206 -45383 -14529 21454
21139 21454 41007 55171 24958 6086 -1715 -8521 -29807 -27820 -26286 -40046 -83257 -38689
21127 -38689 -29866 -43117 -72400 -29266 -689 63966 109641 75972 25041 29468 11605 37439
21115 37439 77098 22231 -32501 -24858 29714 83136 61642 -34799 -88348 -74853 -82646 -60883
21103 -60883 2083 51645 42283 61191 84419 46201 -1714 -33742 24333 94318 114793 119350
21091 119350 119539 96055 38877 52638 32742 -16551 6117 47209 77192 33171 35872 14519
21079 14519 -32703 -36703 -16043 37470 -20558 20875 -11260 -11808 22163 -15307 -82888 -75109
21067 -75109 -33162 4860 73830 58276 -34643 -79430 -59132 -22974 -48255 -86038 -105042 -13019
21055 -13019 3919 12890 35058 6165 -11995 8603 1676 -13858 -5686 -65055 -102070 -73613
21043 -73613 -54604 -78983 -158271 -131837 -86152 -58024 61204 59439 98505 101538 54343 76796
21031 76796 84843 26804 60732 101623 31776 -18036 -73429 -88562 -37959 -66960 -57849 -61262
21019 -61262 -30205 24715 38306 30235 15748 -6389 -81393 -83215 -74025 -33316 -1525 3739
21007 3739 11582 -18495 4946 50198 -19143 -94386 -74739 -19541 -67053 -99413 -60800 -44386
20995 -44386 -50851 37720 89448 86516 143045 140776 89000 10497 -31708 -13044 56126 103341
20983 103341 111144 63527 -43862 -75556 -107152 -70030 -41881 -20954 -46703 -27269 -72747
20972 -72747 -110984 -110568 -118024 -35913 -6771 -21187 -35880 -40226 -45633 -22703 -14338 -40778 15845
20959 15845 45555 72789 64828 48281 11352 26936 38055 29876 18067 8859 67907 67180 49802
20946 49802 17657 -6645 -79189 -99860 -67917 -67679 -87341 -13538 24070 -50166 -64018 -73561
20934 -73561 -130814 -98502 -23333 -9920 -13963 -31306 -66856 -103235 -69193 9682 -7623 -65681
20922 -65681 -51177 -31087 -62351 -105797 -144806 -158126 -67378 -58414 -79666 -96070 -15942 99960
20910 99960 95234 -37382 -90485 -35079 -43564 -59512 -80726 -119286 -89767 -5495 6475 67259
20898 67259 42621 -10829 -18322 -31576 -71166 -35005 13078 80627 55590 10246 12897 -44915
20886 -44915 -46997 -61843 -22009 53465 104660 11865 -35759 17275 27047 -17004 -14595 -33124
20874 -33124 16918 100435 112037 94442 67053 28429 -7414 -50713 -98635 -69082 25012 60442
20862 60442 27393 10776 2611 -13856 -3378 -16421 -53641 -91022 -133126 -27233 31273 42065
20850 42065 47276 28588 -64989 -145633 -130800 -148581 -120852 -112725 -99543 -49475 -26225 -25353
20838 -25353 20845 66690 9820 -83143 -48480 -98154 -159373 -63417 130048 171846 72331
20827 72331 36023 50392 11166 31939 -3845 21173 46736 -8819 -10567 6658 -40452 -68444
20815 -68444 -31567 -72621 -83082 -27078 -2790 -53880 -105869 -188763 -137893 -70571 -32857 10767
20803 10767 26880 33294 26010 -62 -106540 -114443 -37866 -9781 24791 38227 -25050 -22413
20791 -22413 -23265 25723 -4400 -32821 -3802 13491 24488 97262 100297 49144 41206 46374 20614
20778 20614 -15781 -120754 -172576 -100955 -34097 -39402 -54506 -80246 -120295 -103550 -130855 -131033
20766 -131033 -119924 -82451 -9594 -7955 -57464 -37067 58501 89805 111740 73883 38423 -17335
20754 -17335 -22159 -50480 -69862 -65036 27206 79170 45221 9248 26505 11518 14508 19176
20742 19176 28179 -60116 -117619 -36784 8005 -10923 13285 -66016 -41417 -19005 -13817 -56882
20730 -56882 -66160 -35843 -16195 -36852 -67427 -32752 29757 73016 49582 20189 -2897 -13951
20718 -13951 54662 120483 120991 78480 54067 70111 -12630 43997 148674 113600 43132 44907
20706 44907 14328 -19798 -48377 -54312 6613 24165 35016 35032 23554 7934 77604 189839
20694 189839 300874 500520 788034 1117975 1456177 1375119 1029616 573335 283476 183136
20684 183136 210247 217340 170507 184127 212089 198350 159502 136014 144599 148697 73591 100104
20672 100104 179228 325866 492139 880320 1361916 1606744 1366211 1018179 672831 438404
20662 438404 256205 147332 97321 94936 174227 168877 145223 107912 50921 -7063 16352
20651 16352 32146 43576 87065 96292 25856 18501 38879 31252 83895 47666 11426 20912
20639 20912 6925 61468 59804 17264 -22176 -61424 -17705 13073 18587 9596 -75337 -59517
20627 -59517 -16994 -3407 24234 97372 129199 78403 22062 23951 47291 15053 -55261 -26079
20615 -26079 -8855 -8473 -98895 -72817 -54912 -101445 -128859 -100767 -32061 22032 -2671 -39500
20603 -39500 25558 31264 -23826 -93593 -125225 -124153 -76424 -88718 -141999 -138213 -67922 -45772
20591 -45772 9502 -38924 27701 65794 86106 12172 3363 21567 30417 122427 95439 31672
20579 31672 -11516 71322 134492 179601 293829 302752 358352 440848 571867 833749 1229060
20568 1229060 1930245 2876948 3177403 2726539 1849385 1081692 594662 397803 358251 299660
20558 299660 205629 117668 114052 123778 94848 104571 88434 121361 70681 43886 -25301 -11133
20546 -11133 27895 44402 53715 9297 -16715 -16060 -29024 -59791 -68029 -25605 46881 104414
20534 104414 166787 211140 114276 13854 15321 34638 88382 42924 -43350 -68112 -4021
20523 -4021 43372 46126 74113 54914 14752 -15312 23385 -23702 -100813 -35670 52284 56490
20511 56490 10448 -34942 -66335 -60457 -23339 64070 112642 79368 42240 -51671 -135891 -162636
20499 -162636 -143242 -147924 -93311 -30567 -71364 -144779 -153057 -96154 -10317 26331 47132 86837
20487 86837 107285 132381 62206 32114 75984 5698 -35870 -75432 -83775 -117330 -116137 -55641
20475 -55641 -74250 -52614 -28956 -3472 32895 -4723 6917 13759 37336 47078 11033 16921
20463 16921 89479 67812 7969 33941 74584 93007 47209 55361 23763 -21386 11742 82732
20451 82732 88156 36709 6726 35114 105799 75931 -3382 -52660 -13725 24883 74839 -27621
20439 -27621 -80176 -15314 -7709 28438 16825 -26205 -37000 -96259 -59135 -22874 -59759 -13915
20427 -13915 56947 65519 47007 96734 53199 14790 -4278 -21297 54738 29040 -62224 -75090
20415 -75090 -68103 -63913 -16776 -21020 -43298 -27536 8544 -33787 -45798 -36548 -32347 -25030 2579
20402 2579 4398 54327 -2565 -34767 -5222 -9515 -100802 -161122 -159105 -82968 -126884 -143299
20390 -143299 -74652 51891 142718 115315 89173 72265 60176 72724 49571 -70365 -174666
20379 -174666 -157481 -52495 35375 61513 136970 206660 234178 151603 45944 15928 36303
20368 36303 101603 124591 134185 178432 147077 129525 175165 152352 77636 56570 69215 26509
20356 26509 -61351 4054 53165 -16851 -7128 22791 18360 17231 56881 16931 19957 18098 22301
20343 22301 6186 78268 126318 145300 128466 198130 196654 178669 182986 153492 78050 -1843
20331 -1843 -11944 -32454 6566 80528 99263 45170 40885 58409 111432 75956 86542 116255
20319 116255 126278 119133 76291 89389 189886 236343 239135 167893 62257 5220 -7896
20308 -7896 50113 25571 1267 25416 84511 74704 33253 43346 58334 51997 69032 80463
20296 80463 154945 191087 144502 182752 189081 218914 224409 238179 153324 118844 160391 150944
20284 150944 166247 115879 66544 104905 78922 98709 75838 66862 19746 -14268 -105775 -109991
20272 -109991 -58274 4975 96343 117563 117045 152807 138366 145838 53714 75498 145004 152903
20260 152903 210670 203273 190942 197924 139603 94237 81040 85116 132748 197783 154717 116868
20248 116868 139279 192701 214269 222720 221937 127738 145738 135915 146596 183931 106960 121294
20236 121294 122417 158704 139780 148225 178545 127366 101743 115766 67956 99308 128415 162193
20224 162193 144818 268637 320808 331755 323308 211866 187627 182373 181141 268820 265919 214847
20212 214847 267995 219693 -41930 -113091 -29553 34024 45467 -25474 48142 133424 66283
20201 66283 58019 119977 80329 15600 75526 102711 100350 110591 155497 195402 231319 212436
20189 212436 216524 175823 -68600 -101173 40850 129755 168448 131205 59180 73315 96146
20178 96146 87392 -15201 22424 62428 -25095 -29328 23297 6980 68385 75214 67429 -21345
20166 -21345 -35560 2764 9354 32447 13668 72489 130645 177360 232303 236268 234610 189298
20154 189298 152234 103999 61305 89103 99841 113019 50840 21898 94168 152700 175041
20143 175041 225496 274473 258045 217038 256468 296381 266337 249616 315742 368219 357525
20132 357525 361994 405419 473642 522759 589399 660195 695077 793736 914966 1004923 1117507
20121 1117507 1345958 1716526 2121316 2174039 1978149 1676855 1534964 1492437 1525662 1631099
20111 1631099 1705366 1799454 2013142 2272378 2518565 2759849 3114305 3596226 4209760 5081010
20101 5081010 5977187 6829096 7883770 8970108 10194148 11758836 13635108 16351980
20093 16351980 20261056 25670594 32821691 42437363 57232016 81937950 124884628 194498225
20085 194498225 259149446 252456192 195186013 124523076 77458267 52540373 39574012
20078 39574012 32347274 28008950 25146591 23058834 21673821 21351666 22499156 24925350
20070 24925350 28639128 33925496 41075861 51013234 67022516 94386543 142561807 217055189
20062 217055189 270722606 249534774 183487278 113596770 70114861 46996923 34425418
20055 34425418 27042735 22366406 19060469 16473079 14176178 12252514 10786101 9566210
20047 9566210 8474128 7618630 6982336 6184417 5254042 4388697 3835050 3468646 3157692
20038 3157692 2936208 2796510 2625120 2416312 2309698 2282701 2286864 2350260 2665385 2938703
20028 2938703 2830174 2396152 1922648 1606761 1460779 1407250 1328350 1221938 1136462 1041519
20018 1041519 1027548 931181 832919 806537 817314 801064 799217 797560 743633 745157 757971 778232
20006 778232 718436 636326 624689 611829 641846 674492 658966 621825 485729 435776 523730
19995 523730 558087 557216 497536 421937 463059 479102 466394 429989 374762 345742 307727 259406
19983 259406 269708 272065 311220 292314 354007 416597 360049 373224 402877 398754 400245 451084
19971 451084 400222 374046 338976 297284 273790 315792 345939 304285 256961 328865 442615
19960 442615 452889 443065 330243 206155 52627 7737 40771 72364 131905 235959 229577
19949 229577 226842 254428 301800 351313 304785 226572 155101 190565 233534 250000 261273 284527
19937 284527 368289 427526 345265 232323 128966 123095 196135 171872 121667 74676 52237
19926 52237 97086 101661 26833 72556 178810 178165 167095 189228 259109 283451 245023 267521
19914 267521 247695 181208 171193 191120 211240 195783 111222 7764 83603 137881 160004
19903 160004 157843 94248 38552 27972 126991 223252 241841 208836 315002 468149 584660
19892 584660 700558 798259 835762 970846 1275321 1734678 2415685 3683080 5723408 7516558
19882 7516558 7337546 5649666 3630010 2229112 1536213 1160535 997359 904804 895024
19873 895024 891777 790178 790574 886117 976374 998379 1095832 1276457 1542943 2045936 2947826
19862 2947826 4336966 6386477 7880213 7297387 5403706 3417309 2168001 1505292
19854 1505292 1070682 801216 692806 649262 544589 432832 370174 332554 232183 163100
19844 163100 227715 232681 258583 238614 170354 13857 8683 25279 -985 57327 132496 106813
19832 106813 75007 33988 -8291 64324 115889 98502 92809 126130 109535 143336 202987 229011
19820 229011 230960 211948 141293 135975 168445 173459 86498 13991 18978 88559 88538 -567 7006
19807 7006 -16194 22782 32080 13260 -7793 -42733 -30129 13805 56927 75576 35316 -5754
19795 -5754 27932 5042 -33892 -4472 861 -33388 -40176 -86882 -61885 -67034 -65649 -103465 -157966
19782 -157966 -117559 -44627 -57647 -68053 -84781 -71517 -15306 33207 -2098 73415 80135 80067
19770 80067 141212 136911 102691 26926 43994 52033 -4181 -24912 -17418 -47242 4575 48053
19758 48053 -31904 -4487 153233 261786 162630 50613 25173 -52853 -81787 17561 51097
19747 51097 59105 26146 4816 47651 33475 -11783 -30627 -19373 -235 26362 30655 23716
19735 23716 60707 105034 99357 82591 73322 55279 20449 4365 88088 139701 80000 31001
19723 31001 71252 -22330 -42390 -31726 -80318 -30068 -58718 -43908 40294 62139 63040 45106
19711 45106 66431 75538 94697 116215 86326 93031 20305 -21956 -24896 33600 60525 34714
19699 34714 -19047 -60073 -107901 -65994 -22467 -58285 -88305 -93057 -48587 17410 -29705 -77128
19687 -77128 -29581 17460 69704 60625 56761 58571 -825 8285 40874 95600 93286 84225 70495
19674 70495 27858 49388 102340 65967 72029 36140 50965 10967 -67013 -82405 -28745 -10475
19662 -10475 3382 -4128 -24790 -46254 -58678 9682 43112 87478 149696 141296 59948 38851
19650 38851 58923 91390 89628 74406 153416 180693 90154 45241 22527 -32652 -94049 -121808
19638 -121808 -85338 -28685 -49238 -150960 -182624 -215113 -199062 -165076 -119270 -118124 -50700
19627 -50700 39056 -13722 -39589 -15183 2371 1244 -80082 -112102 -66625 -32995 8768 27091
19615 27091 75759 57477 346 -20117 95545 142267 172435 155987 103450 10978 -54296
19604 -54296 -37893 -14203 41425 56743 105101 102667 44099 17324 27546 9066 3462 35705
19592 35705 64176 50149 23706 22617 29673 -58584 -59250 -75154 -128858 -101979 -94013 -113073 -59850
19579 -59850 -33581 -30826 -59736 -28670 19265 5852 -61326 -52666 -15026 -18521 -37321 -7222
19567 -7222 6689 -40141 -72222 -60937 -100127 -65199 -51864 -26328 47599 -8394 -100649 -57994
19555 -57994 17397 93976 162997 110789 92805 66330 7567 -1658 -22887 -17420 28376 29311
19543 29311 19192 -47110 -28159 -40354 -54806 -38295 -24654 -52823 -55745 -65837 170 6172
19531 6172 516 27838 -7210 19472 86374 34748 20403 32590 25812 21943 -1088 -12755
19519 -12755 -60831 -128655 -78987 -54095 -5588 -9358 -5700 29272 11672 15249 43982 8597
19507 8597 -26713 -51715 -11711 26828 28686 -36377 -89552 -63297 -45143 -75697 -80752 -28665
19495 -28665 -25703 -422 13282 -1370 -1948 -51394 -71098 18315 102684 119660 120162 111488 119095
19482 119095 94438 117490 147084 261566 273710 353080 455190 594151 901660 1250804
19472 1250804 1353630 1174417 788142 494540 346622 263283 223844 157805 169792 215168
19462 215168 147906 100473 120570 159451 195569 215842 226802 266611 391276 484114 694541
19451 694541 1036865 1466248 1464298 1126402 719261 469593 353949 235162 183430 81346
19441 81346 42012 25820 -45231 -74840 -47892 6748 -33339 -64175 -36678 -34504 -27719 10684
19429 10684 -8696 59496 51992 63279 65479 22680 11099 80340 27073 14554 8191 10212
19417 10212 37345 102374 194462 153273 65801 -28761 -39827 -31630 -7312 -14236 -51356 -89712
19405 -89712 -105653 -103426 -21647 15864 11155 -12697 -56498 -119870 -105729 -90603 -25057 43813
19393 43813 10029 -12387 34856 61979 28394 12126 -45172 -72263 -87485 -30835 -30619 -65681
19381 -65681 -88479 -73104 -111959 -77260 -38959 -69174 -40442 -30847 -28247 -30205 -57894 -33579
19369 -33579 -16667 -11310 -1104 42426 -6692 13925 31051 -3866 -14673 -22424 -26414 -38849
19357 -38849 -16456 77980 107846 68006 61450 65541 13296 6926 -28084 29041 84886 59230
19345 59230 51473 35239 -34201 -89561 -47866 -15732 -29871 -66053 -42425 -63104 -40453 8886
19333 8886 -15283 -79498 -129442 -117450 -71156 -66430 -53008 -77347 -30670 27968 -25822 -84707
19321 -84707 -39400 14888 32285 1495 -8194 18156 30668 112401 136707 140509 105009 -14220
19309 -14220 -77438 -92907 -94522 -81034 -81119 -46615 -92016 -49079 -17396 -80978 -148920 -103949
19297 -103949 -31282 8563 19626 -27415 -30203 -19589 -19354 -46302 -84210 -17731 27244 39978
19285 39978 -8030 -60090 3366 43216 83226 114528 8230 -45251 -26131 -43416 -34268 -31877
19273 -31877 -10112 3197 21487 74143 44451 43525 2502 -3255 -24309 -44881 12568 -28939
19261 -28939 -91649 -85287 -83538 -64631 8825 548 21509 58993 46451 -12503 -28709 22075
19249 22075 35075 14059 24740 19355 28485 56924 56468 15935 -4390 -25198 -9053 20780
19237 20780 36317 119118 134533 12248 -42113 -18174 -10811 14680 75325 119011 53351 7198
19225 7198 -25676 -59853 -72122 -31469 -37998 -10592 -37464 -51676 8825 39362 21464 -76906
19213 -76906 -152962 -109239 -116752 -118315 -112806 -145583 -114679 -74670 -39583 -49628 -69238 -117549
19201 -117549 -173192 -231250 -162688 -65299 -32946 -46824 -17471 36907 73055 39864 82671
19190 82671 128651 63639 -14053 -69906 -136434 -86243 14267 91183 52045 9537 -25758
19179 -25758 -28918 -63911 -103018 -89077 -78675 -91245 -30859 23011 21773 -42862 -98748 -145666
19167 -145666 -121651 -81169 -70206 -133741 -68239 4484 22114 2467 -25270 -33553 -13078 46173
19155 46173 25208 15721 -13283 -18339 -199 37752 -3751 14556 -17174 -46323 -76278 -102845
19143 -102845 -134059 -102633 -92104 -122596 -105053 -68422 -10510 -5254 -35399 -78894 -99479 -92449
19131 -92449 -70637 -93919 -126107 -90600 7636 48231 23130 2360 -59860 -110224 -59023 13137
19119 13137 27884 39520 10827 48125 97460 27852 -1250 -17704 -46252 -53499 15229 58190
19107 58190 97041 37705 -13217 -2649 41504 10266 -25030 -84408 -136083 -86985 -59308 -65461
19095 -65461 -86802 -43641 -19290 -3708 39983 2061 -31186 -24314 -13068 27368 106949 175196
19083 175196 110743 98051 150994 37322 -91184 -120193 -113195 -104007 -99549 -125006 -148697 -99490
19071 -99490 -11171 54971 96252 77843 49471 5102 -23732 -11824 24394 -58047 -59382 17412
19059 17412 56674 30538 -48102 -37703 -1799 49455 41416 -11417 11886 -19596 -4090 -15944
19047 -15944 -19317 -47840 -99193 -135455 -195023 -110409 -48267 -98375 -134988 -102524 -90981 -65911
19035 -65911 -41173 -59810 -31864 -8676 31996 -3619 -14056 -25832 -86569 -88768 -60694 -3714
19023 -3714 37552 -23624 -47565 -28312 35499 48791 9313 1697 31427 51314 40346 57907
19011 57907 64311 26 -42456 -36179 -11780 -70181 -182994 -204892 -103032 -32768 857 -37481
18999 -37481 2237 9423 20404 18082 28979 -4240 26190 5988 4539 -64665 -135204 -125836
18987 -125836 -59472 -107984 -119057 -135401 -116448 -86340 -82112 -76184 -46466 -30199 -33903 24418
18975 24418 45602 21752 -8290 33434 34989 61848 70746 -31614 -115522 -79532 -24930 5829
18963 5829 85740 127179 169672 227708 234925 216506 116786 104840 230680 275446 251973 286953
18951 286953 362755 435926 590486 916634 1343687 1818592 2051336 2062888 2224732 2786510
18941 2786510 3473160 3324171 2468870 1538661 996192 613236 428520 369283 282969 266490
18931 266490 330513 393398 367728 322977 399816 518013 824329 1158316 1412286 1397758 1137582
18920 1137582 757527 447372 339949 302906 263305 184967 152585 65402 -10475 -36994 31579
18909 31579 79585 100218 58653 38485 25688 37607 41923 49650 28821 11323 -10278 -24278
18897 -24278 -14139 -39557 -58593 -74923 -36780 11234 -17474 -5125 1472 -28927 -80413 -66411
18885 -66411 -31025 -12008 -9599 -24277 -43676 2651 67914 49580 52514 24810 -59806 -22721
18873 -22721 57687 40936 37587 -195 -82821 -154859 -107740 1791 41792 48573 21038 -6860
18861 -6860 -36509 -18386 -28173 4904 -24811 20597 47737 57085 36994 -48401 -18629 61242
18849 61242 104629 140649 174066 194794 219447 241370 158251 154197 150602 132719 107430 105728
18837 105728 81090 37163 24045 10448 24069 74093 170136 180102 207615 276444 376369 450059
18825 450059 555188 802744 894930 782765 584863 339457 174807 121264 89374 95569
18815 95569 24963 43029 38061 44968 82896 45352 82788 105935 33906 -6512 18247 101942
18803 101942 47748 43788 80022 106820 62779 58621 34415 -23480 47631 159557 346051
18792 346051 510737 729549 959938 955696 699723 415003 248977 172529 186655 165656
18782 165656 144981 80584 86182 81647 74838 48192 -6391 -41122 36130 115617 102211 140058
18770 140058 191883 285331 471479 650828 631576 509626 344486 240739 152143 43571
18760 43571 16118 47152 109821 163030 142378 88535 98234 47051 63983 39794 -36196 -26960
18748 -26960 -56099 -17521 -54719 -17413 -62157 -54796 -71885 -118078 -135424 -155286 -99402 6872
18736 6872 92959 153896 134096 85448 73566 71926 7361 -5057 12716 14993 65000 23512
18724 23512 -921 38005 42886 52839 84193 70986 2081 28469 67438 -10115 -26964 18339
18712 18339 69261 67475 83961 21559 -38 -9966 34440 31023 53751 72989 79018 146873
18700 146873 239698 320840 387424 455811 323594 155518 119728 154167 145754 148053 111143
18689 111143 121547 26440 20353 85501 35278 -26396 -93463 -140264 -146648 -171911 -143520 -87125
18677 -87125 -46106 -71322 -119035 -84487 -55234 -7559 73801 79739 93037 74264 79657 1807
18665 1807 -53786 -22270 -31464 3325 11303 -15062 -21167 13040 -13162 -28624 -53510 -57356 21299
18652 21299 28095 17150 44202 92642 130001 77712 75462 23056 31843 27154 26346 81553 93341
18639 93341 81831 129890 167632 85358 24667 -5083 -58789 -77639 -101504 -105894 -23418 43590
18627 43590 -1823 1015 9259 -23110 -2461 -9443 -2661 54435 81720 111830 122571 82520
18615 82520 48760 60848 83718 107300 104949 98033 90284 86898 -22522 -15131 91563 131211
18603 131211 15220 -39462 -11738 -85380 -133706 -107260 -37811 -52798 -16156 36258 117102
18592 117102 104090 81591 52905 62427 274707 411465 384078 360753 309617 197321 123047
18581 123047 151599 152641 174438 188082 166400 147104 130792 127384 133588 103355 111344 90268
18569 90268 23317 83640 102609 187229 309369 310173 248627 89738 -66551 -46661 -53729 8799
18557 8799 54785 49801 33040 49329 24090 -806 -16859 9306 195 19911 -31810 -60699
18545 -60699 13636 87769 10831 -32871 29721 8577 -7877 -4167 -46556 -70879 -34468 46255
18533 46255 43233 12713 -36361 42930 33389 35260 82205 72109 -7792 21236 -19402 -33280
18521 -33280 66093 127468 186871 199325 144057 101562 167120 169100 141061 143359 142607 76508
18509 76508 30973 45454 108437 81426 57871 53850 40441 74446 85877 84076 26624 -12873
18497 -12873 18270 38643 124406 119755 60861 38598 88274 130958 160958 111143 75740 76478
18485 76478 73116 70922 93377 46193 77262 86024 46740 20991 50184 85881 83630 70909
18473 70909 51306 89886 55443 36569 77958 68841 116786 196531 238552 272427 247098 201571
18461 201571 58886 -164786 -183912 -133245 -70941 -77078 -64533 6502 30870 62859 59674
18450 59674 95422 89641 97526 122462 164124 176455 153356 132368 108221 155440 172080 107698
18438 107698 -55837 -247824 -217474 -151515 -119091 -114355 -74939 -37842 4085 -38913 -64055
18427 -64055 -81330 -35201 3096 46772 96142 104035 3872 -13684 -30942 24974 165533
18416 165533 208735 181274 197840 214383 182123 162400 159105 154133 180136 232887 288052 324437
18404 324437 275269 220980 173600 138688 180088 205410 199715 248707 269621 276120 327868 368389
18392 368389 408203 407157 412388 410566 365317 286628 253392 314189 358075 415213 469040 433409
18380 433409 456050 577715 662449 694709 659465 727287 799078 843728 938767 1051655 1126047
18369 1126047 1196327 1321901 1466832 1519145 1768520 2188237 2847983 3646356 4042113 4151684
18359 4151684 4338664 4886490 6100734 8239334 10621810 11168029 10172964 8849912 8126905
18350 8126905 7850520 7942775 8379706 9305832 10899023 13296347 16699165 21272302 27347282
18341 27347282 35701204 47907230 66539877 96133020 146474720 222743148 276451019
18334 276451019 255932869 192062534 125407302 82809540 58245457 43246180 33995403
18327 33995403 28070012 24254183 21784947 20489741 20398350 21530963 24085818 28138612
18319 28138612 33991642 41962211 53599450 72080772 103256935 156892147 232326102
18312 232326102 269043036 235751643 166268635 103784564 66735313 45995997 33600800
18305 33600800 25602952 20255685 16512093 13752432 11654486 9987550 8715740 7846137
18297 7846137 7310004 7020102 6582248 5856109 5090145 4489977 4110178 3820982 3658951
18288 3658951 3668804 3819016 3982779 3716771 3213632 2723876 2405249 2167100 1902612 1666069
18278 1666069 1543640 1511374 1487010 1438642 1426462 1336716 1231513 1187390 1182700 1150506 1108731
18267 1108731 1110870 1113376 1052956 996224 1012408 967171 956879 876873 792064 759742 782189 780438
18255 780438 743301 723035 650910 566766 524508 608425 593505 666791 733513 705997 742327
18244 742327 817383 813419 710450 616669 662925 627238 631864 578675 544059 449716 341589
18233 341589 343527 373784 353749 404859 484861 532937 539775 494067 487597 487361 497808 430296
18221 430296 386625 396468 399599 392216 351897 257238 312514 425991 507471 587131 646749 668205
18209 668205 610300 532994 441588 381305 343430 368839 358282 327770 350961 331021 298909
18198 298909 330017 408976 414469 329214 292175 313241 338836 321162 359009 398350 436875 497645
18186 497645 453580 311051 264350 199855 180094 200953 170317 161777 193672 214923 281631
18175 281631 273297 248435 217362 188618 208661 206263 142701 135417 130254 99625 106626 101011 92202
18162 92202 129094 182015 181252 191181 231891 252081 303139 272771 234293 255510 228584 219972
18150 219972 262067 321710 344272 326984 295586 298966 299023 367206 421555 454974 528148 510020
18138 510020 473036 458671 561221 608859 655611 737827 870286 943601 937789 1000213 1097371
18127 1097371 1188854 1433412 1599176 1837509 2127952 2513345 3040529 3851428 4939141
18118 4939141 6341276 8230020 10797087 14148299 18701238 25868050 37766619 58280822
18110 58280822 91024893 120151919 116112142 88975106 56173574 34290380 22445701
18103 22445701 15946524 12013463 9440026 7709666 6329522 5255315 4473047 3825184
18095 3825184 3362880 3017187 2616945 2285567 2062129 1886708 1694565 1586366 1454104
18086 1454104 1275271 1168350 1105222 974529 870119 804181 738062 725455 676086 666218 593705
18075 593705 532492 586534 601547 566867 504669 520342 509113 439401 469293 558120 470894
18064 470894 367739 436972 542620 622361 728160 897026 1044343 1106861 1199323 1392268
18054 1392268 1687617 1683705 1330044 1002841 750926 663248 665842 651914 565669 464637 426772
18043 426772 382309 459210 412876 358946 333916 275767 253698 228034 233280 193060 194221 141227
18031 141227 114766 171817 210090 246683 290765 366202 391758 413278 483621 608691 818221
18020 818221 859169 676900 509960 383559 335286 306956 293312 292630 267456 278791 224853
18009 224853 158208 172389 181810 245303 281125 295865 289030 372004 411407 436053 457900 524879
17997 524879 620052 728414 745615 783847 851950 905413 927536 880611 853648 877927 930459
17986 930459 913967 822260 804543 778386 641116 573136 470733 369247 327601 285506 295520
17975 295520 270002 227972 215416 190115 201599 209983 176479 144818 97203 125315 187403 166591
17963 166591 153244 138738 99063 100013 167168 215468 324218 360785 319432 269016 204154 215537
17951 215537 293578 375297 419106 387105 372203 418296 418503 460848 518671 434283 345231 346922
17939 346922 357928 376304 362623 358927 378609 371093 266595 232821 163847 197934 175315 136473
17927 136473 68448 10685 53 9118 60352 83658 70001 59244 90698 124317 112625 189148
17915 189148 183410 193664 154975 162015 179791 190084 216780 186487 162492 168521 140167 71413
17903 71413 48577 77081 48969 47980 108751 117314 102125 45082 21624 88577 89167 82459 76187
17890 76187 39665 50934 36356 46341 69506 42616 -2071 61176 76376 114634 133566 82024
17878 82024 99507 90117 105138 68475 49931 80986 133926 119941 120566 198279 183949 112825
17866 112825 45801 -1409 -12211 58383 53801 9846 10156 -3028 -24754 -58572 9359 545
17854 545 -36261 7348 139379 169679 140098 152151 101526 1178 -85904 -80939 -8439 75107
17842 75107 119514 131933 89682 45611 46237 9547 -52088 -46658 74792 118960 110398 130012
17830 130012 108061 54978 69544 63447 77422 64571 41490 -2028 -84946 -41328 38783 6252
17818 6252 -6205 -20419 33058 101425 107025 86518 110337 89106 76739 41178 56173 78947
17806 78947 80729 43793 26453 -2275 -39858 -81497 -39269 -1323 -20139 -89308 -135849 -55109
17794 -55109 -35853 -32545 7055 61203 61846 41558 66557 34148 52312 119306 73601 -20015
17782 -20015 -4758 -33450 -110221 -83768 -36480 1024 -21347 15919 45114 43574 51752 100471
17770 100471 77691 32685 32268 -8316 18039 9054 -37848 25231 33923 24028 16803 26218 64301
17757 64301 77457 1102 7482 14497 -8640 -142 16518 12922 -31478 -11283 54877 56814 58050
17744 58050 29537 82170 76889 157611 177039 98326 34404 -44632 -54831 25405 28266 -44224
17732 -44224 -32332 -1298 38227 75864 41728 11543 -5479 68427 161120 214379 237493 337652
17720 337652 483575 736962 1139509 1497784 1498024 1200873 820863 523157 339943 245936
17710 245936 212687 172941 138984 130726 139346 88990 158965 154324 180034 217841 224081 313507
17698 313507 426125 576166 857419 1174924 1406483 1283932 961420 662225 455198 319051
17688 319051 231233 174707 77786 -16305 -73696 23743 74506 63845 50533 66465 70178 98012
17676 98012 75307 4667 46647 59383 31931 86405 85422 21024 -18826 -26254 -25520 -76940 -88911
17663 -88911 -47758 -21061 -11022 43909 46943 15799 11405 -25221 -56709 -55702 -62576 -79505
17651 -79505 -37101 -67631 -53707 -20409 49431 59765 26032 15572 -2547 -63972 -107697 -152036
17639 -152036 -173755 -196260 -130623 -34782 28932 15166 -35783 -27030 -29495 -14259 32 11922
17627 11922 15679 58592 41758 15393 103169 115414 82072 85543 57317 18498 66279 75156
17615 75156 115984 73948 20339 -3727 2868 12809 41365 78816 87613 81349 83513 76745 48619
17602 48619 60098 99644 147020 47651 -12451 -36120 -56176 -81777 -127496 -159333 -172875 -172363
17590 -172363 -92056 -58712 -40368 -42964 -36781 -30963 21384 30430 65049 69370 76969 -11392 -55326
17577 -55326 -54287 -65134 -46925 10951 -30072 -15046 30718 64607 49094 76878 124144 97221
17565 97221 63271 38804 48689 89157 109217 151420 129152 81846 41775 17593 6339 -6231
17553 -6231 25544 80634 47412 34961 -6751 -60739 -36746 -18534 10941 725 -33850 33702
17541 33702 11275 -36592 -65871 -170402 -168319 -78003 -38597 -14519 -57159 -3521 68967 21279
17529 21279 -20586 -61452 -112662 -136447 -40964 -21582 -19533 4708 -17307 -7898 -57672 -138877
17517 -138877 -77851 -8100 69010 34936 -1491 -65384 -39903 -32527 -81397 -48176 70352
17506 70352 105639 118508 121230 66837 9803 37120 62948 31958 -988 -46389 -24614 -63937
17494 -63937 -91865 -59000 61033 94238 26200 -6815 -3136 29615 25359 -2991 -20158 -36229
17482 -36229 1884 92274 120200 93150 47844 -33976 -75051 -18656 -8701 -92715 -97734 -66015
17470 -66015 13966 24929 34276 24035 2709 4617 -9703 -36940 -23320 -46322 -69071 -35048
17458 -35048 -772 6544 5743 16992 11035 70048 136127 190019 160156 52086 56243 129221
17446 129221 194416 231055 324908 602439 717686 553474 349335 229931 141598 101958
17436 101958 65648 -8217 -92243 -138200 -106813 -95555 -100328 -15445 6146 17203 38775 33815
17424 33815 -18615 -35797 -57822 -23875 -39327 -31625 4081 -2880 -32055 -51080 -80385 -17961
17412 -17961 -15833 -38799 6570 14418 13700 10462 -43241 -88796 -148191 -138168 -121288 -88532 -83141
17399 -83141 -126746 -193711 -150333 -72315 -4057 -5847 23791 21905 -38690 -46273 -56653 -69806
17387 -69806 -14789 -38124 -52371 -27620 -63727 -38420 -101542 -87564 -1323 23415 -39880 -20983
17375 -20983 -17790 67907 88771 58446 4731 5206 43754 86967 34025 12947 40712 42244
17363 42244 18694 22191 77629 60131 75169 64432 28047 3459 -5913 -35495 -63380 -75804
17351 -75804 -68656 -46266 22576 35825 87277 107763 63441 17193 46491 120545 101648 61335
17339 61335 -5173 -38796 -40946 -57747 -57831 -30476 10135 46634 34480 -38042 -49770 -50088 -81308
17326 -81308 -80530 -22552 -28253 -51196 -34456 -24589 -35336 -14029 -25769 27757 19596 -594 40093
17313 40093 40704 -38773 -70460 -6790 25025 34938 -5931 -39508 -32149 -32042 -13880 -57463 -41222
17300 -41222 1851 78849 107790 85660 77837 125252 78745 21792 -41798 -39593 -138424 -147895
17288 -147895 -128461 -86091 -59337 10485 1347 -45061 -89787 -39173 -25717 -33643 -65486 -90516
17276 -90516 -105512 -115987 -39238 52894 2364 -87628 -107537 -62992 -43972 -33677 -22254 62160
17264 62160 69764 77570 146080 134057 65579 24313 58891 113548 127851 143321 42601 -10327
17252 -10327 -43449 -14111 9851 -21168 -421 -37795 -51354 -56225 -136097 -106244 -80862 -16300
17240 -16300 -25973 -26304 -40375 -21721 10386 -78415 -116801 -95205 -98263 -59751 -84526 -102680
17228 -102680 -48658 51157 57499 58835 38193 30483 59492 25720 -1829 -42255 -42582 -36679 -16583
17215 -16583 -1429 7865 -20192 -22600 -37206 -104150 -127131 -104204 -103046 -85921 -102186 -28586
17203 -28586 -11912 -25420 -4942 19166 10985 52580 77600 3431 -92603 -81517 -42089 -106572
17191 -106572 -15326 39401 -22890 8794 -20131 -7695 -32126 -30451 -13456 -64906 -92810 -45844
17179 -45844 -7832 -19410 16065 -50172 -61297 -69814 -75744 -48918 -76766 -63677 -26558 -50528
17167 -50528 -41034 -39538 -66128 -112801 -68838 -31382 -20136 50403 82763 91815 47814 3579
17155 3579 1993 -43514 -143126 -172828 -131578 -125673 -62038 -58640 -89234 -131236 -65422 7179
17143 7179 -46981 -74215 -109487 -68508 -27763 -52318 -12530 -12290 -66763 -47406 -38182 -26401
17131 -26401 -5628 -27120 -34449 -51535 -86778 -58939 -54123 -16209 83214 57699 -27090 -7222
17119 -7222 42070 99081 38130 20686 -16733 -55323 -55233 -48365 2148 -16221 -37506 -49999 -12784
17106 -12784 -5140 80050 41678 -28541 -88334 -22987 -21534 -52589 -51878 33313 -3501 15861
17094 15861 -19934 -39278 -19898 -75695 -85423 -107798 -104389 -84877 -59844 -71606 -74589 -89419
17082 -89419 14417 39612 34360 25038 92297 126835 85120 45741 22156 -81787 -140639 -64541
17070 -64541 -11681 25598 29820 7783 -9961 -50471 -89738 -66852 -16636 -49794 16338 90918
17058 90918 121929 43591 20727 98741 87853 59354 31076 64598 71618 -6221 -21152 -68145
17046 -68145 -77892 -74681 -55814 -72376 -47593 10692 94972 63476 -10007 -4437 14822 -26268
17034 -26268 -27385 15267 86745 95341 107683 74128 12508 -56351 -114788 -117099 -75533 -102695
17022 -102695 -103885 -128333 -162016 -131101 -133128 -54010 -36949 -5908 8773 -9360 967 -18839
17010 -18839 -34991 -46516 -42097 10583 -37210 -33072 -15834 -20025 -69686 -63807 -56580 -52280 -80882
16997 -80882 -9077 20996 44352 -2447 -87124 -111963 -110792 -3216 64065 31421 29793 72093
16985 72093 14501 -34046 -35656 -30850 -53299 -105379 -98723 -91414 -101007 -96180 -92308 -93694 -112179
16972 -112179 -79632 -10301 -23523 -9008 34717 29653 -16588 -37832 -25124 -60121 -83641 -62529
16960 -62529 -61235 -57417 -31414 -110485 -162716 -201876 -123404 -34397 -95478 -123113 -55609 552
16948 552 13337 8803 -60399 -109595 -112179 -102807 -65237 -51293 -101206 -100375 -99534 27261 148017
16935 148017 100714 -8159 -30401 -24818 -42427 -8374 21954 -38489 -82768 8675 23762
16924 23762 66456 71217 34990 -7284 -15049 -71398 -7179 18018 52768 65658 64094 15288
16912 15288 -20894 -85676 -71703 -105600 -78893 -49728 -24429 -19534 -7181 -52772 -115145 -82152
16900 -82152 -77776 -106397 -112863 -103862 -88895 -88879 -57578 -59043 11376 35704 10406 17964 50018
16887 50018 90782 32441 8834 17599 67354 90571 60818 -8453 -69805 -97016 -86063 -3048
16875 -3048 41156 62467 36313 11249 23957 -23912 -35524 4503 23883 -16311 -20409 46130
16863 46130 130392 197400 135729 72999 16205 -36233 -82634 -107993 -42969 26041 34472 61194
16851 61194 78577 73240 28285 12253 29316 -706 42697 72280 120588 102636 66041 13897
16839 13897 -10050 -35841 -4266 8212 15572 -45624 -53158 -45911 6993 -20618 11828 97776
16827 97776 129468 59936 32971 -3995 -49525 13383 2969 -52613 -31070 36143 35895 59270
16815 59270 69452 -14746 -74352 -124676 -81387 -23085 25875 44737 59782 23058 36224 48551
16803 48551 -11044 -32826 -63703 -46377 -88392 -91593 -106879 -41785 2678 -46856 -37655 -28763
16791 -28763 5863 64984 127078 117952 82553 49800 41808 84518 -23589 -6913 45548 39358
16779 39358 -26840 -28810 4180 9260 -11679 -39611 2904 3371 -46167 -44394 -44523 -56544 -43271
16766 -43271 -26769 19256 13581 20664 -35988 -27003 50396 80016 56583 -2746 -31231 -77877
16754 -77877 -75286 15648 -12247 -44909 -90105 -80907 -69529 -83559 -79317 -83209 -127090 -126624 -71772
16741 -71772 -83734 -53985 -45377 -52099 14859 58538 78210 98630 130390 127943 39617 -12689
16729 -12689 -45493 -69369 -71355 -87781 -57349 -1761 36676 -1668 1760 45482 66765 19288
16717 19288 42100 57452 -341 -62884 -27497 34828 41627 34614 93908 125662 73198 110205
16705 110205 131843 36104 29150 1697 44699 69289 58308 61328 55880 63466 76653 40839
16693 40839 26586 20522 19270 12862 -4905 -45605 -62729 -59379 -25851 42203 44874 13520 21249
16680 21249 28929 71674 -23660 -7680 65882 23790 2015 -9641 27658 11196 16664 -25801
16668 -25801 -39076 -58235 -51203 -106777 -94151 -71569 -59177 -67470 -77215 -11171 -36728 -55893
16656 -55893 35046 13929 -5901 -28918 -42141 -74650 -45564 -9143 47134 79732 115417 47180
16644 47180 17745 9943 -16456 -64760 -34999 5400 36047 11765 60680 142283 148848 104769
16632 104769 21523 -58967 -32186 -26656 -3550 -2130 -36151 -14940 -13244 -68688 -68460 -67666 -86145
16619 -86145 -91269 -92069 -87273 -110665 -92724 -20011 -29346 5060 35363 96782 131523 84432 5636
16606 5636 -82005 -169000 -138708 -55066 20340 89568 34916 1978 -26862 16985 3052 -14939
16594 -14939 30437 36996 -14226 -82358 -81022 -3509 51735 92308 96748 109956 38626 -47965
16582 -47965 -61568 -31285 8952 -6446 -50877 -28050 9955 36257 -29009 -14656 10964 28016
16570 28016 63534 86380 48921 44677 -11832 23363 68474 103078 151537 200487 179377 89624
16558 89624 37671 39168 51697 46253 84679 62644 30908 19452 15329 44301 48605 -15657
16546 -15657 -39148 -77939 -98444 -127688 -113170 -164028 -136161 -67079 -42097 1108 -2924 -54176
16534 -54176 -73700 1356 12609 3254 -79884 -82376 -77476 -36638 -40291 -48591 -50964 -156511 -112356
16521 -112356 12152 36501 18446 11249 1460 61337 34800 -26939 -17379 -2683 11344 -39880
16509 -39880 -15060 10376 22428 17893 -12088 31764 90667 100334 124381 110053 71918 102246
16497 102246 127586 101136 52677 -8828 -24642 -52421 -32700 24469 45033 32141 38509 -22589
16485 -22589 -32075 -76881 -153764 -104114 -99174 -130918 -107977 -42422 9189 -3725 -27786 -1215
16473 -1215 -7856 -14989 -20574 20098 19616 -8835 -69652 -80368 -6268 35767 60574 1288 -45963
16460 -45963 -54168 -59511 -28436 64839 51834 25881 -18844 -108872 -62826 3587 34012 43748
16448 43748 63199 31152 62113 122351 22990 -38989 -44450 -51515 -75075 -16049 44670 63083
16436 63083 80921 81126 32436 42419 62403 65554 80968 106276 105298 27624 -51329 -44129 -102740
16423 -102740 -94310 -35992 -20273 3247 20979 72234 41850 -46645 -89740 -115028 -82665 -8
16411 -8 47160 45322 69570 23660 -42147 -14010 49760 86438 76648 54427 28193 11967 -20917
16398 -20917 -46816 -77074 -12069 -6003 3871 18306 -22389 10760 27428 59537 75001 46675
16386 46675 6285 61065 111683 98850 54919 35043 67989 102617 113690 22570 28790 48651
16374 48651 45821 -5964 -22416 -13968 -41188 -53789 -77832 -29197 -40767 -72101 -78824 -68691
16362 -68691 550 20841 -21163 3640 25034 -27573 -6782 19688 46373 68646 26993 19417
16350 19417 65303 127609 142552 91658 58565 -44093 -36345 -49612 -7272 22482 61901 63572
16338 63572 53513 -18361 1557 67000 53851 23739 17092 12968 22418 6933 10758 -42857
16326 -42857 -51225 -25578 17399 50319 98525 114478 119481 38065 5927 -45234 -15992 -55625
16314 -55625 -49724 -83510 -143758 -146197 -60597 50960 64829 31185 20370 1971 -14763 -6328
16302 -6328 -13492 -33549 -6399 -61171 -68022 -41753 -46641 -104221 -79305 -19576 -12917 -21817 -75414
16289 -75414 -25764 55397 -7298 -32634 -22495 -23472 -17589 31878 68069 129716 118454 106512
16277 106512 57664 -3679 -86680 -146263 -111204 -33750 -60879 -116904 -133041 -115260 -63372
16266 -63372 -73751 4149 -1658 24224 19393 15472 19457 -15441 -34675 -74904 -37929 31124
16254 31124 15271 -36342 -13347 8239 18890 -2738 -43115 -13112 22463 -6234 10402 72349
16242 72349 28497 10364 50549 104343 145889 106666 124691 114949 8479 -15545 -11972 22370
16230 22370 45357 52377 49876 46293 25905 26649 -4889 -12158 -49175 -6099 16370 14568 18314
16217 18314 93983 75112 63749 23539 -5299 -23474 -35246 -53230 -53164 -66878 -144716 -177107
16205 -177107 -158253 -122748 -91335 -3800 27865 -16142 -53272 -85680 -76799 -53897 -90786 -117059
16193 -117059 -120955 -21200 58964 106668 74214 -11475 -65824 -5080 83112 26994 -30359 -27752
16181 -27752 -44944 -47845 -48766 -35723 -28592 -1343 34885 46721 26566 2100 28345 21521 -14279
16168 -14279 53214 85960 49800 59498 78766 28276 24673 -26768 -23575 -24160 1048 54019 85205
16155 85205 21831 -46495 -33275 -18445 -12337 -8968 830 -45846 -49731 69445 142935 98663
16143 98663 11493 -59612 -27281 -7358 21183 82416 47986 -39009 -69395 -38854 31228 49747
16131 49747 34916 98609 106423 79182 60552 35403 29053 8223 23774 14985 4937 12448
16119 12448 -1785 -24424 -42898 -17004 -25257 -66277 -72417 -1104 -10847 -60776 -97835 -79714
16107 -79714 -34671 -108675 -137967 -133868 -124311 -114671 -77728 -80679 -93235 -53034 -60202 -27125 8026
16094 8026 9629 -44216 -86022 -77044 -88297 -120192 -90697 -79119 713 5111 -38836 -37370 -33887
16081 -33887 -16196 -45482 -73791 -57469 -44100 -78113 -141395 -98276 -64515 -43381 1208 -7808
16069 -7808 -32416 -22352 -48253 -11648 12920 18677 11950 13055 4312 -32704 -10191 22422 12747
16056 12747 40277 38654 29093 16699 22672 47450 27638 -21651 31833 -17173 -29746 16143
16044 16143 25524 -28821 -72563 -57418 8977 25389 38524 -14089 -44563 24891 23762 21353
16032 21353 -2296 -55557 -31877 -41275 -79763 -76355 22765 23479 -36413 -42814 19848 7688 -20353
16019 -20353 -22391 -35795 8870 -11332 37453 42958 -28166 -125083 -84107 30845 64580 102790
16007 102790 119887 180472 157183 73860 49258 -11886 -80230 -39493 -11921 -4406 -19863 42424
15995 42424 122079 135761 82649 4691 -40496 -74223 -67740 -35958 -79223 -8791 -5869 -52517
15983 -52517 -58162 -83282 -32632 -3526 13280 -23139 2190 78226 126041 115097 158722 89710
15971 89710 30500 31670 47469 61302 86975 69645 50736 4936 -44915 -70923 -4474 49051
15959 49051 -29403 -47488 -31375 17784 60127 26329 -1041 55775 131508 155208 108016 12817
15947 12817 -61364 42279 97450 114457 118852 88556 111686 113133 83403 26373 -39326 -20208
15935 -20208 -16642 -25891 -19573 -44828 -18015 59523 122512 50829 -33988 -112207 -50642 65881
15923 65881 73096 38425 19433 -168 39801 96381 100609 65449 9579 29389 28798 -27900
15911 -27900 -82779 -65072 20080 76645 98141 74480 30585 -9832 -51459 -26510 29105 74424
15899 74424 27714 60680 -5457 -892 24653 49747 -12183 -55225 -112018 -126150 -69985 -2987
15887 -2987 62407 104996 88976 464 -30278 -17865 -7162 7261 -40035 -62277 -79400 -106925
15875 -106925 -77930 -13188 -28226 -75424 -92497 -59068 -69851 21812 11337 22763 26175 17044
15863 17044 -20854 -27054 -29706 -17432 -7500 7700 -2953 15869 59786 80349 32631 -69192
15851 -69192 -50565 -17161 33562 12399 54601 44571 20920 31749 57312 38010 27259 -7735
15839 -7735 -2304 -28362 -96093 -128988 -162622 -164026 -75124 14486 11047 14386 -26398 -66635 -51237
15826 -51237 -12979 -14353 24176 71795 76867 69724 81556 -16782 -87943 -44974 -33247 -14296
15814 -14296 -33124 -72897 -54870 -33813 -10444 -27516 -51294 -57042 -33167 -17335 -24131 -37319
15802 -37319 -42127 5943 12315 29587 -14488 -35957 -34239 -62585 -39650 -56797 -103039 -67940
15790 -67940 -64291 -74326 -46654 -57613 -42562 14908 31535 26820 27160 -47095 -6556 -2676 -76694
15777 -76694 -121173 -108587 -83601 5989 134302 132018 31524 25614 15428 -33846 -23330 -57237
15765 -57237 -114374 -171480 -119084 -73328 -101113 -127586 -117083 -27480 2063 -41307 -61313 -18962
15753 -18962 42454 60893 59900 93882 105641 23530 -39698 -36258 54625 63710 -25480 -91262
15741 -91262 -81127 -32738 -32650 -44217 43031 38803 -3720 -29399 11279 36694 95711 99173 23552
15728 23552 1062 -36532 -18241 -13401 -19909 3148 41258 56918 -28426 21247 78142 31869
15716 31869 79875 117981 96164 46249 7974 -13389 -32601 -14126 34977 40231 87736 144394
15704 144394 69752 42158 26259 -1024 -27416 -12238 26108 82922 140937 171952 214251
15693 214251 162560 44975 6244 9297 -23243 12549 44417 39168 56256 86406 72307 70791
15681 70791 63962 47544 17600 -50017 -32731 -32696 -26910 -7677 -989 -22859 -74231 -82947 18298
15668 18298 63846 22954 -2526 88895 160441 118853 41619 26343 40920 36511 55112 99376
15656 99376 79080 53874 12884 -24786 -94074 -89439 -79496 -48824 -128049 -126773 -68942 -4279
15644 -4279 74228 86431 49899 33231 17848 48870 76017 36612 76876 57531 43409 65013
15632 65013 64158 17280 -33695 19902 -7615 -45046 -78282 -41916 -12230 8168 40571 65752
15620 65752 88062 74712 53173 1592 -12659 -27577 -52737 -47551 -14416 -12819 -11795 -18281
15608 -18281 769 67958 86464 88398 68463 83171 152407 113246 56179 12185 38749 -3221
15596 -3221 -53976 -47633 -63650 -18214 -78 8287 32444 91575 109980 112640 99514 108714 33093
15583 33093 -8669 8772 62221 44357 58066 32825 25644 10573 61420 82562 98976 123311
15571 123311 76280 32878 -10309 -81823 -88908 -27027 -27504 -29072 -89796 -63768 -20390 -36882
15559 -36882 -10878 4625 19978 -21007 -11623 -5358 -6206 -50369 -58134 -38887 -68079 -74700 -30933
15546 -30933 33618 30325 -34756 -57146 -23509 -14991 31386 -11937 -103315 -82053 -114544 -129419
15534 -129419 -86087 -20307 14684 70609 8109 -33256 41179 117448 97573 45945 -30659
15523 -30659 -64625 -60980 -40380 71219 182783 193599 225543 249604 180214 120473 -13661
15512 -13661 -108890 -40969 32948 40528 21431 -12245 -13676 62294 88753 44897 -1103 -13529
15500 -13529 -19019 -50682 -21630 -8779 15730 -22862 -25680 32378 75650 25887 36673 111991
15488 111991 116879 74416 64479 49172 -49996 -30861 18176 5607 -40976 -15236 -6449 428
15476 428 -2944 20720 45220 54056 52494 21178 28261 40076 47702 -27628 -68568 -135022 -145743
15463 -145743 -72034 -90135 -13388 11224 -35299 -79482 -88594 -22169 45347 18582 38528 36555
15451 36555 -21396 19104 -7704 -52533 6441 58728 14570 -14225 -9159 1957 -22120 -2444
15439 -2444 31610 -7474 -21106 53561 102230 76093 92821 50616 -20788 -37159 36005 61017
15427 61017 28013 32469 14484 25261 -1525 -45782 -59320 -47057 20304 -5614 -65048 -40042
15415 -40042 -26063 -93427 -57070 72089 147983 130916 68651 3580 -41911 -71297 -84327
15404 -84327 -26856 40561 15058 14372 13279 14448 41859 52488 49894 86516 68635 6989 -39238
15391 -39238 -32642 -2859 18129 550 -19421 -15932 70852 136423 130003 88682 30487 -15634
15379 -15634 9083 15169 20362 30281 19715 -39931 -55134 -47388 -5994 14447 28767 -24617
15367 -24617 10995 125383 175946 193884 180711 193562 198950 147045 126302 70576 15578 -222
15355 -222 -43842 -50988 22384 75890 84415 65479 13940 -39431 -122513 -97367 8038 52772
15343 52772 66767 37626 44065 6712 17623 111808 101402 -2130 -18209 71216 49905 -43581
15331 -43581 -70593 -47485 -1863 37585 53691 82269 38215 22649 -68880 -136655 -134863 -58583
15319 -58583 -11847 -82932 -71434 -46079 -63940 -63234 -73309 -73396 -87960 -56571 -19988 -20569 -8034
15306 -8034 91163 147848 106024 27630 -49481 -45777 23787 97862 106524 120839 108456 51739
15294 51739 40494 24402 -101292 -53951 54738 69051 27750 -48668 -109664 -109131 -98620 -67292
15282 -67292 -80158 -51641 -12084 21524 1715 -22854 -6727 -21041 -57986 -80141 4275 94810
15270 94810 55556 24762 58927 17451 -32572 -104605 -75100 28475 75401 39838 -34922
15259 -34922 -27241 -24608 -6631 -50143 -96906 -54056 -4730 20263 51153 79596 55280 38628
15247 38628 71616 50357 46566 -5672 -1847 -5406 443 29073 52948 50721 45898 -5552 -2555
15234 -2555 82568 82557 113903 111460 51985 28629 53864 84991 79314 -39883 -138321 -113451 -108793
15221 -108793 -104051 -29635 -2590 -7442 -21556 12446 18580 -83731 -66985 -43734 -29912 -10652
15209 -10652 -28542 5271 -9749 -48400 -20315 22545 81298 58235 60679 11241 46963 79010
15197 79010 60599 66694 47422 46312 36038 36120 41316 49517 11050 -14615 -25077 -100931 -104144
15184 -104144 -60030 -4237 -30971 -49254 -22248 105912 125825 80074 140599 134486 -2615
15173 -2615 34089 134527 103230 70887 73276 110600 155453 109950 72078 18689 6332 9868
15161 9868 27376 -6104 12722 104389 97140 102976 17854 -57050 -41536 -142637 -137259 -15059
15149 -15059 34708 18354 16453 107950 169437 120492 119252 104601 68078 31381 -30200 -63060
15137 -63060 -50281 -18464 -18825 -13699 -10615 -4671 -38679 21181 41947 43441 60237 74599 -5087
15124 -5087 20240 115144 109928 29550 54392 8401 -72602 -36795 40743 64717 6382 -14851
15112 -14851 -29263 -16414 -30818 -22572 17046 40165 44542 60391 45477 -16947 -105234 -58855
15100 -58855 -50860 -68818 -52065 -77414 -22988 -35429 -87805 -77754 -38779 -50167 -45190 -13854
15088 -13854 34811 39231 38517 -12910 17042 43440 47939 75502 85012 54884 104096 57201 -23236
15075 -23236 -88029 -47444 29465 38040 -38794 -61074 -69467 -29835 39355 58779 54694 13939
15063 13939 -33218 -98192 -57474 27897 90713 91096 51700 35786 41345 62398 46880 81260
15051 81260 62553 7777 25932 -1043 16886 50945 49460 56664 65782 59428 96346 82871
15039 82871 65858 11881 10491 11659 68059 141387 147921 76768 -11442 -37474 -114804 -94311
15027 -94311 -53060 -60815 -74607 -54032 -19191 40227 2517 -65610 -69662 -7957 5631 -44444
15015 -44444 -53438 -7237 -4005 17921 48643 -4072 61472 105553 101034 109628 43415 -7
15003 -7 24735 22481 3394 9954 2372 7140 36929 37783 20385 -14379 102054 78330 24167
14990 24167 38144 111306 82862 36935 26364 -23102 6545 49215 56433 -9573 -56077 -81334
14978 -81334 -146358 -63554 -1696 -25208 -60457 -83092 -48336 -49207 -90626 -156503 -122972 -56606
14966 -56606 -10453 6972 22955 -19853 -31905 -91104 -101186 -59102 -53323 -59270 -26049 -9378
14954 -9378 -5547 33841 34377 75684 97193 63931 61806 105319 123812 142393 70281 39185 61510
14941 61510 102964 96360 66101 -29937 19179 52321 64345 43192 -4775 -32327 -60823 -75024
14929 -75024 -45916 5668 39900 7383 47086 81023 132344 141518 93527 4929 32497 104179
14917 104179 52996 -17670 27030 -12815 -34935 6486 24361 29808 55420 10499 12812 -53039
14905 -53039 -38280 -31453 3572 79976 65613 47924 20727 41955 67070 127052 67291 -8302
14893 -8302 -23347 -42681 -75789 -63040 -58159 -69712 -77597 -56966 -60304 -32508 29590 5837
14881 5837 -15941 -71402 -120105 -78783 -27172 -54135 -100200 -112255 -112204 -149691 -122380 -33811
14869 -33811 -4727 -9989 -12945 -27800 -15522 16709 40975 114565 146462 148473 94651 59839
14857 59839 38500 28827 -21851 -20024 -30544 -57828 6601 31622 22900 36525 28745 20677 46730
14844 46730 38038 20344 -51428 -78731 5544 8329 -21600 -11576 7765 17429 -30569 -42446
14832 -42446 42119 39849 5101 -47182 -16960 47374 12069 -36791 1036 8665 27423 -13864
14820 -13864 -26592 -17408 -53776 -118810 -108566 -19099 15724 2297 35364 36844 26596 -8570
14808 -8570 -42330 -23653 -13964 -10712 -1109 87374 112215 65059 57352 -4011 -36047 -12907 -16171
14795 -16171 -9297 57027 3714 -21873 -19136 -30376 -28493 -64480 -64375 -25497 -9759 35266 48228
14782 48228 59241 157288 127854 63492 15371 5136 79705 98407 67103 43638 41848 33005
14770 33005 55699 76749 21274 -30190 19751 28909 22188 -7316 -53618 4223 -22960 23459
14758 23459 17964 -23148 5351 -42467 -104506 -76352 -49935 4546 16144 -27416 17596 28551
14746 28551 -11582 51432 30580 -1372 -86558 -73948 -50691 -22597 18314 -24105 -37060 -51563
14734 -51563 -11923 -19526 -8015 14731 -18142 -4144 63521 71686 33261 -40612 -45558 372
14722 372 62013 115792 117572 49765 58287 146984 173546 66819 -33199 -64792 -14419 12194
14710 12194 25319 -9806 -48266 -87431 -111317 -88533 -139274 -107963 -63171 -31813 -33330 -81176
14698 -81176 -106346 -133314 -47287 15605 72022 67954 2463 -58190 -64543 -60785 -85683 -121627
14686 -121627 -64015 -81194 -133938 -133783 -55635 43209 -13020 12624 62043 28817 -38120 -14104
14674 -14104 62909 103625 136661 102808 5425 -66687 -55566 -25004 55336 32710 4723 -25406
14662 -25406 -181 -17747 -49634 -54920 -78271 -83931 -22290 38433 -5238 8250 30709 32240
14650 32240 25408 7067 29783 26782 14853 25498 -15515 -72126 -89188 -29170 -95946 -107738
14638 -107738 -76784 -46555 -16115 987 14108 -20624 8373 47589 70363 92217 54946
14627 54946 -31906 -58192 -49108 -38672 -63338 -32624 -45519 -92167 -34954 -6562 -8939 -38039
14615 -38039 -80696 -137498 -114000 -122208 -130004 -142152 -109558 -74781 -75409 -23769 24706 47832
14603 47832 57694 -16642 -113198 -190276 -141710 -123548 -132943 -110380 -80066 -69438 -68105 -5475
14591 -5475 -58666 -90430 -35488 -50595 -24406 -19590 -62974 -112576 -107195 -69331 -39439 39074
14579 39074 61551 16888 -6128 11475 23300 5664 -2933 -27535 -100247 -142555 -67633 21405
14567 21405 43419 55630 89973 48402 -64943 -84923 -61168 9286 -6456 -13275 20955 79416
14555 79416 91928 24881 -42032 -58301 -62441 -28760 -959 -7549 -8933 1270 11145 60489
14543 60489 86632 59500 93522 121296 148834 145022 166733 138298 24694 36226 100065 77746
14531 77746 56026 -7914 -8829 -17039 -33354 55279 115021 78866 59504 26030 -16341 -83756
14519 -83756 -88777 -18947 20108 -74 -52554 -79439 -80870 -77093 -18617 -46113 -70410 -26454
14507 -26454 70925 36424 -29426 -39761 -29230 -18403 4223 44065 94940 36670 -3708 -36333
14495 -36333 -31659 24768 -16677 -82402 -95706 -83095 -42749 23855 82843 107782 151550 78593
14483 78593 -14913 -85073 -43826 4091 55013 33373 -9469 10974 13256 20597 -5232 -45784
14471 -45784 -43500 -47523 43571 69917 8318 -36704 -42671 -81 39615 46035 25723 9120
14459 9120 -59940 -22580 75944 54986 16863 -20355 -3955 449 -79045 -107728 -44047 21385
14447 21385 52945 36560 38405 44303 26074 -46534 -134980 -139744 -118077 -29619 -35629 -72737
14435 -72737 -16463 21451 72885 15159 8303 10491 -38019 -103779 -56848 -37649 -37548 -18796
14423 -18796 -7340 -19591 30519 26662 37457 27938 6937 29314 50922 66333 72447 5236
14411 5236 -58949 10972 -13314 -44561 43011 60247 50132 64665 -33788 -64518 -67880 -21585
14399 -21585 47610 89870 121006 26867 45900 12966 -44404 -34361 613 15573 -13629 28371
14387 28371 57282 18581 3625 14620 13120 93284 98796 18817 13291 -21312 -46631 -33541
14375 -33541 -73137 -58636 -14974 -1265 69355 40960 7100 6512 105935 52375 -22542 50290
14363 50290 94954 118741 60025 10792 19373 27149 11531 7066 15980 -8669 3272 1818 38039
14350 38039 34832 40778 42710 53304 70695 42358 94298 119575 89689 97351 96032 59171 35895
14337 35895 17190 86725 104626 133009 107816 78139 -28722 -45498 -29562 -100905 -129830
14326 -129830 -18888 28199 37218 36716 46238 22428 -39058 -67783 -11401 102533 143572 116446
14314 116446 52049 2843 6532 29622 -4788 -10676 -16249 -25934 20620 101041 140689 173340
14302 173340 186591 195913 202295 152492 182669 89436 57289 61325 44672 -7609 -11480 -28704
14290 -28704 -40782 114 29917 28155 -18112 -46671 -92991 -35378 -2955 11316 12594 -20721
14278 -20721 -48148 -24370 -33258 -73591 -66092 -41790 -22730 -18307 -37184 -82079 -72684 -40047
14266 -40047 -2547 55626 39123 5524 -53700 -139109 -176139 -186671 -161366 -113199 -99781 -79254
14254 -79254 -47553 17708 40537 22259 34489 31021 12253 1072 52606 54866 90446 154927
14242 154927 158995 86967 4789 704 -60757 -104126 -25642 -21186 -2679 17236 61165 81269
14230 81269 19177 -29353 -30211 2940 71773 88346 135752 158976 168798 160335 137574 102499
14218 102499 43397 3647 -51408 -67507 -52753 -15595 28163 37373 23832 22520 -12248 32487
14206 32487 26986 42490 82958 45664 32369 15748 79415 57192 36151 35378 -56334 -2727
14194 -2727 22640 -58216 -66958 -20946 36729 36237 8250 -40408 -64844 -40125 -58876 -94892
14182 -94892 -55786 -63520 -54962 -55047 23659 45332 -4757 -80882 -100774 -108719 -43832 -8915 38696
14169 38696 18467 34818 50976 118909 98126 109762 167608 158533 212901 216715 64767 -42084
14157 -42084 -560 21905 -7211 -22759 -38922 21741 -29470 -53826 -45129 -40444 16687 47719
14145 47719 16787 32746 68957 17901 29088 21611 62322 106471 74803 81160 62061 110371
14133 110371 91433 80944 51365 4000 27643 -21652 -41875 -36971 63902 86507 129946
14122 129946 172532 120154 72328 18483 81 -86168 -73404 -42531 -15648 -28878 -33659 -10627
14110 -10627 -50306 9777 68881 53224 41045 85190 129527 139686 83093 -7689 -12945 3597
14098 3597 -11716 3506 33965 24444 58154 78021 154532 165438 116059 23686 -19868 13303
14086 13303 36624 77215 -8793 -58898 -77199 -19259 85017 95260 112137 72161 39818
14075 39818 4572 41478 51044 15044 24037 56981 70481 -20274 -123856 -110218 -24646 37681
14063 37681 59840 68079 42870 72465 98345 56408 11524 53647 37194 8394 -5347 10756
14051 10756 15714 24087 15975 -511 1990 -27857 -17465 -61017 -95072 -95064 -113927 -34837 -6175
14038 -6175 35858 51605 99453 98482 74426 59170 65646 53620 19018 4093 51053 126314
14026 126314 103312 85831 67143 78782 58325 -10549 11847 67760 82704 47845 11396
14015 11396 3001 69469 86846 4656 -2863 48462 22026 -56252 -34098 -31209 404 10622
14003 10622 70858 51891 11828 -69876 -79575 -65761 18273 79485 82837 54188 50076 142214
13991 142214 160285 112749 52503 -78399 -77482 -22750 -12345 -32868 -57831 -95537 -75119 -20471
13979 -20471 56979 88946 -6098 -54080 2467 61951 130562 125193 17189 -47234 -95829 -152960
13967 -152960 -185141 -170934 -96419 -57717 -50815 -54132 -22631 27733 1773 16416 1961 -39746
13955 -39746 -55517 -62405 -9079 4461 -62572 19584 39723 -24001 28638 96173 91760 111126
13943 111126 102141 82442 84850 133264 86008 16403 -24868 -3747 45436 28120 23462 6380
13931 6380 -2921 -47032 -16593 -4855 -106335 -125829 -102574 -57966 -55405 -48028 -36193 -2599
13919 -2599 36153 3555 -28217 -30975 2726 39379 13991 54844 121829 76089 52604 106085
13907 106085 187828 145339 76550 15997 -10902 11280 6468 2047 55452 24530 13693 38421
13895 38421 44711 30579 -60227 -68262 -21471 -64997 -109283 -113310 -136932 -87856 -65554 -98708
13883 -98708 -67723 -6370 67704 41645 6745 -53639 -69017 -50255 -34562 -57920 -48141 -46458
13871 -46458 -6706 53322 51078 2410 -40091 -41091 -68511 -14958 13006 -58589 -66429 -45525
13859 -45525 17371 81960 138792 184212 187566 134297 134559 159094 143590 46884 30502 36530
13847 36530 -43372 -68270 54442 81020 17242 -4100 8838 30828 49720 97604 107135 74274
13835 74274 21465 -20323 -63324 -38759 34855 83105 54702 -26143 -32612 21696 28644 80643
13823 80643 65571 70523 44842 26165 20520 16498 45067 -69488 -152625 -140036 -117345 27254
13811 27254 61129 92402 29762 -17743 -20545 -62255 -66577 -34586 52170 69622 -11139 -2021
13799 -2021 -48662 -77071 -5018 60866 126032 119699 163696 160394 104462 54202 42996 32807
13787 32807 50757 88663 137128 157032 142772 141949 132621 119021 120858 114941 123405 63093 -36361
13774 -36361 -72737 -47143 -58761 -87946 -123138 -56160 24009 65360 84110 64323 72862 61469
13762 61469 71880 68922 66198 72698 302 -7257 12679 46125 114497 180680 175425 148565 135323
13749 135323 96143 32031 -27101 -78426 -65520 -65927 -75734 -71496 -94533 -84750 -124339 -27116
13737 -27116 7502 16076 78106 88101 70303 37118 32909 43786 61409 48596 50395 7314
13725 7314 27926 -9469 -60087 -74642 -103809 -80054 -63093 -61121 -52759 -63765 -58594 -101983
13713 -101983 -79012 -5022 1094 -72601 -78512 -78822 -88612 -20530 21694 78424 40115 -26598
13701 -26598 -114887 -142910 -146300 -98576 -41939 -68202 -37910 -2906 10515 14851 93527 159794
13689 159794 220399 197189 87271 37507 22164 41176 43809 21110 27610 29297 84222 90461
13677 90461 87245 61046 49609 31048 32085 32119 56225 60489 27203 18066 -33431 -64541 -89052
13664 -89052 -68912 -50126 -93774 -88210 -94472 -71848 -30135 -7980 57791 76253 27467 -30862
13652 -30862 -8026 -3942 -76380 -78553 -13320 4671 21470 57027 79004 6871 -19501 38914
13640 38914 62228 24107 32827 100158 89623 46699 54161 52773 18317 46334 107308 92893
13628 92893 27801 -4078 -55626 -87259 -94057 -98188 -63842 -275 46894 -30055 -52662 -5049
13616 -5049 71791 91574 69588 -5904 -25926 -19033 -7916 74364 91014 94994 34848 57173
13604 57173 77701 31127 -1033 -32403 -46401 -63381 -53305 -51285 20647 55858 3193 -557
13592 -557 -34029 31928 113380 140987 86832 31370 39171 24328 -12157 -99182 -81964 -4457
13580 -4457 23073 34245 14550 -50784 -23501 68969 57335 -7932 -69094 -47492 4629 8526
13568 8526 -48859 -125752 -127855 -88012 -57136 -28652 -31778 -52118 -30390 8385 46973 11262
13556 11262 -7338 73840 86471 82129 93834 74023 58559 61298 23804 -7622 -37988 -13158
13544 -13158 -23973 -24602 -2995 17081 28052 35102 46891 60029 57972 76138 69750 47112 54564
13531 54564 -37654 -68440 -68967 -105501 -87757 -31315 -23471 -46208 -2540 45525 39499 44115 17552
13518 17552 2168 33209 -1772 -48751 -59822 -100089 -104003 -34860 5814 1038 -9021 4893
13506 4893 5359 52736 77339 101627 46235 -11386 -81890 -102453 -31428 6450 50250 9675
13494 9675 -42193 23842 44453 17994 30556 1918 31401 14976 -27695 -58364 -61577 -41283
13482 -41283 -72274 -66039 9036 46007 -17253 -26074 10764 33868 50369 -5003 -35100 21114
13470 21114 92510 18458 -35687 27176 21001 27536 71631 35291 23837 14585 27938 28896 40165
13457 40165 71055 12326 -17872 -6206 -26291 -72932 -106679 -98072 -88420 -69986 -44089 -20812
13445 -20812 -35812 14482 48982 95864 101332 52425 38749 69056 88074 84192 110276 10540
13433 10540 -107154 -95537 -94520 -42599 -21279 -40468 -7268 21525 15712 -40537 -50453 -11621
13421 -11621 -12463 9610 -15705 5550 69532 79280 25271 11734 -24173 -34495 38375 48659
13409 48659 11844 -63647 -131579 -175297 -127749 -29408 -8933 3221 -7162 -53431 -50789 -13331
13397 -13331 27868 61817 85066 25362 -79226 -41880 -25183 6016 14749 17441 -5033 10341
13385 10341 27197 14173 -34634 -75985 -92159 -86735 -116673 -69237 -47992 -58326 -40577 13891
13373 13891 26369 5403 -19940 -6998 49561 36130 14208 20473 34590 35431 51270 2222
13361 2222 -52930 -31531 -36061 -47002 -12533 40928 5075 -34993 -41606 -60083 -4608 -27107
13349 -27107 -57027 -44449 -77760 -106381 -44762 -63930 -87571 -109533 -75743 -10225 -28907 -64885
13337 -64885 15446 16914 -37671 -81944 -37808 46218 -34149 -24485 67352 79101 83987 79559
13325 79559 21506 -55090 -82260 -41478 81025 91782 35109 -5704 12866 -28323 -25833 17822
13313 17822 67155 10621 40307 50020 3405 15303 10024 12119 31625 18652 3919 12715
13301 12715 -23190 -89485 -62584 -59765 422 81137 92984 16821 34377 24840 64124 17499
13289 17499 27457 62051 54303 20612 -43658 -29967 38074 53608 48122 100378 121292 38568
13277 38568 6390 10729 -2198 25271 38167 34794 21723 10526 9634 1722 26520 41108 71623
13264 71623 64985 60591 69590 -3941 -56099 -23739 -73961 -145740 -102243 -61764 -60837 -67774 -30047
13251 -30047 12359 22981 34788 12296 14643 83642 -2849 -19476 -38875 -82137 -12028 2820
13239 2820 -11362 30023 36572 -42139 -54893 -38440 -73736 -50097 31143 29738 8190 32524
13227 32524 107364 88154 77412 84432 63958 38282 69858 94743 107849 54854 36615 20649
13215 20649 35131 9082 -53691 -83414 6934 -2171 12456 57162 59525 -11005 -1730 13574
13203 13574 59232 63234 -23741 -70969 -87875 -85426 -66449 -12309 -63526 -91837 -74637 -40606
13191 -40606 -33568 -62587 -100337 -97788 -93624 -96274 -72483 -54356 -33738 -32663 -3663 31540 16026
13178 16026 -39909 -39056 333 17541 -57388 -111411 -103923 -60486 -117833 -137226 -113288 -92411
13166 -92411 -28407 40197 70987 -9136 -23866 20333 54398 79731 76771 44413 -4279 -19259
13154 -19259 -27272 -52913 -11962 15156 52043 44693 14916 12464 -22367 -41448 -27443 35020
13142 35020 43112 115390 66923 29592 -21042 -29956 5518 -62551 8900 41459 68634 59221
13130 59221 -9660 -25320 -56459 -81248 -101498 -97485 -58728 -92557 -120833 -57063 -5823 -21758
13118 -21758 -26261 -24751 -48602 -60948 1572 16770 -46543 12198 -5869 40176 48520 -16017
13106 -16017 -31583 19000 82963 104803 96856 102476 72322 33573 60163 22663 44760 48387
13094 48387 49470 -9206 42556 -4724 36665 43761 29191 13456 7869 25357 59596 39870
13082 39870 10545 -81201 -43657 2285 -16948 -56557 -140470 -139882 -85220 -35461 -18939 40614
13070 40614 68270 85910 15170 14465 -23791 -28517 -57348 -108458 -113116 -110543 -93241 -92604 -34533
13057 -34533 -48047 -46441 -50181 -84710 -67666 -74571 -89916 -27436 -40291 18447 39480 17912
13045 17912 16935 -14443 29208 94837 91076 50250 47388 59120 3668 -57891 -64633 -59008 -13194
13032 -13194 -68657 -76162 -56927 -58371 -5155 50899 10304 5129 -28031 -102033 -43372 33787
13020 33787 -1745 -53344 -110403 -131407 -105815 -68608 -46954 -9332 30886 25231 31294 25156
13008 25156 -14397 -50507 -23730 6266 2174 -67589 -51621 -32485 21504 2478 -88318 -52802
12996 -52802 -74566 -86850 -30215 8928 48804 38513 18659 45809 53369 10452 19885 38673
12984 38673 -75655 -128550 -63809 -31501 18651 43127 35731 -31603 59360 89642 1865 -36560
12972 -36560 -31922 -113810 -36849 24824 -24184 -91033 -66620 2686 15407 9716 -57917 -85188
12960 -85188 -98940 -83618 -57423 -90647 -140335 -83818 -33063 13290 18048 -31815 -77699 -81198
12948 -81198 -127095 -133722 -61760 -64576 -91904 -129635 -117718 -24721 -69849 -104719 -71680 -48685
12936 -48685 -104670 -199427 -211522 -179946 -145518 -154934 -134996 -151844 -65723 17786 28252 -44361
12924 -44361 -46884 59171 66272 28092 10439 47600 6561 580 48037 17719 -54457 -58099
12912 -58099 -61156 -41311 -128775 -143180 -85033 -89286 -174242 -127478 -31446 1313 16241 69095
12900 69095 43549 53916 27442 47227 71886 50017 67071 48083 17989 -36140 -86748 -32379
12888 -32379 -38958 -58748 -68123 -22730 -5573 89214 108957 66320 70033 77532 -1240 -4070 5969
12875 5969 -6241 -22399 11705 18268 99214 151505 68765 -62637 -48532 13139 32741 -8840
12863 -8840 20401 71961 20580 -8880 43320 49742 64549 4303 -69378 -66105 -26423 -60689
12851 -60689 -83876 -24672 73899 89800 55294 -6910 -18450 1780 37498 34625 23830 30099
12839 30099 42275 13560 243 3804 119769 53702 -2197 -10869 -6402 -36494 -64901 -51700
12827 -51700 -71137 -52418 -15380 11057 39972 40393 41118 4188 -22404 -5218 16475 -17942
12815 -17942 -32863 -6974 2918 32062 22223 -33962 -23624 -7756 -4479 56966 9961 -32155
12803 -32155 -43925 -44366 -77286 -72443 -14719 -53130 -70361 -99761 -73129 -86735 -114770 -82181
12791 -82181 -97353 -50419 -42110 37298 -2091 -84339 -32382 5173 -4815 -15326 -25956 -3216
12779 -3216 -28181 -51337 -26783 -7520 -7013 -59259 -37047 -33360 -76477 -79660 -71748 -58037 26631
12766 26631 106653 103844 24484 -38873 -18235 -43812 -10402 22994 81484 95720 19673 -23713
12754 -23713 30482 62001 1061 -91946 -79050 -5700 5971 -12145 27555 27195 78275 115140
12742 115140 120382 47470 -14163 -36214 -37367 -55037 -121322 -49412 22968 -34870 -68268 -91371
12730 -91371 -121893 -52042 -440 14057 -21484 -40944 -21130 24494 122042 140772 66760 8668
12718 8668 42442 34242 -16971 -69313 -115780 -89049 -20827 -32724 12561 65297 -972 4607
12706 4607 54651 61981 62444 63112 -3873 22741 16600 9102 -3060 -39804 -26332 -36673 5097
12693 5097 8324 -26699 -19542 57560 27421 -10000 -35770 -21224 -44411 -39440 20097 -6006
12681 -6006 -39225 -64704 -76891 -59229 -65977 -49588 -29784 -20295 33809 76554 39112 -14755
12669 -14755 8708 25231 -64942 -61568 -62437 -78885 -51013 8953 51863 63333 -37837 -111389
12657 -111389 -58264 18771 26957 59112 13732 -70654 -118169 -108042 -86963 -35812 -33010 -69071
12645 -69071 -101068 -84092 1483 21277 -40857 -53971 -10231 762 -72420 -37991 -57089 -161087
12633 -161087 -165109 -145189 -77712 -8185 2912 -39651 19033 6086 -45762 -47108 -42865 24457
12621 24457 32921 28847 -7349 -30265 -10263 -47967 -97127 -78115 -61368 18601 -35195 -97912
12609 -97912 -29050 24154 -25217 -22981 -47210 -41007 -14155 -14325 -63832 -47547 28530 53293
12597 53293 71070 58842 41373 -11053 -36282 -35938 -17848 44236 6035 -38238 -34546 -98757
12585 -98757 -122779 -112993 -131373 -105153 -46903 -30282 -88428 -91539 -104202 -115745 -102215 -94694
12573 -94694 -48931 -31549 -28520 65643 29750 16780 48864 104184 99520 50585 14995 14047
12561 14047 -11025 -60551 -32519 -20813 -16426 -5353 -38385 -6572 -37608 -96177 -51456 -35605
12549 -35605 14905 9572 12423 15230 -37344 -14172 4216 -7036 17164 -7811 -59656 -81351
12537 -81351 -115205 -64030 -66379 -69616 -17363 -25657 -18987 39226 -2670 -42396 -119547 -110823 -51498
12524 -51498 -3985 11279 -3472 -40227 -14534 -1339 12599 -16853 -58126 -52900 -29527 -70483
12512 -70483 -12000 15768 1401 -1016 32835 9667 -19272 13378 -2086 -21398 -8435 -50273
12500 -50273 -48443 -46289 -26456 6305 2558 10992 28298 -13656 -20162 -45602 -94742 -91081 -46883
12487 -46883 -49336 -71878 -34878 -113185 -137459 -117947 -60961 -67266 -87539 -91807 -89277 -13646
12475 -13646 77176 68513 55178 -59891 -74668 -20048 8834 -2006 -8165 -4386 194 -97328
12463 -97328 -95998 6957 42680 -13833 -47927 487 20122 24636 -7360 -4665 -28401 -36151
12451 -36151 -6269 22606 -3348 -9605 42515 28879 -20380 -22280 -49759 -82346 -69778 -80278
12439 -80278 -103397 -112823 -92489 -63282 -26475 10439 12421 -20875 9766 23260 84213 44134
12427 44134 -10152 -17112 -10506 22682 18451 20492 11533 -26392 -67199 24659 64480 51047 43653
12414 43653 -21283 -85721 -63621 -34785 -107093 -100633 -58029 -73139 -51788 -70959 -111113 -42408
12402 -42408 1500 19990 27274 28806 109904 100934 47308 19228 -646 21796 1123 9813
12390 9813 51366 7985 -34136 26337 21275 10201 -46016 -57113 -39791 -32787 -80898 -99603
12378 -99603 -61618 -24671 19661 47453 37470 4722 -82197 -123430 -80317 -25863 14391 42822
12366 42822 49193 -22204 -26537 -32339 -36181 -18128 -30158 -25562 25606 12480 -18850 -54004 -72619
12353 -72619 -88942 -95616 -48192 -8000 74755 85148 43498 3097 -31740 -48011 -42119 -2544
12341 -2544 31406 -6243 -24212 -85787 -126954 -109086 -60804 -30387 -47279 -55791 -5179 21791
12329 21791 11226 -6840 -77956 -113593 -25727 34869 46546 10140 -36866 8982 30146 -8175
12317 -8175 -36029 -3475 53486 48507 37688 44952 31826 21208 51736 64535 4633 -65914
12305 -65914 4877 55258 80247 91846 49114 77005 58691 43752 10885 54231 13926 52701
12293 52701 108172 50039 -53992 -57996 42239 63837 83148 78619 55661 -5482 -41912 7222
12281 7222 -43608 -63051 -74121 -81278 -23751 -40147 -29155 -1420 71847 99600 92985 4741
12269 4741 -37388 -8961 5655 -44192 -39456 3996 -24846 -65477 -99668 -47995 -37021 8586
12257 8586 49108 16089 -84668 -151682 -129156 -96457 -19831 -59658 -147398 -191110 -170966 -122384
12245 -122384 -98754 -5837 31069 -11549 66212 127540 105217 60505 24419 -20357 -15743 14028
12233 14028 -11214 54183 123196 65770 -48559 -70654 -40516 -74757 -69304 -41996 5956 29120
12221 29120 40461 -32312 -66878 -45253 -23433 -51448 -44500 -23506 47085 93499 102216 63680
12209 63680 114356 148291 87796 -17300 -7486 -26852 -9355 29016 68318 43020 -38130 1204
12197 1204 -12785 -114553 -147632 -94506 -1038 20717 -93812 -112436 -48100 -65321 47186
12186 47186 141221 93949 41280 -1374 -61113 -67688 -38227 5898 11499 48672 -18253 -14039
12174 -14039 12408 54677 63256 8046 -99144 -158806 -115328 -21569 21697 -15811 -8785 41001
12162 41001 50325 12218 -1764 -14775 22534 55558 21729 -11193 -11223 -4310 62713 84820 9130
12149 9130 -12640 -13712 -55393 -56726 -24552 7186 -28680 -90115 -86204 -77081 -71067 -98545 -99337
12136 -99337 -27152 30196 -23619 12432 53347 28367 -39991 -76356 -104682 -65641 -48226 -33092
12124 -33092 37776 46797 -1112 -70065 -19541 -31067 -104448 -111648 -7230 13427 -35355 25081
12112 25081 25071 -17761 -22590 -15520 3988 -15975 -82579 -46061 -41784 -57680 -69418 -35592 -12489
12099 -12489 1744 11583 -31419 6381 37818 21223 78476 32984 -798 -28258 18622 65680
12087 65680 345 -106920 -162170 -159491 -129107 -95618 8801 61500 53016 34929 -54811 -62245
12075 -62245 -61273 -36340 -37476 -58962 -90219 -103094 -59166 -65745 -86808 -82008 -25089 -3585 -53102
12062 -53102 -83656 -66597 -14415 -880 -21782 -41361 -73742 -119609 -114058 -125668 -100716 47847
12050 47847 72080 -38727 -66698 -82086 -75684 -91306 -112913 -90461 -64952 -57239 -90665 -149455
12038 -149455 -107496 -79751 -53072 -75604 -104763 -119459 -82502 -96099 -54156 -35511 87960
12027 87960 122044 110419 74163 66609 3583 -55462 -81116 -55703 9749 -37173 -45628 -36839
12015 -36839 -61458 -86879 -73727 -48731 -144662 -104835 -47027 -40571 -125150 -170551 -92068 51647
12003 51647 28891 16994 24981 64799 57992 31301 -18353 21944 25505 1841 -58008 -9962
11991 -9962 23677 -7098 -61989 -59576 -71127 -90092 -71903 -55274 -52754 5573 66645 89495
11979 89495 59051 44953 -49347 -50194 -56505 -110301 -147851 -86017 -65030 -48333 23407 104380
11967 104380 107931 72862 -235 -61424 -42975 15263 48208 41601 -40185 -132821 -48509 7
11955 7 316 -34128 3263 41149 71532 77378 55063 41211 -7308 -20641 2645 -8204 -1727
11942 -1727 68756 84640 30828 66823 58948 -15920 -82903 3156 53252 78924 43320 16101
11930 16101 27449 28311 30417 -17333 -42171 8518 31652 31471 12423 22701 12236 -5629 -10364
11917 -10364 39309 44274 -42896 -90123 -88034 -125569 -82409 -34027 59469 47339 -1644 -96456
11905 -96456 -105143 -63650 -48314 -74233 -70465 -27856 -2498 -74578 -121223 -109739 -29970 17492
11893 17492 11262 -59087 -86060 28705 85644 51586 -31543 -39328 -20173 3316 -1886 7886
11881 7886 49911 61951 30235 103752 174456 93987 74948 109596 75335 64635 52266 2056
11869 2056 -49952 -76047 -74130 -47935 -33334 -37316 -8187 9286 12159 -25345 -20307 136 -30501
11856 -30501 -40049 -11384 -19375 -27782 28469 2473 -38356 -19221 -67651 -110603 -92235 -40617
11844 -40617 -5071 -7591 -39069 -5748 26478 -33944 -71966 -76442 -95266 -43571 -15146 46418
11832 46418 1023 16603 -29457 -59890 -49537 60531 123802 135716 140958 63339 47582 41556
11820 41556 -6071 30458 24331 -35582 -40346 7958 73214 93401 66109 25306 40711 38994
11808 38994 67789 24310 -7842 15694 19325 -43063 -42699 -109045 -133947 -122208 -109394 -67810
11796 -67810 -44315 -36989 -55034 -17015 41577 103663 39236 -99541 -132438 -70840 -19821 26327
11784 26327 -12854 -3489 24598 -31905 -41110 -5081 38492 47578 83329 100807 86917 49891
11772 49891 49301 -36143 -126931 -171206 -91792 -43026 -39166 -2736 -5388 3636 -16035 -54739 -47679
11759 -47679 -4535 -31293 18962 11727 -12806 -12520 24526 35459 -15028 22022 -2967 21467
11747 21467 49829 34344 -9835 13565 -41684 -105045 -19262 39991 -29587 -70007 -35632 1494
11735 1494 -35145 -56100 -1075 -15189 15028 66231 53047 8422 1565 -11928 -25723 -7130
11723 -7130 -46129 -13126 25127 -15184 -76451 -78481 -37442 32521 78853 65094 114254 150199
11711 150199 56322 -4860 26204 29193 -39016 -36864 -37647 -80937 -135068 -127919 -72966 -73281 -81126
11698 -81126 -66972 -14152 40544 62899 94308 114217 68692 89510 100741 38457 -36676 -30295
11686 -30295 21937 -14406 -9026 -492 4898 42956 -23031 -59960 -72207 -69000 -64999 -73134 -18632
11673 -18632 -12682 -42197 -52903 -13736 -16949 -115253 -102287 -52836 -12300 -6817 1835 -18215
11661 -18215 -98344 -154321 -174254 -160314 -49051 71849 57577 -40156 -22373 19716 11737
11650 11737 -42385 -88461 -127391 -68764 10997 67629 -20144 -99493 -159968 -112616 -61268 -43201
11638 -43201 -11483 -13674 -74982 -44251 -9602 -54050 -26783 -24939 -13740 4179 8071 1841
11626 1841 16381 -18790 -53384 15689 6552 -27652 35688 23580 -36373 -13607 69093 108882
11614 108882 88310 89115 99623 117632 124468 158108 147873 154918 143679 30051 -112379 -111380
11602 -111380 -34690 -29379 -53424 -37638 -42753 -32040 883 -2404 5770 4445 45016 45458 -10727
11589 -10727 -19838 -6432 12427 26769 58667 613 -4146 52497 36384 -17624 -19265 -40063
11577 -40063 -49309 12450 53121 76709 23499 31516 46483 27512 46297 43912 78340 119980
11565 119980 80193 18407 -18488 -42165 5521 71316 12081 -51000 -69849 -21793 38272
11554 38272 -28425 -34503 -33267 -25782 -103471 -52110 45471 -2905 -28708 22272 30034 14173
11542 14173 32647 24217 21303 -6705 -91151 -134528 -130360 -127870 -97291 -90966 -119642 -40573 53184
11529 53184 71357 -6558 19613 69113 67515 60873 104082 143238 94532 107357 69654 44763
11517 44763 40993 35882 -15208 -105499 -26686 58718 81150 14824 -26259 -46506 -52392 -22702
11505 -22702 -26471 -89940 -59686 25932 13732 32583 -30118 -53287 -13347 -37084 -103525 -113154
11493 -113154 -132048 -110610 -80584 -112724 -132038 -60406 -47646 62969 71977 73096 53753 72664
11481 72664 113425 51676 -16185 -16398 -47336 -47066 -69370 -38969 20497 38149 -4218 -45720
11469 -45720 -50204 32499 120364 171668 120041 117001 124676 145819 108770 36204 1371 -2563
11457 -2563 -87727 -53969 5980 -48512 -52176 -9837 98301 166815 74127 -6943 -2207 -45566
11445 -45566 -120065 -159369 -67421 10167 9361 -22603 -65713 -26814 62847 139947 121505 81678
11433 81678 32235 38308 -5750 46590 109414 129023 96752 4960 25017 68823 74586 110321
11421 110321 83790 27848 -5967 49009 88308 25690 11601 984 -57793 -81037 -60442
11410 -60442 -24181 85692 93334 106058 88655 -38629 -29839 16663 64985 94162 126176 115237
11398 115237 82171 29371 -18872 -41257 -48364 -39319 23526 15647 -44388 -57740 -101078 -113064
11386 -113064 -69793 -25113 10501 6951 41129 42379 27269 23907 11685 38193 75796 90630
11374 90630 127746 73644 -25699 -103229 -64140 -56964 -45222 -10773 -36949 -33167 -3097 66866
11362 66866 103663 65826 33837 -3597 -35838 -45216 -38587 -8488 -2370 -942 -16504 -18911 2035
11349 2035 45164 35755 -16790 -98998 -114677 -83934 -23648 -18244 13229 9320 1014 25108 -23302
11336 -23302 -47947 -92041 -139974 -192746 -100057 -24580 -19668 -85847 -96982 -93891 -93207 -39964
11324 -39964 -703 77145 109051 1251 7017 7847 41887 -8069 -31048 -64711 -100643 -69510
11312 -69510 -11097 -33389 10522 20555 43826 23395 21046 -34793 22954 32780 -2759 -33862
11300 -33862 10909 27578 22930 11485 -22562 -33407 43006 38557 -31095 -44522 -117081 -139293
11288 -139293 -64482 -75359 -64035 -69367 -7425 39654 45123 8462 -10323 -36920 -80322 -100282
11276 -100282 -95483 -61443 -37273 -9504 19158 -6780 28003 68577 17814 21128 55512 64386
11264 64386 5248 7082 4866 17899 -15817 -16516 34348 22306 -19282 -24653 -28785 -25820 6902
11251 6902 13807 39564 32998 -32473 -62463 -75038 -87812 30192 100725 78194 25759 -45193
11239 -45193 -131707 -121749 -122382 -106207 -46126 -55418 -61402 -30435 -71611 -50888 -38992 24614 36921
11226 36921 -1451 -28694 -45860 15791 95789 17728 -68398 -88756 -21326 69309 52690 65041
11214 65041 93048 92265 30042 -40356 -69963 -35089 -20214 28734 32384 22103 10372 -15135
11202 -15135 -23030 -39677 9348 -51727 -72587 -20463 -38986 -86411 -154979 -167207 -135384 -130119
11190 -130119 -57334 -23780 17230 44382 42704 74706 70738 25877 19344 54810 32900 -45618
11178 -45618 -10230 25266 12411 -39010 -78069 -54201 -105364 -63714 -856 -3812 -79715 -111322
11166 -111322 -68495 19829 49565 42576 74864 80466 71662 31641 38302 45556 27478 41307
11154 41307 94331 95524 32515 -2272 -25580 -30264 -42277 -155696 -93278 -98814 -173480 -159177
11142 -159177 -110903 -115650 -153722 -133806 -72106 -119761 -215152 -231222 -212002 -172536 -61551
11131 -61551 -5304 4342 5190 -20030 1906 7048 -7635 3185 64291 43685 14148 48943
11119 48943 2868 -25431 -30368 -11996 -42706 -29271 -50109 5139 26546 19221 18341 19233 -57397
11106 -57397 -26400 -48269 -82866 -102387 -51872 32361 -16502 -111910 -129401 -132886 -68061 -41261
11094 -41261 -32918 62888 95869 75901 14487 -22295 -44166 -87161 -126530 -88962 -81039 -86830
11082 -86830 -106282 -73549 -112623 -130149 -104144 -86875 -34678 -36164 -82731 -36794 -39438 6635
11070 6635 72963 42674 35060 38736 9104 -6189 -10279 12608 29439 24042 43387 42026 -17139
11057 -17139 -63073 -64955 -53365 -34871 -39034 27680 -5952 -22271 -13987 -29422 -50951 -30594
11045 -30594 -63730 -83701 -52343 -45310 38866 105492 35124 -26206 7032 -5403 -7868 9081
11033 9081 40235 22927 -39445 -111626 -61874 52325 75413 71363 67277 42730 7356 -34352
11021 -34352 -1284 -26395 -49267 -90680 -55095 25894 -9095 -20518 -5928 -20471 -28609 -24547
11009 -24547 -12190 -14786 34183 55362 33915 69588 104047 111334 60957 34811 10806 -4438
10997 -4438 33637 102374 111293 -26802 -114112 -46700 17735 14412 34902 -45473 -65732 -44689
10985 -44689 -41444 30050 30870 27261 78131 19167 -17344 -17650 -44648 -31548 -67760 -99799 -2905
10972 -2905 -35282 -63542 -23932 -18140 -22260 -269 -52673 -62828 -49338 -113797 -132036 -68201
10960 -68201 6384 37897 114711 95546 -5801 6212 9471 13620 -61720 -81646 -48807 -43065
10948 -43065 -31582 -5583 -28 -28834 -62184 -16346 20628 -38594 -70754 -71010 -59999 30203
10936 30203 49251 99470 124472 75485 27012 46110 21282 -19991 -23063 -72523 -154775 -74613
10924 -74613 -42589 -17832 -43021 -53838 -45819 -28626 1897 -20964 37539 -27064 -85536 -65633
10912 -65633 -33877 -14164 -19006 -60831 -2484 91620 116099 55805 -27708 -82190 -75982 -30842
10900 -30842 -21567 -46333 -79269 -55176 3353 -25210 -131835 -132431 -115712 -10987 66566 77446
10888 77446 78520 34414 61353 120843 137889 83128 74217 84869 122813 139627 137978 114129
10876 114129 97852 116472 112226 98608 9710 -26374 -6088 -46367 -47657 -4273 3583 -25690
10864 -25690 -98809 -9348 48980 16059 7923 -2724 -74530 -143137 -100230 -42990 -54485 7419
10852 7419 77189 104473 57787 -4093 -27658 -10639 22567 8069 7773 41028 -12447 -85403
10840 -85403 -124368 -78672 -13543 48309 88180 29228 -19860 -48710 -17769 89441 89747 65717
10828 65717 36313 46804 53105 2065 63094 79966 92328 110991 78886 64477 102908 104716
10816 104716 111593 87200 33264 12625 -43693 -53316 -48192 -75290 -31159 14829 15100 2900
10804 2900 -9721 10851 51255 53905 94192 127691 75565 60870 72703 88907 19023 -58084
10792 -58084 -95693 -49133 -14150 -1223 22353 52314 11296 11018 12326 54756 23772 -9453
10780 -9453 -5708 42646 89654 33647 -57141 -57260 -21797 -504 -34971 -22854 -22263 -87630 -115118
10767 -115118 -96597 -86613 -47076 -28380 31573 -12719 -78318 -106215 -23672 19061 39293 31015
10755 31015 32138 49490 -14938 -45504 -3266 -15489 30403 87759 50542 -4568 8738 -22355
10743 -22355 -8127 -53296 -20121 2183 -69295 7189 20727 -26500 -92796 -79945 -9506 24059
10731 24059 29401 15242 41472 1468 4266 57990 38039 60868 33534 -72701 -105329 -74818
10719 -74818 30945 29984 4165 40066 16790 -36627 -10472 36357 72262 1594 -67848 -41195
10707 -41195 -53550 -24455 -7349 95573 78132 -7237 -24030 25995 43095 85149 68036
10696 68036 63815 86416 24903 33239 72446 114101 47170 -7289 27807 54499 42055 35544
10684 35544 28140 -3564 -37208 -9339 19485 16879 27687 31450 94239 153962 98628 -27633
10672 -27633 -75959 -8553 67056 120670 113527 72283 139554 135844 114938 115409 91554 17995
10660 17995 23181 -3048 28872 44527 89524 78724 38921 -5967 -40590 -67806 34726 69296
10648 69296 69663 -13683 -52228 -18203 -7275 -70000 -74293 20834 44803 -29829 -29995 -69652 -44424
10635 -44424 -23366 64214 139685 182327 187293 124595 18191 -42052 13175 98442 69600 -4454
10623 -4454 -33816 -23832 40180 74447 80027 11946 -41744 -38359 18717 -16732 -72505 -85306
10611 -85306 -43423 -35110 -5371 72771 87205 -986 -41749 -57949 -59042 -113112 -178908 -148340
10599 -148340 -28953 42614 51584 26969 -54000 -34071 2205 -86440 -97652 -59658 17613
10588 17613 100564 137463 73820 -20364 -22982 -43367 -31392 39122 67220 -2507 -30474 11812
10576 11812 -43033 -112319 -155913 -95009 -22997 -19902 8556 -10205 -35629 -26716 11015 39375
10564 39375 29933 21024 49505 83214 57811 9723 -8034 21023 40689 92054 109802 112386
10552 112386 76091 28992 -2114 -5446 40640 103721 115528 87228 72675 89002 65873 -1108
10540 -1108 14789 9496 27196 73960 66340 126681 131647 65313 40960 -53201 -64105 -36724
10528 -36724 -1446 -13588 8797 -12795 19042 -15996 -10600 14967 11945 18633 -6778 -30852
10516 -30852 -8348 1969 16988 2993 -40428 -58980 -33471 21684 39965 49814 846 -78233
10504 -78233 -63293 -37550 44088 26014 33321 -22329 -16569 43373 57390 26691 -12114 -79852
10492 -79852 -100333 -34979 -11627 -20213 10051 61284 87617 120193 155632 110117 100187 83017
10480 83017 50176 25295 3362 -44575 1200 -13772 -88933 -67924 -78290 -84890 -141723 -83982
10468 -83982 -71019 -58227 -77991 -62816 -17867 5920 101589 56925 -197 -73578 -82540 -79066
10456 -79066 -17674 28174 -2592 -3852 74542 86417 104432 148722 84991 10535 30727 68453
10444 68453 53191 51418 69677 89013 61747 37577 -1680 -38105 -8785 -2996 49817 94891
10432 94891 71744 -8248 18769 40339 -28805 11349 49013 108707 72987 10085 6780 40325
10420 40325 90090 134166 191306 206785 168871 146581 172959 136210 88130 -17954 -69528
10409 -69528 -47710 -20896 13271 -40034 -98538 -93517 -100546 -26928 30152 36606 70655 75090
10397 75090 61886 69308 37250 100917 112310 143345 112407 58689 30156 63574 117128 109954
10385 109954 15534 -17146 -58253 81 33964 3936 50047 107361 90556 89147 169167 199770
10373 199770 192253 235536 196766 133752 66397 73895 77183 115507 144925 142650 76450 74540
10361 74540 117969 122414 137197 91454 85274 106107 102677 138276 170858 228656 231013 277633
10349 277633 322834 360139 525439 754566 1007313 1209139 1428204 1691700 1864434 2004850
10339 2004850 2132679 2162131 2037225 1869199 1706334 1413636 1122702 917739 698631 543449
10329 543449 456568 362625 300019 206182 191800 166179 179825 216718 209659 163693 162749 153513
10317 153513 68835 39271 19730 68874 122372 114717 37646 -62702 -78455 4302 11674 -29492
10305 -29492 52628 94282 151573 104964 56914 110217 116727 92268 21188 54694 75391 78907
10293 78907 107516 113682 55584 31479 27612 16408 3877 27408 2695 -17717 19626 51391
10281 51391 59222 8888 -6068 52231 -5761 -42125 -12719 46714 83126 72969 60434 76926
10269 76926 124417 134842 46341 -32991 4775 52522 33858 -18553 -44225 12831 45307 64590
10257 64590 67655 50117 31655 68382 41961 -2092 53219 112853 52007 32663 32762 45247
10245 45247 15822 -79265 -97451 -80055 -69948 -45823 -82239 -110799 -84466 -31269 16918 5858
10233 5858 56519 88362 117726 111539 96404 53855 32392 96425 111799 55572 46603 3963
10221 3963 -34654 -9983 53709 45346 42495 94842 48783 -26504 -44562 -2598 -968 -22192
10209 -22192 -4636 8011 31311 -21019 -35220 -12875 27028 21138 41464 66878 97063 25039
10197 25039 -1881 42624 74158 17119 -4370 2325 18358 51336 27552 5288 -28678 -17431
10185 -17431 63362 67362 51788 -1772 9804 43996 35174 -107409 -92871 -72142 -57427 -47696
10173 -47696 -19364 -6005 -13515 -36295 -3151 1157 -23128 8614 -11881 -59413 -36784 -42707
10161 -42707 -23545 -53669 -34111 28988 42630 71332 133576 142245 117947 190972 222592 176402
10149 176402 90239 23191 -8632 25081 77621 21494 -12357 -14921 -29510 -32008 -30996 14743
10137 14743 16271 79306 92077 18101 -43626 -82479 -65737 -42480 -3285 28615 56404 63069
10125 63069 39293 -3186 -45459 -8293 37388 51369 38495 525 -59054 -33917 -43525 -15632
10113 -15632 -53815 -90316 -69896 -12729 15557 2232 -8884 8836 8007 16526 20299 6657
10101 6657 -10000 37073 94415 96625 96603 125261 118244 65160 120927 72753 40499 -61988 -58177
10088 -58177 -16457 -61284 -37588 493 6401 34251 64648 106060 99566 57901 16329 15721
10076 15721 32275 31270 -42560 -99791 -89194 -13256 2604 6884 4480 -2080 42755 78547
10064 78547 2422 -67286 -84262 -83249 -23130 -37105 -62901 -54454 -33432 -12038 -19611 -36796
10052 -36796 -96167 -27757 -18086 -51855 -36760 -1309 -4346 -18451 15727 43208 1093 -100406
10040 -100406 -117332 -87673 -104187 -133330 -93055 -29219 -87023 -111974 -28307 11671 7691 -5248
10028 -5248 -69878 -36613 24060 30266 91229 80419 58231 83301 109298 105596 -7734 -109787
10016 -109787 -115130 -109419 -103281 -27673 9851 -21945 -14175 12896 -3164 27517 15788 -23769
10004 -23769 13767 47637 32789 15605 34738 74573 4841 -21752 39264 43623 7576 -19255
9992 -19255 14295 49787 34305 -79145 -103480 -89867 -114926 -57796 -24825 -20154 -33308 24290
9980 24290 61222 7476 -8052 -11565 37745 67267 44646 82321 93693 23537 -40900 -88574
9968 -88574 -102290 -56185 -44103 -1714 -17667 -28531 -21521 13806 -28924 -37538 33369 97740
9956 97740 57156 28886 79615 131867 110581 108364 122603 53613 72723 99903 104581 66764
9944 66764 -21122 -36839 23195 46310 -2896 -84162 -56413 -17231 19662 80781 70726 -33275
9932 -33275 -103449 -107153 -95915 -35565 5172 -2976 -9677 -16468 -28541 43205 27575 -13054 -9707
9919 -9707 -23424 -7887 22614 79785 92853 42983 -2394 -36937 27385 66889 59388 67192
9907 67192 90035 14399 -545 12655 26473 17948 13661 20835 -7854 -15273 2077 19588 94035
9894 94035 68202 49097 32170 64444 81348 80069 79439 54473 14712 84316 149029 122298
9882 122298 45358 11292 46308 61372 11525 2743 35885 42873 11906 -22166 14699 67868
9870 67868 75894 87717 63495 51315 95588 86157 88299 123631 105853 108208 56346 97024 114867
9857 114867 -20036 -66034 -30071 73010 116105 122856 123928 107025 128797 93392 952 -14449
9845 -14449 -12039 -51043 -88454 -72506 20038 53169 -2873 26616 14309 -59886 -73363 -87445
9833 -87445 -108417 -60303 29935 80268 37429 97570 54369 41019 61701 127715 132903 142030
9821 142030 41823 -37737 51506 118818 125360 114088 43731 69739 152862 156804 84418 19445
9809 19445 8025 -19047 -16216 18545 9666 -1825 42011 115579 145854 167590 64194 45195
9797 45195 -9489 1826 25816 2454 -98771 -166272 -202957 -129377 -106796 -93515 -99408 -20524
9785 -20524 9968 -69252 -55322 -9284 -26632 -55454 -64544 -132041 -140218 -81948 -42945 -32465
9773 -32465 11733 60099 52900 74585 88283 111969 148207 124026 81574 71818 140452 136332
9761 136332 63175 24581 -12852 14871 89974 121283 111919 83096 -16068 -40264 2971 39398
9749 39398 120250 170100 131748 87558 26402 1334 13171 88639 93979 218667 222328 107623
9737 107623 10829 -76720 -53090 30201 -673 -34153 -4390 63644 52444 -20446 5346 28935
9725 28935 69130 106457 131821 72002 41970 27088 25826 77252 134303 72505 113888 111632
9713 111632 165978 154255 90199 29962 68508 77046 115419 118610 75001 123499 126984 123297
9701 123297 129745 108194 72881 20702 15312 57801 32623 -22861 -7374 -33498 -15411 32648
9689 32648 22113 -2697 13047 91203 105953 93841 55625 25869 58590 98861 20039 5608
9677 5608 2282 -9846 28263 7349 -1439 29459 26865 44439 51531 48421 40339 65213 98348
9664 98348 79279 55828 52033 19677 -18456 10626 16568 46490 7896 27174 10340 32310
9652 32310 41143 56354 63878 56269 74408 77802 82217 89762 124460 147217 98150 36029 5492
9639 5492 82421 98923 55019 51280 78059 60529 48655 43866 62818 83430 91207 66038 31704
9626 31704 96515 120360 153046 184451 168781 152236 149783 164020 119837 73189 101215 141070
9614 141070 165974 106165 87980 82320 154283 165259 62774 7327 91060 151566 164513 204526
9602 204526 161598 133370 122431 170507 195378 204044 171602 68787 77175 84736 28507 2048
9590 2048 75068 69087 79164 109797 130550 117333 72912 55651 69331 120677 60840 29033
9578 29033 33417 55557 91926 104061 110999 72248 88323 50173 48130 62505 72006 37436 15862
9565 15862 91277 57436 108125 84786 15009 49643 16660 34760 83864 154839 189922 111027
9553 111027 -25048 -21329 43083 109433 133927 158747 152613 227324 205111 119317 67222 65422
9541 65422 74206 130596 99659 66829 28971 -27145 -63090 19201 105451 96823 147789 187985
9529 187985 168302 134390 118763 107780 150890 183265 156954 141279 144763 84535 75460 69720
9517 69720 45363 114927 230923 214765 127595 94846 188164 270525 258630 202448 229674 180461
9505 180461 194367 132611 135714 109264 89469 82121 120407 168089 106697 100210 83141 49589
9493 49589 43217 107462 136923 169294 222458 276261 260148 258419 185193 109708 123646 120739
9481 120739 118889 99865 83190 62689 88425 117523 148538 182800 141925 59046 18228 76252
9469 76252 103843 85563 114479 80575 16051 106024 137446 158988 182394 183184 256860 253489
9457 253489 183874 167161 173239 253781 273655 198898 144117 128102 104857 137526 123423 108602
9445 108602 109293 166262 185882 209042 243512 225130 213181 147974 124880 182956 118300 133636
9433 133636 193912 194221 186451 161634 111366 143319 157747 150690 107228 121933 107467 95889
9421 95889 152928 128063 105753 126445 154845 146265 160137 187076 172732 167347 150981 165856
9409 165856 214148 166116 136519 172861 198186 210131 202494 240752 219382 186183 221907 229779
9397 229779 221380 193439 112376 115384 133134 165302 166579 159838 159837 181633 202977 143733 148025
9384 148025 239100 224765 267365 318507 302661 235379 120044 138435 260228 249247 223549
9373 223549 226618 208000 220987 270835 364421 352872 307338 260875 229869 301409 347965 286955
9361 286955 199951 207690 223497 222313 209565 198832 208687 142690 220611 295891 343303 352658
9349 352658 367178 375170 339877 302702 293363 248030 210351 202645 229322 262964 256682 224040
9337 224040 210147 253762 329007 354611 380208 322828 329394 413548 376687 304931 318843 269286
9325 269286 253915 307547 305634 296369 243879 199944 277182 277405 193209 150583 198158 293252
9313 293252 338189 299218 285537 331078 310413 310047 356960 352385 354739 341725 295858 265873
9301 265873 246942 250951 274202 311727 338710 389780 386895 394308 402872 497335 496512 443529 447025
9288 447025 400718 358031 384666 381282 351284 296166 254936 225100 255360 307313 275753 335348
9276 335348 373312 344354 384344 394417 386218 381144 371418 428399 489863 507191 467654 483356
9264 483356 508776 497285 511331 521198 565509 599371 605959 614384 568120 543117 503222 538326
9252 538326 622195 632618 632484 609407 580774 566362 571256 500784 545860 616924 610230 576558
9240 576558 588380 597676 630162 637240 592882 605909 712348 756306 695772 633985 655632 648891
9228 648891 605927 545598 585224 659434 679925 704103 781598 823041 792404 753331 825619 904889
9216 904889 824300 785085 846557 890293 931034 984657 1010053 919361 860564 858469 914768 912209
9204 912209 970123 963262 911817 995586 1014029 995991 947182 982438 1018383 1138958 1190241 1163376
9192 1163376 1213880 1273145 1261461 1231254 1264280 1301877 1272634 1232447 1246741 1261616 1281155
9181 1281155 1258003 1263943 1344234 1435010 1495079 1473952 1459646 1434104 1440606 1452507 1488214 1550213
9169 1550213 1619333 1708533 1737022 1792605 1795016 1825406 1987759 2005215 1991277 1968477 1936063
9158 1936063 1929304 2027524 2104119 2152534 2195631 2270068 2317862 2388822 2386989 2406911 2418328 2458527
9146 2458527 2480894 2501841 2587995 2673816 2731807 2802424 2809852 2807993 2842214 2940445 3005171 3051564
9134 3051564 3034194 3071874 3072730 3146397 3252796 3377978 3513108 3574639 3575816 3607749 3673788
9123 3673788 3679664 3735610 3827814 3848676 3876859 3919912 3953474 4049886 4161975 4188211 4169282
9112 4169282 4180782 4236746 4272952 4348826 4398401 4447701 4444270 4503962 4572947 4555090 4569013 4605574
9100 4605574 4637256 4604382 4538773 4587890 4613013 4614991 4606864 4569811 4578561 4557446 4554429 4553167
9088 4553167 4447007 4420432 4410660 4384091 4388430 4355508 4302368 4261648 4270524 4285162 4254006 4192984
9076 4192984 4113331 4041843 3975166 3911413 3914520 3792538 3759339 3694363 3601994 3546253 3508066
9065 3508066 3364367 3291237 3344977 3350637 3260794 3199912 3134194 3028255 2989391 2966271 2873236
9054 2873236 2780652 2759810 2819760 2799211 2700125 2638110 2604211 2553504 2548785 2478068 2446196 2401194
9042 2401194 2334978 2285457 2243409 2253490 2130122 2051817 2066888 2115196 2075070 1998016 1908899
9031 1908899 1908350 1961486 1954706 1938995 1898674 1823621 1757330 1704707 1678052 1631490 1632552 1614815
9019 1614815 1534629 1549684 1523870 1415800 1376112 1419403 1427014 1331774 1282824 1290500 1277614 1259619
9007 1259619 1271334 1365908 1354537 1253585 1091376 1100870 1101771 1165137 1116393 1005586 1106384
8996 1106384 1094996 1078396 1121140 1165183 1177751 1163444 1111881 1037434 1096451 1140083 1112720
8985 1112720 1053979 995041 1005475 982915 915848 921363 968941 944522 919117 830419 785652 782540
8973 782540 877818 933267 916502 850837 787939 706630 734203 687922 604177 632370 690169 699317
8961 699317 688249 703622 703677 741201 814871 830127 817963 714991 660421 672249 652710 584363
8949 584363 625317 620155 579098 599302 643893 603717 522491 566693 613752 595786 554138 559215
8937 559215 552439 532784 494985 477489 468834 439271 416127 425138 416405 450488 497608 525980
8925 525980 492997 449097 456841 464028 435857 427153 446903 404593 422949 501130 457017 435039
8913 435039 376599 357642 356052 407835 412718 392440 370892 366085 368321 349041 325263 365792
8901 365792 380127 388220 349289 340660 254232 229346 212243 262205 348822 323240 268153 316531
8889 316531 376425 406405 479546 455875 426149 394306 390897 369441 349283 329529 269311 239165
8877 239165 274862 269179 267379 372744 441691 378777 354346 328148 318332 313398 314104 322631 290045
8864 290045 188355 204707 280601 307707 319705 331141 352257 349010 273365 222649 230885 253626
8852 253626 188116 223241 243787 182768 217388 310543 342384 284496 262215 199136 156882 215247
8840 215247 196421 154092 197025 234173 245769 262406 174095 124716 103443 97978 131014 133780
8828 133780 127508 100984 170876 226019 167383 123627 51203 46986 25204 101388 192483 278016
8816 278016 308379 311923 326701 319242 239482 130207 124183 209055 278899 320266 323641 304406
8804 304406 263264 198077 186339 175278 159406 136130 166782 207661 216763 207412 98450 94329
8792 94329 145816 159634 146772 181777 258430 319121 223035 141964 119383 155388 158817 134176
8780 134176 123733 132744 187582 215584 196485 169333 133695 71170 209242 325408 221646
8769 221646 142987 58109 147448 243813 229804 156947 73964 123011 89118 83975 156644 163782
8757 163782 76815 7907 69047 117544 152175 154481 143292 158006 196595 215171 178480 165916
8745 165916 117764 130445 150956 162177 188888 199623 172881 172139 97731 71843 45372 24610
8733 24610 81882 104287 95496 116647 186183 154367 147053 161047 168775 248554 268819 203322
8721 203322 207004 202794 191681 138731 121039 66565 46388 81343 117008 171152 198236 169406
8709 169406 150777 88901 101115 194088 202441 200347 198554 145802 125314 189315 170053 138429
8697 138429 180846 183782 160403 177001 215061 204490 175971 199374 198387 173219 134608 61512
8685 61512 -7504 35932 66070 146421 82684 17297 55121 105961 43226 20904 25438 103059
8673 103059 141844 191543 142578 106776 42076 40322 64073 105403 78618 29656 -3039 16544
8661 16544 143013 149803 73446 20747 -671 39586 60681 34044 107829 84978 40376 67754
8649 67754 40370 90605 145949 143543 126175 146979 148469 166894 134521 118894 91021 116414
8637 116414 178947 213425 235538 232898 271039 255044 156664 97545 62662 74511 65267 85322
8625 85322 105998 132907 183748 223711 261558 320014 344001 360750 363562 337721 304520 226471
8613 226471 219140 272872 261202 273735 281705 279926 297416 285834 242262 269622 302652 353032
8601 353032 390183 372878 351047 319991 283140 204500 271160 238003 219059 265232 252441 178159
8589 178159 171280 132552 122832 161130 164354 155624 157698 176606 263788 223020 152403 162753 123844
8576 123844 162074 199102 199128 223152 251785 263602 230051 149022 129763 173128 260156 284783
8564 284783 132838 118083 138885 183884 164162 197187 187450 118286 44870 97814 110698 83932
8552 83932 71197 127737 76252 -12762 -67279 -2607 69292 32532 -26526 -5536 -14804 -34443
8540 -34443 3669 99746 143763 125705 115324 128026 46267 65889 143346 148705 138247 103647
8528 103647 114585 146922 117557 74346 57946 -11084 7927 87104 76311 64139 154788 116298
8516 116298 77492 52906 78243 102958 112483 138707 115413 74494 68577 144684 147739 116701
8504 116701 160536 167163 212866 192637 118324 130267 49287 20368 54045 87784 81098 80465
8492 80465 127246 75940 12090 64744 112851 125010 111984 71956 35549 40432 42643 413
8480 413 57199 103213 117528 95861 42593 54152 102949 166099 231695 168012 62907 84289
8468 84289 58893 -11098 27981 60094 63936 69405 64580 23819 47435 46440 55372 150448 185731
8455 185731 190444 211289 280122 285238 192256 147796 127394 81314 93236 112926 142612 133751
8443 133751 67884 57964 44200 49780 66553 80462 4983 30306 36016 102518 94075 92010 95376
8430 95376 74662 111305 102196 75323 124967 216282 192154 151381 140962 186999 210219 174224
8418 174224 155957 216599 206715 127649 98894 95724 63278 33828 85194 93136 70857 13205
8406 13205 11619 62309 5462 -52792 -49081 -6846 25687 8677 -41741 -69864 -41623 -36896
8394 -36896 15774 72567 81035 81409 123647 68657 -5974 -2896 31562 80829 84594 48748 89882
8381 89882 142091 140382 68034 22521 56514 91715 79966 90684 80007 79947 65546 -8832 26446
8368 26446 56220 63427 1748 25687 45481 109435 150320 116142 76742 123745 112448 76391
8356 76391 83984 90906 114042 111417 108508 91045 134303 175513 111024 94043 70600 16444 9256
8343 9256 64201 134218 50038 19300 57817 61528 24662 13578 -8578 -24541 -10089 -31480
8331 -31480 -75619 -3276 18566 60973 77315 92028 60502 76977 34274 8731 25115 105736
8319 105736 154195 137282 122367 118467 107928 135198 71179 44152 17373 71607 31904 36857
8307 36857 3307 13567 35856 37319 82699 45054 23483 20175 16598 -3415 10883 89522
8295 89522 78339 122883 116991 86279 15178 -14370 -18117 -46019 -2486 29153 23769 59511
8283 59511 73038 28098 27474 23606 -8316 -82294 -106456 -41327 8710 -40709 -53455 7305
8271 7305 63045 49366 -19669 -21212 44516 3131 13169 57910 51199 26091 -1708 76234
8259 76234 118007 73231 115267 99086 46078 -35825 -36435 1585 -44777 -51214 -44240 -32890 -3827
8246 -3827 -8311 28831 80035 92500 70459 18337 22496 83922 115283 114306 65510 -5312 -912
8233 -912 2682 71036 146651 125466 91906 71543 48003 37087 65918 114136 34541 -65905
8221 -65905 -127503 -105489 -63729 -43728 -29090 -18169 25500 57981 4466 -72840 -63258 -45712
8209 -45712 -124302 -129809 -100625 5013 92596 79227 83136 105507 93970 -27008 -56680 -58246
8197 -58246 -94642 -115787 -38319 31581 7197 907 -1850 -14962 -8388 -11812 15017 19758 16050
8184 16050 78795 96345 29144 2926 14504 94848 139008 77749 34761 8201 -32515 -3380
$$ [...]
##END NTUPLES=NMR SPECTRUM
##END=
