##TITLE=Analysis number 329743
Compound Code cc 54206
Book Reference 518/193
Project Code adrs
Chemist Name colinb
##JCAMPDX= 6.0         $$ Bruker NMR JCAMP-DX V2.0
##DATA TYPE= NMR SPECTRUM
##DATA CLASS= NTUPLES
##ORIGIN= Bruker BioSpin GmbH
##OWNER= nmr
$$ XWIN-NMR		Version 3.5
$$ Wed Sep 26 10:10:01 2007 GMT Daylight Time (UT+1h)  MAYBRIDGE\nmr@NMR_250MHZ
##.OBSERVE FREQUENCY= 250.131544655141
##.OBSERVE NUCLEUS= ^1H
##.ACQUISITION MODE= SIMULTANEOUS (DQD)
##.ACQUISITION SCHEME= undefined
##.AVERAGES= 16
##.DIGITISER RES= 18
##SPECTROMETER/DATA SYSTEM= dpx250
##.PULSE SEQUENCE= zg30
##.SOLVENT NAME= CDCl3
##.SHIFT REFERENCE= (INTERNAL, CDCl3, 0, 16.522)
##AUDIT TRAIL= $$ (NUMBER, WHEN, WHO, WHERE, WHAT)
$$ ##TITLE= Audit trail, XWIN-NMR		Version 3.5
$$ ##JCAMPDX= 5.01
$$ ##ORIGIN= Bruker BioSpin GmbH
$$ ##OWNER= nmr
$$ C:\u/data/dgb/nmr/ADRS/2370/pdata/1/auditp.txt
$$ ##AUDIT TRAIL=  $$ (NUMBER, WHEN, WHO, WHERE, WHAT)
(   1,<2007-09-26 10:09:39.89 +100>,<MAYBRIDGE\nmr>,<NMR_250MHZ>,
      <created by zg, POWCHK disabled, PULCHK disabled
       configuration hash MD5:
       76 6E 9A 78 1E 09 19 81 EC 84 63 8F B0 6A 59 2D
       data hash MD5: 64K
       F3 AA C7 75 C9 8C AB 1C 46 98 00 7A 2E F7 D1 B8>)
(   2,<2007-09-26 10:09:52.54 +100>,<MAYBRIDGE\nmr>,<NMR_250MHZ>,
      <Start of raw data processing
       ef LB = 0.3 FT_mod = 6 PKNL = 1 SI = 32K 
       data hash MD5: 32K
       3D 0C 28 4C A7 A5 A4 41 7A 0D F8 67 FD 52 50 88>)
(   3,<2007-09-26 10:09:54.10 +100>,<MAYBRIDGE\nmr>,<NMR_250MHZ>,
      <apk 
       data hash MD5: 32K
       38 C8 5F 17 CA C8 B0 AD E4 FF 0E 0E 53 99 D8 77>)
(   4,<2007-09-26 10:09:54.93 +100>,<MAYBRIDGE\nmr>,<NMR_250MHZ>,
      <abs ABSG = 5 
       data hash MD5: 32K
       F1 C1 DF EB F5 AB 87 11 51 16 7C 61 97 76 69 D0>)
$$ ##END=
$$ 
$$ hash MD5
$$ 5D 0D CA A4 6F E3 E4 27 6F 63 77 01 7A 42 DB 6F
##$RELAX= 
##$RELAX= 
##$RELAX= 
##$RELAX= 
##$RELAX= 
##$RELAX= 
##$RELAX= 
$$ Bruker specific parameters
$$ --------------------------
##$DU= <C:\u>
##$EXPNO= 2370
##$NAME= <ADRS>
##$PROCNO= 1
##$TYPE= <nmr>
##$USER= <dgb>
##$AMP= (0..31)
100 100 100 100 100 100 100 100 100 100 100 100 100 100 100 100 100 100 
100 100 100 100 100 100 100 100 100 100 100 100 100 100 
##$AQSEQ= 0
##$AQ_mod= 3
##$AUNM= <au_zg>
##$AUTOPOS= <39 >
##$BF1= 250.13
##$BF2= 250.13
##$BF3= 250.13
##$BF4= 250.13
##$BF5= 500.13
##$BF6= 500.13
##$BF7= 500.13
##$BF8= 500.13
##$BYTORDA= 1
##$CFDGTYP= 0
##$CFRGTYP= 5
##$CHEMSTR= <none>
##$CNST= (0..31)
1 1 145 1 1 1 1 1 1 1 1 1 1 1 1 1 1 1 1 1 1 1 1 1 1 1 1 1 1 1 1 1 
##$CPDPRG= <>
##$CPDPRG1= <>
##$CPDPRG2= <>
##$CPDPRG3= <>
##$CPDPRG4= <mlev>
##$CPDPRG5= <mlev>
##$CPDPRG6= <mlev>
##$CPDPRG7= <mlev>
##$CPDPRG8= <mlev>
##$CPDPRGB= <>
##$CPDPRGT= <>
##$D= (0..31)
0 1 0 0 0 0 0 0 0 0.06 0 0 0 0 0 0 0.0002 0 0 0 0 0 0 0 0 0 0 0 0 0 0 
0 
##$DATE= 1190797778
##$DBL= (0..7)
120 120 120 120 120 120 120 120 
##$DBP= (0..7)
150 150 150 150 150 150 150 150 
##$DBP07= 0
##$DBPNAM0= <>
##$DBPNAM1= <>
$$ [...]
##$SUBNAM7= <"">
##$SUBNAM8= <"">
##$SUBNAM9= <"">
##$SW= 20.6930455092707
##$SWIBOX= (0..15)
0 0 3 0 0 0 0 0 0 0 0 0 0 0 0 0 
##$SW_h= 5175.983436853
##$TD= 65536
##$TD0= 1
##$TE= 296.16
##$TE2= 300
##$TE3= 300
##$TEG= 300
##$TL= (0..7)
0 120 120 120 120 120 120 120 
##$TP= (0..7)
150 150 150 150 150 150 150 150 
##$TP07= 0
##$TPNAME0= <>
##$TPNAME1= <>
##$TPNAME2= <>
##$TPNAME3= <>
##$TPNAME4= <>
##$TPNAME5= <>
##$TPNAME6= <>
##$TPNAME7= <>
##$TPOAL= (0..7)
0.5 0.5 0.5 0.5 0.5 0.5 0.5 0.5 
##$TPOFFS= (0..7)
0 0 0 0 0 0 0 0 
##$TUNHIN= 0
##$TUNHOUT= 0
##$TUNXOUT= 0
##$USERA1= <user>
##$USERA2= <user>
##$USERA3= <user>
##$USERA4= <user>
##$USERA5= <user>
##$V9= 5
##$VALIST= <valist>
##$VCLIST= <CCCCCCCCCCCCCCC>
##$VD= 0
##$VDLIST= <DDDDDDDDDDDDDDD>
##$VPLIST= <PPPPPPPPPPPPPPP>
##$VTLIST= <TTTTTTTTTTTTTTT>
##$WBST= 1024
##$WBSW= 4
##$XGAIN= (0..3)
0 0 0 0 
##$XL= 0
##$YL= 0
##$YMAX_a= 556120
##$YMIN_a= -631982
##$ZGOPTNS= <>
##$ZL1= 120
##$ZL2= 120
##$ZL3= 120
##$ZL4= 120
##$ABSF1= 16.522
##$ABSF2= -4.171173
##$ABSG= 5
##$ABSL= 3
##$ALPHA= 0
##$AQORDER= 0
##$ASSFAC= 0
##$ASSFACI= 0
##$ASSFACX= 0
##$ASSWID= 0
##$AUNMP= <proc_1d>
##$AZFE= 0.1
##$AZFW= 0.1
##$BCFW= 0
##$BC_mod= 0
##$BYTORDP= 0
##$COROFFS= 0
##$CY= 12.5
##$DATMOD= 1
##$DC= 0
##$DFILT= <>
##$DTYPP= 0
##$F1P= 14.0000005364418
##$F2P= -0.99999901652339
##$FCOR= 0.5
##$FTSIZE= 32768
##$FT_mod= 6
##$GAMMA= 0
##$GB= 0
##$INTBC= 1
##$INTSCL= 1
##$ISEN= 128
##$LB= 0.3
##$LEV0= 0
##$LPBIN= 0
##$MAXI= 10000
##$MC2= 0
##$MEAN= 0
##$ME_mod= 0
##$MI= 0
##$NCOEF= 0
##$NC_proc= -2
##$NLEV= 6
##$NOISF1= 0
##$NOISF2= 0
##$NSP= 0
##$NTH_PI= 0
##$NZP= 0
##$OFFSET= 16.522
##$PC= 1
##$PHC0= 152.178
##$PHC1= 14.19034
##$PH_mod= 1
##$PKNL= yes
##$PPARMOD= 0
##$PSCAL= 4
##$PSIGN= 0
##$REVERSE= no
##$SF= 250.13
##$SI= 32768
##$SIGF1= 0
##$SIGF2= 0
##$SINO= 400
##$SIOLD= 32768
##$SREGLST= <1H.CDCl3>
##$SSB= 0
##$STSI= 32768
##$STSR= 0
##$SW_p= 5175.98343685301
##$SYMM= 0
##$S_DEV= 0
##$TDeff= 65536
##$TDoff= 0
##$TI= <Analysis number 999999
Compound Code 99
Book Reference 9
Project Code 9>
##$TILT= no
##$TM1= 0
##$TM2= 0
##$TOPLEV= 0
##$USERP1= <user>
##$USERP2= <user>
##$USERP3= <user>
##$USERP4= <user>
##$USERP5= <user>
##$WDW= 1
##$XDIM= 32768
##$YMAX_p= 279852759
##$YMIN_p= -109104
$$ End of Bruker specific parameters
$$ ---------------------------------
##NTUPLES= NMR SPECTRUM
##VAR_NAME=  FREQUENCY,     SPECTRUM/REAL,   SPECTRUM/IMAG
##SYMBOL=    X,             R,               I
##VAR_TYPE=  INDEPENDENT,   DEPENDENT,       DEPENDENT
##VAR_FORM=  AFFN,          ASDF,            ASDF
##VAR_DIM=   32768,         32768,           32768
##UNITS=     HZ,            ARBITRARY UNITS, ARBITRARY UNITS
##FACTOR=    0.157963299565203, 1,           1
##FIRST=     4132.6476996994, 0,             0
##LAST=      -1043.33573715361, 0,           0
##MIN=       -1043.33573715361, -109104,     0
##MAX=       4132.6476996994, 279852759,     0
$$ Real data points
##PAGE= N=1
##DATA TABLE= (X++(R..R)), XYDATA
$$ [...]
$$ plain form
24656 641 -5244 -294 2908 2302 996 2828 -2063 -746 -3947 -7100 -4312 -5477 -8530 -2792 -7750
24641 -7750 -17171 -15469 -15644 -14606 -7349 -16080 -24135 -21448 -5149 -142 10091 5425 -2682 -1477
24627 -1477 -871 -5320 -434 -3392 -4362 -20880 -23050 -14560 -13782 -11924 -13604 -10705 940 -5321 -8188
24612 -8188 -5897 -1289 -6902 -12119 -9265 -4005 4048 5520 -321 -9558 -6884 -11321 -10185 -4395 -2567
24597 -2567 -2525 -286 -6546 -12856 -6629 -6968 -9943 -18730 -20899 -730 3792 -6356 -12267 -7944 -2845
24582 -2845 7092 9366 10196 7227 7732 19516 16072 5170 -5334 -16120 -9255 8656 1399 -1568
24568 -1568 2466 7448 -3505 7106 19894 11946 3453 -19188 -14553 4314 2187 21877 18794
24555 18794 4045 -9433 -12503 -4211 491 3903 -2971 -8545 -444 2719 2905 -5107 -56 7430
$$ packed form
24656F41n885M950L202o06j306J832m891J317l201l153K788j165l053N738m958
24641g750r421J702j75J038P257q731q055K687J6299N007J0233m666q107J205
24627a477O06m449M886k958r70j6518k170Q490P78J858j680K899J1645o261k867
24612h188K291M608n613n217K854N260Q053J472n841r237K674m437J136N790J828
24597b567M2K239o260o310O227l39k975q787k169K0169M522j0148n911M323N099
24582b845R937K274Q30k969N05J1784l444j0902j0504j0786O865J7911p257k967
24568a568M034M982j0953J0611J2788p948q493k2641M635J8867k127J9690l083
24555A8794j4749j3478l070Q292M702L412o874n574Q101L163J86q012N051P486
$$ plain form
24541 7430 4234 10964 16113 5419 -3699 -13157 -17780 -12668 -18285 -17434 116 10484 8814 -4709
24527 -4709 -4862 -778 9858 8059 1914 1930 -11419 -23907 -20582 -7738 1417 -11788 -16412 -7354
24513 -7354 -2643 -2799 -5044 -6630 -1651 -3992 -11009 -5288 -7719 -12739 -6120 -1657 1727 11571 17076
24498 17076 12087 6353 5816 6421 3326 9719 20907 15639 22845 15587 -4169 -10243 -2174 5948
24484 5948 11562 17864 9986 4750 3968 2965 -1685 -13036 -31095 -36792 -37909 -32760 -26405 -25791 -8987
24469 -8987 5210 4789 -1737 -17282 -27048 -28076 -22219 -9466 12240 20948 15296 9017 3899 15928
24455 15928 15397 13648 14937 13669 -2490 -2729 -9401 -5966 -9284 -14689 -12645 -9308 -3647 326 -2832
24440 -2832 -14990 -14384 -5543 1494 8354 7655 -1778 -227 -5357 -3860 328 -3083 -6671 11072 19796
$$ packed form
24541G430l196O730N149j0694r118r458m623N112n617Q51J7550J0368j670j3523
24527d709j53M084J0636j799o145J6j3349j2488L325J2844R155j3205m624R058
24513g354M711j56k245j586M979k341p017N721k431n020O619M463L384R844N505
24498A7076m989n734n37O05l095O393J1188n268P206p258j9756o074Q069Q122
24484E948N614O302p878n236p82j003m650j1351j8059n697j117N149O355O14J6804
24469h987J4197m21o526j5545r766j028N857J2753K1706Q708n652o279n118J2029
24455A5928n31j749J289j268j6159k39o672L435l318n405K044L337N661L973l158
24440b832j2158O06Q841P037O860o99r433J551n130J497M188l411l588J7743Q724
$$ plain form
24425 19796 9379 13036 5332 1074 7986 65 -3523 4321 12550 10047 10478 10985 3016 -3288 -9965
24410 -9965 -3751 7289 11624 5178 -5242 -6273 -59 -604 -521 -502 -866 -1591 -9780 -13230 -13552 -1004
24394 -1004 -4268 -12290 -6905 -3631 -4093 -8315 -8929 -11412 -12809 -14136 -16443 -13457 -9110 -5858 -17090
24379 -17090 -12958 -5776 -2786 1008 3000 -311 -4689 -421 25 -61 -3727 -2648 -5900 -1121 11704
24364 11704 696 -5087 -1887 1823 7115 3608 -834 -4160 -6265 413 -530 -10288 500 1344
24350 1344 -8840 -17657 -16095 -11361 -3303 -2573 -5130 -2998 -3028 -4038 3545 15307 11812 10426 12007
24335 12007 8831 13214 15156 902 -10637 -13082 -14392 -9804 -11227 -5664 -1069 6452 8889 6498
24321 6498 -686 -3413 7033 14052 19556 18372 11973 4993 14177 21270 14560 15784 14024 11269
$$ packed form
24425A9796j0417L657p704m258O912p921l588P844Q229k503M31N07p969o304o677
24410i965O214J1040M335o446j0420j031O214n45Q3J9l64p25q189l450l22J2548
24394a004l264q022N385L274m62m222o14k483j397j327k307K986M347L252j1232
24379a7090M132P182K990L794J992l311m378M268M46q6l666J079l252M779J2825
24364A1704j1008n783L200L710N292l507m442l326k105O678r43r758J0788Q44
24350A344j0184q817J562M734Q058P30k557K132l0j010P583J1762l495j386J581
24335A2007l176M383J942j4254j1539k445j310M588j423N563M595P521K437k391
24321F498p184k727J0446P019N504j184o399o980R184P093o710J224j760k755
$$ plain form
24307 11269 7011 3912 5393 9487 2250 5651 14944 20683 5172 -5607 -1870 4238 10621 13782
24293 13782 19852 14528 8644 -1932 -4026 -15595 -12175 -12601 1439 11157 6473 2689 4605 2091
24279 2091 -6990 -6788 -11638 -7587 -3805 -1229 -7158 -14296 -12039 -2589 756 -2880 -1173 252 409
24264 409 -3088 6084 -1192 -5723 -16348 -22722 -28589 -23520 -14538 -7548 -12219 -11142 -4440 1031 4831
24249 4831 5323 12132 4979 -9597 -7726 -16759 -13380 -556 13123 13934 4204 467 -2585 8328
24235 8328 12165 3997 -1699 3934 11660 1104 -13873 -9524 -9361 -9708 2444 15772 17182 4791
24221 4791 -7760 -11709 -401 9795 -564 -17037 -16654 -10705 -13378 -2889 -886 -966 -10791 -17445
24207 -17445 -18560 -8653 -1519 6363 12975 9231 13495 8075 1892 -130 -2513 -2947 -6926 -6526 -19082
$$ packed form
24307A1269m258l099J481M094p237L401R293N739j5511j0779L737O108O383L161
24293A3782O070n324n884j0576k094j1569L420m26J4040R718m684l784J916k514
24279B091r081K02m850M051L782K576n929p138K257R450L345l636J707J425J57
24264D09l497R172p276m531j0625o374n867N069Q982O990m671J077O702N471L800
24249D831M92O809p153j4576J871r033L379J2824J3679Q11r730l737l052J0913
24235H328L837q168n696N633P726j0556j4977M349J63l47J2152J3328J410j2391
24221D791j2551l949J1308J0196j0359j6473L83N949k673J0489K003q0r825o654
24207a7445j115R907P134P882O612l744M264n420o183k022k383m34l979M00j2556
$$ plain form
24192 -19082 -19595 -13528 -7534 -10863 -11677 -4868 895 -11268 -7561 -6875 -6342 -980 3858 3977 10870
24177 10870 6242 -4323 -9078 -23171 -25178 -20416 -15143 -6170 -2351 -4112 2407 5822 -2609 3521
24163 3521 4752 1719 1416 4371 1910 -7457 -8605 -8770 -4579 -1057 -1989 591 -861 -4048 2289
24148 2289 6168 13390 11844 15192 15602 13789 8097 584 -6451 -10108 -4250 10376 17451 16066 4063
24133 4063 1260 154 -3980 -1336 7930 10982 12830 4008 -8549 -12413 -7290 -11266 -6893 -5788
24119 -5788 -5784 3206 -5325 -9363 -7676 -10050 -9082 -3438 994 505 -14771 -12891 -6556 -5239 -3266 -5458
24103 -5458 8425 13730 13277 9982 14016 7245 -645 -10589 -7614 1158 4912 10468 19781 9925 -3726
24088 -3726 -10858 -6008 2200 9424 17652 14695 -9630 -11716 -7955 1740 -5555 -6391 4646 7688
$$ packed form
24192a9082n13O067N994l329q14O809N763j2163L707O86N33N362M838J19O893
24177A0870m628j0565m755j4093k007M762N273Q973L819j761O519L415q431O130
24163C521J231l033l03K955k461r367j148j65M191L522r32K580j452l187O337
24148B289L879P222j546L348M10j813n692p513p035l657N858J4626P075j385j2003
24133D063k803j106m134K644R266L052J848q822j2557l864N123l976M373J105
24119e788MQ990q531m038J687k374R68N644M432m89j5276J880O335J317J973k192
24103e458J3883N305m53l295M034o771p890r944K975Q772L754N556R313r856j3651
24088c726p132M850Q208P224Q228k957k4325k086L761R695p295q36J1037L042
$$ plain form
24074 7688 7059 3404 4960 3841 -5547 -13335 -9147 4662 17459 15975 2768 1853 7169 14650
24060 14650 13433 10250 5526 11008 12032 1442 -13861 -24842 -17892 -16289 -2747 -160 10483
24047 10483 17599 11145 14098 9445 5276 1690 2045 -1505 -8187 -2551 4478 -889 -3111 -6032 -7017
24032 -7017 5557 12824 14399 6828 -6473 -12101 -13819 2853 463 -5911 -3197 -2574 -4593 -5094
24018 -5094 -11386 -12843 -16698 -14296 -10293 -7100 -734 11797 7925 -849 -6670 -12849 -17959 972
24004 972 -6879 -23045 -29464 -22708 -15414 -10711 -2701 4352 10809 2884 -7286 -11653 -6961 -9015
23990 -9015 482 -7 -3673 -7456 -7149 -1357 4056 1810 1004 4911 1141 -5880 -5383 7733 21930
23975 21930 18267 15191 13925 15335 6106 -16178 -11642 9147 23548 29111 35505 22511 28078
$$ packed form
24074G688o29l655J556j119r388p788M188J3809J2797j484j3207r15N316P481
24060A4650j217l183m724N482J024j0590j5303j0981O950J603J3542K587J0643
24047A0483P116o454K953m653m169l586L55l550o682N636P029n367k222k921r85
24032g017J2574P267J575p571j3301n628j718J6672k390o374K714O23k019n01
24018e094o292j457l855K402M003L193O366J2531l872q774n821o179n110J8931
24004I72p851j6166o419O756P294M703Q010P053O457p925j0170m367M692k054
23990i015R497m89l666l783L07N792N413k246q06L907l770p021M97J3116J4197
23975B1930l663l076j266J410r229k2284M536K0789J4401N563O394j2994N567
$$ plain form
23962 28078 23870 -1022 -7236 4937 338 -12597 -11078 -14789 -15426 -7720 -11545 -7160 -5924 -2185
23948 -2185 -4854 -1214 -7302 -20979 -24743 -11675 -6367 -5984 -4945 3061 -6949 -8461 3693 -3689
23934 -3689 -7101 -6725 -6618 -14624 -22712 -6939 2122 1185 2161 -4783 -10418 -14691 -25091 -22291 -16615
23919 -16615 -17947 -29188 -27315 -21071 -14581 -4488 -3255 -2291 3724 3088 5086 -395 -7801 -16706
23905 -16706 -3987 -1991 -1472 -1377 -5283 -8840 -13269 -14520 -16086 -11495 7858 4461 10037 11782 -7336
23890 -7336 -11384 -7848 540 13123 9574 -2247 -7624 -11982 -16627 -10306 -9472 -9317 -13795 -14575 -14777
23875 -14777 -4751 4478 -359 -8089 -6208 -8750 8168 9170 3091 -1189 -10796 -11488 -18307 -15418
23861 -15418 -4458 -3830 -4081 2794 7451 5489 -7677 -12482 -2285 7516 6994 14106 6056 -4225
$$ packed form
23962B8078m208k4892o214J2173m599j2935J519l711o37P706l825M385J236L739
23948b185k669L640o088j3677l764J3068N308L83J039Q006j0010j512J2154p382
23934c689l412L76J07q006q088J5773R061r37R76o944n635m273j0400K800N676
23919a6615j332j1241J873O244O490J0093J233R64O015o36J998n481p406q905
23905a6706J2719J996N19R5l906l557m429j251j566M591J9353l397N576J745j9118
23890g336m048L536Q388J2583l549j1821n377m358m645O321Q34J55m478p80k02
23875a4777J0026R229m837p730J881k542J6918J002o079m280r607o92o819K889
23861a5418J0960O28k51O875M657j962j3166m805J0197R801n22P112q050j0281
$$ plain form
23847 -4225 -10795 -25463 -35610 -31537 -15957 -1886 -6724 -15473 -8876 -13452 -14719 -18494 -10834 959
23833 959 17747 25418 9019 -8727 -11325 -11919 -3657 -1034 3390 4060 7441 5225 -2547 -6470 -13863
23818 -13863 -20496 -15106 -12535 -7868 183 4123 -749 -14711 -6431 -1135 -1923 3693 10075 14223
23804 14223 10451 -647 6435 3433 884 -1236 3879 2153 -331 -13142 -17907 -11322 262 1326
23790 1326 5159 2220 3343 -3061 -5109 -4806 -5931 -5712 -1699 -8058 -13877 -10970 -2604 5052 -3789
23775 -3789 -15243 -19487 -5932 -3943 802 -1995 -13239 -14465 -7484 -8029 -15891 -22723 -28376 -23243
23761 -23243 -23401 -24846 -19182 -5715 6642 -3108 -5711 -2918 -3556 7642 10275 5533 -7978 -15211
23747 -15211 -11052 3504 2669 -9613 -9725 -237 13865 16120 15701 10143 19637 23285 20633 16867
$$ packed form
23847d225o570j4668j0147M073J5580J4071m838q749O597m576j267l775P660J1793
23833I59J6788P671j6399j7746k598n94Q262K623M424O70L381k216p772l923p393
23818a3863o633N390K571M667Q051L940m872j3962Q280N296p88N616O382M148
23804A4223l772j1098P082l002k549k120N115j726k484j2811m765O585J1584J064
23790A326L833k939J123o404k048L03j125K19M013o359n819K907Q366P656q841
23775c789j1454m244J3555J989M745k797j1244j226O981n45p862o832n653N133
23761b3243j58j445N664J3467J2357r750k603K793o38J1198K633m742j3511p233
23747a5211M159J4556q35j2282j12R488J4102K255m19n558R494L648k652l766
$$ plain form
23733 16867 11892 16437 12179 5140 465 569 -4178 4675 11643 6985 -5299 -5874 5563 -2387
23719 -2387 -13789 -12670 -22069 -28137 -30357 -21420 -13853 -12047 -6890 -3331 -2120 -8159 4526 3383
23705 3383 -2219 1132 -8548 -12282 -11883 -4084 11952 10810 12445 16345 19694 18708 12396 3570 -3853
23690 -3853 -13346 -11073 -4436 -1497 -3339 -14293 -7393 -24 4849 866 -529 2792 520 -16459
23676 -16459 -26810 -11802 -2811 -6417 -8342 -4743 1587 228 -8747 -8159 -7877 -17274 -12888 -3934
23662 -3934 4346 7040 -1064 -6590 -5405 -13549 -13384 -9574 -12173 -7243 -5075 -5968 -3885 4190 8200
23647 8200 19008 17251 8023 -8811 -14027 -282 22595 37338 35446 18667 14272 14763 10707
23634 10707 13982 5005 -8785 -2546 2844 4405 518 -3312 7788 19390 17590 16086 8847 1948
$$ packed form
23733A6867m975M545m258p039m675J04m747Q853O968m658j2284n75J1437p950
23719b387j1402J119r399o068k220Q937P567J806N157L559J211o039J2685j143
23705C383n602L351r680l734L99P799J6036j142J635L900L349r86o312q826p423
23690c853r493K273O637K939j842j0954O900P369M873l983j395L321k272j6979
23676a6459j0351J5008Q991l606j925L599O330j359q975N88K82r397M386Q954
23662c934Q280K694q104n526J185q144J65L810k599M930K168q93K083Q075M010
23647H200J0808j757r228j6834n216J3745K2877J4743j892j6779m395M91m056
23634A0707L275q977j3790O239N390J561l887l830J1100J1602j800j504p239o899
$$ plain form
23620 1948 -2125 -8192 -7173 -3815 7381 -2781 382 913 222 -1871 29 -4570 -10666 -8662 -2699
23605 -2699 3350 313 -11441 -4440 224 -9604 -17592 -4443 -1758 9989 10632 2168 1292 3048
23591 3048 605 -74 -123 -2288 663 10767 10846 5494 4959 5666 -3233 -6944 -957 -6016 -3299 -2292
23575 -2292 -528 8743 8760 8099 2547 -490 761 1065 -12607 -20447 -13915 -166 1627 11617 1826
23560 1826 -7460 -11171 -9612 -14318 -10445 -6741 5549 11790 16553 18711 14157 24005 27351 29412
23546 29412 22946 16161 10783 7425 -526 -2515 -6369 -647 15045 6013 -12310 -16398 -17508 -13280
23532 -13280 -17112 -16348 -23180 -16593 -4735 -6240 -18392 -9069 -6999 -7089 -12393 -2820 7627 7130 2043
23517 2043 5294 11253 8051 4095 8373 3979 -886 -6035 -3186 -11814 -28512 -32063 -22627 -8353
$$ packed form
23620A948m073o067J019L358J1196j0162L163N31o91k093J900m599o096K004N963
23605b699O049l037j1754P001M664r828p988J3149K685J1747O43q464q76J756
23591C048k443o79m9k165K951J0104P9n352n35P07q899l711N987n059K717J007
23575b292J764R271J7o61n552l037J251L04j3672p840O532J3749J793R990r791
23560A826r286l711J559m706L873L704J2290O241M763K158m554R848L346K061
23546B9412o466o785n378l358p951j989l854N722J5692r032j8323m088j110M228
23532a3280l832P64o832O587J1858j505j2152R323K070r0n304R573J0447m97n087
23517B043L251N959l202l956M278m394m865n149K849q628j6698l551R436J4274
$$ plain form
23503 -8353 7275 -5556 -17355 -7604 -3482 -588 -6235 -7078 -7329 -9662 -17939 -27590 -24623 -7905
23489 -7905 2878 -9417 -15720 1184 -2925 1671 16012 28433 33139 21247 3859 4256 11217
23476 11217 11924 12819 1104 -5644 -5195 -3546 -3180 -3129 -1323 -10689 -3644 1973 5211 1152 -3744 -4673
23460 -4673 -1247 7098 6764 6111 11515 13781 14028 24871 30633 23666 2882 2098 -2211 -2496 -2774 6661
23444 6661 5266 1624 7239 5468 2287 -2434 -5558 -13809 -8411 -14834 -14708 -7172 -13275 -24072 -19521
23429 -19521 -16904 -13932 -14190 -12052 9284 22456 22392 18642 8035 -1448 -4631 -11953 -6626 2272
23415 2272 10636 12379 7993 7167 9985 11272 6594 6839 17053 11070 1164 -5919 -14111 -12977 -1556
23400 -1556 -4696 -8808 -5066 -5126 1575 -3509 -3087 -8829 -4127 -7072 -6332 -10185 4498 5627 1134
$$ packed form
23503h353J5628j2831j1799R751M122K894n647q43k51k333q277r651K967J6718
23489g905J0783j2295o303J6904m109M596J4341J2421M706j1892j7388L97O961
23476A1217P07Q95j1715o748M49J649L66N1J806r366P045N617L238m059m896r29
23460d673L426Q345l34o53N404K266K47J0843N762o967k0784p84m309k85k78R435
23444F661j395l642N615j771l181m721l124q251N398o423J26P536o103j0797M551
23429a9521K617K972k58K138K1336J3172o4l750j0607r483l183p322N327Q898
23415B272Q364J743m386q26K818J287m678K45J0214n983r906p083q192J134J1421
23400a556l140m112L742o0O701n084M22n742M702k945P40l853J4683J129m493
$$ plain form
23385 1134 3297 7553 9554 7639 -9988 -13609 -4770 -5074 -14959 -13804 -12720 -14887 -14786 -33645 -31438
23370 -31438 -28092 -32397 -26238 -11485 -8059 -17087 -20306 -15560 -11832 -7839 -16860 -19549 -13197 -7189
23356 -7189 -2977 -3838 -9267 311 5241 -767 -4293 -6267 -23413 -22665 -25746 -15247 -3783 6669
23342 6669 -3440 -8130 1078 -5561 -3271 -7686 -12718 -12384 -10747 -6998 -3333 -10582 -9775 -8557 1107
23327 1107 3464 -9654 -5513 -1077 -2384 -509 3506 -477 -24002 -33259 -19694 -11278 -1632 15573
23313 15573 22656 21893 22781 22322 21106 25263 17040 2360 -4659 -13940 -8410 -5802 19891 22223 -3038
23298 -3038 2816 16237 8591 6833 8375 16659 12215 4537 -4373 -3978 -8803 -2670 -1792 -6658 -14336
23283 -14336 -23830 -20738 -8109 -8525 -14799 -9365 -16094 -22319 -11629 -11637 -10277 -4415 -2060 -6883 -13578
$$ packed form
23385A134K163M256K001j915j7627l621Q839l04r885J155J084k167J01j8859K207
23370c1438L346m305O159J4753L426r028l219M746L728L993r021k689O352O008
23356g189M212q61n429R578M930o008l526j974j7146P48l081J0499J1464J0452
23342F669j0109m690R208o639K290m415n032L34J637L749L665p249Q07J218R664
23327A107K357j3118M141M436j307J875M015l983k3525r257J3565Q416R646J7205
23313A5573P083p63Q88m59j216M157q223j4680p019r281N530K608K5693K332k5261
23298c038N854J3421p646j758J542Q284m444p678q910L95m825O133Q78m866p678
23283a4336r494L092J2629m16o274N434o729o225J0690qJ360N862K355m823o695
$$ plain form
23268 -13578 -3254 6566 5354 -3893 -4124 -7113 -2225 -8012 -19641 -11085 3873 -2359 -5644 1635
23254 1635 -2726 -3405 5790 -4487 -21842 -25524 -12120 6108 18180 24610 14078 8045 11922
23241 11922 9681 2776 1341 13108 11530 -303 -7346 -9965 -13684 -21214 -18192 -11609 3845 14987
23227 14987 3291 -101 -1824 -9285 -11182 -13539 -1019 2467 3461 2686 -10648 -4525 326 -4767
23213 -4767 -12828 -4924 -5810 -14956 -17888 -13946 -17670 -15718 4034 4573 1135 6601 15562 23462 22467
23198 22467 18268 10231 -4586 -6028 3899 -1798 -16961 -19511 -19579 -4336 20978 16476 -4343 -7909
23184 -7909 -8280 -13086 -15207 -20548 -5607 -4674 -10787 -4072 12151 21001 10617 -16586 -24690 -27249
23170 -27249 -25933 -19511 -8583 1270 14944 9411 -2985 -15379 -8947 6251 6189 -424 -3851 1205
$$ packed form
23268a3578J0324R820j212r247k31k989M888n787j1629Q556J4958o232l285P279
23254A635m361o79R195j0277j7355l682J3404J8228J2072O430j0532o033L877
23241A1922k241o905j435J1767j578j1833p043k619l719p530L022O583J5454J1142
23227A4987j1696l392j723p461j897k357J2520L486R94p75j3334O123M851n093
23213d767q061P904q86r146k932L942l724J952J9752N39l438N466Q961P900r95
23198B2467m199q037j4817j442R927n697j5163k550o8J5243K5314m502k0819l566
23184g909l71m806k121n341J4941R33o113O715J6223Q850j0384k7203q104k559
23170b7249J316O422J0928R853J3674n533j2396j2394O432J5198o2o613l427N056
$$ plain form
23156 1205 5930 3089 37 -4003 -2162 -225 4932 -381 -11627 -7046 -1384 -3323 -8704 -3669
23142 -3669 5803 10605 14206 730 -4406 -11062 -9077 14790 23185 14043 21636 24035 17984 16233
23128 16233 14279 7756 2868 33 1947 5530 3528 -6822 -16072 -11850 -13857 -10827 -25658 -23631
23114 -23631 -10529 -2347 8171 27280 26775 11067 -9023 -8111 9349 13118 16378 22790 16609
23101 16609 388 -7199 -13705 -20285 -24894 -14854 -3205 -370 -18306 -28767 -25344 -12164 -9480
23088 -9480 -18985 -20354 -11169 -6583 5513 9180 5329 3067 -2803 -7004 -11280 -15629 -12405 -7015
23074 -7015 3078 420 70 -4581 -12507 -3813 -13527 -11053 -3618 2834 4980 -3931 -11332 -16920 -27733
23059 -27733 -17457 -3389 -11132 -9688 -2767 1359 15696 22450 12699 912 -5092 -3528 -11746
$$ packed form
23156A205M725k841l052m040J841J937N157n313j1246M581N662j939n381N035
23142c669R472M802L601j3476n136o656J985K3867Q395r142P593K399o051j751
23128A6233j954o523m888k835J914L583k002j0350r250M222k007L030j4831K027
23114b3631J3102Q182J0518J9109n05j5708k0090R12J7460L769L260O412o181
23101A6609j6221p587o506o580m609J0040J1649K835j7936j0461L423J3180K684
23088i480r505j369R185M586J2096L667l851k262n870m201m276m349L224N390
23074g015J0093k658l50m651p926Q694r714K474P435O452K146q911p401n588j0813
23059b7733J0276J4068p743J444O921M126J4337O754r751j1787o004J564q218
$$ plain form
23046 -11746 -10272 -4078 -4675 15664 24426 20717 17469 17176 10620 4995 -4868 -8074 -324 4801 -3340
23031 -3340 -17622 -20461 -15713 -6035 -4354 3895 -772 -2721 5710 1628 -6753 -5328 1027 -8770
23017 -8770 -11417 -12221 -7751 3384 -2759 -3426 -7589 -12195 -14328 -17535 -17292 -7081 5226 8882 6352
23002 6352 11547 15411 13097 7842 8730 -4006 -6822 -13306 -27205 -24271 -4313 1183 9880 22970
22988 22970 13529 18135 16739 -3070 -5470 -7258 -25492 -27541 -18391 -21374 -31658 -21107 -8754
22975 -8754 -8980 -17377 -16029 -5411 3549 9371 -4792 -18226 -13371 -8980 -214 3201 -10649 -16362
22961 -16362 -11639 -8812 -14275 -14045 -19340 -17082 -14923 -18070 -26145 -21900 -9084 -6996 -17574 -26197
22947 -26197 -20476 -1940 2357 7747 9364 2997 -6647 -9105 -6022 -1815 -1342 -1749 1024 -12063
$$ packed form
23046a1746J474O194n97K0339Q762l709l248k93o556n625r863l206P750N125q141
23031c340j4282k839M748R678J681Q249m667j949Q431m082q381J425O355r797
23017h770k647q04M470J1135o143o67m163m606k133l207K43J0211J2307L656k530
23002F352N195L864k314n255Q88j2736k816o484j3899K934J9958N496Q697J3090
22988B2970r441M606j396j9809k400j788j8234k049R150k983j0284J0551J2353
22975h754k26q397J348J0618Q960N822j4163j3434M855M391Q766L415j3850n713
22961a6362M723K827n463K30n295K258K159l147q075M245J2816K088j0578q623
22947b6197N721J8536M297N390J617o367r644k458L083M207M73m07K773j3087
$$ plain form
22933 -12063 -17375 -18563 -13286 -9618 -3511 582 6087 5172 5318 -2195 -16680 -30021 -30093 -10912 7206
22918 7206 16446 10065 21941 17746 7283 8938 7436 9622 10812 10487 226 -1947 -11254 -20370
22904 -20370 -23062 -24727 -11339 -15136 -9687 11734 7264 8156 665 5466 9437 20235 11082 -146
22890 -146 -17368 -21013 -13991 -12664 -11498 -13018 -14952 -5909 -11056 -7840 11801 10319 615 -108 -8233
22875 -8233 -5059 607 6699 6037 -5481 -20752 -17124 -12819 -3619 -422 -3537 -9660 -18280 -12595
22861 -12595 -2159 -10421 -3566 -5001 -6464 -9832 -16013 -9079 -5108 14305 24624 21355 19883 19643
22847 19643 8672 -1487 -19358 -22578 -2280 7054 8906 -1529 -22 2989 -1035 -5800 -1369
22834 -1369 5725 23675 18431 16127 8939 11919 24360 23815 31962 19166 7858 -1649 -300 8014
$$ packed form
22933a2063n312j188N277L668O107M093N505r15J46p513j4485j3341p2J9181J8118
22918G206R240o381J1876m195j0463J655j502K186J190l25j0261k173r307r116
22904b0370k692j665J3388l797N449K1421m470Q92p491M801L971J0798r153j1228
22890a46j7222l645P022J327J166j520j934R043n147L216J9641j482r704p23q125
22875h233L174N666O092o62j1518j5271L628M305R200L197l115o123q620N685
22861a2595J0436q262O855j435j463l368o181O934L971J9413J0319l269j472k40
22847A9643j0971j0159j7871l220K0298R334J852j0435J507L011m024m765M431
22834a369P094J7950n244k304p188K980J2441n45Q147j2796j1308r507J349Q314
$$ plain form
22820 8014 8872 -1119 -5258 5237 3188 -2049 -8613 -8029 -6287 -13513 -11115 -7924 -2805 8839 7644
22805 7644 1415 -9582 -4893 3923 11968 -613 -14569 -17298 -10188 -3105 -5182 -18181 -12569 -1851
22791 -1851 8591 9053 16134 19491 11183 2231 3828 -3305 -5899 -7622 6494 13777 6998 -4622
22777 -4622 -8288 3892 -6399 -1660 -4490 -8255 -4121 1931 2484 631 -6644 -80 3830 3837 -1174
22762 -1174 2312 11024 4011 -587 -6526 -4715 970 -4599 -7745 -265 2284 -4721 -420 -5291 -12282
22747 -12282 -13035 -5674 6182 2643 6214 6162 709 4110 16816 29421 26534 12216 4424 1260
22733 1260 -32 5466 14759 14368 10905 2094 -899 -5567 -8360 -8866 6309 6855 8013 10598 19027
22718 19027 12215 7120 -898 -12136 -17788 -23598 -9854 -10736 -16279 -20665 -10097 25 11320
$$ packed form
22820H014Q58r991m139J0495k049n237o564N84J742p226K398L191N119J1644j195
22805G644o229j0997M689Q816Q045j2581j3956k729P110P083k077j2999N612J0718
22791a851J0442M62P081L357q308q952J597p133k594j723J4116P283o779j1620
22777d622l666J2180j0291M739k830l765M134O052N53j853p275O564L910Pn011
22762a174L486Q712p013m598n939J811N685n569l146P480K549p005M301m871o991
22747a2282p53P361J1856l539L571n2n453L401J2706J2605k887j4318p792l164
22733A260j292N498R293l91l463q811k993m668k793n06J5175N46J158K585Q429
22718A9027o812n095q018j1238n652n810J3744q82n543m386J0568J0122J1295
$$ plain form
22705 11320 19173 13379 4383 -1775 -1271 6276 6290 -5575 -5856 -11766 -12822 -3939 -6932 -11401 -14645
22690 -14645 -9643 -218 -3458 -38 -2423 -12812 -5381 -2853 11923 10576 -2135 -5935 -12138 -23606
22676 -23606 -22561 -19417 -22468 -24511 -30331 -22523 -8683 -3120 -7035 -16112 -5033 -5091 -5134 -8366 -10589
22661 -10589 -6236 -18680 -26380 -20027 -15562 -6038 5898 13230 15937 18641 14131 13802 29033 8459
22647 8459 -10260 3327 15441 13766 2334 -6772 -16868 -14160 -952 -5590 -17980 -12483 -8282
22634 -8282 -13403 -6725 -14598 -16401 -3058 -11881 -14332 -15809 -12234 -7241 320 -2128 -20 4600
22620 4600 1838 -9594 -13171 -3623 -7232 -22165 -32824 -26374 -21103 -5572 4502 -4059 -9546
22607 -9546 -8980 -1140 10810 1245 -11239 -17689 -17720 -17444 -13549 -1645 -15152 -23909 -10868 -1855
$$ packed form
22705A1320P853n794q996o158N04P547J4j1865k81n910j056Q883k993m469l244
22690a4645N002R425l240L420k385j0389P431K528J4776j347j2711l800o203j1468
22676b3606J045L144l051k043n820P808J3840N563l915r077J1079n8m3l232k223
22661a0589M353j2444p700O353M465R524J1936P332K707K704m510l29J5231k0574
22647H459j8719J3587J2114j675j1432r106j0096K708J3208m638j2390N497M201
22634h282n121O678p873j803J3343q823k451j477L575M993P561k448K108M620
22620D600k762j1432l577R548l609j4933j0659O450N271J5531J0074q561n487
22607i546N66P840J1950r565j2484o450l1K76L895J1904j3507q757J3041R013
$$ plain form
22593 -1855 -14231 -26000 -16986 -10094 -230 1704 3787 -6827 -17935 -25618 -25402 -17864 -23825 -29460
22579 -29460 -23997 -5323 4043 -3583 -12374 -14132 -26546 -26230 -8894 -1398 -967 7811 9498 -1334
22565 -1334 -12403 -25095 -14833 -10358 -16815 -14304 -4757 -6912 -12066 -7093 -10050 -16340 -12378 -248
22551 -248 4440 -1019 2036 7623 -3538 -3654 -15710 -13746 -1255 6441 9102 917 -2510 -18015
22537 -18015 -8991 2017 12370 25603 33671 22564 5298 -3969 1784 -511 -13214 -13010 -11382
22524 -11382 510 3655 -2976 -17807 -21600 -19766 -2011 6049 -4059 -14536 -16138 -14424 -18776
22511 -18776 -12621 -10167 -10703 -8246 -7932 -14368 -2970 -2608 7394 16478 11256 5312 7285 4517 942
22496 942 13026 23520 35627 41888 34818 23555 18286 29099 29757 25744 13970 20164 21280 2523
$$ packed form
22593a855j2376j1769R014O892R864J934K083j0614j1108p683K16P538n961n635
22579b9460N463J8674R366p626q791j758j2414L16J7336P496M31Q778J687j0832
22565a334j1069j2692J0262M475o457K511R547k155n154M973k957o290L962J2130
22551b48M688n459L055N587j1161j16j2056J964J2491P696K661q185l427j5505
22537a8015R024J1008J0353J3233Q068j1107j7266r267N753k295j2703K04J628
22524a1382J1892L145o631j4831l793J834J7755Q060j0108j0477j602J714m352
22511a8776O155K454n36K457L14o436J1398L62J0002R084n222n944J973k768l575
22496I42J2084J0494J2107O261p070j1263n269J0813O58m013j1774O194J116j8757
$$ plain form
22482 2523 -3374 -3177 -3893 -9358 -10619 -9170 1497 6667 -4239 -8627 -8235 -11173 -15003 -4932 -4690
22467 -4690 -12 -5672 -18292 -26207 -19065 -16943 -10091 1436 1762 -5511 -3076 266 -249 3444 8377
22452 8377 3242 -3297 -4375 7965 9704 8148 4363 13634 20942 27246 15597 -2994 -9573 -4964
22438 -4964 -4119 -3211 4480 6701 7795 4590 22296 17282 15584 14058 11412 7658 3701 -3921 -5367
22423 -5367 5725 2285 2975 -8217 -11909 -7978 -2694 3121 6055 5380 -8703 -7322 -5657 -14454
22409 -14454 -23825 -21020 -16924 1639 6478 2892 -9349 -10798 -3445 5380 14000 12304 16969 17973
22395 17973 17686 24781 21515 24464 29397 30540 29667 30401 15855 7627 4344 6811 15635 14153 16014
22380 16014 25739 25461 14276 8603 13388 8032 5120 3245 3476 252 1051 1740 9673 17835 25545
$$ packed form
22482B523n897J97p16n465j261J449J0667N170j0906m388L92k938l830J0071K42
22467d690M678n660j2620p915P142K122O852J1527L26p273K435L342n15L693M933
22452H377n135o539j078J2340J739j556l785R271P308O304j1649j8591o579M609
22438d964Q45R08P691K221J094l205J7706n014j698j526k646l754l957p622j446
22423e367J1092l440O90j1192l692L931N284N815K934o75j4083J381J665q797
22409a4454r371K805M096J8563M839l586j2241j449P353Q825Q620j696M665J004
22395A7973k87P095l266K949M933J143q73P34j4546q228l283K467Q824j482J861
22380A6014R725k78j1185n673M785n356k912j875K31l224P99O89P933Q162P710
$$ plain form
22365 25545 14529 9320 14029 22509 29743 26309 16337 -390 -5845 -919 6277 9177 8939 1585
22351 1585 -5544 5776 2881 5446 -11806 -27141 -9130 11846 4953 -8349 -15620 -5510 -5781
22338 -5781 -13060 -11464 -2546 6617 12786 8335 -6475 -10573 -4053 -4479 -5924 -11330 -511 -1056 -16696
22323 -16696 -20436 -9699 -16219 -21754 -14386 4001 -1487 -8314 -1865 1129 -3578 -8407 -3742 -7809
22309 -7809 -3118 1566 5537 2812 10700 228 10133 15037 19151 18876 13033 -2807 -9084 -2457
22295 -2457 13346 25246 22571 14537 9572 5171 -4268 886 9444 3617 6645 9636 53 -16292
22281 -16292 -15277 -12108 2660 704 -7856 -19968 -13026 2531 10549 7891 506 -1986 -3841 -7897
22267 -7897 984 2274 -1239 1318 823 3339 9304 1204 -7063 -11605 -16722 -20795 -16667 -10518 -4999
$$ packed form
22365B5545j1016n209M709Q480P234l434r972j6727n455M926P196K900k38p354
22351A585p129J1320k895K565j7252j5335J8011K0976o893j3302p271J0110k71
22338e781p279J596Q918R163O169m451j4810m098O520m26j445n406J0819n45j5640
22323a6696l740J0737o520n535P368J8387n488o827O449K994m707m829M665m067
22309g809M691M684L971k725P888j0472R905M904M114k75n843j5840o277O627
22295b457J5803J1900k675q034m965m401r439N154Q558n827L028K991r583j6345
22281a6292J015L169J4768j956q560j2112O942J5557Q018k658p385k492j855m056
22267g897Q881J290l513K557m95K516N965q100q267m542n117m073M128O149N519
$$ plain form
22252 -4999 -14026 -9355 261 9914 28119 33680 25584 9338 1713 -2080 -4808 -12039 -16986 -11034
22238 -11034 5753 15945 11248 3871 4292 1124 5666 12398 10091 6116 13207 3007 3229 5150
22224 5150 -11247 -18897 -14669 -13296 -819 1409 -989 -12091 -18284 -17409 -8073 -2380 -2176 -249
22210 -249 8657 11601 13112 20471 14079 4780 2938 -436 2204 11775 13749 9229 8469 9505 14078
22195 14078 17601 26604 6455 231 -5388 -9912 1880 7451 12437 10935 4228 -5128 -5651 -6235
22181 -6235 60 2041 6578 5026 6132 12275 6663 -6435 -12887 -7161 11661 13240 16770 12153
22167 12153 -3054 446 5889 4123 15978 21624 11598 5193 -6317 -7150 1567 -12481 -10767
22154 -10767 696 213 -433 230 -4172 -9244 -16315 -16560 -6809 -283 -1706 -9674 -12694 -5627 -1386
$$ packed form
22252d999r027M671R616R653J8205N561q096j6246p625l793k728p231m947N952
22238a1034J6787J0192m697p377M21l168M542O732k307l975P091j0200K22J921
22224E150j6397p650M228J373J2477K228k398j1102o193Q75R336N693K04J927
22210b49Q906K944J511P359o392r299j842l374K640R571J974m520p60J036M573
22195A4078L523R003k0149o224n619m524J1792N571M986j502o707r356n23n84
22181f235O295J981M537j552J106O143n612j3098o452N726J8822J579L530m617
22167A2153j5207L500N443j766J1855N646j0026o405j1510q33Q717j4048J714
22154a0767J1463m83o46O63m402n072p071k45R751O526j423p968l020P067M241
$$ plain form
22139 -1386 -2303 -13802 -10430 503 2120 10317 8789 6804 12250 10585 -2527 -9477 -2141 -475
22125 -475 1199 10144 5770 -1084 -260 5888 10660 15979 13128 16429 23534 15911 10131 11092 7693
22110 7693 671 -10619 -11694 -12124 -21299 -14495 -6887 -6460 -11703 -6947 -1795 -5474 341 -771 549
22095 549 3515 2298 -150 -2622 -13999 -15525 -20383 -17187 -13836 -1217 8189 -4907 -12608 -7042
22081 -7042 -4345 -3089 4604 -3409 -1571 2905 2271 -1573 236 573 19453 24204 14736 13911 333
22066 333 -1124 3040 8582 12324 9725 -237 -4416 3462 -5 -5738 -15385 -11120 -9627 -24739 -23575
22051 -23575 -18748 -11515 -13430 -15320 -8189 6280 8005 3205 2005 987 7343 -1998 -11341 -6671
22037 -6671 -4788 -14521 -13509 -12197 -4999 11681 26657 20034 13724 13780 16882 8152 4183 5886 13446
$$ packed form
22139a386r17j1499L372J0933J617Q197j528j985N446j665j3112o950P336J666
22125d75J674Q945m374o854Q24O148M772N319k851L301P105p623n780R61l399
22110G693p022j1290j075m30r175O804P608M27n243M756N152l679N815j112J320
22095E49K966j217k448k472j1377j526m858L196L351J2619R406j3096p701N566
22081g042K697J256P693q013J838M476o34l844J809L37J8880M751r468q25j3578
22066C33j457M164N542L742k599r962m179P878l467n733r647M265J493j5112J164
22051b3575M827P233j915j890P131J4469J725m800j200j018O356r341r343M670
22037f671J883r733J012J312P198J6680J4976o623o310N6L102q730l969J703P560
$$ plain form
22022 13446 17240 7938 13226 26941 22030 6797 7010 12605 10512 8970 6893 5840 -5761 -13768
22008 -13768 -4636 3467 9988 20161 18595 8475 8311 13318 8925 5521 9020 9660 10376 6559 -13000
21993 -13000 -10419 -8015 -19273 -13345 -6943 -7159 3695 10391 9003 2679 -6450 -6423 7644 7784 11581
21978 11581 1841 -9653 -11276 -20786 -23853 -20111 -9699 -4324 2888 17930 11127 2713 1673 12371
21964 12371 8457 -4476 -7589 -6709 -14243 -20045 -15493 -9570 -5940 -5062 -1226 3253 -501 5661 -2389
21949 -2389 7150 11779 7638 1101 -6119 -7994 -6303 2390 5268 1852 -4323 -7056 -8718 -8917 2239
21934 2239 4989 -1860 -6510 -11719 -3645 4036 1103 -9158 -4235 1850 -5447 -9817 526 658
21920 658 7359 10038 14800 5987 4891 -1950 -12063 -6153 -8409 -4048 7891 1154 -49 -8149
$$ packed form
22022A3446L794r302N288J3715m911j5233K13N595k093j542k077j053j1601q007
22008a3768R132Q103O521J0173j566j0120j64N007m393l404L499O40P16l817j9559
21993a3000K581K404j1258N928O402k16J0854O696j388o324r129K7J4067J40L797
21978A1581r740j1494j623r510l067L742J0412N375P212J5042o803q414j040J0698
21964A2371l914j2933l113Q80p534n802M552N923L630Q78L836M479l754O162q050
21949b389R539M629m141o537p220j875J691Q693K878l416o175k733j662j99J1156
21934B239K750o849m650n209Q074P681k933j0261M923O085p297m370J0343J32
21920F58O701K679M762q813j096o841j0113N910k256M361J1939o737j203q100
$$ plain form
21906 -8149 -12272 -13228 -10482 -12211 -2394 -745 -7496 -9811 -14419 -15244 -8893 -7347 989 17873 13498
21891 13498 7316 -5003 -9061 -6895 5086 11042 -2551 -5061 2346 4831 1405 -1857 2113 242
21877 242 -2502 -6049 2039 -4858 -9879 -9919 -5491 2701 1983 -3086 -12508 -5887 -5499 6178 4068 -3044
21861 -3044 -10782 -13728 -1199 9270 1158 -815 -503 -3721 -1189 6119 15342 12407 8747 10164
21847 10164 8802 419 -7850 -12856 -12048 -587 -5149 -5744 -2568 -9169 -11924 -5562 2145 1662 4018
21832 4018 -2336 -3769 13049 26206 29844 18282 5197 -3038 -3476 -3599 -4587 2642 13202 18907
21818 18907 13195 8655 1696 3400 -1032 -3492 -14448 -15613 -5200 -3147 -830 -2574 -9665 -3079
21804 -3079 6191 5846 2804 4029 -2508 3921 10683 13999 20883 28620 18482 7102 6076 -2695
$$ packed form
21906h149m123r56K746j729R817J649o751k315m608q25O351J546Q336J6884m375
21891A3498o182j2319m058K166J1981N956j3593k510P407K485l426l262L970j871
21877B42k744l547Q088o897n021m0M428Q192p18n069r422O621L88J1677k110p112
21861c044p738k946J2529J0469q112j973L12l218K532P308R223k935l660J417
21847A0164j362q383q269n006Q08J1461m562n95L176o601k755O362P707m83K356
21832D018o354j433J6818J3157L638j1562j3085q235m38j23r88P229J0560N705
21818A8907n712m540o959J704m432k460j0956j165J0413K053K317j744p091O586
21804c079R270l45l042J225o537O429O762L316O884P737j0138j1380j026q771
$$ plain form
21790 -2695 -3720 -2918 270 -138 -7935 -2513 12161 16772 23069 11563 -8296 -5925 -1871 15
21776 15 13155 16905 -1265 -10958 -13010 -15592 -14170 -11351 -6327 -4717 -7107 -1287 3707 337 -2689
21761 -2689 -5731 -6633 -10453 -15572 -14932 -11183 -3944 6925 24990 31657 23908 10412 13037 19336
21747 19336 11285 2647 -1738 8464 11135 13618 5223 5574 6313 7285 4107 2170 16502 16029 7857
21732 7857 4097 6263 11577 26288 34277 26287 33262 28945 24479 24209 24899 24237 29639 27103 14169
21717 14169 20989 40669 44843 35703 29978 32739 35788 25772 21359 38466 41665 43101 36401 42987
21703 42987 33368 23386 31297 40143 39109 33645 24180 25543 35346 32189 20856 20619 27912 24395
21689 24395 37861 38176 24493 19582 22208 23017 23184 22176 17235 14130 16452 22737 37786 42381
$$ packed form
21790b695j025Q02L188m08p797N422J4674M611O297j1506j9859K371M054J886
21776A5J3140L750j8170r693k052k582J422K819N024J610k390N820M994l370l026
21761b689l042r02l820n119O40L749P239J0869J8065O667p749j3496K625O299
21747A9336q051q638m385J0202K671K483q395L51P39R72l178j937J4332m73q172
21732G857l760K166N314J4711P989p990O975m317m466k70O90o62N402k536j2934
21717A4169O820J9680M174r140n725K761L049j0016m413J7107L199J436o700O586
21703D2987r619r982P911Q846j034n464r465J363R803l157j1333k37P293l517
21689B4395J3466L15j3683m911K626Q09J67j008m941l105K322O285J5049M595
$$ plain form
21675 42381 36893 34232 30379 27725 38883 41269 43946 35335 30654 33954 31101 23887 15358 12727
21661 12727 11122 17449 17290 18082 16239 8150 11089 3919 -4800 -5481 -7341 -18196 -11292 -4469 9110
21646 9110 26438 29204 33157 10829 -1249 5497 13592 7671 8713 35535 45747 33737 18826
21633 18826 10017 13543 24649 25582 22503 17335 16460 13042 11506 16182 13199 1048 11042 18077
21619 18077 18361 19087 6429 11137 11395 1645 -7308 -14524 604 13455 10492 8135 8155 7865 2404
21604 2404 2359 250 7324 19312 21809 21493 24801 23457 19935 22653 28446 30703 30298 24326 26180
21589 26180 28750 35548 38903 25359 11071 5949 18460 14771 4302 15907 21167 11599 -1141
21576 -1141 -6098 10752 24457 26068 25174 17827 20200 17266 9392 4893 9713 16606 20173 15505
$$ packed form
21675D2381n488k661l853k654J1158K386K677q611m681L300k853p214q529k631
21661A2727j605O327j59P92j843q089K939p170q719o81j860j0855O904O823J3579
21646I110J7328K766L953k2328j2078O746Q095n921J042K6822J0212j2010j4911
21633A8826q809L526J1106R33l079n168q75l418j536M676k983j2151R994P035
21619A8077K84P26j2658M708K58r750q953p216J5128J2851k963k357K0k90n461
21604B404m5k109P074J1988K497l16L308j344l522K718N793K257m05n972J854
21589B6180K570O798L355j3544j4288n122J2511l689j0469J1605N260r568j2740
21576a141m957J6850J3705J611q94p347K373k934p874m499M820O893L567m668
$$ plain form
21562 15505 16110 18144 18047 13696 15569 7028 5100 252 4781 9996 13441 5757 2182 10848 13551
21547 13551 18705 30043 31160 35146 41669 41950 28136 24151 15122 12148 23467 30324 32159 32527
21533 32527 30665 35054 26163 17310 10990 20123 19458 27108 27933 30655 31825 28062 34068 38612 44643
21518 44643 42727 28855 37281 41674 36549 28218 24225 26985 29562 40768 50811 47848 50325 39693
21504 39693 28851 26355 24936 42402 32740 27964 22273 28391 29074 21726 14538 13644 20272 15595
21490 15595 19884 11215 11347 18851 18816 14629 19978 21563 13348 14886 16269 23417 15711 14978 12836
21475 12836 12732 5886 -215 -627 485 1987 9723 14104 8578 4590 6348 10166 21595 37506
21461 37506 35454 27043 11221 26772 32340 23168 19985 9967 6654 -7176 -11419 -7859 -7352 -3252
$$ packed form
21562A5505O05K034r7m351J873q541j928m848M529N215L445p684l575Q666K703
21547A3551N154J1338J117L986O523K81j3814l985r029k974J1319O857J835L68
21533C2527j862M389q891q853o320R133o65P650Q25K722J170l763O006M544O031
21518D4643j916j3872Q426M393n125q331l993K760K577J1206J0043k963K477j0632
21504C9693j0842k496j419J7466r662m776n691O118O83p348p188q94O628m677
21490A5595M289q669J32P504l5m187N349J585q215J538J383P148p706p33k142
21475A2836j04o846o101m12J112J502P736M381n526l988J758L818J1429J5911
21461C7506k052q411j5822J5551N568r172l183j0018l313j3830m243L560N07M100
$$ plain form
21447 -3252 141 7923 10338 10168 20318 16443 12507 11006 15542 10534 8508 8797 13736 21953 15347
21432 15347 1565 2683 18429 19502 19730 13406 2560 -2115 -1460 6348 8449 12627 4007 -17291
21418 -17291 -19806 -4328 -2836 1493 -2499 2773 9778 15002 22384 25456 21033 20388 21494 29868
21404 29868 24772 17710 20063 17521 7501 1978 -2741 -2948 12968 29293 44468 40479 33522 19926
21390 19926 7541 -4071 -5936 -4221 2218 6702 7261 10780 15795 10327 14050 14035 3360 -2330
21376 -2330 -9969 -19922 -32075 -27577 -24916 -18754 -8071 -3596 9739 -1191 4660 7120 9843 -1443
21362 -1443 1820 7177 3907 -830 4429 8779 11907 13444 4296 -642 -228 -3797 -373 -4799 -5673
21347 -5673 944 5103 6159 13180 18733 25312 22521 14329 6885 -1894 -16902 -10250 -3011 5616
$$ packed form
21447c252L393P782K415j70J0150l875l936j501M536n008k026K89M939Q217o606
21432A5347j3782J118J5746J073K28o324j0846m675O55P808K101M178q620k1298
21418a7291k515J5478J492M329l992N272P005N224P382L072m423o45J106Q374
21404B9868n096p062K353k542j0020n523m719k07J5916J6325J5175l989o957j3596
21390A9926j2385j1612j865J715O439M484N59L519N015n468L723j5j0675n690
21376b330p639r953j2153M498K661O162J0683M475J3335j0930N851K460K723j1286
21362a443L263N357l270m737N259M350L128J537r148m938M14l569L424m426q74
21347e673O617M159J056P021N553O579k791q192p444q779j5008O652P239Q627
$$ plain form
21333 5616 10021 6287 9371 184 -8929 -7884 4960 9313 7416 -2636 573 7331 9551 2977
21319 2977 -3709 -3189 -8004 -8723 -7776 -931 -2231 -11328 -16082 -453 -3889 743 -957 -8065 -8877
21304 -8877 -18147 -23367 -19208 -26700 -25394 -26074 -22820 -15096 -9340 -4138 4124 1155 4525 7226 4329
21289 4329 1834 2091 1096 5826 17741 3061 -3049 4859 2974 -5744 3469 24038 18766 7987
21275 7987 3820 -2250 -8152 -10419 2946 4153 6030 6242 13408 12726 -836 -8067 -15627 -16749 -11148
21260 -11148 -2783 5454 10447 5839 4860 946 6909 9017 6666 -2693 -11131 -18916 -93 9905
21246 9905 7702 2583 -12013 -12286 -10624 -4925 5498 6043 -8602 -16685 -15691 -17702 -13831 -13319 -19215
21231 -19215 -23893 -13823 -12979 -20439 -27565 -19428 -9365 2884 16022 21281 20094 15523 14363 10072
$$ packed form
21333E616M405l734L084r187r113J045J2844M353j897j0052L209O758K220o574
21319B977o686N20m815p19R47O845j300r097m754J5629l436M632j700p108q12
21304h877r270n220M159p492J306o80L254P724N756N202Q262k969L370K701k897
21289D329k495K57r95M730J1915j4680o110P908j885q718R213K0569n272j0779
21275G987m167o070n902k267J3365J207J877K12P166o82j3562p231p560j122N601
21260a1148Q365Q237M993m608r79l914N963K108k351r359q438p785J8823R998
21246I905k203n119j4596k73J662N699J0423N45j4645q083R94k011L871N12n896
21231a9215m678J0070Q44p460p126Q137J0063J2249J3138N259j187m571j160m291
$$ plain form
21217 10072 460 -16592 -13029 418 14798 7248 9002 -2140 -4883 -3933 -2413 -1839 -270 -1086
21203 -1086 -3197 1676 -7782 -8640 79 929 4181 1642 2761 3950 2811 6634 -1408 -3520 -3053
21188 -3053 -4291 -899 240 3453 13922 8895 -5612 -5732 -1359 -4600 -3941 1382 -5420 -621 4188
21173 4188 1161 15110 24112 19766 11060 -2578 -3509 9494 14349 6168 10261 9972 9730 12284 5982
21158 5982 3509 -1702 8827 -3258 -16442 -18270 363 2424 -1819 -4786 -13492 -15981 -18161 -21540
21144 -21540 -33811 -27441 -21234 -10563 -8670 -5514 -1789 -2333 -1789 6042 -2223 -6529 -2125 8682
21130 8682 7738 -5725 -6968 5936 12286 11775 8083 1693 -1667 -7432 -13034 -10586 744 -244 -10186
21115 -10186 -20104 -18793 -21186 -20455 -10043 -20089 -13109 -10692 -7826 -1170 -2042 -2030 -5680 -6001 -9677
$$ packed form
21217A0072r612j7052L563J3447J4380p550J754j1142k743R50J520N74J569q16
21203a086k111M873r458q58Q719Q50L252k539J119J189j139L823q042k112M67
21188c053j238L392J139L213J0469n027j4507j20M373l241O59N323o802M799M809
21173D188l027J3949R002m346q706j3638r31J3003M855q181M093k89k42K554o302
21158E982k473n211J0529j2085j3184j828J8633K061m243k967q706k489k180l379
21144b1540j2271O370O207J0671J893L156L725n44N44P831q265m306M404J0807
21130H682r44j3463j243J2904O350n11l692o390l360n765n602K448J1330r88r942
21115a0186r918J311k393P31J0412j0046O980K417K866O656q72J2l650l21l676
$$ plain form
21100 -9677 -11033 -7713 -8887 -4632 -6223 -6753 -9336 -8133 -14520 -8522 2915 666 -3423 -2383 -4927
21085 -4927 -11595 -10684 -14222 -20590 -16375 -20196 -6745 5494 20511 30470 29033 32170 22570 10617
21071 10617 2455 -10989 -9042 1704 6307 9556 4612 -8936 -16571 -14589 -10820 4018 -2886
21058 -2886 -8052 -9627 -2430 606 -2773 -6512 -1597 2949 -1771 -1041 5403 -5215 -1669 8529
21044 8529 2383 10835 6103 5055 5176 -155 -13076 -8648 -2014 2629 8767 504 -2456 1714 -2513
21029 -2513 -159 4560 -316 -14716 -19631 -20767 -16570 -4663 -1244 -6566 -8088 -4551 -7313 -133
21015 -133 -7023 -11488 -14491 -13926 -11729 -13685 179 11450 6824 5447 10024 3571 275 -1396 9139
21000 9139 2204 3334 11443 5627 -8790 -7414 -3828 9188 11946 19673 22887 17706 9561 3558
$$ packed form
21100i677j356L320j174M255j591n30k583J203o387N998J1437k249m089J040k544
21085d927o668R11l538o368M215l821J3451J2239J5017R959j437L137r600j1953
21071A0617q162j3444J947J0746M603L249m944j3548p635J982L769J4838o904
21058b886n166j575P197L036l379l739M915M546m720P30O444j0618L546J0198
21044H529o146Q452m732j048J21n331j2921M428O634M643O138q263k960M170m227
21029b513K354M719m876j4400m915j136M197J1907L419n322j522L537k762P180
21015a33o890m465l003N65K197j956J3864J1271m626j377M577o453l296j671J0535
21000I139o935J130Q109n816j4417J376L586J3016K758P727L214n181q145o003
$$ plain form
20986 3558 2368 1132 -1377 513 2609 -214 1791 1802 259 8378 5366 4973 5136 -2236 2867 631
20970 631 -4152 4256 4028 4230 -1472 -3338 5690 3579 1996 -5071 -15398 -12747 -9188 -5069 -5376
20955 -5376 -10573 -16408 -17488 -13306 2932 15692 19629 14424 13904 10908 15544 5398 -8463 -16381
20941 -16381 -6198 -646 10041 7387 -1098 -2763 7586 9876 14664 8223 -804 -3433 -7506 -13956
20927 -13956 -14925 -2803 7657 10842 -2352 -9121 -15013 -18075 -8492 -16720 -19145 -16073 -13307 -3747
20913 -3747 -4508 -12326 -19189 -28275 -21447 -11325 -6464 2589 8660 6149 12142 15033 16252 22297 23540
20898 23540 9872 -927 -9746 -1395 12841 28320 19046 -336 -7116 -3600 -4607 -5223 -9635
20885 -9635 -12672 1074 5222 -11130 -7562 -4155 -9246 -5972 -5823 -9100 -5430 1902 3367 7207
$$ packed form
20986C558j190j236k509J890K096k823K005J1j543Q119l012l93J63p372N103k236
20970F31m783Q408k28K02n702j866R028k111j583p067j0327K651L559M119l07
20955e376n197n835j080M182J6238J2760L937n205n20k996M636j0146j3861p918
20941a6381J0183N552J0687k654q485j665J0349K290M788o441r027k629m073o450
20927a3956r69J2122J0460L185j3194o769n892l062R583q228k425L072K766R560
20913c747p61p818o863r086O828J0122M861R053O071k511N993K891J219O045J243
20898B3540j3668j0799q819Q351J4236J5479r274j9382o780L516j007o16m412
20885i635l037J3746M148j6352L568L407n091L274J49l277L670P332J465L840
$$ plain form
20871 7207 9616 2760 2079 2290 1438 3175 -757 -1024 2371 3029 1262 -858 3925 -2323 -8647 -3115
20855 -3115 6450 8942 3741 -1098 263 3257 10089 9760 13796 9854 6876 7551 7715 4842 584
20840 584 -7864 -7674 -8762 -8690 -16456 -16879 -11388 -5786 -16005 -10548 -12224 -12265 7907 13470 14452 15337
20824 15337 -4114 -6139 -7787 -13441 -6008 -12320 -18607 -18876 -11828 -3879 3463 924 1693 -3462 -5881
20809 -5881 -14014 -929 5911 -72 -4588 944 3524 2037 -7588 -13321 -7901 -5059 8379 -3633
20795 -3633 546 8762 5853 930 6164 389 1438 1493 -12321 -19738 -12586 -6516 -438 -2838 -3567
20780 -3567 -5790 2979 9152 4954 7629 13038 9291 5179 13591 7410 -187 -107 -5858 -5297 -553
20765 -553 5506 13705 19763 17862 13511 19324 18531 13313 19497 15661 18279 13810 16304 10048 7599
$$ packed form
20871G207K409o856o81K11q52J737l932k67L395O58j767k120M783o248o324N532
20855c115R565K492n201m839J361K994O832l29M036l942k978O75J64k873m258
20840E84q448J90j088P2p766m23N491N602j0219N457j676m1K0172N563R82Q85
20824A5337j9451k025j648n654P433o312o287k69P048P949P342k539P69n155k419
20809e881q133J3085O840n983m516N532K580j487r625n733N420K842J3438j2012
20795c633M179Q216k909m923N234n775J049N5j3814p417P152O070O078k400p29
20780c567k223Q769O173m198K675N409l747m112Q412o181p597Q0n751N61M744
20765e53O059Q199O058j901m351N813p93n218O184l836K618m469K494o256k449
$$ plain form
20750 7599 18746 14448 16279 10397 3199 -2271 -4878 -7071 -3653 -7627 1184 15048 16364 10973
20736 10973 16440 11928 -464 -361 10228 10603 13674 8152 6820 12778 11776 5566 -2158 -581
20722 -581 3126 -3153 -12562 -6326 -13997 -17887 -18172 -2752 -4039 -2573 -11955 -19916 426 9818 -3553
20707 -3553 -9468 -5459 2281 664 8552 7011 -1096 6464 1028 3924 7271 14835 24038 3217
20693 3217 -5361 -8023 6529 20620 27392 21936 26424 13158 453 -6201 -2186 6091 17380
20680 17380 16196 5287 362 4630 17069 15775 22145 21292 11420 5849 -8084 -14263 -12933 4064
20666 4064 11509 11701 3000 2024 1782 -562 1816 6980 17821 16056 11742 4514 7937 18817 17573
20651 17573 22175 8961 -352 8335 210 -2438 -13326 -5682 1187 -3217 -6640 -13910 -19331 -21004
$$ packed form
20750G599J1147m298J831n882p198n470k607k193L418l974Q811J3864J316n391
20736A0973N467m512j2392J03J0589L75L071n522j332N958j002o210p724J577
20722e81L707o279r409O236p671l890k85J5420j287J466r382p961K0342R392j3371
20707c553n915M009P740j617P888j541q107P560n436K896L347P564R203k0821
20693C217q578k662J4552J4091O772n456M488j3266j2705o654M015Q277J1289
20680A7380j184j0909m925M268J2439j294O370q53r872n571j3933o179J330J6997
20666D064P445J92q701r76k42k344K378N164J0841j765m314p228L423J0880j244
20651A7573M602j3214r313Q687q125k648j0888P644O869m404l423p270n421j673
$$ plain form
20637 -21004 -22667 -25784 -36421 -33680 -20758 -11768 -10787 -10855 -5169 1187 2008 -2247 -4660 -4177 -5753
20622 -5753 -14106 -8425 -436 8353 19058 21213 16805 662 -4789 -932 1934 2560 274 9702
20608 9702 11877 10151 14146 11314 6791 -2640 -14460 -150 10888 8155 12980 10371 6465 -1684
20594 -1684 7681 28518 26848 24616 18637 11695 2743 -1239 -2047 -29 6830 -8643 -4285 -489
20580 -489 -7797 -9134 -12722 -10185 11121 12753 5701 -5850 -779 18887 10494 -6486 -1231 -816
20566 -816 -9402 -9588 -1832 8115 9191 -5821 -9377 -4367 -4867 -2581 3227 7895 11215 14426 13913
20551 13913 6371 4384 3927 5254 7473 7310 -6313 -7932 4718 12676 15285 9139 4730 -7602
20537 -7602 -4505 -2601 -723 5618 3436 -2596 -14894 -13152 5749 9535 7693 16170 21165 19582
$$ packed form
20637b1004j663l117j0637K741J2922Q990R81o8N686O356Q21m255k413M83j576
20622e753q353N681P989Q789J0705K155m408j6143n451L857K866O26k286R428
20608I702K175j726L995k832m523r431j1820J4310J1038k733M825k609l906q149
20594a684R365K0837j670k232n979o942q952l982q08K018O859j5473M358L796
20580d89p308j337l588K537K1306J632p052j1551N071J9666q393j6980N255M15
20566h16q586j86P756R947J076j5012l556N010n00K286N808M668L320L211n13
20551A3913p542j987m57J327K219j63j3623j619J2650P958K609o146m409j2332
20537g602L097J904J878O341k182o032j2298J742J8901L786j842Q477M995j583
$$ plain form
20523 19582 18018 23161 23450 18461 16278 7414 7584 11907 12506 888 -2418 -4308 10885 25914
20509 25914 20901 17168 17322 9491 8235 5356 -492 -3369 -16038 -27400 -25177 -10993 -1544 6937
20495 6937 4836 735 -794 1451 2158 -8949 -12307 -650 -593 4333 -5482 -13012 -2549 1218 -2658
20480 -2658 937 6885 -1016 -14253 -15547 -118 2748 6627 4803 17668 16065 8781 4668 3738
20466 3738 5330 -2086 1894 -34 -9047 -7436 -2461 -6293 -5567 -7431 -2715 -8239 -21320 -16232 -8711
20451 -8711 -11075 -12314 -5975 -9185 -4695 2443 1993 6420 -1740 14431 26097 16035 1515 -1092
20437 -1092 4455 -1354 -8056 -14654 -5728 -6451 -4632 4404 2511 8696 13139 10430 17521 19215 9968
20422 9968 -487 1794 -499 -17981 -14971 -6434 -2366 4296 12203 -5823 -14853 -22032 -21135 -7711
$$ packed form
20523A9582j564N143K89m989k183q864J70M323N99j1618l306j890J5193J5029
20509B5914n013l733J54p831j256k879n848k877j2669j1362K223J4184R449Q481
20495F937k101m101j529K245P07j1107l358J1657N7M926r815p530J0463L767l876
20480b658L595N948p901j3237j294J5429K866L879j824J2865j603p284m113r30
20466C738J592p416L980j928r013J611M975l832P26j864M716n524j3081N088P521
20451h711k364j239O339l210M490P138m50M427q160J6171J1666j0062j4520k607
20437a092N547n809o702o598Q926p23J819R036j893O185M443k709P091J694r247
20422I968j0455K281k293j7482L010Q537M068O662P907j8026r030p179Q97J3424
$$ plain form
20408 -7711 11750 6432 1784 201 2325 -2582 4194 -9373 -17555 -9837 -8288 -25085 -26872 -24413
20394 -24413 -11429 1918 -400 -2198 -10309 -4795 -3528 -17868 -17518 -28331 -21520 -11642 -15938 -10605
20380 -10605 -9066 -17453 -5936 -259 -6229 -8955 4144 8381 15061 15520 7035 5575 -3757 -6165
20366 -6165 5674 6006 11193 17351 11565 4680 3810 -2882 -3697 -7772 -9913 4512 16300 18811 9157
20351 9157 7453 9447 7303 6114 6479 8164 1721 -4318 208 8673 12989 3466 1316 305 5303
20336 5303 14343 19813 21719 11763 12134 12788 14232 11806 4727 -1400 -10637 -7720 5987 10166 8631
20321 8631 10030 -663 -8778 -7835 -9119 -6480 4727 5837 3664 3675 6139 6541 1083 -10982 -11494
20306 -11494 -4511 -11979 -9328 14521 22715 14751 9895 3612 -352 -424 3574 7817 10248 7355 13064
$$ packed form
20408g711J9461n318m648j583K124m907O776j3567q182P718J549j6797j787K459
20394b4413J2984J3347k318j798q111N514J267j4340L50j0813O811R878m296N333
20380a0605J539q387J1517N677n970k726J3099M237O680M59q485j460r332k408
20366f165J1839L32N187O158n786o885q70o692q15m075k141J4425J1788K511r654
20351I157j704J994k144j189L65J685o443o039M526Q465M316r523k150j011M998
20336E303R040N470J906r956L71O54J444k426p079o127r237K917J3707M179j535
20321H631J399j0693q115R43j284K639J1207J110k173J1K464M02n458j2065n12
20306a1494O983p468K651K3849Q194p964m856o283l964p2L998M243K431k893N709
$$ plain form
20291 13064 17756 19766 12279 6290 2822 4559 12985 13254 18654 2081 5211 -2723 -3425 -6693 -11753
20276 -11753 -4558 4499 11342 6683 525 -8096 -8285 -11061 -8493 3087 8240 12107 13280 13666 9388
20261 9388 5510 -2870 496 -151 -9948 -10476 -6702 1427 18412 13806 4142 -1928 -4341 -1350 -1899
20246 -1899 1293 -14339 -8928 13987 26810 22357 14126 19396 26909 29171 16970 9831 17065 6488
20232 6488 2913 11275 18515 17046 17924 12761 5101 2267 5375 6746 7488 2631 2706 -5679 -9449 -10262
20216 -10262 -15551 -12933 -7987 3973 5222 6449 7971 10636 13755 15189 5046 -8420 -15089 -9850
20202 -9850 1685 2967 7205 421 -13706 -7674 4876 7573 -10537 -18824 -13231 -14441 -2355
20189 -2355 4839 -1505 -15674 -12024 -3894 -1286 -3270 -49 -10245 -7573 92 4963 10645 19746
$$ packed form
20291A3064M692K010p487n989l468J737Q426K69N400j6573L130p934p02l268n060
20276a1753P195R057O843m659o158q621j89k776K568J1580N153L867J173L86m278
20261I388l878q380L366o47r797n28L774Q129J6985m606r664o070k413K991n49
20246a899L192j5632N411K2915J2823m453q231N270P513K262j2201p139P234j0577
20232F488l575Q362P240j469Q78n163p660k834L108J371P42m857P5q385l770q13
20216a0262n289K618M946J1960J249J227J522K665L119J434j0143j3466o669N239
20202i850J1535J282M238o784j4127O032J2550K697j8110q287N593j210J2086
20189b355P194o344j4169L650Q130K608j984L221j0196K672P665M871N682R101
$$ plain form
20175 19746 25848 27078 18568 16574 7883 13585 25212 23831 7726 -4859 -6538 -1297 2557 -3531
20161 -3531 -9413 -13884 -10587 11884 18540 -2428 -20182 -14160 -7672 566 21063 18928 18887 18590
20147 18590 22094 10626 -586 -4700 -2188 -1435 2826 -1669 978 14274 8474 10337 1262 -3109
20133 -3109 -1868 7332 6807 6159 5182 8711 8357 -1149 -3967 -9025 -9855 -17028 -9131 413 2525 -463
20117 -463 -6143 4270 11653 21660 21103 9312 -11120 -13290 -6886 8121 11817 5074 1279 -7406
20103 -7406 2265 -8042 -10000 -15646 -25317 -23090 -16344 -5207 -3351 -8699 -612 2706 6600 6688 2744
20088 2744 2700 8678 15421 13648 8680 -7868 -22221 -17038 4701 11704 4618 9408 9294 -583 1788
20073 1788 9280 16679 6137 5528 18588 27701 18139 10409 14688 16129 12767 6203 8401 -4959
$$ packed form
20175A9746O102J230q510j994q691N702J1627j381j6105j2585j679N241L854o088
20161c531n882m471L297K2471O656k0968j7754O022O488Q238K0497k135m1k97
20147A8590L504j1468j1212m114K512P53M261m495K647J3296n800J863r075m371
20133c109J241R200n25o48r77L529l54r506k818n058q30p173P897R544K112k988
20117d63n680J0413P383J0007n57j1791k0432k170O404J5007L696o743l795q685
20103g406R671j0307j958n646r671K227O746J1137J856n348Q087L318L894Q8l944
20088B744m4N978O743j773m968j6548j4353N183K1739P003p086M790j14r877K371
20073A788P492P399j0542o09J3060R113r562p730M279J441l362o564K198j3360
$$ plain form
20059 -4959 -7188 -2274 4251 9776 3918 12253 14006 1620 -8400 -9341 -15939 -11490 -11608 -7987 6201
20044 6201 15789 -1306 -18038 -17548 -3214 -3750 -8271 -7703 -5729 -5465 1199 -5033 -18372 -20200 -3694
20029 -3694 -3197 -13248 -5685 7988 12830 19283 13943 6092 4161 773 2070 1904 7439 10678 9934
20014 9934 7154 14061 24430 20523 17359 13285 1728 -12802 -17811 -18467 -14732 -16415 -22797 -19738
20000 -19738 -9935 4531 11341 7749 7210 10304 11935 10348 11524 11341 10946 -1806 -3956 1997 7820
19985 7820 5238 12125 15320 11847 9269 11213 5934 3650 244 -2099 4193 1998 4535 7883 5025
19970 5025 6812 14904 20368 22504 13168 16218 19075 15178 24865 19733 16719 10910 7276 10118 13300
19955 13300 6011 -1302 -7255 -11574 -1568 7219 12522 13304 20147 9230 1321 -1482 -3902 2069
$$ packed form
20059d959k229M914O525N525n858Q335J753j2386j0020r41o598M449j18L621J4188
20044F201R588j7095j6732M90J4334n36m521N68J974K64O664o232j3339j828J6506
20029c694M97j0051P563J3673M842O453n340p851j931l388J297j66N535L239p44
20014I934k780O907J0369l907l164m074j1557j4530n009o56L735j683o382L059
20000a9738R803J4466O810l592n39L094J631j587J176j83l95j2752k150N953N823
19985G820k582O887L195l473k578J944n279k284l406k343O292k195K537L348k858
19970E025J787Q092N464K136r336L050K857l897R687n132l014n809l634K842L182
19955A3300p289p313n953m319J0006Q787N303P82O843j0917p909k803k420N971
$$ plain form
19941 2069 15834 19167 19377 -199 -566 -800 343 -5947 -5596 4384 10661 7436 13206 11494 2259
19926 2259 9506 25191 39491 39151 19460 8578 3330 5219 -1878 -10437 -8610 3432 11215 20687
19912 20687 21111 21813 8469 -761 3962 8956 13656 17309 15106 14109 23981 27587 18856 14534 12226
19897 12226 14763 14042 12465 12394 12061 19042 13843 17735 24796 28823 12094 11113 19376 13376 15331
19882 15331 12573 22770 21506 27369 29467 21580 13462 17145 18515 14670 19533 17324 10683 5492
19868 5492 -2083 -8840 -5951 3883 1598 1945 -4901 -4043 -459 4827 2567 -4912 -7081 3388 5330
19853 5330 -3089 8702 10533 -1067 4618 4127 6514 8780 10829 3546 -3509 -7358 -7524 2818
19839 2818 9608 1199 -2947 1555 11773 12971 2205 478 5264 -317 -2557 -14409 -16865 -14686
$$ packed form
19941B069J3765L333K10j9576l67k34J143o290L51R980O277l225N770j712r235
19926B259P247J5685J4300l40j9691j0882n248J889p097q559J827J2042P783R472
19912B0687M24P02j3344r230M723M994M700L653k203r97R872L606q731m322k308
19897A2226K537p21j577p1l33O981n199L892P061M027j6729r81Q263o000J955
19882A5331k758J0197j264N863K098p887q118L683J370l845M863k209o641n191
19868E492p575o757K889R834k285L47o846Q58L584N286k260p479k169J0469J942
19853E330q419J1791J831j1600N685m91K387K266K049p283p055l849j66J0342
19839B818O790q409m146M502J0218J198j0766j727M786n581k240j1852k456K179
$$ plain form
19825 -14686 -5154 14770 20877 3303 -16644 -19330 -19193 -14976 2483 10480 6689 2118 -3917 -11249
19811 -11249 -13704 -14681 -13155 -4519 -3446 12282 16860 14804 134 -2178 -4910 -5323 -3229 -1147
19797 -1147 -712 -2494 -5522 -2845 -832 -1770 2769 10318 12802 12809 6034 12554 14702 2380 2424 6342
19781 6342 7743 3264 7145 2859 2610 -7290 -10043 -8298 -14767 -13106 3531 10821 15857 7754 -2745
19766 -2745 7727 6377 5465 -2029 -15860 -11105 8558 5721 5512 -962 358 10367 10536 14207
19752 14207 10420 7358 17852 14103 222 -4505 2402 9427 1745 -2083 429 8941 8834 8661
19738 8661 15094 13803 17139 22300 19850 6826 10295 7694 1471 4820 10648 8721 7248 9207
19724 9207 10481 -2167 1003 8134 16911 30758 23976 16439 7906 746 -1911 3554 19023 14590
$$ packed form
19825a4686R532J9924O107j7574j9947k686J37M217J7459P997l791m571o035p332
19811a1249k455r77J526Q636J073J5728M578k056j4670k312k732m13K094K082
19797a147M35j782l028K677K013r38M539P549K484Po775O520K148j2322M4L918
19781F342J401m479L881m286k49r900k753J745o469J661J6637P290N036q103j0499
19766b745J0472j350r12p494j3831M755J9663k837k09o474J320J0009J69L671
19752A4207l787l062J0494l749j3881m727O907P025p682l828K512Q512j07j73
19738H661O433j291L336N161k450j3024L469k601o223L349N828j927j473J959
19724I207J274j2648L170P131Q777J3847o782p537q533p160k657N465J5469m433
$$ plain form
19710 14590 12163 917 -15321 -27004 -13206 9695 14223 11671 15097 17805 24569 24706 22147
19697 22147 20977 21514 24137 16660 9363 13399 19417 22031 31636 26858 24031 18276 18595 17648 11574
19682 11574 5689 14735 17073 15394 -893 -9574 -1008 4450 2272 -14357 -17381 -9719 -1624 -1514
19668 -1514 8698 8884 5556 -620 3460 6814 11797 13523 10977 10950 4609 50 5081 17202 12009
19653 12009 8469 -3850 -10579 -1442 -10385 42 7248 21710 21223 19842 14374 20068 10880 2189
19639 2189 10559 14439 23915 19021 18179 21637 18738 13348 23049 14431 16594 17586 9452 9788 15470
19624 15470 18580 18370 22146 23078 7806 2392 20496 36816 35572 35942 44021 38967 27999 25426
19610 25426 14004 4158 11070 12600 12732 6449 4755 20269 19497 14593 11026 3216 866 -4025
$$ packed form
19710A4590k427j1246j6238j1683J3798K2901M528k552L426K708O764J37k559
19697B2147j170N37K623p477p297M036O018K614R605m778k827n755L19r47o074
19682A1574n885R046K338j679j6287q681Q566N458k178j6629l024P662Q095J10
19668a514J0212J86l328o176M080L354M983J726k546k7o341m559N031J2121n193
19653A2009l540j2319o729R137q943J0427P206J4462m87j381n468N694r188q691
19639B189Q370L880R476m894q42L458k899n390R701q618K163R92q134L36N682
19624A5470L110k10L776R32j5272n414J8104J6320j244L70Q079n054j0968k573
19610B5426j1422r846O912J530J32o283j694J5514p72m904l567p810k350m891
$$ plain form
19596 -4025 -3114 7126 -3230 -7148 14685 24983 35538 26107 30154 25777 24399 33598 23418
19583 23418 12482 10694 19175 22847 16234 6111 -4611 3688 4668 -1864 259 1443 4645 6264
19569 6264 11245 11663 9647 3671 11295 10891 16448 20708 18693 29960 24184 12829 5193 1474 5642
19554 5642 12611 9397 1896 -7279 -1149 -2993 6546 12186 -1442 10146 6432 4349 18905 29170
19540 29170 26290 18687 14465 6054 -6901 -7241 4974 6696 3424 17583 25207 28375 24781 12737
19526 12737 6242 2522 865 3080 7622 18550 28482 22709 10473 7414 9390 13503 12556 4291
19512 4291 -2077 -12938 -9847 1810 13861 9023 -3652 -15083 -8034 2983 8536 8974 -2703
19499 -2703 -571 12355 20742 26832 24754 14749 14480 8416 19809 11136 2224 8735 10763 13124
$$ packed form
19596d025R11J0240j0356l918K1833J0298J0555r431M047m377j378R199j0180
19583B3418j0936j788Q481L672o613j0123j0722Q299R80o532K123J184L202J619
19569F264M981M18k016n976P624m04N557M260k015J1267n776j1355p636l719M168
19554E642O969l214p501r175O130j844R539N640j3628J1588l714k083J4556J0265
19540B9170k880p603m222q411j2955l40J2215J722l272J4159P624L168l594j2044
19526A2737o495l720j657K215M542J0928R932n773j2236l059J976M113r47q265
19512D291o368j0861L091J1657J2051m838j2675j1431P049J1017N553M38j1677
19499b703K132J2926Q387O090k078j0005k69o064J1393q673q912O511K028K361
$$ plain form
19485 13124 21530 26643 28294 34195 24216 10428 8277 11305 11543 10150 18554 20070 23126 23991 11128
19470 11128 8567 19607 18888 19868 21883 22666 18735 17415 2982 1904 523 6089 6903 8635 9967
19455 9967 -187 8654 30454 33904 30882 26560 23436 27592 18224 15788 15912 6784 -1692 4510
19441 4510 15784 27453 23325 17489 10538 3369 11583 6192 -7741 -7754 -6059 2182 8728 15062
19427 15062 10911 13501 18742 15149 3728 -4983 -9181 -7455 6730 17037 22027 18665 10248 9134
19413 9134 28 4016 13294 21319 26008 21474 16288 429 473 6533 20222 22100 24079 29591 27608
19398 27608 9439 5600 7812 11862 25699 27903 20725 17088 19708 12724 12918 16059 23443 22399
19384 22399 15539 6637 6840 10791 1376 12976 22550 17685 7064 14353 26238 24426 32228 38441
$$ packed form
19485A3124Q406N113J651N901r979j3788k151L028K38j393Q404J516L056Q65j2863
19470A1128k561J1040p19R80K015P83l931j320j4433j078j381N566Q14J732J332
19455I967j0154Q841K1800L450l022m322l124M156r368k436J24r128q476O202
19441D510J1274J1669m128n836o951p169Q214n391j3933j3J695Q241O546O334
19427A5062m151K590N241l593j1421q711m198J726J4185J0307M990l362q417j114
19413I134r106L988R278Q025M689m534n186j5859M4O060J3689J878J979N512j983
19398B7608j8169l839K212M050J3837K204p178l637K620o984J94L141P384j044
19384B2399o860q902K03L951r415J1600R574m865j0621P289J1885j812P802O213
$$ plain form
19370 38441 21895 15360 22975 28135 23658 12634 8229 9232 694 2348 -389 7722 11866 12541
19356 12541 24479 24474 16666 18996 21745 19881 31597 40908 33903 28249 33773 56716 64801 59524
19342 59524 58944 67199 66489 64454 67854 70742 70511 69680 71439 73115 75793 79900 87573 93110 95202
19327 95202 124422 136142 144275 162643 187352 207362 217410 240826 256605 273983 296098 309201
19315 309201 311540 318220 321368 312423 297556 279761 265840 266358 248626 224464 205360 181551 160004
19302 160004 141403 118935 106193 106867 107682 94743 76353 65477 68460 57124 58493 50492 37420
19289 37420 30484 37004 48885 44207 32599 34110 27008 23036 17884 15099 28404 32537 35143 33929
19275 33929 39202 41219 44969 29401 15661 17201 10577 8669 13148 19998 16510 23447 30645 31393
$$ packed form
19370C8441j6546o535P615N160m477j1024m405J003q538J654k737Q111M144O75
19356A2541J1938np808K330K749j864J1716R311p005n654N524K2943Q085n277
19342E9524n80Q255p10k035L400K888k31q31J759J676K678M107P673N537K092
19327I5202K9220J1720Q133J8368K4709K0010J0048K3416J5779J7378K2115J3103
19315C09201K339O680L148q945j4867j7795j3921N18j7732k4162j9104k3809k1547
19302A60004j8601k2468j2742O74Q15j2939j8390j0876K983j1336J369q001j3072
19289C7420o936O520J1881m678j1608J511p102l972n152k785J3305M133K606j214
19275C3929N273K017L750j5568j3740J540o624j908M479O850l488O937P198P48
$$ plain form
19261 31393 35954 41633 23128 17979 14757 6724 12027 13686 17459 15355 28237 28609 17152 14675
19247 14675 16267 22624 26481 18823 25957 32502 38973 39315 35100 31980 25723 16443 26590 32259
19233 32259 46862 40290 29775 33702 28713 28448 31026 29716 27716 24682 22630 19824 17542 17616 24068
19218 24068 24588 24704 19341 28962 36830 24889 9758 10095 12712 10165 13510 9728 14002 27670
19204 27670 32354 26823 25977 19629 24445 18225 16655 12236 13974 20882 24009 22534 19262 12995 16070
19189 16070 26553 22439 30321 29474 32548 32476 23538 34091 35725 21083 11709 8025 14141 9722
19175 9722 6366 16286 23034 26187 17497 25013 26228 21372 14849 16167 21628 22479 19007 7663 10008
19160 10008 14185 14941 8923 152 7270 8691 17628 33740 32859 32131 39396 33646 30640 25111 13842
$$ packed form
19261C1393M561N679j8505n149l222q033N303J659L773k104J2882L72j1457k477
19247A4675J592O357L857p658P134O545O471L42m215l120o257r280J0147N669
19233C2259J4603o572j0515L927m989k65K578j310k000l034k052k806k282P4O452
19218B4068N20J16n363R621P868j1941j5131L37K617k547L345l782M274J3668
19204B7670M684n531q46o348M816o220j570m419J738O908L127j475l272o267L075
19189A6070J0483m114P882q47L074p2q938J0553J634j4642r374l684O116m419
19175I722l356R920O748L153q690P516J215m856o523J318N461Q51l472j1344K345
19160A0008M177P56o018q771P118J421Q937J6112q81p28P265n750l006n529j1269
$$ plain form
19145 13842 22209 18727 7356 4954 25839 38145 37487 33059 30589 22675 21582 32039 32569 26560
19131 26560 25806 28019 36578 34013 34241 38161 23257 8781 -1788 5869 22619 29746 25287 16144
19117 16144 15205 22119 23569 11843 -1590 7629 10979 19809 24162 7342 -8488 -715 8210 7667
19103 7667 20291 18945 28399 31275 49195 47896 37003 29466 36255 43463 41024 44681 40045 48427
19089 48427 59825 49656 48854 50982 42391 34470 33320 31296 30130 38803 56820 58060 58253 63872
19075 63872 54074 47825 54390 60170 54159 51950 47107 43944 37560 34939 28752 33509 43457 55883
19061 55883 47124 42186 47767 38060 32317 37830 37218 34673 42174 41118 33191 19668 20196 31378
19047 31378 32626 28775 24369 23263 23777 24028 16450 13260 19036 22810 19989 28240 36358 43496 46798
$$ packed form
19145A3842Q367l482j1371k402K0885J2306o58m428k470p914j093J0457N30o009
19131B6560p54K213Q559k565K28L920j4904j4476j0569P657J6750P127m459r143
19117A6144r39O914J450j1726j3433R219L350Q830M353j6820j5830P773Q925n43
19103G667J2624j346R454K876J7920j299j0893p537O789P208k439L657m636Q382
19089D8427J1398j0169q02K128q591p921j150k024j166Q673J8017J240J93N619
19075F3872r798o249O565N780o011k209m843l163o384k621o187M757R948J2426
19061E5883q759m938N581r707n743N513o12k545P501j056p927j3523N28J1182
19047C1378J248l851m406j106N14K51p578l190N776L774k821Q251Q118P138L302
$$ plain form
19032 46798 44909 25850 22001 27227 25178 31884 13699 7647 10410 9545 21052 20703 20357 20036 16253
19017 16253 28153 19452 11870 8201 11123 19117 26391 25566 20847 12582 13110 7791 8104 16913 20056
19002 20056 18187 17371 22065 35793 41452 49040 50152 43727 41630 51822 58147 59033 39606 26039
18988 26039 22953 26399 33575 30121 29191 38094 31446 19861 18744 18398 21876 30920 30813 24205 19610
18973 19610 16359 26665 22310 23841 26423 21352 16148 8284 6834 10116 14631 27573 32923 34167
18959 34167 40961 29412 29848 26012 15667 18645 32213 37795 32917 25184 11064 25362 24926 29338
18945 29338 32712 30622 28083 29279 24480 24670 23868 26670 33100 44169 42484 46449 48301 52391 48127
18930 48127 41946 44441 56517 53171 47543 50315 50211 40244 31446 38207 40970 46115 36890 29725
$$ packed form
19032D6798j889j9059l849N226k049O706j8185o052K763q65J1507l49l46l21l783
19017A6253J1900q701p582l669K922P994P274q25m719q265N28n319L13Q809L143
19002B0056j869q16M694J3728N659P588J112o425k097J0192O325Q86j9427j3567
18988B6039l086L446P176l454r30Q903o648j1585j117l46L478R044j07o608m595
18973A9610l251J0306m355J531K582n071n204p864j450L282M515J2942N350J244
18959C4167O794j1549M36l836j0345K978J3568N582m878p733j4120J4298m36M412
18945B9338L374k090k539J196m799J90q02K802O430J1069j685L965J852M090m264
18930D8127o181K495J2076l346n628K772j04r967q798O761K763N145r225p165
$$ plain form
18916 29725 41413 43169 39198 35343 45754 52003 45147 39790 50996 54305 68727 87423 110453
18903 110453 143242 161517 174003 168377 150145 137013 127340 112094 92896 85573 79535 91902
18891 91902 114869 130399 147507 187358 245838 282516 305159 309753 279056 253490 236631 220566
18879 220566 223456 235305 232303 196513 156398 126688 107294 82257 80477 97023 108668 111686
18867 111686 130350 150405 200482 253343 279276 301231 294770 250937 196975 147553 115515 96306
18855 96306 95726 91485 84520 69698 69938 71454 73749 66684 61603 57613 61811 67536 60959 44389
18841 44389 44375 47975 45288 54777 55928 38610 42400 45851 47704 49178 43185 36741 44166 43547 38863
18826 38863 42266 43886 56367 77388 80472 75809 69557 60999 41886 27145 32483 35402 38837
$$ packed form
18916B9725J1688J756l971l855J0411O249o856n357J1206L309J4422J8696K3030
18903A10453L2789J8275J2486n626j8232j3132r673j5246j9198p323o038J2367
18891I1902K2967J5530J7108L9851N8480L6678K2643M594l0697k5566j6859j6065
18879B20566K890J1849l002l5790m0115k9710j9394k5037j780J6546J1645L018
18867A11686J8664K0055N0077N2861K5933K1955o461m3833n3962m9422l2038j9209
18855I6306n80m241o965j4822K40J516K295p065n081l990M198N725o577j6570
18841D4389j4L600k687R489J151j7318L790L451J853J474n993o444P425o19m684
18826C8863L403J620J2481K1021L084m663o252q558j9113j4741N338K919L435
$$ plain form
18813 38837 31239 25273 35644 31912 42510 50932 42848 38876 33373 26744 27263 30820 32978 27185
18799 27185 35678 48487 39519 32870 37972 45051 53426 48763 44242 40997 33478 25569 32139 44913
18785 44913 42472 38215 31446 37159 48552 43882 46566 59367 63622 70651 71454 70664 87100 102111
18771 102111 100997 92097 110354 135831 142919 128899 118042 108006 94815 80562 83739 87815
18759 87815 79499 82325 73936 82220 81819 70366 69745 79616 99070 116721 138382 148931 148365 138039
18745 138039 123719 117219 126853 132514 130524 116829 117848 123280 146967 174218 175108 159023 138229
18732 138229 120433 115413 117888 108314 106300 118490 141678 136794 136109 151070 147814 131235 134127
18719 134127 139728 145123 154228 190522 249591 291148 279479 271116 266259 241655 221944 228177 259613
$$ packed form
18813C8837p598n966J0371l732J0598Q422q084l972n503o629N19L557K158n793
18799B7185Q493J2809q968o649N102P079Q375m663m521l245p519p909O570J2774
18785D4913k441m257o769N713J1393m670K684J2801M255P029Q03p90J6436J5011
18771A02111j114q900J8257K5477P088j4020j0857j0036j3191j4253L177M076
18759H7815q316K826q389Q284m01j1453o21R871J9454J7651K1661J0549n66j0326
18745A38039j4320o500R634N661j990j3695J019N432K3687K7251Q90j6085k0794
18732A38229j7796n020K475r574k014J2190K3188m884o85J4961l256j6579K892
18719A34127N601N395R105L6294N9069M1557j1669q363m857k4604j9711O233L1436
$$ plain form
18706 259613 304761 374381 501055 707556 1051822 1453930 1490839 1286857 1073092 792577
18696 792577 548568 407140 323459 263353 228361 210396 198629 193801 197450 208793 220760
18685 220760 236567 267379 312258 382826 506233 707856 1071737 1505401 1534691 1327911
18675 1327911 1095790 809508 549102 391774 305907 252539 211320 182134 160263 143729
18665 143729 136644 129695 123317 111618 109119 100317 94282 83274 78867 68416 58073 65553 71589
18652 71589 63981 64556 54205 49063 62008 71363 83915 90413 80651 63785 54656 57764 60919 60385
18638 60385 61250 68560 72461 78338 83509 94617 102506 100649 109879 99395 95988 108242 111401 105211
18624 105211 103932 118478 145469 187496 231718 231968 217484 194346 173841 151028 140048 147425
$$ packed form
18706B59613M5148O9620J26674K06501L44266M02108L6909k03982k13765k80515
18696G92577k44009j41428q3681o0106l4992j7965j1767m828L649J1343J1967
18685B20760J5807L0812M4879P0568J23407K01623L63881M33664K9290k06780
18675A327911k32121k86282k60406j57328q5867n3368m1219k9186k1871j6534
18665A43729p085o949o378j1699k499q802o035j1008m407j0451j0343P480O036
18652G1589p608N75j0351n142J2945R355J2552O498r762j6866r129L108L155n34
18638F0385Q65P310L901N877N171J1108P889j857R230j0484l407J2254L159o190
18624A05211j279J4546K6991M2027M4222K50j4484k3138k0505k2813j0980P377
$$ plain form
18612 147425 165241 173527 161894 137377 121841 109516 101475 106541 102855 102271 121914 142619 176903
18599 176903 194133 210851 219102 197386 179372 146600 111260 92429 93808 81089 83026 95342
18587 95342 92234 88441 84661 77753 76979 81642 76379 71061 80746 103630 147835 157131 155459 175060
18573 175060 158578 131846 117774 98044 91504 86744 74626 83317 93585 82711 85448 89282
18561 89282 89987 87370 78007 81689 77086 64541 53497 57026 70706 77275 79924 92490 109225
18548 109225 105164 106773 105375 97066 90966 96830 94362 98688 96696 83952 80876 92943 99825 115406
18534 115406 107720 96575 85803 82552 85117 80604 88373 83808 89720 104735 103226 101571 106152
18521 106152 104854 96004 85044 75414 69624 65273 68558 72643 88389 91714 94019 86038 84439 89137
$$ packed form
18612A47425J7816Q286j1633k4517j5536j2325q041N066l686n84J9643K0705L4284
18599A76903J7230J6718Q251k1716j8014l2772l5340j8831J379j2719J937J2316
18587I5342l108l793l780o908p74M663n263n318R685K2884M4205R296j672J9601
18573A75060j6482k6732j4072j9730o540m760j2118Q691J0268j0874K737L834
18561H9282P05k617r363L682m603j2545j1044L529J3680O569K649J2566J6735
18548A09225m061J609j398q309o100N864k468M326j992j2744l076J2067O882J5581
18534A15406p686j1145j0772l251K565m513P769m565N912J5015j509j655M581
18521A06152j298q850j0960r630n790m351L285M085J5746L325K305p981j599M698
$$ plain form
18507 89137 83277 73738 73426 66553 72775 78674 83843 81184 80385 72079 71947 74887 68710 71928 77825
18492 77825 75955 84558 88697 84817 78641 79921 92597 104925 92838 87939 90459 79246 72497
18479 72497 79379 83749 83258 91723 105452 101511 102962 92725 81611 93988 95835 91241 94285 88318
18465 88318 79179 72712 73217 68209 65873 81707 95365 99928 96906 84085 86475 89178 92973 95344
18451 95344 98156 87769 83410 89129 102081 115999 112609 102189 98621 95335 89607 86382 88892
18438 88892 76869 80316 83330 89546 86807 71428 66463 79853 81501 85652 77819 78215 99690 107431
18424 107431 102456 96142 96940 100078 100151 94429 95927 103616 99364 93309 85061 76239 67575 76617 81033
18409 81033 84056 88191 83369 69745 64399 65894 58079 53685 44519 26455 11153 419 -30185
$$ packed form
18507H9137n860r539l12o873O222N899N169k659p99q306j32K940o177L218N897
18492G7825j870Q603M139l880o176J280J2676J2328j2087m899K520j1213o749
18479G2497O882M370m91Q465J3729l941J451j0237j1114J2377J847m594L044n967
18465H8318r139o467N05n008k336J5834J3658M563l022j2821K390K703L795K371
18451I5344K812j0387m359N719J2952J3918l390j0420l568l286n728l225K510
18438H8892j2023L447L014O216k739j5379m965J3390J648M151p833L96K1475P741
18424A07431m975o314P98L138P3n722J498P689m252o055q248q822q664R042M416
18409H1033L023M135m822j3624n346J495p815m394r166j8064j5302j0734l0604
$$ plain form
18396 -30185 -51479 -17547 43657 76124 105469 130633 141292 141781 136816 139605 133308 116318 111316
18383 111316 129625 138211 121953 114991 104027 82302 62216 33184 11859 -939 -17861 24498
18371 24498 96170 132448 157531 188048 196688 200978 206086 202626 189138 170926 167928 172858 161285
18358 161285 156874 159186 168141 175524 186557 185562 203880 218465 225894 235918 256422 267050 274026
18345 274026 307697 315514 319436 311009 277989 251970 225889 217035 213875 206906 186687 166341 160442
18332 160442 155357 153917 159386 175818 181207 201577 229333 253214 275092 290345 320883 327039
18320 327039 330827 326507 305650 279963 260105 240729 226945 210413 193183 169757 153145 161454
18308 161454 174920 177167 191388 196754 197835 187178 190262 185402 189058 200032 195198 179977 173457
$$ packed form
18396c0185k1294L3932O1204L2467K9345K5164J0659M89m965K789o297j6990n002
18383A11316J8309Q586j6258o962j0964k1725k0086k9032k1325j2798j6922M2359
18371B4498P1672L6278K5083L0517Q640M290N108l460j3488j8212k998M930j1573
18358A61285m411K312Q955P383J1033r95J8318J4585P429J0024K0504J0628O976
18345B74026L3671P817L922q427l3020k6019k6081q854l160o969k0219k0346n899
18332A60442n085j440N469J6432N389K0370K7756K3881K1878J5253L0538O156
18320C27039L788m320k0857k5687j9858j9376j3784j6532j7230k3426j6612Q309
18308A61454J3466K247J4221N366J081j0657L084m860L656J0974m834j5221o520
$$ plain form
18295 173457 172412 197449 210482 207338 207476 192943 177210 179752 178553 166834 164708 174591 175203
18282 175203 182092 178651 192983 204002 217860 251917 258404 234479 207898 166335 142279 144685
18270 144685 160223 169900 170298 191359 208269 221069 224082 213287 208071 211455 230259 241455 231944
18257 231944 212697 216046 229228 250418 257817 256210 225371 192831 185078 179060 193847 240645
18245 240645 311392 420277 494228 513051 516943 498731 467527 449990 413238 382082 347066
18234 347066 328960 317353 306744 300535 295526 284636 284954 301167 324866 333363 350153 394106
18222 394106 464077 568977 613041 572412 497876 408305 339878 324573 328059 347999 369684
18211 369684 393515 411769 429751 435825 430760 426924 420587 420640 434838 446814 447886 456283 465041
$$ packed form
18295A73457j045K5037J3033l144J38j4533j5733K542j199j1719k126R883O12
18282A75203O889l441J4332J1019J3858L4057O487k3925k6581m1563k4056K406
18270A44685J5538R677L98K1061J6910J2800L013j0795n216L384J8804J1196r511
18257B31944j9247L349J3182K1190P399j607l0839l2540p753o018J4787M6798
18245B40645P0747J08885P3951J8823L892j8212l1204j7537l6752l1156l5016
18234C47066j8106j1607j0609o209n009j0890L18J6213K3699Q497J6790M3953
18222C94106O9971J04900M4064m0629p4536q9571o8427j5305L486J9940K1685
18211C69684K3831J8254J7982O074n065l836o337N3J4198J1976J072Q397Q758
$$ plain form
18198 465041 487412 502680 465268 394728 338409 317113 336536 390189 465804 555027 658410
18187 658410 825342 1097616 1429474 1502670 1392336 1249406 1044585 875378 791846 768354
18177 768354 794129 815036 833041 854674 838186 814628 797096 801408 846580 919213 1009561 1130818
18165 1130818 1295536 1559895 2004697 2531959 2587924 2344833 2081412 1729054 1413739 1238571
18155 1238571 1188146 1177039 1195545 1209371 1203431 1184841 1159440 1146930 1167949 1200633 1235367
18144 1235367 1274978 1313429 1368853 1434435 1470245 1505801 1557886 1627320 1685277 1760979 1856213
18133 1856213 1968416 2092552 2237788 2396253 2544042 2753467 3095789 3623388 4242903
18124 4242903 4434320 4396355 4381435 4321732 4356806 4636866 5038861 5440096 5960368 6623109
$$ packed form
18198D65041K2371J5268l7412p0540n6319k1296J9423N3653P5615Q9223J03383
18187F58410J66932K72274L31858P3196j10334j42930k04821j69207q3532k3492
18177G68354K5775K0907J8005K1633j6488k3558j7532M312M5172P2633R0348J21257
18165A130818J64718K64359M44802N27262N5965k43091k63421l52358l15315j75168
18155A238571n0425j1107J8506J3826n940j8590k5401j2510K1019L2684L4734
18144A235367L9611L8451N5424O5582L5810L5556N2085O9434N7957P5702R5234
18133A856213J12203J24136J45236J58465J47789K09425L42322N27599O19515
18124D242903J91417l7965j4920n9703L5074K80060M01995M01235N20272O62741
$$ plain form
18114 6623109 7577592 9060769 11481052 15662053 21853128 24935378 23429552 21817829
18106 21817829 19657894 17739257 17579017 18681324 20522952 22863291 26267511 31609092
18098 31609092 39494193 50811160 68544144 99142062 154442049 233574628 257638239
18091 257638239 223254756 188285258 141651792 94193141 63902710 47310591 37877339
18084 37877339 32199648 28650516 26692594 25971630 26102505 27068733 28735009 31712842
18076 31712842 36961498 45059644 57085130 76358910 109932357 170756623 256431081
18069 256431081 279852759 241399669 202454901 150744569 98619195 65200652 46552855
18062 46552855 35633126 28829767 23981230 20257455 17474575 15287404 13548952 11776413
$$ packed form
18114F623109R54483J483177K420283M181001O191075L082250j505826j611723
18106B1817829k159935j918637j60240J102307J841628K340339L404220N341581
18098C1609092P885101J1316967J7732984L0597918N5299987P9132579K4063611
18091B57638239l4383483l4969498m6633466m7458651l0290431j6592119r433252
18084C7877339n677691l549132j957922p20964J30875R66228J666276K977833
18076C1712842N248656Q098146J2025486J9273780L3573447O0824266Q5674458
18069B56431081K3421678l8453090l8944768n1710332n2125374l3418543j8647797
18062D6552855j0919729o803359m848537l723775k782880k187171j738452j772539
$$ plain form
18054 11776413 10111280 8723866 7502996 6596599 5983189 5515799 5115227 4684209 4200928
18045 4200928 3750310 3342533 3039578 2873186 2782199 2814913 2973264 3277088 3327967 3020239
18035 3020239 2706897 2344528 1966130 1688408 1522919 1404723 1330862 1314023 1297910 1261767
18025 1261767 1187415 1082431 987556 933267 894035 874106 850325 815338 795212 781341 764335
18014 764335 752088 719279 660941 583507 518416 487371 489257 499631 531784 549972 545237 536424
18002 536424 529178 534601 525295 512198 487879 483863 486208 492741 493394 489483 458186 426213 410569
17989 410569 388662 349296 320795 331223 368200 411822 420682 409500 388525 353700 328854 325597
17977 325597 337374 351380 352421 358507 373159 389908 405138 424720 464071 505955 556941 542150
$$ packed form
18054A1776413j665133j387414j220870r06397o13410m67390m00572m31018m83281
18045D200928m50618m07777l02955j66392r0987L2714J58351L03824N0879l07728
18035C020239l13342l62369l78398k77722j65489j18196p3861j6839j6113l6143
18025A261767p4352j04984r4875n4289l9232j9929k3781l4987k0126j3871j7006
18014G64335j2247l2809n8338p7434o5091l1045J886J0374L2153J8188m735q813
18002E36424p246N423r306j3097k4319m016K345O533O53l911l1297l1973j5644
17989D10569k1907l9366k8501J0428L6977M3622Q860j1182k0975l4825k4846l257
17977C25597J1777J4006J041O086J4652J6749J5230J9582L9351M1884N0986j4791
$$ plain form
17965 542150 454851 394220 337641 291115 282982 281003 283612 301519 291174 274001 255883 236981
17953 236981 232138 223656 222432 245566 243007 225117 234559 250411 293712 338802 296297 156336
17941 156336 100876 99779 88502 110989 148556 176440 194676 197705 195695 190399 188961 176033
17929 176033 163884 143588 111595 84029 64620 46851 12024 -25573 -50844 -77502 -109104
17918 -109104 -80342 6861 56163 116847 171456 200858 214332 210409 205249 193259 170238 151196
17906 151196 146680 177314 201496 189762 169962 157500 142809 138933 135195 117279 118410 110180
17894 110180 84074 66506 72538 74213 57044 41174 39379 70612 90565 119570 138639 143483
17882 143483 161686 186119 178106 159160 144591 147489 155008 148501 126098 113517 100439 81027
$$ packed form
17965E42150q7299o0631n6579m6526q133j979K609J7907j0345j7173j8118j8902
17953B36981m843q482j224K3134k559j7890R442J5852M3301M5090m2505j39961
17941A56336n5460j097j1277K2487L7567K7884J8236L029k010n296j438j2928
17929A76033j2149k0296l1993k7566j9409j7769l4827l7597k5271k6658l1602
17918a09104K8762Q7203M9302O0684N4609K9402J3474l923n160j1990k3021j9042
17906A51196m516L0634K4182j1734j9800j2462j4691l876l738j7916J131q230
17894A10180k6106j7568O032J675j7169j5870j795L1233J9953K9005J9069M844
17882A43483J8203K4433q013j8946j4569K898P519o507k2403j2581j3078j9412
$$ plain form
17870 81027 61858 57559 47625 35809 13644 37585 80877 106629 135839 158029 157311 164395 174019
17857 174019 178413 184089 170319 167749 171615 169205 138572 119262 123520 130275 137951 147049 144026
17844 144026 142058 148930 162521 191295 204542 229099 265114 270939 277927 268310 247097 216881
17832 216881 208141 198862 186435 174119 163567 151942 137305 124571 112555 107559 111417 129907
17820 129907 143014 155200 177552 195489 217268 254489 261218 269143 261257 235493 208095 198443
17808 198443 204179 211865 193259 190825 180295 146269 124585 112591 91032 84042 84947 93339 101202
17795 101202 104206 100560 94097 90814 112638 164641 196650 210558 229461 238715 221058 206916
17783 206916 190123 181131 168506 146597 128403 124120 127572 129900 135214 136701 132212 127074 137773
$$ packed form
17870H1027j9169m299r934j1816k2165K3941M3292K5752K9210K2190p18P084R624
17857A74019M394N676j3770k570L866k410l0633j9310M258O755P676R098l023
17844A44026j968O872J3591K8774J3247K4557L6015N825O988r617k1213l0216
17832B16881q740r279j2427j2316j0552j1625j4637j2734j2016m996L858J8490
17820A29907J3107J2186K2352J7937K1779L7221O729P925p886k5764k7398r652
17808A98443N736P686j8606k434j0530l4026k1684j1994k1559o990R05Q392P863
17795A01202L004l646o463l283K1824N2003L2009J3908J8903R254j7657j4142
17783B06916j6793q992j2625k1909j8194m283L452K328N314J487m489n138J0699
$$ plain form
17770 137773 165997 190952 213224 251535 255194 251827 268223 263864 245491 222388 208347 208060
17758 208060 201246 196538 196762 186651 181454 185982 184653 183736 171892 169666 192934 203622 205152 193235
17744 193235 166605 134752 130818 136419 152299 182001 247550 351900 439785 458703 459614 429473
17732 429473 402071 375093 346555 320156 306675 290909 276424 250926 225332 224469 230021 228225
17720 228225 233743 250086 264281 286075 320384 389016 493276 531785 483196 394937 307985
17709 307985 235972 209590 222296 232025 248323 270611 300950 332415 353403 350926 366423 369752
17697 369752 362580 344910 334169 332464 327962 346951 371033 370895 329715 264111 199116 156952
17685 156952 149906 179686 231485 264147 297569 329844 353707 380239 369194 373194 384915 381214
$$ packed form
17770A37773K8224K4955K2272L8311L659l367J6396m359j8373k3103j4041k87
17758B08060o814m708K24j0111n197M528j329r17j1844k226K3268J0688J530j1917
17744A93235k6630l1853l934N601J5880K9702O5549J04350Q7885J8918R11l0141
17732D29473k7402k6978k8538k6399j3481j5766j4485k5498k5594q63N552j796
17720B28225N518J6343J4195K1794L4309O8632J04260L8509m8589q8259q6952
17709C07985p2013k6382J2706R729J6298K2288L0339L1465K0988k477J5497L329
17697C69752p172j7670j0741j705m502J8989K4082j38m1180o5604o4995m2164
17685A56952p046K9780N1799L2662L3422L2275K3863K6532j1045M000J1721l701
$$ plain form
17673 381214 381116 377383 387870 412789 453235 484134 506959 528318 538139 515984 501608 522705
17661 522705 548888 569347 606388 636587 646026 633368 635285 654467 672557 692399 713461 712390
17649 712390 729635 773043 830484 889782 941304 977752 985363 974224 963807 972371 999825 1043455
17637 1043455 1081960 1129001 1187676 1250288 1291444 1310524 1340143 1395357 1467251 1533499 1617222
17626 1617222 1733834 1877506 2024196 2192131 2364380 2630510 3075595 3629279 3855929
17617 3855929 3798547 3707982 3567178 3467917 3469449 3601020 3807551 4009463 4217596 4408930
17607 4408930 4695710 5135885 5677897 6331645 7145355 8187782 9340929 10199525 11002795
17598 11002795 12047532 13483769 15508783 17936698 20982904 25327857 31654814 40688070
$$ packed form
17673C81214r8l733J0487K4919M0446L0899K2825K1359R821k2155j4376K1097
17661E22705K6183K0459L7041L0199R439j2658J917J9182J8090J9842K1062j071
17649G12390J7245M3408N7441N9298N1522L6448P611j1139j0417Q564K7454M3630
17637A043455L8505M7041N8675O2612M1156J9080K9619N5214P1894O6248Q3723
17626A617222J16612J43672J46690J67935J72249K66130M45085N53684K26650
17617C855929n7382r0565j40804r9261J532J31571K06531K01912K08133J91334
17607D408930K86780M40175N42012O53748Q13710J042427J153147Q58596Q03270
17598A1002795J044737J436237K025014K427915L046206M344953O326957R033256
$$ plain form
17590 40688070 53315774 72468061 104889718 162594016 245871449 277096232 242831617
17583 242831617 205295090 156710483 105719784 71875794 53145597 42411774 35480513
17576 35480513 30781089 27737442 25902198 25169308 25642526 27253165 30131793 34950996
17568 34950996 42346377 53021232 69825712 99038824 151769965 227493228 253750030
17561 253750030 221264034 186136716 140690755 93499432 62166909 44426903 33917311
17554 33917311 27284133 22873568 19505884 16828341 14788551 13200558 11851989 10438758
17546 10438758 9052447 7827431 6779324 5993359 5429031 4996585 4594570 4131226 3705605
17537 3705605 3318407 3013562 2809394 2690165 2647874 2670465 2842905 3114662 3053123 2755299
$$ packed form
17590D0688070J2627704J9152287L2421657N7704298Q3277433L1224783l4264615
17583B42831617l7536527m8584607n0990699l3843990j8730197j0733823o931261
17576C5480513m699424l043647j835244p32890M73218J610639K878628M819203
17568C4950996P395381J0674855J6804480K9213112N2731141P5723263K6256802
17561B53750030l2485996l5127318m5445961m7191323l1332523j7740006j0509592
17554C3917311o633178m410565l367684k677543k039790j587993j348569j413231
17546A0438758j386311j225016j048107p85965n64328m32446m02015m63344m25621
17537C705605l87198l04845k04168j19229m2291K2591J72440K71757o1539k97824
$$ plain form
17527 2755299 2462004 2094265 1764357 1549223 1402135 1299273 1234129 1192260 1148353 1096456
17517 1096456 1025708 949400 900250 873688 862606 834904 791711 783645 774062 754206 736943 715558
17505 715558 664744 623369 582348 566531 575812 634056 735312 830858 846295 823148 785850
17494 785850 734249 682569 658039 647074 674836 721210 702555 654161 625523 600609 585967
17483 585967 571525 580347 602319 638886 723586 905865 1224666 1710326 2182292 2144242 1880404
17472 1880404 1591176 1236569 948465 803800 737994 740180 790362 807399 779247 763554 766596
17461 766596 790317 833598 833455 804226 848306 876987 896180 1025069 1290737 1569829 1594479
17450 1594479 1472264 1254790 986083 749821 579577 486711 456009 449259 395999 355865
$$ packed form
17527B755299k93295l67739l29908k15134j47088j02862o5144m1869m3907n1897
17517A096456p0748p6308m9150k6562j1082k7702m3193q066r583j9856j7263k1385
17505G15558n0814m1375m1021j5817R281N8244J01256R5546J5437k3147l7298
17494G85850n1601n1680k4530j0965K7762M6374j8655m8394k8638k4914j4642
17483E85967j4442Q822K1972L6567Q4700J82279L18801M85660M71966l8050k63838
17472A880404k89228l54607k88104j44665o5806K186N0182J7037k8152j5693L042
17461G66596K3721M3281j43k9229M4080K8681J9193J28889K65668K79092K4650
17450A594479j22215k17474k68707k36262j70244r2866l0702o750n3260m0134
$$ plain form
17440 355865 337949 321308 319997 332879 291443 158330 88424 71144 76108 96479 136784 190025
17428 190025 211687 208075 202926 201563 201866 188609 175575 159820 146219 123017 101258 88614
17416 88614 77508 73412 102648 116309 62231 46322 78276 91134 111491 153749 193138 221955
17404 221955 210512 175079 134129 121824 109156 105250 126467 144661 133461 109984 101497 101306
17392 101306 106933 108504 101786 95194 96697 91958 87174 99247 111231 123774 133080 114032 88499
17379 88499 71017 41034 20740 24579 28836 41861 55578 55119 56236 63153 70970 74380 61462
17366 61462 50325 39112 29547 30012 29346 35326 38257 40843 46249 48406 44645 24529 11614 14945
17352 14945 18115 17750 19451 23342 31152 42811 50563 31104 4392 10653 21730 17430 3662
$$ packed form
17440C55865j7916j6641j311J2882m1436j33113o9906j7280M964K0371M0305N3241
17428A90025K1662l612n149j363L03j3257j3034j5755j3601k3202k1759j2644
17416H8614j1106m096K9236J3661n4078j5909L1954J2858K0357M2258L9389K8817
17404B21955j1443l5433m0950j2305j2668l906K1217J8194j1200k3477q487j91
17392A01306N627J571o718o592J503m739m784J2073J1984J2543R306j9048k5533
17379H8499j7482k9983k0294L839M257J3025J3717m59J117O917P817L410j2918
17366F1462j1137j1213r565M65o66N980K931K586N406K157l761k0116j2915L331
17352A4945L170l65J701L891P810J1659P752j9459k6712O261J1077m300j3768
$$ plain form
17339 3662 2605 -6799 -5242 -6483 -8485 -11484 -4832 5394 3582 9524 14831 24513 26515 37270
17325 37270 39947 38138 34710 29842 17975 12373 15309 15161 8866 9576 -6468 -16835 -18329 -29001
17311 -29001 -32730 -31260 -38562 -39927 -35018 -11322 -7821 -17672 -19334 -16635 -16101 -10385 -4752 -242
17297 -242 -5316 -15825 -16267 -16766 -11466 -26561 -37942 -40731 -56625 -59115 -59815 -65427 -56668 -20220
17283 -20220 53147 107384 122540 131455 129652 109943 84650 62709 49919 28108 17185 18964
17271 18964 12679 852 14856 18237 8366 1136 -14505 -30536 -26762 -12879 19211 80664 119400
17258 119400 121667 129922 143302 130383 94219 78075 81837 77087 61946 52831 34167 35133 38831
17245 38831 34845 26754 27438 32765 20624 15222 8127 3756 8049 16393 3988 2219 11957 22254
$$ packed form
17339C662j057r404J557j241k002k999O652J0226j812N942N307R682K002J0755
17325C7270K677j809l428m868j1867n602K936j48o295P10j6044j0367j494j0672
17311b9001l729J470p302j365M909K3696L501r851j662K699N34N716N633M510
17297b42n074j0509m42m99N300j5095j1381k789j5894k490p00n612Q759L6448
17283b0220P3367N4237J5156Q915j803j9709k5293k1941j2790k1811j0923J779
17271A8964o285j1827J4004L381r871p230j5641j6031L774J3883L2090O1453L8736
17258A19400K267Q255J3380j2919l6164j6144L762m750j5141r115j8664R66L698
17245C8831l986q091O84N327j2141n402p095m371M293Q344j2405j769R738J0297
$$ plain form
17231 22254 26454 13564 8350 18273 22080 38409 53772 55663 37303 24072 15599 -1880 -2331
17218 -2331 3238 1067 3460 10602 8613 10090 11816 4270 -12253 -21903 -20409 -9408 4425 14805
17204 14805 4380 -2626 -352 -2589 -6507 -2658 -9564 -10180 3441 15048 30846 25122 2858
17191 2858 -14534 2307 14390 12486 12910 16257 11593 552 -6502 -716 11525 12211 -2284 3535
17177 3535 4674 5637 16 -1330 2497 -4816 -7004 -12077 -18841 -16068 2145 5481 2186 1557 2451
17162 2451 7624 13860 11101 10351 -1135 -4162 -2798 6481 16883 22968 14229 17015 22690 9896
17148 9896 2327 2377 -6222 -9856 -11822 -15232 -18168 -26808 -32884 -38888 -34580 -22013 -23604 -15500 -14972
17133 -14972 -11745 -16560 -20165 -18398 -15242 -18417 331 10930 15935 16855 9208 -5139 -3587 -9305
$$ packed form
17231B2254M200j2890n214R923L807J6329J5363J891j8360j3231q473j7479m51
17218b331N569k171K393P142j989J477J726p546j6523r650J494J1001J3833J0380
17204A4805j0425p006K274k237l918L849o906o16J3621J1607J5798n724k2264
17191B858j7392J6841J2083j904M24L347m664j1041p054N786J2241O86j4495N819
17177C535J139R63n621j346L827p313k188n073o764K773J8213L336l295o29Q94
17162B451N173O236k759p50j1486l027J364R279J0402O085q739K786N675j2794
17148I896p569N0q599l634j966l410k936q640o076o004M308J2567j591Q104N28
17133a4972L227m815l605J767L156l175J8748J0599N005R20p647j4347J552n718
$$ plain form
17119 -9305 -13710 -8614 5969 22931 28666 20134 22891 15930 15962 13482 6554 2150 4862 12023 3189
17104 3189 -13566 -16017 -2185 7147 1424 891 3322 992 3563 -4037 3233 2088 9039 13742
17090 13742 4513 -3373 6950 12311 9388 13106 5597 -8821 -12141 -5435 -750 23861 37101
17077 37101 10412 -2559 -2072 -2363 -5317 -5537 -6309 -12137 -9570 -15176 -21267 -14712 -4713 2438 -1442
17062 -1442 -5862 -16308 -16888 -18103 -14546 -8716 20623 37903 18798 6457 -6707 -3999 -4760 -18732
17048 -18732 -18116 -919 996 2021 3205 1469 3644 3673 5667 4600 -5884 -18877 -19706 -19420 -15914
17033 -15914 -19960 -8127 -4669 -2713 -8222 -19511 -23024 -21772 -17494 -16665 -17408 -22243 -18643 555
17019 555 11386 12621 -3080 -5032 -903 -5563 -5440 -4154 -11762 -14343 -1541 6994 12899 19855
$$ packed form
17119i305m405N096J4583J6962N735q532K757o961L2k480o928m404K712P161q834
17104C189j6755k451J3832R332n723n33K431k330K571p600P270j145O951M703
17090A3742r229p886J0323N361k923L718p509j4418l320O706M685K4611J3240
17077C7101k6689j2971M87k91k954k20p72n828K567n606o091O555R999P151l880
17062a442m420j0446n80j215L557N830K9339J7280j9105j2341j3164K708p61j3972
17048a8732O16J7197J915J025J184j736K175K9J994j067j0484j2993q29K86L506
17033a5914m046J1833L458J956n509j1289l513J252M278Q29p43m835L600J9198
17019E55J0831J235j5701j952M129m660J23J286p608k581J2802Q535N905O956
$$ plain form
17005 19855 19764 11447 7536 21043 21252 21416 11527 -2980 6914 24695 36941 44831 50110 61272
16991 61272 75977 87300 106418 134347 168809 217772 303238 424796 617237 951336 1374279
16980 1374279 1462772 1274496 1064736 792475 540688 372512 262345 191700 155892 141159
16970 141159 132523 136042 133639 132733 143435 166862 201560 244347 309856 423324 608391 934030
16958 934030 1337648 1414921 1224890 1012755 753394 496624 331808 234804 163986 126687
16948 126687 98685 86600 71112 72571 75842 67293 56791 53211 54712 41975 35472 25789 20696
16935 20696 12093 4156 -2766 3688 -4130 -3492 -3655 -14716 -33021 -22836 -19401 -30366 -34616 -24673
16921 -24673 -477 7978 -11812 -22998 -28693 -26159 -25386 -19303 -11217 -3782 3245 7082 4171 -4948
$$ packed form
17005A9855r1q317l911J3507K09J64r889j4507R894J7781J2246P890N279J1162
16991F1272J4705J1323J9118K7929L4462M8963Q5466J21558J92441L34099M22943
16980A374279Q8493j88276k09760k72261k51787j68176j10167p0645l5808j4733
16970A41159q636L519k403r06J0702K3427L4698M2787O5509J13468J85067L25639
16958I34030M03618P7273j90031k12135k59361k56770j64816r7004p0818l7299
16948A26687k8002j2085j5488J459L271q549j0502l580J501j2737o503r683n093
16935B0696q603p937o922O454p818O38j63j1061j8305J0185L435j0965m250R943
16921b4673K4196Q455j9790j1186n695K534P73O083Q086P435P027L837k911r119
$$ plain form
16907 -4948 -16570 -15381 -2078 5271 -2165 -11451 -15823 -17292 -9771 -8119 -6835 -4734 -3845 -3483 -5383
16892 -5383 -1864 2614 -3050 -21975 -28070 -23622 -21079 -12188 -2156 -12940 -19368 -16375 -21396 -20666
16878 -20666 -19648 -27905 -25960 -16236 -19066 -13011 -6078 -9325 -11785 -6428 -24214 -22260 -13641 -15065
16864 -15065 -15925 -22513 -14309 -20618 -23581 -21148 -14823 -15859 -21072 -21450 -15308 -17650 -23116 -14232 -16399
16849 -16399 -15052 -11916 -13268 -20089 -23173 -14979 2724 2234 -3633 -13533 -17308 -7653 -7342 -17285 -12945
16834 -12945 -9206 -14042 -13138 -10248 -14309 -11286 -2335 -4101 -2491 -333 -13078 -12197 2855 15723
16820 15723 1063 -11609 -7678 -8396 -11464 2259 10076 1434 -3345 -4997 -9616 -15618 -19148 -19035
16806 -19035 -19006 -4764 -3447 -10814 -8390 -9062 -17617 -19339 -10394 1168 -5638 -4351 -3690 -1477 -7708
$$ packed form
16907d948j1622J189J3303P349p436r286m372j469P521J652J284K101Q89L62j900
16892e383L519M478n664j8925o095M448K543Q891J0032j0784o428K993n021P30
16878b0666J018q257J945R724k830O055O933l247k460N357j7786J954Q619j424
16864a5065q60o588Q204o309k963K433O325j036n213l78O142k342n466Q884k167
16849a6399J347L136j352o821l084Q194J7703m90n867r900l775R655L11r943M340
16834a2945L739m836R04K890m061L023Q951j766J610K158j2745Q81J5052J2868
16820A5723j4660j2672L931p18l068J3723P817q642m779j652m619o002l530J13
16806a9035K9J4242J317p367K424o72q555j722Q945J1562o806J287O61K213o231
$$ plain form
16791 -7708 -6567 -8200 -12250 -19689 -8318 -4363 -12180 -16528 -19672 -25188 -35462 -22713 -14085 -7987
16777 -7987 -7229 -16583 -13395 -25811 -32714 -25726 -15146 -7718 -3528 592 11652 11765 9854 12049
16763 12049 9281 11679 10772 13413 6625 -4046 -8471 -18150 -16050 -26390 -28997 -20013 -19330 -16582
16749 -16582 -7365 -2940 -15865 -14954 -16426 -18030 -14919 -4072 -5561 656 6711 -1146 -9487 -11909
16735 -11909 -10041 -17925 -20839 -25969 -27653 -20010 -8735 -13005 -9743 -5335 -10667 -12789 -16342 -14724
16721 -14724 -10812 -3080 8441 12307 -1839 -2599 6336 13133 15570 9864 -7779 -17810 -22592 -32097
16707 -32097 -35204 -28543 -28919 -20322 -23410 -19586 -18580 -9364 -4064 -7127 -8617 -4079 -1474 -7751 -11881
16692 -11881 -1490 -278 2505 3756 200 -12184 -23796 -28052 -12615 588 9727 11497 -3833
$$ packed form
16791g708J141j633m050p439J1371L955p817m348l144n516j0274J2749Q628O098
16777g987P58r354L188j2416o903O988J0580P428M190M120J1060J13j911K195
16763A2049k768K398r07K641o788j0671m425r679K100j0340k607Q984O83K748
16749a6582R217M425j2925R11j472j604L111J0847j489O217O055p857q341k422
16735a1909J868p884k914n130j684P643J1275m270L262M408n332k122l553J618
16721a4724L912P732J1521L866j4146p60Q935O797K437n706j7643j0031m782r505
16707c2097l107O661l76Q597l088L824J006R216N300l063j490M538K605o277m130
16692a1881J0391J212K783J251l556j2384j1612m256J5437J3203R139J770j5330
$$ plain form
16679 -3833 -12917 -9506 -11702 -10400 -8080 -6880 -7408 -1677 -2026 5909 -3706 -23890 -22153 -9682 -2001
16664 -2001 -733 -9507 -19946 -29604 -23412 -21216 -21779 -10154 7705 16318 20789 8908 6345 13319
16650 13319 15876 5637 -5154 -3753 -7898 -15352 -18637 -14361 -16063 -8076 4052 11229 9728 2799
16636 2799 -16019 -18626 -23582 -25009 -22373 -17078 -15417 -7618 5789 2053 -19416 -30108 -25956 -19001
16622 -19001 -7543 -7747 -16387 -10934 -2533 -2883 -12794 -20054 -15489 -20446 -12342 -12946 -20505 -18783 -21593
16607 -21593 -23024 -13106 -11879 -9190 -5565 -5145 -11432 -6868 -11307 -23775 -19990 -21890 -31771 -36834
16593 -36834 -33123 -26258 -15460 -18392 -9381 -3964 -7639 -966 2542 10102 7585 -9969 -13417 -10151
16579 -10151 6070 3507 423 -1095 -4228 -11635 -13915 -26620 -30405 -22887 -15789 -15405 -19763 -9559
$$ packed form
16679c833r084L411k196J302K320J200n28N731l49P935r615k0184J737J2471P681
16664b001J268q774j0439r658O192K196n63J1625J7859Q613M471j1881k563O974
16650A3319K557j0239j0791J401m145p454l285M276j702P987J2128P177j501o929
16636B799j8818k607m956j427K636N295J661P799J3407l736k1469j0692M152O955
16622a9001J1458k04q640N453Q401l50r911p260M565m957Q104o04p559J722k810
16607b1593j431R918J227K689L625M20o287M564m439j2468L785j900r881n063
16593c6834L711O865J0798k932R011N417l675O673L508P560k517j7554l448L266
16579a0151J6221k563l084j518l133p407k280j2705l785P518P098L84m358J0204
$$ plain form
16565 -9559 -79 426 -6550 -12040 -7696 -70 1602 2632 -6870 1332 735 -10376 -7320 -1726 -8747
16550 -8747 -7233 -7473 572 6442 12691 12362 9448 5736 4652 7803 13342 15667 16022 9044 -698
16535 -698 -7323 -11026 -8555 -7181 -8425 -6899 6330 803 -10096 -18596 -21501 -18411 -16262 2831
16521 2831 14315 5367 -8135 -7588 5010 14112 2742 4019 8584 20281 20091 5620 -4561
16508 -4561 2828 6058 -1360 -10767 -5743 -16205 -23414 -20694 -12217 -9733 -15705 -10761 -7726 341
16494 341 -13247 -27695 -21015 -8099 -4187 -11746 -16665 -6868 7000 -4490 -3173 1514 6587 7487
16480 7487 -9644 -15261 -14784 -8591 -3827 3218 -1931 -9013 -13369 -20853 -24248 -18118 -13836 -7334 -3738
16465 -3738 -11778 -10772 -949 -9108 -13942 -5310 -7153 -12125 -749 7981 2846 -1832 5284 17872
$$ packed form
16565i559R480N05o976n490M344P626J672J030r502Q202n97j1111L056N594p021
16550h747J514k40Q045N870O249l29k914l712j084L151N539K325L55o978r742
16535f98o625l703K471J374j244J526J3229n527j0899q500k905L090K149J9093
16521B831J1484q948j3502N47J2598R102j1370J277M565J1697j90j4471j0181
16508d561P389L230p418r407N024j0462p209K720Q477K484n972M944L035Q067
16494C41j3588j4448O680J2916L912p559m919R797J3868j1490J317M687N073R00
16480G487j7131n617M77O193M764P045n149p082m356p484l395O130M282O502L596
16465c738q040J006R823q159m834Q632j843m972J1376Q730n135m678P116J2588
$$ plain form
16451 17872 25510 30816 27161 22567 20235 19442 19335 32369 20923 11622 13244 14098 2930 -17096
16437 -17096 -26238 -22258 -13129 -20782 -29273 -28291 -17576 -9882 -10315 -9222 7150 21039 20715 15276
16423 15276 9897 8833 12199 9062 11058 12881 7993 5713 -772 784 -849 -10580 -15649 -14351
16409 -14351 -11874 -1150 -3760 -7999 -3178 5685 -450 -10963 -11078 -8961 -7522 -956 -5495 -11663
16395 -11663 -5036 -7171 -11143 -15527 -8542 -8259 -5986 -1477 2560 2924 -4088 -13405 -14290 35 6523
16380 6523 -512 -9803 -5114 -7557 -18070 -15349 -8691 -10827 -21482 -26132 -16241 -17255 -17972 -14493
16366 -14493 -4006 -4892 -15363 -24736 -5787 1264 5129 15554 19059 10993 2578 -1784 -5887 -9701
16352 -9701 -17672 -23799 -23328 -16702 -18499 -6323 -3131 -1784 -7618 -23169 -19973 -16158 -19159 -26043
$$ packed form
16451A7872P638N306l655m594k332p93j07J3034j1446r301J622Q54j1168k0026
16437a7096r142L980R129p653q491R82J0715P694m33J093J6372J3889l24n439
16423A5276n379j064L366l137J996J823m888k280o485J556j633r731n069J298
16409a4351K477J0724k610m239M821Q863o135j0513j15K117J439O566m539o168
16395a1663O627k135l972m384O985K83K273M509M037L64p012r317q85J4325O488
16380F523p035r291M689k443j0513K721O658k136j0655m650R891j014p17L479
16366a4493J0487q86j0471r373J8949P051L865J0425L505q066q415m362m103l814
16352i701p971o127M71O626j797J2176L192J347n834j5551L196L815l001o884
$$ plain form
16338 -26043 -22029 -16843 -4913 10609 9431 -384 7145 -1460 -9009 -4638 7351 12431 23382
16325 23382 26547 18883 4361 4704 14768 15373 16754 9243 2803 5408 3650 -1203 -90 5312
16311 5312 10202 10225 7502 10566 13144 11692 20292 17997 12987 -5778 -6789 -7708 -4257 -708 10424
16296 10424 14621 10792 7104 2722 -6640 -8068 -6345 -6507 -15566 -20846 -16999 -1092 2464 4995
16282 4995 1715 -1086 -7898 -11497 -9921 -11538 -10713 -16263 -13202 -2850 5318 9292 3636 -11351
16268 -11351 -18946 -14313 -11296 -15582 -18314 -18967 -14542 -21035 -24076 -18420 -13839 -9764 -19298 -20271 -10066
16253 -10066 -13709 -15911 2374 14866 158 -6013 -5433 -8016 -10052 -6799 -9654 -12313 -16060 -17291
16239 -17291 -14976 -11822 -5981 -11221 -18748 -13176 -8743 -13033 -24443 -15015 874 13234 14036 11319
$$ packed form
16338b6043M014N186J1930J5522j178r815P529q605p549M371J1989N080J0951
16325B3382L165p664j4522L43J0064O05J381p511o440K605j758m853J113N402
16311E312M890K3k723L064K578j452Q600k295n010j8765j011r19L451L549J1132
16296A0424M197l829l688m382r362j428J723j62r059n280L847J5907L556K531
16282D995l280k801o812l599J576j617Q25n550L061J0352Q168L974n656j4987
16268a1351p595M633L017m286k732o53M425o493l041N656M581M075r534r73J0205
16253a0066l643k202J8285J2492j4708o171N80k583k036L253k855k659l747j231
16239a7291K315L154N841n240p527N572M433m290j1410R428J5889J2360Q02k717
$$ plain form
16225 11319 3538 8115 10983 4716 1966 -2146 -8795 -4146 -12287 -10350 -6059 3833 8393 8002 3309
16210 3309 6788 2507 -2172 -3350 -6293 84 -7642 -1246 3661 616 -6266 -14892 -26201 -37514
16196 -37514 -42037 -29119 -21141 -30928 -28311 -9268 -5207 -7724 -12790 -18917 -12923 -1668 5549 11800
16182 11800 9213 8424 9659 -5929 -18583 -20387 -19305 -18568 -17768 1589 489 -4721 -11785 9460
16168 9460 14728 7286 11948 13145 9491 6638 10204 6488 1322 -7653 -14031 -21041 -17625 -11760 -2257
16153 -2257 154 -2538 -628 8845 4623 11327 15177 7469 7286 3623 -7994 -13634 -18081 -13856 -17709
16138 -17709 -12589 -8226 -1640 -2601 4288 10286 9806 6414 7898 12057 10337 2964 5365 402 -141
16123 -141 -9163 102 9613 6390 7867 6521 -6387 -15093 -2926 -1069 1486 913 1916 -1688 2860
$$ packed form
16225A1319p781M577K868o267k750m112o649M649q141J937M291R892M560l91m693
16210C309L479m281m679j178k943O377p726O396M907l045o882q626j1309j1313
16196c7514m523J2918P978r787K617J9043M061k517n066o127N994J1255P217O251
16182A1800k587p89J235j5588j2654j804J082P37Q00J9357j100n210p064K1245
16168I460N268p442M662J197l654k853L566l716n166q975o378p010L416N865R503
16153b257K411k692J910R473m222O704L850p708j83l663j1617n640m447M225l853
16138a7709N120M363O586r61O889N998m80l392J484M159j720p373K401m963n43
16123a41r022R265R511l223J477j346j2908q706J2167J857K555n73J003l604M548
$$ plain form
16108 2860 -3222 -5239 -13233 -14553 -10422 -7638 -3465 -4825 -10038 -4937 -6357 1169 3079 10987 9146
16093 9146 6981 9454 9440 13560 7317 4595 -1402 -6801 1334 13209 7084 -2385 -12297 -19610 -24908
16078 -24908 -25607 -16406 -11318 -12199 -17517 -26969 -34496 -25967 -17736 -7792 -3751 527 1271 7139 16841
16063 16841 11618 -268 -19478 -24996 -21374 -21073 -20431 -16091 -7545 -12910 -12937 -7308 1124 618 -754
16048 -754 -17472 -30299 -27112 -20414 -17026 -9823 -4956 616 12373 14813 9816 7616 -2298 -6076
16034 -6076 2174 3950 -11109 -12681 -15126 -11728 -7079 -16333 -7838 -6051 -7738 -8853 -8322 -9528 -9045
16019 -9045 -13873 -9651 -7854 -12994 -20648 -11095 -7759 -4598 -6714 -16886 -15330 -13213 -15991 -16742 -23092
16004 -23092 -17129 -19533 -20342 -3815 901 -6597 -5718 -13304 -14064 -10364 -3346 725 -1827 1355 12951
$$ packed form
16108B860o082k017p994j320M131K784M173j360n213N101j420P526J910P908j841
16093I146k165K473j4M120o243k722n997n399Q135J1875o125r469r912p313n298
16078b4908o99R201N088q81n318r452p527Q529Q231R944M041M278P44N868R702
16063A6841n223j1886j9210n518L622L01O42M340Q546n365k7N629Q432n06j372
16048g54j6718j2827L187O698L388P203M867N572J1757K440m997k200r914l778
16034f076Q250J776j5059j572k445L398M649r254Q495J787j687j115N31j206M83
16019i045m828M222J797n140p654R553L336L161k116j0172J556K117k778p51o350
16004b3092N963k404q09J6527M716p498Q79p586p60L700P018M071k552L182J1596
$$ plain form
15989 12951 4960 -9684 -8996 -10327 -13300 -10079 -3723 -4222 -2588 -13076 -25147 -23925 -18563 -11120
15975 -11120 -6871 -11218 -22263 -15810 -11050 -13104 2977 8035 3239 -196 -6578 -18246 -18891 -11090
15961 -11090 -7186 -103 -10362 -13396 -4980 -2633 -5440 -2134 1749 -1385 5836 5442 2009 1345 418
15946 418 -4547 -10448 -19909 -14898 -9838 -3528 10368 20896 9604 -1540 -4362 -6601 -5405 -991
15932 -991 -861 -9892 -14012 -7387 -1966 -3346 -1231 -3149 -5183 -9713 1612 17390 -3601 -12456
15918 -12456 -5553 2197 -2269 -16698 -17689 -13164 -7532 -3319 -1442 -1207 -4439 -8150 -5775 2714 214
15903 214 5228 -2533 -5853 -3921 -8227 -5757 -7779 -1258 9627 15234 10311 16457 23388 18625 9765
15888 9765 -2441 -15588 -21538 -19942 -26839 -26265 -17296 -14179 -7092 -11725 -15580 -13715 -8878 -11649
$$ packed form
15989A2951p991j4644O88j331k973L221O356m99J634j0488j2071J222N362P443
15975a1120M249m347j1045O453M760k054J6081N058m796l435o382j1668o45P801
15961a1090L904P083j0259l034Q416K347k807L306L883l134P221l94l433o64r27
15946D18m965n901r461N011N060O310J3896J0528j1292j1144k822k239J196M414
15932i91J30r031m120O625N421j380K115j918k034m530J1325J5778k0991q855
15918a2456O903P750m466j4429r91M525N632M213J877K35l232l711K375Q489k500
15903B14N014p761l320J932m306K470k022O521J0885N607m923O146O931m763q860
15888I765j2206j3147n950J596o897N74Q969L117P087m633l855J865M837k771
$$ plain form
15874 -11649 -12261 -17740 -11945 -9881 -13291 -15961 -17892 -25784 -27075 -18825 -8691 -1945 -9932 -8947 -20852
15859 -20852 -23580 -21279 -14975 -9074 6882 4341 -7022 -11468 -7648 -4687 -9031 -9364 1908 3033
15845 3033 18794 21348 9188 4727 2280 -8188 -4031 7467 6830 241 4762 -546 -10284 -9886
15831 -9886 -10063 -3116 2893 1750 -2399 -9431 -13608 -10073 -1275 -1061 -1774 -13220 -15572 -12888 -17728
15816 -17728 -16539 -16296 -15150 -18806 -24403 -21143 -23793 -16468 -27249 -27217 -17650 -14329 -9372 -5641 -2944
15801 -2944 3807 -4576 -10974 -15950 -11216 -13644 -16213 -14950 -9538 801 15879 15457 2528 2016
15787 2016 4100 969 783 7996 20154 19363 15504 10645 527 -4074 -472 9683 9626 -2779 -10513
15772 -10513 -4538 8464 1444 -7032 -17350 -13270 831 4052 -547 -9294 -14046 -21629 -17760 -8820
$$ packed form
15874a1649o12n479N795K064l410k670j931p892j291Q250J0134O746p987R85j1905
15859b0852k728K301O304N901J5956k541j1363m446L820K961m344l33J1272J125
15845C033J5761K554j2160m461k447j0468M157J1498o37o589M521n308r738L98
15831i886j77O947O009j143m149p032m177L535Q798K14p13j1446k352K684m840
15816a7728J189K43J146l656n597L260k650P325j0781L2R567L321M957L731K697
15801b944O751q383o398m976M734k428k569J263N412J0339J5078m22j2929n12
15787B016K084l131j86P213J2158p91l859m859j0118m601L602J0155n7j2405p734
15772a0513N975J3002p020q476j0318M080J4101L221m599q747m752p583L869Q940
$$ plain form
15758 -8820 -15572 -11912 -30 7218 11244 18851 19525 4543 -3489 -11564 -25519 -17598 -12065 -13854
15744 -13854 -9301 -9192 -10808 -3275 8173 14550 6340 6376 8004 7279 5858 5721 9729 4102 1592
15729 1592 -725 1562 -3250 -7628 -1492 15453 9477 1306 -862 -2393 654 -5648 -11708 -11822 -14036
15714 -14036 -12558 -8860 -17616 -28990 -26152 -12292 -9105 -5783 275 6043 15436 2007 -16500
15701 -16500 -8173 -15948 -11876 -10092 -16343 -12147 -12589 -16837 -20323 -6769 3834 10892 12122 629
15687 629 -14237 -21784 -30362 -15557 16267 31996 20727 2388 -1962 7723 6035 76 2521
15674 2521 3243 -1212 -1885 -8129 3095 13152 10920 511 -701 1835 17370 22096 7661 -9909
15660 -9909 -3028 174 -12783 -8326 4761 469 -8188 -12441 -5577 -1163 4486 16424 5365 -2983
$$ packed form
15758h820o752L660J1882P248M026P607O74j4982q032q075j3955P921N533j789
15744a3854M553J09j616P533J1448O377q210L6J628p25j421j37M008n627k510
15729A592k317K287m812m378O136J6945n976q171k168j531L047o302o060j14k214
15714a4036J478L698q756j1374K838J3860L187L322O058N768R393j3429j8507
15701a6500Q327p775M072J784o251M196m42m248l486J3554J0603P058J230j1493
15687F29j4866p547q578J4805L1824J5729j1269j8339m350R685j688n959K445
15674B521P22m455o73o244J1224J0057k232j0409j212K536J5535M726j4435j7570
15660i909O881L202j2957M457J3087m292q657m253O864M414N649J1938j1059q348
$$ plain form
15646 -2983 7584 6111 -8782 -29571 -20142 -1039 7396 1460 -11656 -12446 -14577 -4747 -4192 -4013
15632 -4013 -4959 8011 6787 10080 5930 -816 11323 9563 -5226 -7780 -400 -1663 -7701 -7353
15618 -7353 8699 3796 3753 11465 11043 9458 10971 2481 -464 4136 10929 6559 -9099 -10137 4704
15603 4704 3039 3133 1137 -9495 -17909 -6226 5631 14952 9263 -11284 -2745 5431 -1704 -9682
15589 -9682 2409 7823 -4053 -9466 -1928 2597 -2926 -5716 3170 13535 20418 6418 -3750
15576 -3750 -1482 591 -4172 3295 8857 5394 2905 -621 -11573 -8422 725 -11114 -11906 -3229
15562 -3229 -4754 -7320 -7261 -4918 -4625 -12327 -12899 -10626 2397 7084 11760 -1995 -23683 -18675 -15564
15547 -15564 -10179 -14997 -5291 -1091 1591 -231 -8747 -20204 -24175 -17750 -4556 -3933 -1443 -8147
$$ packed form
15646b983J0567j473j4893k0789R429J9103Q435n936j3116p90k131R830N55J79
15632d013r46J2970j224L293m150o746J2139j760j4789k554P380j263o038L48
15618g353J6052m903m3P712m22j585J513q490k945M600O793m370j5658j038J4841
15603D704j665R4j996j0632q414J1683J1857R321n689k0547Q539Q176p135p978
15589i682J2091N414j1876n413P538M525n523k790Q886J0365O883j4000j0168
15576c750K268K073m763P467N562l463k489l526j0952L151R147j1839p92Q677
15562c229j525k566N9K343K93p702n72K273J3023M687M676j3755k1688N008L111
15547a5564N385m818R706M200K682j822q516j1457l971O425J3194O23K490o704
$$ plain form
15533 -8147 -10163 2850 13386 20100 25031 13640 7585 10990 11017 -724 -8304 -12410 -10825 -1344
15519 -1344 -2016 -2242 -151 342 9893 13065 11598 13564 8917 3435 2623 2555 8823 6963 10877 4205
15503 4205 6631 -6113 -14700 -16238 -23072 -24515 -15679 -8177 3689 2977 4513 3543 140 1740 1143
15488 1143 3960 1654 2598 4524 -7409 -60 7689 -6294 -7284 -267 5108 4914 4511 -2644 -14213
15473 -14213 -6123 5910 10638 13789 9050 -2777 1918 -5806 -6375 -4743 8654 24284 7983
15460 7983 6297 9568 -614 -15829 -16182 -8825 -3487 5266 16096 7910 -13213 -8616 -6910 -9455
15446 -9455 -2389 1053 4457 -4678 -6837 -6998 7579 19167 16320 9326 5961 16844 15704 3041
15432 3041 -7650 -4307 3512 10691 15421 23576 20947 11939 11606 -748 6039 1364 -5472 -7026
$$ packed form
15533h147k016J3013J0536O714M931j1391o055L405K7j1741p580m106J585R481
15519a344o72k26K091M93R551L172j467J966m647n482q12o8O268j860L914o672
15503D205K426j2744q587j538o834j443Q836P502J1866p12J536r70l403J600n97
15488A143K817k306R44J926j1933P349P749j3983r90P017N375j94m03p155j1569
15473a4213Q090J2033M728L151m739j1827M695p724n69J632J3397J5630j6301
15460G983j686L271j0182j5215l53P357N338Q753J0830q186k1123M597J706k545
15446i455P066L442L404r135k159j61J4577J1588k847o994l365J0883j140j2663
15432C041j0691L343P819P179M730Q155k629r008l33j2354O787m675o836j554
$$ plain form
15418 -7026 -9207 -10286 -5333 1916 1313 5825 8533 6304 -1321 -6828 -14894 -12625 -6881 -13936 -19619
15403 -19619 -11552 4114 4533 4893 -9447 -13799 -6543 1394 10247 6258 3265 -1908 -3058 33
15389 33 12635 7460 -4463 -1695 5171 16222 16176 10005 -2583 -8066 -131 -3341 -10206 -11679 -2711
15374 -2711 -712 6829 -877 -3181 2492 6601 11770 11120 7071 12224 15892 20356 12962 -158 -10768
15359 -10768 -19150 -13093 -6698 -12580 5957 19123 10726 7577 -5201 -5354 -4898 3478 10872 1959
15345 1959 -113 3338 3506 6307 -5352 -14708 -15770 -8625 1416 9053 15644 12552 11893 5786 806
15330 806 -185 -478 -9495 -6459 3530 -2598 -15882 -19584 -17117 -4562 4575 7568 4883 -3428 -5316
15315 -5316 -17518 -26464 -21045 -11732 -14084 -7353 1628 -3474 -7408 -7973 -17045 -19170 -7459 260
$$ packed form
15418g026k181j079M953P249o03M512K708k229p625n507q066K269N744p055n683
15403a9619Q067J5666M19L60j4340m352P256P937Q853l989k993n173j150L091
15389C3J2602n175j1923K768O866J1051m6o171j2588n483P935l210o865j473Q968
15374b711J999P541p706k304N673M109N169o50m049N153L668M464p394j3120j0610
15359a0768q382O057O395n882J8537J3166q397l149j2778j53M56Q376P394q913
15345A959k072L451J68K801j1659r356j062P145J0041P637O591l092o59o107m980
15330H06r91k93r017L036R989o128j3284l702K467J2555R137K993k685q311j888
15315e316j2202q946N419R313k352O731Q981n102l934n65r072k125J1711P719
$$ plain form
15301 260 3251 10891 9440 763 -4787 -14322 -12107 -10948 -14300 -6868 -11387 -9216 3240 4962 -8925
15286 -8925 -1847 2635 2395 -2023 -3860 2748 9126 1200 -1538 -6424 -3497 -5327 -2030 -4892 1484
15271 1484 -270 -11909 -6321 8791 -1776 -7077 -3376 1711 6909 7448 8781 12016 19648 -81
15257 -81 -23996 -17259 -11362 -10734 -8501 -12251 -12873 -2879 13921 5301 1786 3245 6081 4661 -2549
15242 -2549 7057 6341 -4168 -7676 -89 3670 11431 16939 15597 -59 5177 7963 10749 7846
15228 7846 2883 -4483 -3278 -1374 8217 11404 17883 13743 2998 -443 6037 8408 6773 12212
15214 12212 4253 -4907 -5757 -2574 -12234 -18158 -13690 -5638 -9254 -5962 -10464 -16855 -10999 -9827 -2749
15199 -2749 -4832 -3104 -6111 -11567 -10358 -5931 -15443 -24761 -17357 -11908 -1199 9263 10262 7006
$$ packed form
15301B60K991P640j451q677n550r535K215J159l352P432m519K171J2456J722j3887
15286h925P078M482k40m418j837O608O378p926k738m886K927j830L297k862O376
15271A484j754j1639N588J5112j0567n301L701N087N198N39J333L235P632j9729
15257h1k3915O737N897O28K233l750o22R994J6800q620l515J459K836j420p210
15242b549R606p16j0509l508P587L759P761N508j342j5656N236K786K786k903
15228G846m963p366J205J904R591L187O479m140j0745l441O480K371j635N439
15214A2212p959r160q50L183r660n924M468Q052l616L292m502o391N856J172P078
15199b749k083J728l007n456J209M427r512r318P404N449J0709J0462R99l256
$$ plain form
15185 7006 78 -8528 627 916 -3756 -5842 -8391 -5038 -2313 -6413 -613 -7302 -6559 -7657 -12290
15170 -12290 -5885 -22801 -30373 -31792 -24406 -11072 -7112 4317 -4020 -18179 -16813 -12024 -11506 -3425
15156 -3425 -3130 -678 -1073 -4526 7554 7802 -872 -1603 6306 9250 1354 -12633 -15342 -8892 -10817
15141 -10817 -23350 -25570 -21812 -11276 -10421 -14324 -12509 -5159 2829 4390 -8338 -14716 -2142 361
15127 361 -8150 -6482 -2271 -10094 -22212 -19278 -9688 -8968 -2868 978 5135 4052 -7002 -17264
15113 -17264 -11239 -11206 -8260 -4620 -19463 -26752 -9181 -3264 -2358 -4334 -1775 8309 22056 19641
15099 19641 19377 5044 -2933 5242 18298 5966 -2141 15843 10158 7073 12687 12966 11228 19490
15085 19490 12014 8801 -1572 -1395 -1582 -246 1009 -374 5079 1826 -5383 -8927 -7923 -10601 -7673
$$ packed form
15185G006o928q606R155K89m672k086k549L353K725m100N800o689P43j098m633
15170a2290O405j6916p572j419P386J3334L960J1429q337j4159J366M789N18Q081
15156c425K95K452l95l453J2080K48q674p31P909K944p896j3987k709O450j925
15141a0817j2533k220L758J0536Q55l903J815P350P988J561j2728o378J2574K503
15127C61q511J668M211p823j2118K934R590P20O100L846M157j083j1054j0262
15113a7264O025L3K946L640j4843p289J7571N917R06j976K559J0084J3747k415
15099A9641k64j4333p977Q175J3056j2332q107J7984n685l085N614K79j738Q262
15085A9490p476l213j0373J77j87J336J255j383N453l253p209l544J004k678K928
$$ plain form
15070 -7673 -18307 -25736 -29758 -30267 -21210 -7677 -9505 -8422 -4291 -8685 -12553 -7750 -2128 -4647
15056 -4647 -11536 -9054 1253 6234 9555 11633 -4293 -14253 -22232 -28758 -19991 -8889 -13689 -15892
15042 -15892 -6402 -7643 -3836 8085 14626 12338 9862 -968 -1135 -1324 -1931 -6481 -10573 -8039 -205
15027 -205 -8541 -4055 1551 4679 -1852 460 -7437 2143 14151 17742 1838 -9260 -10767 -2790
15013 -2790 -2817 -9127 -8917 2175 4654 250 -3967 -4748 3021 -333 -3323 5876 7024 15269 12617
14998 12617 12449 11710 -4637 -15658 -15150 -8588 786 7056 4008 602 -13967 -13682 -6740 4193
14984 4193 11601 -2556 -14022 -7844 8513 14901 10453 9448 -10204 -23606 -21799 -7319 -2110
14971 -2110 -225 -10726 -24062 -29837 -25333 -13552 -9233 -15970 -16848 3344 3666 1688 -3438 -5134
$$ packed form
15070g673j0634p429m022n09R057J3533j828J083M131m394l868M803N622k519
15056d647o889K482J0307M981L321K078j5926r960p979o526Q767J1102m800k203
15042a5892R490j241L807J1921O541k288k476j0830j67j89o07m550m092K534P834
15027b05q336M486N606L128o531K312p897R580J2008L591j5904j1098j507P977
15013b790k7o310K10J1092K479m404m217p81P769l354k990R199J148Q245k652
14998A2617j68p39j6347j1021N08O562R374O270l048l406j4569K85O942J0933
14984D193P408j4157j1466O178J6357O388m448j005j9652j3402J807J4480N209
14971b110J885j0501j3336n775M504J1781M319o737q78K0192L22j978n126j696
$$ plain form
14957 -5134 -2125 -6560 -12210 -16559 -16029 -18705 -23733 -15298 -13580 -14995 -19339 -27517 -23623 -20717 -31319
14942 -31319 -24001 -13790 -11305 -6675 -16022 -12443 1452 12107 -1657 5991 13894 15638 9878
14929 9878 16350 18640 -2917 -10862 -5484 5319 7157 6348 -1726 1729 4068 11640 5732 961
14915 961 9527 3492 -5138 -5745 -4856 -10338 -4765 -3702 -6565 -5580 -2860 11662 18850 12119 7306
14900 7306 1248 -3970 -14392 -6255 -4804 687 -60 -4247 63 -4401 -3856 5135 -2689 2084 13203
14885 13203 18099 13427 8792 4572 2492 -637 -3506 729 7794 20245 13223 11591 13438 5366
14871 5366 33 -2236 7032 2897 -9638 -15161 -7863 -5385 -11746 -10881 -9750 -16112 -21217 -16655 -16651
14856 -16651 -12681 -869 -868 -15705 -12058 -9543 -16284 -14422 1496 -57 -15976 -17551 -15045 -17201
$$ packed form
14957e134L009m435n650m349N30k676n028Q435J718j415m344q178L894K906j0602
14942c1319P318J0211K485M630r347L579J3895J0655j3764P648P903J744n760
14929I878O472K290k1557p945N378J0803J838q09q074L455K339P572n908m771
14915I61Q566o035q630o07Q89n482N573J063k863R85K720J4522P188o731m813
14900G306o058n218j0422Q137J451N491p47m187M310m464N45Q991p824M773J1119
14885A3203M896m672m635m220k080l129k869M235P065J2451p022j632J847q072
14871E366n333k269R268m135j2535n523P298K478o361Q65J131o362n105M562M
14856a6651L970J1812Jj4837L647K515o741J862J5918j553j5919j575K506k156
$$ plain form
14842 -17201 -9747 -11022 -10319 -7005 -7100 -6072 -1084 -6291 -19590 -26663 -17632 -11841 -14951 -11007 -8651
14827 -8651 -9877 -12016 -8312 -2841 856 -5630 -426 4251 1390 -2116 -4710 -4818 -17616 -14415 -10187
14812 -10187 -6335 -3532 -7605 1279 -312 -1326 -12873 -17715 -14026 -895 -893 2271 -189 -4041 -899
14797 -899 5936 2309 -8649 -10728 -15433 -19015 -3881 4278 13850 6861 2197 2266 4908 1947 -3352
14782 -3352 -9549 -8397 -3391 -5751 6598 9133 8829 8767 21475 16638 1907 18024 33873 22046
14768 22046 13023 6031 939 -3890 -10356 -17309 -15517 -24593 -17934 -11057 -9839 -13243 -16462 -18074
14754 -18074 -15144 -17839 -22810 -15896 -8869 -19974 -12874 -5356 2191 1132 10117 2976 5360 7500
14740 7500 11272 6550 8703 11646 8325 680 8305 6804 4285 11784 15424 18015 18516 12332 21278
$$ packed form
14842a7201P454j275P03L314r5J028M988n207j3299p073R031N791l110L944K356
14827h651j226k139L704N471L697o486N204M677k861l506k594j08j2798L201M228
14812a0187L852K803m073Q884j591j014j1547m842L689J3131KL164k460l852L142
14797h99O835l627j0958k079m705l582J5134Q159R572o989m664O9K642k961n299
14782c352o197J152N006k360J2349K535l04o2J2708m837j4731J6117J5849j1827
14768B2046r023o992n092m829o466o953J792r076O659O877J218l404l219j612
14754a8074K930k695m971O914P027j1105P100P518P547j059Q985p141K384K140
14740G500L772m722K153K943l321p645P625j501k519P499L640K591N01o184Q946
$$ plain form
14725 21278 18774 15249 18597 19559 18400 21817 26312 26732 14484 13992 20962 14104 10087 8045 6992
14710 6992 -5707 -4479 -11851 -9282 1366 4813 7101 14276 9427 4257 5536 7199 -1242 2897
14696 2897 3027 -2713 -10998 1630 13569 22607 31528 24168 5253 -1659 -5484 2218 -2946 -3719
14682 -3719 -1972 -3520 1798 846 -4184 -2190 5679 10318 16911 19429 10752 3638 5463 7355 3984
14667 3984 3655 -17008 -31863 -28601 -22204 -11491 -4541 -3404 3633 7942 -3469 -2967 2957 15888
14653 15888 13320 4029 -15814 -12456 -1298 -541 3663 7206 16883 6677 144 6669 10401 -1958
14639 -1958 3795 10729 10070 17015 12074 4846 -9672 -24164 -26173 -28224 -25520 -27181 -11247 -12881
14625 -12881 -9962 -17950 -21633 -26804 -16123 -2164 3107 9695 4661 7837 4715 3130 8806 10925
$$ packed form
14725B1278k504l525L348R62j159L417M495M20j2248m92O970o858m017k042j053
14710F992j2699J228p372K569J0648L447K288P175m849n170J279J663q441M139
14696B897J30n740q285J2628J1939R038Q921p360j8915o912l825P702n164p73
14682c719J747j548N318r52n030J994P869M639O593K518q677p114J825J892l371
14667C984l29k0663j4855L262O397J0713O950J137P037M309j1411N02N924J2931
14653A5888k568r291j9843L358J1158P57M204L543R677j0206o533O525L732j2359
14639a958N753O934o59O945m941p228j4518j4492k009k051K704j661J5934j634
14625a2881K919p988l683n171J0681J3959N271O588n034L176l122j585N676K119
$$ plain form
14611 10925 6955 12552 3344 -4424 -14434 -15855 -17369 -17439 -12097 -10664 -8265 -7600 -9922 -11497 -17722
14596 -17722 -19010 -13853 -11681 -17090 -20522 -18961 -10228 583 -8201 -4243 352 -347 3491 -2416
14582 -2416 -20325 -8871 131 7869 7366 -4685 -372 13633 12057 4104 -11405 -7649 -6197 -20299
14568 -20299 -10861 -8223 -18448 -23392 -17337 -14138 2473 -981 -11296 -5933 7116 16394 2157
14555 2157 114 15085 15723 1538 8741 3172 -12262 -17823 -20999 -18544 -17538 -24161 -14214 731
14541 731 -6177 -9057 2159 4952 211 7683 4015 13595 12034 5312 1537 2776 587 -3533 1279
14526 1279 -4142 -9590 -11253 -10654 -12810 -8059 2920 1884 1603 10819 16451 19986 19493 6658 -5541
14511 -5541 -614 5752 2544 -1238 3280 6704 -3808 -12704 -14833 -16089 -9767 -7664 -17763 -15358
$$ packed form
14611A0925l970N597r208p768j0010j421j514p0N342J433K399O65k322j575o225
14596a7722j288N157K172n409l432J561Q733J0811q784L958M595o99L838n907
14582b416j7909J1454R002P738n03j2051M313J4005j576p953j5509L756J452j4102
14568b0299R438K638j0225m944O055L199J6611l454j0315N363J3049R278j4237
14555B157k043J4971O38j4185P203n569j5434n561l176K455J006o623R947J4945
14541G31o908k880J1216K793m741P472l668R580j561o722l775J239k189m120M812
14526A279n421n448j663N99k156M751J0979j036k81R216N632L535m93j2835j2199
14511e541M927O366l208l782M518L424j0512q896k129j256O322K103j0099K405
$$ plain form
14497 -15358 -4282 10853 19411 11320 5838 -1692 -1276 -6907 5382 10763 3039 -4473 -6615 5684
14483 5684 4914 10329 9338 9778 9828 -6928 -14014 -11711 -8430 -9507 -15633 -17553 -11057 -7590 -6959 -5905
14467 -5905 3030 4562 -160 11275 28194 24557 9398 -2414 -279 -8514 -23053 -22543 -324
14454 -324 10822 12000 6893 4137 13624 9666 -2928 -8282 -15982 -10737 -8612 -13319 -12002 -7286
14440 -7286 -240 -2493 -6510 80 11683 15739 -2463 5723 26384 20506 9595 16259 14247 8251
14426 8251 -13900 -8226 7545 4212 2043 3331 10271 8955 1243 6647 14619 16344 10159 6696
14412 6696 7200 3838 899 -2553 -3708 1377 11875 9342 4562 -8790 -17846 -13989 -13733 -17389 -19742
14397 -19742 -9149 -7495 -4976 -6050 -8705 -4973 -7795 -493 337 -9333 -12090 -18512 -15203 -15816 -13860
$$ packed form
14497a5358J1076J5135Q558q091n482p530M16n631J2289N381p724p512k142J2299
14483E684p70N415r91M40N0j6756p086K303L281j077o126j920O496L467O31J054
14467e905Q935J532m722J1435J6919l637j5159j1812K135q235j4539N10K2219
14454c24J1146J178n107k756R487l958j2594n354p700N245K125m707J317M716
14440g286P046k253m017O590J1603M056j8202Q186K0661n878j0911O664k012n996
14426H251k2151N674J5771l333k169J288O940j316p712N404P972J725o185l463
14412F696N04l362k939l452j155N085J0498k533m780j3352r056L857K56l656k353
14397a9742J0593J654K519j074k655L732k822P302Q30r670k757o422L309o13J956
$$ plain form
14382 -13860 -11942 -19694 -11124 8784 20673 11117 -1819 -4853 12476 7605 8152 1394 2605 -5404
14368 -5404 -3250 3008 11707 11934 10071 9863 17311 10755 -1887 -9733 -12076 -15202 -18688 -23990 -18646
14353 -18646 -2664 -2659 -110 -5391 -7866 -6004 1734 12334 638 -2095 730 407 5087 -1581 -1246
14338 -1246 -2333 4580 8484 -1702 -2187 -8223 -12465 -24171 -22911 -9442 -3623 -11914 -13314 -4784
14324 -4784 -5967 -6911 -8804 -5558 -5139 519 -3406 -17002 -16108 -6814 -13533 -8270 1683 5955 -5802
14309 -5802 -7464 6348 8281 968 2189 -6576 -17591 -7697 -173 674 -7153 -8292 -11680 -13369
14295 -13369 -4740 -5377 -7185 -3614 -1434 213 6128 13285 20117 17688 16271 14940 4649 -3636
14281 -3636 -5930 -13706 -14930 -15575 -30655 -37942 -22068 -9467 -14015 -21625 -17773 -9559 -13587 -14481
$$ packed form
14382a3860J918p752Q570J9908J1889r556j2936l034J7329m871N47o758J211q009
14368e404K154O258Q699K27j863k08P448o556j2642p846k343l126l486n302N344
14353a8646J5982NK549n281k475J862P738J0600j1696k733K825l23M680o668L35
14338a246j087O913L904j0186m85o036m242j1706J260J3469N819q291j400Q530
14324d784j183r44j893L246M19N658l925j3596Q94R294o719N263R953M272j1757
14309e802j662J3812J933p313J221q765j1015R894P524Q47p827j139l388j689
14295a3369Q629o37j808L571K180J647N915P157O832k429j417j331j0291q285
14281c636k294p776j224o45j5080p287J5874J2601m548p610L852Q214m028q94
$$ plain form
14267 -14481 -1231 2302 4328 8311 10080 10769 13700 17372 8495 -41 -1319 451 -77 2070 140
14252 140 974 2638 -4913 -12121 -18691 -10243 -12062 -12719 -10660 -21708 -13274 -8051 -16380 -27949 -19249
14237 -19249 -9212 -1937 1201 1385 -12199 -17756 -18700 -27421 -31161 -31511 -32033 -21491 -13795 -17762 -27008
14222 -27008 -20236 -18346 -16615 -19338 -10353 3937 3037 10564 11886 7072 -233 -318 -5498 7617 4316
14207 4316 -8360 -13056 -12418 -11601 -8855 -2554 83 -12277 -28505 -25869 -23021 -14764 -11748 -1822
14193 -1822 5348 -769 -7105 -4232 1631 9602 6839 3097 6699 3661 68 1273 -6972 -12704 -5645
14178 -5645 -504 -12648 -14026 -9410 -1308 11652 19920 15470 7592 -4158 -13193 -21865 -12410 -6175
14164 -6175 -1916 710 -4969 -13090 -9300 -5205 -15797 -21193 -19777 -783 8774 -2791 -11935 -15823
$$ packed form
14267a4481J3250L533K026L983J769O89K931L672q877q536j278J770n28K147j930
14252A40Q34J664p551p208o570Q448j819o57K059j1048Q434N223q329j1569Q700
14237a9249J0037P275L138J84j3584n557r44q721l740l50n22J0542P696l967r246
14222b7008O772J890J731k723Q985J4290r00P527J322m814p305q5n180J3115l301
14207D316j2676m696O38Q17K746O301K637j2360j6228K636K848Q257L016R926
14193a822P170o117o336K873N863P971k763l742L602l038l593J205q245n732P059
14178e645N141j2144j378M616Q102J2960Q268m450p878j1750r035q672R455O235
14164f175M259K626n679q121L790M095j0592n396J416J8994R557j1565r144l888
$$ plain form
14150 -15823 -20571 -19542 -21066 -17364 -1024 -6790 -17024 -10110 -9178 -14034 -4677 2511 4853 4761 6693
14135 6693 23173 13438 -3924 -16026 -15753 -15071 -22286 -11757 -9444 -4943 -6754 -7447 -11406 -10972 -2295
14120 -2295 -1717 2977 9386 18819 16401 15934 10796 11284 16020 14684 3166 -10552 -11493 -16097 -28518
14105 -28518 -28093 -19029 -10493 -15176 -20421 -13861 1246 -188 -1319 99 -637 -2065 -378 -11200
14091 -11200 -9999 -5874 -1164 -4701 80 5999 3844 -3179 -5788 -7126 -13081 -18516 -5208 -6629
14077 -6629 -5358 -10259 -17304 -11505 -2256 3115 5663 10179 13934 14183 16909 22557 6466 -1846 6516
14062 6516 7286 1294 -3344 -11283 -1572 3471 800 -4447 1912 -1554 -4176 4247 6043 -257 -3379
14047 -3379 -1329 5108 -1121 -11831 -11697 -8140 -12848 -11937 -9387 -5329 -3892 -2062 12984 6800 -6388
$$ packed form
14150a5823m748J029j524L702J6340n766j0234O914R32m856R357P188K342r2J932
14135F693J6480r735j7362j2102K73O82p215J0529K313M501j811o93l959M34Q677
14120b295N78M694O409R433k418m67n138M88M736j336j1518j3718r41m604j2421
14105b8518M25R064Q536m683n245O560J5107j434j131J418p36j428J687j0822
14091a1200J201M125M710l537M781N919k155p023k609j338n955n435J3308j421
14077f629J271m901p045N799R249N371K548M516L755K49K726N648j6091q312Q362
14062F516P70n992m638p939R711N043k671n247O359l466k622Q423J796o300l122
14047c379K050O437o229j0710J34L557m708R11K550M058J437J830J5046o184j3188
$$ plain form
14032 -6388 -3819 -9480 -9657 3656 9585 1794 -8201 -5500 -4931 3571 11723 19090 12796 -748 -3691
14017 -3691 -11272 -1153 -3675 -11497 -13856 -6712 -3425 1492 9010 16613 5808 -12534 -12122 3291
14003 3291 12143 19086 21156 21830 16386 12319 -3783 -6383 -2788 -588 -5251 -861 -369 3875 15905
13988 15905 16528 15854 14580 14422 12879 5983 -3221 4759 4138 -7670 -24931 -18609 -6540 -10321 -13447
13973 -13447 -13560 -15105 -18088 -12445 -9010 -6035 -6698 -9063 -20898 -25548 -15272 -8390 -9924 17
13959 17 10554 24153 23594 21806 14984 7173 2428 -707 9555 19925 12657 7405 -9654 -13895
13945 -13895 -6149 -8956 -7069 -272 305 1642 9040 14820 16327 22829 15813 4282 -4044 -7326
13931 -7326 -12182 -14214 -23482 -22030 -23575 -20769 -3116 -2594 -6134 -1147 4035 -3328 -8147 -9711 -13793
$$ packed form
14032f388K569n661j77J3313N929p791r995K701N69Q502Q152P367o294j3544k943
14017c691p581J0119k522p822k359P144L287M917P518P603j0805j8342M12J5413
14003C291Q852O943K070O74n444m067j6102k600L595K200m663M390M92M244J2030
13988A5905O23o74j274j58j543o896r204P980o21j1808j7261O322J2069l781l126
13973a3447j13j545k983N643L435K975o63k365j1835m650J0276O882j534R941
13959A7J0537J3599n59j788o822p811m745l135J0262J0370p268n252j7059m241
13945a3895P746k807J887O797N77J337P398N780J507O502p016j1531q326l282
13931g326m856k032r268J452j545K806J7653N22l540M987N182p363m819j564m082
$$ plain form
13916 -13793 -5810 -3099 1840 -7168 -16733 -17120 -18547 -10406 -4569 -2424 7839 -1296 -9053 -3796
13902 -3796 2053 -466 11336 4330 -7949 -6824 -4227 -987 699 5522 10754 2610 556 3286
13888 3286 588 4732 -4639 3356 7952 -1250 8664 10052 2262 -11525 -8033 -1544 -6606 -13473
13874 -13473 -13929 -7107 -5377 -8129 -4078 -4593 -11468 -16117 -19570 -15674 -7248 139 -1209 -3929 7692
13859 7692 18540 20509 20429 15583 16310 16877 14972 -24 -11424 -21222 -6420 2892 -1882 -636 15392
13844 15392 22527 18200 5453 -4964 -5849 -4739 -3070 -788 -702 -8983 -4267 1068 -3813 5607 2866
13829 2866 -7663 -14979 -21076 -20540 -321 10199 7279 14839 25605 26415 30359 32653 30609 17347
13815 17347 -308 -5063 -3514 -6075 -16127 -11867 -16091 -13793 -14622 -8663 -12915 2169 3399 -4697
$$ packed form
13916a3793P983K711M939r008r565l87j427Q141N837K145J0263r135p757N257
13902c796N849k519J1802p006j2279J125K597L240J686M823N232q144k054K730
13888C286k698M144r371P995M596r202R914J388p790j3787L492O489n062o867
13874a3473m56O822J730k752M051n15o875m649l453L896Q426P387j348k720J1621
13859G692J0848J969q0m846P27N67j905j4996j1400r798J4802R312m774J246J6028
13844A5392P135m327j2747j0417q85J110J669K282Q6q281M716N335m881R420k741
13829B866j0529p316o097N36K0219J0520k920P560J0766Q10L944K294k044j3262
13815A7347j7655m755J549k561j0052M260m224K298q29N959m252J5084J230q096
$$ plain form
13801 -4697 -1876 -8971 -4952 -4252 -9280 -9228 -8683 -5154 -4475 -4085 -1767 9988 17053 20057 15260 8368
13785 8368 -5895 -9965 -7080 -1279 1472 6120 -2527 -7917 -9144 -10911 -9205 -9093 -7184 -14790 -12538
13770 -12538 -12732 -7001 -4716 -14001 -20693 -26492 -16482 -15045 -12224 -15001 -20556 -18598 -5224 -22934
13756 -22934 -26567 -18716 -14363 -17871 -26945 -26114 -12829 805 11003 7746 -6258 -10146 -946 -1242
13742 -1242 -12945 -15058 -10481 637 905 -730 -2701 5385 1068 -4232 3078 13167 5091 -2136
13728 -2136 1115 14848 18035 643 -10413 -6590 -8843 -11251 5377 13057 -231 -3539 612
13715 612 -3459 -3179 -13007 -9078 -6376 -13054 -13060 -9864 -3133 1280 8434 4258 -605 -6568 -4396 -6901
13699 -6901 -25080 -21544 -19116 -27626 -18445 1698 1336 -2159 -4371 1365 -251 1282 4134 169
$$ packed form
13801d697K821p095M019P00n028N2N45L529O79L90K318J1755P065L004m797o892
13785H368j4263m070K885N801K751M648q647n390j227j767J706J12J909p606K252
13770a2538j94N731K285r285o692n799J0010J437K821k777n555J958J3374j7710
13756b2934l633P851M353l508r074Q31J3285J3634J0198l257j4004l888R200k96
13742a242j1703k113M577J1118K68j635j971Q086m317n300P310J0089q076p227
13728b136L251J3733L187j7392j1056L823k253k408J6628P680j3288l308M151
13715F12m071K80r828L929K702o678oL196O731M413P154m176m863n963K172k505
13699f901j8179L536K428q510R181K0143l62l495k212N736j616J533K852l965
$$ plain form
13685 169 1676 1763 3374 -677 -5001 -11035 -4520 3379 -865 1275 4239 -4545 -8303 -3541 3716
13670 3716 3305 8744 6244 4873 218 -1441 -3010 -8228 -16573 -6812 788 7643 5698 6353 -317
13655 -317 -6296 -13326 -12307 12927 10342 -641 -8250 -8244 167 2577 -5135 -8979 -11491 -1837 -7606
13640 -7606 -11082 -715 2628 -3273 -8920 -4324 -5113 -7480 7839 17355 15857 8011 -9155 -6633
13626 -6633 -14992 -30388 -27163 -17848 -14544 -10840 2845 5056 -1950 -7929 -5685 -6747 -8384 -6353
13612 -6353 -9527 -6953 3494 6822 -1309 -5623 685 -200 2145 -1716 -13513 -10956 -8050 4339
13598 4339 7478 -105 -9776 -11632 -8684 -114 -6957 -12971 -17438 -14876 -18596 -17036 -2784 3368
13584 3368 -3707 -5616 629 -3412 -9684 -928 8146 3951 -2162 1467 5352 -1644 -6090 2824 6332
$$ packed form
13685A69J507Q7J611m051m324o034O515P899m244K140K964q784l758M762P257
13670C716m11N439k500j371m655j659j569n218q345R761P600O855j945O55o670
13655c17n979p030J019K5234k585j0983p609OQ411K410p712l844k512R654n769
13640g606l476J0367L343n901n647M596p89k367J5319R516j498p846j7166K522
13626f633q359j5396L225R315L304L704J3685K211p006n979K244j062j637K031
13612f353l174K574J0447L328q131m314O308q85K345l861j1797K557K906J2389
13598D339L139p583r671j856K948Q570o843o014m467K562l720J560J4252O152
13584C368p075j909O245m041o272Q756R074m195o113L629L885o996m446Q914L508
$$ plain form
13569 6332 -1659 -6620 -14885 -10441 -5253 -2437 885 1843 -2470 -8227 -14692 -8000 2023 9321 11333
13554 11333 18003 14834 5911 -2588 9572 7342 -4921 -12162 -13582 -21986 -26842 -16446 -4379
13541 -4379 -11960 -8819 2203 7566 3224 2920 3463 3695 -2452 -2265 -1974 -4650 -6330 -7245 -9242 -1330
13525 -1330 -2252 -7014 -6438 -6458 -2461 169 7511 6921 1800 2700 12623 11338 10133 8270 8465 9724
13509 9724 14 -3854 -4462 -9622 -10798 -2769 -3278 -6600 445 10443 11239 3223 1616 -8327 -12225
13494 -12225 -2514 7247 21843 21336 25704 11429 6030 5748 9137 8901 7137 -11086 -16429 -9950
13480 -9950 -4576 -5733 -12111 -9633 -6366 -3825 -3133 7656 7793 -1313 3939 14715 11864 1032
13466 1032 10790 16964 4412 -3962 -5501 -8766 -4580 -7401 -11574 -8308 -14598 -16412 2102 7032
$$ packed form
13569F332p991m961q265M444N188K816L322R58m313n757o465O692J0023P298K012
13554A1333O670l169q923q499J2160k230j2263p241j420q404m856J0396J2067
13541d379p581L141J1022N363m342l04N43K32o147J87K91k676j680r15j997P912
13525a330r22m762N76k0L997K630P342n90n121R00R923j285j205j863J95J259
13509I724r710l868o08n160j176Q029n09l322P045R998P96q016j607r943l898
13494a2225R711R761J4596n07M368j4275n399k82L389k36j764j8223n343O479
13480i950N374j157o378K478L267K541O92J0789J37r106N252J0776k851j0832
13466A032R758O174j2552q374j539l265M186k821m173L266o290j814J8514M930
$$ plain form
13452 7032 -2957 2636 -10978 -17565 -8975 -5369 2132 6747 13063 9942 8674 -713 -12034 -14574
13438 -14574 -1409 10093 14535 22615 19062 25115 35122 45927 51950 51453 53239 46957 43905 43481
13424 43481 45949 42660 45443 45592 30365 15578 24094 12658 8607 4420 14223 25191 31790 33180
13410 33180 21362 19360 20229 25439 26360 16749 9883 8441 4982 12787 14203 9034 12617 16525 16161
13395 16161 10657 2833 1260 4649 7890 25497 34833 44194 53508 67550 80679 86026 90382 92920
13381 92920 90948 93829 95770 83919 67756 54355 40213 30272 23617 23272 21766 21808 22473 13538
13367 13538 -2668 -7436 -15282 -13345 -5264 4465 17633 18069 12324 10470 14557 10875 6453 7973
13353 7973 13591 4713 3808 13570 19001 21585 14840 11920 14537 18425 30728 50136 57054 56290 50541
$$ packed form
13452G032r989N593j3614o587Q590L606P501M615O316l121j268r387j1321k540
13438a4574J3165J1502M442Q080l553O053J0007J0805O023m97J786o282l052m24
13424D3481K468l289K783J49j5227j4787Q516j1436m051m187R803J0968O599J390
13410C3180j1818k002Q69N210R21r611o866j442l459P805J416n169L583L908l64
13395A6161n504p824j573L389L241J7607R336R361R314J4042J3129N347M356K538
13381I2920j972K881J941j1851j6163j3401j4142r941o655l45j506M2O65q935
13367A3538j6206m768p846J937Q081R729J3168M36n745j854M087l682m422J520
13353G973N618q878r05R762N431K584o745k920K617L888J2303J9408O918p64n749
$$ plain form
13338 50541 71450 88182 91657 87595 76137 71624 61977 64637 65732 44766 34083 27935 34067
13325 34067 38827 32213 21525 16298 5839 1384 18234 28331 15034 10820 15896 9575 -1411
13312 -1411 8275 16807 9630 -140 -6912 2391 13480 7795 8851 16185 5282 6294 10798 20121
13298 20121 21101 27006 37380 40344 25559 31895 41896 41919 33280 24528 27631 24275 28665 35026
13284 35026 34578 21089 14898 17279 19691 22139 18277 23182 32079 17960 19775 5125 -7038 -12252
13270 -12252 -9202 -9463 -14029 -21878 -28618 -29098 -22413 -17890 -11925 -13950 1086 16740 22391 21508 18657
13255 18657 16694 13118 668 -13679 -7655 6613 12179 12550 15374 15262 9022 10861 16345 10953
13241 10953 3715 11198 14194 11884 16000 13583 4958 -4829 641 16800 29852 27242 22827 25739
$$ packed form
13338E0541K0909J6732L475m062j1458m513r647K660J095k0966j0683o148O132
13325C4067M760o614j0688n227j0459m455J6850J0097j3297m214N076o321j0986
13312a411R686Q532p177r770o772R303J1089n685J056P334j0903J012M504R323
13298B0121R80N905J0374K964j4785O336J0001K3q639q752L103l356M390O361
13284C5026m48j3489o191K381K412K448l862M905Q897j4119J815j4650j2163n214
13270a2252L050k61m566p849o740m80O685M523N965k025J5036J5654N651q83k851
13255A8657j963l576j2450j4347O024J4268N566L71K824j12o240J839N484n392
13241A0953p238P483K996k310M116k417q625r787N470J6159J3052k610m415K912
$$ plain form
13227 25739 20877 9854 8877 17151 5531 -6145 -6547 -10252 -7401 -2907 3450 4123 4548 3714 10965
13212 10965 -3600 -12429 -3517 -309 -4725 -6337 -11285 -6451 -7974 -20993 -22200 -13900 -10776 -3574
13198 -3574 2565 11658 11386 12597 22298 16518 20782 10288 420 -7153 -12353 -7998 -4270 -3861 -1948
13183 -1948 -3562 -4843 -10087 -12613 -17986 -15207 -4733 11066 19781 19502 10241 -2091 -19511 -15128
13169 -15128 -11287 -6671 -8023 -14173 -15540 -16679 -13926 -7523 -11163 -5906 -1267 2131 1519 -4350 272
13154 272 4169 9838 13462 18484 14680 4877 -4227 -14780 -10752 -5436 -9729 -334 -3928 -11589 -14503
13139 -14503 -5357 -7170 -22706 -22986 -22577 -15223 -13894 -14331 -11379 4685 12382 11554 5258 6352 10961
13124 10961 4910 7373 5449 3947 3870 1947 -5266 -13755 -9356 -3804 -1232 8237 5049 -7194 -9304
$$ packed form
13227B5739m862j1023r77Q274j1620j1676m02l705K851M494O357O73M25q34P251
13212A0965j4565q829Q912L208m416j612m948M834j523j3019j207Q300L124P202
13198c574O139R093k72J211R701n780M264j0494r868p573n200M355L728M09J913
13183a948j614j281n244k526n373K779J0474J5799Q715k79r261j2332j7420M383
13169a5128L841M616j352o150j367j139K753O403l640N257M639L398o12n869M622
13154B72L897N669L624N022l804r803r104j0553M028N316m293R395l594p661k914
13139a4503R146j813j5536k80M09P354J329m37K952J6064P697q28o296J094M609
13124A0961o051K463j924j502p7j923p213q489M399N552K572R469l188j2243k110
$$ plain form
13109 -9304 -6809 -9106 -11493 -2817 -8915 -19623 -15896 -9261 513 4313 9700 16384 1844 -3711
13095 -3711 -9132 -12839 -17592 -17497 -8120 -2658 -8441 -2334 -5425 -5752 -2758 -1418 -9429 -11725 -8534
13080 -8534 -5888 -1484 -1770 -5314 -4206 -7617 -5145 1164 -668 -9774 -6548 -10228 -6098 -9945 -7421
13065 -7421 -3621 -2925 -1667 4739 2639 136 8252 5278 -1103 5126 9275 10725 11104 4647 -1924
13050 -1924 -8036 -18216 -21215 -16310 -21613 -17427 -13647 -10539 -19669 -36280 -31874 -27804 -19998 -15416
13036 -15416 -7339 -4195 -10754 -10008 -5893 -3668 -7368 -26743 -31257 -22971 -22146 -21145 -11642 -9661 -3076
13021 -3076 -10424 -5967 6328 13770 16872 10733 4866 5876 -1141 -7204 -6058 -16775 -19171 -13004
13007 -13004 -12785 -19449 -21648 -13804 -3199 -2318 -7616 -13623 -15607 -16980 -14004 -3064 8759 15788
$$ packed form
13109i304K495k297k387Q676o098j0708L727O635R774L800N387O684j4540n555
13095c711n421l707m753R5R377N462n783O107l091l27K994J340q011k296L191
13080h534K646M404k86l544J108l411K472O309j832r106L226l680M130l847K524
13065g421L800O96J258O406k100k503Q116k974o381O229M149J450L79o457o571
13050a924o112j0180k999M905n303M186L780L108r130j6611M406M070P806M582
13036a5416Q077L144o559P46M115K225l700j9375m514Q286Q25J001R503J981O585
13021c076p348M457J2295P442L102o139n867J010p017o063J146j0717k396O167
13007a3004K19o664k199P844J0605Q81n298o007j984j373K976J0940J1823P029
$$ plain form
12993 15788 16086 9666 7382 5108 -9069 -8564 -4632 -15204 -16893 -2867 1044 -7582 4270 3914
12979 3914 7792 3408 -3753 -2484 -3836 -1846 -844 10638 18759 17895 9484 8980 16707 16766 8305
12964 8305 3284 170 4912 7713 10661 6214 7437 24412 25573 22172 17728 23984 14205 4090
12950 4090 6772 -574 -12442 -13843 -10682 -7483 -2488 -10 10740 23518 24742 22965 16945 6224
12936 6224 -5772 -11777 4939 7071 1716 3206 -2450 -2250 4828 2993 9192 13041 16753 -2853
12922 -2853 -8826 -4409 -7593 -10726 -12748 -4825 -3557 -13023 -5313 2220 -3323 -4992 475 -2281 2728
12907 2728 13646 21193 21904 3369 -7306 -6030 -3809 -1404 -9254 -7436 -3075 -5871 -475 -32
12893 -32 8445 15857 8909 -10193 -8406 7508 9497 -8545 -20202 -12017 -7350 -1319 9356 6718
$$ packed form
12993A5788K98o420k284k274j4177N05L932j0572j689J4026L911q626J1852l56
12979C914L878m384p161J269j352J990J002J1482Q121q64q411n04P727N9q461
12964H305n021l114M742K801K948m447J223J6975J161l401m444O256r779j0115
12950D090K682p346j1868j401L161L199M995K478J0750J2778J224j777o020j0721
12936F224j1996o005J6716K132n355J490n656K00P078j835O199L849L712j9606
12922b853n973M417l184l133k022P923J268r466P710P533n543j669N467k756N009
12907B728J0918P547P11j8535j0675J276K221K405p850J818M361k796N396M43
12893c2Q477P412o948j9102J787J5914J989j8042j1657Q185M667O031J0675k638
$$ plain form
12879 6718 -3441 -5794 -9383 -7688 -8564 834 2364 -3026 16998 22401 8315 -9433 -10680 9579
12865 9579 7996 2339 -4867 -8187 -808 -6974 -8937 11193 6998 -7021 -2841 -943 5203 2372
12851 2372 1954 -3489 -1668 2457 -5103 -129 14567 28284 25060 21626 12768 -1043 1896 1176
12837 1176 9574 21007 11024 2443 6462 3593 -13208 -24863 -16054 -7595 -2674 5051 11412 5758
12823 5758 -849 -1571 -6441 -6820 -11265 -11526 -554 14318 19887 25272 20783 16221 11058 14365 6491
12808 6491 5288 2384 -287 -965 3736 9484 15553 11045 5465 -1768 2321 4297 6065 8952 -3333
12793 -3333 -5309 -4630 1772 -1165 -1808 -3645 1976 7401 7910 5132 1512 -2615 1415 -5091 -6557
12778 -6557 -6748 7951 13864 17891 14368 23818 34734 45213 41702 23669 12435 7481 4792 3375
$$ packed form
12879F718j0159k353l589J695q76R398J530n390K0024N403j4086j7748j247K0259
12865I579j583n657p206l320P379o166j963K0130m195j4019M180J898O146k831
12851B372m18n443J821M125p560M974J4696J3717l224l434q858j3811K939p20
12837A176Q398J1433r983q581M019k869j6801j1655Q809Q459M921P725O361n654
12823E758o607p22m870l79m445k61J0972J4872N569N385m489m562n163L307p874
12808F491j203k904k671o78M701N748O069m508n580p233M089J976J768K887j2285
12793c333j976O79O402k937o43j837N621N425N09k778l620m127M030o506j466
12778f557j91J4699N913M027l523R450J0916J0479l511j8033j1234m954k689j417
$$ plain form
12764 3375 999 13157 28170 28706 25870 24441 6231 -6476 -4154 -14187 -10264 -3705 3055 7029
12750 7029 -999 -5384 -9570 -10139 -5661 -1901 -3252 -4154 801 11006 17717 17487 27172 15021 4070
12735 4070 6435 8838 -6641 -9418 -3382 2254 -2551 -3631 -2303 -2201 -8580 1708 5294 280
12721 280 2948 -2897 -10277 -16530 -20986 -18898 -14429 -17966 -12291 -6187 -2456 -8403 -3325 -2301 6349
12706 6349 15032 12537 6706 -17720 -17240 -7862 -2865 696 2348 4499 7544 8691 9371 12554 11202
12691 11202 19067 21121 21664 13171 -321 -6125 2526 400 -4724 -648 624 -7384 -794 9787
12677 9787 8299 -172 -8925 -6652 -5368 -19074 -14661 -5606 -9205 -11172 3442 10433 23715 21159
12663 21159 6030 -2554 8711 12814 12192 13347 31380 21083 12465 1994 -7077 -6588 -4322 2325
$$ packed form
12764C375k376J2158J5013N36k836j429j8210j2707K322j0033L923O559O760L974
12750G029q028m385m186n69M478L760j351r02M955J0205O711k30R685j2151j0951
12735D070K365K403j5479k777O036N636m805j080J328J02o379J0288L586n014
12721B80K668n845p380o253m456K088M469l537N675O104L731n947N078J024Q650
12706F349Q683k495n831k4426M80R378M997L561J652K151L045J147O80L183j352
12691A1202P865K054N43q493j3492n804Q651k126n124M076J272q008O590J0581
12677I787j488q471q753K273J284j3706M413R055l599j967J4614O991J3282k556
12663B1159j5129q584J1265M103o22J155J8033j0297q618j0471r071M89K266O647
$$ plain form
12649 2325 13140 14087 20025 16844 17285 10146 19323 26957 22627 16626 5454 22554 31675 22980
12635 22980 21197 19550 20393 22326 25878 19777 11857 11267 18692 26540 22765 22947 16871 18541 14918
12620 14918 -3924 -8362 466 2264 -4511 -14057 -10170 1185 23414 30463 30518 21664 24307 34695
12606 34695 30882 23823 19789 28136 28494 31495 28538 19192 15102 8490 -403 5850 14207 23265 22743
12591 22743 21378 14016 19019 20528 27672 32954 33214 40487 44629 47093 40778 39986 32911 27018 27034
12576 27034 30005 16957 14870 12545 -1828 -833 2624 444 6650 433 5735 1762 4200 11737
12562 11737 15642 7078 472 7790 19020 17089 12690 9106 6851 15265 16177 14261 7997 801
12548 801 -3961 -1281 15774 16185 14025 17787 14536 20293 16742 15292 8797 -4357 1011 7698 2788
$$ packed form
12649B325J0815R47N938l181M41p139R177P634m330o001j1172J7100R121q695
12635B2980j783j647Q43J933L552o101p920n90P425P848l775J82o076J670l623
12620A4918j8842m438Q828J798o775r546L887J1355K2229P049N5q854K643J0388
12606C4695l813p059m034Q347L58L001k957r346m090o612q893O253Q357R058n22
12591B2743j365p362N003J509P144N282K60P273M142K464o315p92p075n893J6
12576B7034K971j3048k087k325j4373R95L457k180O206o217N302l973K438P537
12562A1737L905q564o606P318J1230j931m399l584k255Q414R12j916o264p196
12548H01m762K680J7055M11k160L762l251N757l551j450o495j3154N368O687m910
$$ plain form
12533 2788 -5218 2209 5866 10800 6722 2849 5900 13068 11865 1908 5510 7051 15388 19424 4549
12518 4549 -13745 -22339 -15244 -9065 -16681 -14408 -5586 -8249 -1673 3061 9363 12600 8953 -3111
12504 -3111 1174 9843 7887 -1184 -13912 -18720 -19394 -14730 -13324 -17156 -20334 -10605 -7137 -11131 -14309
12489 -14309 -21668 -20946 -18983 -14878 -712 827 -3311 1392 2933 -5364 -5826 -4250 1924 21100
12475 21100 33250 29428 18726 14014 -490 -7958 -16596 -18464 -17329 -14146 -4361 1413 4915 4890
12461 4890 5616 13236 5507 -6488 2923 6799 -3678 -9290 -14830 -18321 -23838 -19642 -16076 -18709
12447 -18709 -16964 -5902 -1256 10330 7759 984 -606 -12649 -7903 2606 7647 6754 7388 766
12433 766 -9020 -16581 -15911 -24501 -14932 -10161 -14154 -13949 -14599 -22138 -5837 1315 -7049 -13010 -3394
$$ packed form
12533B788q006P427L657M934m078l873L051P168j203r957L602J541Q337M036j4875
12518D549j8294q594P095O179p616K273Q822k663O576M734O302L237l647j2064
12504c111M285Q669j956r071j2728m808o74M664J406l832l178R729L468l994l178
12489a4309p359P22J963M105J4166J539m138M703J541q297m62J576O174J9176
12475B1100J2150l822j0702m712j4504p468q638j868J135L183R785N774L502k5
12461D890P26P620p729j1995R411L876j0477n612n540l491n517M196L566k633
12447a8709J745J1062M646J1586k571o775j590j2043M746J0509N041q93O34o622
12433G66r786p561O70q590R569M771l993K05o50p539J6301P152q364n961R616
$$ plain form
12418 -3394 -7549 -7162 -8110 -20219 -22880 -23804 -28477 -25846 -15083 -17867 -18789 -16701 -4191 -7565 -9485
12403 -9485 -11096 -3400 6583 16635 15018 6469 2191 1887 4205 9035 7248 1001 4054 12400 23082
12388 23082 35968 25478 13801 12440 6223 2466 1459 12974 13989 2564 -9840 -7692 2132
12375 2132 14383 7436 -2068 -14455 -19801 -13959 -11693 2404 12037 17361 5575 8053 20955
12362 20955 27361 30490 15941 10776 -1759 529 -3094 -2961 2725 12344 16338 626 -2150 2400
12348 2400 4695 10968 12684 11349 12095 19905 23659 19362 1906 -9179 -13500 -22753 -22591 -6941
12334 -6941 6975 15675 15321 7510 -1953 -740 1172 7939 14787 16106 19803 27738 15095 15806 9757
12319 9757 5200 3895 -5536 -18506 -16631 3573 10682 1601 -8775 -6844 -6850 -9914 -21987 -14699
$$ packed form
12418c394m155L87r48j2109k661r24m673K631J0763k784r22K088J2510l374j920
12403i485j611P696R983J0052j617q549m278l04K318M830j787o247L053Q346J0682
12388B3082J2886j0490j1677j361o217l757j007J1515J015j1425j2404K148R824
12375B132J2251o947r504j2387n346N842K266J4097R633N324j1786K478J2902
12362B0955O406L129j4549n165j2535K288l623J33N686R619L994j5712k776M550
12348B400K295O273J716j335P46P810L754m297j7456j1085m321r253J62J5650
12334f941J3916Q700l54p811r463J213J912O767O848J319L697P935j2643P11o049
12319I757m557j305r431j2970J875K0204P109r081j0376J931ol064j2073P288
$$ plain form
12305 -14699 -6255 -10139 -13257 -887 4847 -3882 -4863 -10539 -1325 6409 -912 3917 3973 1245 -11172
12290 -11172 -19295 -9126 722 -5955 -8913 -17192 -10851 -6214 -6874 -5801 -3538 -4075 -5276 2982 10980
12275 10980 10695 16068 18175 5278 -2782 152 -2952 5683 8711 5346 -1269 -11323 -9632 -21608
12261 -21608 -19527 -6254 4357 4554 -6884 -24646 -28364 -19247 -10602 -16629 -23185 -18293 -12297 -9479
12247 -9479 7340 8806 -5406 -7998 -3497 3393 -1570 -9650 -11460 -13886 -15293 -21027 -24404 -9326
12233 -9326 -667 10112 11903 7430 -1819 -573 -8438 -13332 -19825 -184 16529 19633 33421 33543
12219 33543 15176 10081 10349 4596 -11499 -6476 -5938 -6119 -5197 -13918 -11793 -3659 0 -15009 -14341
12204 -14341 -14597 -19065 -16214 -9372 -9297 -14241 -13795 -3589 2751 377 -13887 -13648 -7469 -4102 -10156
$$ packed form
12305a4699Q444l884l118J2370N734q729r81n676R214P734p321M829N6k728j2417
12290a1172q123J0169R848o677k958q279O341M637o60J073K263n37j201Q258P998
12275A0980k85N373K107j2897q060K934l104Q635L028l365o615j0054J691j1976
12261b1608K081J3273J0611J97j1438j7762l718R117Q645o027o556M892N996K818
12247i479J6819J466j4212k592M501O890m963q080j810k426j407n734l377J5078
12233i326Q659J0779J791m473r249J246p865m894o493J9641J6713L104J3788J22
12219C3543j8367n095K68n753j6095N023N38j81R22q721K125Q134L659j5009O68
12204a4341k56m468K851O842P5m944M46J0206O340k374j4264K39O179L367o054
$$ plain form
12189 -10156 -18708 -9434 -1023 8108 16812 1280 -12348 -150 12206 12359 15044 2564 -14445
12176 -14445 -10024 -12667 -6296 -1719 -825 2899 -3797 -5218 -4318 -6420 -4022 -10470 -13757 -12032 -4633
12161 -4633 -3181 -6560 975 1392 -4910 -20585 -19219 -19796 -18707 -21847 -27199 -15202 -8442 -8891 -7460
12146 -7460 -947 6044 11857 11591 -2229 -17353 -14497 -8270 -1400 2013 3203 20198 14500 12130
12132 12130 -3983 -10294 -3712 15345 6653 3304 -9592 -21356 -23090 -21538 -16756 -6530 -3557
12119 -3557 -2035 -15091 -24181 -28385 -26558 -29040 -30453 -31674 -29927 -28667 -25066 -22402 -18014 -10487
12105 -10487 -3040 1046 -4494 -11861 -8381 -805 -6211 -4003 146 -7728 -11951 -7986 -14286 -20097
12091 -20097 -16098 -10991 -9370 -35 2864 -1533 -8766 1008 -9622 -18880 -10667 -5265 -24037 -18724
$$ packed form
12189a0156q552R274Q411R131Q704j5532j3628J2198J2356J53K685j2480j7009
12176a4445M421k643O371M577Q94L724o696j421R00k102K398o448l287J725P399
12161d633J452l379P535M17o302j5675J366n77J089l140n352J1997O760m49J431
12146g460O513O991N813k66j3820j5124K856O227O870L413J190J6995n698k370
12132A2130j6113o311O582J9057q692l349j2896j1764j734J552M782J0226K973
12119c557J522j3056r090m204J827k482j413j221J747J260L601K664M388P527
12105a0487P447M086n540p367L480P576n406K208M149p874m223L965o300n811
12091b0097L999N107J621R335K899m397p233R774j0630r258Q213N402j8772N313
$$ plain form
12077 -18724 -19399 -17558 -15717 -32235 -41397 -36372 -29671 -20748 -8161 -11224 -14836 -7302 -7765 -17870
12063 -17870 -12695 -10519 -24246 -25596 -19325 -1130 8303 7272 4243 1655 -3030 -2771 1872 -330
12049 -330 -4187 -15535 -21858 -6361 -3051 -6195 -12689 -5153 4399 8233 -6075 1882 2581 -13648
12035 -13648 -10450 -7751 -664 -3421 -5669 -1257 -8341 -13328 -15248 -25648 -21734 -17119 -16740 -14021
12021 -14021 -22840 -33259 -30574 -25659 -18302 -17289 -17985 -14676 -22420 -13638 4384 4232 3425 21125
12007 21125 22901 15404 5744 6792 19728 7875 -2462 -9029 -3182 1100 12614 11525 -3020
11994 -3020 -5554 -3254 4739 3237 2440 -438 5310 5756 -4829 -258 9115 -8 -15960 -21547 -19851
11979 -19851 -20783 -10576 -8830 -12211 -19269 -5817 6541 6463 3052 10703 10266 -8934 -13116 -10642
$$ packed form
12077a8724o75J841J841j6518r162N025O701Q923J2587l063l612P534m63j0105
12063a7870N175K176j3727j350O271J8195R433j031l029k588m685K59M643k202
12049c30l857j1348o323J5497L310l144o494P536R552L834j4308P957O99j6229
12035a3648L198K699P087k757k248M412p084m987j920j0400L914M615L79K719
12021a4021q819j0419K685M915P357J013o96L309p744Q782J8022j52q07J7700
12007B1125J776p497r660J048J2936j1853j0337o567N847M282J1514j089j4545
11994c020k534K300P993j502p97k878N748M46j0585M571R373r123j5952n587J696
11979a9851r32J0207J746l381p058J3452J2358p8l411P651m37j9200m182K474
$$ plain form
11965 -10642 -18725 -10720 -227 6391 3188 9383 6372 4685 -1951 -10895 -5777 -9564 3910 6008
11951 6008 7981 4980 13983 13585 6003 -626 -10660 -7615 1687 -15368 -11525 3519 7451 1804
11937 1804 -511 5638 8585 7047 4748 5881 -3145 -7098 -807 -1278 -2783 4041 1604 -854 -7271
11922 -7271 -7143 -2715 -9498 -20636 -14724 -18301 -15569 -15133 -18801 -15291 -11352 -10959 -12742 -5902 -7375
11907 -7375 -15396 -8029 -5686 -4359 -6256 -79 -6164 -3278 -3195 -8893 -14828 -27302 -35223 -31580 -21646
11892 -21646 -15975 -2797 514 9376 15163 8431 -2824 1356 4651 -1212 -707 -7785 -6947 -7497 -3626
11877 -3626 -5174 -14641 -23077 -21434 -12964 -10506 -12559 -24232 -14446 -9116 1937 6092 -3492 -12252
11863 -12252 -2838 3117 -12322 -17253 -10316 -188 1100 -11374 -5907 2438 2140 -7903 -3776 3110
$$ packed form
11965a0642q083Q005J0493O618l203O195l011j687o636q944N118l787J3474K098
11951F008J973l001R003l98p582o629j0034L045R302j7055L843J5044L932n647
11937A804k315O149K947j538k299J133r026l953O291m71j505O824k437k458o417
11922g271J28M428o783j1138N912l577K732M36l668L510L939L93j783O840j473
11907g375q021P367K343J327j897O177o085K886Q3n698n935j2474p921L643R934
11892b1646N671J3178L311Q862N787o732j1255M180L295n863N05p078Q38n50L871
11877c626j548r467q436J643Q470K458k053j1673R786N330J1053M155r584q760
11863a2252R414N955j5439m931O937J0128J288j2474N467Q345k98j0043M127O886
$$ plain form
11849 3110 -8765 -21072 -10179 -7075 -8037 -13876 -8332 -11916 -13294 -3654 5189 11525 13792 8817
11835 8817 8244 -2128 -11098 -17166 -7087 -158 -676 -2808 -10896 -4769 10599 8484 9964 8399
11821 8399 12720 12356 13787 7642 -1051 -8087 -16249 -20980 -9720 -9695 512 1190 7035 -162 -7025
11806 -7025 -15717 -28531 -32809 -28343 -30784 -31386 -22910 -32850 -33787 -28131 -14785 -11658 -8177 7351
11792 7351 6046 -4853 801 -744 -7602 -5186 7205 5877 -4917 5521 13255 20767 28071 18159
11778 18159 12263 7354 3319 2203 -3524 -11380 -8002 -6195 -9544 -10702 -21110 -23070 -33511 -32684
11764 -32684 -30148 -21060 -21443 -23014 -16113 -22156 -16270 -2523 -434 -1327 3467 -6999 -24543 -30623
11750 -30623 -27037 -16733 -6875 -18078 -25986 -22390 -20959 -26353 -25674 -8903 -4493 -14080 -25343 -22432
$$ packed form
11849C110j1875j2307J0893L104r62n839N544l584j378R640Q843O336K267m975
11835H817n73j0372q970o068J0079O929n18k132q088O127J5368k115J480j565
11821H399M321l64J431o145q693p036q162m731J1260K5J0207O78N845p197o863
11806g025q692j2814m278M466k441o02Q476r940r37N656J3346L127L481J5528
11792G351j305j0899N654j545o858K416J2391j328j0794J0438P734P512P304r912
11778A8159n896m909m035j116n727p856L378J807l349j158j0408j960j0441Q27
11764c2684K536R088l83j571O901o043N886J3747K089q93M794j0466j7544o080
11750c0623L586J0304R858j1203p908L596J431n394O79J6771M410r587j1263K911
$$ plain form
11736 -22432 -21630 -18417 -2653 7071 -101 2976 2399 -4863 -9185 -4328 2110 2201 5716 9021 7103
11721 7103 3877 7854 9950 7209 2057 -3113 -4083 1569 -4782 -21830 -23836 -23612 -25744 -23946 -21236
11706 -21236 -30546 -26662 -18021 -7691 -7664 -3577 742 1427 -6268 -18019 -12444 -759 -464 -11203
11692 -11203 -18525 -22475 -20036 -16207 -19284 -24938 -17274 -5701 -6257 1586 16035 15088 4540 -14003
11678 -14003 -22859 -14071 1004 -4872 -18929 -21399 -10032 -3648 3356 -3538 -12026 -11181 -5829 1930
11664 1930 518 94 3446 8626 -4296 -15297 -14573 -10743 -9990 -9243 -2514 -786 -2399 1460 10256
11649 10256 9583 5376 -77 -4136 1326 3149 -3219 -10846 -14168 -20173 -19820 -23069 -28258 -27331 -24006
$$ packed form
11736b2432Q02L213J5764R724p172L077n77p262m322M857O438R1L515L305j918
11721G103l226L977K096k741n152n170r70N652o351j7048k006K24k132J798K710
11706b1236r310L884Q641J0330K7M087M319O85p695j1751N575J1685K95j0739
11692a1203p322l950K439L829l077n654P664J1573n56P843J4449r47j0548j8543
11678a4003q856Q788J5075n876j4057k470J1367O384P004o894q488Q45N352P759
11664A930j412m24L352N180j2922j1001P24L830P53P47O729J728j613L859Q796
11649A0256o73m207n453m059N462J823o368p627l322o005L53l249n189R27L325
$$ [...]
##END NTUPLES=NMR SPECTRUM
##END=
