##TITLE=Analysis number 328775
Compound Code cc 54208
Book Reference 518/139
Project Code adrs
Chemist Name colinb
##JCAMPDX= 6.0         $$ Bruker NMR JCAMP-DX V2.0
##DATA TYPE= NMR SPECTRUM
##DATA CLASS= NTUPLES
##ORIGIN= Bruker BioSpin GmbH
##OWNER= nmr
$$ XWIN-NMR		Version 3.5
$$ Tue Jul  3 12:17:19 2007 GMT Daylight Time (UT+1h)  MAYBRIDGE\nmr@NMR_250MHZ
##.OBSERVE FREQUENCY= 250.131544655141
##.OBSERVE NUCLEUS= ^1H
##.ACQUISITION MODE= SIMULTANEOUS (DQD)
##.ACQUISITION SCHEME= undefined
##.AVERAGES= 16
##.DIGITISER RES= 18
##SPECTROMETER/DATA SYSTEM= dpx250
##.PULSE SEQUENCE= zg30
##.SOLVENT NAME= CDCl3
##.SHIFT REFERENCE= (INTERNAL, CDCl3, 0, 16.522)
##AUDIT TRAIL= $$ (NUMBER, WHEN, WHO, WHERE, WHAT)
$$ ##TITLE= Audit trail, XWIN-NMR		Version 3.5
$$ ##JCAMPDX= 5.01
$$ ##ORIGIN= Bruker BioSpin GmbH
$$ ##OWNER= nmr
$$ C:\u/data/dgb/nmr/ADRS/220/pdata/1/auditp.txt
$$ ##AUDIT TRAIL=  $$ (NUMBER, WHEN, WHO, WHERE, WHAT)
(   1,<2007-07-03 12:16:48.84 +100>,<MAYBRIDGE\nmr>,<NMR_250MHZ>,
      <created by zg, POWCHK disabled, PULCHK disabled
       configuration hash MD5:
       76 6E 9A 78 1E 09 19 81 EC 84 63 8F B0 6A 59 2D
       data hash MD5: 64K
       CF E5 B2 F9 27 8F 43 95 6E DB 64 74 CC D2 DB 77>)
(   2,<2007-07-03 12:17:08.31 +100>,<MAYBRIDGE\nmr>,<NMR_250MHZ>,
      <Start of raw data processing
       ef LB = 0.3 FT_mod = 6 PKNL = 1 SI = 32K 
       data hash MD5: 32K
       BD 7A 25 B0 5F C4 D4 68 CE E1 D7 52 A2 2B 18 6E>)
(   3,<2007-07-03 12:17:10.14 +100>,<MAYBRIDGE\nmr>,<NMR_250MHZ>,
      <apk 
       data hash MD5: 32K
       A3 9C A9 95 FD 80 F1 31 81 18 36 48 BA 10 0B 30>)
(   4,<2007-07-03 12:17:10.83 +100>,<MAYBRIDGE\nmr>,<NMR_250MHZ>,
      <abs ABSG = 5 
       data hash MD5: 32K
       55 91 15 43 5A 11 95 D6 CA 8D A8 24 5A E6 3E 84>)
$$ ##END=
$$ 
$$ hash MD5
$$ B2 22 B8 36 C1 19 F5 E1 76 AA D0 6A D9 36 F2 A0
##$RELAX= 
##$RELAX= 
##$RELAX= 
##$RELAX= 
##$RELAX= 
##$RELAX= 
##$RELAX= 
$$ Bruker specific parameters
$$ --------------------------
##$DU= <C:\u>
##$EXPNO= 220
##$NAME= <ADRS>
##$PROCNO= 1
##$TYPE= <nmr>
##$USER= <dgb>
##$AMP= (0..31)
100 100 100 100 100 100 100 100 100 100 100 100 100 100 100 100 100 100 
100 100 100 100 100 100 100 100 100 100 100 100 100 100 
##$AQSEQ= 0
##$AQ_mod= 3
##$AUNM= <au_zg>
##$AUTOPOS= <25 >
##$BF1= 250.13
##$BF2= 250.13
##$BF3= 250.13
##$BF4= 250.13
##$BF5= 500.13
##$BF6= 500.13
##$BF7= 500.13
##$BF8= 500.13
##$BYTORDA= 1
##$CFDGTYP= 0
##$CFRGTYP= 5
##$CHEMSTR= <none>
##$CNST= (0..31)
1 1 145 1 1 1 1 1 1 1 1 1 1 1 1 1 1 1 1 1 1 1 1 1 1 1 1 1 1 1 1 1 
##$CPDPRG= <>
##$CPDPRG1= <>
##$CPDPRG2= <>
##$CPDPRG3= <>
##$CPDPRG4= <mlev>
##$CPDPRG5= <mlev>
##$CPDPRG6= <mlev>
##$CPDPRG7= <mlev>
##$CPDPRG8= <mlev>
##$CPDPRGB= <>
##$CPDPRGT= <>
##$D= (0..31)
0 1 0 0 0 0 0 0 0 0.06 0 0 0 0 0 0 0.0002 0 0 0 0 0 0 0 0 0 0 0 0 0 0 
0 
##$DATE= 1183461406
##$DBL= (0..7)
120 120 120 120 120 120 120 120 
##$DBP= (0..7)
150 150 150 150 150 150 150 150 
##$DBP07= 0
##$DBPNAM0= <>
##$DBPNAM1= <>
$$ [...]
##$SUBNAM7= <"">
##$SUBNAM8= <"">
##$SUBNAM9= <"">
##$SW= 20.6930455092707
##$SWIBOX= (0..15)
0 0 3 0 0 0 0 0 0 0 0 0 0 0 0 0 
##$SW_h= 5175.983436853
##$TD= 65536
##$TD0= 1
##$TE= 296.16
##$TE2= 300
##$TE3= 300
##$TEG= 300
##$TL= (0..7)
0 120 120 120 120 120 120 120 
##$TP= (0..7)
150 150 150 150 150 150 150 150 
##$TP07= 0
##$TPNAME0= <>
##$TPNAME1= <>
##$TPNAME2= <>
##$TPNAME3= <>
##$TPNAME4= <>
##$TPNAME5= <>
##$TPNAME6= <>
##$TPNAME7= <>
##$TPOAL= (0..7)
0.5 0.5 0.5 0.5 0.5 0.5 0.5 0.5 
##$TPOFFS= (0..7)
0 0 0 0 0 0 0 0 
##$TUNHIN= 0
##$TUNHOUT= 0
##$TUNXOUT= 0
##$USERA1= <user>
##$USERA2= <user>
##$USERA3= <user>
##$USERA4= <user>
##$USERA5= <user>
##$V9= 5
##$VALIST= <valist>
##$VCLIST= <CCCCCCCCCCCCCCC>
##$VD= 0
##$VDLIST= <DDDDDDDDDDDDDDD>
##$VPLIST= <PPPPPPPPPPPPPPP>
##$VTLIST= <TTTTTTTTTTTTTTT>
##$WBST= 1024
##$WBSW= 4
##$XGAIN= (0..3)
0 0 0 0 
##$XL= 0
##$YL= 0
##$YMAX_a= 405875
##$YMIN_a= -391619
##$ZGOPTNS= <>
##$ZL1= 120
##$ZL2= 120
##$ZL3= 120
##$ZL4= 120
##$ABSF1= 16.522
##$ABSF2= -4.171173
##$ABSG= 5
##$ABSL= 3
##$ALPHA= 0
##$AQORDER= 0
##$ASSFAC= 0
##$ASSFACI= 0
##$ASSFACX= 0
##$ASSWID= 0
##$AUNMP= <proc_1d>
##$AZFE= 0.1
##$AZFW= 0.1
##$BCFW= 0
##$BC_mod= 0
##$BYTORDP= 0
##$COROFFS= 0
##$CY= 12.5
##$DATMOD= 1
##$DC= 0
##$DFILT= <>
##$DTYPP= 0
##$F1P= 14.0000005364418
##$F2P= -0.99999901652339
##$FCOR= 0.5
##$FTSIZE= 32768
##$FT_mod= 6
##$GAMMA= 0
##$GB= 0
##$INTBC= 1
##$INTSCL= 1
##$ISEN= 128
##$LB= 0.3
##$LEV0= 0
##$LPBIN= 0
##$MAXI= 10000
##$MC2= 0
##$MEAN= 0
##$ME_mod= 0
##$MI= 0
##$NCOEF= 0
##$NC_proc= -2
##$NLEV= 6
##$NOISF1= 0
##$NOISF2= 0
##$NSP= 0
##$NTH_PI= 0
##$NZP= 0
##$OFFSET= 16.522
##$PC= 1
##$PHC0= -49.96327
##$PHC1= 5.968187
##$PH_mod= 1
##$PKNL= yes
##$PPARMOD= 0
##$PSCAL= 4
##$PSIGN= 0
##$REVERSE= no
##$SF= 250.13
##$SI= 32768
##$SIGF1= 0
##$SIGF2= 0
##$SINO= 400
##$SIOLD= 32768
##$SREGLST= <1H.CDCl3>
##$SSB= 0
##$STSI= 32768
##$STSR= 0
##$SW_p= 5175.98343685301
##$SYMM= 0
##$S_DEV= 0
##$TDeff= 65536
##$TDoff= 0
##$TI= <Analysis number 999999
Compound Code 99
Book Reference 9
Project Code 9>
##$TILT= no
##$TM1= 0
##$TM2= 0
##$TOPLEV= 0
##$USERP1= <user>
##$USERP2= <user>
##$USERP3= <user>
##$USERP4= <user>
##$USERP5= <user>
##$WDW= 1
##$XDIM= 32768
##$YMAX_p= 309296967
##$YMIN_p= -29728
$$ End of Bruker specific parameters
$$ ---------------------------------
##NTUPLES= NMR SPECTRUM
##VAR_NAME=  FREQUENCY,     SPECTRUM/REAL,   SPECTRUM/IMAG
##SYMBOL=    X,             R,               I
##VAR_TYPE=  INDEPENDENT,   DEPENDENT,       DEPENDENT
##VAR_FORM=  AFFN,          ASDF,            ASDF
##VAR_DIM=   32768,         32768,           32768
##UNITS=     HZ,            ARBITRARY UNITS, ARBITRARY UNITS
##FACTOR=    0.157963299565203, 1,           1
##FIRST=     4132.6476996994, 0,             0
##LAST=      -1043.33573715361, 0,           0
##MIN=       -1043.33573715361, -29728,      0
##MAX=       4132.6476996994, 309296967,     0
$$ Real data points
##PAGE= N=1
##DATA TABLE= (X++(R..R)), XYDATA
$$ [...]
25445 -3140 -6161 -3408 -5208 -961 5783 348 1358 4818 12223 16567 6223 4676 1530 867 202
25430 202 -1405 8335 3463 -636 -2005 -5702 -9063 -12210 -11254 -6123 -9836 -4935 -2867 -176 7438
25415 7438 6671 2153 -1693 -6854 401 1866 -4912 -8362 -7060 905 2500 -512 -3855 -2822 7042
25400 7042 5278 5011 5334 2764 3846 6134 2803 4594 -1180 -2766 -9061 -3829 -2957 969 233 110
25384 110 -3299 -7368 -5454 -4532 -3167 -3710 -8821 -8617 -7985 -975 -517 -35 -608 1459 -6403 -12921 -8242
25367 -8242 -8479 -7029 -9047 -6150 -10351 -6456 -9487 -7687 -1403 -3698 -2961 115 6241 2736 -7311
25352 -7311 -5346 -2989 -974 -3904 -7448 -9688 -8943 -4994 -5597 -4030 -446 -1023 108 2721 6790
25337 6790 5774 3852 2223 2085 688 3149 5719 4181 -4467 -5432 -1789 -1060 2792 -736 2468
25322 2468 2160 -412 -1665 -3184 -2621 8345 10584 1857 2241 -66 240 -555 1938 4184 -1183 -2253
25306 -2253 -7775 -8409 -10897 -16882 -6867 -322 -4153 -5159 804 9913 9915 6050 13133 17346 20141
25291 20141 17225 10414 11754 16538 16061 10943 7119 -6132 -8311 -2572 -3753 -6307 -4470 1146
25277 1146 6019 9293 6855 12768 13289 8929 4070 1303 6034 3771 1733 2476 832 1968 -1605
25262 -1605 -2612 -5791 -2366 -446 -593 -1716 -2736 -8228 -6359 -6635 -7851 -6631 -886 -553 1366
25247 1366 -1355 -4637 -7219 -7312 -5528 -7253 -744 5509 8132 6423 2352 798 3843 -2777 -5744
25232 -5744 -5105 -2417 1079 0 -4215 1558 1158 -757 -2346 -7038 -3320 -420 1566 -1757 -1486
25217 -1486 -458 -2654 -8974 -4955 -257 -1887 -2058 -5125 -7469 -12159 -6084 868 -2917 -2067 3631
25202 3631 4286 -108 -1908 -9643 -6254 -1456 -1646 -425 -4039 -7571 -3196 -5591 -7645 -14094 -12332
25187 -12332 -8126 -3873 -5893 -7787 -5971 -4123 -5378 -11605 -13395 -6994 -1105 -475 -2841 -6280 -7693
25172 -7693 -3780 -4932 -13002 -8875 -2904 -2181 -3477 -5945 -7750 -2331 -3886 -4356 3138 13202 16270
25157 16270 17678 16278 10613 6808 6758 7286 985 -1123 1422 7706 6127 -407 -959 2702 4450
25142 4450 2016 -5660 -11796 -6684 -3506 -7936 -4339 5097 11848 12478 6689 5700 5628 1417 -1807 1996
25126 1996 -8411 -12205 -9979 -2654 5276 -1342 -3854 -1473 -525 -3781 -6803 -2359 1940 8907 6181
25111 6181 -260 -4237 -11202 -14546 -18214 -15950 -11409 -4046 -7275 -10007 -12550 -11329 -14583 -6104 -606
25096 -606 1407 -233 1407 4478 7561 7377 5758 586 -1229 -5616 -6492 -1538 -3478 -4094 -96 3734
25080 3734 1163 -3763 -2681 -2004 -5468 -6128 -3823 -4937 -1889 651 -2261 -7008 -10579 -12219 -7218
25065 -7218 -9319 -10887 -14254 -8962 -481 2384 -3751 2239 12819 16968 17647 13362 1302 -1096
25051 -1096 -379 -986 69 -5749 -22 10301 10544 3458 -2024 -7428 -7454 -8004 -3556 1853 6816 4608
25035 4608 4402 -865 -7842 -1888 6104 2798 -753 3422 8050 15000 8397 3902 3482 3300 4064 6723
25019 6723 4060 -3696 -5089 -1057 4915 3043 2727 3280 6864 11262 5680 -2889 -3670 -5247 -3374
25004 -3374 2272 1752 -6239 -6225 1614 -396 -5576 -6552 -8443 -6504 -2911 -5704 -7561 -2666 -3630 231
24988 231 -1529 -2758 -2819 -2324 -2242 2516 199 -82 2127 -3230 -8489 -11180 12 3462 -1603 2099
24972 2099 966 982 -3533 -5288 -4429 -2316 -492 5376 9032 6705 1369 -1971 -570 -2493 -5535
24957 -5535 1337 4584 -1662 2930 1907 1519 5394 5035 1325 -1761 -2098 -318 256 606 1147 10658
24941 10658 12673 6987 9053 2701 -562 2793 5256 8515 10429 7664 7771 2776 3102 2127 -3142
24926 -3142 -5436 -834 1716 -1036 -4031 -4937 -2966 6106 5628 6260 5640 4979 5452 3431 2129 2361
24910 2361 2070 -1113 -1600 -274 -2927 -3528 -4497 -533 8076 14562 4900 -3080 1710 5596 6153 4382
24894 4382 306 9214 8279 4203 6169 10198 6934 6488 4253 -24 -4786 -2881 -2028 -1249 2773 -9
24878 -9 -594 3735 -357 -1475 3961 7851 5098 3714 -4902 -4807 -1030 -2344 -137 2351 5562 5901
24862 5901 -2837 926 11237 17321 14144 18475 20449 16700 6791 5156 9828 18849 13382 7875
24848 7875 13143 13908 8926 4094 6501 9987 4696 4508 12421 6423 10015 18388 14586 4888 -735
24833 -735 -425 -4422 -6143 -2616 -2639 -4289 -10382 -12981 -9034 -9083 -1918 3962 10823 16384 12644 13654
24817 13654 16690 15019 10478 -786 -7449 -5113 -6357 -5960 648 11269 6249 -2258 -8984 -7913
24803 -7913 -9573 -6203 -5158 -8955 -1328 404 1265 3798 -1593 -1925 6951 8837 7463 910 -439
24788 -439 4556 6502 8398 4512 409 -2490 -10893 -16323 -10199 -10393 -5881 184 -274 -4153 -4525 -7499
24772 -7499 -8241 -5380 -4953 -6380 -2700 4219 -834 -2328 187 5504 5332 4848 3782 5158 4607 2723
24756 2723 -450 -4986 1981 7327 7148 2916 -3589 -13235 -9874 -9629 -4509 3266 10151 13293 9543
24741 9543 12091 11352 -5079 -11742 -11211 -2846 -1735 -7413 -6791 -4660 -5214 -7352 -868 3322 -4669
24726 -4669 -7479 -2531 5226 -894 -1090 -2696 -4622 -3768 -1049 -3271 -6941 -1601 3302 -854 -3319
24711 -3319 -828 2540 6577 5217 963 -2084 -8195 -4802 -969 -1504 -1617 2110 5775 1697 7058
24696 7058 9662 10334 6541 5208 2319 -4881 -820 9096 17892 16971 11210 6883 8467 6756 1272
24681 1272 3367 3933 2061 -566 -5296 -9215 -6539 1542 8491 9715 9404 6217 8645 11733 8682
24666 8682 2987 3294 -1127 -2594 -6478 -12605 -9600 -9091 -5563 -3092 1689 3232 -4813 -11838 -3087
24651 -3087 2901 151 -1393 -3468 -11647 -9160 -4149 -6661 -14608 -10195 -40 584 -3939 -3772 2243
24636 2243 3940 2983 -972 2087 4705 10965 10563 3244 -5414 -5588 -2951 -1106 -6192 -7624 -5870
24621 -5870 -6419 -13326 -9498 -5251 209 9889 10118 146 878 3912 -1354 -1350 -7757 -12488 -6824 -7943
24605 -7943 -9248 -16399 -18905 -19653 -19736 -8414 149 -1807 4153 1691 -2840 -7755 -6988 -8869 -6201
24590 -6201 -8064 -10544 -7558 2651 4632 3998 6163 3558 3857 1356 3150 3866 5949 -2813 -6044
24575 -6044 -5075 -735 5906 -889 -6795 -705 795 -1526 -3451 -6130 -5654 -929 -1544 -38 5920
24560 5920 8895 11754 16138 12479 3023 -858 -4800 -8880 -5428 -4294 -2034 1568 6167 2336 4660
24545 4660 2378 3150 9906 9689 -483 -5159 -10564 -3724 -1092 -7194 -12987 -9709 578 7080 8239
24530 8239 4648 8924 6296 5288 620 -4097 -1251 3608 3022 2192 -1629 -3180 -2555 -1022 475
24515 475 -6608 -8347 -7603 996 2900 -117 2832 5153 9187 15061 14780 15041 8213 8692 10423 9082
24499 9082 4317 5621 11330 15487 10030 2927 -2021 -3311 -7170 -4497 -3750 -3216 4412 5151 7957
24484 7957 6095 -806 -134 2249 1787 1618 4763 932 -4383 -3239 4208 3091 4707 7966 5247
24469 5247 -1587 -722 2310 -183 -1826 -2069 -5976 -3892 -1889 -4649 -5816 -4192 -6805 -5864 -2177
24454 -2177 280 5298 1341 -1171 -6567 -11764 -7306 -2788 -1702 -633 1116 2296 7724 10752 13036
24439 13036 7424 2038 4378 5536 -626 -4716 -5917 -4276 -3053 -2548 793 10126 18202 19606 13450
24424 13450 10495 10587 2379 -4910 -13335 -12153 -16084 -14693 -12050 -7208 -8334 -9187 -2054 9071 6031
24409 6031 1498 -1779 755 836 1069 2248 2057 -3984 -7471 -2190 -1700 -125 5047 12706 13093 10358
24393 10358 -2694 -6467 -324 5028 8703 6911 -2009 -5123 -3382 -2477 -5788 -4857 3011 -2115 2443
24378 2443 7711 846 1111 4079 5794 -606 -2465 -1967 -566 -2133 -1044 -4021 -6394 3980 8555
24363 8555 8586 11674 11622 2269 -9340 -17117 -14803 -8802 -6259 -3820 4606 11325 13585 15587 12410
24348 12410 11480 6424 5686 5481 3206 4043 -1717 2332 7522 12650 3984 -7962 -15116 -9609 -2376
24333 -2376 279 -3155 -1321 -9804 -7673 -4337 -5273 1134 2944 5268 -2360 3888 7747 2834 316
24318 316 -2107 7817 5685 164 -1748 -137 667 -3685 -6785 -5271 2721 3213 2348 -6273 -2596 7154
24302 7154 9118 899 3173 10490 5242 -3970 -9254 -11642 -11815 -1880 -4550 -3085 1188 4789 3002
24287 3002 1074 -2291 -1203 -2672 -489 4114 6098 8553 12004 8040 4934 1073 -2538 -5059 -6071
24272 -6071 131 1509 4497 3319 2909 -583 2626 3626 -371 2349 10822 17476 13648 615 -2836
24257 -2836 -4917 -2722 7334 8310 2723 -2 -4398 180 9328 11923 8207 3394 -3788 1235 3729
24242 3729 6988 -1736 1102 6582 10086 9937 1047 -3758 -2651 2044 8318 5222 6125 8840 7856
24227 7856 10066 5293 -2943 -655 7898 10072 7707 4993 -5158 -4545 -1452 -3511 -4960 -9408 -6607
24212 -6607 -2725 -6988 -16323 -20886 -17468 -9312 -7214 -4454 -2333 -2173 4308 5716 3039 10653 6919
24197 6919 5099 971 2587 3511 1554 1780 1671 -1158 -1960 2668 4724 8221 1667 2983 9298 6128
24181 6128 -108 1329 -1744 -2355 -2716 -1926 1948 9804 13216 10142 13687 17098 17720 16664 11580 -762
24165 -762 -1877 -2806 -3870 -808 -2089 -8577 -9883 -13780 -10490 -1305 -2359 -5856 -1068 904 4996
24150 4996 9716 4600 -2626 -13704 -16808 -10895 -8534 -2350 3394 7832 16154 14009 11071 14720
24136 14720 13561 14540 11927 11852 9743 8115 5833 695 4374 1451 6253 7498 7264 1403 -5304
24121 -5304 -7287 -1504 5052 9980 2878 1987 -4422 -3138 4078 7572 4906 6657 3586 5576 358
24106 358 -1135 3033 -1055 -4060 -1834 -5328 1676 4481 360 -1540 -455 -1180 -3003 -8812 -11609
24091 -11609 -9334 -6858 -6558 -2249 3213 6270 7115 -1833 -6517 -9444 -9733 -4379 226 4299 6531
24076 6531 7331 3437 -2747 -2711 -878 1032 -5317 -8429 -7935 -9785 -7211 -6216 -6339 -2944 2508 1409
24060 1409 -4936 2020 3050 1827 -356 -3353 -3168 -3581 -7356 -9576 -4216 -724 4295 6420 2608
24045 2608 -1560 -5468 -1804 -5039 -6048 -1298 6410 8775 7111 2067 1462 8190 9706 5565 128
24030 128 665 1789 -1899 -6106 -14986 -10664 -3631 -2346 -3703 -5719 -4831 -1752 2225 5703 6841
24015 6841 744 2926 -2453 2123 -354 -4670 -3296 2086 2298 12743 14139 9398 10710 10438 9376
24000 9376 -738 -1114 -135 -821 1230 -2180 -3197 -7347 -8431 -6627 -422 -2058 -3700 -3297 -1640
23985 -1640 224 -1109 -1061 -977 3105 2393 -3220 -198 571 -4300 -6838 -4519 -5249 -11249 -8872 -3222
23969 -3222 -5461 -2297 7288 8867 7018 2455 5757 9613 13447 12986 9548 3343 -5672 -5257 -4055
23954 -4055 -3171 1332 4082 3431 1469 1825 725 1540 1421 -152 2752 10264 13447 3642 -3782 -1292
23938 -1292 1128 3830 2009 -4033 -8839 -1162 9558 15697 12697 -217 -8072 -5633 3660 4626
23924 4626 2852 3137 4635 7443 6087 4480 3676 -1990 -7735 -6907 -299 -226 -2608 2993 5948 4818
23908 4818 -1548 -1275 -8359 -9078 -6890 -4395 -5239 -10631 -6902 -1983 -2544 -2991 -4292 448 8587 14608
23892 14608 20275 18518 5172 -8290 -6798 -12631 -12246 -10502 -9656 -7413 -11712 -13862 -15224 -6034
23878 -6034 -3437 -1394 3015 -2861 -6169 -2499 -1231 -1055 3968 4409 6128 4215 3654 -1878 -3788
23863 -3788 1361 -76 894 826 -2053 -2401 -109 5379 9167 4796 285 -3259 -6617 -7775 -5357 4784
23847 4784 4752 4476 6720 6947 8113 4808 3144 -682 -906 -3196 -4166 -9281 -10937 -11875 -8297 -3476
23831 -3476 -7796 -6625 4490 -2178 -6098 -1186 -554 577 7901 9448 7232 2444 -3246 -3456 -390
23816 -390 -4218 -5863 -20822 -17689 -4606 1736 2652 2065 4729 9365 2413 5322 3111 2603 197
23801 197 -1096 3692 434 -7180 -4186 4274 10972 6167 3090 4605 4747 6903 3250 -1962 3524
23786 3524 7613 4574 -4010 -7553 -9417 -9546 -5546 -5204 -7980 -11311 -10979 -9878 -10152 -8731 -2336 1047
23770 1047 2197 3032 8718 6672 3899 651 -2084 3687 1718 9860 14507 8304 2519 3572 -2366
23755 -2366 -2290 -3076 -3461 1766 1143 -2940 -8523 -10742 -15857 -11702 -11511 -7125 -2242 959 1301 -708
23739 -708 886 112 -3436 1337 7259 -2217 -11143 -13296 -13829 -5512 -8036 -5914 1090 -63 -1740
23724 -1740 -4370 -4576 -130 -1286 3672 -1578 -4521 -5913 -4832 541 1024 -2426 -1251 -6470 -9606
23709 -9606 -10391 -12859 -14235 -9409 -7095 -7183 603 46 -6654 -9269 -10412 -10092 -7813 -1419 1806 5217
23693 5217 5305 546 1377 917 -4916 -5394 -13007 -13262 -8844 -5049 1953 1752 6802 6774 -1786 -5279 -4355
23676 -4355 -65 3525 5575 8554 14537 11233 6328 3949 6131 7783 10648 9713 1189 -6979 -1202
23661 -1202 8464 10865 5317 2848 -1072 -2279 -679 -7265 -4725 -5213 -13955 -15591 -7423 5298 3685
23646 3685 -2896 6325 6181 5587 8674 9258 3988 639 5446 11177 16140 11857 3298 -746 -1104 4707
23630 4707 8706 2111 -1675 3799 6340 10648 14641 12107 13859 2627 -7715 -10559 -430 5239
23616 5239 6754 11811 6642 -819 1382 3831 3060 -372 -4884 -2305 1857 8454 12224 8727 9143
23601 9143 3625 -4997 -7260 -9062 -9207 -2522 3110 3971 6300 5595 5411 6469 9300 8967 6782 6124
23585 6124 8279 12330 12702 5811 3224 838 4190 8164 6404 5300 375 5926 2269 4967 10394
23570 10394 8274 6770 6148 6317 11243 7005 7779 3526 4329 4632 5968 2245 1123 -3806 -243 8297
23554 8297 16255 15263 13646 12179 14705 7342 1853 3164 8968 11766 14699 14082 6751 6563 3944
23539 3944 3009 -1594 -5407 -3958 740 -435 -4557 -5737 -4898 -1408 1011 5528 8972 2449 -2953
23524 -2953 -8449 -7414 -7669 -8894 -11416 -12034 -4323 -64 7959 10396 3848 2253 1425 -2522 -6759
23509 -6759 -7619 -6935 2345 3755 1733 -2100 -3594 -8192 -1243 6662 4763 2934 541 -36 -1799
23494 -1799 2785 3795 5289 3128 6133 8253 8425 8144 8478 2277 -103 -2999 -1362 1035 4009
23479 4009 3051 -1917 -5479 -12102 -7300 -941 6085 6239 9564 9479 3484 2737 5395 7261 7511 3275
23463 3275 3148 6872 13121 11896 4861 2747 -1118 -1018 2909 2340 5436 -328 -9748 -8582 -5016
23448 -5016 -2382 -1982 746 7966 4818 7272 11903 9514 5108 5491 978 -6860 -9129 -6937 -1894
23433 -1894 -4491 -3670 -3654 -3199 -2102 156 2372 7018 9980 2143 -5981 -5677 -2356 1881 2397 775
23417 775 5742 8651 3621 -2321 -872 3206 7044 5765 8578 3278 -2125 -2973 -280 2780 2353
23402 2353 490 1153 -3953 -153 -286 -1576 2360 -1067 72 1515 474 262 482 3231 1766 -2870
23386 -2870 -2687 -4275 -4342 -6469 -6134 -10335 -12538 -8279 -9706 -8582 -6066 -4090 -2083 -548 -827 -570
23370 -570 -1755 -8460 -7050 -1600 5744 4746 5942 7839 7459 -1573 -7784 -3873 -5451 -6499 -2495
23355 -2495 -1885 -891 -6175 -8226 -7088 -5385 -2477 -5977 -8269 -10174 -3579 -4679 -9599 -6489 -2009
23340 -2009 -2782 -8284 -11340 -8275 -4997 -6800 -2704 3192 657 -1350 7448 10593 6850 605 -7316
23325 -7316 -12075 -5587 -4386 -120 6555 3375 6661 6533 4304 1456 1080 -1892 -5341 -4015 -2159
23310 -2159 -1324 -420 3765 4622 2762 1925 8055 8944 9211 8308 6130 4137 4834 2794 7958 5205 2241
23293 2241 -4111 -10607 -12294 -8985 -3560 -6666 -7614 -5092 1734 -652 -8043 -10062 -11309 -8848 -11064
23278 -11064 -6791 158 -1580 -918 2514 -422 -4164 -2877 -7585 -12733 -5057 -3306 -2645 -5053 -6903
23263 -6903 -8723 -9903 -6628 -2291 -1658 4291 9399 6171 1954 -1194 -9565 -16811 -7582 -1269 -8422
23248 -8422 -11652 -8776 -7958 -9929 -15604 -16035 -12038 -12407 -3561 -850 -3553 -1544 5710 1740 -3467
23233 -3467 -3369 4736 4866 5034 1123 300 908 3644 3053 3191 3155 -4091 -1166 2144 -200 926 -3022
23216 -3022 -8127 -9470 -5179 -2481 774 -2329 -7404 -13506 -4160 -4061 -4314 -8616 -7932 359 -1977 -6492
23200 -6492 -7392 -9566 -6440 2284 -1284 -7470 -6216 -3338 -3045 -1889 707 5470 5648 46 -5785
23185 -5785 -4884 -952 -1651 -3952 -3838 2875 4573 -3538 -8347 -5067 2615 6337 3672 616 2383
23170 2383 2234 -1198 -4043 -6874 -1094 -1020 -6980 -7872 -8495 -6755 -3356 -4819 -1687 546 -3061 -6700
23154 -6700 -10862 -7704 -2886 2428 2829 4524 741 -2256 -7226 -10824 -13689 -10326 -8665 -1157 5881
23139 5881 3628 2948 2350 -17 -2741 -3753 -7005 -9606 -10634 -7082 5575 5024 5117 8322 8833 7331
23123 7331 6142 2555 3780 7072 6755 -1159 -1091 8178 825 -9658 -10632 -8137 876 2053 -505
23108 -505 -2925 -2233 -3951 -2326 2729 4537 4295 -2391 -9154 -6081 -85 3802 -3503 -6298 -5855 -5396
23092 -5396 -6923 -7891 -2595 -1094 5990 7490 -28 -9738 -16329 -16407 -11955 -14232 -16275 -14634 -5092
23077 -5092 754 1633 4835 1431 990 -4516 -1590 1480 1632 1815 3670 -1333 106 1207 8242 8662
23061 8662 -950 -8770 -5491 -1600 -1521 -2720 2015 -2472 -7056 -4130 -733 -831 1040 -2901 -9934 -4169
23045 -4169 -5198 696 7689 5406 7802 7342 2517 -1939 -3177 -8041 -11132 -8162 -6946 -7436 -15076
23030 -15076 -15309 -12005 -9596 -5701 1977 3220 1941 -2507 -10798 -9866 -5097 4485 7821 10025 7884
23015 7884 4210 -1224 -254 -1168 -9412 -10581 -15083 -13597 -11010 -1829 -5225 -10586 -1057 1220 -4771
23000 -4771 -6242 -13931 -14458 -4720 -682 -758 -5055 -11891 -10965 -9306 -11164 -16158 -12736 -9416 -4742 -3289
22984 -3289 -3086 2614 9758 8084 2943 1475 64 2025 6154 -1125 -3701 2596 2915 5936 11607
22969 11607 9972 5012 -2648 -5582 8341 9155 2473 2840 2238 -986 -1460 2640 541 -1596 -3281
22954 -3281 -1900 -5486 -10103 -4469 -6960 -9864 -6397 7095 14063 8304 6521 10563 13919 7050
22940 7050 -711 3029 3545 -908 -5487 -2587 -2265 -5816 -15850 -11241 -5638 -7334 -4142 -7272 3999
22925 3999 9132 7190 -5642 -13779 -12953 -20786 -27746 -24705 -14226 -5747 -6715 -5721 -4731 -4494 -1574
22910 -1574 -329 -2558 -325 3678 3294 2392 -416 -73 -2354 -4048 -1783 548 967 1069 5403 7828
22894 7828 3186 -8778 -14375 -8297 -3687 -5207 -3014 238 -146 5882 9495 4783 1287 8555 4623
22879 4623 -272 4853 6122 854 613 -5744 -6774 4436 9450 2828 1525 -7632 -9982 -8206 -9064
22864 -9064 -9023 -2745 -954 -3726 2595 -2311 -12471 -13100 -15171 -12440 -4401 -3039 -5636 -8976 -12553
22849 -12553 -9876 -6945 -2859 1496 2208 -2391 -4757 -2979 -2121 -7433 -8382 -8198 -981 -201 3223 2236
22833 2236 2853 8020 7840 8473 7446 2944 1562 -2109 -2996 -5825 -11139 -8813 -6717 -6761 -7525 -6486
22817 -6486 -12315 -3439 3747 -1983 -3740 -4361 -6299 -2157 7575 9205 3377 -1069 -828 -37 3740
22802 3740 -1188 -8944 -2055 203 -6613 -4914 -1016 6080 12832 16200 21056 13431 2065 -284
22788 -284 75 -1041 -6866 -16869 -13867 -6007 -2530 3323 6290 7302 -362 383 2205 -1278 1031
22773 1031 3725 4494 10156 14086 4606 785 1984 881 -559 -2311 -4621 -5419 -4383 -5957 3723
22758 3723 1253 -4124 -1273 -2888 -6989 -91 5582 2493 764 -2214 -6809 1353 -174 -8969 -21003
22743 -21003 -22612 -12611 -3985 434 1965 -963 5752 6113 -48 -113 1531 1753 -435 -320 -169 -3652
22727 -3652 -5236 -5512 -5096 -1283 3976 9084 4464 251 -1405 5398 7617 1807 -3200 -1851 237
22712 237 -2453 1479 2657 -11763 -13949 -6657 -671 7103 8205 1798 -4439 -4072 -2809 3893 3713
22697 3713 -4584 -4136 606 732 963 -5984 -11131 -9889 -13857 -14475 -12912 -14657 -18153 -19884 -12085 -5445
22681 -5445 -7490 -1313 -1577 -2372 2121 7638 7955 -2828 -5959 -2989 -5729 -4699 -5896 -9088 -6138
22666 -6138 288 -2219 -671 2106 3258 699 -4780 -7931 -6718 443 4352 6111 -205 -7470 -5426
22651 -5426 -13289 -12243 -6612 -7193 -5329 -11957 -10169 -10974 -9916 -11173 -11345 -1194 2934 -629 -2401
22636 -2401 -5200 -3177 2127 4175 4275 9754 15395 10398 -1261 -7986 -9102 -11634 -11865 -9440 -7147
22621 -7147 -2561 7625 11215 8280 3478 2634 -6911 -9761 -4944 -99 8446 10129 9933 13190 9286
22606 9286 7782 5341 3331 12953 16946 17461 14736 13879 2837 -13327 -21491 -20476 -15579 -16604 -9700
22591 -9700 -8533 -8366 -1562 2409 2453 -547 1533 2098 3991 1790 -5464 -7952 -11732 -8832 -2876 -3275
22575 -3275 2049 7365 7211 9470 -913 -5054 -1769 -2379 7828 8339 -3970 -5120 -3584 -2652 1094
22560 1094 -4169 -5361 -6813 -8671 -7180 -849 1055 -291 -1489 1112 -1717 1410 7119 5547 1891
22545 1891 -84 1665 8595 7361 1535 -1008 2942 7365 7900 10364 7918 6263 13380 15047 11149
22530 11149 -1157 345 949 1121 -892 3433 4489 550 7322 4926 1469 -2978 -8663 -12243 -7454
22515 -7454 -5019 -1666 3379 12168 12857 5268 1883 -2709 -5832 -5539 -3237 4121 5164 5491 6923
22500 6923 6562 7442 6841 4501 -1181 -4111 -9574 -12248 -9741 -9624 -13324 -10824 -5700 -3221 3561 4540
22484 4540 4584 3664 6798 3441 -2938 -7235 -4362 -1621 1503 4254 -1953 -6195 -7972 -8268 -11344 -6677
22468 -6677 -5445 -3008 -5758 -4815 -2166 3198 2782 6547 6978 4910 757 -3556 -2330 -4358 -7595
22453 -7595 -14162 -10846 -8616 -38 2424 -3971 -11550 -8225 -9211 -9030 -13336 -11922 -11635 -9739 -13503
22438 -13503 -7895 -1282 2583 -3231 -8263 -9308 -6546 -5959 -9333 -6479 -3694 4217 7757 9119 3197
22423 3197 4989 2943 -1226 -3583 -8830 4102 6010 2511 5420 11521 8010 7144 6898 3115 4448
22408 4448 6813 3138 4869 4807 2306 -3888 751 6715 1494 659 -4855 -6172 -11029 -10530 -10520 -5830
22392 -5830 4872 7401 5511 310 -7614 -10633 -9387 -6789 -10368 -15628 -16164 -10682 -9034 -1311 -2888
22377 -2888 -36 2903 3871 6483 12125 21052 23799 17823 11528 8348 12208 6208 1480 1982 -2801
22362 -2801 -2791 -4752 -7555 -4143 -252 3025 7237 4930 -6248 -12690 -9031 -6632 -3233 -4154 -3833
22347 -3833 507 5880 3790 3840 5436 2822 -840 -470 323 -1233 -442 2776 -570 1825 1471 5896
22331 5896 8031 8156 5797 811 -10906 -20637 -25056 -15214 -5318 -3605 -434 2591 4654 7520 4751
22316 4751 -3435 -11380 -11146 -11928 -8434 -3085 -1006 -7274 -5308 1070 2716 3063 2525 3703 4309 4875
22300 4875 7545 -142 -4068 -4776 -6242 -3305 569 -707 -1585 -678 -5464 178 2281 265 1206 -819
22284 -819 -712 -39 -3359 -899 2386 3100 1948 -10124 -14260 -3575 2680 1005 8421 8350 -4005
22269 -4005 -4010 -1885 -5765 -5202 -1162 -772 -5331 -6403 -6694 -6402 -5886 -444 -1116 -7453 -7256 -4939 -2121
22252 -2121 -2341 -3239 -5135 -2497 2420 -2688 -5019 -2668 -987 -6172 -7669 -6447 -235 3464 8155
22237 8155 11598 5304 1515 5671 2081 1919 2277 -440 -3104 345 3609 3980 11582 10198 -1006
22222 -1006 -1563 5207 3097 -1782 -1431 -2501 1357 10032 5670 -392 -2914 -3838 -1735 3432 3634 2312
22206 2312 279 -4768 -4129 -6465 -7304 -7990 -10088 -1549 -776 -1997 -6136 -4738 1567 8623 6533 292
22190 292 -547 657 6616 3475 -1544 -694 2448 -2630 1980 -3337 -6133 -8954 -12584 -9142 -7722
22175 -7722 -4489 -1231 -2768 -1718 -2163 -163 719 -1431 -3103 -6337 -10321 -16841 -13472 -4408 -11544
22160 -11544 -19583 -15103 -7530 783 -2228 -6660 -8218 -12673 -13810 -11420 -11233 -10551 734 -2000 -2892
22145 -2892 322 -444 -271 -2347 -7783 -9838 -8931 -6788 -6552 -3715 4266 3594 11802 14212 6904 446
22129 446 -7037 -3040 4085 -843 -736 -5021 -7925 -7905 -3074 -6006 379 3364 1676 2672 4843 3714
22113 3714 -380 -6638 -7361 -6156 -2025 -4082 866 724 2071 6526 10438 299 -2786 -107 -451
22098 -451 6135 5104 1569 -1877 -1948 -742 -3363 -5401 -930 1222 -3641 -7038 -7890 -6101 -5055 -2121
22082 -2121 5251 6117 2244 219 111 -2069 67 1440 -3701 -4472 -2794 1714 7051 731 -3788
22067 -3788 -6186 -3145 1733 8626 9210 3861 -1913 -3518 -6999 -10198 -7343 -4387 4234 8164 7155
22052 7155 9109 6030 3578 4043 7678 9966 10735 9947 5084 2486 4224 4278 2134 1830 2673 -1947
22036 -1947 1813 -1185 -4764 -3718 -3841 -3142 6361 10651 3552 -1018 -2625 -8185 -777 -2244 -6477
22021 -6477 -7950 -4623 -12100 -10336 -5499 -3794 -5293 -8878 -11096 -14736 -13521 -5807 3306 6097 3903
22006 3903 626 -3980 -9998 -6208 1983 3503 2727 881 4095 3434 6132 8880 2777 1907 6049
21991 6049 9572 15475 13125 9890 4474 5630 2259 2799 5337 2162 2426 8150 8406 8646 8345 6475
21975 6475 6311 -1448 -9406 -8571 -4270 -5979 -7456 1509 973 -1805 1925 2755 1264 3911 5993 8243
21959 8243 6650 4524 5122 3496 1323 3838 2474 193 -4214 -5517 -3261 -1376 -4834 -2821 -6456
21944 -6456 -6152 -6561 -9434 -10076 -7512 -7390 -8691 -6351 -8934 -10353 -5839 -3962 -900 2543 1800 5439
21928 5439 8715 10244 9045 1414 -3945 -3537 -533 3993 1187 806 -671 5571 10127 2979 -3657
21913 -3657 -10769 -13569 -12097 -10578 -5287 -4760 1382 1852 -660 -1640 -8527 -7342 -3005 -3452 -13364 -7051
21897 -7051 -9905 -6587 -4409 -4283 -6212 -10592 -10928 -12006 -16805 -12581 -7881 -2876 -3694 -10770 -10517 -8810
21881 -8810 -1385 236 3444 701 -10846 -15096 -10076 1899 1716 -4162 -3286 -1724 -7927 -14828 -14875
21866 -14875 -13519 -11501 -9410 -6838 -5219 -9390 -14829 -14037 -15321 -8923 -8779 -8290 -3129 -1566 -3059
21851 -3059 85 813 -6690 -8335 -13577 -8798 -5702 -3837 -4619 -3551 -837 -662 4014 -211 -4773
21836 -4773 -274 165 -949 -4702 -3371 3318 4154 1584 -5382 -2733 -4666 -12617 -16596 -9117 -4801
21821 -4801 -12806 -14214 -8257 -12116 -12788 -11863 -13684 -5464 -9 8432 6680 2274 -222 -980 -2842
21806 -2842 1566 5644 4409 -3760 -4493 -2984 -3499 683 -2035 -8368 -4317 4688 13599 11697 7283
21791 7283 2724 -362 7079 13868 10050 1983 -3852 -5832 -3303 590 5952 2909 -24 -1912 -4157
21776 -4157 724 3260 -1496 2765 3170 6364 1643 -2969 -3096 4992 10925 7351 8264 4840 -4842
21761 -4842 -6796 -1684 -2886 -915 1457 44 -906 -3810 -2224 901 -4186 -1395 766 -3529 -10916
21746 -10916 -12455 -11366 -6140 -8195 -5523 -5283 -8526 -11177 -10314 -7039 -3761 -5562 -5284 -5581 -6891
21731 -6891 -6333 -5687 -9739 -9293 -1243 -5326 -11882 -5711 -7178 -12574 -15133 -15586 -10249 -405 6709 6365
21715 6365 5522 5564 5603 1040 -2141 -6217 -2360 -3687 -3943 -9253 -16478 -19610 -17545 -16146 -8686 1093
21699 1093 -2531 -9177 -11942 -7354 -2134 -324 6046 10779 10515 7794 2415 394 7071 7452 -3474
21684 -3474 -2993 1139 5826 597 -3726 -3572 -3763 -1421 877 4283 -81 -2072 -6450 -6927 -1338 -2312
21668 -2312 -1567 -3920 -3184 5121 1176 2414 3310 3053 -344 -2730 -2220 1521 -331 -4453 -4422 -190
21652 -190 -771 -3826 -3464 -497 -4454 -345 723 2850 11691 14222 7648 -543 -1698 -1392 -1588 -2733
21636 -2733 3891 6339 5104 932 -4911 -1187 2264 4304 9943 5246 733 -792 1409 6165 4844
21621 4844 3625 4018 9353 7766 8021 4409 5216 3762 8858 3575 -5539 -5549 -6088 -3792 4445 8845
21605 8845 10378 8099 3164 -2513 -5506 -11000 -9377 -5891 -574 -2523 -2429 -3258 -7031 -9314 -6718
21590 -6718 -5041 -6853 -14708 -18763 -16316 -14208 -10725 -3940 -1509 940 -3621 -6843 -7623 -11586 -13113
21575 -13113 -12561 -10349 -5424 -5698 -4533 -9404 -9992 -6402 -904 5578 8587 8107 5632 5163 3895 -5522
21559 -5522 -12366 -11007 -12755 -14560 -12008 -17260 -21112 -19905 -13155 -8922 -8391 -3877 -4167 -7427 -845
21544 -845 2440 1714 2613 -4485 -5192 -4525 2158 13820 14268 9904 2799 -1964 -7729 -13548 -7587 -4043
21528 -4043 -4381 -1872 -2701 -9719 -5315 -1373 -2849 -1406 -5806 -4661 -4506 -4631 -7880 -9728 -1803 -84
21512 -84 -5695 939 -672 -8431 -8991 -11774 -9622 3171 6553 10186 14923 4938 -268 -10518 -12046
21497 -12046 -5447 -2030 -903 -1551 -6573 -9304 -6755 -6292 -3606 -3688 -5503 -1154 2480 4654 1841
21482 1841 -7295 -14528 -15064 -7601 -2956 -7036 -12021 -7093 -2925 1877 3018 4069 5816 3443 1260
21467 1260 -1732 -7592 -8572 -6276 698 467 -3164 -1681 -2275 1103 -1676 -4374 -5964 -4234 2422
21452 2422 1887 1216 6617 10897 10266 11914 13896 5894 2881 2796 1702 -2893 -1731 -2153 912 2927
21436 2927 1902 2351 7279 5404 236 -524 2301 5123 6833 2678 -6943 1126 6847 6628 3901
21421 3901 4175 862 1012 3683 5559 3451 -230 -9439 -8425 -4467 841 3164 4513 7903 10101
21406 10101 3651 1324 -5646 -2348 -3359 -5126 -2055 -98 1657 6655 8047 4149 2384 -4489
21392 -4489 -6033 -715 -1007 -2692 -2575 -3793 -6979 -2964 -1605 -4190 4579 11330 6088 6634 6462 4291
21376 4291 -2902 -5944 865 -769 -7465 -4320 5084 7203 -453 -7204 -8915 -11467 -17383 -17072 -6896
21361 -6896 9035 15020 7358 4503 2148 -4471 -1729 -2083 -8703 -4458 -4095 -4425 -8788 -5149 -5448
21346 -5448 -5443 -3581 2174 3308 3698 318 2524 7123 3618 -623 -58 58 3280 3499 -55 -472 -3279
21329 -3279 -7934 -644 1967 2941 -239 -3838 -5212 -4188 -7838 -13418 -8989 -9552 -7906 -1879 -1959 1144
21313 1144 8045 -17 2792 2720 -4847 -13915 -16515 -10020 -11382 -5759 5262 8626 1334 790 -5294
21298 -5294 -6749 -1738 -2610 -8850 -7884 -9082 -10201 -7425 -9933 -9481 -3459 -652 432 622 2985 6898
21282 6898 6332 -660 -5769 -5500 -1372 2644 -492 -438 -1924 -2040 -2036 -7182 -7955 -1338 2389 8998 12220
21265 12220 7201 6290 11094 9150 3289 3970 6067 -2669 -11978 -17429 -10700 -7573 -8316 -5119 -2174
21250 -2174 -4986 -9957 -2872 2724 -1178 1602 5316 4263 -1531 2548 -65 466 459 334 -2033 -842
21234 -842 643 2163 -3496 -280 2886 6726 8020 12396 13707 4099 -3189 -1281 -5575 -10560 -6888
21219 -6888 -3082 81 -1019 -2794 -2590 -2844 -2301 -576 5046 4772 -867 -3716 -6062 -3999 -5767 -6338
21203 -6338 -9058 -10231 -5375 -1604 -2614 -3560 -4660 -8927 -8895 -6863 -788 4468 8520 9431 8029 1203
21187 1203 -4781 -5761 -1269 919 2717 5660 3559 2367 3433 -2784 370 4201 2185 2016 4154
21172 4154 -2428 -2950 -5000 -4404 -3667 -2041 -725 -2157 -7220 -2011 1030 2361 1834 567 2690 7685
21156 7685 6377 3332 -455 -2602 515 363 14 -2476 -8434 -9566 -4005 5388 9842 5629 -1254
21141 -1254 -1891 2393 1522 -655 -1967 4613 4798 4089 1693 -3331 -5619 -3438 -368 2252 -3245 -4475
21125 -4475 -2264 -3919 5139 9856 5957 84 508 -2519 -1331 -3189 -7705 -5359 -6020 -8238 -11152
21110 -11152 -8720 -5093 881 1755 -7250 -8174 -13780 -15776 -10757 -10242 -6139 -4321 -5575 -7898 -7431
21095 -7431 -3752 -7446 -6244 -3867 474 2804 5561 -4526 -9287 -5884 -7617 -10555 -9802 -6624 -4129
21080 -4129 -1541 -6434 -4940 4762 9191 1464 4634 8065 6851 6108 3438 4813 -1683 -6516 -10041
21065 -10041 -12050 -6371 -5758 -7432 -13567 -12694 -6062 -4239 -4771 -6078 -8801 -9561 -4969 4300 3567 -5803
21049 -5803 -7186 -3205 -2001 -3369 -4803 -5423 -4924 -5159 -3499 -4065 -10997 -9767 -6200 -1224 -2607 -6844
21033 -6844 -7345 -3550 5325 327 -3939 -3023 -2304 -1962 -628 2665 6018 -280 456 -2580 -2096 191
21017 191 -6666 -12626 -7195 -1598 2551 -5065 -5215 1433 1042 4924 4141 126 -3124 -11117 -7706 -3821
21001 -3821 -7090 -14479 -13006 -9335 -8545 -5611 -5203 -2129 2552 -101 1099 -2017 1576 -689 2110
20986 2110 7342 12569 9184 5570 -238 1261 -3316 -5676 -7060 -7549 576 6159 -1688 576 6964
20971 6964 11801 11651 8803 6267 2153 -8103 -8304 -2868 -5466 -8440 -5842 1306 10128 6616 2770
20956 2770 3448 -759 -1052 -1720 -2466 -5912 -9446 -5129 759 7923 11795 10113 4987 3462 3028 -2824
20940 -2824 -3845 -6956 -8348 -371 2534 -3029 -1411 4387 2031 -128 -1978 4490 5452 1122 -1157
20925 -1157 -2700 -6958 -3637 -4437 3627 2290 926 -2347 -2261 -1846 5321 19229 18152 4885 -9151
20910 -9151 -8227 -4731 378 7752 10826 11518 6556 6727 9622 6460 -204 -3237 -9716 -8020 -7478 -12543
20894 -12543 -22343 -16284 -9379 -9326 -7609 -7281 -2216 -5314 -1206 -444 2740 5822 5644 4939 3724 -1660
20878 -1660 -3392 -4944 -5483 -4287 -4901 -8330 -6694 -5042 -8062 -3435 -1079 3088 -498 2046 3272
20863 3272 8318 8701 8085 8719 9998 9151 -1543 -8812 2912 5668 3810 711 -6351 -7636 -12019
20848 -12019 -8923 -4182 -5988 -11823 -14722 -13691 -9065 267 1878 -971 393 41 1263 -2400 -2733
20833 -2733 -890 -662 -2477 -6271 1086 7256 4036 2385 6729 2322 2864 -1683 -1067 2223 3829
20818 3829 1422 -6003 1101 7672 293 -3848 2988 5725 3191 7216 8829 739 -8047 -11624 -8238
20803 -8238 -3705 -4873 -2834 759 -4086 -4155 -5301 -6769 -4548 -1380 991 1081 3369 5447 3235 2200
20787 2200 3643 11646 15219 14328 12741 9723 5590 3423 7166 16048 14413 6836 1006 -1765 -4625
20772 -4625 -8633 -10495 -14454 -16071 -9388 -7578 -7638 -8543 -1215 3328 5360 12568 14560 2094 -5468
20757 -5468 -1224 2304 -6814 -7747 -4180 3563 4852 1311 -3735 -9317 -9579 -6500 2477 12850 8226
20742 8226 8729 2687 -1152 -2886 -6066 -4505 -1416 -3781 -6620 -5083 -4906 -5230 -1216 5297 1228
20727 1228 785 631 3330 7815 5465 2510 3513 9263 10740 10501 -1745 -13010 -18992 -15095 -10555
20712 -10555 -3317 2627 5667 3063 -5164 -12424 -7434 -1597 5293 8392 5731 3063 4702 10529
20698 10529 11685 7058 6472 13007 8422 -614 -6656 -8894 -7619 -1113 3072 2154 -509 5374 4380
20683 4380 -1408 -3585 -6457 -11632 -14676 -8997 -3572 -5440 -3961 -7455 -8936 -8685 -1032 -3349 -6908
20668 -6908 -9413 -12560 -9685 -6156 2374 5902 4706 3008 2514 -1136 -79 4165 2289 7723 15052
20653 15052 18912 18725 14160 9129 10242 14926 16714 12887 13332 13436 7990 2573 1788 2041 5362 2910
20637 2910 2157 5901 8669 8621 3187 473 8433 11384 10691 10271 2170 -1726 7622 7313 4457 1196
20621 1196 8109 10585 6663 2814 1440 -4871 -7103 -3477 952 -1898 -9214 -7257 -1961 -4536 -1780
20606 -1780 -5175 -3128 -3027 -339 -2510 -3506 3488 4798 7380 6244 7492 9043 7886 5641 8795
20591 8795 -61 -4709 -6371 -13164 -7186 -598 -2420 2835 6747 2917 -1288 -2272 -1426 420 1371
20576 1371 -6042 -7486 -1797 -2676 254 4917 4891 7299 4165 1657 5860 13335 6537 2418 6720
20561 6720 8332 6070 5595 1234 -924 -3412 -3381 -4553 -4133 -1791 2842 2248 -8591 -14183 -16895 -13045
20545 -13045 -8470 -6541 -7915 -11728 -12170 -5897 4002 954 -2878 -5904 -387 3207 3561 2122 4539
20530 4539 3404 -4000 -9170 -8005 1524 6764 7436 -73 -2316 -7738 -6632 -5972 -9561 -9668 -10280 -13536
20514 -13536 -11065 -3229 3781 2692 9987 9247 6401 1984 -3088 -1773 299 3782 1354 -7611 -3735
20499 -3735 -3761 -3283 -2466 -4817 -3058 -1788 -4639 -5481 -1655 -22 -3626 -8300 -13190 -10953 -7243 -5697
20483 -5697 -11578 -8448 -9629 -6307 -10828 -12111 -1306 -298 -1927 110 -2609 -6177 -4782 -9320
20469 -9320 -10599 -1103 4934 4048 -2131 2447 1204 -82 3556 7733 4858 4814 5138 5904 741 -989
20453 -989 -5499 -7699 589 4397 7559 2461 -3457 -1297 -2668 -3171 3690 8031 9252 2192 393
20438 393 2171 -1173 -4000 -2527 -1262 5960 7392 7941 7135 8877 -4353 -2509 -1543 -2044 24 5258
20422 5258 5665 6450 502 -616 -4970 -5000 -1351 411 4525 5481 5509 7990 7218 827 -2741 -5199 -6955
20405 -6955 -5456 -5051 -4927 -7850 -6610 -8615 -10240 -3897 -3312 212 1976 469 2749 7994 8415 7540
20389 7540 6698 1421 -475 -515 -2992 -5413 -3569 -472 -1916 -10067 -7487 -4444 244 5251 8081
20374 8081 4178 2346 -574 -1638 2071 5781 5375 4262 1791 195 2432 -229 -5595 -2436 -1148
20359 -1148 -997 -264 -2561 -4653 -7802 -10010 -8510 -12910 -18087 -14537 -7790 -1540 4768 1331 -1781
20344 -1781 -4491 1147 6209 13959 11811 1795 2924 9439 6054 -1945 -3470 -478 5300 9221
20330 9221 10841 7586 5860 9293 9710 10140 14057 12248 13047 6356 5100 4316 -1764 -4591 -5256 -11708
20314 -11708 -5684 -5618 -6397 -4499 -1948 5593 8617 4497 -455 -2213 -11654 -19052 -16559 -9142 -6953
20299 -6953 -10197 -8786 -7550 -9612 -3551 -191 5037 -4933 -18756 -18645 -6388 1121 6536 1708
20285 1708 -1829 87 2282 -1310 -1642 -4646 -9873 -3205 4497 1257 2079 5338 2279 2497 -432
20270 -432 -1194 2949 480 6892 8812 7507 3595 -19 -7009 -11425 -12183 -9722 -8942 -10127 -16897 -19321
20254 -19321 -15764 -14724 -13026 -7064 -6006 -8785 -10606 -12306 -12090 -13932 -11932 -8681 -5149 -5424 -6565
20239 -6565 -8620 -6097 -3081 -2965 -1675 -2580 -5163 -8005 -399 10277 11470 3666 -3104 -1982 -37
20224 -37 305 -1525 318 6590 -5158 -10922 -9451 -4882 -5484 -3128 -6924 -5832 -4471 803 -344
20209 -344 -2196 -2756 -4132 -6303 -4798 -2831 -3640 192 5194 1506 1452 1992 2150 4470 -627 -5617
20193 -5617 -8081 -12841 -19485 -19684 -12552 -13006 -13587 -15541 -8386 -4354 -3075 -7162 -8580 -2615 -377
20178 -377 798 -601 -4923 -7560 -3946 4061 2755 -1804 -14 -3472 -4015 -9668 -5177 5 -4594
20163 -4594 -7959 -6615 3363 7033 3893 5511 8313 1417 -3239 -8619 -9433 -8596 -12302 -11243 -8275
20148 -8275 -12831 -6984 -8902 -12796 -7982 -5989 -3169 -5484 -8179 -2941 -8934 -13189 -17112 -18313 -14482
20133 -14482 -5379 -1347 -3597 5017 7809 8392 2087 -4838 -5941 -4337 3214 11480 15661 10656 7509
20118 7509 11776 7958 8142 10012 12257 5625 3395 14063 8036 634 -4576 -10106 -14019 -4471 2767
20103 2767 -56 2434 6614 7404 632 3945 11220 11987 5160 9491 3190 -1519 -2664 -10024 -11460
20088 -11460 -7092 -8866 -15047 -20029 -16388 -8733 1737 -2025 -4490 -1915 -1512 2699 -837 -1896
20074 -1896 2342 4587 4947 6044 6189 8246 2895 -4036 -5936 -8848 -9254 -6382 -4576 -1658 -6131
20059 -6131 -12297 -13166 -14184 -21358 -17234 -4199 6642 4162 962 -1713 -5293 -8833 -8187 -3832 4982
20044 4982 3934 2866 -2205 -9175 -10861 -1404 3788 3915 1780 2372 6959 8910 10986 10750 6051
20029 6051 -163 -8477 -8144 -5223 2738 7511 9913 7579 9527 7548 6323 5274 5148 3400 -8503
20014 -8503 -9501 -9003 -6359 5041 3389 2883 796 3956 2221 1305 507 -1262 -2874 -5125 -985 -757
19998 -757 226 -1024 -4048 -4641 713 -2221 -8882 -6133 -194 -426 5918 -85 -8924 -4609 -1989 -1203
19982 -1203 -4350 1632 331 1658 -4506 -14262 -9323 -998 8232 5986 -1976 -5066 0 1669 -2565
19967 -2565 -4060 -1657 2871 42 3555 1368 3822 6893 -1874 -8215 -10971 -4304 1620 2380 4214
19952 4214 696 -2784 -1572 -5839 -9598 -11310 -13231 -13521 -6924 -380 1184 -479 -4411 -8666 -7778
19937 -7778 -11861 -11165 -4707 -2552 5985 4134 4365 494 3823 5394 6728 10389 13737 10387 5177
19922 5177 1702 260 5937 4056 -4115 -3338 -3582 -6037 -6401 -4068 -3202 -1239 -3923 -4134 -505 -1067
19906 -1067 969 -5651 -5714 -632 -3909 -6165 -2320 22 8092 10785 8429 -4537 -15927 -9309 -2290
19891 -2290 -3766 -2131 -4920 -8876 -5770 -2509 -2328 -936 -1719 -2349 5740 8576 4732 6901 7824 5471
19875 5471 795 -8773 -8607 3095 4381 561 3814 5089 8309 9760 12455 13611 5463 -3141 -4378
19860 -4378 -1384 -5065 -2690 -1650 945 9467 7488 1593 -5503 -1784 -3189 -9018 -2477 422 2023
19845 2023 -523 -76 -240 -2043 -3654 -5073 -488 -6524 -8730 -6541 -3312 -4091 -11531 -15261 -11528
19830 -11528 -4115 1778 9064 7267 8912 8490 6683 -647 -9269 -9598 -6864 247 1523 -5563 -6308
19815 -6308 -4778 -13773 -15168 -14152 -7341 -3027 -6407 -2339 -8998 -12328 -7132 -8328 -6117 -7016 -11563
19800 -11563 -11975 -5059 -3843 -2756 -6780 -8758 -6095 -4148 -7089 -5845 103 4186 -432 56 7600
19785 7600 12047 11948 2678 1091 -5180 -5890 -902 -3673 -3054 -2632 -10033 -11187 -6819 -6160 -5053 -4508
19769 -4508 -4127 -2542 458 -255 -5318 -5692 -4041 1064 3227 1819 -2856 -5137 -4539 -110 2929 -595
19753 -595 -1557 1096 868 -3908 -2694 -3006 -4621 -12320 -11508 -6032 1679 10275 10210 10213 967 -3751 -7455
19736 -7455 -12167 -10818 -11121 -12553 -12565 -7786 4869 10095 9537 4346 1508 -1336 1864 5642 3862
19721 3862 5678 4072 4121 12117 13247 8861 3163 1078 -193 5811 6503 5935 2667 -7798 -7722 -5649
19705 -5649 3742 5582 6627 8447 875 1826 1485 -895 6733 -129 -8333 -10635 -7550 -1347 -7222
19690 -7222 -10149 -4877 1368 3550 -1767 -5962 -7616 -3022 -1647 261 758 1006 -7831 -13028 -8500
19675 -8500 -5584 -7108 -10191 -14383 -14604 -1695 4627 4163 1581 4606 6553 2422 2341 380 4974
19660 4974 -937 -10980 -12385 -14917 -15798 -8236 -4442 -7845 -12119 -14844 -12244 -7872 -3870 -10749 -9469
19645 -9469 -4959 -1780 -2750 102 2920 3074 -3753 -7582 820 5274 1526 -12145 -15506 -11727 -6540
19630 -6540 -4592 -3600 3635 1736 -4164 -8253 -8816 -9372 -4342 3821 7894 6405 7196 -1217 -6353 -5402
19614 -5402 -354 -727 -748 2449 6270 5643 1093 4285 -1829 842 1107 3173 6190 3212 3023 -3420
19598 -3420 -7154 -839 2398 1655 1015 1211 -5637 -8140 -3414 -4905 -2013 2707 -152 -3738 -1927
19583 -1927 3204 1904 -928 -5491 -3493 10844 9837 -4205 -2817 4942 9172 12169 10776 11238
19569 11238 15099 10033 -1393 -6284 -10630 -7528 135 -741 243 3594 3762 -462 -3447 3752 11732
19554 11732 10159 10059 7045 4319 3597 -2591 -5645 -2012 -468 -1726 -512 9484 11284 6907 -98
19539 -98 -2066 2969 7473 7734 7220 -9094 -18441 -13641 -6740 686 6920 2267 -635 1108 525 -5067
19523 -5067 -3317 -465 -2576 -3348 -1173 922 2305 906 663 2243 6207 11487 2620 -4790 778
19508 778 528 -859 3575 507 -1497 -7563 -14143 -12186 -5704 -7785 -4820 4142 4141 2316 11316 8209
19492 8209 4109 183 5830 9943 9538 5116 7298 11838 11075 4895 1163 -820 3856 -753 -843 -463
19476 -463 1521 1652 -1176 -7020 -11914 -15667 -11537 -6883 -5006 -1024 3013 17 1 357 -2097 -3805
19460 -3805 -1171 4224 4957 3567 -3023 -6828 -4019 -4387 -2554 65 -2190 -3933 -3158 -4022 3423 5424
19444 5424 -5339 -5776 -2796 1688 -2182 -8594 -6378 -4701 -11008 -12942 -12761 -5450 1990 1716 9520
19429 9520 16221 11200 6495 9410 -340 -9573 -5194 3213 8647 1996 -6012 -5839 -4612 -158 348
19414 348 1253 -847 3333 6603 -6395 -13351 -8755 -428 -4059 -4442 -7710 -6593 -2685 3696 7362
19399 7362 1224 -7197 -7953 -8362 -7003 -3163 -3688 -3988 -5447 -5763 -8539 -12167 -12596 -9989 -6390 -4056
19383 -4056 -2120 603 -2321 -7150 -13048 -14362 -10087 -5710 -1217 1985 2093 3955 -1333 4056 14195
19368 14195 13783 7935 -1317 -5405 -8646 -11749 -15314 -20384 -17866 -23072 -17614 -7475 -5712 -8317
19354 -8317 -7852 -1637 -3383 -190 1992 -12 4353 3790 7870 7149 651 6021 5425 1899 -3160 -2250
19338 -2250 -3417 -2346 1484 8092 5623 2595 9075 5116 -2121 -4708 -5792 -2270 7109 10861 9580
19323 9580 5367 2616 2904 -391 -4846 -9905 -10485 -14051 -4659 -21 -2601 -2796 -4062 -4237 -3989 -276
19307 -276 168 -4107 -4093 2360 4640 8427 8021 2271 3437 5120 -3731 -6371 65 5088 2665 -1438
19291 -1438 1317 2675 -1703 1212 6620 6889 8295 6057 2982 -3131 -3784 -2069 994 915 1709 484
19275 484 4447 5845 8113 10438 8816 9008 4857 4710 1424 -193 2101 5365 6974 13517 11002
19260 11002 2973 2112 1655 -366 -2547 -3520 -8359 -9313 -2113 1894 -780 -2868 -5178 -5877 -6989 244
19244 244 4312 269 1661 -2442 -4714 -3731 -3424 5011 6285 1609 -370 3169 7669 13025 15734
19229 15734 7231 2045 8648 2734 162 7528 12235 12790 8319 3067 -3163 -586 6166 11732 8819
19214 8819 7867 4869 7471 9287 2691 4200 8854 12963 15369 13094 13566 12364 6986 2964 2518
19199 2518 2248 -3286 -4577 -411 4634 5782 3090 722 6984 8601 5341 1858 2606 -777 -3636
19184 -3636 -6240 -3395 -4245 -8524 -7450 -1236 2408 1600 2454 171 -851 -5226 -8404 -1526 4491
19169 4491 3527 2658 4272 9828 10574 7083 5650 8391 4894 3914 4745 1473 4274 11235 7071 1077
19153 1077 1040 2237 7912 8027 -1436 -4886 3066 -1617 -3807 -3741 -3666 2651 5736 7482 8234 4067 8023
19136 8023 7350 3652 5785 11281 12937 13505 8193 3105 2050 2909 3196 6497 12973 17701 13682 9212
19120 9212 4688 3251 5196 6979 6335 7017 11359 6840 1783 4402 6240 5983 7678 8270 6938 3899
19104 3899 3808 4940 -5076 -8960 -2691 1727 10059 11867 10756 10570 14802 15552 12688 12919 12869 14315
19088 14315 12949 7856 6789 4298 2470 2074 6471 4577 3968 4806 5455 5435 4145 776 1333 5066
19072 5066 5447 4202 2988 5973 6712 7584 5149 6797 3191 -2350 -10014 -7142 4956 15275 16233
19057 16233 11927 12412 15773 14836 12581 7786 4214 12467 16193 12541 6176 2859 5485 8942 3407
19042 3407 1193 5055 14545 17185 8354 1924 -3696 15 858 1667 4698 10605 7379 2808 506
19027 506 -617 -2683 -470 -2500 -1920 -9 3766 3267 6087 11886 15113 17691 16277 5777 3018
19012 3018 7395 7564 7386 5957 5539 4662 5824 2773 3724 2403 4797 6530 2254 1029 492 -2575
18996 -2575 -5343 3171 3519 -6389 -204 8061 8071 6570 10572 9454 11212 10556 7547 1289 2637 3244
18980 3244 7289 9488 4876 2986 5935 744 -1962 3946 5778 -1121 -5945 -8928 -8545 -1798 8731
18965 8731 9741 9235 12552 11643 5920 3267 11625 23884 22118 15282 15208 12082 10183 13762 14393 13578
18949 13578 17684 13350 9062 13962 13721 14280 6890 7569 11991 20872 26858 30402 29280 29184 35088 43071
18933 43071 52000 61872 80426 112378 167523 239139 277727 298284 368014 431971 388512 314690
18921 314690 285677 260133 203753 142094 100768 74843 60231 56669 57057 57846 69080 87426
18909 87426 116993 157705 221162 283199 310888 349049 429755 448554 365560 307413 294937 253982
18897 253982 172257 110494 79366 55388 45800 35823 31886 32177 30836 29198 23747 26514 23026
18884 23026 21602 24231 20225 14932 12925 15555 15948 6101 5050 8328 10420 12300 6179 4698 9856
18869 9856 10685 11219 14246 13639 19790 24621 19861 13230 8045 4773 9968 16017 17104 16292 15335 11446
18853 11446 12358 11542 6770 5993 9241 15673 20301 13660 17074 13811 7490 8456 17166 20797 17709
18838 17709 23787 25455 24866 17989 13037 12531 16541 18309 11265 6337 1788 6958 9282 8753 8846 8526
18822 8526 13658 18024 15735 19613 21838 28543 34391 37375 35781 31096 32035 28899 25841 30014 30285
18807 30285 28680 27196 25870 24880 16359 10745 9380 10974 9867 16385 18832 20773 23584 22704 17516
18792 17516 17227 14972 15461 18577 17608 19289 18349 23466 25433 35553 38632 43017 39535 45557 57766
18777 57766 78019 101530 122346 163055 244667 348006 429044 501684 514317 464256 413306
18766 413306 347754 257602 181106 132091 106618 88104 72473 59892 58302 67566 76465 89821
18754 89821 115951 152913 219711 326013 432645 513080 565114 520834 436192 337766 230945
18743 230945 156936 116769 90209 68208 52782 40993 32911 29651 28212 28593 24851 29094 35401
18730 35401 33821 36035 32590 34327 37742 33307 27759 21299 16805 24704 27575 20983 16495 22075
18716 22075 27168 25212 28340 31097 19280 12214 9995 13546 22433 24477 21157 17714 17498 19201
18702 19201 18968 20715 21137 24514 25266 22266 24493 25993 30802 37223 35615 26070 15615 8024 9894
18687 9894 17383 20944 21253 20095 21527 16638 10848 6311 7300 13867 14347 17369 15665 20347 20820 19730
18671 19730 23531 23275 20504 19454 19980 19761 18434 9624 2767 4504 5334 1828 1243 7091 18781
18656 18781 27549 33034 30904 24947 23520 28631 31420 28224 24926 24276 23078 20347 13303 9822 13525
18641 13525 21810 15544 14002 18065 27204 27204 23307 27406 25710 25969 26500 26466 23852 29635 30947 24223
18625 24223 23182 20096 16157 8969 7294 7547 16399 19228 17616 19792 21783 28808 27104 26773 30303
18610 30303 32384 35077 31808 25279 24165 25700 25790 30624 24875 23685 33504 31367 31434 40537 44458
18595 44458 37454 37096 50420 63743 70305 72719 71455 67340 54395 49874 45017 38194 37968 33225
18581 33225 27891 23566 18400 19758 27634 33206 36775 40024 47324 60843 72019 81297 89177 89681
18567 89681 90645 93412 85326 64810 53732 43561 34962 34833 31744 35035 27267 28781 34841 41346
18553 41346 46484 45369 43052 36860 34641 36776 37601 33310 32193 30500 22846 14913 13033 10556 12553
18538 12553 20252 19156 16241 18123 20565 25252 34981 36128 40872 44248 37575 36690 32693 25280 22152
18523 22152 19576 13839 16041 24453 26574 24845 26172 29986 32018 28075 21526 18825 19880 24223
18509 24223 33359 32047 35104 32979 29845 27831 30838 29642 28104 39274 41691 31266 20911 18071
18495 18071 15981 13392 12394 21337 35157 35350 39515 55967 59819 62047 62975 63818 62063 65618 72223
18480 72223 71163 65480 68674 57422 46486 44134 35404 33440 36063 38885 55696 74477 92358
18467 92358 110733 132839 149738 152215 163232 168145 163298 148488 138149 126570 118893 112137 106313
18454 106313 95334 89446 90690 89396 87116 91280 101272 114501 128120 139414 151143 159099 167710
18441 167710 170865 171659 164471 154526 142602 135396 121850 117412 113862 110495 108046 102747 101591 102937
18427 102937 101294 104199 106972 110780 120280 130511 143617 156062 172260 181294 179695 178648 164095
18414 164095 158667 156806 154458 147676 137930 139913 144135 151143 163241 170034 181459 187500 207247
18401 207247 227372 250607 261058 264541 271600 272733 265111 256850 245359 239801 235107 228367 216265
18388 216265 214514 226575 242328 257179 277265 296982 314877 335228 373549 430034 493131 534071
18376 534071 571267 644051 730192 716633 659520 639912 630396 592226 567167 567586 574337 591051
18364 591051 623267 667819 716979 767215 829769 917741 1035976 1189083 1359013 1530735 1753525
18353 1753525 2073766 2393620 2644405 2981843 3391972 3766574 4253221 5005989 6093265
18344 6093265 7841875 10958827 16554918 26171281 38266450 44066235 47237786 58562377
18336 58562377 70723681 63319739 50010467 45258174 41803135 31214467 20804798
18329 20804798 14593642 11445049 9958041 9317769 9284792 9870250 11151762 13587969 18293048
18320 18293048 26949314 40921030 54018295 57931756 64864835 82533853 89451870 73179091
18312 73179091 59717192 56116136 47624037 32332086 20467612 13592884 9820147 7695361
18304 7695361 6310931 5350486 4744373 4230432 3754441 3439511 3134781 2751686 2476459
18295 2476459 2308101 2088767 1801185 1542635 1338497 1187453 1069221 966068 883351 815333
18285 815333 762911 727213 713122 736563 797680 825119 823741 884681 966757 919746 813472
18274 813472 766582 734886 653843 576253 522936 481131 440450 404968 371753 341228 326046
18263 326046 329562 324284 310175 297924 293295 296444 297815 292095 292373 291036 289045 285748 274696 268955
18249 268955 269196 279492 289710 301115 327929 392533 518078 728012 984648 1100202 947802
18238 947802 698361 521990 420615 365264 340750 341195 341256 334996 333036 336970 340054 333095 326884
18225 326884 336133 361269 398905 450453 526330 634977 815134 1120891 1589033 2063432 2476960
18214 2476960 2716061 2453383 2054150 1565982 1116679 834741 676104 579649 523071 498878
18204 498878 502002 517826 549662 586669 621228 648989 666307 682586 710857 761887 855423 986593
18192 986593 1155393 1311187 1478544 1584389 1594369 1650854 1741506 1941701 2383704 3109712
18182 3109712 3842461 4527007 4991255 4851033 4596593 4284121 4125836 4327966 4908847
18173 4908847 5948817 7647133 10405420 15025593 23110187 37203221 58175773 77570182
18165 77570182 94197506 107000917 97509140 81320463 63054798 42017372 26921040
18158 26921040 18251905 13309034 10399848 8654828 7648402 7161252 7159148 7702798 8895215
18149 8895215 11156651 15284997 22758769 35701820 52490075 65862663 79251357 83069486
18141 83069486 71377638 58712571 42671826 27267383 17385863 11763860 8420407
18134 8420407 6348315 5028350 4138193 3525486 3122688 2838061 2617809 2470022 2298498
18125 2298498 2126305 1973951 1818889 1715370 1673752 1716421 1793012 1931509 2133712 2314998
18115 2314998 2518999 2675679 2895380 3448620 4648715 7154160 11954686 18418498 18560702
18106 18560702 12203161 7065558 4337540 2938239 2166492 1690878 1366241 1153292 1018854
18097 1018854 949896 960158 1053055 1159034 1224912 1150383 972179 782016 609008 491951
18087 491951 431093 393129 362358 337593 318264 302074 281523 257391 239266 228146 218248 214242
18075 214242 220783 225259 229687 245911 269609 299933 332941 352119 347401 328540 309317 305973
18063 305973 293448 283042 267584 247624 225580 209285 197609 183917 171387 157800 147811 140043
18051 140043 126260 113990 111978 111719 109832 112116 120424 123404 120433 121429 123932 129265 141752 145581
18037 145581 159165 167297 166412 154196 146429 143280 150717 165598 186177 194929 190838 182958 164557
18024 164557 144321 132757 126005 127407 131188 135159 150766 175524 196079 223863 241821 247539
18012 247539 242607 226771 210561 218300 241671 266423 288464 313646 331394 345746 374564 417566
18000 417566 450814 480766 526366 584863 650461 730060 818879 903485 941518 882004 756662
17989 756662 633774 536060 447310 386277 337991 296038 268921 256328 263085 293591 344071
17978 344071 393375 394458 344271 279404 230654 212832 205692 190106 178005 176947 182577 189879
17966 189879 181064 175235 169842 165287 166417 174922 182589 191194 214005 235914 249472 251813 271624
17953 271624 303349 323368 329554 320561 303913 283514 261417 236887 208417 197226 183709 167532
17941 167532 152476 141185 146337 154506 162768 173667 181404 168872 144835 130885 123653 121660 130614
17928 130614 129426 127546 126862 119352 115058 106124 113804 121537 130450 146488 159438 174418 183155 184301
17914 184301 172822 151729 135598 130030 130846 132056 143352 156663 159667 153647 147070 142485 143617
17901 143617 147094 152123 148579 151990 160442 177547 187152 209141 241754 278715 318121 360634 413750
17888 413750 494284 610337 775653 1048980 1464124 2085473 2951962 3931540 4809451 5127984
17878 5127984 4609597 3545457 2465651 1642689 1100066 773191 584450 467292 381525
17869 381525 320343 276582 244740 217172 196228 184700 177642 166998 162003 161136 161896 160836 162961
17856 162961 162767 160183 156601 160723 161898 166128 159459 153514 154036 165451 179858 183430 181347 175462
17842 175462 169820 156961 143146 134955 123223 117500 109677 99216 92111 91406 88962 87004 78370
17829 78370 67561 66770 73116 80851 88501 90579 91490 91554 86645 87425 94481 96885 116245 128973 137135
17814 137135 134222 122591 101636 89243 80068 69067 58321 52173 53129 59295 61281 61428 62347 54062
17800 54062 48453 45493 49212 61834 70100 73553 67397 69432 72986 68143 60210 61664 55781 56467
17786 56467 52305 45631 35149 32838 39590 37457 29207 26453 33312 39846 36947 25714 13557 13737
17772 13737 12929 12801 17255 15714 12715 14717 21638 30177 31421 33050 37125 39439 44879 53427 63547
17757 63547 72090 75039 72269 81221 86274 93142 94613 92910 104029 113204 132155 147314 171375
17744 171375 223784 299580 353707 361655 403330 492286 499540 414202 354036 324200 273046 205305
17732 205305 149939 118006 101576 97129 89960 81583 73764 79652 98041 127620 179059 246853
17720 246853 282122 298679 358606 416695 375308 301608 267225 241893 183164 123402 86559
17709 86559 67332 52306 48503 42778 38980 38986 38345 30682 32207 33867 33352 35478 32365 33740 36555
17694 36555 32475 25510 20833 26616 25355 28560 31831 29146 25952 20968 11579 15539 16908 13271
17680 13271 14158 10782 9070 9799 9796 8261 9399 6750 9063 12297 18700 24179 21429 17882 16007 16998
17664 16998 15895 14702 17229 20442 24991 39434 46359 52592 49793 44476 41050 33284 31986 32054 30755
17649 30755 35775 40331 48718 52028 53021 56080 62943 77727 102331 130416 160963 205473 281683
17636 281683 415462 651760 1074092 1699764 2302612 2769229 2721795 2240923 1622026 1022424
17626 1022424 633552 423238 308708 238993 197198 166642 145960 118313 105598 104715 97583
17615 97583 86984 80794 87464 83949 82703 87425 96039 104275 118829 141994 178497 223726 294227
17602 294227 417368 630170 1013094 1573719 2109527 2522815 2449489 2021918 1465486 934919
17592 934919 585643 391604 276509 203844 157620 129130 98664 82152 66944 58766 52844
17581 52844 42958 43342 40434 40791 37841 36732 43762 46120 45070 41593 45520 46597 45090 44686 36971
17566 36971 28010 31944 30073 25888 31902 41203 60956 74122 97657 147593 234769 341485 430976
17553 430976 514121 541388 472521 388441 280978 187213 126252 87495 70428 65296 60410 50453
17541 50453 43104 44568 48984 58778 79989 118647 184753 268293 358228 435703 506899 493681
17529 493681 411586 320020 226942 154371 103441 68829 51586 35981 23892 15333 12508 14585
17517 14585 12864 8334 2731 12105 14872 16101 13674 10549 5474 8460 14496 20725 21093 14543 7013
17502 7013 4604 8010 7816 2306 3930 -2471 467 -1592 -12745 -7925 -2179 -3074 -1071 -159 -3512
17487 -3512 -1741 -892 -532 3377 2291 3298 8212 13064 15632 12055 8270 3920 9003 5740 5341
17472 5341 10022 14771 14050 8788 1511 4723 11818 13212 7020 1378 570 530 -695 -404 -5775 -2307
17456 -2307 -6415 -1690 6764 -1571 -1690 1823 3731 -265 -1785 3276 2895 12005 27333 53470 88790
17441 88790 110201 86040 52905 33822 18867 5969 7164 17896 19773 12772 8926 6390 7865
17428 7865 11420 12325 14808 12753 11756 12353 16934 22059 23137 18459 15982 23112 31667 39138 53484
17413 53484 74181 88771 112598 147207 211553 283005 282314 242537 228222 264188 365617 500100
17401 500100 502739 375144 271752 227222 234461 266632 290431 248708 177216 134757 124883 125048
17389 125048 136338 179759 248768 297496 276214 228330 212286 258302 370387 480789 453426
17378 453426 330592 247301 213287 220186 249561 244647 185036 122368 80780 60431 39096 20938
17366 20938 20478 16761 13881 12831 16478 17171 13657 9307 9095 9310 7926 8296 9096 8788 5831 -866
17350 -866 -51 7102 10284 6812 5623 4768 5388 6192 -171 5 -640 -2255 -1813 -1195 -1634 2717 -4836
17333 -4836 -8355 -9069 -7846 -12998 -13861 -8405 -2781 -1281 -2430 -79 -7302 -12098 -10270 -1448 2642
17318 2642 4566 6498 -2382 -9818 -7450 -110 1676 -5576 -9301 202 365 1640 -6746 -9081 -2271
17303 -2271 3793 835 -3484 -3537 3537 8448 6163 6974 3907 -3973 -6786 -5516 -2100 -4340 -4509 -2896
17287 -2896 -5356 -320 3941 4277 1156 -1648 -1736 -1226 -4220 -15256 -18045 -15652 -11224 -12609 -6942
17272 -6942 2090 1057 -3188 -5798 -9746 -13534 -7653 -1458 4037 -2995 -8887 -3629 950 1331 2850
17257 2850 3482 2875 -1128 -427 1969 -1888 -5605 -12487 -17290 -15435 -13198 -5602 -8675 -10725 -5779
17242 -5779 -8806 -6728 -1886 -2443 -3264 -1119 -3309 -6691 -5820 -6079 -3459 -4066 -5215 -2124 -7098 -8816
17226 -8816 -6994 -13286 -11663 -5679 -967 3187 -4684 -12364 -7783 -10296 -13234 -9892 -9173 -14892 -13172
17211 -13172 -3385 -4008 -8745 -12469 -11996 -12119 -10264 -11027 -7658 -4633 867 1986 -290 -7356 -16297
17196 -16297 -16394 -7638 -3529 -160 2801 -2100 -5814 183 949 -1938 -5434 -3337 2668 3071 1968
17181 1968 -8330 -8920 422 3718 3631 -3208 -5764 -6 5452 12466 6247 897 1065 2530 -2571
17166 -2571 -2048 5333 3338 -6142 -6366 -5385 -5319 -1107 -1360 -3196 -73 1701 -2792 -2753 -461 -5116 -8713
17149 -8713 -4495 611 -4703 -4289 -6941 -7502 -11888 -8427 -4602 -711 859 1171 907 -898 -5485 -10480
17133 -10480 -16119 -12408 -6628 -10871 -14744 -13073 -9040 -7967 -10569 -11938 -7049 -4526 -5425 -5800 -3661
17118 -3661 -6225 -7744 -8653 -5461 281 448 -2936 -5347 -1513 -2439 -2480 1768 -2099 -7820 -8418 -11213
17102 -11213 -10085 -8800 -6777 -6342 -5048 -4206 -510 976 883 2580 -194 -5493 -10696 -10875 -1103 2808
17086 2808 -3116 -4869 -6429 -7371 -4024 -6757 -10292 -15593 -13636 1465 8660 5401 7119 11895 13329
17071 13329 14688 11281 9615 9321 11082 12466 11084 9788 5843 -2904 -5498 -6593 -1917 -3206 6244
17056 6244 15277 15405 5453 -1784 1979 108 -7428 -7375 -12115 -9678 865 11910 20089 34548 59145
17041 59145 90823 120232 121179 102308 94005 98076 116256 150012 202506 229510 188035 128375
17029 128375 92257 81734 94094 122703 135720 115864 79015 65108 70046 85997 103267 120770
17017 120770 113870 88431 76469 80621 107883 152969 208508 213781 156657 108772 79931 66996
17005 66996 74256 96846 109298 92503 63754 40339 24047 21764 29483 24658 13974 3600
16993 3600 2143 9343 4797 2656 4920 661 1827 -4511 -8855 -9167 -6112 -4612 -4819 6728 16166
16978 16166 11075 5102 604 -2142 -562 2517 -1131 -649 -6662 -10375 -12978 -8633 -900 719 -614
16963 -614 -6491 -6574 -1671 5440 3100 477 1259 4456 -536 -841 -4253 -2319 -3401 -6482 -5328 -1884
16947 -1884 -4222 2364 3591 5470 929 636 -2918 -8042 -4569 -4273 1908 5303 -363 -5623 -3993
16932 -3993 531 -450 -5202 270 1618 -3811 -11021 -13432 -7614 -3011 2264 -4076 -573 -6624 -13863
16917 -13863 -7852 -4287 -861 3276 3046 -5157 -2798 -2439 -4158 -2122 1512 5226 12054 7402 -2993
16902 -2993 -6485 -10178 -8529 -11153 -9636 -2135 -1403 -5106 -7693 -10684 -5659 -6714 -8842 -8329 -7520
16887 -7520 -4882 -534 -1659 -7909 -7067 -2485 -243 2348 -3023 -4166 -9683 -12968 -9062 -11222 -15121
16872 -15121 -11365 -9279 -8171 -9666 -9474 -14834 -16456 -12293 -4374 -4412 -6590 -11573 -13571 -12484 -20568
16857 -20568 -17679 -15841 -16354 -16575 -6598 -3361 -14481 -15129 -11514 -11209 -7508 -3 4144 265 -684
16842 -684 2327 1339 -6201 -2455 -668 -1546 -1232 -7866 -10632 -10332 -11533 -8330 812 718 -32 -4924 -3051
16825 -3051 -10184 -13078 -9082 -9155 -9110 -7251 -8488 -5189 294 -858 -821 2422 252 -545 -9188 -11259
16809 -11259 -11553 -4395 2738 3773 -1091 -8455 -15344 -8025 -4844 -355 -929 -327 1471 6851 -3704
16794 -3704 -7260 -5240 -8209 -10783 -18192 -21921 -21713 -9732 -2681 -4299 -10652 -7216 -1081 -2065 -5115
16779 -5115 1563 -425 -7817 -12912 -9488 -8744 -7929 -4202 -3079 -6429 -11695 -8316 -6571 -9164 -7590
16764 -7590 -9513 -6864 -4009 -3462 -9392 -12072 -18828 -19729 -20974 -14462 -8650 -7677 -6933 -4861 -3484 -8495
16748 -8495 -11377 -9783 -6528 -7490 -2346 -4865 -9109 -9257 -14550 -13308 -8825 -9889 -16883 -14814 -10360
16733 -10360 -5287 -3931 -4358 -5965 5250 3708 3436 7706 10024 3694 4782 3904 1004 2717 4112
16718 4112 5312 2627 -1393 -8454 -18230 -8397 -2663 -7146 -6562 -7932 -12776 -14911 -7082 -4495 -4120
16703 -4120 -7202 -7155 -7739 -2408 -2959 -2578 3211 3425 6370 461 -7806 -8415 -3395 -1063 827 5261
16687 5261 4516 -3018 -10428 -12795 -10282 -5016 -5983 -7025 -10444 -2946 1693 2024 3862 -1878 -1170 1015
16671 1015 9808 8723 6092 3192 5692 9194 7439 -4406 -563 7169 12155 12890 3001 -3816 -3611
16656 -3611 -7962 -6352 -4377 570 1291 4380 6751 4111 -1742 -1818 6898 -2953 -5119 -6292 -7367
16641 -7367 -6884 -8823 -2729 5687 7542 -5647 -14150 -6600 4025 8770 1199 -4112 -2159 1243
16627 1243 2478 -1579 -4175 -2477 -9370 -12943 -8166 -6043 -9625 -11022 -8611 -2353 -649 -2000 -2309
16612 -2309 -7603 -15806 -20949 -14201 -7820 -3811 2361 2010 5009 -6872 -10683 -8054 -609 2846 2575
16597 2575 3450 8243 1386 -4580 422 5932 8759 7411 7854 2509 5681 2126 -709 -2472 628
16582 628 11873 13247 5952 2158 1135 -3880 -4893 -5451 733 12727 12454 6385 -433 2075 -68
16567 -68 -6587 -7755 -3749 -3336 -3364 2523 316 -6574 -3781 -1675 -2526 -2573 -3048 3561 5490 5056 6315
16550 6315 8572 9159 5039 4402 1025 4799 -1530 -5781 -8448 -3987 1916 6073 5696 6726 8126
16535 8126 2628 -1925 -4295 -5619 1334 6777 5573 4223 6224 2431 -3085 -5454 -5911 -1939 7595
16520 7595 8938 -2180 -8635 -5810 -8700 -10942 -584 -1383 -7134 -4535 -9506 -7523 -6344 42
16506 42 3529 5255 2972 -785 -2052 3388 1185 -4925 -2911 3333 3049 4417 3679 321 -4968 -6257
16490 -6257 -2907 -1557 -5265 4155 8380 3596 3430 3858 1351 3820 7949 9616 14125 10187 7570
16475 7570 4258 6591 4808 5231 4838 4101 3410 -2417 -458 -823 5594 7638 4837 6123 -76 -1496
16459 -1496 1044 5341 4048 4611 7455 5518 5263 6095 7679 801 -9512 -9242 -684 2359 -5427
16444 -5427 -8152 -1352 6444 8830 6570 559 7385 14803 4537 -2248 -3160 199 5668 11066 12435
16429 12435 10290 4462 -1633 -9451 -8321 -395 4456 9337 6925 -107 3272 3922 -214 -4945 -8816
16414 -8816 -8621 -7498 -1269 3091 7805 6609 -2936 -13354 -14363 -9524 -5905 18 3340 9259 8861
16399 8861 4865 1317 -11 1501 4476 3771 1953 7786 2811 -1794 3566 3036 2171 7009 5877
16384 5877 -815 -2862 -3929 -9116 -3503 -3025 -9594 -10381 -2660 -8926 -5859 -3998 -729 -3854 -5653
16369 -5653 -4861 -296 10116 4237 7095 5703 7210 7984 5804 -363 -4001 -8189 -2937 -1654 -1185
16354 -1185 3612 4724 -8460 -13643 -9506 -7094 -11054 -10178 -7811 -3157 -3539 -5237 -4665 -7590 -5975
16339 -5975 -7209 -10263 -7326 -3788 -7004 -6017 -709 2307 1887 2285 2040 5179 6271 -458 158 249
16323 249 -5600 -6222 -5309 5150 8204 5571 1714 -5558 -1706 -3377 -3797 429 2004 -2411 -6112
16308 -6112 -9416 -9490 -6855 -1885 -3203 -4865 -13444 -14551 -7541 -1739 -814 3775 12463 7365 4697
16293 4697 2077 -10606 -10573 -6595 1412 -1116 -1953 -3367 -10126 -11784 -6434 1208 4412 -295 -4604
16278 -4604 -6179 -6598 -8783 -2366 -219 -3230 -3795 8305 15291 3266 -6970 -9245 -9144 -3069 -7377
16263 -7377 -4132 -4467 -7724 -2898 -7924 -13192 -10740 -9234 -13995 -11796 -4763 -1994 1683 2929 9416
16248 9416 13391 5523 910 7378 8948 11146 6057 -2361 -6924 -369 799 -2545 -3320 -3525 855
16233 855 -7530 -6833 -1150 1672 4665 931 -785 -512 -3846 -5077 -1720 -5889 -9692 -5764 -1098
16218 -1098 -4422 -9283 -9483 -5209 -955 -322 -2659 -1981 -7162 -13898 -9888 -2559 3151 2415 3401 5294
16202 5294 4254 527 -1480 -3072 -4210 -2859 -3061 -3238 -4779 -480 1327 4389 1145 4605 784
16187 784 -9845 -6811 -7817 -9201 -10077 -14906 -11102 -8707 -845 2264 132 4032 2902 -2174 -5166
16172 -5166 -12686 -10730 -4061 -6236 -7989 -4684 -4486 -2595 -3201 -6496 -6128 -1638 1942 9838 9980 7152
16156 7152 2389 7601 7332 6125 -907 -6131 -8955 -2185 6530 9617 4757 1920 -2357 -2208 1080
16141 1080 1414 1251 32 -2806 -2540 -1857 -4798 -5613 -2066 -8528 -14606 -16136 -19393 -16564 -16409 -10980
16125 -10980 868 4420 5283 2473 1730 9809 14275 9310 4390 7374 756 -5849 -7042 2025 2492
16110 2492 2310 4319 -525 2014 2577 -4489 -7263 -5689 -7144 2354 -1482 -6521 -14830 -20713 -17027
16095 -17027 -9916 1844 5264 5263 2124 2844 10522 12406 6820 -438 -2040 -5769 -10294 -8190 -3276
16080 -3276 991 330 -2369 486 -1177 -4825 -2692 -3353 -894 1153 1292 1239 4301 5507 5617 637
16064 637 -1996 -2574 -709 1199 -1824 -5512 -2394 -1626 -6900 -6858 1277 4732 -410 -2433 -7950 -7675
16048 -7675 -10653 -11138 -14405 -14061 -4864 2490 -2875 -11317 -6611 -4099 -6262 -6139 -7980 -8409 -4642 -168
16032 -168 -574 -430 -6390 -4451 1268 -957 -2958 773 -256 -506 -649 -929 -4577 -7442 -4365 -2985
16016 -2985 -3705 -2694 -4015 -5804 -7253 -7216 -1447 2796 1054 3756 8252 2429 1031 2761 982
16001 982 721 656 -709 -541 1289 -1752 571 2022 -504 -976 2934 7219 1173 -4806 -6275 -8970
15985 -8970 -846 -3678 -4408 57 1167 -4805 -4978 -1856 -4378 1044 4063 -1032 -3396 -1718 19
15970 19 -1544 -3577 963 3042 1180 -4551 -2228 4727 2107 -644 -3564 -2928 -4688 -14065 -14591 -6586
15954 -6586 -1868 -3080 -4309 -2422 -3841 -1361 1351 -656 -2893 -13896 -17156 -16945 -16200 -13192 -3173
15939 -3173 1522 5431 2151 450 -5291 -6160 -2429 1952 5474 2731 2248 2789 2808 4463 770 467
15923 467 -3842 -4029 -3504 -1319 259 -3470 -8424 -6000 -749 6424 6151 2854 1039 -3537 -7243 -1701
15907 -1701 5404 -2046 -2167 6160 10905 9830 12516 9383 3696 3646 851 -7901 -12736 -9036 -7707
15892 -7707 -7329 -11510 -9044 -2683 -4740 -11956 -15398 -14479 -10549 -9296 -3987 -1502 -8175 -8895 -5287
15877 -5287 1060 1648 1874 5153 4265 4888 -1444 -3366 -3451 177 2614 -6499 -5448 -2490 -4264 -6337
15861 -6337 -4846 -3060 -6618 -2056 835 -1687 -5190 -7964 -4443 -3072 -8698 -10329 -2743 -995 1955
15846 1955 5175 4944 7458 2305 -7140 -2409 2050 -6067 -10450 -12231 -5903 2994 9330 2461 -3657
15831 -3657 3717 -1624 -5427 -12785 -6778 2706 6373 4216 4139 -254 -7532 -10095 -7416 -3162 -2896
15816 -2896 -2523 59 288 -3617 -3304 -3779 -4798 -260 3770 6666 4751 41 -981 -1406 -2645 -7912
15800 -7912 -6263 -2963 294 7730 4049 2106 755 -284 5553 8105 4435 3622 6775 5770 13431
15785 13431 11171 7878 5150 11969 14780 12923 10135 -619 -2481 290 1703 -2916 -4166 -8127
15771 -8127 -2950 6390 9392 6256 1215 4242 1235 2215 -2787 -5047 -2929 -1898 895 -6321 -12006
15756 -12006 -15663 -10691 -1757 6388 7880 9361 11583 9816 979 -5919 -2256 3637 4943 -636
15742 -636 -4857 -2045 3620 6149 1406 -220 -1154 3736 5917 5436 6674 10323 10207 7318 10382 6706
15726 6706 -2519 -1878 7447 12716 6112 -1731 -747 7139 7925 2428 3270 6126 7070 6141 4304 1210
15710 1210 -315 4741 4849 7449 -3742 -11394 -11734 -8980 -11895 -10908 -8547 -5319 -2478 919 4152
15695 4152 8054 10299 9164 6261 -1605 -4194 -1008 6031 6920 1736 453 567 2199 3814 4176
15680 4176 -154 -95 -1848 409 2626 3584 4580 7393 6412 5681 6240 264 -8023 -3985 -215 1578
15664 1578 2821 1979 -2708 -4872 -2046 262 -1581 -2002 223 3594 6541 5642 6958 4781 6686
15649 6686 6215 3097 -1906 -4741 -4538 -3931 -7751 -1701 12415 17406 11511 4 -160 -4389 -5366
15634 -5366 -1544 1104 6280 3865 -566 -6678 -7433 -3984 -6836 -4784 3946 3680 4246 4442 6549 7840
15618 7840 4021 -3353 -8224 -8034 -4195 -4155 -4921 -7051 -4991 313 -338 -586 -3839 -5257 -5867 -3026
15602 -3026 22 9240 12707 17441 16395 15436 8108 1153 -2170 -2112 -4522 -4564 -4715 -5665 -3273 578
15586 578 -4491 -5749 -6744 -7808 -2258 5478 4322 2927 2095 4247 -408 1181 3212 13239 13370
15571 13370 4153 1254 3823 2359 -5300 -6146 -7294 -10221 -6266 -6329 -6134 -5678 220 2293 3340 4307
15555 4307 1533 -3010 -2244 -308 4580 6654 4634 1627 -927 -4297 -1555 2983 3290 455 2098
15540 2098 -2768 -2192 -11296 -11401 -10161 -7414 -10433 -11950 -12147 -4244 2247 2948 -1166 -4231 -4014 -7985
15524 -7985 -6735 795 6979 9726 10813 11926 13154 8598 -1951 -3208 -2311 -2838 -856 -1768 -1245
15509 -1245 -3149 -11611 -7034 -5039 -1759 4412 8466 14038 9680 6447 9478 1690 4750 9160 3933
15494 3933 2101 6519 8394 5118 2477 -609 2152 -3577 -5012 -1758 7334 7233 4168 9476 7053
15479 7053 6795 -1833 -5591 -4550 1076 2954 2755 -68 -9678 -2943 908 2296 -958 -7649 -2337
15464 -2337 4958 7824 2895 3785 -706 -2609 1350 5285 5079 9758 8241 2723 -860 1424 4933
15449 4933 6393 -894 1014 3503 7408 322 -2794 -1170 -5671 -6907 -5767 -6277 2627 10523 12305
15434 12305 10724 6187 4824 6217 13403 14441 9002 10585 8417 3581 2108 -2307 -2132 -8654 -9015
15419 -9015 -272 6095 -463 -4951 -2667 1485 -1457 -1701 -4537 -5434 2686 8276 2714 6708 7102
15404 7102 5067 3403 -3166 -752 813 9295 11064 6091 -567 -2178 -3425 -2299 -274 2505 938
15389 938 -1269 4915 11823 8926 5364 7596 2910 1973 4807 5209 12935 14095 12290 13628 10645
15374 10645 3748 4790 168 3665 6690 3926 -4151 -10173 -8416 -9207 -11462 -12714 -4317 5057 9436
15359 9436 8069 5573 7815 4510 4480 -2096 -623 2542 1435 -3302 -1864 -3700 -1104 95 3157
15344 3157 3210 -2769 1529 4531 -93 354 1953 6770 7408 3695 -1508 -1001 837 3132 2180 7318
15328 7318 8995 10921 15171 14786 4195 -1114 1055 3003 2080 1482 3254 5779 2609 -2088 -5152
15313 -5152 685 3175 6073 1229 -3692 -8210 -6857 -1493 1962 2180 -3867 -3638 -5824 -10223 -4877
15298 -4877 1899 3947 5513 13380 9529 6110 5688 6247 192 1487 2144 1862 2126 -671 2290 4218
15282 4218 2902 5501 2959 4998 3941 11417 13328 7621 2493 -3903 -9368 -10362 -5115 -10212 -4283
15267 -4283 2551 1561 -926 -1262 -3561 1483 5618 8013 14758 13023 11034 4861 3039 3245 1672
15252 1672 6330 9393 12817 8331 5624 5572 9746 11339 2253 2170 2895 4094 -2045 -7220 -3629 197
15236 197 4602 2529 1026 5998 7757 6928 12227 12632 5253 1019 3644 8935 10997 8414 5929
15221 5929 3931 5313 9357 5955 2656 2061 -308 -3011 2439 3456 5279 6325 -812 -6142 -13
15206 -13 -187 5306 11961 8842 5186 -158 -2080 1601 1017 -3190 899 454 -1064 2715 11831 17070
15190 17070 16627 19972 13453 10516 9614 6859 7982 6011 2144 -3067 -6907 -4364 3302 4742 5604
15175 5604 9348 9185 -641 -694 6457 5300 4545 8370 8763 8210 3515 4456 3021 -4369 -5315 -4334 -6468
15158 -6468 -5246 -1451 2834 5630 5151 5867 3423 -1379 -6744 -12155 -10984 -3581 3648 4134 5261
15143 5261 3886 5841 7221 5177 2272 3000 9790 8659 12882 15226 5322 -397 1263 -448 1205
15128 1205 4605 2475 3744 9349 12944 20419 14706 4451 3639 4109 2756 -1044 -3322 -3921 3255
15113 3255 3879 7077 12100 5471 4149 4017 5690 7648 11991 11103 16900 15674 3774 -2260 1454
15098 1454 8579 14290 14282 4980 4961 5108 2971 -1048 1314 5446 -2317 -2368 -1806 -162 -899 2209 3150
15081 3150 -2769 -6969 -11042 -2785 1298 -3536 -6407 -6307 -2348 2131 4004 433 712 1583 4993
15066 4993 5376 -9106 -13516 -12118 -9053 -10049 -5020 -3458 482 1179 -2090 1413 3840 1739 4284
15051 4284 8820 16300 18414 11404 -474 -3344 604 -1395 -6893 -7969 -11406 -11080 -5989 359 1258
15036 1258 6112 11585 16207 6960 -2117 -5146 -312 3892 3148 -1199 -2407 1929 2764 684 -2076
15021 -2076 -4681 -10273 -9357 -3258 2178 480 -976 -4974 -6841 -4636 -6447 -2977 -1299 2285 4178
15006 4178 7750 2918 -714 -1966 58 -3345 -5146 -7861 -9551 -11176 -5702 1163 4661 -589 -4153
14991 -4153 -1724 -2936 -11040 -5552 2295 245 3729 1635 -5706 -4107 -1902 -2162 763 -3174 -6710
14976 -6710 -9184 -5865 3285 10342 8907 4089 2136 2596 612 4542 6761 -1204 -351 461 -897
14961 -897 3183 9518 8957 1756 509 8607 10703 6112 6774 4416 3835 1310 -4619 -6940 5127
14946 5127 15349 7021 -1500 455 5489 5001 9857 14072 14855 12534 13033 14249 13172 12186 9155
14931 9155 1992 -287 4399 11578 8288 -526 -933 -1470 269 193 -5022 -339 -792 -1299 1917 3605
14915 3605 10652 9974 7723 10095 10010 6961 3146 1301 -940 -3266 -4658 -4336 -9707 -9692 -5712 -3943
14899 -3943 -1893 5906 6448 3665 1387 1591 7524 2337 2495 -870 -10414 -5848 -4579 -5462 -4583 209
14883 209 3767 -754 -3085 -5419 -10144 -4958 1459 7726 13332 13536 6788 1268 2017 9428 8559 847
14867 847 -356 5095 8639 10386 10776 11178 11036 8373 6690 -1388 33 1185 -2880 1551 9677 10928
14851 10928 8861 9521 8624 1401 -3197 48 1561 763 -3 3050 5690 -1604 -2564 4773 4341 855
14835 855 1121 4405 2358 6055 8575 5152 1780 -2639 -1854 -1067 1846 5328 2582 -950 1241 -2572
14819 -2572 -75 -818 -625 -128 1560 3513 4392 6929 8812 16814 16205 6781 -464 -2729 4178 14202
14803 14202 14919 17016 18464 10070 10232 15703 14630 8634 -802 1680 6563 5721 -4901 -7468 -113
14788 -113 7525 11258 15462 18840 15182 5683 5601 17788 21841 18966 13262 10350 7125 939 2820
14773 2820 -72 -2427 7761 7862 4346 -165 -1345 -3247 -2355 -1655 -5459 -1457 -1918 6107 3199
14758 3199 6866 9336 3543 8560 3305 4807 3284 5557 3567 4991 5813 2873 1020 831 2326
14743 2326 4677 8624 12229 8591 8414 9132 9730 8094 5700 12494 16583 10048 11894 12023 5069 2526
14727 2526 4257 -504 -8409 -3939 5027 10920 8505 4290 2300 742 828 2217 5127 12652 9169
14712 9169 1824 -3315 731 8974 12015 17273 14947 18775 20312 17158 12419 10328 3768 -28 5792
14697 5792 11417 15701 9778 6163 7332 6103 5179 5314 9233 12239 11264 10894 4714 1739 -4923 -3730
14681 -3730 55 3871 5094 6358 6362 12280 18108 8971 6373 7544 9475 7617 10543 9155 10399
14666 10399 14741 21216 30216 35445 31170 27657 31341 46303 48100 40198 28236 17032 8584 6852
14652 6852 1113 -5285 6832 9126 4108 11670 15744 15695 16461 11282 5710 8609 11427 14966 15799
14637 15799 7033 5653 9883 7604 11183 17264 14735 12626 6241 3525 7642 13946 9326 11104
14623 11104 10363 10830 11194 6937 6422 13099 16010 12528 12173 11677 12265 12401 5836 6503 5942 5134 10398
14606 10398 16883 14651 12350 9598 11142 8316 1020 1308 687 4479 2413 2843 2781 8300 15153 19325
14590 19325 18927 17342 18050 7770 6140 5665 8220 5961 7424 8969 9193 6750 8617 10287 12449
14575 12449 10446 15957 13755 7220 9528 12837 11261 6227 8185 15623 20026 20017 20095 18836 16712 12468
14559 12468 15113 11469 4931 7667 7692 -130 -2964 1058 -4410 -4857 5381 4620 3630 5827 11245
14544 11245 11067 12254 20267 16557 8978 12084 20155 15925 4670 5479 13233 20238 22101 22508 18450
14529 18450 12505 16146 19992 26307 42742 53025 54952 59199 61827 53873 45728 39245 31708 28234
14515 28234 26856 22667 14609 8001 10012 13036 14039 16209 14872 15010 9070 -87 4141 7413 12116
14500 12116 15174 14818 13952 12896 6855 2847 5356 4235 6513 9770 10546 9240 4027 3629 -3626
14485 -3626 -4603 1090 1697 2441 2662 -488 -3899 -2779 3708 4513 5197 7794 9838 7632 6920 11360
14469 11360 13808 9469 7711 7010 8523 17361 19911 12987 11726 12823 15951 10312 5892 5828 6204
14454 6204 12338 18860 15088 15531 20414 17601 14321 13313 18529 22421 18597 11847 8817 10591 13811
14439 13811 14813 8261 4521 -2018 -990 6073 6754 8360 16218 18097 14700 19538 19332 20044 24685
14424 24685 18374 12881 12326 8317 6339 7688 7317 7915 6293 5923 14413 16657 15171 15907 14079 2995
14408 2995 -1712 7519 12943 17482 14497 9950 4429 1555 -1117 3623 722 -1871 2180 3865 332
14393 332 6709 13775 14403 5898 1150 5522 8359 6244 10191 8048 9925 11959 12823 15030 9584
14378 9584 1031 3167 3240 2372 9914 7823 9150 11764 4595 5815 -2003 -7510 -1934 4503 8167
14363 8167 -1252 -469 3721 3733 4166 6826 8961 11730 16867 17353 15866 14554 13984 11502 8755 13227
14347 13227 15216 10898 19435 18507 10197 12095 14163 19485 27107 30545 26429 25036 28814 23448 19355
14332 19355 9474 6941 12299 13518 18479 14035 11111 17422 21881 19538 19114 15555 10882 11860 11045
14317 11045 11786 18497 24520 21361 8084 6284 13263 12075 13890 11441 7043 3869 4837 3517 854
14302 854 3921 9314 4935 8568 16047 23232 21309 22847 19860 13680 14337 12860 15579 16567 17788
14287 17788 13554 15705 20250 17578 14519 14251 13644 21587 18870 13416 8672 14411 17736 25944 20556
14272 20556 18978 12233 9454 12401 13360 12594 10453 9416 5545 3090 7492 11757 23604 29134 28812
14257 28812 27204 27501 24673 26649 25239 20385 25770 31350 26353 24245 30625 29658 25880 24333 27679
14242 27679 28047 33746 42860 38463 38506 32168 26847 26673 29291 31827 35227 39514 41714 44077 41096
14227 41096 37280 37418 34963 27767 23003 20227 25474 34772 36014 39395 44594 45353 45942 48749 48138
14212 48138 51487 59627 68936 79427 83528 80546 84724 100498 124732 165708 226170 309484 451248
14199 451248 686034 1014185 1289089 1474538 1663679 1714151 1566648 1375233 1164643 830909
14189 830909 541832 363894 255600 193984 158564 138019 121419 110177 97941 89068 92182
14178 92182 80146 75161 72966 67467 58904 62117 63884 56177 50224 45516 40789 35029 31631 29519
14164 29519 28941 31865 31764 31403 44985 50338 41349 36678 37942 40320 33613 35123 40481 35081 37307
14149 37307 38783 36298 37888 35283 38231 35172 29556 25624 29847 27892 22975 14560 8976 17300
14135 17300 31628 37282 41165 58265 78485 96699 105989 101132 81581 61386 53697 49113 45793
14122 45793 42851 44373 38117 24561 24705 22783 17247 21918 29702 20629 24686 36145 40812 38239
14108 38239 32631 37482 30805 27023 24833 25346 26204 29243 40451 45169 61278 85109 113771 168576
14094 168576 221166 228400 183879 129412 92987 76967 66371 60476 62407 60113 53062 45009 49372
14081 49372 43427 35542 43068 49836 54580 59652 60672 58437 57171 54739 49693 48360 52463 57593
14067 57593 58516 55428 57216 57217 63209 70073 75760 73293 65338 63404 70929 78020 81541 94955 113061
14052 113061 125610 141979 162137 181797 211142 232627 247139 265269 291721 320891 356127
14041 356127 398281 456711 541123 688966 934869 1362079 2121574 3462908 5615376 7905771
14031 7905771 9732902 10610456 9455340 7568253 5214914 3222849 2017931 1352527
14023 1352527 969726 739129 592282 490596 423174 380390 350951 328284 315008 296133
14013 296133 279513 276218 290160 317702 371984 488643 668066 777208 736529 557348 374797
14002 374797 268909 206490 176551 152531 130977 118677 108895 103878 109646 112414 118431 145014
13990 145014 188750 245777 269203 258911 225543 174267 141017 121528 110954 105940 97336 88917
13978 88917 89697 102659 114423 135797 177504 217634 232929 221563 223691 253315 276378 275132
13966 275132 262522 265321 278728 302394 314764 317834 308727 288421 254395 219320 186244 157116
13954 157116 139208 127406 121050 117103 121570 132573 152383 176200 213624 287347 417313 632691
13942 632691 1001792 1529225 1898594 1702737 1173521 731562 466630 311945 218689 162370
13932 162370 136329 117253 109484 106488 112027 112479 107035 105862 106119 102397 97861 93841 98765 89907
13918 89907 68726 45011 33633 32689 28638 26810 23316 19664 15880 13451 14758 19997 24605 26523
13904 26523 33349 34261 39397 44957 41050 40148 38075 42117 47684 50562 54419 65260 67560 67070 64762
13889 64762 61183 53016 48877 56818 61868 64360 63945 63555 56076 70900 82329 80812 78749 80626
13875 80626 66770 64040 55426 43823 38955 27715 11233 455 2671 4900 10497 35972 73535
13862 73535 99325 125426 155460 168316 173879 172880 176605 176921 177377 180850 182504 184189 189541 194469
13848 194469 200503 205224 199677 194638 200439 208317 229443 270854 317504 361264 409279 460017 491341
13835 491341 503645 501447 479355 443802 399406 345357 295231 261364 241047 226047 215465 211490
13823 211490 205526 205084 205308 198704 193060 186704 172027 165586 173889 177078 167110 160159 159577 156497 158418
13808 158418 161342 164698 176464 180585 179118 180398 188655 195035 201532 212658 224776 238475 246635
13795 246635 259204 280545 314881 368475 425761 462481 490248 509588 547247 616052 683721
13784 683721 722374 725359 712912 678517 627636 581678 545673 508882 495456 483484 474633 471145
13772 471145 473991 465111 459107 463058 475946 489624 509587 520329 531025 541243 552870 563066
13760 563066 581516 615148 654257 681500 711143 736378 761143 767020 786022 813239 831367 863961
13748 863961 914009 987100 1067463 1154882 1244964 1341493 1442343 1553083 1662628 1780947 1895654
13737 1895654 2024472 2186521 2389354 2638078 2950175 3357636 3939633 4746204 5597916
13728 5597916 6518417 7485323 8301911 9097691 9981585 10867207 11598303 12569669 13949861
13719 13949861 15831666 18535628 22855998 29779661 41098346 60676250 95080563 151222523
13711 151222523 214105881 248162415 280487815 309296967 302243043 267047524 238322259
13704 238322259 191633744 127869172 80826836 53453306 37841743 28653326 22913606
13697 22913606 18923760 16278919 14571185 13168324 11997188 11238809 10357257 9366635
13689 9366635 8484428 7586623 6553088 5635652 4751193 3963419 3390267 2966270 2635667
13680 2635667 2393705 2198385 2032373 1873494 1729475 1610939 1517458 1434755 1368485 1310880
13670 1310880 1263227 1216323 1155738 1105145 1055416 989301 928042 872807 816444 771555 738477
13659 738477 711979 686663 663650 639471 624244 602632 575419 552824 534571 517016 498021
13648 498021 470548 445476 424949 401614 375013 353959 337551 324609 328109 353449 390478 427940
13636 427940 440440 412152 394919 411576 404148 355049 318751 307416 300013 297389 297801 285837
13624 285837 276432 271294 257160 243298 233918 233812 233581 233413 224207 220521 218921 214327 205489 198988
13610 198988 196807 193403 194359 186457 180543 175341 167161 158885 150116 143810 143834 136674 126337 122496 113770
13595 113770 103062 102469 104325 100305 103567 109273 124061 133275 138095 148027 155630 165036 167049 149679
13581 149679 132767 121929 99884 84983 78014 62922 67003 75719 83843 80480 73175 74995 70753
13568 70753 65614 56905 36760 26456 19247 18131 16678 21504 13908 13923 15527 17927 28259 44214
13554 44214 70940 83992 98293 121561 140876 144034 145193 144260 128940 115604 99758 78120
13542 78120 68660 60917 63573 69384 73346 74460 82218 92946 99420 102224 108971 112289 108715 101169
13528 101169 97426 86310 69998 60348 66857 62561 66868 76421 72084 69634 67033 60740 64420 75274
13514 75274 81337 86809 87203 88209 78677 75036 74810 83207 90346 92697 94039 87526 84081 75921 61512
13499 61512 58988 55734 42334 39577 30584 23849 17549 15111 21109 26231 32644 41857 50532 54182
13485 54182 58726 53634 51399 53884 47639 40542 32567 26408 24645 9961 1309 7136 18140 22861
13471 22861 23254 24145 22557 22927 28322 36345 44086 52146 49666 49690 52617 54095 54040 56037 64809 65888
13455 65888 69653 73959 70653 68341 65651 60953 64615 72441 78597 80667 76583 81007 75476 64512
13441 64512 60012 51981 43942 42948 43153 41209 34902 33426 32705 30148 25309 27382 31589 29857 28185
13426 28185 27144 21320 22717 26614 22268 19752 16058 18922 20870 19721 16215 21153 26734 24347
13412 24347 25593 24762 31472 33422 31553 31839 28171 33181 34276 34246 32765 25625 24889 22643 30078 36569
13396 36569 30247 24500 19850 16463 15789 16891 22216 13422 14360 22137 24958 21257 24982 33206 37394
13381 37394 31860 29282 25100 27954 29623 21259 19240 15446 13822 19029 25350 28808 26460 18666
13367 18666 11807 12352 12602 17195 20919 14091 8531 18176 22090 21220 13095 15271 23238 17932 9436
13352 9436 4507 8290 15402 15936 13088 3546 1846 9110 9314 11044 4505 1058 3304 5604 8236
13337 8236 5481 -1693 -1612 3505 5832 -1952 -1049 4821 4921 8663 10176 10695 12527 10774 5832 3518
13321 3518 396 220 6029 5499 4947 7634 7851 7344 8732 7227 11155 18358 13387 8080 2166 4077
13305 4077 10955 10954 19402 24694 20421 17098 14404 18501 17866 16318 14404 13812 11743 8293 9230 11421
13289 11421 11195 14507 16203 16961 9563 8147 10184 9978 5825 6148 8387 9305 14277 13264 13360 14616
13273 14616 10944 8519 13459 19927 10495 4131 -2297 105 -353 8065 10298 10699 13694 9135 10208
13258 10208 14086 19453 22798 29090 21882 18202 14108 13474 11229 14374 10103 4518 2343 2512 -4294
13243 -4294 -1083 6357 8740 8037 11320 14481 12947 20085 25242 28767 33122 31150 36800 52350 65972
13228 65972 67249 76270 79881 83504 97135 125738 169160 222748 317212 495060 783973 1114244
13216 1114244 1323991 1515423 1675839 1646601 1460249 1279123 1008774 678472 441487 296279
13206 296279 207268 156075 131267 117310 104091 88730 74509 64106 64658 66969 57257 51425
13194 51425 45719 38867 36898 32654 30010 25061 19801 10730 6438 9540 14044 14756 16353 24617 28028
13179 28028 21832 16472 11396 9236 15124 15775 17930 21607 21314 22077 16762 11897 12869 18531 17318
13164 17318 5012 1381 6587 9183 8263 7430 7319 4289 1525 3686 9965 9919 11941 17286 24356
13149 24356 20994 13744 7719 3364 -1058 680 1073 -4002 -872 722 -97 -3421 1647 9769 12276
13134 12276 15521 14646 16333 11847 9540 8421 6512 3739 4212 652 1417 4639 8890 12836 9550
13119 9550 5083 3487 9459 12342 13581 7459 7538 3327 -1102 -1558 -4775 -2297 -1234 -5781 -4214
13104 -4214 -5872 -5043 -4834 -43 1194 -6782 -11405 -1648 934 2353 4626 731 1319 -765 2612
13089 2612 4064 2572 2887 11057 16323 12733 7728 7428 6155 5361 5920 8682 15798 19154 16341 16144
13073 16144 12845 11995 17943 15087 5590 76 -1776 -7778 -11021 -8079 -720 -457 -5379 -6956 -11103
13058 -11103 -12185 -11883 -12486 -4027 1431 -2276 -295 -176 4461 5637 4358 -5276 -10925 -5941 699
13043 699 2091 -4116 -4308 -6913 -2332 840 -2432 765 35 3900 2578 2792 100 1297 10683 12449
13027 12449 14349 15439 12605 6358 6306 2075 2238 4287 9087 4914 4391 4815 4070 6906 9673 7612
13011 7612 25 -5079 -8825 -5352 -3173 -3251 7685 8574 2870 756 3288 4168 3413 -1061 -1027 3708
12995 3708 6351 5837 11252 13821 8441 4702 9207 9015 4153 7361 6195 12411 10455 11859 15298
12980 15298 12154 10947 11597 11994 17003 15279 6109 3707 5036 6369 6043 9102 5749 -2230 1770
12965 1770 5564 2083 1630 4383 8323 11720 11132 3511 3209 -721 698 7108 7954 10747 11008 7782
12949 7782 5686 11377 12763 12737 6766 -2391 -7539 -8755 -3576 -2791 -8734 -11268 -1341 7009 16242
12934 16242 13127 3353 -4511 -7136 566 -894 -5441 -90 1256 3931 369 -2827 -1717 -3538
12920 -3538 -5847 -1712 1173 5879 6892 3982 -7990 -11399 -2353 2331 932 1240 5922 2229 -7221
12905 -7221 -8144 -6984 -1893 -8628 -12666 -11149 -2610 1747 3767 8556 8978 3239 872 3713 6099
12890 6099 -1209 -3035 -3942 -7556 -5915 -6022 1291 4 1070 8033 13300 13397 9260 2009 -929 108
12874 108 3216 8860 7297 -2043 -7598 -12120 -6049 -5571 -4477 -4846 -5924 -1645 4437 7414 7190 4485
12858 4485 -2804 -5371 1574 1741 5622 6923 6148 8773 1600 -2019 3223 9204 6371 5353 5085
12843 5085 4097 2844 -3577 -4075 -3334 188 2639 5663 3192 2172 4453 1333 1809 2517 4945 4065
12827 4065 6756 6884 7211 6172 4436 3698 3122 -4668 -5339 -4471 -4754 -1675 2129 2736 -4722 -6554 39
12810 39 4067 5967 7632 10615 15100 11871 14907 16611 21689 31051 35249 35499 40702 50897 53751
12795 53751 53839 54617 56548 66091 72951 78766 82159 90283 96225 103553 112983 125562 141366 175741
12781 175741 210486 258023 338536 453093 598888 755991 920070 1073640 1200486 1292729
12771 1292729 1355477 1393645 1406442 1394852 1358164 1278629 1159632 1019123 862163 709980
12761 709980 576474 446238 340192 262877 213608 182642 160191 151679 150003 142096 139835 137736
12749 137736 130083 132870 152100 177125 215895 272561 344786 423962 493564 549580 579795 594800
12737 594800 602781 600138 600467 605110 604845 589783 560659 506069 436586 357083 280600 217821 163046
12724 163046 119843 93843 81680 67244 63115 63904 51635 46870 44471 32299 27293 21628 19197
12711 19197 22966 25409 19676 17317 15077 12299 7063 10442 11338 5675 4243 9228 10752 6759 5826
12696 5826 9726 15017 20581 20532 18423 17399 12218 15706 18175 15216 13931 13046 11512 6365 5369 2727
12680 2727 -200 -1669 -6249 -2384 -1990 300 2164 1004 562 3901 -1692 -3687 -8875 -6732 -2487
12665 -2487 6205 11821 9048 8207 9098 12006 17343 19003 14784 8000 8096 10714 10268 11855 15971 20713
12649 20713 14356 10470 14228 18973 19220 7845 7037 7709 3404 7836 9036 8668 10301 7911 9407
12634 9407 3245 -5140 -1586 -5773 -3149 1695 6382 4859 -2349 -1212 1422 3716 4536 8050 10454
12619 10454 11875 8046 1365 2941 4788 5686 -1706 -6910 2473 4294 8855 11312 8461 11701 10796
12604 10796 11909 3269 -3613 2203 3369 6959 4989 7088 5896 449 1038 -7736 -9102 -1636 3246
12589 3246 3201 4273 520 -465 -224 -9744 -16107 -10931 -2326 2810 7769 7862 816 2036 4629 3627
12573 3627 -3511 -2958 34 2315 2664 -5324 -10285 -6729 -3713 -5656 208 2164 728 -5910 -5472
12558 -5472 -2713 4153 12157 10654 6329 3640 912 826 1982 -2152 -5161 -4226 1209 -1950 1316
12543 1316 1461 -1751 349 -1764 -1925 3580 4297 1662 4530 10591 10235 7293 5232 -1136 -1146 7281
12527 7281 4288 5094 4755 1709 753 1192 -621 1709 1328 2609 3545 1295 2083 2630 4798 -927 -5174
12510 -5174 -5300 2739 6088 8742 16585 18185 14816 17834 11170 5162 3247 -750 -3514 -4616 -7698
12495 -7698 -2903 816 9004 13353 7300 10305 10421 5796 7574 5366 -1272 -8984 -10209 -5920 -8311
12480 -8311 -3858 -3489 -4653 -1515 -1368 -5800 -8259 -9532 -7908 -9374 -6729 -1548 -5669 -5330 -4315
12465 -4315 -9189 -4386 -1174 3297 1812 -861 -3969 -8169 -7009 -1794 -5190 -5077 -3420 -1738 1108
12450 1108 -572 -6581 -5247 1835 1061 -1523 -1970 -5801 -10149 -4763 -116 2148 7819 5748 -3799
12435 -3799 869 3832 4893 3058 1019 -2775 1436 5458 3474 -143 -814 -3416 -2820 321 3115
12420 3115 2687 5708 4674 9281 12254 10274 8914 7486 3887 5646 4474 3787 -5401 -8027 -4753
12405 -4753 -5228 -4861 -5989 -8067 -8615 -11891 -9881 -7903 -9772 -7501 -6109 -6686 -13424 -9778 -7883 -5746
12389 -5746 -2908 -4091 -2984 -3574 -5057 -4547 -4158 -7441 -5049 -2926 481 5925 9241 1067 -4693
12374 -4693 -3711 3048 8462 7996 -996 -5093 -6339 -3875 4702 2888 6037 2298 3408 4115 6349
12359 6349 14646 12228 11998 13876 16439 14572 13025 5014 3563 37 -1567 -2166 -926 4455 -1446
12344 -1446 -875 -4911 204 6384 6696 8438 10870 1649 -5354 -10663 -6518 -4399 -1159 -1596 -891 -5544
12328 -5544 -9261 -11852 -7668 -6635 -1887 2416 32 -8390 -8268 -3185 -5176 -7682 -6019 505 5156
12313 5156 8919 9821 9443 5464 5420 5285 -1233 -4365 -9371 -13021 -13848 -4503 -3804 -2360 -2424 -2926 -718
12296 -718 -44 3098 5082 -3994 -6020 2151 -1797 -1577 1442 -2527 -784 3333 7326 15204 11103
12281 11103 7330 5362 623 -832 9950 10529 4241 3669 4064 1555 -5159 -8011 -5950 -1016 1306
12266 1306 -7282 -5971 3088 8851 5555 4413 4654 3866 3333 5596 2828 397 -5427 1030 2153
12251 2153 -4235 -2419 6560 5014 3607 849 -353 2869 -943 -2711 -946 1259 3408 1748 -3741
12236 -3741 -8313 -4246 1378 6122 7371 43 -7553 -15155 -11588 -5945 -552 -1264 -6313 -11672 -14182
12221 -14182 -11966 -12943 -14750 -1956 6114 5511 4053 6762 -536 -6290 -9703 -4416 -3308 -159 4366
12206 4366 3572 2618 5846 4085 5604 -317 -74 -4061 -8093 -7873 -1014 5212 2844 -8063 -9869
12191 -9869 -658 2453 969 2072 1793 310 -6359 -8552 -7182 -5123 -1560 1559 1294 506 1860
12176 1860 368 -3396 -2463 -5508 -11370 -12490 -15473 -16378 -8152 -3457 4680 10277 13300 11400 4327
12161 4327 1752 7788 8542 9852 4573 3691 -220 2390 10607 5831 546 -3381 -4914 -5559 -2333
12146 -2333 4895 5255 700 192 -9216 -15181 -11012 -14182 -11729 -6801 -5517 -2950 323 130 -1584
12131 -1584 2642 8289 6863 4728 6071 11272 7716 5320 8764 10148 6519 5717 4714 -652 -2707
12116 -2707 2460 2728 -1281 -774 -3706 -610 3602 3118 9446 -461 -8818 -12705 -9888 -3924 147
12101 147 -362 -912 -176 -2534 -1045 1045 101 2599 467 1281 4571 5560 13893 20796 21009 18168 15510
12084 15510 11433 8331 8044 5055 7183 4244 1040 4934 6734 5553 10294 10180 9658 3758 -2424
12069 -2424 -1446 -4 -2119 -3230 -3080 2698 6698 8724 7684 1361 2362 4416 -1115 -2911 -5558
12054 -5558 -7568 -2395 -3836 -7278 -4077 -1083 2145 1409 -1078 -6392 -12098 -10473 -2427 -2670 -5673
12039 -5673 -1936 609 72 -7587 -1096 2218 5852 6160 901 620 5398 7070 5509 6796 401
12024 401 -8090 -2904 245 8419 9210 5737 -486 2901 -2688 -11301 -8326 -1685 6509 6967 3687
12009 3687 5537 1346 -4063 -1955 1777 1956 4050 3533 1707 3505 546 -4907 -465 -6210 -4566
11994 -4566 -6563 -8298 -6035 -1581 -2239 -5131 -2344 3827 -1030 -4025 2472 7030 7788 117 -1744
11979 -1744 1305 3878 833 -4810 640 832 170 1565 -3455 2083 8445 4923 -2612 -9912 -12523
11964 -12523 -10045 -7371 -8780 -8283 -1639 -658 964 -3471 -5400 1163 1616 2107 -365 -691 -1119 -10353
11948 -10353 -6234 -1799 6306 16011 11315 2382 147 -387 845 5681 -308 -848 -164 -5051 -6350
11933 -6350 -3138 -2604 -4007 -2123 -3918 -6969 -5588 1053 4737 767 -15210 -15940 -15793 -13272 -10139
11918 -10139 -696 -1065 3998 6827 -330 -6953 -1043 4311 7541 7915 1320 -1101 -3285 -1769 2163
11903 2163 1377 5084 1778 751 2502 4552 -1198 -3144 -61 -1329 -2764 1880 2819 2752 4613 6518
11887 6518 2595 1351 -1038 265 3638 8401 9113 1705 -4536 -6668 -2923 -3467 -4164 -3002 -6015
11872 -6015 -7730 -5869 -4155 -1427 -4324 502 5210 1918 995 5134 388 -4760 -8806 -5642 -97
11857 -97 563 -1973 -6765 -6238 -5167 -7921 -7347 -1631 1608 1888 4622 6985 5757 -749 -10097 -7476
11841 -7476 -5949 -12628 -15457 -12726 -7078 2019 11225 8852 10868 9382 9285 11506 9637 6630 461
11826 461 -4001 -1417 -4991 -14287 -15554 -15808 -9774 -6240 1322 7113 -61 -9801 -9460 753 8760
11811 8760 7147 -150 -3852 -4001 -7054 -8696 -7165 -6111 -5325 -9157 -11123 -1250 1135 903 -4733
11796 -4733 -8263 -4967 1192 6793 6905 5503 4151 8491 7253 11059 7111 2062 2330 4709 -1763
11781 -1763 -6545 -1518 -2919 -287 216 -800 3767 5897 3907 4319 2364 -5672 -1268 74 -7065
11766 -7065 -12891 -10357 -9542 -11413 -14402 -9128 -5416 -9211 -9619 -6576 -6099 -8199 -2160 -9022 -6752
11751 -6752 -296 -2872 -6420 375 9207 16289 11971 11450 8140 7321 13043 5689 -840 -6653 -10914
11736 -10914 -6532 -1029 1599 5682 9683 8021 2330 -1055 -1212 -3460 -9033 -10953 -11630 -10221 -9741
11721 -9741 -14247 -12389 -14762 -13908 -14749 -10205 -7337 -7658 -4699 4472 10408 8900 2069 1039 -2514
11706 -2514 -6478 -6589 -6959 -15248 -8013 -1836 -6270 -7360 1775 4126 3908 4407 2654 108 3250 3551
11690 3551 -4231 -5840 -7538 -3828 -3901 552 1431 2064 -2328 -4490 -10712 -4958 26 4698 2855 -1333
11674 -1333 3822 6864 2649 -3239 -5860 -5314 -3870 -970 -3824 -7493 576 5527 5578 624 -4168
11659 -4168 -4846 -2635 -3706 -988 175 -6405 -6236 -10324 -10515 -9008 -3960 1034 5276 5022 3727 1427
11643 1427 692 4647 2565 -2116 -4788 -5087 -7470 -7453 -1413 -1964 -2553 -4717 -1889 -2931 -2494 6434
11627 6434 7966 -3730 -7302 -3148 255 3609 388 1165 4287 3291 214 3663 3598 2133 2445 -1463
11611 -1463 -5507 -3657 393 4096 3561 2764 2016 723 -2435 -176 -1508 -4095 4066 10780 10401 5875
11595 5875 -747 -4144 -7274 -9927 -2872 -5936 -8624 -9557 -7884 -1328 2629 8358 8807 7218 3907
11580 3907 4716 5377 4032 4937 8926 11708 11675 6769 951 367 4250 6465 6311 3014 -4408 -3875 -1462
11563 -1462 126 -1926 2472 -454 -2826 -3484 -3333 -3122 -4044 -5920 -4285 -413 -3516 -6411 -6222 -7092
11547 -7092 -7544 -6761 572 2510 -298 -2558 -702 -529 240 3965 3577 1436 -2256 -5501 -6602 -8296
11531 -8296 -3959 467 1447 2579 -3613 -9361 -10372 -7661 -6208 -3636 -3015 288 1753 -1259 -317
11516 -317 70 3563 3918 4441 2022 2452 -1459 -7282 -9432 -2191 4230 4653 2955 6342 9285 4081
11500 4081 12853 12072 7156 1962 1338 1349 268 1635 3365 -1396 -2134 575 3712 5478 8110 5764
11484 5764 6906 -525 -7855 -10200 -13602 -11815 -3603 -3386 -11755 -18355 -13096 -9447 -7456 -8675 -6453
11469 -6453 -3690 -3331 -6375 -4413 -878 2372 4590 -5607 -8030 -8087 -8741 -5746 -3662 -12737 -17442
11454 -17442 -9989 -6844 -8554 -6495 -6874 -4115 -3834 -12724 -16230 -11050 -10947 -6191 -4809 -6823 -5687
11439 -5687 -7845 -6518 -4231 -9305 -553 4621 -5468 -6893 1346 1466 1578 2846 2006 4758 2062
11424 2062 5521 377 -169 2962 -1473 -5033 -7359 -12808 -10874 -8888 -8159 -11198 -10832 -12580 -11507
11409 -11507 -7622 -5774 -6880 -5031 -2701 -9644 -11826 -7769 -6809 -7793 -6854 179 56 -9123 -11944
11394 -11944 -7093 -2291 -7570 -11613 -7883 -5892 -4710 -1497 2713 1635 793 3235 9936 -2190
11380 -2190 -7441 -4523 -9947 -13654 -13985 -7308 -7520 -10581 -3209 -5338 -8969 -2722 3929 2561 -3110
11365 -3110 27 5907 11114 12563 4162 -5757 -2215 6265 1452 -2982 1835 1396 212 6915 6493
11350 6493 5156 4356 -1500 -266 328 892 -5502 -12277 -15422 -8015 -1516 -8704 -9752 -11464 -8981
11335 -8981 -8898 -7851 -5840 -42 6966 7249 8189 5690 824 -3110 4102 8724 8876 7518 7194 9961
11319 9961 11530 10058 1661 -5859 -7019 -8957 -8202 -2532 -4511 -3847 1541 1361 -117 -47 -2947 3002
11303 3002 1155 -208 4551 573 -4395 1209 -699 -6031 -6737 -3382 -1561 -2204 -3144 -4494 -611
11288 -611 -286 -2616 -1890 -2191 -1937 -7779 -15809 -11577 -2423 5198 8226 6741 526 -213 -11211 -10134
11272 -10134 -5109 -4998 -2550 357 -921 -4171 -3092 2336 -5698 -3188 10821 16041 7289 -3607
11258 -3607 -7809 -7070 -8819 -8388 -8209 -5870 -6201 -7674 -5361 1091 175 -3827 -3265 -6532 -5675 -3183
11242 -3183 -3831 -4294 351 -1705 -6457 -6891 -7391 -5693 447 6149 3346 -2267 -9067 -113 1089 -1986
11226 -1986 -409 3250 -2042 -5840 -10093 -14509 -6895 -1445 -3553 -2979 -1006 -4817 -4969 -10147 -4647
11211 -4647 1785 1325 -36 170 -162 -2589 -2494 -1538 -10286 -8755 -7590 -7809 115 3507 378 -3631
11195 -3631 -3609 -93 -1491 6964 7768 5236 -2346 -2933 -652 -651 -2476 328 5917 6231 5271 3764 3654
11178 3654 605 -3518 -302 -2226 -4712 1890 3254 8609 -2270 -12264 -7597 -232 1831 -4825
11164 -4825 -11028 -15897 -15907 -11602 -4840 -5191 -5018 -6813 -6035 -7523 -8393 -8847 -6718 -1829 -2501 -54 8012
11147 8012 4801 7729 7363 11541 16230 15617 8185 3965 4064 7541 13282 12800 9354 6083 -90 -5661
11131 -5661 -5935 -7284 -9775 -8549 -15727 -19084 -9222 -3403 -1563 -1044 -2987 -5206 91 1524 -4836
11116 -4836 -7309 -6651 -10696 -10575 -9361 -4070 -1675 -3772 -5651 -1885 -4485 -5741 -1269 8391 10277
11101 10277 160 -335 1589 -2743 -6391 -5012 3379 3863 1150 -4176 -5287 -314 -1011 -2410 -3847
11086 -3847 -1461 1902 4532 2801 7752 1122 -7383 -5036 1144 387 -230 -3134 2621 7183 4465
11071 4465 6055 9957 3894 1452 4481 5144 -419 -9455 -15200 -15692 -19872 -13160 -2169 -1605 738
11056 738 508 -296 -984 -2654 -906 -538 5231 8669 5984 -6976 -11253 -10171 -4347 -16273 -19259
11041 -19259 -12032 -2547 5237 10490 8856 -1794 -1441 -1313 -5267 -2634 -3111 -38 4733 917 -7571
11026 -7571 -9284 -7119 -6635 -11535 -9809 -10184 -6958 -5048 -1195 1784 831 335 -3539 672 1187 2704
11010 2704 8525 8932 1430 -1219 -5693 -3348 2665 3434 3173 -2436 754 4398 -920 -23 1918 3187
10994 3187 5220 -440 -5935 -2982 -8214 -4872 -3780 -7933 -10715 -12931 -13491 -7861 -10133 -13009 -11173
10979 -11173 -8442 -2647 3719 1560 2900 6686 11778 10496 15003 10798 -1148 5758 11206 5208
10965 5208 5578 7976 7866 10723 5262 4990 4213 8049 6701 5673 358 -4088 -1713 -2737 608 3462
10949 3462 3054 2053 2034 -4228 -5212 -3422 676 -1600 -1008 1453 3343 12984 17894 9885 -2291 -5348
10933 -5348 98 1321 2482 724 -824 3098 38 -6596 -9509 -9333 -845 -114 350 7186 12128
10918 12128 8738 2597 10890 5364 -4523 -10042 -7497 -6133 -6235 -1915 -6861 -10201 -3685 4007 2729
10903 2729 5489 8755 5424 1396 3797 1892 1191 5197 8580 8095 6429 7070 7179 5503 912 2037
10887 2037 -3771 -6559 2764 3819 -69 5704 2691 2304 -201 -2596 2423 -719 -6878 -8514 -1187
10872 -1187 757 -4741 -4632 4963 11195 8652 1106 3648 8665 6774 3044 -509 -2612 3351 -2500
10857 -2500 -5758 -5432 -8628 -6361 -6171 -4461 -6553 -2057 3732 5527 4845 4479 -827 -3651 7756
10842 7756 7213 688 423 8696 7727 1438 -7036 -4219 -1017 3605 7920 549 -531 5089 4750 4347
10826 4347 -2448 -3699 -1538 1886 -1299 -5282 -7733 -13063 -5045 -1003 -1536 -3697 -4774 -8919 -5161
10811 -5161 -5603 -2387 -2319 -5286 -2339 -584 -83 -1281 -9350 -12028 -16459 -15993 -12790 -12014 -8366 1944
10795 1944 -297 -597 -3272 -3350 -1289 1942 2797 -1126 -2339 -2348 -485 -940 3846 7147 4029 5887 2613
10778 2613 -2121 -3700 -3748 -3919 -2325 -10978 -12205 -9210 -14098 -14461 -10951 -13484 -23632 -29728 -25441
10763 -25441 -23306 -22375 -22165 -6906 4437 4168 1917 6367 3279 -691 -2892 2549 12376 11467 11064
10748 11064 12449 7562 4298 -2739 -9222 -15854 -4947 -1489 -1770 -3945 -1237 8086 8207 7009 9179
10733 9179 302 -10455 -9090 -7498 -2157 -4774 -8154 -9650 -7978 -11715 -11920 -10484 -9275 -234 4479
10718 4479 1380 -4836 -9631 -9324 -734 2499 -1982 -1947 -5488 -7295 -4605 4497 9590 14123 18263
10703 18263 16328 9489 9832 20436 28778 22257 6187 7374 4246 -2377 -4645 -9121 -10016 -8832
10689 -8832 -11938 -14823 -9116 2520 3464 469 639 551 -1828 -3536 -6512 -3015 1140 -178 -4847
10674 -4847 -5832 -2092 2840 1048 -660 -1872 -6114 -5968 -9007 -9342 -13375 -14801 -14784 -11574 -14695 -13388
10658 -13388 -6436 917 -2754 -8299 -15175 -11044 -8608 -10594 -14817 -15479 -5769 1195 1731 -4088 -4155
10643 -4155 190 532 814 -2436 -7288 -7422 -5829 -6611 -5759 -7065 -5782 -2918 -1408 -1357 -10122 -5714
10627 -5714 -5979 -2696 871 -4676 -11007 -16933 -18135 -11212 -7654 -3178 -2038 -6624 -4670 -2189 -3449
10612 -3449 -2195 -6704 -6831 3293 6005 6007 9708 4505 9019 17034 13852 15152 11088 1579 -5729
10597 -5729 -3890 1054 -524 1296 6303 3307 2893 -703 -1098 -4836 -3835 -524 173 3164 6674
10582 6674 3535 1372 4182 11463 13666 13361 18436 18606 18124 17467 10794 6087 11483 15856 16098 20844
10566 20844 17436 11506 4102 -6395 -12268 -9363 -6559 -6174 2770 5017 6998 11647 11082 -300
10552 -300 -7922 -4064 7683 7072 3949 1571 2491 3626 8303 6041 1918 4550 8109 12845 13571
10537 13571 14578 16199 14520 7980 1972 -7716 -3950 -278 -2735 -8972 -15096 -19623 -12849 -4273
10523 -4273 756 -8624 -5622 4735 7708 2368 2978 -3407 -10963 -12908 -4103 6069 4793 -3293
10509 -3293 -6283 -9962 -15128 -17476 -19946 -20944 -16558 -10033 -9314 -6747 -3589 -2804 -5552 -9597 -7927
10494 -7927 -13618 -12663 -5829 -2562 1890 -3351 -8338 -3910 -2158 -511 -805 1265 8494 6509 55
10479 55 1183 1227 3747 10592 11154 11473 10484 15043 10781 12443 11321 9961 3889 1546 -250 -7 -2462
10462 -2462 -4498 -8185 3558 6848 5591 3867 -1761 5270 11114 7961 8979 5976 449 -11037
10448 -11037 -13235 -2951 -197 5132 8338 3031 298 2009 -3769 -7378 -8117 -6276 -2592 2842
10434 2842 9459 9171 4230 1977 7505 8152 7759 7224 7750 9939 13792 19869 23187 17045 9428 8835
10418 8835 7064 5240 -1221 -6424 -2657 958 -5287 -7458 -827 -256 -1825 358 -1907 -557 -392
10403 -392 -383 -7523 -10391 -5436 -9911 -12694 -12360 -7483 -4202 -5379 -2422 -2149 -1619 8697 10807 5916
10387 5916 5133 4309 1691 3976 5754 6348 4035 -967 1426 4352 1309 3224 2825 -334 5540 3736
10371 3736 2742 4193 8439 11932 15809 12425 7525 5685 15861 26699 31587 33905 40613 50436
10357 50436 62601 77695 105154 150084 213361 294096 380635 460149 544940 628036 676850 690784
10345 690784 683035 660148 608338 526664 439835 353805 280904 217712 164772 118595 93426 79943
10333 79943 70202 67291 65238 63408 70817 77113 73494 74513 86458 94276 99270 98671 111026 122143
10319 122143 134442 147699 161550 187990 222365 275962 352578 479014 687343 983274 1350130
10308 1350130 1795114 2309083 2786368 3124844 3262362 3145961 2817544 2325950 1772197
10299 1772197 1275446 888580 628438 459927 343822 272410 221573 186616 166291 151466
10289 151466 140504 133175 121376 119195 108205 99733 89557 81333 72698 58378 45654 40939 36942
10276 36942 32195 32207 38962 43273 47050 43823 37964 34938 34763 29550 15350 12106 20499 21507 14976
10261 14976 10025 10216 13100 12734 17561 19745 13403 4980 -258 2532 8002 17675 23493 19830 12714
10246 12714 16587 17840 17140 18294 18411 17368 15487 11636 10248 10491 10806 8139 2608 4550 -116
10231 -116 -2440 -1334 -645 4813 3161 -5028 -4885 6914 17434 19471 13733 15206 14978 10710 8070
10216 8070 8666 4701 5006 5282 8255 13618 12976 10908 1568 2056 8851 8835 11188 9036 2774 4652
10200 4652 11340 12652 13459 17472 24598 29606 36538 46701 51588 48068 42841 42628 49908 67656 82206
10185 82206 95266 116536 161871 232472 327927 467526 649883 873387 1110684 1348325 1508110
10174 1508110 1546238 1455227 1255774 995193 732119 515738 359505 242271 170783 122544
10164 122544 98610 86650 69630 61966 57346 55394 49201 45335 38424 30368 20850 14790 19147
10151 19147 21197 23413 17891 14535 17851 16397 13026 5597 7145 5244 5213 5453 825 2331 -37
10136 -37 1626 7949 7290 7111 2143 -7550 -12422 -10255 -3363 5856 15064 10183 5677 5467 11633 10925
10120 10925 13873 14805 11853 10784 2970 -5763 -5715 -2359 -159 -24 -5973 -3471 2105 376 6600
10105 6600 5649 450 1431 7609 9615 12261 12843 11327 5264 -1191 3312 6506 9073 1564 -2117
10090 -2117 -2359 -1141 3585 1719 7403 8648 11923 17154 13433 15489 17521 13681 9152 3599 2744
10075 2744 4162 -2009 -5299 -2106 -2870 -2614 907 2930 6009 10932 8375 6075 2768 3595 1952
10060 1952 8468 10652 11979 4011 -2083 -5728 -3261 1753 3227 8134 2727 -109 -2271 -1545 -96
10045 -96 2401 -75 -2904 -220 -7761 -7585 -5963 -1891 -935 -6273 3624 11152 4012 -4472 -4149 3561
10029 3561 4601 3276 2785 1165 1300 401 1877 -437 412 7259 4325 2639 222 7159 4178 1672
10013 1672 1030 2712 -389 -1420 -359 1794 4559 2291 278 2350 5907 9097 10991 9558 3052
9998 3052 -35 1988 2404 3496 -468 -6414 -11485 -12794 -7394 -3588 349 4305 6373 316 -6451
9983 -6451 -11193 -8122 -7433 -328 4668 4471 111 2683 3782 1433 868 2011 3001 -2413 -2417 -474 -5010
9966 -5010 -1589 5297 8298 10901 15445 27382 41227 74750 102333 91991 58635 31215 20337
9953 20337 14426 11205 5529 9942 13059 9975 6631 7534 6092 -2180 185 5126 9811 9849 6657
9938 6657 -3815 -7327 -1106 6337 8786 3596 -3298 -1353 2728 3250 -6153 -7146 -6397 -3882 4828
9923 4828 11124 8062 4648 4679 -501 -5403 -9652 -4321 -1015 -5311 3883 -345 -4152 -2832 696
9908 696 4266 5840 7742 13532 18018 14750 18684 14877 13222 11776 12767 15868 21395 13981 5936
9893 5936 -2552 -8404 -12783 -11079 -7223 -3351 4848 6198 1176 -1117 1494 2858 6295 11882 5726
9878 5726 7126 8296 8003 5065 6397 4458 -2177 -12753 -11222 -2423 -6517 -16497 -13511 -13187 -9358
9863 -9358 -6 -232 -2721 124 7861 10031 -2903 -10777 -11338 -2612 1515 409 7234 8112 2028
9848 2028 -854 -2732 -1534 -1225 -1132 -840 -6869 -6544 -3632 -2002 -1032 -1725 -9147 -9720 -7715 -6880 -3027
9831 -3027 173 4319 9408 9440 8418 6562 8976 6177 2702 1567 -933 -5219 71 4374 2422
9816 2422 2350 1549 3056 4529 7551 2458 2 -3684 -11224 -12253 -3273 9865 8012 -717 -3195
9801 -3195 1041 5603 7500 3776 7626 10078 10730 14256 7541 1184 3481 1316 1086 1752 436 -334
9785 -334 2783 8430 21598 17257 12953 3586 3016 11145 11148 2409 -87 -2797 -369 2177 3256 3950
9769 3950 5088 12638 17118 14531 13839 5392 108 2141 -6057 -6987 -306 -634 -6205 -6389 -2853 -1185
9753 -1185 272 -3380 -7370 -9331 -9442 -6153 -3654 625 5374 6568 6086 -1484 -1429 -2187 -4334 -4973
9737 -4973 -1980 5423 5247 43 -1766 3417 2926 3987 8719 10482 5840 7366 9290 10714 10224 12754
9721 12754 13195 10542 1352 4289 6480 1172 -1677 -5227 978 2694 -1436 -3645 2550 5492 1508
9706 1508 4543 7477 9153 5742 2531 -6976 -13849 -6615 -359 -4323 -11481 -9967 -8392 670 2592
9691 2592 -1119 -3531 -8239 -5019 -2550 -1731 -960 402 4361 1627 1777 3181 2163 -3873 -1665 248
9675 248 -3100 -6085 -2802 -3763 -4142 -3838 -344 3996 -164 -8013 -7361 1804 9311 7329 -273 -4588
9659 -4588 -4283 -8895 -7571 -3086 3008 2881 271 5986 12249 8667 4688 4786 3470 1844 3068 1910
9643 1910 -1354 -7681 -3330 2449 2756 1651 -3382 -9809 -3555 -735 -5534 1579 6780 2578 8876
9628 8876 9208 5564 -2829 -1913 1421 2053 876 53 4433 -2516 -1960 1377 3471 6602 4620 -80
9612 -80 656 -137 1963 7450 1544 2122 5512 -1909 -8159 -113 1998 629 -475 3817 8569 -121
9596 -121 -4690 -5740 -5360 -5401 1503 3837 -552 3664 8066 5230 5785 2222 3627 3933 2139 4030
9580 4030 -2705 -4622 3501 7478 3653 5113 3388 2861 -2193 -2670 -12 2814 971 2660 7072
9565 7072 12279 9230 8332 1087 -6752 -8663 -6854 -8218 -6639 -5358 -6146 348 -1443 -1627 -2761 -9648
9549 -9648 -12599 -9438 -6786 -6775 -550 2664 185 2082 6017 8147 6772 3402 3108 2167 4837 8146
9533 8146 11026 13009 4766 -1374 4079 11712 9380 3899 -83 -1812 -4484 1578 9704 12396 11963
9518 11963 4500 1072 -8380 -8167 -4656 -6357 -2424 511 -2219 -2590 3353 3295 1742 3952 1861 -5430
9502 -5430 -5021 3879 6970 2750 5786 3605 5857 8219 13724 19261 18219 12443 16582 14913 13637
9487 13637 9931 10206 10837 15075 9811 2927 -2525 4961 12584 12023 6398 -169 707 -3094 -2179 1156
9471 1156 2139 -725 4549 8709 6735 -486 -2872 7344 8912 4933 641 -1553 -6294 -9124 -10917
9456 -10917 1370 4499 3132 110 -3705 -3044 -1493 -5228 -5760 -6736 120 -419 -650 8312 8789 10546
9440 10546 5798 1927 -2372 -6535 -7914 -8164 -8115 -6335 -3303 -3629 -1561 2030 -3224 -9778 -13565 -9996
9424 -9996 -6802 -1944 -1469 9077 12179 14553 13733 9843 4211 -2691 1402 8797 12938 4589 10294
9409 10294 11921 12061 5087 -2309 -9478 -18740 -6330 5020 1448 4523 7270 14506 10844 8569
9395 8569 11992 9297 9633 7572 3485 -689 302 9117 12535 10360 9323 4525 3094 -377 -9979
9380 -9979 -14839 -15843 -12040 -10630 -15405 -13809 -9330 -1515 3883 6230 2333 -853 -3050 -3798 -1898
9365 -1898 -2800 200 3187 -1049 -6281 -7995 -3251 -3336 1723 8046 10948 8041 5576 717 2759 9892
9349 9892 9624 11903 9055 3473 4669 -1429 1260 4153 8564 13799 3477 -1435 742 3970 10502
9334 10502 5527 2234 942 -5268 -2945 329 252 -337 -2032 3731 2787 2006 -3512 -610 3042 4368
9318 4368 2023 4263 7327 3157 5890 3825 8628 16106 14163 17081 24758 22365 15097 12174 6991
9303 6991 8172 9438 6376 2263 1800 313 -2636 -10983 -13364 -7965 4203 4768 2041 2275 3394
9288 3394 3222 -363 347 5055 -121 -5501 -8478 -7046 -7591 -7664 -1573 9360 20544 28563 29328 29886
9272 29886 23117 11233 984 -9468 -9936 -5642 -4928 -386 12305 15124 12679 741 -8748 -6149
9258 -6149 -2617 -6092 -7955 7552 20588 26752 34881 31602 18174 9613 1067 -7355 -11186 -3379
9244 -3379 3073 6577 8654 4328 1117 -2298 -4548 -5622 -3095 2104 1210 -3107 -5190 2732 6939
9229 6939 -5902 -10816 -11277 -2692 5544 7205 8571 2667 -3074 -574 -1489 -296 7201 12729 -937
9214 -937 -5608 -2168 -1341 666 1955 4570 8978 5089 -2192 -1497 -2005 -502 -5508 -3097 2845 -1742
9198 -1742 241 -1034 2895 3698 4070 5602 14075 14285 14581 11623 8337 12731 18285 13851 12266 10874
9182 10874 9961 6360 -4756 -11699 -14385 -8504 1154 2464 2178 7797 12015 15379 14574 12814 6865
9167 6865 -3125 -6203 -3154 4116 4682 4842 3229 -4507 -7920 1993 8447 10111 5957 -1815 -6341
9152 -6341 -5656 -3200 -4269 -2488 9588 10279 4207 5053 1424 2562 4115 2303 383 7510 17125
9137 17125 12734 8789 10563 4885 2453 2563 1426 3814 5261 -3972 -11709 -11656 -5432 105 373 5604
9121 5604 12726 4249 2525 3018 -7389 -10418 513 9257 6160 -1817 -1164 3099 -758 -2151 9931
9106 9931 22564 26216 19534 16596 26931 32360 23223 23000 33306 35960 32378 30783 29467 25762
9092 25762 25154 25622 31593 33223 36697 39754 48343 53979 58715 65293 71376 79659 99219 104559 112044
9077 112044 132349 145585 163185 183482 206341 243706 296733 378186 491572 654781 914591
9066 914591 1373306 2195897 3703036 6343762 9563264 9509917 6358324 3719915 2238592
9057 2238592 1440868 987572 718745 549256 440568 364228 298859 242961 209085 180445
9047 180445 154322 130364 109260 97644 94240 89029 83201 81028 67913 57074 52091 48046 43908
9034 43908 37364 38549 29533 20194 15141 14917 15571 15056 14486 9495 7813 6032 11040 18331 20354 15455
9018 15455 10333 5455 9357 9812 17249 17639 12686 8220 4940 5860 8377 6940 2387 -1231 422
9003 422 -2062 -1287 11342 12398 10334 10044 6089 -4594 -4294 -4861 -7859 -9670 -2069 993 -5008 -8653
8987 -8653 -1448 4350 -516 5290 4407 3002 2551 2413 3723 4386 437 170 2362 11849 11439 10697 8165
8970 8165 9952 5810 4848 1067 353 -470 9806 11767 12145 11447 3623 1374 6296 8097 -1393 3460
8954 3460 6701 15213 14993 7486 4603 -202 -4033 -151 634 5988 9614 4685 1881 -4523 -4709 -2428
8938 -2428 -5911 -3389 -4714 -5066 -8968 -14219 -11061 -13511 -7907 -11645 -12387 -4749 1704 6464 6296 1405
8922 1405 2019 -3577 -6478 -8333 -7648 -13830 -17710 -15788 -9457 -7222 -5381 -7593 -8280 -6157 -2636 -8091
8906 -8091 -4987 2761 3410 -5 431 2182 7699 6504 995 -403 3332 2948 5698 13247 15408 10876
8890 10876 -3779 -8941 -7224 -2772 -2839 1399 -1451 -5365 -8244 -6370 -8757 -11442 -6391 2981 9462
8875 9462 3935 -3401 -3394 928 -399 522 10558 11100 7772 6166 8959 5790 10742 5560 -2569 -5484
8859 -5484 -7669 -6540 -9157 -9767 -6115 -1925 -1630 -8442 -8929 -3535 1808 3034 -4460 -5998 -5582 -677
8843 -677 -5060 -10597 -12345 -11214 -5408 -3015 -220 2744 1832 2648 4335 9733 9058 3530 -1634 -4132
8827 -4132 -469 -4746 -3304 916 2028 -185 -5895 -5264 -864 2392 -1832 4049 7945 4849 2798
8812 2798 -5062 -8108 -4388 45 -4349 -4517 1751 8121 6766 6284 1664 -3035 -3883 -2247 -449 -2516
8796 -2516 -5504 -8737 -1937 421 4013 5927 -1621 -6598 -5512 -2835 1264 1487 4402 3299 -2497
8781 -2497 -10150 -8039 -3508 -1891 5844 2994 2648 6581 6540 3061 2718 -3516 -12098 -10085 -3697 1301
8765 1301 -3946 -11507 -4049 1529 -2036 -8926 -9112 -9327 -10030 -8119 -5232 -1801 10648 16366 13507
8750 13507 8998 4936 5906 3226 3353 585 -774 -800 -2030 -273 -2204 589 3902 10553 16640 13781
8734 13781 14223 10454 1587 -4073 3884 9754 3781 -3009 -596 -243 -1401 1363 1709 3056 5923
8719 5923 13391 15389 12917 5977 -3330 -7287 -9530 -9731 -6583 -4427 -5500 -3124 -446 1390 5551
8704 5551 3408 1457 1735 8421 9333 876 -7070 -7347 -6666 -5174 -2096 68 -1049 7167 9445 11579
8688 11579 13654 8310 0 1733 10652 14700 10984 3453 4955 5785 3074 -189 -2947 -3091 -1286
8673 -1286 3768 9605 8676 5759 -238 -8010 -8206 -10345 -7857 5147 16777 20318 17071 7678 423
8658 423 1004 1167 -2572 -1560 9547 13857 13673 18080 11828 7461 7364 8159 16709 16513 13622 8183 7339
8641 7339 2827 4820 4893 3676 5287 9954 10793 13498 10377 4860 4784 4443 2927 13220 15674 15604 16294
8624 16294 10017 13873 12740 16248 20581 18821 20565 16253 16264 19907 16461 15514 21897 26848 27349 25866
8608 25866 29595 19770 9590 13771 21073 18109 9117 1906 5521 10557 10078 6504 -747 -1641 4827
8593 4827 3364 -2867 -5864 -3422 -6557 -4367 -726 -6085 -6193 -7182 -5366 -38 3365 -1436 -6808
8578 -6808 -10764 -4666 -6615 -12724 -9572 -5300 -2404 -7134 -8347 -7410 -8625 -4795 -5946 -11620 -20355
8563 -20355 -14793 -10086 -7943 -5132 -3314 2206 5329 -115 -1108 -1477 -4224 -4673 3845 3000 6956 4543
8547 4543 -2608 -10219 -8219 -7471 -1498 749 -3178 -880 358 -1802 1154 11977 13240 9864 3346
8532 3346 -1767 -8094 -5555 -682 1648 -440 372 5401 5525 2420 -2297 -6730 -5464 -2749 -4477
8517 -4477 -3370 57 1679 5821 3530 2290 4139 -115 -3678 -5004 -2043 1836 -2196 -8685 -4254
8502 -4254 -3134 -4015 -8183 -10170 -10271 -694 -392 -408 -3982 -1708 699 3894 2084 3292 9257 12829
8486 12829 11581 3164 -606 1761 650 -1807 -3196 -3187 -3162 -6079 633 10166 11746 6428 -3581 -9733
8470 -9733 -6375 -4126 -698 4396 6349 -344 -252 3953 107 -6588 -6016 -5582 1789 5984 6814 1650
8454 1650 -220 -3459 -4575 -2597 3088 6305 5535 7798 3305 -1283 -3560 -5252 -5057 -5637 1375 932
8438 932 -2116 -5156 -1021 -8929 -5902 -3579 -9308 -14708 -7979 -4814 -6614 -3410 9160 13145 7179
8423 7179 582 1766 6495 4176 -5300 -2542 5797 7894 -1050 -3187 709 -848 1144 1163 1590 -8256
8407 -8256 -10195 -5193 -7562 -10562 -15894 -19903 -13425 -8542 -4650 -7362 -11730 -14043 -9860 -4058 -2183
8392 -2183 -2814 -4981 -4500 -3975 -1415 -747 -2971 -2762 -1473 792 -1938 -1827 -1951 -7941 -7532 -4183 -5976
8375 -5976 -4763 -8142 -3782 2998 -1229 -3463 -2176 3846 9082 6313 5806 5372 6167 1882 -64 -1455
8359 -1455 -13262 -16418 -12893 -4313 2802 9987 7852 -1506 -6511 2400 11101 5418 -6038 -11452
8345 -11452 -8103 -3150 2478 -1806 -6011 -1605 -1317 -12475 -16904 -13782 -6850 -3855 -12035 -16524 -8302
8330 -8302 236 3893 10155 9983 9856 8296 -459 -7896 -5194 -4266 -26 3227 -601 -2749 -2333 -2267
8314 -2267 -436 3655 6208 3969 278 -780 -1184 -3228 -6415 -4633 -2871 -2793 2840 3012 -1665 -4107
8298 -4107 1070 725 -1435 -2155 -4697 -1867 4502 6739 -218 -4321 4057 9205 9348 4589 -4748 -7550
8282 -7550 -12804 -16833 -9936 -5170 -4038 -1577 -4329 -1046 2926 -1408 -2702 479 5537 11244 13288
8267 13288 12213 8879 13815 14934 5742 -4167 -10599 -14983 -16147 -12103 -8315 -8780 -2990 2660 11753
8252 11753 11062 5251 5799 5542 8897 16226 15738 19582 14388 10416 10636 12032 10045 678 -5728 -2802
8236 -2802 -2098 -1751 2149 956 541 4869 -177 -1596 -1182 5402 8925 10945 5309 -3364 -7767 -252
8220 -252 9404 6605 2683 -1250 -1751 -5285 1067 4077 5009 7585 9571 12371 11662 12794 13814 9106
8204 9106 8521 8013 9044 11713 7658 2125 -5464 -4839 -2002 3565 5838 811 -6139 337 1075 2159
8188 2159 3830 2525 -1207 -6492 -7829 -667 -1622 1031 3393 2848 2320 -2103 1959 7573 8897 6109
8172 6109 610 -538 5871 5081 -11 -397 -7304 -10097 -3128 -1047 -6500 -12647 -11462 -5393 2421
8157 2421 7166 5412 4128 4584 -3964 -8997 -2545 286 1077 8860 7932 3342 6643 7916 7797 1793
8141 1793 -5898 -1762 794 5938 9535 10218 974 -2999 4970 6156 7254 7096 2887 4655 10100
8126 10100 10841 9686 10791 13889 10841 8540 13841 4914 -10799 -12111 -6462 -7056 -10017 -10472 -12015
8111 -12015 -6676 -2168 -4891 -6842 -6886 -5824 1020 -314 -10422 -7747 2015 5672 6875 3198 -6966
8096 -6966 -12013 -5384 -6714 -4621 -1063 3851 8609 7360 5299 4302 1848 -4496 -12710 -10233 -6492
8081 -6492 -54 2606 4187 -470 1037 6244 15353 9986 4288 723 -4099 -9337 -4679 3116 3479
8066 3479 5624 4421 4524 1114 2398 4144 456 1853 4439 12051 10174 1289 2993 5142 5478
8051 5478 10604 9700 15892 19069 4299 1334 585 3385 3890 403 -384 -7576 -5260 -6270 -2719 4850
8035 4850 12169 15590 6632 -3204 -4630 -5844 -1328 1805 -2607 -3536 -2957 1023 3264 1482 1666 7547
8019 7547 11606 7334 2841 3712 -783 380 1411 602 -697 2286 3062 -765 -5236 2514 7775 13284
8003 13284 17110 9174 1934 -701 -2132 123 6853 7726 6898 8746 4766 3059 3476 1215 1336 -374
7987 -374 8171 13113 6501 -2747 -1829 -4541 -2165 3562 1626 36 2882 7794 13780 17784 24645
7972 24645 22639 20300 18665 20566 21752 18909 16931 7818 7200 6748 4751 7893 2590 -3953 -6275
7957 -6275 -11171 -3244 -1321 -2710 286 1781 4520 12537 12237 2054 -6274 -3413 -4056 -1354 1314
7942 1314 7123 10043 9764 7758 9755 9456 11041 4290 4141 6501 8479 8186 11182 12338 7270 10975
7926 10975 14776 12977 12555 8205 2749 3023 -563 2796 5494 2765 1241 4329 7927 4145 -4960
7911 -4960 -9675 -7973 -2065 2450 6703 13537 14042 1278 -5083 -2415 -3112 -7851 -8075 -3133 137
7896 137 1815 2346 2507 3804 1331 -5711 -12192 -11036 -6267 -165 1010 -3820 -3400 -4008 942 241
7880 241 5250 7271 6822 6081 7205 5658 -1590 230 6044 9025 6048 1384 1847 -1759 -8316 -6734
7864 -6734 1900 4625 -5906 -13565 -10531 -8076 -6075 -9222 -11587 -12779 -13029 -8139 -4349 -8333 -11417
7849 -11417 -8259 -10505 -3846 3509 4376 -810 -4037 1538 -3154 -7039 -8621 -4215 2748 1592 6055
7834 6055 8319 9860 5854 -2293 -2041 -1893 -7036 -10710 -9571 2904 15134 14145 11459 10354 6193
7819 6193 484 -2086 -6064 404 2589 -2414 789 3358 -2621 332 3828 7375 6958 5215 5865
7804 5865 -576 3584 12942 13407 9643 10960 14110 5350 -5729 -6322 -7563 -3674 2922 4256 2925
7789 2925 -1100 3091 6977 1778 -3286 -8066 -10123 -11305 -10636 -6289 -6116 -5950 -6481 -4187 499 -3425
7773 -3425 -5913 -5353 -6185 -8005 -5083 -4451 -7919 -7904 -3745 1578 2662 -657 6236 9942 6378 4262
7757 4262 -4389 -5487 -2385 336 -633 -4315 -8036 -11716 -12178 -8426 -2121 -1166 625 4142 6412 5028
7741 5028 -3315 713 1348 1391 -763 -2743 -3413 -7274 -6896 -3544 -1121 -2299 318 3482 7476 2794
7725 2794 -79 -5829 -11576 -15310 -10163 -5441 4740 -3070 -4724 3586 1744 788 -778 -2609 -4224
7710 -4224 -11548 -15738 -12236 -7260 -1016 54 1129 -1992 -2575 1775 3322 -230 -5368 -7268 -4326
7695 -4326 -4988 -6356 -5470 -2451 -4573 1251 6154 1665 5712 11621 11083 6496 -905 -1448 5750 5294
7679 5294 1746 6252 4597 2533 6365 3180 -1668 5711 6071 -723 5264 6039 1694 885 -2596 -5454
7663 -5454 -5604 -5591 -3747 -3836 -5109 -221 1241 -2193 -9146 -11975 -7157 -2213 750 1686 -5595 -8050
7647 -8050 -6779 -8031 -13553 -10377 -4041 -8055 -13345 -9425 -8084 -11893 -10630 -764 4840 854 591
7632 591 -5796 -5490 -2380 -7445 -7227 301 188 -10699 -12888 -9585 -2847 -4889 -4447 -6640 -10043 -9337
7616 -9337 -8263 -7402 -10611 -8992 -6119 -7872 -2436 -1296 -2673 2204 3846 908 -4779 -9389 -10278
7601 -10278 -4899 635 5775 6616 8555 9541 11208 11319 8120 7217 11687 10785 6794 8022 9372 11280
7585 11280 13070 3140 -4336 2298 3883 410 -7630 -1605 -4330 -6060 -5388 -9304 -14892 -13818 -5826
7570 -5826 -5130 -2187 -6731 -7842 -10789 -10439 -4655 -1219 -6884 -7711 -4247 -2605 2679 5431 -1476 1615
7554 1615 5289 -2343 -7646 -5382 2360 -6358 -8316 -7815 365 -58 -3181 2974 5496 5631 3164 2627
7538 2627 -1436 -6957 -7473 -5898 -3900 -5034 -5958 -10824 -4832 5416 7935 4153 3593 -1586 832
7523 832 -52 -9298 -12690 -580 2792 299 -3863 -4493 -8362 -6807 -5040 -3679 -1183 9032 10531
7508 10531 2605 5808 9419 5830 4204 2826 -680 -2170 -5869 -9362 -10786 -11427 -12282 -13393 -8207
7493 -8207 -5271 -9263 -19742 -21692 -14493 -13250 -7339 -6915 -3636 -1527 -3603 -10599 -13323 -15435 -15028
7478 -15028 -13039 -10771 -6946 -2376 -2808 -567 -1167 1775 1710 1635 -3056 -3453 -2507 -6202 -13097 -13228 -5293
7461 -5293 5757 6405 -2062 2201 9294 6917 1119 -4727 -3175 -7201 -9475 -11893 -14420 -12896 -4876
7446 -4876 -964 -591 3352 7536 2325 2811 6632 4025 2778 6764 9267 9932 9403 7887 6364 9341
7430 9341 12742 5528 -2943 -5356 -5934 -7763 -5376 -6854 -9959 -11317 -16158 -6752 -3192 -4435 -5420
7415 -5420 -7606 -9902 -7531 -3331 -4005 -2404 4798 5996 8972 10185 6869 7938 5839 8736 7728
7400 7728 1891 3246 5528 7708 3471 -1477 239 2205 -1301 -6683 -7751 -7348 -10477 -12295 -9391
7385 -9391 -8586 -8133 -12828 -10729 -10851 -2904 -1180 6773 6955 6457 4424 -4715 -9927 -11489 -13059 -13791
7369 -13791 -5317 288 259 -7115 -9841 -16525 -13025 -9641 -7523 -3864 -6647 -8520 -4665 3411 7768
7354 7768 1386 -4486 1202 905 -2443 -1659 1130 4160 4706 1600 -2691 -1423 -5467 -3813 -2083 -5365
7338 -5365 -418 195 -231 3448 7908 751 -4111 543 6013 3410 4253 8258 2436 3969 -2597 -1318
7322 -1318 1040 2326 -1820 -4437 -4169 -3503 -8061 1009 5173 6520 9299 448 -3779 2485 2815 968
7306 968 -804 1891 283 -1524 3007 5636 5198 1699 -3154 -2118 -2978 -6810 -4869 2325 4515 5755
7290 5755 7077 4809 2046 -3639 -5874 -11523 -1892 -1937 -7673 -14259 -14850 -14730 -5931 433 -495 1855
7274 1855 4473 3621 5027 -230 577 2468 268 1192 -1578 -2318 -1908 2981 8507 5105 3575 5956
7258 5956 -204 -8779 -6840 -7755 -8549 -9665 -5485 -6036 -8935 -2247 7854 -1916 -31 3492 4538
7243 4538 1366 -4632 -5300 -1057 -515 1626 4004 -17 -1775 1008 6303 -309 -953 -6519 -13953 -15704
7227 -15704 -7503 -2283 -426 122 -4063 -12793 -9583 -6825 -2495 -5440 -3202 -4884 -5026 -4379 -4523 -3576
7211 -3576 -6106 -10931 -15946 -23418 -18542 -18601 -7720 -2445 -3576 -10739 -14789 -10107 -8161 -13044 -13989
7196 -13989 -12158 -10671 -6548 -9413 -9231 -5930 -3258 -1537 -488 -2275 193 8055 4983 3168 5171
7181 5171 6673 3428 -139 -4828 1310 5852 1423 -873 -61 -414 -6190 -7111 -3173 2607 111 4222
7165 4222 3634 -3599 -6719 -2494 -1775 3181 5261 353 1167 1447 4426 4629 4565 1263 -903 1492 8729
7148 8729 4525 -6439 -8129 -11067 -12844 -10363 -9072 -4709 6110 7298 -324 -879 2701 2545 4159
7133 4159 3515 1781 243 3181 3260 -527 -931 5446 11209 6721 6061 -213 -7548 -13560 -14375 -18184
7117 -18184 -18403 -13743 -5462 -3551 -2768 -4696 -4703 -9649 -13898 -8945 -10047 -11720 -7703 -11562 -8196 -6795
7101 -6795 -12364 -5344 4629 412 -4566 -5124 -2583 -1927 3093 8854 4242 5371 -48 -9525 -7808
7086 -7808 -7074 -13929 -6444 -3799 -6096 -6191 -4124 4715 7912 3420 875 -2024 -4181 -5328 -6134 -7781
7070 -7781 -6475 -502 564 -5400 2559 5798 -1252 -3229 -8336 -10724 -10348 -4716 -2507 5991 5372
7055 5372 3589 -2441 -408 730 1076 -2191 -3149 -12868 -15010 -3092 1637 -2878 -6782 -7452 -6709 -8153
7039 -8153 -11802 -13596 -12324 -9420 -6390 1098 4700 7153 7546 8233 2716 -2098 -3993 -2844 -2975 -2492
7023 -2492 2615 3829 2299 5594 4551 -288 178 -2275 -1880 -1641 943 12075 13705 5285 1343
7008 1343 6714 11879 1759 -4515 -2752 -206 2936 -1655 2954 7461 2478 4360 -2017 -1032 1706
6993 1706 2352 814 -3005 -442 -1150 2059 2251 1311 3050 735 -2644 -7546 -9691 -8408 -9758 -1201
6977 -1201 6869 2370 -2626 1666 187 -624 -482 1456 4993 2872 3828 7759 10871 7082 4565 28
6961 28 -104 435 -2711 -3347 -437 -7645 -8780 -2294 -3521 206 -2090 -3604 -4166 -4221 -4224 -6154 -7394 -3830
6943 -3830 1939 194 1670 4007 -2634 -5508 -637 -919 -5656 -7345 -4442 16 -2099 -2667 -2271 360
6927 360 6153 4106 -3340 -5820 -6870 -9464 -5723 77 -8204 -9859 -5664 -8877 -10665 -9426 -1069
6912 -1069 6649 9129 6696 -3610 -8342 -5198 -1820 -510 588 3088 5901 2420 666 6544 8522
6897 8522 6971 2789 7603 8731 9456 10510 1115 -798 5985 4109 5451 3354 -1392 -1915 -5369
6882 -5369 -4010 953 2232 3780 2473 -1694 60 513 -1160 6219 7930 11466 8948 2995 1765
6867 1765 3045 772 -4358 1716 584 3028 2678 -2142 -6427 -2281 5757 8133 3559 2360 2306 3588
6851 3588 7563 12298 9886 8205 8150 7628 3422 5111 -2693 -2257 2781 2524 -612 -4330 -10674 -9449
6835 -9449 -10500 -7289 -2507 668 2584 4140 3302 2071 5929 3252 -4697 -1143 -3224 -2308 6227
6820 6227 11676 6500 2289 1061 -5982 -6291 -946 3151 6096 7449 6965 3527 -319 -3391 -7584
6805 -7584 3130 7748 6636 -1320 -5917 -2398 -7139 -7965 -4242 -952 -1606 -521 -5469 -10268 -15157
6790 -15157 -12485 -9335 -5430 20 11 -4260 -1048 9583 15594 9954 10284 12968 11432 19881 23013
6775 23013 16857 12344 7043 4972 766 -602 3146 -2880 -4052 -1535 493 2108 510 2137 -5308
6760 -5308 -12143 -10481 -8346 -6389 -4138 1755 3784 1282 3616 4201 777 -2308 1574 4118 6933
6745 6933 9827 5569 949 -1091 3659 4337 546 -9678 -6222 -6361 -2656 955 9434 11080 12798
6730 12798 7425 535 -10183 -11180 -3032 -3942 1394 5160 3935 -5444 -11520 -9734 -3767 -971 1112
6715 1112 8327 5902 -935 -7842 -9730 -4109 -1924 1193 3504 5737 823 -1999 -1167 261 -4133
6700 -4133 -8281 -5760 -7508 -5074 -5520 -6625 -6352 -3446 7453 10980 11579 12082 10422 2999 -5520 -3652
6684 -3652 -242 2675 -2923 -9593 -12776 -12526 -11064 -7183 -4789 -2838 -565 5734 3739 -1481 1145
6669 1145 3481 4511 4714 877 6275 7478 1925 -5975 -8324 -7886 -1257 2901 -2042 -3655 2900
6654 2900 1359 -201 2834 -4018 -6941 -3933 4006 9614 3342 -1114 752 8655 9187 -2569 -12062
6639 -12062 -9107 -5730 -5 6485 5279 -573 -1903 55 3420 6522 7181 1717 -4875 -2226 -780
6624 -780 -5112 -8320 45 -5249 -8345 -3265 -3834 -3296 4598 3306 5270 -5039 -9593 -4376 -674
6609 -674 7518 12440 11253 7906 10018 4659 -2091 -3872 -9242 -9085 -8800 -7531 1484 5899 6684 4518
6593 4518 -2537 -8560 -4968 -577 2693 1481 -4405 -2978 -1673 -3637 -8806 -9055 -13048 -16110 -7916
6578 -7916 -1467 -5332 -7223 -7119 -10728 -15205 -15007 -13700 -9642 -3200 5884 8789 6977 3171 -409
6563 -409 -676 -6280 -3770 -3281 -3692 -178 6402 6887 7584 9586 14169 8307 7167 8715 12302 14018
6547 14018 11523 7859 4996 2296 128 -6855 -8424 -10816 -10010 -8371 -6103 -3751 -2157 -3738 3145
6532 3145 9170 3702 28 -488 3553 -1045 -3408 -2233 1122 10609 16862 6362 -1031 -1349 5327
6517 5327 4386 -1315 -1811 -3146 -1031 1464 2493 2104 3064 4100 4830 66 -2910 -3248 -2301 2589 665
6500 665 -1760 5045 3733 2908 6142 3919 2202 4638 3595 121 -3459 -970 -8709 -10353 -14484
6485 -14484 -20212 -21644 -22919 -14361 -6698 -1254 -1188 2466 -1031 1800 1374 -3070 -6706 -11570 -4024
6470 -4024 11470 14534 6551 3606 1854 -476 -2525 434 2266 1875 670 -8476 -8531 -4510 -13781
6455 -13781 -13835 -4609 -7000 -6322 -2603 -5302 -1724 -1664 -5072 -5191 -5313 404 -5268 -8125 1718 5729
6439 5729 4750 4155 -3538 -6855 -3411 3227 10704 5616 5903 4243 1502 -1620 -3411 -8376 -4172 -1271
6423 -1271 -4690 -10476 -7269 -6116 -2719 916 3822 10730 10692 5471 4595 3461 1137 -2304 -2143 4724
6407 4724 10226 2349 -6339 -5762 -8702 -14480 -8001 -131 -2620 -7991 -7901 -3280 3508 -165 -9909 -13595
6391 -13595 -12986 -13233 -5649 1931 -56 -4628 -3665 -5741 -3398 -5962 -7020 -3457 3555 2493 -1950
6376 -1950 -2475 -5191 -8435 -3236 -265 -7582 -6951 990 1197 1543 63 3751 2110 -4268 -1550 -1427
6360 -1427 -2331 1960 -4893 -9757 -8788 -10002 -10963 -11224 -8657 -7948 -5864 -12029 -9435 -6038 -2671 -4521
6344 -4521 -3901 -8465 -8558 -5717 -2809 -2924 -532 778 -5415 -13186 -9453 -4669 -8 -274 -3025 -2181
6328 -2181 -1917 5953 5235 8 -5263 -5675 112 5059 8287 10622 10891 9003 5180 -1536 -3187 6213
6312 6213 5735 1212 3635 3597 396 -942 -9710 -18098 -14357 -10689 -10830 -8050 -2914 1559 360 -4305
6296 -4305 -4653 -3981 3162 1550 0 3232 2576 2253 -1076 669 -380 -6566 -12147 -7426 1229 -3433
6280 -3433 -9238 -11412 -8172 -619 3044 6084 -1502 -3840 -175 2171 1085 601 1184 1416 1885 -4338
6264 -4338 -4731 -3149 775 8344 8893 7087 3218 -651 -3124 4442 3725 -135 1785 -1670 -76 -1252
6248 -1252 2508 4845 1682 3151 1791 -1966 -3487 -297 849 -2653 1889 5238 74 138 3122
6233 3122 -1046 -5534 -3581 795 47 -2063 4024 5341 -363 -4255 944 11077 12905 39 -4760
6218 -4760 448 -1393 -3680 -7772 -6659 -5144 -4006 -5737 -8948 -6598 -1349 -2991 -3464 3008 14405
6203 14405 16353 15388 14898 12440 8881 2782 -2758 -2649 296 5378 3848 6110 9103 7393 7302 6425
6187 6425 9415 9845 12463 5515 -292 -4392 -10244 -14162 -12723 -7782 -1307 438 185 -250 -3082 -560
6171 -560 2713 6170 -215 -2655 -3078 -8169 -6267 -149 -2726 -6707 -4178 1138 2230 2439 750 2574
6155 2574 -3116 -3009 -2594 2143 4208 5264 10463 2934 -353 -4507 -6398 -5395 -6708 -1736 -3542
6140 -3542 -8409 -8506 -4585 -5558 100 7613 6707 -1957 -9358 -13188 -9043 -3304 4146 -672 -6562 -8143
6124 -8143 -3488 1840 6580 2534 -4656 -5136 -10801 -14484 -10392 -13002 -10891 -6664 -4773 1408 377
6109 377 -1398 -1147 484 63 1135 4217 -1043 -1680 -1837 2856 -3494 -6279 -5383 -10949 -14834 -10339
6093 -10339 -13490 -9997 -6464 -6895 -3282 -50 -3005 -7292 -5347 -745 5260 3836 3888 2253 -1349
6078 -1349 -2012 2209 7308 9872 7592 13042 14635 16186 17769 10608 6792 7463 5670 4134 2039
6063 2039 -3851 -3950 -4493 -2636 201 5848 12446 7833 5009 3112 -8769 -16379 -12758 -5019 -1410
6048 -1410 2893 1318 3114 -900 6570 8054 5310 10947 5794 4013 11034 17159 7013 2328 -3926
6033 -3926 -12574 -13964 -11546 -11327 -4851 1270 6285 4596 3700 4855 292 2862 9737 15769 11338
6018 11338 1187 -2896 -1011 -1247 -896 2450 6067 -1080 -1514 -468 3062 583 14 1293 2240 2617
6002 2617 -568 -2346 -4393 -4763 -3960 -10524 -5935 -3392 1451 -2604 -9502 -11031 -4350 5183 8802
5987 8802 6084 3464 906 -2509 -7513 -9109 -7976 -9532 -12162 -14453 -15191 -10487 876 6118 5810
5972 5810 -875 76 907 -1233 -5140 -4214 -5125 -6716 -5146 -11009 -9175 -8930 -10570 -5528 1961 3778
5956 3778 12244 17643 9063 5726 4250 -537 -3544 -686 4096 4009 1139 2301 754 2207 6476
5941 6476 -3414 -4402 -3000 -6354 -6596 -7985 -7599 3750 5329 -4578 -5369 -4602 -923 4473 -3171 -7327
5925 -7327 -14747 -21704 -24954 -20797 -6407 -1824 -6635 -5310 1491 -3471 -2214 -906 -8141 -15721 -4786
5910 -4786 1720 3639 4429 3010 -3670 -4112 1439 3708 4396 1104 -3932 -5237 -2370 -1141 1684 -656
5894 -656 -7513 -3515 1301 3022 7221 2175 5671 3236 2173 3767 1714 3946 4237 5002 7911 7866
5878 7866 -1313 -1846 3860 7744 6272 6581 8072 6022 7103 7602 2609 -2476 -11039 -13337 -7543 -3414
5862 -3414 2918 7363 9925 6691 4851 4718 -1533 -8871 -8122 -1557 1005 -5081 -6411 -12665 -10024
5847 -10024 -3704 -1280 2136 2327 -1142 -7920 -1986 5640 9122 7804 6564 3989 4612 218 -1342
5832 -1342 4165 2376 4800 8261 10555 10598 5933 2064 3493 920 -5078 -8590 -10516 -9352 -5011
5817 -5011 -3240 2507 4521 -2794 -6381 -3817 -835 -1197 -1909 554 7915 11898 6392 -24 -4300
5802 -4300 2729 -1106 -6788 -7553 -5511 -6040 -15344 -18547 -13477 -6930 -2141 -2783 -1791 -8492 -6785 -4968
5786 -4968 -2133 -3155 -5853 -5133 142 8363 5010 2419 -4307 -5342 -2063 -3565 -5848 -10655 -8680
5771 -8680 -10849 -12543 -7624 -7012 -8110 -5122 -6553 -6149 -9219 -15329 -9032 -184 -3582 -6234 2603
5756 2603 1872 -4687 -5265 -2680 -2253 -10342 -13406 -3508 -5320 -5342 -5336 -10536 -1442 4126 -381 7453 8431
5739 8431 8934 12678 11978 1989 -9100 -6397 -4590 -6886 -7114 -3639 -8085 -8067 -10183 -6743 2362 6389
5723 6389 2965 -1436 -9889 -10955 4419 -1 -9567 -7508 -13030 -8362 -3997 -1541 -6960 -9313 -7215
5708 -7215 -8405 -9258 -2803 1278 3800 4906 5081 -2398 -8633 -10994 -15224 -13209 -10136 -4847 -5495 -10010
5692 -10010 -2207 1671 -380 -6249 -2986 -1736 -2701 -6368 -7351 -7957 -15532 -12304 -6881 -3539 -4528 -4285
5676 -4285 -9054 -11650 -3190 133 -786 -8796 -6735 453 -1236 -848 4061 6229 -5429 -2587 3328
5661 3328 10421 9135 779 -4538 -3666 4105 2644 -1608 2112 -3926 -8851 -15748 -17358 -19218 -16576
5646 -16576 -6647 -853 -3311 -2897 -1073 -1835 2426 5860 7145 8532 11143 14677 11552 9002 6296
5631 6296 4023 3954 -3395 -5493 264 1702 3867 6402 3874 -692 2575 2540 -1532 2765 4857 6386
5615 6386 8032 5177 9937 14722 7511 1193 680 -694 -9226 -11585 -12335 -11132 -9078 -2026 -1215 5105
5599 5105 6550 7293 2416 -3988 -697 1233 5928 8473 -1055 -6710 -3407 -153 -4173 -3530 -9322
5584 -9322 -10414 -10551 -3542 -4818 492 -883 210 4378 14337 15739 8688 14319 16845 14335 8820
5569 8820 1737 4844 4120 -273 -1116 -7059 -16475 -9000 -5584 -8200 -4940 2716 6975 8835 8592 876
5553 876 2514 1549 -405 -634 -3271 -9063 -3692 3426 4354 3960 2416 -995 -6415 -3634 3907 2062
5537 2062 -2686 987 3347 4811 -284 1057 3570 3227 4592 8366 918 2293 10866 6428 -1245
5522 -1245 1878 4266 3099 3416 9041 10786 7549 3152 -2230 856 2182 -70 -3301 -350 -8607
5507 -8607 -9873 -4298 -7475 -6590 -4495 -11838 -13562 -9807 -2581 -3954 -12046 -13421 -10377 -6098 -8408
5492 -8408 -9831 -9017 -12860 -10980 -9532 -12587 -16904 -15299 -4205 -2823 -3703 -1711 -4708 -174 1265
5477 1265 -6474 -10034 -695 5198 7551 381 -5645 -2696 -388 6103 3065 -1095 -2372 -7658 -12965
5462 -12965 -6479 -2042 -2682 -4434 737 -2538 -3708 -1524 3678 11691 11644 4773 6254 8031 1321
5447 1321 1267 -2450 -3477 -1583 982 5978 11109 8197 -1345 -7656 -17278 -11039 -11392 -5710 -2323 -5061
5431 -5061 -6036 -4039 -1835 -1513 2422 1131 3928 7786 11510 5374 2100 -942 910 -5263 -12765
5416 -12765 -14477 -10210 -9916 -9958 -2620 998 -2541 -343 1922 -823 -1772 2343 1955 6739 5621 3301
5400 3301 1629 -443 3544 11726 14612 15547 9133 9652 10014 3001 1609 -3372 -10995 -14538 -13490 -6614
5384 -6614 -13872 -17079 -11948 -5569 -4507 -5169 -3285 -4143 -5016 -7925 -11165 -6684 -4507 4670 11564 12127
5368 12127 6739 1150 63 -1327 -651 -2318 -6523 -5944 5270 10428 9197 9401 4462 793 -4476
5353 -4476 -7382 -8597 -10881 -4775 -1110 -756 -8022 -3234 6631 11014 12453 8697 -998 -5778 -7806
5338 -7806 -4426 -5607 -5394 6 8272 5508 -1387 -7711 2728 4231 2877 6771 5234 -661 915
5323 915 146 8333 16454 7769 8170 7816 5933 1257 -3061 -726 -261 -5353 -4614 3066 5407 4985 -2565
5306 -2565 -8140 652 5219 11539 8828 1308 -5705 -7046 660 -5361 -11466 -7201 -2333 -3099 316
5291 316 5392 7636 -1923 -4564 -8345 -1511 1824 5457 5183 1120 -4111 -2695 3154 8916 1469
5276 1469 191 -2465 3509 5706 6762 3932 15 -1116 -1992 2719 7381 6430 8604 9058 11150 9874
5260 9874 6726 6969 9762 2265 -4746 -9537 -14075 -10221 -4558 -990 1757 1063 -4684 -7145 -12259
5245 -12259 -13337 -5023 334 968 -2997 1517 2829 1352 3595 4772 12978 12736 14865 8343 -1481
5230 -1481 -9048 -7321 -6693 -6347 -6958 -6822 -4977 -4549 -16 1503 5944 8965 3984 -1219 -2618 -1496
5214 -1496 1282 4502 6570 2027 -860 876 -1677 503 1358 1239 -226 -5037 682 9364 13023
5199 13023 5872 -2410 -6222 -3574 278 -2360 187 5442 6115 678 3934 4747 3926 2683 -1064
5184 -1064 -6742 -15925 -13688 -9900 -15322 -11699 -4855 -1306 -6385 -9322 -12227 -9129 -3840 -2604 -3934
5169 -3934 -8121 234 7421 8976 10077 9575 4087 3997 4809 -593 -10749 -9886 -4358 -3187 -377 108
5153 108 6731 2309 -2421 1951 -1337 -7265 -85 6685 3275 -824 -206 -692 703 -1970 -10459 -5645
5137 -5645 -3134 -3335 -3261 -2902 -4677 -5703 -1547 6774 5577 -10553 -13323 -6434 -5269 -264 10562
5122 10562 8650 4119 3235 7287 8416 3480 -638 -5229 -4084 -2782 -6976 -7383 -1935 559 -4734
5107 -4734 -3742 -705 5253 9582 10578 9475 -881 73 11415 9549 3346 5492 2461 -3117 -4946
5092 -4946 -3418 -6781 -3193 122 -2712 5438 8083 504 -3774 502 1285 -4440 -4904 -2591 -1006
5077 -1006 2755 4356 5140 4853 1157 4196 5850 -1710 -12581 -10880 -8142 -7740 -4639 -7565 -5357
5062 -5357 6238 8084 3009 8988 14780 14558 11812 13081 10792 14225 14108 10535 3229 -6292 -2723
5047 -2723 5086 2653 9299 12879 7989 898 1833 8094 5973 4600 5000 2415 3043 1215 1738 3333
5031 3333 -2552 -4503 -7207 -8168 -5917 -7476 -5361 -1457 1887 3171 -1838 -3941 2523 6456 1795
5016 1795 6025 10478 7835 6557 7879 3304 -2616 -6562 -943 2579 2345 -1381 -1936 3138 3132 2074
5000 2074 1118 -4636 -5840 -4746 -7215 -2395 -1617 2324 9285 14117 12115 4686 4128 5982 4691 900
4984 900 3029 7392 6581 4075 -2276 -5055 -1247 4045 8238 5299 1752 -5273 -8296 363 726 -5639
4968 -5639 -6689 -4098 1353 4145 22 -5169 -4959 -3072 -8951 -1080 4926 -4655 -12281 -5151 1613
4953 1613 -1416 -5804 -12903 -20699 -10812 1049 -1317 293 107 2889 -1743 -2125 -4571 -8224 -5170
4938 -5170 -2571 -778 -1025 -853 -2539 792 466 4950 8673 1729 -586 -3026 -9007 -8289 -3171 -3256
4922 -3256 -4166 -1242 1827 4909 5112 1090 -4805 -6323 -7446 -14162 -16384 -14285 -10053 -8226 -6409
4907 -6409 -4831 -2490 -4842 -12 1284 -1319 -2864 -5796 -10404 -2496 647 -3033 -3262 -4873 -6209
4892 -6209 -4368 -2894 -700 -1093 -790 747 -2288 -7307 -6447 4721 3331 -1489 -7473 916 9281
4877 9281 7016 11290 15185 8424 10450 13197 8951 5589 4869 8402 7631 4553 -2457 -4609 -4302 -5773
4861 -5773 -16176 -11207 -1770 -2131 -3075 74 1456 4236 -6672 -4717 8564 11052 8079 2975 1403
4846 1403 -5132 -7115 10 758 3408 6484 -423 -8408 -16920 -13960 -8312 -6798 -1617 -2116 -751
4831 -751 -3351 -3765 -2757 -4502 -293 704 525 2967 8637 8885 6820 -1419 -11715 -20919 -19524 -11585
4815 -11585 -4558 1703 4561 7348 915 -3794 -7806 -8546 -6465 147 3115 -2944 -9534 -7272 -11567
4800 -11567 -10138 -6954 -3109 -2937 -7795 -17572 -15883 -10133 -2911 -68 7405 5882 1271 -2726 2073
4785 2073 2305 4014 2720 4920 891 -5214 -7899 -9912 -11695 -7322 1150 3731 5584 4355 3609
4770 3609 9911 8206 2834 2141 -836 -383 -4237 -9928 -10341 -7979 -850 -2610 -4302 1514 7357 -26
4754 -26 -4697 -7307 -1772 1794 -2143 294 -5032 -6927 -6431 -3698 -3975 -5677 -8527 -8725 -4240 -3646
4738 -3646 2925 3067 -344 5613 6024 2846 1088 1120 -205 -1194 -1544 -4606 -2287 -6638 -4214 -4478 -6135
4721 -6135 1766 8262 8977 16801 16639 5617 7624 12095 4747 -443 -386 -4100 -6250 -1460 3983 5532
4705 5532 3577 533 -358 -3266 -4745 -4355 -4519 -10016 -10682 -3791 -7737 -10500 -11110 -11089 -6812 -759 1206
4688 1206 -5419 -5348 -6516 -5570 -1461 -3087 -6236 -10503 -11641 -6376 -5330 -1221 5068 11242 16585 14425
4672 14425 9704 5218 1029 -901 -1092 -2876 -4262 -9019 -9764 -912 3811 -1573 -5528 -3405 -1777
4657 -1777 -3598 -558 -3138 -4097 -4753 -3728 -8181 -8687 -2238 2043 -4851 -11520 -21899 -14652 -8600
4642 -8600 -8644 -7945 -5730 -7659 -9362 -1009 3571 5500 9239 8798 5418 6660 1391 -9265 -13827 -12631
4626 -12631 -11107 -6993 -9690 -5617 -1269 -4346 -7993 -10072 -10237 -7362 -6777 -4132 -3916 -3323 -277 -5502
4610 -5502 -7046 -6894 -11906 -8814 -5504 -2327 -2145 -5149 3900 6259 -4460 -4865 -1456 4139 5465
4595 5465 5570 3379 4463 4768 219 -4444 -5169 -9066 -5209 1740 6845 -2918 -7965 -3651 7244
4580 7244 6012 -845 -435 308 1392 -533 -3145 -5043 -506 1265 -1406 -552 -7714 -6457 -1876 5356
4564 5356 11763 8749 10171 7036 1869 1452 6014 9280 10742 8356 544 -7010 -10161 -14284 -6510
4549 -6510 -2650 -5768 -13567 -13103 -2715 -3269 8 140 1445 2183 1067 -1043 -3490 -3786 -1549 -3443
4533 -3443 -8344 -13166 -11046 -9731 -9788 -6487 -3704 -4296 -4694 -6251 -4019 2849 5529 400 -738 6686
4517 6686 1044 -1705 -6413 -9861 -3718 -717 -3269 -525 6514 10275 6248 -932 216 -2530 -5952
4502 -5952 -917 -5039 -4617 -6337 357 13848 8110 1670 5456 3108 -1027 -5632 -1827 -1675 -1377
4487 -1377 -3263 -4637 -849 393 8219 5643 1586 -130 603 3931 4104 57 -2620 -5855 -4227
4472 -4227 375 -3334 -5046 -5666 -117 2972 4919 -566 -2461 2695 123 -2662 7264 10718 5204
4457 5204 -769 -1388 402 2352 8969 11997 14495 13010 8937 5299 4624 923 7412 8816 5055
4442 5055 3293 6519 7267 7674 4035 4363 2669 -4077 -1325 3644 11813 16047 10703 9793 5203 -138
4426 -138 -5682 -2079 -23 7519 4319 -538 -4544 -4419 -4087 -178 -8547 -14948 -8953 -5198 2988 -514
4410 -514 -3738 -6658 -4173 -1995 7706 13147 5069 4655 3969 -1390 -3703 -173 2768 6525 3471 1197
4394 1197 3253 673 -4349 -7613 -4673 3689 9804 12276 11256 5574 5921 -1072 -11042 -10494 -4
4379 -4 5045 6373 -827 -1799 -6692 -10516 -8513 -2961 2770 3147 5601 975 3398 3302 -3844 -3759 -6049
4362 -6049 -6923 -3987 -8470 -14228 -10571 -7402 -9378 -14090 -12811 -10349 684 4627 6549 7647 11914
4347 11914 11093 3586 -5364 -4365 -1906 -115 -1342 64 2658 2471 5566 4043 4644 6050 3429 -1600
4331 -1600 -3010 -1274 7 1459 -1624 -10720 -3952 -1588 -3507 -5057 -5336 -3101 2330 10135 15096
4316 15096 18470 18582 10307 5113 4853 4924 1146 3855 10753 11672 10513 5562 3838 4412 6863 10677
4300 10677 8213 8333 10527 7114 6897 2116 467 -1206 -2508 1614 -2699 391 10673 16208 15852
4285 15852 9629 5051 7067 2662 -7792 -7863 -4180 -4356 -3171 -3660 -4968 -2534 -437 -1635 -6152
4270 -6152 -9272 -3399 1442 -1783 1681 -502 -4585 -10823 -6457 -3457 -5977 -7359 -6273 -5139 -2803
4255 -2803 5719 14540 9811 3619 3285 3183 -6220 -12620 -9340 -4144 -9380 -11684 -5923 1741 1109 -5712
4239 -5712 -4361 4127 2229 -5290 -8511 -3258 -2403 -1925 -681 -5482 -7373 -425 5555 2934 2766 2880
4223 2880 2357 -2590 -3901 2251 3247 -1160 -6147 -5992 -6481 -8066 -6022 -4103 -2105 -5013 -150 646
4207 646 7062 554 -3635 -2033 1424 2344 6214 1723 1250 2654 8780 3946 -1383 -2901 -2783 -3191
4191 -3191 -10455 -13216 -9478 -6609 -5976 -103 -2477 -5017 -300 -1230 -6044 -8223 -14329 -22994 -18785
4176 -18785 -14451 -13692 -6414 -806 -3485 -3834 -581 -6439 -2603 63 -6667 -5140 -3708 -6086 -3142
4161 -3142 -1768 -1010 -3227 -2552 -438 -670 -2300 1416 6116 4993 7336 4556 -1858 -60 5467 10385
4145 10385 14352 11936 418 336 2205 -3301 -6581 209 8173 6916 9176 7426 -137 6150 10407
4130 10407 2677 -4981 1166 1369 4733 2064 431 -1728 -5298 108 4909 7128 4653 612 -4711
4115 -4711 -6139 -5904 -9975 -4326 916 1827 -3071 -827 5029 6030 -1143 -1544 -5607 1325 4714 4215
4099 4215 1357 -2070 4096 6352 5786 8096 10099 12784 16036 9732 647 -383 2209 -3870 -2201
4084 -2201 -836 -6583 -8308 -7114 -3982 -2600 -1153 1807 4204 -1576 927 2857 5858 10756 9623
4069 9623 194 -7509 -769 6625 3688 722 528 -1181 -768 -75 1395 3873 4862 5117 7023 3783
4053 3783 -1291 -6010 -5590 -10354 -11403 -7916 -1615 3509 4009 2743 1590 706 1611 876 -4100 4027
4037 4027 13044 3347 -7902 -6778 -3196 -1552 3569 3002 1494 -224 2494 3618 696 1873 1344
4022 1344 -555 369 -1564 -6365 -542 1045 -4948 -3909 1179 -1044 698 -4192 -8318 -4973 2407
4007 2407 6818 6225 5733 6931 1013 2720 15372 14012 2740 -3139 4501 -2233 -10412 -8423 -7052
3992 -7052 -4233 -4703 7635 8257 4157 2094 3319 2540 2901 -725 -9824 -5421 -4602 2460 5909 5437
3976 5437 3848 -1404 -9788 -11695 -8571 -5906 -4719 -6087 -7323 -3224 -653 3634 2543 1140 -257
3961 -257 -1742 -2846 283 -148 -3801 -1211 5494 5318 6142 3967 -661 -1211 -3105 -712 394 8374
3945 8374 13539 9798 948 -301 349 1109 5649 7768 11955 11925 3362 1079 3753 -3414 -8444 -8449 -4827
3928 -4827 -2791 -4341 -3619 1676 4112 1929 -1053 -2821 -1981 -1537 -7600 -11156 -6572 -5769 -3609 -524
3912 -524 56 2051 5619 5980 11782 14357 12356 6593 7331 8698 2721 2312 1483 -462 2159 6796
3896 6796 6539 1839 -5983 -5870 -2362 -531 -158 -7450 -8868 -3950 -7422 -4805 -147 1613 -50 -5282
3880 -5282 -6479 -5299 -2760 1659 15161 15996 6486 1231 -2162 -2760 -6959 -3565 -1425 -3656 -4025
3865 -4025 -62 -6323 -1714 2517 -334 -4054 -11048 -15608 -8212 -5420 -5672 -7766 -7718 -5735 -5622 -5947
3849 -5947 -5184 -9344 -16297 -17761 -9827 -6680 -3446 3848 1602 -3427 2294 3958 9211 12821 12675
3834 12675 9561 8277 6225 -421 223 -691 -6127 -2949 5131 4993 -3142 -6921 -832 -542 -627 1534
3818 1534 -1614 2156 955 -1168 -1752 2807 2556 -4411 -12127 -6462 -5690 -4026 -5388 -9116 -5401 -1662
3802 -1662 1782 -167 -1559 -1306 -4677 -3565 4346 2715 1198 5849 2167 -6 -69 -3889 -2555 -3863
3786 -3863 -4857 -5934 -4175 -6457 -9126 -6018 -7438 -7358 -3013 4743 7368 10396 8460 6198 4960 8682
3770 8682 4771 -1531 -520 9262 14412 16939 14218 4504 -2514 -498 662 -1827 -9663 -8413 -7849
3755 -7849 -12581 -12895 -13545 -9396 -5315 -4852 -10800 -11889 -12780 -13002 -9151 -8101 -14109 -4295 -1641 -7391
3739 -7391 -5835 -2594 -1790 -1702 6257 4266 3492 2757 -274 -8678 -8302 -1170 -532 -1506 -1704 2917 648
3722 648 -2888 -1272 -5478 -5274 -3198 997 3436 -4200 -3223 -6433 -5242 -1342 -4383 -2631 5645 9603
3706 9603 7202 1783 1907 4553 1485 581 2050 -1651 -4237 -5743 -5769 -7078 -7491 -6074 3398 10843
3690 10843 15530 17398 17541 15271 13955 6588 3990 6409 -1035 -4386 -7423 -552 946 -1953 -621
3675 -621 5158 8272 4520 -2122 -3072 2906 368 3422 6699 7965 2909 1036 -642 2385 5356
3660 5356 7901 3673 -2443 -4147 -6697 -11909 -10092 2826 5005 3204 43 -1113 -1127 372 6341
3645 6341 5253 7315 6231 3852 570 -6640 4062 10098 3112 -6079 -7867 -2780 1815 9199 3809
3630 3809 -1601 -5803 -6385 -1834 5880 10044 11182 10158 8852 1983 127 3809 9387 7517 8614
3615 8614 8915 7759 2500 2225 2302 875 3124 2133 1109 -1465 1359 1579 2095 320 -1503 -1011 2808
3598 2808 2148 4792 4180 3882 -1700 1026 8808 15122 16582 11794 4672 6996 7866 4908 5309 7080
3582 7080 5580 4880 -387 -8254 -5912 -1893 4610 10364 8611 5173 4269 4100 1499 -3434 -3410 4085
3566 4085 -768 -2155 5255 9886 4714 -1075 -8679 -5644 357 8598 10677 12058 6630 4105 6519
3551 6519 2041 -3352 -4376 -6840 -11657 -11471 -10991 -8480 -7250 -5704 -5426 -2888 -5952 -5921 -13014 -11814
3535 -11814 -5076 -944 5447 11450 10037 2007 2077 6786 6261 2737 3203 4830 2034 1498 -994 282
3519 282 5439 7206 5864 4860 -5141 -7076 -4774 -8670 -4956 -3006 1286 -2368 7018 9512 3845
3504 3845 847 6592 3231 4772 -313 -5086 -5670 -5772 -3493 3515 4636 5808 8954 8042 6241 4006
3488 4006 -4003 -887 5179 3327 1835 -3815 -16551 -16427 -3867 -2350 -4352 -7774 -6401 -427 -1616
3473 -1616 -4479 -3171 -2802 2747 -3482 -10155 -6389 -4728 -1944 -4728 -3236 4126 9081 8756 11638
3458 11638 7716 4546 5034 8188 9270 12228 9954 6380 8166 5519 1353 1957 1445 -702 1109
3443 1109 -541 -289 7337 10914 10286 9863 14832 16982 10270 5659 2441 10146 13320 8613 6944 3974
3427 3974 1446 98 3077 230 3727 11512 14142 16457 11775 4351 5015 4077 -1325 -5837 -4525
3412 -4525 6955 2978 -4425 -3049 -891 1337 -402 4248 5118 -1573 -6907 -4115 -8020 -6599 -2919
3397 -2919 -2135 -6074 -8104 -1530 8999 5911 6776 11992 3930 1472 2955 2387 450 -2282 -5381
3382 -5381 -10217 -9903 -4966 -3229 7031 12505 11350 8011 11842 14854 16670 17124 15441 11216 4001
3367 4001 3324 12421 13110 12167 8786 5981 7624 9248 10174 8438 7856 1318 6019 2234 -1787 5478
3351 5478 9493 7997 1855 2305 -1233 -2894 -3777 -4126 -4302 -5966 829 6387 3003 5803 7073 3130
3335 3130 -3930 -2285 5219 1781 4298 5191 3757 -860 -1095 4993 4526 5951 6969 3412 -655 203
3319 203 5507 9989 10704 7137 6908 7565 5809 -929 3375 6113 9930 13160 11086 5404 3200 -1903
3303 -1903 -8907 -8010 -6391 -2307 -157 6471 2112 -6388 -4013 5215 9335 2651 -5831 -5906 -5570 1095
3287 1095 -5546 -6276 -4759 -11313 -16707 -9995 -2727 -5862 -7578 -7392 -7262 -8993 -8635 -1987 -4861 -7088
3271 -7088 -3178 -2225 -3441 1746 4787 4886 -153 -3185 -1485 1679 5270 6652 1769 -998 133 -5603
3255 -5603 -5534 -3163 -6320 -10026 -7220 1904 -1001 730 8567 8806 2304 1601 85 -5157 -1651 4519
3239 4519 9590 10336 6520 6260 9664 16613 24351 13974 9798 10188 5782 4579 2920 -5867 -5737 -8843
3223 -8843 -6716 -3332 -3289 -2579 603 7532 5349 -1153 5368 13227 7088 -936 497 6999 8048 11017
3207 11017 13022 7439 9275 5642 3874 7768 10353 14043 15766 5021 3559 -1830 -4871 -10440
3193 -10440 -7984 7879 8417 -1523 -2901 -6629 -5971 -11910 -14110 -8413 -4944 -8633 -2857 142 1447
3178 1447 -904 197 1918 -3485 -5165 -1929 -6557 -13506 -13452 -4699 2976 8559 4666 1632 -748
3163 -748 1457 1124 -87 -4888 -9394 -9762 -6467 -7782 -7871 -6494 -3234 8090 10756 4616 2813 6079
3147 6079 5979 7011 -359 -5553 -3965 -4503 -3871 -5766 -9328 -5044 -4210 -6627 -2625 508 2345 5665
3131 5665 2897 2366 851 -1251 -495 8263 6615 1618 -751 2719 3135 10375 4015 -2740 -8131 -6689
3115 -6689 -3670 1111 -9008 -17641 -13238 -5274 -5364 -5846 -6847 -7602 -12090 -15208 -11806 -6643 3308 7019
3099 7019 9749 7451 6112 1389 -2478 -5199 -2663 -4716 -793 808 4722 -3974 -13889 -11312 -5046
3084 -5046 -6214 -13261 -10613 -6449 -8577 -5110 180 -923 -3959 -3017 -11055 -13966 -10791 -8883 -7511
3069 -7511 -4239 -5871 -13823 -7062 3017 9780 10912 8993 4463 -2104 -2941 -7454 -4778 -680 -4805
3054 -4805 2639 2712 -4422 -5534 -3840 -3905 -2586 4458 5797 -1055 -124 2858 5529 6151 6339 4590 -2811
3037 -2811 -7895 -9530 -6187 -2022 2212 1085 621 -589 3400 2650 -3058 -1474 -1044 410 5235 7100
3021 7100 -917 -3096 2121 2584 220 -2958 1357 59 -3340 3172 2112 6306 6441 3624 6949
3006 6949 5595 -799 -5325 -2174 264 -808 -2333 4513 -960 -5753 -3629 813 -4782 -10812 -7928
2991 -7928 -5567 -11604 -14196 -3675 8229 5927 -4496 -4479 -1829 -4566 -10737 -10553 -14014 -17727 -18753
2976 -18753 -16617 -8304 500 -3779 22 4620 6017 7147 4966 5604 7173 -549 -3690 5208 3555
2961 3555 858 542 6513 10146 10248 5594 -6291 -8681 -7505 -2387 -2182 -1645 1191 3433 2303 4482
2945 4482 7744 6053 3031 4788 9937 7695 -831 -7050 -8016 4173 12175 6208 6183 8341 8729 2308
2929 2308 51 -10773 -14995 -10308 -6214 -10678 -4816 1485 2884 5620 7163 8815 12179 6172 1574
2914 1574 -4247 -7384 -6852 -517 4195 3589 -1248 -1878 -113 -259 2685 1508 5978 6596 4207 11037
2898 11037 12548 1587 -1145 730 -2235 6062 14156 9908 7426 10778 9022 3714 -1413 -1858 -2835
2883 -2835 -4347 -1078 2814 5080 4216 -4815 -6209 601 578 2669 4271 -1983 -8884 -11639 -16500 -12357
2867 -12357 -9221 -12493 -18627 -14133 586 887 -7772 -5028 4702 3022 214 -3078 -4855 -5945 -6694
2852 -6694 -4213 -838 4949 9568 6872 2288 2581 7658 8200 11905 10131 12623 2672 595 665 5015
2836 5015 4880 2402 -2754 -5561 -6595 -825 1268 -623 -1095 -3097 -1018 2347 -1848 -1470 -279 -2497
2820 -2497 -4246 -296 3179 3674 1264 1048 1938 -4220 -9904 -8425 -2322 2963 7852 7448 10243 13249
2804 13249 14661 13533 6179 4212 1305 -4036 -5198 -3449 -5313 1635 6277 2873 1646 -310 -8529
2789 -8529 -3055 2690 -6506 -7528 -2411 -4516 -3658 -601 250 -538 -3025 -1867 1231 5937 6254 2901
2773 2901 0 -1322 -5029 -7558 -1919 2662 4133 3884 5988 7529 6019 3505 749 6079 5495
2758 5495 936 -3263 -716 -2261 -2547 -8296 -11511 -8428 -2236 -9287 -3469 2561 2204 996 1920 566
2742 566 3833 5328 5297 11536 12999 6971 5766 11871 11731 3029 2538 3478 1975 4214 7429 9500
2726 9500 7029 10195 7200 3042 1109 -2710 -6169 -3592 1842 1592 3730 2391 -382 -5381 -5594
2711 -5594 -3737 301 8126 9860 3812 981 3449 4395 4642 2537 -1612 -1612 -4282 -1314 588 -5555
2695 -5555 -2283 1693 -408 -8703 -14498 -8948 -3950 238 564 289 -2514 -2875 -1671 -3807 -3344 -3566
2679 -3566 2769 6955 4076 -5410 -10003 -3317 2442 3662 5558 9262 15087 14176 13759 15836 8422
2664 8422 1172 6924 5165 -2248 -4332 -2652 -791 3357 9539 10837 10233 12982 10769 10620 9615
2649 9615 10166 10188 8768 5917 1100 1700 7594 10203 4369 -5164 -9131 -6827 -1690 -1162 -7962 -3352
2633 -3352 -537 -1903 -3510 -1080 -5355 -4619 -5542 -9145 -5409 -6377 5901 9457 4059 5801 11407
2618 11407 7481 624 -1613 -6082 -4904 -8535 -11037 -7477 -2624 321 6549 4489 526 -4601 -9386
2603 -9386 -7897 -11049 -12068 -8417 -3954 -4595 -5601 1423 5763 9187 4074 -4580 -2454 813 3055
2588 3055 4203 6610 -926 -6116 -7030 -8318 -6450 -3468 -277 2361 7247 5208 -2969 -7686 -4148
2573 -4148 -9122 -12824 -9061 -1950 5390 55 -5856 -1921 1515 6317 9399 16004 12360 10609 5565
2558 5565 -2913 -13287 -13527 -16458 -11220 -1181 -4642 -1861 391 -461 -107 11076 14251 10104 7120
2543 7120 14141 10115 8867 7677 5581 -1228 -4966 -301 3101 7265 8983 1631 523 -1310 9511
2528 9511 13200 8095 6215 4237 1445 1132 5998 11756 5137 275 1655 -1738 -8896 -7560 -3893
2513 -3893 -1939 -716 5409 -83 1034 6085 6560 8850 6595 6112 16004 12552 25 -8100 -11194
2498 -11194 -12279 -4819 -1147 4067 5325 1947 -5032 560 3312 448 586 -31 -1310 3933 6557
2483 6557 -3001 -6467 -5332 -1066 4234 14038 12042 9414 7703 10679 11161 2252 98 -461 -31 -379
2467 -379 -3015 3188 4755 2343 4716 7426 7871 4675 -5046 -7767 -10079 -4528 -4402 -5364 -6917 -2471
2451 -2471 3857 5980 1240 1297 4338 -226 -2553 478 2551 12799 19258 19745 17331 15606 15213 14546
2435 14546 10490 7532 -3447 -1838 1195 800 -2113 -6556 -13141 -8406 -8465 -113 3392 5669 4777
2420 4777 7118 7493 8578 6391 5223 4747 9866 2689 -5479 1494 1809 4162 5068 1743 -1945 4405
2404 4405 4398 -5130 -11654 -14176 -8091 -2768 4464 8162 8298 7095 4748 -369 -5255 -2285 864 7315
2388 7315 -578 2073 5598 6143 839 -1929 -5155 -7649 -4530 -9464 -11479 -8735 -1146 2384 5787
2373 5787 6683 10156 10891 16411 17419 11502 7349 8626 10250 4517 6642 5317 4682 9050 9021 5085
2357 5085 5474 6301 9373 8175 90 -3485 -5612 -5378 -6228 -1530 838 -1875 -1127 5063 -953 -12755
2341 -12755 -9749 -4691 -5037 -10304 -7018 -6653 -5098 2206 5135 3925 6838 604 4984 -266 302
2326 302 -164 151 1944 -6805 -9928 -10194 -4499 -2765 1106 5014 573 2267 4029 -1927 -176 2077
2310 2077 6010 4415 550 -4820 -3235 1650 7332 7546 670 -114 2709 2827 11469 19453 15482 15936
2294 15936 7187 2773 2827 7045 394 -3612 -4244 -3366 -8996 -8509 -4650 -8390 -7610 2418 7468 6035
2278 6035 -773 -4094 1041 5267 2295 7137 686 -9856 -8166 -13411 -17930 -22265 -14653 -13792 -13307
2263 -13307 -10679 -12265 -9994 -2845 -8101 -12476 -12476 -13449 -5746 957 -2062 -2639 -971 -3658 -4310 -657
2247 -657 -1987 -1779 -5860 -5528 -409 619 1210 -1740 -1832 -341 -988 -486 763 -8691 -16644 -16108 -11156
2230 -11156 -14824 -9578 -3655 -3336 -2871 2410 1042 -3458 -4962 -5147 -3972 -7685 -9871 -9914 -7544 747
2214 747 5962 10395 8212 4950 6937 3625 1953 -5006 -8439 -11250 -13135 -13086 -12709 -4132 4856 3819
2198 3819 4325 3049 403 5297 10447 16237 13085 6679 -460 -7366 -4282 -1520 13498 16795 13943
2183 13943 11383 5950 1745 -2799 -2205 -2011 861 -1801 -10861 -15397 -13211 -12051 -8214 -6156 -3380
2168 -3380 -5971 -3641 1101 790 -490 3227 5583 8762 4724 -2211 -2562 -3996 -6320 -3795 -4456 -2365
2152 -2365 -7767 -1616 -1844 839 3121 4877 247 -1687 -5175 -74 979 4501 2118 -7665 -4711
2137 -4711 -10093 -16383 -14594 -5221 2376 4549 5773 3369 3917 3575 2964 723 2670 3548 3577 -20
2121 -20 -4741 -8356 -10879 -10845 -4291 -2514 -6120 -5186 -932 3471 1020 1625 1274 7618 17838 20062
2105 20062 10995 4229 -501 6444 9140 5606 3713 2005 -4033 -2422 -3295 -4594 -6054 -9914 -7754
2090 -7754 -5306 -2695 -3447 -1772 -4113 -5186 2608 5675 4960 1446 11209 11827 5801 -476 3796 9818
2074 9818 6937 -256 -1348 -5879 -8323 -4511 1582 -1696 -13069 -15476 -7657 -164 819 -49 -7604
2059 -7604 -4969 2247 413 2228 6040 3742 -3000 -3085 3351 6212 6553 1949 2093 2576 3833 6358
2043 6358 -85 -2131 3041 8286 -626 -7856 -6627 1560 -1750 -3864 1786 2522 3413 2199 2616 5012
2027 5012 5112 1231 -5449 -6804 -7313 -7881 -1102 357 725 -5074 -4737 -3853 -5960 -7937 -4806 -4502 -6385
2010 -6385 -3163 4423 4325 4693 5407 1831 -512 -4128 -2412 -2634 -7599 -1321 -1835 -912 4288 9635 9780
1993 9780 2806 -3843 -1863 -2436 -5779 -5189 -8396 -5556 -8071 -5223 -1773 -2334 809 2762 -5185 -3284
1977 -3284 1836 -1586 2979 6163 1051 -6035 -2374 -3709 -994 1964 5776 9632 11071 11809 7388
1962 7388 3762 1998 4132 -833 -3641 -4031 1729 2966 -5809 -959 4967 7261 4924 -168 5065
1947 5065 4820 2099 -650 -1977 -1395 -4151 -4411 -3395 2121 -184 1682 4208 5297 1900 -357 -2090
1931 -2090 -4647 -3871 2210 2156 -1923 -5916 -57 7356 2783 -2886 -10151 -8825 -5565 -32 -6186 -5995
1915 -5995 -3541 -2828 -1342 -638 -240 -540 -210 -1558 -5380 -2516 -5519 -11857 -8993 -7816 -7603 1659
1899 1659 7615 11115 14022 15939 10333 80 -2035 4685 6919 7427 6749 5927 8470 13106 15563
1884 15563 18448 11400 2919 -2322 717 2957 -2884 -9616 -10641 -12700 -12695 -13076 -7835 -6764 -6186 -7561
1868 -7561 -9030 -3233 -2245 -343 2431 1116 29 -4206 -8028 -12391 -12344 -7965 -11321 -6877 5263
1853 5263 7802 3231 2720 694 3872 1109 -5186 -7907 -9674 -9950 -8196 -12395 -10206 -6770 395
1838 395 4829 7799 7347 8814 14582 11075 4003 3339 6037 5107 9066 15302 13774 14934 11912 3053
1822 3053 -4423 -9791 -7886 -4530 -2855 -6019 -10317 -11691 -5217 -8616 -3012 7140 6795 -484 -9673
1807 -9673 -9846 -8494 -4605 -637 1942 4411 2351 -2642 -7369 -4692 -3967 -9663 -17023 -12477 -2612
1792 -2612 -4221 -1042 6738 1588 -2564 1293 -443 8689 9894 -1334 -7913 -12294 -7616 -6234 -2742
1777 -2742 867 9027 13326 12694 11936 7286 5473 -2666 -15538 -19074 -15344 -9543 2015 6217 9954
1762 9954 15909 14070 8374 2510 565 2808 2261 424 284 4478 7279 1915 -1300 3942 2125
1747 2125 1319 -101 57 3174 2258 1930 -673 -2820 -6219 -9364 -6279 -8109 -2869 -7016 -16248 -17686
1731 -17686 -7593 -5431 -4969 -4414 -3509 835 1581 5468 2423 -5597 -7217 -4306 -1556 809 2251
1716 2251 -876 -420 -8102 -8564 -4404 -2431 -2724 -1175 -19 5816 5769 8727 8432 5228 2837 1949 -962
1699 -962 900 1903 576 -1878 -10689 -10294 -6686 -2706 4562 5618 -1194 -4425 -2496 -1078 -4197
1684 -4197 3515 3718 2192 9615 5094 -2325 604 4046 8545 10032 4186 819 2568 -267 -8114
1669 -8114 -3284 4493 4653 -1659 1491 6859 11310 10269 4191 -8352 -9688 -12816 -10842 -8745 -2142
1654 -2142 2693 10539 12295 8163 5344 3333 -673 -2439 1165 -161 -1498 192 -1956 -6866 -3189
1639 -3189 -434 -3277 -6624 -6088 -7616 -5395 -2403 -231 1820 2723 -836 -4357 -1690 2613 5920
1624 5920 3357 1664 4996 1219 -2998 -7013 -13436 -11080 -7624 -2971 4522 2004 -5526 -5687 -8980
1609 -8980 -9234 -12346 -8957 3499 12087 16496 13176 4717 9767 8948 5675 9251 7913 2555 4128
1594 4128 5852 -1289 -4592 -6974 -5339 -2606 5748 7221 4109 2530 1017 -4725 -5289 -1507 1345
1579 1345 2251 5577 8064 12278 9727 7545 632 -1840 -2537 -10519 -14184 -9065 850 4785 8181
1564 8181 11090 6743 8413 7148 2082 -5164 -3764 -4231 -5532 2854 4647 8127 3166 -6372 -3854
1549 -3854 940 687 -2731 -5138 -2843 6964 11307 5963 5280 3756 -4655 -7445 -2865 1928 1561 2695
1533 2695 4863 2403 4358 3141 -2177 -9193 -12462 -17967 -17257 -7406 -9176 -9290 526 885 -2375 -1501
1517 -1501 -8535 -7580 -1525 -4956 -8464 -5653 -7230 -4278 -895 -600 -7184 -6511 -2496 0 10197
1502 10197 11893 7628 7444 5570 1657 48 72 2096 1066 -109 2625 -7154 -11382 -11816 -13977 -16837
$$ [...]
##END NTUPLES=NMR SPECTRUM
##END=
