##TITLE=Analysis number 328616
Compound Code cc 54209
Book Reference 518/121
Project Code adrs
Chemist Name colinb
##JCAMPDX= 6.0         $$ Bruker NMR JCAMP-DX V2.0
##DATA TYPE= NMR SPECTRUM
##DATA CLASS= NTUPLES
##ORIGIN= Bruker BioSpin GmbH
##OWNER= nmr
$$ XWIN-NMR		Version 3.5
$$ Wed Jun 20 12:37:39 2007 GMT Daylight Time (UT+1h)  MAYBRIDGE\nmr@NMR_250MHZ
##.OBSERVE FREQUENCY= 250.131544655141
##.OBSERVE NUCLEUS= ^1H
##.ACQUISITION MODE= SIMULTANEOUS (DQD)
##.ACQUISITION SCHEME= undefined
##.AVERAGES= 16
##.DIGITISER RES= 18
##SPECTROMETER/DATA SYSTEM= dpx250
##.PULSE SEQUENCE= zg30
##.SOLVENT NAME= CDCl3
##.SHIFT REFERENCE= (INTERNAL, CDCl3, 0, 16.522)
##AUDIT TRAIL= $$ (NUMBER, WHEN, WHO, WHERE, WHAT)
$$ ##TITLE= Audit trail, XWIN-NMR		Version 3.5
$$ ##JCAMPDX= 5.01
$$ ##ORIGIN= Bruker BioSpin GmbH
$$ ##OWNER= nmr
$$ C:\u/data/dgb/nmr/ADRS/1320/pdata/1/auditp.txt
$$ ##AUDIT TRAIL=  $$ (NUMBER, WHEN, WHO, WHERE, WHAT)
(   1,<2007-06-20 12:37:18.46 +100>,<MAYBRIDGE\nmr>,<NMR_250MHZ>,
      <created by zg, POWCHK disabled, PULCHK disabled
       configuration hash MD5:
       76 6E 9A 78 1E 09 19 81 EC 84 63 8F B0 6A 59 2D
       data hash MD5: 64K
       7A CE AD CF 86 C7 08 EA 62 63 2C 33 18 9B 87 7A>)
(   2,<2007-06-20 12:37:30.98 +100>,<MAYBRIDGE\nmr>,<NMR_250MHZ>,
      <Start of raw data processing
       ef LB = 0.3 FT_mod = 6 PKNL = 1 SI = 32K 
       data hash MD5: 32K
       7E 05 E5 49 A4 E8 26 B0 03 49 E7 FC E4 72 54 F4>)
(   3,<2007-06-20 12:37:32.59 +100>,<MAYBRIDGE\nmr>,<NMR_250MHZ>,
      <apk 
       data hash MD5: 32K
       D9 F3 BA 46 6B A5 5D A7 AC 67 90 61 19 C1 AD A9>)
(   4,<2007-06-20 12:37:33.40 +100>,<MAYBRIDGE\nmr>,<NMR_250MHZ>,
      <abs ABSG = 5 
       data hash MD5: 32K
       5C 22 EC 67 50 CB 4B C5 77 41 98 02 AD C5 CE 31>)
$$ ##END=
$$ 
$$ hash MD5
$$ B6 57 9C 0E A7 E0 90 9D 23 27 E4 D0 C6 13 0C AE
##$RELAX= 
##$RELAX= 
##$RELAX= 
##$RELAX= 
##$RELAX= 
##$RELAX= 
##$RELAX= 
$$ Bruker specific parameters
$$ --------------------------
##$DU= <C:\u>
##$EXPNO= 1320
##$NAME= <ADRS>
##$PROCNO= 1
##$TYPE= <nmr>
##$USER= <dgb>
##$AMP= (0..31)
100 100 100 100 100 100 100 100 100 100 100 100 100 100 100 100 100 100 
100 100 100 100 100 100 100 100 100 100 100 100 100 100 
##$AQSEQ= 0
##$AQ_mod= 3
##$AUNM= <au_zg>
##$AUTOPOS= <26 >
##$BF1= 250.13
##$BF2= 250.13
##$BF3= 250.13
##$BF4= 250.13
##$BF5= 500.13
##$BF6= 500.13
##$BF7= 500.13
##$BF8= 500.13
##$BYTORDA= 1
##$CFDGTYP= 0
##$CFRGTYP= 5
##$CHEMSTR= <none>
##$CNST= (0..31)
1 1 145 1 1 1 1 1 1 1 1 1 1 1 1 1 1 1 1 1 1 1 1 1 1 1 1 1 1 1 1 1 
##$CPDPRG= <>
##$CPDPRG1= <>
##$CPDPRG2= <>
##$CPDPRG3= <>
##$CPDPRG4= <mlev>
##$CPDPRG5= <mlev>
##$CPDPRG6= <mlev>
##$CPDPRG7= <mlev>
##$CPDPRG8= <mlev>
##$CPDPRGB= <>
##$CPDPRGT= <>
##$D= (0..31)
0 1 0 0 0 0 0 0 0 0.06 0 0 0 0 0 0 0.0002 0 0 0 0 0 0 0 0 0 0 0 0 0 0 
0 
##$DATE= 1182339437
##$DBL= (0..7)
120 120 120 120 120 120 120 120 
##$DBP= (0..7)
150 150 150 150 150 150 150 150 
##$DBP07= 0
##$DBPNAM0= <>
##$DBPNAM1= <>
$$ [...]
##$SUBNAM7= <"">
##$SUBNAM8= <"">
##$SUBNAM9= <"">
##$SW= 20.6930455092707
##$SWIBOX= (0..15)
0 0 3 0 0 0 0 0 0 0 0 0 0 0 0 0 
##$SW_h= 5175.983436853
##$TD= 65536
##$TD0= 1
##$TE= 296.16
##$TE2= 300
##$TE3= 300
##$TEG= 300
##$TL= (0..7)
0 120 120 120 120 120 120 120 
##$TP= (0..7)
150 150 150 150 150 150 150 150 
##$TP07= 0
##$TPNAME0= <>
##$TPNAME1= <>
##$TPNAME2= <>
##$TPNAME3= <>
##$TPNAME4= <>
##$TPNAME5= <>
##$TPNAME6= <>
##$TPNAME7= <>
##$TPOAL= (0..7)
0.5 0.5 0.5 0.5 0.5 0.5 0.5 0.5 
##$TPOFFS= (0..7)
0 0 0 0 0 0 0 0 
##$TUNHIN= 0
##$TUNHOUT= 0
##$TUNXOUT= 0
##$USERA1= <user>
##$USERA2= <user>
##$USERA3= <user>
##$USERA4= <user>
##$USERA5= <user>
##$V9= 5
##$VALIST= <valist>
##$VCLIST= <CCCCCCCCCCCCCCC>
##$VD= 0
##$VDLIST= <DDDDDDDDDDDDDDD>
##$VPLIST= <PPPPPPPPPPPPPPP>
##$VTLIST= <TTTTTTTTTTTTTTT>
##$WBST= 1024
##$WBSW= 4
##$XGAIN= (0..3)
0 0 0 0 
##$XL= 0
##$YL= 0
##$YMAX_a= 208107
##$YMIN_a= -176763
##$ZGOPTNS= <>
##$ZL1= 120
##$ZL2= 120
##$ZL3= 120
##$ZL4= 120
##$ABSF1= 16.522
##$ABSF2= -4.171173
##$ABSG= 5
##$ABSL= 3
##$ALPHA= 0
##$AQORDER= 0
##$ASSFAC= 0
##$ASSFACI= 0
##$ASSFACX= 0
##$ASSWID= 0
##$AUNMP= <proc_1d>
##$AZFE= 0.1
##$AZFW= 0.1
##$BCFW= 0
##$BC_mod= 0
##$BYTORDP= 0
##$COROFFS= 0
##$CY= 12.5
##$DATMOD= 1
##$DC= 0
##$DFILT= <>
##$DTYPP= 0
##$F1P= 14.0000005364418
##$F2P= -0.99999901652339
##$FCOR= 0.5
##$FTSIZE= 32768
##$FT_mod= 6
##$GAMMA= 0
##$GB= 0
##$INTBC= 1
##$INTSCL= 1
##$ISEN= 128
##$LB= 0.3
##$LEV0= 0
##$LPBIN= 0
##$MAXI= 10000
##$MC2= 0
##$MEAN= 0
##$ME_mod= 0
##$MI= 0
##$NCOEF= 0
##$NC_proc= -5
##$NLEV= 6
##$NOISF1= 0
##$NOISF2= 0
##$NSP= 0
##$NTH_PI= 0
##$NZP= 0
##$OFFSET= 16.522
##$PC= 1
##$PHC0= -48.66833
##$PHC1= 9.072793
##$PH_mod= 1
##$PKNL= yes
##$PPARMOD= 0
##$PSCAL= 4
##$PSIGN= 0
##$REVERSE= no
##$SF= 250.13
##$SI= 32768
##$SIGF1= 0
##$SIGF2= 0
##$SINO= 400
##$SIOLD= 32768
##$SREGLST= <1H.CDCl3>
##$SSB= 0
##$STSI= 32768
##$STSR= 0
##$SW_p= 5175.98343685301
##$SYMM= 0
##$S_DEV= 0
##$TDeff= 65536
##$TDoff= 0
##$TI= <Analysis number 999999
Compound Code 99
Book Reference 9
Project Code 9>
##$TILT= no
##$TM1= 0
##$TM2= 0
##$TOPLEV= 0
##$USERP1= <user>
##$USERP2= <user>
##$USERP3= <user>
##$USERP4= <user>
##$USERP5= <user>
##$WDW= 1
##$XDIM= 32768
##$YMAX_p= 532135230
##$YMIN_p= -801992
$$ End of Bruker specific parameters
$$ ---------------------------------
##NTUPLES= NMR SPECTRUM
##VAR_NAME=  FREQUENCY,     SPECTRUM/REAL,   SPECTRUM/IMAG
##SYMBOL=    X,             R,               I
##VAR_TYPE=  INDEPENDENT,   DEPENDENT,       DEPENDENT
##VAR_FORM=  AFFN,          ASDF,            ASDF
##VAR_DIM=   32768,         32768,           32768
##UNITS=     HZ,            ARBITRARY UNITS, ARBITRARY UNITS
##FACTOR=    0.157963299565203, 1,           1
##FIRST=     4132.6476996994, 0,             0
##LAST=      -1043.33573715361, 0,           0
##MIN=       -1043.33573715361, -801992,     0
##MAX=       4132.6476996994, 532135230,     0
$$ Real data points
##PAGE= N=1
##DATA TABLE= (X++(R..R)), XYDATA
$$ [...]
23343a26806J4881L2274K1571L1782k6759n602J6761K3389j0398J29248M15319
23332E15660j07185k78950j65681R30J31419J36893j5085O230r3825Q567r6403
23321D2570j25780K5442m9209J4170l0181K6127J33979l485J06589n7002j96690
23310a13470j04015j08432K22482J24526J82310J5985k28296j70715P4418p7187
23300a82394k3331J58330O0231r1718K6785J60267J04336q7732k00398J43377
23290F7753n9208k12002l4122n968J28949J82807P9116o726O7296J14759j20676
23279B01978j25686j14717O6634l344j13453J52001O1464n7300r6100R6849J11229
23268A79555P8623k9794j02622r5465j57563l2873j69675j24025N7661K23293
$$ y = [-126806, -111925, -79651, -58080, -26298, -53057, -58659, -41898, -18509, -28907, 100341, 515660, 408475, 129525, -36156, -35226, 96193, 233086, 218001, 224231, 130406, 138973, 42570, -83210, -57768, -106977, -92807, -122988, -96861, 37118, 33633, 140222, 83220, -113470, -217485, -325917, -103435, 21091, 203401, 219386, -8910, -179625, -105207, -182394, -205725, -47395, 12836, -78882, -52097, 108170, 212506, 124774, -75624, 67753, 8545, -203457, -237579, -243547, -114598, 68209, 147325, 140599, 207895, 322654, 201978, 76292, -38425, 28209, 24865, -88588, 63413, 124877, 67577, -28523, 68326, 179555, 258178, 228384, 125762, 30297, -127266, -160139, -329814, -453839, -396178, -172885]
23258a72885J52205o8860k5054k7765M3717P111L6243J81659O7256l330N6232
23247B46529k85724j30006K25678K48242l00434j44645P5329N495k4620O007P6850
23236a299J63666J7183M178j3188L0041j16989j59871P3661O9184J51090k19058
23225a402j45187j34340k5590K75087J23913M3997j9470L1179j7340m9064p4125
23214G658P9360O1573m256j68874k96068P4432J87570K4934M8049j31246Q7854
23203b9014J4338K88741K1372q8173k16717j91469K12317K4252o0998k0654L5370
23192a0635M4556l9327J18840N4319j36745o9284R4817J860q4914O4120r8689
23181f1082j08368n4769J14392J79108K1429P1763O1912k37927r2132J32362n0341
$$ y = [-172885, -20680, -89540, -114594, -142359, -98642, -91531, -55288, 126371, 193627, 190297, 246529, -39195, -169201, 56477, 304719, 4285, -140360, -65031, -59536, -84156, -78149, -1299, 162367, 179550, 183728, 170540, 200581, 83592, -76279, -2618, 66566, 217656, -1402, -146589, -280929, -306519, -31432, 92481, 136478, 117008, 148187, 130847, 81783, 7658, 87018, 148591, 144335, -24539, -320607, -246175, -58605, -33671, 14378, -116868, -29014, -14676, 274065, 295437, 207264, -9453, -200922, 11395, 35647, -25351, -46005, -10635, 33921, -5406, 113434, 167753, 31008, -38276, 56541, 58401, -26513, 37607, -61082, -169450, -224219, -109827, 69281, 90710, 162473, 224385, -13542, -105674, 26688, -23653]
23170b3653j11880N1319N751j42576o8815P7540j10450k0655L2459K72169J40517
23159A01726l0121P0559Q7426j1748n3042j27534R867J02076r2938l4823J01671
23148A23119k07410q5367L633N7818M564J91931L3993q0512O9247J7486K9832
23137A58334j47972K40296J53209j65200n3059k68263P819J48780J42014N2324
23127B68282j60366p6823p213j75082j67154N6504K85395J09062M9263r2376n1908
23116C7584o0931J381m0220K0267j03103l1299Q9139J39962P1951O7227J6802
23105B08760k84816j11603J71055M0082O5882J74328o9876J29737J36333j44212
23095C15670m0433r5073J1787o5152l11064j59501j9539L6199P4868J08574J24180
$$ y = [-23653, -135533, -84214, -78463, -221039, -289854, -212314, -322764, -343419, -310960, -38791, 101726, 71605, 142164, 229590, 217842, 164800, 37266, 47133, 149209, 56271, 21448, 123119, -84291, -169658, -166025, -108207, -103643, 88288, 122281, 41769, 111016, 128502, 158334, 10362, 250658, 403867, 238667, 185608, -82655, -74836, 73944, 215958, 268282, 107916, 31093, 23880, -151202, -318356, -261852, 23543, 132605, 181868, 89492, 37584, -23347, -21966, -62186, -41919, -145022, -176321, -87182, 52780, 124731, 191958, 208760, -76056, -187659, -16604, 23478, 89360, 263688, 193812, 323549, 459882, 315670, 275237, 180164, 191951, 126799, -184265, -343766, -363305, -327106, -252238, -143664, -19484]
23084a9484J0759j70531N2549K02650N2542P8702l04537o436J36202j5366j18366
23073a01316Q4210J64058l0904k44831j0889K5022L10575O7940o8361k35896j40408
23062a80800J32551J27813O3586j15641n4479l0020R2518J91421K3235m1392Q1687
23051B90479L5154o2547J775m5431k26327J4446L0777r4444N440k1291J96082
23040A24113j91791r3564J07419J64902r90j04875Q1669j6998J29983J72043l28401
23029D3510m9710P2874R6461J0590j6306J2396J34012J36106q2647j60971r2201
23018A04114K1094n1457q0347j9726n7699O4011k07437J18674O1238j40653O7846
23007a20342J89108K4717M156o3655j28175R1019J26220L2025j93385O4825j7135
$$ y = [-19484, -8725, -179256, -126707, 75943, 128485, 207187, -97350, -103786, 32416, 17050, -101316, -17106, 146952, 116048, -128783, -139672, -114650, 195925, 263865, 195504, -40392, -180800, -48249, 79564, 143150, 27509, -26970, -56990, 35528, 226949, 250184, 208792, 290479, 325633, 263086, 264861, 219430, -6897, 7549, 38326, -56118, -50678, -71969, 124113, -67678, -161242, -53823, 111079, 110089, 5214, 86883, 69885, 199868, 371911, 43510, -6200, 66674, 163135, 173725, 157419, 169815, 303827, 439933, 357286, 196315, 104114, 125208, 73751, -6596, -26322, -84021, -20010, -227447, -108773, -47535, -188188, -120342, 68766, 93483, 97639, 33984, -94191, -3172, 123048, 155073, -38312, 26513, 9378]
22996I378K1035O7089K02332L6250k45792p6428k2778Q2463q7791k21719j84910
22985d20871Q4832Q9924N5276r29q2188J21878J39126Q6648R0940j23038o073
22974C5525J69770Q4524j56077n0197l9058k18396j98012j1555O9161O1262J97714
22963e5339J28225K5299J32109p3494m7674o970M1357k14135j14304j7758J59818
22952d2866J18130k9851j30563m4465J15207q3758n0659J03371O8689m9192J5720
22941a0237l7568N8414R2427N1595k6320l1633k10175O2467k1658j3083L5277
22930e0494r481L3729R464j81327K9329K73840L02682M21k78470J2615j41208
22919A100M4048l4127L089j57261j20429N9991Q9588j4470k6242p9445j07050
$$ y = [9378, 30413, 97502, 299834, 336084, 90292, 13864, -8914, 73549, -14242, -235961, -420871, -336039, -246115, -190839, -191768, -273956, -152078, -12952, 73696, 164636, 41598, 35525, 205295, 289819, 133742, 83545, 44487, -173909, -371921, -383476, -314315, -253053, -55339, 72886, 98185, 230294, 156800, 109126, 102156, 143513, -70622, -184926, -202684, -42866, 75264, 45413, -85150, -129615, -14408, -98166, -148825, -45454, 23235, -25957, -10237, -47805, 10609, 103036, 154631, 128311, 96678, -113497, -51030, -72688, -85771, -50494, -59975, -26246, -16782, -198109, -168780, 105060, 407742, 408163, 129693, 142308, 1100, 45148, 11021, 14110, -143151, -263580, -203589, -114001, -128471, -154713, -234158, -341208]
22908c41208m3717q9476K0987m1516J99552L9516J35199m7278j8184Q1137m5736
22897a50724L5142q4769l7577j88209J60364K50639j07837o2183m8315J76856
22887e6613Q4483m0431m05093k267K00474K32770n9220q1208J40218j6713J65104
22876A61504n2170j48602J6631N8001p756o3637K83133J61891j76609q2635k35927
22865h6176k30618m4207J44313k2604O8165j6783k38195R2230K9273J3281j4642
22854c05963L2692K3240l279Q1079J39225K5355j02890j68101k07357J52615L10482
22843b2902K90744J14209j62241j55858n6312N7041r2171j38495J47090J89601
22833A70706m2234j67630j13784J69288J30703N756j50032L7702M5254q2103j171
$$ y = [-341208, -384925, -474401, -453414, -494930, -295378, -255862, -120663, -167941, -186125, -104988, -150724, -115582, -200351, -237928, -426137, -265773, -15134, -122971, -185154, -233469, -56613, 27870, -12561, -417654, -419921, -219447, 13323, -45897, -127105, 13113, -3600, 161504, 109334, -39268, -22637, 35364, 27608, -36029, 247104, 408995, 232386, 149751, -86176, -316794, -361001, -216688, -239292, -171127, -187910, -426105, -333875, -304602, -291321, -305963, -273271, -250031, -253310, -172231, -33006, -7651, -110541, -278642, -485999, -333384, -22902, 267842, 382051, 219810, 63952, 7640, 64681, -27490, -165985, -18895, 170706, 128472, -39158, -152942, 16346, 147049, 152805, 2773, 40475, 85729, 3626, 2455]
22822B455J17985O3992j00742l7222j35229p8154l1182K10645N6538r4523o999
22811c2436q1649j5163K33934J30786j02863k7163J26440k31578r5137N5684J8396
22800b0749j8998q7868j66442R38J36118J36598J612N6086L6765o0110N8848j07725
22788c4927j91021m9452L2030J63341K11997n5781p5383J30455M6635k9092l8433
22777A10369J17075R4025O7475q9181P7676l2319l04626q2170n5104M7872Q620
22766d0288m1905o8037P6946J34526N3055Q6105M4483O7904J09614k17263j80913
22755B4227J94234j85248k37055K05262K96348k33359j32021l74k5439k5014j8701
22744a37140O5833J47752j36554p9958j92647O4040N1511J83001P6805j8464j37143
$$ y = [2455, 120440, 184432, 83690, 46468, -88761, -166915, -198097, 12548, 69086, -25437, -32436, -114085, -129248, 104686, 235472, 132609, 105446, 231886, 308, -94829, -39145, -20749, -39747, -127615, -294057, -293119, -157001, -20403, -18791, 37295, 74060, 13950, 72798, -34927, -225948, -275400, -243370, -80029, 131968, 76187, 804, 131259, 177894, 148802, 110369, 227444, 321469, 388944, 299763, 377439, 345120, 40494, -41676, -96780, -48908, -40288, -82193, -150230, -73284, 61242, 114297, 200402, 244885, 312789, 422403, 205140, 24227, 218461, 33213, -203842, 1420, 297768, 64409, -67612, -67986, -93425, -118439, -137140, -71307, 76445, -60109, -140067, -332714, -268674, -217163, -34162, 42643, 24179, -112964]
22733a12964P754P3865j50659k5259p369K5784J53032N6437J01128Q6336k42382
22722c4297p0191J66386K9336k2103O6119q9801j47596j64438j26086J68241J78479
22711d5951n7931j91389k31714P7119R9892R7589J85806L6548k61541n594K57018
22700d0148lQ1787m0182k00968L307j20478j3666L8789k371P3383J06296M7643
22688f6611j08487m02988J786K69214l2820J04553J64090P9726m3488j13385q1601
22677b30011R5571M8667K0778j23161k18706R3202K355j95358k5784L24612K54726
22666D6891J14571j67324O4157K31444R4042k67152j105K16358O117k50647m6844
22655D0508O0661j33455l1936q4291J3271K87921O9562k88438k1598K9421P3803
$$ y = [-112964, -105210, -31345, -182004, -207263, -214632, -188848, -35816, 20621, 121749, 208085, -34297, -104488, 61898, 91234, 69131, 135250, 45449, -102147, -266585, -392671, -224430, -45951, -103882, -295271, -526985, -449866, -349974, -252385, -66579, -30031, -291572, -297166, -40148, -40151, 41636, 1454, -199514, -196207, -316685, -330351, -291562, -293933, -220550, -114254, -66611, -175098, -578086, -576300, -307086, -339906, -235353, -71263, 8463, -35025, -148410, -230011, -134440, -85773, -64995, -188156, -406862, -313660, -311305, -506663, -532447, -207835, 46891, 161462, -5862, 58295, 289739, 383781, 116629, 115524, 331882, 337999, 87352, 40508, 101169, -32286, -64222, -148513, -135242, 152679, 222241, -66197, -87795, -58374, 15429]
22644A5429K5481J35921K8502J13875J16154M19j36671q9332n6173j39966j38644
22633a25005p8842K5378J23695m5522O4352q3647j04204J54100J44397l0725N4054
22622I8031m9449p0244R9389J2330p674J67415J73455j01964k66603K5977j14633
22611c3970k57296J17219K40393p7204r36N3368J28031j19430j95852k7577P578
22600a65676j22215P7944J56371J71822N2868q0170j20955m3567q4670k19976
22590c78224J71068K538L4430J0989K00291N5512m3965o1889O9719l2962J13195
22579A40702j1082j99475j73122O2808P029M8819J034k7483j1658q644k07394
22568c78466J16959L17469K7707m0274J5068J3808P7042q492k20588K4830n758
$$ y = [15429, 40910, 176831, 205333, 319208, 435362, 435781, 299110, 209778, 153605, 13639, -125005, -203847, -178469, -54774, -100296, -35944, -119591, -223795, -69695, 74702, 43977, 98031, 48582, -21662, 77727, 90057, 82383, 249798, 423253, 321289, 54686, 80663, -33970, -291266, -174047, 66346, -10858, -11794, 41574, 169605, 50175, -145677, -173254, -165676, -287891, -209947, -53576, 118246, 171114, 90944, -30011, -73578, -158248, -378224, -207156, -204618, -170188, -159199, 41092, 96604, 52639, -9250, 60469, 27507, 140702, 129620, -69855, -242977, -180169, -173140, -124321, -123287, -150770, -162428, -171072, -378466, -261507, 55962, 83669, 43395, 58463, 72271, 149313, 140821, -79767, -54937, -60695]
22557f0695j02276R8949J72143n3252O5018J43946o0312q2796j2517M0208j1835
22546A36581l9298K29987j20821k75162l51863q5784N7192J55625J03998r0554
22536b80099m387P795J56863J25719j09220j11025J38365m9363o8338J8769N5227
22525a19694q0933K36769k9219R3880j03990j2745j38117j71035P0687L2643j39000
22514c60754O9246L53861R838j73398J97162J4043o0813q7343n2886P4760J62429
22503A46145r2771P609N2936m1745j742l7083j56668K48931J70430R0203r868
22492C76377k11054k27942j31146r2561J16867P6783M6710J10461N2051j48879
22482c2333j28648k40433M6920M32159p594j30920q492p1122P0917j0695m7994
$$ y = [-60695, -162971, -64022, 108121, 54869, 119887, 263833, 203521, 120725, 108208, 148416, 136581, 97283, 327270, 206449, -68713, -420576, -506360, -449168, -293543, -189545, -280099, -284486, -276691, -119828, 5891, -103329, -214354, -75989, -125352, -193690, -174921, -119694, -200627, 36142, 6923, 100803, -3187, -15932, -154049, -325084, -254397, -221754, -360754, -291508, 62353, 72191, -101207, 95955, 109998, 49185, -38158, -91044, -16284, 146145, 53374, 60983, 113919, 72174, 70432, 33349, -123319, 125612, 296042, 386245, 376377, 165323, -62619, -193765, -286326, -169459, -92676, -45966, 64495, 116546, -32333, -160981, -401414, -354494, 77665, 70071, -60849, -69341, -140463, -69546, -80241, -128235]
22471a28235P1918p1874j06646L7166J97389J12755K1174M5322j06289k11298
22461a38618j41902n1583M9788l668J09332J0214J33933R0057Q9552j10527j25609
22450h9031k0031J39658K00618k08947k52801M929J12595J58236L6791K0276M0467
22439A42760q4117j48354j50679l2742m9352J45946M8843J20296J54340J39973
22429B86914J97548O8612j53636l22282k00140J47574M6044j91543j14372n1493
22419b86774J22436L9411J48162K4374K2551J6387J94314o797j00932l39676k11159
22408c77703k6684k0607P6640R6697n7981J41325K33700K3365n6325N8318l7470
22397E3275j23010n244J024J70378q1619o74k2381l2413j87372j40660j94523
$$ y = [-128235, -56317, -128191, -234837, -197671, -282, 112473, 133647, 178969, 72680, -138618, -280520, -332103, -282315, -285983, -176651, -166437, -32504, 57553, 147105, 36578, -89031, -109062, 30596, 231214, 22267, -230534, -225605, -113010, 45226, 82017, 102293, 142760, 58643, -89711, -240390, -273132, -322484, -176538, -127695, -7399, 146941, 286914, 484462, 553074, 399438, 77156, -122984, 24590, 70634, -120909, -235281, -286774, -164338, -124927, 23235, 47609, 70160, 86547, 280861, 274064, 173132, -166544, -377703, -404387, -424994, -348354, -251657, -309638, -168313, 65387, 88752, 32427, 90745, 53275, -69735, -74979, -73955, 96423, 14804, 14130, -8251, -40664, -228036, -368696, -563219]
22386e63219Q7343k6308q639k7117j958J79520J00009L3371J57479O6461J91562
22375A88504J1632j34881L1542O7736j00867q0466j0320p248J68580K3985r5729
22364F2468j85735j36466j28714J5842L44188n5541r1391J28101L11984L6485
22354C01221n807o0310n1988k5331j4678p0250P2676J8502j777k00891J02004
22343F3371K9405n3121m460m3457j32506J0645O6866l5l3099L2010N4109R5912
22331H5640j86556j80314q900L11854L25482O0771j1521p7187j19621n4168R4326
22320B39806k7006P3565M1158l7816j02369n9607j30665k07734k0684o191j70121
22309d07664j0364J85359L38039k3350j36892m2384J43024j6017j01209p5059
$$ y = [-563219, -475876, -502184, -510823, -537940, -539898, -360378, -260369, -226998, -69519, -3058, 188504, 200136, 65255, 96797, 164533, 63666, -16800, -27120, -34368, 134212, 158197, 62468, -123267, -259733, -388447, -372605, -28417, -83958, -175349, -47248, 264736, 301221, 295414, 235104, 183116, 157785, 143107, 72857, 145533, 164035, 162258, -38633, 63371, 92776, 39655, 35195, -8262, -140768, -130123, -63257, -63292, -96391, -64381, -10272, 85640, -100916, -281230, -290130, 21724, 347206, 407977, 396456, 319269, 199648, 145480, 239806, 212800, 286365, 327523, 289707, 187338, 127731, -2934, -210668, -231352, -237543, -407664, -418028, -232669, 105370, 82020, -54872, -97256, 45768, 29751, -71458, -146517]
22299a46517l1268j31109p6145J80468J87073J18534L31881J70451j44910k28127
22289B30331j46396M2563k4918Q6617P8634k6592j10380j60202m0880N4457J48390
22278A31624p679m1200N272M2187q6578k37352M3049K20970J57826r2003j32169
22267C947p434Q5388J1726k64303r1017J20240r5785k9128k28153J88324K90014
22256a6181J65939m9430L799N4981l1226j33063m1607j41099j26938M4090J90369
22245h0366J32475k09207j30723K03572M4065k01932j61628M7839J34970K37617
22235A6682J75250J15031k38841k61714m2694k513N1927R5701K8327K14016r0479
22224F0693r4343R946m5843L0233l0260J2631j69561N1341K6587j84314O145J29843
$$ y = [-146517, -177785, -308894, -385039, -204571, -17498, 101036, 432917, 603368, 458458, 230331, 83935, 126498, 101580, 188197, 266831, 240239, 129859, -30343, -71223, -16766, 131624, 123945, 82745, 88017, 130204, 43626, -193726, -150677, 70293, 228119, 136116, 3947, -3487, 81901, 93627, -170676, -261693, -141453, -237238, -266366, -494519, -306195, -16181, 149758, 100328, 104127, 159108, 127882, -5181, -46788, -187887, -314825, -270735, -80366, 52109, -157098, -287821, -84249, -40184, -242116, -403744, -355905, -220935, 16682, 191932, 306963, 68122, -193592, -236286, -238799, -186872, -91171, -62844, 151172, 60693, -33650, -23704, -69547, -39314, -69574, -56943, -226504, -175163, -148576, -332890, -326745, -196902]
22212a96902j5930J09071M3910M0585j21598N8208J66132K3012q8885o8168O5113
22201A4548P7830J81793p2348j1712j7134k14415j88552p3768J76209O0317J949
22190f5283m7190J80554K9006J8495L5255l4874n200N0739R7139j24632R311n3752
22178H9568J13855R4461j46878n7448j6300P0695p6159j5726l5292N394Q3369
22167A09539j30090j50074l1144N447L3216J49936k7942J31063R9116q5229R132
22156A12970j37981j46295J6640J51383J0941N3331m6702j66889o2779K7666J25389
22145f2326J4063K57796j908j30649K02091K7444j13479M3923l88j3047j85060
22134C8460r254k877J47842L8248j96410j47257J13285K24238j7392j12563L0287
$$ y = [-196902, -212832, -103761, -59851, -19266, -140864, -82656, 83476, 106488, 17603, -50565, 14548, 92378, 274171, 201823, 190111, 172977, -41438, -229990, -303758, -127549, -67232, -65283, -112473, 68081, 97087, 115582, 150837, 115963, 110763, 161502, 258641, 134009, 143320, 89568, 203423, 297884, 151006, 93558, 77258, 147953, 71794, 56068, 20776, 26170, 109539, -20551, -170625, -201769, -196322, -163106, -13170, -41112, 89951, 189067, 103838, 112970, -25011, -171306, -154666, -3283, 7658, 60989, 14287, -152602, -215381, -187715, -62326, -48263, 209533, 207625, 76976, 279067, 306511, 193032, 236955, 236567, 223520, 38460, 29206, 26329, 174171, 212419, 16009, -131248, -17963, 206275, 188883, 76320, 106607]
22123A06607n1996r2407J67016o0977K8678k86614o7587J38711k5603M4962K921
22112i6289o9461J39012J21392J16866q6316j23305N7768J87081j83570k65810
22102b02632K78981L48984J18810j39682k02206j30219r8285L8538j24581l9453
22092a51745P9466R4965l7701j0193k33858m7181K64658L88897J14184R9690j87664
22081C73518j70566k67186k16995J15340L51569k9146j69436k13051l7256K71150
22071G941O3838j03137R1057J00510j49112n4009k5909m1971l1161Q2403P3558
22060A4008J36341j9825k25995j25818j23908L2269J27469P2920p5978Q703N4844
22049a24970N0231M3724J21007J60040Q2311k2180o8657K47732j2239j67488j1237
$$ y = [106607, 54611, -37796, 129220, 68243, 96921, -189693, -257280, -118569, -144172, -99210, -96289, -165750, -26738, 94654, 211520, 125204, 1899, 59667, 246748, 63178, -202632, 76349, 425333, 544143, 404461, 202255, 72036, -26249, 12289, -112292, -151745, -72279, 22686, -15015, -25208, -259066, -306247, -41589, 347308, 461492, 561182, 373518, 202952, -64234, -281229, -165889, 185680, 156534, -12902, -225953, -263209, 7941, 71779, -31358, 59699, 160209, 11097, -42912, -68821, -110792, -141953, -59550, 14008, 150349, 130524, -95471, -221289, -345197, -312928, -185459, -112539, -188517, -179814, -124970, -74739, -31015, 89992, 250032, 332343, 310163, 241506, 489238, 476999, 309511, 298274]
22038B98274l0428r4330J679j25945K17878J22740r1373j02859l0591j84525r4786
22027a14266j28698p9122j61643R727Q9676R3749j02296J02695Q0648l40J21660
22016h8210R4614m0521j43409M7600M3959r4470o7051J32511N6882n2364M1363
22005f9096Q6177P6235O0400j27616m4469J9853R4382j30091m0719O5186p2282
21994h2040j34814N747O4957m8305k8775q3644R1624K04694J66102n8822k9265
21983F7459j63656J06979m3489q1685n8822j48565J06944J65554K066N9990k422
21972A0353J01344P4814n7939j06559L3225L308M3263L1787J44029M377k2505
21961B59497k26406j60856K1450M5054J74747k0638j81050j17808J83066K22827
$$ y = [298274, 267846, 173516, 175195, 49250, 267128, 389868, 298495, 195636, 165045, -19480, -114266, -242964, -322086, -483729, -474002, -384326, -290577, -392873, -290178, -209530, -209870, -88210, 6404, -34117, -177526, -129926, -85967, -180437, -247488, -114977, -58095, -110459, -69096, 17081, 93316, 153716, 26100, -18369, 1484, 95866, -34225, -74944, -9758, -82040, -216854, -211107, -146150, -194455, -223230, -306874, -215250, -10556, 155546, 96724, 67459, -96197, 10782, -32707, -114392, -173214, -321779, -214835, -49281, -47215, 12775, 10353, 111697, 186511, 128572, 22013, 55238, 58546, 101809, 133596, 277625, 282002, 259497, 33091, -127765, -106315, -61261, 113486, 92848, -88202, -206010, -22944, 199883]
21951A99883j97522j03981L14294j20457J0850j67717p1474J02708J14439n1503
21941B9520k14497j47137r98K37693J99990L4104j5796K0581j0449j54939L9306
21930A7378r1176K3455j28447j86674J44791K96657J21186k0296j24778L1164
21920H3260j1722J8024K63311J1776L9325j24696j44905J8183k35712j35444M2410
21909a76190J78833k5473L7590K4377n450n3246j60163j37232J0917J09220O6445
21898a30372j82604O4603K50814n9101j9279R5000N0961O2569n7202j15238j39596
21887a79445j29781l6588K01368J39305k15796K9893K18507j38697J73376J13341
21877A75483j22987J24120N5420m7333k23724j32291M4806j00305j77817o9513
$$ y = [199883, 2361, -101620, 212674, 92217, 103067, -64650, -136124, -33416, 81023, 29520, -184977, -332114, -333112, -95419, 104571, 138675, 122879, 143460, 133011, -21928, 17378, -73798, -50343, -178790, -365464, -220673, 75984, 197170, 176874, 52096, 83260, 71538, 89562, 352873, 364649, 403974, 279278, 134373, 152556, -83156, -218600, -176190, 2643, -22830, 14760, 39137, 33687, -19559, -179722, -316954, -306037, -196817, -130372, -312976, -248373, 2441, -56660, -75939, 19061, 70022, 132591, 75389, -39849, -179445, -309226, -345814, -144446, -5141, -220937, -191044, 27463, -111234, 62142, 175483, 52496, 176616, 232036, 184703, -39021, -171312, -126506, -226811, -404628, -474141]
21867d74141J25675K13728L2233j13342R6212K12308O0586m8742j86457N6892
21857b5048n3427M2040L3662q9774Q9986N2599j05469j18652K36216K68795j76870
21846A54058j1256l7942n6204J91405K79188j47400M78j36345k27284j68314r3401
21835b53017O6979j502J81640m1893k68856j14561R7586J24143O1333R979P2676
21824f5493K61033J32829p675j15982k32239j89169r0623N7607K74318R1757j87760
21813g1397j08419M7581J87969J07736L3947J16756J19303N1995k27559j52290
21803A05622j27602o7172p0517Q5332M5882r6252J18603L34528j90895L7679j84519
21792i311o7369j661j14315j94583J03343K80927J73448P9424o9789j59074j66208
$$ y = [-474141, -348466, -134738, -102505, -215847, -119635, 92673, 153259, 104517, -81940, -25048, -78475, -36435, -2773, -92547, -2561, 50038, -55431, -174083, 62133, 330928, 154058, 142802, 104860, 48656, 240061, 519249, 371849, 372327, 235982, 8698, -159616, -253017, -186038, -187540, -5900, -47793, -316649, -431210, -333624, -209481, -148148, -138169, -65493, 195540, 328369, 320694, 204712, -27527, -216696, -307319, -249712, 24606, 116363, -71397, -179816, -132235, 55734, 163470, 197417, 314173, 433476, 485471, 257912, 105622, -21980, -89152, -159669, -74337, -28455, -124707, -6104, 328424, 137529, 175208, -9311, -76680, -78341, -192656, -387239, -283896, -2969, 170479, 249903, 180114, 21040, -145168]
21781a45168N0804K48884k966p7777M884J92o0827J35383K74855j14906r8853
21770B14505j26642p221K34103K4694N7767K5301j31744l32058k09889K05239
21760d5945L2849m8276N2193k953j15720m2772J49962j20333j56844p342p7678
21749c82859O3344J71745J84845J05436R2543j06041j95272P59n6204l5635j7241
21738a74580K74329P0201K28651j34020k37938j0694P6841o9504M940J33972j70719
21727h521k34240Po4248p3226J66O5907K00681L19627j1008k44189L4484K3607
21715I047j92580j30155J445P9501l9910N1169J49039J18686K60937q9965j77123
21704D0091K5633j4846q7224j33827j6765n4257o3240m234J01508J09795J4056
$$ y = [-145168, -94364, 154520, 151554, 73777, 78661, 78853, 18026, 153409, 428264, 313358, 214505, 87863, 80642, 314745, 339439, 397206, 422507, 290763, -41295, -251184, -45945, -13096, -61372, -9179, -12132, -127852, -170624, -20662, -140995, -297839, -305181, -382859, -319515, -147770, 37075, 142511, 235054, 129013, -66259, -65500, -121704, -157339, -174580, 99749, 169950, 398601, 264581, 26643, 15949, 92790, 23286, 28226, 162198, -8521, -242761, -242754, -307002, -380228, -380062, -314155, -113474, 206153, 195145, -49044, -14560, 9047, -183533, -313688, -312243, -232742, -272652, -221483, -72444, 46242, 307179, 217214, 40091, 65724, 50878, -36346, -170173, -186938, -241195, -304435, -308669, -207161, -97366, -83310]
21693h3310k01276L9855M8041n4144m9337L9531J34725R1928q3639L0802O3186
21682b3638J25029O8677p2854j20981j27275j92786K7963M9372N7544J37112J8566
21671e3271j14728K31458J46014N0560j86546j44983o1126J87952R3122k06031
21661e7579J06438P1667l7927m8603J2706m7173M1484L4547o4307k8513l1049
21650d8309o8513r7466J10900o7775k7630K20706K71710j5652k51623j53529m0721
21639a67902L70569K47012l62160k01525q7800J57178J21280J22086Q4433R4058
21629C77229l2503n8442n8448k6159n7027j14855j90332K07499p120p1992k10697
21618b42847k02757J46139K87916P0286n1290l4922K35046k3956j45993l76277
$$ y = [-83310, -284586, -244731, -196690, -250834, -300171, -260640, -125915, -33987, -117626, -86824, -23638, 101391, 170068, 97214, -23767, -151042, -343828, -315865, -266493, -208949, -71837, -53271, -167999, 63459, 209473, 260033, 73487, -71496, -132622, 55330, 148452, -57579, 48859, 120526, 82599, 33996, 46702, -471, 41013, 75560, 11253, -17260, -48309, -116822, -214288, -103388, -171163, -198793, 21913, 293623, 277971, 26348, -127181, -167902, 202667, 449679, 87519, -114006, -201806, -44628, 76652, 198738, 283171, 377229, 344726, 286284, 227836, 201677, 144650, 29795, -160537, 46962, 39842, -32150, -242847, -445604, -299465, -11549, 58737, 7447, -27475, 207571, 183615, 37622, -338655]
21608c38655j43286L34469J79703N2205J81281q0121j09846j42940k7512M6375
21598d8327k3169J05418j1674J80791R9409j53353r7110J11738k9004o0425n4602
21587A9692j13373L7283J77039l4029k16431o9749K22381R0940q8881k4557J87395
21576A87710p4243j48699N2248o2733k26558K9743R6808J07983j20603q4880P4885
21565a68339J02128j43002n991K06989M5903K59391M1114j75562j5454l6823k0506
21554H9848P9182k0790j52288n1615k5271J30160J61123j54595k54529J07331
21544i1444r4140k8029P6498r241J579K27319p8281l01279J51405N3852K2987
21533f8774J03722m2942k8768k6975J31635k483J09022K9219j21630j67349j3290
$$ y = [-338655, -481941, -147472, 32231, 84436, 265717, 185596, 75750, -67190, -94702, -48327, -71496, 33922, 22248, 203039, 302448, 149095, 51985, 163723, 134719, 74294, 19692, -93681, -56398, 120641, 86612, -129819, -199568, 22813, 113753, 24872, 315, 187710, 113467, -35232, 17016, -45717, -272275, -242532, -145724, -37741, -158344, -243224, -168339, -66211, -209213, -215204, -8215, 37688, 297079, 338193, 162631, 147177, 110354, 89848, 169030, 148240, -4048, -55663, -80934, 49226, 210349, 55754, -198775, -91444, -185584, -213613, -137115, -146356, -144777, 82542, 4261, -297018, -145613, -91761, -68774, 34948, -7994, -36762, -63737, 67898, 65415, 174437, 203656, 82026, -85323, -98613]
21522i8613J08166R8737p2520k46725K6321K8495n7468Q8801K0059J07023J71694
21511A73970j21794j63351r4948j26975M8686J8061K14780M4144j3732m0869j7969
21500g9997n3098n7250m104P8962j57113j8304K15723K20384J85690j69567M457
21489A65783n6949n0286j34467n6636N8499j24214j25303l9311J80388L61533
21479A79037R892j18451m561k77176j04809M7509p785K36982o0459m2745K952
21468a39614q5368m4109J29385K03473j04883k87049q8969K32935J71712k29027
21458b41514l20557J66415J99124O1220J2339J46269P1688k21686o3947q996P4400
21447a25245J97028R4311K547j94561k58846j33343K9265N2720j76601j9509R1724
$$ y = [-98613, 9553, 108290, 35770, -210955, -184634, -156139, -213607, -124806, -104747, 2276, 173970, 52176, -111175, -206123, -333098, -284412, -266351, -51571, -7427, -21159, -62028, -79997, -133095, -190345, -194449, -115487, -272600, -290904, -75181, 145203, 330893, 161326, 165783, 108834, 58548, -75919, -132555, -74056, -198270, -323573, -362884, -182496, 179037, 188929, 70478, 65917, -211259, -316068, -268559, -276344, -39362, -99821, -142566, -139614, -224982, -269091, -139706, 63767, -41116, -328165, -417134, -184199, -12487, -241514, -562071, -395656, -196532, -135312, -122973, 23296, 94984, -126702, -190649, -199645, -125245, 71783, 166094, 168641, -25920, -284766, -418109, -388844, -336124, -512725, -532234, -440510]
21436d40510K21072J98989j12812k33858j60242J40456L77244K35522M3111j58723
21426A10249j77211K00516N651j14535j48182k66943j10299J56108J96695j43264
21416b91215L9409J00168R2998j10949r1634m89N9202P1298J5593O5667k48642
21405b98594J7759J26498J62625m8294l6074j18781r652P9420J66238J82419j33714
21394H9850k814L3432k07476k08127J00135p7127j0411m0249j50529j8758j24469
21383f16543K64760J38384j54474K15849J31682j47267j31797R309J18022N7801
21373a14274Q4631J53930j37853J3293N9219n3557O0825Q8041K2125j07483k71754
21362b02857q49K31179J23911k7256L48865j34506k12295k8590k09400p7562K04580
$$ y = [-440510, -219438, -20449, -133261, -367119, -527361, -386905, -9661, 225861, 268972, 110249, -66962, 133554, 139205, 24670, -123512, -390455, -500754, -344646, -147951, -291215, -251806, -151638, -58640, -169589, -261223, -261712, -202510, -131212, -115619, -49952, -298594, -280835, -154337, 8288, -40006, -76080, -194861, -204513, -125093, 41145, 223564, 89850, 87036, 120468, -87008, -295135, -195000, -272127, -282538, -322787, -473316, -492074, -616543, -351783, -213399, -367873, -152024, -20342, -167609, -299406, -290097, -172075, -114274, -29643, 124287, -13566, -273, 58946, 5389, 66214, 154255, 176380, 68897, -202857, -203706, 27473, 151384, 124128, 472993, 338487, 126192, 97602, -111798, -189360, 15220]
21351A5220n7753K8551j01219NJ82047J61022l1933o6517M8967q1767r8897J9095
21339A6821M4348o4236l0497o6528J3031J15337J15611m865k04084L5730k0395
21328d9727K05028J80675j15520j83161r4155l9251j47934j589r3290j59109r6561
21317e94594R155J61737K19237J59824J66225j19294j68175Q6063j06781j22727
21307c09330K7234K2263m9254N1114N7061Q0724N859q8935j34958l0990J60985
21296b08227J65465j45133J33120Q9154O0852J41242m5484j24697k78886r8338
21286c10932J46003n0722j14289K54635K22137M6797N5003j58034m8358K5745
21276F7985k03022k55197l2383m153J73153J3169j0663m2750k09325O4708J48030
$$ y = [15220, -42533, -13982, -115201, -115196, 66851, 227873, 195940, 129423, 178390, 96623, -2274, 16821, 61169, -3067, -33564, -100092, -87061, 28276, 143887, 139022, -65062, -29332, -49727, 155301, 335976, 220456, 37295, -56860, -96111, -244045, -245634, -338924, -498033, -594594, -585439, -423702, -204465, -44641, 121584, 2290, -165885, -79822, -186603, -309330, -282096, -259833, -309087, -257973, -200912, -120188, -114329, -203264, -338222, -369212, -208227, -42762, -187895, -54775, 34379, 95231, 236473, 190989, 66292, -212594, -310932, -164929, -215651, -329940, -75305, 146832, 193629, 248632, 90598, 42240, 67985, -135037, -390234, -422617, -426770, -253617, -240448, -251111, -293861, -503186, -438478, -290448]
21265b90448K97813j2071j23277M062J43074K7127k80716k07411q62P3137J85323
21254a84249M6932J4641P633l87246J66061K45536j22948m1574J64725N6410q371
21243d2450J0956k9915j15665m5405O3898o0248p678N4949P0177J09663J8485
21232B6767j59602n5710J04173J3394J69756j3487j24846L2910P1028j58676q7597
21221a81890J60412R7972j18231j69008J0641J10044J07735k8800j54969J18642
21211d7452j29801p3807P9295K7764J15989J27268J87093J46734j55256k02440
21201G5387j25848K13997J86460j7406l4361m1250J68180J56259k28591j59320
21191A93507K4241J27390L5387J1970n4927M2969n984k80630k74789j1281J1956
$$ y = [-290448, 7365, -4706, -127983, -123921, 19153, 46280, -234436, -441847, -442709, -369572, -184249, -137317, -122676, -115043, -502289, -336228, -90692, -213640, -255214, -90489, -34079, -42450, -31494, -61409, -177074, -222479, -158581, -218829, -226507, -171558, -101381, 8282, 26767, -132835, -188545, -84372, -70978, 98778, 85291, -39555, -6645, 64383, -94293, -181890, -21478, 76494, -41737, -210745, -200104, -90060, 17675, -11125, -166094, -47452, -177253, -251060, -171765, -144001, -28012, 99256, 286349, 433083, 277827, 75387, -50461, 163536, 349996, 332590, 298229, 256979, 425159, 581418, 352827, 193507, 217748, 345138, 380525, 392495, 337568, 380537, 374553, 93923, -180866, -192147, -180191]
21180a80191L1339P1696J19961M0229n5958n4742j25349m5879J21191J91713j85365
21169g1355j14521J3978L8981M1423K63972K04537q5384j39601Q9679J06054j56501
21158A91262Q7142K7028p0397o5075j85091j38538q9872O604k2668J18725j3092
21147a53972J44316J4897l7397L9640Q3580Q5248R557m9757j97534J3733P6204
21136B8515j5725o1548q8049l2010O6014n954J29367L2321j15724k03804J49963
21125a16634l7851q2029K31265J36247K215m5367Q4962L3581N0154j65995p0905
21114A9643P2529K57285K13995N5953j16728j10882p3674k63553J44439k8607
21104A70400l15849r8227J45481Q925J32173K3134o9807J25003J00084j57229
$$ y = [-180191, -148852, -77156, 42805, 83034, 27076, -27666, -153015, -198894, -77703, 114010, -71355, -185876, -171898, -132917, -91494, 172478, 377015, 291631, 152030, 241709, 347763, 191262, 278404, 305432, 235035, 169960, -15131, -153669, -243541, -236937, -259605, -140880, -153972, -9656, 5241, -32156, 7484, 91064, 176312, 185869, 136112, -61422, -47689, 28515, 12790, -48758, -136807, -168817, -102803, -108757, 20610, 52931, -62793, -266597, -116634, -154485, -236514, -5249, 130998, 133213, 87846, 172808, 206389, 256543, 90548, 19643, 92172, 349457, 563452, 619405, 502677, 391795, 318121, 54568, 199007, 170400, -145449, -243676, -98195, -89270, 42903, 66037, -3770, 121233, 221317, 64088]
21094F4088j60160k6619N042o5329M0921J05798J01901K21935j01198K9446r8832
21083A16993j37255L5528K83257P835l01246R3357J14300k24663m5173l5549J6123
21072g6493P7513j33452m3625Q6237M1628o0943O4685J76420K73875o5205r9808
21061B40832k18752L6720q882J07592N3809J09550M8627j45876j98223n9384j02462
21050a36449l0052q4416J14765P1933J33660j1386J09669K2793K1137m524M0513
21039B47643P6976l0851K8274k4565j62761k20739j35971J39199J36593k90507
21029b36709j09745Q2984Q4096N3852r1883R4599j74514J26859J60826K23806
21019B14171K6585k1332R9695j36175k05398K519n5879q566j07587J35487J74508
$$ y = [64088, -96072, -122691, -117649, -182978, -142057, -36259, 65642, 287577, 186379, 215825, 116993, -20262, 15266, 298523, 306358, 5112, 98469, 212769, -11894, -57067, -92616, -76493, 1020, -132432, -176057, -89820, -48192, -109135, -44450, 131970, 405845, 340640, 240832, 22080, 58800, 49918, 157510, 211319, 320869, 369496, 223620, 25397, -33987, -136449, -166501, -250917, -136152, -64219, 69441, 58055, 167724, 190517, 211654, 207130, 247643, 324619, 293768, 322042, 297477, 134716, -86023, -221994, -82795, 53798, -236709, -346454, -263470, -179374, -125522, -217405, -122806, -297320, -170461, -9635, 214171, 240756, 219424, 319119, 182944, -22454, -19935, -75814, -84380, -191967, -56480, 118028]
21008A18028J10743o1732J15102k2806l67281j15379Q261K3935R3896K79905K03318
20997C85990N3351j05494l16804p5398j06305k4003K43655P2546K2546j44298
20987E786j05898k68106K1324K00094j04567J35180J49024j24067j02944r8557
20977b92731P6250J19494N495j05305Q5335J52515k12051k08938N6165P4056k99001
20966e48716j14776P6198J1117l6616J76364K85665J06799N5040J02128J39911
20956B53114R2608l5994j72658k63848j00314K86120J08325n7458m640j97575
20946i2320r6861n843m6872Q7821L12717P3375k30122J41317N2914j30188r6752
20935c0814j15949j419J10879j83738m9616J08438o972J68278j8759L5657J20842
$$ y = [118028, 228771, 167039, 282141, 259335, -107946, -223325, -215064, -191129, -97233, 182672, 385990, 439341, 333847, 17043, -58355, -164660, -188663, 54992, 127538, 150084, 5786, -100112, -368218, -346894, -146800, -251367, -116187, 32837, -91230, -194174, -292731, -216481, -96987, -91492, -196797, -111462, 41053, -170998, -379936, -323771, -249715, -548716, -663492, -587294, -576177, -612793, -436429, -150764, -43965, 11075, 113203, 253114, 345722, 309728, 137070, -126778, -227092, 59028, 167353, 109895, 105255, -92320, -189181, -195024, -241896, -154075, 158642, 232017, 1895, 143212, 196126, 65938, -30814, -146763, -148182, -37303, -221041, -270657, -162219, -169191, -913, -19672, 15985, 136827]
20924A36827L8201K23853j25457n7247k7126N4405k55056n51J49968j01823M7142
20913H3136P9372j06569q1676k8832K2809J70557j61808o7962J50861K8181j98729
20902a10660M2841Q156J01781k9134r3725j81989j6110K6400J88552J7710r3647
20891a39825J1713j62848l3451J9811J78416N8779L2412m0966L04P7550j76296
20880a74401r1604P4171l9306J09309J6001J21720O7873J16324J09863j28475
20870A81475K4572Q1071K8613j41360j23315R9615Q31j53780J09982L2275k33623
20859i3644j06719j936P3522j27262N8553J93959J22603o6694k51661m2225K25909
20848a5595L38913o3725j47461l4495Q797O72j39265J03272M6128k29306O230
$$ y = [136827, 175028, 398881, 273424, 216177, 189051, 243456, -11600, -12151, 137817, 35994, 83136, 162508, 55939, -25737, -54569, -31760, 138797, -23011, -90973, 59888, 88069, -110660, -67819, -59663, 42118, 12984, -80741, -262730, -278840, -252440, -63888, -46178, -139825, -128112, -290960, -324411, -304600, -126184, -67405, -34993, -75959, -75655, 1895, -174401, -266005, -191834, -231140, -121831, -105830, 15890, 83763, 200087, 309950, 181475, 206047, 287118, 315731, 174371, 51056, 150671, 151502, -2278, 107704, 139979, -93644, -200363, -202299, -128777, -256039, -197486, -3527, 119076, 52382, -199279, -241504, -15595, 323318, 259593, 112132, 77637, 86434, 87106, -52159, 51113, 97241, -132065, -125835]
20837a25835l53089K0J82549J17533J31511R1849j4313J38054J99784n9194j30851
20826A78018j48033l3338O7931Q7964J9200k45418j85884M0182Q9339R9224m8056
20815g8871o114K01273K50873N0152R7183K7089k16985j93323p2610m6049J59552
20804A72170J70241n5650q2540K2071l1648J41804M3076r688j13764R4218M5101
20793C95391j79601m9928l5834n0466n6819j14321R5298k5235k04582N996J80346
20782c9755K6583l6136m6180l3509M1923J11549o1449K9615K5527k23422k9845
20771b35099n3103J03519K36607K2073P9690q3613r0022p2759J22033M390n0739
20760a7023K8677M8624K28977J58123K4164j52696K835k7559k44626j52554j20535
$$ y = [-125835, -478924, -478904, -296355, -178822, -47311, 44538, 30225, 168279, 368063, 308869, 178018, 29985, -3353, 64578, 152542, 171742, -73676, -259560, -219378, -130039, -30815, -78871, -84985, 116288, 367161, 417313, 514496, 541585, 324600, 131277, 58667, 12618, 172170, 342411, 286761, 204221, 226292, 194644, 336448, 379524, 369836, 256072, 350290, 395391, 215790, 165862, 130028, 79562, 22743, -91578, 3720, -21515, -226097, -220101, -39755, -13172, -49308, -95488, -128997, -87074, 24475, -36974, -7359, 18168, -205254, -235099, -288202, -184683, 51924, 73997, 153687, 70074, -19948, -92707, 29326, 33716, -17023, 11654, 60278, 289255, 447378, 471542, 318846, 321681, 294122, 49496, -103058, -223593]
20749b23593m5838L2751Q3654J87944J18018j73393o2631l63J15220r4996N120
20738e8107J29697k2425j45416R2765J8571k6834j31047o638l4080J07043K34342
20727A57871j54075j17094J36089J06062n5213j40363L921n2455O9074K05718
20717A59535n2176j19073M6444j12182N0135N3228J98772k5151p8245n861k18241
20706a02815N0823J16104m4917N5611J9281k54301k179j3086K11327Q9146n3259
20695G1735J44055j08733M1785m1178N4693J50402K4361Q1509m5728o0915k75518
20684C6468j39913o1730J37984J81669J55494Q2264j81699r5895K7534j96089
20674e3913k07420m9420J1443Q0391L8764K61421J26445M0621r2860p6785P8946
$$ y = [-223593, -269431, -236680, -153026, 34918, 152936, -20457, -83088, -83451, 31769, -63227, -58107, 71590, 49165, -96251, -3486, 15085, -11749, -142796, -149434, -183514, -76471, 157871, 3796, -113298, 22791, 128853, 73640, -66723, -62802, -115257, -46183, 159535, 107359, -11714, 34730, -77452, -27317, 25911, 224683, 199532, 121287, 115426, -102815, -51992, 64112, 19195, 74806, 94087, -160214, -162393, -175479, 35848, 124994, 71735, 215790, 107057, 148842, 107664, 162357, 312759, 337120, 418629, 372901, 311986, 36468, -103445, -165175, -27191, 154478, 309972, 392236, 210537, 114642, 142176, -53913, -261333, -310753, -299310, -218919, -180155, 81266, 207711, 248332, 155472, 78687, 157633]
20663A57633k7371l3020k01636Q7885J4055M2101q5670l04545q2013R9187O3369
20652b70025M5704J06220J91755Q835r1374L2041j6144m4509j87264K5060P8040
20641a21661J84670J61663j21271r7389J51199K7490n0312p1509j58236R543k03432
20630b89245p4642j55500Q1097K78067K93718R916j6976J50360r70r8640o6719
20619A10466j66828L0223K17527N2139o7367K7368j71578j4012J25102n483K32693
20608C70250J50831k25701k58022k59964M7728J26339K88305k11669r2802Q3722
20598A9017m3651l4324J14003j36107j74850O2558Q7285r5824J3576k2457j9310
20587b30084q6271L026L8449J9675P4175J61659R2990P8394J4886O6293J9538
$$ y = [157633, 130262, 97242, -104394, -16509, -2454, 39647, -46023, -350568, -432581, -333394, -270025, -224321, -118101, 73654, 82489, -8885, 23156, 7012, -37497, -224761, -199701, -121661, 63009, 224672, 103401, 6012, 157211, 184701, 134389, 62880, -95356, -85813, -289245, -363887, -519387, -438290, -160223, 133495, 143411, 126435, 276795, 275825, 177185, 110466, -56362, -26139, 191388, 243527, 176160, 203528, 31950, 17938, 143040, 137557, 370250, 521081, 295380, 37358, -222606, -174878, -48539, 239766, 28097, -64705, 19017, -24634, -58958, 55045, -81062, -255912, -193354, -106069, -201893, -188317, -210774, -230084, -316355, -313329, -274880, -255205, -181030, -19371, 73619, 152013, 166899, 233192, 252730]
20576B52730j98376o577R7522o5154j21473J22660M7320o8827J0366j9332J46307
20565A97166J52261j40066K6355j55969j67646Q769P8663L4547m1034r8152j09062
20554b14168M0485J38687o4565O0507L1703k7554o1765n3694K67761Q853k17371
20543i1121j84902K6312P8777j044J21966K5668k0956J14775j8120m7938J25238
20532A28655O3835o6037p3884j520j69940k0089J18068K9448K05019J09497k53055
20521F9997k16931j23852L1947K2139j21111J3686K71917Q9634p0734o5837P783
20510i1362m7685J01018m4292j59848L5451J36265L0033N5881J25557J05096P2082
20499C18196o1654k124j38507J8546l1093j90825k23425J18900K36771P0107j52520
$$ y = [252730, 54354, 47777, 145299, 80145, -41328, 81332, 128652, 59825, 70191, 50859, 197166, 349427, 209361, 235716, 79747, -87899, -79130, -467, 34080, -6954, -105106, -214168, -173683, -34996, -99561, -39054, -7351, -34905, -96670, -150364, 117397, 126250, -91121, -276023, -249711, -170934, -171978, -50012, -24344, -45300, 69475, 51355, 3417, 128655, 192490, 126453, 52569, 51049, -118891, -138980, -20912, 8536, 213555, 323052, 69997, -146934, -270786, -238839, -216700, -337811, -324125, -52208, 37426, -33308, -99145, -91362, -139047, -38029, -82321, -242169, -206718, -70453, -40420, 15461, 141018, 246114, 318196, 256542, 254418, 115911, 134457, 103364, -87461, -310886, -191986, 44785, 114892, -37628]
20488c7628r9098P6132n0349J66538P1916j09457j3848p0608L9023J54082J0586
20477A37289p1984p9120j42641J6177n8319J65414P6159P0751l3616J90141n3121
20466B17130n9313j60541j60122k6871r1983J9026K59736J17001j27345J5733
20456B451r0953m5508p9868j7821K4357j04198j57604k2165O7358R7908K97618
20445b8425J9117j56909L0723Q8582m6255o4805J3653P6252q2302J03749J24003
20434G7383q0540M9206R1596P211k1925j73788O8254O7366n8677J08474K1673
20423A56233j52052j53557p8843J08415N5374M4829l4299L3803J45536J62895
20413B88334j10108k7369j6350p2330k00007l0609j5732j26180k0212K219J07773
$$ y = [-37628, -136726, -60594, -110943, 55595, 127511, 18054, 4206, -66402, -27379, 126703, 137289, 65305, -13815, -156456, -140279, -198598, -33184, 42975, 113726, 80110, 270251, 217130, 157817, -2724, -162846, -189717, -281700, -262674, -2938, 114063, -13282, 2451, -88502, -134010, -213878, -231699, -207342, -311540, -469144, -491309, -423951, -326043, -28425, -9308, -166217, -135494, -46912, -93167, -157972, -144319, -68067, -150369, -46620, 77383, -3157, 46049, 137645, 144856, 122931, -50857, 17397, 84763, 26086, 134560, 156233, 4181, -149376, -228219, -119804, -64430, -19601, -53900, -20097, 125439, 288334, 178226, 150857, 134507, 62177, -137830, -168439, -184171, -310351, -330563, -328344, -220571]
20402b20571J21172J75356Q6010P5514J4933K9868n0229j64316l4703r9554j28873
20391a95393k02832L2907N5863o3791J52047Q1011R4160J41452J49179k6552j73382
20380D4669q6593M8891K0099k08928J38149J73498o6908k28626J00J88213k668
20369A9896k91743j70747J71398P2381J03588K3988n5329J01543J8308n947n8610
20358g1274k8930J610O8279Q876j07767R174j36608J60512J81839n0916k00022
20347a65227L0216J3626n4752N0883N6010l6621j41413j03666J95502M9683r7050
20336b02809l0531q9416Q3641j00410m9119p9597m7074m2134J20488K32171P5494
20325a29296O3766Q0042R6030l2842N1119Q91Q1360P3477k9914k2996m0809J16223
$$ y = [-220571, -99399, 75957, 161967, 237481, 252414, 282282, 232053, 67737, 33034, -66520, -195393, -398225, -365318, -309455, -373246, -221199, -140188, -46028, 95424, 244603, 218051, 44669, -41924, 6967, 27066, -181862, -43713, 129785, 62877, -165749, -165649, 22564, 19896, -271847, -442594, -271196, -198815, -95227, -71239, -126568, -25025, -6717, -12664, -71274, -100204, -98594, -30315, -21439, -129206, -120032, -256640, -96128, 85711, 34795, -165227, -135011, -121385, -176137, -125254, -69244, -105865, -247278, -350944, -155442, -105759, -202809, -233340, -322756, -239115, -339525, -388644, -468241, -515315, -557449, -436961, -204790, -129296, -65530, 14512, 110542, 77700, 128819, 129710, 211070, 284547, 254633, 231637, 190828, 307051]
20313C07051l34057j35540m1416j20917J02348m7846k4831J08940J52491j76248
20303b10025k3357m6507r4047R6357P0403K0136P5541J45469K5396j55021J22374
20292B6719O5849j33592P7258R0448j65006k03709K65651J18823K5892j41570
20282B6763M263J904K2307Q42J34516J17764j80327Q0498m2626k72407j23849
20271b30352Q2956J34271l7329N468J75334J81716j36477j22868k44q4434j90385
20260b22344Q7778J75119k0121k3644j5231J93185M8266n935k97448r0315K9341
20249a41349J87285j45128J2694Q409j53265J45798K16985R4780k26315j51177
20239a51283R0429l6567r3000J59863K67793k33157j88936R7534J80408n3374
$$ y = [307051, -27006, -162546, -203962, -324879, -222531, -270377, -295208, -186268, -33777, -210025, -233382, -279889, -373936, -277579, -207176, -187040, -111499, 33970, 59366, -95655, 26719, 92568, -41024, 36234, 126682, -38324, -242033, 23618, 142441, 168333, 26763, 31026, 32930, 55237, 56079, 190595, 308359, 128032, 208530, 165904, -106503, -230352, -147396, -13125, -50454, -44986, 130348, 312064, 175587, 52719, 52475, -31959, -222344, -134566, 40553, 20432, -3212, -18443, 174742, 223008, 217073, -80375, -170690, -141349, 45936, -99192, -86498, -78089, -231354, -85556, 131429, 226209, -106, -151283, -60854, -97421, -190421, -30558, 237235, 4078, -184858, -87324, 93084, 39710]
20229C9710l202j82326m1044J22558p345o0469k54041n9847L5668J39805j29928
20218d00461R981M7497R5519K67344O1157j86728j17684O3362Q1229J21109k4473
20207A7852k1890j13768q7990J02633K12538J17651K9695m0714o3691k18894j54477
20196b21055J5826K50578K9023j63155J41737L8143p2789J5690j4213q1020R2572
20185C1337O5282n1891p9822J48942J54109P5044j78202p9470J8469j16454j77514
20174a90170j08897P5581J39616n9464p9803o0965P0738J9770J14149N9784l636
20163b3297J4827M1202O3711r10J53471n2169j36315m7019M8373R2443p433M9889
20151A96773p4280k91617K0236J87947r9173R2491o5710o2907q9491J99020O5333
$$ y = [39710, 36508, -145818, -186862, -64304, -71649, -132118, -386159, -446006, -410338, -270533, -400461, -390480, -342983, -247464, 19880, 81037, -105691, -223375, -160013, -78784, 42325, 17852, -4038, -117806, -205796, -103163, 109375, 227026, 256721, 216007, 152316, -66578, -221055, -205229, 45349, 74372, -88783, 52954, 91097, 18308, 33998, 19785, -61235, 31337, 96619, 44728, -35094, 113848, 267957, 343001, 164799, 85329, 103798, -12656, -190170, -299067, -223486, -83870, -143334, -223137, -284102, -213364, -193594, -79445, -19661, -23297, -8470, 32732, 96443, 95533, 249004, 196835, 60520, 13501, 61874, 154317, 146884, 196773, 122493, -169124, -148888, 39059, -60114, 32377, -33333, -96240, -185731, 13289, 78622]
20140G8622J5592J23452K7509j76809j03864Q7209l4649m6806J40883J85512J02958
20129C99609j24820k05311N3841j59392j39192r264O3425J86602P1069j21664
20119A4903j66953J2731P0863p9095p0246j08449l8999L03380J30642Q7415q0664
20108G5528N5426K8545j74290k05463l8850k8023P3448P8707K7487k700r8917
20097b09102j73592P5216M5003J15736L1933l5229q5043J4342J29729J39272Q9949
20086A38214p7097j95654l56990q9218K27703K04077j82636m225J62941r8237
20076b71122k90217R4149J74174m5107R1090K31674J24575m1804j05561k40887
20066b79036q2100J48030K06348k33138p731l6235j02452j8242K4704l9380j96307
$$ y = [78622, 94214, 217666, 245175, 68366, -35498, 51711, 17062, -29744, 111139, 296651, 399609, 274789, 69478, 123319, -36073, -175265, -184529, -121104, 65498, 136567, 14903, -152050, -139319, -68456, -147551, -217797, -326246, -365245, -61865, 68777, 156192, 75528, 130954, 159499, -14791, -220254, -259104, -287127, -213679, -134972, -107485, -110185, -209102, -382694, -307478, -262475, -146739, -114806, -150035, -235078, -220736, -91007, 48265, 138214, 61117, -134537, -491527, -580745, -353042, -148965, -331601, -335826, -172885, -271122, -561339, -467190, -293016, -338123, -247033, -15359, 109216, 67412, -38149, -279036, -361136, -213106, -6758, -239896, -247627, -283862, -386314, -404556, -379852, -419232, -615539]
20055f15539M7697J62056R8728j69421R7021L46183J89806J20577j03274j00384
20045G3450J28003K13178j13417j78813j76837m635J02946K6912O5646p5961j24763
20034f4291K28910J18262k40033l5812J27798j14022j14091J11212O6636Q6723
20024A71292J60073j0502j78632R574p8952O2405p7389m5726o1113q358j8554
20013g5882r5178M1576j8979k5651J80042P5624j5305O4442m8526j30644K6245
20002b2236l7341j66209k06544O8931K25825M7422P753J2775R6218l7815K4698
19991A3477J37717q853j16861j84418o9039Q9119J08131l04073J71233J07675
19981e5892N0720N6471n151k7661Q2935P0642j7577L8622Q661k5405j16692k05601
$$ y = [-615539, -567842, -405786, -307058, -476479, -379458, -33275, 156531, 277108, 173834, 73450, 201453, 414631, 301214, 122401, -54436, -59071, 43875, 70787, 136433, 60472, -64291, 164619, 282881, 42848, 7036, 134834, 20812, -93279, 17933, 84569, 171292, 331365, 320863, 142231, 151805, 72853, 135258, 57869, 12143, -48970, -57328, -75882, -171060, -129484, -148463, -174114, 5928, 81552, 66247, 130689, 82163, -48481, -22236, -59577, -225786, -432330, -363399, -137574, -90152, -82399, -69624, 26594, -11221, 13477, 151194, 142341, 25480, -158938, -227977, -138858, -30727, -334800, -163567, -55892, -5172, 51299, 46148, 18487, 101422, 172064, 154487, 193109, 201770, 176365, 59673, -145928]
19969a45928j44055m4069n9862j22091L99347K79227l1864P4772j47459j10765
19959e2747m7158j02815K6868M8906j6850J08614J56655j76627j56608J06012
19949a05750K63984l8366p4118m6458J03917O2004k07173M3578J33617k63684
19939a28449q0180K73364J24740J8734j39380j13896k86290q5660J39258P9260
19929a98499L7812K35531j3622N6190q6804j14931P3858J2717J12161p2309p6530
19918c4426J8196P4902O9853N8741O4224J23667j52835k19521n0809j33340O6776
19907a14572J67625j83774O3310J22304n2699j3923k619P7227L01050j99344k84881
19896a20296j14702m0226K74218L49806q6502K7456J5691j84278j73712k6198
$$ y = [-145928, -289983, -334052, -393914, -516005, -116658, 162569, 130705, 205477, 58018, -52747, -99905, -202720, -175852, -126946, -143796, -35182, 121473, -55154, -211762, -105750, 158234, 119868, 45750, -708, 103209, 165213, -41960, 1618, 135235, -128449, -208629, 64735, 189475, 208209, 68829, -45067, -331357, -417017, -277759, -198499, -160687, 74844, 61222, 117412, 30608, -84323, -10465, 2252, 114413, 42104, -34426, -16230, 58672, 128525, 187266, 251490, 375157, 222322, 2801, -48008, -181348, -114572, 53053, -130721, -67411, 54893, 2194, -11729, -14348, 62879, 363929, 164585, -120296, -234998, -275224, -1006, 348800, 262298, 289754, 305445, 121167, -52545, -78743]
19886g8743N8060K14168n0809k57253q7900J6696O7735P8378J59469r1687j46595
19875a18481n5340K09814J28734j94650l38890k12833R7914J53615L7511J9350
19865b73256J42728J33462Q0735m6316o1402J15763K01003Q0918j91210j68229
19855A4196J01889K34836l5112j93247k21198q9451p8761L3239O2173J6426l6149
19844a91159Q0609J07723N0994r9981n1230P8629l9326n954q4158o0089M0732
19833a73210P7293J97424p3718j17475j28247J9109R5200K04358J2145j99360
19823h6481p2110L4377l6112j46122J29833p8570m2082K1092J65854P241J39679
19812C6599j74253m7948m1203J35998K08752Q1823p5050q9977J9667j92380O4063
$$ y = [-78743, -20683, 193485, 142676, -114577, -202477, -185781, -118046, -39668, 119801, 28114, -118481, -173821, 35993, 164727, -29923, -368813, -581646, -483732, -330117, -292606, -273256, -130528, 2934, 83669, 37353, -24049, 91714, 292717, 373635, 182425, 14196, 116085, 350921, 315809, 122562, -98636, -188087, -266848, -233609, -171436, -155010, -191159, -110550, -2827, 48167, -51814, -103044, -24415, -63741, -69695, -153853, -213942, -173210, -95917, 101507, 27789, -89686, -217933, -198824, -103624, 100734, 112879, -86481, -158591, -124214, -160326, -306448, -176615, -255185, -297267, -276175, -110321, -103080, 36599, -137654, -185602, -226805, -90807, 117945, 199768, 124718, 34741, 54408, -137972, -73909]
19801g3909K172m5226j28709j5425K59910J02095l01996k27593J21196K50820
19791e6665J08404J9339j7531p8444j58m9808l8486R419O5442P4650j06173R1557
19779B1546j13634M1477N622k6353q8191r9928j00345j44533L4702Q7394L21992
19768f0251J46668K8839j31377k12263K0442K42806J56897r9895J1921p8214k83826
19757b58253q8388m2829Q1161L1054n5112J25486K33186j20347k0350K13625j8881
19746H0352P6735j16269j44225q7832j04364L2302K86648J27712N0853j40510
19736F1402J00400J49689q4002m8023j5430N2549J15425J10080r4520l551q4698
19725B59321m435k540r7332j79401R6085j38121j33878p1680P8298Q4832K8901
$$ y = [-73909, -71737, -116963, -245672, -261097, -1187, 100908, -201088, -428681, -307485, -56665, 51739, 71078, 53547, -24897, -25055, -74863, -113349, -103930, -38488, 36162, -70011, 21546, -92088, -50611, -44989, -71342, -159533, -259461, -359806, -504339, -469637, -382243, -60251, 86417, 115256, -16121, -228384, -207942, 34864, 191761, 91866, 103787, 25573, -258253, -346641, -389470, -308309, -277255, -332367, -206881, 26305, -94042, -114392, 99233, 80352, 157087, 40818, -103407, -191239, -295603, -263301, 23347, 151059, 201912, 61402, 161802, 311491, 227489, 179466, 164036, 216585, 332010, 442090, 347570, 344019, 259321, 254886, 252346, 155014, -24387, 71698, -66423, -200301, -271981, -193683, -108851, -79950]
19714g9950j75471L6861J1054P6139L5826j29345q2854J55141J15739K2539r8618
19703a12939J6761j56694q2039J95920j24397O2879N8708O9176j04135J17859
19693e8901J28227K9324K4198p8464o6962O2956J9450j34229K4129j58339L2735
19682a75876O0433K63231J9232j49948n212J69568K328j27516o5159k91093k69745
19671e69757L82546J28612j9363L2397j27134j4457o3060k8675J69389q7038J5099
19660a81441j4960J17038R8708k3102P4407o740k40171p5342P3594J47560j70434
19649b00883j34027K38727J35228P949n3451k31583k6168J61416J74507o2009
19639I706j51048K7989j6479q9256k09107J27169J31996P986J69070J53506j00873
$$ y = [-79950, -255421, -218560, -207506, -131367, -95541, -224886, -307740, -152599, -36860, -14321, -112939, -96178, -252872, -334911, -138991, -263388, -200509, -141801, -72625, -176760, -58901, 69326, 98650, 122848, 44384, -22578, 40378, 59828, -74401, -50272, -208611, -175876, -115443, 147788, 167020, 17072, 11860, 181428, 183756, 56240, -8919, -300012, -569757, -187211, -58599, -77962, -45565, -172699, -187156, -250216, -278891, -109502, -196540, -181441, -196401, -79363, 19345, -3757, 70650, 63910, -176261, -251603, -178009, -30449, -200883, -334910, -96183, 39045, 46994, -6457, -238040, -264208, -102792, 71715, 9706, -141342, -113353, -129832, -219088, -428195, -301026, -169030, -161044, 8026, 161532, 60659]
19628F0659j6031j04691j56315L7017L0931J46814k3992J3299K36044J132k17690
19617G177q4226j15552L5896j0771j3434J49772J48892q1952q0203N3545K1784
19606C0928l5538j3843R3511j47511j91308j22348J04497J34703O9815j80678
19596b57772p9782K5187J22826Q9223J40938k7043j42148J66886J65024L4714
19586B38053r5904J1540M59n3855J29071J28668j17896l7821J33354J09780r5929
19575C49520k04701j96476N8178K72252j02975k5556Q6056j82498k47967R3438
19565a00729j36274j95122k5385K41807q9537K8656K7016J2754J97516M6564l7741
19554c0475j6247n9458R3927J52040n8891j85762r484o1379K10520J18463r5851
$$ y = [60659, 44628, -60063, -216378, -179361, -148430, -1616, -25608, -12309, 223735, 224867, 7177, -77049, -192601, -156705, -167476, -180910, -31138, 117754, 35802, -44401, 9144, 30928, -4610, -18453, 75058, -72453, -263761, -386109, -281612, -146909, -77094, -257772, -337554, -312367, -189541, -100318, 40620, 13577, -128571, 38315, 203339, 238053, 142149, 153689, 154148, 100293, 229364, 358032, 240136, 202315, 335669, 445449, 349520, 144819, -51657, 6521, 278773, 175798, 150242, 236298, 53800, -194167, -100729, -237003, -432125, -457510, -215703, -305240, -276584, -249568, -236814, -39298, 7266, -30475, -46722, -106180, -12253, 139787, 80896, -104866, -114350, -175729, 34791, 153254, 57403]
19543E7403k10816L1771R2933o2210k8378k5477o1291R5860K2910J88548J00070
19532B01323K6371k78595q2927j54030M4360M2028j92167K6174N6283M2809J06889
19521a61482R9808n0742q6729j68166J23430J32019j57641M566q2232L2835R4457
19510b19877p3877n9002Q9215Q1496K2491L9310o9659K36035K37826q6341j53290
19499D4327q5380M4112q7818m8815m2432j02726J6544L30795K77312j5007p3871
19488B57041p7059M4110j09386l0210j8092j26817L8842J17585j38618j08717
19478a51321j7671k34351j18008L34334J54O000M0533n5178n4197K20562J12787
19467H3644Q1966k0112j30077m4292k73246K4555P5588L18344k7873q9783j70790
$$ y = [57403, -153413, -121642, -28709, -90919, -119297, -144774, -206065, -110205, -87295, 101253, 201323, 227694, -50901, -133828, -287858, -243498, -201470, -393637, -367463, -311180, -268371, -161482, -61674, -112416, -199145, -367311, -243881, -111862, -269503, -264937, -347169, -314334, -219877, -293754, -352756, -263541, -182045, -159554, -120244, -189903, 46132, 283958, 197617, 44327, -41053, 3059, -84759, -133574, -176006, -278732, -262188, 68607, 345919, 330912, 257041, 179982, 224092, 114706, 84496, 66404, -60413, -21571, 96014, -42604, -151321, -168992, -403343, -521351, -187017, -186863, -180863, -140330, -195508, -249705, -29143, 83644, 165610, 145498, 15421, -28871, -302117, -277562, -201974, 116370, 88497, -1286, -172076]
19456a72076M7911J01417O8077J01209q0502j64318k7427j15383k06567n2738
19446e00397J03469M66237K73125P4584j58637j00004l2458Q4460M019j35576
19436G8822p2363J296J16025l2563L01937J07946k51683k62122P1461J21624K5027
19425B05407m7363j8407j7387j00113L3229L491k18560Q0829R1491j06194J05436
19414A1859p0495k12550J69976J22500j31385l9187J05359r2866L18241L4946
19404B16398k82727J54L6109o7992R2632j9757J27513j5529k4436P118K38987
19393C08470j19528j29374l8063n5288M2364r6869n7469Q2765j601q3412K36461
19382H8456R419j57820j39417k45744O2114J91240R3830p2447l4841k1186n3377
$$ y = [-172076, -124165, -22748, 45329, 146538, 66036, -98282, -125709, -241092, -447659, -500397, -396928, 69309, 342434, 417018, 258381, 158377, 125919, 210379, 214398, 78822, 6459, 7755, 123780, 91217, 393154, 501100, 249417, -12705, 58756, 180380, 205407, 158044, 139637, 122250, 22137, 55366, 58857, -159703, -78874, 12617, -93577, 11859, -58636, -271186, -101210, 21290, -110095, -149282, -43923, -136789, 181452, 216398, -66329, -66175, -30066, -98058, -5426, -25183, 102330, 86801, 62365, 69483, 308470, 188942, 59568, 21505, -33783, 8581, -88288, -145757, -62992, -64593, -148005, 88456, 97875, -59945, -199362, -445106, -382992, -191752, -97922, -170369, -205210, -226396, -279773]
19371b79773N6835K07772n314J847J76684J1897J59090N8040l6051J8323j25761
19360B43589j41655j59330J1555L03386j18177l25016k3808o3166o8647J49057
19350a92212P3606N675K53170P760j11474k18114j51934R6937n5776K22729R3952
19339B4319P8458k15795j78512J0822l64696J37563K86990J99277o3359J7331
19329f7602L04635n0813k20337k32919m1043P6235K1389R1669k1303k9587L6914
19318a32762o298l13099J470L25879o8856j25424Q8380J8912J27818n9356j66202
19307c09538K90301K02901M5803j18714N2454J21948L8446j43627M9413N5664
19297B85051r2815j98074R9498o7987j50645p8734J49385J25440P373r69L1136
$$ y = [-279773, -222938, -15166, -20480, -18633, 158051, 169948, 329038, 387078, 351027, 369350, 243589, 101934, -57396, -45841, 257545, 139368, -185648, -209456, -272622, -341269, -192212, -118606, -112931, 140239, 147999, 36525, -181589, -333523, -236586, -292362, -69633, 24319, 102777, -113018, -291530, -280708, -645404, -507841, -220851, -21574, -84933, -67602, 237033, 186220, -34117, -267036, -308079, -231844, -210455, -118786, -140089, -169676, -132762, -139060, -452159, -450689, -124810, -193666, -319090, -230710, -211798, -83980, -143336, -309538, -19237, 183664, 229467, 110753, 163207, 285155, 323601, 179974, 229387, 285051, 192236, -5838, 93660, 25673, -124972, -203706, -54321, 71119, 78492, 77523, 108659]
19286A08659R1149L9058m4686M4972j14292O9845O889j15582r8763m1788N5313
19275G74L321k12912p5389n1743J5968J92556J28237J64137Q3601k83924l74709
19264d10083j8254j5635L2550J1092K07161K81084K57883J6105r8538k06550k57196
19253b00381j20602p7133M776K69032J79644k2000j43085j29931M6488J36081
19243e7111k9290j20816L7171J74441N873n7498P7241J29679Q7156q5907k78875
19232a17936j88213O3802J98593J42453J55115l54223k41166j58076P3979K54432
19222a71240J32256L1662O9796Q9076k8222l00917N5731n9180j02519L7502J10598
19211a35457P8996J79868K17266k14504j88608M5458K79865J3224j42569k80868
$$ y = [108659, 199808, 238866, 194180, 239152, 124860, 194705, 201594, 86012, -12751, -54539, 774, 4095, -208817, -284206, -335949, -319981, -127425, 812, 164949, 248550, -35374, -410083, -428337, -443972, -411422, -400330, -193169, 87915, 345798, 361903, 263365, 56815, -200381, -320983, -398116, -393340, -124308, 55336, 33336, -109749, -239680, -193192, -57111, -86401, -207217, -170046, 4395, 10268, -47230, 30011, 159690, 246846, 160939, -117936, -306149, -242347, -43754, 98699, 253814, -100409, -341575, -499651, -425672, -171240, -38984, -7322, 62474, 151550, 123328, -177589, -121858, -181038, -283557, -246055, -135457, -56461, 123407, 340673, 126169, -62439, -16981, 262884, 276108, 133539, -147329]
19201a47329n5714M1295J5629q4757J50942J43681P1413j41152J3907K8181M2244
19190G8340j27010k2658L20711l2008j19605q2655j00568P4517J2880K8200N0689
19179H0833J48270j28516j31902Q8868J6496j42780k71126k73455K303L07360
19169c03649K88082J9098j26865J01445K69008K34307j88976q1525o3528J43359
19159B90756j41884o9274o4639j5811J8215j87028q2253M1359j98453J79261K77473
19148D7722N6927k19307p5319K68240q592m8199o0315Q4745K26267K2446j6828
19137B77787m8904j01206j1162m1059k614p8009k0270j14974n4771J38635J43878
19126H7331r2612j64879K9631J89017k1957k53018j07384J48103J46077J77199
$$ y = [-147329, -203043, -161748, -146119, -230876, -79934, 63747, 135160, -5992, 7915, 36096, 78340, -48670, -71328, 249383, 217375, 97770, 15115, -85453, -10936, 1944, 30144, 80833, 229103, 100587, -31315, 57553, 74049, -68731, -339857, -613312, -611009, -303649, -15567, 3531, -123334, -21889, 247119, 481426, 292450, 210925, 147397, 290756, 148872, 79598, 14959, -852, 17363, -169665, -251918, -210559, -409012, -229751, 47722, 104649, -114658, -189977, 78263, 69671, 21472, -38843, 45902, 272169, 294615, 277787, 228883, 127677, 116515, 75456, 72842, -5167, -25437, -140411, -195182, -56547, 87331, -5281, -170160, -140529, 48488, 26531, -226487, -333871, -185768, -39691, 137508]
19116A37508n573j3911o8086n0452m0377l3173m6996P4047K5249k01355P1898
19105a51221L84183Q6926r6527p7162Q2176k94010j79834J29400K01714N8956
19095A44601m6947k3363o7129M9465J40879k7670j49873j52048o9479Q5582K53084
19084A37102j87940l4567K39734M6512p5436K5886j66999j29296Q1835p9870r1000
19073b34039Q4617J16767J47116j08195K3895J43215l4123j25612j15247m9718
19063a51324R0447J81273j7787j3571R434j24743J86948M0090K3790j27099r8747
19052a289J02122M0440j48368k761K4061k4827k7597O3819K12513J2696m2662
19041B08147l07391j5636J57129j31311j36597P100k6892J02719J13919l4388
$$ y = [137508, 131935, 118024, 49938, -514, -40891, -74064, -121060, -47013, -21764, -223119, -151221, 232962, 319888, 223361, 146199, 228375, -65635, -245469, -116069, 85645, 144601, 97654, 74291, 7162, 56627, 197506, 169836, 19963, -132085, -201564, -115982, 137102, -50838, -85405, 154329, 200841, 125405, 151291, -15708, -145004, -63169, -143039, -234039, -149422, -32655, 114461, 6266, 30161, 173376, 139253, 13641, -101606, -151324, -60877, 120396, 102609, 89038, 98472, -26271, 160677, 200767, 224557, 97458, -1289, 100833, 141273, -7095, -9856, 14205, -10622, -38219, 25600, 238113, 250809, 208147, -99244, -114880, 42249, -89062, -225659, -218559, -245451, -142732, -28813, -63201]
19031f3201p8433j0187m4431J68731J69687k6827m5167P0770M3436p0624J39692
19020B53446j41263k33293R6957O4844N5525N8247o0893j24354K8355j14516K9691
19009h7254J50050O8278j18984j13100l4441M8825j01951K4912J83444K90523
18999C10302P3588q8954q0662j12574Q9773o4398r7311R9838k0530J46537K33405
18988D89014j77269j78326o4071k4339q1753q8614J22949N2295J00006j9189M3342
18977A74045l0158r2916J18352J47601J3865l28206J00885J85259o5267K5628
18967B49088R8551m0359j94182j13766K8044K30486Q0923N4734M8570j71834m8064
18956B22191p219j28779Q6163j53368j68187J24106k3487l6014J49699L70816
$$ y = [-63201, -141634, -151821, -196252, -27521, 142166, 115339, 70172, 140942, 184378, 113754, 253446, 112183, -121110, -24153, 40691, 96216, 154463, 93570, -30784, -2429, -116945, -87254, 62796, 131074, 12090, -101010, -135451, -86626, -188577, -163665, 19779, 310302, 383890, 294936, 214274, 101700, 191473, 127075, 29764, 129602, 109072, 255609, 489014, 311745, 133419, 69348, 45009, -36744, -125358, -2409, 49886, 149892, 130703, 174045, 143887, 50971, 169323, 316924, 330789, 2583, 103468, 288727, 223460, 249088, 347639, 307280, 113098, -668, 27376, 257862, 338785, 393519, 442089, 270255, 222191, 214972, 86193, 172356, 18988, -149199, -25093, -48580, -84594, 65105, 435921]
18946D35921R3453k10837k73246M891J43672J63638M8614j59681j68181j14116
18936c5872K7559J58412J14827J21094N5102j88310k17325j31679J14157p4995
18926e7030R2506K93620J6541k46328p6849J45804N5618p1440j10289m6087K4942
18915B1008r2342l8704N3385j34592j27733o0276J03658J46086J69035J70647
18905B10172j62796J377J70186j13969j03706j85898J0904J29197J18457P0028
18895A43952l31626p1287J28185K40174j59637o4054K12902k450j13009J57414
18885A40564L9536j08843j1763Q0872J42184J0812J25958j52652j36341J9280
18875A49607M4207Q9031o3513J65946k86604j19847J22850k2354R2488k4855k01097
$$ y = [435921, 529374, 318537, 45291, 50182, 193854, 357492, 406106, 246425, 78244, -35872, -8313, 150099, 264926, 386020, 441122, 252812, 35487, -96192, 17965, -57030, 35476, 329096, 345637, 99309, 22460, 168264, 223882, 152442, 42153, -3934, 21008, -71334, -110038, -56653, -191245, -318978, -379254, -275596, -129510, 39525, 210172, 47376, 48753, 218939, 104970, 1264, -184634, -173730, -44533, 73924, 143952, -187674, -258961, -130776, 109398, -50239, -114293, 98609, 96159, -16850, 140564, 180100, 71257, 59494, 140366, 282550, 293362, 419320, 266668, 130327, 149607, 193814, 282845, 219332, 385278, 98674, -21173, 101677, 79323, 171811, 146956, -54141]
18864e4141m4584K14817J64804J88025J14195N2052k33364j39231J05084o7453
18854C00204l7805j67750j79072J83008r3260j76232J09919J23893J66725m5849
18844A83781j6782r6229K1619p7524J9264K9581r336m9957J21781j39969r0197
18833a03968k1805m1684J73394j5841p122j47873q2072J08323J87321l4265J40458
18822A54866J71255j10163j45157L1113l7462L1514k7883j31672l4989R5519J12866
18811A09807P8215k47122j83037J66756Q9853o3455o8706k8388q4922R7419Q1417
18800e2163o7402J99164J14397L5716k426q1759P5896M6840k47873j75231N2540
18789a02301J07043J72413q3770j45386K1198K63870J38157j07813r6468J523
$$ y = [-54141, -98725, 116092, 280896, 468921, 583116, 635168, 401804, 262573, 367657, 300204, 262399, 94649, -84423, 98585, 5325, -170907, -60988, 62905, 229630, 183781, 166999, 70770, 92389, 14865, 34129, 63710, 54374, 4417, 126198, -13771, -103968, -125773, -167457, 5937, -9904, -17026, -164899, -246971, -138648, 48673, 14408, 154866, 326121, 215958, 70801, 101914, 64452, 95966, 68083, -63589, -98578, -3059, 109807, 188022, -59100, -242137, -75381, 14472, -48983, -117689, -146077, -230999, -133580, -52163, -119565, 79599, 193996, 229712, 227286, 145527, 221423, 268263, 20390, -154841, -102301, 4742, 177155, 93385, -52001, -30803, 233067, 371224, 263411, 166943, 168466]
18779A68466R847K87246J46677o7050R485L70164K76218J79708K9790k25150p5353
18768A110048L25455P71483R13172J06408r35253q81177m79022k00726J45327
18759H75715K58524L92833O54650J29884k14172l90227l99987K7856L43138j50561
18749A527653m32134k94865r8789J18657m3784j18800j8938j84102J04137J64087
18739G23122K73067M9366k5895L71285L09335j07874l07490l87495k09884j43344
18729E44193j64236k802J33093R3442n0711l46617l31680p0122O8174J53548N0317
18718G6599r0369j31170J00043J53102J32910J76070j43437l49569r1758J12859
18708e4720K87504P63L0531J33475k3010l60375j2965K23524k2594P6789J19477
$$ y = [168466, 178313, 465559, 612236, 545186, 554671, 924835, 1201053, 1380761, 1410551, 1185401, 1110048, 1435503, 2206986, 3120158, 3226566, 2291313, 1410136, 931114, 730388, 875715, 1134239, 1527072, 2181722, 2311606, 2097434, 1707207, 1307220, 1335076, 1678214, 1527653, 1095519, 800654, 701865, 820522, 776738, 657938, 639000, 454898, 559035, 723122, 996189, 1045555, 1019660, 1390945, 1700280, 1592406, 1284916, 897421, 687537, 544193, 379957, 377155, 510248, 603690, 552979, 206362, -125318, -195440, -127266, 26282, 76599, -13770, -144940, -44897, 108205, 241115, 417185, 273748, -75821, -167579, -54720, 232784, 233547, 264078, 397553, 374543, 14168, 1203, 224727, 202133, 278922, 398399]
18697C98399P9999J4807j34756j22661P7645r4945p4407j42155J1643J44479J62665
18686C20713J06094j17652k32031j73760p7648O0383L09578J26135j36259r4982
18676I0571Q0151J29018o8170m9739j2402r7624q6738P0916M5178J02254J58991
18665C62406q3729k54235j07662J37309J80489R3268K3297L7617L9952k26927
18655B01785j38292k66685k0798l7496m8610K32675J87929p7206k41530j11479
18645c19707O384J77669P131K8058o4463j6p5138o0500j4368n8267N9501J83431
18633a30285J67072J66345P0977n1228l3663j62170j00598J52275R6091M7039
18623B21855p6925r7722j2177p2314j07034n0859p9623O5740K35373J70111k086
$$ y = [398399, 478398, 493205, 358449, 235788, 313433, 218488, 144081, 1926, 13569, 158048, 320713, 426807, 309155, 77124, -96636, -174284, -113901, 195677, 321812, 185553, 90571, 170722, 299740, 231570, 181831, 169429, 71805, -14933, 55983, 101161, 203415, 362406, 278677, 24442, -83220, 54089, 234578, 327846, 351143, 388760, 428712, 201785, 63493, -203192, -223990, -261486, -310096, -77421, 110508, 33302, -208228, -319707, -313323, -135654, -128523, -100465, -164928, -164944, -240082, -300582, -314950, -373217, -313716, -130285, 36787, 203132, 274109, 222881, 189218, 27048, -73550, 78725, 174816, 221855, 144930, 47208, 35031, -37283, -144317, -195176, -274799, -209059, 26314, 196425, 194339]
18612A94339l17176k38995J23842l6788k4844J30445J95514j44701n824J89479
18602F5291J51456K4911k35344q7501K08612k61540j01619o5097J22040J40595
18592c8196J02045j7108j68979j58747r9807J7673J29668J85019K382r3157j16048
18581b55255J70180O5467k26182K31450J67753P941k1954J18604l7053j44692
18571G6259J3765K8948m227O4624K259p2791N0417O80J3031J27826k7509m7846
18559B25436j68574M2343l4293K84027n8899j10680j6455K7005O3460p3080p9599
18548A00691K5057j46350l7862l2223K1895L9374l7019l0397j63898R8627K17552
18537E5447J23476K29064j22817o1555n6643j23481k72697K8224J13992P0312
$$ y = [194339, -122837, -361832, -237990, -274778, -299622, -169177, 26337, -118364, -124188, 65291, 216747, 241658, 6314, -81187, 127425, -134115, -235734, -300831, -178791, -38196, 63849, 46741, -122238, -280985, -380792, -363119, -233451, -48432, -46050, -139207, -255255, -85075, -19608, -245790, -14340, 153413, 161354, 139400, 258004, 220951, 76259, 90024, 118972, 114745, 179369, 181628, 108837, 159254, 159934, 172965, 300791, 273282, 225436, 56862, 99205, 64912, 348939, 290040, 179360, 162905, 189910, 253370, 180290, 100691, 125748, -20602, -58464, -90687, -68792, -29418, -66437, -96834, -260732, -162105, 55447, 178923, 407987, 285170, 223615, 166972, 43491, -229206, -200982, -86990, -16678]
18527a6678J94801K09071k49304j17700j46839q7337K34755L9766N2970o9421
18517D4084k8684O7794P3095k5641j17593J05320q6084j14506m7655R8551j77477
18506b08796j25903K53070K64841j3281p0902m3465j55422K4051J85984R168l7090
18495H2255J91417j82749l5003M5183q0558Q7289J22169r4781n2316k54j845J7743
18483I8550L3949j70319K1518K47154j5464O187j82302j00377M6829Q1656j31686
18472f4305R3553J60366O2875j06523j04709J33398l8897J39051j1081j80454
18462H3274J0076O9916J6089l4501L6242M6687Q9410L972o9588k2327q2610n5754
18450I0886M4264J52460j14791k65203J29761n235k0181k5037m9072O6804P0229
$$ y = [-16678, 178123, 387194, 137890, 20190, -126649, -213986, 20769, 60535, 113505, 44084, 15400, 83194, 156289, 130648, 13055, 118375, 32291, -82215, -129870, -31319, -208796, -334699, -81629, 183212, 169931, 99029, 55564, -99858, -75807, 110177, 119345, 82255, 273672, 90923, 55920, 101103, 20545, 107834, 230003, 135222, 82906, 82652, 80807, 98550, 132499, -37820, -16302, 230852, 215388, 221575, 39273, -61104, -14275, 67381, -64305, 29248, 189614, 252489, 145966, 41257, 174655, 135758, 274809, 263728, 83274, 93350, 163266, 179355, 144854, 181096, 227783, 317193, 321165, 251577, 229250, 146640, 90886, 135150, 287610, 172819, -92384, 37377, 32142, 11961, -13076, -62148, 4656, 74885]
18439G4885r4178R3136M6788J55575L0146q9174r8026L1315M4010j9825O7067
18428B41719J2672M7785R5388o6560k2461l9629M2276O5912J8987j1795J31140
18417E15434J1736J1798K8970K384q1026j23117O3240m8854m2570o9685k34874
18406C3436J00090K13516K82844j0117L2295l15189k62843j26170o1758j28818
18396b42714L1014R5057J14449K26122J34209r0099k5195j11152j32234m9101
18386d9644L9581N2468J58379N6848N5039j03297K1054L77p3257J27187r9030
18375A85705P7549O95o3208N8553J53309l16323k24485O5165J10822K82191m3525
18364B86448j72683J56225K89392N0797N3839j01678L8142j58391j05090j9102
$$ y = [74885, -19293, 73843, 120631, 276206, 306352, 217178, 119152, 150467, 194477, 174652, 241719, 254391, 302176, 397564, 331004, 308543, 268914, 311190, 377102, 396089, 384294, 515434, 527170, 538968, 567938, 570322, 489296, 366179, 429419, 380565, 337995, 268310, 33436, 133526, 347042, 629886, 619769, 652064, 336875, 74032, -52138, -113896, -242714, -211700, -116643, -2194, 223928, 358137, 268038, 242843, 131691, -543, -49644, -10063, 42405, 200784, 257632, 312671, 209374, 230428, 230805, 157548, 284735, 185705, 263254, 263949, 200741, 259294, 412603, 96280, -128205, -63040, 47782, 329973, 286448, 113765, 269990, 559382, 610179, 664018, 562340, 600482, 442091, 337001, 317899]
18354C17899J08631K01208Q4621j8067q6918K373j17213k90036P4913J24642k03001
18343A99052J718R9864n9876J46906M0336q5066j26770N5291J30011J17016k1950
18332D96532k06481N1212n5419J51395R5242k04823j76548O9201K19719n4873
18322C85157r9211j17985m4895J7606p3028K34206J75292P7858J27572J40007
18312H22579O4765j14296n8311r7221j5919K32677J15486K9236j44029j64151
18302F70816j12072L2298O2030p7399J06173n8385m3620J0851J08096M1442q8272
18291F51958k07810j7109L91821J88755j7046j03780o1563O9798k8879O307j5521
18280H56931R4656J78404j00004J26654Q5922j37455n5146k31061k2554p9818
$$ y = [317899, 426530, 627738, 712359, 694292, 607374, 609747, 492534, 202498, 277411, 402053, 199052, 200770, 300634, 240758, 387664, 428000, 342934, 216164, 271455, 401466, 518482, 496532, 290051, 341263, 285844, 437239, 532481, 327658, 151110, 220311, 440030, 385157, 285946, 167961, 123066, 140672, 67644, 301850, 477142, 555000, 682572, 822579, 887344, 773048, 714737, 617516, 601597, 834274, 949760, 978996, 834967, 670816, 558744, 591042, 653072, 575673, 681846, 623461, 579841, 590692, 698788, 740230, 651958, 444148, 427039, 818860, 1007615, 990569, 886789, 825226, 895024, 866145, 872452, 856931, 951587, 1129991, 1029987, 1156641, 1242563, 1105108, 1049962, 818901, 796347, 716529]
18270G16529n3024K3690j63260j50179J41707J30786P8244J30759J10809J31200
18260A097261m7430j6865k46782m2874K09680O6880K56187l4773j71989k80731
18250G88564L31551L30252M1741k06299j96276q7491Q2209J17055J82212j9230
18240A364288q7764O4941n4458j6553K30892K42650P5317J14508J4782Q9378J20507
18229B158488j26731j3877J21057K03130J66588m0742q1788l161J6344K30770
18219B630078K86394M52933J61670l37168j10637q3915O5979K46840J62032R3790
18209C567996K49025J50649j58653L44145P18671Q63272J050453N75487K55013
18200G616058P18363J098114J561362J999669K584235M545562Q094553J3951539
$$ y = [716529, 663505, 687195, 523935, 373756, 515463, 646249, 724493, 855252, 966061, 1097261, 1049831, 1032966, 786184, 743310, 952990, 1019870, 1276057, 1241284, 1069295, 788564, 1120115, 1450367, 1492108, 1285809, 1089533, 1002042, 1084251, 1201306, 1383518, 1364288, 1276524, 1341465, 1287007, 1270454, 1501346, 1743996, 1819313, 1933821, 1948603, 2037981, 2158488, 2031757, 2017880, 2138937, 2342067, 2508655, 2467913, 2386125, 2382964, 2399308, 2630078, 2916472, 3369405, 3531075, 3193907, 3083270, 2999355, 3065334, 3312174, 3474206, 3567996, 3817021, 3967670, 3809017, 4153162, 4871833, 5735105, 6785558, 7361045, 7616058, 8334421, 9432535, 10993897, 12993566, 15577801, 20123363, 28217916, 42169455]
18192D2169455J5817070Q68650o628843K671763J5819079K0186647p129521k1915554
18184F1858746j1561934m41242Q07418p849646q271830l903170o03168J062065
18176C1097239L255851P066042J1870015J9476990L1921974M8975365L8111196
18169A91774672p799689n423719L4435794Q0585555N6339655n7601046o9439187
18162B22872035j9358047J7574602o138472n0920176m1767433j7775949R74501
18155A05461061J9596413M6271021Q9110707J41891711J29804317l162660j21182142
18148D07790428j41930741j00379753n7058541l2129288j8802500j1336248o342868
18141C9810489k512051j564932k298273j809189j286666j089887l46039K168153
$$ y = [42169455, 57986525, 58855175, 52226332, 54898095, 70717174, 90903821, 83774300, 61858746, 50296812, 49855570, 50662988, 42813342, 34541512, 30638342, 30035174, 31097239, 34353090, 41419132, 53289147, 72766137, 104688111, 153663476, 191774672, 183974983, 178551264, 212987058, 293572613, 349912268, 292311222, 222872035, 203513988, 221088590, 214950118, 164029942, 122262509, 104486560, 105461061, 125057474, 171328495, 260439202, 402330913, 532135230, 528972570, 407790428, 265859687, 165479934, 108421393, 76292105, 57489605, 46153357, 39810489, 37298438, 35733506, 33435233, 31626044, 30339378, 29249491, 28903452, 31071605]
18133C1071605O496921J3450506K4469677L7437737L0620444o055005l3192303
18126A04299582l6412732k3612067j2776214o677729l639379j978095o89480J9393
18118A8533279J168952K288612L327233M424922P054966J1528939J9168001L5267733
18110A02762637O5731430J21318223J72976366J4857538j68146103j32753091
18104A76747000p0300437l7042000k1069173j2864113q376400n652993m036456
18097A7405428k965093k201795j569311j139699q60964p52460j108474r98542
18089E809090q34488n92874j39991m33477l42178o7411l42459l60625l70360l35090
18079A990137k18765j70396j65329m4188O9133J40797K4392j2972K15451Q194
$$ y = [31071605, 37568526, 51019032, 75488709, 112926446, 143546890, 137491885, 104299582, 67886850, 44274783, 31498569, 24820840, 21181461, 19203366, 18513886, 18533279, 19702231, 21990843, 25318076, 29742998, 36797964, 48326903, 67494904, 102762637, 168494067, 289812290, 462788656, 477646194, 309500091, 176747000, 106446563, 69404563, 48335390, 35471277, 27094877, 21441884, 17405428, 14440335, 12238540, 10669229, 9529530, 8668566, 7916106, 6807632, 5809090, 4974602, 4381728, 4241737, 3808260, 3466082, 3398671, 3056212, 2695587, 2325227, 1990137, 1771372, 1600976, 1435647, 1391459, 1460592, 1601389, 1625781, 1612809, 1828260, 1836454]
18069A836454k97247r7261J86014N8399l30019l04283m1619L086K4762O6841j89586
18058I15541l95652j06560K78454K6259j48184j24428M3742J43384p5670k17405
18048C39481J33608J33836K8559j03984J38500m4268m9760j29719J27133J13807
18038F87193M2853j26266q1269k2961J6101j3925m354o5594j92204K4304r3099
18027A70779L0544J04064J83154J41835J72160q8882k74533r7152n7540r950J16841
18016C91320J49446R1366j01069j02294j35110O4132K98874J22580J18522r5522
18006H02245j62184K3387O1658j98560q3431J46802j45182r6980l3290j4276K1735
17995C21924Q6070P3869N8904j10077K397Q3897j85720j03288p2224O4736N523
$$ y = [1836454, 1539207, 1441946, 1627960, 1686359, 1356340, 1052057, 1010438, 1013524, 1038286, 1105127, 915541, 519889, 413329, 691783, 718042, 569858, 445430, 489172, 632556, 556886, 339481, 473089, 606925, 635484, 531500, 670000, 625732, 575972, 446253, 573386, 687193, 730046, 603780, 522511, 499550, 515651, 501726, 497372, 431778, 239574, 263878, 170779, 201323, 305387, 488541, 630376, 802536, 713654, 439121, 341969, 284429, 274479, 391320, 540766, 632132, 531063, 428769, 293659, 357791, 656665, 779245, 897767, 802245, 640061, 663448, 725106, 526546, 443115, 589917, 444735, 347755, 314465, 300189, 321924, 407994, 481863, 540767, 430690, 433087, 516984, 331264, 227976, 155752, 220488, 226011]
17984B26011R7333P7599J82087J24620l07518j03401N6645N4658K3969N6640Q9598
17973E78241j11817j67941r9070N2695R2432N7389o4644r2983r4075P0715n1258
17962A69684n1990j32899j19612J9290J17353L8104J75562J38323K5307L324k21206
17951A61240k3918n663K42593o1239j22184n9047j3728j79641O0271J23168j11553
17940A0299J35252K7229R2146J33729j19266l03744q1861L1011P7140J30773o8206
17929F4502J84423M4496j97552k48094j39681J1583k2451o4578P1815J75789J59021
17918C9273K75197J80348p1499j94272l07039j76139O141l02p4208J73291J42475
17907f734Q5790q836j58733n9754J1928O8494K34970L43841Q4685m6956j90021
$$ y = [226011, 323344, 400943, 583030, 707650, 400132, 296731, 353376, 408034, 432003, 488643, 578241, 466424, 298483, 199413, 252108, 344540, 401929, 337285, 244302, 150227, 220942, 169684, 117694, -15205, -134817, -115527, 1826, 39930, 215492, 353815, 379122, 382446, 161240, 137322, 131659, 374252, 313013, 190829, 131782, 118054, -61587, -1316, 121852, 10299, 145551, 172780, 264926, 398655, 279389, -24355, -106216, -75205, 1935, 132708, 64502, 248925, 293421, 95869, -152225, -291906, -280323, -302774, -367352, -295537, -119748, 39273, 314470, 494818, 423319, 229047, -77992, -254131, -247990, -248292, -322500, -149209, -6734, 79056, 70220, -88513, -148267, -136339, -67845, 167125, 510966, 595651, 548695, 358674]
17896C58674n0424n3634j14905K7046j4676m6198P9044J00569o9598n5917o6707
17885I3274o3987j63497N402K8059m258p3854k456l6163r0959o7938J04415P6620
17873a95342K80968j12432M0198N2655q0038k65551J3726q6711J28068K65446
17863D0987L5805o2515J9246o5M2965j02567K2003p3369j3476J09775Q249m1204
17851a4166L3281N6906N3160k99060k85204N1833K63384K41399q3166j80319k39862
17840d01814r452L16977K09908j18812m3290L843r9365R5265R8429J96839J16310
17829C64838j54060k84054o8174l7293j01762n9141p3432K76973J90550j1420
17819D3025j72623Q9037K14406l4685J85014R6836k39468l67741o2720M4775J77983
$$ y = [358674, 308250, 254616, 139711, 166757, 152081, 105883, 184927, 285496, 215898, 159981, 93274, 29287, -134210, -128808, -100749, -105007, -178861, -181317, -217480, -308439, -376377, -271962, -195342, 85626, -26806, 13392, 66047, -13991, -279542, -265816, -352527, -224459, 40987, 76792, 14277, 33523, 33458, 76423, -26144, -4141, -77510, -90986, 18789, 27038, -14166, 19115, 76021, 129181, -169879, -455083, -403250, -139866, 101533, 18367, -161952, -401814, -411266, -94289, 115619, -3193, -46483, -42640, -142005, -46740, 51689, 248528, 364838, 210778, -73276, -141450, -178743, -280505, -339646, -413078, -136105, 54445, 43025, -129598, -40561, 173845, 139160, 324174, 421010, 181542, -186199, -248919, -204144, -26161]
17808b6161K83367Q6178p7047k84724l18962q7100N4297N4242q1112M0020J92668
17797a64334J11361Q969J23350r8799k0227L0846o3594k31151J9825K46654N2117
17786A5017O2159o5629j20522J02088J76209N9993o6033P5994O1943k63738j04110
17775f6629J90341J07456k0712m1825o6995j52323m5202m5332P0603R3963p2883
17764d9538j83670M846j9994J61235J05268J09041J21503J39501J5316j89312
17754B14196k49639J04338P3472q0464m4869k10470l3321r590Q679O4892K6322
17743a36454J75164J35562J12725j45940k25974L3736j72553j7212M5253q4897
17733b80590L1352N0977j5682r6199p5495K14241J50264o4255q521L298J38010
$$ y = [-26161, 257206, 343384, 266337, -18387, -337349, -424449, -370152, -315910, -397022, -357002, -164334, -52973, -44004, 79346, -19453, -39680, -8834, -72428, -303579, -283754, -37100, 15017, 77176, 11547, -108975, -6887, 169322, 229315, 163282, 239276, 301219, 37481, -66629, 123712, 231168, 210456, 168631, 101636, -50687, -95889, -141221, -70618, 23345, -49538, -233208, -228362, -248356, -87121, 18147, 127188, 248691, 388192, 403508, 214196, -35443, 68895, 142367, 61903, 17034, -193436, -226757, -236347, -227668, -162776, -136454, 38710, 174272, 286997, 141057, -84917, -51181, -223734, -240946, -195693, -280590, -249238, -198261, -213943, -310142, -385637, -171396, -21132, -85387, -93908, -90610, 47400]
17722D7400N9179j0112J83727K1316j09478n9264k70228j4525j49212J32342K92552
17711A23697J16417j88950K2173q3050o9428R0374j4830N1730j36251j01287j6195
17700b05600J14294L31774J10191j36677j00044q9810L8905J0247r5797m815L3293
17689E961p1366q812J34791N6965P2999k40252k80469K7092J54421J31106J36947
17678A19383M177q2051j27274J06399j08002m643j04292k6339M9742R8062K50977
17667A76139J39605l5725o3795P3620K07665L88848J08373M18150J332088J648611
17657D393579J342639J71928j095512j176157j146348q31347o59141k68847k67019
17648D63775j10234k09154k74550J37229K8293K49497K0111j68736O9397K08891
$$ y = [47400, 106579, 96467, 280194, 301510, 192032, 132768, -137460, -151985, -301197, -168855, 123697, 240114, 51164, 73337, -9713, -79141, 11233, -3597, 48133, -88118, -189405, -205600, -91306, 240468, 350659, 213982, 113938, 24128, 63033, 73280, -22517, -27332, 5961, -65405, -74217, 60574, 117539, 190538, -49714, -330183, -303091, -148670, -17564, 119383, 123560, 41509, -85765, 20634, -87368, -92011, -196303, -222642, -172900, -74838, 176139, 315744, 280019, 216224, 289844, 497509, 886357, 994730, 1412880, 2744968, 4393579, 5736218, 5908146, 4812634, 3636477, 2490129, 1658782, 999641, 730794, 463775, 353541, 144387, -130163, 7066, 35359, 284856, 304967, 136231, 205628, 414519]
17638D14519q3040L926j96888k81549j41050R9568O421R6884K04404K92779L91333
17627H07307M56739Q01259J231211J169505O52750k36149j236148j451162j016069
17618A179243m02515j16770j92886k43421j10166k4935K0597j304J01228j68325
17608D0746j22704K91792K01553j02206o4789j07597q0693o8569K02919J80046
17598C70498j19162m9331j06837l5159K05070L26587K64185j02847r9723K3488
17588F76769J48044J90133K33902j72420j82200o484l3314J15691n4685k63491
17578F51945m23092k95196L5837j9750O7231J26809K60324M70063J60487q7918
17568I46740j58191O6742R5771L3920k7928j45369k59938q0197J28439O3412l49055
$$ y = [414519, 331479, 335405, 138517, -143032, -284082, -184514, -178093, -81209, 123195, 415974, 807307, 1264046, 2065305, 3296516, 4466021, 5118771, 4882622, 3646474, 2195312, 1179243, 776728, 659958, 467072, 223651, 113485, 88550, 109147, 107843, 209071, 40746, -81958, 209834, 411387, 309181, 244392, 136795, 56102, -12467, 190452, 370498, 251336, 202005, 95168, 60009, 265079, 591666, 855851, 753004, 653281, 676769, 824813, 1014946, 1248848, 1076428, 894228, 887744, 854430, 970121, 915436, 651945, 228853, -66343, -30506, -50256, 16975, 143784, 404108, 874171, 1034658, 946740, 788549, 855291, 951062, 984982, 957054, 811685, 551747, 471550, 599989, 663401, 314346]
17557C14346l17408j73575Q879m8113J46764J43395J5263K9540L60485L49069
17547H28645K60913J36519K23279K90212j91717j62139l22641l36450k72744j95450
17537B58427N0284q2846K72J96954l8683k57717q4222k3341O2936J53513J13254
17526C48831L65522M12539J06187k1386K05993l5876m50859l36085j7968Q073
17516E84971k41071j81914k33051O5596K21000j02715m6390j38956r2366L5221
17506a29675L2959j20211j26274J09895L55700J32720j73403l5838J9314J62204
17496B27391J27759R1835r2043j33105j92040n454j30025j05817J18518R471j2876
17485i6386p7468r0710K21574P1871m5224J47587j44539k36335O20J27768J92513
$$ y = [314346, -3062, -176637, -167758, -215871, -69107, 74288, 89551, 119091, 479576, 828645, 1089558, 1226077, 1449356, 1739568, 1547851, 1385712, 1063071, 726621, 453877, 258427, 308711, 225865, 226137, 423091, 384408, 126691, 42469, 19128, 82064, 235577, 348831, 714353, 1126892, 1233079, 1211693, 1417686, 1381810, 930951, 594866, 576898, 584971, 343900, 161986, -71065, -5469, 215531, 112816, 66426, -72530, -164896, -129675, -96716, -216927, -343201, -233306, 122394, 255114, 81711, 45873, 65187, 227391, 355150, 446985, 354942, 221837, 29797, 24343, -105682, -211499, -92981, -83510, -96386, -173854, -264564, -42990, 28881, -16343, 131244, -13295, -249630, -249010, -121242, 71271]
17474G1271M092N7064p2445j98982k74451n1184J41634q6523N1693J21741K54883
17463A8793q5710L7828j05703p7282m4442J49068J74930Q4583P4159j35030k26860
17452a35666l00591j40239K42053L66060J39752q1675J93799K71574L91681N40979
17442A487727P99813K45048r72031r12230l21949k52486k32772q2917l1399O828
17432b66368m6162l8401p0993r4140q2500K13838K98492K09288n4440k11884O4526
17421g8744O8850L2476j21748p7848J41614P5513k6404j01088j76927J33493J13054
17410a7759j26345l4402q1018Q5104J28681n1320j89100o6669P398Q9111O117
17399b50202J04812J74891P4492j95134n2104R1252k4228n7486n3818J90119n0276
$$ y = [71271, 75363, 132427, 59982, -139000, -413451, -464635, -323001, -409524, -357831, -236090, 18793, -66917, -29089, -134792, -212074, -256516, -107448, 67482, 152065, 226224, 91194, -135666, -436257, -576496, -334443, 31617, 171369, 89694, 283493, 555067, 946748, 1487727, 2287540, 2532588, 1560557, 648327, 326378, 73892, -158880, -241797, -273196, -266368, -312530, -350931, -421924, -516064, -598564, -384726, -86234, 123054, 68614, -143270, -78744, -9894, 22582, -99166, -177014, -35400, 40113, 13709, -87379, -264306, -130813, -17759, -144104, -178506, -259524, -174420, -45739, -97059, -286159, -352828, -345430, -256319, -250202, -145390, 29501, 103993, -91141, -143245, -51993, -76221, -133707, -187525, 2594, -47682]
17388d7682r2326R4267j7507p6955q8059J53537J53202J0809q9476j56158O4807
17377i1541J11757J42201J52084j33943q2694L7657R2945J59459q0263M8785n2141
17366C04306j07877m1909P4469j73965n909K1500j62533P5767M0357J2045j62553
17355a26302j49675q4599J35876L9663j66249J99091k127J19566J42868j0078
17345I8034r0989J00939J19482J7439j00173j91205l9591Q6332n2949R5917J06982
17334A50218J83425p4115j26033j85269j23256j9352N3136P33R4629J64101O8276
17323A86493j05584M6774N614j67742k21587r711Q1422R0485J86016p4430O7358
17312H5108L2814n8394J48125J17441j54825k23535n1841o3834k07773J66857
$$ y = [-47682, -140008, -45741, -63248, -140203, -228262, -74725, 78477, 89286, -190, -156348, -91541, 20216, 162417, 314501, 180558, 97864, 135521, 228466, 387925, 307662, 356447, 304306, 196429, 154520, 228989, 55024, 49115, 70615, -91918, -16151, 24206, 36251, -126302, -275977, -360576, -224700, -185037, -351286, -152195, -154322, -34756, 108112, 98034, 7045, 107984, 227466, 244905, 144732, -46473, -86064, 268, -52681, 43236, 150218, 333643, 259528, 133495, -51774, -175030, -194382, -141246, -140513, -45884, 118217, 186493, 80909, 127683, 133297, -34445, -256032, -265743, -184321, -93836, 92180, 17750, 85108, 117922, 59528, 207653, 325094, 170269, -53266, -105107, -168941, -376714, -209857]
17302b09857J37315n1986p1177J6959K86234N5085j87308Q1237L263L2324N2393
17291A44482j35335r2595K9386l973M7346P7680L3393j62038j60919J76129J25180
17280G8736K68330J6320r2441m3380K44232J5619l76313k07443P947M935N6651
17269b6807Q2678l9202J1344q016j64527j04143j0569r1933J02776J31330l0070
17258a47139Q6249j02635j53102k5667J523J02192J17965J7887J87939k80526
17248a95314k54129M4238K18485l3499j16629o3409J00984K93154r860k0788l47107
17237c83874m3388K70345l3287o2142j11926R3503K71141J88752O0012k26474
17227B2662k13932J80508O2041l4368N1843j69816o177J53782m5993m7503p0504
$$ y = [-209857, -72542, -124528, -195705, -178746, 107488, 162573, -24735, 56502, 59765, 92089, 144482, 9147, -83448, -54062, -58035, -10689, 66991, 100384, -61654, -222573, -46444, 78736, 347066, 363386, 270945, 227565, 471797, 487416, 111103, -96340, -88393, -83458, -26807, 55871, 16669, 28013, 19997, -144530, -248673, -259242, -351175, -248399, -117069, -147139, -60890, -163525, -316627, -342294, -340771, -238579, -120614, -102727, 85212, -195314, -449443, -405205, -186720, -220219, -336848, -400257, -299273, -6119, -15979, -36767, -383874, -427262, -156917, -190204, -252346, -364272, -270769, 372, 189124, 249136, 22662, -191270, -10762, 51279, 16911, 68754, -101062, -107239, 46543, 550, -46953, -117457]
17216a17457K4821o039O249R6031n2918r1727J142Q8216K59501K5078j38482j67810
17204g3395o5501j25227k6046P0415L6472J92815Q9258j11964o5524J2808K0453
17193d5436l6184q3889J20345J5497j05445n4354Q5970m2332J29386K19222J35957
17182C38737k70240j15264j26877J9861P4255L5506o2387J71195L7491r7410j34789
17171a29922k7331L2365K2073P0261r744r1381J22523J31867n7912O2869J44103
17160B69771J03371j53368k59127l17908j64179J93904P1188K22464r1543J1194
17150a14233M1572o6554r5888J5240N7134J25574P1897N6695O9880j16498q5099
17139d0280o8824J02163L9549L5596J69892l1745l57305j88988K78881J64398
$$ y = [-117457, -92636, -98675, -92426, 3605, -49313, -141040, -139898, -51682, 207819, 232897, 94415, -73395, -138896, -264123, -290169, -219754, -183282, 9533, 98791, -13173, -78697, -65889, -45436, -81620, -165509, -45164, -29667, -135112, -189466, -103496, -145828, -16442, 202780, 338737, 68497, -46767, -173644, -153783, -79528, -44022, -106409, 64786, 102277, 4867, -129922, -157253, -124888, -102815, -32554, -42298, -133679, -11156, 120711, 62799, 125668, 269771, 373142, 219774, -39353, -357261, -521440, -327536, -256348, -33884, -125427, -114233, -72661, -139215, -235103, -219863, -162729, -37155, 34742, 91437, 161317, 44819, -40280, -109104, -6941, 32608, 68204, 238096, 206351, -150954, -339942, -61061, 103337]
17129A03337M0469l02610k8195Q3368j24306J59050M4638k37464J4781K13653
17119c3279j656l7108j73688L7248P0551K65629K81546j09560J0938l885j32476
17108A74260k01749q6880L8975j41500J05477K54596q1878N994P3990Q235j28675
17097B0845k61237j11955p2191R8328J58942l0807J08007K5868K8988o3760j161
17086a00133J12523R5747j0411k08806r6897n147J14360J73999j70582k75605
17076c70952R203J05012K63985K74719k164k59348P576J52201P2764p2515m6111
17065A34370n2620J7943k3245O5448K02891l984J6983J50362p6748j19736l07505
17054D159j31939J47065P2045J11268l8083j55426J1420N4806J55908j07662j09959
$$ y = [103337, 143806, -158804, -186999, -103631, -227937, -68887, -24249, -261713, -246932, -33279, -34935, -72043, -245731, -208483, -137932, 127697, 409243, 299683, 310621, 306736, 174260, -27489, -114369, -75394, -216894, -111417, 143179, 61301, 67295, 141285, 149520, 20845, -240392, -352347, -424538, -326210, -167268, -198075, -90068, -64200, -35212, -98972, -100133, 12390, 108137, 97726, -111080, -207977, -213124, -98764, 75235, -95347, -370952, -361749, -256737, 7248, 281967, 279803, 20455, 28031, 180232, 252996, 180481, 134370, 81750, 99693, 76448, 141896, 344787, 340803, 357786, 508148, 431400, 311664, 4159, -127780, 19285, 91330, 202598, 164515, 9089, 20509, 75315, 231223, 123561, 13602]
17043A3602J48020N3310j21128P4212l0256k16011j57436Q9195L16669p0696q7099
17032A2382r2078R2234m3416J03265K73376P783l53177J20959J83030j3778j34664
17021A55916n7606J6514k80849N165K32664j06812j17579q1761J24107L3466j80033
17010b56808k048K4752J63501P7113j5028j65850j58522J25174n2428N1944P7036
16999a31164R9453P5726J1156K5216k85327p2327K81608m2688j10979J66970q561
16988I083j09283k50450n8022K71721Q3254J1674K39286n0937k05528J52424K43652
16977C36874L9008n5716l8381k45976r9957k01505N8806J04949J4381n4002J69149
16966B7630R9920m0085j66594j1840K40404l5682k35033M8321K17139n8088Q157
$$ y = [13602, 161622, 214932, 93804, 168016, 137760, -78251, -235687, -146492, 170177, 99481, 12382, -79696, 12538, -30878, 72387, 345763, 353546, 369, 121328, 304358, 290580, 155916, 98310, 114824, -166025, -160860, 71804, -35008, -152587, -234348, -110241, -76775, -256808, -258856, -234104, -70603, 6510, -8518, -174368, -332890, -207716, -260144, -208200, -131164, -31711, 44015, 55171, 80387, -204940, -277267, 4341, -38347, -149326, 17644, 9083, -100200, -350650, -408672, -136951, -53697, -42023, 197263, 146326, -59202, 93222, 336874, 375882, 320166, 281785, 35809, -64148, -265653, -206847, -101898, -87517, -141519, 27630, 127550, 87465, -79129, -90969, 149435, 113753, -121280, -72959, 144180, 86092, 94249]
16955I4249N4481j78730j10967j2097N5515K30509J10272l8497j35128j7820J45191
16944A96978q117k03060j09796l1944p3855N7448J92143J47472M131j9974J05856
16933B57282J15666K8110j8798l9288j37107k63334k7695J14199J03409J62258
16923B94702p4797k45498l2018j707j6667L9312k4900J12696J86918n5486j00311
16912H2244m6726M242n776K56930n3164o2927k69461l12878j03569K62137J52566
16901i6382K6794K34175K02888j53952p0778K0563j35279r6748N2195r642l61883
16890c88049Q7180K20176K3083N9552N4638J37056J38190j26752K3098j29200
16880I8972M4421o0409j84241j6345q5645j11178K68550J03379n3288j61605J30502
$$ y = [94249, 148730, -30000, -140967, -153064, -97549, 132960, 243232, 204735, 69607, 51787, 196978, 188861, -14199, -123995, -155939, -229794, -172346, 19797, 167269, 171400, 151426, 257282, 372948, 401058, 382260, 342972, 205865, -57469, -85164, 29035, 132444, 294702, 219905, -25593, -57611, -59318, -75985, -36673, -61573, 51123, 238041, 182555, 82244, 35518, 39760, 33984, 290914, 237750, 174823, -94638, -407516, -511085, -248948, -96382, -69588, 164587, 367475, 213523, 142745, 163308, 28029, -68719, -16524, -26166, -388049, -300869, -80693, -57610, 1942, 56580, 193636, 331826, 205074, 228172, 98972, 143393, 82984, -101257, -117602, -203247, -314425, -45875, 57504, 4216, -157389, -26887]
16869b6887J08137J64528K7513O6140q3805k85615L3922O3634j14507J3160j15765
16858a49545j95758J18495L48960J99970L0573L0910J03836o2086r5671j29013
16848B00671O5685j9490K9076R4619j33513q2547j54271j19912J88430q7674j07650
16837a26576K31707N8655j68490P6268R6531r749m1070M4678j3332j70659k08178
16826b30215J36351K26258N3616j91351j3127J81911j8449K1332o7021j45200
16816d5895k46756k40237o7529O6460R1555J47443P4968K7889j79613J70882J39027
16805f1806N7688j42410K23897R8148L2515k55559O9344k9934j81754r7693p692
16794b95256J16623J70845q8380M6140K4378k5175K04363k12815M1486J64751
$$ y = [-26887, 81250, 245778, 273291, 339431, 255626, -29989, 3933, 67567, -46940, -33780, -149545, -345303, -226808, 122152, 322122, 352695, 383605, 487441, 425355, 329684, 200671, 266356, 246866, 275942, 370561, 237048, 154501, 230, -119682, 68748, -18926, -126576, 105131, 163786, -4704, 71564, 168095, 158346, 117276, 161954, 148622, -22037, -230215, -93864, 132394, 186010, -5341, -18468, 163443, 144994, 166326, 99305, -45895, -292651, -532888, -600417, -533957, -442402, -294959, -219991, -192102, -371715, -200833, -61806, -4118, -146528, 77369, 175517, 208032, -47527, 21817, -8117, -189871, -287564, -295256, -178633, -7788, -96168, -50028, -25650, -50825, 153538, -59277, -17791, 146960]
16784A46960J74033j32591j33089m5582j19178r4640J08925j04951j07K28641
16774B8421R4293j39888K239j00352j64650R8663J83098o501j34766J00501J01435
16763F2493j08695L0234J42139K08762J3952k10231q90O9465J17340j00791j7878
16752B05900l2684j62538r2262N1579Q0098K6128n9516j55113J33198R3438o2146
16741B6082q4779q3951N0403O7104L0829k45764q2677P5276K07423P8496j67735
16730a29293j25395K0944J22737Q7816l6140r0238n6034Q7361O3570j03416J04638
16719e3450J7212o6461O8764K9345q8034j42303j20793J89044M7832j85000j75935
16708d79779l294K89941J93998J879Q5972M3679k0661j68356k15058j6976R3093
$$ y = [146960, 320993, 188402, 55313, 9731, -109447, -204087, -95162, -200113, -200220, 28421, 122714, -17174, -14935, -115287, -279937, -181274, 1824, -4677, -139443, -38942, 62493, -46202, -15968, 126171, 334933, 348885, 138654, 137764, 207229, 324569, 223778, 205900, 173216, 10678, -81584, -30005, 50093, 76221, 16705, -138408, -5210, 88228, 26082, -58697, -142648, -92245, -25141, 5688, -240076, -322753, -247477, -40054, 38442, -129293, -254688, -233744, -111007, -23191, -59331, -149569, -205603, -118242, -54672, -158088, -53450, -36238, -102699, -33935, -4590, -92624, -234927, -355720, -166676, -118844, -303844, -479779, -483073, -193132, 866, 2745, 88717, 132396, 111735, -56621, -271679, -288655, -195562]
16697a95562j2905J14431J63420J53093o7020j90962k05821j28375m7913J48497
16687b69117P4564n9712J1546L4713J08730N9078J6918o1981j7555J31591P6941
16676A05716j70867k43744j53377J22658k1165J29956N8239P5361K30651M3272
16666A76700J23591l17926p6454O7634j21753p3804O6827M2357o8220p3322J58819
16655i5551J23954J48173j55160n5294k5563J0203n6663K5918n527j26109M2524
16644a69095k4841P0587J31491J60770O9449k3874l57876k5770J21243j8875m0694
16633a07485n0624L6355R0567J37533N1278j08125J34380N6105J20847P3582k96807
16622A37606j56141j54118K2296R0200L0460m1897O2809K72798O2339o1723j47856
$$ y = [-195562, -208467, -94036, 69384, 222477, 155457, -35505, -241326, -369701, -417614, -269117, -194553, -254265, -242719, -208006, -99276, -40198, -23280, -85261, -102816, 28775, 105716, -65151, -308895, -462272, -339614, -360779, -230823, -172584, -97223, 133428, 176700, 300291, -17635, -94089, -26455, -148208, -222012, -155185, -112828, -181048, -254370, -95551, 28403, 176576, 21416, -33878, -59441, -49238, -105901, -79983, -85510, -211619, -169095, -193936, -123349, 8142, 168912, 238361, 214487, -143389, -169159, -47916, -66791, -107485, -158109, -121754, -31187, 106346, 157624, 49499, 183879, 239984, 360831, 434413, 137606, -18535, -172653, -150357, -60157, -29697, -71594, -8785, 264013, 326352, 264629, 116773]
16611A16773M4181o4676j57016O0415L3381j56597m2121l5582J20067J56650q5923
16600a0448j78764j55233L8541J86860J55902J54228J61506O3670j72267j23559
16590A20436j36234l4111K7649k5363l7377m767M6637j51183m8464J81217J24169
16579F2609J00075N1729m3067j32802j8681k8978j89797r7421J2733K06778J17510
16568D0688P4226r9593j09621r0119j9180K584K75805q5474j28321J58793L9162
16557E8950Q289m7067j6827j72777m1475P3563r9336P8027L4528P7560J11431
16546F4866N7979j36449J15024o0202L4009J97114M1542o6562k73977k14010j49022
16535c89688p4328J93315J79985N1270O8055j75551m2100M729l2401K11523J24244
$$ y = [116773, 160954, 96278, -60738, -323, 33058, -123539, -165660, -201242, -81175, 75475, -10448, -189212, -344445, -305904, -119044, 36858, 191086, 352592, 416262, 243995, 120436, -15798, -49909, -22260, -47623, -85000, -89767, -43130, -194313, -242777, -61560, 62609, 162684, 214413, 171346, 38544, 19863, -9115, -198912, -296333, -283600, -76822, 40688, 114914, 15321, -94300, -184419, -203599, -201015, 74790, -10684, -139005, 19788, 58950, 67239, 20172, 3345, -169432, -210907, -137344, -236680, -158653, -124125, -46565, 64866, 122845, -13604, 101420, 41218, 75227, 272341, 313883, 247321, -26656, -240666, -389688, -464016, -270701, -90716, -39446, 28609, -146942, -189042, -184313, -216714, -5191, 119053]
16524A19053j12883m8053K8122J84400K18312k20644j73165M1775P6343R6200
16514B09460L1860O1389p5713q609o4494p8247Q4891o4594l4741K4812j02791
16503a6777j40409J41262K06295j12360r5864J20921l4602j35912k66169o287
16493c39902N0631J06060K06451J31859J30332l1813j25471m9694O434K3792J7177
16482A25856Q2316K2515j38215j06255K6303O7113K7809j03855j85702J27094
16472e5021m5514o7963O6484q367p6825J52633R2524P3810J40826l252k50929
16461A8406o2714P5092K4164M0884j5854j39829k21208j80281J66542L07010n8081
16450d5869J7676k67309j18642K24243L38480M1028O8321p8935j40085j39104
$$ y = [119053, 6170, -41883, -13761, 170639, 388951, 168307, -4858, 36917, 113260, 209460, 241320, 302709, 226996, 218387, 153893, 75646, 160537, 95943, 61202, 86014, -16777, -157186, -15924, 190371, 78011, -17853, 103068, 68466, -67446, -333615, -339902, -289271, -183211, 23240, 155099, 285431, 253618, 128147, 78453, 84887, 108679, 125856, 208172, 230687, 92472, -13783, 12520, 79633, 107442, 3587, -182115, -55021, -100535, -168498, -102014, -110381, -187206, -34573, 57951, 131761, 272587, 269335, 18406, -44308, 30784, 54948, 95832, 79978, -59851, -281059, -461340, -294798, 12212, -45869, -28193, -295502, -414144, -189901, 148579, 189607, 257928, 178993, 38908, -100196]
16440a00196r2383M1965o3152k2113j60069N7596J55338K05820J88104J32304
16430C43214j12905n301k3549l4946J0916o0932q0143M2613j48321j4827l5912
16419a20093N1958J55586O8808M9730K46844j85686j69288J76874L0766j01757
16409B03742k62805m267o2284R923j06928q2711n0758q4618P94Q7246Q8412J2310
16397b51944j25010J0490J68306J26968q6459K27973J25603j15689Q2199J99972
16387C62409J7914j83492Q5773L16415j61320j95577o8375O0610k58800j46566
16377a71009K29563J23317o0185l9005j55718l9681j75620j42129K7422J8604
16367c84441J69707J99095k6827K7108j4464j26632p4639k8145J93970K74710
$$ y = [-100196, -192579, -150614, -213766, -235879, -395948, -338352, -183014, 22806, 210910, 343214, 230309, 225008, 201459, 166513, 177429, 116497, 36354, 78967, -69354, -84181, -120093, -68135, 87451, 156259, 205989, 452833, 267147, 97859, 274733, 305499, 203742, -59063, -63330, -125614, -115691, -222619, -305330, -356088, -440706, -439912, -352666, -264254, -251944, -376954, -366464, -198158, -71190, -157649, 70324, 195927, 80238, 162437, 362409, 380323, 196831, 282604, 599019, 437699, 242122, 173747, 234357, -24443, -171009, 58554, 181871, 121686, 82681, -73037, -112718, -288338, -430467, -403045, -384441, -214734, -15639, -42466, -15358, -29822, -156454, -231093, -259238, -65268, 209442]
16357B09442n0770k09362j20968J59974J30521N3898j97834j66454q5271L6206
16347b40618j16803J1300K12297J51525k17143K7925k57603k14577O8184K63359
16337c12154J13845J82266R9633j49102m1139m5350k8658N8247k5395J5147M1649
16326i1011J45310J32505j0589j52716K36462k8320k66178r4888k62281j27718
16316e19424J48807j1977q4940J23339J64103J44462J77644J04414R2320o7908
16306B70840R7273k26680j28273j31282j00783j63382P9621J59002l335J2178
16296a34821l5107L094J0351J51441j03363P61K4199J5412q4571j1971m280J69932
16284A077o6389j99698q8979J36848K17423j93123j17074J93300J93490J11654
$$ y = [209442, 158672, -50690, -171658, -11684, 118837, 172735, -25099, -191553, -276824, -240618, -357421, -346121, -133824, 17701, -199442, -171517, -429120, -643697, -575513, -312154, -198309, -16043, 83590, -65512, -106651, -152001, -180659, -122412, -147807, -132660, -91011, 54299, 186804, 176215, 23499, 259961, 231641, -34537, -129425, -391706, -519424, -370617, -382594, -467534, -344195, -180092, -35630, 142014, 246428, 338748, 270840, 368113, 141433, 13160, -118122, -218905, -382287, -302666, -143664, -146999, -134821, -169928, -166834, -156483, -5042, -108405, -107644, -83445, -68033, -152604, -164575, -168855, 1077, -65312, -265010, -353989, -217141, 282, -192841, -309915, -116615, 76875, 188529]
16274A88529j56664k1462K08629Q0260j86494q1287o7488n2197j11156j05800
16264c05130O973J95647K80121J42074L5112m3433P6029N9752k00943k89855k06507
16253b50160j30032J33287K13790K1783l1070R8131R5598P9176p0336L1580K2668
16242B14415l97629k51978M7058J54890J34498K23531j8858q3765p6291K6498
16232b7631J20897k06N5736L8530n7765o3331l5545n4642L4585o6390R8757J08005
16220A51000j71026j00754p7742p2403r880R3583P3943J74301L3705L048m7894
16209D9881o7598O9083J23112k03422j92176K5406J06703N170L9588j09875j65592
16198c19720j06600K49698L08826O981k20029j65365J04777R4001j2613R9493
$$ y = [188529, 31865, 10403, 219032, 299292, 112798, 31511, -35977, -88174, -199330, -305130, -298157, -102510, 177611, 319685, 354797, 311364, 387393, 447145, 246202, -43653, -250160, -380192, -246905, -33115, -11332, -42402, 55729, 151327, 230503, 160167, 191747, 214415, -183214, -435192, -388134, -233244, -98746, 124785, 105927, 22162, -54129, -27631, 93266, 93060, 148796, 187326, 129561, 66230, 30685, -23957, 10628, -55762, 42995, 151000, -20026, -120780, -198522, -270925, -280805, -187222, -113279, 61022, 94727, 97775, 49881, -17717, 51366, 174478, -28944, -221120, -195714, -89011, -83841, -44253, -154128, -319720, -426320, -176622, 132204, 139185, -80844, -246209, -141432, -47431, -60044, 39449]
16188C9449j38846L4089K31122q477J6836l2981j4168k7342J13291N4124j78549
16177H8548j30187J22298J08762J2141J04386r9781m3783k74547j16743n856J6892
16166b17870j6391K29979M8034p6761k9088o868J10603j71404j40961K637P3472
16155a94618K59925N0417J04116J19033l6152j70814o9718M249j34204L6060J99328
16144A67622J00090p2992j89373n1329j45651n5631j3657K00164p1486k01811
16134c34054J54642J35324J85080n2680l04222n0953j7597L9027J37426J50605
16124D2598J21563k89481R81L0958k067L0086j48986j26220K0269J11026j6414
16113b25687k7676K35855K10249l64348J1174J56096j30039l0280P3639n1335
$$ y = [39449, -99397, -65308, 165814, 157337, 174173, 141192, 127024, 99682, 212973, 267097, 88548, -41639, 80659, 189421, 201562, 305948, 206167, 162384, -112163, -228906, -234762, -217870, -234261, -4282, 43752, -33009, -62097, -68965, 41638, -129766, -270727, -268090, -194618, 65307, 115724, 219840, 338873, 302721, 131907, 62189, 66438, -67766, -31706, 167622, 267712, 194720, 5347, -45982, -191633, -247264, -260921, -60757, -132243, -334054, -179412, -44088, 140992, 88312, -215910, -266863, -284460, -245433, -108007, 42598, 164161, -125320, -124339, -93381, -95448, -65362, -214348, -340568, -320299, -209273, -225687, -253363, -17508, 192741, -171607, -160433, -4337, -134376, -164656, -91017, -142352]
16103a42352j1808j7923k3156k8250o2336J09261R2824j91397j22743M5010K63129
16092h9741J14202R3092n6651k06413q6025j14518q478L14702M5806k82421j10881
16081c87326K62262n3462j8591L8011j27259J19864K00605O7627Q6822M9270k4132
16070B13691j24466q9648J12293p1738n4018P4558K4421k2749j03005O3621j19268
16059i6308k26092J54789J58101R8760O0788L224q0449q0012k07138j1773l8560
16048b64670Q3654J53067K30310J12529o568j28326j24011p382j02234Q171K5886
16037a9574J26510j58436j53476O4401q6976l6946P9112P9724J91502J76234p6580
16026A85495K7415j11513r8804k9377j29889j5565P6098p97Q0366J19081J886
$$ y = [-142352, -154160, -172083, -195239, -223489, -285825, -176564, -83740, -275137, -397880, -352870, -89741, 24461, 117553, 60902, -145511, -231536, -346054, -354532, -39830, 5976, -276445, -387326, -125064, -178526, -197117, -159106, -286365, -166501, 34104, 101731, 188553, 237823, 213691, 89225, -423, 111870, 40132, -13886, 60672, 85093, 62344, -40661, 22960, -96308, -322400, -167611, -9510, 89250, 150038, 153262, 72813, -7199, -214337, -226110, -264670, -181016, -27949, 202361, 314890, 308322, 179996, 55985, 48603, -53631, -45460, -19574, 106936, -51500, -204976, -140575, -227551, -264497, -185385, -105661, 85841, 262075, 185495, 212910, 101397, 2593, -26784, -156673, -172238, -96140, -96937, -16571, 102510, 104396]
16015A04396j10363O1034j05788l2831J07585j05235m7842N8998J35900j49732
16005h3878k3437J97989l6845m8567m5520j1733M4499J68801j00016l22193r6387
15994c57287P2015J24521J20420J22404j4412k00899L6553J73316J60629L0351
15984B67611j08837k94233j21616j8044M3468K69163j4076m903M5974L4117J65030
15973B63654j47400j42955K6581o1087j28135K665O4941O3055J08820Q2914K8044
15962A61097j25697k0765l8688N9089k3721k30386r8923J23175L2471j8668J19561
15951f1455l0667j90419j51564n9681M8409O9358R4234J72174K27397K29680j00297
15940B47169j68636P8879J32452o4470m8470k0740J05069J64422l9432j52505
$$ y = [104396, -5967, 55067, -50721, -83552, 24033, -81202, -129044, -70046, 65854, -83878, -107315, 90674, 53829, 5262, -40258, -51991, -7492, 161309, 61293, -260900, -357287, -285272, -160751, -40331, 82073, 67661, -133238, -96685, 76631, 237260, 267611, 158774, -135459, -257075, -275119, -231651, 37512, 23436, 18533, 64507, 98624, 263654, 116254, -26701, -120, -61207, -189342, -186677, -121736, -58681, 50139, 133053, 161097, 35400, 14635, -24053, 35036, 11315, -219071, -317994, -194819, -162348, -181016, -61455, -92122, -282541, -434105, -493786, -445377, -376019, -281785, -109611, 117786, 347466, 247169, 78533, 157412, 289864, 225394, 176924, 156184, 261253, 425675, 386243, 233738]
15930B33738N1467k38795j70780K1716k7523O3037k343R0057J00937l315k88904
15919a70708k25394K82885L4449p4323l3990K46605J86167j30721j34008l0916
15909d9954J66923Q4295Q834l03286q2365o7976r923J90053K9868j777p4508l5670
15897a45486J49422j979j32381J660J76356k1782L6361k8959j04879Q3086j05155
15886i3736Q07M3299q3898j10551J10195j0129M978o3173j14669j61912R8985
15875c79804J05605J07769L36123K8479J44249j35951j10863k03470j83165O1373
15865b29655l0907L3995J12092J45432J46964j71936k18846m3226K82300J25018
15855A51231n6227j68133j90476M258l1253J66033L1093o430O7247P6259P4901
$$ y = [233738, 285205, 46410, -124370, -102654, -130177, -67140, -69483, 20574, 121511, 118196, -170708, -396102, -113217, -78768, -153091, -187081, 59524, 245691, 114970, -19038, -49954, 116969, 201264, 210098, -93188, -175553, -243529, -253452, -63399, -33531, -35308, -109816, -145486, 3936, 1957, -130424, -128764, 47592, 25810, 62171, 33212, -71667, 11419, -93736, -92929, -49630, -133528, -244079, -133884, -144013, -139035, -202208, -316877, -478789, -379804, -274199, -166430, 169693, 198172, 342421, 206470, 95607, -107863, -291028, -229655, -260562, -226567, -114475, 30957, 177921, 5985, -212861, -256087, 26213, 151231, 95004, -73129, -263605, -259347, -290600, -124567, -93474, -99904, -32657, 43602, 118503]
15844A18503K21494L8897k17609k333k745j42110p9007o9374O2528q8706J93337
15833C2875J41898m0755k56377j52113N5415O1740P2078J12437O9638J9524J12196
15822B28556J1249j45389q6922m5873P0898J60289n9420J1973J4406J89067j54196
15811A94638k35760j23635q4556K45400J66867k33008L751J39737J09676J10735
15801B93845j7668J6478O581k76527q9690J87096J83818l8772j12294j7762k9759
15790A05346J44128k53403j72216j07331J05265J69173l7736o4891L9477N7404
15780a4784l062j46720l0323p1337K71018j9256j57013J7208J21989J13037O5133
15769A45890j15011m033J06485n6776n9510J2225J93509N112j93863p6860l9127
$$ y = [118503, 339997, 378894, 161285, 158952, 156207, 14097, -64910, -134284, -71756, -160462, 32875, 174773, 134018, -122359, -274472, -219057, -157317, -85239, 27198, 96836, 116360, 228556, 239805, 94416, 7494, -38379, 32519, 192808, 133388, 145361, 159767, 348834, 194638, -41122, -164757, -249313, -3913, 162954, -70054, -66303, 73434, 183110, 293845, 276177, 292655, 299236, 22709, -66981, 120115, 303933, 265161, 152867, 135105, 105346, 249474, -3929, -176145, -283476, -178211, -9038, -46774, -111665, -72188, -14784, -17846, -164566, -194889, -266226, 4792, -14464, -171477, -154269, -32280, 80757, 145890, 30879, 26846, 133331, 76555, 17045, 29270, 222779, 227891, 34028, -42832, -81959]
15758h1959N0070l5847k4174O5918j52998J13377L7760q6291K04351k7446q4577
15747b1816j23038J2053m3674P456k06769J57J01640p9143K29793m9064n1689
15736b24094J81783q5437l2961j47150k7747K21530j7779L5244O4704N6067j07828
15725h3668j21623L6313J25965J37803j86847J19034J18381j5888J96363J3682
15715C39515r6877q1873o9708r2028l4712J09596j8256N0125J56087j3061r2846
15704A55962J7128N1367J01719k0513J48667J30207k09839j75012o50j52846p6224
15693c0034n4105m3518M7536J8621J39907N2249R013Q5095q9082k2224N0540L2671
15681A96669j81065J6387J86070N1569j26337j42848J41854j0716O829P3422J48933
$$ y = [-81959, -31889, -67736, -91910, -25992, -178990, -65613, -27853, -114144, 90207, 62761, -21816, -144854, -132801, -176475, -169019, -375788, -375631, -273991, -353134, -123341, -172405, -224094, -42311, -127748, -160709, -307859, -335606, -114076, -131855, -96611, -31907, 24160, -83668, -205291, -168978, -43013, 94790, -92057, 26977, 145358, 129470, 325833, 339515, 242638, 160765, 91057, -971, -35683, 73913, 55657, 105782, 261869, 248808, 155962, 173090, 224457, 326176, 305663, 454330, 584537, 374698, 199686, 199036, 46190, -30034, -84139, -127657, -80121, -61500, 78407, 130656, 139669, 224764, 135682, 113458, 163998, 196669, 15604, 31991, 218061, 269630, 143293, 445, 142299, 131583, 138412, 211834, 360767]
15670C60767j12518j83638m5432q4607R300o0648K5224K21135L5320J04253j70904
15659I8252k59607n5241p1318K9905n6697J23010L7809k5093L3219k2701n1563
15648b20025K6610K33708J12142l37333K7097N9174K42841L4674r6006Q7488L4513
15637B04883j97344K7068N1896P0009p9234o4867P5271N7817n344k44639l3256
15626a37740J09155J44385N7308j27860j4833k14026q2867m5311P0838N7262M5508
15615a38181J31539m1572J9883J5360j13169Q9954j09638L1526Q0550j5895J26537
15604G6894L5854k46967m2185J29790J21898j20526q8571J26233J22806n3177
15594F2049Q75r3538P9898n0342n8160K29256L68348j98615j68306M9231P9344
$$ y = [360767, 248249, 64611, 19179, -65428, -56128, -116776, -91552, 129583, 164903, 269156, 98252, -161355, -216596, -287914, -258009, -314706, -191696, -153887, -178980, -145761, -168462, -220025, -193415, 40293, 152435, -184898, -157801, -98627, 144214, 178888, 82882, 170370, 204883, 7539, 34607, 86503, 156512, 77278, 12411, 87682, 145499, 140155, -104484, -137740, -28585, 115800, 173108, 45248, 30415, -183611, -266478, -311789, -240951, -183689, -138181, -6642, -48214, -28331, -12971, -126140, -36186, -145824, -114298, -33748, -49643, 76894, 112748, -134219, -176404, -46614, 75284, -45242, -133813, -7580, 115226, 62049, 62924, -30614, 49284, -1058, -59218, 170038, 538386, 339771, 171465, 220696, 300040]
15583C00040j98706j51234j00662P5261L74128J32897p8354j66547p7929o930
15573A01964O5887j38315p1593J31904K45192q9353j14782l7205R656L3281j21008
15562A5628k3397q795M6156J33868J99819K5714j86597m1545n4926k64269n1481
15551b09825j0872Q1230n299R3245j66349q2597m0557m006K41224Q9620J66140
15540A51954j6127j26056j87202j8458p7915R6386J28425J10349J97706k5167
15530B33895j11913q6639r4628j64556K42288M09829m5671o8562Q5277j15012
15520B84308l7392j47313j97414q4761K02088L5760J14783J11195q0519j00638
15510A00097j48614K9J95269J22489J70028j75697k05953O928l8377n3158K05426
$$ y = [300040, 101334, -49900, -150562, -75301, 298827, 431724, 353370, 186823, 108894, 101964, 167851, 29536, -42057, 89847, 335039, 245686, 130904, 93699, 103355, 136636, 15628, -7769, -16564, 29592, 163460, 363279, 388993, 202396, 160851, 105925, -158344, -209825, -220697, -139467, -144766, -51521, -217870, -300467, -341024, -345030, -103806, -14186, 151954, 135827, 9771, -177431, -195889, -273804, -177418, -48993, 61356, 259062, 233895, 121982, 35343, -59285, -223841, 18447, 428276, 382605, 314043, 399320, 284308, 246916, 99603, -97811, -182572, 19516, 55276, 170059, 281254, 200735, 100097, -48517, -48488, 146781, 269270, 439298, 263601, 57648, 64576, 26199, -26959, 178467]
15499A78467j25740N0419N9306j2935k27737q3286K43750R38j47250J6028k6778
15488g4818N7776M5319J34971l1450m0401P7219L3651k3074o060l4919m0337N1431
15476A49308J71132J1568k14655k77590P1338p0688J37133J83668P5157M3799
15466B80170M4907o1774j37240k03400K2653L3039k8724N5946l0672M5818j52550
15455a31827o25J24243j636j175k2710m7143J27253p1953r6630P5526j51353n2270
15443b50300J93208J16275K1974P3470J45099j11004k11740j22292Q4461J84292
15433A23443L096o9732K18607p0744r6580j6495Q0023Q3793k02476n1329K76768
15422B78374j08228q1092M6511J3962Q4254r8740j8495j04392P1222J93098N2178
$$ y = [178467, 52727, 103146, 162452, 149517, -78220, -161506, 82244, 83182, -64068, -48040, -74818, -17042, 28277, 163248, 131798, 91397, 168616, 202267, 179193, 173133, 138214, 97877, 149308, 320440, 332008, 117353, -160237, -88899, -159587, -22454, 161214, 236371, 280170, 325077, 263303, 126063, -77337, -54684, -21645, -50369, 5577, -25095, 20723, -131827, -132452, -8209, -9845, -11020, -33730, -80873, 46380, -25573, -122203, -46677, -198030, -250300, -57092, 59183, 81157, 154627, 299726, 188722, -23018, -145310, -60849, 123443, 126539, 56807, 275414, 204670, 108090, 91595, 171618, 255411, 52935, 1606, 278374, 170146, 89054, 135565, 149527, 233781, 135041, 116546, 12154, 83376, 276474, 328652]
15411C28652L9370j45415j07044m5668L8536j12390J02513K12857J11408r3754
15401C29065k46244j42538P4769R2281O6833N4665M1509k54990j75592O7017k9667
15390a22892r6914k0083K60899J18773Q9210J04854J02517p3215l13641J37583
15380A87091l5800M1018j1665j35434R164R0819p6268l4719L1366K3679P1629
15369A60880J431j9608n0065N1411P3085J81269q901o4170l55285k04779L5369
15358a99363k8906K10305K00251o8246j53396j61973K7339M3983J15254K18513
15348B03761P2380r5684k1164J8309k2525k17476J49822j1711o9499q0454l2449
15337a06690O0992L22333j4137j98634K37491k1405q8590k33144J91730q5778
$$ y = [328652, 368022, 222607, 115563, 69895, 108431, -3959, 98554, 311411, 422819, 329065, 82821, -59717, 15052, 107333, 174166, 228831, 270340, 15350, -160242, -93225, -122892, -219806, -239889, 21010, 139783, 228993, 333847, 436364, 363149, 49508, 187091, 151291, 192309, 180644, 45210, 54374, 145193, 68925, 34206, 65572, 89251, 160880, 162311, 142703, 92638, 144049, 217134, 398403, 389502, 325332, -29953, -234732, -199363, -228269, -17964, 182287, 114041, -39355, -201328, -173989, -130006, -14752, 203761, 276141, 180457, 159293, 177602, 155077, -62399, 87423, 75712, 6213, -74241, -106690, -45698, 276635, 262498, 63864, 301355, 279950, 191360, -41784, 149946, 64168]
15327F4168k39401J9721M6556J35366O1764j8837K21407n0022j47715l3217k06135
15316a46345j08053k7656j41675K5360K12347K67547k2436j74351l0950k2938
15306a69150J07062P0549M3956R6222p4591k61561j24881R462J68204n6992J76823
15295a4897J55423o3790q1855j6104M231j7271P9885J26497l8555j41703o0246
15284f8385p4446j71290J18304J21815K6057K00928P9824j48183J5714j03347
15274c009r035o9041O2379K2787j81693j32787J57424J64353O4268N0192l3543
15263I2295l5673j07938q2733p6921K68669J67375k70380J3178K2943O4308Q3212
15252A38335K4693K66199N1199j7841j30887k95775l38082o303J47909p9804P0816
$$ y = [64168, -175233, -155512, -108956, 26410, 88174, 69337, 290744, 240722, 93007, 59790, -146345, -254398, -282054, -423729, -398369, -186022, 81525, 59089, -115262, -146212, -169150, -62088, 8461, 52417, 148639, 74048, -187513, -312394, -302932, -134728, -191720, -14897, 140526, 76736, -5119, -21223, -16992, -34263, 45622, 172119, 133564, -8139, -68385, -142831, -314121, -195817, -74002, -47945, 152983, 232807, 84624, 100338, -3009, -12044, -81085, -18706, 4081, -177612, -310399, -152975, 11378, 75646, 125838, 92295, 56622, -51316, -134049, -210970, 57699, 225074, -45306, -32128, -9185, 55123, 138335, 163028, 429227, 480426, 462585, 331698, 35923, -302159, -308462, -160553, -240357, -169541]
15241a69541M4353J14562J06049p6936P9605L0721o2660J92030k28666n6848J76340
15230A49009p9233J12956J26729L6849j8609q6595j30300m588p903n7243l06059
15219b64987j13858J4968K88305J72556J0824k5609q8260R5336O7209o029j01792
15208D8663J713P2306j83346p5281J00858O1468o4574k54036O8361O9822J74073
15197B0027K8891J05947l8754k06469J8638J6130J83963K9049j45204j1564n4131
15186e3477R3388K6726j31419N944J43246J16060j21507O4850K3337j73888K12227
15175B05487K88511j3600k92976j31590J45535n7534k93448M240L02091J62137
15165C18853Q0444O0809k6965Q869K0680k40366j16361J43573m7100j69815K440
$$ y = [-169541, -125188, -10626, 95423, 18487, 98092, 128813, 66153, 258183, 29517, -27331, 149009, 69776, 182732, 309461, 346310, 327701, 241106, 110806, 106218, 98315, 41072, -264987, -378845, -363877, -75572, 96984, 107808, 82199, -6061, 89275, 156484, 150455, 48663, 50376, 122682, -60664, -135945, -35087, 26381, -38193, -292229, -223868, -154046, 20027, 48918, 154865, 116111, -90358, -71720, -55590, 128373, 157422, 12218, 654, -53477, 39911, 66637, -64782, -58838, 84408, 200468, 78961, 143811, 167148, -6740, 205487, 493998, 480398, 187422, 55832, 201367, 143833, -149615, -145375, 156716, 318853, 399297, 460106, 433141, 442010, 462690, 222324, 105963, 249536, 202436, 32621, 35061]
15154C5061K2352j72355r434J28203K2276k6927m2429J50796p1347j16555j53885
15143b34244j10394Q4086J17075p5368q493P6300m2223M2764o1211J63303J07776
15132E9371o1034n3838N6786q4769q2305m4494j76106K48337R3232j66402q7813
15121b99035J04916J30653N3712n278q9329J39154J0338n81o1511J44841R9762
15110B27642j46227j95396p8756q4761K89028J31207q8786L1562J01318L8982
15100B25813m6077j86224j11217J18769K7142O4271J44469R725k24682q9176J20028
15089E2841j8129l7335q4238J20578J61365O3656q5634k86367j23152J63267J43682
15078G0534l4386n0622j02539j2484k3257J05385K78755J71051P9803r4780n35383
$$ y = [35061, 57413, -114942, -124376, 3827, 26103, -824, -43253, 107543, 36196, -80359, -234244, -344638, -260552, -143477, -218845, -227338, -151038, -193261, -150497, -211708, -48405, 59371, -1663, -55501, 1285, -83484, -165789, -210283, -386389, -138052, -44820, -211222, -299035, -194119, -63466, -9754, -15032, -104361, 34793, 45131, 44550, -16961, 127880, 227642, 81415, -113981, -192737, -277498, 11530, 142737, 53951, 85513, 186831, 225813, 179736, -6488, -117705, 1064, 28206, 92477, 236946, 246671, 21989, -67187, 52841, 34712, -2623, -86861, 33717, 195082, 258738, 173104, -113263, -236415, -73148, 70534, 36148, -14474, -117013, -129497, -152754, -47369, 231386, 402437, 482240, 387460, -147923]
15067a47923k4190J45153J25617j89573j71567j12223M6381o6898Q4769J55968
15057a54486n7284M7012L97279J81042j55869j24729q6691J38536j39755j89853
15047a44798O5551J11920k3323j44092K17788P1235p9936j12164k6691M2993k41730
15036b63247l2539J71789K4770r8474j14250o1639L1268Q4619J83598j15482K587
15025a87000j4038M9860q3576J80323j17286q3084J82401J20152M259k42829k19786
15014d10604N4566j5576O6362L230R9092j29664j6796O9636o2915P4642r989j28613
15002d06629J31740K10843O7456L3596J4815j40817R0850L6075J02543k57986
14992a17514k66958J74879L4482J05130j8067Q6067N3338j03686k6747N2884k3318
$$ y = [-147923, -172113, -26960, 98657, -90916, -262483, -374706, -328325, -395223, -310454, -154486, -211770, -164758, 232521, 413563, 257694, 132965, 46274, 184810, 45055, -144798, -79247, 32673, 9350, -134742, 83046, 154281, 74345, -37819, -64510, -21517, -263247, -295786, -123997, -99227, -197701, -311951, -373590, -342322, -257703, -74105, -189587, -187000, -201038, -151178, -234754, -54431, -171717, -254801, -72400, 47752, 52011, -190818, -410604, -356038, -371614, -305252, -302022, -202930, -332594, -349390, -279754, -342669, -268027, -278016, -406629, -274889, -64046, 3410, 37006, 51821, -88996, 1854, 37929, 140472, -117514, -384472, -209593, -175111, -69981, -88048, -1981, 51357, -52329, -79076, -26192, -49510]
14981d9510J77832j45603m9699L20728L3184j43975N545j69742j38417L1155J07750
14970b0752N7830m3552r7618j25k48823O3470J90670M4667J4628J13644q0364
14959f325j9157J39730J41322r170j39601N4098j03842L601m4745K8849j00476
14948e5716J92298j4020l2349Q6443l6898j36976n5363n9651K4718O0959J17835
14937I1280K9722q7047j08033K40228r0k7946M4327K3510m0400R5125N351P9141
14925C45168q9765m8718k8109J49614q031q2074k9710r7449j34126q5594n114
14914a13908k4950L3191n2077j03788L2783J07685J92543j850r6554j72071L25596
14903A26600J905j63866j8817J18559J14584j20950L1171j11111k7358J75045
$$ y = [-49510, 128322, -17281, -66980, 253748, 286932, 142957, 148502, -21240, -159657, -128502, -20752, 37078, -6474, -104092, -104217, -353040, -289570, -98900, -54233, -39605, 74039, -6325, -25482, 114248, 255570, 246400, 106799, 160897, 57055, 60656, 15911, 44760, -55716, 136582, 122562, 90213, 176656, 139758, 2782, -52581, -112232, -87514, -26555, 91280, 121002, 33955, -74078, 166150, 166060, 138114, 182441, 205951, 165551, 260676, 266027, 345168, 255403, 206685, 178576, 328190, 320159, 238085, 208375, 110926, -23200, -108794, -113908, -138858, -105667, -157744, -261532, -228749, -121064, 71479, 69629, -26925, -198996, 126600, 128505, -35361, -54178, 64381, 178965, 58015, 89186, -21925, -49283, 125762]
14893A25762J13038q3317j80921j16629K02893J2655M2872j0877o1486n9404L814
14882a1600q2999N3161j1317j97807j41426Q5876P2796L9381q503J15668j1169
14871i7939J1628q6896J44148K81701j32683j86435o2982m9818N2125O3773j596
14860f4974N5658l8546l7617L136J0716k24923m3828p6897M2613N7904K36190
14849h0568P822Q88m102J9156l3468j49086P6284M9330l2958M5452J48769k5974
14837B1545m6505j77243j7641J99211J22186Q9277L1709j07599j24269n3912J080
14826f2161J64299J04890r7742j7897J8529J23998K7692J2577j40365j16840q3866
14815f6886p0706J50391P2160q4077J7622l4876p5053r4084L46239J21429J623
$$ y = [125762, 238800, 155483, -25438, -142067, 60826, 73481, 116353, 105476, 43990, -15414, -11600, -94599, -41438, -52755, -250562, -391988, -306112, -233316, -193935, -202438, -86770, -97939, -86311, -173207, -29059, 252642, 119959, -66476, -129458, -179276, -127151, -63378, -64974, -9316, -47862, -85479, -82343, -71627, -296550, -340378, -417275, -374662, -316758, -80568, -72746, -71858, -75960, -56804, -90272, -239358, -163074, -113744, -146702, -101250, 47519, 21545, -24960, -202203, -219844, -20633, 101553, 190830, 222539, 114940, -9329, -63241, -62161, 102138, 207028, 109286, 91389, 109918, 233916, 261608, 274185, 133820, 16980, -66886, -137592, 12799, 84959, 882, 18504, -16372, -91425, -185509, 160730, 282159, 283782]
14804B83782m857p7245l9290J00636M8875j99220N3330J70680J62448k37381k71520
14793i762l28758m5317P3469N6550r9750N0651J79633K90681J66405o3852L9951
14782C09901j02552k35537j77378K4074j00601q4335J2981l673J53513J72245
14772c1362j04553j12221q7393j3210m7655K520Q8842N2931k4870m2329P8124
14761b41176j5652K12304J73060o1419l1356J39503j20691k08183J02237K1494
14751b9879o7630Q0569j0025l420l4939K8661J53034K69234J93039j22214j96837
14740B59593l6187k00249m2084J19867o1489R8228K01827m7232n7263K10140j34973
14729C10178j21239K4955j30828j11820J20404J15555K2097k8060j4202o5659
$$ y = [283782, 278925, 201680, 162390, 263026, 311901, 112681, 166011, 336691, 499139, 261758, -9762, -338520, -383837, -310368, -253818, -353568, -302917, -123284, 167397, 333802, 269950, 309901, 207349, -28188, -205566, -181492, -282093, -366428, -353447, -357120, -203607, -31362, -135915, -248136, -335529, -348739, -396394, -393874, -305032, -252101, -276971, -319300, -241176, -256828, -44524, 128536, 67117, 35761, 175264, 54573, -153610, -51373, -29879, -97509, -16940, -26965, -30385, -65324, -36663, 116371, 385605, 578644, 456430, 259593, 223406, 23157, -18927, 100940, 39451, 137679, 339506, 292274, 235011, 445151, 310178, 188939, 213894, 83066, -28754, 91650, 207205, 229302, 201242, 187040, 121381]
14719A21381j18657Q6967n3988J9361J60090J43992n2754j63105J44476J08700
14709C96463n6593k21559k17734L6293O7557P2683J78254J83812o2789j20608
14699B55779J92846k8721j84796r7866k38536R0167Q9246j30340N711J41024P2156
14688A66670m5751K3528j61817l8499P4921K75684l7228j03701p2759K5349J31191
14677B37588j86769j32374J62063m178l9170j03645J40860O44m0400P6567J32225
14666B43411O8262l497K13628J83451j29647j68523k84722k66629n8212R0885
14656a11593j35097K2154K73555K02383n42P5314j00485j44587N0280q1611j01629
14645e1858Q6201J32093K6440k36810j7905P0782N6001l2320r0025M1358J06614
$$ y = [121381, 2724, 89691, 35703, 55064, 215154, 359146, 306392, 143287, 287763, 396463, 339870, 118311, -99423, -63130, 4427, 77110, 255364, 439176, 376387, 255779, 448625, 419904, 235108, 137242, -101294, -11127, 78119, -52221, -46510, 94514, 166670, 120919, 144447, -17370, -55869, 19052, 294736, 257508, 153807, 81048, 106397, 237588, 50819, -81555, 80508, 76330, 37160, -66485, 74375, 75019, 34619, 111186, 243411, 311673, 308176, 521804, 705255, 575608, 407085, 122363, -144266, -202478, -111593, -246690, -224536, 49019, 251402, 250860, 326174, 225689, 81102, 131382, 49771, -51858, 34343, 166436, 192876, -43934, -61839, 8943, 64944, 32624, -57401, -16043, 90571]
14634I0571J70047R6392m3134k36863k84646n2602k1953K15405J67634n3232o8210
14623b0591Q9465j7258k6127M8142q1066J31923R4706m6893l08237r1311K23056
14612d191J09464R4089p3372j60266j58718j00326K17123R5266L5497P2264R0623
14601B17453J38148k37127l6088J36138P734O7396J07966L5886l4504k23178p7736
14590A02088j19484k0881J68905L06154p784k37587k69562q2681m4503R7187P2844
14579c5304J04904r5j86831o8852K16477O6351K17648Q8938K6032k64919j91112
14568b6763k726J16787O7913R8746j00768j40978j76145j92891K70159J40562
14558E3896O2216l2040j40448k1177j8979j52495K26015K61064l0840r2026j2827
$$ y = [90571, 260618, 357010, 313876, 77013, -207633, -260235, -282188, -66783, 100851, 47619, -20591, 68874, 51616, 25489, 73631, -7435, 124488, 219194, 172301, -135936, -227247, -4191, 105273, 199362, 125990, -34276, -192994, -293320, -76197, 19069, 54566, 126830, 217453, 355601, 118474, 82386, 218524, 226258, 293654, 401620, 437506, 403002, 179824, 102088, -17396, -38277, 130628, 436782, 428998, 191411, -78151, -160832, -205335, -108148, -35304, 69600, 69505, -117326, -186178, 30299, 96650, 314298, 403236, 429268, 164349, -26763, -29489, 87298, 155211, 253957, 153189, 12211, -163934, -356825, -86666, 53896, 116112, 84072, -56376, -77553, -96532, -249027, -23012, 238052, 207212, 115186, 102359]
14547A02359J84092n4231j44823l5237j5313Q4249n9985l0032p7481q2446r581
14536a38429J27482k64471J45802K02727n8393k17574M4579L28095N3857O5178
14526B88853J6300M9640p4813j429J93045J45180r0458o6923Q7682M191m6314
14515E04954j64900k06578Q3056J80660q0481p2166j93057l2379O5588j8093K4619
14504I1223O3210p5138j04304K7524k04099J40882K34898J20424p7459J00306
14494C17467K6886j19784j87380M8752k5257J61992J82885o4058q2474L133j52400
14483A09762K3471J06675Q1859L1626n880m0290j03988L01843J74989L0326j55312
14472E55081m2335L3856K41869K45042N00134K55953K54390o8350j08002K07463
$$ y = [102359, 286451, 232220, 87397, 52160, 36847, 121096, 61111, 31079, -46402, -128848, -138429, -10947, -275418, -129616, 73111, 14718, -202856, -158277, 169818, 223675, 288853, 305153, 354793, 279980, 278551, 471596, 616776, 526318, 459395, 547077, 551268, 504954, 340054, 133476, 216532, 397192, 316711, 244545, 51488, 19109, 84697, 66604, 91223, 154433, 79295, -25009, 2515, -201584, -60702, 174196, 294620, 217161, 317467, 344353, 224569, 37189, 85941, 60684, 222676, 405561, 341503, 259029, 262162, 109762, 133233, 239908, 321767, 353393, 347513, 307223, 203235, 505078, 680067, 710393, 555081, 512746, 546602, 788471, 1033513, 1533647, 1789600, 2043990, 1975640, 1867638, 2075101]
14462B075101J75590j15645n27256m06172l79761r8454o7612j51015j12883J4452
14452D06345q2709M5753l6913J7599R2921L2821j03456k5515N2859K1935q7200
14441C34440j35575O8266J14551j40850k7227m0791J6117O0114o8646L9108P2546
14430B92053M53453N33206M67755K0143k62513k96821l9557M15007M8353o9434
14420A561645j89907j05251l22333l46597l34261j38104p0815K34281k6134k78036
14410a5512k15419J11975k2728r0148L443M4265J22133J11428P0731N6322k9518
14399A46972P2795J8709j52453k12530j56277Q3354J82868J9999J0363j20510
14389a06710R0415Q4904j02251J08669J26222K8804r7675j22087K8468N2952J53977
$$ y = [2075101, 2250691, 2135046, 1607790, 1201618, 821857, 723403, 655791, 504776, 391893, 406345, 323636, 369389, 332476, 350075, 442996, 475817, 372361, 346846, 399705, 421640, 334440, 198865, 267131, 381682, 240832, 213605, 172814, 188931, 249045, 180399, 219507, 292053, 745506, 1278712, 1746467, 1766610, 1504097, 1207276, 1167719, 1582726, 1631079, 1561645, 1371738, 1266487, 944154, 597557, 263296, 125192, 54377, 288658, 262524, -15512, -230931, -118956, -141684, -231832, -228389, -184124, -61991, 49437, 120168, 176490, 146972, 219767, 238476, 86023, -126507, -282784, -199430, -16562, 3437, 13800, -106710, -16295, 68609, -33642, 75027, 201249, 230053, 132378, 10291, 38759, 91711, 245688]
14378B45688j61126j0168k0493j00715K73678J28360k27597o9758J84612J03231
14368C45712l2891l35743k07942n3715M8900J35129q7035p8677J00119J80325
14358A4182J8352k1923q8778N985J94110l624K179j57886L0837J46894J00392
14347B40720k31396j30897K61510J48383j39119o8841k6380n8420q6072l7388
14337a27900l4794J67832j43039J23884J62596M1301n3137n8780k7499L392P1239
14326A25095J2812k47004k0045K269J48627m9454n4885K9736J72931R4569J03474
14315C18125o2228J6942L9872j469N2285m120k33596j63277K3940j09934M5289
14304g8171J87115q7360k65815j69204R7060L15956j2762P178K2813K0169P7444
$$ y = [245688, 84562, 74394, 53901, -46814, 226864, 355224, 127627, 57869, 242481, 345712, 312821, -22922, -230864, -284579, -235679, -100550, -187585, -266262, -166143, 14182, 32534, 10611, -78167, -72182, 121928, 118304, 120483, -37403, -6566, 140328, 240720, 9324, -121573, 139937, 288320, 149201, 80360, 53980, -4440, -90512, -127900, -162694, 5138, -137901, -14017, 148579, 189880, 136743, 77963, 50464, 53856, 125095, 137907, -109097, -129142, -126873, 21754, -27700, -82585, -52849, 120082, 214651, 318125, 255897, 272839, 312711, 311242, 363527, 359407, 125811, -37466, -13526, -123460, -78171, 108944, 21584, -244231, -413435, -316375, -419, -13181, -6003, 16810, 36979, 114423]
14293A14423l0772J51906N8533j35467q3214K8920J09009J33009j34718j62552
14283D9077m8346R4129N5417n1589L7643J60912j28206R9249J42130K34384J6685
14272F61485j40477R9969J47502M18668K30735J69632K05280k45134l58000j84995
14262A004665j87034m2157l8563j15386j55597j8220m7808J19864J2406O1546
14252E93716m3688R5046K39502J27250L21919L53182L16195J63352m3264M1170
14242B164380L48585J013212J643301K479555K540817J190020j092231k605372
14234G682267k490801j381688q67804o16053l18080k01730J27708K65595j0150
14225B189264k72579m38919k20089L2561Q7642j53745k47830j15924N3004j83860
$$ y = [114423, 83651, 235557, 294090, 158623, 75409, 104329, 213338, 346347, 211629, 49077, 731, 94860, 150277, 98688, 136331, 297243, 169037, 268286, 410416, 644800, 661485, 521008, 620977, 768479, 1187147, 1417882, 1587514, 1792794, 1547660, 1189660, 1004665, 817631, 775474, 736911, 621525, 465928, 447708, 399900, 519764, 532170, 593716, 550028, 645074, 884576, 1011826, 1333745, 1686927, 2003122, 2166474, 2123210, 2164380, 2512965, 3526177, 5169478, 7649033, 10189850, 11379870, 10287639, 7682267, 5191466, 3809778, 2941974, 2325921, 2007841, 1806111, 1933819, 2199414, 2189264, 1916685, 1477766, 1257677, 1290238, 1377880, 1224135, 976305, 860381, 913385, 729525]
14215G29525k76757J30476J80629J64790M90198K09848K30918K20672K12637J77609
14205B470545j04629j38427J80647N72227J297616J947732K547821K143987J4087
14196A0931606j725749k799620k264425j455080r31740l36164l28379j08077K88252
14187A270624L2843j60340j32004j53286P4527k30359j41850M3791j37298j2181
14177D54467p64m7870n7220r6681l0668J44519L4412q1435n784j14111r8844k7193
14165G2828Q9974J27177J52416P7023j20342o5049m960r959k3732J34960K07864
14154F38200P0070m2570j00254k30812q2887N5957L6014P6483p654m9762Q2722
14143D45507J24749O4031M2804K6864J91326L4562k58537L7716n6981n4131N1215
$$ y = [729525, 452768, 583244, 763873, 928663, 1418861, 1628709, 1859627, 2080299, 2292936, 2470545, 2365916, 2227489, 2408136, 2980363, 4277979, 6225711, 8773532, 10917519, 10931606, 9205857, 6406237, 4141812, 2686732, 1754992, 1418828, 1090449, 982372, 1270624, 1303467, 1143127, 1011123, 857837, 932364, 702005, 560155, 603946, 466648, 454467, 453703, 405833, 348613, 251932, 221264, 365783, 400195, 318760, 312976, 198865, 100021, 72828, 162802, 289979, 442395, 519418, 399076, 334027, 329067, 319108, 295376, 430336, 638200, 708270, 665700, 565446, 334634, 251747, 307704, 343718, 420201, 412547, 362785, 445507, 570256, 634287, 677091, 703955, 895281, 929843, 671306, 709022, 652041, 597910, 649125]
14132F49125L398j21023o4664p3452p9613K37861P3195j31654k25689j45334k1340
14121A00810K045K4422J56023O2656R8632j0294P9030N3978l7833l0079K84895
14110G84285J57811j41486m8923K7340o3392j32052l7160J93101L10494K77872
14100A327890J20897p352o2128j3339r7316k92687n5337K16115k3676j53629M8316
14089A007754n4108J8943k4704l3966N9543J056m9787R9028K02438j06846j26224
14078I93127K9790J75741o3878J57820Q7720l0074m9506j27043l4109Q0392J45600
14067A365580O7337J223O4508P7855O2819k7543K5984N936j29310J72720J05005
14056A792114J36161L39600Q3456j22227k7403K37711L03545J15542j85095P7699
$$ y = [649125, 652523, 531500, 466836, 393384, 313771, 551632, 624827, 493173, 267484, 122150, 100810, 102855, 127277, 283300, 345956, 444588, 434294, 513324, 567302, 529469, 499390, 784285, 942096, 800610, 751687, 779027, 715635, 583583, 546423, 739524, 1050018, 1327890, 1448787, 1441435, 1379307, 1365968, 1268652, 975965, 920628, 1136743, 1113067, 959438, 1007754, 953646, 972589, 947885, 913919, 973462, 974518, 924731, 1023759, 1226197, 1119351, 993127, 1022917, 1198658, 1134780, 1292600, 1380320, 1350246, 1300740, 1173697, 1139588, 1219980, 1365580, 1432917, 1434140, 1498648, 1576503, 1639322, 1611779, 1637763, 1643699, 1514389, 1687109, 1792114, 1928275, 2267875, 2351331, 2229104, 2201701, 2439412, 2742957, 2858499, 2673404, 2751103]
14046B751103j7696J18153L16541M31987J93972J17782O3642K71913K81636K15483
14036D744516K50587M13971M37959M16741Q11583J148391J164453J304847J509576
14027A2202624J766230K175129K117343K048516K263630L263579M389551N913137
14019C6139739Q048676J2264142K0076874L3183167N4166731P9568482Q1169854
14012C24617665L3794267j8702670j9082368J8952425K6349767k4451524p5063277
14005B66414285p9441719n6628732l5696538k2375161j4177915r060619n749256
13998D3284345m222622l564634k891928k457536k326441k019337q40284R612L09086
13989B5280261M26327L70806R26750J772901J970078K064678K673594M226505
$$ y = [2751103, 2733407, 2851560, 3168101, 3600088, 3794060, 3911842, 3975484, 4247397, 4529033, 4744516, 4995103, 5409074, 5847033, 6263774, 7075357, 8223748, 9388201, 10693048, 12202624, 13968854, 16143983, 18261326, 20309842, 22573472, 25837051, 30226602, 36139739, 44188415, 56452557, 76529431, 109712598, 163879329, 243447811, 324617665, 358411932, 339709262, 320626894, 339579319, 365929086, 341477562, 266414285, 186972566, 130343834, 94647296, 72272135, 58094220, 49033601, 43284345, 39061723, 35497089, 32605161, 30147625, 27821184, 25801847, 24961563, 24971175, 25280261, 25706588, 26077394, 27004144, 28777045, 30747123, 32811801, 35485395, 39711900]
13981C9711900N775691P808532J1688223J8268345K9618580M8432088P3264953
13974B34568312Q4229182M8623745j0149819k7888761O337764K9174500r249789
13967C55645134o9262151q7049840o5391952m0681135k5043746j5853438r938408
13960D2424464o174262m502514l964543k990092k808065l025214k847133k244466
13952A3868175j390605j160175j222341j192455j042751r70661q04540n21900
13944E562747j56269Q5520j72736l01378k19911m14263j24872L6162l7091l65251
13934C892658l80068l89166k48002j54480j83372j20614l1882k73960k89700j85610
13924A635804R4056j5182K7239J95232J24890j27386k04874o7554j82495k23072
$$ y = [39711900, 45487591, 53296123, 64984346, 83252691, 112871271, 161303359, 234568312, 318797494, 367421239, 357271420, 329382659, 335720423, 364894923, 355645134, 286382983, 199333143, 133941191, 93260056, 68216310, 52362872, 42424464, 36250202, 31747688, 27783145, 24793053, 21984988, 18959774, 16112641, 13868175, 12477570, 11317395, 10095054, 8902599, 7859848, 6889187, 6084647, 5562747, 5406478, 5491998, 5319262, 5017884, 4797973, 4383710, 4258838, 4295000, 4257909, 3892658, 3512590, 3123424, 2875422, 2720942, 2537570, 2416956, 2385074, 2111114, 1821414, 1635804, 1729860, 1714678, 1741917, 1937149, 2062039, 1934653, 1729779, 1662225, 1479730, 1256658]
13914A256658j01815j03711p6343J11699r2230K649k891J68180J9115n1330j66565
13903I63416m9618j65060l0074m0943O8455j23567m9199j36791q974K03648q0576
13892E50717j03830j72474j81714L8366K16369K40911M38735m2537j97070m2857
13882G44616l7611p6552k4117q2293m1618J12840r3513j39327q8011p7681n4260
13871A42473j2235m0463J55754K58441j31896k95066j26238L7086J6571K27573
13861B32000n0679j30026Q965R4685L7745K71909j64180m3139J24243J39592K5580
13850E46695j63748r53q7747J86746r287M8278r3965p7852J84316M7145k5143
13839E54485O7393K9464J5500k23694j17938J72815K21918o5298j50194m4222
$$ y = [1256658, 1154843, 1051132, 974789, 1086488, 994258, 996907, 994016, 1162196, 1181311, 1129981, 963416, 913798, 748738, 718664, 677721, 746176, 622609, 573410, 436619, 427645, 631293, 550717, 446887, 274413, 92699, 131065, 347434, 588345, 1027080, 984543, 787473, 744616, 707005, 630453, 606336, 524043, 482425, 595265, 501752, 362425, 274414, 196733, 142473, 130238, 89775, 245529, 503970, 372074, 77008, -49230, -12144, 4427, 232000, 181321, 51295, 60260, 154945, 192690, 464599, 300419, 257280, 381523, 521115, 546695, 382947, 381994, 294247, 480993, 471706, 519984, 426019, 348167, 532483, 579628, 554485, 621878, 651342, 666842, 443148, 325210, 498025, 719943, 654645, 504451, 460229]
13829D60229m4604K8097m6409M4647J16127l2719j09142k7749k15873K38939q0658
13818C30885m4949j19224j21950m3663r8350q8938P7568J65534r193j00676j2394
13807f5350J77962j07576j05931k7572J14437J29251N4127M2402r730J2079R2997
13796C07096j34766j15114N3429P970K73621J00721j21330p9794r3355j95424
13786C054O9857J21828J22534J05343J44893L2469m3299k07745m21212j29917
13776b02195L9664K15267J94850n1487r6860n164L5531L6420O8993J08448N6648
13765D00115j36192l47165J39924M9592L6052Q994O4641k77012m9005J01793j47037
13754a55300J59841j660k00013Q6688Q8164R2477J32044P5368k36651k5432R2918
$$ y = [460229, 415625, 443722, 397313, 441960, 558087, 525368, 416226, 388477, 172604, 411543, 330885, 285936, 166712, 44762, 1099, -97251, -186189, -108621, 56913, 47720, -52956, -65350, 112612, 5036, -100895, -128467, -14030, 115221, 169348, 211750, 202020, 214099, 307096, 172330, 57216, 110645, 118615, 392236, 492957, 371627, 291833, 198478, 3054, 72911, 194739, 317273, 422616, 567509, 599978, 556679, 348934, -72278, -202195, -162531, 52736, 247586, 196099, 99239, 94075, 129606, 166026, 235019, 343467, 400115, 263923, -83242, 56682, 106274, 142326, 151320, 215961, -61051, -110056, -8263, -155300, 4541, 2881, -197132, -110444, -22280, 70197, 202241, 277609, 40958, 15526, 108444]
13743A08444R5971j2302q4626K98763L5465m4745j69468K6438J40072P4404k50217
13732B18199k14249k4582J34028K20709k6751L5889k4286j8218k26249M0294P8355
13721A93139n4311R482J5086J01326j6908j55522j40230r2602J6778P2338K0556
13710c0868J50480l7756j80588r0994J9173n5563n1464K29500j4233j2937K3189
13699e2061K05900p3902j98715l5347j09170J75997K3672J11800J70072R2079
13689C10325j4791k422n9845p3985m0990j65473J0898M1792K4018O7003l9610
13678E6920m8564M4415j71177J51119J63952j9549L0330K34303j16896j27583
13668A97270r3039J9395J00461n5747n0770q8560L30730L9988j97859k04554o8135
$$ y = [108444, 204415, 192113, 107487, 406250, 441715, 396970, 227502, 253940, 394012, 468416, 218199, 3950, -20632, 113396, 334105, 307354, 343243, 318957, 300739, 74490, 114784, 193139, 138828, 148310, 163396, 264722, 247814, 92292, -47938, -140540, -123762, -51424, -30868, 119612, 81856, -98732, -189726, -170553, -226116, -277580, -48080, -62313, -75250, -52061, 153839, 79937, -118778, -154125, -263295, -87298, -63626, 48174, 218246, 310325, 295534, 293112, 233267, 159282, 118292, -47181, -36283, 5509, 29527, 96530, 56920, 8356, 52771, -118406, 32713, 196665, 177116, 207446, 441749, 324853, 197270, 104231, 123626, 224087, 168340, 117570, 29010, 359740, 399728, 201869, -2685, -70820]
13657g0820K21453K14485R2016j10555K5615M949k14977o3249j00865n8335K52607
13646A92324J42885J4740k35622O5552p4209J27736l0885k1631m513m9065l4282
13635I3030k4537J97395o2141k22530J8802j38060j7159J37364J81928l1960j71833
13624c9701K00948J70779Q0933j02907k46511j15897m4766Q6114J04894l8595
13614E5291p7363Q914N5391J80197J22677r6053k6472q745N3614P0932n2150p0534
13602B15699j46426L9544q2620O8948J0902l5079j55348l5761J25829n1610j57969
13591b03891p5058J5679k4753O6787J07315J30250R7511j47173l3516M03355P4363
13580D10869r9532Q2691J29218Q8421k82237q7347L9361k1936l1183n2833k5964
$$ y = [-70820, 150633, 365118, 457134, 346579, 372194, 377143, 162166, 98917, -1948, -60283, 192324, 335209, 349949, 114327, 179879, 105670, 233406, 202521, 180890, 176377, 127312, 93030, 68493, 265888, 203747, -18783, 19, -138041, -155200, -17836, 164092, 132132, -39701, 161247, 332026, 412959, 310052, 63541, -52356, -97122, -11008, 93886, 55291, -22072, -13158, 42233, 222430, 345107, 249054, 222582, 213837, 267451, 338383, 286233, 215699, 69273, 108817, 26197, 95145, 106047, 70968, -84380, -120141, 5688, -45922, -203891, -278949, -263270, -288023, -221236, -113921, 16329, 113840, -33333, -66849, 336506, 410869, 311337, 394028, 523246, 611667, 329430, 242083, 281444, 259508, 228325, 175492, 149528]
13569A49528K62213L0430n8674o315j84443j18402J32330R0754N0970M0813J19212
13558E08416m7960O2318K31788K04989J05547M01538P03097L03177k19609l52276
13548A901025L9238K6186k84434m91908m53935o8277j38605r4397k10412q4253
13538A40228K14901J15878k1948P6982P9133k84840k35493J07230J26196Q2351
13528D00618j74298J49913J43698j78538j81963m3678N515J50112M9832L9354
13518C60565K78353q6339j6704K10628L54775N19210M08295N321l36396j67234
13508A530474Q8178R727j70934k53003l20053j23341j42664r2983r242p3417o7466
13497C75276k56576j23535K03986J55650k59834j19491L4065k57525j90537J36235
$$ y = [149528, 411741, 442171, 383497, 377182, 192739, 74337, 206667, 297421, 348391, 389204, 508416, 460456, 522774, 754562, 959551, 1065098, 1466636, 2169733, 2472910, 2253301, 1901025, 1940263, 1966449, 1682015, 1190107, 736172, 667895, 529290, 434893, 224481, 140228, 355129, 471007, 449059, 526041, 605174, 320334, 84841, 192071, 318267, 400618, 226320, 376233, 519931, 341393, 159430, 115752, 121267, 271379, 321211, 360565, 638918, 552579, 535875, 746503, 1101278, 1620488, 2028783, 2034104, 1697708, 1530474, 1618652, 1628379, 1457445, 1204442, 884389, 761048, 618384, 525401, 516159, 442742, 375276, 118700, -4835, 199151, 354801, 94967, -24524, 9541, -247984, -438521, -302286]
13487c02286R6646k9037r266M8309J06327K06950r2111j86354m6739K81651r9130
13476b5040j51532J05422K13342m6879r9885O732R7789Q4863J39097m6957n9326
13465B17626j55874l06911r6927J15227m9248J80650J74247K774J47402l5649
13455A93317j19180j53744K02554J09692j01309q1378N7143L1042j13533P740
13445C2344r1635K21906K07260o2564k82534r9978Q8503O195J3667j3988j61788
13434a42612j16535k5698j38132j16373J21143K33088J31133N4371J29367K4487
13424A54239N5937M9287j97552j25444k0938K74476O18j1842j12839k66193O4934
13413a35317J27060O7825j20547j13962J6613Q0202j22175j48918J43397M3660
$$ y = [-302286, -205640, -234677, -243943, -195634, -89307, 117643, 25532, -160822, -207561, 74090, -25040, -176572, -71150, 142192, 95313, -4572, 2160, 99949, 184812, 323909, 276952, 217626, 61752, -245159, -342086, -226859, -276107, -95457, 78790, 81564, 228966, 193317, 74137, -79607, 122947, 232639, 131330, 49952, 107095, 138137, 24604, 32344, -59291, 162615, 369875, 307311, 24777, -75201, 13302, 19497, 33164, 19176, -142612, -259147, -284845, -422977, -539350, -418207, -185119, -53986, 385, 129752, 154239, 210176, 259463, 61911, -63533, -84471, 190005, 190623, 178781, 65942, -200251, -135317, -8257, 59568, -60979, -174941, -158328, -78126, -200301, -349219, -205822, -162162]
13403a62162K15496J45105J34254j59059k89491O8891L6647K3687J9244j71502
13393a38890j75454O2649J52946O2891k36081q2455m0149J01557L9631J72228
13383h1127J06302n7231o8481N4615K6499O1138J03289L293R2330l09209j4531
13372h3113J41569K6078M688Q7111l0471r5635r8237L2402K38538k3976k45016
13361d6062j05552J88513J31003M137p3382J6628p7554j93263j42894l6414q062
13350c42902n1876J17549J95141J82489n8289j44880J13570L5892l5514k12444
13340b01264K5189K76809J27986k17208j62710J17286J44319n4338j13400j9566
13330g6897q6114O0373l9731r674r1549k3021k0374j58087K2210J1815J54988
$$ y = [-162162, 53334, 198439, 332693, 173634, -115857, -46966, -10319, 13368, 32612, -138890, -314344, -251695, -98749, -35858, -271939, -354394, -394543, -292986, -253355, -81127, 25175, -32056, -100537, -45922, -19423, 41715, 145004, 148297, 240627, -68582, -83113, 58456, 84534, 89222, 176333, 145862, 50227, -48010, -15608, 222930, 198954, -46062, -151614, 36899, 167902, 172039, 98657, 115285, 37731, -155532, -298426, -334840, -342902, -394778, -277229, -82088, 100401, 42112, -102768, 10802, 46694, 11180, -201264, -176075, 100734, 228720, 11512, -151198, -33912, 110407, 56069, -57331, -76897, -163011, -102638, -142369, -152043, -243592, -266613, -286987, -445074, -422864, -411049, -256061]
13319b56061J90670M9222J10196L4435M3250q4840m6213j9238K7335O8660p0853
13308D6563k50312n2817N6534K60519J73527n4662q6879J237K19877k01200n7768
13297E4619p4604k09742K69066K94931J20536j10071q6841j71793O9302l6261
13287A19142m3332o7444n3622J12578r7837r0549j68147Q220P3068K5393j13555
13276b96085j32245K37763L41969J59266J4129q8641j00736n3044J17555J2276
13266B12207m4847j13820O8213j25734n9342L2491J62345m2566j20570k38608
13256b70231j9604J72228J78253J32292k6551q5058k11859k46865J64356k5150
13246b38189j02466J52757J97561P4619J2692p6572j5685o2964n6617J4366N1988
$$ y = [-256061, -65391, -16169, 94027, 128462, 171712, 86872, 40659, 21421, 48756, 117416, 46563, -203749, -256566, -200032, 60487, 234014, 179352, 92473, 93710, 313587, 112387, 54619, -19985, -229727, 39339, 334270, 454806, 344735, 257894, 86101, 155403, 119142, 75810, 8366, -45256, 67322, -30515, -121064, -289211, -280991, -207923, -182530, -296085, -428330, -190567, 151402, 310668, 324797, 236156, 135420, 82376, 199931, 212207, 167360, 53540, 121753, -3981, -63323, -30832, 131513, 88947, -31623, -270231, -289835, -117607, 60646, 192938, 166387, 81329, -130530, -377395, -213039, -238189, -340655, -187898, 9663, 84282, 96974, 20402, 4717, -58247, -114864, -100498, -48510]
13235d8510k30043k30497J03790K06400J62597L27512o4652r416l06185j95059
13225b84063Q2316J94782J50862o9754j07834q661K9751J23607j05720l8774l9174
13214g2662J0270J93875j25788L1702j11228m4648K2904m087J92873Q7925j04891
13203G6245j46950P8907O4033J39425R2265q4665k63675j10840m4758j14972J59025
13192a55960O1401P1075j038l5596O9771j1872M2489Q3797j6360P9909J20749
13181C08365r4453k00098J67756J07887k20407Q2594N7470O7487j70620k7459
13171G8522o0280J13533K30297L07k20550p1999p8067L2287N4136J80236J87542
13160D45964K6467j04338k03828j61362k30036n5098J1887n832k4730N6258k7476
$$ y = [-48510, -278553, -509050, -405260, -198860, -36263, 291249, 226597, 217181, -89004, -284063, -201747, -6965, 143897, 74143, -33691, -42352, -12601, 111006, 5286, -33488, -72662, -62392, 131483, 5695, 37397, -73831, -118479, -95575, -99662, 93211, 181136, 76245, -70705, 8202, 72235, 211660, 303925, 219260, -44415, -155255, -200013, -314985, -155960, -94559, -23484, -24522, -60118, 9653, -2219, 40270, 124067, 107707, 187616, 308365, 213912, 13814, 181570, 289457, 69050, 151644, 209114, 276601, 105981, 78522, 18242, 131775, 362072, 362379, 141829, 69830, -8237, 24050, 78186, 258422, 445964, 472431, 368093, 164265, 2903, -227133, -282231, -270344, -276176, -300906, -244648, -272124]
13149b72124r249k51O7722J20997o8500O9952K54388M9980k14341K4445O5571
13138H8590n2013J66281q4156j33585J56901J42492l3555j48958k7974M6858r0384
13127C0497o5386l13482J5208Q5655j56259m4568J52118J84747J8290R4390J20758
13116A21968j10095j02027J1984J4424l081K24958J4569j43813L9016J1287J8608
13105I7798N9699J53761M5677L9821k34644k8271P908k10328q7169J50059K2032
13094A6343j3312J44878J3096j00248J82847l5054n1408j65756P8257o642m6413
13083A6588k42390L1540K1306K55930P945j48245J2041r6028l17771j38552R0866
13072e06770J24583Q1677J87882J38049J54965J3835k51812j6489K71718M1794
$$ y = [-272124, -281373, -281624, -213902, -92905, -161405, -91453, 162935, 212915, -1426, 23019, 88590, 36577, 202858, 118702, -14883, 142018, 284510, 250955, 101997, 74023, 120881, 30497, -34889, -348371, -333163, -247508, -403767, -448335, -296217, -111470, -93180, 1210, 121968, 11873, -90154, -78170, -63746, -66827, 158131, 172700, 28887, 67903, 79190, 97798, 157497, 311258, 356935, 396756, 162112, 133841, 141749, -68579, -155748, -5689, 16343, 3031, 147909, 161005, 60757, 243604, 208550, 157142, -8614, 69643, 63001, 16588, -225802, -194262, -172956, 82974, 90919, -57326, -45285, -141313, -459084, -597636, -506770, -382187, -300510, -112628, 25421, 180386, 194221, -57591, -74080, 197638, 239432]
13062B39432j26633p5863j5279O2449J77442L15631n5813r1792j00843j47244
13052A81487K7617n9339L6868j2066J75417R4952q7610j05257j27030q6425P1225
13041A09839j5734P7778J4821O7402P4753j54603J23768l5293k23270J14080K6711
13030A80252o1812L5929q3905j33199o1361k08907j25429J15108o8353O7920J02468
13019b41289K61259K88158J3878j09667O879N2084j58143j84562J13202J05213
13009A47012q9009K6580o3809J07686n4953M0913M8748j76624K5001n420J04560
$$ y = [239432, 112799, 36936, 21657, 84106, 261548, 577179, 521366, 429574, 328731, 181487, 209104, 149765, 186633, 174567, 349984, 444936, 357326, 252069, 125039, 38614, 109839, 94105, 171883, 186704, 254106, 328859, 174256, 298024, 262731, 39461, 153541, 180252, 118440, 154369, 70464, -62735, -124096, -333003, -458432, -343324, -411677, -343757, -241289, 19970, 308128, 322006, 212339, 219218, 271302, 113159, -71403, 41799, 147012, 58003, 84583, 20774, 128460, 73507, 114420, 163168, -13456, 11545, 6125, 110685]
$$ [...]
##END NTUPLES=NMR SPECTRUM
##END=
