##TITLE=Analysis number 328702
Compound Code cc 54296
Book Reference 518/123
Project Code adrs
Chemist Name colinb
##JCAMPDX= 6.0         $$ Bruker NMR JCAMP-DX V2.0
##DATA TYPE= NMR SPECTRUM
##DATA CLASS= NTUPLES
##ORIGIN= Bruker BioSpin GmbH
##OWNER= nmr
$$ XWIN-NMR		Version 3.5
$$ Wed Jun 27 11:10:20 2007 GMT Daylight Time (UT+1h)  MAYBRIDGE\nmr@NMR_250MHZ
##.OBSERVE FREQUENCY= 250.131544655141
##.OBSERVE NUCLEUS= ^1H
##.ACQUISITION MODE= SIMULTANEOUS (DQD)
##.ACQUISITION SCHEME= undefined
##.AVERAGES= 16
##.DIGITISER RES= 18
##SPECTROMETER/DATA SYSTEM= dpx250
##.PULSE SEQUENCE= zg30
##.SOLVENT NAME= DMSO
##.SHIFT REFERENCE= (INTERNAL, DMSO, 0, 16.5133)
##AUDIT TRAIL= $$ (NUMBER, WHEN, WHO, WHERE, WHAT)
$$ ##TITLE= Audit trail, XWIN-NMR		Version 3.5
$$ ##JCAMPDX= 5.01
$$ ##ORIGIN= Bruker BioSpin GmbH
$$ ##OWNER= nmr
$$ C:\u/data/dgb/nmr/ADRS/2090/pdata/1/auditp.txt
$$ ##AUDIT TRAIL=  $$ (NUMBER, WHEN, WHO, WHERE, WHAT)
(   1,<2007-06-27 11:09:58.59 +100>,<MAYBRIDGE\nmr>,<NMR_250MHZ>,
      <created by zg, POWCHK disabled, PULCHK disabled
       configuration hash MD5:
       76 6E 9A 78 1E 09 19 81 EC 84 63 8F B0 6A 59 2D
       data hash MD5: 64K
       31 BE D1 4A C1 28 15 72 11 C9 6F 8C 3C BD F4 D1>)
(   2,<2007-06-27 11:10:11.26 +100>,<MAYBRIDGE\nmr>,<NMR_250MHZ>,
      <Start of raw data processing
       ef LB = 0.3 FT_mod = 6 PKNL = 1 SI = 32K 
       data hash MD5: 32K
       E7 34 D1 68 F8 8D 59 09 30 CB 55 D0 20 2C 0C 91>)
(   3,<2007-06-27 11:10:12.96 +100>,<MAYBRIDGE\nmr>,<NMR_250MHZ>,
      <apk 
       data hash MD5: 32K
       95 F7 CE 18 BE 1D C1 CE 2F CD 01 16 A2 77 D9 2D>)
(   4,<2007-06-27 11:10:13.75 +100>,<MAYBRIDGE\nmr>,<NMR_250MHZ>,
      <abs ABSG = 5 
       data hash MD5: 32K
       72 33 66 5A 3A E7 87 E6 7A D3 E9 4A F6 28 BA 89>)
$$ ##END=
$$ 
$$ hash MD5
$$ 0D 62 0F 79 A9 E2 DF 57 31 CA 14 73 09 64 27 81
##$RELAX= 
##$RELAX= 
##$RELAX= 
##$RELAX= 
##$RELAX= 
##$RELAX= 
##$RELAX= 
$$ Bruker specific parameters
$$ --------------------------
##$DU= <C:\u>
##$EXPNO= 2090
##$NAME= <ADRS>
##$PROCNO= 1
##$TYPE= <nmr>
##$USER= <dgb>
##$AMP= (0..31)
100 100 100 100 100 100 100 100 100 100 100 100 100 100 100 100 100 100 
100 100 100 100 100 100 100 100 100 100 100 100 100 100 
##$AQSEQ= 0
##$AQ_mod= 3
##$AUNM= <au_zg>
##$AUTOPOS= <15 >
##$BF1= 250.13
##$BF2= 250.13
##$BF3= 250.13
##$BF4= 250.13
##$BF5= 500.13
##$BF6= 500.13
##$BF7= 500.13
##$BF8= 500.13
##$BYTORDA= 1
##$CFDGTYP= 0
##$CFRGTYP= 5
##$CHEMSTR= <none>
##$CNST= (0..31)
1 1 145 1 1 1 1 1 1 1 1 1 1 1 1 1 1 1 1 1 1 1 1 1 1 1 1 1 1 1 1 1 
##$CPDPRG= <>
##$CPDPRG1= <>
##$CPDPRG2= <>
##$CPDPRG3= <>
##$CPDPRG4= <mlev>
##$CPDPRG5= <mlev>
##$CPDPRG6= <mlev>
##$CPDPRG7= <mlev>
##$CPDPRG8= <mlev>
##$CPDPRGB= <>
##$CPDPRGT= <>
##$D= (0..31)
0 1 0 0 0 0 0 0 0 0.06 0 0 0 0 0 0 0.0002 0 0 0 0 0 0 0 0 0 0 0 0 0 0 
0 
##$DATE= 1182938997
##$DBL= (0..7)
120 120 120 120 120 120 120 120 
##$DBP= (0..7)
150 150 150 150 150 150 150 150 
##$DBP07= 0
##$DBPNAM0= <>
##$DBPNAM1= <>
$$ [...]
##$SUBNAM7= <"">
##$SUBNAM8= <"">
##$SUBNAM9= <"">
##$SW= 20.6930455092707
##$SWIBOX= (0..15)
0 0 3 0 0 0 0 0 0 0 0 0 0 0 0 0 
##$SW_h= 5175.983436853
##$TD= 65536
##$TD0= 1
##$TE= 296.16
##$TE2= 300
##$TE3= 300
##$TEG= 300
##$TL= (0..7)
0 120 120 120 120 120 120 120 
##$TP= (0..7)
150 150 150 150 150 150 150 150 
##$TP07= 0
##$TPNAME0= <>
##$TPNAME1= <>
##$TPNAME2= <>
##$TPNAME3= <>
##$TPNAME4= <>
##$TPNAME5= <>
##$TPNAME6= <>
##$TPNAME7= <>
##$TPOAL= (0..7)
0.5 0.5 0.5 0.5 0.5 0.5 0.5 0.5 
##$TPOFFS= (0..7)
0 0 0 0 0 0 0 0 
##$TUNHIN= 0
##$TUNHOUT= 0
##$TUNXOUT= 0
##$USERA1= <user>
##$USERA2= <user>
##$USERA3= <user>
##$USERA4= <user>
##$USERA5= <user>
##$V9= 5
##$VALIST= <valist>
##$VCLIST= <CCCCCCCCCCCCCCC>
##$VD= 0
##$VDLIST= <DDDDDDDDDDDDDDD>
##$VPLIST= <PPPPPPPPPPPPPPP>
##$VTLIST= <TTTTTTTTTTTTTTT>
##$WBST= 1024
##$WBSW= 4
##$XGAIN= (0..3)
0 0 0 0 
##$XL= 0
##$YL= 0
##$YMAX_a= 400073
##$YMIN_a= -325890
##$ZGOPTNS= <>
##$ZL1= 120
##$ZL2= 120
##$ZL3= 120
##$ZL4= 120
##$ABSF1= 16.5133
##$ABSF2= -4.179873
##$ABSG= 5
##$ABSL= 3
##$ALPHA= 0
##$AQORDER= 0
##$ASSFAC= 0
##$ASSFACI= 0
##$ASSFACX= 0
##$ASSWID= 0
##$AUNMP= <proc_1d>
##$AZFE= 0.1
##$AZFW= 0.1
##$BCFW= 0
##$BC_mod= 0
##$BYTORDP= 0
##$COROFFS= 0
##$CY= 12.5
##$DATMOD= 1
##$DC= 0
##$DFILT= <>
##$DTYPP= 0
##$F1P= 14.0000005364418
##$F2P= -0.99999901652339
##$FCOR= 0.5
##$FTSIZE= 32768
##$FT_mod= 6
##$GAMMA= 0
##$GB= 0
##$INTBC= 1
##$INTSCL= 1
##$ISEN= 128
##$LB= 0.3
##$LEV0= 0
##$LPBIN= 0
##$MAXI= 10000
##$MC2= 0
##$MEAN= 0
##$ME_mod= 0
##$MI= 0
##$NCOEF= 0
##$NC_proc= -3
##$NLEV= 6
##$NOISF1= 0
##$NOISF2= 0
##$NSP= 0
##$NTH_PI= 0
##$NZP= 0
##$OFFSET= 16.5133
##$PC= 1
##$PHC0= -62.56128
##$PHC1= 5.745089
##$PH_mod= 1
##$PKNL= yes
##$PPARMOD= 0
##$PSCAL= 4
##$PSIGN= 0
##$REVERSE= no
##$SF= 250.130002173821
##$SI= 32768
##$SIGF1= 0
##$SIGF2= 0
##$SINO= 400
##$SIOLD= 32768
##$SREGLST= <1H.DMSO>
##$SSB= 0
##$STSI= 32768
##$STSR= 0
##$SW_p= 5175.98343685301
##$SYMM= 0
##$S_DEV= 0
##$TDeff= 65536
##$TDoff= 0
##$TI= <Analysis number 999999
Compound Code 99
Book Reference 9
Project Code 9>
##$TILT= no
##$TM1= 0
##$TM2= 0
##$TOPLEV= 0
##$USERP1= <user>
##$USERP2= <user>
##$USERP3= <user>
##$USERP4= <user>
##$USERP5= <user>
##$WDW= 1
##$XDIM= 32768
##$YMAX_p= 393875225
##$YMIN_p= -193828
$$ End of Bruker specific parameters
$$ ---------------------------------
##NTUPLES= NMR SPECTRUM
##VAR_NAME=  FREQUENCY,     SPECTRUM/REAL,   SPECTRUM/IMAG
##SYMBOL=    X,             R,               I
##VAR_TYPE=  INDEPENDENT,   DEPENDENT,       DEPENDENT
##VAR_FORM=  AFFN,          ASDF,            ASDF
##VAR_DIM=   32768,         32768,           32768
##UNITS=     HZ,            ARBITRARY UNITS, ARBITRARY UNITS
##FACTOR=    0.157963299565203, 1,           1
##FIRST=     4130.47175039357, 0,            0
##LAST=      -1045.51168645944, 0,           0
##MIN=       -1045.51168645944, -193828,     0
##MAX=       4130.47175039357, 393875225,    0
$$ Real data points
##PAGE= N=1
##DATA TABLE= (X++(R..R)), XYDATA
$$ [...]
16617a0214m380j2534j334o406n439L7266L787j7030q407l657N547j868j3242
16604c7911p107L2992K4592n853k423j3595p686l614j0594O082M069o099j8003
16591d5150J3867K168J7008J3194j547J3430O259j7248j5131j6133J6798K5859
16579A3374O437L300n141j1331j6161J3201k542j4417Q789k258J0459j0141k7072
16566c3503J3182J3342k3518k9250J0578K1848L1722p904j6679l48K2313K0100
16554B1883K363j3705q464n26j7833j3542L018J7151L421K526k4944j0420j3674
16541e2746J0400J4358j2100m654N91J4530P515l850j1083K5161J0170j5626o375
16528b3709L036Q480J3258P286N315m615j8177L269j880j924J7533M57J7384R726
$$ plain form
16617 -10214 -14594 -27128 -28462 -34868 -40307 -3041 746 -16284 -24691 -28348 -22801 -24669 -37911
16604 -37911 -45018 -12026 12566 6713 4290 -9305 -16991 -20605 -31199 -25117 -21048 -27147 -45150
16591 -45150 -31283 -29115 -12107 1087 -460 12970 19229 1981 -13150 -29283 -12485 13374
16579 13374 19811 23111 17970 6639 -9522 3679 1137 -13280 -4491 -6749 3710 -6431 -33503
16566 -33503 -20321 -6979 -30497 -59747 -49169 -27321 4401 -3503 -20182 -20530 1783 21883
16554 21883 24246 10541 2077 1551 -16282 -29824 -26806 -9655 -6234 -3708 -28652 -39072 -52746
16541 -52746 -42346 -27988 -40088 -44742 -44151 -29621 -22106 -25956 -37039 -11878 -1708 -17334 -23709
16528 -23709 -20673 -12193 1065 8351 13666 9051 -9126 -5857 -7737 -9661 7872 8329 25713 35439
16514C5439l1522j6830j4131N833J1714r223q748K1345n970l8J5650O610K802
16501A2931J0289o692j1554j6977k3590J5042M0688K564j4940j9174k3520J9907
16489a5026k1852M381J9459P996J3746m670j4352m210O146m486k1269J012J1299
16476b1826J4407J1756j0500m193n682k8391j461K0220R67K8941L870m0288m173
16463c6353Q180R477l49K8318k4040p390k8051k5295j348J4167J0717J390J7646
16450c2931j513r222K340J4975r895j1196J0633K5131J1624k7691k3384q67K5435
16437b6561L0394L5217j5921K739R334j9648k3645k715j5462j3923L3006K0218
16425A3033m377p114p349J9531j648j5668j3304J7236K2244L102j9842O464J8299
$$ plain form
16514 35439 3917 -12913 -27044 -21211 -9497 -18720 -27468 -6123 -12093 -12131 3519 10129 12931
16501 12931 23220 16528 4974 -12003 -35593 -20551 20137 22701 7761 -11413 -34933 -15026
16489 -15026 -36878 -32497 -13038 -5042 8704 4034 -10318 -14528 -8382 -12868 -34137 -33125 -21826
16476 -21826 -7419 4337 -6163 -10356 -16038 -44429 -45890 -25670 -24703 4238 8108 -32180 -36353
16463 -36353 -28173 -18696 -19045 9273 -14767 -22157 -50208 -75503 -76851 -62684 -51967 -50577 -32931
16450 -32931 -34444 -43666 -41326 -26351 -36246 -47442 -36809 -11678 -54 -27745 -51129 -51996 -26561
16437 -26561 3833 39050 23129 25868 35202 15554 -8091 -10806 -26268 -40191 -7185 13033
16425 13033 8656 1542 -5807 13724 12076 -3592 -16896 340 22584 25686 5844 12308 30607
16412C0607j9327m7070Q066J8033j2388L0844j3400j0402k790J5644K6772K081
16400B6670j642J443k5173n41j6461j2389m044p826N065r546j0622K4694J8306
16387a2066J4519j5377Q399M356n110j1540k1454j5392k153O847K0651Q691r150
16374b8779k4680N6L1274Q9m609n819m896p284R63J4553J4190K1676J9792j357
16360B5169j2691o239q082O219P570k3625q566J4512j350K880J0111k6962k514
16347b3568J6425J2641L898k9462l3120L1565j3980n509J1791n302m080K4760
16335a3941j9223J8191P326J1234J0507j2714j738M863N882k1600j1869K103j1151
16322c2130L83J3703K5326k33j3595j7904r912J638J0944J0891l329n170K0532
$$ plain form
16412 30607 11280 -35790 -27724 -9691 -22079 8765 -4635 -15037 -17827 -2183 24589 26670
16400 26670 25028 26471 1298 757 -15704 -28093 -32137 -39963 -34898 -44444 -55066 -30372 -12066
16387 -12066 2453 -12924 -4525 -169 -5279 -16819 -38273 -53665 -55818 -48971 -28320 -19629 -28779
16374 -28779 -53459 -53403 -22129 -22040 -26649 -32468 -37364 -44648 -43685 -29132 -14942 6734 26526 25169
16360 25169 12478 6239 -1843 4376 11946 -11679 -20245 -5733 -7083 -4203 5908 -21054 -23568
16347 -23568 -7143 5498 9396 -20066 -53186 -21621 -35601 -41110 -29319 -34621 -38701 -13941
16335 -13941 -33164 -14973 -7647 3587 14094 1380 -358 4505 10387 -11213 -23082 -20979 -32130
16322 -32130 -31747 -18044 7282 7049 -6546 -24450 -34362 -32724 -21780 -10889 -14218 -19388 1144
16309A144P217r551j3071N780L0001K781j4360j3582l5033l6036J0274j053K7416
16296c8073L1194j3424j3140k0114Q027Q884N115K3007K19k946p621q88K7218
16283G458N088l0683j6933j8232K3079J861R36o691k1964o241Q354K3271k8021
16270e8718J453N5129J6009M637j6631k2302J0522r12k01L49J478k340M81Q204
16256b842K293J2052j2256q829J7418J2536k6995q164k3165J4014N404K664J4787
16243a083N978j0330k2870q029m237J5501n92q516k692j3298o860K1122J2808
16230b3098r662l726n247M389O979K531R23j9855J1489Q710O407J1839N184q707
16216a1844O248J5140k1458l3856O238k745O295k6162q130K1367K0976J2904J5506
$$ plain form
16309 1144 8361 -1190 -14261 -8481 21520 24301 9941 -3641 -38674 -74710 -64436 -65489 -38073
16296 -38073 -6879 -20303 -33443 -53557 -45530 -36646 -31531 -8524 -8305 -11251 -18872 -19760 7458
16283 7458 12546 -18137 -35070 -53302 -30223 -28362 -27426 -34117 -56081 -62322 -53968 -30697 -58718
16270 -58718 -57265 -2136 13873 18510 1879 -20423 -9901 -10813 -11014 -10665 -9187 -11527 -11046 -2842
16256 -2842 -549 11503 -753 -9582 7836 20372 -6623 -14787 -37952 -23938 -18534 -15870 -1083
16243 -1083 4895 -5435 -28305 -36334 -40571 -25070 -25662 -34178 -36870 -50168 -57028 -35906 -23098
16230 -23098 -32760 -36486 -41733 -37344 -30365 -27834 -26911 -46766 -35277 -26567 -20160 -8321 -3137 -11844
16216 -11844 -5596 9544 -11914 -45770 -39532 -42277 -35982 -62144 -70274 -48907 -27931 -15027 479
16203D79J337k9231q850K883k535K5209k1742j2353j3103K2992K3262J0434k0504
16190b1722k2486j0028J2317K7162k623R119j434j2920k2871k2777J8713L7567
16178a1983J0960L662q981j1876l4144k0763J4133K3698J5410K0356j1725j7523
16166b8776J2890J9170J7388n456l6936j6255K148L344r493L524J0236Q2J0656
16153a7478n66J7252L1847j2514j5986l754j3319m253L360j4266J3321J0400k0651
16140b6607j112k219J0236r795J4273J6840r919Q962N501J2735J6832J745n929
16127C1543k6925k4463n608q690j7834j536P812K6744K0335j577q126N756p22
16114c291K6741L602k9901l5475j2473J3802M097K997q387J2929J5544k9372l132
$$ plain form
16203 479 1816 -27415 -36265 -33382 -35917 -10708 -32450 -44803 -57906 -34914 -11652 -1218 -21722
16190 -21722 -44208 -54236 -41919 -14757 -17380 -8261 -9695 -22615 -45486 -68263 -49550 -11983
16178 -11983 -1023 2639 -6342 -18218 -52362 -73125 -58992 -35294 -19884 472 -11253 -28776
16166 -28776 -15886 3284 20672 15216 -21720 -37975 -35827 -32483 -41976 -38452 -28216 -28134 -17478
16153 -17478 -18044 -792 31055 18541 2555 -1199 -14518 -18771 -15411 -29677 -16356 -5956 -26607
16140 -26607 -27719 -29938 -19702 -29497 -15224 1616 -8303 659 6160 18895 35727 37472 31543
16127 31543 4618 -19845 -25453 -34143 -51977 -53513 -45701 -18957 1378 -199 -8325 -2569 -3291
16114 -3291 23450 27052 -2849 -38324 -50797 -36995 -32898 -29901 -38288 -25359 -9815 -39187 -42319
16101d2319J9626M060m106p58J5299j3243k4206J418L815K3376J916J7541j0497
16088h078k606J6303k184j2905k573K416j7247k354j511l98J9046K532j192L4854
16074B4103J3425j4265j7029p721l64j935k3193j4324L278l707R420P161j7447
16061d2598p505L469Q176L0966J4946o242r617N074m335O220N283j2426O494J4267
16047A2172M201l0551j9020K5746J2479k9124l1660O405Q287J8299Q739J3485
16035e42p875l201N050R86J1215R978p75J8445r937k3260q504k8724r033M4092
16021b085Q023j1598J811J1026J052q160j4884j0445K1500k254l4559j1575K3658
16008b8490L4159K2022K675m2652k8018N99K5659J2201N556k4913k8710J9834
$$ plain form
16101 -42319 -22693 -18633 -22739 -23497 -8198 -21441 -45647 -44229 -40414 -17038 -15122 2419 -8078
16088 -8078 -10684 5619 3435 -9470 -12043 -9627 -26874 -29228 -30739 -31137 -12091 -9559 -10751 24103
16074 24103 37528 23263 6234 -1487 -1851 -3786 -26979 -41303 -38025 -41732 -32312 -25151 -42598
16061 -42598 -50103 -46634 -38458 -7492 7454 1212 -8405 -3331 -7666 -1446 3837 -8589 -2095 12172
16047 12172 16373 -14178 -33198 -7452 5027 -24097 -55757 -49352 -41065 -22766 -14027 -542
16035 -542 -8417 -11618 -6568 -5582 5633 15611 14836 33281 23344 84 -8420 -37144 -46177 -2085
16021 -2085 5938 -5660 -3849 7177 8229 69 -14815 -25260 -3760 -6014 -40573 -52148 -28490
16008 -28490 5669 27691 30366 -12286 -40304 -39705 -14046 -1845 3711 -21202 -49912 -30078
15996c0078O003P122m838j4203J94K1930K4537k4132j2331M939p926k273M633
15983b6423Q982J0499J3019J6139r351K275K0599p501k2991k7412k8047k437K1304
15970c1345J0568j4057m73j4569M892m267M382R038P077r410Q569L560L166j6024
15956c8893N339J7644k763J6412l0804n197K9410J1101K1656j3369k0374J3936
15944D098J4230j2191k8063m069j9784Q36J2494o603K794J0542r932j1451n363
15931e2462K1194J2284l6672Q205R475J809r368j6098J4709K8092J7544j0702
15919a1990k6732K214J5163J3855o296J3812k93K885J0801j2285j1992l436K936
15906a1358J077P553q492o112k985P182J5947j599q825j0561O809K3692j7546
$$ plain form
15996 -30078 -24075 -16953 -21791 -35994 -35800 -13870 10667 -13465 -25796 -20857 -28783 -31056 -26423
15983 -26423 -17441 -6942 6077 22216 12865 15140 35739 28238 5247 -22165 -50212 -52649 -31345
15970 -31345 -20777 -34834 -35307 -49876 -44984 -49251 -44869 -35831 -28754 -38164 -29595 -26035 -22869 -38893
15956 -38893 -33554 -15910 -18673 -2261 -33065 -38262 -8852 2249 23905 10536 -9838 4098
15944 4098 18328 6137 -21926 -25995 -45779 -44943 -32449 -39052 -36258 -25716 -35648 -47099 -52462
15931 -52462 -31268 -18984 -55656 -47451 -37976 -36167 -45535 -61633 -46924 -18832 -1288 -11990
15919 -11990 -38722 -36508 -21345 -7490 -13786 26 -267 2618 13419 1134 -10858 -14294 -11358
15906 -11358 -10281 -2728 -11220 -17332 -20317 -13135 2812 1213 -7612 -18173 -11364 12328 -5218
15893e218J2961o261R20k1497k7904J4408L2351J6038o549j2317j0588n63n070
15880a9289m410o12o594q995q533K3858J7260l2538p754J0805K4367Q760k0798
15867b4473j416R088J7494j4640l3581o204J8401K0517k6406k6372k612P772K6110
15854c6322J3785k289Q172J7999J3547J2863k4870l7940j167J2392j4789J493
15842c7126P662K9390L3752Q080j4468j7818q129m804l2844J3622M0095L379r542
15829A1249J799j6386Q636M546R844p877Q349J0771q095n883o021j0262j7646
15816a6976j1899K531J9167J4323Q349N636P643j2283l1167j5546J4084q487o550
15803c1175J6410J6269J2658j8044j3292M592J9985K872k3891l537o16j167P182
$$ plain form
15893 -5218 7743 1482 2402 -19095 -46999 -32591 -240 15798 9249 -3068 -13656 -14219 -19289
15880 -19289 -23699 -24311 -30905 -39900 -48433 -24575 -7315 -39853 -47607 -36802 -12435 -3675 -24473
15867 -24473 -25889 -16801 693 -13947 -47528 -53732 -35331 -14814 -41220 -67592 -70204 -62432 -36322
15854 -36322 -22537 -24826 -16654 1345 14892 27755 2885 -35055 -36222 -23830 -38619 -37126
15842 -37126 -29464 -74 33678 41758 27290 9472 1343 -3461 -36305 -22683 17412 20791 11249
15829 11249 13048 -3338 5298 9844 19688 11811 20160 30931 22836 16953 10932 670 -16976
15816 -16976 -28875 -26344 -7177 7146 15495 21131 28774 16491 -14676 -30222 -16138 -24625 -31175
15803 -31175 -14765 1504 14162 -3882 -17174 -12582 7403 10275 -13616 -17153 -17769 -18936 -11754
15790a1754L993J5458q913J7770L506n1802k3580J0239K6111J9862N714m573k525
15777d94j6267R400K599q041J8264J8664K299j8495j0700j2146K516L992n515
15764a3924J502N845L0804J6110J7941j7776k3841J1469l4401j0834J6017N830
15752D742M270J8827q876R626L609o872k3544j5395p771j2297J839K5800K5565
15739A9523K0777k2080q886k4402Q352R550j0401r384n690R562R182O216q944
15726f625q852q282Q475J0189J7118j405k3713j6588P445k3298q208J2036m616
15713d6324k58K1162J8753M631n031j1710q087J4367q341l526J5293K626o303
15700a2748j676m598p333J1877J0511j1021J3512K0639N888J1881K1218q748m193
$$ plain form
15790 -11754 -7761 7697 -1216 16554 20060 -31742 -55322 -45083 -18972 890 6604 2031 -494
15777 -494 -16761 -7361 -4762 -12803 5461 24125 26424 7929 -2771 -14917 -12401 -8409 -13924
15764 -13924 -12422 -6577 24227 40337 58278 40502 16661 28130 -6271 -17105 -1088 4742
15752 4742 9012 27839 18963 28589 32198 25326 1782 -13613 -21384 -33681 -31842 -6042 19523
15739 19523 40300 18220 9334 -15068 -6716 2834 -7567 -16951 -22641 -13079 -3897 2319 -6625
15726 -6625 -15477 -23759 -15284 -5095 12023 10618 -13095 -29683 -22238 -45536 -53744 -41708 -46324
15713 -46324 -46582 -25420 -6667 -2036 -7067 -18777 -26864 -12497 -20838 -24364 -9071 -6445 -12748
15700 -12748 -14424 -19022 -26355 -14478 -3967 -14988 -1476 19163 25051 36932 58150 49402 45209
15687D5209j1411k841k4087n801k408M448k3492j6779J5677p207J703j529K2789
15674e729K3775j8835l1225n657K0293p899J4816K302k6994j7659K292J754N644
15661d3122l666j2168j1917J9972K5936J1562j6765j2270J728L0319J9702j9451
15649a0140j2279k3281j004J9408K315q446m097n717k5079L245K0449O057K1262
15636a7307J0014o481j4407n75R949n65l248J6404M825j3002k789J2092J6210
15623A1120J3971Q099k3056r912j726J487k0359R212L4511J5208j8839j7199k1126
15610a8609j6905j4784j2699N303J0776L953K4643L2186l556J292k838J7709J7810
15597D4281j7122n671O912J0464J1413k5778j5423K299j0729j2785J0604K0137
$$ plain form
15687 45209 33798 30957 6870 1069 -1339 3109 -20383 -37162 -21485 -28692 -26989 -28518 -5729
15674 -5729 18046 -789 -32014 -37671 -17378 -25277 -10461 -8159 -35153 -52812 -50520 -48766 -43122
15661 -43122 -46788 -58956 -70873 -50901 -24965 -13403 -30168 -42438 -40710 -10391 9311 -10140
15649 -10140 -22419 -45700 -46704 -27296 -24981 -33427 -37524 -43241 -68320 -65075 -44626 -38569 -17307
15636 -17307 -7293 -13774 -28181 -28756 -18807 -19372 -22620 -6216 -1391 -14393 -17182 -5090 11120
15623 11120 25091 33190 10134 222 -1504 -17 -20376 -11164 23347 38555 19716 2517 -18609
15610 -18609 -35514 -50298 -62997 -57694 -46918 -42965 -18322 13864 10308 11600 8762 26471 44281
15597 44281 27159 21488 28400 38864 50277 24499 9076 11375 646 -12139 -1535 18602
15585A8602J1409n177Q882k494l304K008j2137k245k8491j7188P909l214J6751
15572h689J3658n406k361l051j9534Q900K5361o604l7032r304K3366L398J2237
15559e061K1326J517j7079P477K969P365K808l411m984M498n595N271O320j3876
15545I545j5623j642K4232R837o262j7520n374R778o123j8855J7725J7908j432
15532A6194j6223k122L567j0992K202k807j0944r996J131J203J2388K685o590
15519b0304o918J9597K7124K29j0838j6059j866K533N563p839J5750K1061R396
15506C7429j8866j6992m300m442L285M89J7433O449N354j2967l8012j6542K805
15493c8877K7752K271k3059N720o219P144k295k7021k550J9066K587M819J0069
$$ plain form
15585 18602 30011 24834 33716 31222 27918 29926 17789 15544 -12947 -30135 -22226 -25440 -8689
15572 -8689 4969 -437 -2798 -5849 -25383 -16483 8878 2274 -34758 -44062 -20696 -17298 -5061
15559 -5061 16265 17782 703 8180 11149 18514 21322 17911 12927 17425 11830 17101 23421 9545
15545 9545 -6078 -7720 16512 26349 20087 2567 -2807 6971 848 -18007 -282 17626 16194
15532 16194 -29 -2151 1416 -9576 -7374 -10181 -21125 -31121 -29990 -28787 -16399 -13714 -20304
15519 -20304 -27222 -7625 19499 19728 8890 -7169 -9035 -6502 -939 -8778 6972 28033 37429
15506 37429 18563 1571 -2729 -7171 -3886 -3397 14036 20485 25839 12872 -25140 -41682 -38877
15493 -38877 -11125 -8854 -31913 -26193 -32412 -25268 -27563 -54584 -57134 -38068 -35481 -30662 -20593
15480b0593j3099j0384J6819N839q892K1933J4790o024P787M0018J882k6323r543
15467A4210j0415J1242q313j4277P426M003J4482o9k2686m197k5770J1026L1902
15454H564o358j7295K9409N361j1786Q32j2816k0628K799K0385K7210k7197j6327
15441a7847k813J6054J1819k4634K0464K7919J9182r554k1966M580P26k3818k1272
15428b1160O305j2010J3198N624p915o496L26n71K083j6390j478K3151Q370l8198
15414d5161p544J07L5012O258j2811O842R118l2600o470M2920L610O674k154j8300
15400a4499j1756k0897j027R088Q974J9830j6236N578J0444J9556L0118Q862l300
15387D4735l2747j3025j949K043n153j943j7281q822Q790J674J3514J6398J0475
$$ plain form
15480 -20593 -33692 -44076 -27257 -21418 -30310 -8377 6413 389 8176 48194 50076 23753 14210
15467 14210 3795 15037 6724 -7553 -127 3876 18358 18289 -4397 -8594 -34364 -23338 8564
15454 8564 2206 -15089 14320 19681 7895 8727 -4089 -24717 -21918 -1533 25677 -1520 -17847
15441 -17847 -20660 -4606 7213 -17421 3043 30962 50144 40590 18624 23204 23930 112 -21160
15428 -21160 -14855 -26865 -13667 -8043 -15958 -22454 -22128 -22699 -20616 -37006 -38484 -15333 -6963 -45161
15414 -45161 -52705 -52598 -17586 -11328 -24139 -17297 -8179 -40779 -47249 -4329 -719 5955 3801 -14499
15400 -14499 -26255 -47152 -48179 -39091 -30117 -10287 -26523 -20945 -10501 9055 39173 48035 44735
15387 44735 11988 -1037 -2986 -943 -6096 -8039 -25320 -34142 -25352 -23678 -10164 6234 16709
15374A6709j102r878p120k4642J906P556j157J4082K7289O928j4533k6644n9j8020
15360b8685o041O583K4265J951j238m835N500P329J2855l079j4139J0538j1243
15347b39j774J2977R214j3624j8126J1877N162J427K616O06K3869K0322J1750
15334F6057l3535k2814j2952k6975j1112K2388r370K9056K8071M634l5757n170
15322g479K155j0623j0161j365Q282l342k982K495J2643q513k1911K916J2313
15309b5572M323j74K3918l039j557J2552N796j2413j6310K2918p525J7M132k38
15295F828N272J5430J9092o125j7534k2533m392K4016j9175j0824k062K716J5862
15282F571J8092J1411j4291l4532j3552p014j1496Q314K755K035K4879R271O64
$$ plain form
15374 16709 15607 5729 -1391 -26033 -24127 -16571 -17728 -3646 23643 30571 16038 -10606 -10665 -28685
15360 -28685 -34726 -28143 -3878 -1927 -3165 -8000 -2500 4829 17684 14605 466 11004 -239
15347 -239 -2013 10964 20178 6554 -11572 305 5467 6894 9510 10116 33985 54307 66057
15334 66057 32522 9708 -3244 -30219 -41331 -18943 -28313 743 28814 33448 -2309 -7479
15322 -7479 -5324 -15947 -26108 -27473 -19191 -22533 -25515 -23020 -10377 -18890 -40801 -37885 -25572
15309 -25572 -21249 -21423 2495 -544 -2101 10451 16247 3834 -12476 10442 2917 2934 7066 6828
15295 6828 12100 27530 46622 40497 22963 430 -3962 20054 879 -9945 -12007 -9291 6571
15282 6571 24663 36074 21783 -12749 -26301 -33315 -44811 -36497 -33742 -31707 -6828 2443 3107
15269C107j7825M482K871j0590r716j4033J0145J4806P398J5402j0460J53K4450
15256B0190K32k2407l4342r673J121J2082K5762J0964j4082O725K863j1737k0159
15243c2461O157q711J283R532M997J70p690j9466j271K4557R063j5033O133J8727
15229d013l775m136J0147L378O321n931j5151k054p363k9518n251J0528j1038
15216e7856m379J9188M1575Q481m615j0072N221L966M942o867O715L768J865L328
15202A5260n670q615n379O456M617Q905l543L853k8411L800p203p261P497O524
15188i170m911Q463J2262M965m450j253j3640q168P560K0528J407j491j1157k3936
15174b2991R357J4564j1778l897r728m640J8516j1409O992L130k3672O639J9349
$$ plain form
15269 3107 -14718 -10236 -7365 -17955 -27671 -41704 -31559 -16753 -9355 6047 -4413 -4260 20190
15256 20190 20422 -1985 -36327 -46000 -44879 -32797 -7035 3929 -10153 -3428 -565 -12302 -32461
15243 -32461 -26304 -35015 -33732 -24200 -19203 -19033 -26723 -46189 -47460 -22903 -13840 -28873 -22740 -4013
15229 -4013 -7788 -11924 -1777 1601 7922 1991 -13160 -15214 -22577 -52095 -57346 -46818 -57856
15216 -57856 -62235 -43047 -1472 7009 2394 -7678 -2457 1509 6451 -416 6299 10067 11932 15260
15202 15260 9590 975 -4404 2052 6669 15574 12031 15884 -12527 -8727 -15930 -23191 -15694 -9170
15188 -9170 -14081 -5618 6644 11609 7159 5906 -7734 -15902 -8342 12186 13593 12102 945 -22991
15174 -22991 -13634 930 -10848 -14745 -24473 -29113 -10597 -22006 -15014 -11884 -35556 -28917 -9568
15161i568K5532n588j0397K933L603J2231n307N439j2280j1792L576j1031J0378
15148b271M126j6453Q463k551L606J6816j4167k1709j4557J9591Q01o106K5656
15135A245k921j2291K3240m232j2391k1141P138j0095Q493K3214P395n44j846
15122E264j4313l713r965q703m023K1067K910O613j7774k7640k8482K1691M8567
15109h501n580k6524J3182L311R120K2395J808l339n739j3976j6707j279J5897
15096a5932M654J7012K0290N13p744k0614m1939L686J3450J2898O917O166j2491
15083a3134j8341k2435K0780K3839J6201j5603j2622J1385J9102O883j5249k5725
15071b4919k928K3704J5547j1525r51R358j2011J5553o172n950l980n139J4382
$$ plain form
15161 -9568 15964 10376 -21 2912 6515 18746 13439 18878 6598 -5194 -1618 -12649 -2271
15148 -2271 1855 -14598 -6135 -8686 -5080 11736 -2431 -24140 -38697 -19106 -18305 -24411 1245
15135 1245 -1676 -13967 9273 5041 -7350 -28491 -21353 -31448 -22955 259 7654 7110 5264
15122 5264 -9049 -12762 -22727 -31430 -35453 -14386 -11476 -4863 -22637 -50277 -78759 -57068 -8501
15109 -8501 -14081 -40605 -27423 -24112 -14992 7403 9211 5872 133 -13843 -30550 -31829 -15932
15096 -15932 -11278 5734 26024 26537 18793 -1821 -43760 -40074 -26624 -13726 -6809 -643 -13134
15083 -13134 -31475 -53910 -33130 -9291 6910 -8693 -21315 -9930 9172 16055 806 -24919
15071 -24919 -27847 -4143 11404 -121 -1072 8286 -3725 11828 5656 -294 -4274 -9413 4969
15058D969J9815L734k9612j3964O945j1727l930J1389j6471J6658K8795k4239
15046g638j0042J4321l059q144J1270j6215K4112J6404R786N803j6572M3j0987
15033I082j2963J9354p385L119O141j08j2153r94k076j1629j4018K0059J9426
15020A5855j0826L941p328N506o195j6184j2043k3477J3241L1583j7374l1526
15008e4827Q488K2244K2870J8065N443o936j7317j4287o505j4924n882J2569M066
14995b6933J3437J0618j4355R62N794K286O300N08q147n163P223k8943J0560N469
14981b0384J5586j320p25k7574o983K230R930N927r757k084J1409O299O195j318
14967a2569m992j4468L504J0331K334j196J6311K0668k1172M476K0075j657j7840
$$ plain form
15058 4969 24784 28518 -1094 -15058 -8113 -19840 -23770 -12381 -28852 -12194 16601 -7638
15046 -7638 -17680 -3359 -6418 -14562 -3292 -19507 4605 21009 30795 36598 20026 20069 9082
15033 9082 -3881 15473 8088 11207 17348 17240 5087 4093 2017 -9612 -23630 -3571 15855
15020 15855 5029 8970 1642 7148 953 -15231 -27274 -50751 -37510 -5927 -23301 -54827
15008 -54827 -46339 -24095 -1225 16840 22283 15347 -1970 -16257 -22762 -37686 -43568 -30999 -26933
14995 -26933 -13496 -2878 -17233 -16271 -10477 -8191 -1891 -1383 -9530 -14693 -7470 -36413 -25853 -20384
14981 -20384 -4798 -6118 -6843 -34417 -41400 -39170 -29240 -23313 -33070 -35154 -23745 -17446 -11251 -12569
14967 -12569 -17561 -32029 -28525 -18194 -15860 -17056 -745 19923 -1249 3227 23302 21645 3805
14954C805m046k9351j3042J9622K5471J0464k6326k6641P615q196m762K0998K0004
14941d385Q766r509j2412r282K734L807L233l837J727L270J8128j635n499k5350
14927c0244j7389K3511J7242j2024k8173J8882K6572j746M061J9508j1834r782
14915a416j1505j0667J6190J4379k7199L3461K5864j0396M96p624p361J6899j0577
14902B0544l4904j7110J9966K1247J8805K1862M174k5759j3514j3702j5415R326
14890d480j2188K460J6617J0898q82J1565l171j3198k0430R991k463j1155l5025
14877e1461M373K8268J4729o248r728l969J946j1461J1853m819k4652j099J2324
14864c9944M997L891M932J5124K1633k2693j2086J9321o722j1680l558q222K580
$$ plain form
14954 3805 -241 -29592 -42634 -23012 2459 12923 -13403 -40044 -32429 -40625 -45387 -24389 -4385
14941 -4385 4381 -5128 -17540 -26822 -24088 -20281 -17048 -20885 -19158 -15888 2240 605 -4894 -30244
14927 -30244 -47633 -24122 -6880 -18904 -47077 -28195 -1623 -3369 692 20200 8366 -1416
14915 -1416 -12921 -23588 -7398 6981 -20218 13243 39107 28711 29207 21583 14222 31121 20544
14902 20544 -14360 -31470 -11504 9743 28548 50410 54584 28825 15311 1609 -13806 -4480
14890 -4480 -16668 -14208 2409 13307 12425 23990 20819 7621 -12809 -2818 -5281 -16436 -51461
14877 -51461 -47088 -18820 -4091 -10339 -20067 -24036 -22090 -33551 -21698 -26517 -51169 -52268 -39944
14864 -39944 -34947 -31056 -26124 -11000 10633 -12060 -24146 -4825 -11547 -23227 -26785 -35007 -32427
14851c2427R184R268R442j2340r859p209J7046O584Q358Q190L2169k051k9537
14838F818j6145J9J2198l324J3471P067J0562k124q709J7653N315N234O473k2240
14824C2268j4408j0804j359n498j5333n905K4353K2126Q889l0140k8150k0643
14812d4604j509P465K3824J3061j74O555Q481j345j0071j6773l301o568J385k535
14798b6109J6866J9409m230o433j0603Q600j1359j4113J0917J4847k685N228J293
14785A628j895n335j2728J4586r721L806L801Q833J0124k1433p993P034R10J8319
14771I936J638j4329K425k4898M042K7244L230j3527m859Q210K6753J2776K130
14758D0771j5629J213j2366J4364Q689l5829k2366l092P544J8835n37L030j360
$$ plain form
14851 -32427 -23243 -13975 -4533 -16873 -26732 -33941 -16895 -10311 -1953 6237 38406 36355 6818
14838 6818 -9327 -9308 2890 -434 13037 20104 30666 28542 19833 37486 42801 48035 54508 32268
14824 32268 17860 7056 5697 199 -15134 -21039 3314 25440 34329 4189 -23961 -44604
14812 -44604 -46113 -38648 -14824 -1763 -1937 4618 13099 11754 1683 -15090 -18391 -24959 -23574 -26109
14798 -26109 -9243 10166 5936 -497 -11100 -2500 -13859 -27972 -17055 -2208 -4893 335 1628
14785 1628 -267 -5602 -18330 -3744 -13465 -9659 -5858 2975 13099 -8334 -16327 -9293 -8383 9936
14771 9936 11574 -2755 -330 -25228 -21186 6058 9288 -4239 -9098 -888 25865 38641 40771
14758 40771 25142 26355 13989 28353 37042 1213 -21153 -24245 -16701 2134 1597 4627 3267
14745C267n316j4477r68J4198j1037p164J662K1876J4840M340j3637r885j2330
14732a4631P402j6030o747q751L870L3549K2251k5495j128k3176k9380k070O239
14719e4097L78M721J7148J772m255M914j7077L30L9391J6171j9006n944j5794
14706c1348J1376o743p13l676j4538L6033J9959l240l185k284k176m814N415l757
14692c691K6337n42j2343L064K675R062j5474o851k1509P243J4723L2688j8836
14679A6546j1837K2829J9856l9671k9939m675J939N624J4278k962K8901J5455
14667C6344K876p571j3182j448k8990n005N994M368j7660Q235J6897M042P320
14654A2220k8943q986K0474J7445k2392k3450l08J1172J493J5700k497P739J2162
$$ plain form
14745 3267 -2049 -16526 -17494 -3296 -14333 -21497 -19835 2041 16881 21221 7584 -2301 -14631
14732 -14631 -7229 -23259 -30006 -38757 -34887 -1338 20913 -4582 -5710 -28886 -58266 -60336 -54097
14719 -54097 -53719 -48998 -31850 -30078 -34333 -29419 -46496 -46166 -6775 9396 -9610 -15554 -31348
14706 -31348 -19972 -26715 -27428 -31104 -45642 -9609 10350 7110 3925 1641 -535 -5349 66 -3691
14692 -3691 22646 22104 9761 12825 15500 24562 9088 2237 -19272 -12029 2694 35382 16546
14679 16546 4709 27538 47394 7723 -22216 -26891 -24952 -19328 -5050 -8012 20889 36344
14667 36344 39220 31649 18467 17019 -11971 -16976 -10982 -6614 -24274 -16039 858 4900 12220
14654 12220 -16723 -25709 -5235 12210 -10182 -33632 -33940 -22768 -21275 -5575 -8072 -333 11829
14641A1829O687Q97q785k892k812K2226j5462L987j8102o736K2408K238n179k3696
14627a3392j2870P033J3993L7079j0306k0969k428J2314m431l0044n913M311q000
14614c3623N246J8496J5087k7381l3422q724R002J9691J6838J4292O036Q760N896
14601A6194N664q584N355K162p829j046J3692K1838J3075k7869l8757j055k0409
14588b7569j0830R825J1295R769j911k2674j0430J5122K0864K8462K4986P238
14576E4147k8595K02J3380j8210L67P220k6522j5053k00K3882K4169L774j3340
14563B5221j4393Q36j1050j749k1673Q759K5438J7405j6344j4716j4410p188P385
14550a6479o64k716Q10K0871K6271O800R43k3057j4866r631j1568L593o197j6406
$$ plain form
14641 11829 18516 19413 10628 7736 4924 27150 11688 15675 -2427 -9163 13245 15483 10304 -13392
14627 -13392 -26262 -19229 -5236 31843 21537 568 -1860 10454 6023 -24021 -29934 -25623 -33623
14614 -33623 -28377 -9881 5206 -22175 -55597 -64321 -55319 -35628 -18790 -4498 1538 10298 16194
14601 16194 21858 13274 18629 20791 12962 11916 25608 47446 60521 32652 -6105 -7160 -27569
14588 -27569 -38399 -28574 -17279 -7510 -9421 -32095 -42525 -27403 -6539 21923 46909 54147
14576 54147 25552 25754 39134 20924 21291 28511 1989 -13064 -13264 10618 34787 38561 25221
14563 25221 10828 11664 614 -1135 -22808 -14049 11389 28794 12450 -2266 -16676 -23864 -16479
14550 -16479 -17143 -19859 -19049 1822 28093 34893 35836 12779 -2087 -11718 -23286 -19693 -25890 -42296
14536d2296J1368J3946O377j2156k87j4810K7841K206Q971J9298P152N775r278
14523B4107r287Q205M453M023R342p009k1328J1104k815m3815L203j965r375j0314
14509d1471K8494M434K4251l391p606j8310J161J4973J689N768m91o365k346P945
14495H735k340j3844l758J425n333l557K0770J1367J6134K210J940k2018R137
14482B0868K057j186k3541O796K400k439k9588R301J5896m541l367M357J6654
14469A3667o534j0779J8399P247O366j6583j5855J6079J1724q081K1331J3666
14457E0647m31q85k1652n2139J772L5481N173m760k7423j0907J4973m751K0596
14444E694J1787k1072o331M622Q96J0461k868m61j0854m093J6733Q160J3755l2417
$$ plain form
14536 -42296 -30928 -16982 -10605 -22761 -23048 -37858 -10017 -7811 1160 20458 27610 33385 24107
14523 24107 14820 23025 27478 31501 40843 33834 12506 23610 20795 -23020 -19817 -21782 -31157 -41471
14509 -41471 -12977 -8543 15708 12317 4711 -13599 -12438 2535 4224 9992 9501 3136 790 8735
14495 8735 6395 -7449 -11207 -9782 -15115 -18672 2098 13465 29599 31809 33749 11731 20868
14482 20868 22925 21739 -1802 4994 7394 4955 -24633 -15332 564 -3977 -7344 -2987 13667
14469 13667 7133 -3646 14753 22000 28366 11783 -4072 12007 23731 15650 36981 50647
14457 50647 50216 49331 27679 -24460 -22688 12793 17966 13206 -14217 -25124 -10151 -14902 5694
14444 5694 17481 -3591 -9922 -5300 -4404 6057 3189 2728 -8126 -12219 4514 12674 26429 -5988
14430e988K1107J9205j449k2772j514J002l500N541n479J6681J6970j0389m6377
14417a6962J399K415J317J4214J0329J3891j6299j8026K351J180k049j6097R161
14404a3176M526K473M591P844K829O704n57m405p223K9841N000k1197j7707q925
14390i382K275l494n217Q482j3060j1609J842m427j9053J8516M7797L1885r507
14377C5048j2538j7209n834k1962j4305J72J0986R302j9122K0271J3079o549k2639
14364c1300N335O876l657j5906J5597J7369j9104J266M4429k5882m56J1017Q344
14351A3928n154R259n575k994L394l0599l343N982l986J3028L584J7376K7990
14338D2890j1972k5003j8449m106m794m938J3602N26Q140J3174J0055l187r783
$$ plain form
14430 -5988 15119 34324 32875 10103 8589 9591 6091 11632 6153 22834 39804 29415 -16962
14417 -16962 -15563 -13148 -11831 2383 12712 26603 10304 -7722 -5371 -4191 -6240 -22337 -13176
14404 -13176 -8650 -6177 -1586 6258 9087 15791 15234 10829 3606 33447 38447 17250 -457 -9382
14390 -9382 -7107 -10601 -15818 -7336 -20396 -32005 -30163 -34590 -53643 -35127 12670 44555 35048
14377 35048 22510 5301 -533 -22495 -36800 -36628 -25642 -16340 -35462 -15191 -2112 -8661 -31300
14364 -31300 -25965 -19089 -22746 -38652 -23055 -5686 -24790 -23524 20905 -4977 -5433 5584 13928
14351 13928 8774 18033 12458 9464 12858 -17741 -21084 -15102 -19088 -6060 -2476 14900 42890
14338 42890 30918 5915 -12534 -16640 -21434 -26372 -12770 -12244 -4104 9070 19125 15938 6155
14325F155p035O205J079k6111l300P258j3057O300K4523K0615j2988p438N054
14312G260R707j0319N38l004J0579Q868M563M928j3677j9040j0953J6588P094
14299A3132M770k1949l5005Q719J1969R035j6362L937K4740Q395J141n166k6867
14286a9511m750j417Q772J7542O691k794k9870k327R82l521N701j0047n945R353
14272c1141j6056K554J3041L1160J518k8392j8606n661l45Q836j488n394J7688
14259c2286M822K8411J314p985O291r161j4655n039J5025m838J4981l594P140
14246D26j2031k0658L166O612L959P016l269J944k8249K1745K5861K058J3209
14233B1789j0167j2279P667L505k2808k8677K326O179J3378k297Q827K2483J6728
$$ plain form
14325 6155 -880 5325 6404 -19707 -23007 -15749 -28806 -22506 2017 22632 9644 2206 7260
14312 7260 16967 6648 7186 4182 14761 23629 28192 33120 19443 403 -10550 6038 13132
14299 13132 17902 -4047 -39052 -30333 -18364 -9329 -25691 -21754 2986 11381 12522 7356 -19511
14286 -19511 -24261 -25678 -16906 636 7327 4533 -25337 -27664 -26682 -30203 -24502 -34549 -40494 -31141
14272 -31141 -47197 -44643 -31602 -442 1076 -27316 -45922 -51583 -51928 -43092 -44580 -49974 -32286
14259 -32286 -27464 947 2261 -5724 567 -8594 -23249 -28288 -13263 -18101 -3120 -6714 426
14246 426 -11605 -32263 -29097 -22485 -18526 -11510 -14779 -12835 -41084 -19339 6522 8580 21789
14233 21789 11622 -657 7010 10515 -12293 -40970 -38644 -32465 -19087 -21384 -12557 9926 26654
14220B6654k3627k2441q740J247R237J8267O687j9246j5738N85Q308j171p939
14207b7917o32j842J724m000J43j751J0674N839P743p349J1156J7614J0045k2428
14193i81j5118j0935k871Q993J1607P20k2019m807K2794K0565o850l359L171k234
14179a324j1336k1606k1413L765P545J4451P917J9912P325J9159J1993k9023j9280
14166a1915j966N29L5906N955j5425J0090l41j6693n046O637m240k2908k0064
14153c9481r69l633k1678K3516K8674K1451p563j1012j313K9441L393L14j8273
14140B867p62J1702J2381O040p577j1449j1975k1971N764J0713R142K3118R226
14127C7219o814m0444k7117j223l285J1363K525L1189O385k2859k3676q667J8971
$$ plain form
14220 26654 3027 -19414 -28154 -26907 -17670 597 7284 -11962 -27700 -27115 -18807 -19978 -27917
14207 -27917 -28549 -30391 -28667 -32667 -32524 -34275 -23601 -17762 -10019 -17368 -6212 11402 21447 -981
14193 -981 -16099 -27034 -29905 -20912 -9305 -8585 -30604 -35411 -12617 7948 1098 -2261 910 -1324
14179 -1324 -12660 -34266 -55679 -51914 -44369 -29918 -22001 -2089 5236 24395 36388 7365 -11915
14166 -11915 -13881 -13352 22554 28509 13084 23174 22833 6140 1094 7731 3491 -19417 -39481
14153 -39481 -40450 -44083 -65761 -42245 -13571 7880 317 -10695 -12008 17433 20826 21140 2867
14140 2867 2105 13807 26188 32228 24651 13202 1227 -20744 -14980 -4267 4875 27993 37219
14127 37219 30405 -10039 -37156 -38379 -41664 -30301 -27776 3413 9798 -13061 -36737 -45404 -26433
14114b6433J6977J3511j2149o137P385j6929O841R328M668n011p229J4325j0127
14101a0980M388L532P741K6654N922r312j6051j164R245j5930R995j2945l0577
14088b9482M111K498K8889J3993j0747j0367J7542J6844j4535k9854K6068K9412
14076D4372r257k5131K614n724j5551r458K2654L2593j5188m0931M107P263p432
14063a5069P404J5670J6264j0402r259j7984J2173Q740l884J3716m371j2946j8205
14050a8153N147J2903K6435j0686k3405r836O892J2936J5013j5634l5414J1390
14038b2412L7215k921J7478k7019j9060K577j2320R596K5884K1646j6435N152
14026A9381M944l310J396n589m1729O2K2739R781o924j2522j0240J524j2619k476
$$ plain form
14114 -26433 -9456 4055 -8094 -14231 -6846 -23775 -16934 -7606 -2938 -7949 -15178 -853 -10980
14101 -10980 -6592 -3060 4681 31335 37257 27945 11894 10730 19975 4045 14040 1095 -29482
14088 -29482 -25371 -22873 6016 20009 9262 -1105 16437 33281 18746 -11108 14960 44372
14076 44372 35115 9984 12598 6874 -8677 -18135 4519 37112 21924 -19007 -14900 -7637 -15069
14063 -15069 -7665 8005 24269 13867 4608 -13376 -1203 7537 3653 17369 12998 52 -18153
14050 -18153 -13006 -103 26332 15646 -7759 -17595 -10703 2233 17246 1612 -33802 -22412
14038 -22412 14803 11882 29360 2341 -16719 -14142 -26462 -16866 9018 30664 14229 19381
14026 19381 24325 21015 22411 16822 -24907 -24845 -2106 7675 751 -11771 -22011 -20487 -33106 -35582
14012c5582m480K275R510k317P2J9271J6760Q174R516j2526j4827J9205J1368
13999B6419j5070l3916q412J3125J0528k462p180L084k260j0171R06J5713J5437
13986E741k4835K118j0642J1112k63M166m823M371M710j809o192R031O176j3170
13972a4309p750O120j84J6666K1845P690j6415j251K2910J2904R744n300r232
13959D3438J0717J1890j5009m684j6233j7578O916q789k327O631N664k268K3540
13946D1908p394j9165J1411j3167j1533j0563J8178r618k2532n523J8532J6036
13934F570J4800l475J5933r753k2583J947J0648N790J1028p914j1581j8244k1262
13921b8096p998O531R553j706K435K3338l254q241J5746P491N166j0827L165k3113
$$ plain form
14012 -35582 -40062 -37787 -28277 -30594 -30522 -11251 5509 13683 23199 10673 -4154 15051 26419
13999 26419 11349 -22567 -30979 -17854 -7326 -9788 -16968 -13884 -16144 -26315 -25409 -9696 5741
13986 5741 -19094 -16976 -27618 -16506 -16769 -12603 -17426 -13055 -8345 -10154 -16346 -7315 -1139 -14309
13972 -14309 -22059 -15939 -16123 543 22388 30078 13663 12412 35322 48226 57970 52670 43438
13959 43438 54155 66045 51036 46352 30119 12541 19457 10668 8341 14972 20636 18368 41908
13946 41908 34514 15349 26760 13593 2060 -8503 9675 57 -22475 -27998 -9466 6570
13934 6570 21370 17895 33828 24075 1492 3439 14087 19877 30905 22991 11410 -6834 -28096
13921 -28096 -36094 -29563 -20010 -21716 -19281 4057 803 -7438 8308 15799 20965 10138 13303 -9810
13907i810q429J8294J7757M002L491N338l421r504j1567p706P711K9257n243j6248
13893A3922L02L558K99k556j7870j0980R124R095n587N61n155m120J3938J287
13879E818m269j4338Q204M0946k480L585K0165j716r180k745J0915O353j5838
13866D5420k3908k5064K1778R515l015p961j6049j8566r913K0105J6251K4750
13854C3343l108k7984J8378J4824j2486m946K424k2912j9469P895n485j6106J0286
13841b5346K6146Q914L6007l350p582p566J3635O602k1988l2303p369j4357L847
13828b4710L2244J7290j6968M259o814J2795J750l002K0143m607o070n50q570
13815A7190j7875r149J0688J9257j0719k0385p322M33j4015r874L308K434L0709
$$ plain form
13907 -9810 -18239 55 17812 21814 25305 30643 27222 17718 6151 -1555 6156 35413 30170 13922
13893 13922 14224 17782 18081 15525 -2345 -13325 -4201 4894 -693 -132 -5287 -9407 4531 5818
13879 5818 1549 -12789 -4585 36361 33881 37466 57631 55915 46735 43990 54905 61258 45420
13866 45420 21512 -3552 18226 27741 24726 16765 716 -17850 -27763 -7658 8593 33343
13854 33343 30235 2251 20629 35453 22967 18021 20445 -2467 -21936 -14041 -19526 -35632 -25346
13841 -25346 800 9714 45721 42371 34789 27223 40858 47460 25472 -6831 -14200 -28557 -24710
13828 -24710 7534 24824 7856 12115 5301 18096 19846 16844 36987 32380 26310 25760 17190
13815 17190 -685 -9834 854 20111 9392 -10993 -18315 -17882 -31897 -41771 -38463 -36029 -5320
13802e320K3233j2746J3591K809j3472P991K248n01j8897j0402R857J1006J8646
13789B8043K5488o890q309o567j1134j7695M48J4584L225j5829L733l681k7231
13776b1815j3238r233k0478L6421p620j2267L9255K6455P885j3470J348k33q992
13763D018R236J0470l691J9997J7980L873m720k3995l4000k790K2600K2977J4003
13750E5958j8739j9352j2984q279j775J840j5l334R570K436r581P649K0056N820
13736B9270L18J9793j2878J7945k537k3754m066r692J0824J901K249j0728m670
13723A3975J4837J1860J0321J1195O229J6831j4067j9529k4852k3547J9757K0374
13711D3384J4487j6888q274P896Q97M524J6931Q023j957n418J0670M966M73j5170
$$ plain form
13802 -5320 17913 5167 18758 21567 8095 16086 18334 17833 -1064 -11466 -1609 9397 28043
13789 28043 53531 46641 38332 31765 20631 2936 3384 17968 21193 5364 9097 5416 -21815
13776 -21815 -35053 -44286 -64764 -28343 -35963 -48230 -8975 17480 25365 11895 13243 13010 4018
13763 4018 13254 23724 20033 40030 58010 61883 57163 33168 -832 -3622 18978 41955 55958
13750 55958 37219 17867 4883 -3396 -5171 -3331 -3346 -6680 2890 5326 -4255 3394 23450 29270
13736 29270 29588 49381 36503 54448 51911 28157 24091 14399 25223 27124 29373 18645 13975
13723 13975 28812 40672 50993 62188 68417 85248 71181 51652 26800 3253 23010 43384
13711 43384 57871 40983 32709 40605 41502 46026 62957 70980 69023 63605 74275 79241 79714 64544
13697F4544j4613o845K794j7090J2443J5276m81j3722o042k0253j5299j4469L348
13684a0409K1626J3971k047k2093o675j4994J8893J7431J4691j1531M699K2900
13672D6462j566N408J2447j1886r928o54l140n69j9585j1150J526j3632j2600
13659a8867J6992J5047o407o658M785J5285K1651K5829j8549J074J7074J9456
13647H6712J1451k0493l6488q915J2530k718R316J538k6319j4266J1186j1244
13635A2290r670P954N978j1615n840J329J5152K4694L313j7j987j612l28k090
13621C7551l283j3904j0853K4714J912k6117j6005J0748K9409K6904l889k328
13609E4859K4018L49j1996K6596J5104m683o989O349K316R497j6336j6256K0646
$$ plain form
13697 64544 49931 43086 45880 28790 41233 56509 56028 42306 36264 16011 712 -13757 -10409
13684 -10409 11217 25188 23141 1048 -5627 -20621 -1728 15703 30394 18863 23562 46462
13672 46462 44896 50304 62751 50865 40937 40283 37143 36574 16989 5839 7365 -6267 -18867
13659 -18867 -1875 13172 6765 107 4892 20177 41828 67657 49108 50182 67256 86712
13647 86712 98163 77670 41182 32267 44797 42079 51395 52933 26614 12348 23534 12290
13635 12290 2620 10574 16552 4937 -903 426 15578 40272 43585 43568 41581 39969 39641 37551
13621 37551 34268 20364 9511 34225 36137 10020 -5985 4763 34172 61076 57187 54859
13609 54859 78877 79226 67230 93826 108930 104247 97258 103607 105923 115420 99084 82828 103474
13596A03474J02j2005j0560j4764q106j4826R379J8233J9538m176J2400O09j2493
13583H6805j3037M344L3421K0783J9143l1501l3541r023J0666K0133J0314P518
13571A26025j4611J7761M473p859J600j2177p976o290k078m383R892q131j3232
13558H3014K1119K8368P478r91n481j6214r023l815J1127M3291j649k982K4718
13545A78960L2173K1594M806R33Q940l432q239J2820J3618K5716K1513K0048J0827
13532C40277J3148q888K2622M5383N4391L6445K2971O0168R2652J01593J19279
13521I00041J15100J19690R0404J22427J20175J02764Q6339J24404J10504R5111
13511A986959J34539J91875K20036L25771N23735P29162R83953J309035J611739
$$ plain form
13596 103474 103576 91571 81011 66247 58141 43315 52694 70927 90465 86289 98689 99298 86805
13583 86805 73768 78112 111533 132316 151459 119958 86417 77394 88060 108193 118507 126025
13571 126025 111414 129175 133648 125789 127389 115212 107236 100946 98868 94485 104377 96246 83014
13558 83014 104133 132501 139979 138988 133507 117293 108270 104455 115582 158873 157224 154242 178960
13545 178960 211133 232727 237533 238466 247406 243974 235735 248555 262173 287889 309402 329450 340277
13532 340277 353425 344537 367159 412542 466933 503378 526349 586517 679169 780762 900041
13521 900041 1015141 1134831 1225235 1347662 1467837 1570601 1656940 1781344 1891848 1986959
13511 1986959 2121498 2313373 2533409 2859180 3382915 4112077 5096030 6405065 8016804
13502H016804J744010J515852Q39719j41625j065398j570188j685988j521899
13494F131287j247038r65406p06979n25104l77736l09228k37521k19686j78761
13485A363828j19986q8446o6008n0457m1702q0062p5348n2400m2683o0578l8180
13474F47978m0792j9021J6784k091j1987q089P47M111K8349N3296K9835K2215
13462G21335M3487O5547Q4527O2551O6466R5432J07015J34648J48700K32105K77070
13451B038883L36406M66411O11783Q37793J095934J288768J342147J141035P60590
13442I919750L84498J11122j62088n70440r49838j187456j245804j118370r11671
13433D269703o78013m62188l05256k30409j57458o3057j483K7296J03690J79360
$$ plain form
13502 8016804 9760814 11276666 12116385 11974760 10909362 9339174 7653186 6131287
13494 6131287 4884249 3918843 3211864 2686760 2309024 1999796 1762275 1542589 1363828
13485 1363828 1243842 1155396 1089388 1038931 997229 917167 841819 789419 746736 686158 647978
13474 647978 607186 588165 604949 602858 590871 582782 583529 587640 615989 669285 699120 721335
13462 721335 764822 830369 914896 977447 1043913 1139345 1246360 1381008 1529708 1761813 2038883
13451 2038883 2375289 2841700 3453483 4291276 5387210 6675978 8018125 9159160 9919750
13442 9919750 10304248 10415370 10253282 9682842 8733004 7545548 6299744 5181374 4269703
13433 4269703 3591690 3129502 2824246 2593837 2436379 2373322 2371839 2399135 2502825 2682185
13423B682185K49379L72907N51611P98831J194272J616412J981905K093122J728553
13414A3269177R14324k41211j318878j940031k071761j849960j479694j094815
13406D187151q14488o20272m43610l01021k50304j87526j53992j28992j29955
13397A156991j00028p4517o7612p5888p8828p7252q6212n0900l8242l0984n4080
13386D22448k2098J467j5068m0023k4377k3703q395k2327j5640j5885J8957K0788
13374B76144n890P636k0476m618q544l60J6578q272k0655O966o935p689N860k195
13360B27550j1508j6703q838P916P894n330l3145k166K733m672O392J9645q58
13347A88910n830j472j7001j7496P245j0018K2754K3948J6532L7435J5573K1992
$$ plain form
13423 2682185 2931564 3304471 3856082 4654913 5849185 7465597 9447502 11540624 13269177
13414 13269177 14183501 13942290 12623412 10683381 8611620 6761660 5281966 4187151
13406 4187151 3372663 2752391 2308781 2007760 1757456 1569930 1415938 1286946 1156991
13397 1156991 1056963 982446 914834 838946 760118 682866 596654 545754 507512 476528 422448
13386 422448 400350 401817 386749 346726 322349 298646 290251 267924 252284 236399 255356 276144
13374 276144 270254 277890 257414 252796 244252 243892 260470 252198 231543 238509 231574 223885 229745 227550
13360 227550 216042 199339 190501 198417 206311 200981 167836 165670 168403 163731 170123 189768 188910
13347 188910 183080 181608 164607 147111 154356 144338 167092 191040 207572 245007 260580 282572
13335B82572L5005L2627J8200M7375L0532K0094K1804l217m458j5682k0761l1355
13323D12736l7417n1884k3934j1655j4076J85o130j943J2978j2982P95m4893m9827
13310A71953j4713J0437j222n507q058j4961j6791j8764P859j3546k0555j0457
13298F5675K1169m71m953K3081L739k5152J0153J0741R283J5088N812k2576M593
13285A16182Q281j7648J7858K3856J5359k1508k5004j3118J302m134l105K6254
13273A24575K1121n629j3903J1314Q46J0762j48k6054j4841K8221j0687J222j8911
13260A07888o558j0236j6488j7655j1386L521L634Q086m301l1408q788N39p146
13247I702N912K8825K2183m264P977J7514l080J6250J1703P784K2799O094K872
$$ plain form
13335 282572 317577 350204 368404 415779 446311 466405 488209 484992 480534 464852 444091 412736
13323 412736 375319 323435 299501 287846 273770 273955 267825 265882 278860 265878 266673 221780 171953
13310 171953 157240 167677 166455 160948 152890 137929 121138 102374 110233 96687 76132 65675
13298 65675 86844 86373 81420 104501 108240 83088 93241 103982 113265 128353 134165 111589 116182
13285 116182 124463 106815 124673 148529 163888 142380 117376 104258 105560 101426 98321 124575
13273 124575 145696 140067 126164 137478 138324 149086 148938 122884 108043 136264 125577 126799 107888
13260 107888 101330 91094 74606 56951 45565 49086 52720 60806 56505 25097 16309 16848 9702
13247 9702 15614 44439 66622 62358 70335 87849 84769 101019 112722 120506 143305 149399 152271
13234A52271p682m955K2409r070m1432j1010J3945j4586l486J2126K3984m853
13222A27661l1812j3714r325R023J4829K1840J730j0466Q74k547j8583K6987R920
13209A26417m661j2865K1493J1277q233m767R456P901L1511K4732j3241j2423
13197A76597m444J7660J4439K6172M9066L7935O312k5668J7852J9619O713m231
13185C38022j7394p261K2747N657k2442j9499j5215K1436r751J9870K7023j9683
13173C23510m2611q510L57J0833L9826M027m079R072P928J257l1838N553Q501
13160C23826J6704P405j559N63r925J1125K1968K5331L681J907N772J0947j5768
13147D01977J9314J2554r496M996J7005J4102Q476J1572R968J3491K3832J4151
$$ plain form
13234 152271 144589 139634 162043 152973 111541 100531 114476 99890 96404 108530 132514 127661
13222 127661 95849 82135 72810 81833 96662 118502 120232 109766 110640 108093 89510 116497 126417
13209 126417 121756 108891 130384 141661 133428 128661 138117 146018 177529 202261 189020 176597
13197 176597 172153 189813 204252 230424 279490 317425 323737 298069 315921 335540 342253 338022
13185 338022 320628 313367 336114 341771 319329 299830 284615 306051 296300 316170 343193 323510
13173 323510 280899 272389 272746 283579 323405 327432 323353 332425 340353 341610 309772 315325 323826
13160 323826 340530 347935 346376 346939 337014 348139 370107 395438 399119 401026 406798 417745 401977
13147 401977 421291 433845 424349 429345 446350 460452 468928 480500 490468 503959 527791 541942
13135E41942L503J9764L1489L0280L2284J8213L7452L7870L5244P0419N6938N5530
13123I70928N2667R9915J02986R9317J03299J41221K03557K49733K98205L18552
13113B640380L22871L08064K85026K25540J30910N0713m2390j04654j62220j97956
13103C456284j80608j68326j35746p6442k0540L854M2396O6916J20012J58864
13093C266664J72866K08625K76979L11656L59704M20568M83331N93814P08094
13084F802301Q48705R23215J011306J116531J292120J514462J714551J975763
13076A7198954K412284L024688L874354N132289O965764R556726J2964683J6829853
13068G7959595J9958758K0636911J7813778J2468675O779896K830450K80821k946155
$$ plain form
13135 541942 545445 565209 596698 626978 659262 677475 714927 752797 788041 858460 915398 970928
13123 970928 1023595 1123510 1226496 1325813 1429112 1570333 1773890 2023623 2321828 2640380
13113 2640380 2963251 3271315 3556341 3781881 3912791 3963504 3921114 3816460 3654240 3456284
13103 3456284 3275676 3107350 2971604 2895162 2874622 2878476 2920872 2987788 3107800 3266664
13093 3266664 3439530 3648155 3925134 4236790 4596494 5017062 5500393 6094207 6802301
13084 6802301 7651006 8574221 9585527 10702058 11994178 13508640 15223191 17198954
13076 17198954 19611238 22635926 26510280 31642569 38608333 48165059 61129742 77959595
13068 77959595 97918353 118555264 136369042 148837717 155617613 158448063 158728884 155782729
13060A55782729p937286j3923362j8635430k0203134j8815550j5621234j2045930
13053D8600803q935186o555707m899936l760804k958067k425516k024308j726921
13045A5314358j522491j361992j237737j115705j015870r45249q58155p02731
13037F554428o16591n42009m79969m06316l50727l09811k80860k42161k03863
13028C122121k01889j73068j50285j59502j32839j25639j29938j00379q4409p5619
13018A788554o4219m1629o1845m3056n7442m6509n2421m9406m1307l2563m4858
13007A253299o6463m2667k9284m7258l1573k2052l3907m6478o097J6588k8323
12996I15785j9476j5871m9777k6863j3868q539j3477K1786k560k5463k6884k6349
$$ plain form
13060 155782729 147845443 133922081 115286651 95083517 76267967 60646733 48600803
13053 48600803 39665617 33109910 28209974 24449170 21491103 19065587 17041279 15314358
13045 15314358 13791867 12429875 11192138 10076433 9060563 8115314 7257159 6554428
13037 6554428 5937837 5395828 4915859 4509543 4158816 3849005 3568145 3325984 3122121
13028 3122121 2920232 2747164 2596879 2437377 2304538 2178899 2048961 1948582 1864173 1788554
13018 1788554 1724335 1682706 1620861 1577805 1520363 1473854 1421433 1372027 1330720 1298157 1253299
13007 1253299 1186836 1144169 1114885 1067627 1036054 1014002 980095 933617 927520 944108 915785
12996 915785 896309 880438 830661 803798 789930 781391 767914 789700 787140 761677 734793 708444
12984G08444p411r498j9173k9344k7745r727m105l7986l1470k4892j978r563J8461
12971E14013p882j1626j2474n94j6661k5690j8616l0172j2764j6678Q609l064
12959C66401j1163O723K952K0545K3000j7493m173K0690o097k3422o278M938j6374
12946C60249L0733k666k9782k3046M27J2849k1725q091j3689J8929M653j0893
12934C17948l894j0859k2683l3030L673P285J3580o29n519l666j9979J574J7924
12921B61725k05j0575j7048k5028j3656M331M333k5540J3559m556R097o841P525
12908A97121J558l8501M1K5289O102k1452r995q182j04K896K3399j8257k0663
12895A39252K956O753m353k8227O711N046k0451J7091L298o715K5823J5418J9726
$$ plain form
12984 708444 701033 691535 672362 643018 615273 605546 601441 563455 531985 507093 505115 495552 514013
12971 514013 506131 494505 482031 481437 464776 439086 420470 390298 377534 360856 369465 366401
12959 366401 355238 361961 364913 385458 408458 390965 386792 407482 401385 377963 371685 376623 360249
12946 360249 390982 388316 358534 335488 335915 348764 327039 318948 305259 324188 328841 317948
12934 317948 314054 303195 280512 247482 251155 258440 272020 271391 265872 262206 242227 243801 261725
12921 261725 261520 250945 233897 208869 195213 199544 203877 178337 191896 187340 196437 189596 197121
12908 197121 198679 160178 160219 185508 191610 170158 160163 151981 151877 154773 178172 159915 139252
12895 139252 142208 148961 144608 116381 123092 128138 107687 124778 128076 121361 147184 162602 182328
12882A82328L0258J5865J2867k018k7198j1527J483q383j9656j7533m26k6321
12870A29739j7889m493O461K2252j7930n309j373o045K8735m010j5773j5211j0428
12857H8726P535j3101k5983j6769M1243P384j0678K1451l135j9050l680k1347
12845E2596j5166O167O339J1685R700M316l4004n387L0794J7205j8293j7179m414
12832D4359l31J0662K1580J6999P884j5496j1046R499K5320J1624N360P880K9142
12819A63436m3027m864J6255J4766J5350r730k8069Q053m139l4267R239K9533
12807A32536k191j5631j9004j4164j0275L3233l369k3780J670j1j0791p764j0696
12794D9763N155J9078J8849q365k2958N452Q617M278j8P736K4422k976n255n237
$$ plain form
12882 182328 212586 228451 241318 239300 212102 200575 202058 193675 174019 156486 156060 129739
12870 129739 111850 107357 113818 136070 118140 112831 111458 105413 134148 130138 114365 99154 88726
12857 88726 96261 83160 57177 40408 81651 89035 78357 99808 96673 77623 73943 52596
12845 52596 37430 43597 49936 61621 71321 75637 41633 36246 67040 84245 65952 48773 44359
12832 44359 44028 54690 76270 93269 101153 85657 74611 84110 109430 121054 126414 134294 163436
12819 163436 120409 115545 131800 146566 161916 152186 124117 132170 128031 93764 103003 132536
12807 132536 130345 114714 95710 81546 71271 104504 101135 77355 79025 79014 68223 60459 49763
12794 49763 54918 73996 92845 84480 61522 66974 75591 79869 79851 87587 112009 109033 103778 98541
12780I8541O327q625k85k2859k3159K0008q557j5607p206J7823K9322m685j983
12767G9055j6687r420J8692J8228j1656q396N575P2R847R188j3681j638r664j5557
12753E3958j0349J2916K803l5856L0465J7875k3342J836K5206k6008k6867m416
12741A8221O168j804L6906K5087l7821k5849Q071J1730l705J5280j211j1354J4898
12728E4617K9400j8022j5727O374o809p884m884J438J4760J0756K663m834j4980
12715D6868J606j5407P938K8421m903l686K2143n511m332J647Q034k178k0446
12702F0194k4925j1399p619J3774Q140L369l20J6149k4979j6538R957J7874p689
12689C5988k5953L566K876M5658J0295j7148m426J6621q466j2485k3448N083J6459
$$ plain form
12780 98541 104868 96243 95958 73099 49940 69948 61391 45784 38578 56401 85723 81038 79055
12767 79055 62368 52948 71640 89868 78212 69816 75391 75463 85310 94498 80817 79179 69515 53958
12753 53958 43609 56525 59328 23472 53937 71812 48470 50306 75512 49504 22637 18221
12741 18221 24389 22585 59491 84578 46757 20908 28979 40709 37004 52284 51073 39719 54617
12728 54617 84017 65995 50268 56642 49833 41949 37065 38503 53263 64019 66682 61848 46868
12715 46868 48474 33067 41005 69426 64523 60837 82980 77469 73137 74784 82818 80640 60194
12702 60194 35269 23870 16251 30025 38165 41534 41214 57363 32384 15846 25803 43677 35988
12689 35988 10035 13601 16477 62135 72430 55282 50856 67477 59011 46526 23078 28161 44620
12676D4620k973j4295q290m634j9085k6475r225K2908L844O11J4699l441K077
12663C41J447K2449J2450K456K2710K298P579k4515n256J4781M69j1422L398k096
12649D7089l2920n86J1319K0524r407m867k03J5138j1965J1902j3480j5192K535
12636A9887m784N86J9285r453N08K9537J211R846J0734N47O057K2984j594L321
12622A08672K4664J2061j484o572n058L6059K0103L2269K1161j486K3744L5365
12610B99498M3246Q2639Q7235O1416M1695M6036O3821P737k93J4338l3919m9207
12598F64242o3107m6532n6077q3192p8604n2845k5973o005l2079l2816k3139l9353
12586A24520P035n039l5336K9168O446l2318q36l746j4430j1120O732J166J0695
$$ plain form
12676 44620 41647 27352 19062 14428 -4657 -31132 -40357 -17449 -13605 -12994 1705 -1736 341
12663 341 1788 24237 36687 39143 61853 64151 71730 47215 41959 56740 57209 45787 49185 47089
12649 47089 14169 13583 24902 45426 36019 31152 30949 46087 34122 46024 32544 17352 19887
12636 19887 15103 15689 34974 25521 26029 55566 56777 66623 77357 77904 83961 106945 105351 108672
12622 108672 133336 145397 143913 137341 132283 168342 188445 220714 241875 240389 264133 299498
12610 299498 342744 425383 512618 574034 615729 661765 725586 733323 733030 747368 713449 664242
12598 664242 601135 554603 498526 415334 336730 283885 257912 251907 219828 187012 163873 124520
12586 124520 131555 126516 91180 120348 126794 94476 93640 89894 75464 64344 71076 72242 82937
12573H2937j6878k6735J3422K6403j2321q281L753r606K7466J4677q946k731m070
12560G9090Q030o707m966n117J759j7864j1421o119j3124m603J424J2640k702
12547C0320m294k3059j9123K922R926M5081L1086j9093p872m410j5955K3703J5201
12534F4433j4148j7962M797Q33J2511o161j2583k047j6867r127K3492k009k5782
12521f20m765K9479K9517K2546L714k7048j957p189j4968k260j712J5907J553
12508D2197j2336j646o542Q27j0951l768P336j5676J6934M30K187Q453J1540k955
12494C6030j8386J1180J6123r097N191P563j7722j6382J7373P659O535M177J1436
12481F1680Q01j1482q200k5446r879K1219l781K431K6280k076j1932q997J7263
$$ plain form
12573 82937 66059 39324 52746 79149 66828 58547 62300 52694 80160 94837 85891 83160 79090
12560 79090 87120 80413 75447 70330 72089 54225 42804 36685 23561 18958 20382 33022 30320
12547 30320 26026 2967 -16156 -13234 -3308 41773 72859 53766 45894 41484 25529 49232 64433
12534 64433 50285 32323 37120 37953 50464 44303 31720 29673 12806 3679 27171 25162 -620
12521 -620 -5385 24094 53611 76157 79871 52823 50866 43677 28709 26449 24737 40644 42197
12508 42197 29861 28215 21673 22500 11549 7781 15117 -559 16375 16805 18992 27445 38985 36030
12494 36030 17644 28824 44947 35850 41041 48604 30882 14500 31873 39532 46067 50244 61680
12481 61680 62481 50999 42799 17353 7474 28693 24912 27343 53623 51547 39615 30618 47881
12468D7881q94M734R923Q870J2161k5450n742J845J2441O217n756j1299j2563
12455D2368l0988j9405J7020J198J9004Q435J7934K011r104P074l998o713k1202
12442B3634O753n387k3604J5036L0106J4095j4173q651O643O486J5681Q446N971
12429H1036l533l117j8192j9300n779j4042J4748K8372J5595k2489q962P631L281
12416E5249k5722j5332Q062P81r18K3761k218k5599L210J5841J5818P024o821
12403E3136k3177k3552J5909P944q128k32N905N782m984J828M054P830j475R738
12389E0578K543k089J569M528Q443j4961n194r737k3211l702R941P722l53J1326
12375C7403Q987J2006k1084j8181j8354J9734J0260L322N384J2927j0990m584
$$ plain form
12468 47881 46987 51721 61644 70514 82675 57225 51483 53328 65769 71986 66230 54931 42368
12455 42368 11380 -8025 8995 10193 29197 37632 55566 57577 48473 55547 51549 44836 23634
12442 23634 30387 25000 1396 16432 46538 60633 46460 37809 44452 50938 66619 75065 81036
12429 81036 77503 74386 56194 36894 31115 17073 31821 60193 75788 53299 44337 51968 55249
12416 55249 29527 14195 22257 23038 22120 45881 43663 18064 21274 37115 52933 59957 53136
12403 53136 29959 6407 22316 30260 22132 21900 27805 33587 28603 30431 34485 42315 40840 50578
12389 50578 53121 51032 52601 57129 65572 50611 45417 35680 12469 8767 18708 26430 26077 37403
12375 37403 46390 58396 37312 19131 777 20511 30771 34093 39477 52404 41414 36830
12363C6830p321N094K0468j4583j6626j9906k4831L1451J2472o955K0285P099
12351D3477P744j0836J2688K4498k7104j0127r722j589J6739j373on950M150O859
12337D9448R63j1444J2641K0214j8154k786M571Q241j846j9003j5566K3093J8482
12324F8854k4628k1700J178J5107K349P89Q996j8792J6720r117j3958n824L0400
12311E0374k0135J8821J4813q557N085O013j6250r521M486J067j1601j73j3317
12298B1105J9339J9068Q458P477Q53M745o790m034Q880k0542n230J4419M327O103
12284G8178p12l6741q361K4788J3316J8959K9993j1174q381k520l8829M81p916
12271E1081K429j0406J3945L2031M2680n31k1954m542Q066l0529j7074L0311K2231
$$ plain form
12363 36830 29509 34603 55071 40488 23862 3956 -20875 10576 23048 16093 36378 43477
12351 43477 51221 40385 53073 77571 50467 40340 30618 29029 45768 44395 44389 38439 42589 49448
12337 49448 50411 38967 51608 71822 53668 50882 55453 63694 61848 42845 27279 50372 68854
12324 68854 44226 22526 23704 38811 41160 41949 50945 32153 48873 39756 25798 19974 50374
12311 50374 30239 49060 63873 55316 60401 66414 50164 40643 45129 46196 34595 34422 21105
12298 21105 40444 59512 67970 75447 76300 81045 74255 70221 79101 58559 53329 67748 72075 78178
12284 78178 77466 40725 32364 57152 70468 89427 119420 108246 99865 97345 58516 58997 51081
12271 51081 53510 43104 57049 89080 131760 131229 109275 104733 112799 82270 65196 95507 117738
12258A17738r999j5560k1255p299j4241j480K7996J5977M347M243p593o057j1671
12245G5146j4602q681O909l918j3152N828J1358N099J9713R409j6010L335O35
12232H1069j9972n152O501N889o538j3558J2990K4025L818R05J1553k447P81M869
12218A04733M650j3136j7062o6J3637j8652M420J910M729K1003j648p144O299
12205A03673k0969J1229J9184Q210j5849j4307m392r215J2229O294j4459R691
12193I1319K9422j0888m277Q547L419o571r453M161l0815p335K4032K5917J8541
12180A36019k6646j7597k8227J5877L4742K2356O421q22L69J439j3908O490n713
12167A30800j2539o921j3964J9280J1178j8293k565J050r751Q727J5597k669o764
$$ plain form
12258 117738 107739 92179 70924 63625 49384 47904 75900 91877 96224 100467 92874 86817 75146
12245 75146 60544 51863 58772 54854 41702 47530 58888 63987 83700 93109 77099 80434 81069
12232 81069 61097 55945 62446 68335 61797 48239 61229 85254 89072 89977 101530 99083 99864 104733
12218 104733 109383 96247 79185 79119 92756 74104 78524 80434 85163 106166 104518 97374 103673
12205 103673 82704 93933 113117 121327 105478 91171 86779 77564 89793 96087 81628 91319
12193 91319 120741 109853 105576 114123 117542 110971 101518 105679 74864 67529 91561 117478 136019
12180 136019 109373 91776 63549 79426 114168 136524 142945 142123 142492 143931 130023 136513 130800
12167 130800 118261 111340 97376 116656 127834 109541 106976 108026 98275 107002 122599 119930 113166
12154A13166O963K1530J4945p563K109j4306J0211K2919J4853o466j0006j8527
12142A49828k6463J1623J225J3625N891o962j2074m542L915K1578R921q420j8562
12129A40583Q214j4961o395R516L691k012K5292L073J6244p467J470Q014J0546
12116A95808K1126K0039j822l0974j9301l1805r087L2793N469M689J263o002j7673
12103A64523j58M582J4798j6516J2280L4161J6471Q672k233j6408o590K0655J0996
12090B45233j8317j0051Q032j2097j1356J9537M1690J5166K703m836j3954m772
12078B56978J5411K1148K959r230j1142q536O666L2404K9026K6655L0822J366
12066C94527k8549N682J9787l332M292O725R529j4677o278m323M425K3670N388
$$ plain form
12154 113166 120129 141659 156604 149041 151150 136844 147055 169974 184827 178361 168355 149828
12142 149828 123365 134988 136213 149838 155729 148767 136693 132151 136066 157644 167565 159145 140583
12129 140583 148797 133836 127441 136957 140648 138636 163928 167001 183245 175778 177248 185262 195808
12116 195808 216934 236973 235151 204177 184876 153071 143984 176777 182246 186935 188198 182196 164523
12103 164523 164365 168947 183745 167229 179509 213670 230141 238813 236580 220172 213582 234237 245233
12090 245233 226916 216865 224897 212800 201444 220981 262671 277837 280540 275704 261750 256978
12078 256978 272389 293537 296496 287266 276124 267588 274254 306658 335684 362339 393161 394527
12066 394527 365978 371660 391447 388115 392407 399132 408661 393984 387706 383383 387808 411478 416866
12053D16866J531J3163K4059L2737J1129K2666J7369J9644L1244O1447N2544N6972
12041G61371j178n1523n1046n2466k0080k37J986K7400J4366j1343j448N616J9303
12028F40721L9432J4564j6568J9073N907q421K1515M4900J7743O127K8609M8473
12016H62075K2679K0936J8359J2966J2576K9239L2295L1615L3391L5613N6775
12005A168519O1784L6795N7086R3904J24454J71028K24033K10547M7395j02095
11995B093450j33990j05401m4580j0601J7609M8291M9409N8374Q2648O7863P6595
11984B199667P1299O7033R5299R9901J15284R6522R4596J29547J54599J57351
11974C281098J58337J67526J86765J92329J62686J90953K34277K42664K62752
$$ plain form
12053 416866 418397 431560 455619 488356 499485 522151 539520 559164 590408 651855 704399 761371
12041 761371 760193 708670 657624 605158 585078 584841 586827 614227 628593 617250 615802 621418 640721
12028 640721 680153 694717 678149 697222 703129 694708 716223 761123 778866 784993 813602 862075
12016 862075 884754 905690 924049 937015 949591 978830 1011125 1042740 1076131 1111744 1168519
12005 1168519 1230303 1267098 1324184 1418088 1542542 1713570 1937603 2148150 2195545 2093450
11995 2093450 1959460 1854059 1809479 1798878 1816487 1864778 1914187 1972561 2055209 2123072 2199667
11984 2199667 2270966 2337999 2433298 2533199 2648483 2745005 2839601 2969148 3123747 3281098
11974 3281098 3439435 3606961 3793726 3986055 4148741 4339694 4573971 4816635 5079387
11965E079387K85754L08435L31305L53884L60981M00397M50456M88740N47279
11956H606618O19894P42436P76134O53201N16089M61228M80993N48709O29805
11947A4035107O63074O51450N98267N80578M86046M19065L48567K30165J08018
11938A8120337K4096j06959k64503l53509m20855m93816n71132o18917o45843
11929A4668899o79795o94831o86614o70751o49799o08491n77632n46207n36329
11920I018450m92850m63996m47446m15383l72660l62559l41846k92979k47088
11911E581643k29350j80940j95015k46137k72419k75249k23460k00553j85959
11902C572561j58444j64112j52709j30031j25526j12631j24073j10327o7223r1741
$$ plain form
11965 5079387 5365141 5673576 6004881 6358765 6719746 7120143 7570599 8059339 8606618
11956 8606618 9226512 9968948 10745082 11398283 11914372 12375600 12856593 13405302 14035107
11947 14035107 14698181 15349631 15947898 16528476 17014522 17433587 17782154 18012319 18120337
11938 18120337 18144433 18037474 17772971 17419462 16998607 16504791 15933659 15314742 14668899
11929 14668899 13989104 13294273 12607659 11936908 11287109 10678618 10100986 9554779 9018450
11920 9018450 8525600 8061604 7614158 7198775 6826115 6463556 6121710 5828731 5581643
11911 5581643 5352293 5171353 4976338 4730201 4457782 4182533 3959073 3758520 3572561
11902 3572561 3414117 3250005 3097296 2967265 2841739 2729108 2605035 2494708 2427485 2335744
11892B335744r0967q0010q2262o7103n1720q0154q8922n7614n4658p3081p2498
11881A536755n4062k9182m5799m6438m8360j3950l2909n0855l6009k7786k7040
11870A124365k7964k1748k066j6680l0408k9892k2574k7857l3758j6578k7014
11859H67826k7342k4047j4458k2761j4114j9918k7446j6591m3136J4480K961N78
11847F76032j6906l9288j2233L778l7340k7656k3523k343P689K5849J3241k7464
11835E39836J0416j4131k9452j2706j5874j5097m482j3904r896m235n950j8066
11823D06459k7867J4003J1607j6234P235J0522j2596j4244j1161j3639J6288J1733
11811C82106r377j4389l7936j6480k4818q262K1643J4372m390j2673j3455j0098
$$ plain form
11892 2335744 2244777 2164767 2082505 2015402 1963682 1883528 1794606 1736992 1682334 1609253 1536755
11881 1536755 1482693 1453511 1407712 1361274 1312914 1298964 1266055 1215200 1179191 1151405 1124365
11870 1124365 1096401 1074653 1072587 1055907 1025499 995607 973033 945176 911418 894840 867826
11859 867826 840484 816437 801979 779218 765104 745186 717740 701149 658013 672493 675454 676032
11847 676032 659126 619838 607605 611383 574043 546387 522864 520521 528210 554059 567300 539836
11835 539836 550252 536121 506669 493963 478089 462992 458510 444606 434710 430475 424525 406459
11823 406459 378592 392595 404202 387968 395203 405725 393129 378885 367724 354085 370373 382106
11811 382106 372729 358340 320404 303924 279106 270844 292487 306859 302469 289796 276341 266243
11799B66243K0043O348j291Q953p837k179j1880j2456Q092K167o655l039j4587
11786B51922J4303L413k006m330o050K0938k0621l3600K15q1j4011p142J2737
11773B15687L7454M822l4755l4176O203j724l4402Q008K5855j0607K6855j734
11761B07486l2542k4063k2311L451R303q31J3226K0132P870J5451J0381k0024
11749A87529j5005j6426j9301k232J3779J3111k0006k2128j864R787k80k5233
11737A01731q225R626J174J937J3861J5675n100k1725j3840K475R948P174r06
11724A13805r396M252J503j8597J6278L7856N413j9062M91K2654O25k1386m309
11711A30127L587k253j6731J6539N670j4930q242l332j7445K1491K9598k3803
$$ plain form
11799 266243 286286 292634 291343 300296 292459 290280 278400 265944 274036 276203 269548 266509 251922
11786 251922 266225 269638 267632 263302 257252 278190 257569 223969 224184 224103 210092 202950 215687
11773 215687 253141 257963 223208 189032 195235 193511 159109 167117 192972 182365 209220 207486
11761 207486 174944 150881 128570 132021 141324 140493 153719 173851 181721 197172 207553 187529
11749 187529 172524 156098 136797 134565 148344 161455 141449 119321 117457 127244 126964 101731
11737 101731 93506 103132 104306 106243 120104 135779 130679 108954 95114 97589 107537 114711 113805
11724 113805 104409 108661 110164 91567 107845 145701 151114 132052 132543 155197 155822 134436 130127
11711 130127 133714 131461 114730 131269 136939 122009 113767 110435 92990 114481 144079 120276
11699A20276j0791K248k593O879k1731l6072l105J9632J2155o12n766r695J890
11686G2715J2314J6435K2060J3347k0549q386j3266j2298p67p33J5378j200j8811
11673G6239m111K2476j6977l6309k1914K3770O799J312J2629J9859K671j2789
11661G3655K538M621j8570J6044J6350K881k962r108p865l4362P893k0924J1873
11648D2064L0810Q937j33o523m151r921N278j485O377R888p366j3454j0828J2658
11634F2151J0292N996l117m2106k9659j4127L8884L7412P570O084o352N53P189
11621H0770p058O155K6129M789q700k7578J334P689m2j2295n618J9582r22j415
11607H2820o372N342L092k2795j1274m843n094r911j1408J0256J7523J2462N51
$$ plain form
11699 120276 109485 111733 109140 116019 94288 58216 55111 74743 86898 86286 80520 70825 72715
11686 72715 85029 101464 123524 136871 116322 107936 94670 82372 81605 80872 96250 95050 76239
11673 76239 72128 94604 77627 41318 19404 43174 49973 51285 63914 83773 86444 73655
11661 73655 76193 80814 62244 78288 94638 97519 94557 85449 77584 43222 51115 30191 42064
11648 42064 72874 81811 81678 75155 71004 61083 66361 64876 71253 81141 73775 60321 49493 62151
11634 62151 72443 78439 75322 33216 3557 -10570 28314 65726 73296 79380 73028 73581 80770
11621 80770 73712 79867 105996 110785 102085 74507 75841 83530 83488 71193 65575 85157 84235 82820
11607 82820 76448 81790 84882 62087 50813 45970 40876 30965 19557 29813 47336 59798 60349
11594F0349l319J217J7933P539m1412k255N34P708J8392N731J3584p803k2305
11581E5893k0413P441L9263J3101j9582m374N865j7817q125o874p93P794J6532
11568F7911m773L676j0249j9826k8908j2056K6724K4031l052K782J0766K231O769
11555F6026q835l50R26r048K680r69J736N069q663j4420K8026k522j620J3070
11541G1106O058l1436J930M133K0200L826j5027M951j4800p328Q662K0286N274
11528G7835o713k4410k8395J1155j732K0830J4550j6097K137O292L468k5643j0144
11515B3133J8722m773J8753K1790j3216r874J1631J7216K0133j459p644j2584
11503H1828L213J3264r749k89m188l1426k1231K098K214r932J39j9531j2863K0769
$$ plain form
11594 60349 57030 58247 76180 83719 42307 40052 40586 48294 66686 72417 86001 78198 55893
11581 55893 35480 42921 82184 95285 75703 71329 77194 59377 51252 44378 43585 51379 67911
11568 67911 63138 66814 56565 36739 7831 -4225 22499 46530 43478 46260 57026 59257 66026
11555 66026 57191 56841 57767 48719 51399 50430 52166 57235 48572 34152 62178 59656 58036 71106
11541 71106 77164 45728 47658 51791 71991 75817 60790 65741 50941 43613 52275 72561 77835
11528 77835 71122 46712 18317 29472 27740 48570 63120 47023 49160 55452 58920 33277 23133
11515 23133 41855 37082 55835 77625 64409 54535 66166 83382 103515 102056 94412 81828
11503 81828 85041 98305 88556 88267 84079 52653 31422 33520 35734 25802 25941 6410 -6453 14316
11489A4316J0314m741P727N381j1218j6729O346r531J068J2274J3928K2796J222
11476E3153J004j5350j489m750m696J0223J0887m033k4577j0339p236M508K5300
11463C2605J3960k66l738j180K953N849p908r612p787n398q082l126J0049J9047
11449C7366O051M893k1444K311k1302K702P147J2324J6877j6952J6273K0338j5982
11436E0602M939O385K608p293j0841J4808k1081k4316J278n688J0394J1283Q50
11423C3928j3042K4653K0341l4448j2796j8699q614J3349K2740r607n38j2938
11411D329p3K0663O431k665O237J400j1559j2191j9448j5561O595j1607L816K5045
11397A412K6520J8397P636j8470j5355n013j5400K3317j76K3843L608j8346N793
$$ plain form
11489 14316 24630 19889 27616 32997 21779 5050 11396 1865 2933 15207 29135 51931 53153
11476 53153 54157 38807 37318 32568 27872 38095 48982 44949 20372 10033 2797 7305 32605
11463 32605 46565 46299 42561 41381 44334 50183 42275 32663 24876 19478 11396 8270 18319 37366
11449 37366 43417 48310 26866 29177 7875 10577 17724 30048 46925 29973 46246 66584 50602
11436 50602 55541 61926 64534 57241 46400 61208 40127 15811 17089 11401 21795 33078 33928
11423 33928 20886 45539 65880 31432 18636 -63 -8677 4672 27412 17805 17267 4329
11411 4329 4256 24919 31350 28685 34922 36322 24763 12572 -6876 -22437 -15842 -27449 -23633 1412
11397 1412 27932 46329 53965 35495 20140 15127 -273 23044 22868 46711 50319 31973 37766
11384C7766M519N38j6663l4493o581J5O268K0978J223l302L037M588J2750R354
11370C9997l659J8717K4357j8025q072m770j0086L102m667K6488o611k0335j4236
11357B2200K2826J8117n750k965j697J509K4202n499j8799o852j4395K0089n192
11344D7794L735Q679k2161M77K877j0788k5697j3382k986Q773J6271J2119k451
11331B3260k317l120l239J1192j987k204j0598j7568j7845J229K129J5222K1775
11318A5929k754j4644l345P988J988q340J2867j6493k3782j897L5390n1j2598
11305i742J7222O380M971k601K0140p726m731M074o590K9668Q087j2571J6798
11292F3379j4865r354j0294J8559J913k0929L998j4065k7581k60N021j1801n49
$$ plain form
11384 37766 42285 42823 26160 -8333 -14914 -14899 -8631 12347 13570 10268 13305 17893 30643 39997
11370 39997 36338 55055 79412 61387 53315 48545 38459 41561 36894 63382 56771 36436 22200
11357 22200 45026 63143 57393 54428 52731 54240 78442 72943 54144 47292 32897 52986 47794
11344 47794 51529 60208 38047 38524 41401 30613 4916 -8466 -11452 -2679 13592 25711 23260
11331 23260 20943 17823 14584 25776 23789 21585 10987 -6581 -24426 -23197 -21068 -5846 15929
11318 15929 13175 -1469 -4814 3174 5162 -3178 9689 -6804 -30586 -32483 2907 2856 -9742
11305 -9742 7480 13860 18831 16230 36370 28644 23913 27987 21397 51065 59152 46581 63379
11292 63379 48514 39160 28866 47425 49338 28409 32407 18342 -9239 -9499 -4478 -16279 -16828
11279a6828O603Q174K0871j5821j4825Q70R502n170j618j9339J3203K510K3955
11266A2087L0508j0888k1870l2524o077m938P179J6224J0958K1949J5607Q380
11254D6595k137j3761k1036k951J1928K8127j327k964K286n921J1n072J0488Q533
11240E2799j874q634n207K319J190K509M84j0495K646l2948j6238K5672K2049
11227C4272J9452l577L895m631p31j363m401k7921p103K3430m842J917J5313j4102
11213B9608j5436J1146m939K455J2815J0431L740n234j0123Q825j5753J054N254
11200C3843J9794P174M420k2280k0218K5175n389j0490k068j3095K62P5Q051J9360
11186D4614K2060J0368m296k0237j81j1327j8047J2923K709P499K7662O025l1525
$$ plain form
11279 -16828 -10225 -2051 18820 2999 -11826 -10956 -1454 -6624 -8242 -27581 -14378 -11868 12087
11266 12087 42595 31707 9837 -22687 -28764 -33702 -26523 -10299 659 22608 38215 46595
11254 46595 44458 30697 9661 6710 18638 46765 45438 42474 44760 38839 38850 33778 44266 52799
11240 52799 50925 42291 37084 39403 40593 43102 43586 33091 35737 2789 -13449 12223 34272
11227 34272 53724 50147 54042 49411 48680 47317 42916 14995 7892 31322 26480 28397 43710 29608
11213 29608 14172 25318 20379 22834 35649 46080 49820 44586 34463 43288 27535 28589 33843
11200 33843 53637 60811 65231 42951 22733 47908 42519 32029 29961 16866 17128 17203 25254 44614
11186 44614 66674 77042 72746 52509 52328 41001 22954 35877 38586 46085 73747 79772 48247
11173D8247j2357R688J8458l477m582K109J2863j7601j4181K439J2823k1436j5657
11160A7336P709K400Q45n450R401l698k900L3497L451o789k443L1339l84K9692
11146A14006J4901J3369J2035K1071K1987J7353j5977k2730J389J8624L8549N2867
11134B87444O9100J05563J54949J69913K47525L22788L06030J76099n158j92463
11124A641790k92412l13213k58858j50814j23094q6515o6038o9156l8382k0948
11114B22360k7274k0136K435O72J735l0835l3903K133J186Q030k2225j0650p806
11101H5722j0911J5009J9808q533j4972k1036Q907O461O036K5359K1126K5074
11089A58050L9772L3037N9595N4535N709l3527o2007m9369m1127l5784j2408k7881
$$ plain form
11173 48247 35890 45578 64036 60559 55977 58086 70949 53348 39167 41606 54429 32993 17336
11160 17336 25045 27445 28290 22840 32241 28543 25643 59140 62591 55802 53359 84698 84314 114006
11146 114006 128907 142276 154311 175382 197369 214722 198745 176015 177404 196028 234577 287444
11134 287444 356544 462107 617056 786969 1034494 1357282 1663312 1839411 1834253 1641790
11124 1641790 1349378 1036165 777307 626493 503399 416884 350846 281690 243308 222360
11114 222360 195086 174950 177385 178057 179792 148957 115054 117187 118373 126403 104178 93528 85722
11101 85722 74811 89820 109628 101095 86123 65087 73994 80455 86491 111850 132976 158050
11089 158050 197822 230859 290454 344989 350698 317171 255164 205795 164668 128884 116476 88595
11077H8595j0196J0289K133K0762j367P923J6827K3882J9164K779j9003q313k6862
11064A26613K368q298K281k580k6331j3398J214j7142o532K259j2497q628K3411
11051F2740P369M550j558J4144Q114K9779K1003P947J3418l988k1937j5324R229
11038A35486L220j2547K2945L5123N357P755O302K4906j911j5432r090K2518r46
11025B23686J046J0895M2007O6445L3782r612k6164j1636k4186k5931k2928k8008
11013B29396N83N780n470J0744K406j5975k0444k0015k4788j9702J0596J7680
11001A70791q959P318Q044K629k6845j1354J2364J6906J8949k7365l4608k4163
10989A03707j3772K0187O448j1816l0080N514J4329m317l925l1842l0760J861
$$ plain form
11077 88595 78399 88688 90821 111583 110216 118139 134966 158848 178012 180791 161788 153475 126613
11064 126613 128981 120683 122964 120384 94053 80655 81869 64727 58195 60454 47957 39329 62740
11051 62740 70109 74659 73101 87245 95359 125138 146141 154088 167506 163518 141581 126257 135486
11038 135486 138706 126159 149104 184227 189584 197339 203641 228547 226636 211204 202114 224632 223686
11025 223686 224732 235627 277634 344079 377861 368249 342085 330449 306263 280332 257404 229396
11013 229396 229979 235759 230289 241033 243439 227464 207020 187005 162217 142515 153111 170791
11001 170791 161832 169150 177194 179823 152978 141624 153988 170894 189843 162478 127870 103707
10989 103707 89935 110122 116570 104754 74674 80188 94517 90200 86275 54433 23673 25534
10977B5534k4931k966L9361M093J308K3217K391k2752k5519j1326K9302J1563
10965D9275J6796j912m868J3455J3524O391j0646k4342r572J6951J7969p935R549
10952H4635M342P496J393P134j9171j1516J6267L378j0003J0948L1590J6396l949
10939A38940J134K5746K7668M6770N4159N1906r949m7549m4319l5536k539j7924
10927A88507k6066q817J3682M137j6623j4672N895K2966l699q231M415K1265K9740
10914B12499J8722q986J0853J9873K0049N1040P5749J19276J24190J47204K07499
10903I97968K59380K45075J71049K751j64165k41987k25041j99544j66613j29614
10893E49259q4779n1431m0024r578k5373l0703j0589j4941k7236m2874j4509K759
$$ plain form
10977 25534 603 -2363 36998 41091 42399 65616 68007 45255 19736 8410 37712 49275
10965 49275 66071 64159 59291 72746 86270 92661 82015 57673 48101 65052 83021 75086 84635
10952 84635 88977 96473 97866 105000 85829 74313 90580 93958 83955 94903 126493 142889 138940
10939 138940 140074 165820 193488 240258 294417 346323 336374 288825 244506 208970 206431 188507
10927 188507 162441 153624 167306 171443 154820 140148 146043 169009 165310 157079 161494 182759 212499
10914 212499 231221 222235 233088 252961 273010 324050 399799 519075 643265 790469 997968
10903 997968 1257348 1502423 1673472 1676223 1512058 1270071 1045030 845486 678873 549259
10893 549259 464480 413049 373025 363447 338074 307371 296782 281841 254605 211731 197222 199981
10881A99981M087r166j6443m459k1506k4521m144O968j255l8003p504p344k0265
10868E6426m086m626k629k9192N035K3781K782J1185L9587K2345J038M314J2681
10855A38641J3357J7381K0799j1985p355j093l61K1524j0106O817L720J5669L952
10842B10960k1559k2600j228J2271k852m942J1226K8015M37m62k4206j8628K4482
10829A90914J8023o392j1240P610K7567o808l7566J0243L0606O438M2K5934K1311
10816B76682K6526J2997L1069K9265K7843L3771M5808O0544J16616R9613K0526
10805G81260k2522m2076o7292p5521p4001m6913j4437r121j1973M304j3532j1745
10793C96431q748J0120J3194j4898J705J502k018M265O456J3723j6170j3197j078
$$ plain form
10881 199981 204068 194902 178459 174000 152494 127973 123829 130797 129542 91539 84035 76691 56426
10868 56426 52340 47714 45085 15893 20928 44709 47491 58676 98263 120608 121646 125960 138641
10855 138641 151998 169379 190178 178193 170838 169745 169384 190908 180802 187619 191339 207008 210960
10842 210960 189401 166801 165573 177844 174992 170050 181276 209291 209728 209266 185060 166432 190914
10829 190914 208937 202545 191305 198915 226482 219674 182108 192351 222957 229395 229437 255371 276682
10816 276682 303208 316205 347274 376539 404382 438153 483961 544505 661121 760734 781260
10805 781260 758738 716662 649370 573849 499848 452935 438498 429377 417404 421708 408176 396431
10793 396431 387683 397803 410997 396099 397804 399306 397288 401553 408009 421732 405562 392365 391287
10780C91287J4190L140J1852R959M679R194P162q874k041l94K0684J3492J2268
10767D86598J9933J3464j411J5474R697K0694P842L211m328k1296j9746l917J9398
10754E45613K5905K0953L2430K0701N0876M4292N096L0998M1561M6452K3744K0430
10742I09051M1787M1358M7794M5708L0023J2590J5123M6723N8734N1768O8892
10731A369551Q1764N8453Q1652Q6152N2110N2396N0415Q1713Q0431J04103J02526
10720B201266J16221J19579J14377J25155J21790J41530J14137J18837J70151
10711C343043K37751K63269K97755L34453L75230M03819M30453M54259N38095
10702F678127O31882P61206Q86610J056981J256461J524398J871848K127101K400855
$$ plain form
10780 391287 405477 408617 420469 430428 435107 444301 451463 442589 440548 440154 460838 474330 486598
10767 486598 506531 519995 518584 534058 543755 564449 572291 575502 571174 549878 530132 526215 545613
10754 545613 571518 592471 624901 645602 696478 740770 745866 776864 818425 864877 888621 909051
10742 909051 950838 992196 1039990 1085698 1115721 1128311 1143434 1190157 1248891 1300659 1369551
10731 1369551 1451315 1509768 1591420 1677572 1729682 1782078 1832493 1914206 1994637 2098740 2201266
10720 2201266 2317487 2437066 2551443 2676598 2798388 2939918 3054055 3172892 3343043
10711 3343043 3580794 3844063 4141818 4476271 4851501 5255320 5685773 6140032 6678127
10702 6678127 7310009 8071215 8957825 10014806 11271267 12795665 14667513 16794614 19195469
10693A9195469K703749L206453M043635N317199P166773R832274J3769494J9801242
10685H5036288K9036447M2488667N9450072P3961643P0553230L3348878k0725198
10678C73150027n7350173o9959457o3498049m8060701l3423800k2904563j5983997
10671F1969287j1380154q327452o233278m746492l688323k973942k563151k326390
10663A9730105k106304j868228j643539j405663j229353j038293q80283p32648
10655H825794o21394m94958l82739k74603k27855j70671j38680k9302Q4596K03309
10645F773497L38260N35354Q52385J371113K055015K999214M030591M432183L109429
10636B6497041L9555k672624l914226l867536l002518k019437j235245o20418
$$ plain form
10693 19195469 21899218 25105671 29149306 34466505 41633278 51465552 65235046 85036288
10685 85036288 114072735 156561402 216011474 289973117 360526347 393875225 373150027
10678 373150027 315799854 245840397 182342348 134281647 100857847 77953284 61969287
10671 61969287 50589133 42261681 36028403 31281911 27593588 24619646 22056495 19730105
10663 19730105 17623801 15755573 14112034 12706371 11477018 10438725 9558442 8825794
10655 8825794 8204400 7709442 7326703 7052100 6824245 6653574 6514894 6485592 6570188 6773497
10645 6773497 7111757 7647111 8499496 9870609 11925624 14924838 18955429 23387612 26497041
10636 26497041 26536596 23863972 19949746 16082210 13079692 11060255 9825010 9204592
10628I204592j34679L37608R11660J701059K847828M229745N428586N186730K272045
10619C1985174j521946l567973l779483k756093j490788q53097q62834j115923
10611A6037037j223816j038126o58654o2156O34193J501586K358597L035615L144765
10602B3729041K095599K22798j407267k175058k070108j335866l00791Q35282
10594A9593630K081334L338221M243113M027757K176797o32491k891989l862203
10586B8074169l570628k531333j252488O8451J368138K603978L600571L967766
10578C2328624L477844K618964J778544L19932k318501m584683n302427m773677
10570B3544620l449076k075673j123481p95608j051522j540470j910915j967828
$$ plain form
10628 9204592 9069913 9407521 10319181 12020240 14868068 19097813 24526399 29713129 31985174
10619 31985174 30463228 26895255 23115772 20359679 18868891 18015794 17152960 16037037
10611 16037037 14813221 13775095 13116441 13054285 13688478 15190064 17548661 20584276 23729041
10602 23729041 25824640 26047438 24640171 22465113 20395005 19059139 18758348 19593630
10594 19593630 21674964 25013185 29256298 33284055 35460852 34828361 31936372 28074169
10586 28074169 24503541 21972208 20719720 20788171 22156309 24760287 28360858 32328624
10578 32328624 35806468 38425432 40203976 40523908 38205407 33620724 28318297 23544620
10570 23544620 20095544 18019871 16896390 16100782 15049260 13508790 11597875 9630047
10562I630047j719079j375578j044252p91343o22787m56332l29695k64198k08169
10553B818614j48079q2951j4349L9905J19217K06485L34495N42609Q20630J030139
10543E666715R68333N04241k51682q18885j028147r74447q00630n87305m23856
10534B254337l15803k37511j72244j30935j08672r5097q6946p1088n6427n9495
10524I20119o5654m4381k1334l3698n3418m8066k3082j4147j5683l8155p777j7532
10512E37192j5949o164N78q011k197j0158k371L378j3172k0298J8007r496k760
10499D68579R883K9946j807j3932k3600l439K576k721l9877m3642k4637j6937
10487C40392k0872l145O097M200k7553k0530K1432j533j0252P724j7602k3837
$$ plain form
10562 9630047 7910968 6535390 5491138 4699795 4077008 3620676 3290981 3026783 2818614
10553 2818614 2670535 2587584 2573235 2613140 2732357 2938842 3273337 3815946 4636576 5666715
10543 5666715 6635048 7139289 6887607 6068722 5040575 4066128 3265498 2678193 2254337
10534 2254337 1938534 1701023 1528779 1397844 1289172 1194075 1107129 1036041 979614 920119
10524 920119 854465 810084 788750 755052 701634 653568 630486 616339 600656 562501 554724 537192
10512 537192 521243 515079 515657 507646 505449 495291 492920 496298 483126 462828 480835 471339 468579
10499 468579 478462 508408 506601 492669 469069 465630 468206 465485 425608 381966 357329 340392
10487 340392 319520 316375 322472 326672 299119 278589 300021 298488 288236 295960 278358 254521
10475B54521j2827o05j1185J2534K135J2639Q953j5793r344K1439J099l8098j6306
10462B09162Q012J2457P719L437l4268j2552N575k3949M844J3942L447k101J6329
10449B12054K6241K3701q697j9975J58J0058Q936j8388j1555j8508j7497k4837
10437A61691M639K4939R450K966J206J5358R956r430j0320R046J1830K097j7965
10424B15463k6280Q293p652j1950j153J8816m83j0391l546J0073P074j1315l0496
10411A56453L110K7618J3505k825R155M744k1131j2831j8836j4852R982L044j4540
10398A42596r840J6385R512J0891m490k978o407k9480j5469P119K0705n249j0993
10385A22302j4285j9827R707J8189Q341O366Q608o554q719L449Q515R852K7008
$$ plain form
10475 254521 241694 241089 229904 242438 244573 257212 266165 250372 241028 262467 263566 225468 209162
10462 209162 217174 229631 237350 240787 206519 193967 199542 175593 180437 194379 197826 195725 212054
10449 212054 238295 261996 253299 233324 233482 243540 252476 234088 222533 204025 186528 161691
10437 161691 166330 191269 200719 203685 204891 220249 230205 220775 210455 219501 231331 233428 215463
10424 215463 189183 197476 189824 177874 176721 195537 195054 184663 181117 191190 198264 186949 156453
10411 156453 159563 187181 200686 197861 207016 211760 190629 177798 158962 144110 154092 157136 142596
10398 142596 132756 149141 158653 169544 165054 162076 155669 126189 110720 117839 138544 133295 122302
10385 122302 108017 88190 97897 116086 124427 130793 139401 132847 124128 127577 136092 145944 172952
10372A72952l8067j9006k1933k1618J50Q445Q808N113J6505j633R868M562r54
10359A23192j7175q636Q738O929l004J1939R514k9548k2037R787M030r389j496
10346H2844O41j037l917l165L443M118J4781R229J5099k718k6039l4645N854K1680
10332H6168P266J658j1046k53J4279Q347k4498j2126P526R350k531O261L511L194
10318I7106r482M076l81L092k4277j1099J3059L2165l045p632J1054j9803p257
10305G7576J5023K5120m486l455j3458L444J6983J4273M66R417l5231l2730j0335
10292F2607n772K0154O205o127l1072k8621J6539K7685j7515q644P850o003p573
10279B9713l671K312K5283J3218j9751j0274P378L7575J3441m582j3962N11n198
$$ plain form
10372 172952 134885 115879 93946 72328 72478 80923 89731 94844 111349 109716 119584 124146 123192
10359 123192 106017 97381 106119 113048 110044 121983 131497 101949 79912 89699 93729 84340 82844
10346 82844 83485 82448 78531 75366 78809 82927 97708 106937 122036 119318 93279 58634 64488 86168
10332 86168 93434 95092 84046 83793 98072 106419 81921 69795 77321 86671 84140 90401 93912 97106
10318 97106 87624 91700 91319 94411 70134 59035 72094 104259 101214 93582 104636 84833 77576
10305 77576 92599 117719 113233 109778 96320 99764 116747 131020 131486 140903 105672 72942 62607
10292 62607 56835 76989 83194 77067 45995 17374 33913 61598 44083 35439 43289 37286 29713
10279 29713 26042 28354 53637 66855 47104 36830 44208 81783 95224 90642 76680 77191 71993
10266G1993r908n251R909L2513K1928M56j9079k1579j0765k7019J8180K1130K650
10253H5158K972q918j2875Q079O146J8041l37l291n32K778J5743K1748J3058j1784
10239A35986K7640L4726J1940K4681N0236M9038P7361R4845J19744J67236K48926
10228A042359L21224L04471J90120r229j92021k72092k96251k69697k03950j39125
10218D75809p4005m4959n5523m0039m282j4537j6406j0687j6851K85j2213l5889
10206A50703Q295J2314k4196k8536k0387k5668r91Q644K8076O725j8730o642K9894
10193A19501j0267k6117P162j5126J9326L0255R456N836J5986J723K1555J1695
10181A90985r232j4958K105Q410n369K039j1195k3783l3307J1457J3848J3413
$$ plain form
10266 71993 62085 56834 66743 99256 121184 121640 102561 80982 70217 43198 61378 82508 85158
10253 85158 88130 79212 66337 74416 80562 98603 98266 94975 94443 97221 112964 134712 147770 135986
10239 135986 163626 198352 210292 234973 285209 334247 411608 506453 626197 793433 1042359
10228 1042359 1363583 1668054 1858174 1848945 1656924 1384832 1088581 818884 614934 475809
10218 475809 401804 356845 301322 261283 257001 242464 226058 215371 198520 198805 186592 150703
10206 150703 158998 171312 147116 118580 98193 72525 71534 80178 108254 114979 96249 89607 119501
10193 119501 109234 83117 90279 75153 94479 124734 134190 140026 156012 157735 179290 190985
10181 190985 181753 166795 168900 177310 171941 173980 162785 139002 105695 117152 131000 144413
10169A44413M3109M8206L0383J6103K4945N529k8954k6263k1149l0419j9141N41
10157A87303K693L108J7787L0885J7899p108p393k6778j4205k1927k0969J3667
10145A74962K6635M696j271M496j3833k886l5730l1670N149k508l2376l336K7649
10132A19977R285n802L5911K0820J737k5856k6539j4343K6678K4591L4918L6419
10120B37796L7803j2284l3352k0567J2750j2738k552k2429n0170j9035l1346O241
10108I0117l511l1516J9348J9856l810m695M9k6194R758K394J2435J3569J7359
10095A15159j9859n029K5Q53L1923P873L861J9264K3329o23R851J2866Q456j8243
10081A89706j4104j9238k4825l7422j5902j8480N642l214j3210M49j2006m3088
$$ plain form
10169 144413 187522 235728 266111 282214 307159 312688 283734 257471 236322 205903 186762 187303
10157 187303 189996 193104 210891 241776 259675 252567 245174 218396 204191 182264 161295 174962
10145 174962 201597 206293 205022 209518 195685 192799 157069 125399 130548 128040 95664 92328 119977
10132 119977 129262 123460 159371 180191 181928 156072 129533 115190 141868 166459 201377 237796
10120 237796 275599 263315 229963 209396 222146 209408 206856 184427 134257 115222 83876 90117
10108 90117 86606 55090 74438 94294 90484 85789 85838 59644 69402 71796 84231 97800 115159
10095 115159 95300 90271 90296 91149 123072 130945 134806 154070 177399 176776 186627 199493 207949 189706
10081 189706 175602 156364 131539 94117 78215 59735 65377 62163 48953 49402 37396 -5692
10069e692m803K8125J0796q117P201j5170J288K0981J8156j907j3857j6723L868
10056B4146J1069n819J0271K3294P352j8149p252J37J3346j5095j119j6043o578
10043A9560q472P646K0304n865R748J902k6544j0328M216K3091K4048K5870J1572
10030I6748m526j9060j0650L22l724N226j2871R32k2651J5311J2132k308j2448
10017D2433n079n456j290J1535j5536j9570J6421R160J3505j9265Q69Q937k917
10004C3747O730P848p499j6793p198J9843j1045j9022k7285l484J6140K1506j724
9991A1764j3022Q265K0115l129q20l295K934J5342p839k8860j7875J3037p116
9978a0499O88J4285k2602j8010n570J4931O646L142K007J5738K6960L341q098
$$ plain form
10069 -5692 -10495 17630 28426 20309 27510 12340 13628 34609 52765 50858 37001 20278 24146
10056 24146 35215 29396 39667 62961 70313 52164 44912 45049 58395 43300 42181 26138 19560
10043 19560 11088 18734 39038 33173 42921 44823 18279 7951 12167 35258 59306 85176 96748
10030 96748 92222 73162 62512 62834 59110 64336 51465 52397 29746 45057 57189 54881 42433
10017 42433 37354 31898 30608 42143 26607 7037 23458 32618 46123 26858 27727 36664 33747
10004 33747 40477 48325 40826 24033 16835 36678 25633 6611 -20674 -24158 -8018 13488 11764
9991 11764 -1258 7007 27122 23993 23173 19878 22812 38154 30315 1455 -16420 -3383 -10499
9978 -10499 -9811 4474 -18128 -36138 -41708 -26777 -20131 -16989 -14982 756 27716 31057 22959
9965B2959J4428j5454M933J7551J3414O018j5927O772j5578j5801N095O547j3690
9952B1267L196K432J3808N019k8489k874J7038J2904j9930j8109N778n06r557
9939A977J8584n98j7695O207J4745K8789N712j4252j4118j8680J2804M6572Q720
9926G8767N384O104k3487l8893m447P226m041j7038j1837K603j5463l605J8744
9913A7O852r322p010L537j9927J6911K2398J436j9545q584N565P640n65Q454R318
9898A7175k173j506j745J2271j3177o11j2020k2r727k3941K1795L1255K7238p079
9884C7733j7532k131j3431J3073p984k1904q381j3480j755M221P447K1930J9290
9871A7096J0373q186p11P602Q529J432l951O016k878J1135j1489k3961k0507l553
$$ plain form
9965 22959 37387 21933 26866 44417 57831 63849 47922 54694 39116 23315 28410 34957 21267
9952 21267 24463 26895 40703 45722 17233 14359 31397 44301 24371 6262 12040 11534 1977
9939 1977 20561 19963 2268 8475 23220 52009 57721 43469 29351 10671 23475 70047 78767
9926 78767 84151 90255 66768 27875 23428 30654 26613 9575 -2262 341 -15122 -18727 17
9913 17 6869 -2453 -9463 -5926 -25853 -8942 13456 14892 -4653 -13237 -7672 -32 -597 7857 17175
9898 17175 15002 13496 11751 24022 10845 10234 -1786 -1808 -11535 -35476 -13681 17574 44812 37733
9884 37733 20201 18070 4639 17712 9728 -12176 -20557 -34037 -35792 -31571 -24124 -2194 17096
9871 17096 27469 19283 18572 26174 34703 36135 32184 38200 35322 46457 34968 11007 -9500 -13053
9857a3053K2297J4909K5569j89J710K90l696j5283J00J9133J0920q992k7074p371
9843A9270j8088K028J424j2558r483J0780P699j3113J7510K5729m010j0898R152
9830B5442O052j0518Q346R337j1091L107k899j2083r518R484J7564p054p009k651
9816A6509J2674j0489n696j4207J643J3640r516L527L324j2168n377J949J3303
9803I116O221j0142q218O994L668J7129N001k9543o768K0979l606m290k555O923
9789A0909k833J290k256k8984L546L2869j1481r1J0189N028l126j2304P012l3206
9775b3438j5275J7166L3494J0705r259k7341J0223J328L911J5141J3508q959l658
9762A7546K2698J176r373n333M233j1823k7184j0788J8549R180L657M340J6991
$$ plain form
9857 -13053 9244 24153 49722 49533 51243 51533 47837 32554 32654 51787 62707 53715 26641 19270
9843 19270 1182 3210 4634 -7924 -17407 -6627 1072 -12041 5469 31198 27188 16290 25442
9830 25442 31494 20976 29322 38659 27568 30675 27776 15693 6175 15659 33223 26169 19160 16509
9816 16509 29183 18694 12998 -1209 434 14074 4558 8085 11409 -759 -6136 -4187 9116
9803 9116 15337 5195 -3023 3971 7639 24768 29769 226 -6542 14437 10831 6541 3986 10909
9789 10909 8076 9366 7110 -21874 -18328 14541 3060 2969 13158 18186 15060 2756 9768 -23438
9775 -23438 -38713 -21547 11947 22652 13393 -13948 -3725 -2397 1514 16655 30163 21204 17546
9762 17546 40244 41420 32047 26714 30947 19124 -8060 -18848 -299 8881 12538 16878 33869
9749C3869l245j9931j1851P979p182l474P642O344j8973O940K0830J672J690J6321
9735C8631J8130p140k3814k0359k593N133k926J5906K1389j803J5383j2231j491
9722D2215J513j8640j7407P415j9711J860j6730j3345l98l627P401P117J8240
9709d097K8070J946j0399j2957r663l287J1759R646K439M896L317o455m763k4223
9695a3771L8624O637J439o209j4273J6997J7072j6805j4746r57J8476R012j0707
9682C0789j3413k6757l015O658J2429j5471J4783J6218j9010j1193O707K2851
9670B1576L606j1341k3295N349o755l69J1047J8720P458n345O881L2462J9967
9657G9961N51j8760j2061j4999k9857p890M1659M9325L0260K889m3335l1663m3882
$$ plain form
9749 33869 30624 10693 -1158 6821 -361 -3835 3807 10151 -8822 -1882 18948 20620 22310 38631
9735 38631 56761 49621 25807 5448 2855 7988 5062 20968 42357 40554 55937 43706 42215
9722 42215 43728 25088 7681 15096 -4615 -2755 -19485 -32830 -33228 -36855 -29454 -22337 -4097
9709 -4097 23973 25919 15520 2563 -7100 -10387 1372 11018 13457 18353 21670 15215 10452 -13771
9695 -13771 24853 31490 32929 26720 12447 29444 46516 29711 14965 14008 32484 41496 30789
9682 30789 17376 -9381 -12396 -5738 6691 -8780 6003 22221 3211 -7982 -1275 21576
9670 21576 25182 13841 -9454 -4105 -10860 -11229 -182 18538 25996 20651 27532 59994 79961
9657 79961 80512 61752 49691 34692 4835 -3055 38604 87929 118189 121078 77743 46080 2198
9644B198l2351K9536L6473l856l4296p064J2102R126K3912L941j6514j5218J2190
9631B0179l912Q785N543l2053l565J0426j7830l3981K0634K0391j5869M008J0886
9618f358j3157Q748J0676J2280K6520m152k2374n305n387J53K3480n279o379r012
9604D454k1057P514P204Q00j2865m431l848J5567J8760J0648K672K4577n718j3083
9590C1194j3469j7226j5859J5889J6736L626k9968j3724q711r850J1813L3871
9578D322J9125P06K153R89r381j7789n913J307r605k157J4179J7960j7681k1677
9564b3462r958J3708J8093J8652P166K3649O010q803j8319q138l273n881k3627
9551a4183o575J5474K1394j7893k303N55r774l9431J0458J5783J6974J5291L63
$$ plain form
9644 2198 -30153 -617 35856 32000 -2296 -9360 2742 11868 35780 39721 23207 7989 20179
9631 20179 16267 25052 30595 -1458 -5023 5403 -12427 -46408 -25774 -5383 -21252 -17244 -6358
9618 -6358 -19515 -10767 -91 12189 38709 34557 12183 6878 1491 1644 25124 19845 13466 4454
9604 4454 -16603 -9089 -1885 -1085 -13950 -18381 -22229 -6662 12098 22746 25418 49995 44277 31194
9590 31194 17725 499 -15360 529 17265 20891 -9077 -22801 -31512 -41362 -29549 4322
9578 4322 23447 24153 26306 27295 17914 125 -5788 -4481 -14086 -16243 -2064 15896 -1785 -23462
9564 -23462 -33420 -19712 -1619 17033 24199 47848 53858 45055 26736 18598 15325 9444 -14183
9551 -14183 -20758 -5284 16110 -1783 -4086 -3531 -13305 -52736 -42278 -26495 -9521 5770 6133
9538F133J3735k387J9254J4504k3142j3202J2756j702k5722n661J2915L836k5229
9525a3912r347J2647R30O032J3M099r20M414J6159R791j4249k5070j1310m083
9511b4806j1217J1461O252n877K92n489O684l0195Q432L285j6294n420j2945J8717
9497e7120M4013j1891k7395J4926J5006J3601K9751R686r832j3575N401J3020
9485B5591J329M572K122k0169j0510J1865n268N510p336k5864j350R924R722M20
9471E58K8229J5998n779j7688j6844J883K8254Q47r292M56O836p140q743j1910
9457E665j468P079j8696P003J1107o67P987Q925k046q684l9894k8461Q876L568
9443c9706N202K4132K0948L171j3517k2610M107L305M132j117J747P038k3692
$$ plain form
9538 6133 19868 17481 36735 51239 28097 14895 27651 25949 227 -5434 7481 11317 -13912
9525 -13912 -23259 -10612 -9682 -3650 -3637 462 -458 3956 20115 29906 15657 -9413 -20723 -24806
9511 -24806 -36023 -24562 -18310 -24187 -23895 -29384 -22700 -52895 -44463 -41178 -57472 -62892 -75837 -57120
9497 -57120 -13107 -24998 -52393 -37467 -22461 -8860 20891 30577 20745 7170 12571 25591
9485 25591 26920 31492 33614 13445 2935 14800 9532 15042 7706 -18158 -19508 -9584 138 558
9471 558 28787 44785 39006 21318 4474 6357 34611 35458 26166 26622 33458 26318 17575 5665
9457 5665 4197 11276 -7420 -417 10690 10023 18010 26935 24889 16205 -23689 -52150 -43274 -39706
9443 -39706 -34504 -10372 10576 13747 230 -22380 -18273 -14968 -10836 -11953 -10206 -3168 -26860
9430b6860n963K714J587K1327J5975P907J190j7331j7928M481J4394K4373N989
9417C1855l1648k5262J932J5058L605q468J6868L1900k0758j8552j115j7025j8063
9404c9673K6223N780qK9305R192j1848l3514R353L1126n600l0386r139R167m701
9390a4723j4044q882J7930O594J4769L722k031l23l922M195j038K687j3290K946
9376e410k025k2721Q453K6561p65j4792J3428K1410L2504K0783o534k4074k6107
9363B0711n243l867J076n005J2428J6148o518q066k5426n217J4727k1432j9968
9350c5652K016J6910J3712J5160L635J2060j1596l0518n818j7318N706j792J9119
9337a4376J645J4999K973P718L825n080l0159k9293l105K1621P362L0897r343
$$ plain form
9430 -26860 -32823 -30109 -28522 -7195 8780 16687 17877 546 -17382 -12901 1493 25866 31855
9417 31855 207 -25055 -23123 -8065 -4460 -12928 3940 35840 15082 -3470 -4585 -21610 -39673
9404 -39673 -13450 -7670 -7678 21627 30819 18971 -14543 -5190 25936 20336 -10050 -19189 -10022 -14723
9390 -14723 -28767 -37649 -19719 -13125 1644 5366 3335 3012 -910 3285 2247 4934 -8356 -5410
9376 -5410 -7435 -30156 -21703 4858 4093 -10699 2729 24139 56643 77426 70892 46818 20711
9363 20711 15468 11601 12677 7672 20100 36248 29730 21664 -3762 -8979 5748 -15684 -35652
9350 -35652 -33636 -16726 -3014 12146 15781 27841 16245 -14273 -20091 -37409 -31703 -33495 -14376
9337 -14376 -12731 2268 5241 12959 16784 11704 -18455 -47748 -50853 -29232 -21870 9027 -316
9324c16j5943j1297K0404K3316J2784j283j933n977p999n456l83J8981K757q983
9310A8672j5484M799m344L09J5846J3703J946O889l996k1742Q856o739j5919l770
9296i74J1585J6975j2089N378l825l126O010O534R381j0814l552p177K225j1204
9282E327l727o088N534K2092j2362r779L3236K8136m999k1872J8687K466j9648
9269C7003k0138Q83o991M285J5899J9556j7853k1414o639J0342q706L588k643
9256G172j6193r075O408K3848K8684M001L006J5866k0108j6124j2261k196J0890
9243B3918m331p268k540j6557M300K974n089J1258k515j8246P170L8361J1774
9230D3209l2519L450M806K617L633o410j4924q371K101l980j1759J7810k919k0168
$$ plain form
9324 -316 -16259 -27556 -7152 16164 28948 27665 25732 19755 11756 6300 5917 24898 27655 18672
9310 18672 3188 7987 3643 3952 19798 33501 35447 42336 38340 16598 25454 18715 2796 -974
9296 -974 10611 27586 15497 20875 17050 13924 19934 26468 35849 25035 21483 14306 16531 5327
9282 5327 1600 -4488 1046 23138 10776 997 34233 62369 57370 35498 54185 56651 37003
9269 37003 16865 17748 10757 15042 30941 50497 32644 11230 4591 14933 6227 9815 7172
9256 7172 -9021 -18096 -11688 12160 40844 44845 47851 63717 43609 27485 15224 13028 23918
9243 23918 19587 12319 9779 -6778 -2478 496 -4593 6665 4150 -14096 -6926 31435 43209
9230 43209 10690 14140 18946 21563 25196 18786 3862 -4509 -2408 -6388 -18147 -337 -3256 -23424
9216b3424K424J2068p119J3860L0565Q637r997l500j8111o099o167J7134K4290
9203C4561l2406j2723J2649l270O822l173n546J6424J9817J7969m453j2580j6884
9190A7207J3121k5877k1505p078j3792k0921J9741Q169M823P233N364o487l508
9177b3510m77m690j2873N706J1647J1662k642k1682J7807L6599J242p132k2136
9164a0479k224L2237J0403M685j8212l8961p452J9625J4341N949J6843j9023l2864
9151b5132J2182K0268J011l686p331j7271J1242j908K7652K2899L979L132N12
9138D7549k7316r872J1483k068k7560K525n174K804q804Q90J906J7521l382j410
9124i08K3332j3365l528p54j3561N836J7392P819P92j136j2108P376J3900o666
$$ plain form
9216 -23424 -21000 -8932 -16051 -2191 28374 37011 27014 23514 5403 -696 -6863 10271 34561
9203 34561 2155 -10568 2081 -1189 5633 2460 -3086 13338 33155 51124 46671 34091 17207
9190 17207 30328 4451 -17054 -24132 -37924 -58845 -39104 -30935 -26112 -18879 -13515 -20002 -23510
9177 -23510 -23987 -28677 -41550 -35844 -24197 -12535 -15177 -36859 -19052 17547 18789 11657 -10479
9164 -10479 -12703 19534 29937 34622 16410 -22551 -30003 -10378 3963 9912 26755 7732 -25132
9151 -25132 -12950 7318 8329 4643 -2688 -19959 -8717 -10625 17027 39926 43905 47037 47549
9138 47549 20233 10361 21844 19776 -7784 -5259 -10433 -7629 -16433 -15543 -13637 3884 502 -908
9124 -908 22424 9059 5531 4777 -8784 -2948 14444 22263 23055 21919 9811 17187 31087 24421
9110B4421j1426j2339j4703k2893P649L0958J2995J7467k1984K2756J6633j2444
9098C7090k7442j1086q616N399R559L5737j4823m3290q024j8925m336K1439J4565
9085a2753R608k9793Q340r164J6870K2237J06l326J2210K371l165K490K283J720
9071B0034j9141Q236J2224j5370k4193J422J6339J3614o277q63J2531l578J4553
9058B9531K4360n962k7428m423j6184J811n599j3794J0409R133r168J266J3668
9045G620q222M853O985k3211N485o539j0616P45J1195J0081j860O181P197j2193
9031b299J0173K360J6121k560J666O598k9514j2976L270j7021R552L3834J0925
9018C0129k8907p198J8377Q310J7165R645j1229l2722j7678J0426R086P187J5216
$$ plain form
9110 24421 12995 656 -14047 -36940 -29291 1667 14662 32129 10145 32901 49534 37090
9098 37090 9648 -1438 -10054 -4655 4904 40641 25818 -17472 -25496 -44421 -48757 -27318 -12753
9085 -12753 -3145 -32938 -24598 -33762 -16892 5345 5451 2125 14335 16706 13541 16031 18314 20034
9071 20034 893 9129 21353 5983 -18210 -16788 -449 13165 6888 6025 18556 14978 29531
9058 29531 53891 47929 20501 16078 -106 1705 -3894 -17688 -7279 1854 -7314 -6048 7620
9045 7620 -602 4251 11236 -11975 -6490 -13029 -23645 -22900 -11705 -1624 -3484 2697 9894 -2299
9031 -2299 7874 10234 26355 23795 25461 32059 2545 -10431 -7161 -24182 -14630 19204 30129
9018 30129 1222 -5976 12401 20711 37876 47521 36292 3570 -14108 -3682 5404 12591 27807
9005B7807k0182k4580j9797J9595Q370N124J3826j4631Q905R520j6993q296j109
8992a2441N074r654J4067j669j2219J2403p85q904O00k5306K0440J5326k0408
8979b3476o697R928J4236K1457K5140k1498m270k8323o904Q208J4704J9240N671
8966B7416k2316k0852J4139J4315J4128m815j4396Q958Q181N196k170r265k9033
8953a0514m563P703K025M137n231k762K8524O926n755J8924N347J119J0371j4841
8939D1410k3412p479Q773J322j2008r79M435j1036o468K252l067m120J3257P665
8925A0545o33n72l972M504J8030j8379k7560K6970p70k2913Q384L7905R062j6906
8911B3695r151p207l119O295o947l1494l486K4113J8483Q914N496P014l5854k8558
$$ plain form
9005 27807 7625 -16955 -36752 -17157 -8787 -3663 10163 -4468 4437 13957 -3036 -11332 -12441
8992 -12441 -7367 -17021 -2954 -4623 -16842 -4439 -5224 -14128 -13528 -38834 -18394 -3068 -23476
8979 -23476 -30173 -20245 -6009 15448 40588 19090 14820 -13503 -20407 -12199 2505 21745 27416
8966 27416 5100 -15752 -1613 12702 26830 22015 7619 16577 24758 29954 27784 18519 -10514
8953 -10514 -15077 -7374 -5349 -1212 -6443 -9205 19319 26245 20490 39414 44761 45880 56251 41410
8939 41410 17998 10519 19292 20614 8606 7627 12062 1026 -5442 -3190 -6257 -10377 2880 10545
8925 10545 9912 9340 5368 9872 27902 9523 -18037 8933 8163 -14750 -6366 31539 40601 23695
8911 23695 14544 7337 4218 10513 3566 -27928 -31414 -7301 11182 20096 25592 32606 -3248 -31806
8897c1806P76j685J793J2759j9018q273J3572K0647J2515J3712K0043k5704j1182
8884a851Q054L49J7775M942j1159q799j0040L204Q199r133m873k1558O305J0932
8870g653J0739N783l871J0699J9414j0919J336K2896j4926k2677p462r68N676
8857H067k28q486J1253J657K858P854R088J2431j9205j8407k15m3295j5191J3811
8843c8008K0628J2936J5695J6603P908K677N116k5669o317R976j5253k3263K534
8830a4437K5137J0788j5156P708j930j833O454j3246k7279j0166O794J9428L336
8817d402j9484k4381N931K4354L4882q30P481j1628j5555j8948K2896J1747l201
8804H862J4958k4795j1750p287K6761m535K2354K6994P112j0042k3464j4472j1338
$$ plain form
8897 -31806 -31030 -32715 -30922 -18163 -37181 -45454 -31882 -11235 1280 14992 35035 9331 -1851
8884 -1851 6203 6552 24327 29269 18110 9311 -729 2475 10674 1541 -3332 -24890 -18585 -7653
8870 -7653 3086 8869 4998 15697 35111 24192 25528 48424 33498 10821 3359 2391 8067
8857 8067 7839 -647 10606 12263 15121 22975 32063 44494 25289 6882 6667 -36628 -51819 -38008
8843 -38008 -17380 -4444 11251 27854 35762 38439 43555 17886 11569 21545 6292 -16971 -14437
8830 -14437 10700 21488 6332 14040 12110 10277 16731 3485 -23794 -33960 -27166 -7738 -4402
8817 -4402 -23886 -48267 -42336 -17982 16900 16070 23551 11923 -3632 -22580 316 12063 8862
8804 8862 23820 -975 -12725 -20012 6749 2214 24568 51562 58674 48632 25168 10696 -642
8791f42k5669K1414R425m871j0468K2650J1046k0875j913J5814O51j4460k2897
8778b0795j547N043r206J7435J390j801j3446O954J5833J2981J4469m80J8583
8765D5413J9390m48m602j0590k6723k6154J3425J1002j7606J6453K6845j2908
8753C3497k6817j9975k1070R21J5379J9624j2640l755K0647J2609m050k443j7878
8740e951J2683K2973l465j6313j1266j497R693R3j7551J1141K2294m978l1097
8727a3241j4378L113O800J3114k283j3458k485n479Q330M97M961K4864K4724r027
8713B6052j3635r016n308P257j3465k0924Q614l286o662O134j1160J3185J8338
8700c876J1169Q263Q800j7115O82M393p005m261K884K0241L002k2986k1188J5384
$$ plain form
8791 -642 -26311 -4897 4528 -343 -10811 11839 22885 2010 97 15911 16562 2102 -20795
8778 -20795 -22342 -17299 -26505 -9070 -7680 -9481 -22927 -15973 -140 12841 27310 26830 45413
8765 45413 64803 64355 59753 49163 22440 -3714 9711 20713 3107 19560 46405 33497
8753 33497 6680 -13295 -34365 -33444 -18065 1559 -11081 -14836 5811 18420 14370 11927 -5951
8740 -5951 6732 29705 26240 9927 -1339 -2836 6857 6950 -10601 540 22834 17856 -13241
8727 -13241 -27619 -24506 -17706 -4592 -6875 -20333 -22818 -28297 -19967 -19470 -14509 10355 35079 26052
8713 26052 12417 3401 -1907 5350 -8115 -29039 -20425 -23711 -30373 -24239 -35399 -22214 -3876
8700 -3876 7293 15556 24356 7241 7923 12316 5311 1050 3934 24175 27177 4191 -16997 -1613
8686a613Q139j4653l438o462k479K2906M3163Q702l7830j506K765k690r305j4154
8672h455j096k533J1230N672N12n356m184K4938J3414r192m489K1398j4389j7518
8658I952j050P939J8152M601R710m290L060o831p812P35j026p493p267r371n597
8643C412J2175m85m820l967K5408R232p761o577J4020J258O74J1439j3291k3333
8629A7384l229l327K559j6492P921Q187K2089J0423Q764j0375k4833j5539j1600
8616h068q630K382m717J9956J3310K5206M416k1102k4685j1463K576j6994N260
8603b2553K1362r297J8412Q682K4831o976m2221j3063P301j1179M91K6052k151
8590c09j1300K710J3188O635K346J1382L069k0232j3255j561j288o33J5189L896
$$ plain form
8686 -1613 6526 -8127 -11565 -18027 -20506 2400 45563 54265 16435 14929 17694 15004 5699 -8455
8672 -8455 -9551 -12084 -854 4818 5330 -26 -4210 20728 34142 24950 20461 41859 27470 9952
8658 9952 8902 16841 34993 39594 49304 45014 48074 41243 33431 34166 33140 25647 18380 9009 3412
8643 3412 15587 15102 10282 6315 31723 40955 33194 26617 40637 41895 42569 54008 40717 17384
8629 17384 14155 10828 13387 -3105 4816 13003 35092 45515 54279 43904 19071 3532 -8068
8616 -8068 -16698 -14316 -19033 923 14233 39439 43855 22753 -1932 -13395 -10819 -27813 -22553
8603 -22553 -1191 -10488 7924 16606 41437 34461 -7760 -20823 -13522 -24701 -24210 1842 -309
8590 -309 -11609 -8899 4289 10924 13270 24652 27721 7489 -5766 -7327 -8615 -9248 5941 9837
8576I837j3823J739R998Q278J0063J883q282k0426r493K4282q555J134J4026j0564
8562A0097k3915R44J4154M654j0066k0710K6096J5279q650j1832k5596r354J9480
8549a9419K8959J3696J87J8505J5989n114k055l5873l0890J5143J3676j8518j3441
8536a9155J74J1373j1551j1810J0385M978n065P333K425J5720K474n083j803n895
8522e500M069j4286N792K9173K4573j0474k2109P093j3396k1368j8915L954L0769
8509f25K828j3316Q853J0225R402o988O527L613k355j1400m624P599k0861n697
8495a6819K7184K54Q24j721n285l317M940J5281K541M274j7315l0507j4719l433
8481c7818J9130O458J5124J1489N753K9973r822p497Q726j965P132j7209k283
$$ plain form
8576 9837 -3986 -2247 7751 16029 26092 27975 19693 -733 -10226 14056 5501 6635 20661 10097
8562 10097 -13818 -12874 1280 5934 -4132 -24842 1254 16533 7883 -3949 -29545 -38899 -19419
8549 -19419 9540 23236 23423 41928 57917 52803 50748 14875 -16015 -872 12804 -5714 -19155
8536 -19155 -18981 -7608 -19159 -30969 -20584 -15606 -20671 -13338 -10913 4807 7281 2198 395 -5500
8522 -5500 -1431 -15717 -9925 19248 43821 33347 11238 18331 4935 -16433 -35348 -31394 -625
8509 -625 2203 -11113 -2260 7965 17367 10379 16906 20519 18164 6764 2140 9739 -11122 -16819
8495 -16819 10365 10619 11443 9722 4437 1120 6060 21341 23882 28156 10841 -19666 -34385 -37818
8481 -37818 -18688 -12230 2894 14383 20136 50109 40287 32790 41516 39551 46683 29474 27191
8468B7191r248k602J104J2032J3390m2961k6146J8584K2691L4692p704j8113r585
8455A3325l6265O93J7348m878l199o274P727N396J2075q936N598L738k4855R752
8441h755K879M689J0431Q015j929M394k901j2383n473j3657o598q440k378L2005
8427a01L2876j1863n579J2705j4708K455J7838j2753q572l675N897L601Q242J110
8413B7473j8141j7634J4283K3705L3066p193r719r136J1444N892j1961j389M464
8400D5154P577J3698J0971L7776K6057L7941R3477J55721K04748J68168J1718
8389H13006j23905j86805j85536j35249o7768l0112j2159N929j3323j7760k7700
8378A8618j4683J3171k8927j824M945L3809J0990j1485j074j3969j6562K8960
$$ plain form
8468 27191 17943 15341 16445 28477 41867 -1094 -27240 -8656 14035 48727 41023 22910 13325
8455 13325 -22940 -22247 -4899 -9777 -12976 -19250 -11523 -6127 5948 -2988 2610 6348 -18507 -8755
8441 -8755 -5876 -1187 9244 17259 15330 19724 16823 4440 -1033 -14690 -21288 -29728 -32106 -101
8427 -101 32775 20912 15333 28038 13330 15785 33623 20870 12298 8623 14520 18121 26363 27473
8413 27473 9332 -8302 5981 29686 62752 55559 45840 36704 48148 54040 42079 40690 45154
8400 45154 52731 66429 77400 115176 141233 179174 272651 428372 633120 801288 813006
8389 813006 689101 502296 316760 181511 113743 83631 71472 77401 64078 46318 18618
8378 18618 3935 17106 -11821 -13645 -8700 25109 36099 24614 23540 9571 -6991 21969
8366B1969J256m712p303J7906K46p554N755N269N175q005K5593M2265L7289R673
8352A44822L7487R0555J66212K55798M34001M78607J11351k59532l69680l67255
8342G22366k45969j40418r8840n5087j9236k4808m9780k1420j8969k868J3547
8331E8518J0610O292J0685J09l678n155m0526k8480J1118o363j9598K059J202
8318c207R423l353Q605K6706J0784j5605p86n019L618K3175L1378M8492N6914
8305A91125R8473J91155K46356J22037p3751j51556j65988j53146j20163m2542
8295A42000j7717k9643k1607k9297N340j4312j5616j4047r185P353j553j4903
8283a3187L9139O644j3670j6350l5610n404J9494l168N89K913o059R673k037Q976
$$ plain form
8366 21969 23225 18513 11210 29116 29362 21808 27563 32832 38007 30002 55595 97860 135149 144822
8352 144822 182309 272864 439076 694874 1128875 1607482 1718833 1459301 1089621 722366
8342 722366 476397 335979 237139 182052 162816 138008 88228 66808 47839 44971 58518
8331 58518 69128 75420 86105 86214 82536 77381 36855 8375 19493 13130 -6468 -4409 -3207
8318 -3207 6216 2863 11468 38174 48958 33353 32567 27548 31166 54341 85719 134211 191125
8305 191125 289598 480753 727109 849146 775395 623839 457851 304705 184542 142000
8295 142000 124283 94640 73033 43736 49076 34764 19148 5101 -4084 3269 1716 -13187
8283 -13187 25952 32596 18926 2576 -33034 -38438 -18944 -22112 -21523 -18610 -24669 -14996 -17033 -8057
8269h057P349j724j1118J7450q088o183L5505o117j8271m674J8548P956N311k705
8255B5182r012j1233Q059m928J3373J8680q703n836J1395J032j1438k85j5525
8242A0761j5514J6554n875l359Q387J6516p185n649j2845j6547Q282J0818Q016
8229A2360K5808N53o333N315p496j1342K216K5793q081m2618j3049P883j2899
8216b1890J7396L11L942q577j0750K9590P631N400J3034R58l552l398k8676j7295
8202a5876M459p774R81K5539J6841q005p039j9331j5175J4633J4882J2077K3280
8189C9492R221p325o554k694o038j6475j1441J0625n13J5980Q79k3689j2935J224
8175a0243N972J056q789J8995J0650o283O489l1457L389P879O580k733J7q132
$$ plain form
8269 -8057 -708 -2432 -13550 3900 -4188 -10371 25134 19017 746 -3928 14620 22576 27887 25182
8255 25182 16170 4937 12996 8068 21441 40121 31418 25582 36977 38009 26571 26286 10761
8242 10761 -4753 11801 5926 2567 10954 27470 20285 14636 1791 -14756 -6474 4344 12360
8229 12360 38168 38721 32388 37703 30207 18865 21081 46874 38793 -3825 -16874 -8991 -21890
8216 -21890 -4494 -4183 -241 -8818 -19568 10022 17653 23053 36087 37045 33493 30095 1419 -15876
8202 -15876 -11417 -19191 -18210 7329 24170 16165 9126 -10205 -25380 -10747 4135 16212 39492
8189 39492 48713 41388 34834 32140 26102 9627 -1814 8811 8298 24278 25157 1468 -11467 -10243
8175 -10243 -4271 -3215 -12004 6991 17641 11358 17847 -13610 -10221 -2342 4238 1505 1522 -6610
8161f610J649r394j7939J694M439J4221J8490J5217k357k436J0334n741k9809
8148h242N223M332K630N925J9028m356l1620R492r68k3176P632L2973l254n696
8134I923r162j2854J206J6658K6653j8400j5165Q731j2285K748J0794q462k2304
8121b1919J721J1971J9960M101L106j1144l0970j0881K240K0135N917m351J5885
8108E771k3250m846J6848J1435K573J3859J0497k013P831K1050j1649o337k1879
8095A9890p719M063k454l8281j1986J9286K2997m4472J7880Q684M518K558J1575
8082F539J3678M21n175j8469l567k4377j3179R250J7342J1819o360P936O976j761
8068A073J1017J0428k0397j4743q504J9213K3976q808o925j7646l494K7687K5242
$$ plain form
8161 -6610 -4961 -14355 -32294 -30600 -26161 -11940 6550 21767 19410 16974 27308 21567 -8242
8148 -8242 -3019 1313 3943 9868 28896 24540 -7080 2412 1444 -21732 -14100 18873 15619 9923
8134 9923 761 -12093 -10887 5771 32424 14024 -1141 7590 -4695 -1947 8847 385 -21919
8121 -21919 -20198 -8227 11733 15834 18940 7796 -23174 -34055 -31815 -11680 -5763 -10114 5771
8108 5771 -17479 -22325 -5477 5958 8531 22390 32887 30874 38705 59755 48106 41769 19890
8095 19890 12171 16234 13780 -24501 -36487 -17201 5796 -38676 -20796 -12112 -7594 -5036 6539
8082 6539 20217 20638 15463 -3006 -6573 -30950 -44129 -34879 -17537 -5718 -12078 -4142 2834 1073
8068 1073 12090 22518 2121 -12622 -21126 -1913 22063 13255 6330 -11316 -14810 12877 38119
8055C8119j484k3146j2664k3106l131J0026K9236J6463K7054j2781j8177N3O905
8042C3367m192k8723L696q956l730K0276M163j7292K014J517R230l4197j2911
8029c5738o723n978K6197K8344J0281j2102k2028J4309J8083j1300j2978J103
8017h530j66n757q740k5696J1670J1377o439J4720k2521J3744J273Q32m218l116
8003c1567N496J5730K154n882r295K0523J2426J9656J0001j9653O399n84j7900
7990G504j0217p848J2510J4180k5921j5795j86R049K8819J1271r9P115j444j8202
7976A0736l961j051J983L471Q98l044k0438l1432j0604J5372N460J9500j613O854
7962g869J3460J0766j8359j8272N537J1884R158Q658O141J8743M446j1181j3599
$$ plain form
8055 38119 36635 13489 825 -22281 -25412 -15386 13850 30313 57367 44586 26409 26462 33367
8042 33367 29175 452 4148 -4808 -8538 11738 15901 -1391 623 2140 11370 -22827 -35738
8029 -35738 -42461 -48439 -22242 6102 16383 4281 -17747 -3438 14645 3345 -9633 -8530
8017 -8530 -8696 -14453 -23193 -48889 -37219 -25842 -32281 -17561 -40082 -26338 -25065 -24233 -28451 -31567
8003 -31567 -26071 -10341 -8187 -14069 -23364 -2841 9585 29241 39242 19589 25988 25404 7504
7990 7504 -2713 -10561 1949 16129 -9792 -25587 -25773 -16724 12095 23366 23267 30382 28938 10736
7976 10736 6775 5724 7707 11178 12076 9032 -11406 -42838 -53442 -38070 -32610 -13110 -14723 -7869
7962 -7869 5591 16357 -2002 -20274 -14737 -2853 6305 14963 21104 39847 44293 33112 19513
7949A9513L23J557M17j1193o004J0043K8958M5281J5318K4081J5520j7474k6570
7936I9770l9081m5158k6071J0959K1975k2154o746R512J4950J4862j233k1913
7924I672l4921n425L264K4180J1403O945R056J1139j7102r151l539J1664K647
7911A9832J3236q468l15M50N168P939j0671J0427p329j1048J7568L7843J7646
7898I2278L8877K585m7426o4410k2552M871P209P969j9232k0492j5199q429J4559
7885b9392J0344L81n589p217K6851n682K377R856R993O782j7424n033j2301N909
7871a0145M6473Q47l4520J6044K322k6060j0376J4684N295P038Q920O636J1481
7858C8639j4805q105j2226j8850l862M139j2121j14n065p682p206j4451J4066
$$ plain form
7949 19513 19836 21393 21810 10617 4613 14656 43614 88895 104213 128294 143814 126340 99770
7936 99770 60689 15531 -10540 419 22394 240 -6506 3006 17956 32818 31585 9672
7924 9672 -25249 -30674 -27410 -3230 8173 15118 24174 35313 18211 9060 5521 17185 19832
7911 19832 33068 24600 24285 24735 29903 37842 27171 37598 30269 19221 36789 74632 92278
7898 92278 131155 133740 86314 21904 -648 4223 11432 19401 169 -20323 -35522 -43951 -29392
7885 -29392 -19048 -18667 -24256 -31473 -4622 -10304 -7927 1929 11922 18704 1280 -3753 -16054 -10145
7871 -10145 36328 37175 2655 18699 21021 -5039 -15415 -731 4564 11602 20522 27158 38639
7858 38639 23834 15729 3503 -15347 -19209 -15070 -27191 -27305 -32370 -40052 -47258 -61709 -47643
7845d7643K4769J1383o98k649L824K7079j8843j8900o00n183o339j034l113J0507
7831b7440N046m454K0560J0519l289P293K1645j485k6617k012n204O449P490R637
7817A8138j0253N269J8507j5728k6276k763j9160j2172N434K5828L829K0719r312
7804B060k9471n619Q091J4100k2614P932N997J4213J7513J5828j6788k0762j0435
7791a9955J3696R891J24p20j2370M489J4572Q87m404J9517j6j8520n238J194J2191
7776A5338R541O448k7591l0147j8482J890J7188l678K3888N297j5435j3278J5612
7763a3409K340k8542J0174M0934j462p930j6395J8614J1889j0910j0055q720O134
7750g338J8787R025j1728J921j369L03r577K618R121O232l0901P650k706o599
$$ plain form
7845 -47643 -22874 -11491 -12189 -14838 -11014 16065 -2778 -21678 -22278 -27461 -33800 -34834 -37947 -27440
7831 -27440 -22394 -26848 -6288 4231 942 8235 29880 28395 1778 -234 -5438 1011 8501 18138
7817 18138 7885 13154 31661 15933 -10343 -13106 -32266 -44438 -39004 -13176 -9347 11372 2060
7804 2060 -27411 -33030 -24939 -10839 -33453 -25521 -19524 -5311 12202 28030 11242 -9520 -19955
7791 -19955 -6259 3632 3756 3036 -9334 -4845 9727 10614 6210 25727 25711 7191 1953 3147 15338
7776 15338 24879 31327 3736 -26411 -44893 -43003 -25815 -29493 -5605 -308 -15743 -29021 -13409
7763 -13409 -11069 -39611 -29437 11497 10035 2105 -14290 4324 16213 5303 -4752 -13472 -7338
7750 -7338 11449 20474 8746 10667 9298 9601 24 2642 11763 17995 -12906 -5256 -7962 -14561
7736a4561L0383J1824k1363k8824L268J3893K0275J6186n522j6854j1822j662
7724d779k8722L621j3129p139M0891J7455n964j3871j1961k3241r369J5609k890
7711d3489Q940P213O986j977J8701J9080Q109k570J3468K273o926k0657k5814
7698a6663l767j7232r418Q178J349K2026j0007O892J0365k166j9951j7759j825
7685d9978K2242K6797R796n159j1332m801o505j0516J0700J7732J2217n079J378
7672G492l9955N979J2453O331m2814P053K3996k620N440J7342K8297Q83l7864
7659g987n048J518O672l170j9992k9437j8670J7301K4145M623J2834J4586j126
7646c751j5195L255j1136k8717Q281J6293p801K507J0266J7106M331Q636R173
$$ plain form
7736 -14561 15822 27646 6283 -22541 -19273 -5380 14895 31081 25559 8705 -3117 -4779
7724 -4779 -33501 -29880 -43009 -50148 -9257 8198 2234 -11637 -23598 -46839 -56208 -40599 -43489
7711 -43489 -34549 -27336 -20350 -22327 -3626 15454 23563 20993 34461 36734 29808 9151 -16663
7698 -16663 -20430 -37662 -47080 -38902 -37553 -15527 -25534 -18642 -8277 -10443 -30394 -48153 -49978
7685 -49978 -27736 -939 8857 3698 -7634 -12435 -18940 -29456 -18756 -1024 11193 6114 7492
7672 7492 -32463 -26484 -14031 -7700 -50514 -43461 -19465 -22085 -16645 697 28994 29877 -7987
7659 -7987 -13035 -11517 -4845 -8015 -28007 -57444 -76114 -58813 -34668 -30045 -17211 -2625 -3751
7646 -3751 -18946 -15691 -26827 -55544 -47263 -30970 -38771 -36264 -25998 -8892 -4561 4075 13248
7633A3248N571k4842j2268p189j105P424J1304o481R906J3177P73j4200j1204
7620a5886R839L948j2539K6229J0514j2958M6l204j1146j3556P268j0921L178
7607a9188j487J1089R942j0748j575J9367L194m10j7268q709O756K0756J8065
7594B9784k0013m741K0910Q183r341k6868k4813k7625J8170L4463J8306O964l161
7581B0218j3797j7680o271K748N618J1132j251M230K1034j1538j7183j2572m843
7568b0155K0934J1920o134K602j8185n892o536J913P360M217J5368p855O31L045
7554C233J2876p019o110j2360k256m844J242J1044J5659j1765j0733P329K305
7541a399M180p354j3039k509J6153J2691p800j0546n695k447k8064J3259M80o084
$$ plain form
7633 13248 18819 -6023 -18291 -25480 -26585 -19161 -7857 -14338 -4432 8745 9518 -4682 -15886
7620 -15886 -6047 -2099 -14638 11591 22105 9147 9193 5989 -5157 -18713 -11445 -22366 -19188
7607 -19188 -20675 -9586 356 -10392 -11967 7400 10594 10184 -7084 -15793 -9037 11719 29784
7594 29784 9771 5030 25940 34123 24782 -2086 -26899 -54524 -36354 -1891 16415 23379 20218
7581 20218 6421 -11259 -17530 -14782 -9164 1968 717 4947 25981 14443 -2740 -15312 -20155
7568 -20155 779 12699 6565 9167 -9018 -14910 -21446 -19533 -12173 -7956 7412 -443 188 3233
7554 3233 16109 9090 2980 -9380 -11636 -16480 -15238 -4194 11465 -300 -11033 -3704 -1399
7541 -1399 2781 -4573 -17612 -20121 -3968 8723 923 -9623 -15318 -17765 -45829 -32570 -32090 -38174
7527c8174L1406K6030o330O156O494k2138j184J3012L887r561O521L290k3270
7514c861n804K0427N294p766q083N937k832K4182L253l8326p076j0192r668J7717
7500a6798K6272n178q470j385N465J066J5311n158j1080p335j3763P421J8469
7487D837Q688k978J2755J2294J16M774j625k2218k4442K718J420Q869K1083N819
7473C2110o889k7264j6222j6868J1261K0730J7778R459J8840P852k0681k3942
7461F164P740J480K387l485k0120l353k7453Q697P043J3521L6038K4350r833j1735
7447C1441l3562k0422l455P976J073o567O596J0487N993n224J6147m708j1143
7434e368l339L669M387J3394M2304j4999l4382j9287q861Q718p108q928M100J6180
$$ plain form
7527 -38174 -6768 19262 12932 19088 25582 3444 2260 15272 19159 9598 16119 19409 -3861
7514 -3861 -9665 10762 16056 8290 207 6144 3312 27494 30747 -7579 -14655 -24847 -34515 -16798
7500 -16798 9474 4296 -4174 -5559 -94 972 16283 11125 45 -7290 -21053 -13632 4837
7487 4837 13525 10547 23302 35596 35712 40486 38861 16643 -7799 -5081 -3661 5208 26291 32110
7473 32110 25221 -2043 -18265 -35133 -23872 -3142 14636 24095 42935 50787 30106 6164
7461 6164 13904 15384 17771 14286 -5834 -9187 -36640 -27943 -20900 -7379 28659 53009 43176 31441
7447 31441 -2121 -22543 -25998 -18022 -16949 -23516 -16920 -6433 -440 -5664 10483 5775 -5368
7434 -5368 -8707 -5038 -651 12743 55047 40048 5666 -13621 -22482 -13764 -20872 -29800 -25700 -9520
7420i520p230K0842L0692Q966k917j2550q370j5935j4546P024J2567J8555J4342
7407D1920M816q830k4248K2466N363j5266j7139q930J8816J9853j9685l2856k3263
7394c6983q399l065K7000J9957o350j9639j2855N958K805J4625M548l886k272
7381a8556M915L201K5009K5374m534l060j1168O271q913j3900Q137j8984j1786
7368a7994Q16k392N271j8129o710J0888K8352j1426n886m10M86L7526K1146j1319
7354C0219k4209J7152J7763j3800l3374l426o479Q549J9469p883J2762K3099j8415
7341B1427j1470J6156r3o851k096r830m859j0112J4181K8220M20k8377j6734j9145
7327b9163P687r377l709K0514K7120J4394j0835j2251r829N612p376k4414k665
$$ plain form
7420 -9520 -16750 4092 34784 43750 40833 28283 19913 3978 -10568 -3544 9023 27578 41920
7407 41920 46736 37906 13658 36124 41487 26221 9082 152 18968 38821 19136 -13720 -36983
7394 -36983 -45382 -48447 -21447 -1490 -7840 -27479 -40334 -34376 -31571 -16946 -12398 -16284 -18556
7381 -18556 -13641 -10440 14569 39943 35409 32349 21181 27452 18539 4639 12776 -6208 -17994
7368 -17994 -17178 -19570 -14299 -32428 -39138 -28250 102 -11324 -17210 -17620 -17134 20392 41538 30219
7354 30219 6010 23162 40925 27125 -6249 -9675 -16154 -7605 11864 3981 16743 39842 21427
7341 21427 9957 26113 26020 19169 17073 7243 2384 -7728 6453 34673 35093 6716 -10018 -29163
7327 -29163 -21476 -30853 -34562 -14048 13072 27466 16631 4380 -5449 163 -7213 -31627 -34292
7314c4292N649L771K433m447L815J4885r356O405o15R293J4394j1777L8405J2624
7300E1187j8820q070k7757j1663P086J503n509m470P784N941k638j373n412L083
7286i128m90k1031O902J0619R561P589j7848O783N40m886N412R24n668J7203M272
7271A0754J1433j4087k7944J4376J5476J1294J8638j8735k6145J8006O64j2265
7259A465l70L909n701j2550l575j219Q69J9169P754J455L3134l366n6493j4309
7245b9828m652j550N976r343m556k814Q330O739n92l845L984n006J5010L2369
7231A0222j1364j6282L392L2390K2217r987N568j4015j7775k8717N288J5320L842
7218I9j3710k062q413J169Q926j403P785p290j4560j4493J491J0000J1418n010
$$ plain form
7314 -34292 -28643 -24872 -22439 -26886 -23071 -8186 -17542 -11137 -11752 -2459 11935 158 38563 51187
7300 51187 32367 24297 -3460 -15123 -8037 -6534 -12043 -16513 -8729 -2788 -5426 -6799 -12211 -9128
7286 -9128 -9618 -30649 -23747 -13128 -3567 4022 -13826 -7043 -6503 -11389 -5977 -5053 -10721 6482 10754
7271 10754 22187 8100 -19844 -5468 10008 21302 39940 21205 -4940 13066 13730 1465
7259 1465 1095 5004 -697 -13247 -16822 -18041 -17172 1997 9751 11206 44340 40974 -15519 -29828
7245 -29828 -34480 -36030 -30054 -39397 -43953 -46767 -38437 -31698 -32290 -36135 -32151 -37157 -22147 10222
7231 10222 -1142 -17424 -14032 18358 40575 30588 36156 22141 4366 -24351 -19063 -3743 99
7218 99 -13611 -15673 -24086 -22917 -13991 -15394 -7609 -14899 -29459 -43952 -42461 -32461 -21043 -26053
7204b6053l863l674M196J8079K4847J464J730k7204q402J1479L243p699j4971
7191b6828l0Q611O19L59J0831J9719J8912j4531m032j3586J773J9070K492j0284
7177A3095j5663k4027J5309J2623k762j3488k9218Q310J6563M077Kn04K7568j2837
7163i52m425J3804o245j0113J743Q501m667k6028J3141m615J9485J2906k121k342
7149H072k0868k2588j775M51K6155O169J0670P094k018k3716K1522R624l3753
7136a4961O148O701n883L150M456J0823J4994j5889k5149j8901k803L5722P677
7123F085j1166l448Q701K4148J2760j7666j3488J1783J1442R656j0197j8601j3659
7110c650N894k1823j0508L960p711J3730J7346J3207p58m418j5180O521O276k768
$$ plain form
7204 -26053 -29916 -33590 -29394 -11315 13532 14996 16726 -10478 -18880 -7401 -4158 -11857 -26828
7191 -26828 -26858 -18247 -17628 -17269 -6438 13281 32193 17662 13630 44 1817 20887 23379 13095
7177 13095 -2568 -26595 -11286 1337 -1425 -14913 -44131 -35821 -19258 -15181 -15179 -15683 11885 -952
7163 -952 -5377 8427 2182 -7931 -6188 2313 -2354 -28382 -15241 -19856 -371 12535 10414 8072
7149 8072 -12796 -35384 -37159 -36708 -10553 -4384 6286 13380 11362 -12354 9168 18792 -14961
7136 -14961 -8813 -2112 -7995 -4845 -389 10434 25428 9539 -15610 -34511 -37314 -1592 6085
7123 6085 -5081 -8529 172 24320 37080 19414 5926 17709 29151 38807 28610 10009 -3650
7110 -3650 2244 -19579 -30087 -26127 -33838 -20108 -2762 10445 9687 5269 -9911 -3390 2886 118
7096A18j2517K6682K9290m283k7407O456N118j2629j829P07o864L148M657R677
7082B0324j3781l0119n521M148J9675N335j638m685J6536K3939j9291k1288k0084
7069b6450p288L821R47K944j2624L4985J7344o648k8033K393l332p854J9102N167
7055e526j7706K3185o039j3742p42J1152j5140j1872O136K2998K3847j4592k0633
7042a8674K395q046L841P160j8390J9850R694K2681L47j0382J1086J2717o000
7029B8279k1225j1974L122J2943J3622j6166k0120q503N405Q073J1026n075r500
7016a0093J1207j3136P013Q119k4263j8229M0111Q692k812m330p769j83J8094
7003A2421O230k1506k7727N27N16J0087J5257J9671j5499L562q967j0603J5905
$$ plain form
7096 118 -12399 14283 43573 39290 11883 18339 23457 10828 8999 9706 2842 5990 10647 20324
7082 20324 6543 -23576 -29097 -24949 -5274 61 -1577 -6262 10274 34213 14922 -6366 -26450
7069 -26450 -33738 -29917 -28970 -26026 -38650 -3665 13679 7031 -21002 -18609 -21941 -29795 -10693 -5526
7055 -5526 -23232 -47 -6086 -19828 -20570 -9418 -24558 -36430 -30294 -7296 16551 1959 -18674
7042 -18674 -16279 -24325 -20484 -13324 -31714 -11864 -2170 20511 20858 10476 21562 34279 28279
7029 28279 7054 -4920 -1798 11145 24767 8601 -11519 -20022 -14617 -6544 4482 -593 -10093
7016 -10093 1114 -12022 -5009 3110 -21153 -39382 729 9421 6609 2279 -5490 -5673 12421
7003 12421 18651 -2855 -30582 -30055 -29539 -19452 -4195 15476 -23 3539 -5428 -16031 -126
6990a26R75j4684k443K5626o768n67J0308M652O014p668n014J313j2535O26m183
6975d474L408J657n668M972J1585k44p303N527j0320j3588N60Q685K6298O506
6961B7601q841j5040j3968J4107K566k7934n494q479k940P884R037N255J5443
6948h03P708L570n913P257o156j8348q020Q422J0392j5858m819N906O883K4171
6934A4392K2580k8658j8810k2325j8152K3430K6456J1007k908j7625J2186N918
6922G491j2861j6806j3559j3696j5603m479K3154K0791K5499P2J1678O299Q422
6909B6402O795k1802j7100o27j9247j2023P500J3108n890l287k057L0799K4002
6896B6573J5502j7649j3591j3406k64K118m47J3628r694l4315k6984J0517K0447
$$ plain form
6990 -126 849 -13835 -16278 9348 2580 2013 12321 16973 22987 15319 10305 11618 -917 -291 -4474
6975 -4474 -1066 591 -5077 -105 11480 11236 3933 9460 -860 -14448 -13888 -5203 21095 27601
6961 27601 18760 3720 -10248 3859 6425 -21509 -27003 -35482 -38422 -30538 -21501 -16246 -803
6948 -803 6905 10475 4562 11819 5663 -12685 -20705 -12283 -1891 -17749 -22568 -16662 -9779 14392
6934 14392 36972 8314 -10496 -32821 -50973 -27543 -1087 9920 7012 -10613 1573 7491
6922 7491 -5370 -22176 -35735 -49431 -65034 -69513 -46359 -25568 -69 3 11681 17980 26402
6909 26402 33197 11395 -5705 -6332 -25579 -37602 -30102 -16994 -22884 -26171 -28228 2571 26573
6896 26573 42075 24426 10835 -2571 -2835 -717 -1164 12464 2770 -31545 -58529 -48012 -27565
6883b7565K0952j4187K062K3352m536k0286O068J5897p950m094J7057J734p092
6870A412K9997P477j2011r350k1956j6082Q805R914k0457r6K8709K8917J4053
6857D9332p341M145j9663j55O233p328l858j6871j1745N370J6407k562k3571r876
6843b1483K130N771J8888J5511k2107j8099K2005K197J5428K2863j9587O665J264
6830C1446j4722m169J901m5392j1843J6157n293j6016K7642Q355K039P661j073
6817c307M43J561O252K786M797J4147j834K552l808J2136j9144j7190j4849m284
6803a9742m327J6902M980l4530J4735K8955r112m633j032Q570N342j4921m056
6790a2869J1914j2685j331J8894J2074k2680k830J8761m422N290n295k5495k0916
$$ plain form
6883 -27565 -6613 -20800 -18738 4614 78 -20208 -14140 1757 -6193 -10287 6770 8504 1412
6870 1412 31409 38886 26875 17525 -4431 -20513 -11708 -1794 -22251 -22347 6362 35279 49332
6857 49332 41991 46136 26473 26318 32551 25223 21365 4494 -7251 -1881 14526 11964 -11607 -21483
6843 -21483 -19353 -13582 5306 20817 -1290 -19389 2616 4813 20241 43104 23517 30182 31446
6830 31446 16724 12555 14456 -30936 -42779 -26622 -31915 -47931 -20289 -11934 -9895 -2234 -3307
6817 -3307 -2864 -1303 4949 7735 12532 26679 24845 27397 23589 35725 16581 -609 -15458 -19742
6803 -19742 -24069 -7167 -2187 -36717 -21982 6973 -2139 -6772 -7804 766 6108 -8813 -12869
6790 -12869 -955 -13640 -14971 3923 15997 -6683 -9513 9248 4826 10116 4821 -20674 -41590
6777d1590O459L472K6100J727m4569k301J0699Q934J1359j304k040r417L1251
6764a220p509q359L117j2841m275q55J009l877j9389O559L5341L608j4643K0069
6750c265j0646P988O23O796J1324j1920j3895k404q19J4206l540k812J6142j6107
6736h329j1835J4981k792p432J982J7013Q193J1841j5255r189j1306n258j6462
6723c3848p100K1871K3446Q529R136N371N368m120l8679r435m087q745N459J0830
6709a6004R884m658l089k638O823J5922m312r75j9387k0728J2697Q208j699q840
6695b8796j1805R203J3812J7219n568j4575K5824K0840k794j660R454j3689j4633
6682B832k9446J9957M474J730L614Q412J2113j9906J4842J3843j3995k6777o462
$$ plain form
6777 -41590 -35131 -31659 -5559 -3832 -48401 -50702 -40003 -31069 -19710 -21014 -23054 -32471 -1220
6764 -1220 -8729 -17088 -13971 -26812 -31087 -31942 -30933 -34810 -54199 -47640 -12299 -8691 -23334 -3265
6750 -3265 -13911 -5923 -5300 1496 12820 900 -12995 -15399 -16218 -2012 -5552 -8364 7778 -8329
6736 -8329 -20164 -5183 -7975 -15407 -13425 3588 11781 23622 8367 -822 -12128 -17386 -33848
6723 -33848 -40948 -19077 4369 12898 22034 27405 32773 28653 -10026 -19461 -23548 -32293 -26834 -16004
6709 -16004 -6120 -10778 -13867 -16505 -9682 6240 1928 953 -18434 -39162 -26465 -18257 -19956 -28796
6695 -28796 -40601 -31398 -17586 -367 -5935 -20510 5314 26154 23360 21700 31154 17465 2832
6682 2832 -26614 -6657 -2183 -453 3161 11573 23686 3780 18622 32465 18470 -8307 -14769
6669a4769o711j1214m312N319J5450J948j1638p082m236O800K4857J4821L822
6656A3055j2563j61J7348P507j2406j6786j4683k487j6224L165j98J8344p43P976
6642h856N511n928j2363n890j0719K2323J800r323J4425K7655O849j7052j2018
6629c586R501J8510K0205r069M460K6560L7752P1879J43058K03867J18936p7716
6617E64357j55625j50026r6256o6657n6068k2829K0367J0063k340l4804j944J6432
6605B4670O079n052J5660j3294j5663j1121O661K0891j7239J318N796k9358j6574
6592b7226M905J3542K1583M010J5240j169l7319k0392J2654K2823J4938J3099
6580C6688J1180l0793j0949L193m953P602J2988K0432P601j8115k0547o985l486
$$ plain form
6669 -14769 -21480 -32694 -37006 -31687 -16237 -14289 -25927 -33009 -37245 -30445 -5588 9233 13055
6656 13055 492 331 17679 25186 12780 -4006 -18689 -21176 -37400 -34235 -34433 -16089 -16832 -8856
6642 -8856 -3345 -9273 -21636 -27526 -38245 -15922 -14122 -23445 -9020 18635 25484 8432 -3586
6629 -3586 5915 24425 44630 35561 40021 66581 104333 176212 319270 523137 642073 564357
6617 564357 408732 258706 162450 95793 39725 16896 37263 47326 44986 10182 8238 24670
6605 24670 30749 25697 41357 28063 12400 1279 7940 28831 11592 12910 18706 -10652 -27226
6592 -27226 -22321 -8779 12804 16814 32054 30885 -6434 -26826 -14172 8651 23589 36688
6580 36688 47868 17075 6126 9319 4366 11968 24956 45388 52989 34874 14327 7342 3856
6567C856N652j2783j5360K2930J0757j5605j4030N206J6442k2762j4303L4260
6555D260J3514p81k0708j178K613p511J354J8747o656j7087j5215q203l452K1088
6541a9215O278R680M796j9784l5267o659K6991p100Q21J3897N045L0919J5586
6528B5988k1586k789p459k3361m227J1477J1939Q144K3495K6886k6466j1122r800
6515A119k2246k7138J9476L0900L5473J3675j1892n259p062j9011l775J8240P519
6502C0019o981K966m013p162J1603K860q127o541j6689l438L752L791j6913o194
6488b1067j2925R080J9839j81p116l4110J7528K6003N903j5379j2214R87J8870
6475d782J9620k741m906J1334p891j5428j9282r777M02R653m175j0476J1773K6840
$$ plain form
6567 3856 9508 -3275 -18635 4295 15052 -553 -14583 -9377 7065 -15697 -30000 4260
6555 4260 17774 16993 -3715 -4893 -2280 -9791 -8437 10310 3654 -13433 -28648 -36851 -40303 -19215
6541 -19215 -12937 -3257 1539 -18245 -53512 -60171 -33180 -40280 -39459 -25562 -20517 10402 25988
6528 25988 4402 1613 -5846 -29207 -33434 -21957 -10018 -1874 21621 48507 22041 10919 1119
6515 1119 -21127 -48265 -28789 2111 37584 51259 39367 34108 27046 8035 4260 22500 30019
6502 30019 23038 26004 21991 14829 26432 29292 21165 14624 -2065 -5503 -1751 2040 -14873 -21067
6488 -21067 -33992 -24912 -5073 -5254 -12370 -46480 -28952 -2949 2954 -12425 -24639 -23652 -4782
6475 -4782 14838 12097 7191 18525 10634 -4794 -24076 -33853 -33451 -23798 -27973 -38449 -26676 164
6461A64l760j1672k318j5242L802J7352k088J0477l0185l493J2404M355L4130
6448A3926L3342J6096j5566k9043O06r280j3299K0934J8517N297j4076l8053p763
6435a8362J064m745m986J3260J174J4054R25P289J4523M729k0241R894l3543n693
6421b0658J2966r298Q119J3134m995q983q142j4809J2600O718o441O600l145Q222
6407h112J5856j1970j8481O089J7138J6333N977M515j0341l318J03m457j5787
6394f455p469m63Q567N594q601j3818q390N477M750J6730o934j6299q322l324
6380c8957j885j5646J1070L3237J7284K2385K6923J0647l1218m6955j4193K438
6368b4870n901K2620R025j3395J3234K2901p364Q952O249j4890k4249m987L0571
$$ plain form
6461 164 -3596 -15268 -17586 -32828 -29026 -11674 -13762 -3285 -33470 -36963 -24559 -20204 13926
6448 13926 47268 63364 47798 18755 19361 10081 -3218 17716 36233 41530 27454 -10599 -18362
6435 -18362 -17298 -22043 -27029 -13769 -12595 1459 2384 9673 24196 28925 8684 18578 -14965 -20658
6421 -20658 -7692 -16990 -8871 4263 -732 -9715 -17857 -32666 -20066 -13348 -19789 -13189 -16334 -8112
6407 -8112 7744 -4226 -22707 -16618 520 16853 22830 27345 17004 13686 13789 9332 -6455
6394 -6455 -13924 -14387 -5820 -226 -8827 -22645 -31035 -25558 -20808 -4078 -11012 -27311 -35633 -38957
6380 -38957 -40842 -56488 -45418 -12181 5103 27488 54411 65058 33840 -13115 -27308 -24870
6368 -24870 -30771 -8151 874 -12521 713 23614 16250 25202 31451 16561 -7688 -12675 17896
6355A7896J3091k323n642q816P509n4057k5928K289K0367P063K6138j2395J173
6342a3635J7375o967J528n056j3830k2033M598J9665J6952n703o07P860p99k0765
6328b1417J4794J1315r47r75l3928k7363N591K2875K1721n140N310o785q410N204
6314a8155J7120l74R688J419q243l674R467J1053q44k7286k6214j0516J4385J2069
6300b0105R286J1544J5k721J6968J9395j4428k8819l048j25N893K2103L349j6545
6286B762Q400l732n872j5408q852K1011J8565m276k0019l519j0396N272P388J7318
6272H642k1373j5239m752L469K1233Q345q471R916q687p235J0196K6794N186k3056
6258D968k4279J5935J2044J3095K809J1064k7362N873j0232O426J6450J2096L357
$$ plain form
6355 17896 30987 28664 23022 14206 21715 -32342 -58270 -55981 -35614 -28551 -2413 -14808 -13635
6342 -13635 3740 -3227 -1699 -6755 -20585 -42618 -38020 -18355 -1403 -7106 -7713 147 -652 -21417
6328 -21417 -6623 4692 3745 2770 -31158 -58521 -52930 -30055 -8334 -13474 -8164 -14949 -23359 -18155
6314 -18155 -1035 -1409 8279 9698 1455 -2219 7248 18301 17457 -9829 -36043 -46559 -32174 -20105
6300 -20105 -10819 725 740 -1981 14987 34382 19954 -8865 -11913 -12038 -6145 15958 19307 2762
6286 2762 11162 7430 1558 -13850 -22702 -1691 16874 12598 -7421 -10940 -21336 -16064 -8676 8642
6272 8642 -12731 -27970 -32722 -29253 -8020 325 -8146 1770 -6917 -14152 -3956 22838 28024 4968
6258 4968 -19311 -3376 8668 21763 24572 35636 8274 14147 3915 10341 26791 38887 42244
6245D2244j3153j2792k2185l4228M714l076R470P010J4250J879j3597o416K0377
6232e503p862P043k5535J2028m85j5882P574j291j1347M1432K7096n622k1428
6219B18j3304n311J2398J3800m92l955K2186j2459p092j2099j145K424J1742R612
6205A6523R664L154k3238J1608q339k8426j2337K4780L4300o832l933K7505J356
6192D5785o543k8848Q630J2162k0576j5212J0566J857o856J34j093L613R441o058
6178G002k2906k0321J2526K438j1623k251j3135N721M8753l839j3603L321q017
6165a5934K806K1355J3495q498l433j759j9590N953M655N090O094q617k6897n815
6151c1095J6541J2568M187J6758n321o677O618k6224n694j935K6081N902J3372
$$ plain form
6245 42244 29091 16299 -5886 -40114 -35400 -38476 -29006 -21996 -7746 -5867 -19464 -25880 -5503
6232 -5503 -13365 -6322 -31857 -19829 -20314 -36196 -28622 -29913 -41260 172 27268 21646 218
6219 218 -13086 -18397 -5999 7801 7309 3354 25540 13081 5989 -6110 -7255 -4831 6911 16523
6205 16523 26187 29341 6103 17711 9372 -19054 -31391 -6611 27689 20857 16924 44429 45785
6192 45785 39242 10394 19024 31186 10610 -4602 5964 7821 965 1099 6 3619 13060 7002
6178 7002 -15904 -36225 -23699 -21261 -32884 -35135 -48270 -42549 6204 2365 -11238 -7917 -15934
6165 -15934 -13128 8227 21722 13224 9791 8032 -11558 -5605 -950 4140 10234 1617 -25280 -31095
6151 -31095 -14554 -1986 2201 18959 13638 6961 13579 -12645 -18339 -20274 5807 11709 25081
6138B5081o295j0385O86p591j2033r281O813K6177j3316j0276J8535K726O999
6125A7840J3805j8005p509j6375J270M441K94J3989P517Q514l725k4896L668K6393
6111B7221p60N38r054k808J2300N965j4987j0492l3329j6215J353J2247j500r427
6097c8948J2953J5016J0928J2733J8337j8793p121j8319r271N981J0980m65p466
6084a3455j3445J4730J6952K34k119j2297J0015M233k5767k590J047K3034O498
6071G070l946j7687n684J1161q853O141L0049J0361l6032j9394J0456J3392j1801
6058a4767O575k671K0132k303k1066J414K1959R288m873O96k1603N33L978m736
6044g444l452Q267j0625j5346k845J9299J6298L4285J31j5191n584P71j0753n820
$$ plain form
6138 25081 18786 8401 9087 1496 -10537 -19818 -13005 13172 -144 -10420 8115 10841 17840
6125 17840 31645 13640 6131 -10244 -8974 -4533 -4239 9750 17267 25781 22056 -2840 828 27221
6111 27221 26461 26999 17945 15137 27437 33402 18415 7923 -25406 -41621 -40268 -28021 -29521 -38948
6097 -38948 -25995 -10979 -51 12682 31019 12226 5105 -13214 -22485 -16504 -5524 -5989 -13455
6084 -13455 -26900 -12170 4782 5016 2897 -9400 615 4848 -20919 -23509 -22462 572 7070
6071 7070 3124 -14563 -20247 -9086 -17939 -11798 18251 28612 -7420 -26814 -16358 -2966 -14767
6058 -14767 -8192 -10863 9269 6966 -14100 -12686 9273 18561 13688 14384 -7219 -6686 -2708 -7444
6044 -7444 -10896 -2629 -13254 -28600 -31445 -12146 4152 38437 38568 23377 17793 18564 7811 1991
6030A991m466P6j7442J3989K6149k7330k1497O413k650J872m207k3209P239J8547
6016b4525o188k624K1185M577k504K5707m695J274J9653k4454k6880N290l481
6003a7665K62r181J4251K4799k3902j0452K5541J0268l7778k09L1511k606J6622
5990B1461J0622k3214j6483M125J6653L033K883M978J69k2473j6713L463k082
5977a3578j0547J2601l8844q60J8462J3458J8909m33r663j1705j355Q019N768
5964i768J0676J345j1093j0387j8875J3211J9652K2781J0919o053n455j3393J2763
5951A6323J9421o634j2690k150R010J3431q582l0551n219K0568P502j3975j1791
5938e337m564K9799j5507j1376K1438K4050Q26k5626k0553J945j865O616j952
$$ plain form
6030 1991 -2475 -2399 -19841 -5852 20297 -7033 -28530 -22117 -24767 -22895 -27102 -50311 -43072 -24525
6016 -24525 -30713 -33337 -12152 -7575 -10079 15628 10933 12207 31860 7406 -19474 -14184 -17665
6003 -17665 -17403 -26584 -12333 12466 -11436 -21888 3653 13921 -23857 -24066 7445 4839 21461
5990 21461 32083 8869 -7614 -3489 13164 16197 19080 24058 24227 1754 -14959 -11496 -13578
5977 -13578 -24125 -11524 -50368 -51228 -32766 -19308 -399 -832 -10495 -22200 -23555 -15536 -9768
5964 -9768 908 2253 -8840 -19227 -38102 -24891 -5239 17542 28461 22408 16953 3560 16323
5951 16323 35744 29110 16420 14270 23280 36711 28129 -2422 -7641 12927 20429 6454 -5337
5938 -5337 -9901 19898 4391 -6985 14453 38503 39329 13703 -6850 -4905 -6770 -154 -2106
5925b106o908J0941m135n740j1899n231j6598J671K5794R832k187l4225J3678
5912b7113K7283m26q383K8024q756j2948R104J8697n632j596L462o657K3072J533
5898C9664k9405n592J4059K819j7358n460P530L502r417j2240j2860Q467L1528
5885A5237N847J042j9529p643p559j8692l922K1169J8796p262j5656R425K2148
5872A3401Q308r575n499J7393J9833k3751j7346m478k8385j757O59R783q168J5396
5858a4186K5310j2153o768R472J6021k11j6949K0346O317j9322p751j877J5286
5845A3535J1752k0310P406j2067J6727J1048l7340k3686J5868q024N115J8993
5833i83K2122N919m54L286r714Q721L469k978p196L942m5782J0918J8512M082
$$ plain form
5925 -2106 -9014 1927 -2208 -7948 -19847 -25078 -41676 -40005 -14211 -4379 -6566 -40791 -27113
5912 -27113 170 -256 -8639 19385 10629 -2319 6785 25482 19850 18254 21716 15059 38131 39664
5898 39664 10259 4667 18726 21545 4187 -1273 6257 9759 342 -11898 -24758 -16291 15237
5885 15237 21084 22126 2597 -5046 -12605 -31297 -35219 -14050 4746 -2516 -18172 -8747 13401
5872 13401 21709 12134 6635 24028 43861 20110 2764 -1714 -30099 -31856 -31197 -21414 -29582 -14186
5858 -14186 11124 -1029 -7797 1675 17696 17485 536 20882 27199 7877 126 -1751 13535
5845 13535 25287 4977 12383 316 17043 28091 -9249 -32935 -17067 -25091 -19976 -983
5833 -983 21139 27058 26604 29890 20176 28897 32366 29388 22192 26134 -19648 -8730 9782 13864
5819A3864j8093j1234O321j0572q414R821K5248n679j1744m164j4480O085j6366
5806c9407j7845J9658K3114J4517l346p717R849O791l324l298j4230k1439M603
5793c2074L4003P706k1708k268J9994O187p794q135j9556J5780J2275J3387p609
5780A0188k3798k3324K0338J6487o663j3769j3436K9086N452q937N895J6913j2889
5767A543j3247J769N497Q775N161m588P125J5714j0648k5468j5594l2571J4841
5754d1691L0341q470l2779M281K8792R071J7400J3756k4758k785j1511j196Q073
5741a1476r688P450l351J9402q990q017j5035J2730K913k2059k1565J9019O249
5728c2418L7663M486j457n916n380r929L601m488o145M551M113j8156P691J8837
$$ plain form
5819 13864 -4229 -15463 -9142 -19714 -28128 -18307 6941 1262 -10482 -14646 -29126 -23041 -39407
5806 -39407 -57252 -37594 -14480 37 -3309 -11026 -1177 5614 2290 -1008 -15238 -36677 -32074
5793 -32074 1929 9635 -12073 -14341 5653 11840 4046 -4089 -23645 -7865 4410 17797 10188
5780 10188 -13610 -36934 -16596 -109 -6772 -20541 -33977 -4891 561 -8376 -2481 14432 1543
5767 1543 -11704 -9935 -4438 4337 9498 4910 12035 27749 17101 -8367 -23961 -56532 -41691
5754 -41691 -11350 -19820 -52599 -48318 -19526 -10455 6945 20701 -4057 -6842 -18353 -19549 -11476
5741 -11476 -21164 -13714 -17065 2337 -6653 -14670 -29705 -16975 -14062 -36121 -57686 -38667 -32418
5728 -32418 5245 9731 8274 2358 -3022 -12951 -9350 -13838 -19983 -15432 -11319 -29475 -21784 -2947
5714b947J465m992J0818O318l606J0787j511n499N014J8030J692m581k8430j7082
5700a4524J161L6r973p293P842n018p107Q151Q337j103m178J335O777J7560K868
5685D871j4949k2375j3425P732K7485N981k3199J4692L0704o141l3320j9011J2879
5672b8076J328n413O882J9519N28j7406R290J4558K7929J5343p305j6191O714
5659B7700J7243p583r026j4068R889j813k9529o256q074m594j1055l746K0729
5646b0183J6317R274M129j7194j0649M194m24J087J0296r944n08j2767l2710l066
5632f2148K8602L2656k704n218j9058J3703K0875K190J6924r1j4127j7265N570
5619i1n889K4059n239n018P217j5152J1181O483j6170o63j1132J7072M806q692
$$ plain form
5714 -2947 -1482 -6474 4344 10662 7056 17843 16332 10833 15847 33877 35569 30988 2558 -14524
5700 -14524 -13363 -13327 -23300 -30593 -22751 -27769 -34876 -26725 -18388 -19491 -23669 -22334 -15557 2003 4871
5685 4871 -10078 -32453 -45878 -38146 -10661 -4680 -27879 -13187 17517 11376 -21944 -40955 -28076
5672 -28076 -26748 -32161 -25279 -5760 -5232 -22638 -13348 1210 29139 44482 37177 20986 27700
5659 27700 44943 37360 28334 14266 24155 22342 -7187 -13443 -21517 -26111 -37166 -40912 -20183
5646 -20183 -3866 5408 9537 -7657 -18306 -14112 -14536 -13449 -3153 -13097 -13605 -26372 -59082 -62148
5632 -62148 -33546 -890 -3594 -8812 -27870 -14167 6708 8898 25822 25731 11604 -5661 -91
5619 -91 -5980 18079 12840 7822 15039 -113 11068 17551 1381 718 -10414 6658 11464 2772
5605B772k0657k1797p259n656K24m786R649L2305J4785k260l2748n054J7054L381
5591b0047k790q9l587l599J0100R66l408O868O943q119J5761O570k3679L45L0079
5576A2314l211K3122K2800k5211j8558K900L1015m946n655J2318M106p259j9045
5563B4690q219n908l870j2360k4168k1521J0434J400k843J4732J5529J7295j1092
5550e901n880J3559p660j6690J4744P652K990O903l371k3191J9587l77J6491l212
5536A5644k7193k514N567r409L112J2587l414K5986j2612j0410J5194P738j0508
5523I768k65l948J031J3874r977j8909o98K3436r632l0243L0112K0251J2554j6469
5509B0885k4773M052L898j2118k1037K2389J6607k846k4909l9101j5219K1077
$$ plain form
5605 2772 -17885 -39682 -46941 -52597 -52373 -57159 -47510 -15205 -420 -2680 -35428 -40482 -23428 -20047
5591 -20047 -22837 -22926 -26513 -30112 -20012 -19046 -22454 -15586 -8643 -16762 -1001 5569 -18110 -17765 12314
5576 12314 9103 32225 55025 29814 11256 14156 45171 40225 34570 46888 50994 43735 24690
5563 24690 16471 10563 6693 -5667 -29835 -51356 -40922 -39522 -42365 -27633 -12104 5191 -5901
5550 -5901 -11781 1778 -5882 -22572 -7828 -176 2814 9717 6346 -16845 2742 2365 18856 15644
5536 15644 -11549 -14063 -8496 -17905 -14793 -2206 -5620 20366 7754 -2656 12538 20276 9768
5523 9768 9503 5555 6586 20460 10483 -8426 -9124 14312 4680 -25563 4549 24800 37354 20885
5509 20885 -3888 164 4062 -8056 -29093 -6704 9903 7057 -17852 -56953 -72172 -51095
5497e1095K3141n289K2862J7120P248r43j783j7049N511L3446k3998L518L581
5484A6270p468j0114N57l819j1494o688j1058k339K1067n589M320m179m078L5812
5470A1200J9232J2621j971l5039k0251M685P617O233p27m147r480l241k014l007
5456a8289n581J6182Q746P998J3977K967P300j522k0085l790j041j6545R836P70
5442I23j0756k2277k708J4695j9074j3268L1174J355n243K3926K256K484j0271
5429f784j1112N30J182l5P346r269j6322j0320P839K7588j4470r693K6232j2342
5415a9630j4875J9438R869J656J0662J1722J8175l727j4124l6398j6233J9131
5403a4334J0692J4480k283j8952Q7K5095J0283j4688L035Q076Q401l836L199j0274
$$ plain form
5497 -51095 -27954 -33243 -10381 6739 13987 13044 11261 -5788 -277 33169 9171 12689 16270
5484 16270 8802 -1312 -755 -4574 -16068 -22756 -33814 -36153 -15086 -20675 -16355 -20534 -24612 11200
5470 11200 30432 43053 41082 6043 -14208 -9523 -1906 4327 3600 -547 -10027 -13268 -15282 -18289
5456 -18289 -23870 -7688 1058 9056 23033 26000 33300 31778 11693 7903 6862 -9683 153 923
5442 923 -9833 -32110 -34818 -20123 -39197 -52465 -21291 -19936 -25179 -1253 1003 3487 -6784
5429 -6784 -17896 -17366 -16184 -16219 -8873 -18142 -34464 -44784 -36945 -9357 -23827 -33520 -7288 -19630
5415 -19630 -34505 -15067 -5198 -3542 7120 18842 37017 33290 19166 -17232 -33465 -14334
5403 -14334 -3642 10838 8555 -10397 -10310 14785 25068 10380 13415 21491 29892 26056 29255 18981
5389A8981k2237n956l690r906N235j8469J0293R076p012J9152K8145j1326k6036
5376a3750n708J4732j03j3172k4418O083J5416J5142l061k4717p90J149K0665
5363a2532r817K9732J9524p436k407L109q253j0J9751j7116j3104k3239j1400
5350c3198J3354J6966j4038q121J7407M115k883J3463L438k8825O087J2339L447
5337C551O803P2j0353N629k8652q975L2153J4277M227j9154j6950k3000K7085
5324a3287Q641n982l982q604N659p071j0114q828K6235K7678J9034l104l5089
5311h814m414K452l4179j5811K4943K5125l145k3748l793J077o395q135j2620
5298f7457J2239k743p479J0631L0180n367J3148L2205L224k7249j1620R617n260
$$ plain form
5389 18981 -3256 -9212 -12902 -22808 -17573 -36042 -25749 -16673 -23685 -4533 23612 12286 -13750
5376 -13750 -19458 -4726 -4829 -18001 -42419 -36336 -20920 -5778 -8839 -33556 -34346 -33197 -12532
5363 -12532 -22349 7383 26907 19471 17064 20173 11920 11910 31661 14545 1441 -21798 -33198
5350 -33198 -19844 -2878 -16916 -25037 -7630 -3515 -6398 7065 10503 -18322 -12235 104 3551
5337 3551 10354 10426 73 5702 -22950 -31925 228 14505 18732 -422 -17372 -40372 -13287
5324 -13287 -4646 -10628 -14610 -23214 -17555 -24626 -34740 -43568 -17333 10345 29379 26275 -8814
5311 -8814 -13228 -10776 -44955 -60766 -35823 -10698 -13843 -37591 -41384 -40307 -46702 -54837 -67457
5298 -67457 -55218 -57961 -65440 -54809 -24629 -29996 -16848 15357 18581 -8668 -20288 -10671 -15931
5285a5931Q57n849k1322j3912O053J2989J3585Q409p798N691R106J1753N388k5560
5271a6541J2027J8444J2684j7730j9028j1004J2483o032j3818p02J9761J563J6498
5258H605J1389M779j5663r723J7719r741k229l204J4996p55l714J8363j3678J2065
5244B9209q77n42q32q045j999j0873o403j1643j1596n509j4716J9561k965J4066
5230a3164L8366J4152n097k0204k1295N54j202j0903n026j0097j7644L009M941
5217d3610L197J8619L4091k681j6348o523P727j9288k672j1805l510K0003K6194
5204C394Q488p67K1270p350k1065o088J2430j0195j4360L659J7463j3080N627
5191e74J6657P080J1359J761J762j1622l5121l264K2568J2299k6158J555K4733
$$ plain form
5285 -15931 -15074 -20923 -42245 -56157 -50104 -37115 -23530 -15121 -22919 -17228 -8122 3631 9019 -16541
5271 -16541 -4514 13930 26614 8884 -10144 -21148 -8665 -14697 -28515 -29217 -9456 -7893 8605
5258 8605 19994 24773 9110 -613 17106 7365 5136 1932 16928 16173 12459 30822 17144 29209
5244 29209 28332 27790 26958 18913 16914 6041 -362 -12005 -23601 -29110 -43826 -24265 -27230 -13164
5230 -13164 25202 39354 34257 14053 -7242 -6688 -7890 -18793 -23819 -33916 -51560 -48551 -43610
5217 -43610 -40413 -21794 12297 9616 -6732 -13255 -5528 -24816 -27488 -39293 -42803 -22800 3394
5204 3394 11882 11115 32385 25035 3970 -2118 10312 117 -14243 -10584 6879 -6201 -574
5191 -574 16083 23163 34522 36283 38045 26423 -8698 -11962 10606 22905 -3253 -1698 23035
5178B3035M784m892J9094P618o764j9856k5085q971j54J1667j916n750Q127J039
5164A976p35N177r16K0768j5992J197J6083R483j3552o560k3228k7958j2506r102
5150e5865R062J1876O84Q366L025O449r762J2660O145p803n963k084P01J3747
5136h762r932L0926J0406k4391k1265p290k267J6032K9929l8j3296M435r101j5263
5122a9877O872J3280n189k6916n350L858l54j0129R805J2357L1631O250m489r684
5108B065k0146j097k523K2797j115K2923p48k5387J976j73P268j1053j8340J850
5094b1703N88k4612J7635R673Q142K5482j0173J192n306J4021j9147j299K734
5081b773J2747J3484j5672N378R078j1366n456j0055J1333J7430J202k5122k0431
$$ plain form
5178 23035 27819 22927 42021 49639 42875 23019 -2066 -11037 -11191 476 -1440 -7190 937 1976
5164 1976 1241 6418 5502 26270 10278 11475 27558 37041 23489 16929 -6299 -34257 -46763 -55865
5150 -55865 -46803 -34927 -34243 -25877 -22852 -16403 -26165 -13505 -7360 -15163 -21126 -23210 -22509 -8762
5136 -8762 -18694 12232 22638 -1753 -23018 -30308 -32575 -16543 13386 13348 52 4487 -4614 -19877
5122 -19877 -13005 275 -4914 -31830 -37180 -33322 -33676 -43805 -34000 -21643 9988 16238 11749 2065
5108 2065 -18081 -19178 -21701 1096 -19 22904 22156 -3231 -1255 -1428 5840 -5213 -23553 -21703
5094 -21703 -21115 -45727 -28092 -18419 -10277 15205 5032 6224 918 14939 -4208 -5507 -2773
5081 -2773 9974 23458 7786 13164 22242 10876 5420 -4635 6698 24128 25330 208 -20223
5068b0223O352k751J0602Q918p927L794j922J7964K8088J0472j9975k3166k8376
5055a8150k2196l425K5953K2742P330l544j3319J9416m13j9305j7996J4204K3549
5042A4846L754j6056J019K218j5290l52J4344J9657l244j1966o556o350K2189
5029A8213Q55k482p104r796j1116M216N010k3988r018Q157m609O033L686J034
5015b0909K5772n141J7298J1240K109N186K976m0961J1064J0782j6320K62o893
5002c535n391j1100j3758Q877R669Q287j1255j4276k939J8552K4668J1423m689
4989A4533Q174k6746j1919L5594R505o42K4038J9765j1940m4776L147J5041j7218
4976A6556k6088N11M296J4000J4412j813l771L146R174j4797j0640o095K586k2354
$$ plain form
5068 -20223 -13871 -16622 -6020 2898 -5029 -1235 -3157 14807 42895 53367 33392 10226 -18150
5055 -18150 -40346 -43771 -17818 4924 12254 8710 -4609 14807 14394 -4911 -22907 -8703 14846
5042 14846 18600 2544 3563 5781 -9509 -9861 4483 24140 20896 8930 2374 -3976 18213
5029 18213 19068 16586 9482 -314 -11430 -7214 -2204 -26192 -35210 -27053 -31662 -25629 -21943 -20909
5015 -20909 4863 -278 17020 28260 30369 35555 38531 -2430 8634 19416 3096 3358 -3535
5002 -3535 -8926 -20026 -33784 -24907 -15238 -6951 -18206 -32482 -35421 -16869 7799 19222 14533
4989 14533 22707 -4039 -15958 19636 29141 28499 52537 72302 60362 15586 18733 33774 16556
4976 16556 -9532 -9021 -4725 9275 23687 21874 18103 21249 30423 15626 4986 -1109 1477 -20877
4962b0877o521o096P382K7736Q485N833j994k0513N515K1305j7701k7476K6971
4949B049K9052j9627J0167M910l219p121K0970M868k1754k8990K5945K8125J0638
4936E6013k6434j9656O1j0426p441k313k0676p162n259j61L4743M4768J6863l0224
4922B2696n681l831k2141n632j1812J3478J4497J6053j396j7200j2076L742O239
4909c064k3012k8512j3685K3334J6026J5108P584M688J6114j5980j1763k3418
4897c6580M150J4250M089J4769L355p479j1293J7874K4331j8333P83K4825n67
4884C4174O841J093j6587j1921O32k1963k4910j3898J6812J0535L957j0796k3777
4871d9808J1080J4613j3544J6102Q028J3646K244r553J1770j5664J8468P540k305
$$ plain form
4962 -20877 -27398 -33494 -26112 1624 10109 15942 13948 -6565 -1050 20255 2554 -24922 2049
4949 2049 31101 11474 21641 26551 23332 16211 37181 42049 20295 -8695 17250 45375 56013
4936 56013 29579 9923 9984 -442 -7883 -10196 -30872 -38034 -43293 -43454 -8711 36057 52920 22696
4922 22696 17015 13184 -8957 -14589 -26401 -12923 1574 17627 16231 -969 -13045 -9303 -3064
4909 -3064 -26076 -54588 -68273 -44939 -28913 -13805 -6221 -1533 14581 -1399 -13162 -36580
4897 -36580 -32430 -18180 -14091 678 4033 -3446 -14739 3135 27466 9133 9916 34741 34174
4884 34174 41015 42108 25521 13600 14232 -7731 -32641 -46539 -29727 -19192 -15235 -26031 -49808
4871 -49808 -38728 -24115 -37659 -21557 -13529 117 2361 -7192 4578 -11086 7382 14922 12617
4858A2617j513J3691J602k1269j7526j1736j9948J7053J2852L2922J0690k8231
4846A204j4509J2320j116K41r304o311q980K1309N154o721P669Q804q335l528
4832b103K986l0036n139L836o645K3727J9171k645J0540m459m295p16k3146k9437
4818d8361J3166K0091J4782k938j0508O925J8280j1659K094N242l2916k3972K6223
4805b3551L1511j1594k2625l232L2688J4760m236m732N471M510j7937k7757p552
4792c4276j549N627j9153O503J6738Q641L1918p494o92k4084N813K5219L370j3780
4778B801k557n773K649P837N224J5024J9975O120k8547j9528j4713J8201m946
4765A767k6754P715K923k3114J7047O627j0397m104L477K2649P734k2139L526
$$ plain form
4858 12617 11104 24795 26397 5128 -12398 -24134 -44082 -27029 -14177 18745 29435 1204
4846 1204 -13305 -985 -2101 -1860 -11164 -17475 -26455 -5146 8 -6713 956 9760 1425 -2103
4832 -2103 883 -29153 -34292 -30456 -37101 -13374 5797 3152 13692 9233 4938 4222 -18924 -48361
4818 -48361 -35195 -15104 -322 -3260 -13768 -6843 11437 -222 1872 7114 -25802 -49774 -23551
4805 -23551 7960 -3634 -26259 -29491 3197 17957 13721 8989 14460 18970 1033 -26724 -34276
4792 -34276 -35825 -30198 -49351 -42848 -26110 -17469 14449 6955 6263 -17821 -12008 13211 16581 2801
4778 2801 244 -5529 -2880 4957 10181 25205 45180 51300 22753 3225 -11488 6713 1767
4765 1767 -24987 -17272 -14349 -37463 -20416 -13789 -24186 -28290 -24813 -2164 5570 -16569 -13043
4752a3043Q056J8623j7287M043O011k3248R330j6075j0357J1930K6990o52j0438
4739f117k4426j4984R086J1323P392R82K0977J2299k5240l164J3463J0662J950
4726A4203l206n493M042J6116J7104M840l3519j9976J829l426J4426k077O53o772
4712a256n029R185K066l325O67j2347q953l680P76M343r973L2337j1141q720k894
4697a7944k6829J6100J6147O255k5944J912j0612R452K2523N640j2706j661k6131
4684d3798j2485K9843L4752J5114j1087P26L979r234J1280r933k1264j6807j4412
4671d3326K0268R80Q43L1001r82J3427p127K2903j7623j6357j6088J3411k0327
4658a8997n823J3661Q007J1795O30j7560k4951N377J9154j9688K975J1958j4959
$$ plain form
4752 -13043 -4987 13636 -3651 392 6403 -16845 -7515 -23590 -33947 -22017 4973 4321 -6117
4739 -6117 -30543 -45527 -36441 -25118 -17726 -16744 4233 16532 -8708 -11872 1591 12253 14203
4726 14203 10997 5504 9546 25662 42766 47606 14087 -5889 -4060 -7486 6940 4863 5516 -1256
4712 -1256 -6285 2900 4966 1641 2308 -10039 -18992 -22672 -21896 -17553 -27526 4811 -6330 -15050 -17944
4697 -17944 -44773 -28673 -12526 -6271 -32215 -30303 -40915 -31463 -8940 -3300 -16006 -17667 -43798
4684 -43798 -56283 -26440 8312 23426 12339 13065 17044 7810 19090 9157 -12107 -28914 -43326
4671 -43326 -23058 -22078 -21235 9766 8784 22211 15084 37987 20364 4007 -12081 1330 -18997
4658 -18997 -24820 -11159 -3152 8643 9273 -8287 -33238 -27861 -8707 -28395 -25420 -13462 -28421
4645b8421l373K22K747j722J8719L0169k1885o484j2996N243K1647M052k7798
4632a9880l1367m238O800N829J9345K2643P901R836P469n067j0842J137J7802
4619B7368k1047k0370J2521J0925K0808lP653K411j5526j5490l038j0888J432
4606c244J1179R111J080O441L15k4405R190K1058R759Q518k2253n075r252o94
4592A1728j2694k9480M953J5595K2583Q4P340P134r974j7093j1977J9655k536
4579E318n986O720r360p626o80J1843R982k5687p406Q134j89J935O261j0835j5529
4564c3105K603O277J8579o907p732q630J6325J3634K0384J6568J1037N580r060
4551D5553j9022j8891j4888O632K3140r211k4015j4408k008o76Q484K998l288
$$ plain form
4645 -28421 -31794 -31572 -28825 -30547 -11828 18341 -3544 -10028 -23024 -17781 3866 7918 -19880
4632 -19880 -51247 -55485 -48685 -42856 -23511 -868 7033 16869 24338 19271 8429 9566 27368
4619 27368 6321 -14049 -1528 9397 30205 30202 37855 40266 24740 9250 6212 -4676 -3244
4606 -3244 7935 17046 18126 24567 24882 477 9667 30725 40484 49002 26749 21674 12422 11728
4592 11728 -966 -30446 -25493 -9898 12685 12769 20109 27243 17269 176 -11801 7854 5318
4579 5318 -668 6052 -3308 -10934 -11614 229 10211 -15476 -22882 -14748 -14937 -13002 -6741 -17576 -33105
4564 -33105 -30502 -24225 -5646 -12553 -20285 -28915 -12590 1044 21428 37996 49033 54613 45553
4551 45553 26531 7640 -7248 -616 22524 13313 -10702 -25110 -27118 -27794 -19310 -16312 -19600
4538a9600m151J5733k1086j1047J8033R95n814J0902J1617j0304J0593K583J044
4525e02r085J328n553J2614J0499J6449m235k5788j7662O889j9343J5170L0358
4512A1139l180m375N046j262R193P826j4238k8669k643K52J7730P22N592J0495
4498A3628Q748j3295j1337j4145n738L887o200J4606j3033L807j32j2649l394
4485c5247J8991K3225J3586o597k5908q913j9549o893J4099K2572J0198q40N304
4472D028p281j445P100R92k1725n749q378j2125J341L228J8630K6924m000m542
$$ plain form
4538 -19600 -23751 -8018 -29104 -40151 -22118 -21123 -26937 -16035 -4418 -14722 -4129 -1546 -502
4525 -502 -9587 -8259 -13812 -1198 9301 25750 21515 -4273 -21935 -15046 -34389 -19219 11139
4512 11139 7959 3584 8630 7368 16561 24387 10149 -18520 -21163 -20911 -3181 -2459 3133 13628
4498 13628 22376 9081 -2256 -16401 -22139 -18252 -24452 -9846 -22879 -19072 -19204 -31853 -35247
4485 -35247 -16256 6969 20555 13958 -11950 -20863 -40412 -47305 -33206 -10634 -436 -1276 4028
4472 4028 -3253 -4698 2402 3394 -18331 -24080 -32458 -44583 -43242 -40014 -21384 5540 1540 -3002
$$ [...]
##END NTUPLES=NMR SPECTRUM
##END=
