##TITLE=Analysis number 328733
Compound Code cc 54913
Book Reference 461/130
Project Code adrs
Chemist Name toml
##JCAMPDX= 6.0         $$ Bruker NMR JCAMP-DX V2.0
##DATA TYPE= NMR SPECTRUM
##DATA CLASS= NTUPLES
##ORIGIN= Bruker BioSpin GmbH
##OWNER= nmr
$$ XWIN-NMR		Version 3.5
$$ Thu Jun 28 11:31:53 2007 GMT Daylight Time (UT+1h)  MAYBRIDGE\nmr@NMR_250MHZ
##.OBSERVE FREQUENCY= 250.131544655141
##.OBSERVE NUCLEUS= ^1H
##.ACQUISITION MODE= SIMULTANEOUS (DQD)
##.ACQUISITION SCHEME= undefined
##.AVERAGES= 16
##.DIGITISER RES= 18
##SPECTROMETER/DATA SYSTEM= dpx250
##.PULSE SEQUENCE= zg30
##.SOLVENT NAME= CDCl3
##.SHIFT REFERENCE= (INTERNAL, CDCl3, 0, 16.522)
##AUDIT TRAIL= $$ (NUMBER, WHEN, WHO, WHERE, WHAT)
$$ ##TITLE= Audit trail, XWIN-NMR		Version 3.5
$$ ##JCAMPDX= 5.01
$$ ##ORIGIN= Bruker BioSpin GmbH
$$ ##OWNER= nmr
$$ C:\u/data/dgb/nmr/ADRS/2190/pdata/1/auditp.txt
$$ ##AUDIT TRAIL=  $$ (NUMBER, WHEN, WHO, WHERE, WHAT)
(   1,<2007-06-28 11:31:32.33 +100>,<MAYBRIDGE\nmr>,<NMR_250MHZ>,
      <created by zg, POWCHK disabled, PULCHK disabled
       configuration hash MD5:
       76 6E 9A 78 1E 09 19 81 EC 84 63 8F B0 6A 59 2D
       data hash MD5: 64K
       D3 5B 17 D2 C4 1E 47 BE 37 6E 3C E7 DF AB F6 6B>)
(   2,<2007-06-28 11:31:43.66 +100>,<MAYBRIDGE\nmr>,<NMR_250MHZ>,
      <Start of raw data processing
       ef LB = 0.3 FT_mod = 6 PKNL = 1 SI = 32K 
       data hash MD5: 32K
       89 A8 07 1C 1D 82 5C 8E 9B 41 9E C9 A0 D5 9F D9>)
(   3,<2007-06-28 11:31:45.36 +100>,<MAYBRIDGE\nmr>,<NMR_250MHZ>,
      <apk 
       data hash MD5: 32K
       CC 37 91 E4 FC 9A 57 79 01 78 59 A3 F2 04 E7 FB>)
(   4,<2007-06-28 11:31:46.11 +100>,<MAYBRIDGE\nmr>,<NMR_250MHZ>,
      <abs ABSG = 5 
       data hash MD5: 32K
       15 D3 0A F6 1F 57 4C 2A BD 96 0A 7A 5A 0C DC FB>)
$$ ##END=
$$ 
$$ hash MD5
$$ 5B D2 6D 5E 4B 41 B5 62 E6 6F 5B 28 FF 59 A9 F2
##$RELAX= 
##$RELAX= 
##$RELAX= 
##$RELAX= 
##$RELAX= 
##$RELAX= 
##$RELAX= 
$$ Bruker specific parameters
$$ --------------------------
##$DU= <C:\u>
##$EXPNO= 2190
##$NAME= <ADRS>
##$PROCNO= 1
##$TYPE= <nmr>
##$USER= <dgb>
##$AMP= (0..31)
100 100 100 100 100 100 100 100 100 100 100 100 100 100 100 100 100 100 
100 100 100 100 100 100 100 100 100 100 100 100 100 100 
##$AQSEQ= 0
##$AQ_mod= 3
##$AUNM= <au_zg>
##$AUTOPOS= <19 >
##$BF1= 250.13
##$BF2= 250.13
##$BF3= 250.13
##$BF4= 250.13
##$BF5= 500.13
##$BF6= 500.13
##$BF7= 500.13
##$BF8= 500.13
##$BYTORDA= 1
##$CFDGTYP= 0
##$CFRGTYP= 5
##$CHEMSTR= <none>
##$CNST= (0..31)
1 1 145 1 1 1 1 1 1 1 1 1 1 1 1 1 1 1 1 1 1 1 1 1 1 1 1 1 1 1 1 1 
##$CPDPRG= <>
##$CPDPRG1= <>
##$CPDPRG2= <>
##$CPDPRG3= <>
##$CPDPRG4= <mlev>
##$CPDPRG5= <mlev>
##$CPDPRG6= <mlev>
##$CPDPRG7= <mlev>
##$CPDPRG8= <mlev>
##$CPDPRGB= <>
##$CPDPRGT= <>
##$D= (0..31)
0 1 0 0 0 0 0 0 0 0.06 0 0 0 0 0 0 0.0002 0 0 0 0 0 0 0 0 0 0 0 0 0 0 
0 
##$DATE= 1183026691
##$DBL= (0..7)
120 120 120 120 120 120 120 120 
##$DBP= (0..7)
150 150 150 150 150 150 150 150 
##$DBP07= 0
##$DBPNAM0= <>
##$DBPNAM1= <>
$$ [...]
##$SUBNAM7= <"">
##$SUBNAM8= <"">
##$SUBNAM9= <"">
##$SW= 20.6930455092707
##$SWIBOX= (0..15)
0 0 3 0 0 0 0 0 0 0 0 0 0 0 0 0 
##$SW_h= 5175.983436853
##$TD= 65536
##$TD0= 1
##$TE= 295.16
##$TE2= 300
##$TE3= 300
##$TEG= 300
##$TL= (0..7)
0 120 120 120 120 120 120 120 
##$TP= (0..7)
150 150 150 150 150 150 150 150 
##$TP07= 0
##$TPNAME0= <>
##$TPNAME1= <>
##$TPNAME2= <>
##$TPNAME3= <>
##$TPNAME4= <>
##$TPNAME5= <>
##$TPNAME6= <>
##$TPNAME7= <>
##$TPOAL= (0..7)
0.5 0.5 0.5 0.5 0.5 0.5 0.5 0.5 
##$TPOFFS= (0..7)
0 0 0 0 0 0 0 0 
##$TUNHIN= 0
##$TUNHOUT= 0
##$TUNXOUT= 0
##$USERA1= <user>
##$USERA2= <user>
##$USERA3= <user>
##$USERA4= <user>
##$USERA5= <user>
##$V9= 5
##$VALIST= <valist>
##$VCLIST= <CCCCCCCCCCCCCCC>
##$VD= 0
##$VDLIST= <DDDDDDDDDDDDDDD>
##$VPLIST= <PPPPPPPPPPPPPPP>
##$VTLIST= <TTTTTTTTTTTTTTT>
##$WBST= 1024
##$WBSW= 4
##$XGAIN= (0..3)
0 0 0 0 
##$XL= 0
##$YL= 0
##$YMAX_a= 445016
##$YMIN_a= -281157
##$ZGOPTNS= <>
##$ZL1= 120
##$ZL2= 120
##$ZL3= 120
##$ZL4= 120
##$ABSF1= 16.522
##$ABSF2= -4.171173
##$ABSG= 5
##$ABSL= 3
##$ALPHA= 0
##$AQORDER= 0
##$ASSFAC= 0
##$ASSFACI= 0
##$ASSFACX= 0
##$ASSWID= 0
##$AUNMP= <proc_1d>
##$AZFE= 0.1
##$AZFW= 0.1
##$BCFW= 0
##$BC_mod= 0
##$BYTORDP= 0
##$COROFFS= 0
##$CY= 12.5
##$DATMOD= 1
##$DC= 0
##$DFILT= <>
##$DTYPP= 0
##$F1P= 14.0000005364418
##$F2P= -0.99999901652339
##$FCOR= 0.5
##$FTSIZE= 32768
##$FT_mod= 6
##$GAMMA= 0
##$GB= 0
##$INTBC= 1
##$INTSCL= 1
##$ISEN= 128
##$LB= 0.3
##$LEV0= 0
##$LPBIN= 0
##$MAXI= 10000
##$MC2= 0
##$MEAN= 0
##$ME_mod= 0
##$MI= 0
##$NCOEF= 0
##$NC_proc= -4
##$NLEV= 6
##$NOISF1= 0
##$NOISF2= 0
##$NSP= 0
##$NTH_PI= 0
##$NZP= 0
##$OFFSET= 16.522
##$PC= 1
##$PHC0= -47.99605
##$PHC1= 5.947646
##$PH_mod= 1
##$PKNL= yes
##$PPARMOD= 0
##$PSCAL= 4
##$PSIGN= 0
##$REVERSE= no
##$SF= 250.13
##$SI= 32768
##$SIGF1= 0
##$SIGF2= 0
##$SINO= 400
##$SIOLD= 32768
##$SREGLST= <1H.CDCl3>
##$SSB= 0
##$STSI= 32768
##$STSR= 0
##$SW_p= 5175.98343685301
##$SYMM= 0
##$S_DEV= 0
##$TDeff= 65536
##$TDoff= 0
##$TI= <Analysis number 999999
Compound Code 99
Book Reference 9
Project Code 9>
##$TILT= no
##$TM1= 0
##$TM2= 0
##$TOPLEV= 0
##$USERP1= <user>
##$USERP2= <user>
##$USERP3= <user>
##$USERP4= <user>
##$USERP5= <user>
##$WDW= 1
##$XDIM= 32768
##$YMAX_p= 485093208
##$YMIN_p= -191273
$$ End of Bruker specific parameters
$$ ---------------------------------
##NTUPLES= NMR SPECTRUM
##VAR_NAME=  FREQUENCY,     SPECTRUM/REAL,   SPECTRUM/IMAG
##SYMBOL=    X,             R,               I
##VAR_TYPE=  INDEPENDENT,   DEPENDENT,       DEPENDENT
##VAR_FORM=  AFFN,          ASDF,            ASDF
##VAR_DIM=   32768,         32768,           32768
##UNITS=     HZ,            ARBITRARY UNITS, ARBITRARY UNITS
##FACTOR=    0.157963299565203, 1,           1
##FIRST=     4132.6476996994, 0,             0
##LAST=      -1043.33573715361, 0,           0
##MIN=       -1043.33573715361, -191273,     0
##MAX=       4132.6476996994, 485093208,     0
$$ Real data points
##PAGE= N=1
##DATA TABLE= (X++(R..R)), XYDATA
$$ [...]
$$ plain form
18344 420005 338145 388850 413302 310747 243321 183133 151652 177831 215635 235790 188471
18333 188471 168557 166155 173125 147638 122566 160378 187659 220171 216530 204943 247058 276423
18321 276423 286132 338768 370960 320313 348921 425966 500104 462333 363956 409990 455163 423980
18309 423980 358776 331938 322795 404822 425650 397782 422755 485107 536036 506617 453699 367542
18297 367542 371119 340984 235415 209798 185800 155376 157209 159727 194168 223439 240389 272910
18285 272910 327313 496826 694369 778366 779106 673861 627659 707279 830151 884398 792307
18274 792307 646596 522886 441006 369036 385497 369244 411551 515769 619725 631367 741596
18263 741596 810999 896361 1057963 1183002 1241767 1199455 1167765 1223352 1319214 1291620 1157761
$$ packed form
18344D20005q1860N0705K4452j02555o7426o0188l1481K6179L7804K0155m7319
18333A88471j9914k402O970k5487k5072L7812K7281L2512l641j1587M2115K9365
18321B76423R709N2636L2192n0647K8608P7045P4138l7771r8377M6034M5173l1183
18309D23980o5204k6838r143Q2027K0828k7868K4973O2352N0929k9419n2918q6157
18297C67542L577l0135j05569k5617k3998l0424J833K518L4441K9271J6950L2521
18285B72910N4403J69513J97543Q3997P40j05245m6202P9620J22872N4247r2091
18274G92307j45711j23710q1880p1970J6461j6253M2307J04218J03956J1642J10229
18263G41596O9403Q5362J61602J25039N8765m2312l1690N5587R5862k7594j33859
$$ plain form
18252 1157761 1000384 859239 797243 782365 762582 674653 646612 623866 593342 557695 557283
18241 557283 595029 586251 624060 733444 816974 816161 827790 884735 911699 906526 886865 866140
18229 866140 844316 722396 514268 422193 404861 413720 420308 394100 327122 350463 385158
18218 385158 415890 490996 578892 592243 584523 567804 621812 652670 726587 775731 707624 590993
18206 590993 503616 467808 542864 646161 689229 642382 573966 586562 619795 688959 618938
18195 618938 512073 510134 563346 581972 561432 587057 660029 708125 790075 938918 1035425
18184 1035425 1050915 1111592 1136689 1269179 1619571 1995134 2340791 2610293 2707129 2648059
18174 2648059 2594219 2525882 2374982 2100178 1689182 1282291 950060 810373 696346 532632
$$ packed form
18252A157761j57377j41145o1996j4878j9783q7929k8041k2746l0524l5647m12
18241E57283L7746q778L7809J09384Q3530q13J1629N6945K6964n173j9661k0725
18229H66140k1824j21920k08128r2075j7332Q859O588k6208o6978K3341L4695
18218C85158L0732P5106Q7896J3351p720j6719N4008L0858P3917M9144o8107j16631
18206E90993q7377l5808P5056J03297M3068m6847o8416J2596L3233O9164p0021
18195F18938j06865j939N3212J8626k0540K5625P2972M8096Q1950J48843R6507
18184A035425J5490O0677K5097J32490L50392L75563L45657K69502R6836n9070
18174B648059n3840o8337j50900k74804m10996m06891l32231j39687j14027j63714
$$ plain form
18164 532632 444319 401832 428639 456463 388860 354712 353599 365049 361364 331354 342738 324191
18152 324191 285990 315973 442279 415022 403602 406915 465977 530031 567829 545504 565556
18141 565556 597308 686080 765918 779394 830238 900169 903526 886329 897929 926609 976744 1152315
18129 1152315 1379882 1713784 2127787 2504497 2940785 3375128 3687731 3977543 4251484
18120 4251484 4605447 4949753 5222042 5667122 6559336 8127810 10751218 15113247 22528135
18111 22528135 35301853 56946378 93879600 142944982 144614920 92026887 50807706
18104 50807706 29730820 19136373 13396160 9977837 7708856 6104502 4930096 4077015
18096 4077015 3457959 3034517 2713688 2488911 2229888 2061758 1813309 1631142 1442033
$$ packed form
18164E32632q8313m2487K6807K7824o7603l4148j113J1450l685l0010J1384j8547
18152C24191l8201K9983J26306k7257j1420L313N9062O4054L7798k2325K0052
18141E65556L1752Q8772P9838J3476N0844O9931L357j7197J1600K8680N0135J75571
18129A152315K27567L33902M14003L76710M36288M34343L12603K89812K73941
18120D251484L53963L44306K72289M45080Q92214J568474K623408M362029P414888
18111B2528135J2773718K1644525L6933222M9065382J669938n2588033m1219181
18104E0807706k1076886j0594447n740213l418323k268981j604354j174406q53081
18096D077015o19056m23442l20829k24777k59023j68130k48449j82167j89109
$$ plain form
18087 1442033 1290168 1236557 1155090 1064465 934769 815714 744251 656968 655075 667759 591126
18076 591126 551287 572971 636223 682034 650196 663637 688237 675005 643351 628352 585577
18065 585577 549637 547446 594846 643502 676451 633987 602640 666214 767519 817120 824340 848232
18053 848232 850871 796242 686920 685261 617811 591180 640709 668272 617846 506445 418127
18042 418127 405022 380124 392190 395337 392821 445815 502354 463618 453490 471859 503861 473454
18030 473454 475827 491824 474473 440861 395054 360568 307395 214240 188409 180604 174001 176532
18018 176532 172018 110836 124705 168619 168357 157162 159172 212362 237411 259796 193574 171284
18006 171284 204710 268163 239205 180029 171823 155589 136136 151576 190151 188096 188239 189354
$$ packed form
18087A442033j51865n3611q1467r0625j29696j19055p1463q7283j893J2684p6633
18076E91126l9839K1684O3252M5811l1838J3441K4600j3232l1654j4999m2775
18065E85577l5940k191M7400M8656L2949m2464l1347O3574J01305M9601P220K3892
18053H48232K639n4629j09322j659o7450k6631M9529K7563n0426j11401q8318
18042D18127j3105k4898J2066L147k516N2994N6539l8736j0128J8369L2002l0407
18030D73454K373J5997j7351l3612m5807l4486n3173r3155k5831p805o603K531
18018A76532m514o1182J3869M3914k62j1195K010N3190K5049K2385o6222k2290
18006A71284L3426O3453k8958n9176q206j6234j9453J5440L8575k055J43J115
$$ plain form
17994 189354 167611 154436 156785 213057 253297 258062 239755 215330 269593 319301 383253 430811
17982 430811 425222 322811 229993 178480 146029 152016 192227 207746 227943 206883 178424 135584
17970 135584 96191 76810 102625 142630 183464 190151 160217 132411 87088 81399 88496 52685
17958 52685 77022 53559 81904 94277 110631 92683 98880 150322 136245 148393 132561 102610
17946 102610 106120 119273 76847 11034 -18167 -7103 53430 43578 76377 102676 24930 48853
17934 48853 154876 158779 113987 57355 2665 11589 10317 54115 5950 -8221 -3729 29180
17922 29180 47726 65393 88633 64773 81530 72491 19931 31296 102247 85893 70275 21686
17910 21686 25627 88286 122727 98743 101624 124021 117450 85116 2239 -32643 7699 50611
$$ packed form
17994A89354k1743j3175K349N6272M0240M765j8307k4425N4263M9708O3952M7558
17982D30811n589j02411r2818n1513l2451N987M0211J5519K0197k1060k8459m2840
17970A35584l9393j9381K5815M0005M0834O687k9934k7806m5323n689P097l5811
17958E2685K4337k3463K8345J2373J6354j7948O197N1442j4077J2148j5832k9951
17946A02610L510J3153m2426o5813k9201J1064O0533r852L2799K6299p7746K3923
17934D8853J06023L903m4792n6632n4690Q924j272M3798m8165j4171M492L2909
17922B9180J8546J7667K3240k3860J6757r039n2560J1365P0951j6354j5618m8589
17910B1686L941O2659L4441k3984K881K2397o571l2334q2877l4882M0342M2912
$$ plain form
17898 50611 69491 113480 137120 178349 163669 146426 183834 132876 129877 146505 79367 88994
17886 88994 138298 185959 186513 139272 138760 213282 171908 202913 221020 217553 292147 405767
17874 405767 470945 623473 757898 763179 683255 659036 781505 882590 815804 655671 551005
17863 551005 547778 655279 791851 822010 698221 679589 762700 831043 915055 772188 534976
17852 534976 424814 377588 345252 364618 311861 284914 312225 307231 303995 282382 231498 226360
17840 226360 260307 214885 219647 280254 278232 262633 264911 307846 327971 306468 333227 341246
17828 341246 312418 286661 301731 293849 288984 280065 311400 275985 234439 234469 261711 256699 250490
17815 250490 243614 251178 221093 218094 269783 266205 318367 460136 534143 577837 719298 981919
$$ packed form
17898E0611J8880M3989K3640M1229j4680j7243L7408n0958k999J6628o7138R627
17886H8994M9304M7661N54m7241n12P4522m1374L1005J8107l467P4594J13620
17874D05767O5178J52528J34425N281p9924k4219J22469J01085o6786j60133j04666
17863E51005l227J07501J36572L0159j23789j8632Q3111O8343Q4012j42867k37212
17852E34976j10162m7226l2336J9366n2757k6947K7311m994l236k1613n0884n138
17840B26360L3947m5422M762O0607k022j5599K278M2935K0125k1503K6759Q019
17828C41246k8828k5757J5070p882m865q919L1335l5415m1546L0K7242n012o209
17815B50490o876P564l0085k999N1689l578N2162J41769P4007M3694J41461K62621
$$ plain form
17803 981919 1253673 1376521 1338488 1294007 1429108 1644267 1783964 1717639 1482712 1201253
17793 1201253 1041646 1016199 1015877 984053 945680 870541 821493 784495 853913 1019981 1242634
17782 1242634 1518041 1708175 1735855 1600195 1580985 1719014 1902512 1924090 1717063 1433331
17772 1433331 1217582 1096391 1085970 1082117 1067925 963186 897174 849382 845735 902790 940523
17761 940523 983578 1039265 1115816 1217575 1357793 1605936 1896895 2178810 2309539 2401447
17751 2401447 2549443 2661516 2793662 2882155 2946715 2999686 2990272 3084995 3265994 3611156
17741 3611156 4096150 4698800 5350894 6085425 7075907 8467822 10577599 13753180 18514451
17732 18514451 25804819 37521084 56426109 84329027 113904630 125511311 113871867
$$ packed form
17803I81919K71754J22848l8033m4481J35101K15159J39697o6325k34927k81459
17793A201253j59607k5447l22l1824l8373p5139m9048l6998O9418J66068K22653
17782A242634K75407J90134K7680j35660j9210J38029J83498K1578k07027k83732
17772A433331k15749j21191j0421l853j4192j04739o6012m7792l647N7055L7733
17761I40523M3055N5687P6551J01759J40218K48143K90959K81915J30729R1908
17751B401447J47996J12073J32146Q8493O4560N2971r414R4723J80999L45162
17741C611156M84994O02650O52094P34531R90482J391915K109777L175581M761271
17732A8514451P290368J1716265J8905025K7902918K9575603J1606681j1639444
$$ plain form
17725 113871867 100606112 103274312 117679841 121927434 101151789 69467732 45402197
17718 45402197 31647598 24266657 20407747 18626925 18399703 19461556 22040390 27002030
17710 27002030 35724091 50433160 73791806 105333742 130833050 131157602 114223295
17703 114223295 105584977 114657232 127921571 121027978 90969616 59059595 37783268
17696 37783268 25491008 18479084 14401134 11819954 9989524 8493445 7289138 6476599
17688 6476599 5913440 5369466 4807204 4387458 4077626 3939627 3801373 3493530 3205747
17679 3205747 2997889 2944119 2999939 2985224 2760241 2335660 2112653 2027582 1938362 1774863
17669 1774863 1520403 1280688 1096368 964054 888786 781534 683417 665663 693576 707989
$$ packed form
17725A13871867j3265755K668200J4405529M247593k0775645l1684057k4065535
17718D5402197j3754599p380941l858910j780822k27222J061853K578834M961640
17710B7002030Q722061J4709069K3358646L1541936K5499308L24552j6934307
17703A14223295q638318R072255J3264339o893593l0058362l1910021k1276327
17696C7783268j2292260p011924m077950k581180j830430j496079j204307q12539
17688F476599n63159n43974n62262m19746l09832j37999j38254l07843k87783
17679C205747k07858n3770N5820j4715k24983m24581k23007q5071q9220j63499
17669A774863k54460k39715j84320j32314p5268j07252r8117j7754K7913J4413
$$ plain form
17659 707989 649529 654570 659025 628908 514379 475608 421225 425475 449280 417623 389429 418540
17647 418540 447555 471739 408023 361032 361726 364214 323968 273577 301814 355131 301113 300270
17635 300270 322152 275083 270648 313680 353212 353214 319242 368059 327814 262651 219098 192290
17623 192290 208028 223309 221354 244204 259901 242858 239355 215134 227006 211510 217984 246379
17611 246379 224663 150673 105949 122673 222632 244931 221269 261512 296598 270815 269128 208590
17599 208590 231675 255571 274773 281059 238114 222341 206345 173221 156080 109346 91932 121040
17587 121040 158911 229878 244162 190945 172938 157011 129150 171203 215660 281615 341040
17576 341040 376239 329145 198851 188669 228018 222757 202366 135124 129561 149928 156498 145738
$$ packed form
17659G07989n8460N041M455l0117j14529l8771n4383M250K3805l1657k8194K9111
17647D18540K9015K4184o3716m6991O94K488m0246n0391K8237N3317n4018q43
17635C00270K1882m7069m435M3032L9532Kl3972M8817m0245o5163m3553k6808
17623A92290J5738J5281j955K2850J5697j7043l503k4221J1872j5496O474K8395
17611B46379k1716p3990m4724J6724R9959K2299k3662M0243L5086k5783j687o0538
17599B08590K3085K3896J9202O286m2945j5773j5996l3124j7141m6734j7414K9108
17587A21040L7871P0967J4284n3217j8007j5927k7861M2053M4457O5955N9425
17576C41040L5199m7094j30294j0182L9349n261k0391o7242n563K0367O570j0760
$$ plain form
17564 145738 74872 50702 51467 43494 108143 129208 117877 86730 46954 46207 50848 73775 87946
17551 87946 70759 79121 75644 78922 72320 53755 62738 136407 170396 173448 173529 162755 150462
17538 150462 116199 58351 92709 121550 159951 166078 190167 151245 92299 117537 107044 92419
17526 92419 73704 65606 76337 149716 166004 147970 164033 257703 304630 394876 481595 602666
17514 602666 561925 487089 479071 525760 590148 577373 447802 415583 527917 612014 813117
17503 813117 1078880 1236949 1144286 904831 757920 732543 684952 547322 463839 464196 534084
17492 534084 654344 834046 847435 678106 534849 432877 380913 350030 352264 453043
17482 453043 539396 715479 760409 673047 533297 459215 345451 237182 228301 274200 358327
$$ packed form
17564A45738p0866k4170P65p973O4649K1065j1331l1147l9776p47M641K2927J4171
17551H7946j7187Q362l477L278o602j8565Q983P3669L3989L052Q1j0774j2293
17538A50462l4263n7848L4358K8841L8401O127K4089l8922n8946K5238j0493j4625
17526I2419j8715q098J0731P3379J6288j8034J6063R3670M6927R0246Q6719J21071
17514F02666m0741p4836q018M6689O4388j2775j29571l2219J12334Q4097K01103
17503H13117K65763J58069r2663k39455j46911k5377m7591j37630q3483L57O9888
17492E34084J20260J79702J3389j69329j43257j01972n1964l0883K234J00779
17482D53043Q6353J76083M4930q7362j39750p4082j13764j08269q881M5899Q4127
$$ plain form
17471 358327 488296 612397 684151 561037 360794 249284 211221 232552 240022 260309 227316
17460 227316 202365 174134 142776 140061 109394 89579 51686 83959 75466 39998 35970 114219
17448 114219 142484 134006 152046 256893 352510 428753 646509 856962 692024 411412 210872
17437 210872 109442 123822 147261 140297 151054 154168 128255 89587 51016 86828 95441 85211
17425 85211 119784 84016 24184 47641 75122 59255 46984 -6131 -37471 -60131 -30545 14151
17413 14151 -117 8185 18584 53062 68454 84075 67416 71695 43450 -2126 15357 64432
17401 64432 69831 7459 -26199 27800 125872 131486 118117 181115 230162 149521 123721 89128
17389 89128 86697 99701 83221 125616 157157 151312 136282 71666 24849 19150 64757 14483
$$ packed form
17471C58327J29969J24101P1754j23114k00243j11510l8063K1331P470K0287l2993
17460B27316k4951k8231l1358k715l0667j9815l7893L2273q493l5468m028P8249
17448A14219K8265q478J8040J04847R5617P6243K17756K10453j64938k80612k00540
17437B10872j01430J4380K3439o964J0757L114k5913l8668l8571L5812Q613j0230
17425H5211L4573l5768n9832K3457K7481j5867j2271n3115l1340k2660K9586M4696
17413A4151j4268Q302J0399L4478J5392J5621j6659M279k8245m5576J7483M9075
17401F4432N399o2372l3658N3999R8072N614j3369O2998M9047q0641k5800l4593
17389H9128k431J3004j6480M2395L1541n845j5030o4616m6817n699M5607n0274
$$ plain form
17377 14483 -26674 -27010 -60929 -65776 -23687 40130 75843 39651 9014 -2041 54687 34399
17365 34399 -25015 -34365 -46932 -82470 -118676 -107084 -44540 20202 53448 28077 -13443 -49428
17353 -49428 -90561 -48008 26369 98201 90587 29275 34644 37351 75683 65346 28499 -42911
17341 -42911 -52790 -62283 -103116 -107859 -53106 36680 36468 -19087 -16724 51052 112893 150642 167038
17328 167038 130824 86466 95830 55652 66322 118215 66705 49681 23901 46041 43742 56328
17316 56328 93217 190936 168485 107258 25053 -7090 18362 68162 92395 56140 2817 -13861
17304 -13861 -26907 13276 55873 -2019 -18286 -20530 -16915 -33517 -13557 31436 35121 -25840
17292 -25840 -45348 -38655 -28158 -6832 -3205 50244 66375 57935 31939 21510 20337 48534
$$ packed form
17377A4483m1157l36l3919m847M2089O3817L5713l6192l0637j1055N6728k0288
17365C4399n9414r350j2567l5538l6206J1592O2544O4742L3246k5371m1520l5985
17353d9428m1133M2553P4377P1832p614o1312N369K707L8332j0337l6847p1410
17341d2911r879r493m0833m743N4753Q9786k12n5555K363O7776O1841L7749J6396
17328A67038l6214m4358R364m0178J0670N1893n1510j7024k5780K2140k299J2586
17316E6328L6889R7719k2451o1227q2205l2143K5452M9800K4233l6255n3323j6678
17304a3861j3046M0183M2597n7892j6267k244L615j6602J9960M4993L685o0961
17292b5840j9508O693J0497K1326L627N3449J6131q440k5996j0429j173K8197
$$ plain form
17280 48534 50015 48849 11522 -47857 20651 127797 180422 254583 220912 147825 156612 169311
17268 169311 157877 110912 127832 158771 141671 176962 98453 113121 132323 113450 86636
17257 86636 69574 21649 -34991 4725 42137 27872 -27388 789 96670 117936 134043 155240
17245 155240 169791 159577 96345 100927 101955 129720 184059 175080 170816 97493 2360 54803
17233 54803 126364 88078 25581 46547 131728 149436 187815 195105 149103 138701 129119 100593
17221 100593 151096 206580 194726 153827 163413 216387 166976 97893 89908 78229 29779 6374
17209 6374 12725 76607 126084 170514 168421 130594 151182 204229 217716 195775 164996 181269
17197 181269 174455 225754 281621 262206 207979 231964 196692 132513 135302 167847 180151 181949
$$ packed form
17280D8534J481j166l7327n9379O8508J07146N2625P4161l3671p3087Q787J2699
17268A69311j1434m6965J6920L0939j7100L5291p8509J4668J9202j8873k6814
17257H6636j7062m7925n6640L9716L7412j4265n5260K8177R5881K1266J6107K1197
17245A55240J4551j0214o3232M582J028K7765N4339q979m264p3323r5133N2443
17233E4803P1561l8286o2497K0966Q5181J7708L8379P290m6002j0402r582k8526
17221A00593N0503N5484j1854m0899R586N2974m9411o9083p985j1679m8450k3405
17209F374O351O3882M9477M4430k093l7827K0588N3047J3487k1941l0779J6273
17197A81269o814N1299N5867j9415n4227K3985l5272o4179K789L2545J2304J798
$$ plain form
17185 181949 99996 71054 19826 10321 50767 70723 48865 107534 147533 129058 67796 132654
17173 132654 123835 95142 99006 176722 357386 487180 543713 568192 518292 472588 496844
17162 496844 518318 527955 467331 333292 187514 163660 243586 246657 201146 191760 154191 136967
17150 136967 136820 221516 380330 595898 767273 811209 763827 676773 643519 745901 772577
17139 772577 686418 553744 352636 267553 262596 238110 170691 144139 92143 70370 51277
17128 51277 64502 21989 6025 53667 99698 60899 52202 17243 -37664 -72960 -55467 -50571
17116 -50571 -26104 -15991 -22357 -8284 26635 14789 30319 88873 89319 55906 36398 40256
17104 40256 109084 141703 103972 54260 13340 -10872 3633 6450 25065 25005 3209 -23936
$$ packed form
17185A81949q1953k8942n1228r505M0446J9956k1858N8669L9999j8475o1262O4858
17173A32654q819k8693L864P7716J80664J29794N6533K4479m9900m5704K4256
17162D96844K1474R637o0624j34039j45778k3854P9926L071m5511r386l7569j7224
17150A36967j47Q4696J58814K15568J71375M3936m7382q7054l3254J02382K6676
17139G72577q6159j32674k01108q5083m957k4486o7419k6552n1996k1773j9093
17128E1277J3225m2513j5964M7642M6031l8799q697l4959n4907l5296J7493M896
17116e0571K4467J0113o366J4073L4919j1846J5530N8554M46l3413j9508L858
17104D0256O8828L2619l7731m9712m0920k4212J4505K817J8615o0k1796k7145
$$ plain form
17092 -23936 -18187 14107 47895 78229 55701 -7770 -6085 49704 70721 28269 22732 62049
17080 62049 100010 118329 117487 78126 35845 64050 88648 90232 132954 133965 129903 174540 190087
17067 190087 151636 154947 150845 144316 99415 128162 142521 126549 171952 208622 211184 147180
17055 147180 77865 72668 41811 154409 203101 194378 140488 142313 160084 112702 73748 51734
17043 51734 111091 84006 92435 114572 143390 161587 164961 180796 129142 93540 76268 124465
17031 124465 161523 177524 192955 211473 230569 253842 202593 167936 161484 161925 234078 307402
17019 307402 295061 310964 316984 364521 486162 457442 377914 344260 273879 258008 303779
17008 303779 377843 414182 411550 435880 416214 413716 336077 293538 297559 383573 459139 469132
$$ packed form
17092b3936N749L2294L3788L0334k2528o3471J685N5789K1017m2452n537L9317
17080F2049L7961J8319q42l9361m2281K8205K4598J584M2722J011m062M4637J5547
17067A90087l8451L311m102o529m4901K8747J4359j5972M5403L6670K562o4004
17055A47180o9315n197l0857J12598M8692q723n3890J825J7771m7382l8954k2014
17043E1734N9357k7085Q429K2137K8818J8197L374J5835n1654l5602j7272M8197
17031A24465L7058J6001J5431J8518J9096K3273n1249l4657o452M41P2153P3324
17019C07402j2341J5903O020M7537J21641k8720p9528l3654p0381j5871M5771
17008C03779P4064L6339k632K4330j9666k498p7639m2539M021Q6014P5566R993
$$ plain form
16996 469132 492991 527213 631491 680382 673642 643578 721675 747702 683165 697433 776962
16985 776962 903169 1037919 1216088 1482844 1559412 1412924 1307967 1237685 1239070 1280916
16975 1280916 1407717 1657072 2029774 2471238 2741154 2813194 2772989 2852993 3111615 3553032
16965 3553032 4269243 4932264 5369649 6053754 6847445 7394039 7877810 8936315 10911283
16956 10911283 14200846 19700853 29016002 44389282 69286123 107098788 134555817
16949 134555817 111882324 71909524 46782913 34558268 29923315 30440111 35574230
16942 35574230 46426468 65846269 97659350 131410412 124233598 84756653 55191078
16935 55191078 40261102 34614687 35676778 43200007 58625836 85247803 120459361
$$ packed form
16996D69132K3859L4222J04278M8891o740l0064P8097K6027o4537J4268P9529
16985G76962J26207J34750J78169K66756P6568j46488j04957p0282J385M1846
16975A280916J26801K49355L72702M41464K69916P2040m0205Q0004K58622M41417
16965C553032P16211O63021M37385O84105P93691N46594M83771J058505J974968
16956A0911283L289563N500007R315149J5373280K4896841L7812665K7457029
16949A34555817k2673493l9972800k5126611j2224645m634953N16796N134119
16942C5574230J0852238J9419801L1813081L3751062p176814l9476945k9565575
16935E5191078j4929976n646415J062091P523229J5425829K6621967L5211558
$$ plain form
16928 120459361 127027011 92100283 58950637 40745172 31950005 28735797 29956501
16921 29956501 35975196 48541568 70812188 104798704 125514301 99226751 61169275
16914 61169275 37508167 24452985 17034999 12759133 10128799 8396061 7265325 6550151
16906 6550151 5981304 5532787 5351911 5088020 4464875 3686440 3145880 2855757 2650435
16897 2650435 2610448 2693926 2723687 2598561 2481369 2230246 1839751 1528866 1309918 1187620
16887 1187620 1122820 1003830 969192 1035375 1109496 1235462 1282844 1134726 983403 844256
16877 844256 776704 735336 653782 603416 531827 465043 406453 362623 391258 435744 464952
16866 464952 420169 451102 436286 417031 445770 409327 424936 408988 351226 281144 289645 287423
$$ packed form
16928A20459361O567650l4926728l3149646j8205465q795167l214208J220704
16921B9956501O018695J2566372K2270620L3986516K0715597k6287550l8057476
16914F1169275k3661108j3055182p417986m275866k630334j732738j130736p15174
16906F550151n68847m48517j80876k63891o23145p78435n40560k90123k05322
16897B650435l9987Q3478K9761j25126j17192k51123l90495l10885k18948j22298
16887A187620o4800j18990l4638O6183P4121J25966M7382j48118j51323j39147
16877H44256o7552m1368q1554n0366p1589o6784n8590m3830K8635M4486K9208
16866D64952m4783L0933j4816j9255K8739l6443J5609j5948n7762p0082Q501k222
$$ plain form
16854 287423 268959 223746 191237 186098 186834 197509 262516 320955 207442 174759 236903 269187
16842 269187 251150 231119 223176 243402 226910 158315 169872 195023 239482 207666 180091 202223
16830 202223 207276 170747 147630 179403 241516 266416 300476 276947 198730 113098 82090 137187
16818 137187 174077 187366 163138 104777 142557 208545 278584 266484 290432 297883 279142 245360
16806 245360 258674 270150 285695 270707 287969 245550 156098 129713 160536 141716 135217 126996
16794 126996 144741 136155 107995 158836 263487 311279 298147 225717 190102 184581 202895 176003
16782 176003 169388 120552 165962 174369 135575 68577 64103 61679 80623 115185 129769 141585
16770 141585 178546 152587 155115 131059 42783 21658 55221 70806 119688 120056 82788 16070
$$ packed form
16854B87423j8464m5213l2509n139P36J0675O5007N8439j13513l2683O2144L2284
16842B69187j8037k0031p943K0226j6492o8595J1557K5151M4459l1816k7575K2132
16830B02223N053l6529k3117L1773O2113K4900L4060k3529p8217q5632l1008N5097
16818A37187L6890J3289k4228n8361L7780O5988P0039j2100K3948P451j8741l3782
16806B45360J3314J1476J5545j4988J7262m2419q9452k6385L0823j8820o499q221
16794A26996J7745q586k8160N0841J04651M7792j3132p2430l5615n521J8314k6892
16782A76003o615m8836M5410Q407l8794o6998m474k424J8944L4562J4584J1816
16770A41585L6961k5959K528k4056q8276k1125L3563J5585M8882L68l7268o6718
$$ plain form
16758 16070 -20191 -37938 -54970 -46255 -26142 -19708 -15492 13389 63271 51457 20211 4115
16746 4115 -29581 -27772 24315 6174 -50355 -52390 -17452 90024 134299 63086 48633 59982
16734 59982 21859 32499 98575 127431 111385 124005 128980 99564 47772 -13812 -5891 19328
16722 19328 45108 96036 109173 104744 96738 111859 101074 92983 49327 51192 98983 69343
16710 69343 28787 19759 22967 161 -23110 -19832 42448 138027 164505 159026 133257 106156
16698 106156 82152 25901 9241 -17455 644 38122 56080 123868 134069 73771 36007
16687 36007 15361 30404 -1097 -5410 -34025 -24719 -39397 59948 35127 -6929 949 -25809
16675 -25809 30748 39645 -48478 -58515 -56983 -49828 -21227 32416 33000 4686 36790 77574 118268
$$ packed form
16758A6070l6261j7747j7032Q715K0113O434M216K8881M9882j1814l1246j6096
16746D115l3696J809N2087j8141n6529k035L4938J07476M4275p1213j4453J1349
16734E9982l8123J0640O6076K8856j6046J2620M975k9416n1792o1584P921K5219
16722A9328K5780N0928J3137m429q006J5121j0785q091m3656J865M7791k9640
16710F9343m0556r028L208k2806k3271L278O2280R5579K6478n479k5769k7101
16698A06156k4004n6251j6660k6696J8099L7478J7958O7788J0201o0298l7764
16687C6007k0646J5043l1501m313k8615R306j4678R9345k4821m2056P878k6758
16675b5809N6557Q897q8123j0037J532P155K8601N3643N84k8314L2104M0784M0694
$$ plain form
16662 118268 119069 107591 50723 23656 49313 101806 155333 140985 119191 82229 58371 42440
16650 42440 32896 76941 83945 127823 98573 51223 23906 -7941 -14180 -32913 -20289 -45838
16638 -45838 -38782 -25722 -7955 28757 64705 54626 3451 -12524 -12101 -18642 24980 -50465
16626 -50465 -90971 -55721 9756 -31266 -40972 -2735 -16342 33675 56187 93862 57511 67212
16614 67212 52260 48996 53274 56088 130293 120121 99835 82575 80427 131112 93923 53839
16602 53839 28292 73295 116227 181850 170540 190836 279664 267762 202892 106693 107060 175426
16590 175426 242194 323006 402097 462091 517217 475861 360111 257515 234948 150893 83500
16579 83500 65115 115471 228053 283251 336914 359214 351869 293223 282249 275809 295007 337380
$$ packed form
16662A18268Q01j1478n6868k7067K5657N2493N3527j4348k1794l6962k3858j5931
16650D2440r544M4045P004M3878k9250m7350k7317l1847o239j8733J2624k5549
16638d5838P056J3060J7767L6712L5948j0079n1175j5975M23o541M3622p5445
16626e0465m0506L5250O5477m1022r706L8237j3607N0017K2512L7675l6351R701
16614F7212j4952l264M278K814P4205j0172k0286j7260k148N0685l7189m0084
16602E3839k5547M5003M2932O5623j1310K0296Q8828j1902o4870r6199L67O8366
16590A75426O6768Q0812P9091N9994N5126m1356j15750j02596k2567q4055o7393
16579H3500j8385N0356J12582N5198N3663K2300p345n8646j0974o440J9198M2373
$$ plain form
16567 337380 390024 446604 455911 383350 268750 218264 214086 221240 179723 150954 151440 194292
16555 194292 242079 277486 291458 252482 193328 134027 123473 112814 101896 105434 108211 115394
16543 115394 66441 51495 37976 10450 -7225 -6034 10441 -26009 -56231 -102362 -67502 -36321
16531 -36321 -67424 -103862 -72378 -86214 -69469 -40304 -292 35178 -5210 -13010 13128 -12145
16519 -12145 -30494 -29274 -32776 -19703 -14245 5462 22802 20321 68768 26449 37422 54273
16507 54273 18526 -9354 -55065 -58731 -22601 34154 14437 18291 -45444 -92835 -93504 -63036
16495 -63036 -56689 -7010 44014 84695 42951 17066 52121 39949 10170 24432 26548 51607
16483 51607 51416 27970 46946 -41736 -67479 -64831 -56798 -7160 12069 -22362 -5578 54726
$$ packed form
16567C37380N2644N6580R307p2561j14600n0486m178P154m1517k8769M86M2852
16555A94292M7787L5407J3972l8976n9154n9301j0554j0659j0918L538K777P183
16543A15394m8953j4946j3519k7526j7675J191J6475l6450l0222m6131L4860L1181
16531c6321l1103l6438L1484j3836J6745K9165M0012L5470m0388p800K6138k5273
16519a2145j8349J220l502J3073N458J9707J7340k481M8447m2319J0973J6851
16507E4273l5747k7880m5711l666L6130N6755j9717L854o3735m7391o69L0468
16495f3036O347M9679N1024M0681m1744k5885L5055j2172k9779J4262K116K5059
16483E1607j91k3446J8976q8682k5743K648Q033M9638J9229l4431J6784O0304
$$ plain form
16471 54726 86927 38485 6469 49276 36224 16402 16083 -32558 -107620 -120523 -111568 -147027
16459 -147027 -171801 -154994 -88912 -70446 -117659 -89830 -88323 -89682 -87296 -128160 -128588 -108855
16447 -108855 -47150 -14880 -42119 -45176 -51290 -45387 -19096 -24346 6287 11539 2739 -37769 -36140
16434 -36140 -1473 5428 16184 -8247 -24140 2960 5266 -7264 -20380 -66217 -71588 -6202
16422 -6202 37674 27499 -55674 -89014 -85356 -79591 -70539 -38913 -187 -11498 18876 59782
16410 59782 21123 -28708 -9184 20092 21759 39788 18982 15746 42939 52864 68358 127872
16398 127872 205888 235330 292503 415854 476316 534848 669863 732412 632755 508805 407419
16387 407419 358027 280577 191118 161170 257398 366979 527173 721250 718870 513116 371919
$$ packed form
16471E4726L2201m8442l2016M2807j3052j9822l19m8641p5062j2903Q955l5459
16459a47027k4774J6807O6082J8466m7213K7829J507j359K386m0864m28J9733
16447a08855O1705L2270k7239l057o114N903K6291n250L0633N252q800m0508J629
16434c6140L4667O901J0756k4431j5893K7100K306j2530j3116m5837n371O5386
16422f202M3876j0175q3173l3340L658N765R052L1626L8726j1311L0374M0906
16410E9782l8659m9831J9524K9276J667J8029k0806l236K7193R925J5494N9514
16398A27872P8016K9442N7173J23351O0462N8532J35015O2549r9657j23950j01386
16387D07419m9392p7450q9459k9948R6228J09581J60194J94077k380k05754j41197
$$ plain form
16376 371919 334954 370884 364477 317439 393774 549448 688416 722621 575552 348843 208271
16365 208271 159694 162313 179749 226730 300187 429804 573153 628241 447217 267295 153975
16354 153975 200020 209362 142933 101450 88617 48992 20614 3519 45979 131398 216048 165610
16342 165610 184611 256760 275156 247981 307242 379074 395215 459385 568338 589795 488657
16331 488657 371770 268281 286692 267036 264909 274287 211343 199675 193067 133547 146709 175549
16319 175549 246340 353038 413079 410088 492382 511364 451267 392321 363358 318972 291724
16308 291724 211628 161882 126223 100052 84992 29470 -4550 17730 26754 36767 36597 36890
16296 36890 53186 6751 -8865 -57750 -93652 -24474 -30787 -27384 -30461 -56636 -41127 -47245
$$ packed form
16376C71919l6965L5930o407m7038P6335J55674J38968L4205j47069k26709j40572
16365B08271m8577K619J7436M6981P3457J29617J43349N5088j81024j79922j13320
16354A53975M6045R342o6429m1483j2833l9625k8378j7095M2460Q5419Q4650n0438
16342A65610J9001P2149J8396k7175N9261P1832J6141O4170J08953K1457j01138
16331D88657j16887j03489J8411j9656k127R378o2944j1668o608n9520J3162K8840
16319A75549P0791J06698O0041k991Q2294J8982o0097n8946k8963m4386k7248
16308B91724q0096m9746l5659k6171j5060n5522l4020K2280R024J0013j70K93
16296C6890J6296m6435j5616m8885l5902O9178o313L403l077k6175J5509o118
$$ plain form
16284 -47245 -52209 -31075 -19193 -87927 -65924 -60899 -45004 2944 51786 117199 126379 137450
16272 137450 86531 100395 44389 36571 37935 85226 101576 64306 81806 79848 73091 78449
16260 78449 97936 46909 15582 27673 11525 -7918 10625 49934 -21633 -108950 -77078 -70505
16248 -70505 -101858 -82654 -75640 2133 8519 -51701 -58307 -21906 38539 80966 44617 44140 18089
16235 18089 -7884 21666 -5592 -6843 -2039 4326 6520 34175 -36127 -23604 52797 48990 179
16222 179 -6586 -51365 -64708 -37264 -40643 -97285 -126223 -90223 -79178 -51853 -14687 19111
16210 19111 25519 15785 36834 -42072 -85475 -75930 -40165 18513 71134 -9472 -30173 -27208
16198 -27208 30213 29579 12668 -3701 28502 38707 45490 88785 75579 98341 137986 78872
$$ packed form
16284d7245m964K1134J1882o8734K2003N025J5895M7948M8842O5413R180J1071
16272A37450n0919J3864n6006p818J364M7291J6350l7270J7500j958o757N358
16260G8449J9487n1027l1327J2091j6148j9443J8543L9309p1567q7317L1872O573
16248g0505l1353J9204P014P7773O386o0220o606L6401O0445M2427l6349m77k6051
16235A8089k5973K9550k7258j251M804O365K194K7655p0302J2523P6401l807m8811
16222A79o765m4779j3343K7444l379n6642k8938L6000J1045K7325L7166L3798
16210A9111O408r734K1049p8906m3403R545L5765N8678N2621q0606k0701K965
16198b7208N7421o34j6911j6369L2203J0205O783M3295j3206K2762L9645n9114
$$ plain form
16186 78872 45767 9759 -10933 -13095 24192 16664 5628 25786 -11137 -5900 21211 40768
16174 40768 97039 69292 16189 26643 -6787 -15419 -38796 -58573 -63530 -52316 -27496 15058
16162 15058 63554 93078 77758 80168 43895 44711 20505 4660 37675 68922 -1488 -112237
16150 -112237 -124488 -73401 -48099 -1935 25258 23146 59145 38686 17367 3742 -323 34845
16138 34845 38361 -14632 2959 37303 14299 -6191 -2133 -22622 -21350 -37800 -51400 -44035
16126 -44035 -34659 -2062 19981 38437 42031 -23279 -67721 -40849 -40369 -51667 -70999 -76393 -35209
16113 -35209 -28833 -46923 -42432 -21996 -78626 -55981 -21000 -14794 -37376 -55399 -40181 -46587
16101 -46587 -72950 -73554 -76009 -41234 -11156 -23806 -5153 42511 19331 -9140 5690 504
$$ packed form
16186G8872l3105l6008k0692k162L7287p528j1036K0158l6923N237K7111J9557
16174D0768N6271k7747n3103J0454l3430q632k3377j9777m957J1214K4820M2554
16162A5058M8496K9524j5320K410l6273Q16k4206j5845L3015L1247p0410j10749
16150a12237j2251N1087K5302M6164K7193k112L5999k0459k1319j3625m065L5168
16138C4845L516n2993J7591L4344k3004k0490M058k0489J272j6450j3600P365
16126d4035R376L2597K2043J8456L594o5310m4442K6872M80j1298j9332n394M1184
16113c5209O376j8090M491K0436n6630K2645L4981O206k2582j8023J5218o406
16101d6587k6363o04k455L4775L0078j2650J8653M7664k3180k8471J4830n186
$$ plain form
16089 504 30544 64812 41146 62796 97401 81957 4445 -1851 41402 47049 44359 -4436 -16949
16076 -16949 -45439 -44097 -10771 -53603 -66781 -12379 -29518 -47638 -43859 -35053 -28953 -70411
16064 -70411 -112484 -78365 -105510 -104625 -80801 -22826 34678 14189 48 -70131 -113041 -111184
16052 -111184 -52474 -16030 17596 13342 -37267 -7590 29186 21440 -14370 -6323 10179 33913
16040 33913 79579 74713 42627 -2228 6221 35336 35745 52672 79297 2289 -5354 -19559 -52817
16027 -52817 -65814 17613 58824 66793 74786 30603 -31959 -10620 46235 51759 95930 50087
16015 50087 -6277 -53292 -40367 -7830 -500 -14836 -65501 -51929 14728 36563 39329 28679
16003 28679 69264 19182 9166 30641 13233 -9292 -17005 -41028 -28932 -53628 -10020 29631
$$ packed form
16089E04L0040L4268k3666K1650L4605j5444p7512o296M3253N647k690m8795j2513
16076a6949k8490J342L3326m2832j3178N4402j7139j8120L779Q806O100m1458
16064g0411m2073L4119k7145Q85K3824N7975N7504k0489j4141p0179m2910J857
16052a11184N8710L6444L3626m254n0609K9677L6776p746l5810Q047J6502K3734
16040C3913M5666m866l2086m4855Q449K9115M09J6927K6625p7008p643j4205l3258
16027e2817j2997Q3427M1211P969P993m4183o2562K1339N6855N524M4171m5843
16015E0087n6364m7015J2925L2537P330j4336n0665J3572O6657K1835K766j0650
16003B8679M0585n0082j0016K1475j7408k2525p713k4023J2096k4696M3608L9651
$$ plain form
15991 29631 37720 21239 23137 46656 69272 31254 -19887 -7201 4882 -23673 11348 50700
15979 50700 47168 61958 73100 26969 -42115 -61447 -51052 -13356 -8992 -47712 -20870 1577
15967 1577 -40616 -98691 -102873 -86790 -105688 -125476 -109470 -45277 4852 36839 -9785 26854
15955 26854 34100 15221 -26732 -47358 -36559 -36521 -38112 -72233 -57476 -33460 -76299 -152510 -104793
15942 -104793 -53751 -47319 -18084 -73043 -76901 -98436 -77325 -2482 -1071 -50964 -38397 71506
15930 71506 105061 65129 -415 4808 25948 -1201 -22646 -21102 -36192 -24071 9189 59841
15918 59841 11249 -20609 -26517 -56311 -58600 -17128 39994 54414 -4249 -4218 -12084 -26540 -74369
15905 -74369 -109485 -89662 -110428 -138966 -111972 -78892 -69413 -78824 -86398 -108294 -57382 -68334
$$ packed form
15991B9631Q089j6481J898K3519K2616l8018n1141J2686J2083k8555L5021L9352
15979E0700l532J4790J1142m6131o9084j9332J0395L7696M364l8720K6842K2447
15967A577m2193n8075m182J6083j8898j9788J6006O4193N0129L1987m6624L6639
15955B6854P246j8879m1953k0626J0799L8j591l4121J4757K4016m2839p6211M7717
15942a04793N1042O432K9235n4959l858k1535K1111P4843J411m9893J2567J09903
15930G1506L3555l9932o5544N223K1140k7149k1445J544j5090J2121L3260N0652
15918E9841m8592l1858n908k9794k289M1472N7122J4420n8663L1p866j4456m7829
15905g4369l5116J9823k0766k8538K6994L3080R479r411p574k1896N0912j0952
$$ plain form
15893 -68334 -62668 -64871 -70294 -57037 5393 -19960 -75652 -121170 -139230 -88384 -86767 -86068 -74899
15880 -74899 -33271 -39801 -32644 -26839 -90618 -103897 -69199 -20611 416 -19549 -21555 -2825
15868 -2825 -14571 -44571 -68208 -118773 -135219 -116378 -39581 -22188 20465 62641 58589 41172
15856 41172 36286 -22475 -8396 23032 3479 11220 38631 -588 -9381 27091 -44145 -53944
15844 -53944 16088 57690 65122 43529 2281 -17336 -72652 -84513 -48904 -9987 21818 46861
15832 46861 21137 1260 -21592 -29286 1969 -33906 -17616 -53548 -59401 -4045 53207 31489
15820 31489 -37824 -40832 -51525 -70356 -40275 6707 53274 44171 14244 14423 15449 -3219 14439
15807 14439 40270 -32421 -54141 -8861 -2143 -1521 -74894 -93086 -47484 -88441 -133365 -112884
$$ packed form
15893f8334N666k203n423J3257O2430k5353n5692m5518j8060N0846J617O99J1169
15880g4899M1628o530P157N805o3779j3279L4698M8588K1027j9965k006J8730
15868b825j1746l0000k3637n0565j6446J8841P6797J7393M2653M2176m052j7417
15856D1172m886n8761J4079L1428j9553P741K7411l9219q793L6472p1236r799
15844e3944P0032M1602P432k1593m1248j9617n5316j1861L5609L8917L1805K5043
15832D6861k5724j9877k2852p694L1255l5875J6290l5932n853N5356N7252k1718
15820C1489o9313l008j0693j8831L0081M6982M6567r103k9927J79J026j8668J7658
15807A4439K5831p2691k1720M5280O718O22p3373j8192M5602m0957m4924K0481
$$ plain form
15795 -112884 -71782 -21348 -19146 -795 -33417 21602 -31015 -66372 -13439 56404 108859 114136
15783 114136 70538 6195 -45606 -24638 -8925 -42410 -70264 -58372 -54484 -77985 -89565 -101630
15771 -101630 -48075 -42737 -96400 -104034 -120139 -82893 32497 35309 13846 -8455 -11447 -17890
15759 -17890 -25220 -43547 -41186 -77560 -96062 -50000 1790 44550 45119 -24328 -13978 -21487 -34713
15746 -34713 -47000 -33882 -40247 -41136 -20685 -33920 -22446 -1865 51845 -7041 -48592 -5813
15734 -5813 16605 19228 -17069 -81440 -109461 -92236 -89993 -73927 -18844 -44073 -44918 -77789 -54756
15721 -54756 -88540 -84799 -79446 -125517 -143656 -90872 -70448 -77814 -96608 -116546 -123363 -85157
15709 -85157 -36659 -45413 -41431 -23723 738 28261 34924 53374 29159 -8465 -13574 -53708
$$ packed form
15795a12884M1102N0434K202J8351l2622N5019n2617l5357N2933O9843N2455N277
15783A14136m3598o4343n1801K0968J5713l3485k7854J1892L888k3501j1580j2065
15771a01630N3555N338n3663p634j6105L7246J15390K812k1463k2301k992o443
15759a7890p330j8327K361l6374j8502M6062N1790M2760N69o9447J0350p509j3226
15746c4713j2287J3118o365q89K0451j3235J1474K0581N3710n8886m1551M2779
15734e813K2418K623l6297o4371k8021J7225K243J6066N5083k5229q45l2871K3033
15721e4756l3784L741N353m6071j8139N2784K0424p366j8794j9938o817L8206
15709h5157M8498q754L982J7708K4461K7523O663J8450k4215l7624n109m0134
$$ plain form
15697 -53708 -92511 -56080 -9601 55259 108116 123247 15393 -114405 -101266 -30238 1795
15686 1795 13873 32637 80550 92673 13694 -33789 -61571 -46030 -71946 -57249 17224 38976
15674 38976 11684 35589 23861 -27005 -8944 -27262 -50889 -67630 -93624 -98631 -100734 -72511
15662 -72511 -8953 5543 16608 51391 89267 159067 138739 97012 17998 -21477 -65494 -54650
15650 -54650 14124 98699 119507 98512 106548 74208 40437 33414 -9374 -15612 33051 70858
15638 70858 70556 59090 74501 88747 68418 21805 35609 99397 122001 126371 118539 111136 49485
15625 49485 1970 40013 67744 99516 70388 49598 32712 57866 62183 91488 81683 107660
15613 107660 117435 50629 41825 62583 54917 28377 34837 14456 -7117 -69720 -55585 -3712
$$ packed form
15697e3708l8803L6431M6479O4860N2857J5131j07854j29798J3139P1028L2033
15686A795J2078J8764M7913J2123p8979m7483k7782J5541k5916J4697P4473K1752
15674C8976k7292K3905j1728n0866J8061j8318k3627j6741k5994n007k103K8223
15662g2511O3558J4496J1065L4783L7876O9800k0328m1727p9014l9475m4017J0844
15650e4650O8774Q4575K0808k0995Q036l2340l3771p023m2788o238M8663L7807
15638G0858l02j1466J5411J4246k0329m6613J3804O3788K2604M370p832p403o1651
15625D9485m7515L8043K7731L1772k9128k0790j6886K5154M317K9305r805K5977
15613A07660R775o6806q804K0758p666k6540O460k0381k1573o2603J4135N1873
$$ plain form
15601 -3712 6850 -8627 21329 20863 -23331 327 35387 69730 51572 18683 25031 14491
15589 14491 -16778 -70210 -90005 -9025 21569 -24429 -16151 13200 -36696 -65300 -69910 -80033
15577 -80033 -72023 -40796 -44877 -1476 -17784 -7985 2545 10480 52470 54762 -9940 -48598 7852
15564 7852 36211 18357 23682 18020 7794 -13938 -26925 -34745 -34527 -80958 -133696 -87058 -25641
15551 -25641 -36223 -62427 -42005 -23102 -6747 -22353 8244 -4401 -4327 -10346 -34356 -58839
15539 -58839 -21622 17571 -1210 5812 15137 36112 31011 -4698 -30599 -78779 -67508 -23490
15527 -23490 -29850 -72055 -117754 -137416 -166489 -137518 -107187 -67102 -36151 18694 44618 55581
15515 55581 100085 106143 61785 59253 29699 44594 6788 -23620 -5512 -23469 -15856 9819
$$ packed form
15601c712J0562j5477K9956m66m4194K3658L5060L4343j8158l2889O348j0540
15589A4491l1269n3432j9795Q0980L0594m5998Q278K9351m9896k8604m610j0123
15577h0033Q010L1227m081M3401j6308R799J0530P935M1990K292o4702l8658N6450
15564G852K8359j7854N325n662j0226k1732j2987p820K18m6431n2738M6638O1417
15551b5641j0582k6204K0422J8903J6355j5606L0597j2645P4o019k4010k4483
15539e8839L7217L9193j8781P022R325K0975n101l5709k5901m8180J1271M4018
15527b3490o360m2205m5699j9662k9073K8971L0331M0085L0951N4845K5924J0963
15515E5581M4504O058m4358k532k9554J4895l7806l0408J8108j7957P613K5675
$$ plain form
15503 9819 14841 -12585 -84929 -66347 -30463 -38557 -46119 -50106 3863 5353 2500 -17569 -53667
15490 -53667 -19165 -25258 18441 60049 21116 -11893 -7190 2127 -46391 -61349 -43258 -61762
15478 -61762 -37600 -10986 -4209 -21879 -26565 -59362 -54701 -65474 -51714 1733 -4255 3408 -6866
15465 -6866 -25175 -92226 -101853 -59660 -28163 21076 3628 20380 -22229 -61977 -79203 -66704
15453 -66704 -69410 -50311 -33973 -42956 -37899 -56995 -23337 -8954 -14023 -76657 -91187 -57193
15441 -57193 -50772 -55099 -18819 -34867 -28039 -8084 9603 23619 20218 -12283 -43480 -13192
15429 -13192 -41590 -58901 -48243 -6506 18484 41121 78137 105505 67347 24563 -18768 5619
15417 5619 42509 35355 -8293 45446 89046 116052 78709 35032 60362 25839 -8665 -44792
$$ packed form
15503I819N022k7426p2344J8582L5884q094p562l987N3969J490k853k0069l6098
15490e3667L4502o093M3699M1608l8933l3009M703R317m8518j4958J8091j8504
15478f1762K4162K6614O777j7670m686l2797M661j0773J3760N3447n988P663j0274
15465f866j8309o7051r627M2193L1497M9239j7448J6752m2609l9748j7226J2499
15453f6704k706J9099J6338q983N057j9096L3658J4383n069o2634j4530L3994
15441e7193O421m327L6280j6048O828J9955J7687J4016l401l2501l1197L0288
15429a3192k8398j7311J0658M1737K4990K2637L7016K7368l8158m2784m3331K4387
15417E619L6890p154m3648N3739M3600K7006l7343m3677K5330l4523l4504l6127
$$ plain form
15405 -44792 -55267 -24152 51621 87152 57642 11055 -55476 -42861 -8700 -7609 -88025 -129385
15393 -129385 -133213 -133638 -59202 -11678 -782 -9182 -27503 -13661 -7862 14907 33372 53541
15381 53541 30496 -9193 -10243 -35935 -26961 -17078 -42717 -3 18642 21063 5821 12037 28265
15368 28265 13514 -31241 -29285 97 -22745 -48374 -27292 -4243 26606 65447 90038 31619
15356 31619 -11272 -9367 29830 -42050 -72605 -20583 26324 66076 161215 200437 211037 285592
15344 285592 403664 468943 533444 542389 590960 610716 579776 493990 366238 255611 210330
15333 210330 170523 64156 25783 5576 -19563 18426 28566 -17263 34663 34768 -49693 -93573
15321 -93573 -72727 -64671 -60217 -77626 -83668 -79744 -7417 -9682 -50633 -48459 -76209 -142551 -162629
$$ packed form
15405d4792j0475L1115P5773L5531k9510m6587o6531J2615L4161J091q0416m1360
15393a29385l828m25P4436M7524J0896q400j8321J3842N799K2769J8465K0169
15381E3541k3045l9689j050k5692Q974R883k5639M2714J8645K421j5242O216J6228
15368B8265j4751m4755J956K9382k2842k5629K1082K3049L0849L8841K4591n8419
15356C1619m2891J905L9197p1880l0555N2022M6907L9752R5139L9222J0600P4555
15344B85592J18072O5279O4501Q945M8571J9756l0940q5786j27752j10627m5281
15333B10330l9807j06367l8373k0207k5139L7989J0140m5829N1926J05q4461m3880
15321i3573K0846Q056M454j7409o042L924P2327k265m0951K174k7750o6342k0078
$$ plain form
15308 -162629 -167484 -52311 23334 54166 36843 -45048 -124369 -103684 -122405 -46240 -11200
15297 -11200 -23080 -17891 -33098 -22374 -55065 -103269 -78120 -39714 -25706 47226 43449 63069
15285 63069 90490 64138 -9940 -104844 -150756 -96826 -51993 16909 29612 7247 26801 33616
15273 33616 24842 11882 -14055 -23144 13861 25595 13282 72373 176379 280922 349539 416662
15261 416662 575170 808947 1049314 1301841 1620707 1795997 1898437 1986061 1914648 1732289
15251 1732289 1512266 1238098 965016 721484 481539 362323 289976 205292 137563 90930
15241 90930 97472 41253 9755 49187 37351 75817 149154 151305 112564 70733 61496 98977
15229 98977 65062 -32761 -64637 14817 79452 15510 -4775 -26139 -39617 -57497 -26570 -12113
$$ packed form
15308a62629m855J15173P5645L0832j7323q1891p9321K0685j8721P6165L5040
15297a1200j1880N189j5207J0724l2691m8204K5149L8406J4008P2932l777J9620
15285F3069K7421k6352p4078r4904m5912N3930M4833O8902J2703k2365J9554O815
15273C3616q774j2960k5937r089L7005J1734j2313N9091J04006J04543O8617O7123
15261D16662J58508K33777K40367K52527L18866J75290J02440Q7624p1413j82359
15251A732289k20023k74168k73082k43532k39945j19216p2347q4684o7729m6633
15241I0930O542n6219l1498L9432j1836L8466P3337K151l8741m1831r237L7481
15229I8977l3915r7823l1876P9454O4635o3942k0285k1364j3478j7880L0927J4457
$$ plain form
15217 -12113 -3249 26741 -14358 -30674 -47701 -20986 33729 21441 23941 36720 -25518 -55910
15205 -55910 -34391 -25509 -67444 -117541 -68765 -52648 -66775 -106080 -130723 -135320 -95458 -58521
15193 -58521 -35800 -63969 -110104 -106760 4863 71626 -3627 -68813 -92455 -26288 69265 14807
15181 14807 -40554 -17559 4278 2215 3983 27690 26861 50782 42876 11669 12177 64332 -13048
15168 -13048 -63086 -41260 -24972 -32576 -64419 -47012 -76822 -117706 -76310 -58569 -77997 -86861
15156 -86861 -54455 -35394 -78810 -95994 -105296 -156436 -182354 -135092 -86292 -54723 -72497 -66637
15144 -66637 -75727 -75520 -31881 -19109 -6266 -38244 -16773 36794 9324 -6381 -10206 -119120
15132 -119120 -110006 -104688 -152960 -160630 -114910 -107948 -83007 -36283 -49510 -67497 -88735 -35053
$$ packed form
15217a2113Q864K9990m1099j6316j7027K6715N4715j2288K500J2779o2238l0392
15205e5910K1519Q882m1935n0097M8776J6117j4127l9305k4643m597L9862L6937
15193e8521K2721k8169m6135L344J11623O6763p5253o5186k3642O6167R5553n4458
15181A4807n5361K2995K1837k063J768K3707q29K3921p906l1207N08N2155p7380
15168a3048n0038K1826J6288p604l1843J7407k9810m0884M1396J7741j9428q864
15156h6861L2406J9061m3416j7184r302n1140k5918M7262M8800L1569j7774N860
15144f6637r090K07M3639J2772J2843l1978K1471N3567k7470j5705l825j08914
15132a19120R114N318m8272p670M5720O962K4941M6724j3227j7987k1238N3682
$$ plain form
15120 -35053 -39582 -73142 -57724 -49903 -2982 5286 -59169 -36408 -20598 21640 -1478 -5056
15108 -5056 6574 -11552 -3822 -31936 -24677 -64791 -76999 -47748 -42741 -34902 -55221 -24557 8181
15095 8181 -26939 -32827 -25074 9073 77470 95492 38475 8470 -11674 -3404 77859 31365
15083 31365 -17224 -13944 44073 12019 -26436 -63853 -30715 3012 37993 2767 -31679 -1429
15071 -1429 56509 39910 3637 -53577 -57983 -29338 -5990 18674 16025 -10686 12409 29653
15059 29653 36997 -4892 -41465 -35483 -75355 -135109 -169407 -174615 -161791 -144929 -126837 -32062
15047 -32062 -24819 -32281 -57265 -93048 -58250 -6421 35200 27608 21345 22818 32882 29890 4319
15034 4319 -26315 -73009 -76905 -88956 -137599 -182673 -159001 -44459 -83223 -69932 -104238 -125049
$$ packed form
15120c5053m529l3560J5418P821M6921Q268o4455K2761J5810M2238k3118l578
15108e056J1630j8126P730k8114P259m0114j2208K9251N007P839k0319L0664L2738
15095H181l5120n888P753L4147O8397J8022n7017l0005k0144Q270Q1263m6494
15083C1365m8589L280N8017l2054l8455l7417L3138L3727L4981l5226l4446L0250
15071a429N7938j6599l6273n7214m406K8645K3348K4664k649k6711K3095J7244
15059B9653P344m1889l6573N982l9872n9754l4298n208J2824J6862J8092R4775
15047c2062P243p462k4984l5783L4798N1829M1621p592o263J473J0064k992k5571
15034D319l0634m6694l896j2051m8643m5074K3672J14542l8764J3291l4306k0811
$$ plain form
15022 -125049 -57310 -44393 -99462 -117828 -61742 -27170 -29989 -46482 -34824 10230 5838 40690
15010 40690 55057 11753 -54769 -41058 -16026 -2916 32834 17811 -12104 -12628 -27990 -43261
14998 -43261 8074 -8065 -47791 -35582 -11125 -609 -23113 -4659 52992 6007 -39013 17201
14986 17201 55270 47903 9171 -28967 -66873 -94783 -30474 -55765 -60432 -48093 -74334 -84815
14974 -84815 -36427 7993 -5048 -28853 -29854 -11253 -39744 -18620 -27439 -28290 -27422 -71734 -66034
14961 -66034 -87215 -107055 -77973 -62784 6862 1538 14875 35666 11974 -66933 -108681 -62809
14949 -62809 -43807 -72553 -57661 -54310 -34543 36031 99160 65868 81350 78499 29751 18853
14937 18853 20830 35851 -27020 -8768 10655 39303 36958 4957 -136 -56231 -38092 -9348
$$ packed form
15022a25049O7739J2917n5069j8366N6086L4572k819j6493J1658M5054m392L4852
15010D0690J4367m3304o6522J3711K5032J3110L5750j5023k9915n24j5362j5271
14998d3261N1335j6139l9726J2209K4457J0516k2504J8454N7651m6985m5020N6214
14986A7201L8069p367l8732l8138l7906k7910O4309k5291m667J2339k6241j0481
14974h4815M8388M4420j3041k3805j001J8601k8491K1124q819q51Q68m4312N700
14961f6034k1181j9840K9082J5189O9646n324J3337K0791k3692p8907m1748M5872
14949f2809J9002k8746J4892L351J9767P0574O3129l3292J5482k851m8748j0898
14937A8853J977J5021o2871J8252J9423K8648k345l2001n093n6095J8139K8744
$$ plain form
14925 -9348 -9668 15183 78906 41053 9279 -52537 -28024 61978 112284 70419 53197 19208
14913 19208 -2596 -821 -52677 -32404 59510 87438 12813 -30529 -18629 -26761 -62669 -32968
14901 -32968 -61429 -95085 -76928 -21971 6704 -55804 -89771 -105008 -123269 -48618 -37367 -322
14889 -322 -34884 -111532 -100163 -123383 -91759 -63409 -14321 -28372 -47999 -42974 -21229 -15500
14877 -15500 -24756 -1474 19650 17638 -16731 -84825 -127486 -105303 -55526 -96658 -138551 -94891
14865 -94891 -44042 -16803 2200 -15670 -59498 -50423 -93606 -80554 -99059 -78250 -31399 16631
14853 16631 63892 50604 49325 8885 12088 -32276 -62329 -60172 -2729 2008 -25430 -46066
14841 -46066 -25963 20434 20251 29182 -14313 -38693 21069 6971 -14869 -21164 -56037 -62669 -25864
$$ packed form
14925i348l20K4851O3723l7853l1774o1816K4513R0002N0306m1865j7222l3989
14913A9208k1804J775n1856K0273R1914K7928p4625m3342J1900q132l5908K9701
14901c2968k8461l3656J8157N4957K8675o2508l3967j5237j8261P4651J1251L7045
14889c22l4562p6648J1369k3220L1624K8350M9088j4051j9627N025K1745N729
14877a5500r256K3282K1124k012l4369o8094m2661K2183M9777m1132m1893M3660
14865i4891N0849K7239J9003j7870m3828R075m3183J3052j8505K0809M6851M8030
14853A6631M7261j3288j279m0440L203m4364l0053K157N7443M737k7438k0636
14841d6066K0103M6397j83Q931m3495k4380N9762j4098k1840o295l4873o632L6805
$$ plain form
14828 -25864 17974 -15753 -39565 -60492 -40485 -34073 -33053 -63746 -113292 -115672 -79244 -72428
14816 -72428 -42656 -48893 -73193 -133194 -172540 -100535 -122322 -143252 -150076 -84683 -47348 -20923
14804 -20923 47844 27661 35406 42452 31005 57991 58130 21359 -15165 -10010 14213 46551 36854
14791 36854 11564 32711 40049 3440 32586 74909 75193 31178 7776 -43161 -97276 -138854
14779 -138854 -78630 -38738 -26360 -48585 -22206 -51739 -58075 -40202 -19150 -4290 -47985 -53697
14767 -53697 -38828 -62933 -118184 -146942 -138229 -121219 -68639 -16585 -14338 -23124 -56904 -16891
14755 -16891 20492 -28316 -33023 -18382 -13949 -1579 -37209 -43492 -45432 -74877 -92646 -98715 -98246
14742 -98246 -38038 -76821 -56716 -20388 -30706 -19258 21092 -10210 984 -2938 45823 54725
$$ packed form
14828b5864M3838l3727k3812k0927K0007O412J020l0693m9546k380L6428O816
14816g2428K9772o237k4300o0001l9346P2005k1787k0930o824O5393L7335K6425
14804b0923O8767k0183P745P046j1447K6986J39l6771l6524N155K4223L2338r697
14791C6854k5290K1147P338l6609K9146M2323K84m4015k3402n0937n4115m1578
14779a38854O0224L9892J2378k2225K6379k9533o336J7873K1052J4860m3695n712
14767e3697J4869k4105n5251k8758Q713J7010N2580N2054K247q786l3780M0013
14755a6891L7383m8808m707J4641M433J2370l5630o283j940k9445j7769o069M69
14742i8246O0208l8783K0105L6328j0318J1448M0350l1302J1194l922M8761Q902
$$ plain form
14730 54725 58700 15057 -45533 -30471 -36692 -84596 -109376 -42324 44229 62973 37537 10989
14718 10989 -822 -10710 12192 40028 84696 17236 -52805 -54711 19086 51936 60073 60200 61612
14705 61612 52720 47233 14253 -17261 -77267 -122703 -134407 -125877 -57903 48378 80642 39498
14693 39498 -52234 -61063 -52245 -43921 -29405 -5811 -33205 -44823 -47235 20824 -6551 -64351
14681 -64351 -97520 -23054 -19700 -90748 -59095 -3974 -26236 -39022 -45978 -79773 -86329 -84584
14669 -84584 -99027 -97599 -67824 -21530 -67618 -67122 -122606 -99293 -86513 -70770 -80392 -25899
14657 -25899 35250 35249 22818 -21459 -86264 -103498 -100363 -69085 -37386 3056 2613 -552 -4613
14644 -4613 -36222 -15282 -12685 -37298 -50488 -68081 -59403 -17527 -49035 -62318 -63126 -51264 -50514
$$ packed form
14730E4725L975m3643o0590J5062o221m7904k4780O7052Q6553J8744k5436k6548
14718A0989j1811r888K2902K7836M4668o7460p0041j906P3797L2850Q137J27J412
14705F1612q892n487l2980l1514o0006m5436j1704Q530O7974J06281L2264m1144
14693C9498r1732q829Q818Q324J4516K3594k7394j1618k412O8059k7375n7800
14681f4351l3169P4466L354p1048L1653N5121k2262j2786o956l3795o556J745
14669h4584j4443J428K9775M6294m6088M96n5484K3313J2780J5743r622N4493
14657b5899O1149jj2431m4277o4805j7234L135L1278L1699M0442m43l165m061
14644d613l1609K0940K597k4613j3190j7593Q678M1876l1508j3283q08J1862P50
$$ plain form
14631 -50514 -43078 -32876 -53675 -107002 -81998 -32599 19958 18378 41172 61746 87723 76937
14619 76937 72290 44105 12956 -15808 -19711 13827 -26095 -52592 -9837 29647 5340 -36626
14607 -36626 -43677 8478 -15963 -2793 12036 70114 48631 -6218 -420 27509 56033 40174
14595 40174 -68020 -62814 -15765 -24800 -59336 -88894 -54758 -85823 -44197 -38984 -97509 -56168
14583 -56168 7964 27983 -35210 -8969 7577 10547 20716 42625 22440 -6296 -16677 -37172
14571 -37172 -43402 -33016 -38919 -30081 -7403 42730 45218 64933 48544 44897 10665 -10569 9862
14558 9862 22577 14355 3027 -23073 -7016 -31078 -76394 -105215 -83616 -43852 -50069 -68935
14546 -68935 -51838 9148 -350 -1684 27734 45387 36790 7919 -60493 -80709 -45031 -11373
$$ packed form
14631e0514P436J0202k0799n3327K5004M9399N2557j580K2794K0574K5977j0786
14619G6937m647k8185l1149k8764l903L3538l9922k6497M2755L9484k4307m1966
14607c6626p051N2155k4441J3170J4829N8078k1483n4849N798K7929K8524j5859
14595D0174j08194N206M7049r035l4536k9558L4136l1065M1626N213n8525M1341
14583e6168O4132K0019o3193K6241J6546K970J0169K1909k0185k8736j0381k0495
14571c7172o230J0386n903Q838K2678N0133K488J9715j6389l647l4232k1234K0431
14558I862J2715q222j1328k6100J6057k4062m5316k8821K1599L9764o217j8866
14546f8935J7097O0986r498j334K9418J7653q597k8871o8412k0216L5678L3658
$$ plain form
14534 -11373 -29219 -63491 -55941 -42698 -18926 37523 36562 16621 18804 24653 104353 82226 -20887
14521 -20887 -6272 25818 19074 9293 -9996 -37452 -18638 -11446 -23609 20487 14849 -28464
14509 -28464 -30587 30432 47800 29568 13623 -3498 -766 983 -33423 6913 5232 -9137
14497 -9137 -22062 -37183 -10589 13371 -3931 -9661 -53271 -67902 -56865 -33052 -25777 -37547
14485 -37547 -51779 -57970 -95551 -137870 -91137 -40277 -36793 22059 76167 56244 -24518 5733
14473 5733 2814 41707 30544 -1559 -28930 -23409 -5002 7996 -692 7774 -68458 -92787 -33988
14460 -33988 -17735 -62496 -112480 -155608 -112805 -67501 -45311 -39347 -25621 -46955 -66537 -100618
14448 -100618 -68269 -26705 -48571 -30058 26759 932 26299 26159 -16433 -57440 -45543 -11020
$$ packed form
14534a1373j7846l4272P550J3243K3772N6449r61j9941K183N849P9700k2127j03113
14521b0887J4615L2090o744r781j9289k7456J8814P192j2163M4096n638m3313
14509b8464k123O1019J7368j8232j5945j7121K732J749l4406M0336j681j4369
14497i137j2925j5121K6594K3960j7302n730m3610j4631J1037K3813P275j1770
14485c7547j4232o191l7581m2319M6733N0860L484N8852N4108j9923q0762L0251
14473E733k919L8893j1163l2103k7371N521J8407J2998q688Q466p6232k4329N8799
14460c3988J6253m4761m9984m3128M2803M5304K2190N964J3726k1334j9582l4081
14448a00618L2349M1564k1866J8513N6817k5827K5367j40m2592m1007J1897L4523
$$ plain form
14436 -11020 -14270 -71023 -81728 -58134 -16014 60247 74566 18465 -19558 -14612 9594 -17932
14424 -17932 -104477 -91043 -90363 -53072 -40807 -21847 -1811 -15773 -39569 -1999 -17374 -71283
14412 -71283 -71000 -91852 -77569 -58906 -83917 -71908 -83625 -119747 -83460 -65489 -39092 -38374
14400 -38374 -66741 -33001 -10511 -40964 -50203 -56171 -43147 -40158 -13888 -42976 -38968 -49660
14388 -49660 -5219 27142 35458 41219 22125 46136 14806 40032 50565 -14056 -39359 3593
14376 3593 -27681 -52157 44329 78604 62843 22968 -69637 -88370 -70920 -83520 -72034 -40717
14364 -40717 -21263 -3859 -51346 -52334 15044 -3910 18343 617 -16907 26960 16795 -45823
14352 -45823 -61074 10664 60665 41799 61533 34602 1547 -31843 -41711 -60632 -60328 -101513
$$ packed form
14436a1020l250n6753j0705K3594M2120P6261J4319n6101l8023M946K4206k7526
14424a7932q6545J3434O80L7291J2265J8960K0036j3962k3796L7570j5375n3909
14412g1283K83k0852J4283J8663k5011J2009j1717l6122L6287J7971K6397P18
14400c8374k8367L3740K2490l0453r239n968J3024K989K6270k9088M008j0692
14388d9660M4441L2361Q316N761j9094K4011l1330K5226J0533o4621k5303M2952
14376C593l1274k4476R6486L4275j5761l9875r2605j8733J7450j2600J1486L1317
14364d0717J9454J7404m7487r88O7378j8954K2253j7726j7524M3867j0165o2618
14352d5823j5251P1738N0001j8866J9734k6931l3055l3390r868j8921L04m1185
$$ plain form
14340 -101513 -91825 -62410 -51441 -84381 -27537 -5444 11742 -13571 -61516 -90680 -114883 -67529
14328 -67529 -54430 -74834 -26060 5909 -65109 -126952 -100424 -69581 -70977 -64872 -19587 41388
14316 41388 42842 14017 -12394 -23087 -39120 -66232 -31890 -12751 9436 8255 -20912 -10986
14304 -10986 836 -69218 -109628 -105746 -61425 -49699 -76397 -140598 -146587 -98707 -100004 -110138
14292 -110138 -85976 6602 -9715 -71947 -44570 -25351 1510 -51920 -95587 -61442 -68209 -87962
14280 -87962 -113133 -80928 -9716 36625 639 -76698 -142297 -134218 -163557 -128935 -65176 -7890
14268 -7890 16983 -2661 -14667 -41857 7080 51044 6184 -28331 -52598 -53906 -91071 -36912
14256 -36912 -5713 -9361 -23029 -30925 -42777 -43051 -37918 -36543 -60525 -97999 -90467 -85448 -82574
$$ packed form
14340a01513R688K9415J0969l2940N6844K2093J7186k5313m7945k9164k4203M7354
14328f7529J3099k0404M8774L1969p1018o1843K6528L0843j396O105M5285O0975
14316D1388J454k8825k6411j0693j6033k7112L4342J9139K2187j181k9167R926
14304a0986J1822p0054m0410L882M4321J1726k6698o4201n989M7880j297j0134
14292a10138K4162R2578j6317o2232K7377J9219K6861n3430m3667L4145o767j9753
14280h7962k5171L2205P1212M6341l5986p7337o5599Q079k9339L4622O3759N7286
14268g890K4873j9644j2006k7190M8937M3964m4860l4515k4267j308l7165N4159
14256c6912L1199l648j3668p896j1852k74N133J375k3982l7474P532N019K874
$$ plain form
14243 -82574 -79326 -67050 -65948 -72676 -43468 7760 11112 -314 6632 -40596 -55301 -76904 -3383
14230 -3383 36595 14925 -58404 -133315 -118263 -126118 -140598 -125856 -113237 -104696 -70442 -13217
14218 -13217 34474 10358 58179 70577 62115 64511 46018 -35146 -23722 -6136 -2457 16746
14206 16746 9761 -27303 -27846 41361 49063 -13516 -4332 12830 -24620 -20716 13245 -11259 66363
14193 66363 68868 63418 70822 37947 -10787 19855 2399 -67751 -85120 -71445 -55517 -68153
14181 -68153 -46430 -49285 -37222 -22850 -65429 -44481 -68049 -64057 -42676 -2113 -21925 -25298
14169 -25298 -4170 -11026 -88505 -71612 -18163 18298 -15246 -49317 -34105 -20972 -37442 -65511
14157 -65511 -110840 -141697 -157926 -140692 -89982 -55521 14627 -20848 -26178 6290 27735 -2465
$$ packed form
14243h2574L248J2276J102o728K9208N1228L352j1426O946m7228j4705k1603P3521
14230c383L9978k1670p3329p4911J5052p855j4480J4742J2619Q541L4254N7225
14218a3217M7691k4116M7821J2398q462K396j8493q1164J1424J7586L679J9203
14206A6746o985l7064n43O9207P702o2579R184J7162l7450L904L3961k4504P7622
14193F6363K505n450P404l2875m8734L0642j7456p0150j7369J3675J5928j2636
14181f8153K1723k855J2063J4372m2579K0948k3568L992K1381M0563j9812l373
14169b5298K1128o856p7479J6893N3449L6461l3544l4071J5212J3133j6470k8069
14157f5511m5329l0857j6229J7234N0710L4461P0148l5475n330L2468K1445l0200
$$ plain form
14145 -2465 -61791 -117149 -151862 -149454 -108209 -41267 -11003 -24708 -77996 -45564 -82551 -71401
14133 -71401 -89650 -109882 -67216 -25645 -11713 -27843 -16364 -41342 -28749 -21683 -40665 -48496
14121 -48496 -29985 36259 58430 42990 25772 13470 19220 -9519 -46463 -35193 -56441 -50897
14109 -50897 -48084 -75174 -43995 -16685 31177 -15342 -12891 -18888 -48204 -86530 -110419 -114412
14097 -114412 -81036 -57247 -44808 2625 -19478 -41121 -32108 1387 29467 1750 10290 -10291
14085 -10291 -47935 -22806 46132 112907 223502 280836 277679 269869 245730 188599 126609 126000
14073 126000 61132 59329 84938 32899 7154 1809 24857 50541 73863 37813 64001 39971
14061 39971 14547 -24467 -67738 -32005 67233 137597 98820 76963 59083 85667 65902 108869
$$ packed form
14145b465n9326n5358l4713K408M1245O6942L0264j3705n3288L2432l6987J1150
14133g1401j8249k0232M2666M1571J3932j6130J1479k4978J2593P066j8982p831
14121d8496J8511O6244K2171j5440j7218j2302N750k8739l6944J1270k1248N544
14109e0897K813k7090L1179K7310M7862m6519K451n997k9316l8326k3889l993
14097a14412L3376K3789J2439M7433k2103k1643R013L3495K8080k7717Q540k0581
14085a0291l7644K5129O8938O6775J10595N7334l157p810k4139n7131o1990o09
14073A26000o4868j803K5609n2039k5745n345K3048K5684K3322l6050K6188k4030
14061C9971k5424l9014m3271L5733R9238P0364l8777k1857j7880K6584j9765M2967
$$ plain form
14049 108869 151977 137179 154389 293976 431424 454474 522678 633357 705536 782738 789513
14038 789513 747562 682591 635461 578130 424024 258921 142290 79601 43309 49111 95367
14027 95367 44602 -26329 -53304 -4927 -858 -5600 31346 -23249 -43546 -86945 -78913 -57252
14015 -57252 -48299 -28218 -45704 -57880 -70306 -53234 -63069 -27966 -8039 -3327 31714 46829
14003 46829 16947 -3449 -22828 -42478 -70756 -115705 -109375 -81877 -30043 46169 16115 2255
13991 2255 1920 37842 42854 -27188 -32404 -39407 -78723 -93691 -134620 -163522 -128620 -66128 -28417
13978 -28417 -21388 -14562 -12515 -38215 -85563 -70865 -36756 -32409 -61274 -73186 -106126 -67566
13966 -67566 -55455 -40592 -87266 -80517 -60962 -81610 -44274 -112508 -121779 -40422 -40691 26083
$$ packed form
14049A08869M3108j4798J7210J39587J37448K3050O8204J10679P2179P7202O775
14038G89513m1951o4971m7130n7331j54106j65103j16631o2689l6292N802M6256
14027I5367n0765p0931k6975M8377M069m742L6946n4595k0297m3399Q032K1661
14015e7252Q953K0081j7486j2176j2426J7072r835L5103J9927M712L5041J5115
14003D6829k9882k0396j9379j9650k8278m4949O330K7498N1834P6212l0054j3860
13991B255l35L5922N012p0042n216p003l9316j4968m0929k8902L4902O2492L7711
13978b8417P029O826K047k5700m7348J4698L4109M347k8865j1912l2940L8560
13966f7566J2111J4863m6674O749J9555k0648L7336o8234r271Q1357k69O6774
$$ plain form
13954 26083 74251 87794 62452 31932 38234 7336 36515 55308 38658 77078 128123 80655
13942 80655 -2717 8756 32848 7190 -30931 -27582 15623 98219 152782 136598 41381 4396
13930 4396 11220 50869 84466 66791 38824 54963 -34229 -122646 -20947 76889 98507 34473
13918 34473 -35279 -40056 60248 93447 82579 33320 32924 83274 81656 58602 33090 38530
13906 38530 -19298 -35408 3194 62017 89376 86676 104603 102940 118206 90854 91576 52999
13894 52999 15725 17808 -33298 -45768 -45145 -73475 -64403 -24287 16074 -1774 16010 59159
13882 59159 69137 31837 31768 61494 83670 43797 -18579 -75230 -78639 -27582 45527 29100 26283
13869 26283 41366 61406 39041 66810 80156 49487 42469 49083 -3858 26371 8893 -20207
$$ packed form
13954B6083M8168J3543k5342l0520O302l0898K9179J8793j6650L8420N1045m7468
13942H0655q3372J1473K4092k5658l8121L349M3205Q2596N4563j6184r5217l6985
13930D396O824L9649L3597j7675k7967J6139q9192q8417J01699R7836K1618o4034
13918C4473o9752m777J00304L3199j0868m9259l96N0350j618k3054k5512N440
13906C8530n7828j6110L8602N8823K7359k700J7927j663J5266k7352P22l8577
13894E2999l7274K083n1106j2470O23k8330R072M0116M0361j7848J7784M3149
13882E9159R978l7300o9K9726K2176l9873o2376n6651l409N1057P3109j6427k817
13869B6283J5083K0040k2365K7769J3346l0669p018O614n2941L0229j7478k9100
$$ plain form
13857 -20207 -7892 -8310 -197 -15447 -33884 -43309 -31903 -36749 2620 -18362 -46596 -25233 -10629
13844 -10629 -50388 -124815 -140563 -79743 -85246 -32303 28853 62238 74731 69676 85955 79172
13832 79172 113505 146135 131344 117351 89536 32613 21303 46082 27979 32657 16844 70223
13820 70223 91298 106393 80412 20842 -44065 -57062 2917 5390 -28876 -36199 -83613 -102629
13808 -102629 -82126 -33237 -57717 -87720 -87456 -59796 -42124 -15624 23198 86396 55645 17868
13796 17868 -31122 -57987 -67444 -76772 -52584 -52156 -104417 -103431 -107823 -89079 -98311 -52114 -54970
13783 -54970 -57276 -38912 -22093 -16460 -23605 -68266 -91787 -121494 -135651 -97535 -26338 10984
13771 10984 10783 -5158 -65 -4521 -82659 -94780 -107501 -102374 -76226 -35528 -11700 1995 -21913
$$ packed form
13857b0207J2315m18Q113j5250j8437r425J1406m846L9369k0982k8234K1363J4604
13844a0629l9759p4427j5748O0820n503N2943O1156L3385J2493n055J6279o783
13832G9172L4333L2630j4791j3993k7815n6923j1310K4779j8103M678j5813N3379
13820G0223K1075J5095k5981n9570o4907j2997N9979K473l4266p323m7414j9016
13808a02629K0503M8889k4480l0003K64K7660J7672K6500L8822O3198l0751l7777
13796A7868m8990k6865r457r328K4188M28n2261R86m392J8744r232M6197k856
13783e4970k306J8364J6819N633p145m4661k3521k9707j4157L8116P1197L7322
13771A0984k01j5941N093m456p8138j2121j2721N127K6148M0698K3828J3695k3908
$$ plain form
13758 -21913 -87763 -104761 -65264 -32753 -48328 -31488 -40925 -66564 -96240 -100034 -127567 -122546
13746 -122546 -45805 40855 75414 120619 179698 179753 149434 125656 82992 64822 20804 17452
13734 17452 69192 80951 117292 154044 205060 203278 133142 75220 104700 114792 171144 150243
13722 150243 129213 62049 -3896 983 22699 26096 22021 34710 42774 51687 52489 35308 25434
13709 25434 86871 83474 72406 86047 82853 77126 95531 111574 118060 136251 142124 155965 108381
13696 108381 84809 98411 115968 78638 46277 16201 2992 -1419 -5062 -11213 14060 2237
13684 2237 -2155 -29070 -24154 -20939 -46115 -61524 -4643 12410 29624 31978 38268 36087 38829
13671 38829 61674 78054 64570 59741 60041 34863 60003 32327 73011 107684 112443 64668
$$ packed form
13758b1913o5850j6998L9497L2511j5575J6840r437k5639k9676l794k7533N021
13746a22546P6741Q6660L4559M5205N9079N5l0319k3778m2664j8170m4018l352
13734A7452N1740J1759L6341L6752N1016j782p0136n7922K9480J0092N6352k0901
13722A50243k1030o7164o5945M879K1716L397m075J2689Q064Q913Q02j7181r874
13709B5434O1437l397j1068J3641l194n727J8405J6043O486J8191N873J3841m7584
13696A08381k3572J3602J7557l7330l2361l0076j3209m411l643o151K5273j1823
13684B237m392k6915M916L215k5176j5409N6881J7053J7214K354O290k181K742
13671C8829K2845J6380j3484m829L00k5178K5140k7676M0684L4673M759m7775
$$ plain form
13659 64668 33780 30625 11086 7328 112076 191967 195796 177246 206859 267896 301564 281163
13647 281163 301642 345862 374967 410873 491697 553827 621217 690213 669949 684682 673597
13636 673597 657228 689697 698512 711851 720640 690261 736392 768471 731072 662091 653129 597343
13624 597343 561296 497036 447293 373358 260238 197129 163754 151052 193441 272052 209778
13613 209778 182783 142142 79039 64098 110021 120172 114531 109182 80021 26511 20307 22149
13601 22149 -8240 -24840 34425 57007 -8081 -41196 -20272 -7191 -4899 -34268 -13737 3337
13589 3337 12221 -9047 -1283 22794 9324 11795 -13869 -84450 -82429 -66489 -57853 -21630 -33987
13576 -33987 -31000 -69258 -36983 21247 35071 60949 62630 -411 -20521 4931 -10880 31035
$$ packed form
13659F4668l0888l155j9539l758J04748P9891L829j8550K9613O1037L3668k0401
13647B81163K0479M4220K9105L5906Q0824O2130O7390O8996k0264J4733j1085
13636F73597j6369L2469Q815J3339Q789l0379M6131L2079l7399o8981q962n5786
13624E97343l6047o4260m9743p3935j13120o3109l3375j2702M2389P8611o2274
13613B09778k6995m0641o3103j4941M5923J0151n641n349k9161n3510o204J842
13601B2149l0389j6600N9265K2582o5088l3115K0924J3081K292k9369K0531J7074
13589C337Q884k1268P764K4077j3470K471k5664p0581K021J5940Q636L6223j2357
13576c3987K987l8258L2275N8230J3824K5878J681o3041k0110K5452j5811M1915
$$ plain form
13564 31035 44885 87037 26987 -36775 -28503 -31302 -47576 -67576 -56179 -4752 -13798 -32293
13552 -32293 -3491 -5209 -29368 -10168 86270 98973 97204 67550 89909 86362 27412 26574 21585
13539 21585 37858 -4795 -2368 54348 42698 15276 40846 80076 53805 24944 18477 -9088
13527 -9088 -3006 -25149 -2556 -37080 3447 47696 15079 10327 87862 113509 93576 120385
13515 120385 85650 7663 -5320 -12680 -15667 -6140 26475 48180 79239 56909 19655 34116
13503 34116 42507 25951 8853 1702 42864 19443 87320 45499 6385 -59575 -83471 -27089
13491 -27089 -4162 62443 98248 87651 34737 13653 21682 24582 -16525 -62903 -3975 49367
13479 49367 86683 110994 116103 148408 155647 108757 37122 38009 31828 79819 176449 203541 184974
$$ packed form
13564C1035J3850M2152o0050o3762Q272k799j6274k0000J1397N1427r046j8495
13552c2293K8802j718k4159J9200R6438J2703j769k9654K2359l547n8950q38m989
13539B1585J6273m2653K427N6716j1650k7422K5570L9230k6271k8861o467k7565
13527i088O082k2143K2593l4524M0527M4249l2617m752P7535K5647j9933K6809
13515A20385l4735p7987j2983p360k987R527L2615K1705L1059k2330l7254J4461
13503C4116Q391j6556j7098p151M1162k3421O7877m1821l9114o5960k3896N6382
13491b7089K2927O6605L5805j0597n2914k1084Q029K900m1107m6378N8928N3342
13479D9367L7316K4311N109L2305P239m6890p1635Q87o181M7991R6630K7092j8567
$$ plain form
13466 184974 184555 200923 199131 182371 171665 197505 197348 269675 412370 619175 831611 1020466
13454 1020466 1020277 885834 628620 495422 407220 312702 204693 117914 119810 126815 116460
13443 116460 228174 191289 135867 125396 145895 79395 51421 59078 54450 58415 42281 72053
13431 72053 97671 118794 165347 239184 322317 427270 530519 625487 633482 500319 357091
13420 357091 327472 402599 466028 641517 909432 1243543 1668961 2021531 2162696 1996176
13410 1996176 1613925 1158552 806386 587010 417901 316770 213920 193601 162501 167487
13400 167487 158910 87364 53736 43132 21203 33694 41024 98254 111912 50190 22061 55952
13388 55952 86923 87320 77873 107912 167855 205718 245487 275448 270138 326917 301717 244508
$$ packed form
13466A84974m19J6368j792j6760j0706K5840j57P2327J42695K06805K12436J88855
13454A020466j89j34443k57214j33198q8202r4518j08009q6779J896P005j0355
13443A16460J11714l6885n5422j0471K0499o6500k7974P657m628L965j6134K9772
13431G2053K5618K1123M6553P3837Q3133J04953J03249R4968P995j33163j43228
13420C57091k9619P5127O3429J75489K67915L34111M25418L52570J41165j66520
13410A996176l82251m55373l52166k19376j69109j01131j02850k0319l1100M986
13400A67487q577p1546l3628j0604k1929J2491P330N7230J3658o1722k8129L3891
13388E5952L0971L97r447L0039N9943L7863L9769K9961n310N6779k5200n7209
$$ plain form
13376 244508 269172 304414 418899 566922 791501 1022450 1069089 1012500 889925 704191
13366 704191 473261 314816 186049 133202 84948 64063 62479 99461 93782 37885 6164
13355 6164 -6904 -45600 -77058 -110709 -44210 42007 72345 86333 77062 56823 28356 53793
13343 53793 82137 93121 65061 61392 33575 5602 14460 29709 61586 55270 76597 64280
13331 64280 64802 100546 51737 -9204 2751 39072 -19544 -20883 -6847 7900 23629 -10663
13319 -10663 -4870 19054 -5756 -3271 1951 -38606 -37456 -6577 13484 25776 -8569 -33121
13307 -33121 -16441 -66001 -115446 -138170 -139834 -101983 -68645 3822 59362 80272 86043 53361
13295 53361 87777 83893 7811 -40278 -37854 -44105 -16578 -13570 -19459 2160 40336 -29227 -24988
$$ packed form
13376B44508K4664L5242J14485J48023K24579K30949M6639n6589j22575j85734
13366G04191k30930j58445j28767n2847m8254k0885j584L6982n679n5897l1721
13355F164j3068l8696l1458l3651O6499Q6217L0338J3988r271k0239k8467K5437
13343E3793K8344J0984k8060l669k7817k7973Q858J5249L1877o316K1327j2317
13331F4280N22L5744m8809o0941J1955L6321n8616j339J4036J4747J5729l4292
13319a0663N793K3924k4810K485N222m0557J150L0879K0061J2292l4345k4552
13307c3121J6680m9560m9445k2724j664L7851L3338P2467N5540K0910N771l2682
13295E3361L4416l884p6082m8089K424o251K7527L008n889K1619L8176o9563M239
$$ plain form
13282 -24988 45266 15994 -38566 -21419 34555 85267 78020 115391 56450 -30868 -1098 58797
13270 58797 42081 26622 57981 104510 114567 91485 48961 50819 66228 82005 93899 110080
13258 110080 83620 83725 87240 50381 -5237 -27417 9039 15001 -40425 -1499 62047 70572
13246 70572 75376 47454 38174 46600 49020 25830 39558 55510 32197 17859 3679 -12139
13234 -12139 -76721 -86290 -32943 35645 15968 38229 92659 181765 195495 164082 130098 125965
13222 125965 176785 212483 331990 531785 765825 1046412 1358141 1725011 1984120 2211571
13212 2211571 2427215 2492735 2355094 2123507 1881432 1642614 1351160 1017573 647668 459642
13202 459642 339321 326826 289728 249842 237623 180917 135690 125699 140305 144878 152539 103378
$$ packed form
13282b4988P0254k9272n4560J7147N5974N0712p247L7371n8941q7318K9770N9895
13270E8797j6716j5459L1359M6529J0057k3082m2524J858J5409J5777J1894J6181
13258A10080k6460J05L515l6859n5618k2180L6456N962n5426L8926O3546Q525
13246G0572M804k7922r280Q426K420k3190J3728J5952k3313j4338j4180j5818
13234a2139o4582r569N3347O8588j9677K2261N4430Q9106J3730l1413l3984m133
13222A25965N0820L5698J19507J99795K34040K80587L11729L66870K59109K27451
13212B211571K15644O5520j37641k31587k42075k38818k91454l33587l69905j88026
13202D59642j20321j2495l7098l9886j2219n6706m5227r991J4606M573P661m9161
$$ plain form
13190 103378 93902 114587 111336 121883 124237 132022 161707 117790 71904 38912 27976 85639
13178 85639 122342 104797 132859 153611 161415 130007 99752 81700 56513 39457 -35190 -74962
13166 -74962 -36108 -6620 36011 -5266 -18339 42576 95552 79442 42487 4429 2971 -30590
13154 -30590 -38522 -18570 62588 105328 59420 70725 25681 16918 61838 56440 46399 1597
13142 1597 -32526 24422 23340 42236 86996 134438 144929 55834 -8183 1316 40964 55548
13130 55548 38942 15406 28042 77257 78230 85168 60351 55692 39578 40599 71572 46872 62106
13117 62106 138238 153585 106294 63668 83603 146954 158620 133201 119324 119278 112647 117681 169422
13104 169422 195749 230935 309290 388575 380138 305000 204833 171399 186933 206564 286751
$$ packed form
13190A03378r476K0685l251J0547K354P785K9685m3917m5886l2992j0936N7663
13178H5639L6703j7545K8062K0752P804l1408l0255j8052k5187j7056p4647l9772
13166g4962L8854K9488M2631m1277j3073O0915N2976j6110l6955l8058j458l3561
13154c0590p932J9952Q1158M2740m5908J1305m5044q763M4920n398j0041m4802
13142A597l4123N6948j082J8896M4760M7442J0491q9095o4017R499L9648J4584
13130E5548j6606k3536J2636M9215R73O938k4817m659j6114J021L0973k4700J5234
13117F2106P6132J5347m7291m2626J9935O3351J1666k5419j3877m6o631N034N1741
13104A69422K6327L5186P8355P9285q437p5138j00167l3434J5534J9631Q0187
$$ plain form
13093 286751 473575 701782 867226 1182819 1756401 2269332 2487055 2118474 1433231 902521
13083 902521 617813 460602 455500 390605 295217 235789 226115 228512 196165 187200 244732 305854
13071 305854 244988 174350 124663 95466 96968 112588 164563 182067 172562 185915 216647 263127
13059 263127 302034 460188 546203 485583 447040 410046 385583 451785 548900 690656 894113
13048 894113 1237837 1783955 2392721 2818382 2715203 2085477 1476785 1069959 822638 643193
13038 643193 531803 442983 399442 378960 396472 375021 365736 341019 313927 311771 233756 122150
13026 122150 92041 73295 61935 60297 66239 99564 103866 78432 29330 -9632 22103 32069
13014 32069 659 -1629 -6292 -17595 -3331 79374 132444 97852 64650 29294 26429 20218
$$ packed form
13093B86751J86824K28207J65444L15593N73582N12931K17723l68581o85243n30710
13083I02521k84708j57211n102o4895r5388n9428r674K397l2347q965N7532O1122
13071C05854o0866p0638m9687k9197J502J5620N1975J7504r505J3353L0732M6480
13059B63127L8907J58154Q6015o0620l8543l6994k4463O6202R7115J41756K03457
13048H94113L43724N46118O08766M25661j03179o29726o08692m06826k47321j79445
13038F43193j11390q8820m3541k0482J7512k1451r285k4717k7092k156p8015j11606
13026A22150l0109j8746j1360j638N942L3325M302k5434m9102l8962L1735R966
13014C2069l1410k288m663j1303J4264Q2705N3070l4592l3202l5356k865o211
$$ plain form
13002 20218 6897 4754 25914 19631 66548 142650 170630 193999 169126 158630 186137 195973
12990 195973 95929 66860 48032 64599 92960 109109 156036 214547 269279 263487 247214
12979 247214 215549 256581 268655 216794 171695 164039 100678 105081 61624 51578 104975 99612
12967 99612 98344 102749 106710 129702 119543 146855 162478 139077 149742 166470 175341 121319
12955 121319 107950 150202 116659 96832 156836 146575 157324 154741 130706 115984 96932 53087
12943 53087 43764 22777 81629 127546 164193 147378 144024 127636 129085 131864 178706 197013
12931 197013 172890 219872 235020 239134 175344 186812 214506 259434 363562 378923 339171
12920 339171 362681 354486 389666 364869 424752 512371 533417 466694 420852 390195 366266 357329
$$ packed form
13002B0218j3321k143K1160o283M6917P6102K7980K3369k4873j0496K7507R836
12990A95973j00044k9069j8828J6567K8361J6149M6927N8511N4732n792j6273
12979B47214l1665M1032J2074n1861m5099p656o3361M403m3457j0046N3397n363
12967I9612j268M405L961K2992j0159K7312J5623k3401J0665J6728Q871n4022
12955A21319j3369M2252l3543j9827O0004j0261J0749k583k4035j4722j9052m3845
12943E3087r323k0987N8852M5917L6647j6815l354j6388J449K779M6842J8307
12931A97013k4123M6982J5148M114o3790J1468K7694M4928J04128J5361l9752
12920C39171K3510q195L5180k4797N9883Q7619K1046o6723m5842l0657k3929q937
$$ plain form
12908 357329 354114 339983 395941 490269 524661 448793 389391 401867 378997 374338 394310 334713
12896 334713 302599 334530 348898 385586 425041 430898 460242 512975 504719 461549 462420 470547
12884 470547 503061 490948 453173 464417 479866 483341 505713 504578 498913 538950 622436 623284
12872 623284 660662 706568 684890 720849 728313 731027 763117 807475 906605 987019 1028457 1077990
12860 1077990 1197860 1414173 1730683 1906948 1751101 1464777 1276095 1178213 1155210 1098882
12850 1098882 1060126 1106969 1172278 1160365 1151525 1196169 1257951 1344711 1400406 1454765 1510742
12839 1510742 1620667 1725134 1774720 1842756 1956009 1978843 1988687 2021290 2174722 2308027
12829 2308027 2361217 2477170 2569531 2676771 2805188 2993749 3191290 3354544 3486362 3649087
$$ packed form
12908C57329l215j4131N5958R4328L4392p5868n9402J2476k2870m659J9972n9597
12896C34713l2114L1931J4368L6688L9455N857K9344N2733q256m3170Q71Q127
12884D70547L2514j2113l7775J1244J5449L475K2372j135n665M0037Q3486Q48
12872F23284L7378M5906k1678L5959P464K714L2090M4358R9130Q0414M1438M9533
12860A077990J19870K16313L16510J76265j55847k86324j88682r7882k3003n6328
12850A098882l8756M6843O5309j1913q840M4644O1782Q6760N5695N4359N5977
12839A510742J09925J04467M9586O8036J13253K2834R844L2603J53432J33305
12829B308027N3190J15953R2361J07240J28417J88561J97541J63254J31818J62725
$$ plain form
12819 3649087 3865616 4099219 4292822 4533806 4827883 5169919 5570568 6035216 6638808
12810 6638808 7379613 8292291 9517207 11088205 13018619 15215209 17614519 20219764
12802 20219764 23134609 26290679 29671629 33567007 38649323 45663840 55798156 70990343
12794 70990343 94232684 129466749 180594168 245646762 312375123 370680474 422371467
12787 422371467 466341413 485093208 466200863 421959047 371726314 318768140 258042167
12780 258042167 193989498 139515760 101609065 77618904 62050241 51572649 44240834
12773 44240834 38688277 34451097 31047150 28057493 25364874 23104345 21413559 20046696
12765 20046696 18818105 17796006 17182696 16817745 16486584 15804589 14970670 13806359 12397468
$$ packed form
12819C649087K16529K33603J93603K40984K94077L42036M00649M64648O03592
12810F638808P40805R12678J224916J570998J930414K196590K399310K605245
12802B0219764K914845L156070L380950L895378N082316P014517J0134316J5192187
12794G0990343K3242341L5234065N1127419O5052594O6728361N8305351N1690993
12787D22371467M3969946J8751795j8892345m4241816n0232733n2958174o0725973
12780B58042167o4052669n4473738l7906695k3990161j5568663j0477592p331815
12773D4240834n552557m237180l403947k989657k692619k260529j690786j366863
12765B0046696j228591j022099o13310l64951l31161o81995q33919j164311j408891
$$ plain form
12756 12397468 11071558 9863425 8625881 7366190 6311770 5493996 4940071 4473495
12748 4473495 4187952 3946162 3686738 3435475 3215487 2947291 2766902 2614697 2465262
12739 2465262 2389879 2263858 2132199 2049996 1981377 1891833 1819518 1729783 1575733 1488490 1482346
12728 1482346 1426081 1446308 1406583 1349718 1350884 1277490 1179452 1134364 1121445 1128749 1075556 1049614
12716 1049614 1075069 1123617 1118747 1091040 1048350 1040750 1034024 1004575 997751 925354 841626 784934
12704 784934 735509 766903 769344 700997 706619 769133 784557 709564 729850 772230 764197 739586
12692 739586 657207 645121 625231 596148 588041 584451 578702 591543 633671 668509 669669 651344
12680 651344 648522 612850 566725 569054 570784 591600 556168 498175 481667 495933 484925 489661
$$ packed form
12756A2397468j325910j208133j237544j259691j054420q17774n53925m66576
12748D473495k85543k41790k59424k51263k19988k68196j80389j52205j49435
12739B465262p5383j26021j31659q2203o8619q9544p2315q9735j54050q7243o144
12728A482346n6265K0227l9725n6865J166p3394r8038m5088j2919P304n3193k5942
12716A049614K5455M8548m870k7707m2690p600o726k9449o824p2397q3728n6692
12704G84934m9425L1394K441o8347N622O2514J5424p4993K0286M2380q033k4611
12692G39586q2379j2086j9890k9083q107l590n749J2841M2128L4838J160j8325
12680F51344k822l5672m6125K329J730K0816l5432n7993j6508J4266j1008M736
$$ plain form
12668 489661 500195 523037 570544 600091 615479 686017 737683 737357 742133 765199 790994 799389
12656 799389 781083 704843 658901 571724 533633 483772 454954 416561 395091 350687 261268
12645 261268 291247 293206 283157 266342 240571 269557 229163 194090 227514 270604 287743 274623
12633 274623 227052 240023 318058 326545 346711 356389 346225 336840 333994 366004 397564 430101
12621 430101 436450 502560 540646 574540 587350 631080 692340 636006 561839 526159 512946 491797
12609 491797 428030 366250 298389 246693 220555 210530 166408 153392 121869 131421 160818 165845
12597 165845 183189 165852 130193 36878 28847 96330 144356 178306 151064 189839 236373 222304
12585 222304 231511 237589 282692 265224 234980 246008 269342 263774 199908 158877 200225 283851
$$ packed form
12668D89661J0534K2842M7507K9547J5388P0538N1666l26M776K3066K5795Q395
12656G99389j8306p6240m5942q7177l8091m9861k8818l8393k1470m4404q9419
12645B61268K9979J959j0049j6815k5771K8986m0394l5073L3424M3090J7139j3120
12633B74623m7571J2971P8035Q487K0166R678j0164r385k846L2010L1560L2537
12621D30101O349O6110L8086L3894J2810M3730O1260n6334p4167l5680j3213k1149
12609D91797o3767o1780o7861n1696k6138j0025m4122j3016l1523R552K9397N027
12597A65845J7344j7337l5659r3315q031O7483M8026L3950k7242L8775M6534j4069
12585B22304R207O078M5103j7468l0244J1028K3334n568o3866m1031M1348Q3626
$$ plain form
12573 283851 284629 325365 359729 463474 572405 741620 982312 1322983 1549703 1732292
12563 1732292 1917026 2038333 2007012 1870749 1731890 1525160 1299603 1016701 758949 561933
12553 561933 462326 428500 390472 339722 340416 324292 296120 293017 275170 280632 291383 291550 313348
12540 313348 327957 305430 257518 274987 229244 182821 226299 270521 291895 276148 241529
12529 241529 245683 327475 360448 286663 220019 188228 204717 198157 147608 178552 251871 217352
12517 217352 164142 197917 210715 148473 147611 154466 136546 124659 70333 88988 104078 104634
12505 104634 128736 90165 89130 166756 196223 183559 108471 100008 149674 157765 108704 89523
12493 89523 131226 103400 119837 95822 86022 37509 33284 93963 117998 140760 154434 179981
$$ packed form
12573B83851P78M0736L4364J03745J08931J69215K40692L40671K26720J82589
12563A732292J84734J21307l1321j36263j38859k06730k25557k82902k57752j97016
12553E61933r9607l3826l8028n0750O94j6124k8172l103j7847N462J0751J67K1798
12540C13348J4609k2527m7912J7469m5743m6423M3478M4222K1374j5747l4619
12529B41529M154Q1792L2973p3785o6644l1791J6489o560n0549L0944P3319l4519
12517B17352n3210L3775J2798o2242q62O855j7920j1887n4326J8655J5090N56
12505A04634K4102l8571j035P7626K9467j2664p5088q463M9666Q091m9061j9181
12493H9523M1703k7826J6437k4015r800m8513m225O0679K4035K2762J3674K5547
$$ plain form
12481 179981 183767 197191 227839 238405 219478 142691 186190 245047 238478 220221 148552 151970
12469 151970 175682 148842 173522 168426 145000 191490 221607 173090 217095 296691 285789 245224
12457 245224 209244 155831 164626 190771 194356 193173 175410 157107 129116 70963 33226 76667
12445 76667 126978 114109 132011 145635 147067 92110 88206 149225 204472 203030 183088 138445
12433 138445 132705 127106 172269 193429 130073 159067 174451 175697 135245 98548 142991 165698
12421 165698 149511 147826 105678 128894 81645 121437 121469 166510 209648 212490 238462 245384 198295
12408 198295 193121 226283 212072 179094 164515 151979 147058 137904 156325 181166 328923 449853
12396 449853 461491 376266 301052 213120 147731 59481 58792 180253 251525 310462 295266 303804
$$ packed form
12481A79981L786J3424L0648J0566j8927p6787M3499N8857o569j8257p1669L418
12469A51970K3712k6840K4680n096k3426M6490L0117m8517M4005P9596j0902m0565
12457B45224l5980n3413Q795K6145L585j183j7763j8303k7991n8153l7737M3441
12445G6667N0311j2869J7902J3624J432n4957l904O1019N5247j442j9942m4643
12433A38445n740n599M5163K1160o3356K8994J5384J246m0452l6697M4443K2707
12421A65698j6187j685m2148K3216m7249L9792L2M5041M3138K842K5972O922m7089
12408A98295n174L3162j4211l2978j4579j2536m921r154J8421K4841J47757J20930
12396D49853J1638q5225p5214q7932o5389q8250o89J21461P1272N8937j5196Q538
$$ plain form
12384 303804 365266 408873 407849 345536 279488 291362 273204 228155 189235 229544 246749 224435
12372 224435 285800 332217 413006 494494 634180 747988 814708 838326 802969 756872 862116
12361 862116 1041713 1304374 1607950 1918427 2211119 2546990 2715988 2745234 2589092 2290448
12351 2290448 1958878 1610226 1283109 1011171 806774 600919 445648 374033 347956 312777
12341 312777 323842 339709 311526 307622 342547 310503 250574 202114 194101 250191 196274 192432
12329 192432 167003 110953 130066 129563 159604 239662 297159 369042 400681 317786 223801 130275
12317 130275 59699 32762 70834 97984 66335 53369 -11432 -22156 -13135 13001 6582 22072
12305 22072 34646 21301 37323 52827 -2130 -58863 -49133 -2220 8649 39110 35271 33217
$$ packed form
12384C03804O1462M3607j024o2313o6048J1874j8158m5049l8920M0309J7205k2314
12372B24435O1365M6417Q0789Q1488J39686J13808O6720K3618l5357m6097J05244
12361H62116J79597K62661L03576L10477K92692L35871J68998K9246j56142k98644
12351B290448l31570l48652l27117k71938k04397k05855j55271p1615k6077l5179
12341C12777J1065J5867k8183l904L4925l2044n9929m8460q013N6090n3917l842
12329A92432k5429n6050J9113n03L0041Q0058N7497P1883L1639q2895r3985r3526
12317A30275p0576k6937L8072K7150l1649j2966o4801j0724R021K6136o419J5490
12305B2072J2574j3345J6022J5504n4957n6733R730M6913J0869L0461l839k054
$$ plain form
12293 33217 47215 61271 148008 232688 367426 354287 330838 259266 231177 214665 256118
12282 256118 226201 134600 132964 168381 197939 187613 192804 210348 145982 66198 28582 4496
12270 4496 32431 6738 -46 -29411 -41295 -10679 38345 62296 71123 58244 52674 -1653
12258 -1653 -14341 34766 78369 85195 78214 52529 38554 16441 -9928 -14159 38022 120530
12246 120530 172182 200508 260188 282217 217923 148252 93976 64090 97788 156309 185712
12235 185712 167345 143180 51609 50154 97223 149538 156217 159016 102109 82165 64826 37309
12223 37309 17328 38516 21862 -4792 34518 19227 22491 45609 28439 -10848 -24756 771
12211 771 -27725 -28421 -21354 -23762 -29756 -87834 -93845 -68862 17733 86820 123567 146533 161035
$$ packed form
12293C3217J3998J4056Q6737Q4680J34738j3139k3449p1572k8089j6512M1453
12282B56118k9917r1601j636L5417K9558j0326N191J7544o4366p9784l7616k4086
12270D496K7935k5693o784k9365j1884L0616M9024K3951Q827j2879n570n4327
12258a653j2688M9107M3603O826o981k5685j3975k2113k6369m231N2181Q2508
12246A20530N1652K8326N9680K2029o4294o9671n4276k9886L3698N8521K9403
12235A85712j8367k4165r1571j455M7069N2315O679K799n6907j9944j7339k7517
12223C7309j9981K1188j6654k6654L9310j5291L264K3118j7170l9287j3908K5527
12211G71k8496o96P067k408n994n8078o011K4983Q6595O9087L6747K2966J4502
$$ plain form
12198 161035 146236 96675 86780 52865 26942 65956 122349 180468 179060 209237 246885 193911
12186 193911 139696 204258 218679 183957 199686 174209 110066 71499 25609 41084 56831
12175 56831 40940 -29379 -92549 -103804 -22618 -42828 -89208 -85012 -18317 11956 -75 -3957
12163 -3957 -30995 -4779 22291 -23922 26385 71976 80779 64660 104131 125356 107993 38500
12151 38500 37587 45718 46830 53050 68984 106092 94957 33751 24779 12882 39203 74978 102684
12138 102684 34887 -21097 16235 33801 46481 1859 -15592 9366 41262 80479 108317
12127 108317 81508 59485 72362 49053 21141 25173 -12079 15754 68275 87208 52003 34100
12115 34100 55770 68185 28969 28336 30050 51077 92067 133547 107870 56925 65784 62683 59465
$$ packed form
12198A61035j4799m9561r895l3915k5923L9014N6393N8119j408L0177L7648n2974
12186A93911n4215O4562J4421l4722J5729k5477o4143l8567m5890J5475J5747
12175E6831j5891p0319o3170j1255Q1186k0210m6380M196O6695L0273j2031l882
12163c957k7038K6216K7070m6213N0307M5591Q803j6119L9471K1225j7363o9493
12151C8500r13Q131J112O220J5934L7108j1135o1206q972j1897K6321L5775K7706
12138A02684o7797n5984L7332J7566J2680m4622j7451K4958L1896L9217K7838
12127A08317k6809k2023J2877k3309k7912M032l7252K7833N2521J8933l5205j7903
12115C4100K1670J2415l9216o33J714K1027M0990M1480k5677n0945Q859l101l218
$$ plain form
12102 59465 86554 82263 110973 95300 34569 52338 73408 36426 77634 104813 80303 90508
12090 90508 150336 120435 114729 35935 9094 29488 35547 77615 29455 -1986 12865 21810
12078 21810 21733 -18453 34046 63325 74052 97498 40874 -26157 -14669 12910 -1813 -10028
12066 -10028 -440 -4283 19178 15798 15071 18172 -10766 -20111 -59896 -56208 -5984 -32455 -34394
12053 -34394 18324 45787 113251 64998 34663 23926 1962 20524 55858 49868 33849 60475
12041 60475 58105 -13169 -108215 -55311 -38674 -60220 -19068 19391 7187 67424 128991 245913
12029 245913 345493 418010 314736 180647 125955 98343 61690 11070 38651 55991 74288
12018 74288 65901 37386 -24740 -54520 -13780 -58761 -115068 -112335 -14172 29556 18250 10169
$$ packed form
12102E9465K7089m291K8710j5673o0731J7769K1070l6982M1208K7179k4510J0205
12090I0508N9828k9901n706p8794k6841K0394O059M2068m8160l1441J4851Q945
12078B1810p7m0186N2499K9279J0727K3446n6624o7031J1488K7579j4723q215
12066a0028R588l843K3461l380p27L101k8938r345l9785L688N0224k6471j939
12053c4394N2718K7463O7464m8253l0335j0737k1964J8562L5334n990j6019K6626
12041F0475k370p1274r5046N2904J6637k1546M1152L8459j2204O0237O1567J16922
12029B45913R9580P2517j03274j34089n4692k7612l6653n0620K7581J7340J8297
12018G4288q387k8515o2126k9780M0740m4981n6307K733R8163M3728j1306q081
$$ plain form
12006 10169 -21147 -27101 2154 -32962 -31264 33998 68156 47114 16511 568 44450 70633
11994 70633 50602 45583 3458 52132 73276 43888 1450 9139 50837 48613 35460 72100
11982 72100 97414 92032 57551 52978 53476 75611 137188 182618 171362 139457 167809 168197 127051
11969 127051 73689 108621 89962 57540 61302 76007 103231 109955 24329 -19344 16883 36765
11957 36765 35202 30164 27856 28036 -9334 -6968 37302 7113 -11767 3783 12922 31759 23283
11944 23283 63537 99831 64806 31085 6446 14626 -5042 20841 46123 15853 -3350 52492
11932 52492 79734 109545 95252 70272 37254 27676 26606 92510 93946 76847 123415 84956
11920 84956 68368 35 19813 45318 126257 142991 138250 129901 168528 212083 246999 305838
$$ packed form
12006A0169l1316n954K9255l5116J698O5262L4158k1042l0603j5943M3882K6183
11994G0633k0031n019m2125M8674K1144k9388m2438P689M1698k224j3153L6640
11982G2100K5314n382l4481m573M98K2135O1577M5430j1256l1905K8352L88m1146
11969A27051n3362L4932j8659l2422L762J4705K7224O724q5626m3673L6227J9882
11957C6765j563n038k308J80l7370K366M4270l0189j8880J5550R139J8837q476
11944B3283M0254L6294l5025l3721k4639Q180j9668K5883K5282l0270j9203N5842
11932E2492K7242K9811j4293k4980l3018r578j070O5904J436j7099M6568l8459
11920H4956j6588o8333J9778K5505Q0939J6734m741q349L8627M3555L4916N8839
$$ plain form
11908 305838 406899 547663 617884 633812 708015 811721 979259 1224948 1588271 2153933
11898 2153933 2854754 3920655 5691968 8668230 13527370 20119515 23604720 19195443
11890 19195443 12092987 7304839 4659211 3224424 2384839 1914083 1611675 1494570 1573408
11881 1573408 1792023 2226240 2939980 3953849 4505080 3679263 2454034 1627723 1162772
11872 1162772 944788 821965 786246 673996 515004 377115 331589 317489 361361 374413
11862 374413 351998 296124 259021 208249 147261 73055 26427 57394 99990 94499 129401 102007
11850 102007 43329 -603 39922 92053 71585 109964 105024 65272 81605 85585 60596 12880
11838 12880 28701 30187 40699 8107 -29262 -27750 -4536 5214 49477 41877 24158 -1680
$$ packed form
11908C05838J01061J40764P0221J5928P4203J03706J67538K45689L63323N65662
11898B153933P00821J065901J771313K976262M859140O592145L485205m409277
11890A9195443p102456m788148k645628j434787q39585m70756l02408j17105P8838
11881A573408K18615M34217P13740J013869N51231q25817j225229q26311m64951
11872A162772k17984j22823l5719j12250j58992j37889m5526j4100M3872J3052
11862C74413k2415n5874l7103n0772o0988p4206m6628L0967M2596n491L4902k7394
11850A02007n8678m3932M0525N2131k0468L8379m940l9752J6333L980k4989m7716
11838A2880J5821J486J0512l2592l7369J512K3214R750M4263p600j7719k5838
$$ plain form
11826 -1680 -15137 26958 46435 43855 32180 52419 85326 58877 25472 57114 105161 91665
11814 91665 46287 112952 131995 82177 18030 49196 43638 86818 52194 26753 125237 136979
11802 136979 104853 121009 129493 97241 96736 99969 109322 108048 27138 -3645 15118 5018 19431
11789 19431 45428 33629 33685 45104 60045 36425 -2330 9043 1601 1425 7336 -38824 -49459
11776 -49459 1469 67496 40663 -7224 13405 38248 30729 -9100 21246 45454 65811 79236
11764 79236 46483 19839 41693 49501 16655 -2142 -9783 22188 20331 31254 36566 60199
11752 60199 34411 57906 123025 133188 129158 118479 127679 133077 168625 194708 176621 125207
11740 125207 140634 68080 52517 84498 126981 122601 115542 72124 48827 48180 59685 91660
$$ packed form
11826a680j3457M2095J9477k580j1675K0239L2907k6449l3405L1642M8047j3496
11814I1665m5378O6665J9043m9818o4147L1166n558M3180l4624k5441R8484J1742
11802A36979l2126J6156Q484l2252n05L233R353j274q0910l0783J8763j0100J4413
11789A9431K5997j1799N6J1419J4941k3620l8755J1373p442j76N911m6160j0635
11776d9459N0928O6027k6833m7887K0629K4843p519l9829L0346K4208K0357J3425
11764G9236l2753k6644K1854P808l2846j8797p641L1971j857J0923N312K3633
11752F0199k5788K3495O5119J0163m030j0679R200N398L5548K6083j8087n1414
11740A25207J5427p2554j5563L1981M2483m380p059m3418k3297o47J1505L1975
$$ plain form
11728 91660 108476 88874 52834 71140 119516 95805 65759 77946 51083 48986 38992 7578
11716 7578 9182 108441 148201 117103 88017 81922 99795 98885 138854 182115 80502 64911
11704 64911 106904 58013 43376 5302 25357 81298 86015 83240 77888 104465 115010 147167
11692 147167 163471 222711 207638 215488 264816 321011 345715 373811 394377 355125 289791 281195
11680 281195 216312 202680 256351 265764 267519 260284 280366 234645 227480 229613 175505 173679 165645
11667 165645 165661 170483 168246 160634 167517 135308 125663 93152 80331 69728 34470 54212 62570
11654 62570 85151 59530 54316 65817 63451 60174 19951 -5483 23865 55760 92664 109677
11642 109677 96319 114963 123805 122977 100381 79276 3770 2011 22819 15048 50610 44077 -48456
$$ packed form
11728I1660J6816j9602l6040J8306M8376k3711l0046J2187k6863k097r994l1414
11716G578J604R9259L9760l1098k9086o095J7873r10L9969M3261j01613j5591
11704F4911M1993m8891j4637l8074K0055N5941M717k775n352K6577J0545L2157
11692A47167J6304N9240j5073P850M9328N6195K4704K8096K0566l9252o5334q596
11680B81195o4883j3632N3671R413J755p235K0082m5721p165K133n4108j826q034
11667A65645J6M822k237p612O883l2209r645l2511j2821j0603l5258J9742Q358
11654F2570K2581k5621n214J1501k366l277m0223k5434K9348L1895L6904J7013
11642A09677j3358J8644Q842q28k2596k1105p5506j759K0808p771L5562o533r2533
$$ plain form
11629 -48456 -42029 -14779 42826 50443 -6470 -18980 -21197 -10704 6822 10638 18167 37690 25417
11616 25417 51252 14239 -5074 -30807 -111693 -75769 -29370 18791 11295 -2505 -4110 5111
11604 5111 -25181 -30980 -90072 -54760 -93403 -161964 -132881 -114975 -106895 -56088 -8116 51036
11592 51036 30092 13498 6415 -12504 3790 14171 -11540 -81438 -98266 -111567 -75230 -18845
11580 -18845 -36344 -13237 16725 14631 8594 -9140 -84991 -135697 -102647 -15972 -4327 -39260
11568 -39260 -106032 -120905 -69627 -79762 -121883 -13310 44758 26059 -38106 -29146 17074 70367
11556 70367 15044 -64807 -55809 -32324 -51491 -63066 -66994 -54748 -37721 30240 7818 -30666
11544 -30666 -34777 10269 -6143 47350 50516 48291 42702 37410 31014 41594 46795 25557 11217
$$ packed form
11629d8456O427K7250N7605P617n6913j2510k217J0493J7526L816P529J9523j2273
11616B5417K5835l7013j9313k5733q0886L5924M6399M8161p496j3800j605R221
11604E111l0292n799n9092L5312l8643o8561K9083J7906Q080N0807M7972N9152
11592E1036k0944j6594p083j8919J6294J0381k5711o9898j6828j3301L6337N6385
11580a8845j7499K3107K9962k094o037j7734p5851n0706L3050Q6675J1645l4933
11568c9260o6772j4873N1278j0135m2121J08573N8068j8699o4165Q960M6220N3293
11556G0367n5323p9851Q998K3485j9167j1575l928J2246J7027O7961k2422l8484
11544c0666m111M5046j6412N3493L166k225n589n292o396J0580N201k1238j4340
$$ plain form
11531 11217 32123 58408 65656 39153 35190 18096 -56206 -85225 -64237 -77591 -90730 -40145
11519 -40145 -4619 5477 -15347 14393 -3615 -6840 -39251 -48884 -27522 17147 25565 89572
11507 89572 72299 -21730 -111323 -85933 13384 64204 62019 -8524 -47192 -31184 6233 56329
11495 56329 97658 117609 51865 73288 67740 36549 31040 25666 -10482 -78250 -79860 -66503
11483 -66503 -18384 16593 13025 -9223 -51771 -88055 -136858 -129122 -63616 -43086 -24014 10264
11471 10264 26155 -40053 -78491 -75298 -99761 -95350 -48799 22334 33034 31545 80029 60225
11459 60225 27650 16405 -47962 -66395 -36934 -3480 -45052 -128118 -76048 7310 -18309 -24288
11447 -24288 -18165 -44894 -37339 14537 16660 15403 64726 136816 158106 187362 192809 165855 89418
$$ packed form
11531A1217K0906K6285P248k6503l963j7094p4302k9019K0988j3354j3139N0585
11519d0145L5526J0096k0824K9740j8008l225l2411r633K1362M4669Q418O4007
11507H9572j7273r4029q9593K5390R9317N0820k185p0543l8668J6008L7417N0096
11495E6329M1329J9951o5744K1423n548l1191n509n374l6148o7768j610J3357
11483f6503M8119L4977l568k2248m2548l6284m8803P736O5506K0530J9072L4278
11471A0264J5891o6208l8438L193k4463M411M6551P1133J0700j489M8484j9804
11459F0225l2575j1245o4367j8433K9461L3454m1572q3066N2070Q3358k5619n979
11447b4288O123k6729P555N1876K123j257M9323P2090K1290K9256N447k6954p6437
$$ plain form
11434 89418 56263 72850 46091 9569 5997 -21392 -72802 -56035 15715 -5947 11304 -9470
11422 -9470 -6797 48441 74556 77482 55613 53857 45383 54317 77438 -5529 -12014 -38978 -55787
11409 -55787 -52513 -27682 -64803 -70896 -22923 49963 -16060 -52905 -37848 3085 7272 -28888
11397 -28888 -87882 -63488 -4070 16520 9140 72774 113561 77129 5469 -17571 -24695 -29052
11385 -29052 -22734 -11472 -2746 54953 83979 73523 100766 81520 48336 -6310 -74460 -94097
11373 -94097 -92074 -79783 -27544 -44838 -83260 -87219 -129802 -145150 -139874 -69914 -64641 -65937 -27307
11360 -27307 -47281 -82050 -70819 -18454 -3947 -23082 -22894 -23980 -37261 -48335 -71754 -40397
11348 -40397 -10845 -58110 -127486 -135455 -152477 -87824 -47862 -69834 -31054 11212 -826 -8197
$$ packed form
11434H9418l3155J6587k6759l6522l572k7389n1410J6767P1750k1662J7251k0774
11422i470K673N5238K6115K926k1869j756q474Q934K3121q2967o485k6964j6809
11409e5787L274K4831l7121o093M7973P2886o6023l6845J5057M0933M187l6160
11397b8888n8994K4394N9418K0590p380O3634M0787l6432p1660k3040p124m357
11385b9052O318J1262Q726N7699K9026j0456K7243j9246l3184n4646o8150j9637
11373i4097K023J2291N2239j7294l8422l959m2583j5348N276O9960N273j296L8630
11360b7307j9974l4769J1231N2365J4507j9135J88j086j3281j1074k3419L1357
11348d0397K9552m7265o9376p969j7022O4653L9962k1972L8780M2266j2038p371
$$ plain form
11336 -8197 -18335 -15487 -37560 -38236 29169 22034 -15323 -18601 -62894 -78558 -82678 -42537 -44391
11323 -44391 -83715 -89344 -87808 -19678 45631 -11073 -99307 -86619 -36573 -45171 -59910 -53683
11311 -53683 -43382 -42499 -46285 -40838 -4355 -36176 19146 38279 35365 41774 18554 -10822 -38830
11298 -38830 -4281 -14642 -4644 -54400 -99853 -132694 -113189 -95268 -54462 -11200 31223 38967
11286 38967 21951 28257 45819 24076 -898 -10653 -30917 6463 13229 3998 17815 8753 -29618
11273 -29618 8664 41328 83174 96558 95820 131557 129019 72908 25212 6408 -27138 -15908
11261 -15908 -5215 15761 -5311 971 11545 834 22522 8599 -29844 77754 111932 99878
11249 99878 159941 202049 128199 148725 226668 227414 191075 166154 129210 109324 90968 40677
$$ packed form
11336h197j0138K848k2073o76O7405p135l7357l278m4293j5664m120M0141j854
11323d4391l9324n629J536O8130O5309n6704q8234J2688N0046q598j4739O227
11311e3683J0301Q83l786N447L6483l1821N5322J9133k914O409k3220k9376k8008
11298c8830L4549j0361R998m9756m5453l2841J9505J7921M0806M3262M2423P744
11286C8967j7016O306J7562k1743k4974r755k0264L7380O766r231J3817r062l8371
11273b9618L8282L2664M1846J3384p38L5737k538n6111m7696j8804l3546J1230
11261a5908J0693K0976k1072O282J0574j0711K1688j3923l8443J07598L4178j2054
11249I9878O0063M2108p3850K0526P7943P46l6339k4921l6944j9886j8356n0291
$$ plain form
11237 40677 49660 49731 62296 64273 100369 59022 32640 25453 30868 18590 -3879 -21957 -12733
11224 -12733 -19823 19270 31593 16233 54092 100390 108181 109724 73916 -809 -4404 75139
11212 75139 86078 69627 4831 -84356 -76850 -44392 1491 59238 82212 98061 103527 105872
11200 105872 67113 53468 44870 81098 102291 88183 41367 46605 43351 79630 76327 923
11188 923 -49121 -54383 -52457 -30539 -44503 -72023 -14562 35961 33575 36814 10009 28275 92909
11175 92909 176780 135567 59954 22115 -12955 -57535 -121127 -149076 -132634 -48279 -41129 -95063
11163 -95063 -118197 -85257 -25916 -11074 -10291 30553 -872 -34998 -37389 -73716 -101510 -116769
11151 -116769 -84137 -23296 20132 57210 5780 -3496 47544 40023 47372 30978 23461 -32371
$$ packed form
11237D0677Q983P1J2565J977L6096m1347k6382p187N415j2278k2469j8078R224
11224a2733p090L9093J2323j5360L7859M6298P791J543l5808p4725l595P9543
11212G5139J0939j6451o4796q9187P506L2458M5883N7747K2974J5849N466K345
11200A05872l8759j3645q598L6228K1193j4108m6816N238l254L6279l303p5404
11188I23n0044n262J926K1918j3964k7520N7461N0523k386L239k6805J8266O4634
11175I2909Q3871m1213p5613l7839l5070m4580o3592k7949J6442Q4355P150n3934
11163i5063k3134L2940N9341J4842P83M0844l1425l4126k391l6327k7794j5259
11151a16769L2632O0841M3428L7078n1430r276N1040p521P349j6394p517n5832
$$ plain form
11139 -32371 -77879 -93124 -40435 -2277 -17049 -11481 33399 3116 -52980 -33166 3004 62462
11127 62462 32215 -61242 -85928 -60474 7300 7295 -46288 -84716 -64605 -21077 34121 28972 29798
11114 29798 27256 32576 -21229 -58241 -49895 -77947 -90944 -39218 -3279 17581 -15536 6849
11102 6849 21934 -4867 -47001 -93892 -79403 -8000 -14769 -14498 -11840 -21707 -55100 -73023 -111525
11089 -111525 -97802 -103618 -118115 -131403 -109114 -61099 12058 51027 26474 22828 23139 -8759
11077 -8759 -27452 -62275 -52364 -27869 -88432 -61432 -21556 -19516 -39455 -56886 -27162 55625
11065 55625 94088 96556 93064 111912 84906 64820 10495 -6335 12995 -7623 -1895 27947
11053 27947 26264 21883 30396 20385 -3090 -27503 -60401 -82338 -68145 -83979 -101309 -117708
$$ packed form
11139c2371m5508j5245N2689L8158j4772N568M4880l0283n6096J9814L6170N9458
11127F2462l0247r3457k4686K5454O7774nn3583l8428K0111M3528N5198n149Q26
11114B9798k542N320n3805l7012Q346k8052j2997N1726L5939K0860l3117K2385
11102F849J5085k6801m2134m6891J4489P1403o769K71K658r867l3393j7923l8502
11089a11525J3723n816j4497j3288K2289M8015P3157L8969k4553l646L11l1898
11077h759j8693l4823R911K4495o0563K7000L9876K040j9939j7431K9724Q2787
11065E5625L8463K468l492J8848k7006k0086n4325j6830J9330k0618N728K9842
11053B7947j683m381Q513j0011k3475k4413l2898k1937J4193j5834j7330j6399
$$ plain form
11041 -117708 -99367 -87504 -70755 -88770 -5980 57984 38787 -7198 -53362 -72985 -26938
11030 -26938 -33855 -87404 -102332 -12567 3725 -39927 -4084 -21877 -22467 2386 -54007 17270
11018 17270 39659 -41886 -92049 -59908 -33351 -25814 5885 19911 -33220 -63239 -65050 -13122
11006 -13122 -7997 24860 -49325 -52899 -50685 -26211 13545 2364 -78606 -105287 -47774 -16871
10994 -16871 10267 32915 -49890 -70111 -28256 -33674 26553 52626 6359 -38153 -51137 -13360
10982 -13360 21034 11066 78345 90588 47078 30728 40294 58530 65331 70289 81048 87608 51308
10969 51308 3380 -22693 -62155 -22505 8516 3794 -4355 -9262 -3942 29049 20991 35 -24942
10956 -24942 -24232 23250 -15863 -10294 -10912 -7152 19810 -11561 -26606 -33482 20324 47080 57506
$$ packed form
11041a17708J8341J1863J6749j8015Q2790O3964j9197m5985m6164j9623M6047
11030b6938o917n3549j4928Q9765J6292m3652L5843j7793n90K4853n6393P1277
11018A7270K2389q1545n0163L2141K6557P537L1699J4026n3131l0019j811N1928
11006a3122N125L2857p4185l574K214K4474L9756j1181q0970k6681N7513L0903
10994a6871K7138K2648q2805k0221M1855n418O0227K6073m6267m4512j2984L7777
10982a3360L4394r968O7279J2243m3510j6350R566J8236O801M958J0759O560l6300
10969E1308m7928k6073l9462L9650L1021m722q149m907N320L2991q058k0956k4977
10956b4942P10M7482l9113N569o18L760K6962l1371j5045o876N3806K6756J0426
$$ plain form
10943 57506 59382 78256 76756 104165 82206 87519 98996 90957 89718 95335 106032 86995 76062
10930 76062 54098 17202 58354 28369 -10914 67770 55058 5144 19826 9855 -5777 4093
10918 4093 18675 51051 -9988 -38745 -5645 65061 68451 57961 56118 -6633 -31988 -17357
10906 -17357 -11494 15051 8664 17046 47697 75423 59315 67000 36312 30496 -25426 -87025 -87082
10893 -87082 -54177 -361 47451 23596 -47896 -34765 5581 -23299 -16589 -49788 -18802 28356
10881 28356 9009 10394 31654 48141 32659 13424 67874 62868 -1127 -8121 -6968 -7311 -29424
10868 -29424 15086 57468 20345 10509 -30627 -59373 -27912 -5467 51217 72522 103672 102782
10856 102782 78522 19343 33832 46091 51412 26297 3809 246 -26 -18648 -4454 2340
$$ packed form
10943E7506J876J8874j500K7409k1959N313J1477q039j239N617J0697j9037j0933
10930G6062k1964l6896M1152k9985l9283P8684j2712m9914J4682r971j5632R870
10918D093J4582L2376o1039k8757L3100P0706L390j0490j843o2751k5355J4631
10906a7357N863K6545o387Q382L0651K7726j6108P685l0688n816n5922o1599n7
10893h7082L2905N3816M7812k3855p1492J3131M0346k8880O710l3199L0986M7158
10881B8356j9347J385K1260J6487j5482j9235N4450n006o3995o994J153l43k2113
10868b9424M4510M2382l7123r836m1136k8746L1461K2445N6684K1305L1150q90
10856A02782k4260n9179J4489J2259N321k5115k2488l563k72j8622J4194O794
$$ plain form
10844 2340 56232 48258 30924 27091 29467 36084 90952 52619 -12190 4613 3471 4457 46600
10831 46600 50348 46110 11098 -11729 -18238 -21275 -40877 -79884 -28791 -3922 2807 11986 27604
10818 27604 29529 23782 19002 40173 4692 -80809 -44980 -17363 -9942 629 -17034 5376
10806 5376 69978 57358 29091 17510 -449 -17558 1778 4372 15471 10323 16321 69027
10794 69027 92106 64283 16197 20575 35379 41899 -15332 -68249 -52752 -9688 -10930 -11101 -22083
10781 -22083 22476 46142 21259 52988 50989 -2163 -14106 -35975 -53661 -78797 -58047 -8906
10769 -8906 -9087 10660 33590 32674 20726 19167 59660 29002 14937 30031 26612 18879 34935
10756 34935 95400 142958 131136 97119 100217 88922 77995 76265 12993 -51944 -62315 -8316
$$ packed form
10844B340N3892p974j7334l833K376O617N4868l8333o4809J6803j142R86M2143
10831D6600L748m238l5012k2827o509l037j9602l9007N1093K4869O729R179J5618
10818B7604J925n747m780K1171l5481q5501L5829K7617P421J0571j7663K2410
10806E376O4602j2620k8267j1581j7959j7109J9336K594J1099n148N998N2706
10794F9027K3079k7823m8086M378J4804O520n7231n2917J5497M3064j242j71j0982
10781b2083M4559K3666k4883L1729j999n3152j1943k1869j7686k5136K0750M9141
10769h906j81J9747K2930r16j1948j559M0493l0658j4065J5094l419p733J6056
10756C4935O0465M7558j1822l4017L098j1295j0927j730o3272o4937j0371N3999
$$ plain form
10744 -8316 47134 19235 -9026 -36906 -93506 -81234 5740 44024 83945 85382 68268 58165
10732 58165 -19049 -45013 -28174 -32323 -33377 -26804 -50378 -116696 -128024 -114165 -88340 -49308
10720 -49308 -44074 -32558 -96422 -130063 -71912 -1498 34066 50310 28674 44322 87212 66251
10708 66251 91458 56909 17415 15564 49987 103345 97680 90488 111238 112766 120409 167663 269705
10695 269705 357026 546172 714892 797091 785050 691256 596944 492688 400670 289381 209441
10684 209441 217253 145515 74760 62658 80422 129668 111624 59486 33509 47192 -12795 -52618
10672 -52618 -61216 11511 71121 42377 30817 54300 79832 105960 112279 115244 146124 83055
10660 83055 57155 110299 185537 228215 300153 355840 423656 527160 671742 773051 746339
$$ packed form
10744h316N5450k7899k8261k7880n6600J2272Q6974L8284L9921J437j7114j0103
10732E8165p7214k5964J6839m149j054O573k3574o6318j1328J3859K5825L9032
10720d9308N234J1516o3864l3641N8151P0414L5564J6244k1636J5648M2890k0961
10708F6251K5207l4549l9494j851L4423N3358n665p192K0750J528P643M7254J02042
10695B69705Q7321J89146J68720Q2199j2041r3794r4312j04256r2018j11289p9940
10684B09441P812p1738p0755j2102J7764M9246j8044n2138k5977J3683n9987l9823
10672e2618q598P2727N9610k8744j1560K3483K5532K6128O319K965L0880o3069
10660H3055k5900N3144P5238M2678P1938N5687O7816J03504J44582J01309k6712
$$ plain form
10649 746339 688434 576562 485191 396149 247307 138492 102991 148354 158868 115153 41032
10638 41032 53214 76470 91990 88304 113679 106899 154050 143451 74726 -2968 -59104 -97270
10626 -97270 -96142 -17992 26396 68454 44926 8384 40482 53611 58689 43419 47859 84331
10614 84331 73884 57284 388 42351 66913 72593 7964 8772 86178 83807 27605 64871
10602 64871 122934 52424 578 11778 32670 28748 105038 101596 79887 100593 75990 57171
10590 57171 -14687 11975 62916 116444 150381 149907 149694 115057 73613 80489 90991 100675 106745
10577 106745 86710 50969 44690 44678 30124 6171 -39631 -42904 -55206 -59177 -52125 -45464 -29582
10564 -29582 -23594 -17703 397 -30630 -15947 38299 73483 59764 77496 82594 73489 124355
$$ packed form
10649G46339n7905j11872r1371q9042j48842j08815l5501M5363J0514m3715p4121
10638D1032J2182K3256J5520l686K5375o780M7151j0599o8725p7694n6136l8166
10626i7270J128P8150M4388M2058k3528l6542L2098J3129N078j5270M440L6472
10614H4331j0447j6600n6896M1963K4562N680o4629Q08P7406k371n6202L7266
10602F4871N8063p0510n1846J1200K0892l922P6290l442k1709K0706k4603j8819
10590E7171p1858K6662N0941N3528L3937m74k13l4637m1444O876J0502R684O070
10577A06745k0035l5741o279j2j4554k3953m5802l273j2302l971P052O661J5882
10564b9582N988N891J8100l1027J4683N4246L5184j3719J7732N098r105N0866
$$ plain form
10552 124355 171913 142325 95991 117444 121456 97224 89422 128910 157012 208574 178767 110385
10540 110385 61767 47490 45348 26679 78945 107136 56911 29984 16102 258 14755 26426
10528 26426 56078 92918 129492 109018 64869 6281 -44677 -55563 13476 61500 88985 115044
10516 115044 141165 117101 131380 188399 214640 213817 253092 315095 341748 404831 496885 538772
10504 538772 641800 789914 1026439 1309708 1839140 2753739 4004709 5109406 5009216
10495 5009216 3754001 2431659 1547492 1097916 820314 627620 529912 416018 335317
10486 335317 227459 157078 202822 222646 225825 237261 274493 282996 281734 324397 390131 510352
10474 510352 620105 551055 425102 323549 232079 166193 144116 187836 161902 156800 168834
$$ packed form
10552A24355M7558k9588m6334K1453M012k4232p802L9488K8102N1562k9807o8382
10540A10385m8618j4277k142j8669N2266K8191n0225k6927j3882j5844J4497J1671
10528B6426K9652L6840L6574k0474m4149n8588n0958j0886O9039M8024K7485K6059
10516A15044K6121k4064J4279N7019K6241q23L9275O2003K6653O3083R2054M1887
10504E38772J03028J48114K36525K83269N29432R14599J250970J104697j00190
10495E009216j255215j322342q84167m49576k77602j92694r7708j13894q0701
10486C35317j07858p0381M5744J9824L179J1436L7232Q503j262M2663O5734J20221
10474E10352J09753o9050j25953j01553r1470o5886k2077M3720k5934n102J2034
$$ plain form
10463 168834 150762 133915 154296 194080 188042 165511 152410 161834 153313 138733 165073 170558
10451 170558 167652 127403 98709 81864 65975 48314 69130 47629 30647 41148 138109 183636
10439 183636 179700 235908 304381 356161 411804 377373 372736 370269 298173 267543 228489 166461
10427 166461 121256 115676 88202 33582 53882 102200 80147 71096 105144 121850 130171 194572
10415 194572 204894 199778 213219 189148 118669 97602 131411 127913 85537 54110 40219 63439
10403 63439 84878 56537 62819 72833 34821 53181 90843 192634 246884 281987 263653 284349
10391 284349 322914 427582 556745 719858 917452 1194601 1497773 1652265 1676716 1639572
10381 1639572 1646940 1626623 1646703 1718453 1696736 1704384 1715990 1698259 1643540 1538602 1387302
$$ packed form
10463A68834j8072j6847K0381L9784o038k2531j3101R424q521j4580K6340N485
10451A70558k906m0249k8694j6845j5889j7661K0816k1501j6982J0501R6961M5527
10439A83636l936N6208O8473N1780N5643l4431m637k467p2096l0630l9054o2028
10427A66461m5205n580k7474n4620K0300M8318k2053r051L4048J6706Q321O4401
10415A94572J0322n116J3441k4071p0479k1067L3809l498m2376l1427j3891K3220
10403F3439K1439k8341O282J0014l8012J8360L7662J01791N4250L5103j8334K0696
10391B84349L8565J04668J29163J63113J97594K77149L03172J54492K4451l7144
10381A639572P368k0317K0080P1750k1717P648J1606j7731n4719j04938j51300
$$ plain form
10370 1387302 1132723 899512 696529 582744 509173 403749 379116 455478 480826 504826
10360 504826 467795 396046 297140 262514 290009 273236 290741 289838 252804 170008 159337 179970
10348 179970 215899 193523 222659 250576 266077 204284 233525 208327 178325 195254 223805
10337 223805 254622 239692 209003 136070 139746 149117 135346 132328 125782 153692 114425 106718
10325 106718 142806 130934 98311 60350 84472 207806 242561 241735 172100 122224 154639 176716
10313 176716 165204 177669 209691 220124 233916 215732 185472 152744 142575 127119 151688
10302 151688 177638 171823 118185 141188 186926 203411 178150 110841 152193 126402 114085 53728
10290 53728 57819 67708 76818 71533 69893 107645 139202 152738 119655 94515 84261 54168 30010
$$ packed form
10370A387302k54579k33211k02983j13785p3571j05424k4633P6362K5348K4000
10360E04826l7031p1749r8906l4626K7495j6773J7505r03l7034q2796j0671K0633
10348A79970L5929k2376K9136K7917J5501o1793K9241k5198l0002J6929K8551
10337B23805L0817j4930l0689p2933L676R371j3771l018o546K7910l9267p707
10325A06718L6088j1872l2623l7961K4122J23334L4755q26o9635m9876L2415K2077
10313A76716j1512J2465L2022J0433J3792j8184l0260l2728j0169j5456K4569
10302A51688K5950n815n3638K3003M5738J6485k5261o7309M1352k5791j2317o0357
10290E3728M091R889R110n285j640L7752L1557J3536l3083k5140j0254l0093k4158
$$ plain form
10277 30010 56845 98712 68678 41932 31383 47162 88038 90987 36244 -20757 -6398 21732
10265 21732 45305 2432 -17456 -16756 -4598 -12093 -46636 -11919 40820 82859 84477 83343 102941
10252 102941 95677 54100 51704 108801 120092 60950 46509 61682 125310 164304 181664 183769
10240 183769 180979 154088 93935 12227 2862 -23534 1685 50960 57150 46605 58441 44188
10228 44188 97286 156654 137317 131134 158198 133396 115773 170884 107086 12322 -9273 -1449
10216 -1449 33590 56357 65757 14802 9242 26365 17486 -28470 -102848 -134314 -50862 -10209
10204 -10209 7140 26295 56235 25897 57630 78485 74850 12383 60014 143821 160036 100549
10192 100549 79928 69779 59171 65988 98816 111661 117210 144427 172195 184699 161967 164477
$$ packed form
10277C0010K6835M1867l0034k6746j0549J5779M0876K949n4743n7001J4359K8130
10265B1732K3573m2873j9888P00J2158p495l4543L4717N2739M2039J618j134J9598
10252A02941p264m1577k396N7097J1291n9142j4441J5173O3628L8994J7360K105
10240A83769k790k6891o0153q1708r365k6396K5219M9275O190j0545J1836j4253
10228D4188N3098N9368j9337o183K7064k4802j7623N5111o3798r4764k1595P824
10216a449L5039K2767R400n0955n560J7123q879m5956p4378l1466Q3452M0653
10204a0209J7349J9155K9940l0338L1733K0855l635o2467M7631Q3807J6215n9487
10192A00549k0621j0149j0608O817L2828J2845N549K7217K7768J2504k2732K510
$$ plain form
10180 164477 115828 22404 35008 120579 137220 110196 104521 116129 165631 234224 384947
10169 384947 490448 654791 791180 829231 774595 668964 654105 764200 983819 1165024
10159 1165024 1245705 1283725 1335945 1341676 1190724 965995 695947 441676 354554 284685 222156
10148 222156 158781 117212 86233 75140 84209 61258 -10679 -1478 8408 -7651 24269 79035
10136 79035 94197 129436 96838 91666 116359 100590 89489 61968 33560 39287 61981 61398
10124 61398 65845 101958 84168 9696 -46893 -25717 -2802 -23967 -10037 35516 122762 104089
10112 104089 63149 43496 22888 -5669 9328 32103 75550 137379 102361 73591 41408
10101 41408 47974 105250 160547 137802 32805 -51747 4417 73011 113925 140665 146808 129792
$$ packed form
10180A64477m8649r3424J2604Q5571J6641k7024n675J1608M9502O8593J50723
10169C84947J05501J64343J36389L8051n4636j05631j4859J10095K19619J81205
10159A165024Q0681L8020N2220N731j50952k24729k70048k54271q7122o9869o2529
10148B22156o3375m1569l0979j1093R069k2951p1937R201R886j6059L1920N4766
10136G9035J5162L5239l2598n172K4693j5769j1101k7521k8408N727K2694n83
10124F1398M447L6113j7790p4472n6589K1176K2915k1165J3930M5553Q7246j8673
10112A04089m0940j9653k0608k8557J4997K2775M3447O1829l5018k8770l2183
10101D1408O566N7276N5297k2745j04997q4552N6164O8594M0914K6740O143j7016
$$ plain form
10089 129792 115396 147093 119472 111133 108730 88097 109496 103885 118387 78954 77436 55583
10077 55583 76053 58020 12341 -10228 36668 111051 107388 23765 56295 113934 155115 131775
10065 131775 106337 88554 78190 97050 122415 95741 99989 109735 132697 149205 140905 117746
10053 117746 43662 65712 60886 18027 10681 26092 12305 58562 102328 150395 90491 69508
10041 69508 140172 163083 193138 179251 129305 100068 118897 158776 162878 169911 145353 118282
10029 118282 157190 135161 134325 92438 75453 97321 99861 70365 28893 6094 19375 72104
10017 72104 94070 91292 129708 95302 29164 112 34435 -3426 14379 47562 44672 79776
10005 79776 56766 59089 75395 58551 42196 32774 11734 -11051 -22907 -15224 -13795 -44973
$$ packed form
10089A29792j4396L1697k7621q339k403k0633K1399n611J4502l9433j518k1853
10077E5583K0470j8033m5679k2569M6896P4383l663q3623L2530N7639M1181k3340
10065A31775k5438j7783j0364J8860K5365k6674M248R746K2962J6508q300k3159
10053A17746p4084K2050m826m2859p346J5411j3787M6257M3766M8067n9904k0983
10041F9508P0664K2911L0055j3887m9946k9237J8829L9879M102P033k4558k7071
10029A18282L8908k2029q36m1887j6985K1868K540k9496m1472k2799J3281N2729
10017G2104K1966k778L8416l4406o6138k9052L4323l7861J7805L3183k890L5104
10005G9776k3010K323J6306j6844j6355r422k1040k2785j1856P683J429l1178
$$ plain form
9993 -44973 15101 31303 99936 107686 68173 75378 98510 124280 87750 129680 180105 176276
9981 176276 166548 112203 96220 58375 8330 19539 -14510 -61370 -5998 90720 133566 99677
9969 99677 72701 104797 64419 45440 75978 70232 31779 23051 67621 69180 48677 44817 64846
9956 64846 131943 200609 225380 164641 107736 59995 54773 110422 128825 127042 203211 282970
9944 282970 293739 256491 239367 276013 333441 374075 424052 537191 705305 987093 1241314
9933 1241314 1322255 1180306 993971 957970 1028689 1164521 1553879 2065392 2491049 2245077
9923 2245077 1661890 1284627 1081950 1027148 970293 1097986 1289191 1396915 1263715 1020198
9913 1020198 783244 620298 531890 505955 399809 325067 298406 270416 256365 210643 163178
$$ packed form
9993d4973O0074J6202O8633P750l9513P205K3132K5770l6530M1930N0425l829
9981A76276r728n4345j5983l7845n0045J1209l4049m6860N5372R6718M2846l3889
9969I9677k6976L2096m0378j8979L0538n746l8453q728M4570J559k0503l860K0029
9956F4846O7097O8666K4771o0739n6905m7741n222N5649J8403j783P6169P9759
9944B82970J0769l7248j7124L6646N7428M0634M9977J13139J68114K81788K54221
9933A241314Q0941j41949j86335l6001P0719J35832L89358N11513M25657k45972
9923B245077n83187l77263k02677n4802n6855J27693J91205J07724j33200k43517
9913A020198k36954j62946q8408k5935j06146p4742k6661k7990j4051m5722m7465
$$ plain form
9902 163178 169457 178416 139950 113723 148097 126995 141805 151163 131803 131881 129189 187162 197309
9889 197309 174482 138066 99964 106013 117667 136996 185882 183516 143562 194381 184458 194466
9877 194466 246625 331680 365380 367346 364063 420004 401921 409434 432365 472938 487916 388121
9865 388121 284758 235680 234152 234962 236142 223996 156340 183475 189275 189138 164648 145475 147183
9852 147183 157233 196730 219870 209846 224016 193771 170017 236496 309314 322187 340664 347100
9840 347100 350361 442474 607105 711437 657690 493253 380943 404372 463485 482688 567347
9829 567347 601350 594163 696826 805122 837509 807246 756269 668149 577785 467794 421103
9818 421103 425289 533311 549104 471171 432880 384244 354643 293287 270464 290741 270820 223394
$$ packed form
9902A63178O279Q959l8466k6227L4374k1102J4810R358j9360P8k692N7973J0147
9889A97309k2827l6416l8102O049J1654J9329M8886k366l9954N0819r923J0008
9877A94466N2159Q5055L3700J966l283N5941j8083P513K2931M0573J4978r9795
9865C88121j03363m9078j528Q10J180j2146o7656K7135N800j37k4490j9173J708
9852A47183J0050L9497K3140j0024J4170l0245k3754O6479P2818J2873J8477O436
9840C47100L261R2113J64631J04332n3747j64437j12310K3429N9113J9203Q4659
9829E67347L4003p187J02663J08296L2387l0263n0977q8120r0364j09991m6691
9818D21103M186J08022J5793p7933l8291m8636k9601o1356k2823K0277j9921m7426
$$ plain form
9806 223394 227913 267200 287699 309200 300357 260782 268734 245912 260515 323106 346767 350430
9794 350430 356603 359612 359600 391459 408576 447022 491516 544285 575257 628245 667973 737184 714779
9781 714779 703004 603842 491770 377404 308613 258799 308240 298895 312513 335476 364298
9770 364298 326276 282138 230870 282262 318859 381316 441719 408435 427780 365461 372987 368672
9758 368672 319525 285719 313980 321133 337399 362712 334547 351465 410697 393792 415806 435622
9746 435622 467289 509399 479819 498510 526570 543283 478658 467603 514813 484883 450320 431530
9734 431530 428562 433313 385671 382687 422857 438447 477825 517865 509691 494866 516005 469318
9722 469318 462484 464568 492719 488060 508098 518513 518154 574916 558715 514978 592554 672915 763508
$$ packed form
9806B23394M519L9287K0499K1501q843l9575P952k2822J4603O2591K3661L663
9794C50430O173L009j2L1859J7117L8446M4494N2769L0972N2988L9728O9211k2405
9781G14779j1775r9162j12072j14366o8791m9814M9441r345J3618K2963K8822
9770C64298l8022m4138n1268N1392L6597O2457O0403l3284J9345o2319P526m315
9758C68672m9147l3806K8261P153J6266K5313k8165J6918N9232j6905K2014J9816
9746D35622L1667M2110k9580J8691K8060J6713o4625j1055M7210k9930l4563j8790
9734D31530k968M751m7642k984M0170J5590L9378M0040q174j4825K1139m6687
9722D69318o834K084K8151m659K0038J0415l59N6762j6201m3737P7576Q0361R0593
$$ plain form
9709 763508 934598 1193193 1550832 1946180 2052729 2143650 2388728 2927282 3277478 2864011
9699 2864011 2323739 2088994 2034888 1896064 1476344 1085276 832406 665090 513604 424065
9689 424065 468288 462524 402681 383285 384561 386749 398311 347830 373515 411476 485389 446357
9677 446357 346077 312244 342260 358397 351505 337806 370365 369028 360010 361509 413828 416035
9665 416035 397456 368886 399336 392255 358872 334607 326400 337982 351695 369206 368990 342472
9653 342472 325565 381081 336778 347706 302598 300817 283182 286239 361573 353141 322799 344899
9641 344899 344321 292740 221633 236673 246826 244489 279670 257549 229107 261720 283973 304526
9629 304526 257387 257856 255281 222924 249366 280746 293484 325432 314291 222298 181100 198302
$$ packed form
9709G63508J71090K58595L57639L95348J06549R0921K45078N38554L50196m13467
9699B864011n40272k34745n4106j38824m19720l91068k52870j67316j51486q9539
9689D24065M4223n764n9843j9396J276K188J1562n0481K5685L7961P3913l9032
9677D46357j00280l3833L0016J6137o892j3699L2559j337r018J499N2319K207
9665D16035j8579k8570L0450p081l3383k4265q207J1582J3713J7511k16k6518
9653C42472j6907N5516m4303J0928m5108j781j7635L057P5334q432l0342K2100
9641C44899n78n1581p1107J5040J0153k337L5181k2121k8442L2613K2253K0553
9629C04526m7139M69k575l2357K6442L1380J2738L1948j1141r1993m1198J7202
$$ plain form
9617 198302 224542 247320 259140 228616 209063 175281 176563 223419 212959 219825 242894 204847
9605 204847 170953 183909 229561 271746 276080 284625 280848 295993 331834 328338 332176 304590 284261
9592 284261 241357 171914 190304 189933 224881 280487 210199 151230 164814 240052 305132 343450
9580 343450 342987 391346 349208 306520 342878 341193 286046 237681 261275 315449 295116 332662
9568 332662 307443 287897 303327 262155 255522 270826 273548 316581 365041 370680 363724 378878
9556 378878 333334 312556 305418 343182 320289 292881 219073 207600 228047 242988 199838 195394
9544 195394 244595 282625 289422 275701 248035 181025 218109 271031 273487 264350 333131 361567
9532 361567 371377 386241 366664 378542 355807 345657 315987 299094 347629 383171 390520 351219
$$ packed form
9617A98302K6240K2778J1820l0524j9553l3782J282M6856j0460O866K3069l8047
9605B04847l3894J2956M5652M2185M334Q545l777J5145L5841l496L838k7586k0329
9592B84261m2904o9443J8390l71L4948N5606p0288n8969J3584P5238O5080L8318
9580C43450m63M8359m2138m2688L6358j685n5147m8365K3594N4174k0333L7546
9568C32662k5219j9546J5430m1172o633J5304K722M3033M8460N639o956J5154
9556C78878m5544k0778p138L7764k2893k7408p3808j1473K0447J4941m3150m444
9544A95394M9201L8030O797j3721k7666o7010L7084N2922K456r137O8781K8436
9532C61567R810J4864j9577J1878k2735j0150k9670j6893M8535L5542P349l9301
$$ plain form
9520 351219 369010 373098 372310 390975 357438 310354 290236 249936 294440 363768 383489 367197
9508 367197 385367 377279 376490 380396 343429 271715 297488 337783 391091 417981 394099 365220
9496 365220 313707 300862 294850 329067 272286 223000 290964 350385 315470 240180 210634 270239
9484 270239 295409 364372 411876 452091 446512 365483 359874 386673 415856 397278 395713 404971
9472 404971 358133 300120 290903 340554 344952 357143 322944 255298 233705 236745 268402 359866
9460 359866 409588 455187 468054 457942 440996 460954 474098 418381 402829 427305 410384 394656
9448 394656 404102 410740 365692 376797 417270 419020 438100 439953 418987 383256 346968 333527
9436 333527 367704 373797 375459 359114 339944 335016 355544 432809 477395 483846 462208 474630
$$ packed form
9520C51219J7791M088p88J8665l3537m7084k0118m0300M4504O9328J9721j6292
9508C67197J8170q088p89L906l6967p1714K5773M0295N3308K6890k3882k8879
9496C65220n1513j2845o012L4217n6781m9286O7964N9421l4915p5290k9546N9605
9484B70239K5170O8963M7504M0215n579q1029n609K6799K9183j8578j565R258
9472D04971m6838n8013r217M9651M398J2191l4199o7646k1593L040L1657R1464
9460C59866M9722M5599J2867j0112j6946J9958J3144n5717j5552K4476j6921j5728
9448C94656R446O638m5048J1105M0473J750J9080J853k0966l5731l6288j3441
9436C33527L4177O093J662j6345j9170m928K0528P7265M4586O451k1638J2422
$$ plain form
9424 474630 467327 508915 533917 503822 467302 452966 413982 421650 469171 473665 427915 452386
9412 452386 528391 563162 609681 692526 709703 693708 641413 622231 627982 653152 625602 566169
9400 566169 501717 484778 492892 455667 406805 398489 395527 426492 482456 508176 535301 563328
9388 563328 557932 537338 543945 500918 496082 481333 455417 479309 467201 493011 511044 600560
9376 600560 620204 645003 657110 680822 737785 822089 797741 769858 787152 884041 949742 971631
9364 971631 1008142 996831 1014046 1026709 1058704 943875 837967 815528 751733 736733 729291
9353 729291 699587 684929 663281 641403 636293 597624 606314 600675 599295 662782 646835 577308
9341 577308 537795 557737 548536 584857 610104 622250 712981 726667 700820 722566 740233 758309
$$ packed form
9424D74630p303M1588K5002l0095l6520j4336l8984P668M7521M494m5750K4471
9412D52386P6005L4771M6519Q2845J7177j5995n2295j9182N751K5170k7550n9433
9400E66169o4452j6939Q114l7225m8862q316k962L0965N5964K5720K7125K8027
9388E63328n396k0594O607m3027m836j4749k5916K3892j2108K5810J8033Q9516
9376F00560J9644K4799J2107K3712N6963Q4304k4348k7883J7294R6889O5701K1889
9364I71631L6511j1311J7215J2663L1995j14829j05908k2439o3795j5000p442
9353G29291k9704j4658k1648k1878n110l8669Q690n639j380O3487j5947o9527
9341E77308l9513J9942r201L6321K5247J2146R0731J3686k5847K1746J7667J8076
$$ plain form
9329 758309 783390 800792 852448 938144 1013661 1029807 1032667 1083849 1132074 1172259 1220126 1281069
9317 1281069 1258681 1230368 1137811 1042190 993154 986531 986037 973020 975797 1021625 1019471 1001498
9305 1001498 973157 991601 1012866 1052658 1041665 967256 929910 919399 959910 949096 921420
9294 921420 841607 827834 828889 795943 778189 764502 793458 810747 847633 894726 932188 929928
9282 929928 947750 1024446 1046139 1080884 1103300 1072340 1045843 1051615 1095952 1164776 1223798 1252450
9270 1252450 1306418 1309873 1332955 1312593 1303285 1183149 1088802 1036258 999539 939278 957432 974144
9258 974144 922889 850018 752341 739440 816832 932344 949953 912738 886107 907130 868048
9247 868048 829047 788801 824371 871625 919711 961386 988555 1014553 993888 988332 975630 945421
$$ packed form
9329G58309K5081J7402N1656Q5696P5517J6146K860N1182M8225M0185M7867O0943
9317A281069k2388k8313r2557r5621m9036o623m94j3017K777M5828k154j7973
9305A001498k8341J8444K1265L9792j0993p4409l7346j0511M0511j0814k7676
9294I21420p9813j3773J055l2946j7754j3687K8956J7289L6886M7093L7462k260
9282I29928J7822P6696K1693L4745K2416l0960k6497N772M4337O8824N9022K8652
9270A252450N3968L455K3082k0362r308j20136r4347n2544l6719o0261J8154J6712
9258I74144n1255p2871r7677j2901P7392J15512J7609l7215k6631K1023l9082
9247H68048l9001m0246L5570M7254M8086M1675K7169K5998k0665n556j2702l0209
$$ plain form
9235 945421 903592 869433 890680 938967 997330 1028691 1052432 1052439 1020982 1071459 1100032 1151204
9223 1151204 1130307 1106128 1062932 1128397 1152947 1155374 1141474 1123146 1096329 1042219 1038758 1029890
9211 1029890 1050848 1110168 1053377 1027992 1047934 1077234 1124652 1126896 1099016 1117080 1118829 1111906
9199 1111906 1095795 1086040 1124425 1072284 989050 1036372 1132224 1186929 1211106 1220687 1195214 1149025
9187 1149025 1190914 1132142 1075592 1040624 1060766 1155493 1208825 1179823 1185264 1209728 1217095 1194168
9175 1194168 1156251 1169013 1202572 1234272 1287389 1324225 1386656 1398303 1391349 1378649 1382720 1317915
9163 1317915 1306981 1341389 1394145 1392674 1377393 1362557 1406555 1433997 1424388 1365804 1330948 1318631
9151 1318631 1414446 1499956 1483888 1476068 1448164 1487040 1510238 1548580 1593167 1633077 1650174 1729575
$$ packed form
9235I45421m1829l4159K1247M8287N8363L1361K3741Pl1457N0477K8573N1172
9223A151204k0897k4179m3196O5465K4550K427j3900j8328k6817n4110l461q868
9211A029890K0958N9320n6791k5385J9942K9300M7418K244k7880J8064J749o923
9199A111906j6111r755L8385n2141q3234M7322R5852N4705K4177R581k5473m6189
9187A149025M1889n8772n6550l4968K0142R4727N3332k9002N441K4464P367k2927
9175A194168l7917J2762L3559L1700N3117L6836O2431J1647o954j2700M071o4805
9163A317915j0934L4408N2756j471j5281j4836M3998K7442r609n8584l4856j2317
9151A318631R5815Q5510j6068p820k7904L8876K3198L8342M4587L9910J7097P9401
$$ plain form
9139 1729575 1757863 1753282 1688557 1639814 1630735 1630733 1633233 1736286 1774299 1728445 1691345 1664866 1654042
9126 1654042 1697617 1717998 1750428 1722212 1726040 1789957 1858346 1900328 1924948 1917310 1907422 1898191
9114 1898191 1919680 1942965 1942579 1921831 1935084 1978071 2010223 2020788 2058903 2068792 2124571 2192823
9102 2192823 2208249 2193684 2097421 2030905 2046464 2029360 2075254 2152734 2218227 2216890 2217056 2243803
9090 2243803 2259873 2296358 2303644 2323154 2302569 2289467 2353751 2417231 2425253 2439387 2464499 2494497
9078 2494497 2469829 2395097 2360108 2415221 2489945 2512944 2567125 2610361 2634649 2684374 2681775 2703099
9066 2703099 2711820 2717763 2768995 2818250 2865616 2891061 2903365 2964613 2992224 3017192 3034827 3019648
9054 3019648 3061254 3107064 3160009 3217526 3261298 3291393 3339316 3301352 3307451 3410531 3482822
$$ packed form
9139A729575K8288m581o4725m8743r079kK500J03053L8013m5854l7100k6479j0824
9126A654042M3575K0381L2430k8216L828O3917O8389M1982K4620p638r888r231
9114A898191K1489K3285l86k0748J3253M2987L2152J0565L8115R889N5779O8252
9102B192823J5426j4565r6263o6516J5559j7104M5894P7480O5493j337J66K6747
9090B243803J6070L6485P286J9510k0585j3102O4284O3480Q022J4134K5112K9998
9078B494497k4668p4732l4989N5113P4724K2999N4181M3236K4288M9725k599K1324
9066B703099Q721N943N1232M9255M7366K5445J2304O1248K7611K4968J7635j5179
9054C019648M1606M5810N2945N7517M3772L0095M7923l7964O099J03080P2291
$$ plain form
9043 3482822 3490685 3461101 3531191 3554523 3584716 3590676 3637780 3646065 3664874 3741260 3863820 3866221
9031 3866221 3929579 4006059 4094434 4147837 4123501 4087238 4135792 4206190 4279338 4320180 4404205
9020 4404205 4509504 4530794 4511837 4553790 4644504 4680057 4735890 4798688 4892050 4921059 4944534
9009 4944534 5045397 5122742 5235477 5364755 5450700 5519178 5564751 5616510 5701066 5772103 5819899
8998 5819899 5872650 5966902 6136052 6295959 6373225 6405140 6462799 6577797 6642186 6716966 6784931
8987 6784931 6885972 6981548 7039252 7142292 7243514 7356646 7453097 7537976 7680825 7861617
8977 7861617 8008220 8098803 8184174 8321741 8454264 8599109 8724063 8823897 8972615 9135226
8967 9135226 9255225 9396523 9616551 9801508 9961234 10168974 10440841 10595018 10816274 11032685
$$ packed form
9043C482822P863k9584P0090K3332L0193N960M7104Q285J8809P6386J22560K401
9031C866221O3358P6480Q8375N3403k4336l6263M8554P0398P3148M0842Q4025
9020D404205J05299K1290j8957M1953R0714L5553N5833O2798R3362K9009K3475
9009D944534J00863P7345J12735J29278Q5945O8478M5573N1759Q4556P1037M7796
8998E819899N2751R4252J69150J59907P7266L1915N7659J14998O4389P4780O7965
8987F784931J01041R5576N7704J03040J01222J13132R6451Q4879J42849J80792
8977G861617J46603R0583Q5371J37567J32523J44845J24954R9834J48718J62611
8967I135226J19999J41298K20028J84957J59726K07740K71867J54177K21256K16411
$$ plain form
8957 11032685 11230418 11424868 11574505 11783500 12030853 12307983 12581060 12896567 13227935
8948 13227935 13514562 13832808 14116727 14366836 14663880 14917847 15162998 15383139 15654728
8939 15654728 15962957 16291711 16614004 16966517 17287827 17595082 17960343 18368790 18735372
8930 18735372 19119522 19532658 19969811 20415478 20878889 21318202 21796670 22283579 22804968
8921 22804968 23321733 23829333 24383916 24921472 25458510 26087767 26713979 27342703 27996609
8912 27996609 28667164 29386790 30110864 30768557 31445648 32161008 32885852 33635121 34425486
8903 34425486 35265251 36083563 36863304 37585641 38347449 39101826 39933036 40733651 41480295
8894 41480295 42234356 42962824 43700621 44386733 44975136 45630860 46257662 46845743 47481173
$$ packed form
8957A1032685J97733J94450J49637K08995K47353K77130K73077L15507L31368
8948A3227935K86627L18246K83919K50109K97044K53967K45151K20141K71589
8939A5654728L08229L28754L22293L52513L21310L07255L65261M08447L66582
8930A8735372L84150M13136M37153M45667M63411M39313M78468M86909N21389
8921B2804968N16765N07600N54583N37556N37038O29257O26212O28724O53906
8912B7996609O70555P19626P24074O57693O77091P15360P24844P49269P90365
8903C4425486Q39765Q18312P79741P22337P61808P54377Q31210Q00615P46644
8894D1480295P54061P28468P37797O86112N88403O55724O26802N88081O35430
$$ plain form
8885 47481173 48057575 48612646 49129325 49601806 50017222 50381345 50745819 51167086 51465785
8876 51465785 51724070 51926756 52033250 52086017 52170496 52132977 52034616 51949115 51786696 51479635
8866 51479635 51138966 50832828 50476132 50058974 49551770 49054999 48490000 47931757 47314281
8857 47314281 46674926 46012448 45364208 44731159 44040589 43295967 42566304 41811147 40994283
8848 40994283 40156379 39333206 38544922 37761305 36890858 36006853 35165717 34334588 33577236
8839 33577236 32842356 32070006 31299637 30573452 29877660 29190446 28481935 27785480 27161990
8830 27161990 26588943 26018676 25403422 24851988 24317782 23764238 23200874 22675981 22162143
8821 22162143 21608666 21099704 20657636 20261765 19860612 19390226 18869026 18426410 18073936
$$ packed form
8885D7481173N76402N55071N16679M72481M15416L64123L64474M21267K98699
8876E1465785K58285K02686J06494N2767Q4479l7519r8361q5501j62419l07061
8866E1479635l40669l06138l56696m17158n07204m96771n64999n58243o17476
8857D7314281o39355o62478o48240o33049o90570p44622p29663p55157q16864
8848D0994283q37904q23173p88284p83617q70447q84005q41136q31129p57352
8839C3577236p34880p72350p70369p26185o95792o87214p08511o96455o23490
8830B7161990n73047n70267o15254n51434n34206n53544n63364n24893n13838
8821B2162143n53477n08962m42068l95871m01153m70386n21200m42616l52474
$$ plain form
8812 18073936 17708257 17376710 17054668 16699895 16372410 16087728 15856493 15582480 15220252
8803 15220252 14860164 14591267 14297047 13947093 13586443 13276867 13015816 12727775 12382501
8794 12382501 12116640 11915134 11687678 11437464 11224849 11017877 10777494 10533119 10321575
8785 10321575 10083370 9890122 9788166 9684504 9508503 9320666 9113768 8887895 8722102
8776 8722102 8631430 8545843 8454650 8298388 8207859 8046681 7849797 7730007 7658216 7472070
8766 7472070 7353126 7263884 7157367 7043634 6975306 6830409 6674094 6552234 6498646 6463918
8756 6463918 6347795 6271478 6122083 5979969 5936033 5838381 5690782 5614475 5551179 5487746 5387714
8745 5387714 5337667 5208139 5069525 5005734 4914906 4852332 4844226 4769060 4700964 4663866 4598973
$$ packed form
8812A8073936l65679l31547l22042l54773l27485k84682k31235k74013l62228
8803A5220252l60088k68897k94220l49954l60650l09576k61051k88041l45274
8794A2382501k65861k01506k27456k50214k12615k06972k40383k44375k11544
8785A0321575k38205j93248j01956j03662j76001j87837k06898k25873j65793
8776H722102r0672q5587r1193j56262r0529j61178j96884j19790p1791j86146
8766G472070j18944q9242j06517j13733o8328j44897j56315j21860n3588l4728
8756F463918j16123p6317j49395j42114m3936r7652j47599p6307o3296o3433j00032
8745E387714n0047j29528j38614o3791r0828o2574q106p5166o8096l7098o4893
$$ plain form
8734 4598973 4505851 4438723 4400056 4360553 4304926 4271966 4220585 4165377 4125723 4108344 4058188
8723 4058188 4049307 3993130 3865877 3755859 3692869 3662473 3620390 3608827 3639926 3586536 3501153
8712 3501153 3456215 3436462 3385590 3322738 3360255 3307119 3221152 3135091 3136881 3148804 3115794 3089497
8700 3089497 2998300 2962031 2930621 2913948 2898309 2869324 2821957 2872037 2861548 2818131 2767720
8689 2767720 2752684 2726448 2660201 2580097 2515375 2544694 2609449 2597409 2526588 2536423 2478558 2393170
8677 2393170 2306122 2283380 2328592 2338933 2331560 2351782 2285875 2178823 2114272 2147616 2214977
8666 2214977 2178933 2123155 2086557 2068468 2063282 2012370 2043575 2099860 2072957 2024961 2018735 2022740
8654 2022740 2004871 1971560 1926630 1868560 1903790 1901707 1813614 1846762 2011695 2160159 2291452
$$ packed form
8734D598973r3122o7128l8667l9503n5627l2960n1381n5208l9654j7379n0156
8723D058188q881n6177j27253j10018o2990l0396m2083j1563L1099n3390q5383
8712C501153m4938j9753n0872o2852L7517n3136q5967q6061J790J1923l3010k6297
8700C089497r1197l6269l1410j6673j5639k8985m7367N0080j0489m3417n0411
8689B767720j5036k6236o6247q0104o4722K9319O4755j2040p0821R835n7865q5388
8677B393170q7048k2742M5212J0341p373K0222o5907j07052o4551L3344O7361
8666B214977l6044n5778l6598j8089n186n0912L1205N6285k6903m7996o226M005
8654B022740j7869l3311m4930n8070L5230k083q8093L3148J64933J48464J31293
$$ plain form
8643 2291452 2423189 2599753 2648186 2533278 2303839 2133577 1997896 1908230 1878209 1792214
8633 1792214 1693006 1622230 1596435 1576005 1577561 1630130 1634517 1653268 1626722 1619204 1602681 1612988
8621 1612988 1672539 1659228 1647928 1640241 1618935 1554008 1489631 1443791 1426381 1500647 1575746 1585920
8609 1585920 1555618 1529239 1493353 1428193 1453152 1526666 1575257 1684538 1772081 1942825 2197385
8598 2197385 2560028 2974830 3107536 2701137 2258126 2000043 1849728 1686211 1635136 1677223
8588 1677223 1683166 1674291 1655499 1627850 1658397 1712256 1674157 1740507 1800721 1863434 1961163 2038788
8576 2038788 2110154 2051132 1867114 1694205 1518267 1411068 1328062 1304793 1276001 1258191 1233120
8565 1233120 1153937 1126170 1170694 1137684 1099542 1096249 1152603 1170990 1223716 1308414 1399005 1509806
$$ packed form
8643B291452J31737J76564M8433j14908k29439j70262j35681q9666l0021q5995
8633A792214r9208p0776k5795k0430J556N2569M387J8751k6546p518j6523J0307
8621A612988N9551j3311j1300p687k1306o4927o4377m5840j7410P4266P5099J0174
8609A585920l0302k6379l5886o5160K4959P3514M8591J09281Q7543J70744K54560
8598B197385L62643M14802J32706m06399m43011k58083j50315j63517n1075M2087
8588A677223N943q875j8792k7649L0547N3859l8099O6350O0214O2713R7729P7625
8576B038788P1366n9022j84018j72909j75938j07199q3006k3269k8792j7810k5071
8565A233120p9183k7767M4524l3010l8142l293N6354J8387N2726Q4698R0591J10801
$$ plain form
8553 1509806 1680000 1825407 1774397 1579239 1381480 1211748 1080326 1028831 980745 982408
8543 982408 975972 1003594 949315 903815 917951 908740 919803 914090 915521 954689 1014844 1048094
8531 1048094 1060553 1053105 1021283 948656 853333 833447 844922 892979 885585 878874 864066 812272
8519 812272 724934 688872 679016 763172 772532 758092 753752 752927 742888 690516 690101 692149 712465
8506 712465 743416 726422 722076 775821 758496 720159 746308 767503 731084 735259 775855 724850
8494 724850 662042 626703 625318 644845 599620 501883 519680 556836 588855 580444 607527 606546
8482 606546 602466 608280 595094 586289 577798 538372 533320 574025 629713 629450 655185 702155 752146
8469 752146 828042 902531 978438 1121539 1118704 932981 769107 679685 688887 705034 660872
$$ packed form
8553A509806J70194J45407n1010j95158j97759j69732j31422n1495m8086J663
8543I82408o436K7622n4279m5500J4136r211J1063n713J431L9168O0155L3250
8531A048094J2459p448l1822p2627r5323j9886J1475M8057p394o711j4808n1794
8519H12272q7338l6062r856Q4156R360j4440m340q25j0039n2372m15K048K0316
8506G12465L0951j6994m346N3745j7325l8337K6149K1195l6419M175M0596n1005
8494G24850o2808l5339j385J9527m5225r7737J7797L7156L2019q411K7083r81
8482F06546m080N814j3186q805q491l9426n052M0705N5688k63K5735M6970M9991
8469G52146P5896P4489P5907J43101k835j85723j63874q9422R202J6147m4162
$$ plain form
8458 660872 636035 645621 636590 578885 528858 497264 506037 550279 537646 538536 609438 700704 652770
8445 652770 633547 632339 675645 692693 688054 677428 579648 561960 471616 438572 458274 444458
8433 444458 409592 396739 376562 445980 500590 532174 578972 618883 604550 528372 508033 508790
8421 508790 498578 486840 509725 502086 481950 488588 518655 557122 566586 521852 494997 473580
8409 473580 477065 470008 452864 412756 434024 459863 417548 425960 473334 450905 365792 384646
8397 384646 488259 561126 486746 412393 420676 440641 424217 446005 454208 515652 561959 537885
8385 537885 549961 555941 526255 496616 461804 424249 422552 460206 438805 408982 394508 400520
8373 400520 400847 435164 490971 564382 533600 529946 584980 599161 649531 797281 1058766 1233841
$$ packed form
8458F60872k4837R586r031n7705n0027l1594Q773M4242j2633Q90P0902R1266m7934
8445F52770j9223j208M3306J7048m639j0626r7780j7688r0344l3044J9702j3816
8433D44458l4866j2853k0177O9418N4610L1584M6798L9911j4333p6178k0339P57
8421E08790j0212j1738K2885p639k0136O638L0067L8467R464m4734k6855k1417
8409D73580L485p057j7144m0108K1268K5839m2315Q412M7374k2429q5113J8854
8397C84646J03613P2867p4380p4353Q283J9965j6424K1788Q203O1444M6307k4074
8385E37885J2076N980k9686k9639l4812l7555j697L7654k1401k9823j4474O012
8373D00520L27L4317N5807P3411l0782l654N5034J4181N0370J47750K61485J75075
$$ plain form
8361 1233841 1159920 946184 786605 667985 569394 476703 407936 406204 391653 354469 351774
8350 351774 389238 413484 390498 393899 428899 468091 483327 435696 445771 466769 457958 446108
8338 446108 387595 404244 452726 410473 390669 354196 324896 351046 357873 363270 374796 439671
8326 439671 527684 664507 862914 1060233 1163855 1127340 837375 617224 518731 471357
8316 471357 360733 316903 310600 292366 286969 305656 296041 285433 302816 217787 171884 224121
8304 224121 241819 195976 216241 297288 314001 276009 265856 237398 258557 311823 342546 337534
8292 337534 340420 374534 349321 292801 263322 300514 246037 268498 268945 280352 288674 237886
8280 237886 229508 193057 187455 238858 287480 294182 312366 343878 287419 237969 244723 271181
$$ packed form
8361A233841p3921k13736j59579j18620r8591r2691o8767j732j4551l7184k695
8350C51774L7464K4246k2986L401L5000L9192J5236m7631J0075K0998q811j1850
8338D46108n8513J6649M8482m2253j9804l6473k9300K6150O827N397J1526O4875
8326D39671Q8013J36823J98407J97319J03622l6515k89965k20151r8493m7374
8316D71357j10624m3830o303j8234n397J8687r615j0608J7383q5029m5903N2237
8304B24121J7698m5843K0265Q1047J6713l7992j0153k8458K1159N3266L0723n012
8292C37534K886L4114k5213n6520k9479L7192n4477K2461M47J1407Q322n0788
8280B37886q378l6451n602N1403M8622O702J8184L1512n6459m9450O754K6458
$$ plain form
8268 271181 295896 296152 303102 248283 281371 295925 312775 295764 351031 340808 258517 222858
8256 222858 174732 199062 234284 267490 231486 160330 156061 126604 164359 156858 138612 98981
8244 98981 114687 148127 218768 227793 281594 287374 251238 267128 299133 334923 341363 309293
8232 309293 281248 240850 237281 313165 334748 313390 277859 275055 233961 211877 216897 217428 223538
8219 223538 224806 164373 128766 176494 207249 180446 177306 215909 226269 210667 222254 247891
8207 247891 246698 298690 325064 284889 255493 334423 340760 331627 324318 381919 523605 560044
8195 560044 637485 652346 705545 811404 927846 1056331 1232171 1569552 2055383 2611080
8185 2611080 3004549 3590854 4275633 4937932 5830808 6873805 6890004 5526400 3876161
$$ packed form
8268B71181K4715K56O950n4819L3088J4554J6850j7011N5267j0223q2291l5659
8256B22858m8126K4330L5222L3206l6004p1156m269k9457L7755p501j8246l9631
8244I8981J5706L3440P0641R025N3801N780l6136J5890L2005L5790O440l2070
8232C09293k8045m0398l569P5884K1583k1358l5531k804m1094k2084N020N31O110
8219B23538J268o0433l5607M7728L0755k6803l140L8603J0360j5602J1587K5637
8207B47891j193N1992K6374m0175k9396P8930O337r133p309N7601J41686L6439
8195E60044P7441J4861N3199J05859J16442J28485J75840L37381M85831N55697
8185B611080L93469N86305O84779O62299Q92876J042997J6199j363604j650239
$$ plain form
8176 3876161 2648400 1922109 1524410 1282430 1093401 1027602 1005358 983644 959278 1059661
8166 1059661 1203325 1361943 1509779 1733762 1913824 1998507 2047585 1987877 1811414 1643472
8156 1643472 1388811 1165655 1007433 940144 914442 839548 809007 815139 933467 1099999 1344281
8145 1344281 1726309 2189406 2625829 3146799 3729192 4403658 5106493 6017777 6603873 5931187
8135 5931187 4388243 3020097 2139084 1581293 1313819 1118798 906405 832822 765398 718916
8125 718916 736326 812921 865347 930700 1125537 1360962 1574740 1735944 1984823 2436603
8115 2436603 2927248 3256860 3240941 2942770 2532523 2087082 1630692 1278025 968143 750317
8105 750317 605495 486307 420054 387708 359909 366265 383668 362540 354448 338750 325272 338666
$$ packed form
8176C876161j227761p26291l97699k41980j89029o5799k2244k1714k4366J00383
8166A059661J43664J58618J47836K23983J80062Q4683M9078n9708j76463j67942
8156A643472k54661k23156j58222o7289k5702p4894l0541O132J18328J66532K44282
8145A344281L82028M63097M36423N20970N82393O74466P02835R11284N86096o72686
8135E931187j542944j368146q81013n57791k67474j95021k12393p3583o7424m6482
8125G18916J7410P6595N2426O5353J94837K35425K13778J61204K48879M51780
8115B436603M90645L29612j5919k98171m10247m45441m56390l52667l09882k17826
8105G50317j44822j19188o6253l2346k7799O356J7403k1128q092j5698j3478J3394
$$ plain form
8093 338666 383446 380878 329658 231968 117401 139090 169797 184186 168396 226494 264365 300974
8081 300974 366034 398349 349757 277143 376227 478520 514441 593496 742548 954877 1076976
8070 1076976 1155967 1246146 1279049 1244604 1148738 1051192 931865 798000 652802 506502 386857
8059 386857 319587 262734 266641 245181 214126 188047 157811 161133 206518 252894 279952 248408
8047 248408 201811 134295 96290 134437 131948 93208 87122 160903 222187 189052 185803 175340
8035 175340 148698 170658 227383 285478 285158 256931 170994 178965 227654 251954 268333 268673 259741
8022 259741 248900 219394 169442 185496 205423 213530 159565 165795 201555 166887 138538 118519
8010 118519 113257 104273 83214 119505 116454 110451 148876 189651 244215 238910 208328 252948 261844
$$ packed form
8093C38666M4780k568n1220r7690j14567K1689L0707J4389j5790N8098L7871L6609
8081C00974O5060L2315m8592p2614R9084J02293L5921P9055J49052K12329J22099
8070A076976P8991R0179L2903l4445r5866r7546j19327j33865j45198j46300j19645
8059C86857o7270n6853L907k1460l1055k6079l0236L322M5385M6376K7058l1544
8047B48408m6597o7516l8005L8147k489l8740o086P3781O1284l3135l249j0463
8035A75340k6642K1960N6725N8095l20k8227q5937P971M8689K4300J6379L40q932
8022B59741j0841k9506m9952J6054J9927Q107n3965O230L5760l4668k8349k0019
8010A18519n262q984k1059L6291l051o003L8425M0775N4564n305l0582M4620Q896
$$ plain form
7997 261844 264277 266833 213151 190375 184347 140917 102279 147606 169915 216722 268400 318814
7985 318814 287728 230945 178111 170513 145918 203055 262407 207519 195939 228273 201324 162320
7973 162320 242974 248499 222782 232965 238866 192909 202412 237661 218778 222798 228012 213174 199212
7960 199212 142796 114261 150075 159997 188895 209940 198449 115519 83115 138047 212897 276314
7948 276314 317285 317115 293135 243261 204007 238498 266287 223080 199935 213876 211136 229572
7936 229572 182151 159527 188186 213102 143081 104517 58979 77576 89969 129018 76308 69817
7924 69817 114332 104811 123103 194465 207936 182007 150611 184920 183985 201173 222133 252193
7912 252193 262300 229818 179227 163441 158446 118708 106052 110396 124942 142340 162770 157943
$$ packed form
7997B61844K433K556n3682k2776o028m3430l8638M5327K2309M6807N1678N0414
7985C18814l1086n6783n2834p598k4595N7137N9352n4888j1580L2334k6949l9004
7973A62320Q0654N525k5717J0183N901m5957R503L5249j8883M020N214j4838j3962
7960A99212n6416k8535L5814R922K8898K1045j1491q2930l2404N4932P4850O3417
7948B76314M0971j70k3980m9874l9254L4491K7789m3207k3145J3941k740J8436
7936B29572m7421k2624K8659K4916p0021l8564m5538J8597J2393L9049n2710o491
7924F9817M4515r521J8292P1362J3471k5929l1396L4309r35J7188K0960L0060
7912B52193J0107l2482n0591j5786m995l9738j2656M344J4546J7398K0430m827
$$ plain form
7900 157943 95341 58836 115268 160970 210440 228433 181984 118128 54753 26335 56628 115532
7888 115532 130516 174217 100201 92206 136855 167369 86636 20302 3852 -7864 26189 84197
7876 84197 115784 116317 143382 195246 148216 122316 157378 215360 162284 137929 96924 96574 87145
7863 87145 90792 72100 43020 -7085 13374 25726 44724 14232 18848 71322 95683 68362
7851 68362 78528 102651 122789 67512 19785 23710 78411 161087 125106 92129 83665 28447
7839 28447 45426 126086 193818 116070 54161 77138 63031 45549 69105 49114 25592 3161
7827 3161 -70506 -33316 15030 -15248 -38417 28971 71290 88072 67627 80759 91069 78292
7815 78292 83960 119947 100557 78261 49113 67870 81760 35543 58874 74686 78318 52745
$$ packed form
7900A57943o2602l6505N6432M5702M9470J7993m6449o3856o3375k8418L0293N8904
7888A15532J4984M3701p4016p995M4649L0514q0733o6334j6450j1716L4053N8008
7876H4197L1587N33K7065N1864m7030k5900L5062N7982n3076k4355m1005l50r429
7863H7145L647j8692k9080n0105K0459J2352J8998l0492M616N2474K4361k7321
7851F8362J0166K4123K0138n5277m7727L925N4701Q2676l5981l2977q464n5218
7839B8447J6979Q0660O7732p7748o1909K2977j4107j7482K3556j9991k3522k2431
7827C161p3667L7190M8346l0278k3169O7388M2319J6782k0445J3132J0310j2777
7815G8292N668L5987j9390k2296k9148J8757J3890m6217K3331J5812L632k5573
$$ plain form
7803 52745 -21381 -67327 -40488 -48858 -5943 38009 39202 9987 40506 46027 35263 37461 59933
7790 59933 67890 61032 50405 60766 25005 7968 23282 -2353 -9799 39050 5822 54399
7778 54399 31930 10094 11934 47345 83012 87301 106861 60051 47551 117756 149455 153792
7766 153792 122659 99813 74457 24776 36956 53510 100855 127783 94878 110481 119990 74492
7754 74492 49410 64550 65796 78176 75186 4737 -28761 10324 42863 28626 -29683 -33191
7742 -33191 39301 67430 102542 171329 151409 148968 143219 107076 49057 40891 28043 55678
7730 55678 46689 27855 6128 -11553 -32190 -46620 -49847 -36753 -68845 -45892 -28541 -36402
7718 -36402 18707 -15707 27800 35209 39754 92065 128304 129936 107187 77905 46539 -34254
$$ packed form
7803E2745p4126m5946K6839q370M2915M3952J193k9215L0519N521j0764K198K2472
7790E9933P957o858j0627J0361l5761j7037J5314k5635p446M8849l3228M8577
7778E4399k2469k1836J840L5411L5667M289J9560m6810j2500P0205L1699M337
7766A53792l1133k2846k5356m9681J2180J6554M7345K6928l2905J5603R509m5498
7754G4492k5082J5140J246J2380k990p0449l3498L9085L2539j4237n8309l508
7742c3191P2492K8129L5112O8787j9920k441n749l6143n8019q166j2848K7635
7730E5678q989j8834k1727j7681k0637j4430l227J3094l2092K2953J7351p861
7718c6402N5109l4414M3507P409M545N2311L6239J632k2749k9282l1366q0793
$$ plain form
7706 -34254 -69998 -49495 -22790 -36168 -21453 16219 909 -14736 -13688 -12572 -55920 -85513
7694 -85513 -32996 14537 -15067 -45839 -29668 -18449 1137 -13672 -18447 20197 72050 16895
7682 16895 -31863 -27902 -39584 -22831 25082 51942 21915 51346 104504 62065 23142 4271
7670 4271 -16437 -10591 45151 76104 59025 74490 59637 28958 33844 67890 111254 49393
7658 49393 24126 -11011 -14592 31610 26374 10118 385 44023 91405 81765 42714 40110 28269
7645 28269 4236 -34666 -83468 -91211 -106660 -88659 -9480 -3614 -30264 -61679 -96370 -87182
7633 -87182 -24422 11542 6708 473 -72338 -78407 -7116 -15576 -3009 7092 -57002 -73021 -15226
7620 -15226 17378 23922 25146 19753 -32131 11147 62233 110554 85217 55516 72134 85799
$$ packed form
7706c4254l5744K0503K6705j3378J4715L7672j5310j5645J048J116m3348k9593
7694h5513N2517M7533k9604l0772J6171J1219J9586j4809m775L8644N1853n5155
7682A6895m8758L961j1682J6753M7913K6860l0027K9431N3158m2439l8923j8871
7670D271k0708N846N5742L0953j7079J5465j4853l0679M886L4046M3364o1861
7658D9393k5267l5137l581M6202n236j6256r733M3638M7382r640l9051k604j1841
7645B8269k4033l8902m8802p743j5449J8001P9179N866k6650l1415l4691R188
7633h7182O2760L5964m834o235p2811o069P1291q460J2567J0101o4094j6019N7795
7620a5226L2604O544J224n393n1884M3278N1086M8321k5337k9701J6618J3665
$$ plain form
7608 85799 136222 90654 69855 44086 59770 50563 6072 -3672 -22178 -34978 -13104 -13824 -807
7595 -807 -29510 24256 34599 49599 17479 -62980 -70499 -9418 -30328 6677 1635 22340 45543
7582 45543 89728 72718 44563 25187 -14247 -15004 31033 43922 38643 -1240 -31000 -21273 -20123
7569 -20123 -26893 -10302 -12462 -37005 -4799 38416 64639 109642 107085 65534 5216 -40814
7557 -40814 -64556 -71378 -95124 -73293 11693 -10594 -34218 31588 87165 69262 35371 16503
7545 16503 -15910 -8555 51206 86366 160646 194897 154893 119603 106797 91226 10177 19879
7533 19879 -7620 20371 46838 83413 77581 53987 83557 93163 71366 21468 1666 -85
7521 -85 -15604 -2162 35528 43580 76828 131402 125605 66367 27876 1851 10152 31557 50394
$$ packed form
7608H5799N0423m5568k0799k5769J5684r207m4491r744j8506j2800K1874p20J3017
7595h07k8703N3766J0343J5000l2120q0459p519O1081k0910L7005n042K0705K3203
7582D5543M4185j7010k8155j9376l9434p57M6037J2889n279l9883k9760R727J150
7569b0123o770J6591k160k4543L2206M3215K6223M5003k557m1551o0318m6030
7557d0814k3742o822k3746K1831Q4986k2287k3624O5806N5577j7903l3891j8868
7545A6503l2413P355N9761L5160P4280L4251m0004l5290j2806j5571q1049R702
7533A9879k7499K7991K6467L6575n832k3594K9570R606k1797m9898j9802j751
7521h5j5519J3442L7690Q052L3248N4574n797n9238l8491k6025Q301K1405J8837
$$ plain form
7508 50394 42927 49070 74958 53448 3754 -67831 -102220 -128755 -126029 -55581 17570 5592
7496 5592 7652 72445 58632 26538 8810 -50128 -31645 12967 40149 97546 116698 74655
7484 74655 21704 21337 57663 3796 -30939 -13132 -2792 34087 12697 -19558 20113 65493
7472 65493 55797 21142 49275 82380 119781 110064 132705 139642 133215 87393 14381 -20190 -14916
7459 -14916 -29962 -10433 -15751 18244 -23040 -33302 -25663 -4986 -586 -655 -24425 2445 39660
7446 39660 52024 46422 17531 47199 63729 73717 28773 55234 72831 15134 14053 -6220
7434 -6220 -5810 -15430 -1277 -22716 -18064 22135 15336 23949 12843 -10049 -73092 -51415 -9424
7421 -9424 -6612 -19589 41 18749 48198 53660 17433 18678 57053 34668 2701 -44913 -53715
$$ packed form
7508E0394p467O143K5888k1510m9694p1585l4389k6535K726P0448P3151j1978
7496E592K060O4793j3813l2094j7728n8938J8483M4612K7182N7397J9152m2043
7484G4655n2951l67L6326n3867l4735J7807J0340L6879k1390l2255L9671M5380
7472F5493r696l4655K8133L3105L7401r717K2641O937o427m5822p3012l4571N274
7459a4916j5046J9529n318L3995m1284j0262P639K0677M400o9k3770K6870L7215
7446C9660J2364n602k8891K9668J6530R988m4944K6461J7597n7697j081k0273
7434f220M10r620J4153k1439M652M0199o799Q613j1106k2892o3043K1677M1991
7421i424K812j2977J9630J8708K9449N462l6227J245L8375k2385l1967m7614q802
$$ plain form
7408 -53715 -13607 -3603 -24507 28501 41518 56707 63203 54595 46747 32214 82327 129286
7396 129286 118130 121009 72671 -14167 -31707 16316 15988 -14638 13875 18478 -3395 20909
7384 20909 41967 28955 -28590 -33248 -9076 -25758 -1423 1173 6895 14768 -21111 -24208 -39910
7371 -39910 -66939 -45912 -28468 -39900 -44720 35822 38636 -10226 586 1731 7482 35528 47156
7358 47156 -1983 -36176 46072 101822 111733 80034 68001 67721 9387 -80017 -130805 -123428 -83451
7345 -83451 -59601 -30726 -73238 -98533 -55103 -54918 -45951 -14488 4918 41009 54344 7017
7333 7017 15016 71305 69444 18945 -844 42750 63350 55597 13464 -2254 10627 36461 32315
7320 32315 26137 59238 137545 156201 86444 34548 -17786 -52865 -49461 -4124 20520 -16652
$$ packed form
7408e3715M0108J0004k0904N3008J3017J5189O496q608p848j4533N0113M6959
7396A29286j1156K879m8338q6838j7540M8023l28l0626K8513M603k1873K4304
7384B0909K1058j3012n7545m658K4172j6682K4335K596N722P873l5879l097j5702
7371c9910k7029K1027J7444j1432m820Q0542K814m8862J0812J145N751K8046J1628
7358D7156m9139l4193Q2248N5750R911l1699j2033k80n8334q9404n0788P377L9977
7345h3451K3850K8875m2512k5295M3430J85Q967L1463J9406L6091J3335m7327
7333G017P999N6289j861n0499j9789M3594K0600p753m2133j5718J2881K5834m146
7320C2315o178L3101P8307J8656o9757n1896n2334l5079L404M5337K4644l7172
$$ plain form
7308 -16652 -49564 -7732 35959 28677 61963 22991 -46447 -78004 -91443 -50448 -5945 -30850
7296 -30850 -55164 -17002 -44668 -27752 -48877 -46412 -14400 36414 75938 95154 74463 86203
7284 86203 75045 49312 99342 123311 54345 -22907 -43628 -9721 -6223 -24203 -43238 -62847
7272 -62847 -62906 -15228 -27174 -42169 -18441 -3933 -17267 -15733 30820 32404 12625 -6949 -30718
7259 -30718 -44848 -33082 -39019 -53165 -48592 -69899 -82872 -39337 -16055 -87027 -92770 -81974
7247 -81974 -51599 15352 41905 -20189 -55720 -42019 -26657 -11460 68367 82655 86703 58230
7235 58230 3166 -28713 -28518 -21818 -18387 14604 -5663 -36119 -815 -21304 -25288 -56864 -80493
7222 -80493 -115532 -92711 -30146 -9465 -3398 -64364 -103677 -83474 -58192 -47455 -10394 -12144
$$ packed form
7308a6652l2912M1832M3691p282L3286l8972o9438l1557j3439M0995M4503k4905
7296c0850k4314L8162k7666J6916k1125K465L2012N0814L9524J9216k0691J1740
7284H6203j1158k5733N0030K3969o8966p7252k0721L3907L498j7980j9035j9609
7272f2847n9M7678j1946j4995K3728J4508j3334J534M6553J584j9779j9574k3769
7259c0718j4130J1766n937j4146M573k1307j2973M3535K3282p0972n743J0796
7247h1974L0375O6951K6553o2094l5531J3701J5362J5197P9827J4288M048k8473
7235E8230n5064l1879J95O700L431L2991k0267l0456L5304k0489l984l1576k3629
7222h0493l5039K2821O2565K0681O067o0966l9313K0203K5282J0737L7061j750
$$ plain form
7210 -12144 36621 56918 -1762 4501 16815 57172 -9332 -30317 -3386 5537 13420 20539 3832
7197 3832 -25659 6057 12614 -39037 -33672 -61662 -36482 -60252 -54259 -58756 -91792 -30360 41600
$$ packed form
7210a2144M8765K0297n8680O263J2314M0357o6504k0985K6931Q923P883P119j6707
7197C832k9491L1716O557n1651N365k7990K5180k3770N993m497l3036O1432P1960
$$ [...]
##END NTUPLES=NMR SPECTRUM
##END=
