##TITLE=Analysis number 328734
Compound Code cc 55410
Book Reference 470/190
Project Code adrs
Chemist Name mikem
##JCAMPDX= 6.0         $$ Bruker NMR JCAMP-DX V2.0
##DATA TYPE= NMR SPECTRUM
##DATA CLASS= NTUPLES
##ORIGIN= Bruker BioSpin GmbH
##OWNER= nmr
$$ XWIN-NMR		Version 3.5
$$ Thu Jun 28 12:42:36 2007 GMT Daylight Time (UT+1h)  MAYBRIDGE\nmr@NMR_250MHZ
##.OBSERVE FREQUENCY= 250.131544655141
##.OBSERVE NUCLEUS= ^1H
##.ACQUISITION MODE= SIMULTANEOUS (DQD)
##.ACQUISITION SCHEME= undefined
##.AVERAGES= 16
##.DIGITISER RES= 18
##SPECTROMETER/DATA SYSTEM= dpx250
##.PULSE SEQUENCE= zg30
##.SOLVENT NAME= CDCl3
##.SHIFT REFERENCE= (INTERNAL, CDCl3, 0, 16.522)
##AUDIT TRAIL= $$ (NUMBER, WHEN, WHO, WHERE, WHAT)
$$ ##TITLE= Audit trail, XWIN-NMR		Version 3.5
$$ ##JCAMPDX= 5.01
$$ ##ORIGIN= Bruker BioSpin GmbH
$$ ##OWNER= nmr
$$ C:\u/data/dgb/nmr/ADRS/2200/pdata/1/auditp.txt
$$ ##AUDIT TRAIL=  $$ (NUMBER, WHEN, WHO, WHERE, WHAT)
(   1,<2007-06-28 12:41:56.61 +100>,<MAYBRIDGE\nmr>,<NMR_250MHZ>,
      <created by zg, POWCHK disabled, PULCHK disabled
       configuration hash MD5:
       76 6E 9A 78 1E 09 19 81 EC 84 63 8F B0 6A 59 2D
       data hash MD5: 64K
       06 FD 62 FD FF 45 C4 07 A0 4E AE 05 21 A0 B1 2B>)
(   2,<2007-06-28 12:42:15.13 +100>,<MAYBRIDGE\nmr>,<NMR_250MHZ>,
      <Start of raw data processing
       ef LB = 0.3 FT_mod = 6 PKNL = 1 SI = 32K 
       data hash MD5: 32K
       47 80 CC 53 AC DF 9C 49 56 47 89 48 E9 1B 7D EC>)
(   3,<2007-06-28 12:42:19.63 +100>,<MAYBRIDGE\nmr>,<NMR_250MHZ>,
      <apk 
       data hash MD5: 32K
       D8 1F 05 31 9D CD F6 48 1E 5C 37 04 28 BE BA 0A>)
(   4,<2007-06-28 12:42:21.10 +100>,<MAYBRIDGE\nmr>,<NMR_250MHZ>,
      <abs ABSG = 5 
       data hash MD5: 32K
       31 E6 46 1A CF 10 EF 28 17 B3 85 D1 9E 4B 23 67>)
$$ ##END=
$$ 
$$ hash MD5
$$ 27 1C 66 2E 99 4A CF 8E BD 62 28 17 60 D3 C8 B8
##$RELAX= 
##$RELAX= 
##$RELAX= 
##$RELAX= 
##$RELAX= 
##$RELAX= 
##$RELAX= 
$$ Bruker specific parameters
$$ --------------------------
##$DU= <C:\u>
##$EXPNO= 2200
##$NAME= <ADRS>
##$PROCNO= 1
##$TYPE= <nmr>
##$USER= <dgb>
##$AMP= (0..31)
100 100 100 100 100 100 100 100 100 100 100 100 100 100 100 100 100 100 
100 100 100 100 100 100 100 100 100 100 100 100 100 100 
##$AQSEQ= 0
##$AQ_mod= 3
##$AUNM= <au_zg>
##$AUTOPOS= <28 >
##$BF1= 250.13
##$BF2= 250.13
##$BF3= 250.13
##$BF4= 250.13
##$BF5= 500.13
##$BF6= 500.13
##$BF7= 500.13
##$BF8= 500.13
##$BYTORDA= 1
##$CFDGTYP= 0
##$CFRGTYP= 5
##$CHEMSTR= <none>
##$CNST= (0..31)
1 1 145 1 1 1 1 1 1 1 1 1 1 1 1 1 1 1 1 1 1 1 1 1 1 1 1 1 1 1 1 1 
##$CPDPRG= <>
##$CPDPRG1= <>
##$CPDPRG2= <>
##$CPDPRG3= <>
##$CPDPRG4= <mlev>
##$CPDPRG5= <mlev>
##$CPDPRG6= <mlev>
##$CPDPRG7= <mlev>
##$CPDPRG8= <mlev>
##$CPDPRGB= <>
##$CPDPRGT= <>
##$D= (0..31)
0 1 0 0 0 0 0 0 0 0.06 0 0 0 0 0 0 0.0002 0 0 0 0 0 0 0 0 0 0 0 0 0 0 
0 
##$DATE= 1183030907
##$DBL= (0..7)
120 120 120 120 120 120 120 120 
##$DBP= (0..7)
150 150 150 150 150 150 150 150 
##$DBP07= 0
##$DBPNAM0= <>
##$DBPNAM1= <>
$$ [...]
##$SUBNAM7= <"">
##$SUBNAM8= <"">
##$SUBNAM9= <"">
##$SW= 20.6930455092707
##$SWIBOX= (0..15)
0 0 3 0 0 0 0 0 0 0 0 0 0 0 0 0 
##$SW_h= 5175.983436853
##$TD= 65536
##$TD0= 1
##$TE= 295.16
##$TE2= 300
##$TE3= 300
##$TEG= 300
##$TL= (0..7)
0 120 120 120 120 120 120 120 
##$TP= (0..7)
150 150 150 150 150 150 150 150 
##$TP07= 0
##$TPNAME0= <>
##$TPNAME1= <>
##$TPNAME2= <>
##$TPNAME3= <>
##$TPNAME4= <>
##$TPNAME5= <>
##$TPNAME6= <>
##$TPNAME7= <>
##$TPOAL= (0..7)
0.5 0.5 0.5 0.5 0.5 0.5 0.5 0.5 
##$TPOFFS= (0..7)
0 0 0 0 0 0 0 0 
##$TUNHIN= 0
##$TUNHOUT= 0
##$TUNXOUT= 0
##$USERA1= <user>
##$USERA2= <user>
##$USERA3= <user>
##$USERA4= <user>
##$USERA5= <user>
##$V9= 5
##$VALIST= <valist>
##$VCLIST= <CCCCCCCCCCCCCCC>
##$VD= 0
##$VDLIST= <DDDDDDDDDDDDDDD>
##$VPLIST= <PPPPPPPPPPPPPPP>
##$VTLIST= <TTTTTTTTTTTTTTT>
##$WBST= 1024
##$WBSW= 4
##$XGAIN= (0..3)
0 0 0 0 
##$XL= 0
##$YL= 0
##$YMAX_a= 468974
##$YMIN_a= -448312
##$ZGOPTNS= <>
##$ZL1= 120
##$ZL2= 120
##$ZL3= 120
##$ZL4= 120
##$ABSF1= 16.522
##$ABSF2= -4.171173
##$ABSG= 5
##$ABSL= 3
##$ALPHA= 0
##$AQORDER= 0
##$ASSFAC= 0
##$ASSFACI= 0
##$ASSFACX= 0
##$ASSWID= 0
##$AUNMP= <proc_1d>
##$AZFE= 0.1
##$AZFW= 0.1
##$BCFW= 0
##$BC_mod= 0
##$BYTORDP= 0
##$COROFFS= 0
##$CY= 12.5
##$DATMOD= 1
##$DC= 0
##$DFILT= <>
##$DTYPP= 0
##$F1P= 14.0000005364418
##$F2P= -0.99999901652339
##$FCOR= 0.5
##$FTSIZE= 32768
##$FT_mod= 6
##$GAMMA= 0
##$GB= 0
##$INTBC= 1
##$INTSCL= 1
##$ISEN= 128
##$LB= 0.3
##$LEV0= 0
##$LPBIN= 0
##$MAXI= 10000
##$MC2= 0
##$MEAN= 0
##$ME_mod= 0
##$MI= 0
##$NCOEF= 0
##$NC_proc= -2
##$NLEV= 6
##$NOISF1= 0
##$NOISF2= 0
##$NSP= 0
##$NTH_PI= 0
##$NZP= 0
##$OFFSET= 16.522
##$PC= 1
##$PHC0= -48.6351
##$PHC1= 6.454027
##$PH_mod= 1
##$PKNL= yes
##$PPARMOD= 0
##$PSCAL= 4
##$PSIGN= 0
##$REVERSE= no
##$SF= 250.13
##$SI= 32768
##$SIGF1= 0
##$SIGF2= 0
##$SINO= 400
##$SIOLD= 32768
##$SREGLST= <1H.CDCl3>
##$SSB= 0
##$STSI= 32768
##$STSR= 0
##$SW_p= 5175.98343685301
##$SYMM= 0
##$S_DEV= 0
##$TDeff= 65536
##$TDoff= 0
##$TI= <Analysis number 999999
Compound Code 99
Book Reference 9
Project Code 9>
##$TILT= no
##$TM1= 0
##$TM2= 0
##$TOPLEV= 0
##$USERP1= <user>
##$USERP2= <user>
##$USERP3= <user>
##$USERP4= <user>
##$USERP5= <user>
##$WDW= 1
##$XDIM= 32768
##$YMAX_p= 502026116
##$YMIN_p= -279212
$$ End of Bruker specific parameters
$$ ---------------------------------
##NTUPLES= NMR SPECTRUM
##VAR_NAME=  FREQUENCY,     SPECTRUM/REAL,   SPECTRUM/IMAG
##SYMBOL=    X,             R,               I
##VAR_TYPE=  INDEPENDENT,   DEPENDENT,       DEPENDENT
##VAR_FORM=  AFFN,          ASDF,            ASDF
##VAR_DIM=   32768,         32768,           32768
##UNITS=     HZ,            ARBITRARY UNITS, ARBITRARY UNITS
##FACTOR=    0.157963299565203, 1,           1
##FIRST=     4132.6476996994, 0,             0
##LAST=      -1043.33573715361, 0,           0
##MIN=       -1043.33573715361, -279212,     0
##MAX=       4132.6476996994, 502026116,     0
$$ Real data points
##PAGE= N=1
##DATA TABLE= (X++(R..R)), XYDATA
$$ [...]
17030I572l38r281k217N972O708q90M38P5L447J766q843M027J932K979L317L339
$$ 9572 9234 -47 -2264 3708 10416 9526 9964 10039 13486 15252 6409 10436 12368 15347 18664 22003
17014B2003n92k832n882k235K470L899j708k907O256n026p602J506N340k406j710
$$ 22003 21411 18579 12697 10462 12932 16831 15123 12216 18472 13446 5844 7350 12690 10284 8574
16999H574N621P398j489r77j305m932j184K411K704J980K714k931n175n904N543
$$ 8574 14195 21593 20104 19127 17822 12890 11706 14117 16821 18801 21515 18584 13409 7505 13048
16984A3048J897q16j785L016k810N46k098M178M51k618j97K039L873K367l577
$$ 13048 14945 14129 12344 15360 12550 13096 10998 15176 15627 13009 12812 14851 18724 21091 17514
16969A7514J154q88M316Q403M631K70k183n313j1381n037M692N135R94m580m79
$$ 17514 18668 17780 22096 30499 35130 35400 33217 27904 16523 11486 16178 21313 22307 17727 17248
16954A7248M964L457P051M419K089p098o185O435J2685r86j0342l143o273l701
$$ 17248 22212 25669 32720 37139 39228 32130 25945 32380 45065 44079 33737 30594 24321 20620
16940B0620N011M161K286J69l797R47O51j777R674O368J216o235o324N248M517
$$ 20620 25631 29792 32078 32247 28450 29397 30048 28271 37945 44313 45529 39294 32970 38218 42735
16925D2735j699Lj66J0410J3105J5284J1439J625K611k293r265j1620r142m032
$$ 42735 41036 41039 40873 51283 64388 79672 91111 92736 95347 93054 83789 72169 63027 58995
16911E8995n141l592J4040Q904M929O399L721k091m002j0107j1347o551p092m829
$$ 58995 53854 50262 64302 73206 78135 84534 88255 86164 82162 72055 60708 54157 47065 42236
16897D2236m700n805q368k85K666J385l889J979k574j353o27N163N181P915K794
$$ 42236 37536 31731 23363 23078 25744 27129 23240 25219 22645 21292 20665 25828 31009 38924 41718
16882D1718j3472m136L739Q94J382k622l949k09N568R560M621q745o234K919O544
$$ 41718 28246 24110 27849 28743 30125 27503 23554 23345 28913 38473 43094 34349 28115 31034 37578
16867C7578M821L42J886n872l979m570L725N736R326L88n75j75M653P657J0968
$$ 37578 42399 42741 44627 38755 34776 30206 33931 39667 48993 49381 48806 48631 53284 60941 71909
16852G1909J3517N374M28J145N642J3490K347N359R414K4873L7237O2485J00196
$$ 71909 85426 90800 91228 92373 98015 111505 113852 119211 128625 153498 190735 253220 353416
16839C53416J40295K23202M24317Q18761Q92258j27509m96884k01304L44377O66507
$$ 353416 493711 716913 1141230 1959991 2852249 2724740 2227856 2026552 2370929 3037436
16829C037436k06068p10186n42307k33652J11677N56977Q65222M1795n29164l08043
$$ 3037436 2831368 2121182 1578875 1345223 1456900 2013877 2879099 2920894 2391730 2083687
16819B083687J82247O27127l3229p69140p08541m70789k81162j51194r3511o3227
$$ 2083687 2265934 2893061 2859832 2090692 1382151 911362 630200 479006 385495 322268
16809C22268m6159k2263o620m814K360j4157j1337q97L401p241j4983j5750l235
$$ 322268 276109 253846 247226 242412 244772 230615 219278 218381 221782 214541 199558 183808 180573
16796A80573N516j407l042K090o043L124K489q616j2355q791o415n974K690J0192
$$ 180573 186089 184682 181640 183730 177687 180811 183300 174684 162329 153538 147123 141149 143839 154031
16782A54031K052k560l185k891J402M273k398p651p729j1027j2635p999m347l793
$$ 154031 156083 153523 150338 147447 148849 153122 150724 143073 135344 124317 111682 103683 99336 95543
16768I5543n199j501j333M139J048K657L260J294L983M456M108J08m64J438L042
$$ 95543 90344 88843 87510 91649 92697 95354 98614 99908 103891 108347 112455 112563 112099 113537 116579
16753A16579L724m307n998L166L504N554L852J057q344n015J2257O911N758l819
$$ 116579 120303 115996 109998 113164 116668 122222 126074 127131 118787 113772 126029 132940 138698 134879
16739A34879k487N748N836p98L65N325n402l738L793n50K89o70l715P044P984
$$ 134879 132392 138140 143976 143178 143543 148868 143466 139728 143521 142971 143260 142590 138875 145919 153903
16724A53903J2421J0966L288J3817O590K986k035P551k709M97O393J4123J9740
$$ 153903 166324 177290 180578 194395 200985 203971 201936 209487 206778 207275 213668 227791 247531
16711B47531K0262K3808J3904K1766J9098J6978J6385J0695J2118J5316K1535
$$ 247531 267793 291601 305505 327271 346369 363347 379732 390427 402545 417861 439396
16700D39396K8719M1998N4922Q4378Q9622R7832J18805Q1843N7682O1224J1279
$$ 439396 468115 510113 565035 649413 739035 836867 955672 1037515 1095197 1156421 1167700
16689A167700M205L4729N9683R4138J40056K11096K36146K04618K52261K09274
$$ 1167700 1171905 1206634 1266317 1360455 1500511 1711607 1947753 2152371 2404632 2613906
16679B613906J67627K36296K71811L67518N98107R50318J476373K352939M006875
$$ 2613906 2781533 3017829 3289640 3657158 4255265 5205583 6681956 9034895 13041770
16670A3041770O878370J0148178J0331184J2695197J5469377M896849J758735
$$ 13041770 19920140 30068318 40399502 53094699 68564076 73460925 75219660
16663G5219660J868857r691667j1744175r501000r092774n198817Q30634O199975
$$ 75219660 77088517 67396850 55652675 46151675 37058901 31860084 32690718 38890693
16655C8890693P578939J1405191J3281609K473905J182084j57857j1616232j2510039
$$ 38890693 46469632 57874823 71156432 73630337 74812421 74654564 63038332 50528293
16647E0528293j1066454j1355638q921166n941494l731612k360251j527025j029085
$$ 50528293 39461839 28106201 19185035 13243541 9511929 7151678 5624653 4595568
16639D595568p34289n20112l51713k33549k03440j54386j37081k10060j86089
$$ 4595568 3861279 3341167 2989454 2755905 2552465 2398079 2260998 2050938 1864849
16630A864849k02362k27217j86108j50740j27979q0783m0246j5232k617L3384
$$ 1864849 1662487 1435270 1249162 1098422 970443 889660 849414 834182 831565 864949
16620H64949J1804j9954r954n5643r4804q8554q4803p9332o3475m8457k4239k1342
$$ 864949 876753 856799 846845 791202 696398 607844 523041 443709 380234 331777 307538 286196
16608B86196j3742q651r644o735n229l965j0892j5002j1234j1112j4168j0354
$$ 286196 272454 263803 254159 247424 242195 238230 227338 212336 201102 189990 175822 165468
16596A65468p434j1018k961K390K989j52N260l581q834k0240l033Q777p408j1610
$$ 165468 158034 147016 144055 146445 149434 149282 154542 150961 142127 121887 118854 127631 120223 108613
16582A08613j0563k3m734l796l35m544r762o949q576j679P178j424q622m857k230
$$ 108613 98050 98027 93293 89497 89162 84618 74856 67907 59331 57652 64830 63406 54784 49927 47697
16567D7697l82j115J448P29m003m760j38O064o022N1n437M436l078M114J617M227
$$ 47697 47315 46200 47648 48377 44374 39614 39476 45540 39518 39569 34132 38568 35490 39604 41221 45448
16551D5448Q19l837K15m787j068J94j461J038L464L237M522M100Q97m681j0993
$$ 45448 46267 42430 42645 37858 36790 36984 35523 36561 40025 43262 47784 51884 52781 48100 37107
16536C7107m505L60n094j746L825M50L160P24Q488k219o016j534j1360q128p431
$$ 37107 32602 32962 27868 26122 29947 30397 33557 34281 42769 40550 34534 33000 21640 13512 6081
16521F081j2983n924m157o952j2264p924o182j888j1490o417Q168M631L462J1107
$$ 6081 -6902 -12826 -16983 -23935 -36199 -44123 -50305 -52193 -63683 -70100 -61932 -57301 -53839 -42732
16507d2732J1767J5769Q576L97L734m967j0320j8244L87Q646N301N631Q349P672
$$ -42732 -30965 -15196 -6620 -6223 -2489 -7456 -17776 -36020 -35633 -26987 -21686 -16055 -7706 -34
16493c4J5869J3296R12L593M952o34l96M129L292j449m888p180m608k115k169
$$ -34 15835 29131 30043 33636 38588 37954 37558 41687 44979 43530 38642 31462 26854 24739 22570
16478B2570n981J062k934l99J3830Q115M723j704K607M58l71l35K99l070r006
$$ 22570 16589 17651 14717 14318 28148 36263 40986 39282 41889 42347 41976 41641 41940 38870 29864
16463B9864k818N090O39J230J804j69m655m129k635m10J250o222p127k203K498
$$ 29864 27046 32136 32775 34005 35809 35640 30985 26856 24221 23811 25061 18839 11712 9509 12007
16448A2007L631p373n979m428L779R528M655N023J326l973j0801L017L66l590
$$ 12007 15638 8265 2286 -2142 1637 11165 15820 20843 22169 18196 7395 10412 10778 7188
16434G188P62k532J607J779J750N205m914o890l009q24j137k289N226N930J82
$$ 7188 7950 5418 7025 8804 10554 15759 10845 3955 946 122 -1015 -3304 1922 7852 8034
16419H034m264k15J751P76n24J575L62K295n94m778m930j910K146k832o064Q52
$$ 8034 3770 3555 5306 6082 5558 7133 7495 9790 9196 4418 -512 -2422 -276 -3108 -9172 -8320
16403h320Q57M292Q6l89M168O003n400j432M269k999j1958o149l852o18M274K315
$$ -8320 -7463 -3171 -3085 -3474 694 6697 1297 -135 4134 1135 -10823 -16972 -20824 -21442 -17168 -14853
16387a4853L10L002L821J266P33J119J395j157l862m273q56o441M671Q222m9j728
$$ -14853 -14543 -11541 -7720 -6454 -5721 -4602 -3207 -4364 -8226 -12499 -13355 -19796 -15125 -6903 -6952 -8680
16371h680o198n466R74Q221m999K674K921J63p85L956M225j123l122M07l089N513
$$ -8680 -14878 -20344 -19370 -11149 -16148 -13474 -10553 -10390 -11175 -7219 -2994 -4117 -7239 -6832 -9921 -4408
16355d408Q360k04l290m571k341n191l747j433N196R972J787M376k608K89N440
$$ -4408 3952 3748 458 -4113 -6454 -11645 -15392 -16825 -11629 -1657 130 4506 1898 2187 7627
16340G627M467l181n324j768J407p82q05j938n767p13M278O195m763P98k729o938
$$ 7627 12094 8913 3589 1821 3228 2446 1641 -297 -6064 -6777 -2499 3696 -1067 -269 -2998 -9936
16324i936N53r01J305P689m586p467M955j403k428l496p42J038L22N933j628k967
$$ -9936 -9383 -10284 -8979 -1290 -5876 -13343 -8388 -9791 -12219 -15715 -16457 -15419 -15097 -9164 -10792 -13759
16308a3759k255L694N396m600l463O383r31q8M64J974r38N665J538j863K674l665
$$ -13759 -16014 -12320 -6924 -11524 -14987 -8604 -9535 -9623 -9159 -7185 -8123 -2458 -920 -2783 -109 -3774
16292c774l154K711Q617k940n603N57N627k588P11q97k011m862m502r62N181M255
$$ -3774 -6928 -4217 4400 1460 -4143 -3586 2041 -547 164 -733 -2744 -7606 -12108 -13070 -7889 -3634
16276c634N806n563K53o002K004l219K855K234k207O73J274p867K457J2680O979
$$ -3634 2172 -3391 -3138 -9140 -7136 -10355 -7500 -5266 -7473 -6800 -5526 -13393 -10936 1744 8723
16261H723n507k254P752N059K446J329K23Q151R51j5559p777p018o316O609N400
$$ 8723 3216 962 8714 13773 16219 17548 17771 25922 26873 11314 3537 -3481 -9797 -3188 2212
16246B212k81k556l7M089O736R093L311j1875q345r02j057p024k254N578L639
$$ 2212 1931 -625 -662 3427 10163 19256 22567 10692 2347 1445 388 -6636 -8890 -3312 327
16231C27n968l801l842l510N050L737j614N947O93j65l116l098P621N534q239
$$ 327 -5641 -9442 -13284 -16794 -11744 -8007 -9621 -3674 -2981 -3146 -6262 -9360 -1739 3795 -4444
16216d444m117l164J039P518R929P227P97m561m037Q66n995J098k172J589j773
$$ -4444 -8561 -11725 -10686 -3168 6761 13988 14785 10224 6187 7053 1058 2156 -16 1573 -200
16201b00O410O252o392n475k038L929O843M819O83M426J4234J6755P878M420J3955
$$ -200 6210 12462 6070 595 -1443 2486 9329 14148 14831 19257 33491 50246 58124 62544 76499
16186G6499L4385N7991O3450r676l3749j5742J3901N7391P6950j8o4905o3307
$$ 76499 110884 168875 232325 222649 188900 173158 187059 244450 321400 321382 256477 193170
16174A93170k2037J1420L5548M441m3405m8757l8464k2468J246J761j1507k0559
$$ 193170 171133 182553 218101 222542 179137 130380 91916 69448 70694 72455 60948 40389
16162D0389j4091m975q082p060k262k972j214j885q34j806m54r40K072L938K196
$$ 40389 26298 21323 13241 6181 3919 947 -267 -2152 -2986 -4792 -5246 -6186 -4114 -176 2020
16147B020o7r90r642j0429o52N281M773J114N636p44m079k403l491R699P971L38
$$ 2020 1953 963 -8679 -19108 -19760 -14479 -9706 -8592 -2956 -3700 -7779 -10182 -13673 -3974 3997 4335
16131D335p336q14n857o269K008M771l067J064L650M293M973J330P32O795l460
$$ 4335 -3001 -3815 -9672 -15941 -13933 -9162 -12229 -11165 -7515 -3222 1751 3081 3813 10608 7148
16116G148r773o331K242L017k910K312R603J371M511K593L289j131o206l063M989
$$ 7148 -2625 -8956 -6714 -3697 -6607 -4295 5308 6679 11190 13783 17072 15941 9735 6672 11661
16101A1661P320J1844J5558J4940L5045M7870N7832P0507Q7429L9273J1264K0186
$$ 11661 18981 30825 46383 61323 96368 144238 202070 272577 360006 399279 410543 430729
16089D30729m4897o7043m8026m9838l6551o935K9471M8994N4975P7452K0190L056
$$ 430729 385832 318789 270763 220925 184374 177439 206910 255904 310879 388331 408521 411577
16077D11577P086n1826p1476o5770n9027n2917l6327k1450j1817j1991q585l355
$$ 411577 418663 366837 295361 229591 170564 117647 81320 59870 48053 36062 27477 24122
16065B4122K262k282r697n051K072P52j297K111n261m617J204k189k391N772J16
$$ 24122 26384 24102 14405 9354 11426 12178 10881 12992 7731 3114 4318 2129 -262 5510 5626
16050E626L85J415Q08M09j309j134n527n12q8o120r33k039j405O999J959O87L908
$$ 5626 6011 7426 8234 8643 7334 6200 673 161 73 -6047 -6980 -9019 -10424 -3425 -1466 -779 3129
16033C129K19J261n253n185J701K425O087K658J257k287M84k387m235k5J2242
$$ 3129 3348 4609 -644 -5829 -4128 -1703 4384 7042 8299 6012 6496 4109 -126 -151 12091
16018A2091N129O019M69L477P741J0250K0658L1603K7386L1211K9995K9836L0729
$$ 12091 17220 23239 23708 27185 34926 45176 65834 97437 124823 156034 186029 215865 246594
16005B46594L7491M4350N7817M0745K3095M997l586L222J3607M635j2244l6414
$$ 246594 284085 328435 386252 426997 450092 455089 451503 454725 468332 472967 460723 424309
15993D24309n7887n6651m3940l9858m1081m1344l0511k6296k3444j4028l375n411
$$ 424309 366422 309771 265831 225973 184892 143548 113037 86741 63297 49269 45894 40483
15981D0483k392K630o884j038l552Q31m823j2266j4971p802K047L970k463j628
$$ 40483 38091 40721 33837 32799 29247 30078 25255 12989 -1982 -9784 -7737 -3767 -6230 -7858
15967g858L79M27n94J2326O793r257n44L589n307k646p094k960R05k820O110J695
$$ -7858 -7479 -7052 -7646 4680 11473 2216 1672 5261 -46 -2692 -9786 -12746 -11841 -14661 -8551 -6856
15951f856M76L275m620M958N555k102K451Q215n530j400m598j0224j488J015p44
$$ -6856 -6380 -3105 -7725 -2767 2788 686 3137 11352 5822 4422 -176 -10400 -11888 -10873 -11617
15936a1617O013L622l70Lj530O26J0669M185j1725L72M05j593J825O00p201o45
$$ -11617 -5604 -1982 -2352 -2349 -3879 -3253 7416 11601 -124 248 653 -940 885 1485 -5716 -6361
15920f361K522J655Q58P61N237l902m166L917j088N90N336P21k519j568j728K383
$$ -6361 -3839 -2184 -1326 -565 4672 770 -3396 521 -567 23 5359 6080 3561 1993 265 2648
15904B648n396m719n965O1R054N153J164L340j899m299q86n912K08N005j407L257
$$ 2648 -2748 -7467 -13432 -13371 -4317 836 2000 5340 3441 -858 -1744 -7656 -7448 -2443 -3850 -593
15888e93M641L77n945o984j899LL083k311l731l84n13O46O193L810j272J831M204
$$ -593 4048 4425 -1520 -8504 -10403 -10400 -7317 -9628 -13359 -13743 -14256 -13610 -7417 -3607 -4879 -3048 1156
15871A156j455l407n68n979l964K435K072P948l194K224K146L183n50k242J173
$$ 1156 -299 -3706 -4274 -10253 -14217 -11782 -9710 -1762 -4956 -2732 -586 2597 2047 -195 978
15856I78P026K772o242k57J745r7Q57R36J784J26j057o060q87J120m929K507j882
$$ 978 8004 10776 4534 4277 6022 5925 6782 7718 9502 9628 8571 2511 1624 2744 -2185 322 -1560
15839a560q475L105Q798K77J221K4o629q612o426M140J156M361K217P61j729Q663
$$ -1560 -10035 -6930 1868 2145 3366 3390 -3239 -11851 -18277 -14137 -12981 -8620 -6403 -5642 -7371 1292
15823A292N628N6k960l142L421p026n385K990O540n24L227P77n79m514m93M910
$$ 1292 6920 6976 4016 874 4295 -2731 -8116 -5126 1414 890 4117 4894 4315 -199 -692 4218
15807D218m544j277j833K617L464J103M58m937l616l077n069l632j047l935k907
$$ 4218 -326 -1603 -3436 -819 2645 3748 4206 -731 -4347 -7424 -12493 -16125 -17172 -21107 -24014
15792b4014Q161L828J117o04K134L27K495j1227j0616J949J1543O920k492k851
$$ -24014 -15853 -12025 -10908 -11512 -9378 -9051 -6556 -17783 -28399 -26450 -14907 -7987 -10479 -13330
15778a3330M19M822J742m156L869N173j972K557J17k444j099L43m116M035K379
$$ -13330 -12911 -8089 -6347 -10503 -6634 -1461 -3433 -876 -759 -3203 -4302 -3959 -8075 -4040 -1661
15763a661p08n401r728N434L869L346K027j093J248l524n774M179L404Q02L111
$$ -1661 -2369 -7770 -17498 -12064 -8195 -4849 -2822 -3915 -2667 -6191 -11965 -7786 -4382 -3580 -469
15748d69R35j164k672j071k371Q04m772k183L293O662J646K41M384q204r425J71
$$ -469 466 -698 -3370 -4441 -6812 -6008 -10780 -12963 -9670 -3008 -1362 -1121 3263 -4941 -14366 -14195
15732a4195O958M717j479m998n519N972L086N57k112M273N389J812q550o312J707
$$ -14195 -7237 -2520 -3999 -8997 -14516 -8544 -5458 -4901 -7013 -2740 2649 4461 -4089 -10401 -8694
15717h694N099J826M035k742n066j277m046M277M855m92j113k56L030O661R80
$$ -8694 -3595 -1769 2266 -476 -5542 -6819 -10865 -6588 -1733 -2225 -3338 -3594 -564 6097 7077
15702G077j2746r028o505l451k420k389R226J6299J196J105j182j97M481L099
$$ 7077 -5669 -14697 -21202 -24653 -27073 -29462 -20236 -3937 -2741 -1636 -2818 -3015 1466 4565
15688D565O446j227j32l437l490o55P00l56N49k477j493j487m191l714O554Q132
$$ 4565 11011 9784 9652 6215 2725 2070 2770 2414 2963 486 -1007 -2494 -6685 -10399 -3845 4287
15672D287o8m449q492l966j397j551O743N835j0307l977j980M231L100j255L007
$$ 4287 4219 -230 -8722 -12688 -14085 -15636 -8893 -3058 -13365 -17342 -19322 -15091 -11991 -13246 -10239
15657a0239J866J434r3L818L456n22Q04l967n683J129k52K557r62o135L208L198
$$ -10239 -8373 -6939 -7032 -3214 242 -280 524 -3443 -9126 -7997 -8249 -5692 -6654 -12789 -9581 -6383
15641f383j212j616O471j07n274O872K154k897k347j409J729N25K288N27Q05K669
$$ -6383 -7595 -9211 -2740 -2847 -8121 -1249 905 -1992 -4339 -5748 -4019 -3494 -1206 -679 126 2795
15625B795K172k347m761J444m47o067O16P235L028n318k803j222P873P972j707
$$ 2795 4967 2620 -2141 -697 -1144 -7211 -6595 640 3668 -1650 -4453 -5675 2198 10170 8463
15610H463k643N60K318k854Q4M04L714k358o894K088N77O43J459L514l439r711
$$ 8463 5820 6380 8698 5844 5928 6332 10046 7688 794 2882 3459 4102 5561 9075 5636 -4075
15594d075j48l33R00N175r00l277K084J0291N193m421l238o08J015l16L509kK619
$$ -4075 -4223 -4556 -3656 1519 619 -2658 -574 9717 14910 10489 7251 6643 7658 7342 10851 10849 13468
15577A3468l209r834n611m77q45j959J653M41j821K527k320j834o39M712j315
$$ 13468 10259 425 -5186 -5663 -6508 -8467 -6814 -6373 -8194 -5667 -7987 -9821 -10460 -5748 -7063
15562g063l291j256K033M086O477K214J13r18q467J834P620L616M389J726q505
$$ -7063 -10354 -11610 -9577 -5491 986 3200 3313 2395 -6072 -4238 3382 6998 11387 13113 4608
15547D608j0103N41m223Q23K015j646M530L487k080L135J386J278m91M7l342q17
$$ 4608 -5495 -4954 -9177 -8354 -6339 -7985 -3455 32 -2048 1087 2473 3751 3260 3307 -35 -852
15531h52j87P388m743m37O946K776l438k869n25j727N44N281k028l73J502n27
$$ -852 -1039 6349 1606 1169 8115 10891 7453 4584 4059 2332 2876 8157 6129 5756 7258 6731
15515F731m009q388l243L180n17r91m25l553M31O177k136j709J658K101j692q974
$$ 6731 2722 -5666 -8909 -5729 -6246 -7237 -7662 -11215 -10784 -4607 -6743 -8452 -6794 -4693 -6385 -15359
15499a5359L089J420M815j30j840k33j786L734N95n078P665J1748m751n509J843
$$ -15359 -12270 -10850 -6035 -6165 -8005 -8238 -10024 -6290 -5695 -10773 -3108 8640 3889 -1620 223
15484B23M672J784n534j582J312M755j907k244j718k11K756J310k163K119l60
$$ 223 4895 6679 1145 -437 875 5630 3723 1479 -239 -450 2306 3616 1453 3572 3212
15469C212L468l770l285M64m088k933L428N157J903O19n598r923K457L854J026
$$ 3212 6680 2910 -375 89 -3999 -6932 -3504 1653 3556 4175 -1423 -11346 -8889 -5035 -4009
15454d009m10L990J664m13k511m657K484m578M82m11K962J125l063N177N631o653
$$ -4009 -4419 -429 1235 822 -1689 -6346 -3862 -8440 -7958 -8369 -5407 -4282 -7345 -2168 3463 -3190
15438c190q21Q77j840P691L057Rm036L287N038m28q94J315l540j1760q168J670
$$ -3190 -4011 -3134 -4974 2717 5774 5783 1747 5034 10072 9644 8750 10065 6525 -5235 -13403 -11733
15422a1733K718m264M176O402J814j903j158K81M03Q36Q53j876j792N15M368M070
$$ -11733 -9015 -13279 -9103 -2701 -887 -2790 -3948 -3667 -3264 -2428 -1575 -3451 -5243 -4728 -360 3710
15406C710j596k514L130J107M25Q138L42N437L674q447q621q203p61L404K141
$$ 3710 2114 -400 2730 3837 4262 12400 12742 18179 21853 13406 4785 -3418 -4179 -775 1366
15391A366M172j369k911j212N109N507J116m172O90l707m914K86j133o670K120
$$ 1366 5538 4169 1258 46 5155 10662 11778 7606 8296 4589 -325 -39 -1172 -7842 -5722
15376e722M745k947M321N314O488l237j2436r403j612N496K96N352L120J342Q99
$$ -5722 -977 -3924 397 5711 12199 8962 -3474 -12877 -14489 -8993 -8697 -3345 -225 1117 2016
15361B016o125L087O242j058K928K448j2082n200k656l360L619K775n43K885K705
$$ 2016 -4109 -1022 5220 4162 7090 9538 -2544 -7744 -10400 -13760 -10141 -7366 -7909 -5024 -2319
15346b319O707L004n303l200M398k384J754J690j963K417J346j0352r075O11N391
$$ -2319 4388 7392 2089 -1111 3287 903 2657 4347 2384 4801 6147 -4205 -13280 -12669 -7278
15331g278J1635O272o621n133N020O200j929l720n241J290l149q10k185L166L53
$$ -7278 4357 10629 4008 -1125 3895 10095 8166 4446 -795 495 -2654 -3464 -5649 -2483 -2130
15316b130m734P37j275k567J916K992L209L525k561o05M079K689n757k879k747
$$ -2130 -6864 -6127 -7402 -9969 -8053 -5061 -1852 1673 -888 -1493 2586 5275 -482 -3361 -6108
15301f108K317k369n899J396j26N173m023O13N197m88n536m671j659M347J811
$$ -6108 -3791 -6160 -12059 -10663 -10789 -5616 -9639 -9026 -3829 -4317 -9853 -14524 -16183 -11836 -10025
15286a0025j61k126J100M425n499l776K946N062K621K628J780J35K125l708q282
$$ -10025 -10186 -12312 -11212 -6787 -12286 -16062 -13116 -8054 -5433 -2805 -1025 -890 1235 -2473 -10755
15271a0755m704K440J122j708J847O352N975L528M311k392n038k340p221k056
$$ -10755 -15459 -13019 -11897 -13605 -11758 -5406 569 4097 8408 6016 978 -1362 -8583 -10639
15257a0639J396M714n68K838K241j336n210l071k754L008J002R692P138J202p39
$$ -10639 -9243 -4529 -5097 -2259 -18 -1354 -6564 -9635 -12389 -9381 -8379 1313 8451 9653 8914
15242H914o87K179o24j800r980m038K49P48O59l887L104M265O117j01L640L687
$$ 8914 8227 10406 9782 7982 -1998 -6036 -5787 -5039 -4380 -8267 -5163 -898 5219 5118 8758 12445
15226A2445k176j217m682J228M97p323L009J738J406Q8L881k799l034l338j237
$$ 12445 10269 9052 4370 5598 6095 -1228 1781 3519 4925 5013 8894 6095 3061 -277 -1514
15211a514l845L975M030J360K023O237J693O216n55q824n339L936L146O158Q499
$$ -1514 -5359 -1384 2646 4006 6029 12266 13959 20175 19620 10796 5457 9393 12539 18697 27196
15196B7196r29k230p834l242r32m76L809K763j42j784o99N485l632q04J993N255
$$ 27196 26267 24037 16203 12961 12029 11553 15362 18125 17983 16199 15500 20985 17353 16549 18542 23797
15180B3797l337M4l042K781k079l192m054k091K138R403j210r295l029M04L722
$$ 23797 20460 20504 17462 20243 18164 14972 10918 8827 10965 20368 19158 9863 6834 7238 10960
15165A0960N153r545l378k465P43k278o793j067P500J1008Q962L468l710n599
$$ 10960 16113 6568 3190 725 1468 -810 -7603 -8670 -1170 9838 18800 22268 18558 12959
15151A2959k690n94N56l453n750O142R29k594n119j366j34K766j590n595L33L271
$$ 12959 10269 9675 10231 6778 1028 7170 8099 5505 386 -980 -1114 1652 62 -5533 -5200 -1929
15135a929M294K696J114K005P552k143j0697n696J543k185L709k651O3J483J560
$$ -1929 2365 5061 6175 8180 15732 13589 2892 -2804 -1261 -3446 263 -2388 -2325 -842 718
15120G18L205Q947N825m338l784o034l331M19N954J860j769r393p953K937P186
$$ 718 3923 12870 18695 14357 10573 4539 1208 1627 7581 9441 7672 -1721 -9674 -6737 449
15105D49o06p215q23N355Q987Q582n291k898J051j033R60r060m76Q349j658l471
$$ 449 -157 -7372 -8195 -2840 6147 14729 9438 6540 7591 6558 7518 -1542 -2018 6331 4673 1202
15089A202l763p521N471N658j209P39j0045l127Q603k012j452q121n182P771O482
$$ 1202 -2561 -10082 -4611 1047 -162 577 -9468 -12595 -3992 -6004 -7456 -15577 -20759 -12988 -6506
15074f506J462o719o963l364M751k384M622J972N022N199m629j185L418n576k67
$$ -6506 -5044 -11763 -18726 -22090 -17339 -19723 -15101 -13129 -8107 -2908 -7537 -8722 -5304 -10880 -11147
15059a1147J718j341L45P181K386j110l754j555p37o705J181P74K712j008o903
$$ -11147 -9429 -10770 -10425 -3244 -858 -1968 -5722 -7277 -8014 -14719 -13538 -12764 -10052 -11060 -17963
15044a7963Q85L735j145n268M678L584K119L859m541P22N619K623N66k686J496
$$ -17963 -17078 -13343 -14488 -19756 -15078 -11494 -9375 -5516 -10057 -9335 -3716 -1093 -527 -3213 -1717
15029a717r689j292N551j2839o51R272k17j269l73m116R66P501J713J48J0062
$$ -1717 -11406 -12698 -7147 -19986 -20637 -11365 -11582 -12851 -13224 -17340 -16374 -8873 -7160 -7012 3050
15014C050M326o014n764J101K894l738P22M736L935M30n113n204r37K649L114
$$ 3050 7376 1362 -4402 -3301 -407 -4145 -3423 1313 5248 5678 565 -4639 -5576 -2927 187
14999A87M636K265l819l240m543L74L855j658k72n06k155L09j829l403K468L797
$$ 187 4823 7088 3269 29 -4514 -4140 -285 -1943 -2215 -2721 -4876 -4567 -6396 -9799 -7331 -3534
14983c534K248J918j748j185m346K197J991K19j425P512O700l620m582o102j0179
$$ -3534 -1286 632 -1116 -2301 -6647 -4450 -2459 -2240 -3665 3847 10547 6927 2345 -3757 -13936
14968a3936K032J3608L600j173p876l271r03q217J568R224O631K451j228J636
$$ -13936 -11904 1704 5304 4131 -3745 -7016 -7919 -16136 -14568 -5344 1287 3738 2510 4146
14954D146J447l051J197K03k146o194j00j902N575k912K278k92M113J1887L83
$$ 4146 5593 2542 3739 3942 1796 -4398 -4498 -6400 -825 -3737 -1459 -1751 2362 14249 14632
14939A4632n667l09k992L624M70p762l027p97K395n40j240q157m669J2174l110
$$ 14632 8965 8656 5664 9288 9758 1996 -1031 -1828 567 27 -1213 -9370 -14039 -1865 -4975
14924d975j116L70q54K110L773l06k690M383k452m930j070n91k108J839N881J137
$$ -4975 -6091 -5721 -6575 -4465 -692 -998 -3688 695 -1757 -6687 -7757 -8348 -10456 -8617 -2736 -1599
14908a599n150J808J0291Q112l902q141l699J742k552J954o269n72R44O25j144
$$ -1599 -6749 -4941 5350 13462 9560 1419 -2280 -538 -3090 -1136 -7405 -7977 -7033 -6408 -7552
14893g552Q305M830J907k827k455N41j211J382k359j1393l9O508j487K105J860
$$ -7552 753 5583 7490 4663 2208 2749 1538 2920 561 -10832 -10871 -4363 -5850 -3745 -1885
14878a885L400L413L558k457k752J392k835k4J72N762l492m319o912q606k378
$$ -1885 1515 4928 8486 6029 3277 4669 1834 1810 1982 7744 4252 -67 -6979 -15585 -17963
14863a7963O725L161p637K106J1136L134j946l909r581k397O483L739J187O669
$$ -17963 -11238 -8077 -15714 -13608 -2472 662 -1284 -5193 -14774 -17171 -10688 -6949 -5762 907
14849I07J290J535o140K0k03l696J059P312r67l130M819m21O01q551l36L514L160
$$ 907 2197 3732 -2408 -2388 -2591 -6287 -5228 2084 1117 -2013 2806 2385 2986 -5565 -5901 -2387 773
14832G73j418M413n896o848l695k76O621j518m387k633k60M412M948M33L160n491
$$ 773 -645 3768 -2128 -8976 -12671 -12947 -6326 -7844 -12231 -14864 -15124 -10712 -5764 -5331 -2171 -7662
14816g662j60J396j48L970l923n423Q28N36L894r32K974O928K471K023L905N191
$$ -7662 -7822 -6426 -6574 -2604 -6527 -11950 -11122 -10586 -6692 -7624 -4650 2278 4749 6772 10677 15868
14800A5868n110j0142p820J736k8l957p58Q880N086J460j094M371k766k037p34
$$ 15868 10758 616 -7204 -5468 -5496 -9453 -10211 -1331 3755 5215 4121 8492 5726 3689 2955
14785B955o48m80N45J373j0613m87M87J832J26Q1J960l189j166n270R663O957
$$ 2955 2307 1827 2372 3745 -6868 -7355 -6868 -5036 -4910 -4829 -2869 -6058 -7224 -12494 -2831 4126
14769D126m204l196n354k686j774K574K607N82p34K478r88l982j638L075K530
$$ 4126 -78 -3274 -8628 -11314 -13088 -10514 -7907 -7325 -8059 -5581 -6569 -10551 -12189 -9114 -6584
14754f584j781J39J872L330j827o855m365L285P159k206n017J212Q4P794K838
$$ -6584 -8365 -8226 -6354 -3024 -4851 -11706 -16071 -12786 -5627 -7833 -12850 -11638 -11554 -3760 -922
14739i22k154k750J074j591L747L707j679J779P068l148l074l464Q70L868l53
$$ -922 -3076 -5826 -4752 -6343 -2596 1111 -568 1211 8279 5131 2057 -1407 -537 3331 2978
14724B978m666M730K982J700l0j194n487m705j190O726M3j554k426L53M355r25
$$ 2978 -1688 3042 6024 7724 7694 6500 1013 -3692 -4882 1844 1887 333 -2093 -1740 2615 1690
14708A690q038q236R53J155M986J683j479k245N495M023K502j0582j475J558M79
$$ 1690 -6348 -14584 -13631 -12476 -7490 -5807 -7286 -9531 -4036 -13 2489 -8093 -9568 -8010 -7531
14693g531M717l69l041L301P20J2739K281m378p652m657k394r22L231J46r61M199
$$ -7531 -2814 -3183 -6224 -2923 -2203 10536 12817 8439 787 -3870 -6264 -7186 -3955 -3809 -4770 -571
14677e71L356K001r18l966p514M916M067n524L214K898j221k928m352M563L596
$$ -571 2785 4786 3868 -98 -7612 -2696 1371 -4153 -939 1959 738 -2190 -6542 -1979 1617
14662A617q120o693J299P847l489m070N737j79N768k151o79k721l422K316K223
$$ 1617 -6503 -13196 -11897 -4050 -7539 -11609 -5872 -6051 -283 -2434 -3113 -5834 -9256 -6940 -4717
14647d717j255k3P827M231j554m329R64j897Q134K385j571O49p989J702P160M30
$$ -4717 -5972 -5995 1832 6063 4509 180 1144 -753 7381 9766 8195 8844 855 2557 9717 10147
14631A0147o801o835L49P764N03l66o143o664M054N598l969J678L483j269J67
$$ 10147 3346 -3489 -3140 4624 5127 4761 -1382 -8046 -3992 1606 -2363 -685 2798 1529 1696
14616A696k178K554J759k013k868L103j571l28k248P771J438J058L299Jj0914
$$ 1696 -482 2072 3831 1818 -1050 2053 482 154 -2094 5677 7115 8173 11472 11473 559
14601E59j601O74K279k00k02j145L627m636l203J716O032J990l141j195J28N670
$$ 559 -1042 -368 1911 1711 1509 364 3991 -645 -3848 -2132 3900 5890 2749 1554 1682 7352
14585G352m709n092p602q130K197P895M530K676L981K969p13q89n53k77m656j04
$$ 7352 2643 -2449 -10051 -18181 -15984 -8089 -3559 -883 3098 6067 5354 4465 3912 3635 -1021 -1125
14569a125K630m633n116L09o222r37R745K436o002O112M99p10J488k085J875K504
$$ -1125 1505 -3128 -8244 -7935 -14157 -15094 -5349 -2913 -8915 -2803 -2304 -3014 -1526 -3611 -1736 768
14553G68J394n559n085M451O253N630j501m153l922q05m188K612K765l933k03
$$ 768 2162 -3397 -8482 -4031 2222 7852 6351 2198 -1724 -2529 -6717 -4105 -1340 -5273 -5476
14538e476O316q5k795j933q989L397K658J824N407p04r128J444M409m095k555
$$ -5476 840 755 -2040 -3973 -12962 -9565 -6907 -5083 324 -380 -9508 -8064 -3655 -7750 -10305
14523a0305m099L911N77O919J881j238k406K157L244k251m523l393M857o93M109
$$ -10305 -14404 -10493 -9916 -2997 -1116 -2354 -4760 -2603 641 -1610 -6133 -9526 -4669 -5362 -1253
14508a253O080M21j0121p723O181N115j957j773K8Q283L280l169K006o883L417
$$ -1253 4827 5248 -4873 -12596 -6415 -1300 -3257 -5030 -5002 3281 6561 3392 5398 -1485 1932
14493A932M07j0984p31K48k965k90L861q43p33L816M712k737m852O694m90j264
$$ 1932 2339 -8645 -9376 -9128 -12093 -12383 -8522 -9365 -10098 -6282 -1570 -4307 -9159 -2465 -2955 -4219
14477d219p08M876K924K446n373j6031P87Q212N677l991k29P05p360R88J3031
$$ -4219 -4927 -51 2873 5319 -54 -16085 -15298 -7086 -1409 -5400 -5629 -4924 -12284 -11296 1735
14462A735K178l418l49j166j469k910j904n472N06N661J514n289L562K252K859
$$ 1735 3913 495 146 -1020 -2489 -5399 -7303 -12775 -12269 -6608 -5094 -10383 -6821 -4569 -1710
14447a710M366j551J073m940r247j097Q084J055k759j972l211l28N378J808K144
$$ -1710 2656 1105 2178 -2762 -12009 -13106 -5022 -3967 -6726 -8698 -11909 -12237 -6859 -5051 -2907
14432b907L049L9q604l509M610M890p08k640K902k014o63l607k261J994q34M390
$$ -2907 142 181 -8423 -11932 -7322 -2432 -3140 -5780 -2878 -4892 -5555 -9162 -11423 -9429 -10263 -5873
14416e873P928J68J96l548n295M199N295l283j658l043R95m579r86N871k327m391
$$ -5873 2055 2223 2419 -1129 -6424 -2225 3070 -213 -1871 -4914 -3919 -8498 -9484 -3613 -5940 -10331
14400a0331M124J352N171j013j776N026K617n583l61j865p352J274L926L372J933
$$ -10331 -6207 -4855 316 -697 -2473 2553 5170 -413 -774 -2639 -9991 -8717 -4791 -1419 514
14385E14L783N447n537j4900l644Q74J354K011P121P997K478n373m30N434K346
$$ 514 4297 9744 4207 -10693 -14337 -13463 -12109 -10098 -2977 5020 7498 2125 1695 7129 9475
14370I475j227L526n553j407O511M022j2828n708J687N964N223L542J039n584
$$ 9475 8248 11774 6221 4814 11325 15347 2519 -3189 -1502 4462 9685 13227 14266 8682
14356H682l613j153J387J533K465j586k813k508j297L853J41M115l209m89l350
$$ 8682 5069 3916 5303 6836 9301 7715 4902 2394 1097 4950 5091 9206 5997 5508 2158
14341B158n235j55n318o453J685Q253j90J440L327O982m54M098l936o548K472
$$ 2158 -3077 -3232 -8550 -15003 -13318 -5065 -5255 -3815 -488 6494 6040 10138 6202 -346 2126
14326B126J141n882O50o549M470R370N31k604k614l572M537O028m610M556P019
$$ 2126 3267 -2615 -1965 -8514 -4044 5326 5857 3253 639 -2933 1604 7632 3022 7578 14597
14311A4597o973p660J154l215j032o152l463M30J550J893Q784k333l835o567N555
$$ 14597 7624 -36 1118 -2097 -3129 -9281 -12744 -12314 -10764 -8871 -87 -2420 -6255 -12822 -7267
14296g267P564M485j631P830m228n481m166k466K046P573j218n417k667n851L342
$$ -7267 297 4782 3151 10981 6753 1272 -2894 -5360 -3314 4259 3041 -2376 -5043 -10894 -7552
14281g552O252R976k65p016j934L746L253K199j2618j1247m223j424o99R420J5637
$$ -7552 -1300 8676 8411 1395 -539 3207 6460 8659 -3959 -15206 -19429 -20853 -21552 -12132 3505
14266C505j200j458J375M202k758O69l237m559j355L575M952N2R896J775J640
$$ 3505 2305 847 2222 6424 3666 4335 1098 -3461 -4816 -1241 3711 3763 13659 15434 17074
14251A7074p27p534n045K150L157o807o628n030p87J178m375N61M437m107l776
$$ 17074 16347 8813 3768 5918 9075 2268 -4360 -9390 -10177 -8999 -13374 -12813 -8376 -12483 -16259
14236a6259O89L081O112J0l022k867K501J0180K628p65J934L794j0704o245K664
$$ -16259 -15570 -12489 -6377 -6367 -9389 -12256 -9755 425 3053 2288 4222 8016 -2688 -8933 -6269
14221f269M306P53L508q650N07j01j844k842Q32j385L789O476j776k428M956J126
$$ -6269 -1963 -1210 2298 -6352 -5845 -5946 -7790 -10632 -9800 -11185 -7396 -920 -2696 -5124 -168 958
14205I58Q612K390l377n866J043j261k527R75k973J177L369o037n161N867L59
$$ 958 9570 11960 8583 2717 3760 2499 -28 947 -2026 -849 2520 -3517 -8678 -2811 -2452
14190b452l908L107o10k921k90L505K531j426m313k506J526O8P295N727k20K520
$$ -2452 -6360 -3253 -3863 -6784 -7074 -3569 -1038 -2464 -6777 -9283 -7757 -7689 -394 5333 5113 7633
14174G633J069k522p942j488k733k480L143O65J20L062K624j623P07K117n45J324
$$ 7633 8702 6180 -1762 -3250 -5983 -8463 -5320 -4655 -4535 -1473 1151 -472 235 2352 1807 3131
14158C131k215P25k566J848j175p155n73Q651K268m266j0037j295J0460J0955
$$ 3131 916 1641 -925 923 -252 -7407 -7980 671 2939 -1327 -11364 -12659 -2199 8756
14144H756M783q148l918m066n298l400J880L52M561P94l007q19J562k131K448
$$ 8756 13539 5391 1473 -2593 -7891 -11291 -9411 -9059 -4498 -3704 -6711 -7530 -5968 -8099 -5651
14129e651P252R516K393N143n90k060K84n980l515M177n218O79L424p598p963
$$ -5651 1601 11117 13510 18653 18063 16003 16287 10307 6792 10969 5751 6430 9854 2256 -5707
14114e707J168L097J162j080j972J005K982J08p21k518p8M430O244M072q22m925
$$ -5707 -4539 -1442 -280 -1360 -3332 -2327 655 763 42 -2476 -2554 1876 8120 12192 11370 6445
14098F445k589N534K580J668P73j0183j0378L917R05O843Q693O636J346n535o829
$$ 6445 3856 9390 11970 13638 14411 4228 -6150 -2233 -1328 5515 14208 20844 22190 16655 9826
14083I826p126p370l498K806J651K80m88J220J320l314j0541N437P416O730m185
$$ 9826 2700 -4670 -8168 -5362 -3711 -3431 -3919 -2699 -1379 -4693 -15234 -9797 -2381 4349 164
14068A64k398m210j352L189N486l118O46l055k732J440Q263O472K444o984j506
$$ 164 -2234 -6444 -7796 -4607 879 -2239 -1593 -4648 -7380 -5940 2323 8795 11239 4255 2749
14053B749j349k417K33k261N297P961k385p623j962j109n799J847N16J832N980
$$ 2749 1400 -1017 -784 -3045 2252 10213 7828 205 -1757 -2866 -8665 -6818 -6302 -4470 1510
14038A510K301K179J472n369L691k747k312J605q79N261M132j2451l356j401l790
$$ 1510 3811 5990 7462 2093 5784 3037 725 2330 1451 6712 10844 -1607 -4963 -6364 -10154
14023a0154K658q12L74L796R526j31k576K539l409j283K386M112n13n286l45J738
$$ -10154 -7496 -8308 -7934 -4138 5388 5257 2681 5220 1811 528 2914 7026 6513 1227 882 2620
14007B620p94N20m220j0820O356J2397k356m515j462j578L110M680k548L69j812
$$ 2620 1826 2346 -1874 -12694 -6338 6059 3703 -812 -2274 -3852 -742 3938 1390 1759 -53
13992e3j086l286K009j414j365K102J050N97j755j406L619q700n309L972J3744
$$ -53 -1139 -4425 -2416 -3830 -5195 -3093 -2043 -1446 -3201 -4607 -988 -9688 -14997 -11025 2719
13977B719n369p092J495M467j3n314l582k166J628Q625P875J621K566J151p356
$$ 2719 -2650 -9742 -8247 -3780 -3793 -9107 -12689 -14855 -13227 -4602 3273 4894 7460 8611 1255
13962A255j490J476J453k020P78R901k455n213N608k235l522J471k014j240N054
$$ 1255 -235 1241 2694 674 1452 11353 8898 3685 9293 7058 3536 5007 2993 1753 6807
13947F807p700n522N144j155j985l217J127N460J825m014k731m076Q238M663l419
$$ 6807 -893 -6415 -1271 -2426 -4411 -7628 -6501 -1041 784 -3230 -5961 -10037 -1799 2864 -555
13932e55o091j027k115K936K994J465k474M832Q711M020M446o306o112k95j161
$$ -555 -6646 -7673 -9788 -6852 -3858 -2393 -4867 -35 8676 12696 17142 10836 4724 4429 3268
13917C268n274J698m840M216R489k586n013m91j860k842K931j086M267K746J694
$$ 3268 -2006 -308 -5148 -932 8557 5971 958 467 -1393 -4235 -1304 -2390 1877 4623 6317
13902F317k78p36l192J070K970m02L481n58O914j358o232o405k745R08J069k032
$$ 6317 6039 5303 2111 3181 6151 5749 9230 8672 15586 14228 7996 1591 -1154 -246 823 -1209
13886a209o87p524k75Q623N353N894j506m221o753J451n438p215n226O976J7453
$$ -1209 -1896 -9420 -9695 -1072 4281 10175 8669 4448 -2305 -854 -6292 -13507 -18733 -11757 5696
13871E696M825j0664p629J278Q39q119P192J670J93j743J762L479l889m715k200
$$ 5696 10521 -143 -7772 -6494 -5655 -13774 -6582 -4912 -4719 -6462 -4700 -1221 -5110 -9825 -12025
13856a2025j738M75Q948P860m264r373M6J2752K431j97l872j646o737L174K510
$$ -12025 -13763 -13288 -4340 3520 -744 -10117 -10071 2681 5112 4915 1043 -603 -7340 -4166 -1656
13841a656p237j49O613J394j555l867o928N631P007J974K10o74l72k690j318O494
$$ -1656 -8893 -9042 -2429 -1035 -2590 -6457 -13385 -7754 -747 1227 1437 763 391 -2299 -3617 2877
13825B877l793M193o94k61J921q44k483n90L073j3123q720J539O356L683N830
$$ 2877 -916 3277 2583 2322 4243 3399 916 326 3399 -9724 -18444 -16905 -10549 -6866 -1036
13810a036P165M292o861j1014n126M399N14m290L835M972J0897k73p064n372P31
$$ -1036 6129 10421 3560 -7454 -12580 -8181 -7667 -11957 -8122 -3150 7747 7474 410 -4962 -4231
13795d231J0358j989l928j36J870l545m089L273N27N535j172K556j975j890k139
$$ -4231 6127 4138 210 74 1944 -1601 -5690 -2417 -1890 3645 2473 5029 3054 1164 -975
13780i75k843J380K031k061l879l433J085J232J626J685M22K786k04j0020M117
$$ -975 -3818 -2438 -407 -2468 -6347 -9780 -8695 -7463 -5837 -4152 -3730 -944 -1148 -11168 -7051
13765g051P202R13J407m685K029n818P047M344J47l906P10j289L9J41n074l615
$$ -7051 151 1064 2471 -2214 -185 -6003 1044 5388 5535 1629 2339 1050 1089 1230 -3844 -7459
13749g459K131K507N048j228l395J647L640Q66j14m730l594K478n52J788J126
$$ -7459 -5328 -2821 2227 999 -2396 -749 2891 3757 3643 -1087 -4681 -2203 -2755 -967 159
13734A59q21m256k73K263J832m126k492P661L599M40R50K402J704k616r17J176
$$ 159 -662 -4918 -5191 -2928 -1096 -5222 -7714 -53 3546 3986 4936 7338 9042 6426 5509 6685
13718F685K423k26l400m579k755q07j824m88j034k212M11P942J569q232k349J519
$$ 6685 9108 8882 5482 903 -1852 -2659 -4483 -4971 -6005 -8217 -7806 136 1705 -6527 -8876 -7357
13702g357o432N05m733m501L645Q216L290o631K022j334M85K885o59R91O629q92
$$ -7357 -13789 -13284 -18017 -22518 -18873 -10657 -7367 -13998 -11976 -13310 -12825 -9940 -10599 -9608 -2979 -3871
13686c871k722j281P716Q283K388n287p30J391j913n544J514K293o105N861K036
$$ -3871 -6593 -7874 -158 8125 10513 5226 4496 5887 3974 -1570 -56 2237 -3868 1993 4029
13671D029j732M669L978q83O61o143k719k709J059R10n277J691M389j665j885
$$ 4029 2297 6966 10944 10061 10722 4579 1860 -849 210 1120 -4157 -2466 1923 258 -1627
13656a627n009m97m634K413J1944O830N323p451j233L746j215J1754K452n959
$$ -1627 -6636 -7133 -11767 -9354 2590 9420 14743 7292 6059 9805 8590 20344 22796 16837
13642A6837k185o646m551j0445p87J0536R715L861j146n378k265L34J943m648
$$ 16837 14652 8006 3455 -6990 -7777 2759 12474 16335 15189 9811 7546 7880 9823 5175
13628E175k980q53l777m625M491K391J225N642o80n962R52K524M612o788m071
$$ 5175 2195 1342 -2435 -7060 -2569 -178 1047 6689 6009 47 999 3523 8135 1347 -2724
13613b724m191q34L340j325k655J383l047l549J797O042K860N758m090r517K432
$$ -2724 -6915 -7749 -4409 -5734 -8389 -7006 -10053 -13602 -11805 -5763 -2903 2855 -1235 -10752 -8320
13598h320N245J839m919N153jK410M642o82l810j375p43J427p984m450O612J0392
$$ -8320 -3075 -1236 -6155 -1002 -1003 1407 6049 5367 1557 182 -561 866 -7118 -11568 -4956 5436
13582E436k41l8n466L807o88M622l73n956K298P156P427p348n229j063M2l443
$$ 5436 5195 5157 -309 3498 2810 7432 7059 1103 3401 10557 17984 10636 5407 4344 4386 943
13566I43k293j754r659k692J225R023Q055p271p861L873J835m435O922j424k886
$$ 943 -1350 -3104 -12763 -15455 -14230 -5207 2848 -4423 -12284 -8411 -6576 -11011 -4089 -5513 -8399
13551h399K547N313l953k687M066M74J515N376k20J434O57J809J709l451n920
$$ -8399 -5852 -539 -4492 -7179 -3113 -2639 -1124 4252 4032 5466 6123 7932 9641 6190 270
13536B70l661Rj922l066L877K406j021j34J273j607J718P04K669P00o393p198
$$ 270 -3391 -3382 -5304 -8370 -4493 -2087 -3108 -3242 -1969 -3576 -1858 -1154 1515 2215 -4178 -11376
13520a1376L92L869N913Q804j50p502P42K74n849L24J940N92N161m960r129k54
$$ -11376 -10984 -7115 -1202 7602 7452 -50 692 966 -4883 -4559 -2619 -2027 3134 -1826 -10955 -11209
13504a1209J896J583N185J523o53K990K283L055K562o09m511p793N742Q438k06
$$ -11209 -9313 -7730 -2545 -1022 -1675 1315 3598 6653 9215 8606 4095 -3698 2044 10482 10276
13489A0276n710p527l716K000k259J022k8M61k350L263K174k675J619p96J039
$$ 10276 4566 -2961 -6677 -4677 -6936 -5914 -5942 -5481 -7831 -4568 -2394 -5069 -3450 -4246 -3207
13474c207q5k342n715O989M047l631L003O616K39n358q068Q0J324j706n105N424
$$ -3207 -3292 -5634 -11349 -4360 -313 -3944 -941 5675 5914 556 -7512 -7432 -6108 -7814 -12919 -7495
13458g495M71L637L207K72n330l68j625L329L69K51N373m45N620n186n811k263
$$ -7495 -7024 -3387 -180 92 -5238 -5606 -7231 -3902 -3533 -3282 2091 1646 7266 2080 -3731 -5994
13442e994m932J928P893l593l001J971M125mm259n791l418j842N682M91O66L34
$$ -5994 -10926 -8998 -1105 -4698 -7699 -5728 -1603 -1607 -5866 -11657 -15075 -16917 -11235 -10744 -10078 -9744
13426i744Q907K756p100q081l058K853R163P789K825q295p346P758M718N934m88
$$ -9744 -837 1919 -5181 -13262 -16320 -13467 -4304 3485 6310 -1985 -9331 -1573 3145 9079 8591
13411H591j291k142J758l328m514R892Q158J808n002l616J381o276l758q494p382
$$ 8591 7300 5158 6916 3588 -926 8966 17124 18932 13930 10314 11695 5419 1661 -6833 -14215
13396a4215K214J803K684n22l93Q1P046M665L946R73l641m221K985M77j330k245
$$ -14215 -12001 -10198 -7514 -8036 -8429 -8348 -1302 3363 7309 8282 4641 420 3405 3882 2552 307
13380C07L376P670R3o669k416l151p78O119q82q248o104K965P565L751J57n993
$$ 307 3683 11353 11446 4777 2361 -790 -1568 4551 3669 -4579 -10683 -7718 -153 3598 3755 -2238
13364b238J926L492m046k677k092L925o683k002O742J0000K035p756k689j0802
$$ -2238 -312 3180 -866 -3543 -5635 -1710 -8393 -10395 -3653 6347 8382 626 -2063 -12865
13350a2865k847N312R170K927L982j424n679P679Q17n193K955j470m487L261K799
$$ -12865 -15712 -10400 -1230 1697 5679 4255 -1424 6255 7072 1879 4834 3364 -1123 2138 4937
13335D937k535k23k460j500k705n215K264L991n516j010K581L856P127k262Mj376
$$ 4937 2402 2179 -281 -1781 -4486 -9701 -7437 -3446 -8962 -9972 -7391 -3535 3592 1330 1334 -42
13319d2k820K271K804O30K940k623l641n062m849J822N336m562J869L720l140
$$ -42 -2862 -591 2213 2843 5783 3160 -481 -5543 -10392 -8570 -3234 -7796 -5927 -2207 -5347
13304e347N715L759l161L518J787K418K759r51j9j902J973j854p159P25K095j494
$$ -5347 368 4127 966 4484 6271 8689 11448 10497 10478 8576 10549 8695 1536 2261 4356 2862
13288B862k652n0j337J919O95M89K451N269N392M465J072n693p298l380o740j445
$$ 2862 210 160 -1177 742 1437 1926 4377 9646 15038 19503 20575 14882 7584 4204 -2536 -3981
13272c981j126l14M978K98o687J723J167j261m853L082L176p11l315P034N175
$$ -3981 -5107 -5421 -443 -145 -6832 -5109 -3942 -5203 -10056 -6974 -3798 -4509 -7824 -790 4385
13257D385k617p86N115L69L334J816L802l413l466K217n093m214O202n98p714
$$ 4385 1768 982 6097 6466 9800 11616 15418 12005 8539 10756 5663 1449 7651 7053 -661
13242f61q297J242O225m16N066k228L633J681p955K303M088M617J763J401k274
$$ -661 -8958 -7716 -1491 -1907 3159 931 4564 6245 -1710 593 4681 9298 11061 12462 10188
13227A0188m228J387n817j0583J407P936L192j752p754p93K265k02L781O022m77
$$ 10188 5960 7347 1530 -9053 -7646 290 3482 1730 -6024 -6817 -4552 -4754 -973 5049 4572
13212D572l432L285n206m941k237K278k718L76L064R27J367l28M057L151M555
$$ 4572 1140 4425 -781 -5722 -7959 -5681 -8399 -8023 -4959 -4032 -2665 -2993 1064 4215 8770
13197H770m207p133J45N977O585j734l428m29J400n98J145J187l89J97k549k540
$$ 8770 4563 -2570 -2425 3552 10137 8403 4975 4546 5946 5348 6493 7680 7291 7488 4939 2399
13181B399m214m683R897N519M234k632k153P378j795p737n438j90J95j814K496
$$ 2399 -1815 -6498 3399 8918 13152 10520 8367 15745 13950 6213 775 585 780 -1034 1462
13166A462L794L1n962j574l117l327J456j94L14n458j894P654N299M790K030j860
$$ 1462 5256 5287 -675 -2249 -5366 -8693 -7237 -7431 -7117 -12575 -14469 -6815 -1516 3274 5304 3444
13150C444J019r708k169J275R09L995K425K485l494J925J702k996k240M511L067
$$ 3444 4463 -5245 -7414 -6139 -5230 -1235 1190 3675 181 2106 3808 812 -1428 3083 6150
13135F150m430K698n93M546J2481L243l634j0910o345K651M649r62m747p243k720
$$ 6150 1720 4418 3825 8371 20852 24095 20461 9551 3206 5857 10506 9544 4797 -2446 -5166
13120e166k259L677J084r214O446J0395l776l548N065K685k289l984O556L641
$$ -5166 -7425 -3748 -2664 -11878 -5432 4963 1187 -2361 2704 5389 3100 -884 5672 9313
13106I313q271m451j791M211l192p525M657j577L34O421O722j012L10Q211k712
$$ 9313 1042 -3409 -5200 -989 -4181 -11706 -7049 -8626 -8292 -1871 4851 3839 4149 12360 9648
13091I648K068k428p694n33O332Q737N543n911q148n575J554J048K297l030k460
$$ 9648 11716 9288 1594 1061 7393 16130 21673 15762 7614 2039 3593 4641 6938 3908 1448
13076A448j123j237m6P2O54N921L636l58j529k081k104L907k109j670m306M91
$$ 1448 325 -912 -958 -886 -232 5689 9325 8967 7438 5357 3253 7160 5051 3381 -925 -434
13060d34M732Q15J070K833q2q906l506k933K658j011p47L520P229M419M415j0100
$$ -434 4298 5113 6183 9016 8934 28 -3478 -6411 -3753 -4764 -5511 -1991 5238 9657 14072 3972
13044C972q546j306Q291M580r649l865l518N776P440m19k420n398q068k619Q413
$$ 3972 -4574 -5880 2411 6991 -2658 -6523 -10041 -4265 3175 2756 336 -5062 -13130 -15749 -7336
13029g336P187R31k825K611r094o849N521q11m62O184j18l059j317j129K461L363
$$ -7336 -149 782 -2043 568 -8526 -15375 -9854 -10665 -11127 -4943 -5061 -8120 -9437 -10566 -8105 -4742
13013d742j148P56o850J133r26k083N135L216P55r944k585k91J871N802P159K977
$$ -4742 -5890 -5134 -11984 -10851 -11777 -13860 -8725 -5509 -4754 -14698 -17283 -17574 -15703 -9901 -2742 235
12997B35j33p25m794l75j392J611Q310j316J349O61j374K061j517q585k567N285
$$ 235 102 -623 -5417 -5792 -7184 -5573 2737 1421 2770 3431 2057 4118 2601 -5984 -8551 -3266
12981c266L003l942J509O163O764N772o682j1923R07K963k55k513M176J392l254
$$ -3266 -263 -4205 -2696 3467 10231 16003 9321 -2602 -1695 1268 1013 -1500 2676 4068 814
12966H14m409r306l15J366L837m48J486j33k841J339R391q75L383L706j750o662
$$ 814 -3595 -12901 -13216 -11850 -8013 -8461 -6975 -7108 -9949 -8610 781 -94 3289 6995 5245 -1417
12950a417j688j052L264j561R545N294l834p723p39J165M568p92K879K214j523
$$ -1417 -3105 -4157 -893 -2454 7091 12385 8551 828 89 1254 5822 5030 7909 10123 8600
12935H600L741K716p002j602q974j198R74k268M536n762p185N583J791O051J358
$$ 8600 12341 15057 8055 6453 -2521 -3719 -2745 -5013 -477 -6239 -13424 -7841 -6050 1 1359
12920A359j606J15j1119K526M073L703N269Q266K509p555o115j552L240J238O25
$$ 1359 -247 -132 -11251 -8725 -4652 -949 4320 12586 15095 7540 1425 -127 3113 4351 4976
12905D976j643K805L045j376J321j149n206k57Q391m624q482l488J145L224P678
$$ 4976 3333 6138 9183 7807 9128 7979 2773 2516 10907 6283 -2199 -5687 -4542 -1318 6360
12890F360p25q55o96j712k880K808k28l392L771J764L822k739k090k638J120j931
$$ 6360 5635 4780 4084 2372 -508 2300 2072 -1320 2451 4215 8037 5298 3208 570 1690 -241
12874b41n945L037K035L01L573K684K626j181l057m007n14O469K052n180q913
$$ -241 -6186 -3149 -1114 -813 2760 5444 8070 6889 3832 -175 -689 5780 7832 2652 -6261
12859f261p41P479N564M597J717l785n309k368r96J359L394J75j357J714j007
$$ -6261 -7002 477 6041 10638 12355 8570 3261 893 -103 1256 4650 4825 3468 5182 4175
12844D175l694K545L265J83M814k714K208o68k534m145N08n192n265k524R14L797
$$ 4175 481 3026 6291 6474 11288 8574 10782 10114 7580 3435 3943 -1249 -6514 -9038 -8124 -4327
12828d327j569m430n359O403N559m585R338M446o868n570j172P485K354Q486j597
$$ -4327 -5896 -10326 -15685 -9282 -3723 -8308 1030 5476 -1392 -6962 -8134 -649 1705 10191 8594
12813H594K11r97n187j593R996L943n286j0668K502J3272k175J055J827o423n236
$$ 8594 8805 7808 2621 1028 11024 14967 9681 -987 1515 14787 12612 13667 15494 9071 3835
12798C835j19k070J759N783O84m435p436L508J832K788Q65p392K770J788j408
$$ 3835 3716 1646 3405 9188 9872 5437 -1999 1509 3341 6129 6994 -398 2372 4160 2752
12783B752K313J344k826L055m70n374j333M479q87q835J557k883L115P970L506
$$ 2752 5065 6409 3583 6638 6168 794 -539 3940 3053 -5782 -4225 -7108 -3993 3977 7483
12768G483Q97o400m37M76M61m566Q545m183l272J769j191l883j150L017l861n429
$$ 7483 8380 1980 1543 2019 2480 -2086 6459 2276 -996 773 -418 -4301 -5451 -2434 -6295 -11724
12752a1724L697O1q379M680Q656M316K642J931L279j0949p911k97j802L409R94
$$ -11724 -8027 -7966 -16345 -11665 -3009 1307 3949 5880 9159 -1790 -9701 -9998 -11800 -8391 -7397
12737g397L862k94j296K808k414K965J536R791k362p181k0K977J262k918Q38m314
$$ -7397 -3535 -3829 -5125 -2317 -4731 -1766 -230 9561 7199 18 -2 2975 4237 1319 2157 -2157
12721b157o72o99l099j343L892n59n343l564j226J109j608Q367M586k969K307
$$ -2157 -2829 -3528 -6627 -7970 -4078 -4637 -9980 -13544 -14770 -13661 -15269 -6902 -2316 -5285 -2978
12706b978j054o750L398O620J845L185N87o857n309P969P640m265n967K226r20
$$ -2978 -4032 -10782 -7384 -764 1081 4266 4853 -2004 -7313 656 8296 4031 -1936 290 -630
12691f30l062N008K410M986K347O56k165P53L18m308k447L742n487m006O497m58
$$ -630 -3692 1316 3726 8712 11059 11715 9550 10303 10621 6313 3866 7608 2121 -1885 4612 4154
12675D154Q87L49l368J798L406n68o973p387L842K919n06l81P430M645l096p075
$$ 4154 5041 5390 2022 3820 7226 6658 -315 -7702 -3860 -941 -1447 -1828 5602 10247 7151 76
12659G6l192j023M234N108K33j696J141o13o387J145O209k090k648J29j887Q52
$$ 76 -3116 -4139 95 5203 5436 3740 4881 4268 -2119 -974 5235 3145 497 626 -1261 -409
12643d09J035Q89k066K686J716m891m287J3747J3945N939K432J39m338j3409k211
$$ -409 626 1515 -551 2135 3851 -1040 -5327 8420 22365 28304 30736 30875 26537 13128 10917
12628A0917K037j464q094R94J0510L313P298k297L614k485m461j1502J292J0590
$$ 10917 12954 11490 3396 4390 14900 18213 25511 23214 26828 24343 19882 8380 9672 20262
12614B0262R02l800j877k470j407m535m42L408P144j57J1649J2356k507j843n717
$$ 20262 21164 17364 15487 13017 11610 7075 6633 10041 17185 17028 28677 41033 38526 36683 30966
12599C0966K185R697J0284K0595K9035K5205K124j8073j4367m438k392K99q846
$$ 30966 33151 42848 53132 73727 102762 127967 130091 112018 97651 93213 90821 91120 82274
12586H2274j2933p355r943j1890l653R61J1060J8596R839j880n791j204N090K766
$$ 82274 69341 61986 52043 40153 36500 37461 48521 67117 76956 75076 69285 68081 73171 75937
12572G5937k673m105P490J5685J7934P013n821m588q551q309N618R288Q241J2708
$$ 75937 73264 69159 76649 92334 110268 117281 111460 106872 98321 90012 95630 104918 113159 125867
12558A25867M615N876J7457J1034K7848N5878P1990K8596n0466n9495m3240k8234
$$ 125867 130482 136358 153815 164849 192697 248575 320565 349161 298695 239200 195960 167726
12546A67726j0061l505n953j2785j8619q479r052m669o10P655N961p387j7675
$$ 167726 157665 154160 148207 135422 116803 108324 99272 94603 93993 101648 107609 100222 82547
12533H2547j1952Q73J0456l75m340p334M310P058l928o422o608j021l622j661
$$ 82547 70595 71468 81924 81549 77209 69875 74185 81243 77315 70893 64285 63264 59642 57981
12519E7981M780O764R783O869L869L040q1o375J1016L1375J3853j7175k6644k0187
$$ 57981 62761 69525 79308 86177 90046 93086 93005 86630 97646 129021 142874 125699 99055 78868
12505G8868k3776j8103p903J1450Q203l304j544k881m906n991o874j324l368j241
$$ 78868 55092 36989 29086 40536 48739 45435 43891 41010 36104 30113 23239 21915 18547 17306
12491A7306O178M958n498o888L40Q14L401R016L751l054m445l453m167q482p240
$$ 17306 23484 28442 22944 16056 16396 17210 20611 29627 33378 30324 25879 22426 18259 9777 2537
12476B537M603K078k337q00M358q52k385m019k093j311l521l71L974K290P103
$$ 2537 7140 9218 6881 6081 10439 9587 7202 3183 1090 -221 -3742 -4113 -139 2151 9254
12461I254N696k491r12L754n631k035k114j1138L527J9934O003J870J0162J0205
$$ 9254 14950 12459 11547 15301 9670 7635 5521 -5617 -2090 17844 23847 25717 35879 46084
12447D6084O721L244K997O313M079r08q325l566r473o266n775N79m33k886k4O360
$$ 46084 52805 56049 59046 65359 69438 68530 60205 56639 47166 40900 35125 35704 35271 32385 32361 38721
12431C8721Q16o040m187m947m829P01J643k84L324M877M439m87o636n055l12n65
$$ 38721 39537 33497 29310 24363 19534 20235 21878 21594 24918 29795 34234 33747 27111 22056 21744 21179
12415B1179J41M108M826J2708L385n89J3382J7238J3905K0412J6027R283Q008
$$ 21179 21320 25428 30254 42962 46347 45758 59140 76378 90283 110695 126722 136005 144013
12402A44013N066j368r224k2694j8612j4839r299j0725j0718r388o992n795j773
$$ 144013 149079 147711 138487 115793 97181 82342 73043 62318 51600 42212 35220 29425 27652
12389B7652M72M305M356L795m844p890m009j1039q784k73O74M668k014l455L624
$$ 27652 28124 32429 36785 40580 35736 27846 23837 12798 4014 3741 4415 9083 7069 3614 7238
12374G238J0686n460q202J426J3104J2038R252R692L470N409J0527L110l24K482
$$ 7238 17924 12464 4262 5688 18792 30830 40082 49774 53244 58653 69180 72290 71966 74448
12360G4448M8J916l184j4376j0979p889n887r934n18K430q91j485J154K003l178
$$ 74448 74496 76412 73228 58852 47873 39984 34097 24163 23645 26075 25184 23699 24853 26856 23678
12345B3678j1586l169J345j733M422k539n777K964k999R35P33L65k24j990M67
$$ 23678 12092 8923 10268 8535 12957 10418 4641 7605 4606 5541 6274 6639 6415 4425 4892
12330D892l108J072J261M202K736j0599j1161k048O770J131R1O271J147j911o81
$$ 4892 1784 2856 4117 8319 11055 456 -10705 -12753 -5983 -4852 -4761 1510 2657 746 65
12315F5l60K155M000J0019k83q044n732L666K702m005r434L226R776q11m666o593
$$ 65 -295 1860 5860 15879 15596 7552 1820 5486 8188 4183 -5251 -2025 7751 6940 2274 -4319
12299d319j713P340j36Rj583p852p004M156J2479M788R94k674K64O201J212Q36
$$ -4319 -6032 1308 1172 1181 -402 -8254 -15258 -11102 1377 6165 7159 4485 4749 10950 12162 12998
12283A2998p120O717L153l84J564m220l09K488p956j064k180n478Q324N039j200
$$ 12998 5878 12595 15748 15364 16928 12708 12399 14887 6931 5867 3687 -1791 6533 11572 10372
12268A0372q12p599L96L636L440K368l771r332L57K974j887k5N558k596r88J031
$$ 10372 9560 1961 2357 5993 9433 11801 8030 -1302 -945 2029 142 117 5675 3079 2091 3122
12252C122j079r729j257k45L129L584j037M14M078Q429O27q366k020m71o074o063
$$ 3122 2043 -7686 -8943 -9188 -6059 -2475 -3512 -3098 980 9409 10036 1670 -350 -821 -6895 -12958
12236a2958l723J015O438M515R875K070l904m312j297M153K470P52p55r54j979
$$ -12958 -16681 -15666 -9228 -4713 5162 7232 3328 -984 -2281 1872 4342 5094 4339 3385 1406
12221A406q362l126L813K410P994L565o812j635J904M580L973j636j1412l844
$$ 1406 -6956 -10082 -6269 -3859 4135 7700 888 -747 1157 5737 9710 8074 -3338 -7182
12207g182m415K917P753j768k230L009K140q3n531o485J359P650N618O53K511
$$ -7182 -11597 -8680 -927 -2695 -4925 -1916 224 141 -5390 -11875 -10516 -2866 2752 3405 5916
12192E916n043m220J175o541m43Q450N834M61L130p51p3J144n343j0032J358M861
$$ 5916 873 -3347 -2172 -8713 -9156 -706 5128 5589 8719 7968 7895 9039 3696 -6336 -4978 -117
12176a17k272R10q360p031L616N111K848N869N048P928K378o648l604l479m375
$$ -117 -2389 -1479 -9839 -16870 -13254 -8143 -5295 574 5622 13550 15928 9280 5676 2197 -2178
12161b178L533P317N20J304K582K270p088q004K179Q833L676O010J5731j817j0061
$$ -2178 1355 8672 9192 10496 13078 15348 8260 256 2435 11268 14944 20954 36685 34868 24807
12146B4807l069l775q788m827o244j075Q318L805j228L438m726j894N150J656
$$ 24807 21738 17963 9175 4348 -1896 -2971 5347 9152 7924 11362 6636 4742 9892 11548
12132A1548o791n694m490K447L27O566M757l318j211l166L731O141J13r317r09
$$ 11548 4757 -937 -5427 -2980 -2653 3913 8670 5352 4141 975 4706 10847 10960 1643 734
12117G34M416k092l298l964L431P577L003K584J535N274N141K029k995K349j404
$$ 734 5150 3058 -240 -4204 -773 6804 9807 12391 13926 19200 24341 26370 23375 25724 24320
12102B4320m083j2960m342j216k111Q80n243O29J0137K068m020J287l670m34l75
$$ 24320 20237 7277 2935 1719 -392 488 -4755 -4126 6011 8079 4059 5346 1676 1242 867
12087H67k523N312J59N38k076L971J812p429o26L488N211P51Q893J601m312m248
$$ 867 -1656 3656 3815 4353 2277 6248 8060 631 5 3493 8704 9455 18348 19949 15637 11389
12071A1389p394k436K027P60N929p459o149K262J468M905J299L086M846j365k383
$$ 11389 3995 1559 3586 4346 10275 2816 -3333 -1071 397 5302 6601 9687 14533 13168 10785
12056A0785l973K926J031k62j255L17O02J1174J1971M172n119q379o164o953J197
$$ 10785 6812 9738 10769 10507 9252 9569 10171 21345 33316 37488 32369 23990 17826 10873 12070
12041A2070l00l014m682l776o842j768O102M910M975M377J749q771m765J102N082
$$ 12070 11770 8756 4074 298 -6544 -8312 -2210 2700 7675 12052 13801 5030 265 1367 6449
12026F449k564J926K787M976O588R77m601l294n615j2169j529J806P693N279K106
$$ 6449 3885 5811 8598 13574 20162 21139 16538 13244 7629 -4540 -6069 -4263 3430 8709 10815
12011A0815J757K045J4814J7188N816J0434j615j0361q817r350p909n729n975
$$ 10815 12572 14617 29431 46619 52435 62869 61254 50893 42076 32726 24817 19088 13113
11998A3113P70j412r197k095J616r156j484O162J373L209L670l947m758M592L002
$$ 13113 13883 12471 3274 1179 2795 -6361 -7845 -1683 -310 2899 6569 2622 -2136 2456 5458
11983E458r55o5j88l689J92n699K17J170O205j836K577J290L952K547K331m211
$$ 5458 4503 4438 4250 561 753 -4946 -4729 -3559 2646 810 3387 4677 8629 11176 13507 9296
11967I296j116O966J5141R329o014r387m809P93j765p261l354L114L362J065o975
$$ 9296 8180 15146 30287 39616 33602 24215 19406 20199 18434 11173 7819 10933 14295 15360 8385
11952H385j921k387l303k90M655N942K649O22p801j0148l516K014M557R262K732
$$ 8385 6464 4077 774 484 5139 11081 13730 14352 6551 -3597 -7113 -5099 -542 8720 11452
11937A1452j0468k369R74K007P807K60l012J323j990m592J86L12L456N466K796
$$ 11452 984 -1385 -411 1596 9403 9663 6651 7974 5984 1392 1578 1890 5346 10812 13608
11922A3608k159P54L948R06j584o901j622J25m216j0653j875k57P802Q752O750
$$ 13608 11449 12203 16151 17057 15473 8572 6950 7075 2859 -7794 -9669 -9926 -2124 6628 13378
11907A3378M577n375p820J339M151M016k993j995o520p19k563J48K624o70j101
$$ 13378 17955 12580 4760 6099 10250 14266 11273 9278 2758 2039 -524 -376 2248 1578 477
11892D77K704N469k546k11K230L721p17K285O368m600o003l008o213j1465N759
$$ 477 3181 8650 6104 5893 8123 11844 11127 13412 19780 15180 9177 6169 -44 -11509 -5750
11877e750O689M011K130r53P10q375j489P11L143O936J34M409K153q415l571l383
$$ -5750 939 4950 7080 6127 6837 -1538 -3027 -2316 827 7763 7897 12306 14459 6044 2473 -910
11861i10j038M799O42P4O598K74j1404l967L101K353K396O105l81n294m777M224
$$ -910 -1948 2851 3493 3567 10165 10439 -965 -4932 -1831 522 2918 9023 8642 3348 -1429 2795
11845B795k050l335l71K418J072m483O101P479j251r41k968o962m119N830P070
$$ 2795 745 -2590 -2961 -543 529 -3954 2147 9626 8375 7434 4466 -2496 -6615 -785 6285
11830F285M067j026l374o389K31L571q327o111j174M821J0694Q727l539l872R3
$$ 6285 10352 9326 5952 -437 -206 3365 -4962 -11073 -12247 -7426 3268 11995 8456 4584 4677
11815D677M294k086j0083p52L009L804N400L752J25p048l224J606J907m017q828
$$ 4677 8971 6885 -3198 -3950 -941 2863 8263 12015 12140 5092 1868 3474 5381 1364 -7464
11800g464j0159L727Q393M284l817k870M831J0288R61j762n587R98o932k502P670
$$ -7464 -17623 -13896 -5503 -1219 -5036 -7906 -3075 7213 8174 6412 825 1823 -5109 -7611 59
11785E9J804p189K181K672O03m062K422L495k53R08K057K725n720m719L034L188
$$ 59 1863 -5326 -3145 -473 130 -3932 -1510 1985 1732 2640 4697 7422 1702 -3017 17 3205
11769C205j782n745N007K258l896k029k653M676K94l45n234l212o19J1524M402
$$ 3205 1423 -4322 685 2943 -953 -2982 -5635 -959 -665 -1010 -6244 -9456 -10075 1449 5851
11754E851j063O160K226o015p574K070R707K32l864M33O854L969k718l982l80
$$ 5851 4788 10948 13174 7159 -415 1655 11362 11594 7730 8163 15017 18986 16268 12286 11906
11739A1906N88q362k683j60M852r948n167J758M798m707J728M337M699L437l315
$$ 11906 12494 4132 1449 1289 6141 -3807 -8974 -7216 -2418 -7125 -5397 -1060 3639 7076 3761
11724C761p776J571m781N355Q371R16l436O658k988j0493N357L641P250L618n724
$$ 3761 -4015 -2444 -7225 -1870 6501 7417 3981 10639 7651 -2842 2515 6156 13406 17024 11300
11709A1300l173k300o704l637O147O001L973n356m114m707j885j96N810L757l097
$$ 11300 8127 5827 -877 -4514 1633 7634 11607 6251 2137 -2570 -4455 -4651 1159 4916 1819
11694A819N663J177k435p59n999r24j272J59N938K898j108M527L785p127L249
$$ 1819 7482 8659 6224 5465 -534 -1458 -2730 -2571 3367 6265 5157 9684 13469 6342 9591
11679I591L161n316m8o599M924R946N847o427j2220n612K443N553R70k648O5K512
$$ 9591 12752 7436 7388 789 5713 15659 21506 15079 2859 -2753 -310 5243 6213 3565 3630 6142
11663F142Q26l464m246k69m224j587K886N596o705k230K666N250J211k145k718
$$ 6142 6968 3504 -742 -1011 -5235 -6822 -3936 1660 -5045 -7275 -4609 641 1852 -293 -3011
11648c011N3K567M733J656N646k196o634M8n486L903L646J778o56k558l886J503
$$ -3011 -2958 -391 4342 5998 11644 9448 2814 2862 -2624 1279 4925 6703 6047 3489 -397 1106
11632A106M193o209l42M246J89r84N221K961o02k631K557K422j0434K256K367
$$ 1106 5299 -910 -1252 2994 3183 2199 7420 10381 9779 7148 9705 12127 1693 3949 6316
11617F316n655l919J562J973L832L340M463n03l564m158o331M872M917m257k869
$$ 6316 661 -3258 -1696 277 4109 7449 11912 11409 7845 3687 -2644 2228 7145 2888 19
11602A9J991J961n109l4j806K398J3591j231r579j368K102m152N708Q474K538
$$ 19 2010 3971 -1138 -1172 -2978 -580 13011 11780 2201 833 2935 -1217 4491 12965 15503
11587A5503n280j1174j243k58M63k967L36K763L066O83o866J326L544j354N527
$$ 15503 10223 -951 -2194 -2452 -1989 -4956 -4620 -1857 1209 1892 -4974 -3648 -104 -1458 4069
11572D069K117O73n578l977J855j38M793J454j672M007N135K279m09k803L33R97
$$ 4069 6186 6859 1281 -2696 -841 -979 3814 5268 3596 7603 12738 15017 14608 11805 12138 13135
11556A3135k333n312J774O37M561k77l647k458q52O199J306N94k838L137L354
$$ 13135 10802 5490 7264 7901 12462 12185 8538 6080 5228 11427 12733 13327 10489 13626 16980
11541A6980M995k465j1887o908Pj06m648M917L82m619k105Q268O670O20n975r671
$$ 16980 21975 19510 7623 715 722 616 -4032 885 1267 -3352 -5457 2811 9481 10101 4126 -5545
11525e545M951L208k932j93j805N366J789M396P780n722j807l637p235M43Q959
$$ -5545 -594 2614 -318 -511 -2316 3050 4839 9235 17015 11293 9486 5849 -1386 -943 8016
11510H016J798j0332n531k232n85J288l624J094M598L266K215K417l631l805k839
$$ 8016 9814 -518 -6049 -8281 -8866 -7578 -11202 -10108 -5510 -2244 -29 2388 -1243 -5048 -7887
11495g887M787Q904N667O688l385l65n25M05m15k566p936k894M706J858m075L1
$$ -7887 -3100 5804 11471 18159 14774 14409 13884 14289 13874 11308 3372 478 5184 7042 2967 2998
11479B998J260m983l487Q977L830k668K932N640l203o557J328N573Q13l901r038
$$ 2998 4258 -725 -4212 4765 8595 5927 8859 14499 11296 4739 6067 11640 12453 8552 -486
11464d86O92R249M123j114j530j650n518K133K845j969R94O975M573m170o770
$$ -486 206 9455 13578 12464 10934 9284 3766 5899 8744 6775 7769 14744 19317 15147 8377
11449H377M184n88m565n727k724M101M859M459k900p368M708K785k46L644J944
$$ 8377 12561 11973 7408 1681 -1043 3058 7917 12376 9476 2108 6816 9601 9355 12999 14943
11434A4943j003o84L010n346K656L198p472r53j076j370J847N574J397k287K352
$$ 14943 13940 13256 16266 10920 13576 16774 9302 8349 7273 5903 7750 13324 14721 12434 14786
11419A4786P98o865k392K511o806j765L824N148Q759k920q103r370N949J3144
$$ 14786 15584 8719 6327 8838 2032 267 4091 9239 17998 15078 6975 -2395 3554 16698
11405A6698l473k433p38m077J237o53k418K256L579L183n809j676L576J255J181
$$ 16698 13225 10792 10054 5977 7214 6561 4143 6399 9978 13161 7352 5676 9252 10507 11688
11390A1688K599l735j426n983l509Q031Q07m018o867l305k811J200J0472M315
$$ 11688 14287 10552 9126 3143 -366 7665 8472 4454 -2413 -5718 -8529 -7329 3143 7458
11376G458P20k659l176k890M666M399P64J253k026k507P12K405m320l693N04L096
$$ 7458 8178 5519 2343 -547 4119 8518 9282 10535 8509 6002 6714 9119 4799 1106 1610 4706
11360D706J676J913M737j638j1479r54M429O110N05q73M319k870k105p526m334
$$ 4706 6382 8295 13032 11394 -85 -1039 3390 9500 10005 9132 13451 10581 8476 950 -3384
11345c384J610k254K278J929P370K028l294j354L89l429l384j286O16K222L355
$$ -3384 -1774 -4028 -1750 179 7549 9577 6283 4929 5318 1889 -1495 -2781 -2165 57 3412
11330C412J486o574O778K697K673l853m693k533l008N171M925K354k16j540m601
$$ 3412 4898 -1676 5102 7799 10472 6619 1926 -607 -3615 1556 6481 8835 8619 7079 2478
11315B478l589l528M193M979O328L769p942j1228L608Q352P602m314P25j113k243
$$ 2478 -1111 -4639 -446 4533 10861 14630 6688 -4540 -932 7420 15022 10708 11433 10320 8077
11300H077N03l640P244L141j859M920P552J2599J1078j054J879K238r018j4563
$$ 8077 8580 4940 12184 15325 13466 18386 25938 38537 49615 48561 50440 52678 43660 29097
11286B9097j5220k247J378p436k725L888p89K894p030p24K659J88j381O1o405
$$ 29097 13877 11630 13008 5572 2847 6735 5946 8840 1810 1086 3745 3933 2552 2613 -3792
11271c792K014L337n83o503l788J510N078R976O65P08l263j744j958n80k702j033
$$ -3792 -1778 1559 976 -5527 -9315 -7805 -2727 7249 7914 8622 5359 3615 1657 1077 -1625 -2658
11255b658Q718J017p45J556k357j202p791m271P382O987k42Q024J820j144j429
$$ -2658 6060 7077 6332 7888 5531 4329 -3462 -7733 -351 6636 6394 14418 16238 15094 13665
11240A3665J001L639N22k932k768m622j239L290M012N647L01j4268n001L851J711
$$ 13665 14666 18305 18827 15895 13127 8505 7266 10556 14568 20215 20516 6248 1247 5098 6809
11225F809K731K623L241L689j003o601P36R75r33N151l079n102Q24K213J670j62
$$ 6809 9540 12163 15404 19093 18090 11489 12225 13200 12267 17418 14339 9237 10061 12274 13944 13782
11209A3782k424k172L787N609k573n903M4J168N15K432m566J887L858k738l185
$$ 13782 11358 9186 12973 18582 16009 10106 10150 11318 11833 14265 9699 11586 15444 12706 9521
11194I521k086j539M40O25M938K489M308Q843J2261K559R08m299o779J1168Q785
$$ 9521 7435 5896 6336 6961 11899 14388 18696 27539 39800 42359 43267 38968 32189 43357 52142
11179E2142j0225j0307l005k739p163m457M69q88O21K874N366l875j400n399r571
$$ 52142 41917 31610 28605 25866 18703 14246 14715 13827 14448 17322 22688 18813 17413 12014 2443
11164B443L910L644o26l074Q21p298K041j951j332J3926L206L519Q88r10j004
$$ 2443 6353 9997 9371 6297 7118 -180 1861 -90 -1422 12504 15710 19229 20117 19207 18203
11149A8203L579L504K961L163m769l594m256p301J811K921n44L990j600k394K92
$$ 18203 21782 25286 28247 31410 26641 23047 18791 11490 13301 16222 15678 19668 18068 15674 15966
11134A5966o470m969J454m60n931J772R57M272J333m601L005O4R44k836k627K241
$$ 15966 9496 4527 5981 5521 -410 1362 2319 6591 7924 3323 6328 6392 7336 4500 1873 4114
11118D114M635P709K775k631q145k938M337P069O330K285J449L652L238n595P372
$$ 4114 8749 16458 19233 16602 8457 5519 9856 16925 23255 25540 26989 30641 33879 28284 35656
11103C5656j331K354k510p394J27J80o051o641k549L838J3035m131n764K413M507
$$ 35656 34325 36679 34169 26775 26902 27082 21031 14390 11841 15679 28714 24583 18819 21232 25739
11088B5739j759L838k943l069j444j18K744L846n400m239P73K355l964k184m111
$$ 25739 23980 27818 24875 21806 20362 20244 22988 26834 21434 17195 17968 20323 16359 14175 10064
11073A0064J468j069L49j755j12J763Q192M044M69K790n38k001K616r60n09P07
$$ 10064 11532 10463 10812 9057 8945 10708 18900 22944 23413 26203 25665 23664 26280 25320 24811 25518
11057B5518o247k268K045J199k166R26L283j995m310j0140p481k368O778R191
$$ 25518 19271 17003 19048 20247 18081 19007 22290 20295 15985 5845 -1636 -4004 2774 11965
11043A1965j565l08M725k773K491K551l673k430q61R28n28L141M488j785j585
$$ 11965 10400 10092 14817 12044 14535 17086 13413 10983 10122 11050 10522 13663 18151 16366 14781
11028A4781N010L53n830p487M484k475m571M502P891j205p147o142j148k94n865
$$ 14781 19791 20144 14314 6827 11311 8836 4265 8767 16658 15453 8306 2164 1016 722 -5143
11013e143l278Q186M717J577R291l837o309J775L450m36K215L412j893j576m461
$$ -5143 -8421 -235 4482 6059 15350 11513 5204 6979 10429 9993 12208 15620 13727 12151 7690
10998G690j88L911J0364P406k293q30M01p607j063J1661N320o062l872q281j72
$$ 7690 7502 11413 21777 29183 26890 26060 26461 18854 17791 29452 34772 28710 24838 16557 16385
10983A6385M327m22r268k062J217M064j799l851J519k342K76L922m14m32k355
$$ 16385 20712 20290 11022 8960 10177 14241 12442 8591 10110 7768 8044 11966 11552 11120 8765
10968H765K305l76k565J602L027L445M227n293K300Q420m189j024j744n514K407
$$ 8765 11070 10694 8129 9731 12758 16203 20430 15137 17437 25857 21668 20644 18900 13386 15793
10953A5793K635l331j0406k497O997J146p587j550M367k198M657Q829Q233L141
$$ 15793 18428 15097 4691 2194 9191 10337 2750 1200 5567 3369 8026 16855 25088 28229
10939B8229p953n890l827J664Q242L402o308Q9k521j935j614o766j832l563Q065
$$ 28229 20276 14386 10559 12223 20465 23867 17559 17648 15127 13192 11578 4812 2980 -583 7482
10924G482R175K466K113o492l107O228O554M582p238r332l834L460l333M903j019
$$ 7482 16657 19123 21236 14744 11637 17865 24419 29001 21763 12431 8597 12057 8724 13627 12608
10909A2608l635K87K497O54l548j766N50L592O604n446M707K084N07m938k100
$$ 12608 8973 9260 11757 12411 8863 7097 7647 11239 17843 12397 17104 19188 19695 14757 12657
10894A2657p21Q744J977J613L1n100K071R68j487m771M850M607o059J328Q277
$$ 12657 11936 20680 22657 24270 24301 19201 21272 22240 20753 15982 20832 25439 19380 20708 28985
10879B8985q55n973k641o561n299N892N650J43J346K048N126k237k352J4M56Q680
$$ 28985 28130 22157 19516 12955 7656 13548 19198 19341 20687 22735 27861 25624 23272 23286 23742 32422
10863C2422k050o917j1314M326Q712m55R37J733o847m357O618k012j739l86j042
$$ 32422 30372 23455 12141 16467 25179 24724 25661 27394 20547 16190 22808 20796 19057 18671 17629
10848A7629k292M369J832L496K636J306m140K282L72j340j600o920n390p63O412
$$ 17629 15337 19706 21538 25034 27670 28976 24836 27118 27490 26150 24550 17630 12240 11477 17889
10833A7889Q564j557n355M412M126l474K022l32q02m83m204J433L34k074j318
$$ 17889 26453 24896 19541 23953 28079 24605 26627 26295 25493 25010 20806 22239 22573 20499 19181
10818A9181l338L335K597N692K268j1586j0883L811L068j325Q00M341L143m93
$$ 19181 15843 19178 21775 27467 29735 18149 7266 11077 14145 12820 13620 17961 21104 20611
10804B0611o900J116M369N696j663l631n001P344M865m538M61K88L851M909J979
$$ 20611 13711 14827 19196 24892 23229 19598 14597 21941 26806 22268 22729 23017 26868 31777 33756
10789C3756m19L804j1155k176N151J103j786R866n658k328R10k816N15L705n487
$$ 33756 33337 37141 25986 23810 28961 30064 28278 38144 32486 30158 31068 28252 28767 32472 26985
10774B6985p939j913M117j984n126J151M020K950N590k545L778L016k858O024
$$ 26985 19046 17133 21250 19266 14140 15291 19311 22261 27851 25306 29084 32100 29242 35266
10760C5266Q604R22l831l588o067l717K395k44L742n43l692L919M773J987L349
$$ 35266 43870 44792 40961 37373 31306 27589 29984 29740 33482 32939 29247 33166 37939 39926 43275
10745D3275k462p68o078k660Q17M66r241q282K31L291J1554J6317M363l65J486
$$ 43275 40813 40045 33967 31307 32124 32590 23349 15067 15298 18589 30143 46460 50823 50458 51944
10730E1944j521k517o080j0507j351N059J213j82M405p31l474n645K721K101k578
$$ 51944 50423 47906 41826 31319 29968 35027 36240 36058 40463 39732 36258 30613 33334 35435 32857
10715C2857K007P77M482K316k564L115J46J70o567j685j228K377l079O583k484
$$ 32857 34864 35641 40123 42439 39875 42990 43136 43306 36739 35054 33826 36203 33124 39707 37223
10700C7223k781k115J846l36N837M486j328J601L466n616J56K287j880n359J230
$$ 37223 34442 32327 34173 33837 39674 44160 42832 44433 47899 42283 42439 44726 42846 37487 38717
10685C8717J888l959k081q60k579k306M090k031K088l120o266J0970K943q644
$$ 38717 40605 36646 34565 33705 31126 28820 32910 30879 32967 29847 23581 34551 37494 28850
10671B8850p960j3483j00J281k177k747m52M969R320J7205J6587K247l512j1231
$$ 28850 20890 7407 7307 8588 6411 3664 3212 8181 17501 34706 51293 53540 50028 38797
10657C8797M743J8001L987j44m615J150Q191K514K616J197L383M571Q162K799
$$ 38797 43540 61541 65528 65384 60769 61919 70110 72624 75240 76437 79820 84391 92553 95352
10643I5352M965J4684J7667K6081L4675N2918Q7956J36075K40302M27960N37488
$$ 95352 100317 115001 132668 158749 193424 246342 334298 470373 710675 1138635 1676123
10632A676123L84646M51689K95386k53544l08076m10771n44806m28316k81239
$$ 1676123 2060769 2512458 2807844 2554300 2246224 1835453 1290647 862331 581092
10623E81092j73227r8532n8874l9450l0237j6729j3257j6048j8613j8622n146
$$ 581092 407865 309333 250459 211009 180772 164043 150786 134738 116125 97503 92357
10612I2357l724j2178j1009o25K777M836o410n297l717k68n268n060p701p775
$$ 92357 88633 76455 65446 64821 67598 72434 66024 60727 57010 56742 51474 46414 38713 30938
10598C0938k084Q9J205J862L290P900l615n684M842J773J922J73L365k445j976
$$ 30938 28854 28943 30148 32010 35300 43200 39585 33901 38743 40516 42438 42611 45976 43531 41555
10583D1555O780J876K690J504m085l619J1129O665J165n838k192K240j156m753
$$ 41555 48335 50211 52901 54405 50320 46701 57830 64495 65660 59822 57630 59870 58714 53961
10569E3961p758M818l719l679k229j805n141r58K083k131L158Q413Q828M084j262
$$ 53961 46203 51021 47302 43623 41394 39589 34448 33490 35573 33442 36600 45013 53841 57925 56663
10554E6663M870J737N08M491O140o117J193L014k819l064L713k064n529j1541
$$ 56663 61533 63270 63778 68269 74409 68292 69485 72499 69680 66616 70329 68265 62736 51195
10540E1195n253o816k888j2589q436P742J2027K6685K7702K7605L9017K4585K0849
$$ 51195 45942 39126 36238 23649 15213 22955 34982 61667 89369 116974 155991 180576 201425
10527B01425O500n864j4672j1358j1864j3155j4554j5614k066j794o05k119q088
$$ 201425 207925 202061 187389 176031 164167 151012 136458 120844 118778 116984 116379 114260 106172
10514A06172m575q0l863R58l028K731L706O35l095O398K198p118J479M283N318
$$ 106172 101597 101517 97654 98612 95584 98315 102021 102656 99561 105959 108157 101039 102518 106801 112119
10499A12119j74j4296p582L957Q083R230J4648J2841P096J0885J7239L0739L7940
$$ 112119 111945 97649 90067 94024 102107 111337 125985 138826 145922 156807 174046 204785 242725
10486B42725N8859P2779Q4410J01162P9822K3046M170j8653l807k9834j04725
$$ 242725 301584 374363 458773 559935 639757 662803 666973 648320 644513 614679 509954
10475E09954q4246q8574q8638o2043m6653k5804o594R57Q587J246Q379j713o207
$$ 509954 425708 337134 248496 186453 139800 113996 107402 108359 116946 118192 126571 124858 118651
10462A18651p372K752m479j4224q449n427J486o164n985o3j471m253L912O593
$$ 118651 111279 114031 109552 95328 86879 81452 82938 76774 70789 70726 69255 65002 68914 75507
10448G5507K80J237L91P571J1130K1667K8091L4808M5128N5562O6702P6375P4555
$$ 75507 75787 77024 77415 84986 96116 117783 145874 180682 225810 281372 348074 424449 499004
10435D99004J6226p0558r5589q4097n7619l8403l1935j7034j7695j3985j8704
$$ 499004 515230 444672 349083 264986 207367 168964 137029 119995 102300 88315 69611
10424F9611k0729j6643n943p907q412k289J852o614L873J6613M521Q034J2989
$$ 69611 48882 32239 26296 18389 9977 7688 9540 2926 6799 23412 27933 35967 48956
10411D8956J764K963N381n24p986j2900n257M287O059R678K1576K0276Q322L507
$$ 48956 50720 53683 59064 58540 50554 37654 32397 36684 42743 52421 73997 94273 102595 106102
10397A06102J801k003m41l714j758J0931J1369Q938L235J333j0890k1375j9954
$$ 106102 107903 105900 105459 101745 99987 110918 122287 131225 134460 135793 124903 103528 83574
10384H3574k950K5126N4450R0035Q2435P1506P8529M1888J6387k19j5448k7676
$$ 83574 80624 105750 160200 250235 332670 404176 482705 524593 540980 540761 525313 497637
10372D97637k9363j4839k3718k9527j2566p402p878j682q070K42j30k150M761
$$ 497637 468274 453435 429717 400190 387624 380222 372344 370662 362592 362834 362704 360554 365315
10359C65315J2080J8152L4795N8344Q5458J09615P8099Q3088Q9406k7251m2334
$$ 365315 377395 395547 430342 488686 574144 683759 761858 844946 934352 907101 864767
10348H64767n2108r2481q0123o9028m8783n0757m5371k8501k5020k1669j4431
$$ 864767 812659 720178 640055 571027 522244 471487 426116 397615 372595 350926 336495
10337C36495j3401p258P88J2469M939n59l378q437j4121l129j559l797M740J1639
$$ 336495 323094 315836 316624 329093 334032 333473 330095 321658 307537 304408 302849 299052 303792 315431
10323C15431N446m83J501M645Q644J2666J8327K0449K4106J7792P746P047R925
$$ 315431 320877 320394 321895 326540 335184 347850 366177 386626 410732 428524 436270 443317 453242
10310D53242o442m513J0454J0480k072n557q335j8993m070M35j0337k425J5175
$$ 453242 446800 442287 452741 463221 461149 455592 447257 428264 424194 424629 414292 411867 427042
10297D27042O451J1451J2074J3452J3275J957N585J6022Q137K0141K7385L4267
$$ 427042 433493 444944 457018 470470 483745 485702 491287 507309 515446 535587 562972 597239
10285E97239N0124O6164O3045M3420L9184K3687J5331Q467L944J5233J2807J7091
$$ 597239 647363 713527 776572 819992 859176 882863 898194 906661 910605 925838 938645 955736
10273I55736K4624L4864M5241N8873P2817R1885Q6287P4022Q8419Q6180P7374
$$ 955736 980360 1015224 1060465 1119338 1192155 1284040 1370327 1444349 1532768 1618948 1696322
10262A696322Q1535R5762J03398J17261J25134J36573J64546J87726K20720L04464
$$ 1696322 1777857 1873619 1977017 2094278 2219412 2355985 2520531 2708257 2928977 3233441
10252C233441M02442N86479Q29206P72028P79183Q59507L12340J89848K42487
$$ 3233441 3635883 4222362 5051568 5823596 6602779 7462286 7774626 7964474 8206961
10243H206961J51866M71992R23240J381232J647947K001306K324861K441731L304844
$$ 8206961 8358827 8830819 9754059 11135291 12783238 14784544 17109405 19551136 22855980
10234B2855980M688903O916527J0607258J6856921K7958134M7933905Q2164495
$$ 22855980 27544883 34461410 45068668 61925589 89883723 137817628 219982123
10227B19982123R7294742O2483415P7272454M4993382m5479203m8352495o9227345
$$ 219982123 317276865 379760280 457032734 502026116 456546913 408194418 338967073
10220C38967073r7053953p9487128n3862306l3560660k0229609j2471816q119313
$$ 338967073 241913120 162425992 108563686 75003026 54773417 42301601 34182288
10213C4182288n849836m235773l172279k999048k515144k116350j974472j547566
$$ 34182288 28332452 24096679 20924400 17925352 15410208 13293858 11319386 9771820
10205I771820j106500o77142k40572j93894q9863n259n52792o70673o85096q69475
$$ 9771820 8665320 7988178 7747606 7553712 7463849 7458590 6905798 6235125 5550029 4680554
10195D680554p47996n44160l89350k91183j96184j41840j12752r4679j04493j11639
$$ 4680554 3932558 3388398 2999048 2707865 2511681 2369841 2257089 2162410 2057917 1946278
10185A946278j36873j32919j19898j07822p8891m9857m3218l7443l8749n3686
$$ 1946278 1809405 1676486 1556588 1448766 1369875 1320018 1276800 1239357 1200608 1146922
10175A146922n5516n4717n2860m5658n7390n7672m5913m4854j8967L446J0249
$$ 1146922 1091406 1036689 983829 938171 880781 823109 777196 732342 713375 716821 727070
10164G27070M1683L9783L4169M8986N9555O6277P6890R1255J32921J71996J34163
$$ 727070 768753 808536 842705 891691 951246 1017523 1094413 1185668 1318589 1490585 1624748
10153A624748R2760J66016K24954P0672k07O9093J22309K37217M89807O05413
$$ 1624748 1717508 1883524 2108478 2179150 2178943 2248036 2370345 2607562 3097369 3702782
10143C702782M73765J17566k95019m64106m61996n38618m35173k66337k42955
$$ 3702782 4176547 4294113 3999094 3534988 3072992 2534374 2099201 1832864 1589909
10134A589909k75815k38313j76258j37091j14011r2322o0525n5719m2828k6586
$$ 1589909 1314094 1075781 899523 762432 648421 556099 495574 439855 397027 370441
10124C70441k3498j3251j8701k8902j9505k3226k4995j8393j0018p383L066K055
$$ 370441 346943 333692 314991 286089 266584 243358 218363 199970 189952 182569 185635 187690
10112A87690J07j554J43q529k290P204K7022K1228K2968K8849K3085r60J734J5008
$$ 187690 187797 186243 186386 177857 175567 182771 209793 231021 253989 282838 305923 304963 306697 321705
10098C21705n4561k0157k0166n5028j3542k4053k7836j6066j5299p425r989j5757
$$ 321705 267144 246987 226821 171793 158251 134198 106362 90296 74997 67572 57583 41826
10086D1826j7650j5232p541j6880j8187k0797j9614j6953l0061l5452k3879k9310
$$ 41826 24176 8944 1403 -15477 -33664 -54461 -74075 -91028 -121089 -156541 -180420 -209730
10074b09730l8293k0497n621n071L9259O6110O3689J02222Q6529N6775M6989K5145
$$ -209730 -248023 -268520 -274141 -279212 -239953 -173843 -110154 -7932 78597 135372 182361 207506
10062B07506K015r715m863K186Q923P12p075k1401k0200p468j8645k8063r109
$$ 207506 209521 199806 194943 197129 206052 206764 199689 178288 158088 150620 131975 103912 94803
10049I4803O948J2297N484J7984K1900J1402p94o444k223j0849j4014M905k700
$$ 94803 101751 114048 119532 137516 159416 170818 170024 163580 161357 150508 136494 141399 138699
10036A38699l911K1758R013O188J8605J0824K175R59J135n150r893j1146k1255
$$ 138699 134788 156546 165559 171747 190352 201176 203351 204310 205445 200295 190402 179256 158001
10023A58001k6242j9530q202r171K573P31O055j548j514m866j3491j2440q886
$$ 158001 131759 112229 104027 94856 97429 98160 104215 102667 101153 96287 82796 70356 61470
10010F1470J0083j319n315L428O370J731r21R158L481j0P95M047R14J535n359
$$ 61470 71553 70234 64919 68347 74717 76448 75527 84685 88166 88156 88951 92998 93912 95447 90088
9995I0088r472j1179l301O274p916j3600r167r261o523N380O220j13L979P702
$$ 90088 80616 69437 66136 72410 64494 50894 41727 32466 25943 31323 37543 37430 41409 49111
9981D9111M108N810R937Q487R715N733k032l344N870O522r217j5433j6042j1687
$$ 49111 53219 59029 68966 77453 87168 92901 90869 87525 93395 99917 90700 75267 59225 47538
9967D7538j1154j0162j896L537j076k250r236k068J25K671O385l878R229N413
$$ 47538 36384 26222 24326 27863 26787 24537 15301 13233 13358 16029 22414 18536 27765 33178
9953C3178L986P430n573r604k132k981n821J538k944K129l856l464r359j129O130
$$ 33178 37164 44594 39021 29417 27285 24304 18483 20021 17077 19206 15350 11886 2527 1398 7528
9938G528j202l233l876k396m148M15m53r940o771j469l322m772j2604m423m685
$$ 7528 6326 3093 -783 -3179 -7327 -6912 -7365 -17305 -24076 -25545 -28867 -33639 -46243 -50666 -55351
9923e5351q36J2630J6393J7952R835J2258J3660J6050J4029J1117R535R50n043
$$ -55351 -56187 -43557 -27164 -9212 623 12881 26541 42591 56620 67737 77272 78222 73179
9910G3179j1867l132r383r859K587j852J10n676J944L700m473J233r938o6O380
$$ 73179 61312 58180 48797 38938 41525 39673 39783 34107 36051 39751 35278 36511 26573 26507 32887
9895C2887O12K898q1M500P862n04k804k23m438j0648k954p364n933M96p026m383
$$ 32887 33499 36397 36316 40816 48678 48174 45370 45147 40709 30061 27107 19743 13810 14306 7280 2897
9879B897j910J0117Q674k499o256p756q12O79j434L009M687n89J273J0535p68
$$ 2897 987 11104 19778 17279 11023 3267 2455 3134 1700 4709 9396 8807 10080 20615 19847
9864A9847M36M998K345R962O830N742K493j911l228l580k045l220J653N387K347
$$ 19847 20283 25281 27626 37588 44418 50160 52653 50742 47514 43934 41889 38669 40322 45709 48056
9849D8056q4N36N465Q15L195l645r22k701j077p40L085K318K068O847k313p514
$$ 48056 47972 48508 53973 54788 57983 54338 53416 50715 49638 48898 51983 54301 56369 63216 60903 53389
9833E3389L430L49k507N705R930L513J211J5080J3042J2637O814J4684L7626O5451
$$ 53389 56819 57168 54661 60366 70296 73809 75020 90100 103142 115779 122593 137277 174903 240354
9819B40354R9574J65906K92216M89264M99155L78457M81286P9357l09971l04654
$$ 240354 339928 505834 798050 1287314 1786469 2164926 2646212 2725569 2415598 2110944
9809B110944m97443n17655l71539k34988j42976q5071n4666m2803k2588j3540
$$ 2110944 1613501 1095846 724307 489319 346343 261272 206606 163803 141215 127675
9799A27675j6830k1179k0014n035r843j0719r63P952R276m101M17p218p69J0226
$$ 127675 110845 89666 69652 64617 54774 44055 43092 51044 60320 56219 56636 49418 48649 58875
9785E8875Q322O838P132k809j742p816n261Q6l738n950k97J5781K2161J6628l745
$$ 58875 67197 74035 81167 78358 76616 68800 63539 63625 59887 53937 53640 69421 91582 108210 104465
9770A04465j0128n266j7154j3570m564Q526Q639K855L418j3645j6746j0216o69
$$ 104465 94337 89071 71917 58347 53783 62309 70948 73803 77221 63576 46830 36614 35945
9757C5945n236m147j0905r0K891M191k4k124k108l127o119K954J081o820M200
$$ 35945 30709 26562 15657 15567 18458 22649 22625 20501 18393 15266 9147 12101 13182 6362 10562
9742A0562N928j68Q403Q696o442q733N815K921k144L092k424J92M528k656m038
$$ 10562 16490 16322 24725 33421 26979 18246 24061 26982 24838 27930 25506 25698 30226 27570 23532
9727B3532O071O339K098o236m198l764k223j183m572R22K073O875M495n414k256
$$ 23532 29603 35942 38040 31804 27606 23842 21619 20436 15864 16786 18859 25734 30229 24815 22559
9712B2559J589J7457Q537J7377K4041L0782K5710n175k8272l3107j0393N671K5227
$$ 22559 24148 41605 50142 67519 91560 122342 148052 142877 114605 81498 71105 76776 102003
9699A02003L1643K0211P47k5232l8487k5579j8706j3880j62k641l126l111M009
$$ 102003 133646 153857 154604 129372 90885 65306 46600 32720 32558 29917 26791 23680 27689
9686B7689N158K762j21K362q111l567j857m149J1K116r48q686K175k52o667J563
$$ 27689 32847 35609 35488 37850 29739 26172 24315 20166 20177 22293 21345 12659 14834 14582 7915 9478
9670I478K210j280J558p6L711m341N210K121j897N278r137K006L905K966m86j1757
$$ 9478 11688 10408 11966 11890 15601 11260 16470 18591 16694 21972 12835 14841 18746 21712 21226 9469
9654I469r216j345L568Q369R404M272O643j226n080j0530q13Q715L842k00j972
$$ 9469 253 -1092 2476 10845 20249 24521 31164 29938 24858 14328 13515 22230 26072 25872 23900
9639B3900l677Q80M546N233N827L815m128l021j375Q282J1330R091M019p246n639
$$ 23900 20223 21103 25649 30882 36709 40524 36396 33375 32000 40282 51612 60703 64722 57476 51837
9624E1837r097j1988j4722k918O655j598R37J2841O605N744j619n046k826o367
$$ 51837 42740 30752 16030 13112 19767 18169 19106 31947 38552 44296 42677 37631 34805 28438
9610B8438p830o488n516K456J2309P502R442N826M017O83k767j183n388j816Q815
$$ 28438 20608 14120 8604 11060 23369 30871 40313 46139 50156 50839 48072 46889 41501 39685 48500
9595D8500R194J1018K7991M2366J1116k0757k2766o885r921j4329j2277n735m475
$$ 48500 57694 68712 96703 139069 150185 129428 106662 99777 89856 75527 63250 57515 53040
9582E3040m907l543k117P739J0607J4855J9271J0845Q942J1981j696l745l122
$$ 53040 48133 44590 42473 50212 60819 75674 94945 105790 114732 126713 125017 121272 118150
9569A18150k350q21n545p787m378n823k708N600o921j578n187o509p091P052K3213
$$ 118150 115800 114979 109434 101647 97269 91446 88738 94338 87417 85839 80652 74143 67052 74104 97317
9554I7317K8279L7079N7313P5506R4151L0360n7581p9834p0113m9746l0740k2604
$$ 97317 125596 162675 219988 295494 389645 420005 362424 282590 212477 162731 131991 109387
9542A09387j8969j0093k106N301J0226M452p072k860N693R095M875Q10O51L545
$$ 109387 90418 80325 78219 83520 93746 98198 91126 88266 93959 103054 107929 108739 109390 112935
9528A12935M724R062k627r940q118j8464j4844j1324j3630j1274p596K408Q13
$$ 112935 117659 126721 124094 114154 106036 87572 72728 61404 47774 36500 28904 31312 32125
9515C2125k429J3279J6531J5516L773Q386J7720K4820O663j8076l7461k7821j0521
$$ 32125 29696 42975 59506 75022 78795 87181 104901 129721 136384 118308 80847 53026 42505
9502D2505n799j1478p329K487K625Q688L860r115l048l664m231k556J170l644
$$ 42505 36706 25228 17899 20386 23011 31699 35559 26444 23396 19732 15501 12945 14115 10471
9488A0471o475L705L623J92l624O03j034j759L879o394j891M260n093o533o664
$$ 10471 3996 7701 11324 11516 7892 8495 7461 5702 9581 3187 1296 5556 463 -6070 -12734
9473a2734K347O936J0642N11k600J445K100J1337j593p020m838k929R773n879
$$ -12734 -10387 -3451 7191 7702 5102 6547 8647 19984 18391 11371 6533 3604 13377 7498
9459G498k625K068K282M151n911l966k193o992k314p6J618M783M663j079j388
$$ 7498 4873 6941 9223 13374 7463 3497 1304 -5688 -8002 -8078 -6460 -1677 2986 1907 519
9444E19r18q096J610O777L908P78O12P313l46p904o661j042J0221N334m175m114
$$ 519 -399 -8495 -6885 -108 3800 4578 5190 12503 12157 4253 -2408 -3450 6771 12105 7930 3816
9428C816J870l451j171J526K744K532j140j2844n795J550J4451L084P61m275o366
$$ 3816 5686 2235 1064 2590 5334 7866 6726 -6118 -11913 -10363 4088 7172 7933 3658 -2708
9413b708k724O624N395L962j1089m102k581k453O938M234J795L929q687l246J561
$$ -2708 -5432 1192 6587 10549 -540 -4642 -7223 -9676 -2738 1496 3291 7220 -1467 -4713 -3152
9398c152l257k779J570P406j306m723k795k836P93K650K840M592M145L968p141
$$ -3152 -6409 -9188 -7618 -212 -1518 -6241 -9036 -11872 -11079 -8429 -5589 -997 3148 7116 -25
9383b5j287K531M74L86j536j512L643J534J008r269j104K001N131J373j462n791
$$ -25 -1312 1219 1693 2079 543 -969 2674 4208 5216 -4053 -5157 -3156 1975 3348 1886 -3905
9367c905m222L955k138J153K744J615L834k729J311l67Q43p24m41l435O142M834
$$ -3905 -8127 -4172 -6310 -5157 -2413 -798 3036 307 1618 1251 2094 1370 929 -2506 3636 8470
9351H470Q16M695K154p841k231j830M44M82n065q200K773M233M847R01o032j532
$$ 8470 9286 13981 16135 8294 6063 4233 4677 5159 94 -8106 -5333 -1100 3747 4648 -1384 -2916
9335b916N1J000K215M284jk859n43R10K908J457j136j602L237k674J206J0109
$$ -2916 -2865 -1865 350 4634 4633 1774 1231 2141 5049 6506 5370 3768 7005 4331 5537 15646
9319A5646j077m765m313M946L140l318p55l49j238L881L673j807j302n55o220
$$ 15646 14569 9804 5491 10437 13577 10259 9504 9155 7917 11798 15471 13664 12362 11807 5587
9304E587J179Q52j886l688m150K195M357l000P791k28k502l079l886O16J269M925
$$ 5587 6766 7618 5732 2044 -2106 89 4446 1446 9237 9009 6507 3428 -458 158 1427 6352
9288F352Q785J457o953q164r17K452K979J353N635j411J657k558m777m514o164
$$ 6352 15137 16594 9641 1477 560 3012 5991 7344 12979 11568 13225 10667 5890 1376 -4788
9273d788m516L682j308J193O201o50R33j5p254l26J334M252J0025K076m942n371
$$ -4788 -9304 -5622 -6930 -5737 464 -186 747 732 -6522 -6848 -5514 -1262 8763 10839 5897 526
9257E26q804L388L896O3m512M485M121K073M600N637N550J938p27N273N312q66
$$ 526 -8278 -4890 -994 -931 -5443 -958 3163 5236 9836 15473 21023 22961 22234 27507 32819 31953
9241C1953K17K07j627l729M03K060M055j311m573k145L2r51J925Q947M048P129
$$ 31953 32170 32377 30750 27021 27424 29484 33539 32228 27655 25510 25542 24591 26516 35463 39511 46640
9225D6640n330j3363n239j039K064O284P114O15k771M563Q158K124Q888m515q533
$$ 46640 41310 27947 22708 21669 23733 30017 37131 37746 34975 39538 47696 49820 58708 54193 45660
9210D5660p836l708K706J728N036O319J593p365j3669p677j083k215P319l890
$$ 45660 37824 34116 36822 38550 43586 49905 51498 44133 30464 22787 21704 19489 26808 22918
9196B2918j070N566K17k206k427r978n694K903Q229J0094k349o077n508Q51J0650
$$ 22918 21848 27414 27631 25425 22998 13020 7326 10229 18458 28552 26203 20126 14618 15469 26119
9181B6119K301R47O682J677j181M17P662P080j062p227l857l035L918L973m351
$$ 26119 28420 29367 36049 37726 36545 36962 44624 51704 50642 43415 39558 36523 40441 44414 40063
9166D0063K566k883n866l998l720r791K213P472M826m205m392l200M655K499m156
$$ 40063 42629 39746 33880 29882 26162 16371 18584 26056 30882 26677 22285 19085 23740 26239 22083
9151B2083n910N222R171R215k908M95R448P307P591Q351L205Q48J1624O701L595
$$ 22083 16173 21395 30566 39781 36873 37368 46816 54123 61714 70065 73270 74118 85742 92443 96038
9136I6038n715N7O615L241k769o938p808m967l084j840p78n993l490l386n43j928
$$ 96038 90323 90380 96995 100236 97467 90529 82721 77754 74670 72830 72052 66059 62569 59183 58640 56712
9120E6712l244L43K351P975O428P680n14n524j501j703J791M475K446J741N744
$$ 56712 53468 53811 56162 64137 70565 78245 77731 72207 70706 69003 70794 75269 77715 79456 85200
9105H5200N461M639K707O526J4295J9079M358Q489J9252P530n410j625Q819R118
$$ 85200 90661 95300 98007 104533 118828 137907 142265 150754 170006 177536 172126 170501 179320 188438
9091A88438J2756L0916K2897R774P430L307N840J9402J7833J6864K1126L3750
$$ 188438 201194 232110 255007 264781 272211 275518 281358 300760 318593 335457 356583 390333
9079C90333K2967K1288M1056O0247P2428P9795Q0701Q5398J03153J30724J50977
$$ 390333 413300 434588 475644 535891 608319 688114 768815 854213 957366 1088090 1239067
9068A239067J68199J93984J98735J83991J50949Q8721Q331o9502j28256j65186
$$ 1239067 1407266 1601250 1799985 1983976 2134925 2223646 2231977 2162475 2034219 1869033
9058A869033j77820j83212j73922j54902j42774j25663j02678q5646o7239o0321
$$ 1869033 1691213 1508001 1334079 1179177 1036403 910740 808062 722416 655177 594856
9048E94856m7601l5608l1086l0395l2416k6466k1772j9016k7831l5728k4466j4886
$$ 594856 547255 511647 480561 450166 417750 391284 369512 350496 322665 286937 262471 247585
9036B47585j2418j2984j4683j1705q196j0873j9868j6085j2708q538j1379q327
$$ 247585 235167 222183 207500 195795 187599 176726 156858 140773 128065 119527 108148 99821
9024I9821o509m648J374j827k343R11k454j672q84m254n638K274n365o372J743
$$ 99821 93312 88664 90038 88211 85868 86779 84325 82653 81769 77515 71877 74151 68786 62414 64157
9009F4157N600M369j476O4N297J321n760q076K5Q605M148p896m193l157O782O989
$$ 64157 69757 74126 72650 72714 78011 79332 73572 65496 65521 74126 78274 70378 66185 63028 69810 76799
8993G6799k316n831n478p549l191o571o626k909k710K865k292l889J093N848K678
$$ 76799 74483 68652 63174 55625 52434 45863 39237 36328 33618 36483 34191 30302 31395 37243 39921
8978C9921o536n240k05l015k746L04L08N803L921j0829L35n01O41l368J030o7
$$ 39921 33385 28145 27940 24925 22179 22483 22791 28594 32515 21686 22021 21520 22161 18793 19823 19756
8962A9756J248k62k927R891L456k472j0811j248O935K575O01J285l456m490k459
$$ 19756 21004 20742 17815 27706 31162 28690 17879 16631 23566 26141 26742 28027 24571 20081 17622
8947A7622Q10L5m730j856P599P552m80J139Q91m85O45P456K077k793j086l397
$$ 17622 18432 18467 13737 11881 19480 27032 26552 27691 28582 28097 28742 36198 38275 35482 34396 30999
8931C0999p581k369j316R44N393K219M39k805r275k510j838M621K803M29J879
$$ 30999 23418 21049 19733 20677 26070 28289 28728 25923 16648 14138 12300 16921 19724 20153 22032
8916B2032l062j035L459N591K415p343k422q40O840Q328k516k420p75N427M869
$$ 22032 18970 17935 21394 26985 29400 22057 19635 18795 25635 33963 31447 29027 28252 33679 38548
8901C8548k59n619M385J790q41L708K151J0410M473J1445J1998m17k484k235M001
$$ 38548 38289 32670 37055 38845 38004 41712 43863 54273 58746 70191 82189 81772 79288 77053 81054
8886H1054Q76j0571k661L390l930K905J7283J3224o974k0320j5556j2206n769
$$ 81054 81930 71359 68698 72088 68158 71063 88346 101570 94596 74276 58720 46514 40745
8873D0745N993Q73j0189L609M244n768k120J608m514n611j085k274P351Q569L099
$$ 40745 46738 47611 37422 41031 45275 39507 37387 38995 34481 28870 27785 25511 32862 41431 44530
8858D4530N562M716K968l283o905m549p269P944R063R467J1826J0826P234P088
$$ 44530 50092 54808 57776 54493 47588 43039 35770 43714 52777 62244 74070 84896 92130 99218
8844I9218q280p180j872p416Q75L571L78m3Q88l879l634j951p013j2293n904M62
$$ 99218 90938 83758 81886 74470 75345 78916 79294 79251 80139 76260 72626 70675 63662 51369 45465 45927
8828D5927M185K098j220l685m651M490q00K827p36m480j789k927N152Q239J0014
$$ 45927 50112 52210 50990 47305 42654 47144 46344 49171 48435 43955 42166 39239 44391 52630 62644
8813F2644J1890J004m131L297O616k008N083k433m666J267L264L142q93j267L279
$$ 62644 74534 75538 71407 74704 81320 79312 84395 81962 77296 78563 81827 84969 84076 82809 86088
8798H6088o779r030m536L590Q077Q800J669L353K461N694L334o379p742n671p210
$$ 86088 79309 70279 65743 69333 77410 86210 87879 91232 93693 99387 102721 96342 88600 82929 75719
8783G5719o157L91K207K198J019r93j117k814j666M706Q827j81k283K997M837
$$ 75719 69562 69953 72160 74358 75377 74384 73267 70453 68787 73493 82320 82139 79856 82853 87690
8768H7690M116O25l832n183o665J765L567J508L817K609N310n701r58K902J0424
$$ 87690 91806 92431 88599 83416 76751 78516 82083 83591 87408 90017 95327 89626 88668 91570 101994
8753A01994M157K64K332K699J4014N366J172N566L584j950p000k322m99m66K172
$$ 101994 106151 106415 108747 111446 125460 130826 131998 137564 141148 139198 132198 129876 129377 128911 131083
8738A31083L417N979J726n202j135j367o284m871r376k826l405P079J0664J949
$$ 131083 134500 140479 142205 137003 135868 134501 128217 123346 113970 111144 107739 114818 125482 127431
8724A27431q70j377J372P50J983K728Q063K965q018K414N662Q559J0822O898O593
$$ 127431 126561 125184 126556 127306 129289 132017 140080 143045 135027 137441 143103 151662 162484 169382 175975
8709A75975M780Q05L51O143R919N435P296L850N021Q142R196K837P000J0737J1179
$$ 175975 180755 181560 181911 188054 197973 203408 210704 214554 219575 227717 236913 239750 246750 257487 268666
8694B68666K727l676M757L428K94o971o523p486o388q94n292L712n37K204l225
$$ 268666 271393 267717 272474 275902 276196 269225 262702 255216 248828 247934 242642 246354 245817 248021 244796
8679B44796o342l11q36L943J1139M671L793L642Q898R928J1477N903K575J6906
$$ 244796 238454 238143 237307 241250 252389 257060 260853 264495 273393 283321 294798 300701 303276 320182
8665C20182K5031J1840k835M211M502k468l752O541J2393R020J3105M161O752
$$ 320182 345213 357053 354218 358429 362931 360463 356711 363252 375645 384665 397770 401931 408683
8652D08683J2771J4557J7406J9659K3088J9942K3213K4691K4814K7986L1299K9245
$$ 408683 421454 436011 453417 473076 496164 516106 539319 564010 588824 616810 648109 677354
8640F77354M1799N0499O4693P1444Q5833J00261J19177J41148J54169J69803J78668
$$ 677354 719153 769652 834345 905789 991622 1091883 1211060 1352208 1506377 1676180 1854848
8629A854848J87267J96022J78674J65597J54413J13051O3566O167o0288j15179
$$ 1854848 2042115 2238137 2416811 2582408 2736821 2849872 2913438 2919605 2859317 2744138
8619B744138j40399j58129j58565j40875j22034j15155j03370j01126r3889q9391
$$ 2744138 2603739 2445610 2287045 2146170 2024136 1908981 1805611 1704485 1610596 1521205
8609A521205r2654j05898j07288r4372q0497q1474p1422o2377p6222q0116o3527
$$ 1521205 1428551 1322653 1215365 1120993 1040496 959022 887600 825223 749001 668885 605358
8598F05358n7834n1555l9271l8230m0144l2859k8550k5560j5455j5717j8983j4129
$$ 605358 547524 495969 456698 418468 378324 345465 316915 291355 275900 260183 241200 227071
8586B27071r192k822n333r669j3377K746Q602j1336j8003j4218l662m774m13q374
$$ 227071 217879 215057 209724 200055 186678 189424 198026 186690 168687 154469 150807 146033 145620 137246
8572A37246n003l011j870r706j733q315m484m193L280r00j0691j340J177K623
$$ 137246 132243 129232 127362 117656 115923 107608 103124 98931 102211 101311 90620 89280 90457 93080
8558I3080n837p981n884R21r2N55N74Q653k162p208p848p595r87N118J84Q425
$$ 93080 87243 79262 73378 74299 74207 74762 75336 83989 81827 74619 66771 59176 58189 63307 63491 71916
8542G1916J588l476j537n22K891J2054J8303J8711M60j5283k1870j3425j3974
$$ 71916 73504 70028 68491 67969 70860 82914 101217 119928 120388 105105 83235 69810 55836
8529E5836j3270j0231l424M601M025J199l246Q759J092r333k58p374n393o184
$$ 55836 42566 32335 28911 33512 37537 38736 35490 44249 45341 36008 35750 28376 22983 16799
8515A6799O385J568K06k471J554O656M936L17j879Q07j879q090L322L530k912
$$ 16799 23184 24752 24958 22487 24041 30697 35633 35950 34071 34878 32999 24909 28231 31761 28849
8500B8849p43K750k359J695M027J0015M63N655J801k943J434o483o988q049l791
$$ 28849 28106 30856 28497 30192 34219 44234 44697 50352 52153 49210 50644 44161 37173 29124 25333
8485B5333O587N010Q32Q65J877j464o942l523k806o132p807N758O297k045k877
$$ 25333 31920 36930 37762 38627 40504 39040 32098 28575 25769 19637 11830 17588 23885 21840 18963
8470A8963J013Q29o379q04K409p571P048M12k221N180j27j241M064P042M234J001
$$ 18963 19976 20805 14426 13622 16031 8460 15508 15920 13699 18879 18752 17511 21575 28617 32851 33852
8454C3852l316n147K675j834L33L07P38R44j650n920n180J754k978K771L839K168
$$ 33852 30536 25389 28064 26230 26563 26870 27608 28552 26902 20982 15802 17556 14578 17349 21188 23356
8438B3356M402n647K939R571m372j4183l74N928N773K813m299o410n61o847l576
$$ 23356 27758 22111 25050 34621 30249 16066 15692 21620 27393 30206 25907 19497 18936 12089 8513
8423H513J065N215j439L597J875m287j5K881K798M12k4L367R58L562L482J152
$$ 8513 9578 14793 13354 16951 18826 14539 14524 17405 20203 20615 20591 23958 24916 28478 31960 33112
8407C3112M33o472k810J918J5019P598q017n206l188j851p293j0399M3j902o21
$$ 33112 33545 27073 24263 26181 41200 48798 40781 35575 32387 30536 23243 12844 12887 10985 10364
8392A0364L350J0699J750p047J759Q004J400o776m079J807L881J606L85p50j953
$$ 10364 13714 24413 26163 19116 20875 28879 30279 23503 19424 21231 25112 26718 27103 26353 24400
8377B4400M49O264K461l215n797M813L768n825q477M85J371N116j42j302n74J302
$$ 24400 24849 31113 33574 30359 24562 29375 33143 27318 18841 19326 20697 25813 25671 24369 23795 25097
8361B5097M108J693L18N242K121r173n415O017R535J0177J1864K2333K0108L2780
$$ 25097 29205 30898 31216 36458 38579 29406 23991 30008 39543 49720 61584 83917 104025 136805
8347A36805O3791R2730J18385Q4384q764q1187r4906q7111n6616l7031k9216k5643
$$ 136805 200596 293326 411711 496095 487331 406144 311238 224127 167511 130480 101264 75621
8335G5621j0511J601j696r754j1339L12N018q077o838m363Q39n497m690p72M379
$$ 75621 65110 66711 65015 55261 43922 44234 49252 41175 34337 29974 30813 25316 20626 19854 24233
8320B4233K63N97K734n007n009k238P132Q818J2417L55j169N403O277N066J5099
$$ 24233 24496 25093 27827 22820 17811 15573 22705 31523 43940 44295 43126 48529 54806 59872 74971
8305G4971J8230J7116L7751O1833R4032J45601K32778K71077L6549j80311k10923
$$ 74971 93201 110317 148068 209901 303933 449534 682312 953389 989938 809627 598704
8294E98704j58401j04956p8018o9138m8945l4439j5062j2912j3381j3044k018
$$ 598704 440303 335347 257329 188191 139246 104807 89745 76833 63452 50408 48390
8283D8390K204p251q161K101K398J950j077J342p924j1237n153L63K72r552l015
$$ 48390 50594 43343 35182 37283 39681 41631 40554 41896 33972 22735 17582 17945 18217 8665 5650
8268E650O270O005r9J625Q39K944M045Q788N476L699J2087J6748K4790L5836M7262
$$ 5650 11920 17925 17826 19451 20290 23234 27279 36067 41543 45242 57329 74077 98867 134703 181965
8253A81965P3978R4305P8838J1441p6174j02856p5827m5798m6110k8809j0287
$$ 181965 255943 350248 429086 440527 364353 261497 185670 139872 93762 64953 54666
8242E4666n18L373p076j402j821l942l723n696R12m083q413l946r355P749J0711
$$ 54666 54148 57521 50445 49043 47222 43280 39557 33861 34773 30690 22277 18331 8976 16725 27436
8227B7436l289o620M372o502p07k170k219l228m675Q43L342J2081J500m946L434
$$ 27436 24147 17527 21899 15397 14690 12520 10301 7073 2398 3241 6583 18664 20164 15218 18652
8212A8652j339J340l446j140L802r52o673o681m197P064l25o608L972M151K689
$$ 18652 17313 18653 15207 14067 17869 16917 10244 3563 -634 6430 6105 -503 3469 7620 10309
8197A0309J289O606Q309j58M173M086o577k362m753l39k357O721j848k440N797
$$ 10309 11598 18204 26513 26355 30528 34614 28037 25675 20922 20583 18226 24947 23099 20659 26456
8182B6456K869k60j623j812l097Q78k473o886J524n94j75M198J771j847k007M548
$$ 26456 29325 29065 27442 25630 22533 23411 20938 14052 15576 14982 14807 19005 20776 18929 16922 21470
8166B1470J270k729n296l525L023J8442J0666L491J4470J4437K2245L1522L2901
$$ 21470 22740 20011 14715 11190 14213 32655 43321 46812 61282 75719 97964 129486 162387
8153A62387K7756K8378J2811r212k5985l0918k7756k5382k2111j2619j0482j853
$$ 162387 190143 218521 231332 222120 196135 165217 137461 112079 89968 77349 66867 65014
8141F5014j0688o736m826k825q033l572o163L913Q765k697o25j520M937N277K535
$$ 65014 54326 47590 42764 39939 31906 28334 22171 26084 34849 32152 31527 30007 34944 40221 42756
8126D2756K147Q15N567J1476P767L843N361P37R28n092J554N120O868O154J2287
$$ 42756 44903 45718 51285 62761 70528 74371 79732 80469 81397 76305 77859 82979 89847 96001 108288
8111A08288J3556K2372N3802P7537Q2646Q7537K4430l1943n6852p4442p0019n0365
$$ 108288 121844 144216 198018 275555 358201 445738 470168 438225 381373 306931 236912 186547
8099A86547k9426j4204j0814j3032j3591r210j801o666j762L285l963r30k960
$$ 186547 157121 142917 132103 119071 105480 96270 94469 87803 86041 89326 85363 84433 81473
8086H1473l926L265K595J0045L793J7515J2597L888J0611J7710K8100K4463Q917
$$ 81473 77547 80812 83407 93452 97245 114760 127357 131245 141856 159566 187666 212129 221046
8073B21046j533j854j633P571J0150J7077K5045K9255M1356N0469O0229N9657
$$ 221046 219513 217659 216026 223597 233747 250824 275869 305124 346480 396949 457178 516835
8061E16835O9774O4904M5912K0121l285k6657m5676m5120l8039k7056j0045j3022
$$ 516835 586609 651513 697425 717546 714261 687604 641928 596808 558769 531713 521668 508646
8049E08646j6438j4332j3785j3473j2687j0238n210r663q868p409l120M358j815
$$ 508646 492208 477876 464091 450618 437931 427693 422483 412820 403952 396543 393423 397781 395966
8036C95966N296J923L197P878J2667J1766J4174N391k523J1513J8951K6368M2440
$$ 395966 401262 403185 406382 414260 426927 438693 452867 458258 455735 467248 486199 512567 555007
8023E55007O0132Q5303J33437J99101K95070L63145K37656o6477k66994k93742
$$ 555007 615139 700442 833879 1032980 1328050 1691195 1928851 1862374 1595380 1301638
8013A301638k39505j81477j34481j04262q2385o1537m6112l7787k5606k9626k4853
$$ 1301638 1062133 880656 746175 641913 559528 497991 451879 414092 388486 358860 334007
8002C34007j8167j2135j2294j0761r886j5371j5561k524J322K356K943J1744N804
$$ 334007 315840 303705 291411 280650 270764 255393 239832 237308 238630 240986 243929 255673 261477
7989B61477P970J0831L481J83N51L525J0275J4770K5638K5365K7701L2970N0798
$$ 261477 269447 280278 283759 283942 284493 288018 298293 313063 338701 364066 391767 424737 475535
7976D75535O2436N5760L9068J4122m587k6999n0186o4102p1287n5558m7847m4093
$$ 475535 537971 593731 632799 646921 642334 615335 565149 501047 429760 374202 326355 282262
7964B82262l4144l7035k8437k1392k0609j4541j2362k813p389r894o640j978M952
$$ 282262 248118 211083 182646 161254 140645 126104 113742 110929 103540 93646 87006 85028 89980
7951H9980p946q447J105M573L489j361j288K724n584K508K25o787m190k181q458
$$ 89980 82034 73587 74692 79265 82754 81393 80105 82829 77245 79753 79978 73191 69001 66820 58362
7936E8362n431N790Q39K729O940M294L90j089l632n436q582R93M965o744j1017
$$ 58362 52931 58721 59560 62289 69229 73523 73913 72824 69192 63756 55174 56167 61132 54388 43371
7921D3371p547J416k322k540j75L799P281L765k022m813m131j1439r038j690J524
$$ 43371 35824 37240 34918 32378 32203 36002 43283 47048 45026 40213 36082 24643 15605 13915 15439
7906A5439n410R1J1873P103O439q15m184K201P70l411m998K013j619l113Q347
$$ 15439 10029 10120 21993 29096 35535 34720 30536 32737 33507 30096 25098 27111 25492 22379 30726
7891C0726Q23m908J851K425J0107q45q948r179q420o685n767n621K351M278N255
$$ 30726 31549 26641 28492 30917 41024 40179 31231 22052 13632 6947 1180 -4441 -2090 2188 7443
7876G443J564m587n287m585J1250Q331q499j807O610l905L383L286L056N56J35
$$ 7443 9007 4420 -867 -5452 5798 14129 5630 3823 10433 6528 9911 13197 16253 16809 16944
7861A6944K953k144m387m22k127l128m94J786n420j31L062M350n751p894k08l0
$$ 16944 19897 17753 13366 12944 10817 7689 7195 8981 3561 3430 6492 10842 5091 -2803 -3011 -3041
7845c041j943M55Q42Q99q72J945k170m899k177P824n344K513J2011O370l953l316
$$ -3041 -4984 -4529 -3687 -2788 -3660 -1715 -3885 -8784 -10961 -3137 -8481 -5968 6043 12413 8460 5144
7829E144j46N991J472j848M51m96n218k444L733J208M729O826O757J81J878K29
$$ 5144 4998 10989 12461 10613 11064 10568 5350 2906 6639 7847 12576 19402 26159 26340 28218 28447
7813B8447o480M218p58N817L130m835j343m831q996K986k291l320J085j279l708
$$ 28447 21967 26185 25427 31244 34374 29539 28196 23365 14369 17355 15064 11744 12829 11550 7842
7798G842o077n062K484j460O048O45l613O419j601l245K38p31k730l00k545P729
$$ 7842 1765 -3297 -813 -2273 3775 4420 807 7226 5625 2380 2618 1887 -843 -1143 -3688 4041
7782D041J970j335J096M412R35J967L090n500o293j865K473N500L155J701j983
$$ 4041 6011 4676 5772 10184 11119 13086 16176 10676 4383 2518 4991 10491 13646 15347 13364
7767A3364K91O66n520o010m157M43Q140l319Q23j36k83p012J33M110j380j784
$$ 13364 13655 14321 8801 2791 -1366 -923 7217 3898 4721 4585 4302 -2710 -2577 1533 153 -1631
7751a631j13l165K031L281l325n600m96K024P404K600m187L240r987q216N538
$$ -1631 -1744 -4909 -2878 403 -2922 -8522 -9018 -6994 410 3010 -1177 2063 -7924 -16140 -10602
7736a0602N757K743p498o862l319j92J2809l858k495L14L786L763r5L824M437
$$ -10602 -4845 -2102 -9600 -16462 -19781 -19973 -7164 -11022 -13517 -13203 -9417 -5654 -5749 -1925 2512
7721B512R77m144m988L603K755j579q53k359O046k466k387m334j502M750k188
$$ 2512 3489 -655 -5643 -2040 715 -864 -1717 -4076 1970 -496 -2883 -7217 -8719 -3969 -6157
7706f157j563P593l020m428j602N087J909R560K869o008J72j849K02M889J645
$$ -6157 -7720 -127 -3147 -7575 -9177 -4090 -2181 7379 10248 4240 4412 2563 2765 7654 9299
7691I299l070l643q50K131l201q362J260P886K909k318l333j661j703j505Q572
$$ 9299 6229 2586 1736 3867 666 -7696 -6436 1450 4359 2041 -1292 -2953 -4656 -6161 2411
7676B411P470L70O010p349q896k967K517O081m619r32P7r25o799N766J2385M694
$$ 2411 9881 10251 16261 8912 16 -2951 -434 5647 1028 96 173 -752 -7551 -1785 10600 15294
7660A5294k394o090n821M536M072K90M00o908p327O84J257K928M44k383n57J996
$$ 15294 12900 6810 989 5525 9597 9887 10287 3379 -3948 -3264 -2007 921 1365 -1018 -1575 421
7644D21J512n105j714K739l456J488J73R670P53j307K920j532j329Q35M818j19
$$ 421 1933 -3172 -4886 -2147 -5603 -4115 -3942 5728 6481 5174 8094 6562 5233 6068 10886 10767
7628A0767m924p009r057L865j90K308J0740M776J840n026R73N317N680l653o619
$$ 10767 5843 -1166 -10223 -6358 -6548 -4240 6500 11276 13116 8090 9063 14380 20060 16407 9788
7613I788q535j241j340J957L755M150o963m874l256l948M160L172l053k970N833
$$ 9788 1253 12 -1328 629 4384 8534 1571 -3303 -6559 -10507 -6347 -3175 -6228 -9198 -3365
7598c365M858J509k658m089p57n558K317L988J149r55M611k586N20k76l67M450
$$ -3365 1493 3002 344 -3745 -4502 -10060 -7743 -3755 -2606 -3561 1050 -1536 -1016 -1292 -1659 2791
7582B791K347J446m12n987J748k294L226J0319o07M109n400o592m586J1774q51
$$ 2791 5138 6584 6172 185 1933 -361 2865 13184 12577 16686 11286 4694 108 11882 11031
7567A1031n36j122j222m213J047J606j505k042o19J107J990K863K307k862k409
$$ 11031 10495 9373 8151 3938 4985 6591 5086 3044 2425 3532 5522 8385 10692 7830 5421
7552E421N698l75r836j2417n146R381P661N342j277L932m952l408M63O45o543
$$ 5421 11119 10744 908 -11509 -16655 -7274 387 5729 4452 8384 3432 24 487 1132 -5411
7537e411K427J643j324p46k570L37J763K429k419K313Q159K861o738q638j188
$$ -5411 -2984 -1341 -2665 -3411 -5981 -5644 -3881 -1452 -3871 -1558 6601 9462 2724 -5914 -7102
7522g102O259L295k640q916k126L239N380K112k515O728P50j044K031r1n154l520
$$ -7102 -843 2452 -188 -9104 -11230 -7991 -2611 -499 -3014 3714 4464 3420 5451 5360 206 -3314
7506c314M047l229j0111k911o74J146l011j47N829K599J245N50J797N81L444K987
$$ -3314 733 -2496 -12607 -15518 -16192 -15046 -18057 -18204 -12375 -9776 -8531 -7981 -6184 -5603 -2159 828
7490H28J193k900M740o1k56M003n95m939j774J553N166R61k003n284k662P53j273
$$ 828 2021 -879 3861 3800 3544 7547 6952 2013 239 1792 6958 7919 5916 632 -2030 -1277 -2550
7473b550n042K516k182n383K822M346M986N063l48J514J895n647K669L560j114
$$ -2550 -7592 -5076 -7258 -12641 -9819 -5473 -487 4576 4228 5742 7637 1990 4659 8219 7105
7458G105M463p038q064j978N111J224k910n80j957k579o17M468o463j049r02O657
$$ 7105 11568 4530 -3534 -5512 -401 823 -2087 -2667 -4624 -7203 -7820 -3352 -9815 -10864 -11766 -5109
7442e109N971Q00j099J152K276r368j328K48O704j31m376k112n26l761O222L309
$$ -5109 862 1662 563 1715 3991 -5377 -6705 -6457 247 116 -4260 -6372 -6898 -10659 -4437 -1128
7426a128N05J967J385n149M240K042n267j045L867m91K371O382l332l481K584
$$ -1128 -623 1344 2729 -2420 1820 3862 -1405 -2450 1417 926 3297 9679 6347 2866 5450
7411E450k451M308n176n093J967k44J308P180O120m862n771o991k715N077N031
$$ 5450 2999 7307 2131 -2962 -995 -1239 69 7249 13369 8507 2736 -4255 -6970 -1893 3138
7396C138k866k272N657k62k892o054l49P06l346L131k045n299J805N279N852l413
$$ 3138 272 -2000 3657 3395 503 -5551 -5900 -5194 -8540 -5409 -7454 -12753 -10948 -5669 183 -3230
7380c230k3j132j612n313K009K628N296M664J920j308r14j880J63K762j889m92
$$ -3230 -3253 -4385 -5997 -11310 -9301 -6673 -1377 3287 5207 3899 2985 1105 1268 4030 2141 1649
7364A649J692k321o655k837k567J057Q889O444k63o158o065j0092J318N134K619
$$ 1649 3341 1020 -5635 -8472 -11039 -9982 -1093 5351 5088 -1070 -7135 -17227 -15909 -10775 -8156
7349h156l8K337m294r66m06k191j452J537j965r46O548L190l780J074O05r04q80
$$ -8156 -8194 -5857 -10151 -11117 -11523 -13714 -15166 -13629 -15594 -16540 -9992 -6802 -10582 -9508 -8903 -9807 -10687
7332a0687P120n71l429L93k98L296n509k332P460M265k822L239R39q81j02k131
$$ -10687 -3567 -4138 -7567 -7174 -7472 -4176 -9685 -12017 -4557 -292 -3114 125 1064 183 81 -2050
7316b050p135J65N224R433O355q390p082k033J221L773k418l106J444r008L69
$$ -2050 -9185 -9020 -3796 5637 11992 3602 -3480 -5513 -4292 -519 -2937 -6043 -4599 -13607 -13238
7301a3238K369N498K545m12L151L012J643n429m59L19p526J455N326j389L291
$$ -13238 -10869 -5371 -2826 -3238 -87 2925 4568 -861 -1320 -1001 -8527 -7072 -1746 -3135 156
7286A56l861l114q9l7k479P672O054m492K517N328K771j112o737m593j232k9k782
$$ 156 -3705 -6819 -6908 -6945 -9424 -1752 4302 -190 2327 7655 10426 9314 2577 -2016 -3248 -3277 -6059
7269f059J276K672k697L975m515m872M512J723J546o523m02J048k431M200J336
$$ -6059 -4783 -2111 -4808 -833 -5348 -10220 -5708 -3985 -2439 -8962 -9364 -8316 -10747 -6547 -5211
7254e211j329o706k11K796N34K806K289N812R45q013j293N604M717n025K06k332
$$ -5211 -6540 -13246 -13457 -10661 -10127 -7321 -5032 780 1725 -6288 -7581 -1977 2740 -2285 -2079 -4411
7238d411J683J183n880M468K304o534m407N558j664k99K208j84K37P201k558K763
$$ -4411 -2728 -1545 -7425 -2957 -653 -7187 -11594 -6036 -7700 -7999 -5791 -5975 -5738 1463 -1095 1668
7222A668R57P70M18j053m335p177o897N472Q656K828r092m751J292m604O47N199
$$ 1668 2625 3395 3813 2760 -1575 -8752 -15649 -10177 -1521 1307 -7785 -12536 -11244 -15848 -15201 -10002
7206a0002K618l317k919P013L309P891l456o999O757N044j690o328j457m022o7
$$ -10002 -7384 -10701 -13620 -6607 -3298 4593 1137 -5862 895 5939 4249 -2079 -3536 -7558 -7625
7191g625L419Q662P888o521k280L44j650q38l651o53l81m645L900P333N59M6n789
$$ -7625 -4206 4456 12344 5823 3543 3887 2237 1399 -2252 -2905 -3286 -7931 -4031 3302 3861 3907 -1882
7174a882k132J176J641m240j715j284N671N641m972L719k754m177k882l550j695
$$ -1882 -4014 -2838 -1197 -5437 -7152 -8436 -2765 2876 -2096 1623 -1131 -5308 -8190 -11740 -13435
7159a3435k820j813J890K782R306Q734j082o101J111j856Q19O9j117L502J385
$$ -13435 -16255 -18068 -16178 -13396 -4090 4644 3562 -2539 -1428 -3284 -2465 -2396 -3513 -11 1374
7144A374k995J5N30k649J774P14J738K810n594j801m764q646L745R242R485p63
$$ 1374 -1621 -1606 -1076 -3725 -1951 -1237 501 3311 -2283 -4084 -8848 -17494 -13749 -4507 4978 4215
7128D215o825l363o558J878P561J514j257r31J481J184J596l37p39O876l195m859
$$ 4215 -2610 -5973 -12531 -10653 -3092 -1578 -2835 -3766 -2285 -1101 495 158 -581 6295 3100 -1759
7112a759l708p6k417R00m272Q600l629m616O119N704n890M822r20P308o244m481
$$ -1759 -5467 -5543 -7960 -7060 -11332 -2732 -6361 -10977 -4858 846 -5044 -222 -1142 6166 -78 -4559
7096d559J604p83j828o54M524L593j503n720J145K550P34j836O197j794o100n500
$$ -4559 -2955 -3738 -5566 -6220 -1696 1897 394 -5326 -4181 -1631 -897 -2733 3464 1670 -4430 -9930
7080i930N61M366k846M714L025J168R27K182p587Q077Q375o015n892m2K606l33
$$ -9930 -9369 -5003 -7849 -3135 -110 1058 1985 4167 -3420 4657 13032 7017 1125 1083 3689 3356
7064C356O42J303l424l913J813m01L32L717M590j029j911k25k168n056o50l571
$$ 3356 3998 5301 1877 -2036 -223 -624 -292 3425 8015 6986 5075 4850 2682 -2374 -3024 -6595
7048f595j01K438k35l54m487J030N020J369j296n386P78M322N336l241m717j729
$$ -6595 -6696 -4258 -4493 -4847 -9334 -8304 -3284 -1915 -3211 -8597 -7819 -3497 1839 -1402 -6119 -7848
7032g848j034R205J73q953K165P238M498j90j836r561J47O688j715n139M414Q105
$$ -7848 -8882 323 496 -8457 -6292 946 5444 5254 3418 -6143 -5996 692 -1023 -6162 -1748 6357
7016F357K448n329K67Q29o000k487M264K495m210J592L200j425m584o344k570
$$ 6357 8805 3476 3743 4572 -1428 -3915 349 2844 -1366 226 3426 2001 -2583 -8927 -11497
7001a1497N093j96o59Q293K826n499l988n88M276j503O746l868k796k280o249
$$ -11497 -6404 -6600 -7259 1034 3860 -1639 -5627 -6215 -1939 -3442 3304 -564 -3360 -5640 -11889
6986a1889J549P556J255M55o5R92j294j643o135L921J1354L648m622l029q384
$$ -11889 -10340 -2784 -1529 -1074 -1139 -147 -1441 -3084 -9219 -5298 6056 9704 5082 2053 -6331
6971f331K02N516J531l167r675k522N361k69m92P604M459j161k550l033L619n286
$$ -6331 -6129 -613 918 -2249 -11924 -14446 -9085 -9354 -9846 -2242 2217 1056 -1494 -4527 -908 -6194
6955f194o768K454N342L222O096q50l312N206Q562l430N12j250q639m217M175
$$ -6194 -12962 -10508 -5166 -1944 4152 3302 -10 5196 13758 10328 10840 9590 951 -3266 909
6940I09q89l578O04N42K640r70l755J138l110o236j650M707J0286j239r246O375
$$ 909 20 -3558 -2954 -2412 228 -742 -4497 -3359 -6469 -12705 -14355 -9648 638 -601 -9847 -3472
6924c472L884l674K577k903m705R44K059k955N791j476n427J354J867j313M986
$$ -3472 412 -3262 -685 -3588 -8293 -7349 -5290 -8245 -2454 -3930 -9357 -8003 -6136 -7449 -2463
6909b463K251O438M894Ko828p346l630J236j183n507l09M729K317K038N347P163
$$ -2463 -212 6226 11120 11122 4294 -3052 -6682 -5446 -6629 -12136 -12445 -7716 -5399 -3361 1986 9149
6893I149o954n915m033k427O219m49l150J1563j810K295O61K82m813m741J143
$$ 9149 2195 -3720 -7753 -10180 -3961 -4410 -7560 4003 2193 4488 5149 5431 618 -4123 -2980
6878b980J792J069O23q09p471o254M157j499L541Q682J932q284m211N649L623
$$ -2980 -1188 -119 504 -305 -7776 -14030 -9873 -11372 -7831 851 2783 -5501 -9712 -4063 -440
6863d40j587j732L897k069K550N56k703l02j413j397k318p408j011J047P161K490
$$ -440 -2027 -3759 138 -1931 619 1175 -1528 -1830 -3243 -4640 -6958 -14366 -15377 -14330 -7169 -4679
6847d679k677M776K680M201j481j713r803J204Q51M957L288J582Q26k823j818
$$ -4679 -7356 -2580 100 4301 2820 1107 -8696 -7492 -6641 -1684 1604 3186 4012 1189 -629
6832f29Q36K035l965j224l504J639Q1n032q844J915J791K782L497M727M295o805
$$ -629 207 2242 -1723 -2947 -6451 -4812 -4731 -9763 -18607 -16692 -14901 -12119 -8622 -3895 400 -6405
6816f405L088M077l003j499l110M237L590m223m265j519K769l09N808P644o454
$$ -6405 -3317 760 -2243 -3742 -6852 -2615 975 -3248 -7513 -9032 -6263 -6572 -764 6880 426
6801D26k621l606R547J945L452m36l361o390k625l280j8K876J0344k657m734l59
$$ 426 -2195 -5801 3746 5691 9143 8707 5346 -1044 -3669 -6949 -6967 -4091 6253 3596 -1138 -1497
6785a497K586l948l125K216k599k372j112P377J357K742L828o731m790J0359L998
$$ -1497 1089 -2859 -5984 -3768 -6367 -8739 -9851 -2474 -1117 1625 5453 -1278 -6068 4291 8289
6770H289k86l509r650m470k945j62O954P935K290P140m74q369k946k989M3N688
$$ 8289 8003 4494 -5156 -9626 -12571 -12733 -5779 2156 4446 11586 11112 2743 -203 -3192 -3149 2539
6754B539j178M078N043m017n741r63K154K502n456m579K186N816k18k862N394
$$ 2539 1361 5439 10482 6465 724 -239 1915 4417 -1039 -5618 -3432 2384 2166 -696 4698
6739D698O876M737k31p446p174o307k815L840l794O185R699M649n788l831m210
$$ 4698 11574 16311 16080 8634 1460 -4847 -7662 -3822 -7616 -1431 8268 12917 7129 3298 -912
6724i12J213Q04l34l283J290j312J628J636M541q68l097J713J436l064O833J283
$$ -912 301 1105 771 -2512 -1222 -2534 -906 730 5271 4403 1306 3019 4455 1391 8224 9507
6708I507p099p288K683M741m071R7m60N622M234j622k469m469k573l555o317l943
$$ 9507 2408 -4880 -2197 2544 -1527 -1430 -1890 3732 7966 6344 3875 -594 -3167 -6722 -13039 -16982
6692a6982O815mM201J710k532L735P979l071j18n625j089L454M422J500O49L319
$$ -16982 -10167 -10171 -5970 -4260 -6792 -3057 4922 1851 1733 -3892 -4981 -1527 2895 4395 5044 8363
6676H363K46n135n413n78M29j512j332J375L177M824m035j954L9L859J219P90
$$ 8363 8609 3474 -1939 -2517 -2088 -3600 -4932 -3557 -380 4444 409 -1545 -1506 2353 3572 4362
6660D362l192j240M44P890N056P88j968O084j308l874m016k288M60K87M380j189
$$ 4362 1170 -70 374 8264 13320 14108 12140 18224 16916 13042 9026 6738 7198 7485 11865 10676
6644A0676k208r055m497Q0l85K87K955L211K318K283k048l404M009j164m970j366
$$ 10676 8468 -587 -5084 -5004 -5389 -5102 -2147 1064 3382 5665 3617 213 4222 3058 -1912 -3278
6628c278M623j482k257l681k754P304J2799R36q525l231k398L848M613l62q357
$$ -3278 1345 -137 -2394 -6075 -8829 -1525 11274 12210 3685 454 -1944 1904 6517 6155 -2202
6613b202n570N765O724k518m502j924J1999j525k604m435k360J090K046r51l192
$$ -2202 -7772 -2007 4717 2199 -2303 -4227 7772 6247 3643 -792 -3152 -2062 -16 -967 -4159
6598d159L062K89n753r325K159O058O85j34q05O817K58J597M075l104m304k879
$$ -4159 -1097 -808 -6561 -15886 -13727 -7669 -6984 -7118 -7923 -1106 -848 749 4824 1720 -2584 -5463
6582e463l082L154J231l115N154J0216M019K330o989p922m704N87M015M481n196
$$ -5463 -8545 -5391 -4160 -7275 -2121 8095 12114 14444 7455 -467 -5171 -4584 -569 3912 -1284
6567a284l104m212L258K507J150n123r62J138N836J07l975K038l606K178R146
$$ -1284 -4388 -8600 -5342 -2835 -1685 -6808 -7770 -6632 -796 -689 -4664 -2626 -6232 -4054 5092
6552E092J470L009J0407m349q065k599N468j272p618l978K817M078k31k134J065
$$ 5092 6562 9571 19978 15629 7564 4965 10433 9161 1543 -2435 382 4460 4229 2095 3160
6537C160j884K753k153K753n230j074j50Q07L750j079J632n961K956M164J579
$$ 3160 1276 4029 1876 4629 -601 -1675 -1825 -1018 2732 1653 3285 -2676 280 4444 6023
6522F023m311k836L580n655j078k930j900j915k548n17O310O952Q84k327N949
$$ 6023 1712 -1124 2456 -3199 -4277 -7207 -9107 -11022 -13570 -14087 -7777 -825 59 -2268 3681
6507C681K356n789j819L40J961m618N530O743L164n473p275p92K458J497P3k470
$$ 3681 6037 248 -1571 -1231 730 -3888 1642 8385 11549 6076 -1199 -1991 467 1964 2037 -433
6491d33O37N466J709p198k007q72j280m030k060j741N222P674M41m862N35M593
$$ -433 204 5670 7379 181 -1826 -2698 -3978 -8008 -10068 -11809 -6587 1087 1528 -3334 -2799 1794
6475A794m482o85o0L929L035k675k683j227J639l091Q02l535L326Q465j072J303
$$ 1794 -2688 -3373 -3433 496 3531 856 -1827 -3054 -1415 -4506 -3704 -7239 -3913 4552 3480 4783
6459D783M422l742m343l027K490n908p96j0080m057N189P589l144k399K308L543
$$ 4783 9205 5463 1120 -1907 583 -5325 -6121 -16201 -20258 -15069 -7480 -10624 -13023 -10715 -7172
6444g172K927P540L236p730l045n185k841K374K309j981J814p766L748J5161M649
$$ -7172 -4245 3295 6531 -1199 -4244 -9429 -12270 -9896 -7587 -9568 -7754 -15520 -11772 3389 8038
6429H038p907k742K565L291J98M008p588r713M181L631j879j143K1K20l964k384
$$ 8038 131 -2611 -46 3245 3443 7451 -137 -9850 -5669 -2038 -3917 -5060 -5039 -4819 -8783 -11167
6413a1167N8K281L50j652j602R87Q213J731m540L377R86j030K410J393K165K679
$$ -11167 -11109 -8828 -8478 -10130 -11732 -10745 -2532 -801 -5341 -1964 -978 -2008 402 1795 3960 6639
6397F639l079k926o0N895o004m781P86j219M02j084k8J428M09k388n00O521P306
$$ 6639 3560 634 574 6469 465 -4316 -3530 -4749 -4347 -5431 -5459 -4031 -3622 -6010 -6510 11 7317
6380G317J597o704L39K92M543K657p70p372R00L00o773J367J071K089M476J73
$$ 7317 8914 2210 2549 2841 7384 10041 9271 1899 2799 3099 -3674 -2307 -1236 853 5329 5502
6364E502o355j779k102N09m83P55M512J036M10k817R15j820m71K769n414m519
$$ 5502 -853 -2632 -4734 -4225 -4708 -3953 559 1595 2005 -812 103 -1717 -2188 581 -4833 -9352
6348i352P384J552L209j430r710m42K538M219l14J032R613L724j946l393l545
$$ -9352 -1968 -416 2793 1363 -8347 -8789 -6251 -2032 -2346 -1314 8299 12023 10077 6684 3139
6333C139p449m874j631j339M372O198m726m82O577k70J924p13J219K494o50j08
$$ 3139 -4310 -9184 -10815 -12154 -7782 -1584 -6310 -6792 -215 -485 1439 726 1945 4439 3789 3681
6317C681r50l046j439K365K764J714n114m135k177r21O50l40K162K258m0o16K864
$$ 3681 2731 -315 -1754 611 3375 5089 -25 -4160 -6337 -7258 -6608 -6948 -4786 -2528 -2568 -3184 -320
6300c20M264L163n966m176K236l305Q82K964k051K828K173l588J834K194L045
$$ -320 3944 7107 1141 -3035 -799 -4104 -3222 -258 -2309 519 2692 -896 938 3132 6177
6285F177j47k54j759k257l369m827j408J288l352N609P792q62r663l250J892n531
$$ 6177 6030 5776 4017 1760 -1609 -6436 -7844 -6556 -9908 -4299 3493 2631 -7032 -10282 -8390 -13921
6269a3921L508J465M464O767j660n981J314N899L745k337m944j444N250k815m19
$$ -13921 -10413 -8948 -4484 2283 623 -5358 -4044 1855 5600 3263 -1681 -3125 2125 -690 -1109
6254a109M862K875l452r478j280k874L517P081M901J051j0233k836m157j165O843
$$ -1109 3753 6628 3176 -6302 -7582 -10456 -6939 142 5043 6094 -4139 -6975 -11132 -12297 -5454
6239e454R686o196k455M262l51n35p141k747L946M350Q129j952j0935k271j309
$$ -5454 4232 -1964 -4419 -157 -508 -1043 -8184 -10931 -6985 -2635 5494 3542 -7393 -9664 -10973
6224a0973l480L190K703M563J157n696Q207J4473L98o44M569m661o406o135j055
$$ -10973 -14453 -11263 -8560 -3997 -2840 -8536 -329 14144 14542 13898 18467 13806 7400 1265 210
6209B10P44M644q18j865k491l768n993L741L894K624O921J602j956n761k105l873
$$ 210 954 5598 4780 2915 424 -3344 -9337 -5596 -1702 922 7843 9445 7489 1728 -377 -4250
6193d250K580L913J111o299n516r7Q877R299m381m007m741k928L370N621j953
$$ -4250 -1670 2243 3354 -2945 -8461 -8558 319 9618 5237 1230 -3511 -6439 -3069 2552 599
6178E99M382k592q23K906n877j85m426N667L914J0006J116o411o982Q4J019K257
$$ 599 4981 2389 1566 4472 -1405 -1590 -6016 -349 3565 13571 14687 8276 1294 1378 2397 4654
6162D654K197m839p55j1525R08O984J3148Q22o500p310J543P1q480k527j291Q25
$$ 4654 6851 2012 1257 -10268 -9360 -2376 10772 11594 5094 -2216 -673 -602 -9082 -11609 -12900 -12075
6146a2075N772M260M572p59m457M910J920j006m680O107K455j421N359K142m050
$$ -12075 -6303 -2043 2529 1770 -2687 2223 4143 3137 -1543 4564 7019 5598 10957 13099 9049
6131I049r047q861O2J201l007M135M38N698P888R73k693n499K152M927n787o980
$$ 9049 2 -8859 -8797 -7596 -10603 -6468 -6030 -332 7556 8529 5836 337 2489 7416 1629 -5351
6115e351j675N179Q91L29n470l102P40K628J016N651L347j18k646n964l483Q75
$$ -5351 -7026 -1847 -956 -627 -6097 -9199 -8459 -5831 -4815 836 4183 4065 1419 -4545 -8028 -7153
6099g153m229N7j57P264K506N188J077j840j733q569L294P469K487j874m29O0
$$ -7153 -11382 -11325 -11482 -4218 -1712 3476 4553 2713 980 -7589 -4295 3174 5661 3787 3358 3418
6083C418L872L807j300r058k845L057k74m371m85K341Q859M067k23o024k246K435
$$ 3418 7290 11097 9797 739 -2106 951 677 -3694 -4179 -1838 7021 11088 10865 4841 2595 5030
6067E030m508k814N024j784j508l101N518R47o113r40P831M59m66K705n270o71
$$ 5030 522 -2292 2732 948 -560 -3661 1857 2804 -3309 -4249 3582 4041 3575 6280 1010 339
6051C39M887R138o053R39O36n184l454L044k146n38J629L136L471L351K499M008
$$ 339 5226 14364 8311 9250 9886 4702 1248 4292 2146 1608 3237 6373 9844 13195 15694 19702
6035A9702o217q185n573o783R55L657K571M544M362j257j0082j1694k522K31M629
$$ 19702 13485 5300 -273 -7056 -6101 -2444 127 4671 9033 7776 -2306 -14000 -16522 -16291 -11662
6020a1662N319N365J143j196R869L613K54m590p038o809M842L182J988J408n768
$$ -11662 -6343 -978 165 -1031 8838 12451 12705 8115 1077 -5732 -890 2292 4280 5688 -80
6005h0L16j155N168K655p044J370m520p321m286O825L355q873n065O481N052K943
$$ -80 236 -919 4249 6904 -140 1230 -3290 -10611 -14897 -8072 -4717 -13590 -18655 -12174 -7122 -4179
5989d179l184n746p491P297L932L256K498N37O976j667k330p224J1590R977N778
$$ -4179 -7363 -13109 -20600 -13303 -9371 -6115 -3617 -3080 3896 2229 -101 -7325 4265 14242 20020
5974B0020m964j0671l977k277K778q12k123j688k05o705k469P53K783K61r79O026
$$ 20020 15056 4385 408 -1869 909 97 -2026 -3714 -3919 -10624 -13093 -12340 -9557 -9296 -10275 -4249
5958d249K008M005K180j70j743p469l97m061j96P79J768j794o571M090J115r24
$$ -4249 -2241 1764 3944 3774 2031 -5438 -5835 -9896 -10092 -9313 -7545 -9339 -15910 -11820 -10705 -11629
5942a1629J555O965K58N44J259q35M094J848J869l642j465j771l293P8Q44J409
$$ -11629 -10074 -3109 -2851 -2307 -1048 -1883 2211 4059 5928 2286 821 -950 -4243 -4165 -3321 -1912
5926a912M000j063j987n237L337m383m447J583N640m45M818N545K201n487j1283
$$ -1912 2088 1025 -962 -6199 -2862 -7245 -11692 -10109 -4469 -4914 -96 5449 7650 2163 -9120
5911i120M935O629L184r59M102O092n833j0137k361L248K9O782O860m286q283
$$ -9120 -4185 2444 5628 4669 8771 14863 9030 -1107 -3468 -220 -191 6591 13451 9165 882
5896H82o985o88K185Q770m728o923K22L587k906j380N363o922L476N733k624o56
$$ 882 -6103 -6791 -4606 4164 -564 -7487 -7265 -3678 -6584 -7964 -2601 -9523 -6047 -314 -2938 -3594
5880c594K934r64o44J200L093K909j73J421J677o033p033J207M060K449m090O031
$$ -3594 -660 -1624 -2268 -1068 2025 4934 4761 6182 7859 1826 -5207 -4000 60 2509 -1581 4450
5864D450M078j239J728k446L329k308r982m955j102P535K47J617J338m661j726
$$ 4450 8528 7289 9017 6571 9900 7592 -2390 -7345 -8447 -912 -665 952 2290 -2371 -4097
5849d097m394R24Q314q02j98J425n551k813j931N240K658j513P80j050K750J865
$$ -4097 -8491 -7567 747 -55 -253 1172 -4379 -7192 -9123 -3883 -1225 -2738 -1958 -3008 -258 1607
5833A607p198m54O14O745k627O07K601J4p33n7o403J579K352L476k821q53M367
$$ 1607 -5591 -6045 -5431 1314 -1313 -706 1895 1909 1176 1119 -5284 -3705 -1353 2123 -698 -1551 2816
5816B816K323J367J322j024M210J605J24p082j476J192m996n09K017J372k524
$$ 2816 5139 6506 7828 6804 11014 12619 12743 5661 4185 5377 381 -128 1889 3261 737
5801G37m376M511k88L77J85K364L624O177k466o076k545n902m088L416J343kk014
$$ 737 -3639 872 584 961 1146 3510 7134 13311 10845 4769 2224 -3678 -7766 -4350 -3007 -3009 -5023
5784e023J723k924n152J0238n171j164M796n751k726L951M358K328K193K138k898
$$ -5023 -3300 -6224 -11376 -1138 -6309 -7473 -2677 -8428 -11154 -7203 -2845 -517 1676 3814 916
5769I16J771o870k855j343L44K792M745n247L95r57L624j298o681O93q48L365
$$ 916 2687 -4183 -7038 -8381 -8037 -5245 -500 -5747 -5352 -6309 -2685 -3983 -10664 -9971 -10819 -7454
5753g454N027J929J318L339m433l981J717l40J496L472j235k774P060R04j57j008
$$ -7454 -2427 -498 820 4159 -274 -4255 -2538 -2878 -1382 2090 855 -1919 5141 6045 5888 4880
5737D880k933m236r15M320N900P299o670p917P11J348j534k267n1J016n028n77
$$ 4880 1947 -2289 -3204 1116 7016 14315 7645 -272 439 1787 253 -2014 -2065 -1049 -6077 -6654
5721f654M952K257m885L631n37j276q66M35M296K067k731k739l271j41m14L482
$$ -6654 -1702 555 -4330 -699 -1236 -2512 -3378 -2943 1353 3420 689 -2050 -5321 -5462 -5876 -2394
5705b394p023l263J0287L665j427k735j393K879n57k134k625P1J909O238k76l231
$$ -2394 -9417 -12680 -2393 1272 -155 -2890 -4283 -1404 -1961 -4095 -6720 -6649 -4740 1498 1222 -2009
5689b009m090l396l214N84k143L003Q492N232j783o199J046k53O649m9k087r59
$$ -2009 -6099 -9495 -12709 -12125 -14268 -11265 -2773 2459 676 -5523 -4477 -4730 1919 1870 -217 -1176
5673a176l711o21P253j109o617k372j811P53R65K681J0436Q479o446q992Q64L474
$$ -1176 -4887 -5508 1745 636 -5981 -8353 -10164 -9411 -8446 -5765 4671 13150 6704 -2288 -1424 2050
5657B050N693l391l565j817M10j016k0K879R576l246j2951k354P546j0036p408
$$ 2050 7743 4352 787 -1030 -620 -1636 -1656 1223 10799 7553 -5398 -7752 -206 -10242 -17650
5642a7650J510N244O681l386l851M280M626M860j834o319l336O452K735K986J792
$$ -17650 -16140 -10896 -4215 -7601 -11452 -7172 -2546 2314 480 -5839 -9175 -2723 12 2998 4790
5627D790L119M580L265m163r426l331m180o05l873o28j198K461L859L224J227
$$ 4790 7909 12489 15754 11591 2165 -1166 -5346 -5951 -9824 -10452 -11650 -9189 -5330 -2106 -879
5612h79N687K080m981L143K91n823p670m60l205k543P397q3J239N558m274n123
$$ -879 4808 6888 1907 5050 5341 -482 -8152 -8612 -11817 -14360 -6963 -7046 -5807 -249 -4523 -9646
5596i646j0617j165J1638j080J684N521j623l585l47L429J299n72m368M655Q360
$$ -9646 -20263 -21428 -9790 -10870 -9186 -3665 -5288 -8873 -9220 -5791 -4492 -5064 -9432 -4777 3583
5581C583K022J888p104k451K056P49K27L64k80O996J0159j264k477Q241K101q272
$$ 3583 5605 7493 389 -2062 -6 743 970 1334 1054 8050 18209 16945 14468 22709 24810 16538
5565A6538l765j581O19r120n576l111k13J1229L528j0566l980O261m566k475j188
$$ 16538 12773 11192 11811 2691 -2885 -5996 -6209 5020 8548 -2018 -5998 263 -4303 -6778 -7966
5550g966P108L409O0n557m16K486K407k152M042J1982j280j003o713o182k879
$$ -7966 -858 2551 2611 -2946 -3362 -876 1531 -621 3421 15403 14123 13120 6407 225 -2654
5535b654N804m391l637l558L995O687K146P750K399j102m552q990p287J448K059
$$ -2654 3150 -1241 -4878 -8436 -4441 2246 4392 12142 14541 13439 8887 -103 -7390 -5942 -3883
5520c883k01k684M357M4j036P34q72j322M83l421p277q46J3805N312N218p055
$$ -3883 -4084 -6768 -2411 -2367 -3403 -2669 -3541 -4863 -4380 -7801 -15078 -15924 -2119 3193 8411 1356
5504A356m23K243n227K188j469m57K553n66m85N816K994j499j990k679j356k195
$$ 1356 933 3176 -2051 137 -1332 -1789 764 198 -287 5529 8523 7024 5034 2355 999 -1196
5488a196k052K115k801j503N911r61N304m128l881j33j2J199l854N104r62j964
$$ -1196 -3248 -1133 -3934 -5437 474 -487 4817 689 -3192 -3325 -3337 -2138 -5992 -888 -1850 -3814
5472c814K136K203O013O263j776J45k031N050r774k962J730j692l887j896l644
$$ -3814 -1678 525 6538 12801 11025 11170 9139 14189 4415 1453 3183 1491 -2396 -4292 -7936
5457g936l298J179K539J273l489j715P962L810q43n30J456l009P755l338j603
$$ -7936 -11234 -10055 -7516 -6243 -9732 -11447 -3485 325 -518 -1048 408 -2601 5154 1816 213
5442B13k79J524r43K353L53R09k289q524n871O770J0662N897K805o802q893L862
$$ 213 -66 1458 515 2868 3221 4130 1841 -6683 -12554 -5784 4878 10775 13580 6778 -2115 1747
5426A747l819j848L07Q805J796m303K58J289l113K206n375p561M4M643K75J0370
$$ 1747 -2072 -3920 -3613 5192 6988 2685 2943 4232 1119 3325 -2050 -9611 -9567 -4924 -4649 5721
5410E721K199j226K293k128r75r115k559j84J398o429L336O535K674L357n462
$$ 5721 7920 6694 8987 6859 5884 -3231 -5790 -5974 -4576 -11005 -7669 -1134 1540 4897 -565
5395e65m056JM755L280J638k898R99J32K34m134k405n845l879K106j49k020L060
$$ -565 -4621 -4620 135 3415 5053 2155 3154 3286 3520 -614 -3019 -8864 -12743 -10637 -10786 -12806 -9746
5378i746N173L86K579M800l31p27M87M098j0323k175N8M719J277m79K733m85K742
$$ -9746 -4573 -4187 -1608 3192 2861 2134 2621 6719 -3604 -5779 -5721 -1002 275 -204 2529 2044 4786
5361D786j548n045j225Q05J707J424j657J978o80l638j428j153l693k720j696
$$ 4786 3238 -1807 -3032 -2227 -520 904 -753 1225 545 -3093 -4521 -5674 -9367 -12087 -13783
5346a3783k7K229O733N70j312p76M055k006k733n234k28P571n44K763N292O656
$$ -13783 -13810 -11581 -4848 -4278 -5590 -6366 -2311 -4317 -7050 -12284 -12512 -4941 -5485 -2722 2570 9226
5330I226j338k782k50K215J6j447o405n832r42O554J0791j338l675N20J187M703
$$ 9226 7888 5106 4856 7071 7087 5640 -765 -6597 -7539 -985 9806 8468 4793 5313 6500 11203
5314A1203m291j518r149J728O123j005L231N380r027J148J577j424j089m685r54
$$ 11203 6912 5394 -3755 -2027 4096 3091 6322 11702 2675 3823 5400 3976 2887 -1798 -2752
5299b752o634j367J941l276P948p769l866M58O051Q852K274p890m035M543R788
$$ -2752 -9386 -10753 -8812 -12088 -4140 -11909 -15775 -15317 -9266 -414 1860 -6030 -10065 -5522 4266
5284D266j790n884m172k153j147O760M708J83l407k280k384O437M811n85j653
$$ 4266 2476 -3408 -7580 -9733 -10880 -4120 588 771 -2636 -4916 -7300 -863 3948 3363 1710
5269A710l531L495L060o840p019K590M120L407M054R78m204j633j362j673p601
$$ 1710 -1821 1674 4734 -2106 -9125 -6535 -2415 992 5046 6024 1820 187 -1175 -2848 -10449
5254a0449k051K001p90L479O791J516k649l720r57K483J3973J689n604j959k028
$$ -10449 -12500 -10499 -11289 -7810 -1019 497 -2152 -5872 -6829 -4346 9627 11316 5712 3753 1725
5239A725j0612K285Q410N888L0K682m006r147j86M568K092J548M758k497l183
$$ 1725 -8887 -6602 1808 7696 7726 10408 6402 -2745 -2931 1637 3729 5277 10035 7538 4355
5224D355o422o121L286p17m719j583L566L716m415o775j494K92O392r01j498K765
$$ 4355 -2067 -8188 -4902 -5619 -10338 -11921 -8355 -4639 -9054 -15829 -17323 -17031 -10639 -11540 -13038 -10273
5208a0273Q123q99N51M612O75j525p167k659Q823N150l308j732k344o618q07l308
$$ -10273 -2150 -3049 -2498 2114 2789 1264 -5903 -8562 261 5411 2103 371 -1973 -8591 -9398 -12706
5192a2706l335K456O488j0121j601M713j378J239P421l880K877n954K28J600P106
$$ -12706 -16041 -13585 -7097 -17218 -18819 -14106 -15484 -14245 -6824 -10704 -7827 -13781 -13553 -11953 -4847
5177d847J812J14L308M794j39K812m104r282k685N438j83j743L588M25K763P13
$$ -4847 -3035 -2921 387 5181 5042 7854 3750 -5532 -8217 -2779 -2962 -4705 -1117 -692 2071 2784
5161B784J515N670P50m720L720k797l822j18p976l003R456J071l610P177M017
$$ 2784 4299 9969 10719 5999 9719 6922 3100 2982 -4994 -7997 1459 2530 -1080 6097 10114
5146A0114N40k652o999j474L092l013n150j02M802O067n932r117n55M542O203
$$ 10114 10654 8002 1003 -471 2621 -392 -5542 -5644 -842 5225 -707 -9824 -10379 -5837 366
5131C66J580k008r689n178M249K3r29m12J236j541M623M94N814J11k661l815L007
$$ 366 1946 -62 -9751 -14929 -10680 -10657 -11586 -11998 -10762 -12303 -7680 -7186 -1372 -1261 -3922 -7737 -4730
5114d730M168n074R30O08j217R485J869L09l335q909K469J035l217p80K965K99
$$ -4730 -562 -5636 -4706 -4098 -5315 4170 6039 6348 3013 -5896 -3427 -2392 -5609 -6389 -3424 -3125
5098c125o84Q096j063j06j596L135l733k568n10n63j069J29O440M041J689k192
$$ -3125 -3809 4287 3224 3118 1522 4657 924 -1644 -2154 -2717 -3786 -3657 2783 6824 8513 6321
5082F321n90m171n865p053m208M458N895O000j584k661l600J67R787l503l692
$$ 6321 5731 1560 -4305 -11358 -15566 -11108 -5213 787 -797 -3458 -7058 -6891 2896 -607 -4299
5067d299m798o41R28M034N56j512N254l422M911J5116l417m956p237K003n62m652
$$ -4299 -9097 -9738 -8810 -4776 -4220 -5732 -478 -3900 1011 16127 12710 7754 517 2520 1958 -2694
5051b694N627n44n308N926K823r401j762m59l83J320M358l735n560L539M643K243
$$ -2694 2933 2389 -2919 3007 5830 -3571 -5333 -5792 -6175 -4855 -497 -4232 -9792 -6253 -1610 633
5035F33m753n63K858l070l222N039l927k86K392K23n24N93k788L30J475M104P426
$$ 633 -4120 -4683 -1825 -4895 -8117 -3078 -7005 -7291 -4899 -4676 -5200 -4607 -7395 -7065 -5590 -1486 5940
5018E940J101M07k025l384l812p15q32l18k507M901K300l991L607j465m819J515
$$ 5940 7041 7448 5423 2039 -1773 -2488 -3320 -3638 -6145 -1244 1056 -2935 672 -793 -5612 -4097
5002d097N570N135j579Q7K43m079K624l343k309j350L06O223j710n64L417K000
$$ -4097 1473 6608 5029 5116 5359 1280 3904 561 -1748 -3098 -2792 3431 1721 1157 4574 6574
4986F574k848P969j85j228l251l49O69j399k999J282k750l588K698J222k737L421
$$ 6574 3726 11695 11510 10282 7031 6682 7351 5952 2953 4235 1485 -2103 595 1817 -920 2501
4970B501m094l004j563J106p89r05J331K45m84L218L085k212l066K47P702K010
$$ 2501 -1593 -4597 -6160 -5054 -5843 -6748 -5417 -5172 -5656 -2438 647 -1565 -4631 -4384 3318 5328
4954E328M65n852j872m612m372O266O636l211o309j567M292P929L541k62n143
$$ 5328 5793 -59 -1931 -6543 -10915 -4649 1987 -1224 -7533 -9100 -4808 3121 6662 6400 1257
4939A257n398k113R93L627K957M070M33j352l5k325n10l435k274j893N413K409
$$ 1257 -4141 -6254 -5261 -1634 1323 5393 5826 4474 4439 2114 1604 -1831 -4105 -5998 -585 1824
4923A824o517m107J890k285K507N138O15N304k73M429n00k495j127j248J327j885
$$ 1824 -4693 -8800 -6910 -9195 -6688 -1550 -935 4369 4096 8525 8025 5530 4403 3155 4482 2597
4907B597o775m379K892J159N109K165l717L81K558K400L06K845o319m940J126
$$ 2597 -4178 -8557 -5665 -4506 603 2768 -949 -568 1990 4390 4696 7541 1222 -3718 -2592
4892b592L336L161k01L873j155K98k612N585k442q857j795oJ489M294K151J941
$$ -2592 744 3905 3704 7577 6422 6720 4108 9693 7251 -1606 -3401 -3407 -1918 2376 4527 6468
4876F468O837R635L071l065o378n524p743J524r78j501o93n693k773j078j219
$$ 6468 13305 22940 26011 22946 16568 11044 3301 4825 3847 2346 1653 -4040 -6813 -7891 -9110
4861i110L317J80J806M876N262K532j0522n35J596L485m49K119p22j841q150L799
$$ -9110 -5793 -5613 -3807 1069 6331 8863 -1659 -2194 -598 2887 2438 4557 3835 1994 -6156 -2357
4845b357j389o850M360M916Q81l964n046p712k485L732J0067M435M177L780r01
$$ -2357 -3746 -10596 -6236 -1320 -439 -4403 -9449 -17161 -19646 -15914 -5847 -1412 2765 6545 5644
4830E644q174n136O012J850L514n14l553q78j790M444M136J203n340J696Q25q403
$$ 5644 -2530 -7666 -1654 196 3710 3196 -357 -1235 -3025 1419 5555 6758 1418 3114 3939 -4464
4814d464L196O520l577N70l912j334K796n489q38L914q68j780J69N748L741J614
$$ -4464 -1268 5252 1675 2245 -1667 -3001 -205 -5694 -6532 -2618 -3486 -5266 -5097 651 4392 6006
4798F006J041k880L014J950m889k546p376p074k197J0478Q392l928n285j322K96
$$ 6006 7047 4167 7181 9131 4242 1696 -5680 -12754 -14951 -4473 3919 -9 -5294 -6616 -6320
4783f320j098j243o210j37O833J659k153k090Q414K267K501M41p415J316L08k940
$$ -6320 -7418 -8661 -14871 -15008 -8175 -6516 -8669 -10759 -2345 -78 2423 2864 -4551 -3235 -2927 -5867
4767e867k220K844R205N246j61m386l762n801J164N193L263n068n50L36k447J233
$$ -5867 -8087 -5243 3962 9208 9047 4661 899 -4902 -3738 1455 4718 -350 -900 -564 -3011 -1778
4751a778J874k348n935P032N510L84m843N73k367J607M498K983k713p257p34N279
$$ -1778 96 -2252 -8187 -1155 4355 4739 -104 469 -1898 -291 4207 7190 4477 -2780 -3514 1765
4735A765p567j300L592N981J803n032l042q103l494J0208R009m474k930N411m034
$$ 1765 -5802 -7102 -3510 2471 4274 -758 -3800 -11903 -15397 -5189 3820 -654 -3584 1827 -2207
4720b207n449P859q28K962M468J076r460J53L414m768k464Q93K697Q552L037k012
$$ -2207 -7656 203 -625 2337 6805 7881 -1579 -1426 1988 -2780 -5244 -4351 -1654 6898 9935 7923
4704G923m569j801P71j469p35m763J205P156P829p745k057j759n200J58M328K756
$$ 7923 3354 1553 2324 855 120 -4643 -3438 3718 11547 3802 1745 -14 -5214 -5056 -728 2028
4688B028q196m32O338j626J0411n16l701l51j091L510k445J582O928k925o18p83
$$ 2028 -6168 -6600 -262 -1888 8523 8007 4306 3955 2864 6374 3929 5511 12439 9514 8896 8113
4672H113m062N479j964n400J821L338k178j71n43l291K403MN071j40p098j881
$$ 8113 4051 9530 7566 2166 3987 7325 5147 4976 4433 1142 3545 3549 8620 8480 1382 -499
4656d99K503L091k542q50l442L341Q76P76J633K588j007n250m282q650K006P738
$$ -499 2004 5095 2553 1703 -1739 1602 2478 3254 4887 7475 6468 1218 -3064 -11714 -9708 -1970
4640a970k191M283N553O665O9m377q944l171J607l160R65J550P995M443n508K231
$$ -1970 -4161 122 5675 12340 12409 8032 -912 -4083 -2476 -5636 -4671 -3121 4874 9317 3809 6040
4624F040p163k860M371n486J387L572J598k259m88q205j657O330M917o12K026
$$ 6040 -1123 -3983 388 -5098 -3711 -139 1459 -800 -1288 -9493 -11150 -4820 97 -515 1511
4609A511m5k056K515M103q552J441N242M170m209j2141l527N00J897O905N912
$$ 1511 1466 -590 1925 6028 -2524 -1083 4159 8329 4120 -8021 -11548 -11048 -9151 -2246 3666
4594C666k027K471l35k482K627N909j441q938o400N756J191k956J238j406L740
$$ 3666 1639 4110 3775 1293 3920 9829 8388 -550 -6950 -1194 -3 -2959 -1721 -3127 613
4579F13J029m247n671j798K290P849N760K172l902k349m587j749k956q51P314
$$ 613 1642 -2605 -8276 -10074 -7784 65 5825 7997 4095 1746 -2841 -4590 -7546 -8397 -1083
4564a083Q335l459q975r719J747N919N628j282Q95l132l677M829O951J986J328
$$ -1083 7252 3793 -5182 -14901 -13154 -7235 -1607 -2889 -1994 -5126 -8803 -3974 2977 4963 6291
4549F291M434O15k377l631R7j23r9Q2l922k564m359j154N641j888p93J269J382
$$ 6291 10725 11340 8963 5332 5429 5306 5207 5289 1367 -1197 -5556 -6710 -1069 -2957 -3750 -2481 -1099
4532a099O478L111M13j179K080j989k645q224j519J50N514r42r56J179j042l290
$$ -1099 5379 8490 8903 7724 9804 7815 5170 -3054 -4573 -4423 1091 149 -807 372 -670 -3960
4516c960p419J131Q065K582L457O854n383j339l061k695p556L515K472p337l777
$$ -3960 -11379 -10248 -2183 399 3856 10710 5327 3988 927 -1768 -9324 -5809 -3337 -10674 -14451
4501a4451j369Q360K809J5k132O118j189P033n031l694J166J276P116K70k311
$$ -14451 -15820 -7460 -4651 -4636 -6768 -650 -1839 5194 163 -3531 -2365 -1089 6027 6297 3986
4486C986L37l196p032Q385L307q482m661j259J165N615m36q519L563M404L894
$$ 3986 4323 1127 -5905 2480 5787 -2695 -7356 -8615 -7450 -1835 -2271 -10790 -7227 -2823 1071
4471A071n615o4K254O566L039L355J378q462k700L150J166J534J176o890L926
$$ 1071 -4544 -4608 -2354 4212 7251 10606 11984 3522 822 3972 5138 6672 7848 958 4884
4456D884L933m921o959l421j802P127K817o635o243K121J351J0298L918l747M78
$$ 4884 8817 3896 -3063 -6484 -8286 -1159 1658 -4977 -11220 -9099 -7748 2550 6468 2721 3199
4441C199M335j15k605j020k579j412J934k368L276K607N80k45j849M782j161m899
$$ 3199 7534 7419 4814 3794 1215 -197 1737 -631 2645 5252 5832 5587 3738 8520 7359 2460
4425B460J029n017j258j987K650j806N54k661M710K24K95J143N292J153r975l772
$$ 2460 3489 -1528 -2786 -4773 -2123 -3929 -3375 -6036 -1326 -1102 -807 336 5628 6781 -3194 -6966
4409f966m015K926Q271K764K244p13k671n464J45M188J404o425l928j185m12M01
$$ -6966 -10981 -8055 216 2980 5224 4511 1840 -3624 -3479 709 2113 -4312 -8240 -9425 -9837 -9436
4393i436K894j381q469K345N462j082P53Q361P037L558N400m156n46j238O38Q18
$$ -9436 -6542 -7923 -16392 -14047 -8585 -9667 -8914 -553 6484 10042 15442 11286 10740 9502 10140 10958
4377A0958L541m959o763n550l477J59N91O50L435M440m897j709k840l367l272
$$ 10958 14499 9540 2777 -2773 -6250 -6091 -5500 -4850 -1415 3025 -1872 -3581 -6421 -9788 -13060
4362a3060K753R809L66J338M889M41q43L51n543k884L354k674k292l22n40N776
$$ -13060 -10307 -498 -132 1206 6095 6536 5693 6044 501 -2383 971 -1703 -3995 -4317 -4857 919
4346I19P234J157K405l593k530k069K043J427o196k446O54O370k559k49J746p069
$$ 919 8153 9310 11715 8122 5592 3523 5566 6993 797 -1649 -995 5375 2816 2567 4313 -2756
4330b756K48L329P532K326m591L114l733k530k109p395L864O93N076L159L115
$$ -2756 -2508 821 8353 10679 6088 9202 5469 2939 830 -6565 -2701 -2008 3068 6227 9342
4315I342p673q254l872Q578L696p381l984L174l044J128R652P168J27q710j2374
$$ 9342 1669 -6585 -10457 -1879 1817 -5564 -9548 -6374 -9418 -8290 1362 8530 8657 -53 -12427
4300a2427L439P929K229J946L539p252r089k560O368N104J466k177j326j231M247
$$ -12427 -8988 -1059 1170 3116 6655 -597 -9686 -12246 -5878 -774 692 -1485 -2811 -4042 205
4285B05N430J536p589R71R619k380n415j930j323l174m86J4401O806n779r95o493
$$ 205 5635 7171 -418 553 10172 7792 2377 447 -876 -4050 -4536 9865 16671 10892 9897 3404
4269C404k009l480m737K842j684j636P149J880m044M352O851P49j091k699j0388
$$ 3404 1395 -2085 -6822 -3980 -5664 -7300 -151 1729 -2315 2037 8888 9637 8546 5847 -4541
4254d541o133j74O070K547l152N93j164J000M804j441l01J014k391L704J500o222
$$ -4541 -10674 -10848 -4778 -2231 -5383 -4790 -5954 -4954 -150 -1591 -1892 -878 -3269 435 1935 -4287
4238d287Q811K731l313l22j418n87n355N32M99r93j665n128J70M412J503P592
$$ -4287 4524 7255 3942 3620 2202 1615 -3740 -3208 -2709 -3702 -5367 -10495 -10325 -5913 -4410 3182
4222C182J647L217Q832n586m985J134N916o52m435p356l696L721J387M66L488
$$ 3182 4829 8046 16878 11292 6307 7441 13357 12705 8270 914 -2782 939 2326 2792 6280
4207F280o23M099J256j417k796J187j363J069J400P87l860j314k810m879N50M462
$$ 6280 5657 9756 11012 9595 6799 7986 6623 7692 9092 9879 6019 4705 1895 -2984 -2434 2028
4191B028R414L167j828m031m716P128l000k121Q11N018n965o211j665o553J652
$$ 2028 11442 14609 12781 8750 4034 11162 8162 6041 6852 11870 5905 -306 -1971 -8524 -6872
4176f872j112k939J1222O72m667P456J967o278m687l778K709N150O616l512p238
$$ -6872 -7984 -10923 299 971 -3696 3760 5727 -551 -5238 -9016 -6307 -1157 5459 1947 -5291
4161e291r252l378N66L144Q390N095O23K681M063O120j348r7j596k592n954j281
$$ -5291 -14543 -17921 -17355 -14211 -5821 -726 -103 2578 6641 12761 11413 11316 9720 7128 1174 -107
4145a07n324n889K400P453M283r63n866n10J603M589o0o55K336R890L034m501
$$ -107 -5431 -11320 -8920 -1467 2816 1853 -4013 -4523 -2920 1669 1609 954 3290 13180 16214 11713
4129A1713p15n874k509n473n557M206M455k406R696l582l256K48n48l591K217
$$ 11713 10998 5124 2615 -2858 -8415 -4209 246 -2160 7536 3954 698 946 398 -3193 -976
4114i76o457M40m432P189l57M50J190r47r50L858R71J475O004k400j0082l407
$$ -976 -7433 -6993 -11425 -4236 -4593 -4143 -2953 -3900 -4850 -992 -21 1454 7458 5058 -5024 -8431
4098h431m192k346J346M148K614m05L545Q164l549m127K768j65m117l012l021
$$ -8431 -12623 -14969 -13623 -9475 -6861 -7266 -3721 4443 894 -3233 -465 -630 -4747 -7759 -10780
4083a0780L456O938L977j490n23j396o4o424o111r15K452L234m044J418M280K955
$$ -10780 -7324 -386 3591 2101 1578 182 118 -6306 -12417 -13332 -10880 -7646 -11690 -10272 -5992 -3037
4067c037K605l720l331J527N522j65J694j544K929N380J595l518J350N241k593
$$ -3037 -432 -4152 -7483 -5956 -434 -599 1095 -449 2480 7860 9455 5937 7287 12528 9935
4052I935r662n59j501o195j56M707J935K746L506N353j956l417j781r13J940K301
$$ 9935 273 -286 -1787 -7982 -8138 -3431 -1496 1250 4756 10109 8153 4736 2955 2042 3982 6283
4036F283J173M568j433j1825k697K648N40k614L553j36N710L063k756o077j730
$$ 6283 7456 12024 10591 -1234 -3931 -1283 -743 -3357 196 60 5770 8833 6077 0 -1730
4021a730L717l143L618M082L219K723n085n315n679N125Q65m497O340K789j659
$$ -1730 1987 -1156 2462 6544 9763 12486 7401 2086 -3593 1532 2397 -2100 4240 7029 5370
4006E370j67m593J38O627l219r534l52L410J442L544q63o319J89N112K086P527
$$ 5370 5203 610 748 7375 4156 -5378 -5730 -2320 -878 2666 1803 -4516 -4327 785 2871 10398
3990A0398J520n066o62l001L381l071n678L724M931K478J243M950J544k659k714
$$ 10398 11918 6852 6190 3189 6570 3499 -2179 1545 6476 8954 10197 15147 16691 14032 11318
3975A1318N824M96j2315n187N807m42k20k752k089j042l234m877L676J403L717
$$ 11318 17142 17638 5323 136 5943 5501 5281 2529 440 -602 -3836 -8713 -5037 -3634 83
3960H3O154p769p788R77N540j293J322Q60K575Q818k486l907m955L606n217n762
$$ 83 6237 -1532 -9320 -8343 -2803 -4096 -2774 -1914 661 9479 6993 3086 -1869 1737 -3480 -9242
3944i242J478M537j245L678Q236J180M9J93p24K187j604l665m41N075k75L30m523
$$ -9242 -7764 -3227 -4472 -794 7442 8622 8671 8864 8140 10327 8723 5058 4617 9692 9417 9747 5224
3927E224m180l463J27J050L595o328j222O49n59L300Q51j189J396Q537K984l58
$$ 5224 1044 -2419 -2292 -1242 2353 -3975 -5197 -4548 -5107 -1807 -956 -2145 -749 7788 10772 10414
3911A0414l038k152j088K328M108j124m417l328j443N140p259n4L064M3M31j0198
$$ 10414 7376 5224 4136 6464 10572 9448 5031 1703 260 5400 -1859 -1913 1151 1194 1625 -8573
3895h573k647K997J2008J970n501k898L919K531k847K823K085k024J386j886o517
$$ -8573 -11220 -8223 3785 5755 254 -2644 1275 3806 959 3782 5867 3843 5229 3343 -3174
3880c174n261J0641R194j413m414M635k56k235l735p606J770l234Q57N669m37
$$ -3174 -8435 2206 11400 9987 5573 10208 9952 7717 3982 -3624 -1854 -5088 -4231 1438 1001
3865A001p948P50L604j515m886L699R772j691l483j891p58j455m03Q412Q327J422
$$ 1001 -6947 -6197 -2593 -4108 -8994 -5295 4477 2786 -697 -2588 -3346 -4801 -5204 3208 11535 12957
3849A2957k883J688J995m138o579j403o016k89M556j187j086j348J973P258q4
$$ 12957 10074 11762 13757 9619 3040 1637 -4379 -4668 -112 -1299 -2385 -3733 -1760 5498 5414
3834E414n409q801o924Q653J0591k66m902J099K166J337l310J744Q080P032o263
$$ 5414 5 -8796 -15720 -7067 3524 3258 -1644 -545 1621 2958 -352 1392 9472 16504 10241
3819A0241j1773m611M914M001k650L141L80M89o770L316K033k031l831M564k450
$$ 10241 -1532 -6143 -1229 2772 122 3263 3643 4132 -2638 678 2711 680 -3151 1413 -1037
3804a037q214q861L451L691K761J9446L224p163N523M1k584k076j0007n630L177
$$ -1037 -9251 -18112 -14661 -10970 -8209 11237 14461 7298 12821 12862 10278 8202 -1805 -7435 -4258
3789d258L403O446j515R961Q54n378j141p360n234R88k181P276J35J755j070k455
$$ -4258 -855 5591 4076 14037 14891 9513 8372 1012 -4222 -3234 -5415 1861 1996 3751 2681 226
3773B26j857K341M773o455N26k403n152L707M842o846K580Q892M798p713k022
$$ 226 -1631 710 5483 -972 -446 -2849 -8001 -4294 548 -6298 -3718 5174 9972 2259 237
3758B37j493j379M426J001n84m326J124j73P22M056L351o048q088m309r21O58
$$ 237 -1256 -2635 1791 2792 2208 -2118 -994 -1167 -445 3611 6962 914 -7174 -11483 -12404 -11746
3742a1746R377J3353M482l022j984l929k521p461O13J155L02N181M400N335L6
$$ -11746 -2369 10984 15466 12444 10460 6531 4010 -3451 -2838 -1683 -1381 3800 8200 13535 13571
3727A3571k435m302k058k271o477K09K733J51m16R885k638o982n374r29k027O631
$$ 13571 11136 6834 4776 2505 -3972 -3763 -1030 -879 -1295 8590 5952 -1030 -6404 -7333 -9360 -2729
3711b729M974m078J774L827n041o580M305L872L581j965P253j952J42K141J117
$$ -2729 2245 -1833 -59 3768 -1273 -7853 -3548 324 3905 1940 9193 7241 7383 9524 10641
3696A0641n415J135l671M778J946n459J204l577k908k552K274N907n567n080M0
$$ 10641 5226 6361 2690 7468 9414 3955 5159 1582 -1326 -3878 -1604 4303 -1264 -6344 -6304
3681f304o13J264l566m160j323k086L637J2692M132m302l663o39K375l358l429
$$ -6304 -6917 -5653 -9219 -13379 -14702 -16788 -13151 -459 3673 -629 -4292 -4931 -2556 -5914 -9343
3666i343p99O432P941L135n510k390O048L684n221o059n527J430j272q26k877
$$ -9343 -10142 -3710 4231 7366 1856 -534 5514 9198 3977 -2082 -7609 -6179 -7451 -8277 -11154
3651a1154O065n67q358N055K076J034n74k444K414l502p007L816Q231j786j834
$$ -11154 -5089 -5656 -14014 -8959 -6883 -5849 -6423 -8867 -6453 -9955 -16962 -13146 -4915 -6701 -8535
3636h535K421L152O593L396n449p322l277M984R17n877m419R34O569O948l022
$$ -8535 -6114 -2962 3631 7027 1578 -5744 -9021 -4037 -3120 -8997 -13416 -12482 -5913 1035 -1987
3621a987l575K334O98Q408M935l662j257K946p734q488N012J2278q19K393p34
$$ -1987 -5562 -3228 -2530 5878 10813 7151 5894 8840 1106 -7382 -2370 9908 9089 11482 10748
3606A0748p48j762m928J51J475J787l794j0706j461L4q83K242N249L9M110n491
$$ 10748 10000 8238 3310 3461 4936 6723 2929 -7777 -9238 -9204 -10087 -7845 -2596 -2557 1553 -3938
3590c938M88L794O10O333R06k877o77l236K498M11j815O2n85j07m271J444n68
$$ -3938 -3450 344 954 7287 8193 5316 4639 1403 3901 4312 2497 2559 1974 1867 -2404 -960 -1528
3573a528J11L727l571k201K32M52K422n10l752L698K768j927M02J504K252N909
$$ -1528 -1417 2310 -1261 -3462 -3230 -2778 -356 -866 -4618 -920 1848 -79 323 1827 4079 9988
3557I988j916r61l32J44n971L512j832J599R949K832j4722N044O488L034q048
$$ 9988 8072 7111 6779 6923 952 4464 2632 4231 14180 17012 2290 7334 13822 16856 8808
3542H808n263k471J046n92K226L64m3n92r51M726N74m241o76K767l17m395l655
$$ 8808 3545 1074 2120 1528 3754 4118 4075 3483 2532 7258 7832 3591 2915 5682 5365 970 -2685
3525b685K313L904N026P75l111o940l255r80K072K582M11m223n409L732R464K096
$$ -2685 -372 3532 8558 9333 6222 -718 -3973 -4953 -2881 -299 112 -4111 -9520 -5788 3676 5772
3509E772K633n016K814l236l034j478k840J991m326k122j21P00m053M983N462
$$ 5772 8405 3389 6203 2967 -67 -1545 -4385 -2394 -6720 -8842 -8963 -8263 -12316 -7333 -1871
3494a871M5l131K89j522k669L635P42l747O67M577R68M134O556j486J069N298
$$ -1871 -1826 -4957 -4668 -6190 -8859 -5224 -4482 -8229 -7562 -2985 -2017 2117 8673 7187 8256 13554
3478A3554j587j368J830L740N91q150k161j012J893r92K970k199n686l12L314
$$ 13554 11967 10599 12429 16169 16760 8610 6449 5437 7330 6338 9308 7109 1423 1111 4425
3463D425J438p494m489J767P193L341m668j259K445PJ12O92m16Q60p825q090L558
$$ 4425 5863 -1631 -6120 -4353 2840 6181 1513 254 2699 2706 2818 3510 3094 3954 -3871 -11961 -8403
3446h403N091L559O824k429p984l598m840l180L173L986N886M528m496Q625N756
$$ -8403 -3312 247 7071 4642 -3342 -6940 -11780 -14960 -11787 -7801 -1915 2613 -1883 6742 12498
3431A2498q352m153m274N851L471j460j716n477L192J382j982K70Q969k914m657
$$ 12498 4146 -7 -4281 1570 5041 3581 1865 -3612 -420 962 -1020 -750 8219 5305 648
3416F48k886L408M695n035o375R228M018o654k676l27q68l494j670m648l556N127
$$ 648 -2238 1170 5865 830 -5545 3683 7701 1047 -1629 -1956 -2824 -6318 -7988 -12636 -16192 -11065
3400a1065K435J476P348k556M29L66J926k897j494K506N778O635K752o351m432
$$ -11065 -8630 -7154 194 -2362 -1933 -1567 359 -2538 -4032 -1526 4252 10887 13639 7288 2856
3385B856J127Q57M82l332L774J0539N49q761n574l085l907J33o08N355j708N344
$$ 2856 3983 4840 5322 1990 5764 16303 16852 8091 2517 -568 -4475 -4342 -4950 405 -1303 4041
3369D041m074M901K77l286j297N667m326o976M392l439j759o89N594M393K180
$$ 4041 -33 4868 5145 1859 562 6229 1903 -5073 -681 -4120 -5879 -6568 -974 3419 5599
3354E599q289q587j72O221L57L687J0532O384r928j0007k567R51l400K077M256
$$ 5599 -2690 -11277 -11449 -5228 -4871 -1184 9348 15732 5804 -4203 -6770 -5819 -9219 -7142 -2886
3339b886l444k504l39k23L422J144M996j955L117J595j326P557K727n065k573
$$ -2886 -6330 -8834 -9173 -9396 -5974 -4830 166 -1789 1328 2923 1597 9154 11881 6816 4243
3324D243k26j938l562j020J072M384j684k093k069k32l806k392Q623K992L076
$$ 4243 4017 2079 -1483 -2503 -1431 2953 1269 -824 -2893 -3125 -6931 -9323 -700 2292 5368
3309E368J430J09n178j730K784K209o76p02p708K185r95O804O28j667k021K18
$$ 5368 6798 6907 1729 -1 2783 4992 4316 3614 -4094 -1909 -2904 3900 4528 2861 840 1058
3293A058K404P09j665J338k588M53M014j775m794k081N786J90L75j947Q82M475
$$ 1058 3462 4171 2506 3844 1256 1709 5723 3948 -846 -2927 2859 3049 3424 1477 2359 6834
$$ [...]
##END NTUPLES=NMR SPECTRUM
##END=
