##TITLE=Analysis number 329192
Compound Code cc 55439
Book Reference 540/12
Project Code adrs
Chemist Name mikem
##JCAMPDX= 6.0         $$ Bruker NMR JCAMP-DX V2.0
##DATA TYPE= NMR SPECTRUM
##DATA CLASS= NTUPLES
##ORIGIN= Bruker BioSpin GmbH
##OWNER= nmr
$$ XWIN-NMR		Version 3.5
$$ Wed Aug  8 11:50:59 2007 GMT Daylight Time (UT+1h)  MAYBRIDGE\nmr@NMR_250MHZ
##.OBSERVE FREQUENCY= 250.131544655141
##.OBSERVE NUCLEUS= ^1H
##.ACQUISITION MODE= SIMULTANEOUS (DQD)
##.ACQUISITION SCHEME= undefined
##.AVERAGES= 16
##.DIGITISER RES= 18
##SPECTROMETER/DATA SYSTEM= dpx250
##.PULSE SEQUENCE= zg30
##.SOLVENT NAME= CDCl3
##.SHIFT REFERENCE= (INTERNAL, CDCl3, 0, 16.4452)
##AUDIT TRAIL= $$ (NUMBER, WHEN, WHO, WHERE, WHAT)
$$ ##TITLE= Audit trail, XWIN-NMR		Version 3.5
$$ ##JCAMPDX= 5.01
$$ ##ORIGIN= Bruker BioSpin GmbH
$$ ##OWNER= nmr
$$ C:\u/data/dgb/nmr/ADRS/300/pdata/1/auditp.txt
$$ ##AUDIT TRAIL=  $$ (NUMBER, WHEN, WHO, WHERE, WHAT)
(   1,<2007-08-08 11:50:32.52 +100>,<MAYBRIDGE\nmr>,<NMR_250MHZ>,
      <created by zg, POWCHK disabled, PULCHK disabled
       configuration hash MD5:
       76 6E 9A 78 1E 09 19 81 EC 84 63 8F B0 6A 59 2D
       data hash MD5: 64K
       1A F1 07 F6 92 F4 43 DF 51 F0 CB 60 E1 98 69 F3>)
(   2,<2007-08-08 11:50:47.38 +100>,<MAYBRIDGE\nmr>,<NMR_250MHZ>,
      <Start of raw data processing
       ef LB = 0.3 FT_mod = 6 PKNL = 1 SI = 32K 
       data hash MD5: 32K
       C6 A7 30 5A 50 18 40 8F 01 28 3F B6 19 94 42 24>)
(   3,<2007-08-08 11:50:49.17 +100>,<MAYBRIDGE\nmr>,<NMR_250MHZ>,
      <apk 
       data hash MD5: 32K
       17 3C 61 58 D7 60 F8 C6 EA 38 2E 5B 2D E1 7A EB>)
(   4,<2007-08-08 11:50:50.02 +100>,<MAYBRIDGE\nmr>,<NMR_250MHZ>,
      <abs ABSG = 5 
       data hash MD5: 32K
       9F 80 FF 64 62 DA FA 58 1C 0C 62 F1 ED 8F A3 45>)
$$ ##END=
$$ 
$$ hash MD5
$$ BF 6C 81 76 9F 9B B9 78 7E 48 7A 50 8E 45 02 B3
##$RELAX= 
##$RELAX= 
##$RELAX= 
##$RELAX= 
##$RELAX= 
##$RELAX= 
##$RELAX= 
$$ Bruker specific parameters
$$ --------------------------
##$DU= <C:\u>
##$EXPNO= 300
##$NAME= <ADRS>
##$PROCNO= 1
##$TYPE= <nmr>
##$USER= <dgb>
##$AMP= (0..31)
100 100 100 100 100 100 100 100 100 100 100 100 100 100 100 100 100 100 
100 100 100 100 100 100 100 100 100 100 100 100 100 100 
##$AQSEQ= 0
##$AQ_mod= 3
##$AUNM= <au_zg>
##$AUTOPOS= <14 >
##$BF1= 250.13
##$BF2= 250.13
##$BF3= 250.13
##$BF4= 250.13
##$BF5= 500.13
##$BF6= 500.13
##$BF7= 500.13
##$BF8= 500.13
##$BYTORDA= 1
##$CFDGTYP= 0
##$CFRGTYP= 5
##$CHEMSTR= <none>
##$CNST= (0..31)
1 1 145 1 1 1 1 1 1 1 1 1 1 1 1 1 1 1 1 1 1 1 1 1 1 1 1 1 1 1 1 1 
##$CPDPRG= <>
##$CPDPRG1= <>
##$CPDPRG2= <>
##$CPDPRG3= <>
##$CPDPRG4= <mlev>
##$CPDPRG5= <mlev>
##$CPDPRG6= <mlev>
##$CPDPRG7= <mlev>
##$CPDPRG8= <mlev>
##$CPDPRGB= <>
##$CPDPRGT= <>
##$D= (0..31)
0 1 0 0 0 0 0 0 0 0.06 0 0 0 0 0 0 0.0002 0 0 0 0 0 0 0 0 0 0 0 0 0 0 
0 
##$DATE= 1186570230
##$DBL= (0..7)
120 120 120 120 120 120 120 120 
##$DBP= (0..7)
150 150 150 150 150 150 150 150 
##$DBP07= 0
##$DBPNAM0= <>
##$DBPNAM1= <>
$$ [...]
##$SUBNAM7= <"">
##$SUBNAM8= <"">
##$SUBNAM9= <"">
##$SW= 20.6930455092707
##$SWIBOX= (0..15)
0 0 3 0 0 0 0 0 0 0 0 0 0 0 0 0 
##$SW_h= 5175.983436853
##$TD= 65536
##$TD0= 1
##$TE= 297.16
##$TE2= 300
##$TE3= 300
##$TEG= 300
##$TL= (0..7)
0 120 120 120 120 120 120 120 
##$TP= (0..7)
150 150 150 150 150 150 150 150 
##$TP07= 0
##$TPNAME0= <>
##$TPNAME1= <>
##$TPNAME2= <>
##$TPNAME3= <>
##$TPNAME4= <>
##$TPNAME5= <>
##$TPNAME6= <>
##$TPNAME7= <>
##$TPOAL= (0..7)
0.5 0.5 0.5 0.5 0.5 0.5 0.5 0.5 
##$TPOFFS= (0..7)
0 0 0 0 0 0 0 0 
##$TUNHIN= 0
##$TUNHOUT= 0
##$TUNXOUT= 0
##$USERA1= <user>
##$USERA2= <user>
##$USERA3= <user>
##$USERA4= <user>
##$USERA5= <user>
##$V9= 5
##$VALIST= <valist>
##$VCLIST= <CCCCCCCCCCCCCCC>
##$VD= 0
##$VDLIST= <DDDDDDDDDDDDDDD>
##$VPLIST= <PPPPPPPPPPPPPPP>
##$VTLIST= <TTTTTTTTTTTTTTT>
##$WBST= 1024
##$WBSW= 4
##$XGAIN= (0..3)
0 0 0 0 
##$XL= 0
##$YL= 0
##$YMAX_a= 577379
##$YMIN_a= -566200
##$ZGOPTNS= <>
##$ZL1= 120
##$ZL2= 120
##$ZL3= 120
##$ZL4= 120
##$ABSF1= 16.44519
##$ABSF2= -4.247982
##$ABSG= 5
##$ABSL= 3
##$ALPHA= 0
##$AQORDER= 0
##$ASSFAC= 0
##$ASSFACI= 0
##$ASSFACX= 0
##$ASSWID= 0
##$AUNMP= <proc_1d>
##$AZFE= 0.1
##$AZFW= 0.1
##$BCFW= 0
##$BC_mod= 0
##$BYTORDP= 0
##$COROFFS= 0
##$CY= 12.5
##$DATMOD= 1
##$DC= 0
##$DFILT= <>
##$DTYPP= 0
##$F1P= 14.0000005364418
##$F2P= -0.99999901652339
##$FCOR= 0.5
##$FTSIZE= 32768
##$FT_mod= 6
##$GAMMA= 0
##$GB= 0
##$INTBC= 1
##$INTSCL= 1
##$ISEN= 128
##$LB= 0.3
##$LEV0= 0
##$LPBIN= 0
##$MAXI= 10000
##$MC2= 0
##$MEAN= 0
##$ME_mod= 0
##$MI= 0
##$NCOEF= 0
##$NC_proc= -1
##$NLEV= 6
##$NOISF1= 0
##$NOISF2= 0
##$NSP= 0
##$NTH_PI= 0
##$NZP= 0
##$OFFSET= 16.44519
##$PC= 1
##$PHC0= -45.73207
##$PHC1= 5.539188
##$PH_mod= 1
##$PKNL= yes
##$PPARMOD= 0
##$PSCAL= 4
##$PSIGN= 0
##$REVERSE= no
##$SF= 250.130019211741
##$SI= 32768
##$SIGF1= 0
##$SIGF2= 0
##$SINO= 400
##$SIOLD= 32768
##$SREGLST= <1H.CDCl3>
##$SSB= 0
##$STSI= 32768
##$STSR= 0
##$SW_p= 5175.98343685301
##$SYMM= 0
##$S_DEV= 0
##$TDeff= 65536
##$TDoff= 0
##$TI= <Analysis number 999999
Compound Code 99
Book Reference 9
Project Code 9>
##$TILT= no
##$TM1= 0
##$TM2= 0
##$TOPLEV= 0
##$USERP1= <user>
##$USERP2= <user>
##$USERP3= <user>
##$USERP4= <user>
##$USERP5= <user>
##$WDW= 1
##$XDIM= 32768
##$YMAX_p= 379519772
##$YMIN_p= -150303
$$ End of Bruker specific parameters
$$ ---------------------------------
##NTUPLES= NMR SPECTRUM
##VAR_NAME=  FREQUENCY,     SPECTRUM/REAL,   SPECTRUM/IMAG
##SYMBOL=    X,             R,               I
##VAR_TYPE=  INDEPENDENT,   DEPENDENT,       DEPENDENT
##VAR_FORM=  AFFN,          ASDF,            ASDF
##VAR_DIM=   32768,         32768,           32768
##UNITS=     HZ,            ARBITRARY UNITS, ARBITRARY UNITS
##FACTOR=    0.157963299565203, 1,           1
##FIRST=     4113.43579811847, 0,            0
##LAST=      -1062.54763873454, 0,           0
##MIN=       -1062.54763873454, -150303,     0
##MAX=       4113.43579811847, 379519772,    0
$$ Real data points
##PAGE= N=1
##DATA TABLE= (X++(R..R)), XYDATA
$$ [...]
15741b048K517R73j046J138j771o05R12j654k172L380L278o03m46O85M335j972
15725D901n586k060k168K865J037K499J436m06l000j178R98M667R72l107m630
15710b760m193j56L883N420r68k172j68Q88K78k72N51Q60l325k011k11l823l60
15693h539N52J379P79o63K728N604j435N34O59k161L413p45j913l9J618k088k683
15676c000r20J646K00j288j726L835M328Q45R09l19j89l086n13p7q57J559J585
15659B932J025J553K62j694m510P63K782K644j35k360K507L054l332n843k115
15644b467J531L174j548j059K347K3r11k987l20K153n44j501L032K213k70k582
15628B84k364k020J311L145N14R40K229M88j333o27j24J135k645k359l29J365
$$ y = [-2048, 469, 1442, 396, 1534, -237, -842, 70, -1584, -3756, -376, 2902, 2299, 1853, 2538, 6873, 4901, -685, -2745, -4913, -2048, -1011, 1488, 2924, 2518, -482, -1660, -662, 4005, 4977, 1870, -2760, -6953, -7109, -3226, 2194, 1226, -946, -1114, -226, 52, -220, 331, 1191, -2134, -4145, -4356, -8179, -8539, -7987, -6608, -5829, -6492, -3764, 1840, 405, 939, 1598, -563, 2850, 2105, 192, 153, 1771, -317, -3000, -3920, -2274, -2074, -3362, -5088, -1253, 3075, 3920, 4829, 4510, 4321, 1235, 722, 645, -212, 1347, 2932, 3957, 5510, 5772, 4078, -432, 331, 3113, 5757, 5622, 3262, 5769, 8823, 5491, -352, -2467, -936, 2238, 690, -369, 1978, 2001, 1090, -1897, -2217, -64, -608, -2109, 923, 3136, 2866, 284, -2080, -4100, -2789, 356, 870, 1810, 4039, 4527, 3194, 2567, 2443, 3578, 933, -1426, -1755, -390]
15612c90J420l601k986P46M83k112K963J989j433K770J454j16J518L29P46k55
15596C525J977k622k097j332K206K190P35K568j741J207k296j184Q01l374K899
15581C462J466j599j465R38N05j093j109n50K004m23k7J200l181n37j003R18N61
15564F7q11k991r72J323M06K09l528m31K739J1J157k08n42N463K445l002j483
15547a48l71R16l1J877k892k482j556O27J252J631M163j982k15J038J012m02p07
15530A730P58j728o45J624K436K173N05r78k27m15q96J314r79n23P93j277m1l088
15512E36n59J216N08K021m14k808J587K029L839l8m973l456j427J302K568j76
15496A755j77M17j62K484p45N284m20n757j718q15k97P24k190j667m47k822K472
$$ y = [-390, 1030, -2571, -5557, -4811, -4328, -6440, -3477, -1488, -2921, -151, 1303, 1187, 2705, 3034, 3780, 3525, 5502, 2880, 783, -549, 1657, 3847, 4582, 7150, 5409, 6616, 4320, 3136, 3937, 563, 3462, 4928, 3329, 1864, 2802, 3307, 2214, 1105, 555, 2559, 2136, 2109, 3309, 128, -409, -1412, -494, 67, -744, -3735, -4707, -3384, -2978, -2769, -6297, -6728, -3989, -3978, -2821, -3029, -3571, 1892, 4337, 1335, -148, -519, 397, 366, 2243, -649, -3131, -4687, -4060, -2808, -1177, 2986, 1004, 789, 1827, 2839, 2437, 1730, 2488, 760, 115, 1739, 4175, 6348, 6853, 5875, 5648, 5233, 4337, 5651, 4672, 4149, 4942, 3665, 3624, 536, -23, 1193, 1701, 3722, 3308, 500, 2087, 4116, 7955, 7917, 2944, -512, -1939, -637, 1931, 1755, 1578, 1995, 1833, 4317, 3572, 8856, 8436, 2679, 961, 146, -151, 573, -1617, -3284, -3731, -6553, -4081]
15479d081J658j652o42o70P47J075J336K720k16R20j335o81K160K695j84m053
15463b03j556M609J248k554j082m51o8N79L323L07J74p21n605k785J983n32K250
15446a084J730J77K007J337M40k023j345m494q77L862L541L354k609l158k110
15431a252k975O20M300p57p32J463L979M8l349k639j716Q06J085k17Q96k918n66
15414c924L056J516k724Rk110j762O00L133J748L504r14p88m269R69K866l161
15398b251j358L536p18M47j371k7n1J208P90L84L8l004L82j029M659N037p8l249
15380C345m020o19J501K659N166j14M83j053j687q53m26k490n214k251J137k34
15364d670Q36Q93k20J613J471k121j833j276J882J955k893l151j126J487J194
$$ y = [-4081, -2423, -4075, -4717, -5387, -4640, -3565, -2229, 491, 275, 1195, -140, -821, 1339, 4034, 3850, -203, -1759, 2850, 4098, 1544, 462, 11, -57, 522, 3845, 4152, 4326, 3605, -2000, -4785, -2802, -3334, -1084, 646, 823, 2830, 4167, 4607, 2584, 1239, -3255, -4132, -270, 3271, 6625, 4016, 858, -1252, -4227, -3607, 693, -64, -796, 667, 4646, 4694, 1345, -1294, -3010, -2204, -1119, -1336, -440, -3358, -3924, -868, 648, -2076, -2067, -4177, -5939, -5339, -2206, -458, 3046, 2132, 1344, -2925, -1956, 910, -2251, -3609, -73, -791, -344, -1715, -1742, -1793, -585, 205, 589, 627, -2377, -1995, -3024, 1635, 6672, 6594, 3345, -675, -1294, 207, 2866, 8032, 7918, 8401, 7348, 5661, 4808, 4382, 1892, -3322, -5573, -4436, -4670, -3834, -2941, -3161, -1548, -77, -2198, -4031, -5307, -3425, -1470, -4363, -7514, -8640, -7153, -5959]
15349e959p23K914J389p47l755J85L934J2O69K493J562K518K214j677j977M92
15333C544j329k125j079j144N61K102J045K401Q57l316m99l640j679K745K647
15318A091J050k423J08J71K488J346j572j300Q69K670J153j775j889j23k179J116
15302H01j128o85j775Q46K429k524K42M83L03Q52R93K261L54r19k296j440L622
15285B419j189m049j30L488J368k114j499M298j412n064Q44O25M92K50p82j582
15269d037J2J582L325J63k086j539J050N88K165k497K196J032j251J631J656o79
15253C311J64r31n97Q77l188l752j976J691L445J766J551R34k312J15M010J808
15237F916j295l654j991k461k95J289K004M137L24k825k483L179Q89j58q85o30
$$ y = [-5959, -6682, -3768, -2379, -3126, -6881, -6696, -2762, -2750, -2081, 412, 1974, 4492, 6706, 5029, 3052, 3544, 2215, 90, -989, -2133, -1572, 530, 1575, 3976, 4833, 1517, 1018, -2622, -4301, -1556, 1091, 2141, -282, -174, -3, 2485, 3831, 2259, 959, 1828, 4498, 5651, 3876, 1987, 1864, -315, 801, -327, -1012, -2787, -1941, 488, -2036, -1794, -1311, -1008, -156, 837, 3098, 3452, 2533, 237, -1203, 2419, 1230, -2819, -2949, 539, 1907, -207, -1706, 2592, 1180, -3884, -3040, -2415, -1923, -1673, -2455, -4037, -4025, -2443, 882, 1045, -1041, -2580, -1530, -942, 1223, -1274, 922, 1954, 703, 2334, 3990, 3311, 3475, 2544, 1947, 2824, -364, -4116, -6092, -4401, -956, 810, 2361, 3295, 983, 1098, 5108, 6916, 5621, 1967, -24, -2485, -2780, -1491, 513, 4650, 4974, 2149, -334, 2845, 3734, 3576, 2691, 2061]
15221B061J076l033n66J263j700J131k028J375L887K033J23n099n47L086l436
15206c74k258L996M121q11j690J958j340K070K230m194j922O35j723j22k408j814
15190c646j363R8K887o46j530j327L18K195J139q62J213L202J565j554k598j225
15174b134R2k413L779J930O33l597l741K0K875L355J17j449L80j364k004l968
15158g489J000M140J739j09j507k941J264L626L766l90k323N76J740q52J053n65
15142B728j346L202K14o232P69Q96l035N3j820J099K958n39l58J209L603R60m392
15125c1p11Q74l49j246K081j35j10J914L85J923L09M06O42m178K11k136J66K209
15107B224J04N22k175J514L890j186k118Q17M01R48j607j634j1l696m20L960L331
$$ y = [2061, 3137, 104, -462, 801, -899, 232, -1796, -421, 3466, 5499, 5622, 523, -24, 3062, -374, -2632, 1364, 5485, 4674, 2984, 4942, 3602, 5672, 7902, 3708, 1786, 2421, 698, 576, -1832, -3646, -5009, -4911, -2024, -2670, -4200, -5527, -5209, -3014, -1875, -2737, -1524, 1678, 3243, 1689, -909, -2134, -2042, -4455, -676, 1254, 1887, -1710, -5451, -5431, -2556, 799, 916, -533, -153, -1517, -3521, -7489, -6489, -2349, -610, -719, -2226, -5167, -3903, -277, 3489, 3099, 776, 1352, 3092, 2240, 3293, 2728, 1382, 4584, 4798, -1434, -665, 231, -2804, -2751, -4571, -3472, -514, -1053, -1411, -202, 3401, 4361, -31, -742, 132, -217, -1463, 618, 483, 373, 2287, 2672, 4595, 4904, 5310, 5952, 1774, 1985, -151, 15, 2224, 2328, 2850, 675, 2189, 6079, 4893, 2775, 3592, 3993, 4941, 3334, 1700, 1689, -2007, -2427, 1533, 4864]
15090D864k354j071k491k268j971k992P075K233j170N80O85l236j933r19J927
15075c041j885j516L519M895k992P93N74P42r6j700j80J150o80j122j002K968
15059D27J047l096l221p32K402L477J993P47n74j673l772J562k51K347Q78k182
15043f21j717K853j247k043K023N878K137M82k557n148K92J276l489J213J230
15028E62j658M28R42J331J271j490M13n35L393J447l338l302l724k674j535M620
15012c849K898M066q02k910O70j428L505L37l897j725J662L472J562k892l346
14997b677R96K771l547r99K813J153P56j28n045l143j339j52L135N712m01m03
14981d98j092j920m77q27L947J591J162L388l224l500J30J247j61k277J730K44
$$ y = [4864, 2510, 1439, -1052, -3320, -5291, -8283, -1208, 1025, -145, 435, 1120, -2116, -4049, -4968, -3041, -4926, -6442, -2923, 1972, -1020, -227, 347, 1089, 993, -707, -887, 263, -417, -1539, -2541, 427, 1474, -1622, -4843, -5575, -3173, 304, 2297, 3044, 2470, 797, -2975, -1413, -1664, 683, 1561, -621, -2338, 515, -732, -2775, -752, 5126, 7263, 7745, 5188, 40, 332, 1608, -1881, -668, 562, -1096, -668, 274, 1605, 2876, 1386, 1799, 1264, 4657, 6104, 2766, -536, -4260, -6934, -8469, -3849, -951, 3115, 2313, -597, 73, -1355, 2150, 2487, -1410, -3135, -1473, 1999, 3561, 669, -2677, -1681, 1090, -2457, -3456, -643, 510, 1266, 1138, -3907, -7050, -8389, -8541, -5406, 306, -95, -498, -1590, -3510, -3987, -4814, -867, 724, 1886, 5274, 2050, -1450, -1320, -73, -234, -2511, -781, -537]
14965e37j495k502r56p48L230k942p51K343J921M977M04m059N04k876j29J605
14949b011L231K88k447k871Q60N040p99J31J519p25q15j224q41k0j901j059J166
14932b478o0N84K453K489J333j280N47q92p12r41m360k220M444J775j005j656
14916a979k476K156K648o42m45J0L457O40j546M664Q94m795j947k396J996q0k11
14899e2j201N75l06J770J28Q07j234k041k515L20K379k666l734J126L90K751K872
14882f31K76r05L578K295k793R81j035m728J639K439k051k874r96N71R96R27l57
14865b668p55K206K187K183M34NM2j075j652m016k02j562K021P82k958k158k013
14848i199K425K952L541q93l172K012L98j565j584J264J532N46j262j000K962
$$ y = [-537, -2032, -4534, -5490, -6238, -3008, -5950, -6701, -4358, -2437, 2540, 2944, -1115, -611, -3487, -3616, -2011, 1220, 1508, -939, -3810, -2950, 2090, 1291, 1422, 2941, 2216, 1401, 177, -664, -684, -2585, -3644, -2478, -2538, -1954, 499, 2988, 4321, 3041, 3588, 2696, 1984, 1043, -3317, -5537, -1093, 682, -323, -1979, -4455, -2299, 349, -293, -738, -728, 2729, 3369, 1823, 6487, 7381, 2586, 639, -1757, 239, 159, -52, -1253, -678, -984, 786, 914, 1721, 487, -1554, -4069, -3749, -1370, -4036, -7770, -6644, -6254, -3503, -631, -355, -1260, 2318, 4613, 1820, 2801, 1766, -2962, -1323, 1116, -935, -3809, -4805, -4234, -3238, -2311, -2668, -3423, -1217, 970, 3153, 3587, 3592, 3634, 2559, 907, -3109, -3311, -4873, -2852, -2070, -5028, -7186, -9199, -6774, -3822, -281, -1174, -4346, -2334, -1936, -3501, -5085, -3821, -2289, -1743, -3005, -4005, -1043]
14833a043K854r71l286j757O25K047L094N6o80r16K39O13k379k01r55j177K39
14816c598M35J510jO34k387k717l23J789J660K851J060J381k691j995k137J715
14800b814J21r14P01k664J024L160n91Q44O59J741n97m90n731J473q00j96P75
14783d299J828j123j09K93l754l20k757J663J804K425K891L56j980r13Q59j371
14767d507N22J308J853K680j153l11j67j554L59r90O44m92j765r8r9L297K037
14750A564R97k173K232J835l937Q5j725P1n40k597N822j06k804l581p59L429N37
14733a650k435n26J034K656O5l023j87L353j716j31m180K67K718l73K612J382
14717a34J192j217j34j988j039J598l80j873j277K410L133L371k860m786O0q97
$$ y = [-1043, 1811, 840, -2446, -4203, -3578, -1531, 1563, 1619, 939, 23, 262, 875, -1504, -1705, -2660, -3837, -3598, -3163, -1653, -1654, -1020, -3407, -6124, -6447, -4658, -2998, -147, 913, 2294, -397, -2392, -4529, -2814, -2693, -3607, -2906, -5570, -4546, -1386, -1977, -1133, -474, 1267, 670, 180, -5551, -4078, -4878, -5074, -4299, -2471, -3594, -3703, -3410, -7164, -7484, -10241, -8578, -6774, -4349, -1458, -1102, -3082, -3995, -3136, -4507, -3985, -2677, -824, 1856, 703, 392, 225, -1329, -970, -1960, -1316, -1808, -3573, -3671, -3770, -473, 1564, 2561, 388, 2620, 4455, 518, 603, -1122, -1051, -1591, -4188, 1634, 1528, -1276, -4857, -5616, -2187, -1650, -4085, -4611, -3577, -921, -856, -3879, -4066, -713, -2429, -2560, -6740, -6473, -3755, -4128, -1516, -134, 1058, -159, -293, -2281, -3320, -1722, -2102, -3975, -5252, -2842, 291, 3662, 802, -3984, -3924, -4821]
14701d821J738L143l414l943P21L927L36L014J921K519k996p565K193L59j127
14686c995j735K26K385J85j48J355O65M57N79K434j689J270o76p34J236Q44J619
14669D278j046k092k098p17k54J003K463K405n003m715J527L226j44n22m72k949
14653e110j707K953L758n05j044O34o22J593P42j836j413m30O64L876J319j452
14637A420K01l486P28J960k631L04j270M86K080J363j682j220n83l89K23q37j343
14620d676K01J441J882J92l457M42L985K29K7K05l838j772j48J128K38K3j40P46
14602c292R01k564m50J224L814J700k67j544k531J777L890o05k918k784n62J087
14586c124K703P23J239o38j462j096l897k171K008J592l32Q97R1k813k704K424
$$ y = [-4821, -3083, 60, -3354, -7297, -6576, -2649, -2313, 701, 2622, 5141, 2145, -5420, -3227, -2868, -3995, -5730, -5504, -3119, -2934, -3082, -1727, -1062, -605, -26, 2408, 719, 1989, 1313, 579, 1815, 2659, 4278, 3232, 1140, -958, -1675, -1929, -926, 1537, 3942, -1061, -5776, -4249, -1023, -1167, -1689, -2161, -5110, -6817, -3864, -106, -611, -1655, -1021, -1643, -50, 692, -1144, -2557, -2987, -2323, 1553, 2872, 1420, 1621, -1865, -1137, 823, -1808, -1504, -2774, -2288, -208, 1155, -527, -1747, -2330, -2719, -2496, -3333, -4676, -4475, -3034, -1152, -960, -4417, -3975, 10, 239, 266, 471, -3367, -5139, -5287, -4159, -3921, -3898, -4038, -3292, -2391, -4955, -5405, -4181, -367, 1333, 1066, -478, -3009, -1232, 2658, 2053, -865, -3649, -4211, -3124, -421, 302, 1541, 903, -559, -1655, -5552, -7723, -5715, -4123, -4455, -3558, -3467, -6280, -8984, -6560]
14570f560J868l128n02L365P743L173k364m02K136l09k599r62l897q09n01j662
14554e410k462K548M639n30k435K038K820p48L73J936k651j164kq14M30O62K488
14537A718l763j373l781k548K041L125L194n65j766l621R75M060k0O9k588o24
14521e467O44M19L649J288J739o12k397L95j031j752j669N26m94N43O445K485
14505D711L12n728k655j179J424K527K682M056l966m413k53L93J45j480k894m0
14489f358K929J462l41l862K201n25K085K390K683j586k003o29k87l841K51J740
14473c691J007J671K27J701J977K671j344j269n04q62P95m157p98J085k02K016
14457C23J150m736j430j433L62j459j60J375J394K563m11P84M14j680k973J383
$$ y = [-6560, -4692, -7820, -8322, -4957, 2786, 5959, 3595, 3193, 5329, 5020, 2421, 1459, -2438, -3247, -3748, -5410, -7872, -5324, -685, -1215, -3650, -1612, 1208, 460, 833, 2769, 118, -1046, -1048, -1862, -1432, -770, 1718, -2045, -3418, -7199, -9747, -7706, -4581, -1387, -1952, -3718, -7339, -6364, -2304, -2324, -2255, -4843, -5467, -4823, -4404, -755, 533, 2272, 1660, -737, -342, -1373, -3125, -4794, -4268, -4762, -4219, 2226, 4711, 5023, -705, -3360, -4539, -3115, -588, 2094, 6150, 2184, -2229, -2482, -2089, -1944, -3424, -6318, -6358, -3429, -1967, -2308, -6170, -3969, -4494, -2409, -19, 2664, 1078, -925, -1554, -1841, -5682, -5431, -3691, -2684, -1013, -786, 915, 2892, 5563, 4219, 2950, 2446, 1584, 2379, -1778, -2576, -1491, -1693, 323, 1473, -3263, -4693, -6126, -5764, -7223, -7383, -6008, -4614, -2051, -2462, -1678, -1264, -2944, -5917, -4534]
14441d534J509m050k018j313N985L559J65k736J966M78l111k381p98P23q34r14
14425h304K192N264L032Q21l084j796J060M012m68q52N91J213j62M32m454l474
14409c977R70M460l6j785j323J32j323K708j94k508k672J43Q4K0O65K525K087
14392b4N79K083o90J95k105Q05J711j556J077K423J34k809m24M96N51L318J32
14375E896o436m167j53K724J383J775o33M71n43k352JJ459j121L807J848l941
14359A8l849l03J827K417J592J688n76r4l308j765R18L674j37p22Q35J306l125
14342C96J603k340j567J47r18l255j967J203J880P92J771K881p14k890O42j94
14326b530k538L366R65O06l067j75m23Q63J334k383M74L452r84L0L204K895K834
$$ y = [-4534, -3025, -7075, -9093, -10406, -4421, -862, -697, -3433, -1467, -989, -4100, -6481, -7279, -6556, -7390, -8304, -6112, -848, 2184, 3005, -79, -1875, -815, 3197, 2729, 1877, 2468, 3681, 3519, 3951, -503, -3977, -3007, 1453, 1417, -368, -1691, -1559, -2882, -174, -368, -2876, -5548, -5405, -5321, -5301, -4636, -2111, -24, 555, 2638, 1948, 2143, 38, 843, 2554, 998, 2075, 4498, 4632, 1823, 1399, 1895, 2446, 5764, 5896, -540, -4707, -4860, -2136, -753, 1022, 389, 860, 317, -2035, -2034, -575, -1696, 2111, 3959, 18, -3831, -4134, -2307, 110, 1702, 3390, 2814, 2720, -588, -2353, -1435, 2239, 2102, 1380, 2215, 3521, 396, 1999, -341, -1908, -1761, -2679, -5934, -7901, -6698, -4818, -4026, -2255, 626, -88, -2978, -2336, -2530, -5068, -1702, -737, -131, -3198, -3373, -3796, -2933, -1599, -3982, -3508, -56, -1040, -1010, 2194, 5089, 7923]
14309G923j44l288k217k012l788j888J228j042K18M490j18p06J290J946K62n39
14293A615J90j03K806j55k56k525k603l289j979K693L295J2l329j227o17K625
14277b847P0L11m27K428k072j216J174J043M08m79l245%K076K886L124k725k544
14260b035K071J822o8o88j292n124n44N794Q41k38j630k430J549Q5j539P83K229
14243d14k900J945N832n66o77k36J179l823m361m341K841N124n26l842M0K519
14227b206j887j50K671L488j361n58J099j865j779J294K874M94k692o37j433l643
14211f291J500N174J536r10n049k043K508J580P15K141L55k879n92L502K286K94
14195C827m238L07J003j887K081R78K0p20l001j904p84j039j414N77P06K388M259
$$ y = [7923, 7779, 4491, 2274, 262, -3526, -5414, -4186, -5228, -5010, -520, -638, -1344, -54, 1892, 2154, 1615, 1805, 1702, 4508, 4353, 4097, 1572, -1031, -4320, -6299, -3606, -311, -299, -3628, -4855, -5472, -2847, -2777, -2466, -2893, -465, -2537, -3753, -2579, -1536, -1128, -1607, -4852, -4852, -2776, 110, 3234, 509, -2035, 36, 1858, 1790, 1102, -190, -5314, -5858, -64, 777, 539, -1091, -3521, -1972, -1887, -3426, -2643, -414, -3314, -1369, 4463, 3897, 3220, 2984, 4163, 340, -4021, -8362, -5521, -397, -923, -4765, -4725, -2206, -4093, -4243, -1572, 1916, 555, -3, 1096, -769, -2548, -1254, 1620, 2114, -578, -1215, -2648, -6291, -4791, 383, 1919, 1009, -4040, -6083, -3575, -1995, -1280, 861, 1216, -1663, -2255, 1247, 3533, 3827, -411, -104, 899, -988, 1093, 2071, 2091, 1371, -1630, -3534, -4318, -5357, -6771, -6194, -5488, -3100, 1159]
14178A159P34o07o75r9L043N78M19l633k63K868j149k045j377j884p72o44L142
14161a205L087j295o250J570j490J2K71J781j091k189N5P39J228n11j326n96j779
14144h989L775N272M01J435k561n585K086M315L226J546r56j717k527K53j545
14129a571o84J286j330k60J816k55K633L810r46k938r83K914J918J302k173l59
14113D180k427j329J90r41o66J94L4j135K383J049k309m74o75k92o29l33j336
14096d516o08p06K301L633J687k454j334J81R69J760j99L0N13l44J329J659q78
14079C023m43J89J285L13j046j133q80M076k958j898j537k034j329q42K153J847
14063a214J653J161k596j237J774L434N966j416l887k731j217N20J510j088N70
$$ y = [1159, 1893, 1286, 611, 512, 3555, 4133, 4552, 919, 656, 3524, 2375, 330, -1047, -2931, -3703, -4347, -1205, 1882, 587, -5663, -4093, -5583, -5571, -5300, -3519, -4610, -6799, -6744, -6005, -4777, -5288, -6614, -7210, -8989, -5214, 58, 459, 1894, -667, -6252, -4166, 149, 3375, 4921, 3965, 2248, -279, -26, -1571, -2255, -969, -2299, -2559, -743, -998, 1635, 5445, 4499, 1561, 578, 3492, 5410, 6712, 4539, 4180, 1753, 424, 614, -327, -993, -799, -765, -1900, 483, 1532, -777, -1251, -1926, -2218, -2847, -3180, -4516, -5124, -5830, -3529, 104, 1791, -663, -1997, -1816, -847, 913, 714, 744, 1257, 913, 2242, 3901, 3023, 2580, 2769, 4054, 4367, 3321, 2188, 1308, 5384, 2426, 528, -1009, -3043, -4372, -5214, -3061, -1214, 439, 1600, -996, -2233, -459, 2975, 8941, 7525, 3638, 907, -310, 210, 1720, 632, 1202]
14048A202M532n30p7M336J555l203N09k378k121O20N79n498l669J12J378J66j94
14031b681j691K780o88J117N30L104J184j598%j606Q85J879l54r42k272p80J591
14014D58K434j631J624j349L08K776j148l096J844l28n619j551m33J344j717n328
13998a1412K993J166L73L229J805l026J732L301p11j760j73J028jq6L310K86l10
13981A744O99j162Q45R36j735k704l737K03Q39J602M42k055k717r95m97m49L905
13964d836M165K046j730l327j01P62K843J857N00l776j213J486j970J200K519
13949D25k476m648r99r52M1K845K638J23M320O122N96j315k982n05l448o24J807
13932I68k381K378m88o32q17j749O16J252j22K28K262R00M09J430M25k211k403
$$ y = [1202, 5734, 5204, 5127, 9463, 11018, 7815, 8324, 5946, 3825, 4445, 5024, -474, -4143, -4031, -2653, -2487, -2681, -4372, -1592, -2280, -1163, -633, 2471, 3655, 2057, 2057, 451, 1336, 3215, 2861, 1919, -353, -1133, 458, 2892, 1261, 2885, 1536, 1844, 4620, 3472, 376, 2220, 1892, -3727, -5278, -5711, -4367, -6084, -11412, -8419, -7253, -6880, -3651, -1846, -4872, -3140, 161, -550, -2310, -2483, -1455, -1456, -1542, 1768, 2054, 1744, 2443, 1281, 2126, 3062, 1327, -1377, -5114, -4911, -4072, -2470, -2028, -4083, -6800, -7795, -8292, -8741, -4836, -671, 1375, -355, -3682, -3783, -3021, -178, 1679, 2179, -1597, -2810, -1324, -3294, -2094, 425, -2051, -6699, -7698, -8650, -8609, -5764, -3126, -3003, 1317, 7439, 8035, 6720, 3738, 3233, -215, -839, 968, -1413, 965, 477, -155, -972, -2721, -2105, -853, -975, -747, 1515, 2415, 2824, 4254, 4679, 2468, 65]
13915F5k087k534K231O87k717j73J7r56J04J848J656K114k555j899J499P77J746
13898a77j272j799J331j681R25L747l88m381j859o4m40N06m21j011J502Q19N4
13881d609n03J107L803R08k179J96k67p036r50N11L228K117L369L703P80k507
13865A671q91J485n18k786pJ489L25l255k567K921N070J493J04j730k537l142
13849b875l448Q25K016K553L26N123o49P83l95m125q79R76J842J558l168k541
13833b078M069L441J22m782m846j955p26K602J607K205r73j546n54K99J343K876
13817A104q09l24O53K77j580m99L91K671l216n604k72K411P46m57q04n26J69L276
13799b393N56j646J326J800k665Q88N08k104j964j191J749j767o37o5o60M66J819
$$ y = [65, -2022, -4556, -2325, -1638, -4355, -4528, -4511, -5467, -5363, -3515, -1859, 255, -2300, -4199, -2700, -1923, -177, -1449, -3248, -1917, -3598, -2673, 1074, 686, -3695, -5554, -5618, -6058, -5552, -5973, -6984, -5482, -4663, -4609, -5112, -4005, -202, 706, -1473, -1277, -1544, -8580, -9530, -9019, -5791, -3674, -305, 3398, 4178, 1671, 780, 2265, 1747, -1039, -1046, 443, 768, -2487, -5054, -2133, 2937, 4430, 4534, 2804, 267, -2875, -6323, -5498, -3482, -929, -603, 4520, 3871, 4654, 4259, 134, -745, 231, 2073, 3631, 463, -2078, 1991, 5432, 5554, 772, -4074, -6029, -6755, -4153, -2546, -341, -1314, -2860, -3414, -3115, -1772, 1104, 295, -29, 624, 901, -679, -1178, -787, 1884, -1332, -6936, -7208, -4797, -4051, -4508, -5312, -5838, -5669, -2393, -1837, -3483, -2157, -357, -3022, -2134, -1626, -3730, -5694, -6885, -5136, -6903, -7540, -7605, -8265, -7799, -5980]
13782e980N505J331k059N41k477j947L335J987k232J052M993O6r77k396j691M609
13766C660o97m232j376J35q08L63J121K335L246k98k509p09j081q89K491R90P80
13749B522j454k224n66q01J025K198p00j970k151k267P64J2K82j999l67J41l771
13732a1326K626K420J774K340k67J249K096P36j694M5k312j678M23R42K09k973
13716e390J571M531L60J840k946j689l033M87K454L952O4l607K179l24n562m406
13700i519J688L748P45j492K99q59j072N467P25N17p3l398j596J246r31j933k56
13683f694M006K534O34k011j418QR25j349j181M462L709l393j729j60j437K190
13667i04L480l325j667k690J086j053l86q69J141J979M656J48j319m25o77J64
$$ y = [-5980, -475, 856, -1203, -662, -3139, -5086, -1751, 236, -1996, -944, 4049, 4115, 3138, 742, -949, 3660, 2963, -1269, -2645, -2510, -3318, -2955, -1834, 501, 3747, 3449, 940, 231, -850, -1739, 752, 1742, 2522, 1068, -1156, -1722, -2523, -1498, 700, 0, -1970, -4121, -6388, -5624, -5612, -5330, -7329, -7696, -7555, -11326, -8700, -6280, -4506, -2166, -2433, -1184, 912, 1648, -46, -1, -2313, -3991, -3568, -2626, -2417, -5390, -3819, 712, 1072, 2912, -34, -1723, -4756, -4269, -1815, 2137, 2201, -1406, 773, 449, -5113, -9519, -7831, -4083, -3338, -4830, -4531, -5390, -6462, -995, -270, 247, 174, -3224, -4820, -3574, -4505, -6438, -6694, -2688, -154, 480, -1531, -2949, -2941, -2016, -3365, -4546, -84, 3625, 232, -1497, -1657, -3094, -904, 2576, -749, -2416, -5106, -4020, -5073, -5459, -6328, -5187, -3208, 1448, 1596, 277, -148, -825, -661]
13651f61K75K52p25K338J197l098j280l100J120J822j885r26J773R22M15R7k98
13634a762q1K733k189m986j294K76Q86M750J177j505k084j169J757j437N08Q55
13618c565K357J664m05L54J96r98K979K71m883l916k153J048K333K645L116o10
13602D33j717j684J280J287k088l270j866j017J597M848J427j925L52J299L632
13587B588O37K205j472l073n924r46J630J430J687j284J426L746r25j966K588
13572B347J047m905L41p1m57q64j384q53L575j252p21L062j841k694r64J70O59
13555d805O51J711k349L49J983O15q86J335J759k462p50K814J883K31j902o324
13539f147p64n04k367j99Q34K192K463P43L84j097l955r12K450J387J783M41q71
$$ y = [-661, -386, -134, -859, 1479, 2676, -422, -1702, -4802, -3682, -1860, -3745, -4671, -2898, -1976, -1561, -1464, -1762, -1843, 890, -1299, -6285, -7579, -7303, -6417, -1667, -490, -1995, -4079, -5248, -3491, -4928, -4420, -3565, -1208, 456, 51, 405, 601, -397, 2582, 2853, -2030, -5946, -8099, -7051, -4718, -2073, 1043, 433, -1284, -2968, -1688, -401, -2489, -5759, -7625, -8642, -7045, -2197, -770, -2695, -2343, -1044, 2588, 3225, 5430, 3958, 885, -5039, -5985, -4355, -2925, -1238, -2522, -1096, 2650, 1725, -241, 2347, 3394, -1511, -1170, -1241, -1698, -2562, -3946, -4799, -1224, -2476, -3197, -135, -1976, -4670, -5634, -5464, -4805, -4154, -2443, -4792, -4443, -2460, -1845, -2731, -1396, 363, -2099, -2849, -35, 1848, 2079, 177, -6147, -6911, -7415, -9782, -9981, -9147, -6955, -4492, -3749, -3365, -4462, -8417, -9329, -6879, -5492, -3709, -3268, -4139]
13522d139K489J545k175P1M98L031Q0k348k005k996n52L673J102J942o46p55j665
13505b850Q48p27j3o73K938L178m74l811Q55k542k526j954J333l31j786n99J026
13488h108K212L387L434J869m36j07l899k958K60J922L771K512j993j962K242
13473B146J765k692j044P01m75KJ420J136j008o78L140o930j639J044q14N29K26
13456c171K640k86K079j69k333k78r97j173M755K371j105J31M06L543k252m835
13440f74m975J74K895n03K174J463j91l36M771L031L532J404n639n949q93r92
13424g08o18J191P29L267k928n303k499J838J502o0m054L73j178J309N67K112
13408d460O0J180j13J90M099j709k578k758K358N88r82l533m68J180J118K932
$$ y = [-4139, -1650, -105, -2280, -2209, -1711, 1320, 1400, -948, -2953, -5949, -6501, -2828, -1726, 216, -430, -1185, -2850, -2002, -2729, -2742, -3415, -477, 2701, 2227, -1584, -729, -3271, -5797, -7751, -6418, -6749, -8535, -9134, -8108, -5896, -2509, 925, 2794, 2358, 2251, -1648, -4606, -4346, -2424, 1347, 3859, 1866, -96, 2146, 3911, 1219, 175, 876, 401, 403, 1823, 2959, 1951, 1273, 4413, -2517, -4156, -3112, -3926, -3397, -3171, -531, -817, 1262, 1093, -1240, -1518, -2515, -3688, 1067, 3438, 2333, 2464, 2870, 6413, 4161, -674, -5649, -5475, -2580, -3083, -909, 554, 363, 27, 4798, 7829, 11361, 12765, 7126, 1177, 284, -708, -1326, -135, 594, 3861, 933, -4370, -6869, -5031, -3529, -3589, -7643, -7270, -8448, -7139, -6572, -4460, -4400, -3220, -3333, -3143, 956, -753, -3331, -6089, -3731, -3143, -4125, -7658, -8126, -6946, -5828, -2896]
13392b896k823j210K282j105j0M93K96K306K990J89m599M66K462o56m27j042J055
13375b229k618r75K293J192q52J025J881j04l320l009K004r55j197k865Q80M037
13359d812J549p88J07M71J091J782o032m496K147J665L031R59j134J649k25l20
13343c356K44o86L9O59N44l341j314j26K253r9P61J107O9J204j354J334N500M04
13325C842j036J924j7k804K508m4o19j208l30m312j212n43J882K654J062j773
13309b6k988J24N34k26j198L400L68J747R63j679J102k987k667L99K978M082o02
13292C324k878p60j133j543j765P66L373L04m270j16K196M14J00k028k606L36
13276f286J311l506k756K225L992L73K514M104K18k134J38J627Q38J32l509n35
$$ y = [-2896, -5719, -6929, -4647, -5752, -5762, -5269, -4973, -2667, 323, 512, -4087, -3621, -1159, -1815, -2242, -3284, -2229, -4847, -5822, -3529, -2337, -3189, -2164, -283, -387, -3707, -6716, -4712, -5667, -6864, -9729, -8849, -4812, -3263, -4051, -3944, -3473, -2382, -600, -6632, -11128, -8981, -7316, -4285, -3326, -4460, -2811, -3036, -3356, -3112, -3798, -3759, -3100, -2556, -5897, -7211, -7337, -5084, -5183, -4422, -3315, -3246, -2042, -3396, -2062, 3438, 3842, 2806, 4730, 4713, 1909, 4417, 4373, 3754, 2546, 2216, -2096, -3308, -3851, -1969, 685, 1747, -26, -3014, -2890, -2356, -2582, -3780, -380, -12, 1735, 2698, 1019, 2121, -866, -3533, -3134, -156, 3926, 3324, 446, -314, -1447, -2990, -4755, -3989, -616, -312, -4582, -4698, -2502, -2088, -1988, -4016, -6622, -6286, -4975, -8481, -11237, -9012, -5020, -4647, -2133, 1971, 2189, 55, 193, 1820, 2658, 2790, -719, -1254]
13260a254l480K61Q87M040j527k319j566j48pj243m018j1M589K099j248J382K372
13243a191Lm44r75k014k435n45J737J878j214Q49M390K37k151l483J071J352l127
13226f062j208L948J781K506k061j231Q35j096q13j73k610j887p12k89j224n31
13210a0827M206K529L423L000p11J795q76n541k68j278o01K150L928j258K37k7
13194a19J073j442j083K131k51M1O84k49q93l858k230J173N77J649K397m81k202
13177c083n19l305j39j547K387M090j661J842L637j97J954L867J508j486l526
13162C822l092j348k586P99K310k10l550k871L24M492K240o21J967l823n788m30
13146h365M223L27k35j592j727N99o03J093N31K871J81k279P37L227K803q52m458
$$ y = [-1254, -4734, -4473, -3586, 454, -1073, -3392, -4958, -5106, -5113, -6356, -10374, -10385, -5796, -3697, -4945, -3563, -1191, -1188, -1632, -2607, -4621, -7056, -7601, -5864, -3986, -5200, -4351, 39, 276, -1875, -5358, -4287, -2935, -6062, -7270, -3322, -1541, 965, -1096, -2327, -1492, -2588, -3401, -3574, -6184, -8071, -8783, -9072, -10296, -10827, -6621, -4092, -669, 2331, 1620, 3415, 2539, -3002, -3270, -4548, -5149, -2999, 929, -329, -92, -119, 954, -488, -1571, 560, 309, 350, 1034, 785, -108, -3966, -6196, -5023, -4446, -2797, -400, -881, -3083, -3602, -6907, -7046, -8593, -6206, -2116, -3777, -1935, 1702, 1505, 3459, 7326, 8834, 7348, 3822, 730, -618, -3204, -2405, -95, -305, -3855, -6726, -6402, -1910, 330, -291, 1676, -2147, -7935, -8365, -4142, -3815, -4050, -5642, -7369, -6770, -7373, -6280, -5749, -2878, -2697, -4976, -4239, -1012, 1791, 939, -3519]
13129c519l10j117j621l87M96Q4K7k080K718m35L41O29J426K351K675j638j609
13112a969J001k628k963M22R50n02M63K698j339k270J675lJ695j79r62N22j090
13095d479K149J018q39p1k162o36j560K952k91J655k7p18k881j058K083M053j198
13078b010j225O22j933L068K626M21O00J33K131K2k499j74n67n024L431R46o179
13061e611o361m38Q27K334J033n91J448j678o26m96j395j252k420j0N984O115
13045c137K833k067l5r44M50j683j370O33R26J637N86j010J58K498l9j2Q1q30
13027a325j742j713j592J994j246L17K266J502J072k261k314o03J685K803m5l278
13011d480J93M04l13J456r93j720L89J279J054J13J102l02l124l431m64L727J757
$$ y = [-3519, -3829, -4946, -6567, -6954, -6458, -6374, -6347, -8427, -5709, -6144, -5803, -5174, -3748, -1397, 1278, -360, -1969, -968, -3596, -6559, -6137, -5187, -5689, -5226, -2528, -3867, -6137, -4462, -4465, -2770, -2949, -3911, -3389, -4479, -2330, -1312, -2151, -2222, -4384, -5020, -6580, -3628, -3919, -2264, -2291, -3009, -5890, -6948, -4865, -812, -2010, -3235, -2613, -4546, -1478, 1148, 1569, 2169, 2302, 4433, 4455, 1956, 1782, 1215, -3809, -378, 568, -5611, -11972, -12410, -11583, -9249, -8216, -8807, -7359, -9037, -9663, -10159, -11554, -12806, -15226, -15236, -9252, -3137, -304, -2371, -2406, -3350, -2900, -4583, -5953, -5320, -4394, -2757, -2171, -3181, -3023, -525, -564, -576, -495, -1325, -3067, -4780, -6372, -4378, -5624, -5307, -3041, -1539, -467, -2728, -5042, -5645, -3960, -1157, -1202, -4480, -4287, -3883, -4196, -2740, -3733, -5453, -5064, -3785, -2731, -2618, -1516, -1818, -4942, -8373, -8837, -5110, -3353]
12994c353k412k203k471L783L776j69k076k15K116J846L049Q14n129k212j470
12979f326L53J461j443j97N83M314K45l20K073J037l316j874k059N90L751k79
12963a407k084m919k280J237J392k189l581J344K820L878K605j392L722K970l264
12948a148L26L296L06q05k868l129k060K640q12J579K97l684M38L984j542J440
12932a742L96k583k541k612L86L49J492J404K505L492j063j343O49J248l520o013
12916i496j2L471j13k604j00O796r42J219N22J785j769q24K73j309K004L77M75
12899b47k488l289j199n76K864J062Q85r3j417R76M45j538r44M46M743J614J271
12882B515l0j874L65k381l459J631J479J261l99L44m675m08L905J224M06K287
$$ y = [-3353, -5765, -7968, -10439, -6656, -2880, -3049, -5125, -5340, -3224, -1378, 1671, 2485, -2644, -4856, -6326, -5973, -4512, -5955, -6152, -5569, -1255, -1010, -1330, 743, 1780, -1536, -3410, -5469, -4879, -1128, -1407, -3491, -8410, -10690, -9453, -8061, -10250, -13831, -12487, -9667, -5789, -3184, -4576, -854, 2116, -1148, -822, 2474, 2780, 1975, -893, -4022, -6082, -3442, -4254, -2675, -2378, -6062, -5624, -1640, -3182, -1742, -1346, -3929, -6470, -9082, -8696, -8347, -6855, -5451, -2946, 546, -517, -1860, -1211, 37, -3483, -9496, -9508, -6037, -6150, -8754, -8854, -2058, -3000, -1781, -1259, 526, -1243, -2067, -1794, -3103, -1099, -722, -247, -2735, -6024, -7223, -7799, -4935, -3873, -2988, -3081, -4498, -3522, -3077, -4615, -5559, -5113, -370, 1244, 2515, 2485, 611, 976, -1405, -4864, -3233, -1754, -493, -892, -548, -5223, -5631, -1726, -502, -96, 2191]
12866B191k63m300k090k038k94Q57j742j720L389K948p56j575K188K792J04k074
12850b383j971m45n59J730J143J57M52J908j86j11o52J096M956O06j274p10l311
12833D46k441K78j055M74J89K708k799M04L281L98k281j021m91k196P75M2k920
12816f209j677J815J296n82J248J132J807n74J275K142j377l73J99o5O22K67J175
12799B121J423M186p4l54r28k049j591k34j043K045K177l351j854j088K834k404
12783a84j846M865j346j331L306O33j627n386J502K591J913K650O40k410k916
12768A054j08r0N171L28J077j404j110m84k565ll042l483r04m572J169N316M51
12751c199l094q5K41J985K197k682L111J210n281J275K147M39J761J589k551j325
$$ y = [2191, 1928, -2372, -4462, -6500, -6794, -5937, -7679, -9399, -6010, -3062, -3818, -5393, -3205, -413, -309, -2383, -4354, -4799, -5358, -3628, -2485, -2328, -1876, 32, -154, -265, -917, 179, 5135, 5741, 4467, 3757, 446, -1995, -1717, -2772, -2298, -2109, 599, -2200, -1796, 1485, 1883, -398, -1419, -1910, -4106, -3331, -3289, -6209, -7886, -6071, -4775, -5357, -4109, -2977, -1170, -1744, -469, 1673, 296, -77, 122, 57, 679, 946, 2121, 3544, 7730, 7656, 7302, 6374, 4325, 2734, 2500, 1457, 3502, 5679, 2328, 474, -614, 2220, -184, -2030, 2835, 1489, 158, 3464, 4097, 2470, -2916, -1414, 1177, 3090, 5740, 6380, 3970, 1054, 946, 856, 6027, 6355, 7432, 6028, 4918, 4434, 1869, 1866, -1176, -4659, -5563, -10135, -8966, -3650, -3199, -6293, -6378, -6137, -4152, -1955, -4637, -1526, -316, -5597, -4322, -2175, -1736, 25, 1614, -937, -2262]
12735b262l047j753j626L441R55O42J959N3k627P60m03J76L144j302K427M398
12719D935k420j038n70l735j368K84j796j522Q25jK85O99P98k403J538q23N01
12702e811J518j352p1L4k198P35p59L671R81j539j3K691J143J885n457k253M126
12685b669M326k91j227J182l995l675k91J471p34k43j072J202J041Q18L785n34
12669i06n63J002k273j285K56K77J149k662j427l83N60L46O3p4k849J227L507
12652d035M521n164M45o13j551K272J838q63k57j025M338K464k528r22l572J722
12636b930M089L195K41J339J58m905j880J18N45J547l417K758J210k421R59M147
12620D753K884J350j972m785m857m66K258N29k114j680J975R42k12J305m74l375
$$ y = [-2262, -5309, -7062, -8688, -5247, -4292, -3650, -1691, -1638, -4265, -3505, -3908, -3732, -588, -1890, 537, 4935, 2515, 1477, 907, -2828, -4196, -3912, -5708, -7230, -6405, -6406, -6121, -5422, -4624, -7027, -5489, -6312, -5811, -4293, -5645, -5716, -5682, -7880, -7145, -7904, -4233, -3252, -4791, -4804, -2113, -970, 915, -4542, -6795, -2669, 1657, 1366, 139, 1321, -2674, -6349, -6640, -5169, -5903, -6146, -7218, -6016, -4975, -4157, -372, -906, -1469, -467, -2740, -4025, -3769, -3492, -2343, -5005, -6432, -6815, -6255, -5909, -5846, -5920, -8769, -7542, -4035, 486, -4678, -4233, -4846, -6397, -4125, -2287, -3150, -3407, -4432, -94, 2370, -158, -1080, -4652, -2930, 1159, 4354, 4595, 5934, 6092, 1187, -693, -575, -30, 1517, -1900, 858, 2068, -353, 606, 4753, 7637, 8987, 7015, 2230, -2627, -3093, -835, -306, -2420, -4100, -2125, -1183, -1395, -90, -564, -3939]
12604c939J745J403L271o79k799l710K423M358M52k063Q7r52P8j098K42j580r11
12587c672M8j030r82J554K845j235j770K490M494K08p83J02j71l13r03l7J548
12570B393O7n53R52M37Q72l60m54j170J038J804j370R64K123m67r82j47L303J709
12552A0159J304L286j153l494k408j71j270l546J188p44k355j115K901j486k265
12537a169J221j188n009Q29O23J429O95p02k55K039N46K07P28J678K73l752k460
12520d267M33L295J679j340j272l82j721p40J17j036O69M69K517M03o028p28J923
12503f009n38j583O12J099M64J086l51k882R29M641J1k606K029O86j218K84Q43
12486b503J485K070J704l99p48pL005m82j410n557l118M86Q52O32J624J597J265
$$ y = [-3939, -2194, -791, 2480, 1801, -998, -4708, -2285, 2073, 2525, 462, 549, -403, -325, -1423, -1181, -2761, -3672, -3624, -4654, -5636, -4082, -1237, -2472, -4242, -1752, 2742, 2950, 2167, 2269, 2098, 1785, 882, 845, 2393, 2460, 1907, 2859, 3296, 4168, 3808, 3354, 2184, 3222, 5026, 3656, 4620, 6743, 6276, 5294, 5147, 8450, 10159, 11463, 14749, 13596, 10102, 7694, 7523, 6253, 2707, 3895, 3151, 796, -319, 2582, 1096, -1169, 52, -1136, -6145, -5316, -4693, -3264, -2569, -3271, -3526, -1487, -941, -734, -6, 1672, 1945, -1807, -4267, -3834, -539, 1140, -200, -1472, -1854, -3575, -4315, -4198, -5234, -4565, -4096, -1579, -1176, -7204, -7932, -6009, -6547, -8130, -7518, -6419, -5955, -4869, -5220, -8102, -7173, -2532, -2521, -5127, -3098, -2412, -3630, -3346, -2503, -1018, 1052, 2756, 2357, 1609, 1602, 4607, 4125, 2715, -2842, -5960, -5474, -4622, -3990, -2366, -769, 496]
12469D96J58k006l735M9n58k146j248J285L473m49K017j126n784q94J475J580
12453g413J231j208J675K786J36J94j161j939K458L33o5m469J418N385Q45k68
12437f2o37m249o07l8l09J509N88O74j708n82qN30M54j089j205L748K820l394
12419c565k991L192L16r58R87J666l17R6J4r6k363l015J707J555J751K613k94
12402B98L35l976o82K365j456k14J39L31J864L361J24p14l680l058K143j518l357
12385g695J09R78r6K404O93l644m65J921o94N94K843m0k029j386R72n55L339K346
12367d05J479n50k149q20L37J48n78j268k535k249m4Q96k401J641K602m21r13
12350g230J257K16L497K359q63j42m29j250k553l200j051O66L550K143j635k501
$$ y = [496, 654, -1352, -5087, -5038, -5596, -7742, -8990, -7705, -4232, -4681, -2664, -3790, -9574, -10468, -8993, -7413, -6182, -7390, -5715, -2929, -2793, -2599, -3760, -5699, -3241, -2908, -2973, -7442, -6024, -639, 206, -62, -699, -4948, -5555, -5593, -5902, -4393, -3805, -3131, -4839, -5421, -5429, -4899, -4445, -5534, -6739, -2991, -171, -3565, -6556, -3364, -3048, -4006, -3019, -1353, -1670, -1574, -1560, -1656, -4019, -7034, -5327, -3772, -2021, 592, 298, 633, -3343, -4025, -1660, -3116, -3330, -3191, -2860, -996, 2365, 2489, 1775, -1905, -4963, -2820, -4338, -7695, -7586, -6608, -6704, -4300, -3607, -7251, -7716, -5795, -6489, -5895, -3052, -3092, -5121, -6507, -5535, -6090, -2751, -405, 1074, 524, -1625, -2445, -2108, -1960, -2538, -3806, -6341, -8590, -8634, -7738, -10139, -8498, -5896, -6317, -7230, -5973, -5757, -2260, 99, -764, -906, -1335, -2585, -5138, -8338, -9389, -8723, -5173, -3030, -4665, -7166]
12334g166P35J466n44R95j281j193L325m80n61R08j307J426J50k389j344l754
12318a1014j734k020L877M126P50K292K90K817R06J836L290q25k289k241n472
12303e411j435Q16k070L289J487j180r43j922p95L0J170m1K560O9N20j399J440
12286c815j116j48J831J466k55L583P02Q9k914L37m902k710l90j536K211l75K169
12269e773M098j916k016K932K408j423J504k938%P27j943r74L59L668Q83l267
12253c671k538n704L58K046J674R40j554K836J272n5k515l592k277J873M047J165
12237e695K458o80j86J799j226n303k080K627K746j654o76J246J1K305K983j090
12221b415l174j798j258J55J63Q84L767n5l05O47M88k94O63K207k468j050J054
$$ y = [-7166, -6431, -4965, -5509, -4514, -5795, -6988, -3663, -4143, -4704, -3796, -5103, -3677, -3527, -5916, -7260, -11014, -12748, -14768, -10891, -6765, -6015, -3723, -3433, -616, 290, 2126, 5416, 4591, 2302, 61, -5411, -6846, -6030, -8100, -4811, -3324, -4504, -5447, -7369, -8164, -8134, -6964, -7005, -4445, -4376, -3856, -5255, -3815, -4931, -5079, -3248, -1782, -2037, 1546, 2248, 2337, -577, -240, -5142, -7852, -8242, -9778, -7567, -7942, -5773, -1675, -3591, -5607, -2675, -267, -1690, -186, -3124, -3124, -2397, -4340, -5314, -4955, -1287, -404, -3671, -6209, -11913, -11555, -9509, -7835, -6895, -8449, -5613, -4341, -4396, -6911, -10503, -12780, -10907, -6860, -5695, -3237, -3917, -4103, -2304, -3530, -8833, -10913, -8286, -5540, -7194, -7870, -6624, -6613, -4308, -1325, -2415, -5589, -7387, -8645, -8490, -8327, -7443, -3676, -3731, -4036, -3389, -2901, -3195, -2532, -325, -2793, -3843, -2789]
12204b789M198k134n221j53P58J197L119j793l742l792K351L939N079K899k236
12189A680l246j708l34K587k273k513P13J143M161K234j262j105m85J98J27q35
12173i18n376k710M530M18J240J950o04J530J014m0j124j958j78K882K579j936
12157A299n213p26P60j345k33L72J964j67l717K65K383k195j818L063L907M415
12141C014q71j431J385j152k121l360L04N77j603L72q52P51J321k961j838l816
12125a2281j677K773O530K664n58j678K040j324n19j383j349m03O52l55q01K16
12109g453o37N13M538L459l055n19L4l798k037Q21J173q42k201q61K8L173J274
12092f390M19J457J173L95l00r32l50L088O63m258o58Q62r18L690q95j76J666
$$ y = [-2789, 1409, -725, -5946, -6099, -5341, -4144, -1025, -2818, -6560, -10352, -8001, -4062, 1017, 3916, 1680, -1566, -3274, -3608, -1021, -3294, -5807, -5094, -3951, 210, 2444, 1182, 77, -408, -210, -83, -918, -6294, -9004, -4474, -4056, -2816, -866, -1470, 60, 1074, 1034, -90, -2048, -2226, 656, 3235, 1299, -3914, -4640, -3880, -5225, -5458, -5086, -3122, -3289, -7006, -6741, -4358, -6553, -8371, -5308, -1401, 3014, 2143, 712, 2097, 945, -1176, -4536, -4232, -3655, -5258, -4886, -5738, -4987, -3666, -6627, -8465, -12281, -13958, -11185, -4655, -1991, -2549, -4227, -2187, -3511, -4030, -5413, -6762, -7165, -6513, -6868, -7669, -7453, -8090, -7577, -3039, 420, -2635, -3154, -3120, -6918, -8955, -8134, -6961, -7803, -10004, -10865, -10837, -7664, -6390, -5971, -4514, -3341, -2946, -3246, -4178, -4528, -1440, -777, -5035, -5693, -4831, -5749, -2059, -2954, -3130, -1464]
12075a464L156M40L03o18j00j645k982k877j099p70l25q49J01Q38K433Q25n68
12058e201o93k552K207O581Q82k467l85j816j022K35k835K405J504n56Q55J319
12042a539k035J110O10m79k645l490q24L330O432K425k262m156p07K076J602J472
12026I20J230j564K29k568j338p34k56J674k593l832k352J457O189K766p99k402
12010c973K91k066M10q34k15K96k46K221o38M65k770k184M4K466L0q8J243J985
11992c563O37n17k607l16M092L369l972j694j621K517L350k725m115l132m64L029
11976g732N541J954j666j455j870J19K659Q5K65K97P52r72j1r44K099L179o37
11959A663J425K015k401l49j25L30L247q13m063j014r08J060k97k286l274O88
$$ y = [-1464, 1692, 2132, 2435, 1817, 1717, 72, -2910, -5787, -6886, -7656, -7981, -8830, -8729, -7891, -5458, -4633, -5201, -5894, -8446, -6239, 342, 1224, -1243, -1628, -3444, -4466, -4231, -7066, -4661, -3157, -3713, -2858, -1539, -3574, -2464, -1854, -2333, -4978, -8468, -9292, -5962, 470, 2895, 633, -3523, -4230, -2154, -552, 920, 2150, 586, 815, -1753, -3091, -3825, -4081, -2407, -5000, -8832, -11184, -9727, -3538, -772, -1571, -3973, -3682, -5748, -5338, -6172, -6387, -6091, -6337, -4116, -4754, -4289, -7059, -9243, -9199, -6733, -6703, -6791, -5548, -3563, -2926, -3443, -6050, -6366, -2274, 1095, -2877, -4571, -6192, -3675, -325, -3050, -7165, -10297, -10761, -7732, -2191, -237, -1903, -3358, -5228, -5109, -2450, -2365, -2100, -1803, -1051, -2023, -2034, -2978, -879, 2300, 1663, 3088, 5103, 2702, 2353, 2228, 2558, 5805, 4992, 929, -85, -993, 67, -230, -2516, -5790, -5102]
11943e102K18r6J744r61j553o83M261p70l688J256N24K736J735j700l82J42j519
11926c838l275J425M621j20K353l151k275J284M68o01k57l778j312L226J043J288
11910b899J59j43j490J274m879k260K649J763K076J588k913j534L8J666p10M90
11894e125Q72J400r90j574j816l622L05N804K039k700j74J079Q18p52j330J434
11878d332K593j48l409J392l31j879K006j722l211K62J884K878L829l417k414
11863f019L93m106K876L498R84L045J907j035m594j64K52j332N36J335R10J877
11847C63j353K637l26j511j426J134J582j609K56j869l042Q0l043k794j571L410
11831i082L543K753J736Q06l1l655q83j424J574K458k004l036j785k381K02N12
$$ y = [-5102, -4884, -4980, -3236, -4197, -5750, -6433, -2172, -2942, -6630, -5374, -4850, -2114, -379, -2079, -2461, -2319, -3838, -7113, -5688, -1067, -1187, 1166, -1985, -4260, -2976, -2508, -3109, -3366, -7144, -8456, -5230, -4187, -2899, -2740, -2883, -4373, -3099, -7978, -10238, -7589, -5826, -3750, -2162, -5075, -6609, -6571, -4905, -5615, -5125, -4253, -2853, -3843, -5417, -7233, -10855, -10550, -4746, -2707, -5407, -5581, -4502, -3684, -4436, -5766, -4332, -1739, -1887, -5296, -3904, -4235, -6114, -4108, -5830, -9041, -8779, -6895, -4017, -188, -3605, -6019, -5626, -9732, -6856, -3358, -2374, 671, 2578, 1543, -3051, -3215, -2963, -4295, -3759, -2424, -1514, 363, -990, 1647, 1321, -190, -1616, -482, 1100, -509, -253, -2122, -5164, -5084, -8127, -10921, -12492, -9082, -5539, -2786, -1050, -244, -275, -3930, -4813, -6237, -4663, -2205, -4209, -7245, -9030, -11411, -11209, -10697]
11815a0697P06M561J176J457L2k186J882K59j441k806J45j804j354n56L004R00
11799f722J552J808n603j142M369K85r05l67N694J556l471j94L3q04o49K255M71
11782a834r66J051n61J08k356M43K803J92j631J551j141l991J093j783k380j1
11766i413j210L309K303R49J025J994l241k437Q81O24j258J369p95L117o64k500
11750e947L60J749m99K57j577K279O01j69k90k39p03p3J533j710q84q45J973r80
11732e164j634K911k07k329p84J21j528l846k428J535O181K378k234j597K94J362
11716f969K744K048k339R98p80o23O26k90J075l662k991J199J825K72J409n5r32
11699f445K558J923j012l211l317k284j48q66K302L632j632J468J117J874k51
$$ y = [-10697, -9991, -5430, -4254, -2797, -2765, -4951, -3069, -2810, -4251, -7057, -6912, -8716, -10070, -10626, -7622, -6722, -5170, -3362, -8965, -10107, -5738, -5453, -6358, -6725, -1031, 525, -2946, -3140, -3107, -3911, -4560, -2305, -1834, -2800, -1749, -2310, -2202, -4558, -4115, -1312, -1120, -2751, -1200, -2341, -6332, -5239, -7022, -9402, -9413, -10623, -7314, -5011, -4062, -3037, -1043, -4284, -6721, -5840, -5216, -6474, -5105, -5900, -2783, -3447, -5947, -5587, -3838, -4337, -4080, -5657, -3378, -2777, -2946, -3236, -3475, -4178, -4251, -2718, -4428, -5312, -6157, -4184, -5164, -6798, -3887, -4094, -6423, -7207, -7086, -8614, -12460, -14888, -13353, -7172, -4794, -7028, -8625, -8331, -6969, -4225, -2177, -4516, -3518, -4298, -4921, -4295, -4585, -3510, -7172, -10163, -8964, -7139, -6867, -5458, -5513, -6445, -3887, -1964, -2976, -6187, -9504, -11788, -11936, -12802, -10500, -6868, -8500, -7032, -5915, -4041, -4292]
11684d292J85K459j901l222k169j54L707j18l033k995j949M081K040J456J760
11669d145l05k167R4k162l99M681L291j672J583M30r35k408k190l747J718M671
11653c662K691J966j679j061q26o41j083l594l66o29j281j923J815M186J118Q42
11637d127j666r92J418k9k026J611K628K359j083n252l489K79N93L092O97n4P40
11620e301K228j514j477K353J822K56o577l007N517K446M266J361j600m490j346
11605e063J450K519L972j735l214K381J586l747m624l689K444M383k465Q80J564
11590c358j727l225l67J125J851j676k107L406j964j627m471K651O226M180l018
11575d101M5n13j936m891p6L829K283K377J594M01m571j297K65J799Q4j156J94
$$ y = [-4292, -4107, -1648, -3549, -6771, -8940, -9094, -5387, -5505, -8538, -11533, -13482, -9401, -7361, -5905, -4145, -4450, -6617, -6523, -8685, -9084, -4403, -1112, -2784, -1201, -771, -1706, -4114, -6304, -10051, -8333, -3662, -971, 995, -684, -1745, -2571, -3212, -4295, -7889, -8255, -8884, -10165, -12088, -10273, -6087, -4969, -4127, -5793, -6785, -5367, -5396, -7422, -5811, -3183, -824, -1907, -7159, -10648, -10369, -9776, -6684, -5987, -6041, -5301, -3073, -4587, -6064, -3711, -1889, -1633, -8210, -11217, -5700, -3254, 1012, 2373, 773, -3717, -5063, -3613, -1094, 2878, 1143, -2071, 310, 1896, -1851, -6475, -10164, -7720, -3337, -5802, -4922, -3358, -5085, -8310, -8677, -7552, -5701, -7377, -9484, -6078, -8042, -9669, -14140, -11489, -5263, -1083, -4101, -4056, -4569, -6505, -11396, -11472, -7643, -5360, -2983, -1389, -988, -5559, -6856, -6591, -4792, -4708, -5864, -5670]
11558e670l28J362J432j414k676j02o94L19O083J909j141l597l821R30J477n99
11542f530m07N57j285k249j278O11J50N128L94J120K517O20L8r36K398j486K594
11525A956J907M591j961j590k420l375L37l90M65l67k232p17K955L58j275j20
11509a878n65R47j388J48o23k052L76K822L260J672k990l097j824K697l560j896
11493g951M812L374J02j269k212J228k623J077J120L65J530J523O22K269j15l170
11477F82q73K78j991j894J065J178K68j933j92j115M28J077j417k88J391k997
11461f333j648K843L273K496j064p98j32j521q12K73j471n68j790L040L09N31
11445c372K878L261m5m279K19J892j100M479M269J528o86j649j781m405j411j267
$$ y = [-5670, -5998, -4636, -3204, -4618, -7294, -7396, -8090, -7771, -1688, 221, -920, -4517, -8338, -7408, -5931, -6530, -6937, -6380, -7665, -9914, -11192, -10581, -10431, -5303, -4909, -3789, -1272, -652, -614, -1550, 848, -638, 1956, 3863, 8454, 6493, 4903, 2483, -892, -555, -945, -480, -847, -3079, -3796, -841, -483, -1758, -1878, -2443, -1496, -2884, -2736, -3359, -5411, -5035, -2213, 1047, 2719, -271, -3368, -5192, -2495, -6055, -7951, -3139, 235, 337, -932, -3144, -1916, -4539, -3462, -2342, -1977, -447, 1076, 1698, 3967, 3852, 682, -191, 87, -1904, -3798, -2733, -1555, -1287, -3220, -3412, -4527, -4099, -3022, -4439, -4727, -3336, -6333, -7981, -5138, -1865, 631, -433, -1231, -1363, -2884, -3696, -3423, -4894, -5462, -7252, -4212, -3903, -3372, -494, 2767, 2722, -1557, -1338, 554, -546, 3933, 8202, 9730, 9044, 7395, 5614, 1209, -202, -1469]
11429a469j780J344J428K235K422O36r03m623l872j298K090O85N34K004j292k544
11413d403j951q46J120P1J123N67N44m67M667J044k161K037K252k440j012P99
11397I44n77k761k663m53j579l479L834O816K688L22J670O32o265l481J92O93
11381c467n8n29k25J962l08p68K180K829n43j137n33J995J453k837k297O19J72
11364a492M48N27k585K67J718J600J167M18m013J806L544l469k944K270K89n23
11348i72j682q39m7J041j40K38J025J267j423j406j450J647J074k870m350k190
11332a1077M218N574K439p51j254P2q37l30j629p2M37K013q10K218J229K230P77
11315D447j658J985Q0l714k138J577j767j918k053j315k49k306r18K595P51J766
$$ y = [-1469, -3249, -1905, -477, 1758, 4180, 4816, 3913, -710, -4582, -5880, -3790, -3105, -2571, -567, -1859, -4403, -6354, -7200, -6080, -6009, -4886, -4319, -3775, -4242, 425, 1469, -692, 1345, 3597, 1157, 145, 944, 367, -2394, -5057, -5510, -7089, -10568, -6734, 82, 2770, 3092, 4762, 5394, -871, -4352, -4160, -3467, -3525, -4054, -4279, -2317, -2625, -3393, -1213, 1616, 1073, -64, -597, 1398, 2851, 14, -2283, -1664, -1492, -1044, -517, -3102, -2835, -1117, 483, 1650, 2068, -1945, -139, 3405, -64, -3008, -738, -449, -972, -2654, -3493, -3540, -2499, -2639, -2401, -1376, -109, -1532, -2938, -4388, -2741, -1667, -4537, -8887, -11077, -6859, -1285, 1154, 403, -851, -779, -1616, -1946, -3575, -3647, -3210, -1197, -2007, 211, 1440, 3670, 4447, 2789, 4774, 4854, 1140, -998, 579, -1188, -3106, -5159, -6474, -6723, -9029, -9947, -7352, -6601, -4835]
11299d835K556M173k37l0M513J378O03J568J990j577j365O12J099P364R365Q844
11283C6021J6196K0175J6850J3210L283n076j2648j4473j6036j2408j1097o654
11271B7343K88J181m524n051m881k034J537r51k670p21k19m291N79J722k327k035
11255B946J736J192J269l29K692J283K279j431M893N390KJ295O766J2333J0332
11240E2648J2145J7391L1911M1155N2150O6102O1069K8933j5222m7325o2099o1077
11228A77781m4230k9605k0396j6413j0704m282m279p497n818j931l753l612j74
11215B5087J41j910o545k348K425l187m287m02L936M979K564k536j48k67M374
11200B1876N425N303L445O839R042M160J0501J7728K9062M2039N1150O2745O3359
$$ y = [-4835, -2279, 1894, 1657, 1627, 6140, 7518, 8121, 9689, 11679, 10102, 8737, 9349, 10448, 17812, 27177, 36021, 52217, 72392, 89242, 102452, 105735, 100659, 88011, 73538, 57502, 45094, 33997, 27343, 27631, 28812, 24288, 19237, 14356, 12322, 13859, 12908, 10238, 9517, 9298, 5007, 5586, 7308, 4981, 2946, 4682, 5874, 7143, 6814, 9506, 10789, 13068, 11637, 16530, 21920, 21922, 23217, 29983, 42316, 52648, 64793, 82184, 114095, 155250, 207400, 273502, 334571, 363504, 348282, 300957, 238858, 177781, 133551, 103946, 83550, 67137, 56433, 52151, 47872, 40375, 34557, 32626, 28873, 25261, 25087, 25228, 23318, 16773, 14425, 16850, 13663, 9376, 8974, 12910, 17889, 20453, 17917, 17769, 17502, 21876, 27301, 32604, 36049, 42888, 51930, 56090, 66591, 84319, 113381, 155420, 206570, 269315, 332674]
11187C32674M1205l977m5232o5661o4755n0520l3174k4628j2173q918q958n244
11175E0639n385m592l626p392o019m628k830m408j947L87J308j378J714q18p45
11160A0280J264k159k892J7j021L037M307j296q51M061K604J600M630P300J1647
11145D2528J7003J4719J7030J6350R704Q40j0209j8174j8538j5974j1676n766
11133C7837p569n634k730o73j285j481O59l442j369m53n99l538m459q64L778L729
11117A1907J29q75L00K564K541k878K694K451R60K223N368K449K237N786Q906
11102D6762Q640O097J0525J9361K3539K7679L5573N0011O4399P7347Q2052P2505
11090E24490M2197L50m2449p1500p7363o8774n9422m5692l7767k2348j8642j3565
$$ y = [332674, 373879, 369902, 324670, 259009, 194254, 143734, 110560, 85932, 73759, 64841, 55883, 50639, 45254, 40662, 37036, 29644, 23625, 18997, 16167, 11759, 9812, 10199, 11507, 10129, 11843, 11025, 10280, 11544, 9385, 6493, 6510, 5489, 8526, 12833, 11537, 10686, 14747, 17351, 18951, 23581, 30881, 42528, 59531, 74250, 91280, 107630, 117334, 118174, 107965, 89791, 71253, 55279, 43603, 37837, 30268, 24634, 21904, 21231, 19946, 18465, 19124, 15682, 14313, 13860, 13261, 9723, 5264, 4400, 8178, 11907, 12036, 11161, 11461, 14025, 16566, 13688, 16382, 18833, 19793, 22016, 27384, 29833, 32070, 37856, 46762, 55402, 61499, 72024, 91385, 114924, 142603, 178176, 228187, 292586, 369933, 451985, 524490, 566687, 567037, 524588, 453088, 375725, 306951, 247529, 201837, 164070, 141722, 123080, 109515]
11078A09515q210p665j1413q733n469n952l144N689K494k747J365R30J252K747
11064G0659O215N309M785P518J1817J0068J3896J9799K2962K7648L6237M3977
11052B80890N4318P7170J06116J45281J91883K41392K76868K60063J72931L2853
11042A839765j20964k31756k68101k48726k01633j53335j16635q3881o1606m5998
11032C07130l7452l2904k6485k3931k1058j2331j3731r500p038o104n871k884
11020A07841J331K74K474M376N513M146O539J0132J3962J9949K4509K7552L4186
11007B62784M3702N7621P4628J02258J39645J87541K41299K79398K72721K00514
10997A862111N6969j06770k26826k74639k63099k20197j68809j24224r4283p1840
$$ y = [109515, 101305, 93640, 82227, 73494, 68025, 62073, 58929, 64618, 67112, 64365, 65730, 66660, 67912, 70659, 76874, 82183, 86968, 94486, 106303, 116371, 130267, 150066, 173028, 200676, 236913, 280890, 335208, 412378, 518494, 663775, 855658, 1097050, 1373918, 1633981, 1806912, 1839765, 1718801, 1487045, 1218944, 970218, 768585, 615250, 498615, 414734, 353128, 307130, 269678, 236774, 210289, 186358, 165300, 152969, 139238, 129738, 122700, 116596, 110725, 107841, 109172, 109446, 111920, 116296, 121809, 125955, 132494, 142626, 156588, 176537, 201046, 228598, 262784, 306486, 364107, 438735, 540993, 680638, 868179, 1109478, 1388876, 1661597, 1862111, 1919080, 1812310, 1585484, 1310845, 1047746, 827549, 658740, 534516, 440233, 368393]
10987C68393n6905m4946l4202k7334k5456k0731j5935j5443j2480p184p274j0235
10975I0268p265l434J587J077n403l051J134J755N516N109M729M493P269N616
10961A09400J1308J8958K3242L2366M3461O2428Q1930R3528R0380O4766K2510
10950F54277k8031o9493q9714r0698p5990n8211m8039l4455k2342j8421j4908
10939A03975j1278p219j0756j2348r646n715n465K74l157l609l47m92l876L168
10925C3509K227M208M279M242P228J7872K2560L5751O9331R8292Q6046O6601J7675
10912D69821l6008o8654r2365q1786n5389l6078k4231j8086r103n482o061m822
10900C1756o411o831r75J166k507l122j107J792O05Q05j075n81k11k062k518q27
$$ y = [368393, 311488, 266542, 232340, 205006, 179550, 158819, 142884, 127441, 114961, 107777, 100503, 90268, 83003, 79569, 81156, 82233, 76830, 73779, 74913, 76668, 82184, 87293, 92022, 96515, 103784, 109400, 120708, 139666, 162908, 195274, 238735, 301163, 383093, 476621, 567001, 631767, 654277, 626246, 556753, 467039, 376341, 300351, 242140, 194101, 159646, 137304, 118883, 103975, 92697, 85478, 74722, 62374, 52728, 47013, 41548, 41822, 38665, 35056, 34709, 34217, 30341, 33509, 35736, 39944, 44223, 48465, 55693, 73565, 96125, 131876, 201207, 299499, 385545, 452146, 469821, 433813, 365159, 272794, 191008, 135619, 99541, 75310, 57224, 48121, 42639, 36578, 31756, 25345, 18514, 17539, 18705, 16198, 13076, 11969, 13761, 14366, 15171, 14096, 13515, 13304, 11242, 8724, 7897]
10884G897j60Q55k01k962p95J644r52n66j334r13K374O91P89M42j050k487m506
10867a234k865k95j772j357P61m71J23J856J568J266N43M259j435j17k287K156
10851F99M46q10j23k625k412R73L212K720J458r30n296k657J397M251J673M18
10835B394p17J260m229j967L712L908m675j148j780O85m22l52k229j341L955J578
10819a368o6K626j343k748k79J936P36j053l845l019l74j352n1M868K553J99k333
10802d913J038n8J410M5k349j404k43K538J933j867j419j403L8n10l97k122J274
10785h409J613L410J493n686q4M99j285K624K694J714J109J240M67K345M133K461
10769A0338L452K307N596R081J0237J0176M769M222N25l983r588j2180j3729r723
$$ y = [7897, 7737, 8592, 8391, 5429, 4634, 6278, 5326, 4760, 3426, 2513, 4887, 5578, 6367, 6809, 5759, 3272, -1234, -4099, -4394, -6166, -7523, -6762, -7233, -7110, -5254, -3686, -2420, -1877, 2382, 947, 830, -1457, 699, 1145, 335, 212, -2413, -4825, -3852, -640, 2080, 3538, 2608, -2688, -5345, -3948, 303, 1976, 2394, 1677, 2937, -1292, -3259, 453, 4361, -314, -1462, -3242, -2557, -2979, -3331, -5560, -6901, -2946, -1368, -1434, 1192, -151, -2899, -3178, -1242, -506, -1559, -5404, -8423, -8797, -10149, -10200, -5332, -2779, -2580, -4913, -3875, -3933, -2523, -2478, -4827, -6231, -6474, -3936, -2003, -3870, -5289, -6692, -6654, -7164, -7561, -9683, -8409, -6796, -3386, -1893, -7579, -7663, -7164, -8449, -5825, -3131, -1417, -308, 932, 1399, 3744, 7877, 10338, 13790, 16097, 21693, 30774, 41011, 51187, 55956, 60178, 60703, 56720, 47132, 34952, 21223, 11500]
10755A1500n292l611j485k918k004J564K457K127k865j045K814M36l970P60M270
10740B738J617J373O82r97N15n54r8q09m545m709J596K366j923j675l695q6J145
10723g059J125m24j320J280k176l833P02L879N04J402L42K398j592k078K868k856
10707f838j005M418K750K401J051J589Q91P45P484Q196J1389J2357O439Q94o478
10692D6283j0393p848n889n779q69N234M755k238N0K299k449r71k437P96J399
10677B1943k266j235k540k665K709J939K128J160j459k968k726J130L317J191
10663A9658q97M183L877j413q47j133k432r08l568L072N337K241J926j53N522
10648C4465M653O722N987R773J2773J2021K0915K9534L2109K8277J1864j1731
$$ y = [11500, 6208, 2597, 1112, -1806, -3810, -2246, 211, 2338, -527, -1572, 1242, 1678, -2292, -1532, 2738, 4355, 5728, 6410, 5413, 5928, 5374, 5276, 4467, -78, -4787, -3191, -825, -2748, -4423, -8118, -8204, -7059, -5934, -6358, -7678, -6398, -8574, -12407, -11705, -7826, -7322, -5920, -5578, -3180, -4772, -6850, -3982, -6838, -7843, -3425, -675, 1726, 2777, 4366, 5257, 6002, 13486, 21682, 33071, 45428, 51867, 52761, 46283, 35890, 28042, 22153, 16374, 15505, 20739, 25494, 23256, 23306, 25605, 23156, 22185, 19748, 20544, 21943, 19677, 18442, 15902, 13237, 15946, 17885, 20013, 21173, 19714, 16746, 14020, 15150, 18467, 19658, 18761, 22944, 26821, 25408, 24561, 23428, 20996, 20088, 16520, 19592, 24929, 27170, 29096, 28943, 34465, 39118, 45840, 51827, 61600, 74373, 86394, 107309, 136843, 168952, 197229, 209093, 197362]
10636A97362m1591n8746p1612n4295l5611o437J5164J1535O198L503K054N07L476
10623b8493J436J194P03j967j714p40L382N356M469K759k106K15J842J637J140
10608a0887L071J973K624J25r53K788l226l239K542O288O598M252M533O087K165
10593B4741J089Q05j02r93K96l429o098k155K060L742J625J865o240o831m317
10578F058j363P59K226O33O781J0767P119L329L783M471M896O832M333J676m59
10563F1841j334m474J734l22J451J416J564M340N703J5268J8563J9200K2485K5854
10549A73289L2853L7637L0056Q373l345j776L812O891K1477L2344M4677N5962
10537D42250P1719Q9625J16932J56726J60456J49407J21830O6301L5700K1330
$$ y = [197362, 155771, 97025, 25413, -28882, -64493, -70930, -55766, -44231, -38033, -34530, -32476, -31969, -28493, -27057, -25863, -25160, -27127, -28841, -29581, -26199, -20843, -16374, -13615, -15721, -15506, -13664, -12027, -10887, -7816, -5843, -3219, -3094, -4047, -1259, -4485, -7724, -5182, 1106, 7704, 11956, 16489, 22576, 24741, 25830, 26635, 26533, 25540, 25836, 22407, 16309, 14154, 16214, 19956, 21581, 23446, 17206, 10375, 6058, 4695, 5454, 7680, 8313, 15094, 25861, 32980, 36309, 40092, 44563, 49459, 56291, 60624, 62300, 61841, 60507, 56033, 57767, 57445, 58896, 60312, 61876, 66216, 71919, 87187, 105750, 124950, 147435, 173289, 206142, 243779, 273835, 282208, 278863, 277087, 280899, 287790, 309267, 341611, 386288, 442250, 513969, 603594, 720526, 877252, 1037708, 1187115, 1308945, 1375246, 1410946, 1432276]
10527A432276M1178R0032J32606J77410K52492L59188N02352O51387Q54345J152718
10517E645984J610439K453729L990934O858138J1962132J7779461J7607759J4409093
10509H2317669O641372m716620j1742636j7583619j7114322j2450742p700355
10502A7650747m634587k925422j967407j440184j118361r02976p32246n92146
10494C337418m80496l86348l06681k34380j66793r3345l3674j9916k4747p1296
10484A519742j19420j46536j53507j26740r2135o7139n5849n2117m5930m8885
10474F11484m5132l8532k7069k3065j8592j2593j0152k567K00m131l447m186o3
10461D22155R43N00R98j0072k2324l0703l4092l0369k1270j5894j3231m802n287
$$ y = [1432276, 1473454, 1563486, 1696092, 1873502, 2125994, 2485182, 2987534, 3638921, 4493266, 5645984, 7256423, 9710152, 13701086, 20559224, 32521356, 50300817, 67908576, 82317669, 88959041, 84242421, 72499785, 54916166, 37801844, 25351102, 17650747, 13016160, 10090738, 8123331, 6683147, 5564786, 4661810, 3929564, 3337418, 2856922, 2470574, 2163893, 1929513, 1762720, 1669375, 1635701, 1615785, 1591038, 1519742, 1400322, 1253786, 1100279, 973539, 881404, 814265, 758416, 706299, 660369, 611484, 566352, 527820, 500751, 477686, 459094, 446501, 436349, 433782, 433982, 429851, 426404, 422218, 422155, 423098, 423598, 424596, 414524, 392200, 361497, 327405, 297036, 275766, 259872, 246641, 241839, 236552]
10448B36552n931p289j588l56M376N577M771j73K843J577Q977J9512L1764M0615
10434C41227M7896N7769M7829L0066K3149P90k6735l3537m8351n8358n1030m5036
10422B85679k8491j0604J0884L1166L7655L7438K6103M483k4026m2571m5772m4603
10410B37341l8574k7410j6600j0602m470l014k635o634j294J54R15j575k856j05
10396A22641J145O08M346J121j25O191P454P782O392O910M248j2805k9323l6830
10382H9755m1317k9494k1012p386O107M979K462K362K653R014R356K227l80K186
10368C1512K571L392J506J858L21o513l96Q29j882l478J57P25j167o55j37K638
10352C1281m69l695m930l697k577m19L129J791O27j488R04M43J127n2j325k174
$$ y = [236552, 230621, 223332, 221744, 221388, 225764, 231341, 236112, 235939, 238782, 240359, 249336, 268848, 300612, 341227, 389123, 446892, 494721, 524787, 547936, 548726, 521991, 488454, 440103, 381745, 330715, 285679, 257188, 246584, 257468, 288634, 326289, 363727, 389830, 394313, 370287, 327716, 281944, 237341, 198767, 171357, 154757, 144155, 139685, 136671, 134036, 127402, 126108, 126262, 127177, 125602, 122746, 122641, 123786, 124394, 128740, 129861, 129736, 135927, 143381, 151163, 157555, 164465, 168713, 155908, 126585, 89755, 48438, 18944, -2068, -9454, -3347, 1632, 4094, 6456, 9109, 18123, 27479, 29706, 29326, 31512, 34083, 37475, 38981, 40839, 41160, 34647, 34251, 35080, 33198, 29720, 29877, 30602, 29435, 28780, 28643, 31281, 30812, 27117, 22187, 18490, 15913, 15494, 18623, 20414, 21041, 19553, 20457, 20900, 22027, 21975, 20650, 18476]
10336A8476L075J904P59R86j568j183j199p928q950o550o818p576m524O84L60
10321b0052P434J0017J1793P460J907m53n73L971M424J854N353K645J89M13k181
10306C4201m696j572l27K500P97n57j311M009L000l281j484J00k72K30K267j000
10290C2604j525l259L69J576j819m001J642K623RJ501p49l404r26K911L598N669
10274C6819K793J462N94l571q40j568K071J244m14j64K36K629K432L574K921Q97
10258E1115Q914J1943K0458L3387N1354R2134J29478J27730J14110Q6102j7276
10247G09449p4774j06350j18062q9353m5003j9167k3218k8051l2920j7865O366
10236A61052J9242P546j2875l3547l2785k8138j9680p326n350m022j627k220p30
$$ y = [18476, 21551, 23455, 24214, 25200, 23632, 22449, 21250, 13322, 4372, -2178, -8996, -16572, -21096, -20412, -20052, -12618, -2601, 9192, 16652, 18559, 18106, 17533, 21504, 25928, 27782, 33135, 35780, 35969, 36382, 34201, 29505, 27933, 27606, 30106, 30903, 30346, 29035, 33044, 36044, 32763, 31279, 31379, 31107, 31337, 33604, 32604, 31079, 27820, 28189, 29765, 27946, 23945, 25587, 28210, 28219, 29720, 28971, 25567, 24641, 27552, 31150, 36819, 39612, 41074, 41668, 38097, 37257, 35689, 37760, 39004, 38590, 38426, 38662, 41291, 43723, 47297, 50218, 51115, 60029, 71972, 92430, 125817, 177171, 269305, 398783, 526513, 640623, 726725, 709449, 634675, 528325, 410263, 320910, 275907, 256740, 233522, 205471, 172551, 154686, 161052, 180294, 187840, 174965, 141418, 108633, 80495, 60815, 53489, 48139, 44117, 42490, 40270, 39540]
10223C9540l611k689o97n272m636k480q59R87J694K794J585Q03j713L02q17k618
10207B2313m916k702K97j853k672k21L927J212j098K377k793L6K585j345m354
10192A0793k691L828j2L83L76m09j69J284j721k812l67L386K847M960J479j96
10176B0959l257l290N90M839l00j965L61K413O54j651J263P20K510K656J623J372
10160B9497L181L543K031J2767J6439K3744K8829L0067L2899L4612J8147J7737
10148B53493K2812Q629k106O770j313j5683j6904j1547l0294l4166l2517k9678
10136A17496k5523k2259j6705o234p172o046j795K4j574j58J390R48j133k217
10122B9042l351O32l568k118J152j51J617k243m04K460J120k115J071N138P328
$$ y = [39540, 35929, 33240, 32543, 27271, 22635, 20155, 19296, 20283, 21977, 24771, 26356, 27159, 25446, 25748, 24931, 22313, 17397, 14695, 14992, 13139, 10467, 10246, 14173, 15385, 14287, 16664, 13871, 13907, 16492, 15147, 10793, 8102, 11930, 11918, 12301, 12677, 12268, 12099, 13383, 11662, 8850, 8483, 11869, 14716, 19676, 21155, 20959, 17702, 14412, 15002, 19841, 19541, 17576, 17937, 20350, 21004, 19353, 20616, 21336, 23846, 26502, 28125, 29497, 32678, 36221, 38252, 51019, 67458, 91202, 120031, 150098, 182997, 217609, 235756, 253493, 276305, 284934, 282828, 289598, 288285, 272602, 255698, 244151, 213857, 179691, 147174, 117496, 91973, 69714, 53009, 46775, 39603, 33557, 31762, 31786, 30212, 30054, 31444, 32392, 31259, 29042, 25691, 26323, 22755, 20637, 21789, 21638, 23255, 21012, 20608, 23068, 24188, 22073, 23144, 28282, 35610]
10107C5610O783J3348K3221L9113O6272R3947R3769P5177K5755k7313p0046r6354
10095B79282q1588n9126l6919k5796j6691o555n019n982q383n784l132l02o59
10082B3346j881j586k310j511j190k420j113J629K58j413k94J926p79j183K142
10067A3621O50k265O97R43r67R46J276K984k826j884J631q76k679m38j858m88
10051H467M94m42j612j744P48k9J300J942K467K87k612J161o42j652k94J632j043
10034H428J2J812K848j622k253M4KP18Q2o30k58J410K708J641J752k503j377k364
10016A0450J5j654L15P39k04l269j93m644J855N652M41k199n41k356j720Q11J299
9999D797J755K952M8k05k23N92k63K100J602k695l65R84j875m133J995K214j608
$$ y = [35610, 42393, 55741, 78962, 118075, 184347, 278294, 372063, 447240, 472995, 445682, 375636, 279282, 197694, 138568, 101649, 75853, 59162, 52607, 47588, 41606, 33223, 27439, 24307, 24005, 23346, 21465, 19879, 17569, 16058, 14868, 12448, 11335, 12964, 13222, 11809, 11515, 13441, 12662, 11479, 13621, 14271, 12006, 12703, 13646, 12679, 13625, 14901, 17885, 15059, 13175, 14806, 13930, 11251, 10813, 8955, 8467, 8961, 8519, 6907, 5163, 5911, 5882, 7182, 9124, 11591, 11878, 9266, 10427, 9785, 8133, 7839, 9471, 8428, 8440, 10252, 13100, 11478, 9225, 9269, 9271, 9989, 10071, 9441, 9183, 10593, 13301, 14942, 16694, 14191, 12814, 10450, 10465, 8811, 9126, 9865, 9661, 6392, 6199, 1555, 3410, 9062, 9503, 7304, 6763, 4407, 2687, 3498, 4797, 6552, 9504, 9552, 9347, 9124, 9716, 9453, 11553, 13155, 10460, 10095, 11079, 9204, 5071, 7066, 9280, 7672]
9982G672O57L278J98M113M074L81P80J717j449j552j208J084M45k150Q07R38p02
9965A9083k372n114k377J917M90M548N970J073l741o819k461K626R21J89j214
9950A2719j794q94O20q64K507K826J074k890k79k098l240K207k30K28O693L610
9934B0195L64J002l044n373j398Q20J200J170L573J421m82j958N91j369j352N
9918A5365J40K386O89m03k766l010l308M097N332K19J106p60l847J440L792p00
9902A9772J251J334l65j844j83k197l2K127L855O238L641j417M378N942L753K893
9886D9146k847m950k691k462O52M340O953K664n798n873o420l466J231N5k64l015
9870B7255J228K227j681k728J936N19K483K07k547J699k624J502J041M79J465
$$ y = [7672, 8329, 11607, 11805, 15918, 19992, 20373, 21153, 22870, 21421, 19869, 18661, 19745, 20190, 18040, 18847, 19785, 19083, 16711, 11597, 9220, 11137, 11627, 16175, 22145, 23218, 19477, 12658, 10197, 12823, 13744, 13933, 12719, 10925, 10031, 10651, 9787, 12294, 15120, 16194, 13304, 13025, 10927, 7687, 9894, 9664, 9892, 16585, 20195, 20559, 21561, 18517, 13144, 11746, 12566, 13766, 14936, 18509, 19930, 19448, 17490, 18081, 16712, 15360, 15365, 15505, 17891, 18580, 18177, 15411, 12401, 9093, 13190, 18522, 18741, 19847, 19087, 15240, 16680, 20472, 19772, 21023, 22357, 21992, 20148, 19965, 17768, 17736, 19863, 23718, 29956, 33597, 32180, 36558, 42500, 46253, 49146, 46299, 41349, 38658, 36196, 36848, 41188, 48141, 50805, 45007, 39134, 32714, 29248, 30479, 30534, 30270, 27255, 28483, 30710, 29029, 26301, 28237, 28756, 31239, 31446, 28899, 30598, 27974, 29476, 30517, 30996, 32461]
9855C2461J125m525k015j090j370k68O03R68k656K980K466pm46j515j837K46k971
9838B2149M37n90p57K432L050J923m831l648K903J008O6P42J909N22m4k115q43
9821B4313k383j183j485J182N065l18r19l731l749j032O11M090j322j194q12K508
9805A9641k24j710k366j949J949j117j750j49N4k300O2J590J024J122K403l47
9789A5933O27k061l738k2L45K383N173L215j126L70n08m18L05j642l745m53J762
9772A6400J728j393J58L282J885j39k025j444k91l286Q27L554Ll357q90n13J661
9755A6160j478j095J119P82N26l981j232J093J784mJ182l758p94L401K371J496
9739A7572j858m313r65K775j263Q20K376k907k983J665J004k29K116j668k121
$$ y = [32461, 33586, 29061, 27046, 25956, 24586, 24318, 24921, 25889, 23233, 26213, 28679, 28672, 28226, 26711, 24874, 25120, 22149, 22586, 21996, 21239, 23671, 26721, 28644, 23813, 20165, 23068, 24076, 24142, 24884, 26793, 27315, 27271, 25156, 24313, 21930, 20747, 19262, 20444, 25509, 25191, 24272, 20541, 16792, 15760, 16371, 20461, 19139, 17945, 17133, 19641, 19417, 17707, 15341, 13392, 15341, 14224, 12474, 12325, 12379, 10079, 10141, 11731, 12755, 13877, 16280, 15933, 16560, 14499, 10761, 10739, 11084, 13467, 18640, 21855, 20729, 21099, 20591, 20173, 20478, 18836, 15091, 14638, 16400, 18128, 16735, 16893, 20175, 22060, 21921, 19896, 18452, 18161, 14875, 15702, 19256, 19259, 15902, 15012, 14499, 16160, 14682, 13587, 14706, 15488, 16014, 12033, 10801, 11894, 13678, 13674, 14856, 11098, 10304, 13705, 16076, 17572, 15714, 11401, 10436, 13211, 11948, 12768, 15144, 12237, 9254, 10919, 11923, 11694, 13810, 12142, 10021]
9724A0021o19j182L294J610J327k019j708m15m426k218J700j442j941R82K987
9709E951P025K491n391k845J051l55r35J955L979J633O80P44k703J627j99k963
9693A1745o321k37L633M098R09l140L74N78K421J252k513n908q46K035O46o07
9677H119M49K140K559J267k899l081l80J948j589k388j061L888K186J719l640
9662I237L206L3k683J495p26R1J013L130k91l053q9J82j726J259r15j627j412
9645G124j644K719L469l675l149R57N24L189K066J131k211j572L201K545j877
9630A2797k098N91J717k124J781J65J361K467l059p92q38l52p69Q8k498O06R25
9613I968j077j48q8j913J041j070R72J449j265J062K263J036l680k834j8K5k665
$$ y = [10021, 9402, 8220, 11514, 13124, 14451, 12432, 10724, 10309, 5883, 3665, 5365, 3923, 1982, 2964, 5951, 12976, 15467, 10076, 7231, 8282, 7927, 6992, 8947, 12926, 14559, 15239, 15983, 13280, 14907, 14708, 11745, 5424, 5187, 8820, 12918, 13827, 10687, 11061, 11639, 14060, 15312, 12799, 6891, 6045, 8080, 8726, 8119, 8568, 10708, 13267, 14534, 11635, 8554, 8174, 10122, 8533, 6145, 5084, 8972, 11158, 12877, 9237, 12443, 12476, 9793, 11288, 10562, 10653, 11666, 14796, 14505, 11452, 11363, 11545, 9819, 11078, 10163, 8536, 7124, 5480, 8199, 11668, 7993, 4844, 5801, 6325, 9514, 11580, 12711, 10500, 8928, 12129, 14674, 12797, 10699, 11290, 13007, 10883, 12664, 12829, 14190, 16657, 13598, 12806, 11968, 11616, 10847, 10935, 8437, 9043, 9968, 8891, 8743, 8655, 6742, 7783, 6713, 7685, 9134, 7869, 8931, 11194, 12230, 8550, 5716, 5698, 5723, 3058]
9596C058o04q9o01J457K727Q40j442K013J835K459N04J731N5j655j71k259j630
9579H228k33J289K699J496j492o43j503j498j752L226J454L15k051j708K687J917
9563A2431J365l467j313K206J861l177j037j418k708j591R57J443K20r9K69j589
9547D353k58K629M094K281j329j527q94j40j737q25j367J9l87M212J902M05k961
9530H470j578n29L26m82N53K13P32J583n05K155K700o11j851n42P73k100o0K555
9512A1802J815J562O439J214l855o760j086j752r0K271J893K62j419l50j188j617
9496I141l24p39P59J812L648N96j706o10o15J547J845J374k180n084k474J436
9480H426J021j939j611J431j668J381J6l4K281J455J467N75k97K025L495J850
$$ y = [3058, 2454, 2365, 1764, 3221, 5948, 6788, 5346, 7359, 9194, 11653, 12157, 13888, 13943, 12288, 12117, 9858, 8228, 7995, 9284, 11983, 13479, 11987, 11344, 9841, 8343, 6591, 9817, 11271, 11586, 9535, 7827, 10514, 12431, 13796, 10329, 9016, 11222, 13083, 9906, 8869, 7451, 4743, 3152, 4109, 5552, 5772, 5673, 5942, 4353, 4095, 6724, 10818, 13099, 11770, 10243, 9349, 9209, 7472, 6647, 5280, 5299, 4912, 9124, 11026, 11431, 8470, 6892, 6363, 6689, 6207, 6760, 6973, 7705, 9288, 8783, 10938, 13638, 13027, 11176, 10634, 11407, 9307, 9247, 11802, 13617, 15179, 21618, 22832, 18977, 12217, 11131, 9379, 9289, 11560, 13453, 13715, 12296, 11946, 10758, 9141, 8817, 8078, 8837, 10649, 14297, 14893, 13187, 12577, 11962, 13509, 15354, 16728, 14548, 9464, 6990, 8426, 9447, 7508, 5897, 7328, 5660, 7041, 7057, 7023, 9304, 10759, 12226, 12801, 12504, 14529, 18024, 19874]
9464A9874l407m484K89j695l259M79M62Q09R49j161P72K139L58J328p28k085j911
9447H729p12m99N76K775j560r21L182K819j109m057k103J60N076J891P62o58j827
9430A2524j457j11J709l94k9L850J501k56p40k918k427q99P49J15l90M042l84
9413A4485k190l376L334L592j621J148K804k047m240o32L147K070J068j009j865
9398A4668k058J115K11Nk638k295M431K557k18j556m51J23j067M112M140r10k999
9381A7170k113J082P75L370K561k538j911R32K983l07J365p14o85r10o68j974
9365A8418k537j483j110l63J937J811j499m142Q63J921l02k525j278J611K281
9350A3603l56J292O53J213j383J519J85K249O06k266k506k000N40J962J974J659
$$ y = [19874, 16467, 11983, 12272, 10577, 7318, 7797, 8259, 9068, 10017, 8856, 9628, 11767, 12125, 13453, 12725, 10640, 8729, 8017, 7518, 8094, 10869, 9309, 8388, 11570, 14389, 13280, 9223, 7120, 7280, 12356, 14247, 15009, 14351, 12524, 11067, 10956, 12665, 12271, 12242, 16092, 17593, 17337, 16597, 13679, 11252, 10353, 11102, 11217, 10827, 14869, 14485, 12295, 8919, 12253, 15845, 14224, 15372, 18176, 16129, 11889, 11257, 14404, 16474, 17542, 16533, 14668, 12610, 13725, 13936, 13941, 11303, 9008, 13439, 15996, 15778, 14222, 13771, 13894, 12827, 16939, 21079, 20169, 17170, 15057, 16139, 16914, 20284, 22845, 20307, 18396, 19328, 22311, 22004, 23369, 22655, 21970, 21060, 20392, 18418, 15881, 14398, 13288, 12925, 14862, 16673, 15174, 11032, 11895, 13816, 13514, 10989, 9711, 11322, 13603, 13247, 14539, 15192, 16405, 15022, 16541, 16726, 18975, 19581, 17315, 14809, 12809, 13349, 15311, 17285, 18944]
9334A8944L698L22m660k357K936O41k77J726O47l408k969k076K970O015J451J180
9318B4783k878l850J47L819J056J196J038n27n79r04L386J654O6k221k339k815
9302B1032q81L582L483J191l916m681o372j133M570J670L025J646m74M613K380
9287B9735j779N60j646l585L267J706L33j633k053k201o7J795j005m2J543R17
9271B5845l079k572P96L439K311j673j082O29J912M08J545j380p80j113P26M137
9255C0069j197r58J473j04K473r43l084l009K13Q48p10K22L362K317K212K878
9239C6062J637k474l581j035k723k7p82n07j029K268K001K108M74R53J955J721
9223C7021J801j963k851J07p79k334J328K222q06O62K061J935j703r46K255K397
$$ y = [18944, 22642, 22964, 18304, 15947, 18883, 19524, 19247, 20973, 21620, 18212, 15243, 13167, 16137, 22152, 23603, 24783, 21905, 18055, 18202, 22021, 23077, 24273, 25311, 24784, 24205, 23301, 26687, 28341, 28407, 26186, 23847, 21032, 20151, 23733, 27216, 28407, 24491, 19810, 13438, 12305, 16875, 18545, 21570, 23216, 22742, 27355, 29735, 27956, 28516, 26870, 23285, 26552, 28258, 28591, 26958, 24905, 22704, 22637, 24432, 23427, 23385, 24928, 25845, 22766, 20194, 20990, 24429, 26740, 25067, 23985, 24614, 26526, 26934, 28479, 27099, 26319, 25206, 25932, 30069, 28872, 27914, 29387, 29283, 31756, 30813, 27729, 24720, 24933, 25781, 25071, 25293, 28655, 30972, 33184, 36062, 37699, 35225, 31644, 30609, 27886, 27859, 27077, 26570, 25541, 27809, 29810, 31918, 32392, 33345, 35300, 37021, 38822, 36859, 34008, 34115, 33336, 31002, 32330, 34552, 33746, 34408, 36469, 38404, 36701, 35755, 38010, 40407]
9207D0407m62k240j323l86j914m103p15k008L764L833J118o04K114J798j322J82
9191C8139L545J643l1O42O609M341J98k506J206N648J978J168j740k833L36J375
9175E9718P135Q659P894Q694M409K163J0048J1717R914J7729K2968K2765L0342
9162B24155M4809O1954Q9840J21111J66214K31451K92463L00198J98565n824j93172
9151A531764k79666k68670k18106j57785j14464q1214o1367n1460l8035l3172
9141B27825k7063j9395j3936j3219j7222j3547j2246j4631j6444j1688j0079k320
9129E6035k886k977n40O7J176J820Q14k368p008l164n01J070j447J457o88J672
9113D2532M807N572J263J4L213O479J0490Q148O006K232P176Q380k13q032p823
$$ y = [40407, 39945, 37705, 36382, 35996, 34082, 29979, 29264, 27256, 31020, 34853, 35971, 35367, 37481, 39279, 37957, 38139, 41684, 43327, 43296, 43938, 50547, 54888, 55086, 52580, 53786, 59434, 61412, 62580, 60840, 58007, 58343, 59718, 66853, 75512, 83406, 92100, 96509, 98672, 108720, 120437, 130351, 148080, 171048, 193813, 224155, 268964, 330918, 420758, 541869, 708083, 939534, 1231997, 1532195, 1730760, 1724936, 1531764, 1252098, 983428, 765322, 607537, 493073, 411859, 350492, 299032, 260997, 227825, 200762, 181367, 167431, 154212, 136990, 123443, 111197, 96566, 80122, 68434, 58355, 56035, 53149, 50172, 49632, 49699, 50875, 52695, 53509, 51141, 44133, 40969, 40468, 41538, 40091, 41548, 40860, 42532, 47339, 52911, 54174, 54188, 57401, 63880, 74370, 82518, 88524, 90756, 97932, 106312, 106099, 98067, 90244]
9098I0244o275n326k712K159P540J1013Q625J3903Q024J3344K1051K8467L8135
9085B28192N6543Q3490J16965J37809J50308J69411J68377J19150N9567J1258
9075A301070m6409j16485j60781j64524j53273j37495j13585q4704o6940m5459
9065B11415k9762k3615j4679j2418j2385r947p762m187n128o565o645n160l034
9052G0128n939n209l890l802j32j458m655j204o56k713qk302k839m077m400m02
9036B6442M213J621N9j769r85O23j173K94M907N186j356n157n134p81R27J605
9020B9522K574J677L410L685L582K966K577k592m136r359p368o12J993K162K733
9005C2814q60m36m26k329L177k148l858K162O07j310K128r61J338K666L849K777
$$ y = [90244, 83969, 78643, 75931, 78090, 85630, 96643, 105268, 119171, 127195, 140539, 161590, 190057, 228192, 284735, 368225, 485190, 622999, 773307, 942718, 1111095, 1230245, 1289812, 1301070, 1254661, 1138176, 977395, 812871, 659598, 522103, 408518, 323814, 256874, 211415, 181653, 158038, 143359, 130941, 118556, 108609, 100847, 96660, 91532, 84967, 78322, 73162, 70128, 64189, 58980, 55090, 51288, 51156, 49698, 45043, 43839, 43183, 40470, 40462, 38160, 35321, 31244, 26844, 26442, 30655, 32276, 32335, 30566, 29581, 30204, 29031, 29325, 34232, 39418, 38062, 32905, 27771, 26990, 27917, 29522, 32096, 33773, 37183, 40868, 44450, 47416, 49993, 47401, 43265, 33906, 26538, 25926, 27919, 30081, 32814, 31954, 31518, 31092, 28763, 31940, 29792, 25934, 28096, 28703, 27393, 29521, 28560, 29898, 32564, 36413, 39190]
8989C9190Q76M270M72K770Q145M635j472p598j5341j2061r136m78K704N171N25
8974B2672O69K511j82R20r42n44N12J956L156K305L5n01J573M372J844L90K351
8957D3097k981l614j671l170l628K463L687K538K455N13O711J1564R612N145J0304
8942H3025N522K578M263N335J0474J8089L2455M0310M5975N4390M3386o328n2323
8929B87151o4396n4696l7799k9354k6935k0638j1043l55L890L618r21l429p2j565
8915D3456k227L055J209n15p5j821L033M522L547L094l445n090k963m336J0J826
8899D3280O367M878L712O460n408j3491r782o512P99N16K296m226o911l413J891
8884B0456N601O402Q219r8r666q502M59Q912J2109J7833J6561J2659l397q172
$$ y = [39190, 40066, 44336, 44808, 47578, 55723, 60358, 58886, 51288, 35947, 23886, 14750, 14272, 16976, 22147, 22672, 23341, 25852, 25670, 26590, 25648, 25104, 25616, 27572, 30728, 33033, 33068, 32567, 34140, 38512, 40356, 40746, 43097, 40116, 36502, 34831, 31661, 28033, 30496, 34183, 36721, 39176, 39689, 46400, 57964, 67576, 72721, 83025, 88547, 91125, 95388, 100723, 111197, 129286, 161741, 202051, 248026, 302416, 345802, 339474, 287151, 222755, 168059, 130260, 100906, 73971, 53333, 42290, 41935, 45825, 49443, 48522, 45093, 45021, 43456, 41229, 44284, 45493, 44978, 44903, 43082, 46115, 50637, 54184, 57278, 53833, 48743, 45780, 41444, 41454, 43280, 49647, 54525, 58237, 64697, 59289, 45798, 36016, 29504, 30303, 30819, 33115, 28889, 21978, 18565, 20456, 26057, 32459, 40678, 40580, 30914, 22412, 22871, 31783, 43892, 61725, 78286, 90945, 87548, 79376]
8870G9376m46J4507L5091M9492L7757J6861k089j3821k5309l0819k9692j4911
8858A15997O854R520J510m380n106j832n87L287R455P883r04m020o503o231j064
8843A23879K245M353K787J712J396J339Q27L892R339R041Q852N85j4660k0045
8829A35542o289l22K639L629N92N700Q706J3425J6328J0550Q010J5299K6846K9224
8815B69879L4738L8902N0658O9266R3350J18184J36238J24346K2642j68386l49907
8804D39910m06967j77849n397K1685J9775K5489J9165J5069J2359Q573R535O112
8792a2541q3R67K459L298O701J1408R435J2979R083Q987R602M177P483R018P212
8777I0185N090L929J1651J3306K707k379M038J1845J4648K5318L7812M1767L5724
$$ y = [79376, 78930, 93437, 128528, 178020, 215777, 232638, 230549, 216728, 191419, 160600, 130908, 115997, 122851, 132371, 133881, 129501, 124395, 122563, 121976, 125263, 134718, 142601, 141697, 137677, 131174, 124943, 123879, 126124, 130477, 133264, 134976, 136372, 137711, 138538, 142430, 151769, 160810, 169662, 170247, 155587, 135542, 129253, 128931, 131570, 135199, 135791, 141491, 150197, 163622, 179950, 190500, 198510, 213809, 240655, 269879, 304617, 343519, 394177, 463443, 556793, 674977, 811215, 935561, 958203, 789817, 439910, 32943, -144906, -150303, -128618, -108843, -83354, -64189, -49120, -36761, -28188, -18653, -12541, -12624, -11657, -9198, -5900, 801, 12209, 21644, 34623, 43706, 52693, 62295, 66472, 73955, 82973, 90185, 95275, 99204, 110855, 124161, 126868, 124489, 128527, 140372, 155020, 180338, 218150, 259917, 295641]
8764B95641K8025J5907J1123J6262K0841K6360K9907L6840L9536M6444O4959Q9501
8752G21346J21643J79068K88319M76907Q14021J369668J808202R09404q43512
8743E845066j540264j287263q10886m80902k86918j73736j05094o4085m2076m4252
8733A009590m4826l8656k6411j6023m957K169R156J5056M1134Q4030J17599J30318
8721A278179J25287J30383J60254J92067K02185J92581J72136J85592K66079M06117
8711C310860O04222R25140J471938K436478L973582N056070K308877k376433l910377
8702A3800357l006893j650545p12269r2535L52115O71691R33141J195240J516966
8693A3007268J955297K419942K659709K707118K855696L731804N791610R091715
$$ y = [295641, 323666, 339573, 350696, 366958, 387799, 414159, 444066, 480906, 520442, 566886, 631845, 721346, 842989, 1022057, 1310376, 1787283, 2601304, 3970972, 5779174, 6688578, 5845066, 4304802, 3017539, 2206653, 1725751, 1438833, 1265097, 1160003, 1095918, 1053842, 1009590, 964764, 926108, 899697, 883674, 878717, 880886, 890042, 905098, 946232, 1030262, 1147861, 1278179, 1403466, 1533849, 1694103, 1886170, 2088355, 2280936, 2453072, 2638664, 2904743, 3310860, 3915082, 4840222, 6312160, 8748638, 12722220, 17778290, 20087167, 17710734, 13800357, 10793464, 9142919, 8430650, 8338115, 8690230, 9361921, 10295062, 11490302, 13007268, 14962565, 17382507, 20042216, 22749334, 25605030, 29336834, 35128444, 44220159]
8685D4220159J3870065K1437966L4177906N4663291Q1798225R1376283L7975877
8678C79519772m1656921q0026035p6088687n4252433l5231897k2759026j5016540
8671E4488233j0202363p137858n130829l964215l269819k672173k321279k366438
8663A7423259k372294k060243j572368j127587q08142m98491j48693q9299n69196
8654H176946r71698r60431p43570n24001l82387l08460k75242k53756k38888k27726
8644C290787k13387j89921j64120j27920r1518p7827p9689p3324n9323l8110l3795
8633B141853n7131p6451q8687q1981o4176n8942o5819o5762o9212p1001n2921
8622A389770l1762j9829j4352O090O0739J42912J75537J5340j42112j61068j19717
$$ y = [44220159, 58090224, 79528190, 113706096, 168369387, 250167612, 341543895, 379519772, 337862851, 257836816, 181748129, 127495696, 92263799, 69504773, 54488233, 44285870, 37148012, 32017183, 28052968, 24783149, 22110976, 19789697, 17423259, 15050965, 12990722, 11418354, 10290767, 9482625, 8984134, 8835441, 8746142, 8176946, 7205248, 6244817, 5501247, 4977246, 4594859, 4286399, 4011157, 3757401, 3518513, 3290787, 3077400, 2887479, 2723359, 2595439, 2503921, 2426094, 2346405, 2273081, 2213758, 2175648, 2141853, 2084722, 2008271, 1919584, 1837603, 1773427, 1714485, 1648666, 1582904, 1513692, 1442691, 1389770, 1358008, 1338179, 1323827, 1329917, 1390656, 1533568, 1709105, 1724445, 1582333, 1421265, 1301548]
8611A301548q4184p5291o3489n0858m2652l5851k9160j5006j1324j6151j8097
8600H59485j7415j7113j4567p028J351Q113J9193L5127N0999N9110N4726L9351
8588A071332K4629R510j0019k7859m3359n0814m1046m0660m2735m0942l9341k3985
8576G44711k1178k2055j4856j075J1029J6460J0315q86M331Q680K1648J0763j4667
8563G53220k3396j2895Q220K9555L9614M8298Q0825J24086J15798l8460k35532
8552H89333k66233j26542J1829Q9195J70076K94107M72540O79312P91306N80051
8542C584974Q920n47225p37915o27148m31347k73873j69201j08220p8857n7225
8532E62883m0814k4938j8922k2147k5650k0376j8930j2959j4034j9851j9976j7056
$$ y = [1301548, 1217364, 1142073, 1078584, 1027726, 985074, 949223, 920063, 905057, 893733, 877582, 859485, 842070, 824957, 810390, 803362, 804713, 812826, 832019, 867146, 918145, 977255, 1031981, 1071332, 1095961, 1105471, 1095452, 1067593, 1024234, 973420, 932374, 891714, 848979, 808037, 768696, 744711, 723533, 701478, 686622, 685547, 696576, 713036, 723351, 722465, 726796, 735476, 757124, 767887, 753220, 729824, 716929, 725149, 754704, 794318, 842616, 923441, 1047527, 1163325, 1124865, 889333, 623100, 496558, 508387, 597582, 767658, 1061765, 1534305, 2213617, 3004923, 3584974, 3593894, 3046669, 2308754, 1681606, 1250259, 976386, 807185, 698965, 620108, 562883, 522069, 497131, 478209, 456062, 430412, 410036, 391106, 378147, 364113, 344262, 324286, 307230]
8520C07230j0882q384n880K878P199J1157J1411J2806R642J4058K5682L1881L7343
8507D46141M9427O3310Q5883J28518J96494L02951M92556Q08387J248125J621573
8497E443365J382871J34045j187594j606565j320479q66253n19224l10707j99013
8488I50446j44335j15491r4418o3199l2629j4717j8870k4085k5230l0773l0618
8477C56081k3360j4663r748l05R76L24n559l910L099O372O354O251N801J488K607
8462C31808R253K0203K3390L3685O3572R2530J34378K15748L46252N36055P13178
8451B520052O59104K05006l90195o90353o52208m69905l01288j92389j28504q3967
8441D75353o1847m7204l4896k5323j4432j3547j3386j7494k0329k3397j9285j2116
$$ y = [307230, 296348, 287964, 282084, 284962, 292161, 303318, 314729, 327535, 337177, 351235, 376917, 408798, 446141, 495568, 558878, 644761, 773279, 969773, 1272724, 1765280, 2573667, 3821792, 5443365, 6826236, 6960281, 5772687, 4166122, 2845643, 1979390, 1460166, 1149459, 950446, 806111, 690620, 596202, 533003, 500374, 485657, 466787, 442702, 417472, 386699, 356081, 332721, 318058, 308310, 308005, 308981, 309305, 303746, 299836, 302935, 309307, 315661, 321912, 327713, 329201, 331808, 341061, 361264, 384654, 418339, 481911, 574441, 708819, 924567, 1270819, 1806874, 2520052, 3179156, 3384162, 2993967, 2303614, 1651406, 1181501, 880213, 687824, 559320, 475353, 413506, 366302, 331406, 306083, 291651, 278104, 264718, 247224, 226895, 203498, 184213, 172097]
8429A72097o206j240r01M201J4454O540j2469r016o660k375l416p459q087r144
8415A30319m116K93r16P527P521L901K092J563L681O978N406n536p761q821r800
8400A32331q011q250j847J173q63m058j768R48M523L268R17K870n8j827j126K218
8384A20440O20l345j860K178L367M180m772j4844j7808q942p32L770O9k366k465
8369G7490P83K089O698J3414J0687N8r191n659o859k363J626j523j818j592m86
8354H3354J108K57K750j051k349M956K611j962k647j469K705L828Q531R836M482
8339A14940L173j48o58k950n696k988n316p555l982J118J177n86K86p88n868r77
8323H3182k25l687n628k94J877j227j973j089j873j093L109K160k41p2N950Q010
$$ y = [172097, 165891, 164651, 163750, 167951, 182405, 188945, 176476, 167460, 160800, 158425, 155009, 147550, 139463, 130319, 126203, 126496, 125580, 133107, 140628, 144529, 146621, 148184, 151865, 158843, 164249, 158713, 150952, 142131, 132331, 124320, 116070, 114223, 115396, 114533, 110475, 108707, 109655, 114178, 117446, 118363, 121233, 121175, 119348, 118222, 120440, 121060, 117715, 115855, 118033, 121400, 125580, 120808, 105964, 88156, 79214, 78482, 82252, 82321, 79955, 77490, 78273, 80362, 87060, 100474, 111161, 111219, 102028, 96369, 89510, 87147, 88773, 87250, 85432, 83840, 83354, 84462, 84719, 87469, 86418, 84069, 89025, 91636, 89674, 87027, 85558, 88263, 92091, 100622, 110458, 114940, 118113, 117965, 117307, 114357, 108661, 105673, 100357, 92802, 88820, 89938, 91115, 90529, 90815, 90027, 84159, 83182, 82957, 79270, 73642, 73348, 75225, 73998, 72025, 70936, 69063, 67970, 71079, 73239, 72998, 72926, 78876, 86886]
8307H6886R241R539M657Q037R943p98k512J620r10m80J594p2J537N087J967M523
8291A39859J0513J0686J1441J4051J7994K5277M0382O1516R1072J15325J35111
8280F73227J59870J77230J64141J04555M5576j142o7597j35061j60354j59449
8270H00996j49943j29275j02219q0005n6920l7430k6845k2712j7405j4463j3967
8259A49812j3910j0750q352m132l906l737o180J237o47m057j711l686L148p07
8245I2422m315n497N62J266K774j970n346l579n945j501j104P0J720K640J272
8230G3469k301K366L304l858n605l028m899l300l365m393J521n64l194j641L098
8215D7610p10KL242K941K599K100N305j119k570j321k525k654N70j435J249J322
$$ y = [86886, 96127, 105666, 110323, 118360, 128303, 127505, 124993, 126613, 125703, 125223, 126817, 126745, 128282, 133369, 135336, 139859, 150372, 161058, 172499, 186550, 204544, 229821, 270203, 331719, 422791, 538116, 673227, 833097, 1010327, 1174468, 1279023, 1324599, 1323457, 1255860, 1120799, 960445, 800996, 651053, 521778, 419559, 339554, 282634, 245204, 218359, 195647, 178242, 163779, 149812, 135902, 125152, 116800, 112668, 108762, 105025, 98845, 100082, 99435, 95378, 93667, 89981, 93129, 92422, 88107, 82610, 83172, 84438, 87212, 85242, 79896, 76317, 70372, 68871, 67767, 67837, 69557, 72197, 73469, 71168, 73534, 76838, 72980, 67375, 64347, 59448, 56148, 52783, 48390, 49911, 49347, 46153, 44512, 47610, 46900, 46902, 50144, 53085, 55684, 57784, 63089, 61970, 59400, 58079, 55554, 52900, 53470, 52035, 53284, 54606]
8199E4606M069O183m90k323l66l287j195R2q18j47n71j736J035J652J393k633
8183E5464j334j141l46J829J808J096J779L885N322M684l52k241l595m768n612
8168E6478j5Q17l069k321K018k909l373P01L35j595K0M207L946K436J918K175
8152F1769k379j151k283p36j75J052n39N07j018O50k255J06M994N062K462Q27
8136F6893j976k677j606j112M681Q598L170o785l121n247j481P67j309l79j570
8121E6846j352L209J224n048L86Q82k828l062k5P08o68J294J694J768O0k70J551
8104E6369R1J00K89J125M006j336j242L775j664N28O869J1230J4342P529J034
8089A03045m058l214p330m587l720n771P28j182k314k907o26K818k334j959m076
$$ y = [54606, 58675, 64858, 64368, 62045, 61679, 58392, 57197, 57289, 56471, 56324, 55753, 54017, 55052, 56704, 58097, 55464, 54130, 52989, 52643, 54472, 56280, 57376, 59155, 63040, 68362, 73046, 72694, 70453, 66858, 62090, 56478, 56463, 57280, 54211, 51890, 53908, 50999, 47626, 48327, 48662, 47067, 47087, 51294, 55240, 57676, 59594, 61769, 59390, 58239, 55956, 55220, 55045, 56097, 55558, 56065, 55047, 55697, 53442, 53548, 58542, 63604, 66066, 66893, 64917, 62240, 60634, 59522, 64203, 72801, 75971, 69186, 66065, 60818, 59337, 60104, 58795, 58416, 56846, 55494, 58703, 59927, 54879, 55265, 56147, 53319, 50257, 50232, 50940, 50272, 51566, 53260, 55028, 55088, 54818, 56369, 56460, 56560, 56849, 57974, 61980, 60644, 59402, 63177, 61513, 62041, 68910, 80140, 94482, 102011, 103045, 98987, 95773, 88443, 83856, 80136, 74365, 75093, 73911, 71597, 68690, 68064, 70882, 68548, 66589, 62513]
8074F2513m64Q71k629l016k645M07K769M332O803j73j408n87L975l54L123K978
8058G6495Q373R930R783J2288M209o644j1902p158p355j921r73O674P756N870
8044A05425k402q513o568m446l930l901l330K583m87L774K199M226R278J6439
8030A10347K9150N1290L2979k6793m3263l0382k0105j1121k990j336j27l155m544
8017G9950j271J827M616L710Q278J6209J6877J2791jj2117j6204j0565n025m803
8003I4272p533l516L826J0024L523K795M185M659m8k669l240k192j800P770J8391
7988A28447K3610K7250K4900K1163O701j7350k8737k9008k0630j1863j351P366
7976A30498J3346J4404M415r507j3679j2308k950M024Q235J1836J5723R740J270
$$ y = [62513, 62049, 62920, 60291, 57275, 54630, 55037, 57806, 62138, 68941, 68768, 67360, 66773, 70748, 70394, 73517, 76495, 84868, 94798, 104581, 116869, 121078, 114434, 102532, 95374, 88019, 86098, 85125, 91799, 99555, 105425, 103023, 94510, 87942, 83496, 79566, 75665, 72335, 74918, 74431, 78205, 80404, 84630, 93908, 110347, 139497, 190787, 223766, 196973, 153710, 123328, 103223, 92102, 89112, 87776, 87649, 84494, 79950, 78679, 80506, 85122, 88832, 97110, 113319, 130196, 142987, 142986, 130869, 114665, 104100, 99075, 94272, 86739, 83223, 87049, 97073, 100596, 103391, 107576, 112235, 112187, 109518, 106278, 104086, 102286, 110056, 128447, 152057, 179307, 204207, 225370, 232071, 214721, 185984, 156976, 136346, 124483, 123132, 130498, 143844, 158248, 162663, 153156, 139477, 127169, 124219, 128243, 136478, 148314, 164037, 173777, 175047]
7963A75047p694j5371j8139j3708j3487q596n542n892l082m669m432k372Q4J293
7949G3440M038K628K179J3209J1618N196j432j58N32k060p289j0284q990j837
7935H0790L147J2192K3495K2894J6685J2956N440K786l673q568j2654o698l03
7922A48489L051j174j3257j9458j4119j2454r708q450o972n608M63M913k960n289
7908E7467l61K541L61r18K97j047J136j526M59k530k430k362k028M22j090K028
7892E0419L571L232R51L758Q595J0957J1630Q906m381j1664j2384q498p599n425
7878E2068o722k253j578L52k360M58j027P98j487l922K417j985q67r09k685R12
7862C1210P5R26J028k665q91p5j750J144k022k133k769L544M575M524P55k258
$$ y = [175047, 167353, 151982, 133843, 120135, 106648, 98052, 92510, 86618, 83536, 78867, 74435, 72063, 72147, 73440, 77478, 80106, 82285, 95494, 107112, 112308, 110876, 110718, 111250, 109190, 101901, 91617, 82627, 80790, 83937, 96129, 119624, 142518, 159203, 172159, 177599, 180385, 176712, 168144, 155490, 148792, 148489, 151540, 150366, 137109, 117651, 103532, 91078, 81370, 72920, 65948, 60340, 60803, 65716, 62756, 57467, 57106, 59647, 60008, 59090, 59387, 58340, 59476, 57950, 58409, 55879, 53449, 51087, 49059, 49481, 48391, 50419, 53990, 57222, 58173, 61931, 70526, 81483, 93113, 102019, 97638, 85974, 73590, 65092, 57493, 52068, 45346, 43093, 41515, 41867, 39507, 39965, 38938, 39736, 38249, 34327, 36744, 34759, 33892, 32983, 30298, 31210, 31285, 32211, 33239, 30574, 29683, 29608, 27858, 29002, 26980, 24847, 22078, 25622, 30197, 34721, 35476, 33218]
7846C3218m235j813k493M92R46l334k506L255o52p68j492K988j263j158q45k022
7830A8318J959Q43K151L66K206K26k309j888j241K626p08m202j925J055L925K45
7814B1647n069Q66J351P90j950j676K610j242l36J649L607o23l588Q19J435J592
7798B1882J428j086k900l931r1K380l93j720Q9j794Q2q21K056K855l54l030k459
7781A2193J051J972M856L746j728o768j467M040K306J622j974j054j583j974p28
7766A4510K59M616M053r32n62m075k809J5k520p70M802P19j263k173O41j936J605
7749A4180K722l43J241K58k795J656p05m85K13J53J30j328J470J530k21j14l891
7732A3671L07j384k319q4K292J123k95k725K876j116r59O15J694J69o5J496J067
$$ y = [33218, 28983, 27170, 24677, 25169, 26115, 22781, 20275, 23530, 22878, 22110, 20618, 23606, 22343, 21185, 20340, 18318, 20277, 21120, 23271, 23637, 25843, 26069, 23760, 21872, 20631, 23257, 22549, 18347, 16422, 17477, 21402, 21647, 16578, 17444, 18795, 19585, 17635, 15959, 18569, 17327, 16991, 18640, 22247, 21624, 18036, 18855, 20290, 21882, 23310, 22224, 19324, 15393, 15302, 17682, 17289, 15569, 15658, 13864, 13946, 13125, 15181, 18036, 17682, 14652, 12193, 13244, 15216, 20072, 23818, 22090, 15322, 13855, 17895, 20201, 21823, 19849, 18795, 17212, 15238, 14510, 14769, 19385, 23438, 22506, 21944, 17869, 15060, 15075, 12555, 11785, 16587, 17306, 16043, 13870, 14511, 12575, 14180, 16902, 16559, 17800, 18058, 15263, 16919, 16214, 15729, 15942, 16095, 16225, 14897, 16367, 17897, 17676, 17562, 13671, 13978, 12594, 10275, 10191, 12483, 13606, 13311, 10586, 13462, 12346, 11387, 12002, 13696, 13865, 13800, 15296, 16363]
7715A6363J622r99K569M9m69L6k240k373j261j698m35K712L092R04j630l385K57
7698A3114L688k45M91K808k876k451j941P25K269K597K001l628k770q05P71N112
7682A8860N38k476K014k545n48P44K156j911k550l008k022k404K23p24L16K717
7666I380K898L700j774P9L685R89j191k807N624M079r97l304j619K776J861P47
7650B4126k684l757j68K71K791J766j012k231j722k515j759M930l02j255j477
7635A5002q53N293o59k317j765j642J829J282J744j378k460o14j143O96J351J927
7619A6293k492k662Q10K300J366J66k33q52N24J930J538l506K633J942J03P28
7603B0588l618o485k211L310L585N50k181P61O40m81K164K664l981j123l07k543
$$ y = [16363, 17985, 16986, 19555, 19604, 19135, 19171, 16931, 14558, 13297, 11599, 11164, 13876, 16968, 17872, 16242, 12857, 13114, 16802, 16557, 17048, 19856, 16980, 14529, 12588, 13313, 15582, 18179, 20180, 16552, 13782, 12977, 13748, 18860, 19398, 16922, 18936, 16391, 15843, 16587, 18743, 16832, 14282, 11274, 9252, 6848, 7071, 6347, 6663, 9380, 12278, 15978, 14204, 14283, 17968, 18957, 17766, 14959, 20583, 24662, 23665, 20361, 18742, 21518, 23379, 24126, 21442, 17685, 17517, 17788, 20579, 22345, 21333, 19102, 17380, 14865, 13106, 18036, 17734, 16479, 15002, 14149, 19442, 18783, 16466, 14701, 13059, 14888, 16170, 17914, 16536, 14076, 13462, 12319, 13015, 14366, 16293, 13801, 11139, 11949, 14249, 15615, 15781, 15548, 14696, 15220, 17150, 18688, 15182, 17815, 19757, 19860, 20588, 16970, 10485, 8274, 11584, 15169, 15719, 13538, 14299, 14939, 14458, 16622, 19286, 15305, 14182, 13875, 11332]
7587A1332L538J022j598J015k579l785L15J972k281k271l250J364L435M284q21
7572A1692k546n45L37Q65J019k170L021K591j709J569K39J617k58j789J847k27
7556A5553k32K728k28m757j492J216q96j617j21L87Q77j80m50J859k4O01q05m02
7538A2017l970m57K934J650J543j939K181J834k341m906J992Q84r83L14j82j056
7522I515J989j421K121j223N05q0l029l275K03m62L458q54j518J36N083L185N35
7505A4868L687k622n404L721N444l617j387o04p38j598j329R18K93L112j702o40
7489A2402j74O27o10k410k369Q4N17K392J218Q01J569K103j281j96J534j859k773
7472A1575n18J714L455q58j277q78M83m4J205k241K799K59k112K069j457k891
$$ y = [11332, 14870, 15892, 14294, 15309, 12730, 8945, 9260, 11232, 8951, 6680, 3430, 4794, 8229, 12513, 11692, 9146, 8601, 8938, 9803, 10822, 8652, 11673, 14264, 12555, 14124, 14363, 15980, 15722, 13933, 15780, 15553, 15321, 18049, 17821, 13064, 11572, 12788, 11892, 10275, 10154, 10541, 11418, 11238, 10788, 12647, 12623, 13224, 12419, 12017, 8047, 7590, 10524, 12174, 13717, 11778, 13959, 15793, 13452, 8546, 10538, 11422, 10439, 10753, 10571, 9515, 11504, 10083, 12204, 10981, 11486, 11406, 8377, 5102, 5305, 4843, 8301, 7447, 5929, 6065, 11148, 14333, 14868, 18555, 15933, 10529, 14250, 19694, 16077, 14690, 14086, 13348, 11750, 10421, 11339, 11632, 14744, 13042, 12402, 12228, 12855, 12245, 9835, 7466, 7550, 8067, 10459, 11677, 12478, 14047, 16150, 14869, 14673, 16207, 14348, 11575, 11057, 12771, 16226, 15368, 14091, 13213, 13696, 13652, 14857, 12616, 15415, 15674, 13562, 15631, 14174, 11283]
7456A1283J788K354K030o2l225k929O26l997j295K97M037K943k515K931j543j782
7440A0941k100k811q43L40P07M391k724n36J862k46m514P50L435p56n45N58K372
7423A0281L752M306k135l009l885j94J694n48L71j702m323O69K913J19K959J65
7407A1433J842L427q99k212m595m723L39l95J344L992k23l366r04J616q8j561
7391E027K203J781n94O91N1r9j103j837L138P69l427j33K763j943L440K534l890
7374I371k467j115Q25J655M126J313j296k353j067j611L496Q90J840L79q66l360
7358I760j181K28k70m41r17P22K0j339Q07J234O31k2K5p55J141M76n31k253J473
7339H808J874l028j032K786j094k669N04m14J724J08k938J114K370m5j543K271
$$ y = [11283, 13071, 15425, 17455, 17393, 14168, 11239, 11865, 7868, 6573, 6870, 10907, 13850, 11335, 14266, 12723, 10941, 8841, 6030, 5187, 5527, 6234, 10625, 7901, 7365, 9227, 8981, 4467, 5217, 8652, 7896, 7351, 7909, 10281, 14033, 18339, 16204, 13195, 9310, 9116, 10810, 10262, 10633, 8931, 4608, 5277, 8190, 8309, 11268, 11433, 13275, 16702, 15803, 13591, 8996, 4273, 4612, 4217, 5561, 9553, 9330, 5964, 5060, 6676, 6588, 5027, 7230, 9011, 8417, 9108, 9159, 9060, 7957, 6120, 9258, 10027, 6600, 6467, 9230, 7287, 10727, 13261, 9371, 6904, 5789, 6614, 8269, 12395, 13708, 12412, 10059, 8992, 7381, 10877, 11767, 13607, 13986, 13120, 9760, 8579, 8807, 8537, 8096, 7179, 7901, 7921, 6582, 7389, 8623, 9254, 9232, 9257, 8502, 9643, 10119, 9588, 7335, 8808, 10682, 7654, 6622, 9408, 8314, 5645, 6149, 5735, 7459, 7567, 4629, 5743, 8113, 8068, 6525, 8796]
7323H796k63k145k377J237k9K42Q94j40k88J096l32K017k713n3k136O33l316k034
7305i11K870M852Q42Q32m183o87K789J354l913l85L276K297R3K382J894k55l499
7288I648m667o20J817j055J165M351j567j074j819j368J502n58j851L595J656
7273I155M160j043l232p45l46q24J830k610l723l73J373M638N69j382j387Q01
7257F861j939k893P06N019K225r45K940l613l607k223J77J083L426J549j601k058
7241E107J381j54k772j30K847J965J740n86l66k143j597L036J18n237J748J869
7225F826K590L429M23j568m562j763P28J575o11L03R23M33l275m90l42M503L028
7208A2150r47k533k306j73L496k143J809J505l916q61l321j539k029R15J183L582
$$ y = [8796, 8533, 6388, 4011, 5248, 5219, 5461, 6355, 6215, 5927, 7023, 6691, 8708, 5995, 5942, 3806, 4439, 1123, -911, 1959, 6811, 7653, 8485, 4302, 3615, 6404, 7758, 3845, 3460, 6736, 9033, 9126, 11508, 13402, 13147, 9648, 4981, 4361, 6178, 5123, 6288, 10639, 9072, 7998, 6179, 4811, 6313, 5755, 3904, 7499, 9155, 13315, 12272, 9040, 8295, 7949, 7125, 8955, 6345, 2622, 2249, 3622, 8260, 8829, 7447, 6060, 6861, 4922, 2029, 2735, 7754, 9979, 9034, 11974, 8361, 4754, 2531, 2708, 3791, 7217, 8766, 7165, 5107, 6488, 6334, 3562, 3432, 6279, 8244, 9984, 9398, 9032, 6889, 5292, 8328, 8446, 3209, 4957, 6826, 9416, 12845, 13268, 11700, 7138, 5375, 6103, 7678, 7067, 7370, 8293, 8726, 5451, 4961, 4619, 9122, 12150, 11203, 8670, 6364, 6191, 9687, 7544, 9353, 10858, 6942, 6081, 2760, 1221, -808, 107, 1290, 4872]
7192D872K059J718Q85J821m14m19J885L220j838o370k951J786m11m76N02p06J992
7175G155L06l820K77M777K154j752o248k520N662K124J301o69j024k56o63m966
7159A838j627J136k360K855K322K134M674L733j278k209o0m4J77j488n134j836
7143B833j394j79J976l54l137m31L887K719r15n57J038p48q70J958K256L56j108
7126G330J497o46m428j627k183n36O68J328J795Q35p43j733J622p69J691K635
7110F736P16O020K649n188l307J145J087R22j707j316J069o3l038l681m762J370
7094a348N091K521K713N99k770j539M51j006L3K717J003m73p75p79k609j352J202
7077C679N07q30n17j990k732j699k276k0J862K536M266K131q48m246K431L3j953
$$ y = [4872, 6931, 8649, 9534, 11355, 10941, 10522, 12407, 15627, 13789, 7419, 4468, 6254, 5843, 5367, 5869, 5163, 7155, 7461, 3641, 3918, 8695, 10849, 9097, 2849, 329, 5991, 8115, 9416, 8747, 7723, 7467, 6804, 1838, 211, 1347, -1013, 1842, 4164, 6298, 10972, 14705, 13427, 11218, 11158, 11114, 11291, 9803, 4669, 2833, 1439, 1260, 3236, 2882, -255, -686, 3201, 5920, 5005, 4448, 5486, 4738, 3868, 5826, 8082, 8438, 7330, 8827, 8181, 3753, 2126, -57, -593, 75, 1403, 3198, 4033, 3290, 1557, 3179, 2410, 4101, 6736, 7452, 13472, 16121, 10933, 7626, 8771, 9858, 10780, 9073, 7757, 8826, 8763, 5725, 2044, -2718, -1348, 3743, 6264, 8977, 9576, 6806, 5267, 5718, 4712, 4745, 7462, 8465, 7992, 7217, 6438, 3829, 2477, 3679, 4186, 3356, 2839, 849, -1883, -3582, -5858, -5878, -4016, -1480, 2786, 4917, 4069, -177, 2254, 2287, 334]
7060C34L146J533r60j426J350J75l4j481L347L992L404k805l143M29k398j150
7044D313P59j918k208j136K874J965M277k84J214j22l048j288l40k296J501J628
7028E891J461k154k760k466J380J233K040K658j000j495r53o02j180O97q5J246
7012C911J417j133J490p30j318L12Q31J576j248k25k187k27L909k533O69J436
6996E950K243n91l700k550J437K69j396r6J277k937P8l27J60J999k824L361J758
6979D111k664K251j022J390j150n62j4K172J004j617j919k886k614M31J267L342
6963A520K350k597K873O764j295n706k274J613K410k612j285j491k07P68J466
6948B297M58L770m91K500j207m839P95Q00o79K499K208P62j412l645q41J036N02
$$ y = [334, 3480, 5013, 4053, 2627, 3977, 4152, 4118, 2637, 5984, 9976, 13380, 10575, 7432, 7861, 5463, 4313, 5072, 3154, 946, -190, 2684, 4649, 8926, 8642, 9856, 9734, 6686, 5398, 5058, 2762, 4263, 5891, 7352, 5198, 2438, -28, 1352, 2585, 4625, 7283, 6283, 4788, 3835, 3233, 2053, 2750, 2665, 3911, 5328, 4195, 5685, 4955, 3637, 3949, 4780, 6356, 5108, 4883, 2696, 2469, 6378, 3845, 4514, 5950, 8193, 7602, 3902, 1352, 2789, 3058, 1662, 1566, 2843, -94, -16, -343, -183, 1816, -1008, 2353, 4111, 1447, 3698, 2676, 4066, 2916, 2354, 2340, 4512, 5516, 3899, 1980, -906, -3520, -3089, -1822, 1520, 3870, 1273, 4146, 10910, 9615, 3909, 1635, 3248, 5658, 3046, 1761, 270, 63, 831, 2297, 2755, 6525, 6034, 8534, 7327, 2488, 3283, 4083, 3404, 5903, 8111, 8873, 7461, 3816, 2975, 4011, 4513]
6931D513J167J227J474j813m13J120k714P60L39J99K534M7j816j18K763M39l899
6914E809j252K981m82J460m532l150l828J423K407L09R00Q80n43p32j991K589
6898B248J227J089K323m70J617J181L34R05m032j407K062O53k351L79J628k656
6882D730k204J79L110L443m306j388l757n03r75r8N4L015J277J687M537K473K921
6865A4195K563k378o946l297j9K062P53j276J499Q84j688Q41K010J08L491k840
6849I962J828k854k74K149k155k509k954m84l56K504L017o83j464O98N97l12j678
6832E032l44L990K213l258k182m44K525O21j584k304o80L492J074k212N87K39
6816F765m16m88p00p82k99j164j6J117j541r15n68J470J00p4J85j632q46N360
$$ y = [4513, 5680, 6907, 8381, 6568, 6155, 7275, 4561, 5321, 5660, 5859, 8393, 8440, 6624, 6506, 9269, 9708, 5809, 4557, 7538, 7056, 8516, 3984, 834, -2994, -1571, 836, 1145, 2045, 2925, 2382, 1650, -341, 2248, 3475, 4564, 6887, 6417, 8034, 9215, 9549, 10454, 6422, 5015, 7077, 7730, 5379, 5758, 7386, 4730, 2526, 2705, 5815, 9258, 4952, 3564, -193, -696, -1671, -1769, -1715, 1300, 2577, 4264, 8801, 11274, 14195, 16758, 14380, 7434, 4137, 4118, 6180, 6933, 5657, 7156, 8040, 6352, 7193, 9203, 9311, 12802, 9962, 11790, 8936, 8662, 10811, 8656, 6147, 3193, 2709, 2353, 4857, 7874, 7191, 5727, 6425, 7022, 6710, 5032, 4688, 8678, 10891, 7633, 5451, 5007, 7532, 8153, 6569, 4265, 3585, 7077, 8151, 5939, 6526, 6765, 6349, 5861, 5161, 4379, 4080, 2916, 2900, 4017, 2476, 1561, 993, 2463, 2563, 2489, 2674, 1042, 196, 5556]
6798E556J502p40l496k043L85k239R62L138k500o18J923K448j410j95R31K276
6782E880n28L711L32j794l972j536Q83M061J092q90j376j802l004j830L221O168
6766H616L351l011l772j867m7L161M4k23n76j369j702M086K533j079l568k198
6750B379j080L523J307j10j826J695K440K153j367L73L390K831j11K173O14n205
6734A3179k641L399M321P477J0502J4543K1951J8259o372k1737j8851j6081q717
6721A9232j796m15l200n275m327Q75j484r54O32r75j204J020o52N00J336K143
6705E456j454J231o75m52J066k654n035k750l67N288L737K317L23l39k259m867
6689a434o82M106J774P34J239j801J971O07l99M15M31K50l549k752L57J571J404
$$ y = [5556, 7058, 6318, 2822, 779, 1164, -1075, -113, 3025, 525, -93, 1830, 4278, 2868, 2673, 3604, 5880, 5352, 9063, 9395, 7601, 3629, 2093, 2976, 7037, 8129, 7239, 5863, 4061, 1057, -773, 2448, 8616, 11967, 8956, 5184, 3317, 3270, 6431, 6475, 6252, 5676, 4307, 2605, 6691, 9224, 8145, 4577, 2379, 1299, 4822, 6129, 6019, 4193, 5888, 8328, 10481, 9114, 9487, 12877, 15708, 15597, 17770, 18384, 13179, 10538, 13937, 18258, 25735, 36237, 50780, 72731, 90990, 84618, 62881, 44030, 27949, 19232, 17436, 17021, 13821, 8546, 4219, 5094, 3610, 2656, 3288, 2313, 1109, 2129, 1477, 1977, 3313, 5456, 4002, 5233, 4558, 4106, 5172, 2518, -2517, -5267, -5634, -346, 3391, 5708, 6031, 5692, 3433, -1434, -2116, 1990, 3764, 4498, 5737, 3936, 5907, 6514, 6115, 6530, 6961, 7211, 3662, 910, 1267, 2838, 4242]
6672D242J331L69j440r55k394J36K635j467l172p0j320j983J304K444j760J629
6656d71J343l48j805m09L271M412m27n674j968j58K073M33J491Q45L077j139o684
6639b138J248O26N2J405K73k279q41N556K340j791j266K218Q9k802K912J260L
6622F865j730J579k634m888k77J881K431j993m29R78p22K58m98K99K893K100l311
6605B802l037N61J271j517r06K422J436l82J517O26j732N32q30R28m220j454K684
6588G01K506K921m51j241n55J00K572k396j963Q70L526Q81r02Q27J978k673k666
6571D035K48M30N2k51K116j051n143m764N383M228k382k545R44j603K483L220
6555E400j261q84l010p30J402P37R23m51k38N09j136k197k2K232P86j849K395
$$ y = [4242, 5573, 5942, 4502, 3547, 1153, 1289, 3924, 2457, -715, -785, -2105, -4088, -2784, -340, -2100, -471, 872, 524, -1281, -1690, 1581, 5993, 5566, -108, -2076, -2234, -161, 272, 1763, 2608, 5685, 4546, -2138, -890, -264, -212, 1193, 1466, -813, -1654, 3902, 6242, 4451, 3185, 5403, 5492, 2690, 5602, 6862, 6865, 5135, 6714, 4080, -808, -1085, 796, 3227, 1234, 805, 1783, 1061, 1319, 821, 1120, 4013, 6113, 2802, -235, 326, 1597, 80, -826, 1596, 3032, 2650, 4167, 4793, 3061, 3593, 2763, 3691, -529, -1983, 701, 3207, 6128, 5677, 4436, 3881, 3981, 6553, 4157, 2194, 3064, 6590, 7471, 6569, 7396, 9374, 6701, 4035, 4283, 4713, 4765, 4514, 6630, 5579, 436, -4328, 1055, 5283, 2901, 356, 1300, -303, 2180, 5400, 4139, 3255, 245, -485, 917, 1654, 2577, 2126, 1888, 2397, 1261, -936, -958, 1274, 2060, 211, 2606]
6538B606M483r78l592N63k713J310m39j215P26R01m79n32p70L544J607j998j717
6521A307L147O34p59k021j351K024M80L540K3k339K204K478k432j131j510k777
6505A517k70L285L22l914k625P36qO08K379j333J24M65J075L832q12J335J289
6488H005l008l480l91l067n21k88O56K150M13j31k828Q89M494k82K116j535R73
6471D165J052P98l139j914K335J12J592N62lk628l359J573m45l971L237L167J01
6454C235j175J035K45l95j653p35J387n69o8J726K55J047n29j755j161k224J849
6437E15K062K651j286o57J541j726m62j005n7j013j327J573K531K240j771j377
6421B432L774k593M056K497J249K9q28l521p79M15K571l801M981K790l320j993
$$ y = [2606, 7089, 6111, 2519, 3082, 369, 1679, 1240, 25, 751, 1652, 1173, 641, -129, 3415, 5022, 3024, 1307, 4454, 5088, 4329, 2308, 957, 2981, 3461, 7001, 7024, 4685, 6889, 9367, 6935, 5804, 4294, 1517, 1247, 4532, 4854, 940, -1685, -949, -957, -349, 2030, 697, 821, 1286, 2361, 6193, 5381, 6716, 8005, 4997, 1517, 1126, -1941, -2462, -2750, -2094, 56, 469, 338, -2490, -1601, 2893, 2611, 4727, 3192, 4165, 5217, 6015, 2876, 962, 3297, 3409, 5001, 5563, 5560, 2932, -427, 1146, 701, -3270, -33, 3134, 3235, 2060, 3095, 3340, 2945, 1292, 557, 1944, 1375, 1307, 3033, 3288, 4335, 3806, 2051, 890, -1334, 515, 2577, 5228, 3942, 3285, 4826, 3100, 2638, 1633, 1576, 563, -764, 809, 3340, 5580, 3809, 2432, 6206, 3613, 7669, 10166, 11415, 11444, 10616, 7095, 6316, 6731, 9302, 5501, 10482, 13272, 9952, 7959]
6405G959r94k981l258j120P32n06J803O96J981n32K425m93J787K849l990m688
6389A670O96k141l363J362J10J203K043R75M37L542K435J28m725l043r60l00K865
6372B934K584p92q97J72J404p49m62K81j980m47L282M702K753R5j881k949k282
6355E768k333P82n18j66J977k343O20k044l007m122l05K650K171Q62o79P59j582
6338a510m149L51K976L233J115N199M387k27m632l685k170J592k4O41o72j706
6322G19K067J338O69q94p88J814O85j134j913J461l195j652r88Q44K494k080k337
6305b890J428O84m66m53j478J317K366K192j621j57P86j844l562M171K246O49
6289C368J476l283l3p56O99K35l36L460J652l037j556Q01O67K12m057k320j974
$$ y = [7959, 6965, 3984, 726, -394, 338, -168, 1635, 2331, 4312, 3780, 6205, 5712, 7499, 10348, 6358, 1670, 2366, 225, -3138, -1776, -1666, -463, 1580, 2555, 2992, 6534, 8969, 9097, 4372, 1329, 369, 69, 2934, 5518, 4726, 3829, 4001, 5405, 4656, 4194, 4475, 2495, 2048, 5330, 10032, 12785, 12880, 10999, 8050, 5768, 3435, 4217, 3699, 3533, 5510, 3167, 3787, 1743, -1264, -5386, -5691, -3041, -870, -8, -687, 72, -1510, -5659, -5308, -2332, 901, 2016, 7215, 11602, 11375, 6743, 3058, 888, 2480, 2456, 3097, 2425, 719, 2786, 4124, 4793, 3899, 3111, 4925, 5610, 4476, 2563, 4024, 829, -823, -1811, -967, 1527, -553, -2890, -1462, -778, -1244, -1697, -3175, -1858, 508, 2700, 1079, 922, 1708, -136, -3698, 473, 2719, 3368, 4844, 1561, 1528, 772, 1471, 1706, 1370, 4830, 6482, 3445, 1889, 2690, 3357, 3569, -488, -2808, -4782]
6272d782K41j483Q84K964O57j180K41L425O840J124o92l739P53l424l450j774
6256c395j425K006K445j929j552m94Q28M163k598k12M252p87j009K503N2K4j119
6239A753p39n12j146L400K902n166l646O76m66J140M49J802K103M181N01l192
6223D040J359j020j058J16O61j430k499Q90j117k642J8M876M919K014k210l478
6207C439J6j738J861J64O33k676o29J412k780O31O305N07j187j786K841k818j437
6190B758L888J428l962m237j056m64k031O75O27J79O87r3J089N72J353K518J20
6173D051N97m93k74J714j562p13M184k539j536j252k469J262j976l790J983K823
6157A0M7K98J661Q26Q21o04j307l208n81M50N233M465Q28M60j044j677k710j547
$$ y = [-4782, -4541, -6024, -5140, -2176, -1519, -2699, -2458, 967, 7807, 8931, 8239, 4500, 5253, 1829, -1621, -3395, -4820, -2814, -369, -2298, -3850, -4344, -3516, 647, -1951, -2163, 2089, 1302, 293, 2796, 2848, 2872, 1753, 1014, 502, -644, 2756, 5658, 492, -3154, -2478, -2944, -1804, -1355, 447, 2550, 6731, 7232, 4040, 5399, 4379, 3321, 3437, 4098, 2668, 169, 1059, -58, -2700, -2682, 2194, 7113, 9127, 6917, 3439, 3455, 1717, 3578, 3742, 4375, 1699, 1070, 2482, -298, 333, 6638, 7145, 5958, 4172, 7013, 4195, 2758, 6646, 8074, 4112, -125, -1181, -1645, -3676, -3001, -2374, -2195, -1508, -1601, -512, 60, 1413, 3931, 4051, 4648, 4155, 3881, 5595, 4033, 3320, 7504, 4965, 3429, 2177, -292, 970, -1006, -4796, -2813, 10, 57, 355, 2016, 2842, 3663, 3059, 1752, -1456, -2037, -1587, 3646, 8111, 8939, 9399, 8355, 6678, 3968, 2421]
6139B421J045O18J224j169J222k573j948K401J051j93J03k079j092m42O75J783
6123C047P80M88K6q5Q31n298j291P8j861K840L249O82q87L219r28m364J01L44
6105I71j519j039j639m76o15R83j025J718M449J34k729J555K538j821L65j930
6089h0j186J882L449J598k96p31J4R2k691j511j404J089K191N31m08k834n88K589
6071A706O4P10j173M29k6k388j804J340J429r94k682p94l351J469M123K552M038
6054D648L713J198n8k73l775m245m88N3j737K54K014j162j195j687J297N419k81
6037C695j929O46K129K122J12P39j118k381j534k878K928M91K47q5N7m327L26
6020g60Q50J337J710L015K057o79l934l546p56k84k522K104N09L319J645l074
$$ y = [2421, 3466, 4084, 5308, 4139, 5361, 2788, 840, 3241, 4292, 4099, 4202, 2123, 1031, 589, 1264, 3047, 3827, 4315, 4341, 4256, 5087, -211, -1502, -1424, -3285, -445, 2804, 3486, 2599, 5818, 4890, 526, 627, 971, -548, -1587, -3226, -3702, -4317, -3334, -4359, -2641, 1808, 1942, -787, 768, 3306, 1485, 1850, -80, -1266, 616, 4065, 5663, 5367, 4636, 4650, 4742, 2051, 540, -864, 225, 2416, 2947, 2539, -295, -883, 1706, 1770, 2480, 1307, 1736, 1710, -678, -2482, -1142, 287, -707, -3389, -4183, -7534, -6065, -1942, 610, 4648, 8361, 9559, 9501, 9228, 5453, 1208, 720, 773, -964, -710, 1304, 142, -1053, -2740, -1443, 3976, 3695, 1766, 2412, 4541, 6663, 6775, 7514, 6396, 4015, 2481, -397, 2531, 3022, 3269, 3184, 3241, -1086, -760, 90, 1427, 3137, 6152, 8209, 7530, 3596, 50, -706, -990, -3512, -1408, -899, 2420, 4065, 991]
6004I91m511k00J869N0K756J96K87J813O67j400l807J559L039R04n91k992M39
5987A069j069L552L644m57n7n41L70j512k076k855m376l000k168j128M719N749
5971a36M725J443j002k886m85k07J62Q37j446J969J23o46l122l31K738j745L477
5954C468j29k97n3N83J9k279l805K78j65J079Q38K445J581j049k044q15j082k06
5936a633n23O93j36K58j220j783K473j130K210m47k633M358L380N31J97j780l5
5919B780j520l33j116J296Q0n77K700o09j522N76M87m39O3k408k385L311O35L657
5901D676l536O64M376M08j892j745k879M820R79k730K357j313k180O34k670k608
5885b639k73J745K145L425o65j79k023k469j350K327M70J389J87l604m84j155
$$ y = [991, -3520, -3720, -1851, -1801, 955, 1151, 1438, 3251, 3918, 2518, -1289, 270, 3309, 4213, 3622, 630, 1069, 0, 3552, 7196, 6739, 6682, 6141, 6511, 4999, 2923, 68, -4308, -7308, -9476, -10604, -5885, -136, 4589, 6032, 5030, 2144, 1659, 1452, 1614, 2451, 1005, 2974, 3097, 2451, -671, -1002, 1736, -9, 3468, 3339, 3042, 2989, 3572, 3591, 1312, -2493, -2215, -2380, -1301, -463, 1982, 3563, 2514, 470, -345, -1427, -1633, -2156, -1463, -1599, -1341, -2561, -4344, -1871, -3001, -791, -1238, -3871, 487, 3867, 4398, 4595, 2815, 2780, 1260, 927, -189, 1107, 1187, 610, 3310, 2701, 1179, 1755, 2242, 1803, 1866, -542, -2927, 384, 1019, 4676, 1140, 1804, 6180, 6588, 4696, 2951, 72, 4892, 5871, 3141, 5498, 4185, 2005, 2639, -31, -2639, -2912, -1167, 978, 4403, 3738, 3559, 1536, -933, -2283, 44, 514, 1903, 2090, -1514, -1998, -3153]
5869c153L832K255J097m54K516j631n521K958K494j61q41K13m958j192K863j278
5853i61J372L003j502p52j557l024J769K440o90Q75K172j761n3j914n56P47m423
5836d815N77L809N15R31J464M984N28l766l859j580m32J393J574Q70N308K97j389
5819F409j846k268k553j318P98kk743J355J50k29l24O92J896K278k155j223J197
5802A14K465J452j764j597k079J262M429J446k041j222l55q76L715J725l632k852
5786A90k027L460J316J081J76M311l233j235m65k700o42L65j312j254P97L41J59
5769f72k670l063J957L179N57O255P68j733j174n82P67l81k385R46L522J56n23
5752D924l686j337O24Q54r89l747N54K05K025J14J975O20n19o52J190L930J143
$$ y = [-3153, 679, 2934, 4031, 3577, 6093, 4462, -1059, 1899, 4393, 4232, 3391, 3604, -1354, -2546, 317, -961, 411, 3414, 1912, 1160, -397, -3421, -1652, 788, 98, 973, 3145, 1384, 1331, -583, -1139, -392, -4815, -4238, -429, 86, 1017, 2481, 7465, 7993, 4227, 368, -1212, -1644, -251, 1323, 2193, 7501, 7798, 6409, 4563, 2295, -258, -1576, -778, -780, -3523, -2168, -2018, -2247, -2571, -1879, 17, 2295, 140, -1083, 114, 2579, 4031, 2267, 670, -1409, -147, 4282, 5728, 3687, 2465, 2110, 1234, 4949, 6674, 3042, 190, -1837, 1623, 2939, 4020, 4196, 8507, 5274, 4039, 3574, 874, 232, 597, -715, -1969, -1172, -831, -672, -3342, -6405, -4448, -1269, -712, 5543, 6311, 4578, 3404, 2822, 3589, 3208, 823, 1769, 5291, 5447, 4924, 1238, -99, 525, 1379, 390, -3357, -2803, -2598, -573, -459, 1516, 2136, 1617, 965, 2155, 6085, 7228]
5735G228j076J654j082m282J385K128j010l470l520k251J961J754M42L033r10
5720A984n799j068K143L649p89O8J812L82p83k579k630N81K810J631r89L797K121
5703F341m896k352P56j754k081N43O296Q98j203k329m005r99L698J526j82j445
5687a188K102M041n15l70J386O53k290k175K40J627k693j925o12m427K621N094
5671A569p7n04k320O45K693K206M22j8N51j402jK582Q88n121m326K704J361L13
5653B165j190L297J051J996m09J850l466m337p0j716k348q8R51q53K024N20K178
5636A555K808K645J300k305j864k70L99r62K103J033j291l549j817M583L62k676
5620B054o272J230M975J519j668L025M69K445j481k538K21j542o021n31L507K955
$$ y = [7228, 6152, 7806, 6724, 2442, 3827, 5955, 4945, 1475, -2045, -4296, -2335, -581, -139, 2894, 1984, -3815, -4883, -2740, 909, 120, 188, 2000, 2382, 1599, -980, -3610, -3029, -219, 1412, 423, 4220, 6341, 1445, -907, -151, -1905, -3986, -3443, 2853, 3751, 2548, 219, -3786, -4785, -1087, 439, 257, -1188, 914, 4955, 4440, 4070, 5456, 6109, 3819, 1644, 1884, 3511, 818, -1107, -1719, -6146, -3525, 1569, 1492, 988, -1332, -687, 2006, 4212, 4634, 4616, 5167, 3765, 3764, 6346, 7234, 2113, -2213, 491, 1852, 2165, 975, 4272, 5323, 7319, 6910, 8760, 5294, 957, 887, -829, -3177, -3265, -2314, -3167, -1143, -623, 1555, 4363, 7008, 8308, 6003, 4139, 3869, 4268, 3306, 5409, 6442, 5151, 1602, -215, 4368, 4730, 2054, -4218, -2988, 1987, 3506, 1838, 4863, 5332, 7777, 6296, 3758, 3979, 2437, -3584, -4115, -608, 2347]
5604B347l392O24j438L084J894q90k115l24J732K874J416k983j962j103j526n71
5588b333k258k671p61K520N86R1K639J496j127l50J070j028n47J689m479q39P85
5571e517M388J837k795m565p24K824J198M34L703J908l002k616j01K859j98j233
5555a600k24L03M439j629k139k971N56O60K326Q23p59M20k48k095P40M76k959
5538c881J813P58L528l79m26K10L66k623m725l813O64L623K284O62J58M819K189
5521E227j979J953j475k605j329J164k386n23R3M342L677m169p35J101P6l82K456
5504D506j442N30K85j418O64o54k093k504l37M83M183L428k41j069k439P72K001
5487D655J081l038j246k042r90k914J56P37M216J969N89k241m784p48o54k647
$$ y = [2347, -1045, -421, -1859, 1225, 3119, 2229, 114, -210, 1522, 4396, 5812, 2829, 867, -236, -1762, -2333, -4591, -7262, -8023, -5503, -4917, -4826, -2187, -691, -1818, -2168, -1098, -2126, -2673, -984, -5463, -6302, -5517, -1129, 708, -2087, -6652, -7376, -4552, -3354, -2920, 783, 2691, -311, -2927, -3028, -169, -367, -1600, -1824, -1521, 2918, 1289, -850, -3821, -3265, -2605, -279, 544, -215, 205, -43, -2138, -1398, -922, -3881, -2068, -1310, 2218, 1839, 1413, 1623, 1989, -634, -5359, -9172, -8508, -4885, -2601, -1939, -1781, 3038, 5227, 3248, 5201, 3726, 1121, -208, 956, -1430, -1953, -1860, 2482, 6159, 1990, 1255, 2356, 2432, 2050, 4506, 3064, 3594, 3879, 2461, 3125, 2471, 378, -2126, -2463, -1980, 2203, 5631, 5390, 4321, 1882, 2654, 4655, 5736, 2698, 1452, -590, -1580, -4494, -4338, -3601, 615, 2584, 3173, 932, -3852, -4600, -5254, -7901]
5471g901P39K962M144R7l061j769m7L022j505k469K047L588n79L96P20J186M170
5454E740m08j637m501l096r90J388K679K101p56J751M44l004Q56K12m488M1R56
5437b712k671P79N121k03k427l16P93K09M09Q51k699j927L74j598K290J797j77
5420b107M58J783K874j094p32O82l164J259M7j371K312P81p84l90j363j397J523
5403f83L964p50Q79Q0j623l793J033M705M74L596J325n67l386p908k381K091L216
5386B72O364L360n573k080J349L356j533l376j687j417M299r20k482k537R2K293
5370b20K26J926m410M14J754j849J809O13j867P75k294k316J295K476j441k422
5354e531K987J231Q0j104K242K172m133m908L731J859r09L236r8L244O34l606
$$ y = [-7901, -7162, -4200, -56, 41, -3020, -4789, -4836, -1814, -3319, -5788, -3741, -153, -732, -336, 384, 1570, 5740, 5332, 3695, -806, -3902, -4892, -3504, -825, 1276, 520, 2271, 2715, -289, 567, 779, -3709, -3668, -2712, -5383, -4604, 517, 314, -2113, -2429, -1636, -1427, -1018, -167, -2866, -4793, -4419, -6017, -3727, -1930, -2107, -1649, 134, 3008, 1914, 1182, 1864, -1300, -41, 6, -1365, 947, 1728, 944, 554, -809, -2206, -683, 3281, 2531, 3410, 3490, 1867, -1926, -893, 3812, 4286, 7882, 9207, 8640, 5254, -2654, -5035, -2944, 272, 6636, 9996, 4423, 2343, 3692, 7048, 5515, 2139, 452, -965, 3334, 2414, -68, -2605, -2513, -220, 6, 1932, -2478, -2064, -310, -2159, -350, 263, -1604, -829, -3123, -5439, -4144, -1668, -3109, -5531, -2544, -1313, -1233, -2337, -95, 2077, -2056, -6964, -3233, -1374, -2283, 953, 855, 4099, 4733, 1127]
5338A127n237m28L041K08N78L99P89n65J400M45Q47J110R5l301K633J204p66n9
5320C520J731j198m02J721K703k920r28Q18k760k244m44k266J115K3p21k026k80
5303d558L264L506K180k08K002J14m673l104j238l62K661L004l820k31J565l65
5287b63O55J850K422j11M12k753k971j325j148k590J407J421r98J331n62L195
5271b8j330j950K020K599J517L32n008r76K317K357Q18k258R4j803L35r58n79
5254b501Q0M58O48j533j214M734O295j149n111j575m069M20M26J184J28J093M320
5237B634n18j562R65P15K53k420n91n17K133k269o94J110K740j935j613k984J738
5220b815K752l020q76J211n29k37L564J915p97j503k4J17k657J368p31j66k552
$$ y = [1127, -4110, -4538, -1497, -1289, -711, -312, 477, -88, 1312, 1757, 2604, 3714, 3809, 508, 3141, 4345, 3579, 3520, 5251, 4053, 3651, 5372, 8075, 5155, 4227, 5045, 2285, 41, -403, -2669, -1554, -1531, -2252, -4278, -4558, -1294, 2212, 4392, 4184, 6186, 6300, 1627, -1477, -2715, -3077, -416, 2588, -1232, -1463, 102, -263, 392, 2242, 4664, 4553, 4965, 2212, -759, -2084, -3232, -5822, -4415, -2994, -3992, -2661, -3223, -28, -1358, -3308, -1288, 1311, 2828, 3160, -1848, -2824, -507, 1850, 2668, 410, 504, -1299, -964, -1922, -2501, -2421, -1963, -1315, -2848, -4062, 672, 6967, 5818, 707, -868, -4937, -4517, -4091, -2907, -2779, -1686, 2634, 2116, 554, 1519, 2234, 2487, 67, -524, -1041, 1092, -1177, -1871, -761, 1979, 44, -1569, -4553, -2815, -63, -3083, -3959, -2748, -3277, -3514, 50, 1965, 1168, -335, -359, -242, -2899, -1531, -2262, -2428, -4980]
5203d980J733J409P18K288j158K0l490k003L661m01J057M316K440k664j574j597
5187b25j439K455Q57q20j263j672J649K297n20K391Q0M90K488J023k761l322L06
5170B014m37j323J768n11o83n74O12k109J224J400j586K971J894Q50j380o76Q42
5153D296M81L811j023j494k062j543l30N32p01n579k139J887L358M64j252j544
5137b838k19L455N84j478mL475l769J428n71m226m271M472L942q74l266J690L065
5120E95J801k228J092O64N35k55q3N78p53m76l240k081J725K805q37m36J860J984
5102C250K574m666m603J359K054m31j947n61n23p56K305J090l5m49m68l93P82
5085a418p0o18p34r2q3P00M4j808N79j816j273j085L869N233L463P17l145m58
$$ y = [-4980, -3247, -1838, -1120, 1168, 10, 30, -3460, -5463, -1802, -2203, -1146, 3170, 5610, 2946, 1372, -225, -1664, 791, 1648, 828, -435, -2107, -458, 1839, 1319, 3710, 3790, 4280, 6768, 7791, 5030, 1708, 2014, 1577, 254, 2022, 1511, 828, 254, 866, -1243, -19, 1381, -205, 2766, 4660, 5510, 4130, 3454, 4296, 4777, 8588, 7565, 6071, 4009, 2466, 2136, 2668, 1967, -3612, -5751, -3864, -506, -42, -1294, -2838, -3057, 398, 982, -496, -500, 2975, -794, 634, 63, -4163, -8434, -3962, -20, -894, -4160, -2470, 595, 2396, 168, 1260, 1924, 2459, 2204, 2121, 2699, 1946, 1470, -1770, -3851, -2126, 679, -158, -594, 1266, 3250, 5824, 1158, -3445, -2086, -32, -463, -2410, -2971, -3494, -4250, -1945, -855, -890, -1339, -1807, -2200, -1418, -1488, -2106, -2840, -2932, -3015, -2315, -2271, -4079, -3500, -5316, -6589, -7674, -3805, 1428, 4891, 5608, 2463, 2005]
5067B005j54J444R1k883L49r47j921j9J067l8Rj146j52j060m706O62K105J978
5049c316N148K48o42j190j021k661j207P20j27r16K856J963j410J316j31MJ926
5032A560n94o36o44n58J408K664p34j702J72N61j832l664kJ182K378Q01m96j490
5014a626K602K573j368j156j040j619j165J464L561L072k019m568j545k544m433
4999i811J479K90L402K140j390j702j563J027K458j498j428j518K480M467J017
4984a50k397j251O81J728L838l740m03J498j144k131J590J785r70K427J571j596
4968A336Q84n77K042J92r3Q65p8k775j535k229o71M76j950q05j864r4j881K804
4950e953J272L231K098m95J212J140J295M78L082M83l939n94K004r38l126R12
$$ y = [2005, 1851, 3295, 3386, 503, 852, -95, -2016, -2035, -968, -1006, -997, -2143, -2295, -3355, -8061, -7399, -5294, -3316, 1832, 2080, 1438, 248, -773, -3434, -4641, -3921, -4048, -4964, -2108, -145, -1555, -239, -370, -366, 1560, 966, 330, -314, -872, 536, 3200, 2466, 764, 936, 1497, -335, -3999, -4001, -2819, -441, 360, -136, -1626, 976, 3549, 2181, 1025, -15, -1634, -2799, -1335, 2226, 5298, 3279, -1289, -2834, -5378, -9811, -8332, -8042, -4640, -2500, -3890, -5592, -7155, -6128, -3670, -5168, -6596, -8114, -5634, -1167, -150, -2547, -3798, -3117, -1389, 2449, -1291, -1694, -196, -1340, -3471, -1881, -96, -1066, 1361, 2932, 1336, 2220, 1643, 3685, 3877, 3784, 4649, 4571, 1796, 261, -1968, -2639, -2163, -4113, -4918, -6782, -6876, -8757, -5953, -4681, -1450, 648, 153, 1365, 2505, 3800, 4278, 7360, 7843, 3904, 3310, 5314, 4376, 1250, 2162]
4934B162j467j862j270q9L974Q09m35j627k148k17o41r21j374M350J133J44l140
4917b619K53M54J539j220j746J051j211L93J511o43K440j277k113J227K271J905
4901B215R25O86m171k381K47K86q04j971J168k051j006M49L65M489L240K12P35
4884B633J657j347n453j12L605K336o35k400k045J286q27J662j42r64K46n80j253
4867b333j649M995N481J081K41k891R74K388k190m050j641j221o18j93R7K530
4851A001L74n65j011k814k359L882J854j7K881N97j168l078K42q25J305k599L91
4834a909M586L870l39l985m223j539J759J592p17J815j007Q96k21n33K740j332
4818A453k589p08P59k380o00J157J781j197J17J667K461K394j83k960j54j82j983
$$ y = [2162, 695, -1167, -2437, -2526, 1448, 2257, 1822, 195, -1953, -2170, -2811, -3732, -5106, -756, 377, 521, -2619, -2366, -1912, -373, -1593, -3339, -2288, -3499, -3106, -1595, -2238, 202, -1075, -3188, -1961, 310, 2215, 3140, 3826, -345, -2726, -2479, -2193, -2997, -4968, -3800, -5851, -6857, -6408, -6043, -1554, 1686, 1898, 2633, 4290, 2943, -2510, -2622, 983, 3319, 2684, 284, -1761, -475, -1302, 360, 218, -746, -500, -1080, -2333, -3982, 1013, 6494, 7575, 7816, 4925, 5899, 8287, 6097, 2047, 406, -815, -1433, -1626, -1529, 1001, 1375, 810, -201, -3015, -5374, -1492, 362, 345, 3226, 3823, 2655, -423, -181, -1006, 299, -2300, -1909, 2677, 6547, 6208, 2223, -2000, -3539, -1780, -188, -905, 910, -97, 799, 578, 45, 2785, 1453, -1136, -1844, -1085, -3465, -4065, -2908, -1127, -2324, -2207, -540, 1921, 4315, 4132, 1172, 1018, 836, -1147]
4801a147k603J135j763j318r81K583L049K192L581O39j941l111m019J980j044
4786b768K16J670k40k483M61P46J149J337l414q91r90j02M011K286j503m42n022
4769e979j884J952L196O97j094j3N64P2j834p98J772q13K80L195J780o13J098
4752A578j853j574k86j378K04Q18o59K820Q65j005k673J636l45J24j21J105l582
4735d326j116J939M15k882K423K646m72j104l649l4N100M40k886J401J345J258
4719D98n89K59P1J134N3J367k848K349L207K228m659p652l134N372K509l52KJ64
4701b1J03k227K80j373o6J81k491k44K663K551l26r3J302j303k832L43K486M63
4683f04J13Q55J109k038q51M38J607J125l58j674l37M29J758J392j661k232O24
$$ y = [-1147, -3750, -2615, -4378, -5696, -6677, -4094, -1045, 1147, 4728, 5367, 3426, 315, -3704, -1724, -2768, -2552, -882, -1122, -3605, -3144, -2398, -1249, 88, -3326, -4217, -5207, -5309, -1298, 988, -515, -957, -5979, -7863, -5911, -2715, -2018, -3112, -3125, -2561, -2489, -4323, -5121, -3349, -4162, -3882, -687, 1093, 480, 1578, -275, -1849, -2135, -3513, -3309, -2491, -3150, -330, 535, -470, -3143, -1507, -1852, -1728, -1849, -744, -4326, -5442, -3503, -3088, -5970, -3547, -901, -1373, -2477, -6126, -6160, -1060, -620, -3506, -2105, -760, 498, -91, 168, 239, 1373, 1426, 2793, -55, 2294, 5501, 7729, 3070, -4582, -7716, -2344, 165, -187, -185, -21, 82, -2145, -1865, -3238, -3304, -3123, -5614, -5858, -3195, -644, -970, -1063, 239, -1064, -3896, -3553, -1067, -604, -491, 364, 1473, -565, -1416, -978, 629, 1754, 1396, -278, -615, -186, 1572, 2964, 1303, -929, -305]
4666c05k889j613J997R4R3J71K94k32J972M380k458j710k158k652j84M006J450
4649B56O84L57R08R65j464k988L49R57j09j483P56r49J084K17l57P4K76j111j525
4630c103n90J943M746O843j418o752k053J342O4j640n39J104J05k14l310j14Q93
4613b693J068m29p12N86O72J978r47j782Q96J655K938M50k414k94k15n40r60J312
4595E69P03j613L22r3J218j369k994l947j318J248L893r02K68J201l52m56M4o42
4577d220J016K600j405P20J372j273K39j931l776K73R71J856L709l44P64q96J840
4560A515J752k025r41M3K4l359N74P57n96j048k67K449J877j570pJ375L356O87
4542D596n197j465J28k32M210J582l903m395J272K442M488j179l734K321j211
$$ y = [-305, -3194, -4807, -2810, -2716, -2623, -2452, -2158, -2390, -418, 3962, 1504, -206, -2364, -5016, -5200, -1194, 256, 940, 1297, 2205, 3170, 1706, -1282, -933, 24, -85, -1568, -812, -1761, -677, -460, -817, -743, -467, -1578, -3103, -3693, -1750, 2996, 9839, 8421, 1669, -384, 958, 1022, -618, -1157, -53, 52, -162, -3472, -3586, -2693, -1625, -2054, -2766, -2180, -1508, 470, -477, -2259, -1363, 292, 3230, 3680, 1266, 972, 757, 217, -743, 569, 1272, -341, -19, -112, 1106, -263, -3257, -7204, -8522, -7274, -3381, -4283, -4015, -2814, -3166, -3622, -3578, -4220, -3204, -604, -2009, -1289, 83, -1190, -951, -2882, -6658, -6385, -5414, -3558, 151, -193, 571, -325, 1515, 3267, 1242, 301, 344, 368, -2991, -2417, -1660, -2256, -3304, -3571, -1122, 755, -815, -822, 553, 3909, 4596, -601, -2066, -1938, -2170, 2040, 3622, -281, -4676, -3404, -962, 3526, 2347, -1387, 934, -277]
4527b77k27k351j234j959J218L551M94n23l05j828J757M547J143k642k639n73
4511a848L012J11j327O56j272Q27j578k499k729L802K653l34k569J052j561k847
4495f451J74J353k97k312L155J249J475J512J443j246r92J691q93m510K231R31
4479a487J695J490J73l162OJ211o58j862k420n47J638K066o74O66J077k906j341
4462e035K390P34J616jk909J368J329P61N40m919k325Q08p73j86R70K585J434
4445a613R81j497M29J148J505j680j378k203q58N80p05j636K203K751L491K059
4429C577m774k886J03N30j527j720K270L913j75l060j508m06j051j735K112N09
4413e828J770J535j554l047K231p78J03K892J319P99j393m707J319O269J607l643
$$ y = [-277, -504, -2855, -4089, -6048, -4830, -1279, -785, -1308, -1613, -3441, -1684, 2863, 4006, 1364, -1275, -1848, 1164, 1275, -52, 604, -668, 159, -1419, -3918, -6647, -2845, -192, -526, -3095, -2043, -3604, -6451, -6277, -4924, -5221, -7533, -4378, -3129, -1654, -142, 1301, 55, -937, 754, -139, -4649, -2418, -1487, 208, 1698, 1871, -1291, -1285, -74, -732, -2594, -5014, -5561, -3923, -1857, -2531, -1865, -788, -3694, -5035, -2645, -1911, -295, -296, -3205, -1837, -508, 253, 793, -4126, -6451, -5643, -6416, -6602, -5632, -3047, -1613, -632, -2129, -1700, -552, 953, -727, -2105, -4308, -5166, -4586, -5291, -6927, -4724, -1973, 1518, 3577, -1197, -4083, -3980, -3450, -4977, -6697, -4427, -514, -689, -3749, -5257, -5663, -6714, -8449, -6337, -5828, -4058, -2523, -4077, -7124, -4893, -5671, -5568, -2676, -1357, -558, -1951, -6658, -5339, 930, 2537, -1106]
4397a106P52J707l569j834j51L283K840K693J449M46N45l001l475p47J003L43
4381A178P97P71j145n294l48K356R37R57j327n12J275n48j76k1J06J061j726p89
4363b448J368p74j648k858J469J988K242J868j085k457r03k328j54N20L193K632
4347F25J54j17J55J54m05N81N96j835j966j889l375N01L51L800M989k7k05Q1J374
4328C542J364l465r81q57Pm904M96N753k345m33j480l084j142N495K860o91l165
4311c030m48j053J810K251M15k918k467Q53L150k493J925K741K96k379K710j049
4295C14l671m8K753j170m36k73k55p40K179N128K188r65j484j084j447k802j957
4278c770k38J001K198L019M952j803l535J627q68m4J384j330k866L40l7k946J329
$$ y = [-1106, -354, 1353, -2216, -4050, -4201, -918, 1922, 4615, 6064, 6510, 7055, 4054, 579, -168, 835, 1178, 1975, 2746, 1601, -3693, -4041, -1685, -748, 209, -1118, -1630, -355, -903, -1079, -1100, -994, 67, -1659, -2448, -1080, -1854, -3502, -6360, -4891, -2903, -661, 1207, 122, -2335, -3238, -5566, -5720, -5200, -2007, 625, 779, 662, 817, 971, 566, 1147, 1743, -92, -2058, -3947, -7322, -6821, -6470, -2670, 2319, 2292, 2087, 2168, 3542, 4906, 1441, 460, -397, -390, -5294, -4798, 955, -1390, -1823, -3303, -6387, -7529, -2034, 826, 135, -3030, -3478, -4531, -2721, -470, -55, -2973, -5440, -4587, -1437, -3930, -2005, 736, 1032, -1347, 1363, 314, -3357, -3405, -652, -1822, -2258, -2531, -2786, -3526, -1347, 3781, 5969, 5004, 3520, 2436, 989, -1813, -3770, -4008, -3007, -809, 2210, 7162, 5359, 1824, 3451, 2583, 2539, 3923, 2593, -273, 67, 30, -2916, -1587]
4261a587J472r02j875r09j169R91J758l084l971J152J498J416L142K233l215q18
4245c868K589p29j86k153j112j810N967M437q16j011q71p39k860k26J168M21j489
4228c288P85J78o88m933m30K873J515J300k0l00m0l387j058K499J6p61P49k290
4210g280J037J367m325k109L213M725M947J918j315J200K182r73m864k793o29
4195c699p59J964M4k642O98K486k275K402R58j149k08K157L78j312J599J746J243
4178C631p04k858k650J836Mp05K567J747j933N53L31J174P8j362k12m572K05J972
4160h98Q88J715k171l585j404jL368K721j609k844K882j698J690J002J183Q12
4144B051j154j473O89j388P38r63k687j936M009K150J689l099m369M61J204p66
$$ y = [-1587, -115, -1017, -2892, -3801, -4970, -3979, -2221, -5305, -9276, -8124, -6626, -5210, -2068, 165, -3050, -3868, -1279, -2008, -2194, -4347, -5459, -7269, -1302, 3135, 2319, 1308, 437, -302, -3162, -3388, -2220, -1799, -3288, -2503, -2325, -3013, -7946, -8376, -5503, -3988, -2688, -2708, -3008, -3048, -6435, -7493, -4994, -4978, -5739, -4990, -7280, -6243, -4876, -9201, -11310, -8097, -3372, 1575, 3493, 2178, 3378, 5560, 4587, -277, -3070, -3699, -4458, -2494, -2450, -5092, -4394, -1908, -4183, -1781, -823, -1972, -2180, -23, 355, -957, 642, 2388, 3631, 2927, 69, -2581, -745, -741, -1446, 1121, 2868, 935, 1488, 1819, 2993, 3071, 1709, 1497, -3075, -2870, -898, -10, 1705, -466, -4051, -5455, -5456, -2088, 633, -976, -3820, -938, -2636, -946, 56, 1239, 2051, 897, -576, 113, -1275, -537, -1500, -4187, -6123, -2114, 36, 1725, -1374, -5743, -5282, -4078, -4844]
4128d844k91J186J315N9K539K198p54J064k53j468l175k79j897M726O346P00k899
4111D273l268o4p16k023J514R98k396l06j138L016L866k036k947j292K955J960
4095B396K64m821K180K646J487j130p48p44K246j589N80j259l068j977K5K162
4079a350K049K20K69o74o6J818n85k352o65L849j213p48N23n91L39M37J014K48
4061B522k849m009l143L386J991P72j840p53J215J164P70j311k969k170J094K096
4045d034r06m42l97J668M262P83j973j65p28k156J051L782J457j249K553k347
4029A159p38l632M04M027J717j270k411j701P27l374q1L4J882M248M97l496j8
4012b026L404m221j274J035K439j353L46R74K207n73L72Q63J56j013j873j743
$$ y = [-4844, -5135, -3949, -2634, -2575, -36, 2162, 1408, 2472, 2219, 751, -2424, -2703, -4600, 126, 6472, 7172, 4273, 1005, 941, 225, -1798, -284, 714, -1682, -1988, -3126, -110, 3756, 1720, -1227, -2519, 436, 2396, 2660, -2161, 19, 2665, 4152, 3022, 2274, 1530, 3776, 2187, 2767, 1508, -1560, -3537, -3512, -1350, 699, 919, 1188, 514, 448, 2266, 1681, -671, -1336, 2513, 1300, 552, 1075, 484, 823, 1260, 2274, 2522, -327, -4336, -7479, -4093, -2102, -1330, -3170, -3923, -2708, -1544, -774, -2085, -5054, -7224, -6130, -4034, -4940, -5382, -5779, -4111, 151, 934, -1039, -1204, -1932, -4088, -3037, 745, 2202, 953, 3506, 1159, 421, -3211, -2807, 1220, 2937, 1667, -744, -2445, -1718, -5092, -5173, -5139, -3257, 991, 1488, -2008, -2026, 1378, -2843, -4117, -3082, -643, -1996, -1650, -676, 1531, 958, 1330, 2193, 2349, 1336, -537, -2280]
3996b280K236k72o84M38o14n11j45O34n5J758Q16j978j886k92N95k167j405M563
3978a249K373j878k025q35L272J299M62J011j011o47L002J581l05L77l345m203
3962b121k771J561L117m12p15K053J576k383k561K55J878j032j870J076K75l273
3946e347K237L987J750j263l846r81M54L187j047n9P31K459l915l196L031p08
3930b526k920J791J954J053j014o614R32R09j11L427l187l437Q49J358N56Q51
3914f129L410k361j28L661K889j847k455j377K6j103k510P22J640M617l398k250
3898f593m68Q67L786J703k447J358M586K985n83o40j500j618k124j512K828L214
3882C842R30J379j986j588J63P90k338k574k106M54L717m6J765q54j548q1K31
$$ y = [-2280, -44, -316, -1000, -562, -1176, -1687, -1832, -1198, -1253, 505, 1321, -657, -2543, -2835, -2240, -4407, -5812, -1249, 1124, -754, -2779, -3614, -342, 957, 1419, 2430, 1419, 772, 3774, 5355, 5050, 5427, 2082, -2121, -4892, -3331, -214, -626, -1341, 712, 2288, -95, -2656, -2401, -523, -1555, -3425, -2349, -2074, -5347, -3110, 877, 2627, 1364, -2482, -3463, -3009, 178, -869, -928, -197, 2262, -1653, -4849, -1818, -2526, -5446, -3655, -1701, -648, -1662, -8276, -7344, -6435, -6546, -3119, -6306, -9743, -8894, -7536, -6980, -6129, -2719, -5080, -5208, -1547, 1342, -505, -2960, -4337, -4311, -5414, -7924, -7202, -5562, -945, -4343, -6593, -7061, -6194, -2408, -705, -3152, -1794, 2792, 5777, 5194, 4554, 3054, 1436, -688, -2200, 628, 3842, 4772, 6151, 4165, 2577, 2740, 3530, 1192, -1382, -3488, -3034, 683, 637, 2402, 1548, 0, -81, 150]
3865A50j859j829j434k007j414J185L105J121L317K836J724K350l467l611qN13
3849F72m660J189L617Q70k475N76k115p26J253L18j46J635J855P67r32k224j115
3832a641j087J025K527L091k107p352l51J731k490J813N643J235k928j923r71
3817c785J126L006l031j454j363M039p76j087j566J302J387j162J859j202K196
3802e11L97J569r22j602N96M225P4k556j864N07N8j779J172K175j789k47K286
3785A789kl310o093j06M33Q41r5M15J442j394n87J275M393L051K142O21j408k843
3767E64J625j128j701K38o20l60Q02K24p46q62m44J774L752L17l509l265P27J34
3749b478l408j625L286M455K271j474k235J528k09j665J61J837l40l682o93K779
$$ y = [150, -1709, -3538, -4972, -6979, -8393, -7208, -4103, -2982, 335, 3171, 4895, 7245, 3778, 167, 159, 672, -3988, -2799, 818, 1688, -787, -211, -2326, -3052, -1799, -1481, -1627, 8, 1863, 2630, 1698, -526, -1641, -2728, -1703, 824, 3915, 1808, -5544, -5895, -4164, -6654, -4841, 802, 2037, -891, -2814, -3785, -2659, 347, -2684, -4138, -5501, -1462, -2238, -3325, -4891, -3589, -2202, -3364, -1505, -2707, -511, -114, 1455, 533, -1069, -473, 3752, 3826, 1270, -594, -87, -29, -1808, -636, 1539, -250, -497, 1789, 1787, -1523, -7616, -7722, -7289, -6448, -6543, -6128, -4686, -6080, -6667, -5392, -999, 2052, 4194, 4815, 3407, 564, 2189, 1061, -640, -402, -1022, -1382, -580, -356, -1102, -1964, -2408, -634, 3118, 3435, -74, -3339, -2612, -2478, -5886, -7511, -4225, 230, 2501, 1027, -1208, 320, 111, -1554, -1393, 444, 104, -3578, -4271, -1492]
3733a492J205J843J177J40l570j186r28M439j582o49M85j63q34K499l90l737k558
3716e301J385J050L04k144O403K489j283q81q59l72L134K151J090n149r14J285
3700B388P54q08j811j899j599m31K058L56m49J4R29K15j635J61N718j024j896
3683A041J576J183k314j447l13J35J97o80J940m72j149j834o27j337m68K243K587
3666B61M872L81l026l099L074J403j631j212j064j658J966r35p32L312l92j3J225
3649B732j335j79k354l958R85L072l58r28n84m066L11j067j253r06N051J065r90
3632d762N26J689J835J148J898k294m354j526j03K476K883l223k067R96j27j183
3616f188L088J669L378j845L89m52K75j552l152Q49K469K220J175l510j571J911
$$ y = [-1492, -287, 1556, 2733, 2873, -697, -1883, -2811, 1628, 46, -603, -118, -281, -1115, 1384, 994, -2743, -5301, -3916, -2866, -2562, -4706, 1697, 4186, 2903, 2022, 1163, 791, 3925, 6076, 7166, 2017, 1103, 2388, 3142, 2334, 523, -1376, -2975, -3406, -1348, -992, -1441, -1427, -498, -283, -1918, -1757, 3961, 2937, 1041, 2617, 3800, 1486, 39, -274, -139, 58, -622, 1318, 846, -303, -2137, -2764, -4101, -4569, -2326, 261, 5133, 5514, 2488, -611, 2463, 3866, 2235, 1023, -41, -1699, 267, -668, -1400, 1912, 1520, 1507, 2732, 1397, 1218, -1136, -5094, -4109, -1037, -1395, -2323, -2907, -6973, -6662, -7729, -8982, -9888, -4837, -3772, -4762, -4236, -2547, -712, 436, 2334, 40, -4314, -5840, -5943, -3467, -584, -3807, -5874, -4878, -5005, -6188, -3100, -1431, 1947, 102, 491, 39, 314, -1238, -4390, -3541, -1072, 1148, 2323, -1187, -2758, -847]
3600h47J156j178k359P45M71Q79k679J034j97J208J063O76J579k292m534j220
3584f495L12L111r76J042J615k515N23J014J565J644k34J038Q62o62j297l678
3568c131k030J24K412O305k170n84k309l58l8J190j7j889L026j844J694P98l164
3551a985P97L091J254L60J46k291j563J414K71k525j659j062J345J112j021j115
3535c431m86P95J926mj99o27j853L28k269k210k60L459L125l4k359j670k555j851
3517a0175L461L140N1j719L052L719o76q5J5J046l178j322n56J800q76j90R95
3500a498p06k348K638L262L810j54p9j141j530j895j377k483K885j228j797j660
3484e301K795N249K878n114m841J04q94K856P24k26K231l503j129l374J484K874
$$ y = [-847, 309, -869, -3228, -2483, -2012, -1133, -3812, -2778, -2975, -1767, -704, -28, 1551, -741, -5275, -6495, -6183, -3072, -4048, -3006, -1391, -3906, -3383, -2369, -804, 840, 606, 1644, 2506, 1844, 547, -3131, -5161, -5037, -2625, 3680, 1510, 926, -1383, -1741, -1779, -589, -606, -2495, 531, -1313, 381, 1179, -1985, -1188, 1903, 3157, 3517, 3663, 1372, -191, 1223, 1494, -1031, -2690, -3752, -2407, -1295, -2316, -3431, -3917, -3122, -1196, -1200, -1399, -2026, -3879, -3551, -5820, -8030, -8290, -4831, -1706, -1740, -4099, -5769, -8324, -10175, -6714, -3574, -3523, -5242, -2190, 1529, 853, 768, 783, 1829, -1349, -2671, -3227, -1427, -2303, -2493, -1498, -2204, -4552, -1914, 1348, 5158, 5004, 4925, 3784, 2254, 359, -1018, -3501, -616, -1844, -3641, -5301, -2506, 2743, 5621, 507, -4334, -4230, -5124, -2268, -1544, -1770, 461, -3042, -4171, -7545, -6061, -3187]
3468c187N231j351k983j770P12K042J580L62j330K079M84J177m139j998o45K112
3452a624j56K935J871j911j414J42l76J890K136k203j022J252R26J535j079j754
3436A148Lm20j146J703J322j322k181j599q82J152K77N44j601j730K847J188p11
3419a408L68j654J180k70k253J331J100k564j73j400J457L059Q44K408K525k410
3403B140k907J637k23j651L511N431q0o87j441l490R6p03j171N9L160k89r31j625
3385H36j545p84J622k411j62L429M77j759m630m877K190j050K815L317J038j688
3369c182J593n32J729j573r92J897P66R88N96k734k008R67J828J353p63N82k929
3352b414m883J906J068k862K379J114J359L19L821k636k673m469j36m78L307L425
$$ y = [-3187, 2044, 693, -2290, -4060, -3348, -1306, 274, 636, -694, 1385, 1869, 3046, -1093, -3091, -3736, -1624, -1780, 1155, 3026, 1115, -299, -157, -533, 1357, 3493, 1290, 268, 1520, 2446, 3981, 2902, 1148, 1151, 731, -415, 1288, 2610, 1288, -893, -2492, -3374, -2222, -1945, -1401, -3002, -4732, -1885, -697, -1408, -1040, -2694, -1514, -1784, -4037, -2706, -1606, -4170, -4343, -5743, -4286, -1227, -383, 2025, 4550, 2140, -767, 870, 647, -1004, 2507, 7938, 7858, 7171, 5730, 2240, 2336, 1633, 462, 521, 3681, 3392, 2461, 836, -709, -1493, 129, -2282, -2444, 985, 1462, -297, -4927, -9804, -7614, -8664, -5849, -2532, -1494, -3182, -1589, -2121, -392, -1965, -2957, -1060, -294, 694, 1290, -1444, -3452, -2485, -657, 696, -67, 515, -2414, -7297, -5391, -4323, -7185, -4806, -3692, -2333, -2014, 1807, -829, -3502, -7971, -8107, -8585, -5278, -1853]
3336a853k93J825L387P91M6J259J62l89j863n166j57J479P42j322r81k154l389
3319g876j006L169J346j246L942l31J374K681J704p85P33L37J486J408k655j087
3303C194r03k222J139J812K642j208k501n86J395J47m709m12K13k538k876L163
3287d250J957j368L020J727l200k117O13L966N355J159k909M80j917j948m92N99
3271F75K746l660m293L497R90L81p16j85O05Q9J479j106K73j229l920j787K645
3254c516J268l322L762O47M222k765r70J536O55m956m394J025L358L394J667k088
3238d77J77r52O57M82M17j504k568J968K646o42j267l31k377k08Q87j329K150
3221b271K617l481m082p08K556P30k535J269M326N962O26j261j313k273L63k242
$$ y = [-1853, -2146, -321, 3066, 3857, 3903, 5162, 5324, 4935, 3072, -2094, -2251, -772, -30, -1352, -2333, -4487, -7876, -8882, -5713, -4367, -5613, -1671, -2002, -628, 2053, 3757, 2972, 3705, 4042, 5528, 6936, 4281, 3194, 2291, 69, 1208, 3020, 5662, 4454, 1953, 1367, 2762, 2909, -1800, -2212, -1999, -4537, -7413, -4250, -2293, -3661, -641, 1086, -2114, -4231, -3618, 348, 5703, 6862, 3953, 4433, 2516, 568, 76, 675, 3421, -239, -4532, -1035, -45, 336, -380, -565, 40, 129, 1608, 502, 775, -454, -4374, -6161, -3516, -2248, -5570, -1808, -1161, 3061, 296, -674, 862, 1517, -3439, -7833, -6808, -3450, -56, 1611, -477, -300, -1252, -595, -113, 304, -1200, -3768, -1800, 846, 204, -1063, -1394, -3771, -3979, -3092, -4421, -2271, 346, -3135, -7217, -7925, -5369, -4639, -7174, -5905, -1579, 4383, 5009, 3748, 2435, 162, 525, -1717]
3205a717k707j930Q24L655l4k592J091J443K462O80J453q18k887k527R48J238
3189a418K704L89o946j793M551K092k566j423M430J388j394j147k080N0M086p10
3173B13j358l298k069K179O035O03l483k75J060j008k210P38J080j024L032L93
3157F08p71q95j250K998M124J48r81l318q71O8l381O9J016M004N60r46J063j124
3139A121k534j138K615j640p02k778J516L670l04k105P57n5P57n36J784J261n87
3122A102K449J720m473l761J712L701L5n554j019J514j285j243J01L140K888p16
3106C11P19k377m894P30J62J707J422k371R75N7J806j237J795Q19l39R45K109
3089B339k192n87M247K619o54n627k063q01j593R95r71P43J929Q86j995L25Q81
$$ y = [-1717, -4424, -6354, -5530, -1875, -1909, -4501, -3410, -1967, 495, 1175, 2628, 1810, -1077, -3604, -2656, -1418, 1286, 1675, -5271, -7064, -2513, -421, -2987, -4410, 20, 1408, 14, -1133, -3213, -3163, 923, 213, -1145, -4443, -6512, -4333, 1702, 2305, -1178, -1453, -393, -1401, -3611, -2873, -1793, -2817, 215, 608, -163, -1058, -2308, 690, 4814, 4962, 3981, 663, -208, -140, -3521, -3452, -2436, 1568, 2128, 1182, 2245, 1121, -1413, -2551, 64, -1576, -2278, -5056, -3540, 130, -174, -2279, -1522, -1577, -820, -1356, 428, 1689, 1102, 3551, 5271, 798, -2963, -1251, 2450, 2485, -3069, -4088, -2574, -3859, -5102, -5001, -1861, 1027, 311, 1030, -1347, -6241, -5511, -5349, -3642, -2220, -4591, -3616, -3559, -1753, -2990, -1195, -376, -715, 230, 2339, 147, -440, 3807, 6426, 5772, 145, -1918, -2719, -4312, -3317, -4288, -3545, -1616, -730, -2725, -2400, -1519]
3072a519K33L896K494P99L3j786k568n846J781L080R63j122K261l150j610o72
3056b733L669j059J223N98K188o64M96n93L20K071m282j699J890K130m059n274
3040e778J144L925m35M76J928P1J558k659p62O07L90J787m06Q42M768o05k199
3023D652K3k062l620j184M61K128J195k869j419J261m746j676J289Q86m12R67
3007e126o3l607J092K968p8K059L490O58k032m467J397j681j672J664J104k17
2991d511l741P84L231K153K349J17l505k283J319L497n46M309K044o81r00k322
2975A314j59J206l283k417k273j036R19J380j181k442j285O3M229L637J621j847
2959a554l413P78K986L246J801r6n286k532j513L098L800j791j263Q71m63j808
$$ y = [-1519, -1286, 2610, 5104, 5903, 5936, 4150, 1582, -4264, -2483, 597, 1560, 438, 2699, -451, -2061, -2733, 936, -123, 1100, 1698, 3886, 3222, 3718, 3125, 3445, 5516, 1234, -465, 1425, 3555, -504, -5778, -4634, -709, -1144, -668, 1260, 1331, 2889, 230, -532, 75, 465, 2252, 1846, 2688, 7456, 6851, 4652, 4675, 2613, -1007, -2191, -1730, 398, 1593, -1276, -2695, -1434, -6180, -7856, -6567, -5681, -6093, -5126, -5189, -8796, -7704, -4736, -4814, -2755, 735, 1393, -639, -5106, -3709, -5390, -7062, -5398, -4294, -4511, -8252, -7468, -4237, -2084, 265, 382, -3123, -5406, -4087, -590, -1136, 3173, 5217, 4536, 3636, 1314, 1155, 2361, -922, -3339, -5612, -6648, -5729, -4349, -5530, -7972, -9257, -9194, -4965, -1328, 293, -1554, -4967, -4189, -1203, 2043, 3844, 3748, -1538, -4070, -5583, -2485, 1315, -476, -1739, -868, -1331, -3139]
2943c139J15J876P50j232j162J404J251k941R34k085r73K167J068o79K83K497
2927A34q19k022J660J698K977R30k532R2L350k217l269k097k207J484K567M69
2911A98l872l102L219M268j890l309QJ009R96j72n27j644K707J124K32R44O27
2894H16N72O40j692L376O62k999l715K5L965J203O74L17j702m570l932J886J742
2877b732m49l389j94J138J489J629K357p20q50o58M414m22k540m57k76K9J035
2860e96J042p73l504k715J026L049J761j614K125L948K12q42j367l91q74J337
2844A824J836P49j447N42l699m954k502o02J89K313L08J79K92p03j477k085k29
2827i466m47M572L179l5j284L30J015L469j399l675l634L65K511p73J018J70K568
$$ y = [-3139, -3024, -1148, -398, -1630, -2792, -1388, -137, -3078, -2144, -4229, -5202, -3035, -1967, -2646, -2363, 134, -685, -2707, -1047, 651, 3628, 4558, 2026, 2118, 5468, 3251, -18, -2115, -4322, -2838, -271, 198, -3674, -6776, -3557, 711, -1179, -4488, -4480, -3471, -2475, -2647, -3174, -4818, -2111, -987, -755, 189, 816, 1388, 2028, 336, 3712, 4374, 1375, -2340, -2315, 1650, 2853, 3527, 3844, 2142, -2428, -6360, -4474, -2732, -3181, -6570, -6764, -5626, -4137, -2508, -151, -871, -1721, -2379, 2035, 1613, -927, -1384, -1660, -1631, -596, 446, -327, -3831, -6546, -5520, -2471, -710, -2324, -199, 3749, 3961, 3119, 1752, 1361, 487, 1824, 3660, 4409, 2962, 3504, -195, -5149, -7651, -8253, -8064, -5751, -5443, -5264, -4972, -5675, -7152, -9237, -9466, -9913, -5341, -2162, -2197, -3481, -3151, -2136, 1333, -66, -3741, -7375, -7010, -4499, -5272, -4254, -4084, -1516]
2810a516j872k624L043L126l067l581k132L386J691J004p45J209K581k619j303
2795c419J05j868j599M21K966K032j975Kk147l5M5K453L035o37j624k79l97j773
2777d694K382L62Q97J079j980k279m48q38Q64J461K787j76m30k454n40K527J544
2760F4r48k499J41P03P65Q78l035P09L491J29j916l217l80N460K791K744j417
2743D463k703j941L01j164J99l71L85M97M574L788J461k488m457q8Q35L54N60
2726D205J362j443l811J538m50k002K233m65j512j15l64m228K13M675R91L59k908
2709a722n015K533P645j645j470l264r04J906M102Q52m638j41K053K316k404k618
2693b414K334K837J542M76n26k681j848J522j885j819o11R32P5j939J006J853
$$ y = [-1516, -3388, -6012, -2969, 157, -2910, -6491, -8623, -5237, -3546, -2542, -3287, -2078, 503, -2116, -3419, -3314, -5182, -6781, -6360, -3394, -1362, -3337, -3335, -5482, -5517, -5472, -3019, 16, -621, -2245, -2524, -2921, -4694, -2312, -1950, -1053, 26, -1954, -4233, -4681, -5519, -4655, -3194, -407, -583, -1013, -3467, -4007, -1480, 64, -884, -3383, -3242, -2539, -1774, -896, -3931, -3222, 269, 398, -1518, -4735, -5115, 345, 3136, 5880, 4463, 1760, -181, 120, -1044, -845, -1216, -831, -334, 4240, 8028, 9489, 7001, 2544, 2456, 3291, 3645, 4205, 5567, 4124, 313, 1851, 1401, -601, 1632, 1167, -345, -460, -824, -5052, -4839, -164, 827, 1186, -1722, -6737, -4204, 3441, 1796, 326, -2938, -3842, -1936, 2166, 3018, -1620, -1761, 292, 2608, 204, -2414, -80, 2757, 4299, 4775, 4249, 1568, -280, 1242, -643, -2462, -3073, -2141, -2066, -4005, -2999, -1146]
2677a146j821J38k593J138K323J03J178l042o51J002K420J491r72p29L00J123
2661B62J044K251k889m78J72j350J15J916j220l676L022M55P27j821m098J797
2645c771L016o73l624K367J91o93L38O22J766J878P16j021J829j505l468k915
2629d947k80Q3L280p31k08j209L48K60k476j562L866q35J965J251j418J553j586
2612b646J65J848m039k423K366M27K44J228K320l75n48j028k85j895K003l56k922
2595e916r35M349j20K88L783L26k755N23J111P94J096j574J475K426J431m292
2579B010k016J178j082k290P49J42j610r64j028N84l481M30L5K304J186Q28q01
2562c826K010L012j82q87l755k986J05K069K557l75J264o79R10j554j967J370
$$ y = [-1146, -2967, -2829, -5422, -4284, -1961, -1858, -680, -3722, -4373, -3371, -951, 540, -432, -1161, -861, 262, 1306, 3557, 668, 190, 362, -988, -873, 1043, -177, -3853, -831, -376, 351, -1470, -5568, -3771, -755, -1428, -5052, -2685, -2494, -3187, -2849, -2227, -461, 1417, 2133, 1112, 2941, 1436, -2032, -4947, -5227, -5144, -1864, -2595, -2803, -4012, -3664, -3404, -5880, -7442, -3576, -4411, -2446, -1195, -2613, -1060, -2646, -2481, -633, -4672, -7095, -4729, -4302, -4058, -2830, -510, -885, -1433, -2461, -2746, -4641, -2638, -2994, -5916, -6851, -2502, -2622, -2334, 1449, 1775, -980, -457, 654, 1448, 2544, 970, 2445, 4871, 6302, 2010, -6, 1172, 90, -2200, -1451, -1309, -2919, -3883, -4911, -4327, -7808, -7378, -7343, -5039, -3853, -3025, -3826, -1816, 1196, 1014, 127, -3628, -6614, -6509, -4440, -1883, -2258, -994, -1673, -763, -2317, -4284, -2914]
2546b914N24J054P9J00R03J280n29j037p10K44j266J918M88l535j496J295k136
2529e738n70K658J907J439K243j579o53n78M63J400k113j624n49j571l29K35J691
2512c268r10j673J531L576j174k842K725K65Q63P8l31L704Q8l234m215P37L88
2495c692j734J140L212j101J120K114j397r77K377r05l17R82K731r48k440L27
2479D92L225J72j73k725k994k10j548K472K598q65j92k265M76J613o59P77j519
2462a325J75l617J748L623R38J0k821j524J632K538L04j824j471L9R99P22o43
2445d97l94J173j427Q8J209L392j23n231k953p24M456K705K3m531m32O70K51o0
2427b405R22R37l240j309L263K328L29m742j451K012qJ738k065P89K889O83j750
$$ y = [-2914, -2390, -1336, -1257, -1157, -254, 1026, 497, -540, -1250, -1006, -2272, -354, 134, -3401, -4897, -3602, -5738, -6308, -3650, -1743, -304, 1939, 360, -293, -871, -408, 992, -1121, -2745, -3294, -4865, -5194, -4959, -3268, -4178, -5851, -4320, -744, -1918, -4760, -2035, -1770, -907, -829, -1160, 2544, 2632, -602, -4817, -4080, -3692, -5426, -4286, -1074, -2175, -1055, 1059, -338, -1315, 1062, 157, -160, 822, 3553, 2605, 165, 492, 3717, 3889, 3716, 991, -2003, -2213, -3761, -1289, 1309, 444, 252, -2013, -1537, 76, -583, 194, -1325, -1150, -4767, -3019, 604, 1542, 1552, -1269, -2793, -1161, 1377, 1681, -143, -1614, -1575, -576, 146, -497, -891, 282, -1145, -1057, 152, 3544, 3421, -1810, -4763, -5487, -1031, 1674, 1697, -2834, -3266, -2596, -2345, -2405, -1483, -546, -3786, -5095, -1832, 496, 825, -3917, -5368, -3356, -3364, -1626, -3691, -2902, -13, 670, -1080]
2410a080o66L851K380K015l239m831l068J28O08k089L86L905P90J161j78r98l754
2393d679j130K729J888N26m460j404K819J123l03K412j005J40J411k982j174L102
2377i87j233j391Q9L850M941j30j812R34L42l35l024J423j378j257j197j684k29
2360c078l013J437K203j061l113K802L439J076j691k856o031R16L810M32N70K434
2344a724K367L96N83R1J444m101o47l90j199k931M147M233K262K091l419j518
2328A685k057R63L200P19k560o77J142k094l87j023J899J227J57J694N08l175
2312A221l448P34L618K112k222Q77J686R3p61j337O5k936J009K165n48k506j623
2295a801J461l524j93m9J817K106J21j856k817n28J884M73R46n82n82Q96K85m240
$$ y = [-1080, -1746, 2105, 4485, 6500, 3261, -1570, -4638, -4510, -3902, -5991, -5605, -1700, -910, 251, 73, -925, -4679, -5809, -3080, -1192, -666, -5126, -6530, -3711, -2588, -2891, -479, -1484, -1344, 67, -2915, -4089, -987, -2220, -3611, -3522, 328, 5269, 5139, 3327, 4261, 4603, 4268, 1244, 2667, 1289, 32, -1165, -2849, -3078, -6091, -4654, -2451, -3512, -6625, -3823, -384, 692, -999, -3855, -9886, -8970, -5160, -4728, -4158, -1724, 643, 1039, 1622, 1713, 3157, -944, -1591, -1981, -3180, -6111, -1964, 2269, 4531, 6622, 3203, 1685, -372, 591, 3791, 4510, 1950, 1273, 2415, 321, -66, -1089, 810, 2037, 2194, 3888, 4396, 1221, -2227, -1493, 2125, 4237, 2015, 2892, 4578, 4671, 3910, 2573, 2638, -298, 711, 2876, 2328, -178, -1801, -340, -3864, -4057, -4106, -2289, -183, -62, -1918, -4735, -5263, -3379, -2906, -1960, -2542, -3124, -2228, -1943, -6183]
2277f183k860K742M838J200j497O46N10J825K708m89p800k136L339L968o14j724
2261a527j661k010j406R35L419K025k699j085J200J170M014J492m036J17M812
2246D760K088m276m868r47J190n85k300k70K722J374K346l094N73L409j862p61
2230e01m421n19j838J742M963l91K179M303p63m154k734j351J371K142J276n00
2214H04p86k67q90j506Q41R14J255N70l078N096K987m203l023o95k778J862J744
2197a153r32K542k52R54nK649K765k954k943m650k863j412L483J007O8j596K029
2180c263K374l214q32M50j96K252J191k537k205k96L985l049k465j218L910L736
2164a377J244j084j226j411J198K082k76l752o18j003m535n90M164P466K306k811
$$ y = [-6183, -9043, -6301, -1463, -263, -1760, -1114, -604, 1221, 3929, 3440, -4360, -6496, -3157, 811, 197, -1527, -3188, -5198, -6604, -5669, -2250, -225, -2924, -4009, -2809, -1639, 2375, 3867, -169, -52, 4760, 6848, 2572, -2296, -3243, -2053, -2638, -4938, -5208, -2486, -1112, 1234, -1860, -1287, 2122, 260, -501, -4922, -5441, -7279, -5537, -574, -965, 1214, 5517, 4754, 600, -2134, -3485, -2114, 28, 1304, 804, 18, -249, -1139, -2645, -1804, -890, 365, 935, -2143, 2953, 5940, 1737, -1286, -1981, -4759, -2897, -1153, -2085, 457, 205, 1159, 1154, 3803, 6568, 3614, 671, -3979, -6842, -8254, -4771, -3764, -3696, -5292, -3263, -889, -4103, -4935, -4485, -4681, -2429, -1238, -3775, -5980, -6276, -2291, -5340, -7805, -9023, -5113, -1377, -133, -1217, -2443, -3854, -2656, -574, -850, -4602, -5220, -6223, -10758, -11348, -7184, 282, 2588, -223]
2148b23L96k289l006l9M364P3K341J746l346k363k739M221N059l364r08K117l389
2131a349k231k702K54K18j578M377l3J821K689K36k66m3N11r23k345r19J327L82
2113e74J675r06n33K143o52N33p8j865n4k315k282p87J828j778O9J718K242K498
2095H82k763j874M613Q24k186k930k443L933m50j8N80L818J592m803m91J263K498
2078B045J306j887K523K467N19Q23r95k813j147l633K72J600j454O44M89p63J187
2061A183O50l594l373J267Q06k66j003K119L042K302j727L4J012k270k549r8L452
2044I87J895j872l513N12J033M78k845l980K779K899L90r74l3J616J197K364l15
2027B618j872j079q94J237k40K340J24q99q00n00o18K906O56k022k601O72J673
$$ y = [-223, 173, -2116, -5122, -5161, -797, -724, 1617, 3363, 17, -2346, -5085, -864, 4195, 831, -77, 2040, -1349, -3580, -6282, -6028, -5810, -7388, -3011, -3044, -1223, 1466, 1702, 1436, 1393, 1904, 981, -1364, -2283, -956, -574, 1101, 195, -338, 1805, 1153, 1686, 1608, -257, -311, -2626, -4908, -5695, -3867, -5645, -5576, -3858, -1616, 882, -1881, -3755, 858, 1682, -504, -3434, -5877, -1944, -2394, -2412, -1832, 1986, 3578, -1225, -1716, -453, 2045, 3351, 1464, 3987, 6454, 6973, 7796, 6801, 3988, 2841, -792, -520, 1080, -374, 270, 759, -4, 1183, 1833, -1761, -5134, -3867, -3061, -3327, -4330, -2211, 831, 3133, 1406, 1440, 2452, 182, -2367, -2465, 987, 2882, 1010, -2503, -1991, -958, -480, -3325, -7305, -4526, -1627, -1237, -2211, -2244, -628, 569, 2933, 2618, 746, -333, -1227, 10, -230, 2110, 2234, 1335, 535, 35, -583, 2323, 2979, 957, -1644, -972, 701]
2010G01O74k177k453n34J163J396q80k608m14K235K943K4J388J771k194R93j503
1993E25n45J152l450N83J441k451J222l41j53L71O64L38R2j913L124M665K33j649
1975C908j564k918l576J991M16q39P10j246N14l64j427M97L354M020L74l955j288
1958a393K984R70J131k632l519n21J431j848K366J699N10K47P53R06l263j805
1942a984k902K83J363K166L060p24k866q92j258n37P74O08kq84J537l91J827J618
1924G96J484J697M5N49k600P81K856k694j503j487K78J736j881Q02M992J365O83
1907G899K164J672q86l755m885j497o88j035P41J454l180J501J991N83l10m139
1891b370j065J210J299k77j846n14j67j895K265K607j157QK298K92J888K956M25
$$ y = [701, 1375, -802, -3255, -3789, -2626, -1230, -2110, -4718, -5132, -2897, 46, 70, 1458, 3229, 1035, 2028, 525, -20, 1132, -2318, -1735, -294, -2745, -1523, -1864, -2017, -1646, -982, -644, -552, -2465, 659, 5324, 5557, 3908, 2344, -574, -4150, -2159, -1743, -2582, -1872, -3118, -2604, -2968, -4395, -3898, -544, 3476, 3850, -105, -1393, 1591, 2561, 3692, 1060, -2459, -2980, -1549, -3397, -1031, 668, 1178, 1425, 2178, 3084, -179, -1984, -4886, -4603, -3240, -1074, 1986, 1262, -1604, -2496, -3754, -4291, -3517, -2909, -2911, -3795, -2258, -2649, -822, 796, 2280, 3977, 4022, 4571, 1971, 2752, 5608, 2914, 1411, -76, 202, 1938, 57, 859, 5851, 7216, 7899, 10063, 11735, 10849, 7094, 2209, 712, 24, -1011, -270, 1184, -1996, -495, 1496, 2079, 1769, -2370, -3435, -2225, -926, -1203, -3049, -3563, -3730, -5625, -3360, -753, -1910, -1902, 396, 688, 2576, 5532, 5957]
1874E957J662R85O26l53o84p601m777K112n84K079j009J9J716O71j147P18M36
1857H26j498L728J142N93J575k930q42O47N88K88j732J756P05j345L244J5j161
1840E599j627J042Q04k416l273j598J244O013J556J468k493k915J576k087q51
1825B042J346l642J109K665P45j752j861m23k36J636l44k146L577J3p79J868j45
1808C673P0J899k120n114k823K449J911l393Q04L009j628J138J758Q30j546j379
1792d62j847J018J456K166Q63k663N21M69R15k812q82K556M911l491j253j407
1776E8l321O2J86L436p81j272j148J680k26k396J953J757J003L549j88k907q6
1759A359K531J33j650k934L09L53q53l882m9N253K548k353k179r87Q99j483L74
$$ y = [5957, 7619, 8604, 9230, 8877, 8193, 592, -4185, -2073, -2657, -578, -1587, -1568, 148, 819, -328, 390, 826, -672, 3056, 4198, 4791, 6366, 3436, 2594, 3241, 3829, 4117, 2385, 4141, 4846, 3501, 6745, 6760, 5599, 3972, 5014, 5818, 3402, 129, -1469, -225, 5788, 7344, 8812, 6319, 3404, 4980, 2893, 2042, 3388, -254, 855, 3520, 4265, 2513, 652, 229, -7, 1629, 1285, -861, 2716, 2729, 1950, 3818, 3673, 3743, 5642, 3522, -1592, -4415, -1966, -55, -3448, -2644, 365, -1263, -125, 1633, 2463, 917, -462, -2309, -1291, 165, 2331, 3194, 531, 1052, 1521, 2436, -376, -1258, 1298, 6209, 2718, 1465, 58, -3263, -3201, -3015, 421, -360, -1632, -2780, -1100, -1326, -3722, -1769, -12, 991, 4540, 4352, 1445, 1359, 3890, 4023, 2373, -561, -252, 101, -752, -4634, -4683, 570, 3118, 765, -1414, -2401, -1502, -2985, -2611]
1742b611J34j615L96K22O57K553P55j413j626Q00J142r27j636L543L383j64k252
1725A341m13j854m5K324J887K220J585o06k988j6k916j292M50l72J170J872m07
1708A940l082Q80O02j660j655P29k89J58M18K093K232K530l669k577J793J388
1692A831q46o16j264n47M76K202L96k93K548L390j759l952l06P06pJ406K828j038
1674E155J710k097m077q69R53N88k878J294l37j973k774k50L904N96K059O25j86
1657A443k85R48j341K99J717k132k636j178O502K882j881j16k152n079j144L521
1641f32M387N68l520q52k394n72m62M91Q48J473L304L82n65k62j631K734j311
1624A986k956n612k691K103L870k605J408M889J719J095N92j784P95n41J834N21
$$ y = [-2611, -2477, -4092, -3696, -3474, -2817, -264, 491, -922, -2548, -1748, -606, -1533, -3169, 374, 3757, 3593, 1341, 928, -926, -971, 1353, 3240, 5460, 7045, 6439, 3451, 3435, 519, -773, -323, -695, 475, 2347, 1940, -1142, -262, 340, -1320, -2975, -2246, -2535, -2377, -1959, 134, 2366, 4896, 1227, -1350, 443, 1831, 985, 369, -895, -1442, -966, 1236, 1632, 1339, 3887, 7277, 5518, 1566, 1260, 1966, 1959, 3365, 6193, 5155, 6865, 4768, 691, -178, 775, 1363, -1515, -221, -558, -2531, -5305, -5555, -1651, -1055, 1004, 1629, 1443, 1158, 2106, 765, 1064, 2781, 649, -1987, -3165, 3337, 6219, 4338, 4222, 2070, -3009, -4153, -632, 3755, 4323, 803, -49, -2443, -3015, -3477, -2986, -2138, -665, 2639, 3021, 2456, 2194, 563, 3297, 1986, -970, -6582, -9273, -7170, -3300, -5905, -4497, 392, 2111, 3206, 3798, 2014, 2809, 2268, 4102, 4623]
1608D623j214j491k263K56k255k040N32M891K241j988m20j116j324j581M4k410
1592e515n7J702L01J332j156j553K121J845K210k501p38p6j814k787M67K039K081
1575b099n89K483K197j671j541P9J484R41R24L898n284m359N66k97PL14j056j789
1557e792J625M277K450k048j6K047j28k195k528j470J233J067j797J48M568j98
1541A243r05J727k726j224j107J092J706J999J191N53m835n202j09j933N43N345
1525b642O1k71J320j891J006J60L599J981K16k408k844p22J257K15J546l12k476
1508b205n92J819n007m95K370J910M36J587Q9k154J257J090k46L64p29K626L212
1491E332K196m397j417J424k542k19L400J126L71J277j961l548l33L8k365K55
$$ y = [4623, 3409, 1918, -345, -89, -2344, -4384, -3852, 1039, 3280, 1292, 872, -244, -1568, -3149, -3105, -5515, -5572, -3870, -3569, -2237, -3393, -4946, -2825, -980, 1230, -1271, -2009, -2085, -3899, -6686, -6219, -4180, -2099, -2688, -205, 1992, 321, -1220, -1141, 343, 1284, 2208, 6106, 822, -3537, -2971, -3268, -3261, -2947, -4003, -5792, -4167, 110, 2560, 512, 496, 2543, 2415, 220, -2308, -3778, -2545, -1478, -3275, -3127, 1441, 1243, 338, 2065, -661, -1885, -2992, -1900, -194, 1805, 2996, 3549, -1286, -6488, -6597, -8530, -7987, -2642, -2581, -2852, -1532, -3423, -2417, -2257, 1342, 3323, 3539, 1131, -1713, -2435, -1178, -963, 583, 271, -2205, -2797, -978, -5985, -6480, -4110, -2200, -1764, -177, -88, -2242, -985, 105, -141, 223, -506, 2120, 5332, 7528, 3131, 1714, 3138, 596, 377, 3777, 4903, 5274, 6551, 4590, 1042, 709, 747, -1618, -1363]
1475a363k61J579q64p44J755J603o70q71J220j107m94K20P40R30J080q26K268
1458D195l611M49L92k344J68j159k689Q36O79K365O96r02L965L384k270o101o22
1441b569j591N63p43k020j025K01K319L078K082K689j006o03P02l85l138l880
1425e326L00M097M525J200j252m64j279l236l28J216J525l467R09J654j834r27
1409b687L50Q07j371M903L326j382K33J204m78k297K95j583k243l37P95k001j94
1392b660K74J86n58P21J83J910P11j437J123J909j172L745J751j047J840J110
1376H589m513j117k627n14m34j215K663J586J0j009r57k455n61L200L531k415
1360A762J339j429k045J590M180q37Q53R16k760k016o30J933J048J305K370k111
$$ y = [-1363, -1624, -45, -909, -1653, 102, 1705, 1035, 164, 1384, 277, -217, 3, 743, 1673, 2753, 1927, 4195, 584, 1033, 1425, -919, -751, -1910, -4599, -3763, -3084, -719, -23, -925, 3040, 6424, 4154, -1947, -2569, -4160, -3597, -4340, -6360, -7385, -7184, -4865, -1787, 295, 2984, 1978, 1375, 2077, 1692, -1446, -5326, -5026, -929, 3596, 4796, 3544, 3080, 1801, -1435, -1763, -547, 978, -2489, -1580, 74, -1760, -2687, -2337, -1530, -2901, 2002, 5328, 3946, 4179, 5383, 4905, 2608, 2903, 1320, -923, -1260, -465, -2466, -2660, -2386, -2200, -2758, -2037, -1854, 56, 767, -670, 453, 2362, 1190, 4935, 6686, 5639, 7479, 8589, 4076, 2959, 332, -182, -616, -1831, 832, 2418, 2428, 1419, 462, -1993, -2554, 646, 4177, 1762, 3101, 1672, -373, 1217, 5397, 4560, 5413, 6329, 3569, 1553, 923, 2856, 3904, 5209, 7579, 5468]
1344E468k55k262n01j964l232j386J9j001p37L94J987K460M264J046l139k861
1328a700J66j337R07K04J984J142r82k406J1J47L41J885K91q65l134K280J149
1311H3L19k596l986k124M535M458L193K37j632J02J491l5o12o98q0k152j196r16
$$ y = [5468, 5213, 2951, 2450, 486, -2746, -4132, -4113, -5114, -5851, -5457, -3470, -1010, 3254, 4300, 1161, -1700, -1534, -2871, -1964, -1760, 224, 1366, 384, -2022, -2011, -1864, -1523, 362, 653, -212, -3346, -1066, 83, 402, -2194, -6180, -8304, -3769, 689, 3882, 4119, 2487, 2589, 4080, 4045, 3433, 2735, 2655, 503, -693, -1609]
$$ [...]
##END NTUPLES=NMR SPECTRUM
##END=
