##TITLE=Analysis number 329039
Compound Code cc 55504
Book Reference 540/16
Project Code adrs
Chemist Name mikem
##JCAMPDX= 6.0         $$ Bruker NMR JCAMP-DX V2.0
##DATA TYPE= NMR SPECTRUM
##DATA CLASS= NTUPLES
##ORIGIN= Bruker BioSpin GmbH
##OWNER= nmr
$$ XWIN-NMR		Version 3.5
$$ Thu Jul 26 13:13:33 2007 GMT Daylight Time (UT+1h)  MAYBRIDGE\nmr@NMR_250MHZ
##.OBSERVE FREQUENCY= 250.131544655141
##.OBSERVE NUCLEUS= ^1H
##.ACQUISITION MODE= SIMULTANEOUS (DQD)
##.ACQUISITION SCHEME= undefined
##.AVERAGES= 16
##.DIGITISER RES= 18
##SPECTROMETER/DATA SYSTEM= dpx250
##.PULSE SEQUENCE= zg30
##.SOLVENT NAME= CDCl3
##.SHIFT REFERENCE= (INTERNAL, CDCl3, 0, 16.522)
##AUDIT TRAIL= $$ (NUMBER, WHEN, WHO, WHERE, WHAT)
$$ ##TITLE= Audit trail, XWIN-NMR		Version 3.5
$$ ##JCAMPDX= 5.01
$$ ##ORIGIN= Bruker BioSpin GmbH
$$ ##OWNER= nmr
$$ C:\u/data/dgb/nmr/ADRS/1520/pdata/1/auditp.txt
$$ ##AUDIT TRAIL=  $$ (NUMBER, WHEN, WHO, WHERE, WHAT)
(   1,<2007-07-26 13:13:11.75 +100>,<MAYBRIDGE\nmr>,<NMR_250MHZ>,
      <created by zg, POWCHK disabled, PULCHK disabled
       configuration hash MD5:
       76 6E 9A 78 1E 09 19 81 EC 84 63 8F B0 6A 59 2D
       data hash MD5: 64K
       5B 70 C1 07 B2 9B D2 52 B6 83 63 83 CC E8 D1 5E>)
(   2,<2007-07-26 13:13:23.03 +100>,<MAYBRIDGE\nmr>,<NMR_250MHZ>,
      <Start of raw data processing
       ef LB = 0.3 FT_mod = 6 PKNL = 1 SI = 32K 
       data hash MD5: 32K
       20 12 80 10 26 2A FC 9F 6B 94 0E EE CB 09 D3 F8>)
(   3,<2007-07-26 13:13:24.84 +100>,<MAYBRIDGE\nmr>,<NMR_250MHZ>,
      <apk 
       data hash MD5: 32K
       19 C0 11 88 4F 41 7E 01 89 1E 0D 94 B3 B9 E7 B7>)
(   4,<2007-07-26 13:13:25.53 +100>,<MAYBRIDGE\nmr>,<NMR_250MHZ>,
      <abs ABSG = 5 
       data hash MD5: 32K
       D5 58 B5 51 49 23 98 64 E0 CC 41 B5 DF 33 EA 5A>)
$$ ##END=
$$ 
$$ hash MD5
$$ E9 FA EF E3 37 1E 82 E9 C6 DB 53 DB 52 E4 90 A8
##$RELAX= 
##$RELAX= 
##$RELAX= 
##$RELAX= 
##$RELAX= 
##$RELAX= 
##$RELAX= 
$$ Bruker specific parameters
$$ --------------------------
##$DU= <C:\u>
##$EXPNO= 1520
##$NAME= <ADRS>
##$PROCNO= 1
##$TYPE= <nmr>
##$USER= <dgb>
##$AMP= (0..31)
100 100 100 100 100 100 100 100 100 100 100 100 100 100 100 100 100 100 
100 100 100 100 100 100 100 100 100 100 100 100 100 100 
##$AQSEQ= 0
##$AQ_mod= 3
##$AUNM= <au_zg>
##$AUTOPOS= <21 >
##$BF1= 250.13
##$BF2= 250.13
##$BF3= 250.13
##$BF4= 250.13
##$BF5= 500.13
##$BF6= 500.13
##$BF7= 500.13
##$BF8= 500.13
##$BYTORDA= 1
##$CFDGTYP= 0
##$CFRGTYP= 5
##$CHEMSTR= <none>
##$CNST= (0..31)
1 1 145 1 1 1 1 1 1 1 1 1 1 1 1 1 1 1 1 1 1 1 1 1 1 1 1 1 1 1 1 1 
##$CPDPRG= <>
##$CPDPRG1= <>
##$CPDPRG2= <>
##$CPDPRG3= <>
##$CPDPRG4= <mlev>
##$CPDPRG5= <mlev>
##$CPDPRG6= <mlev>
##$CPDPRG7= <mlev>
##$CPDPRG8= <mlev>
##$CPDPRGB= <>
##$CPDPRGT= <>
##$D= (0..31)
0 1 0 0 0 0 0 0 0 0.06 0 0 0 0 0 0 0.0002 0 0 0 0 0 0 0 0 0 0 0 0 0 0 
0 
##$DATE= 1185451990
##$DBL= (0..7)
120 120 120 120 120 120 120 120 
##$DBP= (0..7)
150 150 150 150 150 150 150 150 
##$DBP07= 0
##$DBPNAM0= <>
##$DBPNAM1= <>
$$ [...]
##$SUBNAM7= <"">
##$SUBNAM8= <"">
##$SUBNAM9= <"">
##$SW= 20.6930455092707
##$SWIBOX= (0..15)
0 0 3 0 0 0 0 0 0 0 0 0 0 0 0 0 
##$SW_h= 5175.983436853
##$TD= 65536
##$TD0= 1
##$TE= 297.16
##$TE2= 300
##$TE3= 300
##$TEG= 300
##$TL= (0..7)
0 120 120 120 120 120 120 120 
##$TP= (0..7)
150 150 150 150 150 150 150 150 
##$TP07= 0
##$TPNAME0= <>
##$TPNAME1= <>
##$TPNAME2= <>
##$TPNAME3= <>
##$TPNAME4= <>
##$TPNAME5= <>
##$TPNAME6= <>
##$TPNAME7= <>
##$TPOAL= (0..7)
0.5 0.5 0.5 0.5 0.5 0.5 0.5 0.5 
##$TPOFFS= (0..7)
0 0 0 0 0 0 0 0 
##$TUNHIN= 0
##$TUNHOUT= 0
##$TUNXOUT= 0
##$USERA1= <user>
##$USERA2= <user>
##$USERA3= <user>
##$USERA4= <user>
##$USERA5= <user>
##$V9= 5
##$VALIST= <valist>
##$VCLIST= <CCCCCCCCCCCCCCC>
##$VD= 0
##$VDLIST= <DDDDDDDDDDDDDDD>
##$VPLIST= <PPPPPPPPPPPPPPP>
##$VTLIST= <TTTTTTTTTTTTTTT>
##$WBST= 1024
##$WBSW= 4
##$XGAIN= (0..3)
0 0 0 0 
##$XL= 0
##$YL= 0
##$YMAX_a= 618572
##$YMIN_a= -597469
##$ZGOPTNS= <>
##$ZL1= 120
##$ZL2= 120
##$ZL3= 120
##$ZL4= 120
##$ABSF1= 16.522
##$ABSF2= -4.171173
##$ABSG= 5
##$ABSL= 3
##$ALPHA= 0
##$AQORDER= 0
##$ASSFAC= 0
##$ASSFACI= 0
##$ASSFACX= 0
##$ASSWID= 0
##$AUNMP= <proc_1d>
##$AZFE= 0.1
##$AZFW= 0.1
##$BCFW= 0
##$BC_mod= 0
##$BYTORDP= 0
##$COROFFS= 0
##$CY= 12.5
##$DATMOD= 1
##$DC= 0
##$DFILT= <>
##$DTYPP= 0
##$F1P= 14.0000005364418
##$F2P= -0.99999901652339
##$FCOR= 0.5
##$FTSIZE= 32768
##$FT_mod= 6
##$GAMMA= 0
##$GB= 0
##$INTBC= 1
##$INTSCL= 1
##$ISEN= 128
##$LB= 0.3
##$LEV0= 0
##$LPBIN= 0
##$MAXI= 10000
##$MC2= 0
##$MEAN= 0
##$ME_mod= 0
##$MI= 0
##$NCOEF= 0
##$NC_proc= -2
##$NLEV= 6
##$NOISF1= 0
##$NOISF2= 0
##$NSP= 0
##$NTH_PI= 0
##$NZP= 0
##$OFFSET= 16.522
##$PC= 1
##$PHC0= -53.2654
##$PHC1= 6.759319
##$PH_mod= 1
##$PKNL= yes
##$PPARMOD= 0
##$PSCAL= 4
##$PSIGN= 0
##$REVERSE= no
##$SF= 250.13
##$SI= 32768
##$SIGF1= 0
##$SIGF2= 0
##$SINO= 400
##$SIOLD= 32768
##$SREGLST= <1H.CDCl3>
##$SSB= 0
##$STSI= 32768
##$STSR= 0
##$SW_p= 5175.98343685301
##$SYMM= 0
##$S_DEV= 0
##$TDeff= 65536
##$TDoff= 0
##$TI= <Analysis number 999999
Compound Code 99
Book Reference 9
Project Code 9>
##$TILT= no
##$TM1= 0
##$TM2= 0
##$TOPLEV= 0
##$USERP1= <user>
##$USERP2= <user>
##$USERP3= <user>
##$USERP4= <user>
##$USERP5= <user>
##$WDW= 1
##$XDIM= 32768
##$YMAX_p= 536194766
##$YMIN_p= -37942
$$ End of Bruker specific parameters
$$ ---------------------------------
##NTUPLES= NMR SPECTRUM
##VAR_NAME=  FREQUENCY,     SPECTRUM/REAL,   SPECTRUM/IMAG
##SYMBOL=    X,             R,               I
##VAR_TYPE=  INDEPENDENT,   DEPENDENT,       DEPENDENT
##VAR_FORM=  AFFN,          ASDF,            ASDF
##VAR_DIM=   32768,         32768,           32768
##UNITS=     HZ,            ARBITRARY UNITS, ARBITRARY UNITS
##FACTOR=    0.157963299565203, 1,           1
##FIRST=     4132.6476996994, 0,             0
##LAST=      -1043.33573715361, 0,           0
##MIN=       -1043.33573715361, -37942,      0
##MAX=       4132.6476996994, 536194766,     0
$$ Real data points
##PAGE= N=1
##DATA TABLE= (X++(R..R)), XYDATA
$$ [...]
21620 -538 -1835 2425 712 -5002 -4622 -3004 5358 6717 1701 -8081 -5532 -4797 -2532 -2978 494 -3534
21604 -3534 -1583 6331 5866 1643 -255 6923 9227 4314 1658 -2113 -2509 -5086 -7496 -7384 275
21589 275 6190 448 -3567 222 -2450 -11459 -9414 -4968 304 3296 6799 11563 8130 6895 4090
21574 4090 4515 2951 -98 -8548 -7857 -1458 4776 8708 6639 -3191 -7337 -5087 -8978 -9733 -8801 978
21558 978 -455 -4864 -11550 -11269 -6620 -3153 -4935 -3160 -40 -2116 -675 -2679 -4595 -2934 1283
21543 1283 7414 5658 2095 3063 2608 4701 10582 5268 199 -4427 -4576 -5885 -5911 -11337 -13094 -9983
21527 -9983 -8941 -12230 -14189 -12325 -7844 -6134 -10879 -9200 -7890 -8843 -6674 1259 8972 4006 -2781
21512 -2781 3063 3526 -955 -911 -1196 -4383 -3878 -8367 -5380 -544 864 4783 7083 3689 2141 1357
21496 1357 -1974 408 11339 15105 12330 9278 7927 7155 4559 4731 568 -2584 3491 6275 6357
21481 6357 11408 15094 19747 31856 34596 25913 13813 16090 23001 29172 40816 61677 89694
21468 89694 123596 186689 303783 477331 670678 835054 962693 1013331 958717 839531
21458 839531 683431 492541 316175 201521 137344 102011 77284 64572 54534 44314 29509
21447 29509 23550 20250 22926 15315 7693 9986 13047 14012 5385 3801 9864 13619 13292 8451 2494
21432 2494 604 -4242 713 4271 2182 -4879 -7721 -12034 -11099 -12599 -10392 -9400 -10702 -7397 -9613
21417 -9613 -7473 -12431 -19094 -16840 -16520 -13505 -16709 -10084 -2376 1987 500 -8623 -12448 -8048 -14174
21402 -14174 -16616 -14948 -6616 -3138 -3127 -5707 -6141 -11261 -10453 -9868 -10284 -10973 -9393 -9503 -15567 -18146
21386 -18146 -17212 -12163 -10168 -12941 -15931 -15094 -13311 -3716 126 3054 4677 1440 -4919 -6494 -7695
21371 -7695 -10027 -9536 -9015 -742 841 -1599 -1450 -1456 -5417 -3205 1083 2145 -4962 -5931 -13993 -7905
21355 -7905 -1843 2290 4003 3517 -852 -4451 -4893 -10696 -10142 -6064 -95 987 -1555 -1163 6040 12448
21339 12448 11373 1556 -9593 -9955 -7981 -3986 -629 -6145 -15200 -15957 -9355 -6843 -3895 1880 -3184
21324 -3184 -4483 -1118 -2856 -8305 -7595 -4424 -5104 -3436 -3492 -6655 -12151 -8035 -445 1445 1393 -1660
21308 -1660 -8948 -9807 -7092 -5763 -10759 -12533 -14549 -13440 -10176 -7089 -2775 -7170 -7923 -4011 -1504
21293 -1504 1799 -2284 3504 2387 -4332 -7417 -8814 -8355 -8619 -4673 -9507 -10341 -8987 -5907 -5083 -10286
21277 -10286 -11743 -10864 -3148 2672 -634 -1672 -1095 -4153 -4638 -9589 -10837 -10209 -9364 -6907 -5736 -9887
21261 -9887 -9487 -9301 -10152 -6154 -6509 -8807 -1154 1032 3139 -719 -10190 -7134 -8843 -10815 -11811 -13405
21245 -13405 -12669 -2832 3886 900 5158 3499 3679 4695 1645 -4585 -3198 -1871 -4252 1125 8177
21230 8177 9406 4300 2057 87 -3263 -5565 -8034 -7169 -2901 5305 4155 7136 1140 1940 1133
21215 1133 -2976 -2570 -3465 -1505 -7378 -9384 198 -1951 -2278 -5724 -12540 -14597 -5102 -1002 445
21200 445 521 234 1454 396 -4421 -3304 -2524 -4350 -10895 -15239 -13688 -10154 -12052 -16374 -16732 -10851
21184 -10851 -7142 -5797 -9742 -10447 -14149 -15112 -11863 -6817 -2889 4085 6646 1738 -7168 -6488 -9595
21169 -9595 -11972 -4967 -4368 -6727 -3678 -3897 -10011 -10162 -4295 2129 -5286 -11058 -7600 -1471 4023
21154 4023 7556 12216 12641 6610 -2910 -7106 -7281 -5251 -7362 -5149 -5699 -5278 -3157 -4089 -9528 -14629
21138 -14629 -12121 -14129 -10784 -6569 -13498 -23691 -26923 -22354 -7936 -5376 -6092 -5601 -4062 -5282
21124 -5282 -8361 -10141 -10387 -2432 -7869 -2881 2903 -7468 -18582 -14108 -7769 -3995 -3107 -5877 -4547
21109 -4547 -8901 -12165 -12320 -12349 -6590 -1683 1856 1129 1019 -228 -1177 354 374 -2710 1242 -1658 -4074
21092 -4074 -3008 2282 6555 3088 -2512 -10403 -14918 -13610 -12900 -7745 -6396 -721 -1652 -2592 -4166
21077 -4166 -5922 -10885 -4620 1519 -2219 -7707 -12135 -3289 -2259 1819 7444 7247 4297 4168 1772
21062 1772 -5081 -2529 1021 2472 -763 -10867 -12066 -11073 -14051 -16165 -16000 -10505 -3153 -816 2942
21047 2942 -555 -15106 -8378 2449 -2873 -7482 -1880 1251 -37 -1361 -4651 -12415 -12330 -4579 -2625
21032 -2625 -3740 -6309 -5340 -7518 -9181 -8510 -13933 -10735 -5064 605 2761 2567 -6250 -12329 -13646
21017 -13646 -13031 -8597 -5848 -373 -3028 -11457 -16588 -20584 -13842 -3495 -1322 -3520 -5583 -5883 -2567
21002 -2567 2394 -88 -1646 -412 -2550 -7408 -7985 -2001 -354 -9291 -4181 -3369 -6361 -4036 -4819
20987 -4819 -8907 -7232 -12596 -23304 -25674 -19563 -19976 -18410 -6573 258 -3056 -5140 -7314 -6879 -5111
20972 -5111 -6366 -11593 -12306 -9793 -12410 -13105 -15070 -13988 -10680 -13446 -10503 -1067 -5891 -8780 2669
20957 2669 5732 1668 2791 -717 -2903 -7314 -3233 -2226 -3785 -3799 -247 -4446 -4630 -5461 -7448 -8505
20941 -8505 -5081 -314 -3530 -7122 -2868 1882 1379 8128 8664 1175 -2204 -5832 -1027 -6018 -11900
20926 -11900 -14555 -13300 -6095 2939 3171 -1207 -3476 -5288 -4512 -3457 -6902 -5145 -3853 -5526 -6381
20911 -6381 -1668 -3539 -3025 -4933 -3355 -1925 -6385 -9479 -11414 -8403 -10379 -9241 -9944 -9419 -355
20896 -355 1100 2902 2251 -3064 -6143 -9763 -15750 -10670 -9553 -3308 -2323 -2009 -5316 -7080 -6665 -4465
20880 -4465 -2847 -5178 -8427 -16848 -11934 -5858 -6217 -1623 -2285 -4159 -4947 -2846 399 3216 261
20865 261 -3576 -3354 -6234 -3033 -5145 -5193 -5139 -3451 -2783 -3604 -1734 -6692 -9647 -5742 -1509 -5316 -7355
20848 -7355 -9574 -2592 -1469 4376 5947 824 -5868 -8398 -8676 -9120 -9280 -2381 -2432 -8346 -7279 1611
20832 1611 4577 4898 2545 -8567 -12865 -10986 -14072 -11270 -7544 -4073 1004 280 -3973 -4448 -1209
20817 -1209 -4037 -11827 -12919 -11764 -12612 -11481 -5474 -3267 -3526 -12220 -13615 -6642 -3483 -5292 -9239
20802 -9239 -3574 -6910 -13328 -16445 -13632 -16395 -19893 -13403 999 2207 879 6022 9265 12004
20788 12004 11955 3481 451 2093 -1886 -2135 -755 1804 -3294 -7733 -6119 -3775 -5454 -15963 -12021
20773 -12021 -5503 -2091 -930 -7113 -10795 -6563 -2705 1407 -1754 -13335 -13010 -13098 -6679 3660 4513
20758 4513 -3034 -18844 -14928 -2265 3126 -3903 -2862 -5376 -8624 -11762 -11442 -10590 -12932 -14101 -10989
20743 -10989 -12375 -16005 -14392 -15567 -8161 1512 -7613 -6564 -6755 -11675 -7811 -9910 -15749 -9595 -9668
20728 -9668 -16017 -21139 -23022 -16728 -7156 -3307 -2521 -5067 -2126 328 1543 2965 -1501 -19174 -25187
20713 -25187 -23502 -23215 -17594 -16749 -22957 -20034 -11586 -10156 5 2595 -5265 -7110 -8390 -8645 -6690
20698 -6690 -3682 1912 5174 2134 -5344 -2096 -1782 -10749 -22921 -20291 -5285 -3871 -11580 -6621
20684 -6621 -13529 -16094 -18566 -15846 -11869 -9479 -3642 -1962 -7236 -10056 -7003 -4256 -5061 -8026 -5160
20669 -5160 -7069 -5047 -1932 -6048 -7129 -940 1929 4799 4522 1738 476 -1507 -1319 712 666 -126
20653 -126 3795 6539 8374 4645 -3565 -2139 -1138 -2967 -1534 -286 -1658 -9969 -14106 -14474 -13789
20638 -13789 -9447 -8126 -10076 -14443 -19277 -21163 -13300 -5779 -9621 -5250 -2719 -2089 -6903 -21097
20624 -21097 -20653 -13654 -7340 -4710 -5790 -8558 -13075 -15060 -9321 -13296 -8769 -6411 -6680 -6473 487
20609 487 2834 -8602 -15109 -10860 -2419 -7261 -6287 -3524 195 1987 178 -833 -8042 -7372 -6444
20594 -6444 -8101 -7461 -7835 -11473 -17501 -11761 -7295 -1876 -3301 -4844 -3778 -13912 -18602 -18361 -17573
20579 -17573 -11856 -10492 -14753 -13222 -9953 -13975 -14548 -14772 -8423 -5009 -10786 -8376 -8680 -9496 -9066 -5574
20563 -5574 -506 -2977 -4697 -11608 -16362 -11487 -7376 -5171 -1315 -4401 -3518 -2654 -7472 -10482 -13406
20548 -13406 -10972 -7333 -2817 -2416 -2788 -10478 -9938 -2996 2679 7716 6623 6366 -328 -11289 -11095
20533 -11095 -10185 -13346 -13551 -3707 4352 3536 92 2166 1193 -4435 -8839 -9123 -10260 -1953 -1367 -372
20517 -372 1025 336 -5501 -5093 -9363 -12499 -10242 -8515 -12420 -12469 -14814 -24135 -18902 -7380 -5357 -5666
20501 -5666 -9240 -10470 -7164 -5228 -2930 -587 162 1114 -2659 -3671 3131 4944 287 -7849 -7580
20486 -7580 -1204 -4776 -9484 -13459 -6849 -3880 -3731 -6495 -12188 -10991 -6381 -3831 -2631 -5410 -11574
20471 -11574 -9960 -6446 -1537 -2748 -5191 -5999 -2723 -6323 -11346 -10826 -10412 -5572 -2460 -6223 -8146
20456 -8146 -9274 -8099 -11012 -14962 -19277 -15150 -9620 -14261 -17716 -13700 -13158 -11353 -10921 -7982 -227
20441 -227 1626 -3567 -6586 -1533 -715 7029 10433 9490 7970 2557 -2039 -1934 -1119 -4234 -8381 -4130
20425 -4130 1507 339 -5725 -7322 -10797 -5697 49 -42 -7291 -12189 -5328 194 -2537 -3802 -4858
20410 -4858 -5430 -11549 -12316 -9253 -7641 -10345 -14927 -7577 4950 10935 7782 1118 -5996 -11438 -14325
20395 -14325 -18666 -20324 -20048 -15265 -10003 -5357 -7261 -6657 -4454 -3513 -6727 -8831 -10376 -3306 2403
20380 2403 1509 -2566 -3155 -3224 494 576 -3736 -8141 -10184 -10025 -5068 -12161 -11299 -2715 4087 6644 9344
20363 9344 -1874 -5591 -11238 -16159 -11373 -8624 -14836 -18118 -17588 -7118 -6233 -6931 -5599 -7090 -9370
20348 -9370 -6868 1623 -745 487 -909 464 -2982 -6419 -12407 -11046 -13507 -12750 -7329 -5525 -2800
20333 -2800 -6648 -11144 -5149 -2901 -3117 1047 -4439 -4005 5008 -354 -5362 -7312 -1362 2087 -2234
20318 -2234 -9572 -9758 -4861 -6834 -4902 -2104 -2818 -7680 -11958 -5013 -6031 -11914 -14731 -20024 -19004
20303 -19004 -14507 -8285 -800 2898 2309 2417 2836 -1673 -7454 -7164 -4728 2915 3995 239 -6697
20288 -6697 -7473 -8113 -10673 -12282 -4019 -3483 -3607 -2607 -958 -1334 -4300 -6914 -11115 -8582 -13182 -15687
20272 -15687 -5789 -2087 -3206 -1969 -629 -830 -4521 -8944 -11038 -13126 -8951 -8985 -6387 -7990 -4033
20257 -4033 -1147 -5423 -10223 -18231 -22232 -18225 -19050 -8167 -3773 -11498 -17609 -13207 -8530 -8577 -2881
20242 -2881 -3418 878 1196 -4704 -10051 -3440 -4203 -163 1755 -3524 -3069 -5294 -6870 -5616 -9445 -13808
20226 -13808 -11154 -6183 394 -90 -3375 1730 1073 4932 2565 1234 1480 7941 6313 1879 2294
20211 2294 4549 7118 13476 11063 3558 7892 2201 4497 6228 3067 1349 -3101 -10288 -13475 -8650
20196 -8650 -5994 -3701 -4797 -8435 -985 4414 1243 -2669 -1187 -421 -4745 -11628 -16755 -21025 -15642
20181 -15642 -2539 186 107 -1518 -9880 -11924 -10387 -7393 -9885 -13876 -12309 -5326 -2090 -5852 -3202
20166 -3202 -5272 -1963 1719 1940 -3440 -8480 -12713 -9558 -10270 -10103 -16916 -15371 -10339 -2852 -4213
20151 -4213 -13501 -17202 -19410 -23036 -20245 -17089 -8501 -5644 -9390 -15625 -13455 -5639 -3950 -10766 -13291
20136 -13291 -1551 -2019 -7535 -6952 -9873 -12073 -10713 -3262 9143 12299 3181 -1840 -5012 -637
20122 -637 -2535 -1366 -2091 -3765 -6229 -3443 -5442 -7581 -2385 -3171 -5461 -8678 -7766 -11917 -6847 -3017
20106 -3017 871 1660 635 -4318 -9473 -9243 -10365 -16870 -18173 -12888 -5390 -3967 -3229 -8423 -13674
20091 -13674 -12746 -14915 -8608 -552 4856 9944 9956 6380 47 -6145 -3520 3883 9552 10543 5204
20076 5204 -8960 -11317 -11455 -8527 -830 -56 -2141 -9142 -9510 -2675 -3814 -10075 -7870 -3350 -2505
20061 -2505 -7630 -3758 1150 2246 -908 -5243 -5817 -5978 -7024 -12383 -4823 -1963 -6840 -9310 -5395
20046 -5395 -9803 -15070 -8671 -7904 -8401 -11086 -14807 -15230 -10677 -5991 -454 239 -9229 -15618 -11180 -8128
20030 -8128 -5052 -800 -1432 -1194 -5899 -3709 -783 -5627 -8887 -6406 -7188 -6299 -9430 -18700 -15211 -8817
20014 -8817 -9309 -13348 -6394 -2029 -3644 1704 808 -3253 -3397 -4038 -454 -568 -4592 -3718 -6639 -10838
19998 -10838 -6063 -4176 -8305 -6535 -10204 -14048 -14919 -15234 -14042 -8519 -15292 -19188 -16201 -19446 -25864
19983 -25864 -32600 -22252 -11108 -11976 -13197 -7889 2475 4733 -3564 -7127 -3586 -9586 -10822 -11265
19969 -11265 -8147 -3027 565 -115 -1620 4303 5083 1336 -1478 -9070 -10328 -10714 -5770 1875 6400
19954 6400 -3633 -6005 -23 -1095 3415 6771 3589 -6868 -12990 -14974 -17718 -15957 -17849 -17804 -17636
19939 -17636 -12678 -6005 -5234 -8209 -10588 -17336 -14195 -7273 -3576 -9996 -9618 -356 4435 -1797 -811
19924 -811 -6235 -5326 -233 -228 1618 2055 7674 4331 -8590 -14200 -11968 -13501 -9195 -2643 3706 7819
19908 7819 1646 923 -3837 -11212 -10825 -9925 -7385 -1061 -259 -2783 -5629 -9078 -9749 -5047 -8132 -11998
19892 -11998 -11591 -7877 -17496 -21972 -16552 -13543 -6628 -10362 -16248 -9293 -3525 -8331 -9910 -11047 -8335
19877 -8335 244 -60 -8206 -6796 -9023 -14747 -18472 -19967 -21729 -12711 -5371 -569 -5638 -9203 -2071
19862 -2071 3762 612 -6994 -8174 -6223 -5523 -9201 -6801 1023 6121 1061 -4804 -2693 -808 -2787
19847 -2787 -3632 -9914 -7413 -627 3173 7128 7822 5491 3809 -2747 -3097 -2002 -2484 -11330 -9852 -9072
19831 -9072 -5869 -5116 -5020 -6103 -6094 -9140 -9079 -10720 -12919 -12692 -9452 -14065 -13435 -7135 -7344 -9497 -10364 -14640
19813 -14640 -20818 -14525 -4436 1066 -4190 -428 1253 -5100 -8251 -9802 -3455 -5573 -7274 -10821
19799 -10821 -13227 -6377 -7736 -13039 -16968 -9793 -3076 -3679 -3037 140 -2044 -929 -2632 -8397 -6072
19784 -6072 -1918 -4907 -5578 -6268 -386 -1142 -2333 -1946 -3895 -3200 -6571 -2296 -575 1440 2889 1787
19768 1787 -3305 -4766 -3686 776 -1061 2626 1644 170 -6527 -8508 -4564 -2107 -5647 -6215 -1750
19753 -1750 -487 8658 4478 -2394 -6421 -10357 -18042 -16970 -14790 -3375 -1762 -3763 -3902 -2238 -2003
19738 -2003 -5685 -10415 -8417 -229 2709 -1065 -9966 -13234 -6836 -3070 2096 850 -3399 -5940 -10793
19723 -10793 -14351 -11820 -2365 -5298 -3324 -255 -1031 1627 -2717 -6272 -5395 -5938 -3969 527 537 -8506
19707 -8506 -8191 -6908 1728 2745 567 -5795 -3163 -982 -552 3064 2618 -1178 -5043 -8675 -8403 -5726
19691 -5726 -10895 -10898 -2121 3310 6405 1590 -3319 -8257 -9698 -10764 -10969 -15158 -8507 3819 8171
19676 8171 8795 3713 912 6692 5686 683 -1047 -3169 -5922 -5231 -7836 -4494 -8093 -7774 -4174
19661 -4174 -6557 -10098 -13985 -15115 -7259 -8225 -13941 -12814 -11277 -10063 -6708 -1740 -2379 -4417 -4283
19646 -4283 -1118 -6195 931 3187 -3174 2444 8795 6677 4973 -2528 -7668 -6128 -3272 -3115 -291
19631 -291 -325 -4925 -7197 -7363 -3202 -2708 -4910 -7663 -7710 -9301 -9443 -10762 -7148 -1924 -1324 -5977 -5999
19614 -5999 -9786 -10792 -10740 -7996 -4288 -6523 -6615 -12257 -17141 -16268 -15331 -12847 -9344 -2888 -4025 -10475
19598 -10475 -17766 -16634 -13339 -7927 -8397 -2904 -3021 -4691 -1789 1652 1600 3084 1137 530 -372 -1489
19582 -1489 -4718 -2514 -5498 -8399 -5421 -4946 1735 -978 -2982 -655 3257 5823 -4893 -15862
19568 -15862 -20837 -15687 -14999 -9316 -3771 1687 -2042 -2991 -10948 -10787 -1531 -5342 -3713 -3240 -857
19553 -857 2821 2100 600 -1059 -2817 -6819 -4739 795 -2993 -11950 -6200 -9571 -10085 -7701 -187
19538 -187 -1698 -3650 2239 7368 737 -5016 1061 4321 9330 3917 -2136 -551 -1001 -700 3492
19523 3492 3115 2249 5749 10354 2765 -1482 -3223 -762 916 -4266 -3882 -2130 4003 4051 424 -6902
19507 -6902 -7207 -5074 -5671 -7123 1400 1278 -1175 -2060 292 2026 4843 912 -1628 -1625 1296 114
19491 114 3561 -431 -3363 -3309 -4935 -3863 -3284 -2388 -6554 -3401 -7305 -7965 -6534 -3172 -2537 1583
19475 1583 85 -4716 -4970 -1161 -620 -3201 -6792 -8188 -6124 1504 4887 2327 4233 5369 1559
19460 1559 -2761 -8711 -10399 1894 11019 7994 9032 4415 7465 3754 5597 7413 27 -3336
19446 -3336 2544 2703 554 -8155 -15546 -9383 -3190 -3243 -5743 -6623 -12381 -11237 -7955 -954 -2263 -1709
19430 -1709 -1342 -8684 -12624 -6255 -5864 -11598 -13021 -13261 -8872 -788 4929 -3288 -7731 -3735 -5579
19415 -5579 -2585 3153 11171 6765 1668 -4998 -6388 -5635 -2520 -2892 -3820 -951 5881 5436 4503 4807
19399 4807 6261 7105 6707 7359 5212 2926 8338 17657 20995 26984 36932 47460 73604 121127 208057
19384 208057 315176 371930 356111 315684 335478 453301 628969 693477 581817 418418
19374 418418 326373 328517 367439 362105 278123 183225 120163 89014 58133 41252 33694 27473
19362 27473 16988 10086 6576 7586 9336 4049 5413 5906 -1961 -7453 -5712 987 12322 16275
19348 16275 10532 8397 198 3661 11283 11544 4022 8145 4627 -2806 -10698 -10087 -7004 -11173 -8681
19333 -8681 -3911 -11724 -9865 -3710 -5096 -1486 1512 -833 7832 13459 5495 375 2330 273 -3460
19318 -3460 -7385 -13196 -10009 -9459 -8391 -6526 -4277 -4798 -6181 -5972 -8077 -11349 -10472 -6784 -11371 -10921
19302 -10921 -13089 -13048 -9276 -11407 -10298 -11825 -14276 -11711 -11497 -9596 -5988 -4087 -5000 -3801 5459
19287 5459 8057 7305 867 -1402 -4978 -4708 1647 -4660 -10316 -13024 -2579 4887 3579 -2039 -6677
19272 -6677 1195 5307 4702 2985 5211 11017 15710 18474 25522 25504 29849 33653 40229 47510 50844
19257 50844 53175 64691 61290 52905 46683 45871 51528 55123 55878 50666 47718 43674 34896 28778 22325
19242 22325 23588 23439 28951 27201 19310 23863 24853 11837 3656 4918 8434 6846 6680 2921 6424
19227 6424 11524 10677 13322 10009 3025 -5735 -7236 -5255 -8393 -5120 -5397 -7264 -2753 4365 7290
19212 7290 10525 13794 13329 12537 12227 6341 3861 4831 7631 8471 12588 19142 16618 12246 4867 3038
19196 3038 8822 8981 8274 13224 13950 17578 24124 25969 24373 26954 28077 23357 26575 46895 65345
19181 65345 88411 120220 163115 219128 285843 335140 367091 417973 454879 431481 410951 415686
19169 415686 397308 376882 386725 412150 414787 422267 456923 460014 413313 369863 327181 265834
19157 265834 210746 163982 123681 86533 64816 48455 35534 32361 25774 23227 23164 21888 17078
19144 17078 19190 17148 14317 10246 12497 11736 6705 2888 5481 9580 8686 6959 3072 1590 -165
19129 -165 1255 -2929 -9669 -5571 -967 -3096 -6223 -2328 2673 9389 12381 15228 9251 -511 -1757
19114 -1757 503 -1679 -3983 -6766 -4866 -1807 1944 2278 2245 4585 1646 2308 4394 -220 -1456 -1389
19098 -1389 -1661 -2455 -914 2288 2883 -873 -8247 -8923 -4206 4645 5865 4876 7103 3150 8359 12349
19082 12349 10875 7645 655 -1153 6854 11729 7019 7297 4549 3054 7644 -1046 -4113 -7270 -9856
19067 -9856 -7891 -2102 -588 1085 2367 3211 4706 12282 15014 8707 6804 6037 5802 10275 13467
19052 13467 16516 4096 -7906 -1970 1277 3662 3453 -1470 -520 6261 6218 7233 10189 12355 9436
19037 9436 8354 7014 3399 6529 9368 10053 3662 5321 3479 -169 1748 4464 2442 2555 -1905
19022 -1905 919 5173 10077 13346 12515 8612 5384 7638 6829 5576 4070 -1840 -6816 -5148 -3742
19007 -3742 -452 2970 1912 -507 -907 4343 6792 4272 7568 10636 6708 7049 7856 8036 6963 6997
18991 6997 -1819 -12218 -4150 -2946 -6965 -5427 -1216 -5419 -4667 -3012 269 8780 4741 -679 -8273
18976 -8273 -6173 732 -4353 -15578 -13274 -9338 -7905 1640 7312 5980 11493 1560 -643 -4258
18962 -4258 -311 1387 1612 2189 4328 -2691 -8673 -6198 -6911 -2332 4340 1168 -1406 2614 10052
18947 10052 7653 8032 5427 2191 7747 10243 7311 2942 3036 5955 9557 3715 3814 2041 681 3988
18931 3988 6587 6218 7567 4243 -3042 -4502 7196 11273 10408 8560 3876 -952 -766 5364 2477
18916 2477 3004 -2245 3136 10686 10989 4634 2400 3774 10760 11278 10789 12865 6541 1840 769 7650
18900 7650 3035 -1282 -1780 1156 -7374 -11127 -6446 2662 4316 2608 -436 926 5061 3486 5414
18885 5414 9675 4334 -3366 -984 3123 -1726 -4154 5862 15075 18349 9433 32 -1270 -1798 -3427
18870 -3427 -5528 -2669 -4073 -9194 -12172 -12029 -8037 -2851 -3371 -3352 -6919 -10848 -14965 -12186 -13357 -16837
18854 -16837 -5032 -7340 -10356 -6359 -6742 -8773 -6316 -8474 -21918 -22046 -17002 -13742 -23993 -26191
18840 -26191 -23126 -18304 -6640 223 5031 2161 4379 9148 7319 4520 7577 8285 12096 10367
18826 10367 9150 8989 9804 9482 7562 3604 -77 2073 3203 2785 2204 -2306 3833 6070 6734 7411
18810 7411 13212 12980 11265 10472 10515 10629 13290 18376 20853 16647 9807 2945 6019 12109 15973 22362
18794 22362 31325 38990 42681 49776 58623 69197 80511 77140 70707 71206 77498 75866 69985 71216
18780 71216 72985 78836 85541 86280 91774 92638 81616 77064 86010 109161 141460 208883 344654
18767 344654 617354 893784 800095 491806 274399 157710 98301 77116 61114 49797
18757 49797 37444 28026 28882 32197 32376 33475 27446 23145 23558 23421 20329 21105 19904 17888 25461
18742 25461 33992 36654 32673 30793 22472 20232 24231 27941 27589 21135 17560 15315 17875 21705 18024
18727 18024 16185 18637 23140 29412 33569 40301 41750 41349 35047 35608 39953 49627 53293 40722 40083
18712 40083 39639 38359 39892 43149 47241 46400 42423 34462 26890 19165 14471 11638 13992 11151 6783
18697 6783 7102 8061 13514 13932 5002 130 2123 9684 10042 12905 8075 14758 21514 17203 12970 10594
18681 10594 13176 16471 21272 25288 27510 26346 25624 21798 14490 18306 25137 23614 27348 48583
18667 48583 64376 75279 106940 125741 122622 136760 158662 149060 145798 158816 148118 134890
18655 134890 130753 154199 159551 155586 171383 182795 164694 158747 154440 137223 117813 106869
18643 106869 90459 75181 73151 69966 64264 56045 56018 55023 54010 47371 36139 34046 42121 53343
18629 53343 55300 55656 60539 57804 54997 56683 59829 70846 80236 85018 87543 89222 86326 88456
18615 88456 91379 95496 98387 101669 93523 96264 97751 97239 102108 105263 110680 114612 122409 128268 133428
18600 133428 137748 139296 136018 139292 147155 149350 150913 153830 160784 172648 183273 197338 213703
18587 213703 231058 250868 277908 306166 339403 387044 439886 501080 578136 648668 698097
18576 698097 768181 830308 837251 833199 854515 860710 855028 879021 938457 989732 1024796 1097756
18564 1097756 1164381 1185196 1240834 1327516 1411868 1522834 1666537 1831731 2016773 2190302
18554 2190302 2341853 2511559 2675396 2842925 3092420 3426275 3869175 4491324 5414493
18545 5414493 6794392 8982393 12718455 18510546 25178716 32983537 45146752 57524902
18537 57524902 63260988 70211163 80453939 80048678 73834160 73657617 72644730 66659763
18529 66659763 64609869 70179854 74281492 73610464 77987034 83781131 77705526 68601058
18521 68601058 64076700 54755370 41380675 31428871 24110119 17363340 12228859 9054035
18513 9054035 7064576 5707336 4779866 4126082 3625077 3227905 2952060 2761334 2539874
18504 2539874 2339275 2204376 2029496 1824109 1668181 1529278 1386764 1287996 1244112 1210066
18494 1210066 1159960 1135633 1128441 1076790 1003366 966568 917494 852259 816792 811206 801375 786901
18482 786901 799937 810117 760382 706951 662633 588845 506692 447635 395757 360428 323655
18471 323655 296931 287719 282708 273425 260431 257605 260807 252012 242757 234325 226015 220318 208039
18458 208039 201707 194282 192328 190997 187625 187342 183384 183037 175167 161584 155756 156733 154440 144126
18444 144126 134416 125588 121563 118599 113332 108286 108750 109589 114306 122144 119341 113182 104651 102773 107187
18429 107187 104461 102512 104441 106138 105201 100343 91824 87448 80540 79461 82617 83137 74996 76904 82475
18414 82475 77074 73484 82201 90039 93700 113812 138681 135296 118111 116812 117730 104380 100090 113778
18400 113778 120130 113632 115286 120905 115613 111873 122766 121804 105960 100065 89867 86427 83572 74356
18386 74356 64581 62688 66755 66124 67038 59923 58597 59689 65923 67371 68880 69983 73318 69745 70092
18371 70092 72051 65487 63261 67699 65665 60513 60042 68601 75648 87381 112314 150258 162725 131415
18357 131415 91405 65221 56678 50063 40495 37004 33549 29601 27576 22954 13721 9983 17233 22370
18343 22370 27209 25876 26645 27700 28571 28714 29105 37999 37588 31911 26844 28653 25753 25216 19578 18020
18327 18020 22339 23747 28241 34858 39989 39782 41463 36576 28112 28161 36376 37973 41281 47674 44959
18312 44959 44838 44669 45068 49776 45164 40093 39466 35477 30220 25098 28501 41372 39528 27872 25505
18297 25505 31735 35614 46501 54721 57616 56800 56913 54902 48868 46185 33701 30090 35684 27289
18283 27289 20957 25578 25230 23722 25300 29853 30769 26767 22572 24870 25272 24049 23280 23803 26437 23040
18267 23040 20262 18110 14669 27312 42760 42910 40031 36479 25835 18858 28550 30572 29823 37821
18253 37821 31434 23338 22828 22483 21927 28660 44072 55760 52523 51738 37584 32699 34820 30287 27614
18238 27614 26687 32745 48028 83942 191957 292269 239377 159825 116309 96285 86813 79420
18226 79420 74007 64932 59385 59660 59208 53913 44303 40770 40217 34280 34051 40674 42378 37419 28709
18211 28709 34055 47296 59733 63132 56761 59357 62962 65216 72014 71059 75559 85905 95868 122567
18197 122567 163437 214784 283361 364967 424682 447496 454320 438385 378897 321053 269997 235951
18185 235951 234944 268628 328674 399146 445884 444172 435482 397130 331902 274903 226862 186142
18173 186142 150815 133231 129107 121717 108381 110030 116590 122400 125882 118121 95658 83855 93106
18160 93106 121915 148112 163567 165265 167683 174408 175368 182074 205166 225145 236564 251793 267812
18147 267812 283562 296604 308693 314491 320884 317208 298164 301271 334642 370455 373684 376180 400809
18134 400809 456879 511607 566574 650036 786899 926131 1037985 1137202 1295737 1580865
18124 1580865 1970459 2388539 2865394 3272054 3488880 3749864 3970262 4152261 4543896
18115 4543896 5314178 6622945 8765632 12257972 18510493 30635389 55748573 105189230
18107 105189230 160886880 152430598 96900688 52716289 30561057 19475904 13397305
18100 13397305 9758866 7410584 5843286 4692319 3808329 3161882 2639595 2183775 1806636
18091 1806636 1519241 1320441 1194016 1101737 978095 826098 718399 678349 677926 666038
18081 666038 630372 593708 580682 565184 524402 471500 423901 413406 401705 362580 314123
18070 314123 273329 247553 219935 201115 195204 193945 191731 186358 177419 180844 179513 163500 149760
18057 149760 143964 140242 148172 163742 173031 186881 175397 150986 130992 124876 117679 118052 129671
18044 129671 112629 94125 88325 91765 94302 88862 97082 117056 125092 127004 121106 104374 93200
18031 93200 94267 98351 99754 94380 79855 64921 61595 59465 60181 62796 64197 67293 74500 77227
18017 77227 78940 80141 75480 65624 68841 66300 61345 62736 62703 59973 56494 49077 42689 57772 69284
18002 69284 80525 79061 74902 69792 67028 68522 73002 75110 75532 75666 69912 70312 61579 48967 36837
17987 36837 31207 25507 29095 31703 35399 68261 146978 228865 217130 142296 96174 74669 62858
17974 62858 59816 53955 43418 40723 41964 27794 18433 24338 30758 40136 39327 28790 26818 31553
17960 31553 30544 32136 36241 33521 33028 32730 33142 28974 28258 24613 26748 31594 36315 37561 37174 26980
17944 26980 25060 32118 35792 38037 35667 36116 42078 37144 29601 30718 31954 35558 41061 40515 43135
17929 43135 46134 43329 33482 27456 22007 18172 14032 8248 7497 7442 8888 28252 39958 44993 47310
17914 47310 33362 25194 34222 40455 41320 42721 49760 68049 83213 82319 66409 55866 47694 43315
17900 43315 40431 40927 58354 90425 135387 180303 208396 233538 284671 340726 375216 418830
17888 418830 477383 492423 484411 511163 511854 462909 430002 444325 455815 446487 458414 479165
17876 479165 453836 419805 401379 351961 268372 193016 143411 106323 80334 59529 48006
17865 48006 41016 36198 36983 31939 19000 14797 10823 19823 25512 21427 20563 26973 30644 28815 26190
17850 26190 21679 21909 23974 21605 21015 22433 25276 24805 27605 25551 16270 13972 13621 7589 6925 4538
17834 4538 16215 20463 20550 22687 21143 20216 17323 14136 7529 1465 4815 8869 8680 10187 10755 11516
17818 11516 5990 1468 2158 3228 7035 1995 -352 6878 9141 2411 -1226 -302 -2074 -2548 2991
17803 2991 9676 13276 14778 15754 9634 10715 10978 9785 6648 3202 -4600 -4646 -6280 -1790 5113 9402
17787 9402 15135 12436 12618 16339 17560 11083 7294 2226 3736 4377 6092 5634 3160 2928 6536 5691
17771 5691 5516 -2036 -8075 -1321 -2023 -4721 -3986 2984 9004 13016 10696 8421 6164 -3926 -3508
17756 -3508 -966 -2296 -2478 -6468 -10286 -13210 -12565 -6955 -6628 -8992 -8992 -7741 82 -336 -5119 -4480 -1182
17739 -1182 1182 5523 5286 4951 3235 -3462 3646 11546 9954 4372 403 -5285 -8481 -632 7724
17724 7724 4907 3458 10471 10679 5126 4242 5246 8603 12215 12232 8146 5605 8703 7126 7718 11443
17708 11443 5274 2988 6903 7451 8364 8559 3131 -1486 -1778 -2969 3459 10580 4986 -1593 -5728
17693 -5728 -7469 -5359 -2097 3013 5615 5355 -405 -6846 -3171 3227 6345 5759 1103 -1187 4623
17678 4623 4551 4788 2444 -2784 -5899 -5387 -2760 8818 20425 23401 27179 27676 23006 24003 23007 28306
17662 28306 26805 22698 19842 27496 33506 31359 24993 19964 15621 9340 8802 12856 10527 9334 3857
17647 3857 -3196 2609 2582 842 -1914 -9539 -10398 -7499 -8 -4563 -7239 -8490 -3483 -5089 -2599
17632 -2599 2827 3095 4480 -111 -8763 -7700 -3505 227 3299 3870 7572 3020 -7650 -6911 938
17617 938 -560 -5096 -5462 -3041 -1701 -6003 -8416 -280 -12 -5408 -2479 3980 4350 4627 2045 -1971
17601 -1971 1288 4067 7320 3436 -4051 -6762 -5722 -7574 -13008 -13109 -14889 -15115 -12276 -11799 -8906
17586 -8906 -5642 -982 -2435 -4438 -5898 -3605 -917 4389 2469 1017 -1693 -6168 -6386 -3103 -813
17571 -813 -495 1510 3001 -1173 -12616 -8971 -8202 -9756 -13350 -18909 -15663 -6752 -3422 -5363 -6273
17556 -6273 -2077 -6405 -11255 -9390 643 8659 3679 -390 -1658 193 -1637 1546 4675 -131
17542 -131 -6616 -5603 -6091 -8635 -1546 -149 -1441 -6009 -10177 -5379 373 -336 1492 1840 -2452 -2250
17526 -2250 -2203 3739 3703 -602 4881 -1034 -9583 -10069 -6481 -1175 -1825 -749 -4074 -7272 -6240 -12008
17510 -12008 -15629 -15860 -12071 -10932 -6750 -8674 -8749 -5267 903 4737 7124 1325 -8355 -5990 -321
17495 -321 390 175 5466 6953 4820 6505 6049 3929 39 4660 15168 13653 12775 12756 18294 18010
17479 18010 15315 13695 11509 8833 3818 -1833 890 4109 -1063 -1940 -993 4390 6232 10763 10055
17464 10055 8781 8522 10218 9965 5280 8144 7481 5379 8472 8934 2096 7160 8315 3877 5424
17449 5424 8045 14136 26249 28467 36819 71295 124791 231694 451626 781401 871353 608223
17437 608223 329139 182468 113802 73808 45742 31711 27977 25988 20505 24666 18079 8504
17425 8504 3765 6463 11915 8552 5571 7891 8085 10582 2377 199 -114 -5115 -4219 -2497 -2710 2227
17409 2227 8473 15602 10534 6361 3189 1741 7395 5497 4411 -796 -1045 1391 5887 -2012 -1939
17394 -1939 3037 -450 2679 473 -1610 5354 8459 4650 223 -1992 717 4198 11641 12380 28784
17379 28784 46910 67096 76855 67280 52528 43401 43771 54652 71137 101570 144190 204124 255543
17366 255543 246014 182671 128859 104672 105854 128562 180668 268169 343140 361855 346762 273455
17354 273455 188316 139027 120811 120505 142167 196081 256194 263640 225146 175087 128515 92861
17342 92861 68876 60796 59593 65113 78309 82693 74752 59591 35710 26607 23700 21094 22099
17329 22099 18405 14728 19365 23171 21157 16068 16069 18250 23362 36407 48823 54952 61636 75967
17315 75967 102961 144504 184863 243605 320698 377042 421833 461603 462613 449666 439899 403478
17303 403478 369748 364945 386387 413177 429417 454871 463649 432007 394553 345910 273835 206605
17291 206605 160423 121377 83688 60126 46976 40790 35188 27295 28936 19933 11579 9177 12585
17278 12585 11011 11693 14490 13277 8048 7904 10429 12247 11784 12362 8946 958 -4431 -5488 -1130
17263 -1130 -1974 1114 9038 11021 3938 3909 12454 12551 12379 8457 4144 5215 3803 11583 6162 9032
17247 9032 12603 6723 3664 -887 -6324 -4238 2578 9447 3880 3418 1523 1213 1479 1948 2704 7541
17231 7541 3041 5098 -2442 -8519 133 9481 7911 10712 16951 20536 20797 14979 11684 3476 -754
17216 -754 -464 -2407 -2781 -5878 -3997 2604 3447 2285 6583 8022 11273 8054 1412 2677 1033 2721
17200 2721 1606 1028 -3361 -1091 -1367 -347 -50 -2252 -4853 314 -1225 1259 3060 -2276 2847
17185 2847 3015 -2212 -2814 3837 1604 -2024 -8819 -8354 -5546 -3140 -2263 1322 8166 7785 3860 3332
17169 3332 3659 580 -7996 -8181 -155 -1112 -5686 -9848 -13742 -13803 -15636 -17444 -16263 -10169 -7682 245
17153 245 7285 5940 6050 4762 -602 -2944 4821 -326 -164 1408 -6367 -6081 -3028 544 6696 6653
17137 6653 7521 9519 7698 4989 8178 8108 4708 2435 1611 9302 12902 10189 11708 9925 4228 1309
17121 1309 3257 156 -248 -978 -858 -6067 -2459 -1613 1780 570 -7490 -9080 -9879 -14687 -12966 -6860
17105 -6860 -362 -4837 -7931 -4917 484 9552 10427 5577 6395 2148 -10653 -14529 -11866 -12104 -7663
17090 -7663 -5267 -3220 -861 -609 1271 -3460 -8310 -5243 -2286 -7152 -8030 -12415 -16046 -18743 -19340
17075 -19340 -15459 -10463 -8786 -5829 -3368 -5425 -8068 -9975 -12174 -9002 -3406 1502 -496 -15123
17061 -15123 -17114 -16822 -11540 -6212 -10625 -12560 -9751 -4237 -2726 -902 -124 -4137 -5227 1395 6180
17046 6180 7915 8474 11751 17294 16442 10016 7589 9950 8307 3648 -212 -4501 -1160 994 7889
17031 7889 6388 2325 1164 4252 5709 373 6413 8143 843 3606 524 -7677 -5748 -468 2771
17016 2771 11814 20416 24124 35633 38889 35854 44878 53909 64667 71339 68313 62702 62517 58669
17002 58669 57059 54083 55951 62002 61691 63295 68375 62229 47748 37366 29113 25110 25895 27695
16988 27695 23753 18426 13321 14827 20769 21527 22362 20749 12245 6142 6715 13003 20496 18721 16582
16973 16582 13636 10950 9277 6571 -4224 -708 3769 5114 14502 14397 1119 1360 3185 2894 3069
16958 3069 735 4143 12386 10713 6206 6050 12499 12186 11513 10415 10132 12727 17274 22262 25649 28891
16942 28891 29629 29489 34345 40034 40658 38188 36916 35896 31053 31442 34225 35865 45424 41377 37980
16927 37980 35905 32067 25217 18480 14101 10643 9468 14773 21097 21203 15678 12288 -25 1137
16913 1137 4435 2050 2873 5368 6163 10085 15153 6952 5368 10121 16309 19055 15350 17207 22782
16898 22782 20763 22031 24786 18877 17309 18590 18224 27109 35272 35530 42600 54729 59057 70616
16884 70616 94075 113187 119393 131257 136056 134047 139967 136642 127139 129727 138156 149435 151144
16871 151144 158764 179315 172466 167313 167294 154107 125781 107062 96580 94020 109285 148733 204045
16858 204045 222841 178801 119618 83406 73232 68682 63715 56780 58180 58278 48295 41402 45064
16845 45064 51807 53336 50775 56871 65779 71571 71789 71643 76154 73844 65997 66228 72180 78569 81992
16830 81992 80086 80454 80498 81102 88121 93768 91218 87126 82657 85968 99269 105058 108191 114160 126836
16815 126836 134530 137505 143165 151693 157354 154652 160909 178519 196037 207254 225058 234614 243444
16802 243444 252261 256489 275323 291592 315799 340977 366192 389922 416277 454424 512129 578104
16790 578104 651521 734426 815424 882192 954337 1013348 1040231 1070468 1111078 1163207 1237660
16779 1237660 1358373 1524773 1703422 1877761 2067509 2243781 2387203 2518863 2681095
16770 2681095 2870161 3126617 3507972 4023594 4717458 5707655 7164208 9475071 13393994
16761 13393994 19710748 27633304 37048782 50075613 62929134 70947830 79366610 84805202
16753 84805202 81703600 77789219 74369572 68389271 64051064 64698475 69970061 75006389
16745 75006389 78137010 83400887 84186187 77294061 70368440 61012068 47616621 35991719
16737 35991719 27039465 19276121 13550077 9973787 7736327 6285400 5236124 4426071
16729 4426071 3835665 3386301 3015912 2720620 2518497 2349414 2192379 2079880 1961908
16720 1961908 1823330 1715797 1587943 1452305 1339943 1242943 1156421 1096241 1065964 1052900
16710 1052900 1020868 997988 981553 919298 845435 774529 689021 602694 538814 479276 431522
16699 431522 399054 377837 364852 352652 332865 316549 312626 310345 300629 289128 275963 268791
16687 268791 274527 276194 265531 250165 245142 239810 226273 211916 204140 200710 202343 201944 203933
16674 203933 201121 188181 183473 184776 172886 163227 159715 160735 161689 161975 164367 160921 148820 134294
16660 134294 128786 123588 129618 130115 123863 125143 122114 131507 141938 138235 139071 132342 124678 118706
16646 118706 112727 108479 110173 107800 100473 99933 94784 96026 95705 85738 75401 68071 66514 75339
16632 75339 87677 103593 111054 119353 126328 122627 112272 111593 104803 98726 90157 88798 103542 115961
16618 115961 122562 132900 134643 123905 123669 121004 106679 98879 94367 87625 81423 78643 71809 66116
16604 66116 67039 62654 66853 69168 62253 62218 60176 62886 62508 53940 45654 49149 56257 66155 69274
16589 69274 66775 67783 69651 68262 72068 70627 63985 55895 50156 45227 37029 30299 33653 38365
16575 38365 40110 38025 30362 21067 15072 12348 12003 13337 16075 22349 25023 15884 14801 15719 18184
16560 18184 15700 18822 20030 22467 18271 14997 14987 16685 21791 25065 23956 27840 29278 28701 30617
16545 30617 30878 33095 32667 27511 21373 21503 23532 31002 27404 25091 26448 28829 27180 32702 30748
16530 30748 27685 31999 28666 28946 27222 28520 24879 26489 30420 33383 33896 33187 31032 25447 21114
16515 21114 21920 31039 24035 20730 18619 18672 25819 33382 36108 40859 42832 37846 36557 37753 31584
16500 31584 33184 28718 27250 29681 27202 23743 24045 23039 23233 31069 27633 17136 16920 23394 25371
16485 25371 20724 15224 19290 23536 28148 26152 21915 22885 21458 18787 14247 8724 8927 15514 22282
16470 22282 28489 30522 28427 23515 22119 22220 28163 31192 26414 16801 12119 17053 23758 27687 29422
16455 29422 38914 55325 83941 115421 156806 206372 250953 300336 346598 364599 372099 373943
16443 373943 338258 299034 280955 262159 261315 282713 304968 342741 379281 384180 383603 367317
16431 367317 316479 266569 213925 165721 124562 103507 83753 70027 63547 68507 68732 62061
16419 62061 56422 59183 69854 75079 67599 67130 74809 75931 66730 66978 77094 83886 91156 105174
16405 105174 121015 142216 178621 237594 327265 458201 643994 848769 1050242 1271984
16395 1271984 1399070 1436871 1454332 1352573 1199367 1078679 976305 937179 998836 1099335
16385 1099335 1232190 1393673 1443807 1440865 1388468 1207291 1000592 799915 595964 430774
16375 430774 312347 218576 162463 132768 105775 89778 81849 73534 72992 69148 64498 60079 54496
16362 54496 43005 40766 43341 43429 38719 40795 40774 44042 43873 38726 33467 34440 32879 32730 39507 46536
16346 46536 42928 39441 36796 28875 26076 33859 39638 30986 18273 12143 15066 18136 17119 20959
16332 20959 20347 16371 15380 12171 14900 17966 17853 17592 19376 17675 28153 31822 39453 35873 31232
16317 31232 33547 30172 27572 23608 26336 26482 31182 39166 41706 41046 41919 40707 37666 33919 29520
16302 29520 26971 26170 23438 22419 14036 13318 12227 11175 15345 18186 18391 16108 11865 13341 7399
16287 7399 7183 9233 16698 20686 24232 15911 2745 -3322 51 3778 4174 -2958 -1582 -2339 -766
16272 -766 2537 8359 9614 4666 -3632 -5453 1159 6387 5539 10553 11618 8017 12868 15168 13961
16257 13961 8238 7772 12041 9715 2496 -5506 -6477 -3023 -2802 -8854 -8189 -4099 -2692 -3787 1202
16242 1202 1590 1446 4115 1277 666 1965 4734 3158 193 -785 3301 4660 1217 -1738 4519 5235
16226 5235 5593 7404 7823 2614 4377 8407 8735 8573 7964 8519 7334 5497 11936 13801 17480 21019
16210 21019 21157 20594 21215 21252 27900 35203 36925 44738 61898 90327 131284 176146 236985 311365
16196 311365 364301 401419 437505 447547 425313 405447 383205 357685 349843 373168 402055 416316
16184 416316 434125 453687 435823 395786 352298 294191 227092 161923 111817 75224 65038
16173 65038 48276 37841 32282 32567 29859 22229 17978 13431 8399 12695 10648 6875 1447 -1238
16159 -1238 -3318 -557 965 316 803 -2122 -1410 -634 -4587 -8947 -8742 -8787 -4215 3584 3098 658 1362
16142 1362 3177 775 -4592 -4473 -118 -127 489 2715 -1451 -8328 -3244 1614 95 1201 -7125 -13343
16126 -13343 -12885 -10317 -5206 -493 170 -2153 -2805 -1980 85 -2251 -4366 -8064 -4141 -1407 1436
16111 1436 -3784 -3822 3312 4140 5114 1142 -4065 -6272 -2284 2226 4275 5304 -3145 -122 -5193 -6080
16095 -6080 -7405 -13868 -18471 -15300 -5836 4223 3731 2767 -3499 -8942 -12314 -5395 -4821 -173 1079
16080 1079 -2640 -2562 124 4149 2464 -7255 -1077 488 2915 -1124 -3838 2726 6536 11275 18108
16065 18108 15584 12485 12145 15678 13799 13923 15478 21324 21989 19819 18445 12843 7622 4807 5588
16050 5588 7558 4593 1919 8029 9741 7386 -1739 -8294 -12619 -6480 926 5950 5995 -3380 -3026
16035 -3026 -232 2270 -2603 -6444 -2999 -8342 -7422 -8346 -6923 -4717 -3286 -12096 -10249 -12294 -5907
16020 -5907 -2283 -1378 -2618 660 8777 9145 11439 9290 3063 -2609 -1293 4132 4442 -450 -1675
16005 -1675 -7151 -8964 -9157 -2304 8994 13222 5509 3825 12521 14887 7452 2786 5142 -645 -3305
15990 -3305 -4224 -6670 -6705 -6945 -7753 -10127 -9628 -7274 -10304 -10196 -7176 -4171 847 960 -3999 -4125 -6605
15973 -6605 -4594 -7639 -7433 -4377 -1113 90 -5271 -7469 -2960 -3610 -4197 -9764 -13033 -6502 1367
15958 1367 3628 -981 -6285 -1668 509 1485 -5649 -8179 1228 3467 1107 5468 3383 -1410 1200
15943 1200 2555 -4507 -4034 -3526 -1171 3427 2381 -2133 1961 -477 -6859 -10046 -9894 -9668 -9422 -9865
15927 -9865 -4858 -3924 -5982 -5160 -8243 -12863 -15408 -6149 -57 -431 -1200 -992 2007 1161 -2613 4422
15911 4422 3746 -2926 -3333 -7728 -9049 -13621 -17239 -15557 -9913 -8542 -2430 -2812 -6579 -10631 -6558
15896 -6558 -1153 4882 6668 8406 8424 2914 2673 -3716 346 -1824 4569 8647 8597 8009 7575 3602
15880 3602 1142 3925 6474 2547 -5450 -11373 -7758 -1296 2642 1749 1228 -3713 4008 10705 10571
15865 10571 3121 -2307 -7799 -1451 -1248 -3419 -1533 2006 3801 6456 9976 8006 5888 19 -2469
15850 -2469 -2718 -3436 -3772 -4334 1784 6715 15487 18599 13887 13003 15232 16728 16916 10920 14824 19029
15834 19029 18583 19478 18696 13265 5321 6798 8914 3159 -5193 -7313 -360 1679 3114 3628 8007
15819 8007 13454 10896 288 -4120 -2601 -5991 -9924 -13175 -15127 -10838 -12608 -8728 -1526 -198
15805 -198 -5770 -11847 -14516 -9998 -3714 -565 -64 -4084 -2545 2063 9289 8386 -3897 -3428 4144
15790 4144 4357 3641 -3568 -2953 -50 6722 9661 3178 -6882 -5196 -7394 154 7585 494 -3229
15775 -3229 1660 6232 5977 6130 5906 17660 28915 45718 68388 74902 67222 51575 45906 55514
15761 55514 75516 109747 171402 247791 272811 226866 160278 116674 107235 132135 184835 278709
15749 278709 392699 419165 338881 237395 164272 127200 126409 154718 221356 287247 285526 217960
15737 217960 143903 92961 70772 63866 64110 70150 75384 69309 56353 36957 24387 12857 14680
15724 14680 11841 8206 9111 5195 4650 3376 5099 9884 9306 5824 1080 -4967 -10083 -10245 -11096 -7859
15708 -7859 -8098 -4669 6345 8025 8995 4813 2024 3894 -3204 -10889 -6658 -4204 -3623 -10779 -14275
15693 -14275 -11463 -9798 -6677 -10396 -8759 -8249 -975 1064 -1522 -8357 -10449 -9453 -4476 2196 -4597
15678 -4597 -11217 -11715 -11738 -11230 -12888 -9040 -3304 -963 1094 -2921 -5937 -13904 -7534 -2604 -2199 -712
15662 -712 985 1248 -6222 -5860 4541 1757 -7772 -12611 -10558 -6069 -5794 -38 6749 16386 9504
15647 9504 -2793 -9102 -13575 -16150 -16426 -16847 -14693 -11855 -14593 -14911 -13766 -15948 -11177 -8296 -3822
15632 -3822 -4640 -5384 -1231 -20 -138 -8183 -10350 -8624 -4797 -4203 -5787 -8567 -8225 -8091 -7928 -10465
15616 -10465 -10643 -1541 9359 6725 68 -3552 -4572 -303 -7621 -12359 -11437 -7364 -4600 -2356 1455
15601 1455 -3117 -4278 1622 5160 2915 -3590 -7598 -9009 -14660 -17259 -15024 -12892 -7222 -5237 -7460
15586 -7460 1174 1914 -4394 -13620 -12360 -8884 -5819 -3045 -1346 -10606 -9709 -5414 -2214 -2930 -2258 6418
15570 6418 7235 9204 13433 16727 14109 15052 19598 22928 27654 20266 16104 12981 9992 19385 21931
15555 21931 18497 12112 17132 20565 23532 23067 15068 2739 8577 12908 12533 11442 7639 4593 3841
15540 3841 3602 -576 4528 2903 -3707 -5447 1401 9707 8646 5173 -745 -4536 -3938 -11274 -18322
15525 -18322 -18148 -13771 -8659 -2349 2459 -102 -8102 -11386 -8979 -7265 -11569 -17465 -17528 -10003 629
15510 629 3553 3861 -976 -2985 5339 8125 4011 2649 1861 4253 13297 23097 16662 8819 9420 6682
15494 6682 5879 7515 5828 8819 4925 941 -1940 -5924 -6161 -1449 4805 5195 6614 10269 12194
15479 12194 3240 -228 -3700 -10169 -5496 2637 4860 9077 8032 406 -4718 -4690 -1140 3792 647
15464 647 -2951 -1499 1234 1609 1555 342 7688 12239 12019 14445 17551 10081 6669 7570 4207 84
15448 84 3105 2806 90 -5576 3545 10819 4864 571 1366 1825 666 787 3308 3827 5186 1140
15432 1140 -3508 -7335 -7185 -6288 -7851 -4908 1140 -1771 527 2446 2373 5411 -1471 -10372 -12851 -8076
15416 -8076 -8680 -5307 -5918 -7303 -12326 -17294 -18480 -16937 -12654 -3507 -7684 -7414 -6704 -6814 -2030 -3203
15400 -3203 -2554 -3935 -6613 -8342 -4912 -7424 253 6303 389 -6807 -11801 -14982 -14125 -7023 -5694
15385 -5694 -8172 -12811 -9711 -13339 -22372 -21916 -12150 -5239 -8187 -12318 -10233 -8635 508 6089 12579
15370 12579 14127 10586 9908 10874 10314 10051 928 -2737 -3994 -5602 -11968 -8229 -3883 -11 4017
15355 4017 2879 8483 8364 20247 31305 37962 34491 26448 18846 12285 5930 -208 -751 4303 665
15340 665 -6115 -5021 -5505 -3979 -419 -5482 -4481 -1880 -5887 -5920 -6092 -7407 -10492 -8955 1397 4534
15324 4534 -3764 -7544 -5226 -4132 758 -919 -1925 -6492 -5288 -2924 -12734 -20129 -16307 -10714 -4377
15309 -4377 -5246 -10136 -5742 -9032 -13200 -6890 -3544 -185 -1018 -1589 -1988 750 2437 -1777 -9743 -12108
15293 -12108 -13944 -11356 -12911 -11079 -12863 -12681 -7012 358 -1179 9 -3273 -5313 -6187 -4600 400
15278 400 3278 -3083 -5352 1566 3737 -1214 -13153 -16346 -11933 -11406 -15050 -16974 -15921 -14375 -11320
15263 -11320 -16523 -14342 -12887 -9078 -1703 -587 628 650 294 -2035 -11257 -11129 -5870 -6363 -8267 -4249
15247 -4249 -7422 -1491 710 -2127 2844 2029 -6297 -7715 -8911 -1176 3345 1237 9661 7515 -1270
15232 -1270 -4972 -4819 -3598 -1388 1172 1250 -1814 -2019 -1628 3867 5192 -2030 -3237 -1073 3919 10094
15216 10094 12024 14284 7749 3348 2554 2368 7334 10326 7780 8720 12156 12037 9087 5494 7614
15201 7614 6418 13859 16109 11314 7401 4537 2472 3494 8064 9028 134 -2865 615 3276 4047
15186 4047 -1441 -1970 971 1532 241 -4508 -3761 165 699 -2728 -1886 -2546 -6864 -7676 -6642 -5885 -10778
15169 -10778 -11308 -10759 -8733 -709 3605 2161 -478 -10601 -12207 -9279 -1118 -613 -8145 -16367 -16967
15154 -16967 -14197 -8644 -11739 -15687 -18372 -12262 -3903 6596 10317 4316 -489 -1324 -9504 -11371
15140 -11371 -16000 -12681 -8034 -8537 -11608 -11759 -11763 -8502 -8792 -4562 1640 1694 -7795 -5030 -8365 -4898
15124 -4898 -2024 -3544 -7477 -2940 -1402 -4048 -4571 -3901 1456 5930 2473 -4713 -14597 -17223 -15683
15109 -15683 -3064 -980 -7504 -14336 -10064 -6693 -8393 -6943 -11728 -14950 -18927 -16408 -16227 -21640
15095 -21640 -14236 -6013 1208 4715 1396 377 4788 580 -3950 -2082 -3626 -4061 1574 2984 555
15080 555 -34 -5667 -11606 -7539 -8839 -12821 -11527 -7255 -9764 -16306 -10231 -5360 -5982 -10777 -8619
15065 -8619 -2737 -3346 -4727 -12090 -11894 -3342 2305 -1123 -4618 -1645 -1150 954 5170 3957 -2078
15050 -2078 -4428 4745 9721 -2742 -7589 -7040 -2946 -1231 -4463 -2536 -4402 -2336 865 -617 -1346
15035 -1346 -1744 -2135 -4210 -7633 -4870 1662 502 -946 -4078 -9139 -11990 -6799 -1699 -643 -175
15020 -175 1079 -2967 1383 3749 -2204 -2072 -3314 -5571 -2240 -4798 -12598 -11335 -11131 -12558 -8620
15005 -8620 -9866 -9117 -8885 -7683 -14952 -15167 -10203 -2559 -2261 -6483 -3942 1767 761 -371 2187 6825
14989 6825 5389 -205 -964 -4342 -7122 -5179 -5264 -814 4043 3278 7600 6326 4138 -2238 -5770 -3246
14973 -3246 -2733 -6019 -13470 -6591 -701 -6544 -13326 -16201 -8960 -13866 -9162 -6301 -4310 -4746 -5646
14958 -5646 -6969 -7458 -9196 -7656 -1981 -1403 -4227 3420 2789 -4261 -7938 -9664 -5247 -1567 -7830
14943 -7830 -10364 -6530 -8953 -9902 -11086 -8508 -6271 -7210 -10465 -2838 315 -1032 6032 6313 3055
14928 3055 -4384 -8713 -4161 -3641 843 -7331 -13292 -8714 -7472 -3847 -1665 -1833 -3113 -5974 -7055
14913 -7055 -8139 -7074 1290 6028 362 -2654 -7183 -8853 -7020 -10137 -4290 -1713 -654 2640 -4337
14898 -4337 -7814 -16151 -17984 -11436 -10479 -9008 -3880 -8240 -12800 -10417 -4326 -2143 -2157 -5595 -5979 -2742
14882 -2742 573 -6775 -11165 -12472 -10391 -2151 5571 4266 -2557 -6831 -8780 -12684 -14359 -15978 -14764
14867 -14764 -12287 -11605 -9430 -7839 -5166 -670 -385 3391 4729 2764 1547 -5273 -4486 -11967 -14693
14852 -14693 -7408 -3421 -4170 -7412 -8722 -1581 1820 5027 5256 8326 7501 4241 3748 1358 -5690
14837 -5690 -9963 -5361 -4932 -8761 -10180 -11373 -8125 -11270 -13248 -6565 -2965 2741 -4708 -11138 -16088
14822 -16088 -13479 -6593 584 6417 166 -4300 -6719 -11172 -8055 -7996 -4834 -1813 -802 -1332 -5968
14807 -5968 -16652 -17836 -13134 -13438 -15258 -7535 -6092 -6829 -4853 -3230 -4862 -4471 -2728 -5638 -6454
14792 -6454 -5648 -8695 -5053 1464 5991 355 -111 -6311 -4098 -1439 -1949 -8350 -10930 -9586 -6989
14777 -6989 -763 -3810 -8076 -6033 -5753 -2664 -2614 1649 -1913 -16 1829 -6187 -9743 -3694 6354
14762 6354 6233 2307 -548 -9384 -12226 -5787 -997 658 5073 9535 5222 10865 13261 16554 32742
14747 32742 62243 67623 43253 25884 22409 19065 8474 4398 10332 3562 -1515 7460 12066
14734 12066 13107 15986 22933 37192 42907 40125 34000 25489 25101 31465 38744 50557 58404 63526
14720 63526 71769 79459 91197 100913 98667 103338 100052 93350 87652 90431 92532 94167 93573 103037
14706 103037 129121 159804 175744 181668 194169 207576 234904 301723 427929 598534 783958
14695 783958 953936 1079416 1145234 1171210 1172723 1171157 1164679 1136599 1052397 907291 716613
14684 716613 516851 363264 261262 192033 144312 126758 119340 102218 90937 70062 52681
14673 52681 45782 36527 29225 25897 21234 25258 31862 36288 30928 31873 36434 44482 48194 45633 45949
14658 45949 48083 50016 41219 42955 39207 35422 32094 29271 17896 12563 7656 5092 8620 2205
14644 2205 4716 6970 3660 -5206 -2049 5778 7907 10908 8612 3212 7098 9842 12752 13043 5172
14629 5172 3206 8248 9809 10195 9843 13751 20579 26962 26280 26277 26281 29758 34286 41860 48673 46720 40072
14612 40072 44685 37789 30021 29720 25475 19362 14452 20038 18818 9127 6414 7222 5867 1624 -3630
14597 -3630 -4305 1528 2325 732 731 1366 2364 5722 9758 21541 31494 35049 36816 32832 37692 33904
14581 33904 36716 38977 38803 37940 36546 39152 35148 19800 12539 10022 8652 6407 10717 14963 13417
14566 13417 7796 -828 -2864 -633 -2316 -8060 -5569 -1420 1208 3362 1992 -321 -7214 -5261
14552 -5261 -6293 -5239 -4681 -10703 -9935 -12381 -12738 -5877 -2698 -5486 -5614 4225 6268 4061 4058 5992
14536 5992 6649 3923 8616 8461 16651 29131 25422 19577 20312 24079 27806 25007 21108 13736 5859
14521 5859 498 -5800 -5149 -2435 1301 11352 15782 8109 5374 17711 32017 36714 34663 29121
14507 29121 34303 42857 38473 29210 24942 29677 34438 40365 50218 54889 58929 67297 71430 61185
14493 61185 58680 55230 51071 53609 60306 66184 67356 69258 60140 42847 40770 40567 41186 44931 54968
14478 54968 67029 69854 66496 63568 59211 50464 38807 28797 26170 25756 29308 31927 35899 36722
14464 36722 36259 35139 31278 24472 14150 11824 9988 9601 11180 6222 3071 3298 475 -4094 -7494
14449 -7494 -5637 1286 2294 -6648 -15780 -14261 -11082 -15201 -14394 -13373 -14588 -11992 -11164 -16981 -15033
14434 -15033 -14142 -10283 -6390 -12104 -7508 -1210 1344 -2115 -6367 -5636 -8289 -13582 -12793 -13343 -7708
14419 -7708 -7672 -4651 -1130 -6706 -12804 -14117 -8125 -3705 -1183 -3697 -4724 974 -4054 -5959 -1818
14404 -1818 648 -788 -6610 -12674 -8899 -6523 -8034 -11065 -15678 -13236 -7339 -1965 -2989 -9467 -4189
14389 -4189 2958 4217 8019 4596 256 -2801 -5666 -6422 -6791 -1601 -2654 -4757 -2629 386 -2745
14374 -2745 -6450 -9182 -7011 -8453 -17767 -16589 -13964 -12613 -13329 -12934 -10247 -8944 -4566 -7878 -9956
14359 -9956 -9580 -11523 -12810 -16657 -7942 -5171 -3997 7681 12596 13556 14936 11161 14004 26295 27619
14344 27619 22870 13693 13179 4099 3054 4685 10133 14601 10067 14279 17664 14194 4701 -1552 2116
14329 2116 6240 12786 12779 6295 967 -1954 -6357 -7401 -10856 -9898 -6109 -5482 -1515 1317 1662 -849
14313 -849 -2059 2213 1731 529 -158 2372 -9076 -4689 -7469 -8466 -9896 -11472 -13760 -18703 -18731 -16049
14297 -16049 -11282 -4444 2252 3752 2201 -712 -3690 2574 2783 6342 6720 7792 9287 11887 9426
14282 9426 -1201 -680 756 7623 15176 16564 14199 12728 3638 -6225 -12020 -12986 -9983 -3445 3378
14267 3378 3259 2044 -3918 1336 1596 -7083 -4245 651 1426 5123 5918 1724 -2501 -4042 -5700 -7940
14251 -7940 -7272 -8102 -9346 -9521 -1486 -4630 -3509 -3537 -2365 -1924 -6525 -11954 -8499 -6298 -6517 -1469
14235 -1469 2603 393 -1982 -2196 780 -5139 -5850 281 6517 4938 441 4139 3982 2301 -2926
14220 -2926 -6391 -10035 -11339 -6350 -6298 -10318 -340 6889 -358 -9529 -12470 -8910 -7760 -4671 2129
14205 2129 7506 2885 -153 554 3668 4184 6224 15418 15365 11242 6445 2907 5446 12123 15033 15021
14189 15021 6589 -5402 -11306 -11058 -12848 -5722 519 1861 -3376 85 -2047 -5341 -8530 -4276
14175 -4276 2376 3055 6390 -126 92 -4166 -2972 -1889 -2731 -8489 -7451 -3650 -880 361 -3361
14160 -3361 -3671 1052 3536 10314 4789 -59 3725 4175 9669 7481 7870 7817 6278 2510 3018 825
14144 825 934 2965 1609 -959 5559 5767 773 6025 13241 6593 78 2646 10118 19958 27069
14129 27069 40523 41840 26307 8729 7871 12459 10482 11999 17101 28047 48760 68155 87081
14116 87081 108896 126314 115572 80850 53990 36221 25371 22216 29301 43075 67385 98459
14104 98459 136863 158989 160370 144777 109280 72017 53096 44027 38502 35139 36861 42723 62478
14091 62478 95698 119115 114540 94552 75791 54819 35186 22773 12257 14537 15630 9131
14079 9131 7828 13604 19199 26857 33990 20098 6833 2229 -849 -4403 -5432 -7485 -3058 1308
14065 1308 3221 9253 13755 10882 8094 1095 1383 -2331 -7691 -9780 -9164 -9537 -4884 -7118 -10813
14050 -10813 -3020 1921 -403 -257 -1242 -1688 -7929 -7020 1732 1541 -1354 -987 6892 2551 -5302 -8165
14034 -8165 -10866 -4526 -241 -3205 -1589 -1905 -5054 -4960 -2850 1517 1712 -1428 -2564 -5964 -2847 3418
14018 3418 -3927 -3392 8003 14851 8203 8266 9488 9438 10544 14107 7759 -1651 2493 6069 2789 8349
14002 8349 12898 10813 9406 6261 5359 4269 6272 6587 10740 16866 15169 17303 24798 26047 23349
13987 23349 21874 25253 29903 25809 20582 15881 14277 14767 7768 8340 13939 17336 16714 22304 17301
13972 17301 10597 12861 17526 7899 5718 6072 1533 -1151 5916 12458 17520 24036 25612 24226 20164
13957 20164 8561 6518 15822 21859 16591 11649 15374 19142 14998 9856 8274 7796 7964 13039 14088
13942 14088 11884 14855 11735 8406 8411 7509 2565 1475 3735 4813 4968 5693 4471 3006 6236 12448
13926 12448 13450 17849 21701 19995 13367 7888 2822 5085 -878 -3716 -8983 -3600 -3179 -6218 -3203
13911 -3203 2036 4637 8400 8469 247 -4479 -3705 1844 7410 8410 6121 6347 5336 3884 5106 3718
13895 3718 -521 -5948 -1747 -133 -3016 -5550 -7920 -9731 -2827 7475 14016 12338 11693 11702 5713
13880 5713 12486 16085 16576 14286 15624 24320 22288 29094 34879 33888 36724 43725 48391 51228 57333
13865 57333 64313 70711 76591 77010 80856 84001 86400 91731 97695 97298 104254 117845 132442 145372
13851 145372 161649 188602 212889 244215 291180 336310 387051 446450 509567 583154 660754
13840 660754 744411 829392 912062 996113 1069541 1136129 1183367 1214751 1229828 1235237 1231988 1216800
13828 1216800 1201093 1177382 1138046 1109258 1093739 1084484 1066540 1051517 1029806 1021942 1019713 1024607
13816 1024607 1037305 1059197 1075413 1096217 1123435 1154949 1187486 1220180 1250874 1273489 1282859
13805 1282859 1282848 1286144 1266198 1220001 1155044 1079502 1000116 917229 832241 749120 672777 606942
13793 606942 545312 481207 421467 374891 335080 296646 253224 219921 198134 173498 149513
13782 149513 137776 121771 115126 111209 104166 91319 84512 84939 86123 83276 80885 83886 86204 85010
13768 85010 80554 73465 67708 65706 62239 59076 51105 43815 46224 33562 26154 20788 18372 19608
13754 19608 16443 15292 12351 14113 14109 15906 9610 9953 11694 6390 7033 10933 9274 1992 6161 8635
13738 8635 6545 4054 9455 4797 3869 7083 4002 5902 11022 5455 8390 6486 -1999 -7043 -7304
13723 -7304 -3501 78 2738 -6918 -3436 -2765 -3281 3890 2285 1933 5031 724 -1908 -10114 -8875
13708 -8875 -7688 -6389 -3138 962 -2116 -4212 -73 -1037 1256 -910 -5532 -6610 -11355 -11295 -6974
13693 -6974 -7156 -11409 -5245 180 1000 -1544 -6485 -5876 -4194 -5246 -16464 -14900 -12134 -13200 -12627
13678 -12627 -8604 -1208 714 2566 1936 -2631 -2924 -4916 -8633 -8711 -5723 2985 3065 1409 5962 8729
13662 8729 5589 -2451 -5655 -5974 -5985 -4123 -5509 -251 85 -6138 -7742 -4896 -1964 -6181 -1400 5436
13646 5436 2258 1360 2128 -47 -1423 -4686 -16739 -14872 -8960 -7292 -9071 -7525 -10404 -11585 -5131
13631 -5131 -3745 -8594 -2410 -3655 -4889 1187 5042 3663 5018 10574 12227 3095 -2808 -4227 -5927
13616 -5927 -8668 -7383 -9657 -6645 -5460 -5349 -2816 -4108 -5973 -5465 -8105 -10975 -16549 -13446 -10451
13601 -10451 -10536 -7944 -4957 -35 1189 -2203 -3062 -1302 -2450 348 4469 4015 13 -4215 -7051
13586 -7051 -2890 -6349 -9977 -10447 -8908 -9219 240 10669 9840 3326 4644 4931 8339 6015 7304
13571 7304 7114 5575 -223 42 356 -3857 -1914 -2101 -2271 279 -1507 -3357 -2933 2410 4596 6100
13555 6100 9602 9188 4988 5389 4665 4085 4964 7196 7753 13717 30538 45568 69950 98213 123332
13540 123332 127094 119335 108267 86028 56589 31797 18591 17918 11102 9855 8566 -215 -9121
13527 -9121 -7440 -4364 2466 6196 -1188 -9043 -11085 -11446 -8325 -9384 -1027 7856 9257 2488 -7447
13512 -7447 -4519 1017 2554 -1453 -1423 36 -1056 -336 822 5552 9439 11962 10208 8331 6423
13497 6423 5292 3083 5935 5912 1226 2819 3547 -701 635 4990 4615 557 -57 -4209 -7497 -8421
13481 -8421 -6034 2441 12871 22144 17388 13316 7395 8585 13505 15746 16914 13339 11214 -36
13467 -36 -2462 3680 1786 1 3080 5601 4000 -1941 4021 2768 5355 6556 2429 2823 -1305
13452 -1305 -861 -106 7144 8328 13326 18229 14327 14341 15323 25188 35135 47143 40050 28963 22093
13437 22093 13645 10498 8047 2616 1088 3920 7384 5787 8518 16702 21472 15520 1810 -4860
13423 -4860 3837 1015 875 1569 -1680 -981 -7 3620 4409 6220 7073 8729 4548 2360 336 -2311
13407 -2311 -1643 -1291 -1124 -58 -2492 -4983 775 7800 9255 12690 32421 48280 41621 29304 22424
13392 22424 15166 6705 -919 -3194 -5153 58 -2574 -4340 3524 16298 21727 25580 24986 19200
13378 19200 15034 12878 17052 15879 8848 4179 108 -1902 -833 2310 8636 7399 1277 -553
13364 -553 -2068 -1607 -1599 -2818 -2968 -1124 8612 12959 14584 11904 8375 5201 7035 14876 14723 10877
13348 10877 5883 7895 5708 2559 4428 4940 8201 6097 8371 10783 2749 -1470 2742 6500 5153
13333 5153 6817 6908 278 -844 1089 -4693 -7280 -5975 -4091 -5972 -3158 2740 -4556 -13280 -18160
13318 -18160 -18953 -8529 -304 1313 455 -259 1359 4283 -358 -3710 -1858 -1470 1055 -4187 -8482
13303 -8482 -10996 -10534 -9365 -3348 1993 1934 3027 1268 -278 -6062 -14132 -14610 -3801 2600 890
13288 890 676 -164 -5810 -6980 -9684 -5855 466 3711 995 -5494 -10632 -6433 -1063 -1945 -1722 2202
13272 2202 -3186 -4269 -234 -725 -4485 -3989 -4770 -10924 -10401 -4405 1156 3933 5695 -1169 -8379 -16103
13256 -16103 -13172 -6929 -7929 -12161 -8157 -5610 2781 3981 3510 3005 1702 -1259 -2033 -6470 -8952
13241 -8952 -5287 1339 2008 908 13457 19069 14525 10293 1709 -5370 -5819 -5131 -6712 -3362 261
13226 261 1791 -4972 -6305 -366 4291 -4522 -5287 -10469 -10502 -14718 -5688 429 3559 2367 -1581 -2356
13210 -2356 2208 8132 3103 -8250 -13073 -10841 -9189 -1701 2061 4185 9269 11124 11417 8500 3278
13195 3278 7451 14567 19184 27714 32267 20648 10556 4669 3171 -748 -9891 -6715 -6501 -6929 -9500
13180 -9500 -3021 867 4687 4001 1254 652 -2832 -4238 -2976 -1344 1649 6307 6543 10742 8562
13165 8562 4183 -4148 -6075 -2436 -5822 -7151 2785 4268 -4821 -10358 -7060 -3057 -578 400 1211
13150 1211 -1248 -1768 941 7534 18416 16727 10530 1641 -1398 -6524 -6178 995 -256 -4277 2513
13135 2513 10629 8266 6108 2190 6820 7257 2740 -1770 -2121 -2743 -1009 533 -3081 -2417 1222 -1517
13119 -1517 -6805 -585 -3621 -6805 -8085 -10219 -7829 -3647 -7218 -4607 -3921 -1280 581 4061 255
13104 255 -407 10775 11504 7212 5631 2412 -1742 -7616 -11415 -11100 -4980 261 1823 1040 495 1591
13088 1591 2164 6490 3472 3 1465 -3025 -6291 -9443 -7919 -13563 -23139 -21429 -24349 -19861 -16871
13073 -16871 -14412 -9366 -8280 -6725 -7106 -8154 -14273 -11174 -5712 -561 -470 672 -2714 4180 13342
13058 13342 14361 11296 12925 18986 20911 19288 18377 14704 9692 6141 1375 -251 -4464 -745 2861
13043 2861 -6876 -9383 -4560 -3221 2506 5471 5168 6332 4371 3678 5005 7148 7449 -3461 -9199
13028 -9199 -4147 857 6796 2110 -2199 7345 12716 3842 1939 8720 7599 11436 13927 19417 16251
13013 16251 15879 19196 20122 15478 13806 17780 10135 3862 312 2522 7636 7150 2376 -7339 -195
12998 -195 9453 9027 -177 -4624 -8798 -7172 -3385 3946 -1060 -5286 -3403 800 -1828 -3360 -2289
12983 -2289 -704 -2096 -9589 -10485 -4487 -1506 -3584 -856 -657 2367 1530 7043 5392 145 -1465
12968 -1465 -2819 -7731 -7906 -5441 -4983 -7833 -9609 -12904 -7199 -1146 1654 1208 4408 8181 5619
12953 5619 8466 9168 8629 8656 3392 2774 2615 4503 5951 3390 -939 -2433 -25 -7779 -5999 -5903 -11391
12936 -11391 -9671 -14866 -11401 -3862 355 3062 2938 1240 3291 1936 4268 7590 10760 3292 1133
12921 1133 6002 9742 11148 6718 6393 2753 3672 4361 4406 1879 -3505 -4031 903 -4260 -9083 -4055
12905 -4055 -362 -2297 -3746 1064 -811 -1347 -707 1063 1176 -1487 12 3368 4777 4409 5203 4097
12889 4097 -326 -3663 2585 11328 16680 17615 13949 13102 11197 9146 7030 11125 13032 11839 15086
12874 15086 25318 33407 39465 37567 24069 16023 16110 20300 17431 10008 11430 11546 9720 4738 753
12859 753 882 10386 13697 8044 2081 2735 9503 9682 8208 4514 -8646 -1263 3599 4722 6221
12844 6221 10532 14511 5772 6728 8019 4581 3146 10179 10668 7547 5162 10302 20791 38409 55663
12829 55663 83272 132429 169007 146421 92407 57162 38497 27697 27400 32340 36951 33828 35504
12816 35504 33218 35650 55197 73755 72172 54993 33085 17155 7201 10430 2914 -1599 -5990
12803 -5990 -7017 -12712 -7439 -5546 -3908 -4185 2719 1759 -976 -523 -3260 -394 9181 14358 13226
12788 13226 5454 7574 28592 60893 98258 143239 165914 137454 94795 59199 38985 27328
12776 27328 26178 30992 33517 38608 48211 64444 101982 162544 231570 241850 180043 113081 76295
12763 76295 50560 41078 39115 32553 36904 35299 22736 14974 4940 4852 10606 15473 9184 1535
12749 1535 -2165 316 -1838 -804 3766 3090 334 7007 15453 26735 42224 58293 64557 53092
12735 53092 42826 30178 26198 26706 28532 30292 34134 46535 58049 82476 127400 188028 242743
12722 242743 231768 161199 98901 64533 40803 28045 23866 24847 28663 27482 24580 16930 11259
12709 11259 12313 10994 1680 2870 3629 3274 7755 15469 20230 21120 16532 18029 19502 16013 20529
12694 20529 20392 18772 19116 24145 25645 28512 36914 39123 41490 41518 49078 62546 73493 87115 104699
12679 104699 124282 134894 124582 103265 83124 67338 57044 49878 32381 25745 21614 25775
12667 25775 27551 27552 24549 22722 22441 17746 13530 10981 6885 8370 11192 13828 19615 17593 15169
12652 15169 18602 18756 11298 10985 16796 24729 28959 23353 18748 24211 27157 25495 19799 23170 23283
12637 23283 22550 20449 22397 21590 13117 7297 11754 13735 13246 15338 17383 17151 13541 16293 24659
12622 24659 25192 23764 21114 23198 28148 24734 24730 24613 21898 20606 19568 28826 25200 21950 26058 20235
12606 20235 10837 11678 15633 7317 8831 4890 9430 20095 26221 30716 32538 27633 23114 26380
12592 26380 33469 31024 33825 36905 42048 43406 42813 39435 28339 26333 31624 38634 49075 47823
12578 47823 52086 64992 84565 98624 108462 98070 78720 63677 59686 59044 54696 44597 37803
12565 37803 31061 27121 25216 23499 26555 20915 21587 26422 27203 26259 20112 27483 33916 34312 35922
12550 35922 32962 34368 44219 48691 44625 45788 45294 46835 51693 58383 61669 59454 60495 68198 80986
12535 80986 89163 101435 118972 138904 181461 255440 307556 284196 231612 197441 182555 169559
12523 169559 164157 169147 170318 178012 184741 186961 185408 187812 192258 188925 176429 157205 141103
12510 141103 132195 114672 105520 101946 95903 89816 89404 92817 91220 93074 100214 102457 99080 92442
12496 92442 91087 97190 104273 116395 123329 129216 139088 152637 183608 227602 296518 385480 441520
12483 441520 432656 394381 348775 318520 318581 336451 353940 374306 388582 399694 414895 428766
12471 428766 445139 456112 428839 369598 309132 262961 229110 197546 176987 160204 147551
12460 147551 136951 130687 124559 126018 117320 109015 99600 83772 78061 80626 89487 99566 108173
12447 108173 113566 120073 130295 147373 162350 187746 222985 262151 273615 264128 252419 250267
12435 250267 267004 287660 314087 335691 351412 371618 389588 398583 417208 445266 456706 424715
12423 424715 357096 301037 262991 229966 211937 207788 195899 167561 149644 134627 122402 105133
12411 105133 95183 93740 85170 88877 89622 84204 77619 72502 71315 75995 77863 71152 71360 74442 71866
12396 71866 67484 75048 82384 94514 101939 111245 119306 123646 135481 143376 154500 164323 171552 177541
12382 177541 180767 191901 190589 173014 139835 117243 105005 90765 79440 77618 76436 71661
12370 71661 69334 66931 67864 68926 61477 60771 52526 40932 34764 34107 40736 48052 50639 44612 41260
12355 41260 38595 36590 28771 32195 38297 34807 35489 36630 32865 34235 33568 35553 33016 35798 35186
12340 35186 38077 43354 47235 48509 49918 47828 39327 35931 30567 23284 25970 32163 32087 27697 23159
12325 23159 28290 31303 38002 47996 46017 46243 33505 25061 25239 25756 24683 29306 38004 40131 33587
12310 33587 39709 51372 55389 50556 46128 42245 37191 34447 36012 29437 24369 26148 29147 26120
12296 26120 20310 13484 13396 26899 36091 34047 31302 26627 23269 14149 15477 15638 17233 20202 21070
12281 21070 19625 19937 26377 28173 30414 30809 37557 39710 34720 28625 28729 34565 37059 30763 28301
12266 28301 28347 30795 30622 36536 44230 42273 35618 26749 15736 12570 12196 13047 14816 19894 20718 19898
12250 19898 24392 32249 37112 35016 27454 22662 20457 19612 17063 15385 10748 12977 12124 12117 16068 18672
12234 18672 12365 12356 29458 31312 27778 22685 24398 28903 24624 21119 14659 20450 19747 24075 37927
12219 37927 40025 44774 38231 26151 23255 20524 11362 14317 21091 24008 21705 20210 21833 18736
12205 18736 20307 27725 27277 30715 28553 28801 27043 24784 30289 40418 45284 40484 33086 23218 22431
12190 22431 27940 35736 38699 35456 30196 30102 25271 24408 22163 22235 27098 28513 23507 21463 23843 23796
12174 23796 26005 29208 20825 15867 11743 10929 8661 6161 4875 5085 3411 2882 7793 8918 7126
12159 7126 13179 18461 20315 23649 14484 11977 14272 14753 7175 3871 8517 16324 22547 48647 73372
12144 73372 95854 96977 84037 61750 39220 28675 20050 16987 14545 6786 -3407 -3847 -3739
12131 -3739 1007 8757 7474 -2030 -3760 -4460 -2618 2062 199 381 2052 11621 13340 8252 13983
12116 13983 17687 25698 25617 21684 22601 23401 21565 16465 16423 11285 5515 2463 2694 11788 25649 44771
12100 44771 75204 83087 64998 43871 29583 23923 24914 19542 14592 8116 10424 9955 10704 15188
12086 15188 18883 14582 11620 11182 10633 18472 22285 20796 20183 24420 27010 29124 30119 41080 56971
12071 56971 77436 70761 44600 22931 9047 -3349 1963 3222 6727 7481 4344 2250 9588
12058 9588 12634 16790 16363 19265 20756 20418 23870 22110 14421 9967 12147 12232 12553 21580 42479 52553
12042 52553 46731 38680 29042 31975 35678 30388 28629 36686 63931 99062 141769 140263 108060
12029 108060 75660 55870 41465 25310 23660 22641 21255 22126 19328 18527 17950 14358 11773 18269
12015 18269 21631 25613 28312 35303 63165 129327 221675 255802 198609 115666 66240 46292
12003 46292 41435 43873 53903 50674 37810 32175 36003 43721 49618 45401 31980 22139 11260
11990 11260 11180 17436 21990 27233 38177 43657 39721 26207 19900 19033 20049 21769 21324 25255 39784
11975 39784 49661 63273 109269 189462 351847 636567 827737 679274 409943 233243 142473
11964 142473 94033 77782 69004 66711 68562 69243 70589 64342 51423 44739 54137 60949 52126 37075
11950 37075 33003 24068 14268 18301 22083 22962 26487 38158 46835 45423 38251 47543 74636 109368
11936 109368 134276 112581 75172 48721 37451 33108 35106 38822 43608 44873 47043 58332 73110
11923 73110 90007 115963 144408 205863 313473 366680 320819 273506 290400 405961 636668
11912 636668 763888 648960 461837 314270 209254 148002 112892 92828 90510 106947 141388
11901 141388 166597 170546 144807 120545 98874 72314 51709 45987 45077 43152 52802 70111 84569
11888 84569 73315 54897 44638 38112 48573 66354 90201 116314 142732 144251 118816 100912
11876 100912 119271 184670 277866 325706 275082 170055 97943 60159 41860 35159 29496 23927
11864 23927 23571 18876 14570 6442 12514 29837 46416 41047 24614 19033 19543 22947 26843 26666
11850 26666 16560 9312 8364 8767 4453 818 -868 -1757 -1895 4930 9274 7523 3553 712 -2255
11835 -2255 -903 2242 5727 5695 5602 7659 9237 5886 9738 6311 1811 3972 10445 9388 9170 15999
11819 15999 23629 25328 19841 10493 5080 1283 -2059 633 3231 -6023 -8226 -4429 912 3119
11805 3119 6120 15197 15173 15462 19656 25699 30356 26052 21631 16552 8798 2987 533 -2647 -5628
11790 -5628 -6927 -1648 -2361 -7658 -15793 -13767 -12490 -10978 -3449 3228 5452 -2647 -8554 -5759 -3357
11775 -3357 -3830 -2156 -890 8070 13163 12299 11245 10416 12919 33029 69151 89128 74811 46047
11761 46047 26869 11475 6324 6563 5663 14897 14406 10368 6233 5679 9981 14622 21656 28505 24052
11746 24052 11449 3032 3660 7304 12080 15975 14845 18146 15707 19022 30162 56121 77870 76226
11732 76226 48444 30147 19557 10334 9255 10048 8543 2712 4569 3357 8481 8293 1062 -5968
11718 -5968 -10072 -5070 1257 6484 14040 13611 11249 12375 14346 10363 1598 2851 -2035 -2548 -2035
11703 -2035 -6377 -5398 -5745 -4384 -829 -2041 1156 4166 1451 -928 985 1633 4839 4734 1119 1885
11687 1885 17926 34438 51805 79470 110904 106538 79841 59064 43415 37927 36038 43596 49693
11674 49693 41480 23041 9902 -4892 -11871 -7477 1961 2272 -1942 -584 -1786 -6515 -6552 228
11660 228 7632 9784 23185 39042 59699 96965 152364 222759 265318 243010 174784 108948
11648 108948 69819 44447 28075 21652 16778 20193 24807 18925 12158 9024 5503 1320 -2414
11635 -2414 5828 4456 1602 6414 2097 -1901 -4478 -4959 -2594 1510 10071 5547 -2592 -5310 -7530
11620 -7530 -8109 -9003 -9930 -4342 -4482 -5860 -6008 -2476 -2498 -3823 -4926 -11900 -12486 -11482 -6904 3867
11604 3867 5839 -1368 -6628 -3230 3008 5518 4038 -745 1047 -1902 -4370 1083 2969 1012 -6388
11589 -6388 -5014 -4327 -4927 -7355 -8262 -8992 -6296 -4657 -6925 -8399 -7569 -7134 -8209 -4077 -992 -10122
11573 -10122 -20120 -16946 -6279 -8531 -15402 -12146 -6160 -10433 -15211 -15916 -10793 -6823 -554 4985
11559 4985 5082 3427 493 -3554 -2437 870 -36 1769 3949 6659 2226 395 6454 5297 5844 8100
11543 8100 5574 -2310 -6230 -5406 -4105 4477 11865 1356 -12405 -16800 -18253 -20656 -16083 -17613
11529 -17613 -12415 -5593 -5755 -11799 -11437 -2961 -2953 -7055 -1995 -3788 -2250 2162 -176 -8994 -6967 -4853
11513 -4853 -4133 -5853 -1751 645 1562 1392 -497 8035 10422 3478 -5794 -5977 -7392 -8329 -7645 -3365
11497 -3365 -3382 -12419 -11317 -5836 -2932 -1671 -579 -6033 -11448 -19850 -19989 -12227 -4830 -9373 -8648 -5587
11481 -5587 -7831 -6473 -8617 -8438 -8502 -8815 -8010 -9325 -1779 2298 -1699 -2706 312 -401 -580 4108
11465 4108 2437 -3928 -7231 -1531 6188 10113 8198 1855 -3364 -4589 -4842 -5667 -1384 664 7678
11450 7678 4064 2461 2977 -2947 -6423 -4845 -5631 -12991 -8678 -7712 -13086 -8267 -9091 -12608 -11577 -6980
11434 -6980 -1036 5854 8304 7205 10299 15162 12968 4280 6826 3796 2404 9428 13198 8329 5836
11419 5836 7697 4389 5976 -1881 -6637 -9049 -1022 4133 4874 3029 -568 1676 485 -5613 -11284
11404 -11284 -12017 -15078 -14167 -14603 -14966 -8287 4576 6908 6947 -2028 -9537 -8518 -5261 -147 -1135 -4078
11388 -4078 -9537 -11543 -10669 -4108 -1031 -9221 -13162 -15559 -17688 -14971 -14917 -12378 -4102 135 -4932
11373 -4932 -10638 -2562 1327 1581 -6129 -9417 -7851 -10805 -9568 -13087 -10679 -11043 -9558 -10493 -11606
11358 -11606 -3373 -5412 1336 6003 4461 5579 9932 14075 9689 5037 5337 10108 8867 3887 -5266
11343 -5266 -2139 -1190 -9595 -13748 -15241 -10861 -6282 -3852 -2890 -3716 -4407 -11888 -11130 -6445 -12473 -19189
11327 -19189 -17395 -14448 -11659 -14034 -20090 -19822 -23179 -27666 -20307 -21510 -24264 -18855 -16157 -17460 -14534
11312 -14534 -3984 -493 -2245 -6464 -8268 -6669 -5835 -15425 -16954 -12445 -3986 726 3427 -5878
11298 -5878 -7902 -3918 -680 1375 -5127 -7502 -10046 -9744 -4579 -622 -2173 926 1914 -4515 -4159
11283 -4159 -9193 -9159 -8648 -10972 -15121 -9115 -10583 -10787 -9555 -5076 -4622 349 1488 4307 8990 1539
11267 1539 6496 5787 11439 12693 10083 8028 10331 11697 13917 24784 29304 30163 39582 53706 74737
11252 74737 103703 171595 295655 450848 550190 571981 579563 537378 409940 264376 166636
11241 166636 111150 76982 56867 43530 33629 27389 29580 22917 18727 19697 16872 11027 3606
11228 3606 261 6348 9911 12198 9679 6902 8702 11738 8588 2964 5880 6472 4225 3692 4931
11213 4931 2908 5168 4605 5666 -1165 3253 4097 -140 -740 1463 1150 3314 5723 3454 10666 14899
11197 14899 12738 8177 4674 2644 2789 5584 8505 7174 2733 6739 14655 17792 11784 16733 21609
11182 21609 22699 16911 14773 13522 8576 2597 2727 20 2882 2879 1186 -290 2084 -534 2811
11167 2811 441 -1484 -1144 -8789 -8468 -5484 -1681 -2075 -4464 -2312 -796 123 -5450 -3579 1331 -871
11151 -871 2944 6101 2106 -2613 5525 10821 11434 9371 19596 27359 39157 54976 58068 62690
11137 62690 74414 93535 104641 115046 119529 121090 110626 103457 95930 97975 119445 186943 300238
11124 300238 433317 493379 461352 447862 488349 477280 366622 236111 147055 95926 67334
11113 67334 47441 40175 37699 34409 29185 30564 28825 28211 29597 19801 15499 12366 9993 10139 12765
11098 12765 10333 11685 18931 19524 14387 11469 7766 15401 21353 17109 16485 17877 14024 7259 2504
11083 2504 2684 -2594 -10864 -6763 -8107 -5010 1852 -1307 -4398 -11574 -18818 -16001 -8391 -2305 -2012
11068 -2012 -3545 1738 5839 10110 14377 13655 7093 2927 7882 16549 12311 9709 13969 14097 12235
11053 12235 11719 8842 9158 3252 -2667 -2694 3972 11954 19290 17695 17360 12647 4027 8344 1954 -5374
11037 -5374 -6677 -6286 -599 2271 5867 8634 11632 15344 18289 21781 25420 24728 14501 14010 16632
11022 16632 12203 13199 9140 5477 9066 12168 15733 16373 17300 18238 18628 17453 8858 4632 5596 6731
11006 6731 5465 3126 9790 11001 12729 16855 23675 24620 17199 12067 16019 18762 23930 23115 30259
10991 30259 36516 31020 20206 18282 16953 8709 9533 8352 7043 6693 7738 6831 478 5195 3457
10976 3457 4417 7397 14353 14809 11796 12051 12300 5042 2340 4960 6902 9011 18372 21164 15064 16479
10960 16479 21171 19883 15906 15149 16617 17149 17719 11577 11308 13916 9575 8039 10137 13393 13683 9298
10944 9298 6022 4315 9565 11094 13772 9771 9330 15917 17635 17616 13315 8723 3916 -2288 -6042
10929 -6042 3574 5013 3469 3916 8741 14027 15581 15322 16544 20064 21429 19697 13725 9925 8384
10914 8384 8729 9218 14919 12592 6615 4914 8588 5035 7207 10808 11370 7778 3269 4132 3746 -3507
10898 -3507 -7333 -2106 3290 3695 -7114 -3357 3714 13460 21773 24767 31987 37706 30519 27058 28642
10883 28642 29867 26527 21284 15553 15872 16454 20719 26132 27149 18103 13177 13615 14317 14573 13521 19027
10867 19027 22865 19679 17513 18061 21384 26421 31752 35411 39069 39410 37868 40573 39935 44213 46594
10852 46594 46059 41851 40197 30603 21144 9252 10755 11851 16072 18513 20199 22046 29427 34278
10838 34278 31637 27145 23203 22567 14485 13567 19446 25218 21244 18979 13089 17279 23753 23119 25485
10823 25485 30655 37221 40218 34382 37803 41451 43570 49955 47713 39277 26436 20148 14257 13266
10809 13266 13598 8467 2408 2254 2998 5106 3054 4645 8467 12121 17656 19780 20219 21193 23399 20386
10793 20386 29053 32269 24595 22967 24691 35614 48292 56024 59609 61795 63481 66052 76910 81620
10779 81620 84617 99937 112935 124041 139424 150118 161403 186513 233548 330563 518930 871239
10767 871239 1427234 1951199 2284712 2744496 3196015 3033409 2562737 2232125 1797915 1222485
10757 1222485 767562 498522 346178 267843 227176 189420 164133 151317 145794 136063 123244
10746 123244 113582 113176 113796 122345 122954 118892 115206 113645 114671 108465 89906 69232 61255 59874
10732 59874 62214 64765 71448 70282 63274 57870 52347 46262 43488 34075 30396 23659 20246 20553 29464
10717 29464 27559 21131 25164 33370 29014 24486 28131 33982 38137 35515 27312 29737 28890 28601 27074
10702 27074 28871 31634 30807 32284 27518 23006 18299 12327 12091 10731 4429 5214 1916 -2170 -7289
10687 -7289 -11768 -13018 -13318 -7697 -17730 -33944 -37942 -31706 -32060 -34559 -33379 -28732 -16109 -2074
10673 -2074 14521 26252 35792 42138 36902 26061 13958 5214 -340 1938 16574 23988 31799
10660 31799 49159 55012 63685 75737 78667 67103 54520 51155 52385 58700 54869 55266 61237 68017
10646 68017 71044 71737 75847 82255 76159 65287 51998 46844 39089 34332 41134 45524 41829 45256
10632 45256 52249 52472 45861 44744 39679 38100 37854 47322 53996 54914 55033 56317 54236 58639 68977
10617 68977 91689 137165 192161 271037 346855 393333 442619 482964 448596 383114 326821 268835
10605 268835 206194 158120 113471 85831 64299 49914 51926 41023 32765 35946 35958 39797 35597
10592 35597 43223 56183 62880 56056 51954 43266 26729 15590 7814 -296 1302 -6504 -16316 -26917
10578 -26917 -23883 -11804 -1769 5080 16341 26307 29822 36954 50267 54305 51250 50682 47990 52550
10564 52550 64440 68317 62900 59341 65442 54966 33983 29358 27025 18536 18561 24028 31130 35177
10550 35177 42919 61910 94605 120052 141697 165007 182189 190602 196545 204128 182804 149210
10538 149210 125527 110111 94548 70580 57861 55609 53881 47472 41773 39774 40221 45721 43187
10525 43187 36410 35127 24463 16957 11534 9013 7194 -53 -640 3524 13804 27650 36449 47637
10511 47637 51680 49483 46567 42631 41561 44553 60977 69300 73253 88183 106739 103246 102149 107503
10497 107503 107209 104798 101903 103574 105245 104192 105614 139548 228038 402460 556165 630594 817061
10484 817061 1011924 956672 875096 881348 813081 655743 517100 418329 359870 315305 280128
10473 280128 254005 231065 208020 188829 163066 137446 114532 91784 71569 67106 64041 70535
10461 70535 85673 108785 130949 143195 155132 167012 172923 185359 187687 188882 197198 207409
10449 207409 217030 224975 224030 231151 250591 266815 280662 294199 300284 304101 307834 293508 283880
10436 283880 277994 271758 264019 254826 241417 237200 247642 267996 291570 329753 376746 419358
10424 419358 450948 481255 527425 563039 579300 592092 599442 587926 578650 589778 591125 585718
10412 585718 617393 675430 733880 806757 883114 953330 1038771 1101559 1156941 1237792 1338637
10401 1338637 1426118 1510614 1602009 1689162 1765215 1819138 1860137 1921479 1987011 2029552 2087594
10390 2087594 2216725 2379797 2543926 2759367 3086137 3560106 4234012 5159065 6216969
10381 6216969 7154496 8229611 9551931 10520480 11334762 12792234 14489621 15718627 17202033
10372 17202033 19375318 21114337 22588198 25237688 29281590 35168421 45081149 62579551
10364 62579551 94064177 151503805 244405556 338877946 393899949 456625359 536194766
10357 536194766 534200198 460567404 405343777 349856974 256922748 166529103 108401219
10350 108401219 75126755 55583138 43600259 35919316 30552270 26630593 24070609
10343 24070609 21821987 19063753 16633528 14923549 13382854 11839195 10622581 10086132
10335 10086132 9725818 8901059 8019342 7341551 6553689 5727498 5071621 4571911 4156552
10326 4156552 3806664 3530424 3274704 2994046 2741768 2550437 2372506 2179440 2016171
10317 2016171 1900876 1814168 1740258 1651073 1585601 1548513 1502114 1448859 1400448 1378011 1376196
10306 1376196 1367850 1349272 1328656 1321662 1289022 1233620 1178331 1122372 1046874 988631 955886 916434
10294 916434 881745 875890 885425 889551 886566 890497 904346 901781 894893 893479 878809 853612 833235
10281 833235 812963 786046 748505 714046 683379 650054 619229 593688 579974 569632 562126 554296
10269 554296 554278 550952 536227 526689 522828 513279 503560 503036 485706 469951 467004 479117 489554 492716
10255 492716 499702 504641 505148 507197 500638 493208 480173 454569 419610 395999 375856 349925 317815
10242 317815 291115 265365 241247 211629 194731 202903 253518 363384 464906 522239 645821
10231 645821 795995 792899 707729 687759 640197 532557 442312 390268 355903 336142 313977
10220 313977 284442 266573 262298 261645 265668 264671 263517 275387 294283 312331 331094 339895 336711
10207 336711 329216 322961 300545 282911 273312 270852 270455 264301 269887 281443 281822 269182 266397 266880
10193 266880 259152 244272 240105 233147 222905 211418 211807 200972 198098 202937 197871 193828 186566
10180 186566 165157 142378 123882 108133 87693 55264 33780 33771 33875 39033 57250 82814 109521
10167 109521 134466 161281 182741 196433 214152 225625 222556 210218 205681 203290 189471 164362
10155 164362 139306 134903 123819 113116 115700 118592 124172 134764 136193 133751 134709 135466 136549 140579
10141 140579 146523 154162 163397 159841 165710 168977 163832 156376 150350 142689 129888 122143 118201 115126
10127 115126 106396 97988 92612 87495 96278 107326 111124 111628 112580 112087 108894 112778 111894 99405 91977
10112 91977 88396 89430 95858 106895 116459 123729 137012 146714 141397 131782 135502 135295 126814 118485
10098 118485 110753 110825 108919 105692 101551 101186 98122 103844 115770 116734 110965 113085 112364 114181 116078
10083 116078 118673 118902 119121 123201 129281 123778 113514 112213 111914 113701 102438 93390 81334 79931
10069 79931 85914 89062 88159 90896 86943 83752 85764 84577 78718 68151 69442 73477 70445 68820
10055 68820 84487 106466 115284 125267 139655 147690 146024 141347 134046 126342 138142 145259 156916
10042 156916 174327 193851 207979 221211 226482 213025 199059 180009 156209 139022 128920 124515
10030 124515 115264 105190 105878 106954 110331 121578 130835 139572 158557 191834 229095 238229 203273
10017 203273 157307 129465 120604 128971 145576 173591 209492 224899 199106 154015 126959 117370
10005 117370 109657 98399 96632 95889 104483 115086 126193 162543 230789 331627 342878 267366
9993 267366 195230 149783 126203 119172 112129 104032 92807 90005 94531 98124 102778 99957 94989
9980 94989 96282 101429 113856 134515 167961 183186 159410 131423 114788 113403 119569 128076 139011
9967 139011 157785 201532 242729 241311 214357 187693 179632 169129 172282 188752 214699 249213
9955 249213 313280 404583 568812 894205 1424581 1972313 2322112 2745933 3225693 3136738
9945 3136738 2655255 2310939 1920130 1351033 868597 574540 414917 327792 277462 242649
9935 242649 223825 214624 205734 191158 167209 152020 137406 121801 113585 106931 106846 111163 107664
9922 107664 114065 122308 129505 131566 136077 151613 162960 154221 147720 141262 132751 133079 148310 152102
9908 152102 153146 163678 157508 133652 115994 98244 77396 65266 57517 53045 51570 48709 51614
9895 51614 47145 46277 54971 66155 80314 89731 104109 117748 126288 129136 132212 117593 105491
9882 105491 90933 86132 98268 105666 107810 115484 125823 137354 152145 163114 183470 227536
9870 227536 304223 407567 467613 421870 358526 344732 395092 539733 799867 1156888 1598953
9859 1598953 2028858 2363724 2536460 2466253 2196427 1803852 1363481 975648 675461 475292
9849 475292 357359 289910 248478 217191 211026 216249 219302 222079 229012 240767 248154 244937 223202
9836 223202 196971 182979 181243 184718 195805 215133 239595 264813 282417 300235 320151 339214
9824 339214 359924 373789 386230 403236 418957 449071 504619 606053 780204 1106910 1711557
9813 1711557 2690644 4003218 5729395 7468766 8804523 9734187 9584822 8664707 7270658
9804 7270658 5508003 3928548 2688303 1802208 1263506 939941 737916 611017 529096
9795 529096 477639 455619 441896 420503 382213 340914 314593 288969 266067 245902 225422 218786
9783 218786 209308 196083 189397 176714 163176 155586 147647 143230 137571 129473 128916 124230 116364 111975
9769 111975 113745 115730 117625 113851 106199 98500 97787 97929 99639 108934 115364 122370 134266 140869 134028
9754 134028 121439 112567 107164 114751 119743 129925 142729 142748 136972 134541 135721 128799 125726 128048
9740 128048 126786 139480 140889 146447 156736 164664 166777 171011 175068 179889 182689 184633 184243 186422
9726 186422 192000 198285 207171 213579 218446 226121 238339 253475 265032 263303 256611 257962 259010 260922
9712 260922 262461 256380 255806 261119 257647 258129 264095 269840 270172 268571 267205 271762 273733 285062 287213
9697 287213 289745 296467 301488 299369 307988 318051 328144 325902 325563 332033 344684 363606 380320
9684 380320 391422 405449 417833 415761 408459 418694 418291 419735 415486 409463 404799 414278 430405
9671 430405 443413 458303 468585 473173 474750 461112 438559 421711 389109 362732 341466 329517
9659 329517 326264 317964 304834 300478 302811 307712 309342 310065 314106 324805 340070 358594 397861
9646 397861 456374 542997 653521 826488 1091900 1211572 1041357 797182 660407 622064
9636 622064 674011 819336 1068731 1476846 1909335 2050395 1727536 1224904 856827 659115
9626 659115 570112 567060 652574 878860 1193159 1280813 1033565 739567 559544 461245 368125
9615 368125 291685 250420 223438 200722 189507 187457 203852 236245 253022 229411 190682 163931
9603 163931 148364 138574 138386 137475 133567 128540 124266 109692 95622 96529 96085 101964 108481 111152 110273
9588 110273 101492 93591 94354 89680 88681 86438 81612 78116 77763 84765 83824 75486 71240 65907 60279
9573 60279 58350 63007 67730 72123 74057 76823 81067 81145 83284 80404 82896 86580 86201 86965 84398 82494
9557 82494 78814 83870 88927 90016 89902 89259 93014 99441 94174 87368 82827 88041 92225 86820 88963
9542 88963 90954 99396 105295 105734 99506 96769 94697 99835 110550 117265 127938 143978 159298 162093
9528 162093 151199 138664 143592 145624 149787 154669 145128 136549 129040 123919 126934 128047 131538 143490
9514 143490 147629 150787 153837 150560 153445 157593 156395 156143 163767 170616 172622 176085 181352 184783 188273
9499 188273 196306 205901 220409 231104 239137 253432 268586 279042 306529 341625 386003 422790
9487 422790 440134 443327 445734 452763 475830 509680 547262 590509 632314 672161 722284 784058
9475 784058 841752 908882 986752 1081210 1178509 1284770 1393656 1516323 1641673 1772796 1896785
9464 1896785 2017537 2107136 2155524 2159746 2124969 2060236 1971591 1860421 1743303 1620125 1495713
9453 1495713 1371481 1257971 1148401 1058074 977986 899394 825212 750962 690679 634861 586061
9442 586061 540298 505809 473618 441619 407036 376615 355587 337252 316363 293511 276664 264511
9430 264511 253199 235950 227826 220946 212908 201580 188044 174850 173999 168665 160086 153363 153826 153444
9416 153444 145768 142183 142311 136414 126612 117658 118483 122157 122179 126859 138419 149906 155707 161164 165049
9401 165049 156279 143343 139279 128642 117603 107742 109202 117713 132302 146456 148230 137703 125424
9388 125424 113408 103411 100540 92475 75994 64508 59558 69701 73950 67636 65283 73274 75384
9375 75384 77243 74430 75865 70226 70599 68201 63150 63416 65337 72071 67813 63165 54171 52615 57501
9360 57501 55945 58910 68147 72476 72588 75214 75397 74024 73607 80221 79850 74257 68240 69230 67535 67393
9344 67393 74340 75374 78381 82406 84275 77261 69402 63873 62692 65828 67406 71285 73179 74243 74268
9329 74268 77429 74963 74124 72340 67211 64908 61412 52395 44428 45376 50958 44991 45488 49629 48400
9314 48400 46750 43605 43175 46111 58760 68359 74696 86949 106633 119825 117237 105409 100943 102545
9300 102545 121180 140488 162360 178901 186784 176962 156707 134274 121682 133314 155790 174978
9288 174978 187416 183338 161955 135119 106411 88672 89021 105675 117911 105874 87780 70439
9276 70439 59101 54451 44906 43679 43552 45247 49157 55947 56403 47286 42967 43325 42811 50907 49464
9261 49464 42293 46581 55393 45843 43040 50133 48406 45835 41335 39746 38323 35967 37310 38207 34882
9246 34882 39643 39875 38227 42561 48969 42178 30988 30851 28458 28798 35382 38195 38321 32851 26902
9231 26902 34754 34113 30938 28807 25032 17875 21018 25226 23362 23219 24732 33014 40469 40666 37732
9216 37732 35547 36157 33583 37641 44119 41424 32709 30253 31731 27625 28699 29756 17344 17430 19357
9201 19357 22017 26645 24343 29241 29190 24165 22785 29055 33334 32499 33292 29128 26130 24800 27464 31349
9185 31349 29494 28971 29156 26692 16892 17127 19156 25949 40298 46744 48340 53513 53793 58013 49190
9170 49190 35240 35868 37772 31585 27055 24940 24165 20798 20664 19475 16964 13181 14138 19270 25351
9155 25351 27365 28226 26453 27655 27744 29706 30941 27942 22441 26148 29741 21872 18602 25706 22548
9140 22548 15949 11243 9482 9837 15277 17758 15645 18108 34039 36321 38728 39752 38363 35371 37343
9125 37343 38002 37154 30943 24003 14413 9292 9130 6670 8582 15572 20260 23440 26186 32680 33769
9110 33769 27459 21999 22380 20179 20413 23004 27934 29032 31431 31517 36793 43901 45975 50968 69351
9095 69351 72743 58993 46015 35357 32017 27497 22332 23585 27959 27343 27868 23893 31040 34393
9081 34393 29126 27486 28199 32326 30382 27631 30035 27825 30851 29111 32080 35936 40127 41412 38898
9066 38898 38036 38324 38943 41855 42875 42128 42353 41614 41878 44430 44951 36823 36881 40116 40673 40814 48367 45769
9048 45769 46534 45361 40114 43378 51397 52254 57134 61171 62212 62417 62777 63286 56791 60295 60986 61219
9032 61219 60535 60887 61931 56870 56825 60812 62305 61251 60563 64465 64298 71079 77848 73685 69442 69697
9016 69697 75422 85201 83515 83397 87344 88512 77536 68448 63863 67228 73334 81177 78064 79522 85244
9001 85244 82784 77267 75821 70880 60876 62440 69769 71327 65053 59948 65124 69711 73687 86851
8987 86851 91261 98181 99572 93340 85547 83130 81760 76341 72254 68265 61572 63871 66471 70584 82603
8972 82603 86589 88620 105522 134130 164744 201200 228037 226467 191045 157208 127394 106423
8960 106423 91234 78411 75046 78173 76465 78608 75414 62397 57804 56476 61784 52306 51573 49270
8946 49270 46201 43043 37406 42232 41010 38434 41822 40097 46360 52332 56363 62820 65642 57220 47138
8931 47138 40052 38756 42069 46096 46180 44697 42519 44573 46478 40594 38826 38611 44267 51075 48502
8916 48502 42692 35624 34884 32682 30200 25536 23664 29712 37715 37038 32230 30722 28032 32919 42675
8901 42675 45292 38536 33793 26156 28825 27825 26415 23797 16897 17992 18500 12509 16210 28624 34179
8886 34179 28066 21044 26442 24607 26968 29989 34329 34013 36392 46914 47919 50493 45932 44136 33918
8871 33918 27042 23566 22299 23623 27926 24566 25083 25507 23212 34094 38818 43140 52668 75287 105986
8856 105986 145767 150742 123705 87836 59480 39156 24400 21122 25614 30811 32120 32144 33970
8843 33970 36818 38844 46617 52819 50891 43038 32410 28232 27224 24695 26908 25423 21728 25363
8829 25363 37068 38131 41041 42969 40284 41478 50724 41466 28049 22623 17512 21260 22914 17239
8815 17239 10731 6833 16937 20251 16695 23203 18523 14679 19256 19461 16133 12710 12423 17315 17334
8800 17334 12850 4281 3363 3657 7498 10741 11209 23804 34425 38633 31187 24790 19550 25134 29091
8785 29091 34346 43204 42822 38313 35837 29846 27023 22180 19861 26497 40199 40639 32853 25249 21133
8770 21133 20585 26383 30196 27642 23943 29546 28153 28815 29072 26652 33490 55309 72040 74377 59059
8755 59059 43419 41553 45605 41167 43429 53098 70731 94864 138940 191343 223726 218760 177219
8742 177219 126135 86913 66106 56891 57672 52965 48216 40321 37381 38341 45068 59607 73953 67557
8728 67557 51662 35575 26706 23340 24676 29944 35131 45547 44785 39907 36861 33059 33706 49054
8714 49054 80732 122607 135609 113565 81448 63653 48019 42641 51816 60279 71167 84747
8702 84747 90679 93006 84403 82054 78566 69166 65295 61436 63353 63364 59868 56226 53983 52262 52581
8687 52581 58128 68493 78096 84594 83817 76657 73121 70168 63382 56470 61905 64528 58054 55270 43041
8672 43041 34963 43581 47554 52340 71128 81060 64979 54125 48633 46985 47870 51086 47075 46130
8658 46130 44674 44310 56193 83451 109923 118395 98302 72888 58313 46847 40968 36550 35411
8645 35411 38014 41216 43333 46337 48520 52174 61569 67035 76613 81993 74209 61407 53261 49520
8631 49520 50956 58186 65122 71066 91673 115278 140403 172088 219734 269414 307574 376155 522793
8618 522793 764517 973608 923495 677581 457782 333484 257256 212255 180635 150345 130837
8607 130837 107538 102374 99622 97703 97187 107247 114397 118992 127377 143074 152952 155580 169171 194024
8593 194024 224571 260833 299026 352736 455879 660822 1002458 1366059 1407413 1097849 755904
8582 755904 542141 433371 396896 394471 412441 454353 539840 713775 1061191 1612396 2015730
8571 2015730 1861843 1533762 1534158 1747739 1613938 1137113 725339 502496 386436 317419
8561 317419 275575 249128 229231 205048 182474 167735 165241 175422 185588 179009 165056 163761
8549 163761 172075 187011 192739 200367 202465 214962 239200 263278 276126 279562 261044 242072 230494
8536 230494 221548 219323 227923 248709 297416 384253 540214 805840 1135229 1354275 1454164
8525 1454164 1794609 2581174 2923814 2262944 1396735 858985 588805 450215 374311 332158
8515 332158 316870 291165 247695 211841 198290 215683 236255 232800 201061 170170 149697 133382
8503 133382 119377 117214 120139 128160 152525 182797 195297 176735 145492 121715 111253 111638 111416
8490 111416 112033 122876 153222 210164 269798 334995 380850 393823 441806 622203 1000173 1396139
8478 1396139 1347563 977857 648859 445001 324572 255084 211091 189117 180739 171782 165011
8467 165011 163824 171643 185245 197024 185852 161402 145644 125100 103735 88793 81524 79834
8455 79834 88505 99508 114271 119840 101858 81623 71620 70671 72291 81876 88197 98263 106276
8442 106276 108888 125786 154167 177558 183598 184522 176206 148587 110567 88722 75497 68753 64721
8429 64721 68804 77219 78754 76430 79825 77380 84969 99568 125933 146734 143021 126966 128354 135490
8415 135490 124547 104419 85332 66563 48991 35085 33493 38610 37767 35977 30596 28775 32524
8402 32524 28395 28309 30050 37221 45235 48806 45822 43397 43027 40655 34525 32620 32562 28366 26590 17912
8386 17912 11996 14946 20421 33365 41734 40191 38733 36091 37582 48295 64840 69768 70759 68841
8372 68841 65710 65766 64496 51417 33931 24945 19650 18323 18900 22939 26441 25742 26447 27892 26470
8357 26470 25537 21572 23190 30528 34261 38810 33963 27800 30410 28495 21211 14813 21410 28456 27433
8342 27433 33943 42466 56062 67233 77406 81695 76351 69698 57000 39811 25956 19271 14901
8329 14901 15346 16056 13542 10997 12306 15995 10622 7429 11752 14738 18490 18411 16198 9606 11553 14142
8313 14142 12011 9578 7950 11656 15229 13253 12706 5245 7468 11490 16881 18741 17237 14455 8389
8298 8389 437 5420 6099 10976 7962 2841 8647 15560 22339 23405 21418 12790 10470 11709 9407
8283 9407 6446 5470 9360 14152 14512 9216 14179 11056 7390 8177 10238 1513 7094 10414 9887 10255
8267 10255 16656 9482 3530 8282 13894 17169 21302 25261 20972 25295 29272 28735 29081 26511 19860
8252 19860 19007 16879 10586 10114 6610 6153 6619 20208 31544 32333 24327 23252 21150 12937 12838 9604
8236 9604 14334 16894 18743 18977 15619 22187 19686 18767 15661 13244 12871 13927 15403 15485 19056 20626
8220 20626 11677 9806 11348 21688 32720 34174 47162 63718 69658 72753 66492 48553 25106
8207 25106 18052 18419 22487 25988 28610 29005 17953 8227 6735 4260 10054 18346 17315 16862 21173
8192 21173 26066 17041 8500 2237 -547 1907 5031 15165 16733 14803 13625 7142 5210 7894
8178 7894 8807 7777 12153 17839 19814 11757 11966 29703 37595 54794 69954 68046 56232 46839
8164 46839 37325 29312 25448 20943 15757 13837 10310 12804 13194 8858 10 1747 8188 11002 12268
8149 12268 11415 5402 407 -7636 -12012 -11450 -6893 -5766 -4013 2362 3240 2859 1670 10265 12038 6032
8133 6032 5044 6315 8224 4545 1443 -4785 -7225 -5715 3779 11892 18882 17379 10578 3766 6803
8118 6803 7465 5158 5441 13629 15802 25415 23524 13426 12325 4961 1819 8780 17704 15929 8851
8103 8851 -553 -543 -1186 -10153 -3596 4539 2331 986 -3714 -1543 -1792 5978 10884 6070 3935 6416
8087 6416 5108 2 1421 10452 10451 11418 14375 15301 21708 23844 16945 13603 14899 24506 27159 15485
8071 15485 5310 -662 -2574 -6372 -775 8192 9768 7514 9935 4440 -1706 -1267 247 11008
8057 11008 11247 5178 1590 2530 8988 7405 2973 578 -641 3598 9375 16358 18089 13396 23764
8042 23764 25842 17135 17346 17804 18182 16410 16478 17698 8433 8434 8182 2929 4782 8846 9315 11175 11745
8025 11745 10230 17306 15139 15586 10160 10130 14630 19066 16495 12691 10487 15668 19230 15294 8885
8010 8885 8647 15101 17415 12605 6219 2888 9919 10030 7083 5344 12794 8269 8474 7762 13657 20810
7994 20810 24208 14363 10182 12956 15726 17379 13915 13598 9560 4708 8671 14931 12525 7133 6018
7979 6018 -1049 2143 10790 12450 9711 13059 22063 22782 21270 22769 28164 29665 23824 19509 15664
7964 15664 13423 13469 6716 -999 -6410 -7940 2698 2120 4087 8713 7567 5718 4966 2301 4475
7949 4475 6980 7935 16404 18216 16039 10722 8730 2907 6463 8449 7971 11040 13928 9470 9032 8825
7933 8825 3455 3192 5956 -1569 -7731 -4828 -453 -832 -987 -1169 7148 14866 13801 10277 12581 12870
7917 12870 9312 5937 9349 10248 10741 8741 7886 13955 20430 22430 25995 22896 19328 14043 16049
7902 16049 15394 11154 9489 11922 10277 7222 3552 3981 7731 8219 4514 1561 -2934 -2218 -2379 -616
7886 -616 4402 3775 5439 6503 3860 6644 4683 3965 7489 10518 14946 18992 12383 4283 2007 -341
7870 -341 5412 8153 12429 11357 16542 16164 14220 8054 -822 -4882 -1542 3243 5473 -4698 -1248
7855 -1248 4323 6726 9190 10285 4803 1300 2250 2050 495 4607 2402 2384 1252 -602 1267 2206
7839 2206 3555 3496 3290 7163 10095 5113 4476 3624 2309 6662 12846 23777 19479 11414 6730 11592
7823 11592 10929 9363 5326 867 1965 1652 5979 5896 -1919 -889 7688 12596 6155 8364 11960 6041
7807 6041 2672 7451 7263 689 -2625 1651 6273 11671 11114 10691 4407 -1852 -1100 3658 5766 7400
7791 7400 7712 2374 -4239 -5403 -7145 -5077 -2495 -1682 1867 152 2845 3292 6965 6375 798 -4050
7775 -4050 -3684 -3746 -1083 -1365 -257 4248 -4600 -7774 -4865 -1244 -2745 -3114 -3930 -50 2728 1023
7759 1023 440 1511 -221 1321 4285 235 240 5772 -429 -815 -1565 -7800 -11701 -11443 -9407 -5391 323
7742 323 -4789 -7699 -4862 3697 10119 1515 -2177 1602 3864 981 3453 -2381 -4938 -2295 -1340
7727 -1340 4890 10127 5563 -1633 -4708 -5529 -1775 3371 4313 -6648 -10055 -738 1966 -687 -3214
7712 -3214 -4563 -1998 1928 7442 8333 5361 1204 2639 3597 126 -2113 -5447 -14530 -7541 3307
7697 3307 2115 4795 1757 -619 -5935 -8429 -3504 -5356 -1235 2983 -1898 -3638 1012 9189 17174
7682 17174 14130 17389 14741 5933 2916 96 2663 7443 7807 13722 13308 14574 13260 4143 -4790
7667 -4790 -7131 -1521 3255 8373 4592 -115 -31 1189 4474 2180 9162 4018 -2747 4271 11635
7652 11635 16901 14093 7662 7621 6372 -1898 -3152 -7389 -8126 -10580 -12488 -11612 -2608 -2082 -3893 -784
7636 -784 3909 2701 -2728 -10748 -7387 -3551 -4071 -5978 -1987 992 -784 -2594 -6568 -14502 -15357 -2294
7620 -2294 6595 10301 2126 379 1067 -2758 -1184 4496 4088 3884 -1430 -3737 -8214 -132 5641 7187
7604 7187 1867 4125 6417 1195 1054 1761 5148 8011 5216 5003 2389 1962 6073 -3950 -5894 -6322
7588 -6322 -11747 -14866 -8489 -994 -148 1290 8639 9698 11551 9470 11546 5748 1686 136 -8722
7573 -8722 -10600 -5217 -999 3642 953 -3471 -6120 1793 -3566 -2605 -3911 -8238 -6641 -3436 -5039
7558 -5039 -2349 1960 2989 -1102 -6551 -4083 4293 11077 11332 13277 10932 3464 3481 391 2937 -1083
7542 -1083 -3981 -3130 -6223 -3041 -5818 -9752 -8422 -6591 -9093 -9070 -1168 4338 2545 -6151 -11440 -11447
7526 -11447 -4810 -2454 -3809 -2481 -6205 -9583 -6102 -8721 -8458 277 1507 3199 9059 10055 6183
7511 6183 -2411 -6365 -4383 1915 3780 379 3228 4758 3575 -2333 -14032 -10479 -5939 721 -3964
7496 -3964 -3517 -1593 303 -5894 -6331 -2498 -6159 -7926 -3194 -5177 -10607 -11313 -12129 -10967 -5152 -6347
7480 -6347 -5782 -1315 425 -2945 -883 1674 -375 -2851 -775 -764 -3546 -1363 2025 2480 1314 2546
7464 2546 7538 9396 4974 4221 3002 -2957 -5973 -2369 -3353 -2788 -7071 -1506 419 230 2188 -1210
7448 -1210 -2971 -834 1606 -1675 -5963 -4480 -4474 -229 -3939 -1683 -1657 -2514 -6425 -14365 -11556 -19125
7432 -19125 -21261 -17773 -7266 3030 5640 4174 3594 2314 -564 -82 4505 -1152 -2154 3 9025
7417 9025 3752 -902 505 -1407 3602 5370 6214 2378 2593 1584 1752 -931 -2034 -3919 -9999 -5923
7401 -5923 -3340 1950 -1990 -3406 -3745 -3493 -588 3002 9256 552 -2603 -7027 -3857 -1807 -2988
7386 -2988 -8263 -7476 -732 -768 -4762 -1830 4172 -1582 -3303 -5773 -11892 -10932 -17630 -14943 -9378 -11698
7370 -11698 -13477 -6201 1935 1281 2389 1048 -3260 -7214 -1987 -1314 4052 9788 8535 4867 7497
7355 7497 11808 11083 -2583 -8189 -4454 -2607 -5029 -3364 -3999 -8892 -7104 -953 4007 3885 -3048
7340 -3048 -6090 -3324 -5078 -6996 -10648 -4872 -930 -617 1543 4483 -2395 -9559 -9310 -8523 -11823 -9021
7324 -9021 -9009 -8055 -3288 -5675 -5993 861 -1255 -1195 719 -4557 -6533 -2693 -3792 -4107 -914 4733 9006
7307 9006 7124 1916 1708 3542 345 -2939 -6901 561 -1985 2594 4586 -1844 -1066 -1038 -1095 -4804
7291 -4804 1278 -3519 -5648 -6210 -3296 -6818 -2465 -1872 -109 -227 -1558 3261 -39 -3579 74 4467
7275 4467 -5854 -10389 -8063 -3015 -2234 -3865 -8884 -2878 2732 533 -5539 -4469 1727 3207 2672
7260 2672 3702 5826 2286 854 -1133 -1731 -4351 -3028 4683 8259 3203 1886 -6146 -7525 -11391
7245 -11391 -10963 -9479 -7099 -6462 1375 5220 6007 4340 3594 2662 -4528 -7133 -6448 -8336 -5177 4887
7229 4887 9016 3203 -3146 -4682 -6594 -7862 618 -2657 -6407 -1266 4300 6819 -774 -6558 -12281
7214 -12281 -11519 -9313 -7551 -5982 -9938 -7850 -3094 7843 17281 23883 12839 5337 249 6381
7200 6381 6981 2364 2385 6449 -2318 -4396 1857 4838 5107 4937 -2064 -5122 223 -242 2142 -911
7184 -911 -2447 -7174 -11183 -14520 -15425 -13086 -14845 -15538 -13108 -2903 -2096 -3671 -1816 -9486 -9451 -2039
7168 -2039 2031 2731 3634 617 135 -3106 -5796 -3710 -5883 -2089 -79 992 186 1426 -4495 -5892
7152 -5892 -731 881 -38 -3218 -1846 -2624 -6007 -6863 -5824 -6538 -5096 -6243 -9093 -642 9886 7034
7136 7034 -3389 -3671 -6924 -9506 -10048 -12050 -5583 -2317 -4505 -7758 -7011 -351 5108 5773 2686 -3457
7120 -3457 -8232 -9267 -7115 -3662 -3588 -6464 1226 5584 4899 4041 6045 -2358 -5601 -3132 1849 -874
7104 -874 395 -317 -5066 -12894 -18130 -8076 -6805 -4892 533 4092 -1095 -4554 -6968 -6362 -6275 -571
7088 -571 1605 -1624 3083 4015 1950 -5171 -12317 -7795 551 1538 -1817 2074 8927 537 87 6929
7072 6929 6279 4416 -6494 -12497 -10034 -7431 -77 7098 5752 -209 -6085 -8672 -9350 -7914 -8043
7057 -8043 -7537 -2639 730 1540 4328 16 2249 4071 8113 6996 5 -991 -22 -3857 -11614 -12959
7041 -12959 -9891 -5217 -6289 -12780 -10168 -9322 -7844 -10223 -18423 -21098 -23777 -19654 -19299 -21630 -13825
7026 -13825 -10069 -10789 -9647 -4109 312 -4430 -9043 -6800 12 6196 302 1256 5466 5180 -1261
7011 -1261 -198 10041 5455 -5248 -7827 -7911 -7991 238 7174 6750 5056 3444 3489 7143 11063 11412
6995 11412 11695 8435 9334 9105 11393 5094 -4630 -12832 -6881 2756 -1780 -5567 -7533 -2810 -729
6980 -729 5691 4064 4533 4077 -7238 -7872 -6156 -3717 573 3579 3241 -1720 -5902 -7470 -4334 -6942
6964 -6942 -7682 -1646 -6150 -11514 -6122 3516 2496 -4817 -6147 -8529 -5055 -4878 -4302 680 860 -204
6948 -204 2477 5612 -2557 -5009 -1190 4810 4866 14376 9996 5651 3670 4899 753 -2584 -3456 -7117
6932 -7117 -6998 -4034 -3044 -3445 260 -3798 829 -840 -1344 -2290 1559 -3337 -7516 724 5346 3881
6916 3881 2481 4114 5980 9168 6239 -2641 -9271 -5583 -5509 -5551 -6359 -100 -536 -1683 -1864 -7642 -9137
6899 -9137 -6590 -4766 -5860 -5509 -4647 -5145 -6623 -1998 -7705 -8580 -5207 -2706 -1587 6442 11285 5855
6883 5855 2451 5177 2229 -2251 -6471 -3225 -2490 -3707 -5230 -3661 -5195 -756 4009 -1889 -2959
6868 -2959 -126 2478 -96 248 -2364 -1307 -4840 -8693 -2957 -1805 2114 -1514 -1290 7153 9719
6853 9719 6260 3036 1404 -8658 -10113 -2900 9881 16691 20868 21398 20598 21183 12216 3471 -1259
6838 -1259 190 2037 -1037 -8148 -5795 -6483 -11511 -10974 -6076 -5714 -2052 566 7061 2917 -1953 6711
6822 6711 4958 -605 -6224 -701 8456 9380 -1000 -6400 -11854 -10968 -12296 -8367 -5912 -1723 -427
6807 -427 -1109 3166 5044 -1158 -13066 -13215 -6459 380 8156 5680 -2246 -5982 -9796 -1651 2993
6792 2993 5400 5609 2380 -2057 -313 3302 432 4123 4970 535 -1031 3065 7460 11711 6299
6777 6299 -7111 -11363 -8625 -3822 1839 3774 4071 -434 -10653 -8184 -1551 6213 3522 903 -3004
6762 -3004 1113 4372 762 2013 249 -8794 -14867 -11415 -3553 1489 2247 -1938 350 3722 9456
6747 9456 11428 10732 4790 981 6128 6186 2646 6300 9744 3351 -4081 -7811 -6474 -2132 -5703 -7593
6731 -7593 -9157 -6881 -4284 -5479 -11002 -11076 -4423 -3299 -13159 -20640 -17900 -6810 -3388 -3430 -3998 -1287
6715 -1287 2657 7187 14343 20083 32144 47128 46764 40535 30147 18484 16698 8290 3949 3069
6701 3069 4399 9170 9442 8281 6390 5760 5372 7407 9409 10310 19049 30864 47411 74619 97312
6686 97312 94862 90100 83780 62560 37011 21336 16439 12254 11402 10709 11367 9063 8260 6716 9790
6671 9790 7049 4300 3425 5865 5578 2548 1989 6537 10726 9594 5304 4400 609 461 715 2069
6655 2069 13486 7773 10166 11614 3452 1948 -6080 -7260 1029 1841 2482 5006 10182 4344 -4337
6640 -4337 -2422 -7975 -6382 -9733 -10981 -13187 -13492 -11262 -10300 -8061 -4086 -4231 4429 3876 -504 -1445
6624 -1445 -684 3633 5619 694 -3050 -649 1799 3034 2726 5954 1085 -5968 -8614 -7957 -9642 -12605
6608 -12605 -6105 1791 7096 8778 8780 3430 -1227 1746 -3231 -2535 331 1796 5011 3573 608 968
6592 968 -2121 -6596 -11665 -9704 -454 -1818 1286 4082 1658 32 3193 -285 -4186 -7832 -10214
6577 -10214 -7041 -3268 -695 -1633 -1907 -4153 -10657 -9271 -5607 -6221 -4624 -4944 -6528 -11025 -10320 -6123
6561 -6123 -7557 -6044 -8804 -5316 -6956 2536 -1196 -3460 -1134 2950 -5155 -8509 -10906 -7423 -4242
6546 -4242 -12498 -20377 -21103 -19368 -17676 -11591 -11233 -11509 -14725 -12731 -4300 -1825 2572 6819 9922 13874
6530 13874 7251 2775 -5756 -15642 -16833 -15586 -8590 -3396 -2891 -1674 2632 2375 3566 771 2557
6515 2557 -4460 -5159 -2406 -1117 2540 -3051 35 3752 6351 1423 -2360 1137 7901 10613 374
6500 374 -6880 -1238 3575 3384 6024 7177 6319 1112 -3968 -3793 -7130 -1273 -2752 -6904 -5929 -6865
6484 -6865 -8722 -4365 -6605 -18578 -18419 -13094 -14889 -10920 -1036 -712 -4208 -8857 -6063 2604 6303
6469 6303 4394 4565 5606 938 -6431 -11525 -8590 -8899 -5326 -2137 2337 3054 7502 2511 -6832 -13040
6453 -13040 -6410 -6705 -3297 318 7459 8899 8568 -662 -4788 -2677 214 1325 2002 -1003 -3809
6438 -3809 -4885 -9372 -12875 -8882 -92 4576 3381 4535 6546 8485 3254 240 477 6193 2909
6423 2909 -649 -750 3823 1344 -2736 -212 -9362 -12227 -8641 6426 7414 3594 773 -43 4657
6408 4657 1856 3873 1742 -5045 -7243 -4419 -3647 2191 1118 -662 4067 6241 -913 -3983 -2006
6393 -2006 -2 -2420 -1112 -3814 -1714 -2929 -1285 4147 6250 1293 -5327 -7489 -9011 -6942 -3537
6378 -3537 -1585 -5568 -7111 -4835 415 444 3584 3682 8099 8326 7640 10506 1604 1102 836 -1212 -3753
6361 -3753 -8255 -14590 -20797 -20203 -13160 -5087 -4379 -10837 -12489 -5309 -416 -2568 -4616 -4292 -8749 -10904
6345 -10904 -6553 -3906 113 -5399 -5934 2149 5044 1662 -3776 -1919 412 -736 -1735 -7149 -7350
6330 -7350 -5532 -1206 -2702 -9523 -8447 -8761 -4405 492 -2138 -3112 2727 453 -3012 -4292 -4433 1873
6314 1873 5462 1611 -7156 -5109 -6292 -10098 -6982 -8871 -6842 -2211 524 -1803 -4934 -2195 28
6299 28 -1551 -3580 -4595 2915 6995 3317 -214 -5525 -5974 -6105 -4511 -2915 -2554 2160 -1238 -3874
6283 -3874 -6371 -10941 -8903 387 3525 6553 343 -7948 -11237 -8961 -3577 1021 1357 -1857 -2565
6268 -2565 4276 11108 14419 10131 12197 10761 7484 7463 5758 2835 -3390 -2999 -4549 1059 2241 1649
6252 1649 3847 -565 -269 -145 -2267 -218 27 -8756 -7555 -197 -5853 -17060 -19705 -18339 -13827
6237 -13827 -7588 -7612 -10045 -9649 -3749 -505 -135 -2734 -1861 -402 6950 6472 4307 4168 5407 4190
6221 4190 5036 2401 3296 2063 -349 -7156 -9019 -2304 2227 -2738 -1219 7149 8265 2594 1796 -3537
6205 -3537 -5551 -4144 -3133 -2235 -931 2005 959 -5239 -8930 -6913 -10145 -7874 -4955 -6803 -10511
6190 -10511 -7468 -5343 -5102 -1066 722 2927 7249 9062 -8 -7574 -7299 -2208 -5371 -6493 -1545
6175 -1545 -222 -3734 -6080 -3720 886 4699 4392 -2032 -4417 2031 -2627 -9027 -6216 -9656 -10557
6160 -10557 -1229 4998 -6599 -6433 6249 3300 1052 -3948 -7373 -6220 -3399 2074 4794 1826
6146 1826 319 -1473 4860 2166 -608 1767 3001 2503 -892 -6228 -11940 -12691 -11280 -7138 -4208
6131 -4208 -5782 -3358 696 -1526 -676 5056 1379 -7022 -8215 -5775 -844 -3375 -10145 -10354 -6213
6116 -6213 -1428 4496 6409 6774 11532 6825 6260 960 -2815 143 6375 491 -3287 1929 4311
6101 4311 9262 15637 8381 1241 -2318 1629 3649 -114 -959 770 -4195 -7204 137 1845 5936
6086 5936 5761 2581 -864 1445 4176 14 1678 -1812 -2618 1233 3277 -1257 -2562 -8409 -6693
6071 -6693 -5600 -10507 -11710 -6053 4258 8062 4853 672 -556 -2264 1257 -319 -5108 -4228 -2521
6056 -2521 417 370 -4350 -1673 1384 -1312 -302 6514 7719 -741 -6339 -9941 -14448 -13205 -7469
6041 -7469 -4674 -4394 -7858 -13249 -15289 -11667 -5544 -7606 -3023 2586 5025 6866 6881 7047 10045 10382
6025 10382 2368 3401 4227 -1101 -2560 -672 3227 -3077 -11143 -8428 -482 6866 11390 10035 4293
6010 4293 -2323 -5969 -10817 -9301 -5688 -1845 2978 6194 1898 2775 8507 4052 4254 12396 9143
5995 9143 4510 4314 6075 4535 244 -610 -334 5502 8886 9209 4085 -6741 -18040 -19589 -10835
5980 -10835 -3607 -4188 -6059 -1925 2194 -175 1380 4384 6203 8666 8819 5855 2457 -4262 -7267
5965 -7267 -1263 996 -503 9473 14417 6494 4876 9398 1834 -1338 -241 -4135 -2240 894 -1375
5950 -1375 3748 6748 7106 8192 7334 596 1521 2118 -2605 5663 6639 237 -8322 -7160 2558 5259
5934 5259 -2371 -9411 -6433 -5587 -2980 -1372 4021 68 -2065 -8022 -4941 -6675 -4783 -7360 -8276
5919 -8276 569 6869 7300 4353 3583 392 -3150 2647 1728 -1429 -2170 -7269 -8550 -7729 -10780 -5095
5903 -5095 -2728 -2474 921 -5810 -1949 2427 4071 5583 4903 3212 6485 2665 2186 -811 1406 -2172
5887 -2172 -5920 -7324 -3408 -5429 -7750 -4507 -2747 -5138 -6519 -4943 -4262 -2312 774 -6815 -9559
5872 -9559 -10566 -10921 -11005 -9364 -9565 -1020 1284 6284 8950 12198 13562 7131 -3220 -3897 -6794 -4321
5856 -4321 -4429 -3981 1407 -2772 -5661 -1464 -4302 -9956 -13187 -7831 -4240 2485 393 -4089 -9169
5841 -9169 -8380 -8612 -770 3121 5554 4137 1514 1004 481 -4626 -1154 2681 1191 3233 10101 10935
5825 10935 3183 -1744 -4263 -1039 227 6954 8215 5145 7567 1119 -10810 -11083 -2234 -2043 -8893
5810 -8893 -8053 -1279 5005 -27 -9916 -11944 -11062 -8729 -7122 -5106 -8398 -17489 -16287 -16437 -10245 -9234
5794 -9234 -1433 -839 -6 -5408 -5831 -1284 -5495 -7429 -2614 4026 2079 3870 6757 11854 11961 9677
5778 9677 7309 6663 5563 1964 -2066 894 2710 -639 -2934 -1693 -3752 -12011 -9996 -9442 -4785
5763 -4785 -4109 -753 2764 1871 3791 6566 2171 -1656 -10928 -10636 -9574 -7650 -4777 -240 4842 6472
5747 6472 181 -492 1309 4230 6066 10749 10861 12344 11677 11027 383 5425 7241 1082 -5454 -6228
5731 -6228 -994 -2773 -6700 -5015 -957 3471 5311 648 4237 4938 -6756 -1602 7308 12022 9265
5716 9265 3103 1279 -362 5177 11492 7531 7031 5547 8155 4922 3371 -1852 -4849 -4327 -2246
5701 -2246 -1711 -4313 -6792 -3438 -5085 -1355 69 1266 3027 3366 -1381 -5670 -7569 -6246 -7604
5686 -7604 -5106 -6549 -13063 -14506 -8940 -2548 3725 -345 -1198 -3610 -4389 -7438 -9975 -3081 1133
5671 1133 -1471 -1236 -6908 -7409 -6641 -3215 2594 -2754 -2911 -6451 -7734 -1759 1322 -5632 -6781 3632
5655 3632 8471 8605 -1314 -2269 -2742 -6551 -5253 -3774 -860 11641 12248 1528 -7325 -10527 -8325
5640 -8325 -12969 -6543 -6709 -10774 -7813 -2125 -2948 2010 2636 720 3901 7554 9101 132 -11196
5625 -11196 -5314 -6861 -11381 -6740 -2343 -5284 -6167 -7386 -2726 4840 1082 -2272 -2338 -1719 -626 7268
5609 7268 10671 6105 9559 6987 10007 7239 -3633 -5256 -6972 -10922 -18437 -18528 -9747 -7289 -12947
5594 -12947 -7451 -10779 -10267 -8525 -829 8478 11745 1179 -3458 -1331 87 -3187 -2517 -1901 971
5579 971 11598 11486 5283 4450 8775 12523 10463 7266 5456 6220 4688 -3216 -642 -8174 -14662 -9752
5563 -9752 -5633 -9726 -10959 -372 -3452 -5710 -8295 -10132 -6672 3980 10907 3347 -8623 -5403
5549 -5403 79 610 -1672 -5897 -6179 -3620 -8403 -10924 -13042 -11550 -1202 9513 11549 10347 4897
5534 4897 3714 2022 -4054 -1311 -5347 -8028 -7560 -9978 -11692 -9036 -8188 -73 -463 -3652 -5182 -3779
5518 -3779 -5360 -7282 -5246 -11299 -12548 -6953 -2795 3260 -4181 -9231 -6509 -4456 -6825 -15060 -12058
5503 -12058 -4129 -8225 -14353 -14553 -11184 -6766 -11024 -10955 -4387 -4983 -9618 -8389 -8365 -16003 -15126 -10645
5487 -10645 -3363 -10322 -9743 -7786 -8069 -8631 -8978 -1455 917 -128 1839 4657 2427 2095 7008 11699
5471 11699 17009 14283 7677 4495 1838 640 592 2278 5129 4438 -3817 -8474 -4194 -1109 9
5456 9 709 -7805 -13291 -11902 -9792 -14093 -9846 -7620 -4030 -2974 -8673 -12535 -18765 -20321 -18575 -11188
5440 -11188 -1838 -6758 -10848 -10339 -8665 -9905 -6511 -3843 -2260 288 4697 8664 9259 8140 10188
5425 10188 9109 7991 848 -2437 -1701 -6445 -6394 -12120 -15567 -10855 -5864 -10518 -5757 -8269 -11103
5410 -11103 -11706 -9480 -7487 -6401 515 4074 5196 1979 789 3506 35 -7365 -13486 -15316 -10494
5395 -10494 -6597 -6114 -2656 -244 -1201 -12211 -13800 -1681 -5398 -9626 -8659 -1545 -746 -5908 -7358
5380 -7358 -5947 -4467 -3722 -10426 -15201 -16542 -6863 249 644 2425 -3071 -4240 -1588 -5033 2848
5365 2848 10549 6576 -2521 -6776 -5261 -5993 -615 -2253 -8318 -11239 -19585 -17959 -8413 -872 -3105
5350 -3105 -9413 -14521 -13811 -5391 -1133 -2215 -6051 -4552 1834 4681 5145 12362 13955 16918 7946
5335 7946 -1726 -302 8339 8979 9707 5488 -7006 -6680 -7932 -5533 339 1137 162 94 4387 6637
5319 6637 -3655 -7599 -7119 -6016 27 -318 13 -1353 -3307 -1878 -138 3109 -1906 -5352 -5195 -4317
5303 -4317 -1320 -626 1846 -3824 -8765 -4276 -3679 -8323 -7845 -3690 40 -8596 -11155 -10598 -3850 -590
5287 -590 5472 11941 12023 12430 9067 11287 4989 -772 -1558 -4082 -9609 -9602 -5876 -2153 -1227 -78 -3925
5270 -3925 -13430 -13889 -13177 -3210 -2084 -1945 -7891 -12236 -5172 -3440 684 -2521 -10722 -13124 -4828 126
5254 126 -293 2435 6396 8470 3604 2462 4501 -923 -9240 -10944 -15119 -21744 -14064 -9910 -9457 -9528
5238 -9528 -3821 -3088 -558 -5096 -12611 -9733 -2447 -4360 -4088 -6125 -5193 -5747 -11217 -18273 -12318 -583
5222 -583 593 -707 -4703 -6207 -2345 -2597 -5340 -6040 -571 143 -47 -7772 -7132 -3471 442 -324 -4638
5205 -4638 4109 10406 9912 5336 7491 4650 -1797 -3925 -3198 -5546 -5765 -3544 -2694 -4518 511 729
5189 729 2342 -1531 8166 11328 6597 5785 3687 752 3538 1423 -3958 -5167 -600 104 -2474 -1507
5173 -1507 -2697 2346 3227 -969 -4994 -4738 -2246 504 -4582 -8028 -10780 -10716 -3508 -601 -6032 -11638
5157 -11638 -8354 348 40 -2420 -4396 -457 1605 202 -3174 -6278 -3292 673 4498 5389 6226
5142 6226 6683 7954 2558 5294 5201 1396 2047 1922 1899 3703 3974 -2865 -2156 855 -5688 -11756 -14727
5125 -14727 -7643 -2922 2539 259 4946 3837 5067 7141 -2089 -12580 -19507 -17418 -13912 -13829 -12414
5110 -12414 -11284 -4109 2107 -2281 -5178 -6153 -10032 -12388 -13146 -10871 -5331 -2610 237 -2728 -3108
5095 -3108 -1973 -2334 1715 9141 11061 11374 6459 3793 1210 4062 -475 -2494 -7616 -9467 -4049
5080 -4049 -251 2052 444 -3355 -1247 2643 3885 4558 1592 -1049 -2321 1062 3074 4418 4305
5065 4305 -3913 606 -1643 -3263 -4954 -9886 -11671 -8189 -1841 911 5852 5995 -750 -2752 -854
5050 -854 871 -5667 -1768 -1956 -4445 2484 3961 -5599 -7744 -7565 -11706 -19275 -18860 -10677 -9008 -12794
5034 -12794 -7574 1824 2694 3278 6903 1833 -3064 -2911 3328 5526 5480 4640 10656 10664 10680 9724 9598 6801
5016 6801 5017 7032 11439 12167 4953 3621 4297 637 -2684 -5145 -9871 -9702 -13883 -17402 -6230
5001 -6230 -665 -306 1605 3414 2535 -2577 -3399 -8652 -14827 -16081 -10306 395 6675 6019 3131 24
4985 24 4815 2255 -5222 -6289 -2336 4057 7274 10733 8902 150 4541 9349 6694 4056 6744
4970 6744 6018 9647 16541 20133 10896 -8513 -15124 -17210 -15994 -13053 -7876 -5448 -6663 -3551 -1119
4955 -1119 -1823 -1386 -9443 -11579 -7931 -5309 -3229 2713 1558 2723 3041 -1347 -4330 -3803 -1401 3554
4939 3554 4287 3011 6410 11084 6384 -3408 -8898 -12650 -8934 -441 1327 565 -4839 -4074 -2032 3106
4923 3106 4291 -3522 -11146 -10648 -11461 -15005 -13649 -9014 -1730 5244 -2553 -11119 -2322 -7310 -12632
4908 -12632 -10759 -5868 -5354 -7508 -2473 -1915 -3379 -6211 -5983 -2115 -840 -9125 -6217 -2186 118
4893 118 2421 4397 4889 3998 4704 2401 -607 -5943 -7741 -10439 -11890 -9293 -3486 3465 5990 3244
4877 3244 2027 -3306 -6818 -7200 -8116 -10696 -5230 -3367 -6691 -10468 2123 11976 8805 10663 11337
4862 11337 6460 93 -3669 -6872 -5559 6497 3995 910 6861 6496 3817 2171 -2214 3082 -1405
4847 -1405 -5305 -4162 -5121 -6186 -6253 -3664 -2187 -7540 -6773 -2968 3971 5694 9123 5270 854 1855
4831 1855 -2752 202 2764 5151 3414 3156 5272 5730 3385 3164 9636 16215 20083 17833 13232 8057
4815 8057 3410 3888 5814 9075 7237 -6929 -2363 866 -4839 -5100 -5980 -9670 -15327 -20603 -20898 -16700
4799 -16700 -15370 -14206 -9996 -8581 -4996 -7995 -8711 -8199 -3021 5461 6489 -4105 -10686 -13428 -11719
4784 -11719 -1750 8064 10957 2111 -3985 -4459 2098 5020 6399 4336 2213 5646 5548 -2433 1148
4769 1148 7302 8110 7853 5036 8061 10209 2868 -1449 -11957 -17714 -10984 -6242 -108 -901 1458
4754 1458 2960 -296 413 137 -1020 363 -797 -1549 -2037 3948 10206 14835 18993 22070 18638 8140
4738 8140 -714 -5562 -8982 3085 381 -6614 -2898 495 -5986 -10626 -8112 -10739 -15250 -10577 -7251
4723 -7251 -6925 -6481 -5551 -5797 -6352 -204 3864 6243 11 696 3868 2109 -1260 -12260 -11147 -6770
4707 -6770 -2169 299 -3763 -5496 -2291 -3439 3002 7957 6650 6627 5572 7858 5874 191 -3101
4692 -3101 -49 6515 2993 2857 12202 20984 20929 12539 10614 10384 10255 7180 808 -5321 -1411 828
4676 828 -639 -1222 -6585 -11359 -12878 -7886 1439 -1005 -2989 -1176 -4971 -7464 -1719 2810 1054
4661 1054 -3300 -6304 -7280 -3414 -7503 -8040 4426 10328 5446 -1503 -5672 -6661 -6493 -4191 -899 -1996
4645 -1996 -10543 -8534 -4682 -7050 -7211 -7450 -4643 6471 5967 1158 -3510 -6522 -8918 -12369 -4623
4630 -4623 -5109 -9584 -8771 -8724 -10517 -994 4973 3291 3447 4327 -1578 -9395 1000 8553 6647 2268
4614 2268 -95 252 5963 603 -938 2951 9437 6600 12711 20075 15532 3526 -1244 -4703 -7480
4599 -7480 -6840 -1040 -2221 -10034 -11778 -12774 -18420 -15495 -5288 2378 5429 7247 11228 7060 320
4584 320 4524 13851 11448 6248 -2131 -2777 -2181 6355 2091 -2566 1587 1290 1041 458 -1449 2392
4568 2392 9756 5278 86 -883 8440 6209 -745 -2505 -1491 2335 2374 4827 4756 -5901 -13091 -9812
4552 -9812 -966 -9997 -9996 -6142 -5042 -2974 2157 3996 -469 -998 3820 4847 2632 3083 -4838 -13536
4536 -13536 -7555 -2995 303 128 -2882 -7069 -8979 -3509 -1921 -8377 -11121 -4830 -3995 839 11269
4521 11269 11702 6736 4951 3900 771 1887 3748 1367 1640 -2621 -2867 -10622 -9719 -9613 -8276 -7583
4505 -7583 -1827 258 5656 14330 18362 13285 10601 6273 1024 1577 1266 623 144 -5607 -4557 -8088
4489 -8088 -10732 -11731 2790 8391 4258 3633 10741 9547 4732 4589 3710 -3023 -2167 2619 7693 8566
4473 8566 6899 -3007 7790 6890 3949 2567 1898 -279 1230 2430 -1027 -5105 -3902 -7260 -8153
4458 -8153 -4158 -7091 -8877 -6387 -710 2177 2852 7022 11277 6873 258 -1385 -1576 -6030 -8301
4443 -8301 -10298 -2591 -2804 -5748 -206 4931 7371 7702 7689 11576 4486 638 -659 -1623 -2671 -2928
4427 -2928 1722 5957 3848 1488 282 -896 436 119 -6641 -10610 -6342 -7299 -3860 -2584 -96
4412 -96 1899 -59 -3739 4793 3328 3729 153 -3236 -546 503 -446 1436 3943 1741 1171 -1543
4396 -1543 -7492 -6543 -4574 -457 3531 -4015 -3578 3734 2714 8807 7455 249 -5935 -8254 -11470
4381 -11470 -11325 -1754 809 132 2075 -5322 -8769 -5894 -849 -469 -2883 -297 -8826 -22184 -19929
4366 -19929 -19568 -21087 -18982 -12048 -870 5036 5796 4517 3772 2445 3790 1031 4055 4346 -328
4351 -328 -8128 -4610 -4269 -5251 -3561 -7122 -10914 -6279 766 -169 558 -3310 -9396 -12576 -12602 -6230 -7262
4334 -7262 -7814 -12604 -18039 -18056 -11086 -4129 -2840 -2496 -1759 -3276 -1021 -1529 -5982 -8480 -9246 -4707 -316
4317 -316 -3222 -7746 -5135 537 -2288 -5255 -6017 -3240 -3883 -7609 -8321 -8950 -9765 -6862 2914 4937
4301 4937 -379 -476 -1341 4331 -1261 2257 1977 -3891 -2151 2279 6593 9441 10404 3310 -6288 -12878
4285 -12878 -12433 -9111 -7757 -6243 -8779 -728 5485 3421 -4078 -9492 -3732 -4756 -5646 -5583 -5176 -2536
4269 -2536 -2879 -3723 -2734 -7088 -6122 -6108 -109 -1999 -3445 -1052 2989 5283 6944 12047 13514 13077 13816
4252 13816 13689 10172 -1042 -4987 -850 4441 1740 -5850 -50 9772 7863 5110 -3765 -6607 -544
4237 -544 3661 5948 10433 14820 11944 9885 3424 7167 9834 1315 -4185 831 6593 5126 -2823
4222 -2823 -7524 -4276 -676 -872 1308 2330 7028 8863 6821 -2239 -2780 2266 5877 984 -4442
4207 -4442 -1043 2720 -1629 -1648 3201 4440 -1328 -768 3732 8300 4502 -2996 -6580 -5553 1187 6548
4191 6548 5822 2754 -138 -3286 -4534 -2395 4174 3091 -4520 -8033 -5743 -8410 -13801 -14211 -9686
4176 -9686 -10626 -7880 -7594 -4003 2182 4505 1762 -582 -1354 662 2835 -1818 -2379 776 5120 4505
4160 4505 4379 10045 14024 10701 7597 1916 4440 2893 -5368 -11152 -7178 -7893 -14610 -14747 -18050 -21193
4144 -21193 -12666 -7588 -7821 -6096 -9845 -13263 -10734 -1062 -1205 -9380 -14872 -15967 -7007 -5830 -3268
4129 -3268 6559 4460 1719 2538 6889 6775 -155 -1764 -3462 -5062 -9446 -10244 -8777 -12510 -12057 -15606
4113 -15606 -8602 -4595 -3910 -3731 -5910 -2060 -423 -3330 -10448 -11693 -1593 2792 2975 3278 4918
4098 4918 5499 646 -1980 4896 8697 6674 7117 -4518 -8732 -7966 -1 4490 -1168 -3080 -7252
4083 -7252 -11042 -7827 -9303 -6150 -6031 -6008 -4721 -4678 -2173 -2876 -8164 -14329 -18589 -14654 -2753 -940
4067 -940 643 1974 2326 2459 -2907 -7995 -4263 -802 1954 3670 -27 -3811 -11045 -14731 -13336 -10180
4051 -10180 -3597 7033 13697 14767 14522 7380 5886 8149 4949 7611 8742 3354 -2715 -1350 1187
4036 1187 -3272 1170 -1419 -3956 -1959 5044 4120 -4774 -6171 -447 -672 -1908 -236 3039 1572
4021 1572 2862 -1049 -4235 1909 3410 2996 -7507 -7428 -1377 -3838 -4068 -7090 -3723 2686 -2831 3942
4005 3942 4054 -554 -2144 -2234 954 1804 1985 -470 -6521 -8823 -12419 -8474 -4320 -5494 -2733 3621
3989 3621 984 -5737 -2527 2985 5069 2278 5400 8889 6637 8543 13535 11760 6253 1827 1307
3974 1307 5577 9885 10928 4842 -4001 -4608 -11299 -13249 651 2360 -5918 -10868 -2851 6069 -480
3959 -480 -4020 -6143 -9362 -15375 -15115 -4055 817 397 2825 8050 6119 3397 -1509 -8865 -5171
3944 -5171 2730 5387 6273 10720 13691 13582 7683 2013 -518 3342 3736 2739 5313 12381 8780 4085
3928 4085 -2321 -5572 -8591 -7323 -8811 -11193 -9985 -7721 -2807 -3863 -1998 -301 -3228 -3467 3815
3913 3815 6458 3696 -1343 -5429 -759 -5973 -6040 -3580 -4775 -8250 -7390 -9305 -10267 -4883 1869 -682
3897 -682 -529 7857 8997 7118 5954 6702 6888 453 -5241 461 1787 2515 3137 2515 8344 9547 2054
3880 2054 -474 436 -2672 -5865 376 1588 -1007 1594 6487 8822 8917 1060 -4970 -2266 4313 4455
3864 4455 -2653 -5004 -2872 3004 -2636 -6954 -4806 -621 543 304 -2119 -817 -4635 -6851 -5955
3849 -5955 -11328 -13505 -9087 -8523 -11140 -12021 -8252 -11194 -10697 -11553 -14312 -11481 -5286 -6266 -6404 -3227
3833 -3227 879 1042 1349 -202 -2267 -6380 -8447 -12700 -11368 -10443 -5413 -5108 -5109 -4346 -3160 -1100 -8889
3816 -8889 -13017 -3619 -811 -2224 -6894 -6553 -1197 1347 13899 10206 -4555 -6955 -1488 -2513 3089
3801 3089 -4598 -2378 7799 5313 2394 2156 -2294 -9964 -5629 -177 -3205 1859 309 -706 866
3786 866 796 -1178 -55 -469 -5141 -3478 3018 3697 -1754 -4631 -7283 -6692 -2803 -5330 -6702 -3124
3770 -3124 460 8276 6203 10241 6409 4040 3032 -344 -3988 -642 9964 4673 4339 6337 385
3755 385 -1587 -1001 -1854 -3249 907 5155 10854 7170 -1583 -822 -1944 -846 1773 3254 4280 7031
3739 7031 7342 -2084 -5071 -1105 -2274 -5322 -5486 -1736 2357 6641 6163 1277 567 -766 -4997 -6794
3723 -6794 -2867 403 1606 -1257 -2387 -261 383 1069 5241 7521 4857 5918 11397 11401 8061 3604
3707 3604 3382 5663 7000 5413 6212 40 -468 -943 -3288 -4300 11 5895 8157 6039 1721 -2050
3691 -2050 -4643 -8467 -3538 6458 7383 -918 -7857 -14671 -5916 -549 -6322 -3932 -9652 -14516 -10463
3676 -10463 -2994 3325 -4355 -5535 -7455 -2415 -1644 -4124 -9192 -12377 -3326 -3891 -11559 -6893 2082
3661 2082 926 -5540 -5588 -10411 -12281 -12302 -9367 698 4780 421 -7676 -10366 -10698 -4510 -2313 -6156
3645 -6156 -8310 -6461 -2588 -6613 -13038 -13505 -9004 -5500 -961 1650 1048 -740 -1178 -4851 -5805 -4010
3629 -4010 -1253 1824 2810 -175 -1920 4326 7121 1073 -117 -2837 684 2401 -2684 -4451 -6152
3614 -6152 -9433 -5845 501 16026 13688 7222 5631 4709 9801 13035 17478 20835 16477 10778 11429
3599 11429 8984 10092 11840 5365 131 1202 -386 -2529 -4072 -2447 4084 3018 -6038 -9757 -9419
3584 -9419 -2663 643 824 6479 9499 12181 12469 5723 1504 7849 13397 2649 -1814 161 3498
3569 3498 6382 11261 14578 5341 592 -6727 -5610 -3813 -3242 2530 9977 5482 -6545 652 5954
3554 5954 3112 -1166 947 3978 8818 10013 2236 -1028 -411 736 -917 -6604 -6131 -6984 -13881 -7094
3538 -7094 1988 401 -5304 3495 -173 -2353 -5124 3123 2021 -471 -1052 -3590 732 3278 2714
3523 2714 2681 6867 8411 989 3048 3646 4679 7215 -2872 -10512 -12267 -9079 -12844 -7653 -7686 -9327
3507 -9327 -9314 -8382 -7389 -3664 -2986 1788 139 -10073 -10339 -1109 3138 632 -3151 1879 5737 5871
3491 5871 3482 895 -4186 -7064 -6969 -5679 -2755 -5070 -4060 -4483 1697 12015 12315 9656 7631 -368
3475 -368 -922 6037 10790 10880 7565 -2611 -4870 5915 10124 6107 7097 4876 -517 351 6838 794
3459 794 -1151 -2016 -6864 -4276 333 -2569 -3768 1239 -5679 -5940 617 5429 1567 -7252 -6160 -6567
3443 -6567 -11835 -11214 -4690 -2869 -9896 -7644 -8424 -8120 -7259 -8544 -5581 -4427 -3006 -892 -5880 -4989
3427 -4989 4945 6138 1897 -2467 -8565 -11309 -13792 -8625 4672 4204 839 -3198 -906 -1922 -3062
3412 -3062 2533 3450 -822 4054 153 -3154 -6789 -793 -1638 -272 4321 3113 9168 10735 12132
3397 12132 9100 6612 5249 6493 7184 6547 2893 -5685 -5386 -5396 -2275 -851 -11213 -2908 4484 -421
3381 -421 -1126 1490 2252 926 -3281 -1102 -118 3949 6074 7158 6647 300 -6566 -1818 776 4913
3365 4913 4898 -1107 -2506 91 65 2930 1051 1724 -725 -3407 -7766 -4168 -3600 -4953 754 1675 -1400
3348 -1400 -6081 -6593 -10343 -12849 -7361 -3216 -3599 -3067 -8202 -8609 -9195 -7388 -11085 -4942 -2432 -7119
3332 -7119 -11499 -9133 -4673 969 1109 1350 3722 7896 9295 5189 2167 -5351 -7179 -10678 -11487 -9489
3316 -9489 -1891 3943 10197 7504 2145 3024 1351 -1616 7502 7621 3981 340 -2119 2728 2245 2726
3300 2726 -379 5122 6027 -3074 -8520 -12767 -11038 -9952 1821 11388 6552 556 -3745 -3214 2193
3285 2193 -1895 -4484 -2366 1428 5581 -2007 -7565 -11241 -9611 -4790 -6283 -3832 -7119 -5158 -1673
3270 -1673 3887 4036 4189 6043 3841 854 4747 382 -8329 -8621 1085 2319 5772 7713 7659 5739
3254 5739 8779 6159 4829 5405 323 630 6056 9284 7961 7581 9573 8009 4818 -4340 -13263 -17101
3238 -17101 -15597 -10447 -7196 -7997 -4411 -5210 -3127 -2682 601 4552 -2130 -9167 -9456 -117 4519 3358
3222 3358 -3820 -8289 -7597 -7297 -7241 -13937 -11763 -7328 -4150 -4580 -11686 -10170 -10769 -11936 -12291 -7864 -6797
3205 -6797 -6980 -6923 -6910 -6027 -3632 -3048 -8449 -10062 -7012 -6980 -690 2833 3492 2438 -808 -3129 843
3188 843 6479 7932 5674 6555 4438 1002 -795 -2872 -4191 -560 3368 1174 2528 -5208 -7319
3173 -7319 -11706 -8845 -1523 -4056 -7996 -5009 575 1366 856 -492 -7778 -9965 -8187 -3950 -1258
3158 -1258 -2928 2525 -749 -6886 -11678 -10154 -1736 797 1478 169 -3100 -9841 -7572 -5406 -7021
3143 -7021 -3208 -1998 5612 11108 16754 16762 13662 10913 11799 11026 8354 6477 -1166 -3243 31 -1410
3127 -1410 -3912 -5662 -4584 -2211 577 3344 7287 11644 11851 14712 15038 18789 16243 11640 7876
3112 7876 1801 -405 -4361 -12773 -12236 -7647 -1727 1753 4242 4679 6265 6719 2786 -1401 219 1879
3096 1879 412 2124 2303 2545 6379 9384 9595 8465 7524 5680 1435 3454 5922 1455 -11848 -15085
3080 -15085 -15383 -10003 -9611 -11088 -8764 -3662 -3748 826 7760 14433 15235 11361 5457 4277 5332 7609
3064 7609 1332 -1001 -1200 -914 3667 3725 2141 5360 656 -1718 7234 13667 12956 5367 2860 3083
3048 3083 4085 996 -319 272 671 6168 3062 1350 -5939 -3234 3482 7082 5381 5531 -1904 -4982
3032 -4982 6349 343 -3033 1021 1170 -5868 -5519 -3347 -2073 2715 1536 -2725 -7855 -9781 -3490
3017 -3490 2670 961 -5546 -10558 -8100 -868 -3280 -8881 -12397 -12496 -11847 -2988 7803 6820 7196 6240
3001 6240 4500 9017 6611 6436 4012 -632 -1540 2180 10209 10978 5895 3196 -982 -7286 -7046 -3325
2985 -3325 -4970 -13560 -10536 -9791 -4940 49 3022 5876 11411 11615 7064 472 5018 4475 -923 1212
2969 1212 -2531 -3438 -590 4364 -2195 -5383 -6183 -1820 -915 -6068 -13193 -9872 1340 -610 559
2954 559 1409 1146 2786 5784 7473 6760 4375 7105 5770 1805 2938 439 -2862 3312 7902 6803
2938 6803 3714 -1229 -2203 2441 6219 11172 6937 -3454 -5644 -8918 -4125 252 -5068 -8898 -9963
2923 -9963 -9498 -5 4513 1285 3352 7552 7047 5681 5765 9706 2546 2785 4693 5649 13197 10251
2907 10251 2199 -4503 -686 4578 13879 11996 3825 5421 4196 -1364 1178 10211 12407 6907 1583
2892 1583 709 6279 1584 -1230 7823 10016 2421 -2336 -472 -1317 2869 2104 -7146 -12660 -12718 -11760
2876 -11760 -12906 -5617 -2698 1627 3887 2311 2311 -1143 -4940 -10237 -10805 -6209 -5633 -9381 -6348 -2608
2860 -2608 -4391 -5921 -10853 -7666 1080 3507 10280 9474 3696 92 1104 -380 -2729 -7854 -14983
2845 -14983 -14205 -9262 -1944 -2809 -3065 -5653 -8630 -11018 -9684 -10025 -3066 2088 679 1980 4083 6655
2829 6655 6276 7222 1792 -9387 -8348 -7888 -3270 -2179 -1816 -2295 554 2303 -2919 -2248 3082 3980
2813 3980 -2020 -4382 -2018 -2398 -4171 -5053 -2943 108 -2120 -3023 -3999 -2214 3149 5533 6344 3071
2797 3071 483 5087 6853 5137 -590 -5351 -13901 -12073 -7639 -3527 268 3876 5037 7340 10589
2782 10589 11888 3787 -1464 -5812 -5170 -10510 -11412 -4774 -1779 -4305 -9955 -8239 -9474 -8446 529
2767 529 5087 -132 -7454 -12274 -7230 3199 9122 301 2847 7871 9021 4500 3447 497 2758
2752 2758 4975 4804 2839 -368 1467 7622 8337 5388 4024 2044 8272 3527 -1405 -3059 -4254
2737 -4254 -3715 -4692 -8910 -7789 -8780 -5879 -1835 -6406 -5627 -3562 -4199 -12015 -7519 -158 -3775 -574
2721 -574 1216 92 -4889 -10392 -11797 -8762 -4799 -1323 1402 -3080 -2970 1775 4403 -5525 -8281
2706 -8281 -3810 1259 -31 3498 5571 -6071 -13409 -10537 -5681 -3065 2066 -2361 -9365 -6683 1279
2691 1279 4175 6857 11778 13322 5273 -6789 -7336 -69 6636 3580 3539 8022 12234 12192 6677 1256
2675 1256 -2250 -2121 -1986 -2665 -6992 -13596 -12944 -5303 1265 3591 3719 -1653 -3855 -1418 866 2318
2659 2318 5153 5391 1735 -1774 -3939 754 4365 -726 -6072 -9224 1085 4339 9816 12058 6781
2644 6781 3632 4255 4091 -195 -7962 -6612 -2100 1759 -891 2522 3077 -1636 -2088 873 1157 1589
2628 1589 1863 -6368 -7778 -10332 -15390 -2395 13032 16751 15446 5754 9157 9510 -8394 -15028 -10895
2613 -10895 4085 15126 11410 12206 28833 25979 3245 4677 5715 -11115 -15346 -13626 -4561 7485
2599 7485 9569 6291 1484 -3939 -8605 -6376 -5069 -2107 5973 7823 9088 2345 -2047 -5750 -4352
2584 -4352 5621 8082 4679 1598 -5818 -8570 -5943 433 554 2553 4023 -374 -3086 -3593 -7068
2569 -7068 -6482 -1909 2957 9663 15324 12280 9674 11889 5749 6250 7805 7420 2891 7627 3494 2606
2553 2606 -5371 -4812 -1144 300 -1190 -922 1390 2738 6868 12338 4551 -3590 -5387 -2553 -1875 -4310
2537 -4310 -2766 -4034 -3663 -2280 -4742 4375 5807 1995 -3811 -3820 -2856 -975 -2552 -5275 -6270 -7627
2521 -7627 -8868 -7683 302 7141 7241 11510 6991 -1231 -10648 -13831 -10196 -9624 -7867 -4163 -5275
2506 -5275 -2770 -6690 -14046 -12164 -6623 -9352 -15395 -17104 -11682 -11976 -10331 -7470 -7689 -6781 -2067 -178
2490 -178 -38 -2419 581 5727 5712 6021 784 -162 -2814 1798 5568 3750 -4437 -6350 -1629 8910
2474 8910 10305 12897 10326 8736 2199 -1796 4288 2498 884 6301 5355 2414 3115 -63 1931
2459 1931 5856 6775 7716 10357 15047 12892 6942 3424 7392 11899 7460 911 -2633 -646 -3137
2444 -3137 -1955 2408 -1314 -7669 -9668 -4288 8664 12213 7771 10243 2043 2178 4743 -1942 -8380
2429 -8380 -10362 -4472 -1579 -2860 -3353 -439 5851 5111 6717 5844 10150 2961 2702 1808 -112 -1768
2413 -1768 -4990 -5145 -5795 -3064 -2198 7433 12474 6045 2888 1690 -5196 -7160 -3770 -8541 -8311 -8578
2397 -8578 -2058 1505 3576 4610 9840 10905 10404 13270 13358 5401 1980 3342 7674 7776 8410 14213
2381 14213 10844 12218 16852 16151 15708 13121 13259 15095 4943 3376 334 959 5478 4281 7969
2366 7969 14178 15010 6381 10164 11094 8358 6089 9357 10909 10571 13368 17479 13960 6377 -5683
2351 -5683 -3671 389 1072 1534 3940 5449 4315 -521 -197 136 930 1712 5959 1586 -4385 -11280
2335 -11280 -7377 -5426 -6973 2752 1118 -5362 -5889 906 4438 12360 11031 13304 12951 4553 3999
2320 3999 4629 1270 -1736 422 -1549 -2347 -511 2086 -758 1923 2638 523 4185 6863 3154 -1561
2304 -1561 -1797 5488 10248 14077 8876 -2173 -7737 -14577 -19450 -16136 -13595 -6374 980 5046 619
2289 619 -2318 -4596 -9925 -6953 -670 2388 4248 -3353 -2779 -6528 -734 5963 6229 -1921 -6640 -3870
2273 -3870 2314 1983 -2007 -6858 -7483 -4481 726 1583 9191 12319 8598 10985 15973 12017 7348 75
2257 75 4051 -2374 -9717 -2233 603 -5271 -6551 -1871 63 1988 -2426 -7796 -5409 -348 2116
2242 2116 1824 6177 2322 -1903 -3523 -7199 -10142 -7366 -5439 -8445 -10690 -6280 -1973 -4356 -7012
2227 -7012 -2069 9060 10084 4963 6161 9886 11896 9301 3780 -511 -772 -217 -3363 -2189 -719
2212 -719 -4397 -4297 569 8063 4298 4120 2590 3124 -1798 2354 10652 10382 7339 8730 4789 -6288
2196 -6288 -4812 2103 740 1504 11553 11333 -4762 -9076 7360 11569 807 8505 16531 9674
2182 9674 6888 17881 12106 -3082 1450 7389 2101 -5584 -6158 -4678 -4286 3635 3527 5089 7835
2167 7835 3772 1224 -834 65 1993 5931 7860 6969 1451 956 -2036 -16 1830 593 1276 6121
2151 6121 6652 7453 575 -139 -2860 -3234 -845 1736 308 254 4095 3885 7516 7767 7017 4342 1427
2134 1427 -2348 -627 4860 3599 243 -231 336 854 3664 8712 9964 87 -2314 894 9432 11607
2118 11607 3890 -2586 -728 -5011 -4811 -2777 3018 7103 12384 9121 7342 2503 1121 3782 -2681
2103 -2681 -9061 -7053 -6920 1590 10049 8022 4579 4712 2401 -1447 1301 3086 4384 3180 -2252
2088 -2252 -9792 -14583 -5006 -3451 -11823 -8747 -3922 -659 4486 3320 2908 2654 3741 3345 -1584 -3247
2072 -3247 -1824 -858 5458 10715 8107 8004 8925 13345 8468 2746 826 -776 -5268 -2248 -2491 2890
2056 2890 4474 1321 3192 2451 4882 325 -740 570 1858 -6197 -7656 -6454 -274 2133 -3142
2041 -3142 -4023 -7116 -7962 -4687 -1828 -3552 1637 2230 92 5770 3841 4534 9993 6963 3186 2749
2025 2749 -1400 -5340 448 2066 -4035 -8400 -8632 -2463 -4739 -8960 -13412 -9005 -4287 -10933 -21745
2010 -21745 -17256 -3369 957 -1952 -3564 -3478 828 -138 1471 6466 3678 5295 2932 670 -3761
1995 -3761 -4852 -332 1867 6366 6993 2677 453 -132 1862 6896 9609 9880 11676 10756 6281 6635
1979 6635 6885 10978 11325 7317 3160 10865 8656 3811 -5620 -9347 -2443 3239 6746 2481 -115
1964 -115 -568 -4949 -11990 -11546 -4906 -3853 -6763 -5843 -10577 -13836 -13395 -10934 -5501 4609 4983 7236
1948 7236 8966 7598 1219 -3400 912 -2735 -4582 -4816 -12333 -15296 -9912 -3594 -188 -7199 -13563
1933 -13563 -10555 -5850 -2712 6783 8959 9493 9615 7320 848 -193 -2495 2776 5200 5080 4776 7720
1917 7720 13328 10582 4236 7513 11652 13026 11005 1204 -3823 1066 -103 4061 -622 -3068 -2087
1902 -2087 -3031 -4015 -4452 -3741 -2214 1322 829 49 1711 263 510 4409 13471 6778 -455 2817 -2879
1885 -2879 -9996 -7299 -2866 -7249 -9553 121 4071 -1892 -11944 -14214 -5555 -7736 -6787 5135 8302
1870 8302 7280 3558 2213 2458 507 -3508 -6939 -8551 -3577 -3061 -4219 -2275 819 -1489 962
1855 962 3170 2429 4663 3004 -1990 -505 -3739 -8087 -7699 -8207 -8109 -350 657 -1409 -4660 -6676
1839 -6676 -814 3035 433 3208 785 -1577 -656 -1457 -8136 -13404 -5583 -7374 -6662 -3727 695 5487
1823 5487 10002 13202 12588 13079 20921 17021 21600 22229 21577 18137 7366 -3689 -5031 4590 9409
1808 9409 5875 2034 -266 1453 -2646 -4098 -8374 -5778 555 3948 493 6429 6269 2227 3275
1793 3275 13127 12394 12703 15636 10716 4500 9012 11722 8184 5267 1256 2162 -497 -768 7786 4383
1777 4383 4590 2848 5041 357 2443 5130 6445 10115 7070 3530 1396 1860 5517 3644 7784
1762 7784 11034 4536 256 2234 2355 6272 2379 4728 4668 -3127 -9938 -8888 -6557 1276 -253 -5042
1746 -5042 -4921 -3924 -2663 -4858 -3754 -2094 1072 3932 3279 6026 -129 -2379 1681 12314 23666
1731 23666 20633 14896 10904 4612 2984 -1012 -467 -274 -30 -1256 -5128 -5549 -1498 -1859 -2924 -2328
1715 -2328 -4592 -7624 -6994 -4513 -2357 -1199 1334 4657 5574 4144 6402 7332 4587 5570 -3594 -2752
1699 -2752 3431 1266 3323 852 3286 -3557 -5194 -10385 -11739 -2454 -287 2654 1695 1885 -2781
1684 -2781 -2732 3689 9290 11557 12415 10927 12280 16966 19323 13524 14963 17230 15148 4871 579
1669 579 -2634 -5643 -6830 -6197 1953 7859 6815 13442 15342 7056 -1759 -4568 -2241 2882 1045
1654 1045 4156 -3134 -6766 -1592 -2861 -3666 -223 1695 5278 3416 947 5253 6762 2791 2675
1639 2675 3680 3083 5956 13812 15204 8844 7262 2068 -5950 -1675 -5350 -6040 5725 -921 -7584
1624 -7584 -7541 -3709 -1000 4108 6017 2544 -6540 -5665 -795 -2679 -1047 2369 209 3033 214 -7324
1608 -7324 -3510 -2644 -580 5402 7711 2623 304 5691 14263 10819 5542 -887 -6664 -11152 -12747
1593 -12747 -9965 -3196 -379 2765 2332 3093 2723 2697 485 -1235 -6698 -7563 -2761 450 7015 10255
1577 10255 11306 4222 1067 1777 3474 874 944 2519 6290 5080 3355 3447 4001 3483 4753 6554
1561 6554 273 745 2141 4540 -1146 -3992 -920 2105 4616 6733 8099 11926 12841 6320 -1900
1546 -1900 -5051 -2312 -1612 -2824 -1612 -4229 -6154 -5882 -4669 -2376 -243 5039 1952 3437 488
1531 488 3824 -1363 -2749 -1672 -3935 -4366 -8296 -11796 -6781 -9088 -11960 -8574 99 5133 -596
1516 -596 -531 2183 7906 9860 6674 4709 5201 2966 4321 2665 2550 10281 6564 7479 3192 -5084
1500 -5084 -9709 -6630 -4949 -11423 -9700 -10627 -9332 -4923 3335 4857 1253 -9294 -18056 -17709 -13901
1485 -13901 -18854 -16855 -12941 -8100 -4160 -3915 -8597 -11911 -7735 3862 2326 -3695 -749 29 -1320
1470 -1320 3585 -2095 -8026 -4019 4726 505 -941 3283 3602 4554 4906 3495 2113 -531 -4656 -4259
1454 -4259 274 -1764 -6641 -11738 -10175 1189 4151 2272 2543 -20 -3212 -2731 1567 3212 6681
1439 6681 10813 15596 9567 3694 2712 7612 2309 -4597 -5803 93 7343 7985 8128 8953 9414 12167
1423 12167 9939 8437 6790 4867 4219 2314 -1686 207 3312 -2796 -916 -3029 -6551 -6382 -7173
1408 -7173 -7520 -5502 -3710 -1711 -380 2858 4587 -5084 979 4979 7330 5273 2737 -1622 -2888
1393 -2888 -11288 -12823 -1090 6242 5297 6283 4530 -2187 -1842 35 3390 4067 5667 9752 6731 11293
1377 11293 7041 -454 1487 3983 1170 625 4566 3006 -1903 -3505 -2490 -1370 939 6382 12188
1362 12188 11229 2156 -1028 6413 2687 -2188 -278 7782 12134 11556 7890 617 374 5056 8876
1347 8876 7781 10048 709 -6602 -4526 -10247 -12686 -8216 -1952 678 1436 -623 4213 8129 9700
1332 9700 14614 9664 6767 2744 1013 -1393 -2598 -8328 -12049 -2748 8885 7028 5520 8286 9854
1317 9854 4205 4121 -500 -8924 -8750 -11273 -825 5353 -38 363 5924 12471 10482 -154 -6275
1302 -6275 -9133 -7405 -3831 -3168 3565 1377 -2801 -10346 -12063 -8013 -6430 1394 7324 7113 5675
1287 5675 7845 10291 11653 10104 7183 7419 4938 3414 -1576 -964 262 -5471 -7677 -4901 -2846
1272 -2846 -5352 -6145 -5028 -3056 -1334 -1110 -2527 -7387 -7999 -5804 -1715 -2077 -4130 -7504 -9433 -5337
1256 -5337 -4538 -4087 -5708 -8668 -4447 -2651 4575 10456 6217 -2963 -4456 -4720 1148 3918 4031 9286
1240 9286 17690 19263 9973 -1794 -2812 -1647 3763 5774 10898 12734 13725 9423 6959 3195 1627
1225 1627 2905 5163 10135 14384 13630 11778 -92 -3953 -9150 -7426 -2786 3170 3306 -60 -1458
1210 -1458 3178 3975 6075 3667 6068 1904 3614 6400 -845 -664 -133 2320 2544 -109 -2919 -1702
1194 -1702 -5410 -3416 -4184 -6805 -6411 -9602 -14146 -13107 -5179 5703 8411 -1099 -7013 -1623 -1907
1179 -1907 -8351 -11451 -3104 1388 1606 -2115 -1137 6961 7195 5738 3793 3771 -3878 -11308 -8769 -6452
1163 -6452 -5234 -3879 -8044 -8157 -755 2073 -1487 -7460 -5729 -8792 -8395 -2345 -7010 -4473 1216
1148 1216 1403 4919 -180 -5064 -4769 -7462 -6984 -4629 -8162 3211 15894 20207 12877 647 -3147
1133 -3147 -3738 2037 5165 3813 -4037 -12257 -9175 -10085 -8914 -6254 -1044 -930 -2853 -2535 2916 4674
1117 4674 1409 8628 2375 -7064 -808 4111 5554 4792 494 8028 16457 15530 10187 15769 16119 11838
1101 11838 5453 1697 -2049 4571 9959 6279 -1566 -2403 -351 408 -2941 4943 6613 1262 -1313
1086 -1313 -4541 -7709 -6967 -7792 -958 2656 260 -10348 -12217 -15049 -13222 -6110 -4035 -9994 -9334
1071 -9334 -5829 4324 11433 5463 2953 4690 4338 -1241 -5375 -3633 -3230 9371 11350 4333 -2869
1056 -2869 -2285 -3879 715 2955 1862 -8378 -12538 -3930 1366 1623 7621 14047 11086 10096 5567
1041 5567 3009 12164 11645 7438 105 -5385 -10573 -2666 4856 -1100 5011 10972 6453 5365 6111
1026 6111 3141 3985 4965 -2888 -5722 -4579 -3496 3710 1278 667 -2784 -3275 2320 -1560 -6626 -439
1010 -439 4533 13925 15351 9681 5034 -337 31 432 4194 -1436 -1003 -3892 997 9694 6863 4061
994 4061 4250 61 -684 -3221 -8114 -8183 192 -47 -2574 414 -81 5468 10366 10844 11467 11421 12572 3201
976 3201 -1579 1359 -1898 -279 3961 6780 6511 9048 6534 3407 -2419 -2246 -1343 3180 2497 -3643
960 -3643 -964 2379 1708 637 179 5946 8371 11970 6056 -7862 -8464 -5742 -1505 -4736 -3062 -3251
944 -3251 -1163 -3634 -9761 -11498 -5352 5660 6669 2999 1211 -5814 -12584 -9831 -11857 -13024 -2131
929 -2131 3552 4709 5489 5599 1956 -3119 2292 9810 13675 8037 1817 1883 -5992 -11792 -8619 -3330
913 -3330 -6158 -6001 -6910 -1689 -3829 -5137 -3275 3535 4980 2873 6677 13711 14976 4534 -1879
898 -1879 -6458 -5150 -5939 -6448 -10038 -11139 -10081 -8452 -7435 -7284 -2044 4894 2240 1176 -3142 2145
882 2145 3128 5596 1062 -674 2413 50 -2304 -3750 -2516 4047 4002 5110 3615 6669 6806 10459
866 10459 10610 4168 2008 3679 3241 2765 5777 7132 7822 8003 6779 7199 7841 14008 14998 8897 9682
849 9682 11471 10780 9990 5646 5221 6259 13155 5442 1304 2276 5105 1309 196 4498 9931 13230
833 13230 12246 12616 12189 4997 3045 5792 8360 11230 9610 6919 6613 5147 -459 939 -1033 -1582
817 -1582 -1027 -1212 -1328 -3174 -4104 2949 4780 4354 7141 9883 9639 8738 8226 14036 14805 10303 10724 11516
799 11516 5696 434 663 -3292 2448 4993 1196 4201 8948 -150 -9526 -10918 -5436 -7176 -14574
784 -14574 -13143 -16042 -15214 -3098 5548 965 10 1168 -1622 -3668 -7388 -7295 -8095 -3705 -3357 -4190
768 -4190 -7610 -3332 -2604 -289 -718 4201 5243 6477 3238 -5126 -3964 -3863 -3637 -5694 -10741 -10819 -9999
751 -9999 -3795 -1992 -8216 -4253 -2108 -6403 -8475 -7452 -7268 -2582 3546 7225 3971 3526 1321 7306
735 7306 11934 4950 -5149 -2054 6357 1817 -442 -4478 -3246 2441 11111 5824 7359 8477 8120
720 8120 7340 1756 -1639 425 -1335 -5923 -10177 -3661 5814 12297 12520 9724 10475 9711 8993 11577
704 11577 16774 23809 16860 -27 -7764 -7686 -8497 -6947 -2004 2028 -883 -1547 3836 8354 8303 -2498
688 -2498 -1914 3042 -327 -2324 238 2711 6726 4668 820 5106 8061 13870 11292 6093 251
673 251 -3421 -257 -8467 -12069 -9214 224 3646 5779 4253 1116 -3036 3121 3567 -8948 -16250
658 -16250 -13624 -11413 -10234 -5193 -2028 -7078 -2186 3601 8633 8140 3764 -1741 -5879 4057 14327
643 14327 14955 16473 13590 2264 6892 5794 8260 6506 5362 -324 -2823 1876 3421 -659 115
628 115 5849 19326 17474 9208 1922 1835 5377 5557 3723 1738 1053 2989 6856 10677 3163 1395
612 1395 -3503 -5655 -6473 -3490 974 6494 1291 -4229 -3243 -1058 1853 -1893 -9572 -7524 6452
597 6452 10580 6397 -1227 845 -764 -2317 -6319 -8779 -9430 -2876 3355 3980 6936 5074 6015 2881
581 2881 1396 -521 -48 -1361 4197 3168 1807 1481 4066 7847 5616 5211 3268 1661 1712 1174 3618
564 3618 -946 -5406 -10986 -11184 -5739 -690 1007 -8544 -4842 6981 8024 -2316 -3401 3460 4689
549 4689 3871 4427 8673 7879 2697 16 2935 1469 -4109 -3160 -3430 -4805 2427 7260 7815 3347 -4923
532 -4923 -4089 -2176 -419 -2577 -7886 -13074 -9097 -11503 -10626 -3383 2744 4736 5309 2259 -6049 -12490
516 -12490 -4968 -5517 -8345 -2549 2734 7300 4717 4667 1206 -749 -3203 -6536 -10531 -7453 -3965 2247
500 2247 2837 2472 -1874 -7140 -991 5599 -4436 -7029 -3466 -3761 -445 5478 7441 4804 -3877 -9478
484 -9478 -7150 -2721 -4024 -4036 -4160 -8764 -7915 703 4148 308 -4263 -9313 -7061 -3910 -3789 -9511
468 -9511 -8637 -3795 2737 11065 8165 5435 6263 9755 9671 10787 3668 6828 16925 19453 16067 9459
452 9459 10711 9734 7099 8123 7514 3374 3669 -482 770 482 1898 611 -8334 -8149 -1877 4130
436 4130 2589 2001 5084 10753 13473 9298 4979 3381 -31 1114 5362 9722 7845 8660 11359 15894
420 15894 16871 13013 2856 390 3634 2016 37 -561 -426 2760 -7151 -9274 4362 16051 13401
405 13401 2651 -1755 2533 -2408 1571 7295 10463 9580 8376 9747 8296 5387 2406 2412 -1706 -3275
389 -3275 -359 4513 6438 10358 6723 3691 -878 -3862 -8336 -5837 -1192 3658 3993 5568 5166 967
373 967 -3683 -9102 -6239 -1237 -435 2048 5154 2398 -36 3267 8338 11804 11651 4635 -5015 -5931
357 -5931 -12964 -15625 -13469 -14376 -15358 -12641 -12930 -13837 -15075 -14485 -7290 -5320 6 7964 9237 12365
341 12365 8296 4161 -1242 -395 -2560 -4826 1797 1335 36 940 -1775 -553 702 4662 601 -2121
325 -2121 -3526 470 2675 -911 1890 2886 8780 3622 540 8348 7912 11035 12154 4473 -3964 -12788
309 -12788 -4723 1923 -4617 -6699 -1755 5329 5965 -1488 -7163 -9622 -7584 -11465 -9871 -3836 5000
294 5000 7297 8719 8308 7567 5107 6906 7368 7211 8583 9180 12732 12307 6089 3091 -1130 1205 2431
277 2431 1249 -5427 -9680 -8497 -3419 1633 325 1228 5115 9918 4488 1924 -1221 2897 2438 553
261 553 2588 879 -138 4426 -955 -3786 -3490 -5267 -726 5289 6432 2523 5078 8719 3301 2277
245 2277 1209 4257 6258 1424 -1261 925 311 -1239 -1453 2036 313 -4128 -4928 -6397 -302 3602
229 3602 -6799 -8260 2768 8966 4039 -1162 3235 5392 5572 7025 1407 -4129 -3843 4122 8911
214 8911 8260 9648 10795 13583 7659 3141 -369 2178 1618 -1207 851 -2512 -1335 3861 751 1290
198 1290 9133 8700 13132 14070 12099 12379 9375 6348 5712 6454 5618 3963 3756 8044 9516 3305 5644
181 5644 3007 -470 3470 8481 5484 -3511 -4466 -866 -6142 -3676 -49 2818 -1083 -2820 -5390
166 -5390 -7848 -9734 -5802 -2058 9204 12945 7206 4329 2243 -1935 -7964 -6581 -3996 3129 9234
151 9234 6041 1670 380 -812 1706 8420 9552 2691 -2895 -6745 -7795 -10913 -9966 -2982 -4900
136 -4900 -7430 -6175 -3065 -5175 -8234 -5146 -5497 -2055 2678 5353 5659 4190 6755 8356 8402 10601
120 10601 7109 4408 8427 7380 5330 7221 12015 7241 6985 3338 1353 4395 7392 2163 -1234
105 -1234 -429 -2772 -2241 -6761 -4788 -4642 2008 4709 6542 8037 6523 9421 2498 -2936 -544 -1128
89 -1128 -2749 475 2862 6070 6699 4937 1560 -123 -2445 -793 -401 2081 7309 12767 16273 14414
73 14414 3628 -1291 -2573 -3164 -2537 -4808 -6810 -13319 -14840 -12045 -3278 840 909 -2641 -5832 329
57 329 2387 -2225 -4135 -2819 2032 1303 551 4309 9336 9587 6195 2824 533 804 -1371 -2161 3541
40 3541 8993 8089 2529 1000 -329 525 788 271 -517 1819 2973 157 1448 3638 4596 6596 6505
23 6505 5673 5656 1544 -2753 736 4796 4568 7766 7107 4878 6336 5970 4705 3121 4458 6684 3440
6 3440 2905 2404 -851 -4228 -3844 90
0I0
$$ Imaginary data points
##PAGE= N=2
##DATA TABLE= (X++(I..I)), XYDATA
32767 71427 71611 71797 70719 65942 62919 68123 71692 80555 90760 84520 82063 82581 80672 80218 81589
32752 81589 84916 82215 83105 78752 77212 79205 81795 83589 83870 84933 84608 89679 87330 89564 88925
32737 88925 89327 92031 93531 89435 83247 85710 86282 86332 89510 85881 88723 88210 90609 93887 93241 93601
32721 93601 95122 94347 91798 92999 94677 94318 98068 99318 102727 104806 106276 104505 102229 102865 100580
32706 100580 102421 102809 105081 111021 114476 117343 122400 124135 118792 114777 113602 114776 114036 113522 115793
32691 115793 116036 118244 119745 120668 123232 121346 117681 117348 120121 123641 119149 120211 119125 120796 126746
32676 126746 127882 127010 121975 120309 119022 115138 115628 117492 116600 122059 130289 133906 136121 136987 134743
32661 134743 135835 135008 133040 130838 135719 140367 142138 141146 142259 139941 140095 140167 143583 146321 141548
32646 141548 141133 143966 140812 140797 144906 148204 144982 143307 148285 148803 150362 151326 152059 152793 152573 153763
32630 153763 155887 153856 149788 150018 154615 152340 150302 148700 151228 154353 153707 151989 151487 159255 160475
32615 160475 158018 159441 158112 155804 155773 162841 158017 148784 149455 159164 163494 159482 161394 166247 162562
32600 162562 158991 158147 159842 156654 155154 157330 159951 162687 163019 162320 162679 166109 166137 168975 171807 170945
32584 170945 169710 172869 170593 169831 168396 169646 169959 171234 175628 174321 178215 176443 172145 173522 183002
32569 183002 189220 190921 184984 177802 177854 180920 183487 184741 182864 182248 178977 177536 178563 177684 182723
32554 182723 177326 177853 184124 188059 184461 181699 180473 185636 187551 189778 190585 187193 185698 184792 189798
32539 189798 196077 192419 188967 185715 186943 187267 192756 197087 195275 196625 202741 207274 208978 207675
32525 207675 204310 196256 194285 196498 197549 198064 195954 193216 198584 204004 211711 215827 211956 211666 211006
32510 211006 208023 204666 203268 201016 197712 202871 204597 208402 207872 207130 205772 205636 202242 200467 200707
32495 200707 208596 210602 210454 206872 203672 204988 210609 215228 215525 213337 215110 219821 221720 218375 216427
32480 216427 217984 219640 216145 208969 206138 216354 218572 220681 219367 218567 218587 218039 215072 221064 224524
32465 224524 222682 216563 219596 226143 225569 220558 220110 216044 216465 217429 217410 223791 222948 222175 224822 229218
32449 229218 226961 222277 215694 218394 218566 219826 219483 219859 223699 221229 224599 228587 225653 224313 231421
32434 231421 237265 232815 232326 233893 237056 237938 234055 230557 232090 232205 230152 232131 235583 233777 235525
32419 235525 238089 242520 238727 236586 230935 224029 220288 225279 231642 226015 227942 233388 237462 241173
32405 241173 241263 241901 237875 240168 238115 234821 235558 235060 231260 236168 245233 246055 242866 240683 238517 235706
32389 235706 239292 248011 241828 239352 242918 240352 239685 242347 242346 243141 242351 243900 245303 242443 243510 243287
32373 243287 242111 246068 242208 242112 243326 242663 243998 247557 249030 249252 247645 248817 242556 244297 245697
32358 245697 244815 250442 250808 247293 249574 248558 247371 242839 243282 248349 249305 248129 246451 247176 243037
32343 243037 244043 241752 237071 235797 237822 243490 243266 245554 243663 245209 244918 245184 241423 239737 241084
32328 241084 241559 237569 238260 240761 241794 238821 239279 247906 252562 246629 240873 244150 248811 247881 245135
32313 245135 245154 249592 247975 245352 248512 247585 246914 247797 253215 254989 255532 254184 246817 247570 250136 245920
32297 245920 245271 244619 245989 255703 260325 261070 265723 265747 267506 265310 253392 242711 243562 251222 253522
32282 253522 257336 250369 249668 248101 244120 241327 246209 256342 258373 253112 245863 251267 254811 253440
32268 253440 250823 250416 246805 249137 252082 252028 255800 256714 260646 257800 258684 258304 263345 264567 264350 255800
32252 255800 246835 245975 253404 252598 244510 249228 256406 254981 253329 255091 255844 252823 250109 249221 249414
32237 249414 260400 261963 256389 250652 247680 257048 260910 261845 263822 266784 262664 265721 267288 264668
32223 264668 260306 257762 255706 256798 255736 258031 253573 253769 255373 263453 270462 269499 266269 263670 263040
32208 263040 267039 268321 259284 252356 249512 256479 252969 246795 251164 258488 258970 258086 261315 260588 256352
32193 256352 258484 257646 257912 256791 260234 254804 253950 265000 260227 253603 255970 261047 274282 269338
32179 269338 264231 265598 261011 261884 267522 273289 265666 263125 261072 263165 258404 254056 251930 253474
32165 253474 253893 255127 262169 266819 270574 267283 257711 255424 252791 260173 262250 256233 252609 252717 257739
32150 257739 262229 266437 268708 272324 263547 262165 258143 252104 255323 258780 263402 271370 261451 259931
32136 259931 267167 270360 269472 266175 261121 257405 251540 245972 249614 257737 264298 266776 267730 268939 264429
32121 264429 265873 264949 265472 260999 259186 262278 261320 261487 267805 270050 270724 268775 259585 264663 276942
32106 276942 278519 277927 285330 284287 277149 270942 266850 269319 268203 267925 264057 264755 265105 259362 256692
32091 256692 257930 268911 275811 274873 261071 261623 267662 271562 275427 271378 271833 272799 271770 269144 274895
32076 274895 271112 268431 269385 269928 266751 262068 265274 266936 265970 265769 261119 260710 265321 274437 280750
32061 280750 272183 266732 269955 269152 270524 268132 270078 263889 262370 265700 263828 261110 267388 264682
32047 264682 268031 270753 268067 270827 271919 273820 272398 271026 271580 270294 264136 265151 265757 260795 262473
32032 262473 264907 263610 264198 269947 275853 281525 289234 291194 282077 271133 266847 270093 272599 278301
32018 278301 272349 272431 268266 261856 263971 266325 264486 263239 265929 263297 268165 273299 273051 275311 278131
32003 278131 280324 275576 270975 272375 273681 271470 272928 275999 271018 262474 258921 261053 261240 257571
31989 257571 262815 264726 272821 273757 273269 272729 278239 280701 278579 277910 283343 276918 269713 269124 270995
31974 270995 271793 270474 267999 270739 269380 265041 270833 271620 272020 279269 276558 268375 267291 270565 274848
31959 274848 267991 261426 258389 266594 272070 274609 277356 281749 278121 276128 274750 271019 269448 271333
31945 271333 274977 274192 271349 268857 271175 269424 263490 260730 267737 271869 270689 274228 272315 275015
31931 275015 276617 267188 263887 271166 277379 276445 271122 273044 267112 268871 271460 273195 274888 276503
31917 276503 278449 275539 268475 268051 265366 263503 262229 271153 274383 271643 270886 265017 258484 265464 276796
31902 276796 270162 272536 277317 276685 274912 270263 268092 271454 271243 272767 278285 280652 279059 274058 275929
31887 275929 272808 265348 265659 273136 273509 270468 269500 268745 266532 271830 272853 271063 264888 258542 259844
31872 259844 264806 265841 266029 264784 267359 272802 278486 279044 269786 268002 275334 275199 267865 262254 257168
31857 257168 255644 262130 270166 267337 273794 273814 273379 270528 267256 260774 261435 261666 266593 272300 279507
31842 279507 284033 284081 283703 284200 288133 278363 274570 276011 269769 271441 280935 283719 269383 263929 268722
31827 268722 274696 272508 269461 272253 269158 267746 260942 262839 262569 272767 272597 270104 277574 277979 278464
31812 278464 280919 274494 271380 268974 270582 269193 273571 278269 274250 277880 273574 273382 277812 280906
31798 280906 276488 272524 271672 267233 265414 272432 273086 270262 267006 268357 273533 270376 264905 262090 257082
31783 257082 265530 272758 276869 278558 278994 281107 273939 264626 257686 261549 268079 271040 268626 273526
31769 273526 271299 267534 262951 266723 272290 269899 266948 271352 273710 272677 270689 271006 269344 262135
31755 262135 263280 266314 273426 266115 260087 269000 269981 267697 265152 264801 259956 261984 265807 264043 257275
31740 257275 256328 259234 266046 265498 270863 277498 274568 268018 267147 270516 270884 272803 265955 274687 281686
31725 281686 280877 283558 285090 276729 276115 271061 270620 275748 269295 262882 257074 257060 268246 280021 281768
31710 281768 275372 276591 278094 275688 278559 282749 287704 288827 286801 280462 274190 275069 276848 277797 278995
31695 278995 281956 279063 280658 284833 283362 278683 277190 273265 271887 273993 270853 268251 266390 267312
31681 267312 269141 272260 268923 266481 269492 275725 279346 272372 274702 266720 258033 256297 258864 265038
31667 265038 267920 272704 275784 274738 275662 277623 276238 268869 264370 259876 264424 271734 275574 274559
31653 274559 271518 269788 273148 270805 269637 275096 277086 267488 263260 267736 275576 281932 276514 278068
31639 278068 284098 285782 283852 287934 283255 279360 274804 274784 277112 275098 278228 280545 283224 284793 283672
31624 283672 282037 280379 275685 271832 264846 263612 269015 276630 278365 280122 282253 284086 281588 279400
31610 279400 281427 284084 282459 280151 279765 278813 279712 284333 283158 278431 276509 284382 283728 278516 273796
31595 273796 264474 262835 266969 270847 271059 273438 268646 266757 270237 274563 272872 276341 276687 273126 272117
31580 272117 270836 273204 271292 272258 273279 274735 277983 278084 276207 279495 278831 279776 279466 276003 270559
31565 270559 275097 273138 274156 278629 276397 265541 265835 267622 273242 278390 277899 280092 280517 280664 281392
31550 281392 272637 266501 268422 277147 278727 281415 281752 279438 283196 282616 291434 289672 289629 292692 287582
31535 287582 280940 274987 267700 268941 272878 273466 272632 275082 278991 278449 280338 280494 276080 281880 287673
31520 287673 291737 283469 281139 276424 272699 273470 273088 264591 268079 278719 286762 288413 280918 274460
31506 274460 276205 281446 277360 274789 276654 280250 280200 281364 276091 275421 275813 276920 281754 290776 289865
31491 289865 285393 283656 280030 279269 276359 279551 285660 288060 286930 284991 278690 276577 281275 273171
31477 273171 271459 273588 276235 275964 275784 278047 280229 282782 282164 285846 284883 281331 281802 280679 280472 281411
31461 281411 272666 274083 285270 294980 290523 280782 284318 284653 282003 275367 271880 274754 275887 278536
$$ [...]
##END NTUPLES=NMR SPECTRUM
##END=
