##TITLE=Analysis number 329480
Compound Code cc 55506
Book Reference 540/20
Project Code adrs
Chemist Name mikem
##JCAMPDX= 6.0         $$ Bruker NMR JCAMP-DX V2.0
##DATA TYPE= NMR SPECTRUM
##DATA CLASS= NTUPLES
##ORIGIN= Bruker BioSpin GmbH
##OWNER= nmr
$$ XWIN-NMR		Version 3.5
$$ Wed Sep  5 13:22:54 2007 GMT Daylight Time (UT+1h)  MAYBRIDGE\nmr@NMR_250MHZ
##.OBSERVE FREQUENCY= 250.131544655141
##.OBSERVE NUCLEUS= ^1H
##.ACQUISITION MODE= SIMULTANEOUS (DQD)
##.ACQUISITION SCHEME= undefined
##.AVERAGES= 16
##.DIGITISER RES= 18
##SPECTROMETER/DATA SYSTEM= dpx250
##.PULSE SEQUENCE= zg30
##.SOLVENT NAME= CDCl3
##.SHIFT REFERENCE= (INTERNAL, CDCl3, 0, 16.4276)
##AUDIT TRAIL= $$ (NUMBER, WHEN, WHO, WHERE, WHAT)
$$ ##TITLE= Audit trail, XWIN-NMR		Version 3.5
$$ ##JCAMPDX= 5.01
$$ ##ORIGIN= Bruker BioSpin GmbH
$$ ##OWNER= nmr
$$ C:\u/data/dgb/nmr/ADRS/300/pdata/1/auditp.txt
$$ ##AUDIT TRAIL=  $$ (NUMBER, WHEN, WHO, WHERE, WHAT)
(   1,<2007-09-05 13:22:29.12 +100>,<MAYBRIDGE\nmr>,<NMR_250MHZ>,
      <created by zg, POWCHK disabled, PULCHK disabled
       configuration hash MD5:
       76 6E 9A 78 1E 09 19 81 EC 84 63 8F B0 6A 59 2D
       data hash MD5: 64K
       22 3C 9C 05 D9 6B FD 92 10 0F CF DD 00 F5 8B 92>)
(   2,<2007-09-05 13:22:39.86 +100>,<MAYBRIDGE\nmr>,<NMR_250MHZ>,
      <Start of raw data processing
       ef LB = 0.3 FT_mod = 6 PKNL = 1 SI = 32K 
       data hash MD5: 32K
       94 E6 69 D6 02 41 F9 3D 43 BD D1 5E B5 BD C7 6C>)
(   3,<2007-09-05 13:22:41.48 +100>,<MAYBRIDGE\nmr>,<NMR_250MHZ>,
      <apk 
       data hash MD5: 32K
       A3 A0 FB 0E 62 79 EC 51 B9 6C 59 B7 41 70 64 D7>)
(   4,<2007-09-05 13:22:42.20 +100>,<MAYBRIDGE\nmr>,<NMR_250MHZ>,
      <abs ABSG = 5 
       data hash MD5: 32K
       46 05 5D AD 9A 20 7E 74 8B E2 AD 34 0E 61 EF A0>)
$$ ##END=
$$ 
$$ hash MD5
$$ 5C 88 6B E0 B9 98 5E 0F 2B FE 23 16 1C C9 FD 53
##$RELAX= 
##$RELAX= 
##$RELAX= 
##$RELAX= 
##$RELAX= 
##$RELAX= 
##$RELAX= 
$$ Bruker specific parameters
$$ --------------------------
##$DU= <C:\u>
##$EXPNO= 300
##$NAME= <ADRS>
##$PROCNO= 1
##$TYPE= <nmr>
##$USER= <dgb>
##$AMP= (0..31)
100 100 100 100 100 100 100 100 100 100 100 100 100 100 100 100 100 100 
100 100 100 100 100 100 100 100 100 100 100 100 100 100 
##$AQSEQ= 0
##$AQ_mod= 3
##$AUNM= <au_zg>
##$AUTOPOS= <36 >
##$BF1= 250.13
##$BF2= 250.13
##$BF3= 250.13
##$BF4= 250.13
##$BF5= 500.13
##$BF6= 500.13
##$BF7= 500.13
##$BF8= 500.13
##$BYTORDA= 1
##$CFDGTYP= 0
##$CFRGTYP= 5
##$CHEMSTR= <none>
##$CNST= (0..31)
1 1 145 1 1 1 1 1 1 1 1 1 1 1 1 1 1 1 1 1 1 1 1 1 1 1 1 1 1 1 1 1 
##$CPDPRG= <>
##$CPDPRG1= <>
##$CPDPRG2= <>
##$CPDPRG3= <>
##$CPDPRG4= <mlev>
##$CPDPRG5= <mlev>
##$CPDPRG6= <mlev>
##$CPDPRG7= <mlev>
##$CPDPRG8= <mlev>
##$CPDPRGB= <>
##$CPDPRGT= <>
##$D= (0..31)
0 1 0 0 0 0 0 0 0 0.06 0 0 0 0 0 0 0.0002 0 0 0 0 0 0 0 0 0 0 0 0 0 0 
0 
##$DATE= 1188994948
##$DBL= (0..7)
120 120 120 120 120 120 120 120 
##$DBP= (0..7)
150 150 150 150 150 150 150 150 
##$DBP07= 0
##$DBPNAM0= <>
##$DBPNAM1= <>
$$ [...]
##$SUBNAM7= <"">
##$SUBNAM8= <"">
##$SUBNAM9= <"">
##$SW= 20.6930455092707
##$SWIBOX= (0..15)
0 0 3 0 0 0 0 0 0 0 0 0 0 0 0 0 
##$SW_h= 5175.983436853
##$TD= 65536
##$TD0= 1
##$TE= 296.16
##$TE2= 300
##$TE3= 300
##$TEG= 300
##$TL= (0..7)
0 120 120 120 120 120 120 120 
##$TP= (0..7)
150 150 150 150 150 150 150 150 
##$TP07= 0
##$TPNAME0= <>
##$TPNAME1= <>
##$TPNAME2= <>
##$TPNAME3= <>
##$TPNAME4= <>
##$TPNAME5= <>
##$TPNAME6= <>
##$TPNAME7= <>
##$TPOAL= (0..7)
0.5 0.5 0.5 0.5 0.5 0.5 0.5 0.5 
##$TPOFFS= (0..7)
0 0 0 0 0 0 0 0 
##$TUNHIN= 0
##$TUNHOUT= 0
##$TUNXOUT= 0
##$USERA1= <user>
##$USERA2= <user>
##$USERA3= <user>
##$USERA4= <user>
##$USERA5= <user>
##$V9= 5
##$VALIST= <valist>
##$VCLIST= <CCCCCCCCCCCCCCC>
##$VD= 0
##$VDLIST= <DDDDDDDDDDDDDDD>
##$VPLIST= <PPPPPPPPPPPPPPP>
##$VTLIST= <TTTTTTTTTTTTTTT>
##$WBST= 1024
##$WBSW= 4
##$XGAIN= (0..3)
0 0 0 0 
##$XL= 0
##$YL= 0
##$YMAX_a= 554844
##$YMIN_a= -512981
##$ZGOPTNS= <>
##$ZL1= 120
##$ZL2= 120
##$ZL3= 120
##$ZL4= 120
##$ABSF1= 16.42764
##$ABSF2= -4.26553
##$ABSG= 5
##$ABSL= 3
##$ALPHA= 0
##$AQORDER= 0
##$ASSFAC= 0
##$ASSFACI= 0
##$ASSFACX= 0
##$ASSWID= 0
##$AUNMP= <proc_1d>
##$AZFE= 0.1
##$AZFW= 0.1
##$BCFW= 0
##$BC_mod= 0
##$BYTORDP= 0
##$COROFFS= 0
##$CY= 12.5
##$DATMOD= 1
##$DC= 0
##$DFILT= <>
##$DTYPP= 0
##$F1P= 14.0000005364418
##$F2P= -0.99999901652339
##$FCOR= 0.5
##$FTSIZE= 32768
##$FT_mod= 6
##$GAMMA= 0
##$GB= 0
##$INTBC= 1
##$INTSCL= 1
##$ISEN= 128
##$LB= 0.3
##$LEV0= 0
##$LPBIN= 0
##$MAXI= 10000
##$MC2= 0
##$MEAN= 0
##$ME_mod= 0
##$MI= 0
##$NCOEF= 0
##$NC_proc= -2
##$NLEV= 6
##$NOISF1= 0
##$NOISF2= 0
##$NSP= 0
##$NTH_PI= 0
##$NZP= 0
##$OFFSET= 16.42764
##$PC= 1
##$PHC0= -42.07623
##$PHC1= 5.173686
##$PH_mod= 1
##$PKNL= yes
##$PPARMOD= 0
##$PSCAL= 4
##$PSIGN= 0
##$REVERSE= no
##$SF= 250.130023602184
##$SI= 32768
##$SIGF1= 0
##$SIGF2= 0
##$SINO= 400
##$SIOLD= 32768
##$SREGLST= <1H.CDCl3>
##$SSB= 0
##$STSI= 32768
##$STSR= 0
##$SW_p= 5175.98343685301
##$SYMM= 0
##$S_DEV= 0
##$TDeff= 65536
##$TDoff= 0
##$TI= <Analysis number 999999
Compound Code 99
Book Reference 9
Project Code 9>
##$TILT= no
##$TM1= 0
##$TM2= 0
##$TOPLEV= 0
##$USERP1= <user>
##$USERP2= <user>
##$USERP3= <user>
##$USERP4= <user>
##$USERP5= <user>
##$WDW= 1
##$XDIM= 32768
##$YMAX_p= 588442370
##$YMIN_p= -138921
$$ End of Bruker specific parameters
$$ ---------------------------------
##NTUPLES= NMR SPECTRUM
##VAR_NAME=  FREQUENCY,     SPECTRUM/REAL,   SPECTRUM/IMAG
##SYMBOL=    X,             R,               I
##VAR_TYPE=  INDEPENDENT,   DEPENDENT,       DEPENDENT
##VAR_FORM=  AFFN,          ASDF,            ASDF
##VAR_DIM=   32768,         32768,           32768
##UNITS=     HZ,            ARBITRARY UNITS, ARBITRARY UNITS
##FACTOR=    0.157963299565203, 1,           1
##FIRST=     4109.04620977639, 0,            0
##LAST=      -1066.93722707662, 0,           0
##MIN=       -1066.93722707662, -138921,     0
##MAX=       4109.04620977639, 588442370,    0
$$ Real data points
##PAGE= N=1
##DATA TABLE= (X++(R..R)), XYDATA
$$ [...]
21130 -16136 -12039 -9353 -4255 2059 -2279 -6764 -7539 -7126 -9711 -2652 3755 -232 -7214 -13066 -16436
21115 -16436 -15239 -15928 -18149 -14183 -8419 -7584 -9255 -7688 -7022 -11327 -10099 -7737 -3180 1683 -2586
21100 -2586 -3251 1905 3798 -1771 -2278 1720 3569 6420 6251 994 -5661 -5184 -1493 -1101 -4705 -9329
21084 -9329 -11069 -6131 -3706 790 584 -2258 -4941 -5476 -3649 4732 9491 9215 7913 881 -732
21069 -732 -2307 4547 8390 -6010 -13591 -12630 -15688 -23374 -19776 -9646 -9237 -7144 -4991 -8959 -8082
21054 -8082 -5018 -8512 -5505 -4794 -8905 -4484 -5126 -750 -2426 82 728 -307 -3143 -8869 -7409
21039 -7409 -6394 -4455 -8217 -10049 -9575 -4557 -2441 -1017 4369 4895 -4020 -10800 -10687 -8159 -10553
21024 -10553 -9103 -7001 -9724 -7886 -4888 -11459 -8195 -2592 -3521 2853 2857 5094 12925 9270 5747
21009 5747 9287 6335 2254 9194 7311 -2621 -1895 5886 4912 4371 9847 6877 7123 3518 -2290 835
20993 835 4813 -710 -3174 -6299 -6960 -6792 -8340 -9807 -8698 -7194 -4803 3725 4376 2310 -5757 -8491
20977 -8491 -8584 -5749 -884 5302 4712 3731 4245 -2653 -8149 -6112 -6968 -11276 -14883 -14371 -4817 -1124
20961 -1124 -6613 -9844 -11904 -21386 -19259 -12679 -11395 -12716 -3421 -969 -2490 -2115 -7655 -10293 -12826
20946 -12826 -16265 -10348 -626 -185 -3905 -11456 751 4767 1584 1299 4677 4704 5304 9178 13868
20931 13868 16627 12761 8024 509 -1977 966 5396 -4767 -8528 -3535 -1533 -3379 -3888 -7141
20917 -7141 -12548 -12680 -6765 -3364 3388 4794 -2681 -10949 -9588 -14151 -12687 -9187 -7750 -8361 -11565
20902 -11565 -16576 -15203 -13448 -13634 -8625 -5960 -9592 -2489 923 3655 1536 4892 3806 3415 703
20887 703 -9627 -12856 -11019 -5307 5796 11936 7313 1317 -5587 -8792 -6585 -5304 1678 10019
20873 10019 2342 -3646 -2405 3779 5893 8564 6863 8653 3271 3089 2785 -2108 -476 -2034 -1835
20858 -1835 -1276 -4306 2862 5963 7472 2706 -3462 3474 8815 6167 -1488 -12600 -15559 -9700 -10266
20843 -10266 -10681 -6376 -2110 -1866 -4841 -3177 -3846 -7609 -4234 -1962 349 -1851 -1019 -4720 -10363
20828 -10363 -9662 -13288 -9851 -8080 2811 -237 -5961 -6292 -6027 -4275 1581 418 -1650 1345 -853
20813 -853 -3995 11 -1759 -9129 -5463 -440 5472 4818 3838 490 -1860 -2623 -4486 -6153 -8298 -7319
20797 -7319 -2264 -3721 -8319 -2503 7214 5468 5562 10459 11005 6765 3859 -5249 -8526 -4667 730
20782 730 -38 -1115 -347 -3677 -6173 -6312 -992 -5934 -9277 -3785 -7488 -11858 -19062 -18001 -15332 -14116
20766 -14116 -6555 -5176 -4452 485 6666 4241 7074 2201 -1980 -9134 -12249 -11643 -5069 -6235 -6169
20751 -6169 -2303 -5226 -9804 -16003 -12976 -8096 1758 4178 3688 -1652 -5398 -6794 -7899 -7700 -12625
20736 -12625 -18092 -10974 -8316 -9093 -14006 -12071 -9415 -9724 -11445 -4250 -640 1194 4308 3719 2615
20721 2615 -1684 -6063 -9893 -9350 -7104 121 1936 -3011 -1592 -4139 -3248 2428 5319 3157 461
20706 461 114 -4808 -5162 -4122 -5638 -4623 1305 -797 -240 -3372 -7413 -7535 -9181 -8687 -7076 -5588
20690 -5588 1546 2785 653 785 689 -2843 -9299 -3757 -1113 -7297 -10892 -9354 -11650 -6288 -4607
20675 -4607 -7683 -5981 -2218 1853 1793 -2733 -1699 -6797 -7161 -10028 -12674 -10779 -7188 -8896 -8365 -11847
20659 -11847 -14284 3212 11471 6268 1722 -5575 -6901 -300 4379 -2795 -13160 -14645 -14010 -11746
20645 -11746 -11172 -5229 -1445 -2369 1634 11402 10213 -728 321 1307 2346 -191 -2708 -399 3497
20630 3497 1968 -601 1284 1140 -1549 -7160 -4794 -195 5406 8914 -70 -618 -2791 -4531 -4998
20615 -4998 -1479 2883 2375 7107 5239 5340 6129 4182 -5649 -5711 5377 13938 6757 4791 9645 9919
20599 9919 11352 11410 10729 4503 -2721 -10642 -13927 -5943 1303 3422 2929 175 4591 -1578 -6816 -6536
20583 -6536 1438 8395 2514 -3944 -3294 -4113 -8922 -5912 -6483 -4522 -6485 -9234 -13578 -9809 -7026
20568 -7026 -6712 -10802 -16995 -11880 -5449 -3573 365 -3788 -1937 -444 2755 3535 2394 -3491 -3030
20553 -3030 -2592 252 -4007 -9291 -3271 279 88 -655 -379 -5000 -2425 79 5123 6379 9887 9183
20537 9183 2723 -676 -3700 -3625 -6270 -10226 -6709 1751 105 -2283 -2273 -6151 -4673 -1878 -1858 -3344
20521 -3344 1152 1749 -123 -2827 -4242 -6683 -3591 -2344 -700 -3613 3171 7929 12237 10242 -454
20506 -454 -8274 -8343 -11720 -15579 -14563 -12861 -8947 -9398 -3226 2955 7224 7762 7148 2130 2573 -2268
20490 -2268 4722 4259 -10114 -13813 -2037 -2808 -7356 -6333 -3184 10273 10127 2118 -4541 -5349 -5213
20475 -5213 -3638 -2215 -6421 -5444 -1356 -1385 -5771 -12083 -16040 -13226 -10664 -8811 -8432 -12277 -8804 1810
20459 1810 -3490 -9193 -10537 -6703 142 8688 12202 10300 9321 -283 -3571 -7067 -2445 2176 4912
20444 4912 2786 -4031 -8281 -3172 -2844 -5744 -8858 -7823 -4566 -633 -6780 -8069 -10867 -7691 -2124
20429 -2124 -4935 -7990 -3402 -655 -5073 -2552 2178 4709 8852 5854 7165 1216 -184 -486 2078
20414 2078 -2107 -6217 -7123 -8965 -13290 -15402 -16813 -9157 -2755 -1627 -2633 1554 -608 -6516 -9050
20399 -9050 -11201 -7967 5934 5505 3791 -1899 -4191 -6374 -7595 -15141 -19659 -14820 -7917 -3073 888
20384 888 4438 -1240 -2448 -3062 -5795 -3243 -6782 -14569 -15112 -8195 -7674 -4702 280 -2063 -10479 -8686
20368 -8686 -8756 -6088 -2963 8062 8807 -3779 -7861 -6315 -5825 -8474 -15209 -15458 -17331 -14931 -11209
20353 -11209 -6611 -6358 1402 5760 7529 7075 10426 14051 10237 10473 7715 3021 -5242 -3793 2620
20338 2620 3792 2568 -1736 -4940 -8389 -13917 -8939 -7901 -7116 -8739 -8724 -5974 -6749 -8215 -4640 1772
20322 1772 -1307 -1746 -6978 -6745 -2441 -4579 -6875 -5844 -4209 -10032 -6211 -6932 -14165 -6910 -2682
20307 -2682 -8191 -498 -5344 -12953 -11616 517 4963 2826 -374 -2354 -8071 -3624 1065 1803 1455
20292 1455 -2845 -1403 -531 -3187 -6725 -566 5090 3774 8731 5807 -2848 -7333 -3609 3537 4025
20277 4025 1184 2948 40 -316 -2815 -2013 -3265 -5519 -5441 -10020 -13589 -11573 -13423 -15805 -6836 -8105
20261 -8105 -10455 -1428 2761 -1407 -6438 -6657 -9487 -10174 -9597 -10035 -8096 -8530 -4640 -8985 -7931 -6486
20245 -6486 -4882 -6731 -12843 -11932 -10818 1150 4161 786 214 4716 3833 -5196 -11881 -9983 -4932
20230 -4932 -6488 -5084 50 1719 4099 5629 3791 2363 2431 5929 6746 6866 1506 -2520 -6027 -6924
20214 -6924 -3299 -1323 2587 2261 -4914 -10285 -7502 -5738 -5417 -5351 -3091 -3052 -7537 -8349 -10329 -7947
20198 -7947 -3551 -1064 6147 6035 724 -5522 -4038 -4844 -6250 -5494 -7216 -3161 -5549 -8185 -5530
20183 -5530 -5127 -2333 1545 -76 1186 6004 -109 -6626 -5168 -7579 -11237 -11537 -8992 -1073 2349
20168 2349 -5635 -13443 -11666 -12155 -15384 -22165 -21321 -14959 -868 -957 -4134 -7231 -6925 -578 2548 752
20152 752 -3259 -2885 -1556 -3553 -529 -5461 -9307 -6574 -2675 202 -1500 -197 3872 11550 8274
20137 8274 2586 2842 1576 4126 -2852 -5273 -817 4050 7338 -652 -7563 -9762 -7085 -5368 -13987
20122 -13987 -12651 -5849 -1749 2812 -2483 -13110 -12754 -9938 -6705 -3788 -2782 -5542 -3015 -5068
20108 -5068 -9132 -11891 -10239 -3858 -3244 -10001 -14305 -19039 -20754 -14169 -11654 -9459 -10529 -6085 -3149
20093 -3149 -1264 -5624 -11694 -11432 -11545 -13978 -14168 -8286 -6996 -6939 -12964 -13687 -13028 -11524 -13700 -14497 -11374
20076 -11374 -16903 -12265 -11780 -8122 -7428 -8550 -5939 3358 439 -8030 -13313 -12296 -16746 -14383 -11547
20061 -11547 -8344 -1986 4290 4121 2429 5487 9339 4668 -4159 -12552 -6407 -459 3258 1773 -1240
20046 -1240 -2425 -9070 -10910 -9351 -7592 -1306 3222 2578 6614 8395 4871 -1686 829 1380 124
20031 124 7468 10495 7922 7510 3172 -4284 -8556 -5158 -7592 -7207 -8598 -13947 -8087 -5229 -3999
20016 -3999 2084 5552 4764 2800 10347 13604 12654 9002 8092 7925 1039 3562 9199 12261 14748 11972
20000 11972 2626 -5750 -10569 -7924 -6785 -2718 -3026 -1360 3750 4095 6229 1960 -2417 7179 13094
19985 13094 11521 9365 8007 915 -3734 -6515 -5325 -3072 5562 7393 9079 15975 15592 7664 8783
19970 8783 10257 12925 12343 4953 -1895 820 1162 -3483 -1583 4935 10364 10463 5079 3003 1294 -3084
19954 -3084 -2341 -3032 -6398 -8442 -8851 -10651 -17408 -19244 -18224 -16168 -14114 -6769 1070 -94 2109
19939 2109 7067 5432 5490 3095 1016 1396 -1318 -39 -1936 1566 8252 8575 7457 1737 -4066 -1474
19923 -1474 -2189 -14802 -16819 -14930 -13297 -12106 -4548 2783 4911 9822 6402 407 1309 1316 2296 -2772
19907 -2772 -5711 -708 1675 -3468 -14132 -15505 -9976 -471 -1330 -7093 -4700 -1694 -2263 -968 1252
19892 1252 7040 3875 10562 13648 6125 -3369 -4455 -1116 -4130 -5871 -6396 -2173 3140 6422 -568
19877 -568 -3892 -2007 -3608 -6329 -6077 -5205 -3619 -1835 -2447 -3979 -7425 -15319 -19190 -15435 -15509 -10417
19861 -10417 -1834 4696 1428 -4952 125 3055 5704 3171 -4103 -2526 -821 -525 -4917 -4598 79
19846 79 543 -2773 -327 -3270 -9749 -13228 -8952 1122 -610 -7510 -5307 -1953 -1647 -4998 -9306
19831 -9306 -8841 -6959 -8106 -8216 -4266 3225 1609 -5596 1284 5427 -2966 -2874 2384 -1475 -7070 4653
19815 4653 8305 3808 1843 1526 -498 2061 4648 1326 -4471 -7596 -8152 -1589 -3880 1046 5274
19800 5274 9177 6494 5301 -835 -2001 -7763 -10621 -12018 -11414 -5997 -7611 -9088 -9238 -3520 -1276
19785 -1276 1610 -5210 -10877 -13296 -9695 -3437 -4922 2 2253 6921 6818 4282 -567 108 81 -2753
19769 -2753 -2895 -1685 -671 4322 672 -4785 -4377 -3039 -1354 -4992 -3150 -803 -1287 2833 80
19754 80 -9214 -7203 -998 -1676 -7583 -9037 -9029 -2471 -2931 -4451 2590 3617 5301 1610 -4596 -1670
19738 -1670 2479 7823 6051 5379 10436 7157 -1835 -3773 -4873 -9055 -13345 -13308 42 6091 1673
19723 1673 -7841 -4658 -2328 -7198 -4918 -9743 -13567 -16047 -12778 -5881 -9841 -17706 -11745 -855
19709 -855 -670 -5758 -1323 2997 6672 10267 2137 -604 2936 2895 1229 7776 13462 13383 9786 3874
19693 3874 2354 9902 12690 11219 4633 4733 3993 2106 3325 -5007 -6140 -715 -3223 -7063 -2735
19678 -2735 -2105 -9127 -10985 -6401 57 -1506 -329 -37 3465 -3584 -8708 -3962 -2070 -6128 -3132
19663 -3132 -2994 -264 9047 9090 3639 -3606 -7131 -9416 -2376 4914 4512 7670 9263 2447 -6196 -7795
19647 -7795 -7951 -9877 -11611 -10795 -9433 -17278 -18981 -12530 -11498 -16115 -13262 -4533 -1871 -5831 -5766 -3451
19631 -3451 -5154 -4440 4707 -214 -4116 -3172 -3746 -3410 -8769 -8745 -3934 -5204 -12232 -10812 -1243 6152
19615 6152 -161 -2716 2716 7336 1456 -4050 3261 5256 3519 2174 -2672 -383 2874 3567 5888
19600 5888 -3094 212 7183 5961 4070 2058 1132 -4281 -10068 -7436 -7113 -7633 -6679 -1581 1554 6977
19584 6977 -463 -1922 2722 1753 176 3861 4051 -3386 -2276 -47 -2244 -3348 -2357 2277 2086 -752
19568 -752 -1644 -3253 -3547 -7155 -2710 -3713 -7045 -12444 -6183 -8486 -5922 959 4620 4297 3051 5864
19552 5864 9239 8986 4083 676 5283 5344 6687 -3163 -6155 771 -1447 -9552 -10535 -3542 -8136 -3767
19536 -3767 6621 7127 2674 2984 2559 -2409 583 2931 -743 3260 9093 5974 -3756 -2279 174
19521 174 -516 1128 4431 262 4610 5191 5178 4115 970 -8715 -3072 -1358 4658 12399 10174 5235
19505 5235 3412 -1353 -1574 2970 2545 -3822 -2264 -3397 -6738 -5365 -1018 2766 -1958 -7131 -9487
19490 -9487 -4524 -2248 5064 9032 7643 4699 -300 -2080 -6619 -6560 -4357 -7000 -2547 -1495 -1240
19475 -1240 -2499 -3585 554 6401 6624 3170 3678 -400 -445 -6718 -11407 -14116 -6532 -7791 -8003 -7840
19459 -7840 -11268 -19375 -13012 -11524 -9586 -10066 -11734 -9610 -5231 -1311 -764 -3620 227 573 -10793
19444 -10793 -9792 -9126 -5455 -2360 -5041 3239 5579 -3825 -11593 -11742 -5941 -2963 2396 9062 6077
19429 6077 4029 3717 2841 -699 -5615 -10019 -9912 -6461 -3758 976 -2991 -563 -3823 -8267 -3223
19414 -3223 -2817 -4866 -141 1079 4492 5463 11986 5602 -1359 -73 -2048 -8828 -3692 6086 4368
19399 4368 2225 149 -144 737 8738 4200 46 316 -7507 -9757 -9009 -9653 -6277 -709 -1835 -7199
19383 -7199 -10519 -13737 -17279 -18494 -16659 -3183 2522 -1498 -3529 -236 2528 4640 -2689 -4562
19369 -4562 -4766 -4807 -8946 -9261 -749 -101 -310 -5998 -11642 -12040 -6389 -1633 -4124 -335 -750 -877 3290
19352 3290 1260 2100 6152 1062 20 1630 3135 1678 -5226 -8423 -7045 -1678 -1985 -3411 -2778
19337 -2778 -149 1015 -284 -5735 -10446 -7850 -2808 -3677 1059 3052 2174 -2618 -6795 -12915 -7690
19322 -7690 -2203 2927 3982 2900 4511 5769 8480 3404 -1086 -2479 -6314 -6223 -3837 -3850 -2863 -6731
19306 -6731 -6680 -4139 -10559 -7909 -811 496 879 4986 1126 -7998 -9461 -6713 -10326 -14136 -14981 -12287
19290 -12287 -6870 -4056 -3530 -4022 -984 6390 6781 -445 -623 -6233 -8179 -2136 -5104 -1814 2713
19275 2713 3841 -2578 -4550 2451 3894 3114 2560 3470 3981 762 -1382 845 -1252 -999 -1224 -3709
19259 -3709 -4935 -2010 -4734 1119 278 -5056 -6577 -2589 -2412 -1951 -1841 458 1827 5002 5017 5005 2547
19242 2547 1666 -1246 -817 5483 12486 11309 8761 9659 8547 6052 -3391 -12463 -10949 -7783 -2231
19227 -2231 4666 2839 -6992 -8754 -8044 -8306 -5737 -4451 -2902 -7931 -8150 -6931 -4506 -5397 -7692 -6892
19211 -6892 -8713 -2135 388 -6131 -7282 -13236 -10802 -6065 -3750 -2074 3396 6452 2454 1363 1186
19196 1186 -3759 -8034 -8793 -9541 -7245 -1146 -4169 -11754 -11571 -3038 -2838 -434 -3814 -10674 -11547 -12028
19180 -12028 -10599 -8846 -7340 -10725 -9977 -2363 581 -399 146 -3851 150 1355 3543 1143 -4428
19165 -4428 -10532 -12861 -9143 -13838 -11359 -11277 -3307 -7483 -12600 -12959 -8232 -3550 -1672 -192 6721
19150 6721 9884 5904 397 -4309 -3797 3905 9345 5825 -1951 -7445 -3070 -1641 -5821 -7547 -4801
19135 -4801 -2227 -2916 -5460 -6449 -1452 6734 11181 7254 2684 1861 -1201 -2084 -2425 -3220 -1180 -2481
19119 -2481 -8744 -8714 -11337 -9228 -5292 -123 4054 2422 -517 1252 -5050 -7609 -12704 -7690 1067
19104 1067 5069 -1255 -8 1147 -5366 -7376 -6364 -5041 -10796 -13797 -8853 -9738 -5630 4130 8852
19089 8852 9895 4546 -4142 -6520 -8456 -6392 1551 2781 2981 -1143 7643 10014 977 -2508 45
19074 45 1995 240 437 -427 -265 -3580 -1262 4473 3984 -3865 -11463 -11360 -7635 -2365 -916 3034
19058 3034 4858 1743 -6918 -6654 -17 2255 -2070 -6849 -8498 -18156 -16451 -6993 -6938 -6430 546 10540
19042 10540 14244 13318 12453 10400 10485 8519 8551 9019 6615 6709 8478 3955 4899 6353 -334 -4064 -3432
19025 -3432 -1050 -375 -3630 532 -731 -1855 3105 6523 6242 5316 8265 6003 894 7197 9195
19010 9195 10870 9796 9038 3588 4307 9839 152 -1041 4653 6935 431 -4913 -5328 -3088 -3715 -2105
18994 -2105 -5528 -5664 -3329 -13478 -13003 -8680 2508 7091 5204 -864 -10905 -12113 -5549 446
18980 446 1775 2775 1398 2570 5670 4722 347 206 1313 6654 3359 7248 17664 10583 -5627
18965 -5627 -7675 -9161 -18089 -17573 -15246 -9493 -3771 -3904 -3564 -3597 -6456 -6243 -5893 -5188 -6104 -8152 -5136
18948 -5136 -8872 -5592 -116 6488 7490 11025 15303 10229 7871 3315 3604 7128 8055 2719 3860
18933 3860 -906 6969 6925 -2990 -7245 -3539 1777 1003 -1794 -1109 -5530 -1948 6383 5375 3909 2478
18917 2478 613 -1490 3458 6187 -3798 -3596 2544 4759 549 -3554 -8665 -7159 -1809 5850 12023
18902 12023 12693 19499 18657 17882 17305 16818 14346 4256 792 1522 9049 13399 66 -4778 463
18887 463 568 10294 7823 1851 -5906 -4880 6487 6974 11154 10326 7916 12695 15028 7719 5909
18872 5909 3670 -1017 -5180 -4425 1275 9215 19899 21594 20981 9143 3310 9174 6753 5296 11131
18857 11131 12581 11063 12681 5143 3609 7747 3535 391 4038 6856 3192 3336 -56 1516 2814
18842 2814 2359 1215 7196 12307 6149 6431 5952 -919 2235 9045 8812 26 3569 6009 4048 4648
18826 4648 11103 5841 3136 9569 11376 1358 -6096 -63 1263 5274 13396 7136 -33 -1637
18812 -1637 -3777 -7018 -12003 -6911 -6121 -3105 -2421 -3536 -9 -650 -1571 1813 2661 8038 13553 10352
18796 10352 5126 3181 5546 6246 3807 7943 2235 497 2055 1231 -575 -620 -3338 -1379 2467
18781 2467 10016 12189 7536 4982 4273 3925 4287 3353 -378 6369 20353 24618 29903 38924 64067
18766 64067 88093 89960 68792 47300 27150 11413 5576 3166 9030 11119 17092 16849 16475 6867
18752 6867 4033 9137 11322 12395 13622 13029 14515 11385 5778 8466 6469 6406 5362 6861 7309 4841
18736 4841 7334 12617 9016 7942 12755 16910 14975 7129 1742 -1196 -4784 -1703 -2321 374 11098
18721 11098 11210 7831 8360 6452 6589 8013 8386 6927 7431 6343 1810 2124 5856 8572 9457 8187
18705 8187 12140 14257 17159 13115 12435 3962 -2448 -8401 -6561 29 10519 11984 4332 5669 11410
18690 11410 7556 8491 13385 11597 4066 5081 9455 13394 3314 -2888 -430 -1701 710 -203 -4945
18675 -4945 -7043 -1902 3472 8151 5747 1094 1201 -1090 2315 7825 979 -2582 -2654 -1343 4591
18660 4591 9016 8224 7260 5028 -4628 470 1021 3090 1911 -144 -236 1571 5797 6734 14757 15510
18644 15510 11128 8880 6900 4652 -5077 -10578 -9462 -7880 -5218 -6736 -4914 2414 2256 4452 4903
18629 4903 6953 3257 7090 15982 9073 9213 5506 1861 224 -754 7021 6315 2950 3152 10380 12477
18613 12477 13378 10421 13087 14119 9007 -238 -486 2432 3613 5246 4847 7216 12306 16133 8276
18598 8276 -11714 -17067 -5428 4025 3194 -9657 -15254 -14428 -13116 -5754 5124 9509 6079 5342
18584 5342 520 -3631 643 5656 12937 14378 10851 19143 22488 20803 18271 8572 1944 7561 12662
18569 12662 11507 9156 13305 17629 15135 7232 8126 14734 14647 9836 10111 7457 5493 8298 12118
18554 12118 8519 7831 3902 5514 4552 2388 1628 2029 194 -663 -1348 882 5676 15148 12159 2863
18538 2863 1682 75 -3416 -77 7285 5725 1700 1084 3684 -1171 -2889 846 -1742 -3191 439
18523 439 3719 3495 4838 12658 14011 6264 -368 -2467 -2122 -4642 -2415 2959 5289 9284 9861 17680
18507 17680 16133 9138 1842 2293 1969 1393 4433 4181 2767 9937 11852 9392 7678 11100 15618
18492 15618 16133 18038 20535 18212 12985 13470 16316 15615 13704 17308 22131 25370 31942 36736 44927
18477 44927 63336 85182 112810 152467 197820 255754 283083 279822 283963 273108 242317 222866
18465 222866 209914 208627 218694 244820 280923 295806 293493 289947 267086 213087 163655 132461
18453 132461 93067 68629 49275 37057 33613 32753 21970 16370 24801 36809 38526 30561 24987
18440 24987 26627 28608 29857 33515 40258 41268 42681 39481 34278 32207 39616 46415 48543 43698
18426 43698 48921 60655 86719 130188 196310 274722 358449 456005 513886 526072 526928 468798
18414 468798 376805 296900 233171 190767 180535 218991 281800 348257 443441 521769 537985
18403 537985 526392 477219 391232 305762 225768 150339 108442 84332 70795 54607 47073 43742
18391 43742 34004 27038 27070 19304 25816 24734 29977 35717 31305 24986 19813 20970 23567 25699 29664
18376 29664 23355 15910 13166 11431 13401 15327 19460 18686 18868 16570 19256 19490 14573 20615 18898
18361 18898 10213 13644 19088 23321 26157 31218 30559 34418 33378 32213 28670 25691 23670 14644 5956
18346 5956 10329 13460 18612 24731 29825 37351 40617 37382 35161 34067 31153 27353 25224 14811
18332 14811 10628 11037 24978 32365 35600 27078 22873 31032 31691 24823 23869 18866 13230 15846 17070
18317 17070 18430 20820 21577 20369 22024 15829 15772 16294 15020 13250 12167 12788 15962 19969 15947 9978
18301 9978 4315 8735 13522 15015 15425 9641 -972 -2141 -3329 -619 4568 8467 9149 5500 6215
18286 6215 11728 10786 12310 16023 13562 14296 13335 15974 22238 26315 27414 30604 25540 24875 23649 25702
18270 25702 24504 26489 16879 9637 15101 25515 35078 39026 41104 41466 48288 53597 52580 48663
18256 48663 40515 36593 35593 29277 32136 32882 34332 37903 40536 45043 47468 44305 39257 36984 37701
18241 37701 30347 24642 18008 17152 18836 18896 21246 22322 27215 19634 14657 14124 16814 16705 22080 20440
18225 20440 19966 22804 23370 18689 19642 27430 30352 24593 21933 17929 17601 22933 23804 22958 23704 28709
18209 28709 26067 22139 21099 19434 17957 13490 24081 26324 27683 25801 23254 27429 27567 25298
18195 25298 24367 25936 31805 31686 32205 30198 23793 24420 29516 27507 25080 28568 30832 28792 28702 30316
18179 30316 27172 22043 22691 29655 27795 28357 30680 36411 38529 45660 49895 61460 80167 92653
18165 92653 98089 96645 96216 96204 107467 126506 147384 169053 182030 177932 156421 126561 105340
18152 105340 93102 85123 83414 84149 94028 107852 107699 105540 104470 100836 101497 109307 118351 114794
18138 114794 99175 87775 87922 91217 89338 92986 95304 95920 94861 99620 120774 143300 158112
18125 158112 180486 206166 238109 278850 323832 375781 444630 524909 605587 702022 851413
18114 851413 1081500 1457963 2132018 3392717 5748708 9604579 14568268 16186212 11994040
18105 11994040 7098691 4185034 2710731 1919940 1444751 1115466 868169 681651 545957
18096 545957 445775 370003 317984 284805 258136 246780 223489 202469 189116 184633 191145 210207
18084 210207 229326 232454 220371 194036 168673 164303 166972 172264 169947 158374 148803 164298 210573
18071 210573 281461 376071 470195 543071 577194 568909 527695 484760 452703 428577 388708 334103
18059 334103 280415 250143 231463 208085 178160 149374 135458 116954 105636 99362 97499 91365
18047 91365 86327 74657 71221 74137 78336 81895 90921 95292 101735 104802 100167 101482 106109 110521
18033 110521 120574 129065 130479 132650 137468 136545 132125 135779 142124 151400 164607 192309 216550
18020 216550 239763 248359 253965 269528 278108 289370 312073 334492 344930 359498 396899 447335
18008 447335 493195 548698 608303 653398 683594 720467 766955 792771 778632 771096 782433 771413
17996 771413 726430 683762 651469 612749 563822 501889 435880 378222 341592 306103 274169
17985 274169 263353 258420 237597 221152 222342 219300 213309 206248 196646 190120 192594 196571 188736
17972 188736 186136 185839 193545 209424 223009 227972 239930 256925 272742 288779 286737 288288 312848
17959 312848 342408 357879 354775 351864 352895 358004 369795 361152 347725 350904 360545 370112 366946
17946 366946 360770 355265 343933 319925 284115 246293 212504 185824 164116 148231 129437 119127
17934 119127 111133 113463 125733 132956 137028 135958 140117 150964 155961 151167 149068 149581 143743 130930
17920 130930 128800 129511 132969 135460 143933 149728 142880 143517 144528 149901 154016 149387 143464 135274 125508
17905 125508 113681 114246 119207 112564 104556 98504 91795 83727 72483 74762 80612 82704 81259 78794
17891 78794 75565 78116 82597 85866 78133 67474 54653 37323 31588 39116 43027 35640 42505 56091
17877 56091 70670 79083 93999 106345 113975 110429 110716 109376 105031 104303 102408 106854 112247 116817
17863 116817 114554 112862 118764 124162 119723 116236 129366 137506 139653 147894 156874 158761 161600 148927
17849 148927 143329 146744 140535 136398 140356 142193 140243 146679 164075 168872 174645 180733 179048 174280
17835 174280 174430 172763 170462 170954 175565 178206 180595 183572 207282 228389 239459 248471 253918 261790
17821 261790 275798 290919 320462 350886 383588 438606 511611 594544 687626 798576 886700
17810 886700 929897 962205 952337 913125 882812 863125 886344 965631 1100859 1284587 1501745
17799 1501745 1704160 1857770 1959558 2002460 2007066 2012064 2042089 2116837 2271608 2455140 2683925
17788 2683925 2959668 3259303 3600757 4017265 4582765 5337422 6491575 8427593 11749404
17779 11749404 17500574 26963184 40596571 55859877 72539726 88490874 93758156
17772 93758156 93730951 88514931 73433916 57883334 44876694 34894135 30859610 33704272
17764 33704272 43061381 56325927 71132085 87646891 95909993 95731594 92465676 78746817
17756 78746817 60931858 45357018 31305154 20668808 14066840 10186836 7819937
17749 7819937 6303849 5324352 4649013 4131774 3745832 3421432 3081128 2754186 2462557
17740 2462557 2171922 1948408 1814554 1767658 1786867 1861203 1933084 1915508 1845072 1725662
17730 1725662 1503302 1268689 1064129 895183 785074 740295 744564 782188 839390 907947
17720 907947 934714 916665 880927 797916 693399 595636 501928 434868 386978 352694 319389
17709 319389 302257 287949 278522 269712 264614 253728 247740 241382 240660 228668 215734 204269 193977
17696 193977 179828 169025 162589 153870 153692 155239 157864 153992 149326 145516 140901 127119 120789 108496
17682 108496 109836 110254 97231 83371 79231 76777 80976 86838 88100 90085 88820 84472 84844 90639
17668 90639 92959 95069 92969 94349 91530 85065 79462 87949 93517 93071 95731 106772 111323 123456
17654 123456 141827 149681 150863 168942 184083 185383 183384 174035 164903 152555 149358 143334 144487
17641 144487 151310 150585 152152 156732 154085 157724 170397 171993 156570 141611 142984 136868 121546
17628 121546 103731 82657 63410 44209 21517 9124 4577 583 -7079 -3491 520 684 -3454
17615 -3454 -4968 -663 650 6093 5734 -4516 -3398 -2935 -3449 -3176 -2644 -4754 -9958 -12098 -7862 -846
17599 -846 434 2547 10605 16402 21221 21850 20577 20769 24055 23498 22171 24250 27845 29937 32217 36975
17583 36975 42997 42178 37750 35310 41018 42299 40103 37602 37035 43803 48282 51878 57334 58049 54991
17568 54991 46346 49766 45312 41499 32692 26924 20150 16534 23229 21487 21421 23017 24003 19286 19410
17553 19410 25613 28246 28129 22941 16011 18440 21363 26872 29082 22710 14479 15748 18505 22044 26733
17538 26733 31611 36941 34647 35144 30144 28457 21518 19301 16305 12059 9500 9162 11839 15123 9347
17523 9347 10310 14493 14796 11906 8407 6317 8845 4978 -7351 -7099 -3532 -904 -2530 1335 11590
17508 11590 10584 20071 27011 26013 20627 10931 6793 3305 5705 -2275 -444 -496 551 -1701 -321
17493 -321 5634 16087 18047 16866 19074 15607 5887 -134 -7723 -9026 -2564 -318 6362 7231 13197
17478 13197 14071 24845 25289 21809 21533 19224 19689 21244 25752 29033 24987 15270 4570 -1599 -3077
17463 -3077 3103 3587 6827 7028 16227 24307 29627 24041 16687 1541 -13315 -18416 -15596 -9977 -2310
17448 -2310 8416 17398 20318 24284 32814 50144 66166 80140 70803 43254 19875 10940 7290
17435 7290 9908 9236 6033 8013 3983 7466 15035 11500 8825 13837 12831 12724 11148 18392 21483
17420 21483 14909 11654 3635 -2107 -233 9852 11677 4258 -4890 -2480 5375 7177 6569 7007 11654
17405 11654 8608 9513 3928 3255 4296 6667 5860 649 955 866 2955 4314 7234 8098 6215 5821
17389 5821 8986 8834 638 -3196 -2580 3763 1920 4761 1278 2757 10062 10084 8751 2787 6404 12112
17373 12112 9671 7574 14218 17315 11341 7882 6982 3704 5257 13469 13014 20919 28440 26771 20038
17358 20038 16139 14671 11918 10738 8236 6306 5859 9160 7014 2823 1003 -7352 -4924 -3697 682
17343 682 2730 -6087 -2029 -3778 -616 6611 9556 11542 10736 9110 2654 -1216 4632 5898 9805
17328 9805 11902 10476 8410 9478 9671 6930 9557 15065 15299 12817 8535 9976 9242 5167 5851 2330
17312 2330 -5796 -5104 -7632 -6205 -386 122 -1609 9003 18097 16619 8741 2818 1295 5674 11243
17297 11243 17692 16931 12539 10190 4556 1624 -1576 2127 8341 10046 11185 13386 22413 23539 19795
17282 19795 15001 11232 11431 12314 13413 15195 13208 11105 6577 7763 6817 6935 6727 2878 -4063 -8614
17266 -8614 3275 16422 10804 5417 9949 12768 10473 8539 2454 1432 2457 2097 4074 -32
17252 -32 5069 9086 6494 8681 14954 15264 14587 13318 14810 18547 14331 8139 8855 14814 15294 9930
17236 9930 5829 1527 2996 8522 9729 11899 16950 9898 10029 9893 7729 11722 7883 -1983 -3999
17221 -3999 -1447 -3740 -330 7274 17165 21611 17953 13514 16698 14027 11705 5465 10613 8899 6790
17206 6790 -996 -4026 751 6077 11015 9312 3561 4512 11733 12213 12049 12776 10363 5955 52 -2350
17190 -2350 8654 5556 6588 13656 16555 10517 6528 -698 1140 1851 -23 731 -4464 -1371 3316
17175 3316 9254 6871 1186 7913 13100 11817 13584 9241 7818 1741 1848 4741 9145 14625 22864
17160 22864 24742 19773 20750 17284 13602 17924 16696 17544 17323 11031 11065 20438 19238 19340 20669 26902
17144 26902 33819 26638 24541 20012 18180 22146 27991 34945 25339 22184 26725 30537 29980 28742 30391
17129 30391 40002 49447 57975 83501 128349 193352 272232 367505 465898 514793 521216 507752
17117 507752 444693 361637 293192 233107 200016 198779 229087 302349 373157 464628 534428 546126
17105 546126 531672 474532 379631 290154 214816 144492 93629 71200 52790 43295 35599 35301
17093 35301 35399 32848 32890 35162 36860 48650 43198 34786 35047 29656 27938 28920 30233 34617 45242
17078 45242 42125 33159 30353 26932 21876 18805 20430 25812 37226 41826 47984 48475 42640 26696
17064 26696 30832 26547 23892 28618 31415 39017 42887 42165 32949 30773 32086 35119 34638 26142 20422
17049 20422 21733 20850 23111 20352 18409 11660 13024 14820 17932 16787 11580 10544 11584 21340 21812
17034 21812 21195 12085 12135 21503 27804 32207 28617 24303 24898 25663 24933 25143 22104 18131 16682 14842
17018 14842 18366 27429 32754 28313 27023 28557 19037 16560 13811 23842 30422 30868 29278 36448
17004 36448 41748 38692 43978 45648 49276 55785 73759 107151 166721 248145 328772 420779 508110
16991 508110 532573 530254 501649 427004 334117 264413 211055 186836 198709 249075 318515 394767
16979 394767 482142 513123 500907 485005 416453 329277 253196 187345 127241 93223 69798
16968 69798 55993 44240 38561 32039 28420 31284 31717 27150 24908 24935 25276 25877 19088 14677 16175
16953 16175 13566 11378 14636 25218 18719 11084 7529 6604 12933 18283 21987 27318 24514 17850
16939 17850 9465 9242 17525 21583 16926 14983 13613 10484 4851 5208 9015 4032 -6468 -6252 -9147
16924 -9147 -14127 -9928 2116 9805 9879 9559 11106 10664 11153 8882 11976 19343 20555 12079 9394 13423
16908 13423 16047 6220 2641 10687 21855 20983 18636 16124 8663 7919 10489 4194 -4224 -1539 3519
16893 3519 6079 10448 12038 13262 10805 7663 6661 10999 11557 14300 10164 10092 10362 -1537 -3821
16878 -3821 4236 7181 19184 28705 28797 24054 16377 14545 25628 30897 29208 27085 23763 21699 24402
16863 24402 29138 23397 22305 32674 36260 37322 34004 29868 27925 32184 33509 31427 31015 33530
16849 33530 25077 22812 20234 16965 16464 16797 19917 22817 24096 25141 22546 17506 13002 13052 10100
16834 10100 12177 16649 18005 10341 6231 13112 12819 15235 13304 15413 22299 24374 25453 19881 18133
16819 18133 21900 26432 31665 29414 22928 28188 34308 33205 25815 22673 20182 24110 28413 33731
16805 33731 43814 45047 43273 39556 34396 33195 32300 35287 33815 26060 31331 32825 35702 43446
16791 43446 56858 70037 92130 125800 163308 201760 252693 303311 317516 304580 312944 298946
16779 298946 256014 234322 229438 234947 244171 273167 307543 315886 307165 302999 266419 214410 178998
16766 178998 144216 110464 82929 74320 67771 67506 62888 61112 61708 59223 52415 48954 48154 50565
16752 50565 61702 68842 72860 70932 65910 61141 57242 45444 37940 38850 35006 25748 28159 42700
16738 42700 45889 39776 43861 44769 43787 37359 36086 33944 39257 44351 45551 52837 59189 55631 53679
16723 53679 46523 36951 35060 34754 31222 38770 45370 51481 59850 59785 64129 59181 57525 52393 51804
16708 51804 57815 59099 59032 59241 57046 57076 65562 74227 70355 67985 65846 71262 72762 74562 79977 89398
16692 89398 93368 97244 89340 90467 89662 88570 83150 82055 77513 64137 58684 57828 58154 50550 55809
16677 55809 62574 66309 65247 66009 67115 65686 53174 50566 37803 34893 35194 30884 32723 32177 34964
16662 34964 37752 39959 44654 44466 44152 34532 30466 32064 33331 41115 42976 40005 47250 54043 53665
16647 53665 49916 52497 48762 41681 38224 36973 33029 28240 24939 29115 30450 22774 21376 22166 18401
16632 18401 17657 26055 35455 41156 45654 56108 52107 48347 47218 44559 42444 42156 45447 47401 51262
16617 51262 53458 67063 70000 72229 68768 59016 66265 65173 65614 68785 57265 53858 61143 72444
16603 72444 83770 90632 87845 86797 89276 88327 88990 95585 102194 102144 107271 112591 108301 104996 102907
16588 102907 101628 99775 102380 111052 114163 118284 125970 131568 131307 133729 128607 115819 98449 94317
16574 94317 94053 87782 78008 76086 71772 70598 74847 74642 94490 105513 103607 114828 124152 122816
16560 122816 125697 126428 132934 128020 132015 145846 144749 142878 143390 145395 149818 151099 153704 154984
16546 154984 147792 153377 169221 178622 183654 192249 189322 181328 179487 179131 168273 155741 145015
16533 145015 147031 153029 156611 162195 174356 182692 184256 192652 197469 203801 218529 224180 217178 208485
16519 208485 204622 201418 199943 205593 200665 201332 205470 210218 215232 217597 220569 229862 225580 219748
16505 219748 214186 209337 205340 197830 189884 188558 198073 203203 206237 219256 224386 233353 243028 263596
16491 263596 281708 284356 292357 312198 334591 358249 380430 400096 425445 451483 481263 515769
16479 515769 557352 618715 703673 824200 976739 1157436 1353720 1568493 1702215 1755548
16469 1755548 1786658 1729702 1641384 1586079 1562517 1590429 1700646 1898263 2175017 2510418
16459 2510418 2916787 3347866 3747613 4204207 4719519 5288911 6064087 7313172 9347908
16450 9347908 12879973 19013122 28860844 42482632 57200466 73608963 88883866 93247569
16442 93247569 93331242 89026640 74542769 59490197 47188922 37376190 33183978 35844298
16434 35844298 44767052 56850557 70499501 85814800 92548590 91819899 89110482 76382549
16426 76382549 59402144 44853339 31536978 21071723 14418234 10501567 8144383
16419 8144383 6650299 5648736 4938119 4431168 3983061 3601979 3270214 2954460 2657771
16410 2657771 2379180 2141159 1910907 1720997 1610186 1540944 1516025 1531227 1532077 1530436 1516876
16399 1516876 1456900 1380721 1272006 1154030 1026577 885050 760084 662737 579900 519857
16389 519857 478156 452218 416775 395591 383929 376974 358706 342256 326762 314030 302868 297881
16377 297881 283131 267003 259483 252155 247737 244928 244648 234827 219488 208322 196616 180131 168871
16364 168871 165663 168594 164493 162358 154489 151217 148241 142860 138722 133453 124529 115311 107678 104606
16350 104606 99793 93136 86919 83422 83268 82801 81521 85609 94136 94855 95789 92451 93708 94007 92358
16335 92358 93797 85581 77535 79591 83849 83371 88272 92541 95316 110131 125680 134113 147055 157550
16321 157550 175081 185452 176856 171465 170795 170586 169653 166175 154929 157479 154406 153490 158058 167966
16307 167966 166606 159703 159604 163386 160374 143828 132244 117254 108427 93010 74551 58397 43720
16294 43720 27216 16341 13635 14025 9311 3215 484 -642 3235 13792 17071 19105 19646 14066
16280 14066 7667 5742 5725 3080 3528 3572 1720 -1398 836 7385 7230 11111 13167 11553 16077 27612
16264 27612 28497 28294 29726 30932 29805 32015 32467 37905 43199 40854 41359 45093 50828 50055 47973 45887
16248 45887 50004 43633 35316 34324 33331 39005 49613 51115 47421 46572 47630 47208 40336 42248 48874
16233 48874 42752 41215 42440 35382 33569 30257 23571 32476 32162 43842 50581 58564 62543 61242
16219 61242 63253 67719 80151 92417 115246 151009 169078 170445 167738 150633 118635 96467
16207 96467 77718 60876 52030 47142 40811 35003 30159 33166 25587 22638 25298 22676 21371 26558
16193 26558 26271 26073 29454 22286 17424 13246 15463 16816 18002 22194 23119 24665 21857 24700 27489
16178 27489 22146 14987 10004 11658 25386 33660 32739 27438 18572 11111 16402 25760 27875 29375
16164 29375 41283 43521 37226 24768 13741 17717 24058 18190 6140 4741 8592 18450 24004
16151 24004 25462 19976 16483 12347 11906 10260 14820 27657 34171 34874 32164 22315 12693 13388 8139
16136 8139 2070 -2868 -1586 3677 5112 9017 9362 11275 15647 9497 2089 1815 2853 -7935 -12330
16121 -12330 -12814 -13437 -11047 -3938 -3005 -6186 -6066 -7667 -8185 -7839 -5595 -3224 -9151 -10446 -11755 -8738
16105 -8738 -6894 -8884 -12465 -16684 -16246 -11765 -8895 -10709 -8873 -11538 -12541 -7230 -2343 -723 -910
16090 -910 4935 9598 -24 -4423 -10157 -8007 -6129 -5123 -4059 -3131 -1965 9080 8643 2238 -4535
16075 -4535 -6987 -5119 -4970 -7460 -7385 -10514 -6847 580 -486 -7579 -12555 -19379 -17206 -9985 -2437
16060 -2437 -4391 -4676 -7964 -7712 -41 3977 3982 -3427 -12347 -14440 -13273 -11741 -11864 -17670 -14286 -10991
16044 -10991 -12312 -13594 -1082 4657 2748 805 2169 6364 1283 -5623 -5686 -8599 -11054 -12461 -11893
16029 -11893 -10867 -3111 -2452 -7371 -5670 -3328 -2351 -3468 -7574 -11936 -11422 -14526 -17601 -20861 -21183
16014 -21183 -17852 -15224 -14607 -7170 -3449 -332 -2371 -2167 -552 4830 4577 4499 249 6921 6191 -3496
15998 -3496 -1754 -4553 -3257 3431 3086 1455 3540 2191 599 -1660 68 532 -6662 -8225 -5009
15983 -5009 -7553 -6881 -6791 -6270 -1509 3999 -4549 -9311 -7265 -3712 -229 283 666 5502 3728 -1945
15967 -1945 3233 -226 3922 4925 -4665 -3245 -4843 -2513 -2404 -12299 -12548 -9140 -4100 -4878 -5037 -8149
15951 -8149 -2296 4864 5412 12106 6496 2982 4542 14477 14097 8669 5862 6370 7367 9532 15087 7643
15935 7643 -381 -7083 -1485 10148 15454 13203 10567 6169 3030 8322 10114 9259 11220 11882 14050
15920 14050 15429 18643 26143 30396 20955 19050 19116 17927 21034 25201 19213 16735 19031 21593 15806
15905 15806 15595 14908 15230 22454 37721 38287 32455 29261 38125 56595 76733 112089 169984 242990
15891 242990 325415 410935 493152 518344 517525 486095 404554 323753 258689 211785 195449 212500
15879 212500 260778 323249 392497 471556 509177 504636 485792 414843 325726 251525 181838 126832
15867 126832 86827 59013 50176 39869 31464 26640 20226 21395 22297 25314 24543 17528 6362 4236
15853 4236 3773 2279 3569 3045 4969 13010 12070 4902 641 -1500 -356 49 1575 1491 6167 4745
15837 4745 971 -4791 1189 7844 7747 5653 1155 6700 5119 6491 4197 2717 3191 2425 -2610 -7397
15821 -7397 -1311 9936 16976 17034 9782 788 -6367 -8028 -4713 -5203 -5172 -6715 -6282 -6920 -8586 -5954
15805 -5954 -3402 -9076 -11069 -5138 -1470 -3852 -7325 -3979 517 7314 6374 8643 7027 530 2263
15790 2263 3038 -3141 -2669 2589 5773 2850 -671 -931 1504 2782 306 460 2823 7538 2285 -366
15774 -366 -1230 3909 8836 6150 4342 7042 9165 1873 -1183 -1609 5559 7477 9640 7382 5975
15759 5975 5227 3596 5346 6690 8957 6554 -2509 -5723 4877 -562 -5484 -6220 -4644 1595 4234
15744 4234 958 2838 7520 14638 13041 10553 8539 3653 4017 2066 3144 3344 5502 11737 12157
15729 12157 6054 4750 80 -4545 -5749 -2043 310 6713 8666 6640 6180 3280 -2548 673 7928
15714 7928 15749 12537 5568 3324 2443 5343 4383 3549 -1502 -6857 -8039 -1909 6661 5509 -3397
15699 -3397 -3646 -260 5860 714 4409 4995 124 -8793 -13564 -11703 -13146 -10583 -6467 -1654 -3193
15684 -3193 -3897 -4956 -9642 -18418 -19677 -12233 -12270 -12494 -7331 -5357 195 5281 2649 -183 5124 6281
15668 6281 1775 -697 1484 147 -2302 -2882 -1608 -386 765 5046 5088 2919 2733 4829 7858 9917
15652 9917 4455 2744 -2022 -4344 -4749 2067 5029 -5160 -17351 -21623 -13071 -6551 -8884 -10208
15638 -10208 -6895 -306 -3563 -4203 -3538 -5619 -5771 -361 -1078 -181 -708 4166 17073 13179 10336 8308
15622 8308 5709 3940 6614 8185 9971 612 -6531 -7932 -5546 367 4782 3664 462 -3657 -4604
15607 -4604 -3509 -3840 856 3826 3651 7096 -2157 -1241 1088 2978 1082 -383 -428 -3349 -7483 -5592
15591 -5592 150 -2226 89 -6302 -8677 -2630 -1081 6072 11556 4892 -5379 -11487 -9056 171
15577 171 2716 -5432 -4568 4571 5905 2852 910 2389 8581 6341 3157 9532 6628 -5864 -8211
15562 -8211 -8052 -6926 -3350 -3634 -3548 -1541 489 2094 5274 9124 5955 2745 3568 1341 1067 449
15546 449 1412 3415 3751 158 -6391 -6017 -2395 -5238 -10296 -10354 -8644 -6926 -3579 -4105 -6491 -6114 -985
15529 -985 -2281 -12864 -9995 -6360 -4870 -1717 650 -1175 642 8265 3714 91 -2992 -12225 -12035
15514 -12035 -2666 -4842 -13568 -17789 -9258 -7670 -10294 -5853 -6702 -2126 4580 6460 5520 7358 8151
15499 8151 6386 -8945 -10424 -2371 2267 -3061 -9132 -7059 -11029 -16078 -14388 -7916 -13621 -18076
15485 -18076 -16562 -14815 -5928 -1896 -5421 -11567 -20558 -21690 -21348 -21677 -15011 -7879 -10365 -9564 -1482
15470 -1482 -455 -5662 -8286 -5321 -1543 3466 3047 -1440 -2866 -5373 -592 987 2945 708 -4461
15455 -4461 -3195 -4259 -7194 -437 3940 1765 4493 3642 1825 4073 1974 2288 3889 1886 -2738
15440 -2738 6169 15806 10089 6943 9921 8157 3711 -1145 -4861 -4469 1806 10205 10175 5779 7386
15425 7386 3675 351 5356 5571 8139 13394 19280 13267 6535 5805 9541 14247 9392 3916 4326
15410 4326 3253 4487 2513 -6772 -5766 -3574 4 5941 4887 2636 726 7451 13859 15161 11867
15395 11867 12753 4442 964 367 583 -3850 -3646 982 -1051 780 -299 -163 -3073 -7158 -3715 -1251
15379 -1251 1964 -3401 -2505 181 3093 3221 2245 -6280 -5559 -1275 -117 1499 982 5494 10214 18861
15363 18861 21328 11561 -878 1757 3737 4989 3440 5591 3486 5513 10520 13226 11904 11537
15349 11537 7068 3396 116 -2172 2485 5372 9909 10824 5195 -2028 3708 8195 15104 15954 17295
15334 17295 19964 23577 19476 16145 8016 -2235 -4152 -3564 68 3174 -2219 313 -3378 -11381
15320 -11381 -10699 -1385 -2319 -8529 -12555 -6734 -3764 -9358 -8187 -8702 -9038 -11345 -9367 -9400 -3714 1629
15304 1629 1185 -566 -4090 -6788 -7678 -10027 -10030 -11543 -10680 -10582 -9914 -9045 -13015 -15671 -9000 -172 5801
15287 5801 149 -5111 137 3525 11475 17369 13546 8140 3222 -2096 -5409 -9161 -7576 -2675 2263
15272 2263 9603 9653 6592 6970 5805 -7265 -2307 -615 -6603 -10807 -5914 -2816 5845 4785 -2692
15257 -2692 -11958 -12125 -8224 -3252 4014 5763 1132 -4206 -3922 -3791 -3694 -3573 -3084 -2048 -2166 -1955 -1897
15240 -1897 58 -2551 -6195 -5313 3908 2882 -2899 -6690 -5782 -2952 -2529 -9938 -13601 -8989 -2929
15225 -2929 585 1821 1989 1156 -2371 -1813 504 -1727 -1433 -3571 -4024 -500 -309 -2153 2750 -147
15209 -147 -4082 -2259 305 618 -4040 -2565 -2920 -3573 -7776 -5275 -3408 -2133 -580 629 -606 -100
15193 -100 -3934 -8956 -12876 -13592 -11891 -7499 -8186 -8478 -406 -2838 -5490 -4448 -4166 -3396 -4171 -7756
15177 -7756 -2784 511 1277 752 -3706 -8210 951 4410 -1580 -9593 -13923 -10280 -5884 -7764 -2534
15162 -2534 -1950 -3371 -12149 -9263 -8024 -5110 -2301 347 1701 3007 1616 -1086 -786 2192 -99
15147 -99 -6984 -11163 -8785 -8327 -9627 -10208 -8575 -9622 -6326 -6083 -7059 -9249 -14575 -7717 -1013 -613
15131 -613 2504 1660 1542 -4276 -10390 -14854 -12893 -7959 -7622 -10483 -10923 -7023 -5037 -10101 -11689 -7891
15115 -7891 -2928 7381 7027 1982 1900 1616 -255 -3536 1228 7186 7754 3109 4378 6650 -6 -10141
15099 -10141 -4613 191 -5897 -7099 -944 -997 1867 -2319 -5278 -3100 -6716 -8854 -11268 -8623 -2445
15084 -2445 -594 -535 -2541 -3582 554 3491 2514 3397 3109 1420 -5488 -8797 -10676 -10854 -5024 -4548
15068 -4548 -4020 -4708 -7724 -1154 574 -6212 -10341 -12273 -9884 -14163 -20391 -19101 -10148 -10813 -5115
15053 -5115 -1703 -1061 -217 -3145 -2931 -9147 -13769 -4576 -2842 -5858 -9487 -2918 -341 988 2634
15038 2634 194 -3709 -9334 -2375 381 508 223 2753 -560 -10217 -15490 -18161 -13802 -8124 1477
15023 1477 -5218 -13258 -18723 -18707 -11265 -8321 -7106 -1367 1710 968 -924 117 2227 2123 4150 6123
15007 6123 12458 12342 7015 5842 267 -1685 -4730 -12598 -11070 -3409 -1091 3745 -992 250 -1191
14992 -1191 -2137 -6076 -5424 -1398 1246 -2124 -5922 -4105 -5996 -4118 -2436 -6763 -8646 -6524 -9063
14977 -9063 -4141 -4458 1192 -2720 -6830 -4906 -4471 -1386 4905 2710 -6383 -4509 -1052 712 -4360
14962 -4360 -9195 -3275 1748 3700 978 4513 4578 4994 -936 -8361 -9295 -4710 -1754 -3779 -3092 2399
14946 2399 -931 -4833 -4729 -2141 -3423 -5180 -6482 -9502 -8318 -7419 -12558 -12053 -5688 -208 -2646
14931 -2646 -4215 -5152 -1257 -1646 -3255 -7619 -6974 1082 6603 -2374 -11788 -7403 -6342 -1097 -3042
14916 -3042 -3430 -2024 -2233 -9105 -11438 -4899 -7005 -3862 -5265 -16259 -11986 -4410 -10436 -11395 -8370
14901 -8370 -5925 -11843 -20313 -25499 -19179 -19373 -19161 -9041 3807 4137 408 -2696 -8437 -5655 -14263
14886 -14263 -13219 -7043 -4948 -9698 -6853 -1297 -2917 -4819 -2600 -6746 -8126 3396 3223 -3021
14872 -3021 -5043 -1728 -4178 -5955 -1041 -47 1283 6680 2300 -5378 -14684 -18470 -14933 -5241 -521
14857 -521 5307 14519 12078 2590 -4467 -4956 -3484 -5711 -11434 -14597 -8781 -5626 -994 -2740 -8381
14842 -8381 -3507 1008 3661 3889 -3116 -6087 240 8800 13990 15028 16730 12949 5694 1115 -4674
14827 -4674 1066 4504 -1387 -5444 -1117 5754 265 -935 3156 6029 2510 -277 -2309 -6242 -3309
14812 -3309 2626 3581 -2912 -9088 -10344 -6743 -3583 -3712 -5424 -1781 -6069 -106 1945 68 2591
14797 2591 4512 11509 12255 7312 2410 301 -1818 -6173 -8261 -5524 -5907 -4804 1655 -655 -5675
14782 -5675 -6797 1357 2690 1740 -4382 -6459 -1316 -4587 -4958 -2191 -594 -6612 -7804 -4292 -6753
14767 -6753 -8661 -6521 -4620 -3208 -5527 -4241 -3838 -3039 252 -4608 -6667 -9668 -11129 -12392 -14217
14752 -14217 -19218 -16296 -7967 -338 2310 -2912 -5287 -6041 -8348 -2738 2533 -1391 -2734 -80 1798
14737 1798 -1233 45 -1551 -1886 -4654 -9549 -7711 -4843 -2624 -5393 -3612 -8348 -6806 -4621 -1712
14722 -1712 -2690 -3203 -7664 -14552 -13249 -10512 -8388 -2050 1261 -3112 -1358 -361 937 -64 4393
14707 4393 6413 7615 5213 -1274 -6950 -7449 -3119 -3539 -8941 -6720 -892 -3538 -3403 -7537 -5054
14692 -5054 -1997 -2999 -754 -2127 -2522 -2249 637 1717 7661 7178 4964 5626 5273 146 -2967 -2446
14676 -2446 -931 3320 3559 598 -2888 1025 6995 1559 -486 1176 297 -5949 -7535 -7224 1082
14661 1082 -3665 -8844 -2957 -1444 -6021 -4077 -1739 113 3426 4381 -5948 -8750 -9509 -3708 -4770
14646 -4770 -3230 6055 5127 2432 -6239 -6317 -1600 3572 -6191 -5688 -9005 -8104 -1884 6112 8541 7188
14630 7188 6991 -636 -1490 -3948 -3230 -2761 -1575 2086 1457 -2478 -7054 -9767 -9216 -6228 -8069 -4716
14614 -4716 -1866 7120 3353 -9434 -9659 -8833 -3057 5106 7999 11446 6295 3285 3883 2406 2072
14599 2072 398 849 1656 8340 13673 14910 14969 14105 8654 4215 554 -3552 606 780 -1179 2269
14583 2269 2117 9706 19264 20620 16071 14946 16749 11900 1499 -4075 -7219 -3901 -3828 -7124 -13771
14568 -13771 -10569 -6443 -4327 4005 15131 18140 6324 -5680 -7964 -8342 -6905 -2012 3985 3156
14554 3156 174 -2020 2213 5409 -183 907 3941 2727 -1162 -452 1077 -1288 -4467 -950 4119
14539 4119 5605 484 -3659 -11938 -14082 -10370 -8932 -5955 -3327 -10034 -12999 -11231 -7437 -1093 -1153
14524 -1153 -6994 -7515 -5591 -4264 -5333 -6162 -3275 -4197 -2219 -7835 -18262 -12658 -5641 -814 1959
14509 1959 7808 5938 3919 2237 479 -4617 -8380 -6772 -723 2662 -2689 -9597 -10661 -8054 591
14494 591 4693 5728 7141 5835 1503 -391 897 2680 1612 -774 -5782 -6824 -7310 -4584 1161
14479 1161 -3853 -8159 -3002 1427 2005 3214 -3153 -8357 -5561 1752 1502 6071 10201 4766 25
14464 25 1570 2482 8254 5498 -2510 -3956 3930 6359 1271 -4922 38 7103 4895 4064 6020 -124
14448 -124 -4490 -4348 4457 10410 9537 6423 1709 5770 6670 6934 6994 3282 -1570 -581 -2264 -3296 1623
14431 1623 4118 4309 4941 4236 84 -2975 1539 6551 9695 9952 5002 4519 -4529 -11498 -12884 -9253
14415 -9253 -5435 1157 8695 9651 10460 10148 12152 16369 11381 2067 -3405 -3439 802 3185 4143 5931
14399 5931 13008 11067 6666 9116 4785 -1434 -5833 -5015 -8578 -6627 -11830 -14604 -8797 -2075 4531
14384 4531 3715 -2003 -5010 -4910 -5031 -8432 -6351 -7138 -4805 -6213 -1129 4924 5344 -3581 -12260 -8488
14368 -8488 1196 8151 1052 4534 7430 4816 6270 6488 -476 -125 -1924 -3312 -2977 -3630 -1960 -6771
14352 -6771 -10959 -5831 808 2262 9942 10288 6716 2543 -3173 -3919 -8325 -8206 -5333 -10377 -12057
14337 -12057 -13137 -13616 -13511 -13833 -12272 -7594 841 4896 4398 887 4227 872 1743 5096 6248 7276
14321 7276 6685 8427 9572 8663 5004 4482 841 -490 927 1265 -5395 -9978 -9549 -8051 -9680 -5735
14305 -5735 -7107 -1023 6334 6710 1098 -4086 474 2014 1761 9529 13298 12577 6693 7070 1248 -1435
14289 -1435 3513 9797 12148 7147 6529 3115 -1822 -1613 -3845 1178 -2748 -5044 -1361 3547 4031
14274 4031 3777 7935 7032 5168 2347 5753 6075 335 -3305 -3765 -7968 -5337 -2284 -839 3372 1986
14258 1986 -4665 -8656 -9137 -6908 -13132 -14826 -7676 -7527 -8898 -6545 -4945 -6169 -5502 -5906 -10186 -11312
14242 -11312 -11888 -13303 -14576 -13770 -11955 -13145 -10626 -9358 -9020 -3311 -3201 -770 2940 4488 7126
14227 7126 5037 -4173 -6756 -4100 -1143 -2188 -2226 -5671 -6669 -2165 -1368 -780 2195 1299 2526 9559
14211 9559 14853 9888 8550 8763 3544 -3619 -1016 5422 9279 8803 3137 -3940 -8025 -7513 -5969
14196 -5969 -2416 -1803 4193 5083 7013 2664 3515 203 4649 5966 3232 -546 -6217 -7142 -5138 -1619
14180 -1619 681 -1442 2462 1393 4147 1901 605 -2060 -3960 -8080 -14143 -11017 -6820 -6586 -8361
14165 -8361 -1900 -3161 -12951 -8897 -8388 -4791 -4277 -1056 -2181 -2517 -927 692 -996 635 1081 -1649
14149 -1649 -7373 -11226 -3248 7870 7898 2910 -2670 -270 3246 -3260 -7439 -11516 -17405 -13026 -9976
14134 -9976 -9431 -10805 -11830 -13271 -14556 -18998 -17890 -17900 -12438 -7908 -7502 -4689 -4019 -2713 -1434 1942
14118 1942 326 3981 2726 2230 -3112 -4948 -9001 -6720 -2493 -2815 -7278 -7750 -5110 -4046 -6570
14103 -6570 -14576 -10630 -9831 -9172 -841 1799 -2592 -10882 -9720 -6055 -6726 -8760 -6223 -4775 -6869
14088 -6869 -6353 802 1548 -1668 2057 4169 4483 7902 -464 -9838 -10420 -12078 -6334 -883 -2301 -365
14072 -365 -4795 -3689 -1991 -5803 -9467 -11607 -10532 -9473 -5101 3223 9121 -514 -7969 -7004 364
14057 364 6310 4619 2739 387 -2080 -4192 -651 2847 -4362 -1993 -3140 -6653 -5154 -2105 -1483
14042 -1483 -3731 523 3539 -4924 -7965 -3557 2295 940 1536 -1299 -7273 -12833 -13756 -9448 -3418
14027 -3418 -4013 -5655 -3637 -1131 181 743 -853 -2934 -6727 -1546 3504 8259 5903 2914 4686
14012 4686 4111 4630 1417 -796 2103 1723 -4428 -5812 -3726 -3482 -1182 -2432 -2626 -5762 -4224 -5221
13996 -5221 -7134 -2366 -2594 -1990 -6315 -10104 -8547 -7701 -10708 -4080 2179 -152 -2724 2654 -5106
13981 -5106 -6704 417 6401 4429 -4891 -2540 -4449 -6686 -7521 -1273 563 2427 1 -4181 -4204
13966 -4204 -2852 -2080 -1827 -1202 -1026 -2868 -6252 -8972 -5760 -4169 -7709 -8242 -11840 -6517 823 510
13950 510 -5584 -2123 -1739 -3385 -2790 2425 4014 5119 4399 2502 -2180 -8644 -11807 -3284 -6407 -8336
13934 -8336 -2206 386 -297 -667 -6506 -9105 -4498 -4172 561 -1099 1456 518 -1509 -5276 -3133 -8589
13918 -8589 -8750 -5640 -7928 -8244 705 482 670 800 45 5649 9963 3501 984 -1161 -10185 -15640
13902 -15640 -14657 -9361 -5398 -5916 -5295 -521 -395 -6478 -4043 -1819 -6117 -3803 -7785 -10371 -6033
13887 -6033 1441 7629 3535 -3582 -2236 -5770 -6185 -6051 -15154 -14143 -18652 -18219 -10744 -10339 -7761 -2111
13871 -2111 -6926 -16751 -14833 -7700 -5194 -8221 -5111 -4977 -8774 -5553 -2900 -1311 -3476 -5445 -9238
13856 -9238 -11969 -14505 -8487 21 5918 2742 -4897 -9713 -9985 -11464 -4008 1196 -3317 -8646 -12801
13841 -12801 -3818 715 -1167 -5716 -5753 -5425 -11036 -13914 -9992 -5419 -5599 -9429 -13166 -10533 -6616
13826 -6616 -2432 -8935 -9514 -5532 -7647 -6558 -2405 -163 -589 -3961 -3690 -9543 -8607 -4800 -1533 2401
13810 2401 7802 6584 824 3207 92 5021 14339 12849 13710 13248 8961 8535 10719 8554 4225
13795 4225 -531 -1034 2904 2090 -51 -4334 -7548 -7955 -5008 1644 12045 10034 73 -10772 -4972
13780 -4972 -2 5065 -564 -3039 -692 6384 6880 194 4415 5981 1782 1243 2208 3673 7962
13765 7962 9767 6044 -620 1603 45 -844 -1389 -6077 -3299 -4076 -677 1792 5578 8599 7944 -167
13749 -167 -4174 -4126 -1226 -6841 -2608 694 4058 6255 5702 12545 4971 -9535 -7616 -12158 -6873
13734 -6873 -3268 1068 2794 3116 808 -4891 -16028 -19435 -12160 -10535 -7280 1851 4592 3017 6135
13719 6135 2304 -279 -6335 -11170 -7445 1091 -2122 -5462 559 868 -3920 -6536 -3716 -2770 1592
13704 1592 -344 3749 3270 1220 -327 -1051 3142 8308 10031 8661 5078 2947 -3152 -7834 -8394
13689 -8394 -12042 -9708 -8330 -12861 -12079 1479 698 -5235 -5214 9 2126 4386 2443 57 3564
13674 3564 4024 1747 4190 8721 5669 7928 4668 -4681 -2810 -6417 -7416 -6645 -2676 -1771 3938 6010
13658 6010 4217 -766 7373 2649 3052 5752 9876 8845 2967 -1455 -5908 -4851 506 -666 -1439
13643 -1439 -2310 1443 7799 4667 406 -9116 -11911 -9295 736 8069 9417 7235 1788 -696 -1165
13628 -1165 -1251 3218 3728 295 -11 -4873 -9419 -6723 -2947 -6555 -7084 -12921 -10035 -2597 -1747 -1338
13612 -1338 7013 11215 14810 13965 7322 -4909 -9988 -8288 -10087 -8772 -5462 -4456 -1786 424 -3316
13597 -3316 -5435 -3073 -5622 -4787 -502 3958 4830 -3084 -914 2765 -4097 -10597 -13432 -14139 -7838
13582 -7838 -6383 2265 -3275 -15002 -13777 -11623 -13429 -11762 -9568 -4199 -1398 -5480 -7898 -3085
13568 -3085 573 1748 -2559 -2751 3310 3644 -649 -4445 -796 1574 5937 10938 3206 -2078 -7586
13553 -7586 -5456 63 -3805 -2212 3127 5290 55 -930 -3745 -2668 369 -220 -5177 -2166 -901
13538 -901 3449 7565 10238 9149 3004 -2528 -7554 -10136 -7863 -8018 -5788 -7566 -8810 -11683 -18356
13523 -18356 -21801 -13576 -4733 2204 2889 3341 -7889 -11095 -13507 -12151 -12311 -14076 -10183 -1841 -3700
13508 -3700 -7818 -7152 -3406 907 -1331 -2905 2205 4170 -2182 -10851 -5592 -1710 -5677 -8627 -11660
13493 -11660 -11978 -8184 -8748 -6928 -7853 -12263 -7792 -3404 -5324 -3076 2148 1055 1586 1533 -5165 -8516
13477 -8516 656 4393 11944 14492 14874 10879 12214 7568 7916 8771 2255 1088 104 -4198 -928 1386
13461 1386 1772 3578 4760 7243 10809 6536 4235 553 3290 9532 7386 11077 5400 2180 2508
13446 2508 1624 -5669 -4933 -632 2259 4796 3147 91 -1809 -7319 -18066 -23207 -22026 -23000 -21129
13431 -21129 -19164 -8093 -4516 -4124 -1747 -2617 -1508 -1873 1985 3198 -4696 -8589 -5599 -8766 -15406
13416 -15406 -16792 -17065 -10765 -8876 -11786 -8433 -4551 -454 2607 5107 6225 -3751 -4738 917 103
13401 103 1589 7383 1860 3256 -39 -6160 -6640 -9275 -11182 -7506 -7013 -2175 -1846 -4910 -4352 -8244
13385 -8244 -13437 -12576 -3500 -3828 -4453 -1077 -896 2967 333 327 7333 4304 5169 -745 -3920 -2874 8411
13368 8411 3882 530 2767 2202 -10 1825 1779 -248 3544 1849 3026 3709 5349 6820 4579 10031
13352 10031 6998 -784 -1600 467 1125 3657 9420 7545 3953 -360 1165 5140 720 -5516 -9026
13337 -9026 -11562 -12605 -11645 -12390 -10210 -8582 -5946 -3839 -3308 2110 181 -2158 4861 5475 2824 2813
13321 2813 5795 8665 5314 2835 1254 4224 1757 -2542 -3895 -1736 2446 2914 3467 2512 -1971
13306 -1971 -8724 -10685 -12308 -15290 -14093 -14907 -15642 -12778 -9943 -9074 -12663 -13561 -6783 -3854 -12981 -12660
13290 -12660 -12784 -5616 -780 -3136 -4530 2761 8728 5490 3523 -2480 -6647 -3053 -3997 -2782 -886
13275 -886 -2252 6384 15268 16049 9030 4754 6370 4796 -1740 -5110 2500 8561 7224 3817 3565
13260 3565 325 -3360 -7485 -8085 -9615 -4869 6752 5882 176 1517 2884 -5329 -7277 -9476 -14597
13245 -14597 -11599 -8177 -5039 -1258 1010 1200 -4407 -4844 -431 -338 958 -465 -324 -7008 -2194 3477
13229 3477 7824 6403 3056 4716 -1457 -6533 -5252 -12433 -10914 -8405 -7385 -535 -831 898 5674
13214 5674 8647 11496 7155 3330 6598 11436 7856 8099 2899 -6430 -3813 -3629 -2448 -3025 7811
13199 7811 15220 10749 4307 4882 2574 3561 3881 4572 -4044 -6932 -8225 -7119 -892 6521 -1721 7
13183 7 1705 -2746 -3019 -6128 -2408 4005 4331 -4000 -8320 1608 9280 12455 8445 8146 4150 501
13167 501 2922 -1131 1827 2777 3878 3180 1983 5325 811 4609 5131 -811 -7261 -4913 -7525 -9779
13151 -9779 -6887 -1351 -3296 -7972 -7712 -5210 -7927 -9157 -2303 -988 1852 3635 -4236 -3275 -7474
13136 -7474 -12578 -7726 -4662 -3209 -6341 -2446 3040 3507 3257 -4306 -3382 -2107 6308 7430 3285
13121 3285 931 -2947 -7086 -4782 -2784 2669 5132 1179 4478 5747 264 -1848 -163 1293 1487
13106 1487 8 -5418 -6092 -7271 -8916 -8024 -2201 -402 -3780 -3416 2416 -3398 236 -135 -309 5984
13090 5984 10003 9232 7679 1018 -1899 -9728 -5402 11 -481 -4706 -5991 -19 -577 -4893 -11627
13075 -11627 -10054 -15464 -17750 -9216 -2884 -6807 -11559 -17676 -15129 -8198 -9430 -7067 -3434 -1769
13061 -1769 -7586 -64 1507 755 3449 11361 -950 -6015 -4995 -8033 -818 -849 -761 7502 7439 1040
13045 1040 3727 4518 -1379 -1852 282 -11259 -17779 -12867 -9610 541 6111 4647 4557 -468 116
13030 116 -3401 -2187 -6084 -10535 -10808 -6534 1362 9568 7116 9362 11016 -1483 -3348 1655 2162
13015 2162 2038 1333 3635 -3893 -6404 -1994 1405 4803 5260 4839 7767 7417 4540 -4840 -13052 -9677
12999 -9677 -1014 4818 8695 4386 1604 7899 7940 9309 7632 7841 6180 -2211 -4366 -3843 -11721 -16090
12983 -16090 -15374 -6349 -3733 1797 653 5452 11172 5564 1793 -239 2862 1389 1201 4495 6749
12968 6749 3009 3 -4094 -11167 -10718 -4232 2008 6128 187 -949 -554 -638 -2650 -7292 -1276 -4025
12952 -4025 -9351 -9244 -3233 -6546 -11839 -14608 -5868 -3253 5958 8513 3436 -135 -174 -1654 -7262
12937 -7262 -7125 1020 3542 6278 1377 2272 -534 2876 2701 2256 5087 10503 6057 2860 959 644
12921 644 4760 8518 7814 4132 3754 2321 -5120 -4381 -3524 -5109 -3400 -6257 -12922 -12365 -4521 3815
12905 3815 7776 4690 574 2019 -2450 -5754 -4879 -2959 -1366 2499 3458 1550 4340 2595 -2198
12890 -2198 -4309 -6219 -8975 -9682 -9417 -5347 -6804 -10962 -6487 -5265 609 1753 -5126 -1080 -1150 3969
12874 3969 808 3971 2790 -1988 -3374 -4333 -4885 -6854 -7383 -5643 -3522 -5297 -11341 -10819 -95
12859 -95 3421 1744 -2373 -3361 -2482 -3240 -1930 -3551 3986 14609 8595 6470 786 4721 5011 883
12843 883 -911 1008 2871 1166 2080 12818 5721 -3458 -2942 -7049 -14425 -16477 -10333 -5856 -9759
12828 -9759 -13601 -14608 -12106 -8705 43 3374 -6386 -6459 -9022 -1824 4884 676 -6439 -13978 -10162
12813 -10162 -6698 -7068 -9013 -9294 -7509 678 2456 -1199 3401 5166 4077 6946 8656 5874 2672
12798 2672 -2355 -1272 2041 -5559 -11918 -12758 -10237 -6528 -2677 4105 12234 11947 6569 4511 761
12783 761 -7294 -4541 -2842 -3651 -5847 -8235 -3234 -1140 1900 -1168 -1656 2078 3825 966 1149 -4409
12767 -4409 -4231 -4198 -10421 -12050 -7022 -1998 81 -5673 -9904 -9382 -6434 -3432 -2583 -1054 10941 7051
12751 7051 3431 2796 3778 2462 -4253 -3594 -3082 -5470 -12015 -17781 -14419 -14551 -17139 -5956 5509
12736 5509 4950 7150 -1150 -12625 -17538 -14614 -8944 284 3679 4225 3918 2020 2162 2040 935 4405
12720 4405 -196 -3071 -3313 -5540 -7437 -10261 -14625 -9220 -6615 -5723 -1856 -4107 -8168 -4283 2226
12705 2226 9093 10829 7370 237 -6967 -12637 -12103 -11452 -6191 -1773 -4118 -9704 -13534 -20259 -20552
12690 -20552 -6901 6248 6703 5671 636 206 1688 5791 4418 -4173 -4463 -3459 -5071 -9638 -11987
12675 -11987 -10646 -3372 -52 -5730 -9632 -6984 -5425 -114 -501 -4599 -318 1212 2411 7473 1019
12660 1019 -5408 -339 4016 4598 4297 8314 10329 10395 7589 5490 462 -393 -4413 -7078 2949 4884
12644 4884 3945 6043 6249 8278 10165 1090 -5089 -2278 2592 12653 12929 7713 6256 7451 9052
12629 9052 10494 7399 6264 3849 2198 404 -3724 -2100 1599 3748 1733 -327 -846 1519 5937
12614 5937 690 1284 8267 377 175 -2824 -2749 417 63 4615 2745 -2807 -894 -865 -657 -1262 382
12597 382 -8370 -11644 -9231 -7526 -8840 -12304 -13770 -12977 -4749 7260 10181 12082 8214 4120 4826
12582 4826 2271 2215 -1920 4420 809 2845 2200 -3345 -2447 1868 5963 5626 11773 12841 18236 11889
12566 11889 12613 13987 11870 8089 8702 6329 8658 8027 2303 481 3305 4905 4434 -638 -4089
12551 -4089 -10357 -6006 -4889 -7020 -9471 -8639 -4682 -6004 -7532 -8103 -2049 1706 2808 275 -2898
12536 -2898 -6398 -7175 -7769 -492 2280 2471 -5909 -2052 4929 -1474 -11535 -10724 -2860 -19 2640
12521 2640 -4559 2926 12137 8705 -989 -4944 -8411 -3140 2634 -1001 1025 2822 7760 9341 8465
12506 8465 3095 7447 9598 294 2896 1270 3180 2587 1832 5034 7708 11282 7609 11100 17231
12491 17231 17421 10800 11781 8619 2804 -1670 -602 5951 21437 19645 10674 -2972 -7861 -7999 -6666
12476 -6666 -8700 -3362 2885 -2408 -6470 -1629 2573 -1284 -3458 1705 2952 9715 14137 11092 13661
12461 13661 12383 5128 -1156 -3938 -4326 -9030 -14277 -13720 -11476 -2718 -2140 -10018 -14779 -6997 -5719
12446 -5719 -3064 -1121 2417 3977 6853 1340 -6422 -6891 -3667 180 -3755 132 135 -241 -2924 -3049
12430 -3049 -6697 2273 10769 7056 3297 2125 755 658 4574 9231 6729 5007 800 -1260 -1633
12415 -1633 247 1859 4467 8004 4448 4684 4482 -904 -3981 -1167 -1956 -6437 38 5872 6041 -3896
12399 -3896 -7013 -1556 3590 6792 13671 10385 12789 15838 13854 8173 6676 1510 1343 -1950 -4498
12384 -4498 -1681 -3521 -983 1095 2664 -599 -1871 -1196 -3898 -3492 -3111 -7718 -7919 -6525 -7692 -6247
12368 -6247 -7006 -6859 -839 505 2535 5946 5325 -1395 -2690 1640 1661 -5409 -6863 -5159 2529 4998
12352 4998 8451 5260 -77 3731 3030 4798 7617 6646 2405 -600 -2137 -5765 -7520 -8732 -5921
12337 -5921 -2241 -5384 -4560 -2536 1829 640 927 -1117 1876 6347 345 3502 2025 -1238 672
12322 672 2474 1691 1298 -2920 -946 2577 -487 2589 7807 7370 6002 6443 6530 4159 3975 2096 -1575
12305 -1575 124 6541 5531 -516 -1232 -1725 3146 3346 2718 6855 8810 5310 -3254 -1255 -4291 -10027
12289 -10027 -8471 -3159 225 3767 -6941 -13944 -10054 2263 -1244 -4522 -2856 -4226 2004 3943
12275 3943 4405 5793 2366 3577 4388 -1211 2235 6665 4407 4879 6817 8701 4918 4873 10300 7968
12259 7968 5769 4621 4466 3350 7350 4276 -3908 -8854 -9797 -10639 -2202 -77 -6568 -13404 -6522
12244 -6522 1100 -1154 -1687 -258 -1 4176 -1649 -8060 -6315 -7483 -13895 -11488 2474 3319 2409
12229 2409 2471 2677 240 3769 6893 6119 8303 8043 4171 3714 5263 4586 -193 1852 9834 17223
12213 17223 19986 19734 22189 17592 4717 4216 8650 3606 4329 12086 10265 -367 -2143 5264 15518
12198 15518 17886 17297 16875 16591 15225 15760 16910 10455 5820 -3878 -5700 -2510 -1701 -4359 3199 2195
12182 2195 -3173 -359 8707 7276 4427 1050 -4991 84 -540 3476 4707 6112 5356 2359 -4925
12167 -4925 -2943 -4114 2294 8569 1273 799 -889 2122 -5081 -12016 -8188 2238 5366 4755 3973
12152 3973 5948 11172 10836 9523 3099 5418 9474 7018 9312 9655 7921 11609 7086 -2599 -4600
12137 -4600 -5574 -7028 -6587 -7785 -1186 -1746 3223 9888 17926 13975 10146 2661 3183 12713 15715 12401
12121 12401 10832 1093 -3536 1753 2691 308 690 5531 8160 6268 6746 6607 6281 6851 6308 3139
12105 3139 -4239 -8955 -11427 -9105 -7418 -4115 2932 6423 3678 -3763 1099 3945 10462 17262 14947
12090 14947 6748 1120 -501 -1819 2733 6079 7097 12072 11780 9610 10460 7543 7226 -684 -7650
12075 -7650 -7544 -9142 -6120 -2766 929 8318 13354 9047 2055 3479 1440 4933 3233 2801 7033
12060 7033 5089 3630 -392 1507 -2481 -6359 -1404 -3233 -2318 2518 1426 -1736 -2891 -8 1486
12045 1486 -2457 707 5798 7076 1796 -2024 -3156 -2522 1404 -1772 -2672 542 1904 9000 9619
12030 9619 7805 2396 -293 4286 10145 10228 7921 8163 9584 12599 8415 7907 7013 11609 17224 14051
12014 14051 7210 11480 4940 -5085 472 4200 4688 5495 7700 6656 2411 5314 3995 -2015 -2003
11999 -2003 1115 2698 13960 18276 7023 -2870 -987 395 5119 10251 5979 -1178 -3107 -9366
11985 -9366 -5557 -2277 -5962 -6699 -4101 -2068 -1213 -1631 -2718 -2759 -2918 -560 2501 -139 1509 2800
11969 2800 3320 5169 493 -1884 4523 6507 290 -98 608 1830 -2709 -6099 -7068 -1968 -801 -3668
11953 -3668 -975 3607 3084 190 -2522 -8630 -4372 -1106 -2141 -4988 -4919 103 2665 4377 9624
11938 9624 5268 -4023 -2551 -461 -2886 -5539 -7479 -7316 -5171 -6636 -8533 -2479 3295 12472 15310
11923 15310 9067 4557 1090 -6159 -13285 -10514 -13264 -11051 -7454 -6797 -9149 -9727 -12276 -10284 -13603
11908 -13603 -15665 -9624 -3029 2059 1206 3012 3400 436 3534 8506 6423 -4238 -13640 -5414 -743
11893 -743 -2880 -6626 44 705 -1864 5402 6765 3380 4559 3967 5610 1869 2751 4833 3163 3026
11877 3026 2825 2274 3017 8366 6187 6991 9631 3232 -3250 -1164 1808 -760 -3859 117 3219 3650
11861 3650 10397 16278 17455 19353 15611 12293 8243 2132 1911 5300 2456 -410 1582 4135 3750
11846 3750 -2889 -13760 -10870 1689 -1059 -713 1997 5884 7611 6106 4354 4327 2669 -34 404
11831 404 4065 11584 4699 1327 -597 -6342 196 1297 -3258 1942 1450 -3395 -6196 563 5731
11816 5731 7316 4558 7000 3524 -3983 -5968 -5833 -10232 -8426 -12486 -7278 -6005 -1591 4566 4566 -3884
11800 -3884 -4020 -2895 -1202 -2690 102 5170 6565 7482 6907 9090 11114 8262 7285 9914 9473 146
11784 146 -1717 209 4047 -3098 -9397 -4144 -2307 -1841 -3187 -2808 -5618 -7874 -2105 2152 1686 -3086
11768 -3086 -6613 -8950 -6992 -4856 -11931 -9215 -8647 -4997 4085 11847 5446 689 350 -4934 -5369
11753 -5369 -2441 1860 3884 3226 3131 4736 4825 2084 -2477 -923 3021 -2912 -3500 1548 206 1877
11737 1877 12495 10619 -1392 -5325 -4701 -2839 3829 8020 7688 9728 4891 -2296 -7486 -3775 490
11722 490 -2769 -1254 2206 -1637 -4748 2065 9579 10012 10496 3888 8012 11747 10086 4554 12887
11707 12887 19036 16909 4599 3089 495 758 900 3440 5042 6638 10671 7938 5199 791 -5103
11692 -5103 -15700 -12460 -4920 4594 6645 6196 15812 19861 14995 7805 991 7890 18374 18046 3310
11677 3310 -1695 2916 5996 6168 5857 2088 229 -4619 -1210 5329 629 -4873 -4123 2040 -2251
11662 -2251 -2499 675 286 4263 12175 11846 12179 12135 9053 902 2959 -833 -4889 -7496 -10391 -14343
11646 -14343 -7975 597 5229 586 -5715 3799 3459 -3187 -2198 4561 7430 6315 6117 4001 1708
11631 1708 4462 6740 3822 658 3496 8119 8065 5658 6229 10130 17939 11549 7583 6716 6209 3274
11615 3274 1427 -2095 -3728 -665 -992 137 4232 3488 -4898 -4934 2142 3597 9251 8597 7603 4443
11599 4443 5699 4960 -2968 -4328 -1527 -1797 826 -1826 -647 4067 3146 -762 -2345 -9427 -12708
11584 -12708 -7095 -5045 -5709 -3679 -2368 -490 3960 6499 8773 5689 2090 2503 2491 -3221 -2057
11569 -2057 824 4725 937 1492 13289 11765 8452 5263 4266 6395 2978 1847 5028 10431 5371
11554 5371 6341 11053 11461 12688 16395 19345 17741 14973 12931 6968 5756 6447 4175 4365 10170 10275
11538 10275 8609 9159 -861 1664 1760 2959 2671 3372 5455 7987 9521 7685 14076 20390 21548
11523 21548 15830 9250 6870 10936 11385 8846 8499 7826 10470 8689 6866 2175 -668 1535 2878
11508 2878 -1675 -3907 -1753 -1718 -1242 1930 497 -1176 3833 12886 15738 12112 7929 6297 563
11493 563 888 -2913 -6885 -5854 -7436 -6839 -3364 -4645 -8254 -7813 -2324 6483 7745 8122 3550 -1502
11477 -1502 -1734 -3007 -5070 -6478 -5306 -6252 -2225 -1303 -3934 -5375 -7216 -6303 -190 2891 2238 -273
11461 -273 5815 7360 -2236 -2939 2569 3641 4062 4502 4810 5188 -2462 -10338 -8440 -1803 838 -4965
11445 -4965 -1693 4410 12604 12414 11498 5685 309 9141 9365 9490 5841 8683 8265 -2173 -161 7364
11429 7364 3585 -3457 -10719 -11636 -6860 -853 2439 5341 2880 -1872 -4934 -9375 -7949 -711 6492
11414 6492 13525 7426 6212 13153 14070 17611 5181 3782 6294 8378 9159 11001 8329 8109 8151 12115
11398 12115 4649 2520 13196 17536 15583 14911 14811 16132 13643 12299 9842 9307 8818 9430 10428 11998
11382 11998 7130 486 -1433 716 1498 3365 5022 7791 3587 3928 -93 -5652 4646 11728 7452
11367 7452 7593 13285 19246 17420 12379 11424 8457 7300 7058 -1140 3038 13563 14277 8209 -367
11352 -367 -688 2557 -852 -3367 -3758 -3644 -5756 -3839 8662 16084 15471 11975 351 -8619 -7398
11337 -7398 -8816 -7141 -4980 3453 7461 10462 5948 3336 2757 1677 7552 11265 12064 16541 13831
11322 13831 13586 12068 11270 4621 3139 5416 11391 15071 9886 5473 8209 15775 16557 13807 8844
11307 8844 10183 15100 15262 8956 5564 576 1712 2916 8376 13735 10184 12435 25198 23582 24669
11292 24669 25003 28556 32826 29511 30592 39136 51377 70147 96698 130211 167511 205949 240655
11279 240655 268501 287824 294942 286427 257611 219028 176042 127712 89301 62897 40505 25345
11267 25345 23618 25174 27442 24289 24710 25615 21341 17612 14344 10771 13448 15556 5187 4635 9775
11252 9775 11033 15503 10416 6076 11071 11481 11493 20493 17906 13980 3330 -3721 -1553 1201 1737
11237 1737 1235 7761 8789 10362 6391 7052 4086 5315 7608 7965 7631 11799 14511 10761 11138 9207
11221 9207 8433 6606 2113 3386 8443 14509 16769 8992 3364 2007 8458 16511 17623 16625 21010
11206 21010 15856 18154 20759 18811 10805 11221 11014 11507 9365 6697 4795 6338 1882 -5875 -1406
11191 -1406 3885 4198 10735 10702 4823 1742 8517 17320 16137 13326 5966 9373 11310 6621 6046 3685
11175 3685 1962 2062 1478 981 -1098 1771 14395 16120 11536 12010 10470 11056 10451 14615 15543 10717
11159 10717 13274 23146 30896 41798 64658 110048 164400 220698 233248 178891 117108 80182
11147 80182 60037 40803 39610 35016 30184 23402 22287 18835 20856 20025 9938 16787 20032 20229
11133 20229 18444 12529 13767 21424 23380 25052 27784 34055 41368 57302 87448 132942 192279
11120 192279 233048 218240 156637 95073 60414 40161 29079 27360 25066 24116 15971 15374 13683
11107 13683 11319 9854 8375 7831 4486 4524 2510 7972 9273 6039 6818 8615 2722 5164 9712
11092 9712 6592 4213 6602 7623 14070 16938 12650 6845 7617 13425 11996 7620 5035 -2396 7791
11077 7791 16539 16656 16877 16800 9509 8435 2243 -2152 -2257 1130 5935 7410 -967 -1571 5146 9658
11061 9658 13055 11051 13227 14421 16602 17711 18323 12755 18628 24248 21362 23468 19781 17447 17332
11046 17332 13030 7581 3527 -5742 -5900 2433 6714 5590 7152 13518 19803 18853 23641 27963 27237
11031 27237 25537 19891 18937 19105 15423 17021 14016 11583 10851 2621 1737 -2872 -1752 3801 3899 5447
11015 5447 7359 9235 13379 15133 10116 14958 22148 20466 19897 14912 7524 3163 9739 11237 8430
11000 8430 9746 12423 16453 14359 11578 13929 7694 822 11046 20934 21596 18841 13577 11279 11802
10985 11802 2362 -7046 -714 6435 2592 -859 -3570 -1219 78 1471 -1953 -2103 5338 7591 2391
10970 2391 -155 280 2479 1746 105 6557 12710 13764 17080 21761 18272 7195 3266 -3013 -880
10955 -880 7457 17701 30460 29240 22131 10393 8112 5450 8830 11324 8204 5306 5543 4261
10941 4261 9645 15986 10114 -528 -919 2004 1461 -160 3117 8798 14037 15475 19896 26677 27491
10926 27491 23174 23532 21523 20435 23808 21306 20683 19030 19412 16909 13226 10476 11706 17495 21528
10911 21528 21189 21725 25417 28337 30340 28637 16220 14197 17840 27196 41557 55395 85123 137778
10897 137778 230670 356318 443793 385096 257683 156551 101657 67865 42731 30007 31280
10886 31280 29430 28602 32312 29197 22770 21252 22589 23374 22395 18467 20779 17786 24628 27464 23572
10871 23572 27409 18635 15722 17419 20726 19283 15533 14143 9037 1376 -660 1635 5139 13257
10857 13257 13041 6854 6985 13118 14597 11139 8276 7882 6621 4719 2894 5970 3677 -725 -7123
10842 -7123 -6974 5236 16585 23480 26028 24406 25758 28475 26254 25706 25870 22698 22699 16191 13539 18767
10826 18767 18364 13784 13779 15235 14109 11675 10836 11269 12073 20618 27619 24872 17899 14959 15836 19824
10810 19824 20209 16784 15238 16695 14188 17266 22831 22206 15085 8939 13603 16156 22089 18071 18417
10795 18417 21802 24826 18972 12568 10069 11026 11005 11260 10301 13690 12554 7254 12212 14322 13796 14728
10779 14728 7916 6922 8188 7901 4121 1650 7850 8583 7535 8035 9846 9091 9735 4327 4848 10349
10763 10349 14049 17188 13430 19353 25152 27033 20173 12516 11623 14719 11322 11236 16751 21998 23712
10748 23712 12774 13698 18640 23725 21721 18402 15260 17087 18693 14149 22507 23069 14695 12588 12245
10733 12245 11299 8478 1175 5393 12894 9013 6050 12251 7388 9683 12346 13503 17460 13748 11570
10718 11570 9373 7458 13945 15992 12385 9154 8492 14184 19431 16009 22229 27764 26508 23750 20794
10703 20794 14760 15385 18295 23850 20361 14408 11148 13543 9666 7774 11247 11870 17539 16062 9484
10688 9484 12184 19896 23397 20054 17911 21804 24603 25989 20896 18505 24504 25548 18330 11775 10881
10673 10881 20885 25247 27875 28330 16520 7657 10092 16712 21769 17339 18241 18531 26569 28336 19951
10658 19951 15104 18478 19618 24230 26950 27125 28774 31255 32276 32096 33576 38905 42235 47814 57633
10643 57633 60832 78495 116755 171222 229767 240237 203469 170126 173601 202914 241860 222036
10631 222036 155187 93417 59361 51323 42256 34050 30994 31042 25587 27606 28289 27198 27576 27699 27931
10616 27931 26578 21225 20643 22101 16092 10909 12036 21221 28199 27376 25669 24917 17867 16174 16387
10601 16387 20837 21558 21010 23500 18682 18896 22540 25884 29669 24409 19704 19666 21442 20346 20650 17382
10585 17382 23078 28954 28430 29194 29267 28956 31173 21590 21499 17231 17270 20069 24526 23577 20177 22208 26992
10568 26992 24296 26057 28513 25718 25403 25587 28096 29023 30216 29188 31781 33071 30486 31838 31961
10553 31961 24111 25517 23578 19768 22783 27981 26199 20115 21222 15542 17274 20424 22123 23025 13748
10538 13748 10363 15289 19004 16470 18849 23816 21309 20775 22660 22001 25345 27277 24842 13360 17663
10523 17663 28773 33369 35769 42392 37259 34880 29817 14497 10875 28264 28984 29284 34537 32312
10509 32312 29665 28969 23368 18963 23218 27148 27976 37059 34923 33556 27864 26458 26444 27887 35295
10494 35295 34558 33999 29024 27521 30166 25987 27951 36076 30734 28986 23793 20426 25329 31886 30739
10479 30739 35247 38787 37180 37597 37495 33215 26782 28347 28934 20496 22561 28203 30371 31192 32172 35997
10463 35997 33945 30196 24674 27017 33172 38419 33362 25721 25658 25813 28958 43066 52405 56374 55030
10448 55030 59127 64092 60731 58395 61276 68880 70810 69851 73516 82940 96967 103327 100667 105547
10434 105547 128084 154924 194849 273759 418780 650795 986697 1318663 1537518 1791360
10424 1791360 1992186 1831965 1549987 1332483 1025148 688554 448051 304901 224203 180569
10414 180569 156205 149744 148654 142357 137903 131044 119771 109355 97519 82669 71679 63315 61184
10401 61184 61691 67005 67164 58444 51939 48875 50638 54441 51318 46475 49657 45093 40083 41050 42040
10386 42040 46654 45787 41084 33320 32452 37203 40541 44215 47778 52915 53047 58451 65505 78138 87581
10371 87581 102220 116914 140901 158662 160509 155101 145276 149075 158606 182584 212572 261551 330868
10358 330868 434573 581278 772740 988132 1209426 1461042 1702028 1878630 1958389 1964574
10348 1964574 1919029 1815396 1623320 1373529 1109521 886149 692807 522605 378495 266759
10338 266759 201161 157553 129836 119807 103158 99145 95924 88645 86251 82391 80535 85637 83603
10325 83603 72024 68578 69278 67325 57986 56628 49536 52512 54686 55761 52405 45906 37094 32008
10311 32008 37581 38467 44824 44645 43417 49604 49901 41900 41017 51427 57459 56843 58091 52771 45420
10296 45420 42555 47565 51518 52342 54628 56032 51225 43865 40811 38447 40328 38955 39444 44324 45913
10281 45913 45204 44427 40675 38245 30291 28450 29645 31301 29268 28809 27259 28553 40627 47152 53020
10266 53020 54933 52478 47972 47605 47199 49392 44395 42099 42722 43224 47591 48571 47214 38643 37135 41228
10250 41228 38366 40061 45971 48424 50032 51005 53931 54598 47752 39860 36608 39192 33307 35815 37971
10235 37971 39706 39737 41926 42637 45880 54036 60168 62105 67885 74018 82449 80887 86671 96806 108825
10220 108825 114473 112992 112956 111198 100994 89310 79414 68674 63045 56957 54408 60156 60826 63278
10206 63278 66866 64260 59195 55481 57800 56695 57638 62883 69408 68774 66962 75645 79275 71806 64774
10191 64774 50522 42142 42181 33524 22226 20083 28893 36607 40918 34074 30493 31819 32778 36952 42672
10176 42672 54939 58279 66725 76540 81605 88541 98591 99340 95410 86682 79183 71911 69137 64926
10162 64926 59092 57088 58947 58855 60909 59370 61617 59613 56533 52992 56453 66455 68286 66546 73375
10147 73375 71769 70526 78025 86804 95538 103369 115441 138497 188316 265135 363207 467294 550010
10134 550010 637786 673962 604999 530110 458996 363525 284893 240515 223741 226400 258694 294403
10122 294403 329967 354123 330160 284801 252523 240072 245501 263008 301376 364661 436160 501142
10110 501142 563885 666105 899062 1327787 1967313 2596947 3079343 3522542 3479738 2996738
10100 2996738 2479330 1837627 1205526 778262 538101 403930 318922 279644 249551 233956
10090 233956 222107 204822 195632 186233 177006 170814 166880 160352 155151 146241 140469 127430 119229
10077 119229 106276 92562 83216 76273 79479 85146 73578 64105 59811 62505 71756 74169 81994
10064 81994 91524 97157 96319 95600 92953 80097 76996 79812 87556 92888 93977 94574 92205 90363 94241
10049 94241 103207 110838 118793 128202 144190 162425 178794 182464 180993 176450 165289 160742 152949
10036 152949 147511 157823 168640 167926 159806 158012 156257 138998 130208 123133 117548 114215 115251 111493
10022 111493 115292 122290 128339 136201 138280 148340 159564 174628 186034 196792 205018 213684 214052
10009 214052 212113 195590 179901 165199 136677 105946 69281 40241 21413 15360 17261 23174
9997 23174 34225 43877 53758 68351 77211 81807 83152 82084 79715 76599 86292 86809 87553 95606 95208
9982 95208 94586 107963 124493 140219 143501 147651 149934 143338 132842 133843 137870 147885 153316 151966
9968 151966 153681 166387 183470 203139 227721 246094 271773 294354 308985 329025 327150 317004
9956 317004 306650 291944 283337 283164 295691 305519 313917 317691 315157 312796 296112 275059 248806
9943 248806 212765 176000 151674 133695 112500 98826 93332 98633 103400 113164 117076 113895 123332
9930 123332 129105 125905 121667 119956 118494 108401 107074 104711 116355 129535 142297 159232 172074
9917 172074 183797 187041 190697 192108 182920 172601 161700 148298 144428 154627 159506 165757 169217
9904 169217 170104 167157 158176 138707 135662 125688 116418 99238 78258 59171 27436 8715 2867
9891 2867 -14504 -19239 -5523 12620 55359 99308 138417 171742 203374 221873 229778 252206
9879 252206 261181 277447 292919 308882 312447 320510 329216 322074 305444 287673 269100 247997 236581
9866 236581 230071 243873 259048 279350 296245 313465 333185 351615 370725 392282 424699 461128
9854 461128 473302 482355 493320 472770 444791 420106 396036 371932 356350 352131 345910 351119
9842 351119 359726 369294 380958 393491 399867 397131 381595 373166 349462 317508 287314 252384 221117
9829 221117 173660 149045 106566 71613 87772 82566 105789 172419 233834 291936 347954 389020
9817 389020 419930 427801 422626 423041 428219 417389 402029 384918 368577 360717 375672 411781 455558
9804 455558 505490 560485 600484 624194 639823 646833 651502 659078 671396 674862 673610 675242 665252
9791 665252 651656 653216 638756 624930 630926 643939 649480 665603 684996 697680 708993 709770 714588
9778 714588 721974 715532 707484 710328 702255 700452 710093 719694 736195 770554 813386 858447 907333
9765 907333 940006 978202 997111 1016128 1044277 1079689 1126290 1178937 1235131 1303727 1363776 1398485
9753 1398485 1415265 1418524 1431620 1461111 1522108 1609247 1714951 1822733 1919133 1993271 2052840
9742 2052840 2122893 2208741 2314880 2456862 2617404 2778608 2944468 3092252 3222312 3363025
9732 3363025 3499766 3652071 3896366 4198802 4602813 5193684 6012897 7193055 8745244
9723 8745244 10394518 12139514 13612068 14547753 15198107 15542190 16116504 17115682 18443892
9714 18443892 20521509 23142476 26121200 30397805 36538626 45892589 61552645 88770299
9706 88770299 136278178 213345928 321755741 428652696 503438001 574309150 588442370
9699 588442370 522805490 447006542 351577056 239941374 154205498 102297898 72218633
9692 72218633 53903314 42175471 34434492 28984699 25090441 22167190 19595357 17580161
9684 17580161 16209099 15161679 14527045 14367204 13800817 13009867 12175500 10681575 9107367
9675 9107367 7759117 6483269 5468402 4726116 4154754 3728692 3360960 3021478 2753735
9666 2753735 2536529 2353582 2224589 2132407 2052909 1982626 1893876 1795474 1701646 1597589 1507835
9655 1507835 1459209 1417725 1378831 1364372 1344635 1297911 1248191 1200191 1140994 1088604 1070639
9644 1070639 1067219 1060165 1043897 1001780 951291 898834 839581 813621 805297 799208 817079 841552
9632 841552 846396 839250 809344 766965 721292 667925 620435 587199 559492 527523 505273 477442
9620 477442 443317 415442 401607 391884 388306 375869 360602 348656 335555 322658 316269 302754
9608 302754 288441 292731 301485 305309 316633 327036 343096 367059 387674 395297 408175 419930
9596 419930 430089 433448 425201 400560 368614 341195 313914 282343 268400 266663 269017 282158
9584 282158 308874 370275 456344 558346 671928 752922 828398 894394 890173 866579 842398
9573 842398 784415 701804 658602 592834 492575 418972 352952 271786 228805 185026 141668
9562 141668 132284 132306 123766 121991 109964 93726 76685 60038 26307 -10265 -48727 -80907 -110658
9549 -110658 -133166 -138921 -133676 -128263 -109842 -93040 -71532 -52803 -32831 -8574 12824 31348
9537 31348 51515 57955 59887 69902 75418 64492 45886 34844 20572 10419 10333 16501 29656
9524 29656 45606 49909 62836 70433 69534 63769 69309 90849 121610 149170 179147 206454 223505
9511 223505 239832 244097 232026 223996 202155 170459 154836 134457 107919 88881 74956 60940
9499 60940 51279 43741 41572 41670 41555 38979 49861 60790 63657 78838 90960 94111 83936 76103
9485 76103 73361 66824 71537 71311 74058 76717 82491 79926 71655 56844 54694 52252 46592 39825 35442
9470 35442 35112 41074 44266 49261 53718 63623 74663 76410 64793 58686 52099 43893 40496 32569
9456 32569 27168 26429 27958 26271 28192 29885 28103 28571 32300 32776 25961 21077 16993 12563 7962
9441 7962 3545 7683 15231 26009 40147 49715 52726 57427 62356 50229 39498 34022 24163 18692
9427 18692 6705 -7971 -17714 -16158 -6351 2763 7986 8279 17486 26631 25645 24300 28828 28782 30703
9412 30703 41121 45999 49363 54333 59733 64323 69488 77227 87366 112326 132053 140341 139528 125908
9398 125908 100718 65515 25416 -14193 -38548 -57471 -70280 -70594 -63821 -46456 -35850 -32924
9386 -32924 -24924 -13319 -8955 -7560 -5726 1231 10443 11023 11830 10430 8476 11952 18289 13296 7776
9371 7776 6072 8013 7391 8006 11105 13050 7186 7250 11914 16129 15932 12778 11688 13567 21061 19318
9355 19318 21355 26710 25925 27258 30345 33235 39065 47777 44628 41398 40457 44464 47538 41586 39345
9340 39345 46075 46577 45830 47654 55888 61108 69574 71604 85019 100757 113988 123104 129628 155162
9326 155162 208651 288322 421361 647221 968586 1289054 1454589 1340537 1030986 689749
9316 689749 449464 305828 228730 192555 173084 156219 151429 155038 150634 147550 159113 177444
9304 177444 185689 196318 228894 273964 344123 484002 742402 1173513 1813549 2486165 2999315
9293 2999315 3484776 3552324 3126424 2640236 1996918 1307733 824104 544296 383836 291503
9283 291503 235870 189619 151111 127391 106855 86988 68092 63682 65608 72301 72765 70294 68692
9270 68692 64633 63717 57638 50259 47930 41970 31101 31736 37907 35116 39310 40542 32767 26979 24992
9255 24992 26447 20653 19654 22549 30804 38368 44768 48780 42152 43749 40725 27537 24745 16348 6809
9240 6809 8940 17093 22197 20851 11515 -201 -5802 -744 3901 6552 8468 13471 14797 21853 27322
9225 27322 32411 34988 36548 31359 34093 39084 34044 44282 47490 42426 34820 36968 42419 43140 42584
9210 42584 41817 37444 32275 25559 27421 32925 33618 27244 26773 21772 17411 23351 27700 24618 20232
9195 20232 13234 13217 25534 27455 28916 34943 36245 36320 38829 32923 28453 27592 27331 20452 17573 25492
9179 25492 27261 24461 15502 11802 8417 -392 2833 11398 19834 23987 20706 17342 26165 30607 28375
9164 28375 28517 19204 20388 21384 24336 22912 22626 28947 29186 27618 26376 21952 20667 23308 25550 24043
9148 24043 17564 13589 12515 11695 11313 17157 20046 22143 25321 25588 22433 22955 22513 26012 27930 27184
9132 27184 22810 22654 25512 25412 29467 28623 27602 28516 23866 25998 23195 15074 13743 13962 16784 15928
9116 15928 18339 20216 23097 18118 16744 17933 27217 33942 36561 38331 37867 42373 42627 34861 38529
9101 38529 47207 48882 48736 47463 50134 55021 56331 50024 46445 53929 62800 63351 66539 75840 80856
9086 80856 93046 107751 128733 153055 185658 226126 274272 350603 471585 656985 973777
9075 973777 1550725 2513095 3844608 5093829 5051206 3712947 2349546 1477454 983283
9066 983283 695891 518394 401080 321535 262412 216164 188752 165586 142535 120449 107315
9055 107315 100224 87378 79805 70821 64920 63186 63647 58808 50709 36813 27872 33440 39394 39985
9041 39985 40282 38006 37491 44148 54682 74069 106038 133633 132426 98786 70485 55037 47508
9028 47508 34820 26279 27667 31962 33795 33476 27202 21525 16735 15703 22842 26979 28349 28552 27800
9013 27800 29774 29408 27548 28276 23787 22365 21628 14934 9551 7460 13184 23205 29551 35643 33619
8998 33619 29781 28118 20344 20232 20061 15977 16529 17515 15204 5288 401 10725 18161 16454 18080
8983 18080 18464 12471 996 1446 6822 10689 7108 4653 6492 5663 4363 6483 12362 6977 5484
8968 5484 7576 8809 8562 8703 9962 11635 15771 22979 27607 20041 12586 8207 4228 2272 8873
8953 8873 13857 15716 15072 8801 11757 16653 16833 12254 7663 2583 2227 -511 6193 12168 8029 4677
8937 4677 1543 3358 3686 4481 4385 13719 17897 17319 9324 7785 5991 7496 5849 5634 8038 11999
8921 11999 19139 14026 8596 11045 14582 8529 6597 9225 6223 6890 13430 18875 23555 23284 23030
8906 23030 25616 32568 32593 24456 25946 30770 37480 47489 56121 63298 66684 63940 71573 96152 122117
8891 122117 143017 193314 273447 402638 606024 919314 1331955 1686112 1676196 1301760 878257
8880 878257 577489 395098 279515 204495 158609 131176 106878 89327 78973 69053 69172 64088
8868 64088 51812 42380 31819 28474 28086 23200 16458 11853 16554 19416 14392 11115 5652 1763
8854 1763 -665 -2585 -6666 -8162 -3940 -6679 -2105 8773 10638 3665 3105 -3115 -2151 4360 2986
8839 2986 2750 -2112 -4166 -1013 -1645 5377 4643 6335 5987 -3565 -4296 -5455 -5824 576 -262 27 -3895
8822 -3895 124 11482 23733 31040 35595 36665 28437 22219 20590 15129 14953 17749 10973 3909 5031
8807 5031 9762 3109 304 -433 5588 48 -3171 -5313 -774 -319 272 6664 8339 2435 297 -1319
8791 -1319 1218 5901 11018 8659 9705 3465 -3005 3225 9679 9820 2593 8085 11068 13828 19125
8776 19125 21514 18810 15250 10902 11044 8822 6515 10403 15904 25666 27970 25560 22041 14123 9140
8761 9140 12472 19315 22836 27210 27229 29257 37345 38201 36134 34892 35292 36927 41802 48523 51356 54987
8745 54987 54253 51701 59963 66642 68800 61285 56625 53066 50501 54250 51969 47144 43873 45277 48354
8730 48354 50721 52569 53209 53796 43607 36697 40966 48035 55111 62578 64138 67410 61984 60667 67022
8715 67022 73725 74379 70796 73092 89841 113537 120582 116759 117660 111101 109285 116837 122297 133151
8701 133151 150480 153639 143429 137369 140025 146391 155715 166673 172239 178902 174348 160292 144650
8688 144650 139703 137997 140201 146722 148003 144370 140155 140571 141836 156246 168590 176035 181377 186659
8674 186659 197681 205261 213805 226881 231854 237326 246431 245586 243894 241917 239170 244546 255985 269658
8660 269658 276228 277509 286116 289272 296273 302216 308683 321807 337481 366725 397087 424645 457966
8647 457966 490118 535408 580024 623385 659118 702718 749077 789407 827668 861952 891499 920062
8635 920062 938401 940604 931971 925366 909489 886303 860333 823432 794325 764388 725523 686668
8623 686668 652703 629237 610270 597534 597300 604611 600494 594845 591058 582509 562275 528622 487572
8610 487572 449317 415814 378955 345427 312549 282533 260080 233829 213312 195531 181722 172079
8598 172079 165483 157807 143503 135199 122242 106617 99915 94053 92935 85498 75821 70400 66291 65637
8584 65637 69875 75435 69681 69015 69403 67726 69808 65651 62044 63191 63112 57928 54355 47756 41919 39616
8568 39616 37430 30574 25133 24932 20495 17741 16266 23743 26929 26256 24094 24837 27762 23414 22860 24275
8552 24275 18736 17657 18930 26551 28412 20429 17690 12345 15773 14572 15187 13641 13437 11705 5666
8537 5666 2538 804 -1366 -995 5949 12948 18096 19172 14710 10419 10281 4545 18 1711 10411
8522 10411 18039 17641 11558 9274 9376 7396 1827 4236 5393 1573 -1802 -8147 -6300 -1538 -283
8507 -283 -2756 -1875 -1554 -8434 -4911 9778 17266 12262 9721 11814 10352 10515 12040 4718 4379 851
8491 851 -1855 -929 -1278 -1591 -7783 -3592 5583 1943 1299 3261 2214 6573 9868 7840 2725 -3159
8475 -3159 5052 15941 17441 14827 7857 5776 9547 5649 5083 8751 9108 11500 15564 15644 14020 9423
8459 9423 8589 6853 5777 9074 14962 17915 25122 32446 35468 37178 32053 27042 19006 14719 9549
8444 9549 2553 -569 5957 10478 6483 6950 13528 6300 5642 7280 9429 7315 8446 9757 6233
8429 6233 6110 7801 4215 -1871 746 2917 1261 6874 7646 8889 7942 5376 -3518 155 1180 420
8413 420 -962 2188 5829 10189 10064 7695 8146 10099 9285 7556 6300 4274 -3448 -2455 991 -266
8397 -266 -1303 -1875 1665 2068 4034 9854 11190 8322 7189 7635 9043 2287 -2808 -3332 -2484 -6055
8381 -6055 -9639 -7300 -9260 -7031 -5378 -1777 1941 4974 3228 -622 6118 10791 11807 18735 12562
8366 12562 3531 2668 4292 4172 8729 8451 9483 8807 4553 8968 9482 10662 11103 9485 11330 12181
8350 12181 13538 15955 18767 14082 6902 8191 5045 378 93 7559 16890 16221 16350 13502 10506
8335 10506 12888 18649 15804 12964 13740 12651 9742 3696 5597 5590 9577 9619 3476 -4624 -4475 -4682 -3105
8318 -3105 3169 9724 5051 -1356 4490 7528 7199 4448 879 3896 8360 12225 17679 15926 12820
8303 12820 11395 6559 4683 9152 9153 6553 10323 11382 8823 6713 7468 7671 17136 17399 17147 18035 15814
8286 15814 7452 283 1030 3408 1752 5971 8918 5781 6530 5302 -6229 -4782 1590 2761 4439
8271 4439 8074 13112 16980 15049 9187 9737 9769 7225 11042 15944 14524 9664 3671 981 9152 13428
8255 13428 15103 16727 17882 14978 14460 10805 9349 9547 16780 19237 14105 15657 25192 23648 7990
8240 7990 6001 18169 27231 23953 17879 9518 5062 -1423 -2494 13890 23625 18105 16143 8617
8226 8617 13440 17078 9443 10462 7539 4492 5182 977 3419 6651 6805 6192 5237 352 -178 -4906
8210 -4906 -6535 -3062 2137 -3318 1067 7914 8186 4545 2086 4752 11853 16249 14801 17764 21053
8195 21053 14917 12162 10969 5299 4217 4309 9225 14336 16279 9034 8267 10386 12254 19738 26389
8180 26389 34321 51573 86309 139068 211743 254454 221102 151991 93704 56849 41872 30315
8168 30315 26536 22060 12937 6907 -785 3065 11271 12986 9815 4781 123 -1647 -756 -40 508
8153 508 8657 7433 4845 -1142 -1265 -3429 -9441 2953 11364 16189 18031 19922 27990 41818 53723
8138 53723 69982 97925 137348 178365 204600 196492 157914 112419 70581 46478 32589 23933
8126 23933 20070 14532 13928 16077 20057 28227 31034 25237 22370 21016 21956 24988 22129 19497 17991
8111 17991 17596 18489 16855 17831 17774 21857 12203 11389 16946 22067 31469 33211 27315 15907 17633 27680
8095 27680 29379 30575 32740 33773 38304 39263 32967 31156 33790 41357 50104 51266 51714 58662 68591
8080 68591 83905 85885 83021 101170 125991 137389 144891 160101 188099 215121 241529 270579
8068 270579 306889 339695 368456 384997 388887 374796 350943 333357 322182 322725 315773 297213
8056 297213 289820 282597 275395 270777 267718 263170 254164 245472 244018 249323 252384 251959 250970 254351 262281
8041 262281 266192 262887 261956 259093 258020 267436 277069 284228 308147 341249 385005 444620 522892
8028 522892 634399 801168 1041337 1299186 1412666 1288977 1054907 849056 683038 563950
8018 563950 486274 438729 406586 387695 363523 339483 316420 292456 270587 245162 220969 203557
8006 203557 190573 172346 167616 168115 165924 172587 178955 185454 185958 192524 213291 249394 295868 355141
7992 355141 412085 418942 371903 327445 306017 305694 320183 339033 366904 398870 433917 466183
7980 466183 470538 461680 437477 394200 347196 307975 288896 271451 242306 204637 176593 153997
7968 153997 141373 129196 115849 99679 90632 93244 92129 79571 75778 72221 72325 70634 71336 78912
7954 78912 85834 96686 113235 134679 149481 131810 106801 89642 77602 58837 48901 48799 54934
7941 54934 65263 68539 63834 62038 55351 52790 51723 42895 30531 28186 30523 33151 29675 25224
7927 25224 17527 17123 23713 18575 9690 7806 15664 21605 25723 27835 24835 20145 13296 10819 7353
7912 7353 11381 15200 7783 7186 6841 7315 12840 19364 19686 24130 14858 5611 3006 1576 3249 6833
7896 6833 14895 20780 19563 13364 10926 14587 18049 12215 18355 28117 28966 24212 26539 32082 38010
7881 38010 39761 37595 24853 22384 21115 18101 19222 17983 13792 15046 23321 21006 20786 11303 10174
7866 10174 20604 22990 17724 14284 13248 16340 8655 -2972 -4941 -5080 -6305 407 6494 5777 5298
7851 5298 7651 9119 6333 -371 -6736 -5976 -12064 -7457 856 6286 472 -1137 1164 2731 348
7836 348 2930 -3590 -7253 -11493 -5514 -5282 -7203 -6918 -1554 -1874 3759 4267 6556 1644 2253 8203
7820 8203 13925 13162 5056 -1849 -3792 -9089 -5484 1817 -3374 -5847 -3272 -2020 -281 -356 -6476 -8265
7804 -8265 -1838 4196 2613 -2544 -8118 -5910 -2795 -4977 -4944 -11323 -16190 -9107 -8647 -7261 517 2702
7788 2702 -868 -3875 -3367 1579 -739 3011 3299 -1448 -5109 -3620 -1107 223 1789 2070 91 -4849
7772 -4849 -8532 -10611 -5215 -4882 -5880 3653 -73 -7524 -2530 5166 10310 10342 1066 1673 3004 -3473
7756 -3473 -4634 -5989 -8535 -8090 -6515 -6451 -9414 -10365 -9035 -329 5920 -3180 -5374 -1975 -547 -5953
7740 -5953 -2262 1942 -4147 -13592 -17048 -9744 -12609 -16001 -11998 -6411 464 3053 4350 -5904 -15871
7725 -15871 -15134 -15367 -6286 -262 -372 -82 904 4761 5709 42 -827 -2054 -6345 -7035 -9139 -10662 -4026
7708 -4026 -6069 -7234 -14246 -17492 -12801 -15863 -17079 -19655 -14220 -3820 -7500 -9310 -9626 -7281 -9266
7693 -9266 -9217 -4928 1897 1558 -1221 -1176 3154 -1415 -6519 -7025 -7940 -7073 -11095 -8312 898 -3031 -11620
7676 -11620 -5758 -8984 -12394 -12482 -15665 -15469 -16005 -10552 -5383 -2825 6033 -1039 -14173 -19160 -16830
7661 -16830 -11101 -5509 2118 6732 9586 6237 -895 1010 -6594 -8223 -7347 -8071 -6333 -2716 -3617
7646 -3617 -9119 -7011 -4987 -5752 -10265 -6636 -340 -2560 -9367 -4864 -6477 -4637 -1283 -7681 -15946
7631 -15946 -18423 -13390 -4525 565 4490 -1389 -10974 -8260 -4550 -9838 -15387 -12937 -8041 -2020 -2599
7616 -2599 -6496 -1809 4120 -1128 -10827 -10221 -6037 -6069 -6137 901 3677 5220 -1487 -3210 -8044 -10225
7600 -10225 -8291 -4559 8095 13212 15862 13074 6138 -3158 -4216 1390 1442 -7678 -9992 -6538 -8667
7585 -8667 -5531 -778 3312 -1842 -5439 -6727 -254 454 -1764 5151 5873 1847 -947 192 5763
7570 5763 11724 16237 8554 8135 6779 4973 1277 -3969 -8078 -5664 -3030 -86 -64 2891 4708 3356
7554 3356 815 -2330 2902 4549 625 -3106 -3888 -6972 -12506 -13607 -15239 -17339 -11203 -6605 -1950
7539 -1950 42 3233 1036 -8048 -12631 -10955 -6705 -9846 -7339 -2986 -5945 -11598 -12948 -11687 -7471
7524 -7471 -11384 -13199 -9414 -7305 -3621 -1477 440 -2723 -10386 -12547 -10631 -8996 -9904 -12211 -10094
7509 -10094 -12509 -17924 -14747 -6463 -6671 -6071 -5829 -15159 -23200 -16128 -8405 -3295 1162 3876 2314
7494 2314 3887 2929 1028 -1867 21 -1679 -1640 -1834 -7347 -9576 -7292 -16814 -19030 -18198 -16362 -12424
7478 -12424 -15808 -13059 -13430 -11073 -4452 8864 6265 -1054 -6613 901 8672 8237 2921 -4833 -7051
7463 -7051 -11918 -14524 -13111 -13177 -11848 -12314 -11586 -13356 -10077 -9267 -13209 -16815 -16565 -9462 -7561 -13874
7447 -13874 -9281 -5050 -3495 4107 554 -5310 -7804 -8624 -9791 -11721 -8575 -7739 -3293 928 365
7432 365 -1132 -1804 -10795 -17791 -11209 -14639 -15191 -9508 -8555 -995 4573 -509 -10754 -14953 -12003 -5968
7416 -5968 -2297 -5901 -14673 -12912 -5819 -3252 -4046 -7411 -17264 -10734 -1298 -10657 -11723 -12910 -14668
7401 -14668 -20858 -15212 -6201 -5514 -11115 -3224 4617 4564 2618 -1680 -1103 -62 -4129 4191 6724 2060
7385 2060 -6233 -15386 -16587 -5664 -4220 654 2809 -119 -2677 -1227 4553 3086 -1101 -700 -1070
7370 -1070 -1520 -5055 -6300 -5412 -3883 -4560 -8581 -10009 -9187 -9565 -6474 -3040 -833 -4996 -3182 -6183
7354 -6183 -7654 -1938 -2038 -2664 1141 -428 2615 1042 -719 -3423 -1395 -2679 -7105 -14491 -21123
7339 -21123 -19060 -19406 -17381 -11589 -4521 -4251 -11225 -11952 -12431 -13036 -16200 -18385 -18115 -12567 -11394 -15672
7323 -15672 -13344 -12182 -12034 -22738 -24159 -20962 -21295 -14850 -6917 -3573 -13248 -16407 -21483 -13852 -10462
7308 -10462 -7364 -5090 -10714 -11610 -4823 -9726 -12429 -11372 -8356 -5688 -453 4263 -1218 -4140 -259
7293 -259 3087 -3510 -7099 -4155 856 101 -152 -3831 -2216 -2000 -2077 -1430 20 -1578 533 0 -7625
7276 -7625 -12077 -5935 -859 -989 -3675 -8467 -8321 -11567 -12012 -10761 -6892 -5895 -2239 4889 5382 6817
7260 6817 508 -4661 -6182 -2873 -7902 -12877 -10255 -10825 -12347 -12896 -7608 -11565 -5523 -6988 -6982 -9345
7244 -9345 -13317 -6878 -2559 -5996 -8486 -5096 -5516 -3966 -2793 -5659 4337 4568 -2484 -2425 -3279 -8549
7228 -8549 -10114 -3238 2063 1975 -2610 -3824 974 -1716 -6943 -14290 -11868 -5697 -4092 -7453 -8090 -7979
7212 -7979 -3882 -3488 -3336 -5355 -6362 -3908 137 -655 1589 3527 -1255 -5438 -7895 -6209 4082
7197 4082 9020 6731 -3243 -14923 -14060 -7745 -5110 -4215 -8641 -9568 -11363 -17616 -10113 -214 7444
7182 7444 3556 -4024 -4495 -1916 -2992 -2964 1188 1453 5926 11859 15682 17889 11866 8470 -2000 -4425
7166 -4425 310 5025 11752 5681 -8327 -7825 -4615 -4922 -5068 -7742 -4286 -521 -5950 -4143 35
7151 35 522 -512 -2922 -2453 4021 2768 5123 7226 5516 2727 1266 -45 -9591 -12401 -9655 -16140
7135 -16140 -16815 -16307 -10091 -6318 -6458 -8247 -6395 -6513 -1748 -4423 -4940 160 3473 6907 5705 -1890
7119 -1890 -9653 -6152 878 1023 7352 7601 4625 3942 7583 2990 8971 10831 5588 4384 11761 10839
7103 10839 6877 200 -8154 -4510 2864 -1195 -11026 -11603 -6759 -5274 -1285 2003 4299 5606 -1857
7088 -1857 -10354 -8716 -11030 -12479 -8986 -3846 2161 3200 1335 978 -4736 2712 32 -4516 1238
7073 1238 -1991 -7844 -4722 -3810 -8926 -10633 -11468 -9582 -8364 -3670 3709 7009 -2916 -7210 -4431
7058 -4431 -4105 -1124 -1695 -3229 4475 7026 -309 -8098 -5782 -2862 -3166 -4854 -6633 -12695 -15075 -11864
7042 -11864 -9161 -2295 1663 -5014 -10086 -8797 -2825 3633 4303 2061 -1877 1943 756 -1749 -2230
7027 -2230 -2751 3205 534 1549 3212 2772 -1198 -1748 7665 6045 507 5439 5122 -1016 -8043 -9993
7011 -9993 -6000 -3943 -6397 -9412 -12475 -8028 -1723 -8101 -10755 -10069 -8999 -6901 -7422 -8837 -14121
6996 -14121 -19066 -21478 -15183 -5702 -7619 -5172 -4971 -4400 -6201 -4833 -6104 -4403 -9083 -10517 -7564
6981 -7564 -9105 -11162 -9410 -9430 -5699 -5100 -7177 -3619 -5406 -3434 -490 -911 -4867 -9274 -8066 -6943
6965 -6943 -13628 -11395 -15030 -13515 -13320 -14756 -12287 -2100 -2423 -8300 -8375 -8716 -2110 1361 -1495 -7178
6949 -7178 -4049 5466 -890 -9909 -17079 -13745 -8235 -6168 -2905 1158 -196 -7365 -4301 -2342 -4009
6934 -4009 -13293 -21142 -13648 -12151 -12898 -11940 -6409 -2796 -4148 1892 6154 5434 2824 6051 -3468 -8084
6918 -8084 -1526 203 -1209 -1623 -11802 -18335 -15798 -5500 1124 37 -3922 -6701 -2657 -4320 -2334
6903 -2334 3895 6486 6533 6816 18036 26991 20744 8067 4544 1985 -1826 3633 5677 2709 -2937
6888 -2937 527 4457 6949 6489 -1853 -4741 -670 -2563 -7444 -11915 -15044 -17166 -8120 1854 1211
6873 1211 -4595 -7070 635 1952 897 4511 -3047 -8269 -7857 -4079 892 2642 -4310 -7422 -1400
6858 -1400 4523 -903 -8472 -10748 -2234 6681 4944 -6156 -15493 -16193 -10125 -8290 -11103 -952 -1408
6843 -1408 -3814 -1324 -3749 -12278 -12361 -8188 -3735 207 113 382 -4295 -8924 -8484 -10494 -14341 -13221
6827 -13221 -6833 -4301 -839 -355 -4663 -3017 -6250 -10231 -11764 -14859 -16752 -14290 -8633 -9529 -7908
6812 -7908 -10256 -15786 -13977 -14040 -12069 -7252 -2032 1934 2346 2645 7857 8947 1615 -2388 -8403 -11488
6796 -11488 -5449 -1526 682 -939 -940 -1713 -4056 -4426 -2434 644 2199 7620 12983 24471 48667
6781 48667 82137 131062 200207 242097 206670 132688 80573 52844 32584 17449 14699 12168
6769 12168 9440 15065 11646 12034 17370 22861 25237 24993 25886 43698 67042 93118 140597 217007
6755 217007 293424 289161 236227 196957 161141 128638 109756 114760 126578 157109 206513 214303
6743 214303 175090 118978 77820 51148 43845 37905 27415 22640 26936 23908 21029 14755 9663
6730 9663 11343 13206 5472 2111 2321 -2447 -2446 3183 13189 9211 2071 547 -2826 -2714 -6038 -5708
6714 -5708 -9820 -10199 -8959 -2634 49 943 -417 -6801 -5459 -1143 2155 7505 2721 1149 5603
6699 5603 11077 1131 2872 -4245 -7656 1230 2217 -3838 -2116 4350 9829 7683 995 2533 2015
6684 2015 2108 2828 2705 2775 4145 2590 -4144 -1294 119 -4921 -947 3778 5003 2553 -1729 3755
6668 3755 2987 2047 -229 -538 -2248 3351 3848 2954 3653 1732 -939 -4635 -2673 1900 1912 -5064 -8378
6651 -8378 -6433 -6899 -2434 -2253 -1375 7025 2183 -183 3673 6894 1679 4725 7125 8389 8674 5876
6635 5876 3955 -2274 -814 299 3251 -195 -2214 1992 5155 2972 1474 2600 -503 -4845 -8040
6620 -8040 -8697 -12051 -10301 948 7248 10609 5318 1851 -1040 -2387 -2455 1946 7934 5977 2600
6605 2600 4439 891 -325 -1064 -2455 12 3181 -1113 -5817 -6239 -8762 -13993 -16873 -12110 -9658
6590 -9658 -11099 -11036 -8770 -4516 -3814 -855 -2071 -7532 -7707 -274 9689 7582 3166 844 -2405 -2954
6574 -2954 -775 378 1483 -4803 -7059 -1552 -2064 -4781 6694 6411 2727 5904 2931 4296 1006
6559 1006 -4023 -8236 -2854 4549 5718 11794 14374 4699 3380 3932 -515 3119 163 -8835 -6438
6544 -6438 -4476 -2265 -10720 -10492 -8114 -10887 -10266 -3618 -1403 -8375 -12109 -7651 -7837 -2211 1711 -3043
6528 -3043 -7508 -3807 -5437 -8943 1554 4900 5890 6653 4915 3663 -4925 -7555 -11714 -9663 -1273
6513 -1273 -841 -7167 -12658 -9408 -4724 -7803 -4431 13 1963 -3848 -3043 -3196 -5343 -3758 -2414 -2130
6497 -2130 5023 7643 -1374 -9210 -8429 -5385 -6786 -7670 -5731 -7408 -4254 -333 -4595 -831 -613 -5837
6481 -5837 -7837 -307 5447 1393 5001 12652 8793 778 -1691 -3142 -3493 1621 5545 6899 3822
6466 3822 679 2613 6518 8045 5117 3911 8748 16947 12225 -2562 -12664 -7493 -1870 -3998
6452 -3998 -5946 -2191 4324 9854 2916 -2585 -8835 -11994 -11325 -9295 -12086 -13870 -12204 -5166 -5167 -10254
6436 -10254 -6599 -3462 -3177 -5063 -8007 -2723 -1961 -3152 -3850 -5399 -7777 510 1554 6695 4810
6421 4810 -4291 -4272 1924 11825 10120 -1510 -1073 -3692 -7434 -3230 -2671 18 -3674 -8183 -5242 -526
6405 -526 -2415 -4106 -4493 1940 6237 3128 1831 -1844 -6370 -5045 -7252 3631 12686 8587 -7122
6390 -7122 -11558 -6968 1568 1373 3270 -371 -1256 -53 -1002 -5033 -6356 -5671 -2679 2746 5956 4380
6374 4380 -106 2695 4962 8174 10589 5605 1126 -1902 1782 1427 1215 8071 17698 14465 10354
6359 10354 8103 2410 -1272 -119 5812 7862 12214 13021 9510 -1323 -12485 -13390 -9845 -95 6255
6344 6255 5337 5190 8480 8338 2069 -3262 -8285 -2035 -2698 -9991 -7275 -5417 -4243 -5302 -7919 -7566
6328 -7566 -5043 -4790 -7734 -5673 981 1533 2528 3243 601 574 1862 -481 -6883 -10929 -6063 -7433
6312 -7433 -9780 -7903 -10149 -11257 -10115 -8908 -3431 4986 2483 -8735 -6658 -893 1172 2763 4811
6297 4811 -3352 -2487 -1490 323 3325 1305 -5748 -7635 -8410 -8337 -6974 -6409 -10953 -13262 -18229 -19730
6281 -19730 -17479 -16110 -16278 -16268 -9772 -4920 -367 -2277 2793 4534 4200 135 5660 193 -3759 -4432
6265 -4432 -4746 -7583 -1944 -6017 -7947 -6071 -3710 -6463 -2385 5382 1127 -1195 -2727 -692 3254
6250 3254 -982 -4055 -9775 -9845 -9465 -10535 -5692 -2552 -4083 -6663 -5150 -4538 -6101 -9444 -7230 -8185
6234 -8185 -4514 -2377 -4332 -1208 -2601 -5296 -10324 -8561 -5988 -6870 2805 5640 -1508 -4653 -270
6219 -270 2998 2317 986 -2371 -7001 -2366 2734 3767 6222 10827 8573 -3664 -9979 -6255 -5177
6204 -5177 2370 -397 3864 7316 7221 2246 -4368 -7089 -4175 -4080 -4520 -7098 622 8696 9500 10365 5774
6187 5774 4607 -4045 -4482 -1398 -2292 -2246 -4071 -10599 -7097 -1553 3621 9335 9743 5667 -2216 -2272 -267
6170 -267 1235 1911 -851 -7440 -16654 -18786 -10257 -67 -1883 -2262 -5465 -12515 -13349 -14809 -17713 -10383
6154 -10383 -8456 -1016 -1893 -11111 -10183 -4092 -372 2482 5122 8869 8739 8832 11001 7735 4665 9968
6138 9968 10458 8057 4860 4262 5661 4834 1794 -6930 -10365 -8226 -4068 -2583 -1472 5193 8113 799
6122 799 1024 4033 1188 -9120 -9539 -2530 -2057 -420 6198 8798 7546 9056 4646 -2088 -5005 -9035
6106 -9035 -9595 -3813 1396 6473 -3615 -6352 -2294 -3379 -1318 7468 3083 -1875 -517 7337 6168
6091 6168 2351 2554 799 -6037 -2011 730 -3942 -3221 -9238 -14730 -14864 -15478 -13395 -16561 -18671 -15931
6075 -15931 -14237 -10047 -2701 -5434 1182 8979 5500 -1832 -1515 -805 717 -5210 -7483 -9706 -16161
6060 -16161 -13694 -9615 -7346 -1479 -3685 -5026 -9322 -10193 -11545 -10254 -3124 4867 3850 -245 2446
6045 2446 259 -1823 -50 4974 3664 1209 -2158 2067 -535 -5471 -7498 635 130 814 5574
6030 5574 3127 -9915 -11489 -2869 -4497 -9245 -4645 -11277 -13003 -2282 -560 -919 -1161 -7135 -17387
6015 -17387 -10718 -433 -13453 -22037 -21606 -8091 -1477 -869 1113 292 -7893 -7804 -6599 3577 2431
6000 2431 -1907 -5251 -4527 -58 1933 4100 6144 5673 5369 5759 9363 10334 5209 4673 756 -971
5984 -971 -83 1183 207 -6382 -6700 -8648 -9918 -4739 548 -2058 -3747 -8264 -5722 -2624 -3462 -2601
5968 -2601 2584 -1322 -2406 -1190 -3678 697 1427 -5321 -3875 -2995 451 4241 -5389 -6056 5033
5953 5033 5801 397 -9592 -10178 -5990 -4316 702 1963 -1734 2678 6717 4971 -3320 343 7713
5938 7713 8531 3524 2905 -2673 -6523 -11904 -12103 -14087 -12844 -10212 -7522 -3731 -7317 -6625 -12207 -14776
5922 -14776 -15130 -13674 -13719 -17472 -12624 -9017 -5463 -6242 -8410 -5753 -3048 905 -1047 -9850 -8929 -10172
5906 -10172 -11060 -4349 309 4298 963 2504 5353 6896 1685 -5705 -12248 -12494 -1731 4656 6669
5891 6669 1090 1175 3533 3449 4509 -5790 -7264 -3447 -3541 1830 -2896 -2849 1282 3009 388 -88 -2059
5874 -2059 -5113 -4675 -1926 6196 7615 8391 8404 6560 3917 812 2751 -2583 -4898 -12650 -8797 -4232
5858 -4232 -2831 -1817 -1064 -3069 3551 795 -666 -8467 -9767 -6486 -5948 1596 5449 6666 2623
5843 2623 -1429 -5758 -490 1217 -2821 -560 -449 2376 5770 2664 -814 4875 -2404 -3240 -7780
5828 -7780 -7621 -11618 -14981 -15544 -12717 -5559 -3781 -4564 761 -2878 -6886 -4075 298 -10173 -16025
5813 -16025 -16995 -10433 -9799 -10101 -8053 -823 2669 4740 1296 -3562 -7733 -7760 -5685 -3173 -4557 -4615
5797 -4615 3970 10980 5737 2255 744 2204 3077 5005 7241 8771 496 -2336 2259 3023 8333
5782 8333 5222 2496 2404 4342 4910 -292 -1856 1900 3632 6495 1117 -6829 -8088 -4347 2288 6142
5766 6142 -285 -8709 -11269 -11110 -8831 -6666 -3292 -2939 -11 -1369 -3013 -2067 1528 -638 -736 -6039
5750 -6039 -6787 -6752 -9934 -11030 -7303 2219 1447 4403 6164 7162 3483 -905 463 -191 -4144 -2992
5734 -2992 -4093 -3304 -8107 -12840 -11446 -8545 -9807 -5052 -1177 -4674 -5709 -7375 -6210 154 -674
5719 -674 -699 3549 3186 -6505 -15182 -13286 -9384 -6142 -5703 -3622 3495 7281 5390 -151 -1076 -4421
5703 -4421 3816 12794 8634 3249 -1794 -9282 -10631 -6080 -3544 -10021 -3920 4775 2806 -643 -250
5688 -250 904 -2922 -3759 -5183 -7878 -6234 -3508 -1855 -5706 -3799 -3106 -13184 -14964 -7915 -2432
5673 -2432 2190 -746 954 1501 4304 -473 -3541 -10156 -6962 -1277 2965 3902 712 -4363 -6301
5658 -6301 -6049 -9082 -8943 -5336 -769 -3658 -696 -2129 -5326 -5824 -1334 941 2194 -4129 -5039 -4121
5642 -4121 -4013 -10847 -13648 -11658 -6133 -2064 -5322 -9748 -9046 -10077 -20299 -18869 -16213 -10601 -12975
5627 -12975 -11127 -8178 -5379 -3432 3693 3351 -2157 -971 -3127 -7541 -3656 8118 8918 6515 6999
5612 6999 -298 -15984 -17755 -14079 -8597 -2493 -392 -4019 -1298 1883 6163 6733 7603 4223 -1740
5597 -1740 -1274 664 -3208 -3800 -243 5272 5073 6026 1220 -3383 -12031 -12176 -10790 -5454 1653 1852
5581 1852 -5001 -14478 -11777 -4840 -1432 -2398 -10657 -17911 -15201 -16440 -14584 -9052 -5764 -3778 -8339
5566 -8339 -7980 -6666 -3237 -4956 -8364 -10654 -11556 -13626 -7148 1208 4573 5822 4970 4833 3269 5808
5550 5808 8503 5692 6241 4114 -1239 -4380 -7527 -3978 -9450 -10375 -10614 -9719 -12473 -12250 -7161 -6522
5534 -6522 -12731 -15890 -9245 -6513 -3785 -8771 -6482 -8421 -11736 -356 2681 -1073 -3615 -3587 -443
5519 -443 -2979 -2819 -1872 1743 -329 -7857 -11827 -13981 -10808 -4049 3239 9339 7485 7289 5831 -450
5503 -450 -9343 -7745 755 8837 13914 12755 9436 3518 3212 4026 -5469 -4525 -517 -1790 -735 3263
5487 3263 967 -3211 -2943 957 2392 2148 3430 -7806 -756 4753 3444 -605 -6122 -5042 -3086
5472 -3086 -8798 -8622 -8672 -4257 -5949 -10089 -8847 -5079 -37 4005 6759 608 -8760 -7763 2649 2493
5456 2493 -4383 -8073 -10870 -10434 -6842 -226 -7049 -6031 -4376 -5539 -10860 -8708 -10416 -12014 -10897
5441 -10897 -12937 -10736 -8247 -12471 -18492 -16894 -4467 5233 12222 8155 -211 -4602 6626 12726
5427 12726 10476 10559 8842 4745 -439 -465 3038 4514 3032 -1366 -8825 -9985 -5245 -2938 -7787 -3012
5411 -3012 1025 -2363 -4082 -2496 -5216 -12219 -14228 -7655 1761 9511 15558 11017 7532 6327 6869
5396 6869 491 -2348 4148 5284 4917 6304 7396 7359 837 1572 -5319 -5155 2240 5839 1070 -373
5380 -373 4436 4236 668 3709 4744 -1930 -8428 -8222 -3933 -1060 -6296 -4162 -4283 -2739 -1065 3384
5364 3384 -1960 -4178 -1010 1553 -6060 -9922 -4252 -343 -3093 1034 5403 4304 2358 -2681 -4026
5349 -4026 -4939 -10428 -9272 -6724 -3839 4843 4710 -6468 -9273 -7471 -1229 -7223 -10822 -8143 -3150
5334 -3150 5559 12020 15546 11290 7223 4311 7053 10009 6016 2584 3053 2365 -4816 -3297 -8871
5319 -8871 -7063 5492 9602 7071 4083 -1272 -12789 -10792 -5403 -2632 -1949 -2407 -110 -1676 -4941
5304 -4941 -4354 -4759 -4397 -5091 -206 5823 5782 6457 4871 977 -6957 -9499 -4778 -2998 865 9243 5304
5287 5304 591 -794 -4733 -3731 -2373 -4492 -3618 -1939 -114 698 -1899 -5120 -8090 -3176 192
5272 192 -2736 214 -1086 -1402 -3524 -2406 -10105 -8603 -5777 -2006 1444 1977 167 -1353 2235 11422
5256 11422 8001 -3129 -1195 -1119 1652 6045 1540 308 3039 -2371 -3167 -5961 -5302 -5377 -5035 1875
5240 1875 2362 -3446 -3444 1989 2118 -318 767 2477 -1719 -3295 -10663 -11100 -10234 -13156 -12927 -13500 -8523
5223 -8523 903 7281 7694 5554 -303 -2871 -6177 -7138 -6085 3763 3145 -1967 -6777 -2370 4798 9903
5207 9903 3084 -5816 -7046 -5367 -4954 -5971 -6844 -5700 -342 -5980 -6317 -1083 -1907 1462 -998 -4934
5191 -4934 -5006 -7341 -7583 -3557 -5927 -8574 -3817 1779 1551 -1516 -3848 638 4285 8512 9489 7614
5175 7614 10231 9008 -370 -6128 -10883 -9924 -6531 -1864 -3526 -4903 -5348 -339 -1634 -4687 -1831
5160 -1831 -680 -1888 -6731 -6131 -6004 -5865 -1 202 -3612 -4147 -3866 3326 7739 5808 2448 2528 2631
5143 2631 -644 -8437 -9853 -8573 -11015 -11899 -1949 -632 -8325 -14213 -8847 -7531 -6846 -2178 -6793
5128 -6793 -9196 -12360 -9890 -4379 4842 6332 1955 -293 -540 -506 921 5248 6712 3733 -612 1237
5112 1237 -1320 -2575 3965 8962 5689 -989 -1521 -362 4078 1860 2091 5250 5402 1507 3837 8588
5096 8588 10033 7933 1939 504 1953 -1283 7320 8824 11173 5765 820 2978 -870 -9258 -9836
5081 -9836 -2901 -3967 -3793 5931 15159 19850 9236 -4956 -3231 3305 7628 4374 2656 -2828 -4037
5066 -4037 3566 5869 273 -3384 -8001 -8405 -1406 -2163 -4933 -3008 -7640 -5320 700 -2467 -5120
5051 -5120 -1434 4929 4172 4340 116 -734 -1685 675 -2441 926 4974 4817 6984 6784 3771 2307
5035 2307 1296 -2397 556 550 87 -780 -3015 -1305 -594 -3472 -4078 -1773 1578 982 -5460 -3690 -2710
5018 -2710 783 1835 -2496 -12978 -11796 -6903 -4885 -2144 -6795 -5114 1475 -334 -3294 156 6853
5003 6853 6830 4801 673 -4873 -8132 -3363 -320 -1313 4038 -5518 -10487 -13361 -5320 -3874 -4367 -7989
4987 -7989 -11963 -4489 -11146 -10083 -4795 -6456 -7242 -6713 -2497 -3669 -7484 -8006 -10034 -6039 -6299 -4056
4971 -4056 -2103 -4700 -5337 -6578 -8190 -7489 -1091 3366 -219 -1220 1418 9013 10853 8111 2622
4956 2622 -134 -8 -665 -1655 -4940 -795 5972 3521 4296 6568 -2161 -9486 -8150 2988 -88 -2344
4940 -2344 -743 4478 4671 5677 3782 -1032 -1115 1038 -5708 -5464 -3430 966 2505 2946 -3057 -3462
4924 -3462 -1253 -4334 -3655 -3239 -2507 -2448 -2775 -851 5590 8621 7687 1678 -2953 -3252 -2649 -1190 -9481
4907 -9481 -10364 -2198 1185 2863 8558 13825 6634 1569 2436 827 223 2591 7940 12007 13046 10507
4891 10507 5886 1087 -5006 -5343 4633 13930 10365 8100 5288 -2195 -6068 -3719 -1451 1641 5788
4876 5788 -246 -653 -2724 -5400 -7440 -14528 -17053 -11088 -8430 -4732 5096 10070 6833 8419 2740
4861 2740 2294 4614 11903 15957 17222 13253 10288 5669 2707 205 -5723 -4934 -4134 2895 8310 8841
4845 8841 6623 3305 4415 11113 13261 6387 6742 10768 6078 -2387 -7029 -12052 -9339 -12831 -13723
4830 -13723 -11803 -13118 -7649 -6269 -6716 -12688 -13014 -10624 -8714 -9793 -7529 951 4212 -139 -3075
4815 -3075 -2712 -7681 -9472 -14621 -14935 -6651 -12464 -11633 2287 -225 159 -5471 -12010 -7162 -982 5938
4799 5938 5567 7687 8332 6527 8711 1162 -11243 -7513 -804 -1138 -7499 -3425 3075 3362 -4748 -1686
4783 -1686 3037 4328 6116 6944 -1373 120 2956 2220 -1475 -2904 -2386 -3930 2933 12760 10555 3270
4767 3270 -3019 -3671 -1881 -6717 -10160 -6823 -13908 -16860 -10697 -1432 1083 -5911 -4280 -4347 -7597 -1113
4751 -1113 -2765 -6855 -8828 -4803 -9735 -4109 -4836 -3453 1029 -4229 -5407 63 3364 8603 9894
4736 9894 5016 1589 -183 6243 13458 7304 -268 -4009 2479 6901 6376 877 2676 3676 -5809
4721 -5809 -12830 -12740 -9331 -8018 -2862 -3745 -1627 -2816 -5381 -5196 -6742 -3464 -1021 81 4320 6146
4705 6146 6771 5558 4502 -2472 -3824 -2243 -4128 2924 393 8724 15688 10886 3109 4103 7619
4690 7619 1847 1860 6107 2256 1131 1562 4822 -111 -5379 1076 -1144 -4403 -10695 -15421 -6052 -4270
4674 -4270 -8967 -15019 -20190 -9289 -1612 -1037 -3765 -4663 -2147 9068 12893 7057 7383 12794 14086
4659 14086 10156 9966 12593 9318 12538 11534 10203 4118 3005 1340 -1119 -3855 -1181 7929 10208
4644 10208 12684 14943 9542 10041 3097 347 -1564 -2752 -1325 -3947 -9175 -10610 -6374 571 -1080
4629 -1080 130 -995 -2162 562 357 -1225 -1857 -1916 6328 7088 2436 -1526 -2540 -7916 -11209 -9551
4613 -9551 -17005 -19338 -15634 -10569 -5456 -2696 -5778 -3169 -6389 -5461 -3779 -8361 -4553 -6438 -7146
4598 -7146 -10651 -9887 -11501 -8748 -4948 -5468 -10981 -7388 -2258 -1355 -3582 -7765 -9351 -6560 4441
4583 4441 11147 4753 -194 -3069 3686 11142 4346 -3958 -8783 -8846 -8633 -2403 958 185 -1072 -1357
4567 -1357 1480 -1013 -7390 -4988 -1505 2136 3528 -10 1754 3807 2954 4744 10162 9479 16140
4552 16140 17173 20614 13206 5984 -853 -5794 -3449 -4014 -4388 -4221 -4298 -4410 -6009 -8995 -3500 6198
4536 6198 5719 -3686 -6673 -109 8891 7676 3844 -528 -5164 -5049 3077 1822 573 3858 4583 2649
4520 2649 692 -2978 -5641 1269 -2793 -15447 -8738 -3888 -6902 -6375 -6133 -6753 -14662 -12028 -9438
4505 -9438 -13801 -11911 -11281 -11847 -14168 -11000 -12756 -12838 -9745 -5666 -5511 503 -3222 -4023 -2246 -4706
4489 -4706 -7842 -10249 -3480 1795 8957 9405 8638 2090 2466 4828 1073 -2502 -2219 -154 -1334 3758
4473 3758 7190 4343 5128 3535 4892 1077 2319 1623 4593 1844 1459 5326 9773 6653 10947 14334
4457 14334 13008 7820 4210 2456 4196 6233 1526 -1172 1178 3257 7333 10063 1760 -5104 -5895
4442 -5895 -6777 -8196 -7867 -5635 -3923 1898 1980 75 -5742 -2329 -2450 -1692 -452 2044 -1584 -4412
4426 -4412 281 -1074 -3739 -1970 228 2730 -6035 -7573 -5408 -9422 -5448 -7443 -8609 -12430 -9786
4411 -9786 -1985 -2576 -5256 4500 10285 11704 7413 5412 -82 2302 4338 -1157 -11391 -7759 -3787
4396 -3787 -5455 -8088 -4125 1026 7220 12353 9953 -911 -3780 -9136 -171 -122 -3372 -4875 -3904
4381 -3904 -865 6631 11133 4268 -3453 -4004 -2225 -5937 3064 3803 -255 -2956 -1602 -374 -1326 -5423
4365 -5423 -5670 -262 1891 -4462 -5559 -763 2570 1343 -1489 -2898 -1897 -4995 1083 5052 12204
4350 12204 8091 4215 4522 1582 -5565 -5352 -8821 -7687 -3019 -3830 -11406 -17946 -22480 -11707 824
4335 824 -2203 -1283 1154 3585 5960 2473 3016 13949 9442 2855 5713 7832 6478 3834 4826 6426
4319 6426 10199 8038 3520 -3152 -3454 1564 1358 -2352 -783 2022 -1978 3527 7441 3691 -3496
4304 -3496 -8529 -12752 -14562 -7274 2297 6118 8719 10093 9070 834 -2174 409 3873 4535 5499
4289 5499 5970 4363 -5650 -14780 -19084 -12363 -2685 950 2845 4239 3767 6671 6269 10296 12309
4274 12309 4835 -1712 -3867 -4389 -3644 2051 -918 -4564 -6069 -2421 2283 11646 17271 17592 10286
4259 10286 7076 5018 5228 -2968 -7479 -7461 -3917 2181 3520 233 -3611 -396 5287 4922 -1117 -2626
4243 -2626 4000 -772 -10065 -8817 -4041 5336 10681 14132 10778 -1470 -5447 -6356 -3030 1723 -1017
4228 -1017 -1504 4045 10163 12261 14677 17217 16186 7357 1006 4617 7787 6001 6218 11542 10825 3628
4212 3628 5430 5184 2541 1373 226 1844 1748 23 -475 -2460 -5032 -4127 687 5756 629 -2791
4196 -2791 -5334 -8254 -8237 -7252 1648 3063 4145 1215 4779 -613 -4452 -1737 4303 9886 5607 8511
4180 8511 7267 7658 24 -329 1025 -3703 -6152 -7040 -3850 4358 7349 6934 4175 -1448 1404 7613
4164 7613 12302 9352 4284 4896 6680 -757 -5228 1597 3236 1258 2724 4776 3006 2854 2727 -108
4148 -108 5686 9473 3123 -2730 -4445 -918 311 534 1285 2120 201 -4833 -13707 -14570 -9390 -5406
4132 -5406 -6010 -7745 -12883 -13120 -11048 -9800 -6212 -2890 -2586 -1646 -11314 -20002 -19281 -10918 -2844 -5442
4116 -5442 -9337 -5688 1397 529 -1385 -3206 -3159 537 4093 12051 14381 6776 1235 -1180 -1312 8598
4100 8598 9014 -2539 -1053 -361 1951 -1644 -5199 -5813 -527 9782 6865 1907 -5183 -1324 -2147
4085 -2147 -3458 2843 2782 1727 5971 4407 -6576 -10731 -4416 1108 423 2509 -2116 1060 3428
4070 3428 -2298 -5306 -5153 -940 -2463 356 4598 1417 5394 6271 7920 6806 8049 10054 10506 -796
4054 -796 -8788 -8316 -7076 -4035 5012 13672 15093 11337 8338 3778 21 800 -380 -1484 104 7020
4038 7020 13396 12617 8017 3893 2880 2595 7781 11468 4390 -1294 9255 9177 -3470 -3535 3887 6233
4022 6233 2260 -2840 -3774 1135 7758 5877 1494 1172 4133 1698 6495 12241 8062 2644 -2892
4007 -2892 -5007 -1361 -124 6224 7244 3755 -4569 -865 -1273 -4755 -5417 -77 1116 622 4419 9273
3991 9273 8016 1209 -2112 112 1317 -4483 728 2615 4553 8035 2657 1629 -5708 -6215 -2103
3976 -2103 3304 10916 14519 6771 1079 5149 7329 2526 -2083 -630 3411 7123 10370 9193 12683
3961 12683 9850 6819 5473 7293 1694 -2753 3175 3925 3472 3738 8254 11179 11220 11856 12834 10415
3945 10415 5306 5711 5422 959 -2543 1446 6512 1039 -119 3768 2797 2792 5826 3130 -1767 160
3929 160 8083 10818 5962 5901 6195 906 1105 7324 3642 -277 4960 4438 6259 10828 6556 4962
3913 4962 10034 20134 22608 22610 14575 2831 -7721 -14819 -8716 -4074 -3892 1913 11144 11470 6404
3898 6404 4138 9559 8548 13868 11126 4729 859 1257 6469 13032 7691 5695 8848 5112 3524
3883 3524 6932 10939 7394 49 -2696 -2946 -4898 -4485 -5709 -4028 -798 -2095 -802 1281 7507
3868 7507 8505 2618 -1022 -633 7038 7904 -3134 -11768 -8512 313 -4713 -7614 -2217 -3886 -6907
3853 -6907 1587 4286 -964 1173 9823 8429 4286 4427 9091 9782 5988 3560 116 -5936 -5650 -3800
3837 -3800 2900 -635 -4876 -5026 -9726 -5602 2315 8891 14157 13812 9866 4211 1283 1403 -627 344
3821 344 -422 2569 5218 6705 6632 3320 -2297 -1443 1522 1582 8770 10651 13805 16155 8214 4119 2738
3804 2738 3413 1019 1407 11884 12701 8156 6054 -581 -1644 -819 -4171 -4423 -4960 -8746 -4557 61
3788 61 -231 -6457 -10055 -7303 -6775 -6720 -7661 -1327 4845 5050 66 -6238 -925 4236 5648 12102 7529
3771 7529 2622 -1113 -4504 -13472 -25035 -20752 -11149 -634 5836 51 -3860 -5541 -3960 -2380
3757 -2380 -3794 -537 -3188 1687 185 3310 11151 11714 8518 3203 7111 4480 -2355 -5187 158
3742 158 -141 -272 -1110 -9442 -11754 -11531 -9800 -11233 -1964 -1100 -1500 -5266 -3871 3468 -5717 -8713 -7357
3725 -7357 -4179 -1666 434 -6689 -4090 1107 -2778 -292 10 -1392 2032 1432 -3611 -2607 -1808 -300
3709 -300 -1389 177 3892 3325 3951 6673 2699 -1872 -9029 -4607 -251 -448 -4974 -2198 802 -2848
3693 -2848 -11829 -3480 2337 6017 4874 8719 754 -9307 -11363 -3106 -3901 -7485 -9269 -8394 -8421 -4058
3677 -4058 -4977 -3533 -208 2116 -1402 1324 5905 -263 -3414 -3580 -10122 -8228 -2093 3358 9030
3662 9030 9616 11149 16850 19512 14194 10529 7144 -191 -7190 -4052 2637 9032 5752 -541 -862
3647 -862 2735 -4004 -5759 -84 5292 8184 5635 -2431 -6603 -7643 -2048 -743 1433 -5915 -9863
3632 -9863 -15368 -17655 -9642 -4390 -4832 -3923 -552 -2575 -4265 -1613 4965 10039 15807 18234 10118
3617 10118 2509 4644 1306 4665 -2614 -10543 -10148 -11308 -6500 1835 1161 1936 3392 562 3978
3602 3978 10951 10275 3545 3688 13011 14792 13387 8899 2959 -1164 -12502 -13879 -6729 -4487 4748
3587 4748 8098 6008 496 2782 -275 -1439 -2040 -47 4984 1366 -1940 1017 3821 -1082 -5513
3572 -5513 -3916 1315 7069 4372 2330 -746 4223 1377 -4497 3549 5714 1864 -1689 -4098 -555
3557 -555 1277 2149 4732 2372 1783 1104 2573 3561 -286 -2993 4066 3158 -3592 -9741 -2716 6896
3541 6896 3543 1532 7112 11637 7461 12738 14437 12469 2587 -8366 -5371 2212 3662 6429 8268
3526 8268 5292 1824 -318 -7876 -12693 -7833 -6601 -3409 1223 3838 5940 5376 3731 -5000 -8491
3511 -8491 -6865 -8326 -6639 -2156 -4184 -7552 270 1018 -7222 -10322 -6200 -1723 1503 -3377 -10156
3496 -10156 -8518 -3887 -3820 -5238 -5677 -1159 1474 798 935 302 3872 6085 5210 929 -231 2014
3480 2014 3717 -2904 -5112 -1135 4088 9528 6920 2483 2454 -6063 -4117 7773 7112 7302 8957 4190
3464 4190 -2327 -2243 4558 4842 4718 7096 9067 3928 -3359 -11202 -14068 -9009 -6069 -10655 -10432 -3950
3448 -3950 2360 4983 7465 2161 -2554 1008 4178 13256 11316 9706 4394 397 1477 7362 9247
3433 9247 6052 2776 -1809 -2286 3645 1025 4712 6007 2179 1750 1385 6252 9761 8848 5668 1926
3417 1926 -858 -255 4167 -2164 -5188 -3429 -697 -292 -7928 -5286 1107 5556 7933 5098 7511
3402 7511 13438 3704 1497 -1010 -6651 -2901 1676 3790 3044 56 -4075 -5982 -9403 -7270 -9432
3387 -9432 -14921 -14866 -11889 -5609 -3267 -4953 -3197 -5838 -7967 -4424 -5199 -4655 -3873 -9717 -8148 3099
3371 3099 4865 622 -7125 -8654 -7291 -3582 -1682 -1363 -3245 -2639 -1903 -1973 -2699 414 -410 -3008 3012
3354 3012 3195 894 -3078 -8354 -11770 -12345 -12415 -12593 -7010 -5076 -13644 -15107 -14522 -7785 -3458 -1076
3338 -1076 -3378 -4766 -7465 -10209 -5305 -964 3 -4399 -6941 -7276 -6115 -3271 1529 6765 6257 2293
3322 2293 127 6834 10351 7540 4698 784 617 1910 -452 1821 557 2557 1776 -2262 -762
3307 -762 5845 110 -7489 -12859 -7534 -6796 -6860 -276 3873 8110 7450 6813 5150 6795 2557 2283 8377
3290 8377 9532 6970 1561 -4711 -7542 -12651 -9100 -3790 1156 15 2149 2136 -862 -3349 5866
3275 5866 8773 3326 -839 1512 -435 4605 11883 17033 15303 9726 4229 5947 2325 -5888 -7271
3260 -7271 -289 2681 6957 1285 -2107 2929 6244 1373 -2692 1605 3250 4216 -375 -4068 -14151
3245 -14151 -11266 -6479 -8695 -1270 2286 -1549 1674 323 -5561 -4808 -173 3544 7540 7305 2682
3230 2682 92 -524 -7138 -6792 -3157 -2970 -2961 -5529 -3415 965 -3082 -6593 -5267 -2851 3559 -2762
3214 -2762 -3630 -403 3350 5707 7780 12640 13149 11069 11463 507 -1466 -5590 -8283 353 762 -6429
3198 -6429 -5971 -5398 -3350 -2329 -4165 -2155 -3970 -2421 3539 7263 3510 1569 172 122 148 -2300
3182 -2300 -4831 6128 12553 10009 7050 9180 972 -3348 -1648 -3465 291 4302 8438 12477 6286
3167 6286 714 1001 704 96 -2643 -5088 -5147 -11062 -10261 -5388 -2203 1011 3643 -296 -5418 -7407
3151 -7407 -3519 -7842 -4958 1822 -377 -3482 2615 12037 9743 13255 11197 6560 7066 3724 6046
3136 6046 14991 17825 6748 -5005 -7799 -10867 -8653 -7526 -1887 346 -7187 -1816 -2669 -565 2930
3121 2930 -1011 -1778 4478 4534 -3566 2344 -592 -5657 -6726 -2295 -888 1139 819 -5972 -10786 -14995
3105 -14995 -7562 -308 989 -3052 -6817 -6337 -2552 4540 4997 3033 -5898 -10224 -3741 -2414 1364
3090 1364 3743 1241 -3357 -9076 -5289 4076 3235 -2857 -2679 1205 5004 4064 -1827 -146 2628 3083
3074 3083 4451 2497 7365 13029 12689 4523 -3854 -3904 4188 8545 5455 7234 8471 3611 2838 5273
3058 5273 7539 523 -1852 -1840 -3385 -608 -3927 -2316 -2576 1188 5430 2802 3112 3894 2450 4925
3042 4925 4974 901 -4892 -4874 -3269 -3698 -4520 2695 9586 2679 -1643 -2364 -50 6615 3636 1053 3966
3025 3966 -3739 -6181 -3852 -1811 -1007 5737 2061 3700 3654 -3417 -6221 -866 2103 5266 6679 4477
3009 4477 9184 7770 3706 212 4008 11508 16489 16990 11754 14479 10694 3309 -8080 -10681 -3593
2994 -3593 4705 279 1816 5982 6516 6745 5461 5570 3410 2603 7771 5436 3923 3261 13460 15485
2978 15485 3954 6176 14176 13586 14105 13634 7425 7558 10039 2830 -4518 -4752 -3874 -8369 -10684 -2869
2962 -2869 180 76 9069 11304 13996 17062 12101 5720 4467 -737 -3653 -120 1404 3632 12598
2947 12598 10094 4263 6689 7965 8107 8262 8263 7708 6350 5316 7587 2289 -1751 1169 5963 2061
2931 2061 -7943 -9088 -14638 -21079 -20229 -15403 -9968 -11145 -3802 4374 5584 1109 -3567 -4145 321
2916 321 -1512 -3268 1023 1002 -5056 -7568 -11906 -6023 -894 -3121 -5291 -3773 -5826 -11567 -10904 -5167
2900 -5167 -7951 -5962 -9491 -9318 -6302 -3765 1295 -2559 1719 13219 12334 12713 5734 9186 5388
2885 5388 4327 1966 -778 1067 -1324 -4581 -7983 -13915 -10149 -501 5308 7621 2059 2070 4740
2870 4740 1846 4604 10142 5737 -31 4664 5448 -679 -5149 -7137 -9973 -9534 -4249 -1432 903
2855 903 4573 5283 4012 2131 5775 11150 13242 12955 9562 1304 -5954 -10031 -6010 -3096 -3444 -4770
2839 -4770 -5490 -5564 630 6779 14583 13999 13257 15334 5691 4555 4990 6765 6274 2477 -4776 567 6178
2822 6178 9931 11670 12959 10869 8460 1361 5832 8868 4032 5508 10667 8079 936 -45 1056
2807 1056 1335 -4962 -12141 -6273 4959 10682 6377 3231 8645 12479 8751 9836 4533 4054 6012
2792 6012 5306 1896 1872 3594 7045 6173 3465 714 7984 8764 5795 6369 -125 -715 -1810 1425 2545
2775 2545 4542 3723 7209 10848 6634 1518 940 -1447 -6200 -6844 -720 6751 11032 6021 -5940
2760 -5940 -3948 -3884 -7206 -6134 -5548 -6096 -12437 -16794 -13690 -13066 -14657 -6689 532 -1050 992 5817
2744 5817 4258 12008 14255 9578 7836 6176 7203 6271 4252 -465 -3008 -7172 -7232 -6224 1389 4093
2728 4093 6103 5570 4644 1740 -8475 -9929 -6625 -4072 -2733 804 3482 5780 15099 16743 18957
2713 18957 14368 4103 -6607 -2704 4401 -1942 -4292 -9174 -13566 -6174 -2672 -4418 -6484 -7772
2699 -7772 816 221 -4558 -2851 3925 4922 -646 -6962 -8874 -8191 -4012 992 6499 4269 1618 -1116
2683 -1116 -4424 -312 1153 2336 6065 5106 2442 1198 318 3963 -946 -7878 -10468 -13355 -13533 -14268
2667 -14268 -14197 -5699 -2956 -563 -1045 -5242 -7668 -12852 -14954 -9639 -2828 -470 -2495 -2539 -4391 -3406
2651 -3406 -2982 -9039 -8737 -8653 -2785 -457 -1683 -1692 -1756 -4582 -5467 -3932 -6907 -4238 -1728 -8137 -6480
2634 -6480 -1203 -1159 1493 9009 10534 11090 11921 7905 9584 9738 4868 -1020 -564 -3620 -6481 -2882
2618 -2882 709 -2304 -8388 -5891 901 903 -5973 -6608 753 1187 -202 3700 4521 -1382 1408 7532
2602 7532 -1135 1578 387 -4209 -11684 -12794 -11660 -9342 -1515 6293 1247 -804 -1599 -2795 1464
2587 1464 10060 12781 13997 14542 17854 9248 267 -694 -3847 -4731 -966 1279 -2863 -305 -3129 -6377
2571 -6377 -4636 -460 -245 4481 5043 1059 3388 3107 4449 6107 2487 2223 1205 4230 4857 1020
2555 1020 2263 4682 7586 675 -6410 -5001 -340 408 -1582 -1539 1124 -6351 -3060 3211 218 -8940
2539 -8940 -12710 -10116 -7628 -6110 -2842 -7522 -10883 -3714 -2654 370 156 -6147 -6788 -5979 -9996 -6807
2523 -6807 -1420 1935 -3079 -6214 -9133 -11034 -8059 -5666 -34 251 5224 8949 14411 19330 18435
2508 18435 13246 9164 12173 12294 10903 11444 11334 13369 10558 4126 3917 9660 7503 1888 3315 2964
2492 2964 4235 4867 5157 6688 7081 7224 625 -1123 -2541 -1968 6673 5674 4763 2416 -343 -1701 -693
2475 -693 -6298 -5542 -6096 -5481 -4083 -6066 -3610 -3762 -5322 -10536 -16135 -11086 -541 -1952 -5081 1464
2459 1464 2502 -2612 -1565 -2786 2971 2785 468 -6427 -11109 -11206 -7026 -5363 -7087 -5924 -5124 5193
2443 5193 5114 -3756 -8540 -11949 -19504 -16857 -10686 -9223 -7523 -4962 1613 1106 -7332 -16104 -7185 -1246
2427 -1246 -4474 -1953 3443 -3921 -9553 -6571 -8232 -7466 -7367 -14971 -16267 -18399 -19692 -15622 -8808 -4746
2411 -4746 -2797 -3804 -7379 -3038 -5625 -3609 3172 -3082 2564 9244 5420 620 -2909 -3756 3912
2396 3912 4784 -1182 -11239 -18406 -13162 -13792 -14792 -6928 -1351 2839 1458 -1664 2596 -2800 -10822
2381 -10822 -9153 -1982 996 993 2842 -1713 -4844 -813 321 8 659 2133 6484 3753 850 1446
2365 1446 2472 1709 -796 -978 -7397 -8498 -6059 -7693 -10317 -10766 -9084 -3314 -63 -1783 -3436 -2024
2349 -2024 -191 -4522 -6138 -1273 -171 1597 6818 -1577 -3711 -1946 2366 8403 9677 4861 5965
2334 5965 8468 3285 3917 8674 11448 8319 3537 2599 -108 3173 -4533 -6323 -5626 -1673 4320 7624
2318 7624 10021 10831 5529 1858 -4341 -4824 -2918 -2333 2676 6689 4966 2673 5582 13310 9756 1526
2302 1526 -508 3052 11075 13146 11085 13464 13480 6759 8078 6129 -3729 -6013 -5937 596 4689 7476
2286 7476 4315 10130 5213 419 2551 -1442 -6313 -2768 -2914 -4713 -8592 -10946 -14730 -8626 -1619
2271 -1619 -5518 -627 283 -3633 -6179 -1949 6619 6479 3995 -4818 -4670 3800 5986 3369 -191 -123
2255 -123 1781 5707 4628 -1034 1233 8157 13004 11142 4931 -2537 -8046 -9610 -4353 -4184 -3989 6083
2239 6083 13722 9385 5926 11749 10300 1634 1330 4663 2081 2035 4893 534 -815 699 -1710 -10753
2223 -10753 -8427 -2387 -475 -695 -6247 -4654 -717 5984 8364 7126 10812 7678 6796 10746 10611
2208 10611 5171 4264 6492 6386 6378 5786 5220 -4788 -4974 -4415 -1871 -1741 -2201 591 571 -2948 514 1393
2190 1393 1814 3346 2465 -730 1569 841 -1273 -2929 -8836 -7794 -1597 886 -3953 -2400 1662 1317
2174 1317 6154 7214 5596 -1782 -10341 -18527 -22877 -16147 -3324 1087 -3373 -7648 -632 -2685 -12243
2159 -12243 -11489 -11386 -4072 -3675 -2546 4907 158 -3184 1025 1597 -3157 -3640 -3715 -6253 -9727 -9134 -4682
2142 -4682 2514 -2440 -7827 -12637 -6887 -438 -6146 -4659 1380 3063 2138 -1575 -3557 -8879 -12617
2127 -12617 -8449 -43 -415 2647 2470 2955 5856 7411 -2517 -2766 -4129 2557 7677 12107 10862 9550
2111 9550 7018 11055 11160 3557 887 -6277 -15873 -4190 3954 473 1565 5507 5944 4756 1538
2096 1538 -6497 -4112 -4931 -6402 -2590 5629 8312 5785 1215 3172 756 -2584 -306 -3228 -6437
2081 -6437 -9656 -261 4176 4647 722 -5605 -19 586 2641 -994 -4135 -6431 -8601 2875 8949
2066 8949 4308 750 2365 2787 5983 14610 4494 3904 2270 796 3273 7754 11997 9565 5969
2051 5969 5372 2819 1146 -3291 -3294 385 -349 3167 5271 1032 -88 1788 5270 5624 -3545 -7797
2035 -7797 -7131 -5959 -2373 -4965 -9629 -13829 -8216 170 1773 -469 -3963 -1371 -85 -891 819
2020 819 6557 10161 4397 5787 4101 -306 2776 9567 17528 7547 -1221 -5138 -2169 -2637 2876
2005 2876 9786 5820 1966 3843 7625 791 -4149 2784 8086 5499 1884 742 2124 2214 -1539
1990 -1539 2945 4631 5662 6290 7181 3685 3091 6866 10894 3095 2136 -2381 3924 6393 1918 2021
1974 2021 2142 190 -2459 9816 8241 1837 117 7255 4638 -4190 -9223 -6256 -11066 -13687 -3384
1959 -3384 939 -762 2824 4424 7605 7479 11762 10904 10214 8834 8986 -366 -7174 -5888 3591 5359
1943 5359 7035 10377 6563 -2373 -8030 -5383 4127 2171 -1827 2804 7580 7534 9772 8815 3081 -810
1927 -810 -7268 -6707 -978 -1764 -2946 -7068 -7922 -3666 -5006 -10673 -6013 2446 7246 8915 11679 9163
1911 9163 8958 11458 12822 13490 7784 -1447 -1815 3735 8828 9667 12408 13968 9005 5281 8420 11928
1895 11928 -1507 -11526 -12197 -10585 -8285 -6191 -1622 -4042 -8532 -12154 -8682 -9262 -10674 -7686 -2108
1880 -2108 -4188 -1383 -920 -1901 900 -3321 -3271 -4787 -4485 -3569 2596 4983 392 -868 1315 302
1864 302 -1649 -3919 -3658 -8046 -6440 3582 17671 17950 7866 4587 2979 1372 -1910 -2329 1984
1849 1984 10369 10877 6248 4468 6126 1379 3960 2767 5052 7648 9244 10320 10653 11159 5431 7182
1833 7182 13903 5797 595 6116 15044 13128 18083 13529 6727 3662 5087 4767 6300 9392 5046
1818 5046 7249 7841 12133 12398 15869 21095 11801 745 -1777 -5762 -10446 -7178 -6458 -2782 -1883 -1798
1802 -1798 -1024 5197 7713 5008 6246 10389 5043 -2755 -9132 -5798 -446 -490 780 -273 -2008 2976
1786 2976 11450 11627 14227 15164 5222 -193 908 7024 6375 3398 687 2989 1675 736 3263 5879
1770 5879 8800 4608 2255 -1432 -1405 -4332 -5489 -4069 -7276 -8915 -6902 -3494 2688 2456 -10951
1755 -10951 -11126 -4794 -10858 -18155 -14338 -11057 -9093 -7728 -7516 -6725 -6567 -2749 -1567 8331 4669 -385
1739 -385 1967 4000 2297 3321 9522 5847 2625 5645 4472 2862 5129 1574 -3453 -8437 -10393
1724 -10393 -4132 4263 6804 8250 6820 1992 570 2543 -4755 -10685 -11680 -10960 -9472 -4040 -1897
1709 -1897 4482 10310 9678 6538 2206 7253 4408 248 4098 7263 6066 10237 11348 10447 9621 6710
1693 6710 6535 2576 497 3064 2685 2182 9387 7140 2604 3101 10028 9310 11574 7067 4945 8317
1677 8317 1917 -946 -3333 -4041 -1126 40 -664 1663 2606 5292 -3523 -8740 -4280 656 467 -888
1661 -888 -8259 -8984 2222 11184 2903 -818 4892 6254 4141 6148 6447 10136 15194 14105 9595
1646 9595 7685 10029 21502 22659 13281 12768 15716 10388 8288 6481 491 -2685 -2793 -2792 -993 756
1630 756 15228 20863 14849 8705 1908 -3506 -4791 -10387 -11850 -5807 4864 2698 -559 -4214 -6492
1615 -6492 -7194 -11077 -10623 -1723 4569 2996 -1944 -6552 -13190 -11065 -6271 9 2206 -7138 -10618
1600 -10618 -9186 1164 13773 12354 13031 6519 3100 635 -2020 -8971 -12776 -10369 -6078 -2509
1586 -2509 3012 1136 -571 1717 -3747 -9555 -14678 -17513 -9193 -557 -1965 -6672 -6472 -3892 3649
1571 3649 4916 -311 1059 5489 11427 6897 3921 14319 17091 11312 11966 11317 6675 5900 8923
1556 8923 13375 12826 2244 -223 10172 13954 7915 -881 -2918 -184 251 -4389 1108 -3248 -9312
1541 -9312 -4858 -2010 -1128 510 1249 -1438 -1919 -5347 -2498 1466 5091 3594 4661 7366 6546 3253
1525 3253 -5937 -10141 -3653 -85 4954 -1390 1923 7426 2698 -3391 -7473 -11297 -13545 -6692 -816
1510 -816 1559 -954 -4670 -8522 -11236 -4282 -2658 -770 -4060 -3280 795 1603 -3873 -6002 -2515 7112
1494 7112 9294 4299 -4077 -10956 -5770 1216 -804 -5640 -645 -2286 -5527 -4205 288 7980 1059
1479 1059 20 4113 1854 154 -185 5721 6929 3257 359 2813 -712 4311 5876 4519 1630
1464 1630 9097 5799 2063 -889 -301 3204 7109 9939 7487 6137 6779 12296 13540 16221 14615
1449 14615 4482 -3622 -2380 3197 -2326 -5866 -3869 2070 -1070 -1789 -1062 2043 7404 9017 5544
1434 5544 3923 -1337 -1794 -3284 -3898 -3379 1254 8991 7038 -3426 -16316 -19298 -17670 -18071 -13384
1419 -13384 -5360 -4091 3518 1204 -2903 -4537 -652 1289 3067 1791 961 -1295 -3507 -4141 -3509
1404 -3509 -5157 -4553 436 2016 3031 4027 531 -3561 -4367 -4201 -8344 -13319 -9486 -659 7010 8281
1388 8281 5178 2950 4314 5016 6946 2220 -3405 -4214 3323 6991 4444 4868 683 -7222 -2813 -3525
1372 -3525 -3211 -2904 -1476 -1376 1285 3533 6194 3905 -119 556 2250 8740 12378 7564 3795 -2409
1356 -2409 -1116 -6328 -1811 -2039 -7354 -2560 -6058 -11058 -12217 -11657 -9793 -4550 -2236 -2803 -8101 -18085
1340 -18085 -12897 -5746 -4552 -8037 -8418 -492 -87 2348 4062 -264 -446 3920 -117 3705 10544
1325 10544 11091 9467 2182 -1833 -2498 -1425 4216 7791 5205 3341 5163 3491 206 -7553 -12513
1310 -12513 -10289 -8688 -3000 -5109 -8142 -8300 -9571 -5270 -5329 4179 6284 4766 1186 -3240 -8445
1295 -8445 -11593 -7491 -7445 -3115 955 -11090 -13805 -14556 -4005 593 -3772 -7207 -4464 -4256 -6061
1280 -6061 -66 2725 -789 -1476 4959 3998 -6558 -10896 -11177 -11753 -14033 -13548 -7671 -10190 -8622 -10849
1264 -10849 -13477 -11612 -5676 -6552 -5475 -10897 -14025 -15119 -8612 3324 7205 5084 1339 -3658 -1503
1249 -1503 2615 -2155 -4614 1476 4653 6045 6603 6058 6891 4348 4236 105 -6508 277 3357 9763
1233 9763 19594 22385 17929 9940 3074 -580 -197 1172 653 7680 13952 6911 2075 2192 4691 5925
1217 5925 3034 3874 -481 626 3417 4204 2037 -408 -1680 -2166 -1509 1642 -68 -4272 -4323 -953
1201 -953 4835 8771 7196 2492 6840 4198 1180 2032 7166 13911 8301 7622 7091 9059 9087 7369
1185 7369 4368 2435 1701 2998 2264 5548 7766 1281 -7876 -9461 -8042 -8288 -3116 -3685 367 4192
1169 4192 6395 2414 3192 5897 5442 10798 6937 2958 1910 165 -2542 -8754 -4192 -2836 -847
1154 -847 3872 8771 2900 -2015 -253 9122 8299 4448 5468 8066 10835 4889 790 370 -1131 -1376
1138 -1376 -2760 1359 133 -4446 -8383 -3923 -4393 -3901 -5870 -6252 -8117 -13365 -11886 -4642 4805 4364
1122 4364 -2553 -6602 -4684 -1028 -3524 -4214 -4166 4390 2809 -909 484 3694 3901 1225 6192 926
1106 926 -972 -5146 -13347 -890 6643 4040 3239 2726 2788 9998 9099 4462 3198 -22 -3886 -8711
1090 -8711 -10750 -12282 -13596 -11132 -10658 -16603 -15544 -9034 2974 6680 11154 10304 13090 5097 869
1075 869 1358 3045 10139 10962 985 4101 10602 3748 32 -881 438 4289 7228 6028 5794 -414
1059 -414 -2551 -3743 -716 5231 6635 6351 4682 545 -1369 -7091 -5173 3379 6110 5917 -2236 -9879
1043 -9879 -10321 -9631 -4005 -1332 2300 3737 5693 4688 -2641 674 4648 -1501 -764 -1239 -7007 -6789
1027 -6789 -5716 -4052 -3056 -6351 -10795 -10763 -9291 -10608 -5181 -2987 68 1116 5520 2834 -1723 -200
1011 -200 -5912 -7281 2799 5861 2193 -2193 -983 4181 6208 1630 -3022 2862 7727 4558 447
996 447 -1380 1041 5025 4687 2959 -7398 -7594 -3312 -3265 -3860 1911 983 2056 4506 8866 1708 -9827
979 -9827 -12082 -10612 -4407 -675 -868 -5186 -10366 -7484 -10062 -6365 -8561 -7174 -434 3296 30
964 30 -4262 -3975 -4971 -8156 -5679 2460 10043 14558 12055 9183 9218 8002 6036 5854 792 -1137 1482
947 1482 -3772 -5287 -7667 -3916 364 756 -3716 -303 -861 187 391 -3907 -8812 -4248 -2054 -5273
931 -5273 1604 10892 13108 11019 5971 3494 -1115 393 -2820 -3335 -9406 -11378 -6248 -5802 -9454 -10254
915 -10254 -7609 -8164 -3523 -1101 -5084 -3298 -6023 -5549 -8311 -6643 254 1989 1100 5268 11289 7950
899 7950 4314 2166 6888 9735 7182 1079 -4565 -6460 -5707 888 5679 4480 2307 -2469 -4151
884 -4151 3839 2391 -1615 -2333 -1764 -4319 -5371 -4627 -1031 6799 7048 11192 10287 8950 6682 4481
868 4481 4961 4880 2824 -261 -5197 -7242 3663 10173 2603 -7671 -10425 -7711 -5126 2888 5582
853 5582 2643 2170 535 3817 2241 -1412 -8496 -4505 1220 3582 9440 10293 5053 4681 13422 12288
837 12288 13025 13303 10946 10144 12913 15828 5289 5579 1041 -5640 -6871 -2912 -1816 -4154 -6064 -5783
821 -5783 -3462 -7102 -3416 -4222 1246 -1321 -836 4619 8701 9973 4224 -2455 1579 5537 737 724
805 724 -4520 -3779 778 6679 6044 9030 7464 5704 2728 -2125 -2646 -2602 -1333 3177 4622 3106 2173
788 2173 3059 9578 10044 10785 15159 15638 12592 6533 2781 77 4547 3702 -1938 -3924 -4492 -13173 -10785
771 -10785 -5537 2052 4552 4946 4838 8631 7160 5858 -2166 -9892 -12174 -18831 -13454 -8063 -5560
756 -5560 -2306 4228 10039 3443 -91 -1639 -5034 -7873 -5129 -1230 -1307 -5258 -5273 -9605 -7320 -1221
740 -1221 2668 2095 -2911 -6814 -11282 -13329 -11655 -7760 -1085 4680 4258 2656 -3028 1670 -347 -3669
724 -3669 -848 1705 2043 4676 4848 4041 -1945 -3230 -3327 1603 9173 7760 3052 194 4600 1869
708 1869 -3056 -3192 1237 -1703 -9545 -11269 -11034 -7168 1460 9414 5834 1185 -3314 2173 3351 -388
692 -388 -52 4876 4439 3466 -2239 -9845 -9538 -5115 -516 1502 3223 11109 9763 2536 4874 9383
676 9383 8654 9851 12171 11434 3570 9852 17657 17429 10836 5754 8564 12392 9738 5714 5218 5481
660 5481 4708 4619 -1360 -3870 -9953 -6416 -1896 -6737 -315 1629 1232 -745 1010 2215 5233 794
644 794 437 936 1507 -2378 2797 -2102 -724 -957 4194 1942 2681 -658 -1792 -1598 -353 3603 8132
627 8132 9082 3105 -2938 -5487 -11137 -8112 -1651 3391 6859 4915 -924 1808 -563 3586 9681
612 9681 6864 4068 -1428 -4615 4322 9642 8259 4979 -3895 -2566 482 3401 2439 4070 2379
597 2379 2785 9588 5420 6848 3751 -644 -209 -3185 -3634 693 1695 4426 1852 -6818 -7698 615
581 615 4997 -1440 -4927 -4919 228 111 5610 15912 16572 8513 7334 9344 7592 2650 313 1059 8579
564 8579 10263 6858 4202 8665 10641 14428 16115 6578 -354 -10210 -9108 -6765 -44 4598 6046
549 6046 7489 8393 3673 -3558 -6037 -8660 -8014 -5409 4292 5900 4230 6079 2054 -1783 -2042 -3216
533 -3216 -6028 -8543 -5000 -2605 -3868 -64 -4002 -853 1251 -5672 -10057 -7995 -4597 3721 3846
518 3846 4995 -1363 -5421 -5631 2137 3330 -105 2656 3789 338 -336 4037 7897 8192 2691 -1213
502 -1213 4310 9420 6981 3280 3981 1194 -2231 14 3243 -1248 -3544 -334 2117 6057 8798
487 8798 2825 -740 1699 5967 333 -200 -6404 -10298 -11908 -7447 -924 1041 -814 4053 -2572
472 -2572 -9019 -8606 -6620 -6464 3713 9925 9335 1951 2057 5712 13183 15486 14689 17742 9825 6965
456 6965 8254 6094 4028 1654 -2303 972 8604 9292 6506 8818 5392 4482 7185 298 -3883 -4513
440 -4513 -5657 -7352 1109 8179 8747 6357 239 1030 4482 4420 181 -1475 -4866 -777 3877 5277
424 5277 3878 4183 948 7082 7939 5314 -425 -2413 -6364 -8243 -6642 -8514 -4701 806 -1348 1844
408 1844 3232 498 1854 -1421 -3064 -6570 -4711 -1549 -1158 2665 1630 -3823 -7515 -7839 -11444 -7600
392 -7600 -3795 -761 3744 6373 14092 9909 -1811 -2048 -5165 -8288 -7730 -5310 18 6582 4895
377 4895 6704 3478 5091 6975 4893 -5626 -6463 -1967 5928 6018 1379 -950 -1894 4671 1599 -2371
361 -2371 -9702 -7475 -4433 -4093 -2360 6480 9052 11176 11278 9484 10343 16225 15649 5714 -3935 -1944
345 -1944 4958 7924 5987 4075 3754 3213 440 -5533 944 4569 6790 6550 1576 1479 5670 1305
329 1305 2636 1949 2107 788 885 5458 5936 7285 8349 9267 10147 4522 2889 7152 9627 9721 12358
312 12358 5265 -6358 -13943 -6078 5798 3688 744 2793 3664 80 -450 641 -5013 -3875 4070
297 4070 -2355 -1399 5399 5520 1616 -1229 1146 12771 7095 -245 63 2631 2311 69 2193 6493
281 6493 3446 -1416 3865 1013 -2261 -3708 -365 -3259 -995 -1490 -4912 -5443 -1772 -3601 904 2981
265 2981 -1250 -5504 -7993 -2514 4216 3851 -931 1565 6676 4792 635 2128 1541 -2911 -810 3937
249 3937 3915 7383 10206 6593 3813 2603 -115 -2653 638 -716 -9879 -8793 -1839 197 176 -1927
233 -1927 -1561 -533 2123 341 -1994 -2089 1394 -28 -3610 -5044 -7990 -4882 -416 4578 10188 9345
217 9345 14706 21207 19682 11654 7378 5737 4058 511 -2408 -414 3800 394 -3532 -1137 3555
202 3555 2947 6201 2202 314 205 1314 -157 2279 6234 1788 -2584 -2401 -1424 2901 4746 5076
186 5076 4547 4137 1807 2763 -2586 240 6738 4955 7011 5654 -1135 1076 2193 2297 6933 16626
170 16626 11322 2590 4278 12755 9794 3506 -272 -956 5522 8080 2229 545 717 1527 3211 5684
154 5684 11364 8952 3761 1212 627 22 1491 903 1507 365 -415 3272 4403 2814 1274 1072 315
137 315 -2132 -2521 -1636 -184 1936 9201 10645 2367 -3369 -6475 -1178 -1277 3308 4427 8939 5158
121 5158 3932 3743 3552 3229 3026 3345 7181 10320 8304 682 -5159 -5061 -2219 -1313 -1446 -2821 -3019 -2044
103 -2044 -2616 -2860 -8105 -10214 -5254 957 664 2638 3542 2922 1683 1764 -694 2918 3041 2458 5676
86 5676 6291 5421 2773 2459 3119 2854 2471 3162 -331 -4379 -2401 -2084 -537 1636 2258 3977 1641 342
68 342 660 2253 610 184 -2015 -3528 3501 9402 10056 7990 4862 4970 3429 3256 9264 12273 7008
51 7008 5026 1965 990 1898 9308 10350 4323 8 197 58 1192 -1739 -3249 -2324 -3011 -4667 -4199
34 -4199 2526 5165 3989 6501 7432 6535 6657 4381 305 -1185 -2655 -1911 -1865 -5527 -5368 -1947 3452
17 3452 7752 8390 6399 5493 8566 4579 3147 -2778 -2364 -667 -2059 423 3769 3359 562 3980
1 3980 8583
0 8583
$$ Imaginary data points
##PAGE= N=2
##DATA TABLE= (X++(I..I)), XYDATA
32767 26267 29334 34776 37133 33779 33568 35953 40979 39723 37893 34389 37608 39415 38753 38611 40279
32752 40279 38709 39834 35976 37392 39066 36933 38832 43522 42927 45529 48330 47115 48796 49084 47506
32737 47506 48963 47399 45328 39031 35933 41251 48986 51180 50803 52564 51765 53781 51188 50495 51905
32722 51905 54803 54266 53072 52769 49954 49637 50467 49892 51628 56534 61078 62960 61690 61188 57199 55032
32706 55032 55802 59724 67243 66170 65331 71431 70102 67311 67322 68898 65981 66505 64038 58962 66825 75487
32690 75487 75654 68139 68085 69874 73395 76637 76086 74745 72620 72522 74613 75114 75371 76010 75504 79477 84282
32673 84282 83619 84330 82278 78770 76174 76660 77926 78202 83957 82104 82633 82065 82156 83212 87225 90715
32657 90715 87941 85167 83228 83524 85659 89544 88829 86950 85345 85445 87410 85547 84016 81702 80360
32642 80360 83326 87519 86545 84621 84176 89058 92464 88971 91864 94111 94202 95453 93755 92359 94883
32627 94883 98325 96171 91718 92453 91988 91859 93270 93225 100976 99416 101982 98418 98454 101566 104494 102657
32611 102657 103875 104913 103948 102006 106168 109363 109525 103375 98981 95987 98019 103736 103419 99123 102401
32596 102401 105367 109788 109409 112411 116147 113905 111705 110605 107349 103417 105912 101470 100937 110577 115822
32581 115822 117630 114137 108603 107415 113264 109813 108391 113588 116317 120381 118338 110294 110962 112099
32567 112099 112302 108843 112187 117032 114331 113161 115769 116838 114652 116982 122386 122698 118476 122788 126666
32552 126666 125352 126130 121190 116237 119752 124033 124408 121574 122095 123892 123013 127519 122833 121277 132879
32537 132879 132693 128194 128027 126284 127433 133508 137385 135352 139674 144102 141654 136703 135688 131671 134032
32522 134032 136187 139282 142931 139051 135109 133273 131391 135888 129787 130213 130240 137182 144702 152595 152120
32507 152120 149708 144961 141349 138081 132665 128614 130635 135097 138513 137606 132951 127565 125578 138483
32493 138483 142631 139242 131841 126667 126382 130193 142298 152051 152461 155342 153973 150954 148982 147270
32479 147270 146223 149589 145975 146271 148919 144641 139924 140027 137777 136207 140851 148714 152528 149975 141248
32464 141248 138766 146895 151417 149015 146838 146849 148580 151481 154570 150545 146247 149653 151718 157147 159740
32449 159740 156304 150053 144943 142299 146019 150485 153556 158095 161356 153056 154079 157359 158078 162355
32435 162355 160305 160293 154170 151994 154377 156701 157233 158073 160981 162597 164937 163734 154295 153640 155233
32420 155233 153250 150103 146091 148638 153764 159190 157933 155996 155059 155744 158989 159713 155968 157158 157167 155034
32404 155034 148221 146603 146152 148663 153740 159924 159489 155059 151329 149776 158549 159131 158098 158018 159693
32389 159693 165043 162881 156590 154958 156403 159807 159125 161559 166138 171705 179297 180048 173877 166252 174047
32374 174047 177433 172116 165950 158454 156597 153451 158907 169421 175919 175452 165612 166295 165151 168570
32360 168570 174980 172807 170241 170399 164845 166233 165258 161806 164908 166143 169105 167211 166274 166179 167175 166491
32344 166491 166893 166658 168317 167803 166516 163900 172988 177163 173801 174877 173402 171470 165645 162504 164149
32329 164149 174109 178688 176003 170183 167143 175790 175991 174685 177348 178914 180603 176000 178067 178989 182424
32314 182424 183485 180596 177602 173758 170593 173390 174002 172375 175768 176411 176716 174904 187618 196378 193042
32299 193042 185287 177085 173695 169563 168078 171088 176009 175165 167640 172706 176419 174395 168072 171685
32285 171685 178169 180348 184500 185469 179872 175865 173848 171129 172159 172923 172942 176885 175100 174476 174272 178586
32269 178586 176582 168943 167534 171614 174540 182837 187355 188827 188888 189123 186362 187843 188155 182689 178191
32254 178191 176735 183988 188180 184203 183797 177561 166974 169148 169981 165865 165164 167684 171665 177163 178885
32239 178885 180572 179421 176725 178688 185201 190878 193180 190300 190507 187982 185670 182729 180726 179677
32225 179677 180578 178913 179138 178154 181581 185326 183869 178165 171351 174111 172921 176036 177717 179200 181809
32210 181809 185540 187376 185174 182029 174241 163207 163687 171240 170675 171072 177488 183000 178541 173282 172600
32195 172600 177528 182381 184823 187366 193332 188655 176589 176056 183856 184510 177242 182395 185055 184991 188538
32180 188538 193367 193127 190581 188574 180281 173706 179582 179489 179553 183253 176590 171800 177406 180452 183161
32165 183161 185534 185084 183857 183954 183318 178652 177357 178270 185600 189110 184387 188019 190446 191737 191959 191776
32149 191776 185720 181836 184409 192074 190001 184219 183868 180727 177545 173901 176096 183132 183706 180131 178984
32134 178984 181541 183649 182845 179552 172219 174977 182724 178224 170273 173060 191434 193639 179848 174371
32120 174371 172016 176935 173341 178317 182935 186142 184725 184136 185117 187266 191407 195435 198305 188535 181917
32105 181917 178343 178731 181158 183028 186745 179195 175903 183045 183959 186558 184980 182383 184725 190030 190870
32090 190870 192279 188304 177493 169228 162975 160578 165963 173532 181755 181382 179030 181612 181964 180337
32076 180337 175286 174371 180500 181739 179582 182395 182457 184208 180546 180185 180382 177727 175643 179041 186039
32061 186039 187313 184081 178746 177882 175623 174567 174317 178262 179650 180433 179906 182392 186905 186901 182844 180528
32045 180528 181239 182496 186408 184920 188430 184943 179938 183426 183448 181057 176700 173527 184142 189192 188951
32030 188951 189388 189185 185596 191422 190985 187871 184419 180336 176187 176453 178590 180668 175103 174067 173805
32015 173805 174508 181651 184206 181588 180916 177341 181699 184913 181838 177944 182448 185138 188431 188286 186776
32000 186776 192267 193152 195664 192848 187402 180897 180594 176756 168241 165795 169560 171158 176553 181488 177456
31985 177456 179433 173814 173609 184200 184998 177723 174329 173869 179272 188210 188941 179614 176475 174564 178980
31970 178980 180916 181876 180758 177338 183811 193187 195314 193671 193717 192472 190866 189841 186719 184371 178664
31955 178664 186150 192778 190778 194198 195589 191864 195172 200151 196622 193005 190130 186652 183964 194258
31941 194258 195591 194912 193763 185811 189170 190217 185540 177744 178285 181054 184077 179376 179188 186102 189547
31926 189547 188121 189958 194255 197938 200056 198152 194400 192355 192893 188476 188291 191297 195620 197125 197412
31911 197412 189358 186947 185528 183891 184524 187321 190206 192579 182179 181250 189879 189880 189217 188015 186983
31896 186983 194038 199193 194060 186720 191068 193198 197202 200885 201138 201947 196552 194816 191512 190166 191778
31881 191778 192736 191223 186548 184124 186483 189043 190829 188138 183510 183729 185306 190117 194996 196077 189655
31866 189655 192759 197551 196869 194868 194609 192606 190992 183765 177841 173681 177140 181008 181813 181655 189195
31851 189195 183492 179939 180801 184924 184374 186632 189520 194973 198398 195412 185304 185921 191946 191105 192059
31836 192059 196072 190885 190523 198513 200264 195226 194266 189127 188475 189997 187047 189615 185534 179432 183471
31821 183471 180143 176969 179083 179237 179778 178674 180218 185749 187458 189343 186357 184933 178085 174062 176891
31806 176891 181900 179978 180365 186970 183671 183672 190986 195925 194061 192207 183076 177747 180234 185557 187248
31791 187248 186900 185968 188189 188477 184713 181647 179189 182470 189246 187192 179936 183573 189142 192581 189744
31776 189744 187930 182505 180017 185001 186060 179224 169796 173950 187896 186137 188143 192155 194211 184851
31762 184851 179410 174470 173566 177097 177750 178207 180789 183250 187622 189359 188817 191258 192318 186032 182666
31747 182666 184429 182872 185368 185368 187672 187915 188692 184503 188703 192535 191409 184929 182741 182461 183550 186334
31731 186334 189047 187323 186611 192614 191946 187766 188912 188729 187553 188964 191493 192678 193058 191774 193385
31716 193385 193632 194857 199171 202877 200708 196329 194738 193896 188639 184520 180132 181947 188186 188372 182425
31701 182425 185770 183538 178697 184951 187709 187455 188168 190987 186660 186279 182669 179245 181537 185491 192460
31686 192460 193018 189789 189646 195126 195486 194136 184910 183301 186232 188403 187861 187589 184455 188119 191176
31671 191176 193670 197850 191403 190725 185829 182403 191872 199137 190099 180387 181933 181982 184216 187838 193200
31656 193200 195560 193655 189833 181734 184497 189659 192675 191636 195795 193682 195762 196028 189209 186485
31642 186485 186206 187789 191819 187786 189634 188944 188575 190787 193159 189767 187225 189618 193996 200709 198769
31627 198769 188911 183908 192532 191733 194714 193878 194061 193477 194276 185502 180431 181924 185253 187036 183396
31612 183396 183753 185141 188942 190772 186167 181585 184243 188773 185749 189004 191062 192920 192597 184292 180302
31597 180302 183256 189555 187310 192876 198391 195648 190100 186572 189049 186902 191735 193698 191409 188518
31583 188518 190511 193046 192654 188267 191507 193786 201685 195238 185005 185193 184800 182417 181433 185461 184939
31568 184939 188636 186611 182484 183930 186145 189966 187892 189259 188320 191238 196182 194449 196059 195505 192525
31553 192525 187321 186466 185251 188691 190435 182694 182005 190284 188354 187862 189497 196956 204149 202763 202771 195742
31537 195742 184017 185097 184754 182334 179540 177847 176517 175077 179606 183377 186892 180159 183428 190583
31523 190583 194353 200705 203406 200058 194109 190592 188784 190344 187913 192828 194759 192034 185178 187374
31509 187374 186629 189201 190546 186635 186347 182572 178592 190430 185860 183890 193141 203871 206184 200185
31495 200185 190321 181744 182126 187341 189512 190835 191474 193705 196256 199640 200375 197385 188817 188233 198324
31480 198324 200212 195309 191975 186033 182590 189009 189749 188797 196164 197105 196210 195839 191190 181503 179502
31465 179502 187687 185297 191119 195168 194503 194067 188939 183968 182467 187752 184976 181250 180877 178848 179130
31450 179130 187610 186435 186702 190746 195398 193779 192580 191321 188768 193126 200088 196524 188019 190814
31436 190814 189023 186073 184463 191884 198894 200967 193277 194706 191630 190696 185852 183118 187061 187593 188006
31421 188006 188924 192243 195904 189008 184346 191314 189401 190218 190450 191858 196063 195722 195032 193725 191912
31406 191912 193899 191335 196684 195472 196810 190222 186577 188603 189362 181896 190297 190556 191123 193276 190386
31391 190386 193116 191342 188793 189208 188206 191039 188660 177832 181013 179792 182752 188529 195985 194397
31377 194397 192351 188510 191592 202042 212126 211741 205408 196171 191718 192518 189204 184507 178638 180950
31363 180950 181825 184540 188244 187489 186212 192874 189956 184265 190032 191204 185789 183650 184536 186474 179589
31348 179589 183720 186812 191080 196947 194305 198515 201131 198242 199875 199884 194048 191970 185067 180305 183288
31333 183288 187086 186503 188848 194364 195283 195328 194149 189896 192843 194510 195446 191275 192592 191675 190801 192382
31317 192382 191664 199268 197203 198355 201387 192018 190931 189956 187377 190661 190388 187722 190327 186655 178817
31302 178817 174046 179659 185106 182192 175890 179611 189937 193108 190288 195262 199871 199148 194294 188844
31288 188844 183944 188882 192504 194482 192749 188364 189637 198657 196897 197473 200243 199441 194350 192795 193826
31273 193826 195508 193416 196684 193141 188917 191545 195404 204131 203272 192804 194589 193048 185334 184323
31259 184323 188705 187983 187797 188933 191450 192184 192447 186815 185911 194176 199376 196515 190570 188462 192281
31244 192281 197559 204924 204062 194610 189458 193005 199060 196414 189305 184045 178451 173267 181029 190287
31230 190287 186065 187567 186249 184635 185124 190110 191035 194096 197928 201507 199724 195086 197660 196986 194392
31215 194392 197802 194150 190023 187596 189395 192271 191250 188233 182942 181841 182517 188671 193594 183189
31201 183189 179207 174603 182245 188322 185831 195424 200334 195176 188719 190604 187305 184241 185615 192720
31187 192720 201174 206764 200068 193973 194407 193725 188856 187792 187180 188969 190931 188039 188912 196830 198915
31172 198915 199857 197924 193010 189339 187293 187205 181391 183496 189926 191970 192609 190083 186283 188235 181943
31157 181943 189640 196473 196792 195947 192648 192840 195565 194198 196817 201177 198977 195484 199397 198585 195418
31142 195418 188596 193029 200889 207708 206472 203618 200702 197646 201118 202146 194817 188469 190093 193157
31128 193157 194658 198453 198854 195210 189971 189234 188173 186709 189261 189696 197152 192735 189433 182190 189355
31113 189355 193763 200695 204964 207709 203734 191778 189681 195846 197974 199750 200502 200601 199140 201514 197337
31098 197337 199887 204654 201383 201108 195474 190596 192295 191467 191688 188791 188626 190382 189763 185208 187360
31083 187360 184513 179368 181490 192188 196336 201074 196505 190523 191126 191045 189068 191867 195518 199322 192223
31068 192223 190442 197024 199229 196502 189657 184509 190811 193246 196245 193202 188591 187441 191098 195391
31054 195391 197839 196024 189004 198065 201473 194512 195569 197521 187116 186378 189643 199341 204514 204338
31040 204338 209815 210836 211407 199999 193402 193895 197958 200206 203283 205441 206160 205046 202986 201384 200236
31025 200236 198434 195284 194441 195468 194110 189584 184498 182470 187500 197853 194982 196601 195497 198946
31011 198946 200747 195866 195073 194483 196606 190163 193834 198793 206651 209421 204026 199360 198739 201604 210372
30996 210372 216248 215580 209305 202382 204232 199037 196421 198251 195744 191248 190986 191358 194955 192366 191446
30981 191446 197301 202480 196770 188758 189968 187705 185787 191390 190825 193947 193833 191568 195278 200223 198135
30966 198135 199173 200534 199718 199644 197276 197957 192649 193749 194588 197499 197139 202374 206959 208354 205273 209102
30950 209102 208665 196503 190371 193334 200625 201532 197270 196483 200596 200256 200055 199888 197707 200758 201318 202737
30934 202737 203193 196203 188380 186782 201654 203368 199945 199188 196453 194575 194116 196500 196995 197753 196750
30919 196750 203755 203388 194865 192893 194956 191037 190639 196237 201546 200853 196103 195144 200851 199513 200695
30904 200695 201980 195624 195614 193441 196619 200968 200301 194586 198627 204946 203482 194583 191181 194908 194269
30889 194269 196644 195289 194349 188077 183609 191432 193424 190175 188032 194426 192725 188340 187106 187877 187773
30874 187773 187536 184666 185600 186240 187893 188778 192851 195637 190403 187294 189297 188132 190674 193821 191748
30859 191748 191606 189164 183124 189151 197223 190618 197524 201192 195480 191454 187850 198061 203748 203501
30845 203501 197618 197041 199593 196838 193968 198600 199368 192655 192692 196851 198467 202282 200943 202493 197597
30830 197597 189853 189609 192916 190918 195716 198519 200869 199948 208302 212756 209869 202959 200419 197881 191631
30815 191631 197586 196760 189846 192446 200632 197747 193593 191092 197583 203096 203800 199263 194122 193609 198873
30800 198873 202123 206358 207663 207976 200153 198669 199999 198303 199357 199387 193745 200028 198865 196724 191403
30785 191403 187152 194250 194005 190739 190568 186317 192326 202556 199959 196267 200167 200397 202483 201789 199098
30770 199098 195888 200404 207124 206269 204268 206565 208055 212157 211356 207193 199544 198884 197807 190238 190282
30755 190282 190164 192623 203447 211911 210243 203107 200450 197475 196294 197330 196518 198065 197925 196273 193497
30740 193497 196703 188722 184468 186594 191797 193480 190012 190522 196991 193293 187662 187504 190793 189101 193031
30725 193031 199806 198816 198944 201977 201966 200005 206198 204494 192670 186217 188412 191003 197580 201183 198020
30710 198020 203505 208390 217936 212623 199402 192734 192808 193814 195750 197629 194120 191291 193316 193151 193443
$$ [...]
##END NTUPLES=NMR SPECTRUM
##END=
