##TITLE=Analysis number 328883
Compound Code cc 55509
Book Reference 540/14
Project Code adrs
Chemist Name mikem
##JCAMPDX= 6.0         $$ Bruker NMR JCAMP-DX V2.0
##DATA TYPE= NMR SPECTRUM
##DATA CLASS= NTUPLES
##ORIGIN= Bruker BioSpin GmbH
##OWNER= nmr
$$ XWIN-NMR		Version 3.5
$$ Thu Jul 12 13:33:41 2007 GMT Daylight Time (UT+1h)  MAYBRIDGE\nmr@NMR_250MHZ
##.OBSERVE FREQUENCY= 250.131544655141
##.OBSERVE NUCLEUS= ^1H
##.ACQUISITION MODE= SIMULTANEOUS (DQD)
##.ACQUISITION SCHEME= undefined
##.AVERAGES= 16
##.DIGITISER RES= 18
##SPECTROMETER/DATA SYSTEM= dpx250
##.PULSE SEQUENCE= zg30
##.SOLVENT NAME= CDCl3
##.SHIFT REFERENCE= (INTERNAL, CDCl3, 0, 16.522)
##AUDIT TRAIL= $$ (NUMBER, WHEN, WHO, WHERE, WHAT)
$$ ##TITLE= Audit trail, XWIN-NMR		Version 3.5
$$ ##JCAMPDX= 5.01
$$ ##ORIGIN= Bruker BioSpin GmbH
$$ ##OWNER= nmr
$$ C:\u/data/dgb/nmr/ADRS/870/pdata/1/auditp.txt
$$ ##AUDIT TRAIL=  $$ (NUMBER, WHEN, WHO, WHERE, WHAT)
(   1,<2007-07-12 13:33:15.47 +100>,<MAYBRIDGE\nmr>,<NMR_250MHZ>,
      <created by zg, POWCHK disabled, PULCHK disabled
       configuration hash MD5:
       76 6E 9A 78 1E 09 19 81 EC 84 63 8F B0 6A 59 2D
       data hash MD5: 64K
       39 24 E4 1F 4A 39 25 3E 26 AE D1 42 46 7C 88 8F>)
(   2,<2007-07-12 13:33:30.62 +100>,<MAYBRIDGE\nmr>,<NMR_250MHZ>,
      <Start of raw data processing
       ef LB = 0.3 FT_mod = 6 PKNL = 1 SI = 32K 
       data hash MD5: 32K
       EA 57 C1 65 7C 84 ED 6A 22 2F AB C4 27 64 09 73>)
(   3,<2007-07-12 13:33:32.56 +100>,<MAYBRIDGE\nmr>,<NMR_250MHZ>,
      <apk 
       data hash MD5: 32K
       F5 B6 C4 8B 53 F7 06 89 31 6A 97 DB 8E 0B 74 8C>)
(   4,<2007-07-12 13:33:33.40 +100>,<MAYBRIDGE\nmr>,<NMR_250MHZ>,
      <abs ABSG = 5 
       data hash MD5: 32K
       4F CD 8A 2E 3E 73 02 0E CE 7B 36 A7 45 1D DA FE>)
$$ ##END=
$$ 
$$ hash MD5
$$ 71 A3 D9 72 09 03 46 6F F5 CD DB 64 EA 0E 82 B0
##$RELAX= 
##$RELAX= 
##$RELAX= 
##$RELAX= 
##$RELAX= 
##$RELAX= 
##$RELAX= 
$$ Bruker specific parameters
$$ --------------------------
##$DU= <C:\u>
##$EXPNO= 870
##$NAME= <ADRS>
##$PROCNO= 1
##$TYPE= <nmr>
##$USER= <dgb>
##$AMP= (0..31)
100 100 100 100 100 100 100 100 100 100 100 100 100 100 100 100 100 100 
100 100 100 100 100 100 100 100 100 100 100 100 100 100 
##$AQSEQ= 0
##$AQ_mod= 3
##$AUNM= <au_zg>
##$AUTOPOS= <19 >
##$BF1= 250.13
##$BF2= 250.13
##$BF3= 250.13
##$BF4= 250.13
##$BF5= 500.13
##$BF6= 500.13
##$BF7= 500.13
##$BF8= 500.13
##$BYTORDA= 1
##$CFDGTYP= 0
##$CFRGTYP= 5
##$CHEMSTR= <none>
##$CNST= (0..31)
1 1 145 1 1 1 1 1 1 1 1 1 1 1 1 1 1 1 1 1 1 1 1 1 1 1 1 1 1 1 1 1 
##$CPDPRG= <>
##$CPDPRG1= <>
##$CPDPRG2= <>
##$CPDPRG3= <>
##$CPDPRG4= <mlev>
##$CPDPRG5= <mlev>
##$CPDPRG6= <mlev>
##$CPDPRG7= <mlev>
##$CPDPRG8= <mlev>
##$CPDPRGB= <>
##$CPDPRGT= <>
##$D= (0..31)
0 1 0 0 0 0 0 0 0 0.06 0 0 0 0 0 0 0.0002 0 0 0 0 0 0 0 0 0 0 0 0 0 0 
0 
##$DATE= 1184243594
##$DBL= (0..7)
120 120 120 120 120 120 120 120 
##$DBP= (0..7)
150 150 150 150 150 150 150 150 
##$DBP07= 0
##$DBPNAM0= <>
##$DBPNAM1= <>
$$ [...]
##$SUBNAM7= <"">
##$SUBNAM8= <"">
##$SUBNAM9= <"">
##$SW= 20.6930455092707
##$SWIBOX= (0..15)
0 0 3 0 0 0 0 0 0 0 0 0 0 0 0 0 
##$SW_h= 5175.983436853
##$TD= 65536
##$TD0= 1
##$TE= 296.16
##$TE2= 300
##$TE3= 300
##$TEG= 300
##$TL= (0..7)
0 120 120 120 120 120 120 120 
##$TP= (0..7)
150 150 150 150 150 150 150 150 
##$TP07= 0
##$TPNAME0= <>
##$TPNAME1= <>
##$TPNAME2= <>
##$TPNAME3= <>
##$TPNAME4= <>
##$TPNAME5= <>
##$TPNAME6= <>
##$TPNAME7= <>
##$TPOAL= (0..7)
0.5 0.5 0.5 0.5 0.5 0.5 0.5 0.5 
##$TPOFFS= (0..7)
0 0 0 0 0 0 0 0 
##$TUNHIN= 0
##$TUNHOUT= 0
##$TUNXOUT= 0
##$USERA1= <user>
##$USERA2= <user>
##$USERA3= <user>
##$USERA4= <user>
##$USERA5= <user>
##$V9= 5
##$VALIST= <valist>
##$VCLIST= <CCCCCCCCCCCCCCC>
##$VD= 0
##$VDLIST= <DDDDDDDDDDDDDDD>
##$VPLIST= <PPPPPPPPPPPPPPP>
##$VTLIST= <TTTTTTTTTTTTTTT>
##$WBST= 1024
##$WBSW= 4
##$XGAIN= (0..3)
0 0 0 0 
##$XL= 0
##$YL= 0
##$YMAX_a= 394583
##$YMIN_a= -544960
##$ZGOPTNS= <>
##$ZL1= 120
##$ZL2= 120
##$ZL3= 120
##$ZL4= 120
##$ABSF1= 16.522
##$ABSF2= -4.171173
##$ABSG= 5
##$ABSL= 3
##$ALPHA= 0
##$AQORDER= 0
##$ASSFAC= 0
##$ASSFACI= 0
##$ASSFACX= 0
##$ASSWID= 0
##$AUNMP= <proc_1d>
##$AZFE= 0.1
##$AZFW= 0.1
##$BCFW= 0
##$BC_mod= 0
##$BYTORDP= 0
##$COROFFS= 0
##$CY= 12.5
##$DATMOD= 1
##$DC= 0
##$DFILT= <>
##$DTYPP= 0
##$F1P= 14.0000005364418
##$F2P= -0.99999901652339
##$FCOR= 0.5
##$FTSIZE= 32768
##$FT_mod= 6
##$GAMMA= 0
##$GB= 0
##$INTBC= 1
##$INTSCL= 1
##$ISEN= 128
##$LB= 0.3
##$LEV0= 0
##$LPBIN= 0
##$MAXI= 10000
##$MC2= 0
##$MEAN= 0
##$ME_mod= 0
##$MI= 0
##$NCOEF= 0
##$NC_proc= -2
##$NLEV= 6
##$NOISF1= 0
##$NOISF2= 0
##$NSP= 0
##$NTH_PI= 0
##$NZP= 0
##$OFFSET= 16.522
##$PC= 1
##$PHC0= 153.5492
##$PHC1= 9.254915
##$PH_mod= 1
##$PKNL= yes
##$PPARMOD= 0
##$PSCAL= 4
##$PSIGN= 0
##$REVERSE= no
##$SF= 250.13
##$SI= 32768
##$SIGF1= 0
##$SIGF2= 0
##$SINO= 400
##$SIOLD= 32768
##$SREGLST= <1H.CDCl3>
##$SSB= 0
##$STSI= 32768
##$STSR= 0
##$SW_p= 5175.98343685301
##$SYMM= 0
##$S_DEV= 0
##$TDeff= 65536
##$TDoff= 0
##$TI= <Analysis number 999999
Compound Code 99
Book Reference 9
Project Code 9>
##$TILT= no
##$TM1= 0
##$TM2= 0
##$TOPLEV= 0
##$USERP1= <user>
##$USERP2= <user>
##$USERP3= <user>
##$USERP4= <user>
##$USERP5= <user>
##$WDW= 1
##$XDIM= 32768
##$YMAX_p= 299754125
##$YMIN_p= -15633
$$ End of Bruker specific parameters
$$ ---------------------------------
##NTUPLES= NMR SPECTRUM
##VAR_NAME=  FREQUENCY,     SPECTRUM/REAL,   SPECTRUM/IMAG
##SYMBOL=    X,             R,               I
##VAR_TYPE=  INDEPENDENT,   DEPENDENT,       DEPENDENT
##VAR_FORM=  AFFN,          ASDF,            ASDF
##VAR_DIM=   32768,         32768,           32768
##UNITS=     HZ,            ARBITRARY UNITS, ARBITRARY UNITS
##FACTOR=    0.157963299565203, 1,           1
##FIRST=     4132.6476996994, 0,             0
##LAST=      -1043.33573715361, 0,           0
##MIN=       -1043.33573715361, -15633,      0
##MAX=       4132.6476996994, 299754125,     0
$$ Real data points
##PAGE= N=1
##DATA TABLE= (X++(R..R)), XYDATA
$$ [...]
16423I631227L516242M680458N827637P217543O962202O094644N860396J964741
$$ 9631227 13147469 17827927 23655564 30873107 37835309 43929953 49790349 51755090
16415E1755090m85411j342659m739681m435479k830459j866173R10680L440703
$$ 51755090 51269679 49927020 45187339 40751860 37921401 36055228 36965908 40406611
16407D0406611L593992M085346L429250o72581j862297m035102p316229o800705
$$ 40406611 44000603 48085949 51515199 50842618 48980321 44945219 37628990 30828285
16399C0828285o785682o388916m688093l431762k400785j568895j039890p25292
$$ 30828285 24042603 17653687 12965594 9533832 7133047 5564152 4524262 3798970
16391C798970n43945m16502l21579k45230j88153j43252j14817r9433q6341r4892
$$ 3798970 3255025 2838523 2516944 2271714 2083561 1940309 1825492 1726059 1639718 1544826
16381A544826j10861j13034j09916j14004j00995q0243o8191m6060k6126k0847
$$ 1544826 1433965 1320931 1211015 1097011 996016 915773 847582 801522 775396 754549
16371G54549j2778j3832k7899l0422l8589n2757n4698n1309m6492l9251l2595
$$ 754549 741771 727939 700040 669618 631029 578272 523574 472265 425773 386522 353927
16360C53927k7433k3666j8833j6795j3867j3168j1370r307q706q528q028q765
$$ 353927 326494 302828 283995 267200 253333 240165 228795 219488 210782 202254 194226 185461
16348A85461j0836r663q518p122o954n458n233o32L763R02k551R9K90J548k607
$$ 185461 174625 164962 156444 149322 142368 136910 131677 131045 134808 135710 133159 133258 133548 135096 132489
16333A32489m239m939o560l097j518J946L45J457M348J118k78m328l755m040m367
$$ 132489 128250 123311 116751 113654 112136 114082 114427 115884 120232 121350 121072 116744 112989 108949 104582
16318A04582m412l424k820k144m629l621m970m10k226k308j340q82j441l891l217
$$ 104582 100170 96746 93926 91782 87153 83532 78562 78152 75926 73618 72278 71396 69955 66064 62847
16303F2847j003r5P09J884K452J738K946M617K738M010P841N978K695K807R00
$$ 62847 61844 61749 62458 64342 66794 68532 71478 76095 78833 82843 90684 96662 99357 102164 103064
16288A03064j200N23n091l58P34j316K086J614J05k054n824n456n092n664n743
$$ 103064 101864 102387 97296 96938 97672 96356 98442 100056 100161 98107 92283 86827 81735 76071 70328
16273G0328o041o227l982p131k730k439q09l53n008j573j026r55R75jl839l265
$$ 70328 64287 58060 54078 46947 44217 41778 40969 40616 35608 34035 33009 32054 33029 33028 29189 25924
16257B5924l929k339p98K617J895j457j663o42N54l97j636K064k555j825j700
$$ 25924 21995 19656 18858 21475 23370 21913 20250 19608 20162 19765 18129 20193 17638 15813 14113
16242A4113k968M51K422L256L10j740o87q66Q74J59M34L250P10j653r62K483K813
$$ 14113 11145 11596 14018 17274 17584 15844 15157 14291 15165 15324 15758 19008 19718 18065 17103 19586 22399
16225B2399K82o63J621J061N73j685k394l835m92P33m17J710K501o06j624J248
$$ 22399 22681 22018 23639 24700 25273 23588 21194 17359 16867 17600 17183 18893 21394 20788 19164 20412
16209B0412L703J373q7k185l63r28k045j933M76o12j544k739k990m02J586l752
$$ 20412 24115 25488 25401 23216 22853 21925 19880 17947 18423 17811 16267 13528 10538 10136 11722 7970
16193G970k723j760m44o1k837L9L238L305L688K823j616j182K10p5k260l91L28
$$ 7970 5247 3487 3043 2982 145 184 3422 6727 10415 13238 11622 10440 10650 10575 8315 7924 8252
16176H252k501N96o97q39J403J455K709L0l094k0J861j668k536K016P81J15N32
$$ 8252 5751 6347 5650 4811 6214 7669 10378 10408 7314 7294 9155 7487 4951 6967 7748 7863 8395
16159H395K220P17K62k611L92K04K528J6k87j799r9K479L10N9m70l673k697j558
$$ 8395 10615 11332 11594 8983 9375 9579 12107 12123 11836 10037 9938 12417 12727 12786 12316 8643 5946 4388
16141D388r66j472m97j097J784J519P57j487j50K388K0k956m672j12K872j07J184
$$ 4388 3422 1950 1453 356 2140 3659 4416 2929 2779 5167 5187 2231 -2441 -2553 319 212 1396
16124A396q5K131P57R43k487m192n37j412l70p95M28J096q81l24p15L089J032
$$ 1396 1311 3442 4199 5142 2655 -1537 -2074 -3486 -3856 -4651 -4223 -3127 -4008 -4332 -5047 -1958 -926
16107i26j738j344q74R8J768K546M00J013j809n19J954j41n34j345J18L487j485
$$ -926 -2664 -4008 -4882 -4784 -3016 -470 -70 943 -866 -1385 569 428 -106 -1451 -1333 2154 669
16090F69l404m950J79k04J963J611P07Q71J27j588q08j701j236L804j183j374
$$ 669 -2735 -7685 -7506 -7710 -5747 -4136 -3429 -2558 -2431 -4019 -4827 -6528 -7764 -3960 -5143 -6517
16074f517K450K466M15j447n5r20J100M63l335j620Q96J168p90m62k586k168M77
$$ -6517 -4067 -1601 -1186 -2633 -2688 -3608 -2508 -2045 -5380 -7000 -6104 -4936 -5726 -6188 -8774 -10942 -10465
16057a0465N18M02L574J780O05k32k63o00j774q94l4l65N6K165o74q51J499J337
$$ -10465 -9947 -9545 -5971 -4191 -3586 -3818 -4081 -4681 -6455 -7349 -7383 -7748 -7692 -5527 -6201 -7052 -5553 -4216
16039d216J191K020L34j883k89N28j091k10L191l80k309k785L96j64j30J869J858
$$ -4216 -3025 -1005 -671 -2554 -2843 -2315 -3406 -3616 -425 -805 -3114 -5899 -5503 -5667 -5797 -3928 -2070
16022b070J425j045k216k29m72n1m19n10K941K27K25J680N8N77K34k347q75O64
$$ -2070 -645 -1690 -3906 -4135 -4607 -4658 -5077 -5587 -2646 -2419 -2194 -514 -456 121 355 -1992 -2867 -2203
16004b203J968J714j343N67J422J50J532p54k565j643M78J738J272n71O68o61
$$ -2203 -235 1479 136 703 2125 2275 3807 3053 488 -1155 -677 1061 2333 1762 2430 1769
15988A769L83l107l803J117L67R55j656j259J812J775k905J597K120L81j95J497
$$ 1769 2152 -955 -4758 -3641 -3274 -2319 -3975 -5234 -3422 -1647 -4552 -2955 -835 -454 -649 848
15972H48p04k865j462J290K342j031L40P58K341J00K048L497m68m057j448k979
$$ 848 144 -2721 -4183 -2893 -551 -1582 -1242 -484 1857 1957 4005 7502 7034 2977 1529 -1450
15956a450k523m04N68L118p40m718j301J812j111J221J294j640k598k204N89k276
$$ -1450 -3973 -4377 -3809 -691 -1431 -6149 -7450 -5638 -6749 -5528 -4234 -5874 -8472 -10676 -10087 -12363
15940a2363j458J962K378R71n67J814L146n28k199J064Q05r43l54L83k094J219
$$ -12363 -13821 -11859 -9481 -8510 -9077 -7263 -4117 -4645 -6844 -5780 -4975 -5918 -6272 -5889 -7983 -6764
15924f764K481j719l720j205K964K385J580J172L242j018m72K76q78J128o46k357
$$ -6764 -4283 -6002 -9722 -10927 -7963 -5578 -3998 -2826 416 -602 -1074 -798 -1676 -548 -1194 -3551
15908c551k35L084n98l154J331J688L89J146J245j519m28O56K26K58j797q25M354
$$ -3551 -3786 -702 -1300 -4454 -3123 -1435 -1046 100 1345 -174 -602 54 280 538 -1259 -2084 2270
15891B270J048k701j192J086J744K65j368J044j205k8K643N837J872K708N991
$$ 2270 3318 617 -575 511 2255 2520 1152 2196 991 963 3606 9443 11315 14023 20014
15876B0014P388Q537J4492K1660K7873L2297L6573L5321L4008K7738O674l894
$$ 20014 27402 35939 50431 72091 99964 132261 168834 204155 238163 265901 272575 268681
15864B68681j4522k4036j9879j3301m852Q173J7924K0347K5626J6751n697j5570
$$ 268681 254159 230123 210244 196943 192091 200264 218188 238535 264161 280912 275215 259645
15852B59645l1610m1869l5373l4554l2651k3047j8195j3075p503n681l901l236
$$ 259645 228035 186166 150793 116239 83588 60541 42346 29271 21768 16087 12186 8950
15840H950j028J358j39j733j20j215K256N58j343j86J59k081n52J031q28k326
$$ 8950 7922 9280 9141 7408 7288 6073 8329 8887 7544 7358 7517 5436 4884 5915 5087 2761
15824B761j914R79J877J651j469Q83n84j339M90j208p6j355j181J028J178J801
$$ 2761 847 1826 3703 5354 3885 4768 4184 2845 3335 2127 2051 696 -485 543 1721 3522
15808C522J273j367j673L360J677K680K016J821L356M090R69j61K001N97j392
$$ 3522 4795 3428 1755 5115 6792 9472 11488 13309 16665 20755 21724 21563 23564 24161 22769
15793B2769k388r5l312j388P41n792n898k388j476j372j243n82N23J834J454k66
$$ 22769 20381 20286 16974 15586 16327 10535 4637 2249 773 -599 -1842 -2424 -1901 -67 1387 1121
15777A121l438j012q73j845L51o68j131R02J277j769M34j777j359M21j899L83
$$ 1121 -2317 -3329 -4202 -6047 -5696 -6364 -7495 -6593 -5316 -7085 -6651 -8428 -9787 -9366 -11265 -10882
15761a0882J129K347O00N51J46R70K438J681k68k542l779j863N21L89L68K1K046
$$ -10882 -9753 -7406 -6806 -6255 -6109 -5139 -2701 -1020 -1288 -3830 -7609 -9472 -8951 -8562 -8194 -8173 -6127
15744f127J192J331R90j770j059R29K21r75Q80l92j719J530M24J398j607k370
$$ -6127 -4935 -3604 -2614 -4384 -5443 -4514 -4293 -5268 -4388 -4780 -6499 -4969 -4545 -3147 -4754 -7124
15728g124J212L252J376j983k405j841r36J79P97Q97p91l31j587O02l63K278Q62
$$ -7124 -5912 -2660 -1284 -3267 -5672 -7513 -8449 -8270 -7473 -6576 -7367 -7698 -9285 -8683 -9046 -6768 -5906
15711e906J390k219N30K466j289k038P28K13J197k041M90J213K806J451k099Q14
$$ -5906 -4516 -6735 -6205 -3739 -5028 -7066 -6338 -6125 -4928 -6969 -6479 -5266 -2460 -1009 -3108 -2294
15695b294K200q59l513j504o67J323J752j256j126j17m77L6K6K85J709k587K847
$$ -2294 -94 -953 -4466 -5970 -6637 -5314 -3562 -4818 -5944 -6061 -6538 -6502 -6476 -6191 -4482 -7069 -4222
15678d222J997p27J452Q73k800k673K93L99k05j938j753J61l20J605j224J43L65
$$ -4222 -2225 -2952 -1500 -627 -3427 -6100 -5807 -5408 -5613 -7551 -9304 -9143 -9463 -7858 -9082 -8939 -8574
15661h574J072M58j00J186P66p26k91L45J314J147L674J871j800k094J56r14j79
$$ -8574 -7502 -7044 -7144 -5958 -5192 -5918 -6209 -5864 -4550 -3403 271 2142 342 -1752 -1596 -2510 -2689
15644b689K791O0P50L48n53J179k107j777J379K195k529j390J900J272l20r40
$$ -2689 102 162 912 1260 707 1886 -221 -1998 -619 1576 -953 -2343 -443 829 509 -431
15628d31R41L10j881J344J209K93j958q67n1l040Q82J184K22j91j097r91K157
$$ -431 510 820 -1061 283 1492 1785 -173 -1040 -1091 -4131 -3249 -2065 -1843 -2034 -3131 -4122 -1965
15611a965p90p66O29P14P30K83j773j132J71j543j938j278K312J482p37j807l095
$$ -1965 -2755 -3521 -2892 -2178 -1448 -1165 -2938 -4070 -3899 -5442 -7380 -8658 -6346 -4864 -5601 -7408 -10503
15594a0503j040J001K081J586J959L11j740n49j470K481K324k420M72L344J935
$$ -10503 -11543 -10542 -8461 -6875 -4916 -4605 -6345 -6894 -8364 -5883 -3559 -5979 -5507 -2163 -228
15579b28m05k117l043j959J758K314K75R72k582j118Q62q79j498J351R79k24q54
$$ -228 -633 -2750 -5793 -7752 -5994 -3680 -3405 -2433 -5015 -6133 -5271 -6150 -7648 -6297 -5318 -5542 -6396
15562f396J383j085k241q75K212j196J75J829l97K197Q84K019q23j262M01J471
$$ -6396 -5013 -6098 -8339 -9214 -7002 -8198 -8023 -6194 -6591 -4394 -3510 -1491 -2314 -3576 -3175 -1704
15546a704m48r17J98M17k201N64k086r34j407N54K633m82J249j238k417O08J028
$$ -1704 -2152 -3069 -2871 -2454 -4655 -4091 -6177 -7111 -8518 -7964 -5331 -5813 -4564 -5802 -8219 -7611 -6583
15529f583K300j077j502q62O41k2N10J157J39K30K771p13k215j007k526j8l55
$$ -6583 -4283 -5360 -6862 -7724 -7083 -7105 -6595 -5438 -5299 -5069 -2298 -3011 -5226 -6233 -8759 -8777 -9132
15512i132j740K022J078j87R03J694P17k391j94L60Q8j293L34Q19k93r26R55q27
$$ -9132 -10872 -8850 -7772 -7959 -7056 -5362 -4645 -7036 -7230 -6870 -6782 -8075 -7741 -6922 -7215 -8141 -7186 -8013
15494h013L14M01L77P0p65R03K155N25J53O64j970j479J55J039M72K63O9O40J193
$$ -8013 -7699 -7298 -6921 -6851 -7616 -6713 -4558 -4033 -3880 -3216 -5186 -6665 -6510 -5471 -4999 -4736 -4667 -4027 -2834
15475b834J73M61K097J959k15j176J658K710M022J613J432K864L826j699o16L59
$$ -2834 -2661 -2200 -103 1856 1641 465 2123 4833 8855 10468 11900 14764 18590 16891 16275 16634
15459A6634J730N88L63Q53J401M33N29o81j648K52r84m41l600l596j489l018k41
$$ 16634 18364 18952 19315 20168 21569 22002 22531 21850 20202 20454 19470 19029 15429 11833 10344 7326 7085
15442G085J010k275o62j137k050K62R73j926k294l75L772M409L699K130K547j497
$$ 7085 8095 5820 5158 4021 1971 2233 3206 1280 -1014 -1389 2383 6792 10491 12621 15168 13671
15426A3671k47J129J514l03K631O852L866K283J127L321N121L828J908J79j407
$$ 13671 13424 14553 16067 15764 18395 25247 29113 31396 32523 35844 40965 44793 46701 46880 45473
15411D5473j857J378p28k504m81k569N83j445O10k074m943m111n082n112m744
$$ 45473 43616 44994 44266 41762 41281 38712 39295 37850 38460 36386 31443 27332 22250 17138 12394
15396A2394j403j446O68O54j463l345j858q7k54j29J630j646j716O55L344J245
$$ 12394 10991 9545 10213 10867 9404 6059 4201 4114 3860 3731 5361 3715 1999 2654 5998 7243
15380G243O94k22K705J543Q79j222j89J148K465K371M257K13o22J493J493M1j268
$$ 7243 7937 7715 10420 11963 12842 11620 11431 12579 15044 17415 21672 21885 21263 22756 24249 24290 23022
15363B3022j130M68R7J041J459J142Q98K83k028o449l970Q74j542m671l53L53
$$ 23022 21892 22360 22457 23498 24957 26099 26997 27280 25252 18803 14833 15707 14165 9494 9141 9494
15347I494M75m65k050o50p92o99l842n44J076M37k09k015j231J499m5k117J526
$$ 9494 9969 9504 7454 6804 6012 5313 1471 927 2003 2440 2231 216 -1015 484 439 -1678 -152
15330a52K161J559l34J00L047N795K705q02j003l658k63P48J823K428K714M42
$$ -152 2009 3568 3234 3334 6381 12176 14881 14079 13076 9418 9155 9903 11726 14154 16868 17310
15314A7310k077l779K8L34L04J244j280k402k681k252j403j831p04p21j45K082
$$ 17310 15233 11454 11482 11816 12120 13364 12084 9682 7001 4749 3346 1515 811 90 -55 2027
15298B027J439p96M73j15m713k004j406l08K454K862R92J036L16j506l766k009
$$ 2027 3466 2670 3143 3028 -1685 -3689 -5095 -5403 -2949 -87 905 1941 2257 751 -3015 -5024
15282e024J51j195j540J955K542r63j879k013J224R47j449l8J446K353J463L98
$$ -5024 -4873 -6068 -7608 -5653 -3111 -4074 -5953 -7966 -6742 -5795 -7244 -7282 -5836 -3483 -2020 -1622
15266a622q72j474j75O6J256k354k850J884R76J089L05k047j106p85R69p64k93
$$ -1622 -2494 -3968 -4143 -4077 -2821 -5175 -8025 -6141 -5165 -4076 -3771 -5818 -6924 -7709 -6740 -7504 -7797
15249g797o17Q73K40M80j998k850J990j739j405J601j852j168j076K467L036K348
$$ -7797 -8414 -7541 -7301 -6821 -8819 -11669 -9679 -11418 -12823 -11222 -13074 -14242 -15318 -12851 -9815 -7467
15233g467K238Q78j819k565m40J823j684o35j188n96j366K567J390J929K01o65
$$ -7467 -5229 -4351 -6170 -8735 -9175 -7352 -9036 -9671 -10859 -11455 -12821 -10254 -8864 -6935 -6734 -7399
15217g399j32m83L259L569J137l810l904K921J835k829k291j651M74Q62j79j82
$$ -7399 -7531 -8014 -4755 -1186 -49 -3859 -7763 -4842 -3007 -5836 -8127 -9778 -9304 -8442 -8621 -8803
15201h803l68j052J007J401P81J1j971J607J724k001j59K34J422P22K62k026n5
$$ -8803 -9171 -10223 -9216 -7815 -7034 -7023 -8994 -7387 -5663 -7664 -7823 -7589 -6167 -5445 -5183 -7209 -7264
15184g264P79J886k042k050R41Q05J049j088j692m96j356p75r28L182J349m72
$$ -7264 -6485 -4599 -6641 -8691 -7750 -6945 -5896 -6984 -8676 -9172 -10528 -11303 -12231 -9049 -7700 -8172
15168h172r55j91L282J021j747l81q24J817k093j879j094P57O32P27k357L30M129
$$ -8172 -9127 -9318 -6036 -5015 -6762 -7143 -7967 -6150 -8243 -10122 -11216 -10459 -9827 -9100 -11457 -11127 -6998
15151f998j280j825O31O24K173Q1j467L530Qq29j38k28j288l68L34J018K02P43
$$ -6998 -8278 -10103 -9472 -8848 -6675 -6594 -8061 -4531 -4523 -5352 -5490 -5718 -7006 -7374 -7040 -6022 -5820 -5077
15133e077j219l98j579kJ659J243J808M1j128j014Q29L546J732K936L928K471
$$ -5077 -6296 -6694 -8273 -8275 -6616 -5373 -3565 -3524 -4652 -5666 -4837 -1291 441 3377 7305 9776
15117I776k969k280q86Q07J843J959N20J853J168m11P92o96l632N14O93k75k452
$$ 9776 6807 4527 3641 4448 6291 8250 8770 10623 11791 11380 12172 11476 7844 8358 9051 8776 6324
15100F324k344j703n42J737O26k228j260l31k045l127L72J674J337j87k41k128
$$ 6324 3980 2277 1735 3472 4098 1870 610 279 -1766 -4893 -4521 -2847 -1510 -1697 -1938 -4066
15084d066k943l21R12L099j168l456j275O71P98J280J881j226P34Q8j337j633
$$ -4066 -7009 -7330 -6418 -3319 -4487 -7943 -9218 -8547 -7749 -6469 -4588 -5814 -5080 -4992 -6329 -7962
15068g962q33K889L72j131N81J94j367J984K374j388r54k920J42K88M55q86l77
$$ -7962 -8795 -5906 -5534 -6665 -6084 -5890 -7257 -5273 -2899 -4287 -5241 -8161 -8019 -7731 -7276 -8162 -8539
15051h539J167r25j921J261K752j299k51J352p38J11m55M19K525o34J397o80j181
$$ -8539 -7372 -8297 -10218 -8957 -6205 -7504 -7755 -6403 -7141 -7030 -7485 -7066 -4541 -5175 -3778 -4458 -5639
15034e639J874M21N2m23m87j403o51j842m241l33J275J295K465J899J636R98M39
$$ -5639 -3765 -3344 -3292 -3715 -4202 -5605 -6256 -8098 -12339 -12672 -11397 -10102 -7637 -5738 -4102 -3104 -2665
15017b665J26j192L71J159K5O49P0k18l220j222K049P31O9j022q18k077L38l24
$$ -2665 -2539 -3731 -3360 -2201 -2176 -1527 -1457 -1675 -4895 -6117 -4068 -3337 -3268 -4290 -5108 -7185 -6847 -7171
14999g171K144K676P06j516l293P52K456j146j770j088N46J99K25J71n96J495
$$ -7171 -5027 -2351 -1645 -3161 -6454 -5702 -3246 -4392 -6162 -7250 -6704 -6505 -6280 -6109 -6705 -5210
14983e210K375R67j538j121j865j91O28m45p39P25K98j893K028J761J463N2o08
$$ -5210 -2835 -1868 -3406 -4527 -6392 -6583 -5955 -6400 -7139 -6414 -6116 -8009 -5981 -4220 -2757 -2705 -3313
14966c313l94RK08L87J636m02k58j05o98n79k236p87j261J678O52j322M58N29
$$ -3313 -3707 -3698 -3490 -3103 -1467 -1869 -2127 -2232 -2930 -3509 -5745 -6532 -7793 -6115 -5463 -6785 -6327 -5798
14948e798J691k058k29J499J361J57j407K38j558j010j173J359l59Q29J704r22
$$ -5798 -4107 -6165 -6394 -4895 -3534 -3377 -4784 -4546 -6104 -7114 -8287 -6928 -7287 -6458 -4754 -5676
14932e676n57o53j937Q56J298p1R28j165p45l43j632J967K548k16r07o71K039
$$ -5676 -6233 -6886 -8823 -7967 -6669 -6740 -5812 -6977 -7722 -8065 -9697 -7730 -5182 -5398 -6305 -6976 -4937
14915d937R72l212l162n3j126n86R03N97J667K596N25k76j931p77K295K002N2
$$ -4937 -3965 -7177 -10339 -10392 -11518 -12104 -11201 -10604 -8937 -6341 -5816 -6092 -8023 -8800 -6505 -4503 -4451
14898d451j724k135O77J340j779P8j904R98r80J26J778K033L73K67J387r10k969
$$ -4451 -6175 -8310 -7633 -6293 -8072 -7994 -9898 -8900 -9880 -9754 -7976 -5943 -5570 -5303 -3916 -4826 -7795
14881g795o12L84j491J242J497j402j409K148m60P88J795L276P80j289r94l68
$$ -7795 -8407 -8023 -9514 -8272 -6775 -8177 -9586 -7438 -7898 -7110 -5315 -2039 -1259 -2548 -3542 -3910
14865c910J11J978k447j961J196J127j77M64K57p00J216J525l845k475K45m51
$$ -3910 -3799 -1821 -4268 -6229 -5033 -3906 -4083 -3619 -3362 -4062 -2846 -1321 -5166 -7641 -7396 -7847
14849g847K3J929K090J023j842l003K209J673r04j301o93K136L713j235k215k254
$$ -7847 -7824 -5895 -3805 -2782 -4624 -7627 -5418 -3745 -4649 -5950 -6643 -4507 -794 -2029 -4244 -6498
14833f498J37J320J53J176K79j182M1M239k405l988M72L56J522O37j203p6P83
$$ -6498 -6361 -5041 -4888 -3712 -3433 -4615 -4574 -335 -2740 -6728 -6256 -5900 -4378 -3741 -4944 -5020 -4237
14816d237j594Q96K946o78k511J03O97N39q87j429k68Q94J34l48n51q04J298P45
$$ -4237 -5831 -4935 -1989 -2667 -5178 -5075 -4378 -3839 -4726 -6155 -6423 -5529 -5395 -5743 -6294 -7098 -5800 -5055
14798e055l373p5J765q07K26J468l58k443J713O59l06j221m24K814J511m19J497
$$ -5055 -8428 -8503 -6738 -7545 -7319 -5851 -6209 -8652 -6939 -6280 -6586 -7807 -8231 -5417 -3906 -4325 -2828
14781b828n54k738Q47J450R04m52q57j84R50l67R00K173l81p63O55j134q93j409
$$ -2828 -3382 -6120 -5273 -3823 -2919 -3371 -4228 -4412 -3462 -3829 -2929 -756 -1137 -1900 -1245 -2379 -3272 -4681
14763d681j301n50J250q57k46Mk787j348J781K447J520j082J693K620J432L758
$$ -4681 -5982 -6532 -5282 -6139 -6385 -6381 -9168 -10516 -8735 -6288 -4768 -5850 -4157 -1537 -105 3653
14747C653N229O378M841L979L568P364O676o13o804r662k774N05L953R897Q962
$$ 3653 8882 15260 20101 24080 27648 35012 41688 41075 34271 24609 21835 22340 26293 36190 45152
14732D5152R119J2883J2700O036O561R193J0353N728o517j4346j5735j4819q581
$$ 45152 54271 67154 79854 85890 92451 101644 111997 117725 111208 96862 81127 66308 57727
14719E7727l56P945J5610J9126J5612J1386Q457R62J02n91K052j602r366j8065
$$ 57727 57371 65316 80926 100052 115664 127050 135507 136469 136571 135980 138032 136430 127064 108999
14705A08999j6774p375k251L282P209O692R836R257J747n348r270r507r062p915
$$ 108999 92225 84850 82599 85881 93090 99782 109618 118875 120622 115274 106004 96497 87435 79520
14691G9520r555j4729j2717q541k418o42K035N374P674K600m713r181q138j0645
$$ 79520 69965 55236 42519 33978 31560 30918 32953 38327 46001 48601 43888 34707 26569 15924
14677A5924m057K00Q2J222J744O48O10L380N528O742J2826J1707Q395R106O973
$$ 15924 11867 12067 12149 13371 15115 15763 16373 19753 25281 32023 44849 56556 64951 74057 81030
14662H1030M911L047K825J4l624m977o330j0281j0574j0951j3596q873l247j588
$$ 81030 85941 88988 91813 91827 88203 83226 76896 66615 56041 45090 31494 22621 19374 17786
14648A7786j162k210k350J555J180j735j98J51l71L12K235O348R215R360J0093
$$ 17786 16624 14414 12064 13619 14799 13064 12866 13017 12646 12958 15193 21541 30756 40116 50209
14633E0209Q463J1192P319N586O205N551l73n316m928p587q764q944j1548j0082
$$ 50209 58672 69864 77183 82769 88974 94525 94152 88836 83908 76321 67557 58613 47065 36983
14619C6983r006m998m001J37L816M796O096N574R188N179M179M675J289P16M073
$$ 36983 27977 22979 18978 19115 22931 27727 33823 39397 48585 53764 57943 62618 63907 64623 68696
14604F8696J286Nn51j671k426l444m582m449p239n640l183l392k369j004J371
$$ 68696 69982 69987 69436 67765 65339 61895 57313 52864 45625 39985 36802 33410 31041 30037 31408
14589C1408M717K259P663J2894K0809L4048N3169P0184P5696O0084K8001j9110
$$ 31408 36125 38384 46047 58941 79750 113798 166967 237151 312847 372931 400932 381822
14577C81822n7520o9598o4543m2861k3103j4647q693m342m026m854l931m464o101
$$ 381822 324302 254704 190161 147300 124197 109550 100857 96515 92489 87635 83704 79240 73139
14564G3139o170r122j2159q652o500m741l273j026k169r94P26Q60n13L854J426
$$ 73139 66969 57847 45688 37036 30536 25795 22522 21496 19327 18333 19059 19919 19406 23260 24686
14549B4686j924k919n49P34J551L538K36j499L39J968N01J073J933m47k445k318
$$ 24686 22762 19843 19294 20028 21579 25117 25353 23854 24193 26161 26662 27735 29668 29221 26776 24458
14533B4458l336k254o91r57m905k977r76q32r8n13k71j695l66R26K752N652K899
$$ 24458 21122 18868 18177 17220 12315 9338 8362 7530 7432 6919 6648 4953 4587 5513 8265 13917 16816
14516A6816J167L827M422O772P082M872j63L273N541L859O272L572M257J0233
$$ 16816 17983 21810 26232 33004 40086 44958 44795 48068 53609 57468 63740 67312 71569 81802
14502H1802J3643J0647N211k577o241j181M835M611J933L012K92p50L233O711
$$ 81802 95445 106092 111303 108726 102485 101304 106139 110750 112683 115695 115987 115237 118470 125181
14488A25181L287l237m454M36O480L286J858N777J781q718j2168p895k576n216
$$ 125181 128468 125231 120777 121213 127693 130979 132837 138614 140395 131677 119509 111614 109038 103822
14474A03822p326j456j211l199n40J541K236j930j0344j1064n153k832m735n881
$$ 103822 96496 95040 93829 90630 90090 91631 93867 91937 81593 70529 65376 62544 57809 51928
14460E1928o889o268k827j631j800o053p875p201o558j015L461P613J646m005
$$ 51928 45039 38771 35944 34313 32513 26460 18585 11384 4826 3811 7272 14885 16531 12526
14446A2526k401m096j215K57l94j289M98Q60j689l2R59J024k758j01J928j401
$$ 12526 10125 6029 4814 5071 4677 3388 3886 4746 3057 3025 3984 5008 2250 2149 4077 2676
14430B676r18j81P08m56J697o67k502r17J396J495l35Q20m16k61J035J954Q02
$$ 2676 1758 1577 2285 1829 3526 2859 357 -560 836 2331 1996 2816 2400 2139 3174 5128 5930
14413E930N0j141r47P26j116r68j190k074l17J663L606K470j906Q0k50KK804M044
$$ 5930 5980 4839 3892 4618 3502 2534 1344 -730 -1047 616 4222 6692 4786 4866 4616 4618 7422 11466
14395A1466J590j555N87J792J073M54j546p02k87J087J212K42J66O60O54q5l17
$$ 11466 13056 11501 12088 13880 14953 15407 13861 13159 12872 13959 15171 15413 15579 16239 16893 16808 16491
14378A6491k036J377M89l118j112l005l287j057J344P83r81L576K3k097k004k211
$$ 16491 14455 15832 16321 13203 12091 9086 5799 4742 6086 6869 5888 9464 9487 7390 5386 3175
14362C175j526j564j512o11J001J212K093m250l967k81l75j084r16J265L176J733
$$ 3175 1649 85 -1427 -2038 -1037 175 2268 -1982 -5949 -6230 -6605 -7689 -8605 -7340 -4164 -2431
14346b431J583J365k031l434k121J483j67L73j1n84R32J542p15j418r62P25K96
$$ -2431 -848 517 -1514 -4948 -7069 -5586 -5753 -5380 -5391 -5975 -5043 -3501 -4216 -5634 -6596 -5871 -5575
14329e575J640j643k07K19K921J464M64m90m16J172p06p64Q79j59J061J457K325
$$ -5575 -3935 -5578 -5785 -5566 -2645 -1181 -717 -1207 -1623 -451 -1157 -1921 -1042 -1201 -140 1317 3642
14312C642k181n20J949N3J258j96l052j073N44k73k070l22J417J368n30j437j558
$$ 3642 1461 941 2890 2943 4201 4005 953 -120 424 151 -1919 -2241 -824 544 14 -1423 -2981
14295b981n81K333K130k137j407J331k12o10j000K07O59J336J18M46r06m20K195
$$ -2981 -3562 -1229 901 -1236 -2643 -1312 -1524 -2134 -3134 -2927 -2268 -932 -814 -368 -1274 -1694 501
14278E01P26q68r36J618K162J73r46j309Q8M20J155J145P15q0O9r72J956J281
$$ 501 1227 359 -577 1041 3203 3376 2430 1121 1209 1629 2784 3929 4644 4564 4633 3661 5617 6898
14260F898O70J342J883m29q10n20j940J212L553L611L565J174J637L547M251K463
$$ 6898 7568 8910 10793 10364 9554 9034 7094 8306 11859 15470 19035 20209 21846 25393 29644 32107
14244C2107L799K429J742N362J2554R660J0153J3166J6728J9321K2348K5136K6536
$$ 32107 35906 38335 40077 45439 57993 67653 77806 90972 107700 127021 149369 174505 201041
14231B01041K5839K4524K2165J8522Q555O37m949q860j1425j6358j9607k0141
$$ 201041 226880 251404 273569 292091 300646 301283 296334 287474 276049 259691 240084 219943
14219B19943j3093j2317r927r465q898q395o809l546K40r02L762N471J912o42
$$ 219943 206850 194533 184606 175141 166243 157848 151039 147493 147733 146831 150593 156064 157976 157334
14205A57334M780R937J0839J0206J3038J4311J7148J9144J9300J3482P668K583
$$ 157334 162114 172051 182890 193096 206134 220445 237593 256737 276037 289519 297187 299770
14193B99770j874j2879j7054k1373k3103k7846k5571k5103k1765j8089j7826j4235
$$ 299770 297896 285017 267963 246590 223487 195641 170070 144967 123202 105113 87287 73052
14181G3052j1622q084o998m846m685m648j948j891k460l570j211j841k723m535
$$ 73052 61430 53346 46348 41502 36817 32169 30221 28330 25870 22300 21089 19248 16525 11990
14167A1990l407J096J84k594m40P73j529j079n30o75p87N19J716l05j239j813
$$ 11990 8583 9679 9863 7269 6829 7602 6073 4994 4464 3789 3002 3521 5237 4932 3693 1880
14151A880J545L800J306r32j419O90J324J688J062j477P38J536J181l09r52p2
$$ 1880 3425 7225 8531 7599 6180 6870 8194 9882 10944 9467 10205 11741 12922 12613 11661 11589
14135A1589j864j134K772J305K098k62k036r34k264k804j933N02J912J336J98
$$ 11589 9725 8591 11363 12668 14766 14504 12468 11534 9270 6466 4533 5035 6947 8283 8481
14120H481k284k232M8J467K422R39k360o42K631J695k027k601j807J031R98Q49
$$ 8481 6197 3965 4013 5480 7902 8841 6481 5839 8470 10165 8138 5537 3730 4761 5759 6608
14104F608J844j206J932n42k336j922P05Q29J48R84N18k74j030K272Q17J663J103
$$ 6608 8452 7246 9178 8636 6300 4378 5083 5912 6060 7044 7562 7288 6258 8530 9347 11010 12113
14087A2113o03j26J04N7l74p30q75J463n59N29j587l56J278J479l152l060J466
$$ 12113 11510 11384 11488 11545 11171 10441 9566 11029 10470 10999 9412 9056 10334 11813 8661 5601 7067
14070G067o9j55o77J037q30m0j372Q09m91K40K398K671J484j45L49j253J070L006
$$ 7067 6998 6843 6166 7203 6373 6333 4961 5770 5279 5519 7917 10588 12072 11927 12276 11023 12093 15099
14052A5099K925K350L303M724Q659K345L269Q172J1769J0477J1072N819j580o740
$$ 15099 18024 20374 23677 28401 37060 39405 42674 50846 62615 73092 84164 89983 88403 81663
14038H1663q648r900q305m003j896L47n69J194J185j154q58K977J038J94m44K150
$$ 81663 73015 63115 54810 50807 48911 49258 48689 49883 51068 49914 49056 52033 53071 53265 52821 54971
14022E4971O3k740l122O00N6J84J648K614P632Q438R962J3433J8294J4960O084
$$ 54971 55034 52294 49172 49772 49828 50012 51660 54274 61906 70344 80306 93739 112033 126993 133077
14007A33077l118r203j0331o733N38M257P655R136M902k847q507j2028j1330j0485
$$ 133077 129959 120756 110425 103692 104230 108487 116142 125278 130180 127333 118826 106798 95468 84983
13993H4983o692m204l067j807m909q72j037j641j226k72J803l190k779p65K615
$$ 84983 78291 74087 71020 69213 64304 63432 62395 60754 59528 59256 61059 57869 55090 54325 56940
13978E6940j561m848o00N954L46J965N194P221R984J4736J2965J0922P687j903
$$ 56940 55379 50531 49931 55885 56231 58196 63390 70611 80595 95331 108296 119218 126905 125002
13964A25002q665j0527j1648j2824p876p465o368j542m62J284J594L208N317M770
$$ 125002 116337 105810 94162 81338 73462 65997 59629 58087 57625 58909 60503 63711 69028 73798
13950G3798K639K246J041r41r83p36k487l52j535k583J648L193j766k291L97J546
$$ 73798 76437 78683 79724 78783 77800 77064 74577 74225 72690 70107 71755 74948 73182 70891 71288 72834
13934G2834J802J980q36j893L537L448K863J875N96j972n167l004o56j634k546
$$ 72834 74636 76616 75780 73887 77424 80872 83735 85610 86206 84234 79067 76063 75407 73773 71227
13919G1227k485L89O67K744N3j445l512p31J746K535M92M58J925K26L19j926q76
$$ 71227 68742 69131 69798 72542 72595 71150 67638 66907 68653 71188 71680 72138 74063 74289 74608 72682 71806
13902G1806p12l62k1n9N034K123J404K81J248J439M256M270L017L63J395K990
$$ 71806 71094 70732 70711 70652 75686 77809 79213 79494 80742 82181 86437 90707 93724 94087 95482 98472
13886I8472q29L59J376J624L757P90r39k794p51k928P27M673L232J161j815k46
$$ 98472 97643 98002 99378 101002 104759 105549 104610 101816 101065 98137 98864 103537 106769 107930 106115 105869
13870A05869L937L266L311O359N493L323J283L996J924L162L910L254M251O167
$$ 105869 109806 113072 116383 122742 128235 131558 132841 136837 138761 141923 145833 149087 153338 159505
13856A59505O697O235O253Q014M177L675L080O317O519P852P042N912Q155J0151
$$ 159505 166202 172437 178690 186704 190881 194556 197636 203953 210472 218324 225366 231278 239433 249584
13842B49584Q425R633R994J2893J2926J2199J2772J3725J3115J3360J4287J5470
$$ 249584 258009 267642 277636 290529 303455 315654 328426 342151 355266 368626 382913 398383
13830C98383J7309J8026K0274K2755K5560K7896K8756L2132L6384L8586M0917
$$ 398383 415692 433718 453992 476747 502307 530203 558959 591091 627475 666061 706978
13819G06978M3137M5595N1626N6368O2575O4646O8555P5644Q3480R0176R2139
$$ 706978 750115 795710 847336 903704 966279 1030925 1099480 1175124 1258604 1348780 1440919
13808A440919R8202J04798J19198J35330J53878J74736K00444K33232K67871L11311
$$ 1440919 1539121 1643919 1763117 1898447 2052325 2227061 2427505 2660737 2928608 3239919
13798C239919L62735M20797M92314N85404O90628Q15769R67653J153328J380720
$$ 3239919 3602654 4023451 4515765 5101169 5791797 6607566 7575219 8728547 10109267
13789A0109267J651907J982074K378225K830467L333236L854320M335668M703063
$$ 10109267 11761174 13743248 16121473 18951940 22285176 26139496 30475164 35178227
13781C5178227M851952M703240M201680L346547K212829R26844l60051j499763
$$ 35178227 40030179 44733419 48935099 52281646 54494475 55421319 55061268 53561505
13773E3561505k375218k934613l188457l184032k991669k686694k334334j974459
$$ 53561505 51186287 48251674 45063217 41879185 38887516 36200822 33866488 31892029
13765C1892029j627586j301998j002702p24435m56840j99452N2524L02305N59318
$$ 31892029 30264443 28962445 27959743 27235308 26778468 26579016 26631540 26933845 27493163
13756B7493163Q30079J118835J428736J760302K110368K471542K808238L085972
$$ 27493163 28323242 29442077 30870813 32631115 34741483 37213025 40021263 43107235
13748D3107235L247681L215305K925539K324552J410881K43822j068324k364644
$$ 43107235 46354916 49570221 52495760 54820312 56231193 56475015 55406691 53042047
13740E3042047l500216m340857m816299m929722m739586m337456l822434l284411
$$ 53042047 49541831 45200974 40384675 35454953 30715367 26377911 22555477 19271066
13732A9271066k777096k325310j939515j620787j358911j146628r68720q21573
$$ 19271066 16493970 14168660 12229145 10608358 9249447 8102819 7134099 6312526
13724F312526o99928o00830n13418m43980l87526l39359k96097k61871k34176
$$ 6312526 5612598 5011768 4498350 4054370 3666844 3327485 3031388 2769517 2535341
13715B535341k07525j83550j61876j43586j27932j15592j04848r3718q2453p3412
$$ 2535341 2327816 2144266 1982390 1838804 1710872 1595280 1490432 1396714 1314261 1240849
13705A240849o7940o0189n1970m5691m0999l6782l4805l2011k7190k6016k6191
$$ 1240849 1172909 1112720 1060750 1015059 974060 937278 902473 870462 843272 817256 791065
13694G91065k7404k3520k2210k5082k5190k2751k2186k2609k0975j8197j4804
$$ 791065 763661 740141 717931 692849 667659 644908 622722 600113 579138 560941 546137
13683E46137j5938j6590j5773j6846j6558j2513r654r145q697j0468j0188j3191
$$ 546137 530199 513609 497836 480990 464432 451919 442265 433120 424423 413955 403767 390576
13671C90576j1649r196o661n014n469m672l356j790j999k670l047r19J149j253
$$ 390576 378927 369731 363070 358056 352587 347915 344559 342769 340770 338100 335053 334134 335283 334030
13657C34030J659R34J053k764k350m683m270l416n951m708p283p797q559q109
$$ 334030 335689 336623 337676 334912 332562 327879 323609 320193 314242 309534 302251 294454 285895 277786
13643B77786p587p579q021o374p737q847o159n887o702p845n300l265j635j41
$$ 277786 270199 262620 254599 248225 240488 231641 225482 219595 212893 205048 199748 196483 194848 194707
13629A94707R77l37j438J223K595J083o4J492k349O5O56N53q18k030n229p612
$$ 194707 195684 195347 193909 195132 197727 198810 198746 200238 197889 197954 198610 199163 198345 196315 191086 183474
13613A83474o544n816o138n013k398j008L165O673J0320R447J0067P969J65q768
$$ 183474 176930 171114 164976 159963 157565 156557 159722 166395 176715 186162 196229 204198 204363 195595
13599A95595j5105j8983j7310j2685q798m384o119o082o226j098n1k820m785r76
$$ 195595 180490 161507 144197 131512 122714 118330 112211 106129 99903 98805 98754 95934 91149 90173
13585I0173l634k347k587k347j209p87n71o65q44N92l22J81K738J437p07o31k248
$$ 90173 86539 84192 81605 79258 78049 77262 76691 76026 75182 75774 75452 75633 78371 79808 79101 78470 76222
13568G6222j317o44J288l145k850K70j678j032p77l497k260j478p2N44n1k166
$$ 76222 74905 74261 75549 72404 69554 69824 68146 67114 66337 62840 60580 59102 59030 59574 59523 57357
13552E7357j947J517K16P57N31N51J139K44K271L145M6m78p18j554l171k181l62
$$ 57357 55410 56927 57143 57900 58431 58982 60121 60365 62636 65781 65827 65349 64631 63077 59906 57725 57363
13535E7363j537l343K291J598k564k480o26j547J224O68M43J879k124n570r63
$$ 57363 55826 52483 54774 56372 53808 51328 50702 49155 50379 51047 51490 53369 51245 45675 44712
13520D4712l01j237J73j163J238J740m78k53K990k31K22M78J08l331k379K191
$$ 44712 44411 43174 43347 42184 43422 45162 44684 44431 47421 47190 47412 47890 47998 44667 42288 44479
13504D4479K56p81j50j271r65j431O72j41O04n29J093k83o59K59M96o58n5L32
$$ 44479 44735 43954 43804 42533 41568 40137 40809 40668 41272 40743 41836 41553 40894 41153 41649 40991 40936 41268
13486D1268L078j018k795j528j023k024m506J327J104k105j685j100j305j093
$$ 41268 44346 43328 40533 39005 37982 35958 31452 32779 33883 31778 30093 28993 27688 26595
13472B6595K497J537k4r14j674j862J107K683P94k502K61J501P93J62m66O26j529
$$ 26595 29092 30629 30605 29691 28017 26155 27262 29945 30739 28237 28498 29999 30792 30954 30488 31114 29585
13455B9585n39r53l128k18j794k376k57P62O6o75l114j280N86O05J476K399k094
$$ 29585 29046 28093 24965 24747 22953 20577 20320 21082 21148 20473 17359 16079 16665 17270 18746 21145 19051
13438A9051n8n3K398j33j123j040r94J92N62n95j407j202r7q28k008k70j971j556
$$ 19051 18993 18940 21338 21205 20082 19042 18048 18240 18802 18207 16800 15598 15501 14673 12665 12395 10424 8868
13420H868j070M75N59o49k64J423K140J259J808J819n07Q78j504J055K313j184
$$ 8868 7798 8273 8832 8183 7919 9342 11482 12741 14549 16368 15861 16739 15235 16290 18603 17419
13404A7419l019l474o2J665j574q43P8j473J652J222m37p23j266j088J739q05
$$ 17419 14400 10926 10864 12529 10955 10112 10190 8717 10369 11591 11154 10431 9165 8077 9816 9011
13388I011k141Q78m14l15J906R97n07j530q68K125K846J3m67j02J150K989K022
$$ 9011 6870 7748 7334 7019 8925 9922 9415 7885 7017 9142 11988 12001 11534 11432 12582 15571 17593
13371A7593r79k327j528J9J481j84J409Q56Q06Q45J005M763L319o38l724l428
$$ 17593 16614 14287 12759 12778 14259 14075 15484 16340 17146 17991 18996 23759 27078 26440 22716 19288
13355A9288L63q72R42J086k082j334K328K513r6J342N233l03j401J366K971K999
$$ 19288 19651 18779 19721 20807 18725 17391 19719 22232 22136 23478 28711 28408 27007 28373 31344 34343
13339C4343K443L653L086N587M235M813P620Q760Q268J1066J0802J3270J9709
$$ 34343 36786 40439 43525 49112 53347 58160 65780 74540 82808 93874 104676 117946 137655
13326A37655K4557K3013K3665K7800K5813J7747J6389J3099M636l317j0015j7192
$$ 137655 162212 185225 208890 236690 262503 280250 296639 309738 314374 311057 301042 283850
13314B83850j9359j5431j5372j4792j4825j6027j0343m453m882o688n131j388
$$ 283850 264491 249060 233688 218896 204071 188044 177701 173248 168366 161678 156547 155159
13302A55159P22J98J794O966O561M604P491R925J2225J1998J7206K0099K0046
$$ 155159 155881 156079 157873 164839 171400 176004 183495 193420 205645 217643 234849 254948 274994
13289B74994J5276J3200R642L178j896r212j5030k2574k5603k7175k5680k6759
$$ 274994 290270 303470 313112 316290 314394 305182 290152 267578 241975 214800 189120 162361
13277A62361k4528k0530j6519j3753r205j0297p791m756m898o351n090l534j651
$$ 162361 137833 117303 100784 87031 77826 67529 59738 54982 50084 43733 38643 35109 33458
13264C3458j257l099k934k897j804k592l143l157j551J006j505J022L24J032j103
$$ 33458 32201 29102 26168 23271 21467 18875 15732 12575 11024 12030 10525 11547 11871 12903 11800
13249A1800r29j553j005M30J887j102m089k287K239J724j195M78L183L05k097
$$ 11800 10871 9318 8313 8743 10630 9528 5439 3152 5391 7115 5920 6398 9581 9886 7789
13234G789J832L981j068k037L600K153l032k856n48p21j200j884n77O55j313j174
$$ 7789 9621 13602 12534 10497 14097 16250 13218 10362 9814 9093 7893 6009 5432 6087 4774 3600
13218C600J273r6l136J0O44M869K047k900j051k84L063J11r64j17l75k49j685
$$ 3600 4873 4777 1641 1651 2295 7164 9211 6311 5260 4976 8039 8150 7186 7069 6694 6445 4760
13201D760j238O5P95J218J722Q69l196R56J040R4k99K95J685O71k335k344j306
$$ 4760 3522 3587 4382 5600 7322 8191 4995 5951 6991 7085 6786 7081 8766 9437 7102 4758 3452
13184C452L854J843J08r69k048l93L037J859M57J430n60j743M56K157j582j168
$$ 3452 7306 9149 9257 8288 6240 5847 8884 10743 11200 12630 12070 10327 10783 12940 11358 10190
13168A0190K028J530m83k03j29L51r75n51k39P03R30J148p49k87R78o20l223k554
$$ 10190 12218 13748 13265 13062 12933 13284 12309 11758 11519 12222 13152 14300 13551 13264 14242 13622 10399 7845
13150G845R53P88K60l85L1J068L74Q16J090P19j013k181j320K890J267j455J032
$$ 7845 8798 9586 9846 9461 9492 10560 10934 11750 12840 13559 12546 10365 9045 11935 13202 11747 12779
13133A2779J630K010K480J9j261l480n55j541J071l01L443K650K90O84P73J8J959
$$ 12779 14409 16419 18899 18918 17657 14177 13622 12081 13152 12851 16294 18944 19234 19918 20691 20709 22668
13116B2668K479k296n24P20K468n36R38J356r3j954p38k255n97J622J664J513
$$ 22668 25147 22851 22327 23047 25515 24979 25917 27273 27180 25226 24488 22233 21636 23258 24922 26435
13100B6435j746j428j410n84J761J102K225M82q93n76m081j590J14Q24N53j651
$$ 26435 24689 23261 21851 21267 23028 24130 26355 26837 25944 25368 21287 19697 19811 20635 21188 19537
13084A9537l72J464J616j802J428J351k089J270M10M11K932M153O26J185K960
$$ 19537 19165 20629 22245 20443 21871 23222 21133 22403 22813 23224 26156 30309 30935 32120 35080
13069C5080K229L839j32K350m38m428l018L66n51k1o90l083p45J738M314j850
$$ 35080 37309 41148 41016 43366 42928 38500 35482 35848 35297 35276 34586 31503 30758 32496 36810 34960
13053C4960l37J480L221L070K339L305N060P312O505J686j03R36R33j998L69J693
$$ 34960 34623 36103 39324 42394 44733 48038 53098 60410 66915 68601 68498 69434 70367 68369 68738 70431
13037G0431n23l192k007L257L248p4O85K101R92K568L378M596K202R37j910n29
$$ 70431 69908 66716 64709 67966 71214 71140 71825 73926 74918 77486 80864 85460 87662 88599 86689 86160
13021H6160j107j586j973l213l212k553j822J041L290k017k320k300j611n9M726
$$ 86160 85053 83467 81494 78281 75069 72516 70694 71735 75025 73008 70688 68388 66777 66718 71444
13006G1444L069J328L347O912J539j72O117N685J20n588j529n25k334k257j226
$$ 71444 74513 75841 79188 86100 87639 87467 93584 99269 99389 93801 92272 91747 89413 87156 85930
12991H5930k151k220j739j737k809k309j976k37k607k212L10J04J062q30k582
$$ 85930 83779 81559 79820 78083 75274 72965 70989 70752 68145 65933 66243 66347 67409 66579 63997
12976F3997k532l617k671j488k555Q6j053l521j044j82J578K240q97j889O49P07
$$ 63997 61465 57848 55177 53689 51134 51220 50167 46646 45602 45420 46998 49238 48341 46452 47101 47808
12960D7808j221l200j234Q08L24j349J015K36o77K335k62j596k225J222J487M9
$$ 47808 46587 43387 42153 42961 43285 41936 42951 43187 42510 44845 44583 42987 40762 41984 43471 43520
12944D3520l042j660J944Q09j133J139J046P95k778m596l532k019j029k895j719
$$ 43520 40478 38818 40762 41571 40438 41577 42623 43418 40640 36044 32512 30493 29464 26569 24850
12929B4850n97k782k678n09R44k26M59J458K357J59j025K054J178j082q66q55
$$ 24850 24253 21471 18793 18284 19228 19002 19461 20919 23276 23435 22410 24464 25642 24560 23694 22839
12913B2839j748M6r69l581j884k492n82j24M614L64o645k88K863J966j399j031
$$ 22839 21091 21137 20168 16587 14703 12211 11629 11505 16119 16483 9838 9550 12413 14379 12980 11949
12897A1949J117K758J202K687O46Q30m19m248p27j673K06J105l281j236J626j715
$$ 11949 13066 15824 17026 19713 20359 21189 20770 16522 15795 14122 14328 15433 12152 10916 12542 10827
12881A0827K343K019K72j58J556L097L05K981P50K92o95l582j921j356j192Q11
$$ 10827 13170 15189 15461 15303 16859 19956 20261 23242 23992 24284 23589 20007 18086 16730 15538 16349
12865A6349K808O97o04l04j954k061k255J587K644j060j322j858l351j83K953
$$ 16349 19157 19854 19250 18946 16992 14931 12676 14263 16907 15847 14525 12667 9316 9133 12086
12850A2086M036K983K592R06j584j623k061o62r46K97J98J373J813r31J023K200
$$ 12086 16122 19105 21697 22603 21019 19396 17335 16673 15727 16024 16222 17595 19408 18477 19500 21700
12834B1700M568J330K995L897L123L686Q391J3190J5070J8081J9214K0312J8225
$$ 21700 26268 27598 30593 34490 37613 41299 49690 62880 77950 96031 115245 135557 153782
12821A53782J5072P619n25q262j5891k0431k1802j9961j8504j2148q130o687p568
$$ 153782 168854 176473 175948 167686 151795 131364 109562 89601 71097 58949 50819 44132 36564
12808C6564l913k03l62m735m368m231k357k278l070J93Q62j667j637J97J424J070
$$ 36564 32651 32448 32086 27351 22983 18752 16395 14117 11047 11240 12102 10435 8798 8995 10419 11489
12792A1489j083j037Q59K058L451J162P40j569l165j438k968j090J924K201M97
$$ 11489 10406 9369 10228 12286 15737 16899 17639 16070 12905 11467 8499 7409 9333 11534 12031
12777A2031J092k536M05O46j299Q59OM58j809l158j607R05K918L314L7R88J662
$$ 12031 13123 10587 10992 11638 10339 11198 11204 11662 9853 6695 5088 5993 8911 12225 12262 13250 14912
12760A4912J539pJ202J956n17P49k66k86J801J954k95j872l509j440N6P24J381
$$ 14912 16451 16444 17646 19602 19085 19834 19568 19282 21083 23037 22742 20870 17361 15921 15977 16701 18082
12743A8082k144j751J475j226j470J854J148J139j567P30J296O96K239J089n6
$$ 18082 15938 14187 15662 14436 12966 14820 15968 17107 15540 16270 17566 18262 20501 21590 21534
12728B1534n39j050P57N61P44K714m95j38L804N309M313O517N366P362O937N750
$$ 21534 20995 19945 20702 21263 22007 24721 24226 24088 27892 33201 37514 44031 49397 56759 63696 69446
12712F9446L254K917M437J079k4K03k481k765o954p761o822p583m109j926m498
$$ 69446 72700 75617 80054 81133 81109 81312 78831 76066 69112 61351 54529 46946 42837 40911 36413
12697C6413k496k432j063j663k336k452J241K555J576J501L280M94J189J641R24
$$ 36413 33917 31485 30422 28759 26423 23971 25212 27767 29343 30844 34124 34618 35807 37448 38372
12682C8372J564L650J791Q48l83P97J239j636l779k360k741l275n89P60j09j256
$$ 38372 39936 43586 45377 46225 45842 46639 47878 46242 42463 40103 37362 34087 33498 34258 34149 32893
12666C2893L23K982K835K302M253K884L84o6k249k78J455K964L199j168n30k660
$$ 32893 33216 36198 39033 41335 45588 48472 48856 48790 46541 46263 47718 50682 53881 52713 52183 49523
12650D9523k616k427Q11r49j673J550k741j47r92n68m58J55J142L971N878L819
$$ 49523 46907 44480 45291 44342 42669 44219 41478 41331 40339 39771 39313 39468 40610 44581 50459 54278
12634E4278M109K085J421J304K781L65l549k342j776j49m050m280m722k724j883
$$ 54278 58387 60472 61893 63197 65978 66343 62794 60452 58676 58527 54477 50197 45475 42751 40868
12619D0868N54k250k268J016K878K687J755J030L157K150J090N47L725N258L902
$$ 40868 41422 39172 36904 37920 40798 43485 45240 46270 49427 51577 52667 53214 56939 62197 66099
12604F6099L030J507J430j380k578k262M49O06J182P27L471J762k470K348j598
$$ 66099 69129 70636 72066 70686 68108 65846 66295 66901 68083 68810 72281 74043 71573 73921 72323
12589G2323l805m377l508j696J860O09K390J382j17n169l835j838Q03M416M896
$$ 72323 68518 64141 60633 58937 60797 61406 63796 65178 65061 59892 56057 54219 55022 59438 64334
12574F4334M472P10P79J02j360j535j585K082J124j393j87J542L161L275L464
$$ 64334 68806 69516 70295 70397 69037 67502 65917 67999 69123 67730 67543 69085 72246 75521 78985
12559G8985L173j0P25J30P7M34J481J751j116J368R39L33J11l652l564k037K822
$$ 78985 82158 82148 82873 83003 83080 83514 84995 86746 85630 86998 87937 88270 88381 84729 81165 79128 81950
12542H1950K758J042k365J44q75n43K532Q264J1850J4363J4487J2899O274j586
$$ 81950 84708 85750 83385 83529 82654 82111 84643 92907 104757 119120 133607 146506 152780 151194
12528A51194K359J3809K3859L9806N3155O3029P0913K4236m8947n4872j7299P018
$$ 151194 153553 167362 191221 231027 284182 347211 418124 442360 393413 338541 321242 328260
12516C28260k453k7446l8307k9753j8112j0160M06R270J7147K6553K1533O372
$$ 328260 325807 298361 260054 230301 212189 202029 202435 211705 228852 255405 276938 283310
12504B83310j0745o788M200J6221J6638J1551J5775K9865L1706J2641j6503k8836
$$ 283310 272565 265777 269977 286198 302836 314387 330162 360027 391733 404374 387871 359035
12492C59035k5409j1995Q305K4090L1698K7912K3978L7208N1994O8242Q9650J20004
$$ 359035 333626 321631 329936 354026 385724 413636 437614 474822 526816 595058 684708 804712
12480H04712J51389Q8212r9546j83452j31215o1949k6958l3247l8932l5276k6278
$$ 804712 956101 1044313 944767 761315 630100 568151 541193 507946 469014 433738 407460
12469D07460k1255j7830J320J5505J7623Q967j5722m3115m1553k0616m835m550
$$ 407460 386205 368375 369695 385200 402823 411790 396068 352953 311400 290784 285949 281399
12457B81399o016j246P219J3851R784j4789k8446k3338j2094o43R004J6515J9411
$$ 281399 275383 274137 281356 295207 304991 290202 261756 238418 226324 225681 234685 251200 270611
12444B70611J9735J5775J0132O335L294J6661M5303M2611l7347r4378p7755n0354
$$ 270611 290346 306121 316253 322588 325882 342543 387846 430457 393110 298732 220977 170623
12432A70623k6579r320m105Q6K998l756j1529j4153j4318j0262n204o092m740
$$ 170623 144044 134724 130619 130705 133703 129947 118418 104265 89947 79685 74481 68389 63649
12419F3649K466M125J000K492j767J001M510N567p52k933n955n366l753j808j474
$$ 63649 66115 70240 71240 73732 71965 72966 77476 83043 82291 79358 73403 68037 64284 62476 61002
12404F1002J359O8J142J690l251n545l367m89K29M279L545N450O246K495K485
$$ 61002 62361 62429 63571 65261 62010 56465 53098 52609 52838 57117 60662 66112 72358 74853 77338
12389G7338M803Q56jk519n095o055n644l193l052j348L966P321L438J241M461
$$ 77338 82141 82997 82996 80477 75382 69327 63683 60490 57438 56090 60056 67377 70815 72056 76517
12374G6517N987L877M758L652J810J592j095k677m746m578p688k525q79J522J844
$$ 76517 82504 86381 91139 94791 96601 98193 97098 94421 89675 85097 77409 74884 74005 75527 77371
12359G7371K484J684M398M244p59k349q97l08J990k242m350j30L784M259L536
$$ 77371 79855 81539 85937 90181 89422 87073 86176 85868 87858 85616 81266 81136 84920 89179 92715
12344I2715k32k133M38J67J984J670M839P639K784J509k791m609J20m006l878
$$ 92715 92483 90350 90788 90955 92939 94609 99448 107087 109871 111380 108589 103980 104100 100094 96216
12329I6216m580k100P66l29Q09Q48L189K267L550J973J013K228O484M453M974
$$ 96216 91636 89536 90302 89973 90782 91630 94819 97086 100636 102609 103622 105850 112334 116787 121761
12314A21761M844M253L76l627n702n878m112k978k576m324M37O834M506N281O861
$$ 121761 126605 130858 131234 127607 121905 116027 111915 108937 106361 102037 102474 109308 113814 119095 125956
12299A25956L551N819O229N5k48J047m602m501n092o202p471n371l021k899k07
$$ 125956 129507 135326 141555 141610 141362 142409 137807 133306 128214 122012 114541 109170 106149 103250 103043
12284A03043J895K305K227M372K248j321l34j767j896j588r46p73k125j997Q14
$$ 103043 104938 107243 109470 113842 116090 114769 114435 112668 110772 109184 108238 107465 105340 103343 104157
12269A04157O16l854j319M94r56M227L128J272J775K527L648J387O82K470K822
$$ 104157 104773 100919 99600 100094 99138 103365 106493 107765 109540 112067 115715 117102 117784 120254 123076
12254A23076n78k943l114m415k583m407m036j899m139l958l099l58k78O49J055
$$ 123076 122498 119555 116441 112026 109443 105036 101000 99101 94962 91004 87905 87547 87269 87918 88973
12239H8973j281K78J28J791M631k004J063N540J722j039J038K777J262K203J985
$$ 88973 87692 87970 88098 89889 94520 92516 93579 99119 100841 99802 100840 103617 104879 107082 109067
12224A09067K194L276K941L2l614m322m008l375n988n638n139l560j183N32Q85
$$ 109067 111261 114537 117478 117510 113896 109574 105566 102191 96203 90565 85426 81866 80683 81215 82100
12209H2100M26K411N231L344r9K603J976J087K317K111J312L72m62j867J580l53
$$ 82100 82526 84937 90168 93512 93413 96016 97992 99079 101396 103507 104819 105191 104729 102862 104442 104089
12193A04089J366P23l453j122l27J51K73m78K030k778k195r62J008J280MM054
$$ 104089 105455 106178 102725 101603 101276 101427 101700 101222 103252 100474 98279 97317 98325 99605 99609 103663
12177A03663J763K584J67j414J735M93l039L5j05k082j662j223J897j081l709
$$ 103663 105426 108010 108177 106763 108498 108991 105952 105987 105882 103800 102138 100915 102812 101731 98022
12162I8022k556k708M067J681j261J206m87J774J093J034J082J166M31J01Q3j906
$$ 98022 95466 92758 96825 98506 97245 98451 97964 99738 100831 101865 102947 104113 104544 104645 104728 102822
12146A02822j617j837l102l938m615j545j769l466m082l869K62l508j828p67J485
$$ 102822 101205 99368 96266 92328 87713 86168 84399 80933 76851 72982 73244 69736 67908 67141 68626
12131F8626J778Q97k350J11k229J80l42l96L63K668j10K020J23K16K342M33J740
$$ 68626 70404 71301 68951 69062 66833 67013 66671 66275 66638 69306 69196 71216 71339 71555 73897 74330 76070
12114G6070L441M851j241p458o816k655n526p666k845j234k244p87J820J065j453
$$ 76070 79511 84362 83121 75663 68847 66192 60666 53000 50155 48921 46677 45890 47710 48775 47322
12099D7322K58P27L030K14J945K878J095J688L033N357N535o84m190j964L298
$$ 47322 47580 48307 51337 51551 53496 56374 57469 59157 62190 67547 73082 72398 68208 66244 69542
12084F9542M640j984q433l885n52J037O18J941K00R1J048j072O2m83K65j235M23
$$ 69542 74182 72198 63765 59880 59328 60365 60983 62924 63124 63215 64263 63191 63253 62770 63035 61800 62223
12067F2223M892P294J3064R310l433j3323r721l937n702k957n82K31k557k883
$$ 62223 67115 74409 87473 96783 93350 80027 70306 66369 60667 57710 57128 57359 54802 51919
12053E1919k92K575j384r71j218J668O282P892J1190J0591P470k788j0899j0752
$$ 51919 51627 54202 52818 51847 50629 52297 58579 66471 77661 88252 95722 92934 82035 71283
12039G1283p066m876l375q65n97j295j259K265P15L392N419J73l559l021m34m198
$$ 71283 64217 59341 55966 55101 54504 53209 51950 54215 54930 58322 63741 63914 60355 57334 56900 52702
12023E2702o892k553k151k150R38L296R73n17K899J88J015J468Q13r34L925M043
$$ 52702 45810 43257 41106 38956 39894 43190 44163 43646 46545 46733 47748 49216 50029 49095 53020 57063
12007E7063N595J3989J5206K2066K6041L0054M3448O4639O8398j6914q2769n8656
$$ 57063 62658 76647 91853 113919 139960 170014 213462 278101 346499 329585 246816 188160
11995A88160k5681j2374j3909j7101q631l385l914m027j896K790Q270R389J0585
$$ 188160 162479 150105 136196 119095 110464 107079 103165 99138 97242 100032 108302 117691 128276
11982A28276K984r020j0390o456l019m59l764m529J11k080J469N752P529R559
$$ 128276 131260 122240 111850 105394 102375 101916 98152 93623 93734 91654 93123 98875 106404 115963
11968A15963J3798J0991j084l685l19P767N424O51J2631L1546N9018J09225J71302
$$ 115963 129761 140752 139668 135983 135664 143431 148855 149506 162137 193683 252701 361926 533228
11955E33228K33777L02432J98809k30105l88731k49955j26380o2909l2672k8282
$$ 533228 767005 1069437 1268246 1038141 649410 399455 273075 210166 177494 149212
11945A49212k5477j6374j1681p186j246j668J566L921O120K26l414J964R595J7521
$$ 149212 123735 107361 95680 88494 87248 85580 87146 91067 97187 97413 93999 95963 105558 123079
11931A23079K7398L8797N9378Q8310J11755R9113J03777J73227K45883J49967
$$ 123079 150477 189274 248652 336962 448717 547830 651607 824834 1070717 1220684
11921A220684j66456l17307k32964j41153r1579n7852l1897j5374O19J1363K5509
$$ 1220684 1054228 736921 503957 362804 271225 213373 181476 166102 166721 178084 203593
11910B03593M8828Q8950J50020K15533K83384L29840J25092l14977l96874k36742
$$ 203593 252421 341371 491391 706924 990308 1320148 1445240 1130263 733389 496647
11900D96647j31599q6924m9252k2347k100K0266M6786Q1675J33585J92666K46235
$$ 496647 365048 278124 228872 206525 204425 224691 271477 353152 486737 679403 925638
11889I25638J89465p2301k96296k76146j56883q0017m3203k3209j2588r752j5604
$$ 925638 1115103 1042802 746506 470360 313477 233460 190257 167048 154460 144708 129104
11878A29104k3765k0444r598m198n626m283j277K936N161P83m904J009Q450R965
$$ 129104 105339 84895 75297 71099 65473 61190 59913 62849 68010 68793 63889 64898 73348 83313
11864H3313J4389K1061K6404Q982k5392l8704k5722j1956q654o219l375k510k201
$$ 83313 97702 118763 145167 154149 128757 90053 64331 52375 43721 37502 34127 31617 29416
11851B9416j715k25O15J583M93J22o18j193K883J169J754Q56j4J77M271O695K747
$$ 29416 27701 27476 28091 29674 30167 30289 29671 28478 31361 32530 34284 35140 35126 35303 39574 46269 49016
11834D9016m291o302n072j801k7k689n000j642J457R91L060N118O097L514k267
$$ 49016 44725 38423 33351 31550 31523 28834 23834 22192 23649 24640 27700 32818 38915 42429 40162
11819D0162k568k272j971k915l133k62Q26K166r33k232o20K761K999L137J770
$$ 40162 37594 35322 33351 30436 27303 27041 27867 30033 29100 26868 26248 29009 32008 35145 36915
11804C6915m989p376k406l874l372j321K111R40j323K509L282M815O362P512J709
$$ 36915 31926 24550 22144 18270 14898 13577 15688 16628 15305 17814 21096 25911 32273 39785 41494
11789D1494q795r789n271j621k86J86L59k997j790k109j685J935m71r41J958n83
$$ 41494 32699 22910 17639 16018 15732 15918 16277 13280 11490 9381 7696 9631 9160 8219 10177 9594
11773I594j89K337K282R79J802L290N354R698J3404J4680N243j5043j7185q584
$$ 9594 9405 11742 14024 15003 16805 20095 25449 35147 48551 63231 68474 53431 36246 27662
11759B7662n291m697q6k645j312K241j528j692M95J632L081P29j435J966M033
$$ 27662 22371 17674 17588 14943 13631 15872 14344 12652 13147 14779 17860 18589 17154 19120 23153
11744B3153L686K860L122r02m057l16N696N389L097J799J91j593K171J045M393
$$ 23153 26839 29699 32821 31919 27862 27546 33242 38631 41728 43527 43718 42125 44296 45341 49734
11729D9734J1220J7820K8806L7902M6873K8971k4130n2826m1000k0465m983N799
$$ 49734 60954 78774 107580 145482 192355 221326 197196 144370 103370 82905 77922 83721
11717H3721K888j1698j9452j2930n012l918k124l001k457q08L248L25q75J35P47
$$ 83721 86609 74911 55459 42529 37517 33599 31475 28474 26017 25209 28457 28782 27907 28042 28789
11702B8789k031P15R91J452nr77J535L734R183P709L074m651o745l706j059l84
$$ 28789 26758 27473 28464 29916 29911 28934 30469 34203 43386 51095 54169 49518 42773 39067 38008 37624
11686C7624R77O18K558R676J6760J9156K3428K3526O582k0410k1446j0235r330
$$ 37624 38601 39219 41777 51453 68213 87369 110797 134323 140905 120495 99049 88814 79484
11673G9484j2134o416J57Q591J5879J7819J4914K808j6022k8373j8979j0314r642
$$ 79484 67350 60934 61091 69682 85561 103380 118294 121102 105080 76707 57728 47414 37772
11660C7772m555j547k642k596J984K404L319N855Q350J1718J5417K1244K6145
$$ 37772 33217 31670 29028 26432 28416 30820 34139 39994 48344 60062 75479 96723 122868
11647A22868L6405N2707N3999J1101n7081p4989n3424k9768j7215j0433m345k417
$$ 122868 159273 211980 265979 277080 219999 145010 91586 61818 44603 34170 29825 27408
11635B7408k894j813J538k282n691k914k316k481K856O38l171j61k229L94J006
$$ 27408 24514 22701 24239 21957 16266 13352 11036 8555 11411 12049 8878 8717 6488 6882 7888
11620G888K424J679M313J283J95j342k062k189j419k395l133o3j215j230r46l80
$$ 7888 10312 11991 16304 17587 17782 16440 14378 12189 10770 8375 5242 5179 3964 2734 1788 1408
11604A408K602P43pn77j052l2j52K772J243n6l10L641L149m42J262J364r29l038
$$ 1408 4010 4753 4746 4169 3117 3085 2933 5705 6948 6892 6582 10223 13372 12930 14192 15556 14627 11589
11586A1589k052l05J523m04k922o14l121k067J878J450Q14J372m80k916j039n71
$$ 11589 9537 9232 10755 10351 7429 6815 3694 1627 3505 4955 5769 7141 6661 3745 2706 2135
11570B135J860K136O35L60J307K790j212J245R60N25K604K263N01k26j177n362
$$ 2135 3995 6131 6766 7126 8433 11223 10011 11256 12216 12741 15345 17608 18109 17883 16706 11344
11554A1344l666l100j26L169J858p3R38J897k135l195j005l260j49L429L948O28
$$ 11344 7678 4578 4452 7621 9479 9406 10344 12241 10106 6911 5906 2646 2497 5926 9874 10502
11538A0502L953J261P49M20l225n4k375j644L477J956n52j831p02k287j453j646
$$ 10502 14455 15716 16465 16885 13660 13606 11231 9587 13064 15020 14468 12637 11935 9648 8195 6549
11522F549J164J482m38j64P87J587J87Q46k299k885l69K899K450J601r57j388
$$ 6549 7713 9195 8757 8593 9380 10967 11154 12000 9701 6816 6447 9346 11796 13397 12440 11052
11506A1052j154J397K213n76J133J873L357P40L986K794l341k538m97n41j602
$$ 11052 9898 11295 13508 12932 14065 15938 19295 20035 24021 26815 23474 20936 20439 19898 18296
11491A8296m75J795J102J799q08q70o85J925j154L03Q29J748K20P6L492K742l110
$$ 18296 17821 19616 20718 22517 21709 20839 20154 22079 20925 21228 22057 23805 24025 24101 27593 30335 27225
11474B7225k652J551K36j896k101r46J854K598K031j548k628j05l010k412j033
$$ 27225 24573 26124 26360 24464 22363 21417 23271 25869 27900 26352 23724 23619 20609 18197 17164
11459A7164J098K746j175j385N58L564K88J184J100J79j538k428J38l343j992
$$ 17164 18262 21008 19833 18448 19006 22570 22858 24042 25142 25321 23783 21355 21493 18150 16158
11444A6158k467j414j497N17J253K95J115K186L399N70J497j686m287l11k12n80
$$ 16158 13691 12277 10780 11297 12550 12845 13960 16146 19545 20115 21612 19926 15639 15328 15116 14536
11428A4536k50K530M0l787k380P92j40j558r43J59L40Q9o60l23r96K34L63L83
$$ 14536 14286 16816 16856 13069 10689 11481 11341 9783 8840 8999 9339 9428 8768 8445 7449 7683 8046 8429
11410H429l66l854k218J237K101k95q7l60J49O61K04J134Q99p74o37p3k401L83
$$ 8429 8063 4209 1991 3228 5329 5034 4947 4587 4736 5397 5601 6735 7634 6860 6223 6150 3749 4132
11392D132L043R09L72RK531R63P03K450m31J831k680l035k071J610o23k756O17
$$ 4132 7175 8084 8456 8465 10996 11959 12662 15112 14681 16512 13832 10797 8726 10336 9713 6957 7574
11375G574J511J369J826J866k21k831L88m77j552j150J101J528M18O14k83K213
$$ 7574 9085 10454 12280 14146 13925 11094 11482 11005 9453 8303 9404 10932 11350 11964 11681 13894
11359A3894R5n40O93J586Q10M79k946k14J229K26j738j590p87N70r64N66j428
$$ 13894 13989 13449 14142 15728 16538 17017 14071 13857 15086 15312 13574 11984 11197 11767 10803 11369 9941
11342I941p64K362j097l104J496K617J397r66j609k092k834k824j623j254O83
$$ 9941 9177 11539 10442 7338 8834 11451 12848 11882 10273 8181 5347 2523 900 -354 329
11327C29J604K174R49n0q16r17j897o30N77N34m96r10p51P98J334J237N57l15
$$ 329 1933 4107 5056 5006 4190 3273 1376 746 1323 1857 1361 451 -300 498 1832 3069 3626 3311
11309C311j528K39k116j759l93J053k242j847N46J113N65o87j154L103L682m27
$$ 3311 1783 2022 -94 -1853 -2246 -1193 -3435 -5282 -4736 -3623 -3058 -3745 -4899 -1796 1886 1459
11293A459k750k049o55o88K173K929j045j437l08L472K676N28J942K063N07K148
$$ 1459 -1291 -3340 -3995 -4683 -2510 419 -626 -2063 -2371 1101 3777 4305 6247 8310 8817 10965
11277A0965K519J590j948k1J19k117n664j101J892J846l91j786J289K289l7p46
$$ 10965 13484 15074 13126 13105 13224 11107 5443 4342 6234 8080 7689 5903 7192 9481 9444 8698
11261H698n01j010j965l91k384k266Q98K81j186L17L631J02j964k604J919K481
$$ 8698 8197 7187 5222 4831 2447 181 1079 1360 174 491 4122 4224 2260 -344 1575 4056
11245D056K144J933R1P11J746r49J739J755j367j410Q16O12n09M405M090K020
$$ 4056 6200 8133 8224 8935 10681 9732 11471 13226 11859 10449 11265 11877 11368 15773 19863 21883
11229B1883j615J153N867P100N442o1J178J847j368m032l509n715m775n95j979
$$ 21883 20268 21421 27288 34388 39830 39769 40947 42794 41426 37394 33885 28170 23395 22800 20821
11214B0821j244k260j934o00j572k814k627J360L3M78L26j891J820j76J772J396
$$ 20821 19577 17317 15383 14783 13211 10397 7770 9130 9163 9641 9967 8076 9896 9720 11492 12888
11198A2888k091L347J781K501M859M024L880L153L011N01j059j14J098J365j433
$$ 12888 10797 14144 15925 18426 23285 27309 31189 34342 37353 37854 36795 36681 37779 39144 37711
11183C7711j583K498J526r49N27L3j960m536l744k098l844k189l996j314k954
$$ 37711 36128 38626 40152 39203 39730 39763 37803 33267 29523 27425 23581 21392 17396 16082 13128
11168A3128k987j644J73R34K071O99k873k046J274J504J162k409j448J996O99
$$ 13128 10141 8497 8670 9604 11675 12374 9501 7455 8729 10233 11395 8986 7538 9534 10233
11153A0233N59N225L695J501R98K507K242K928J409J039P8r82j916l468l495m238
$$ 10233 10792 16017 19712 21213 22211 24718 26960 29888 31297 32336 32414 31432 29516 26048 22553 18315
11137A8315P22L612J793M045K928L667Kk654j103l263n193m883N05L78n17j954
$$ 18315 19037 22649 24442 28487 31415 35082 35084 32430 31327 28064 22871 17988 18493 18871 18354 16400
11121A6400k474j213j790l517k751k424p76J996K987K940J303m09K74q99j26K680
$$ 16400 13926 12713 10923 7406 4655 2231 1455 3451 6438 9378 10681 10272 10546 9647 9521 12201
11105A2201J552P79j979j242j457K56K710K52J845J114q30j187k150j885J581
$$ 12201 13753 14532 12553 11311 9854 10110 12820 13072 14917 16031 15201 14014 11864 9979 11560
11090A1560M65p81J594K930j61k804j521J47R2J400J618L944K181M58j634l756
$$ 11560 12025 11244 12838 15768 15607 12803 11282 11429 11521 12921 14539 18483 20664 21122 19488 15732
11074A5732m117k267j052k412n29J614j930k049k052j296l89K66P93K118L106
$$ 15732 11615 9348 8296 5884 5355 6969 5039 2990 938 -358 -747 -481 312 2430 5536
11059E536J844j634j551J035j55Q46j300m224k272J292j128k578J347K005L96
$$ 5536 7380 5746 4195 5230 5075 5921 4621 397 -1875 -583 -1711 -4289 -2942 -937 -541
11044e41J913J257L25Q91R59N046M829M004N310M729l3p78J091K250J580J73k764
$$ -541 1372 2629 2954 3845 4804 9850 14679 18683 23993 28722 28689 27911 29002 31252 32832 33005 30241
11027C0241k637K86K299J214k233m038l520J790L240K309L374j018l032m169q392
$$ 30241 27604 27890 30189 31403 29170 25132 21612 23402 26642 28951 32325 31307 28275 24106 15714
11012A5714j085J484k170J677J521K315K268K425P96k492j094l27N81nq04j02
$$ 15714 14629 16113 13943 15620 17141 19456 21724 24149 24945 22453 21359 21032 21613 21608 20804 20702
10996B0702k917j406k116R10K279K551O910L866k024k311k147k289J61p42j02
$$ 20702 17785 16379 14263 15173 17452 20003 26913 30779 28755 26444 24297 22008 22169 21427 21325
10981B1325j584j485l098l636j004J251o83R47R60L837J499j160m572l244k541
$$ 21325 19741 18256 15158 11522 10518 11769 11086 12033 12993 16830 18329 17169 12597 9353 6812
10966F812N7J608O807M245q5j693j667j691O34Q50P39L83j593K05J115l468l452
$$ 6812 6869 8477 15284 19529 19444 17751 16084 14393 15027 15877 16616 16999 15406 15611 16726 13258 9806
10949I806q22l92L81J374J697O92K03l622j713Q52M27K01J47p75j346L20L55J322
$$ 9806 8984 8592 8973 10347 12044 12736 12939 9317 7604 8456 8883 9084 9231 8456 7110 7430 7785 9107
10931I107P07J641J890j26j676O01L31K130k060o027l698j217q52n4r73J298J208
$$ 9107 9814 11455 13345 13219 11543 12144 12475 14605 12545 6518 2820 1603 751 697 -276 1022 2230
10914B230r69J808L308L74j632n40p91l333j712O86J084r35p45j751r28K514j814
$$ 2230 1261 3069 6377 6751 5119 4579 3788 455 -1257 -571 513 -422 -1167 -2918 -3846 -1332 -3146
10897c146j851j04q3k39j842O48K662Q77j481j341j174j141j191k97L021Q87j524
$$ -3146 -4997 -5101 -5184 -5423 -7265 -6617 -3955 -3078 -4559 -5900 -7074 -8215 -9406 -9703 -6682 -5795 -7319
10880g319n80K891K247k90K649M196N093J189M62m970l496m175m15K827n28K185
$$ -7319 -7899 -5008 -2761 -3051 -402 3794 8887 10076 10538 5568 2072 -2103 -2518 309 -219 1966
10864A966O48J400M544L451O697N156M701J898j198Q79J169m31m779p556n343
$$ 1966 2614 4014 8558 12009 18706 23862 28563 30461 29263 30142 31311 30880 26101 18545 13202
10849A3202k756k555P40L439L013L445M593M251O100L147j972k89j829m142j86
$$ 13202 10446 7891 8631 12070 15083 18528 23121 27372 33472 36619 34647 34358 32529 28387 28201
10834B8201l4l101m872l336r14K538O747N637M927O35J562K310K184K305K202
$$ 28201 28167 25066 20194 16858 15944 18482 25229 30866 35793 36428 37990 40300 42484 44789 46991
10819D6991j109p802q925l024j276l189j120L607N558N258K953J494j831R67L01
$$ 46991 45882 38080 29155 26131 24855 21666 20546 24153 29711 34969 37922 39416 37585 38552 38853
10804C8853k185l741m348l748n434l808k932k428j657k206R14K017K353K387L365
$$ 38853 36668 32927 28579 24831 19397 15589 12657 10229 8572 6366 7280 9297 11650 14037 17402
10789A7402K468k418j390l359k033N81M17n96k546l873j087P51M5j52J393P32
$$ 17402 19870 17452 16062 12703 10670 11251 11668 11072 8526 4653 3566 4317 4362 4210 5603 6335
10773F335q5Q44R5n66Q80Q31P88J182J867M89J989J227K716K929n65l98o69j068
$$ 6335 6250 7094 7189 6623 7503 8334 9122 10304 12171 12660 14649 15876 18592 21521 20956 20558 19889 18821
10755A8821K307O060Q772N204K687J975J872l077k958k577r51K598R556O405M939
$$ 18821 21128 27188 35960 41164 43851 45826 47698 44621 41663 39086 38135 40733 50289 56694 61633
10740F1633O29l003j249k199n809n308k680J153M465O553N444o05n452m536m434
$$ 61633 62262 59259 58010 55811 50002 44694 42014 43167 47632 54185 59629 59024 53572 49036 44602
10725D4602m843o381J195J786n8p46k225M10k522m272k956l619k250k93J906J74
$$ 44602 39759 33378 34573 36359 36301 35555 33330 33740 31218 26946 23990 20371 18121 17828 19734 19908
10709A9908J478J894J606K251J365j105r91M46K404P97n87M09m32J755K850K978
$$ 19908 21386 23280 24886 27137 28502 27397 26406 26852 29256 30053 29466 29875 29443 31198 34048 37026
10693C7026J598l01j244J227J454J463O89Q72p94J765J449K349L209L372L634
$$ 37026 38624 38323 37079 38306 39760 41223 41912 42784 41990 43755 45204 47553 50762 54134 57768
10678E7768K218R87J277J933K703P64K699L393N717O918O568O140N864M307M639
$$ 57768 59986 60973 62250 64183 66886 67650 70349 73742 79459 86377 92945 99085 104949 109256 113895
10663A13895N271O852J0145R632O207P353J0595J0463Q883N136L240N798Q905
$$ 113895 119166 126018 136163 145795 152002 159355 169950 180413 189296 194432 197672 203470 212375
10650B12375J0670J0331P322N874O120J2371J0726O678K180L564R206J3777J7010
$$ 212375 223045 233376 240698 246572 252692 265063 275789 282467 284647 288211 297417 311194 328204
10637C28204J4030J1335J3571J9201K1944J6843J6607J8852K1245K7250L2182
$$ 328204 342234 353569 367140 386341 408285 425128 441735 460587 481832 509082 541264
10626E41264L7280L8292M1254M1810M7365N3290O2455O9156P8376Q9722J02258
$$ 541264 578544 616836 658090 699900 747265 800555 863010 932166 1010542 1100264 1202522
10615A202522J18206J31138J46579J68236J96202K27610K59055K99868L49519
$$ 1202522 1320728 1451866 1598445 1766681 1962883 2190493 2449548 2749416 3098935
10606C098935M02315M59786N26158N93798O62149P28949P85799Q23887Q24961
$$ 3098935 3501250 3961036 4487194 5080992 5743141 6472090 7257889 8081776 8906737
10597H906737P84908P00127N70635M01848K10419K2663j43505k73345l61339m11357
$$ 8906737 9691645 10391772 10962407 11364255 11574674 11597337 11453832 11180487 10819148 10407791
10587A0407791m25482m11894l79472l36485k85201k28596j66627j05251m5933
$$ 10407791 9982309 9570415 9190943 8854458 8569257 8340661 8174034 8068783 8022850
10578H022850J7753Q5424J61064K40306L28728M25553N36729O68148Q12089R79143
$$ 8022850 8040603 8126027 8287091 8527397 8856125 9281678 9818407 10486555 11298644 12277787
10568A2277787J177509J400643J629868J856114K056347K185697K193382K028744
$$ 12277787 13455296 14855939 16485807 18341921 20398268 22583965 24777347 26806091
10560B6806091J641752J019784K12519o54841j427795j972695k246354k281302
$$ 26806091 28447843 29467627 29680146 29025305 27597510 25624815 23378461 21097159
10552B1097159k157316j946456j702239j453316j225904j028078q56895p06613
$$ 21097159 18939843 16993387 15291148 13837832 12611928 11583850 10726955 10020342
10544A0020342n81070m69534l71295k84539k06535j35101o8284q526N2188J08685
$$ 10020342 9439272 8969738 8598443 8313904 8107369 7972268 7903984 7895458 7947646 8056331
10534H056331J60084K17027K68476L10313L45390L66212L70139L45095K86547
$$ 8056331 8216415 8433442 8701918 9012231 9357621 9723833 10093972 10439067 10725614
10525A0725614J94171O6678q7995k63670m30068n76765o87589p49736p64537p48451
$$ 10725614 10919785 10986463 10898468 10634798 10204730 9627965 8940376 8190640 7426103 6677652
10515F677652p06278o47108n79139n14508m54319l94652l45344l01263k62037
$$ 6677652 5971374 5324266 4745127 4230619 3776300 3381648 3036304 2735041 2473004
10506B473004k25962j96845j76444j56997j40390j26717j13527j02334r2190q5299
$$ 2473004 2247042 2050197 1873753 1716756 1576366 1449649 1336122 1233788 1141598 1056299
10496A056299p7345o7312n9439n3549m8814m5251l8183l2068l1210l0207k6354
$$ 1056299 978954 911642 852203 798654 749840 704589 666406 634338 603128 572921 546567
10485E46567k3549k2479j8852j7136j7913j3634j3319j2716j4501j2312j0284
$$ 546567 523018 500539 481687 464551 446638 433004 419685 406969 392468 380156 369872
10474C69872q863o984p772o196q344o609p577o401p467n376n147m729o376r978
$$ 369872 361009 354025 346253 340057 331713 325104 317527 311126 303659 298283 293136 288407 282031 272053
10460B72053r869r268r122r972r525m357m690n871p942m528l454m615m311k003
$$ 272053 262184 252916 243794 233822 224297 219940 215250 209379 201437 196909 193455 188840 184529 182526
10446A82526n394m122j688k353j219L224L558J368K886J703J439J75j717j325
$$ 182526 177132 173010 171322 168969 167750 170974 174532 175900 178786 180489 181928 182103 180386 179061
10432A79061J718j378l645n308n089l512n912q243n514n902n843m709p072n043
$$ 179061 180779 179401 175756 170448 165359 161847 155935 147692 142178 136276 130433 125724 118652 113609
10418A13609j131l462k469j722j478R05l074l16O6n6J830n99l268j869j167k131
$$ 113609 112478 109016 106547 104825 103347 104252 101178 100862 100928 100872 102702 102103 98835 96966 95799 93668
10402I3668k050j606k243q72j637n28Ol74q97j711o1N25j976q60M2J771K14k014
$$ 93668 91618 90012 87769 86897 85260 84732 84738 84364 83467 81756 81695 82220 80244 79384 79426 81197 81411 79397
10384G9397k837j938l243k234n35J741J092k460l899k490j914m09P20j205O09
$$ 79397 76560 74622 71379 69145 68610 70351 71443 68983 65084 62594 60680 60271 60991 59786 60395
10369F0395O86l001j326J240l439j192J913J555j385r15j877j415J355J200p06
$$ 60395 61081 58080 56754 57994 54555 53363 55276 56831 55446 54531 52654 51239 52594 53794 53088
10354E3088p86J68j868k014r72q4l145j915J923J661K789l63j399K510Q69j579
$$ 53088 52302 52470 50602 48588 47616 47532 44387 42472 44395 46056 48845 48482 47083 49593 50462 48883
10338D8883q45J819o85k288k768p04J878J636j773J327R85j441J173p74j127j276
$$ 48883 48038 49857 49172 46884 44116 43412 45290 46926 45153 46480 47465 46024 47197 46423 45296 44020
10322D4020J213l07k63k743k094p12j219j030L040K849P08K45l198m076k782j87
$$ 44020 45233 44926 44663 41920 39826 39114 37895 36865 39905 42754 43462 43707 40509 36433 33651 33464
10306C3464o86J410M2o46p4J270N00J805K008q6K735J845J482n8J284J921K402
$$ 33464 32778 34188 34230 33584 33510 34780 35280 37085 39093 39007 41742 43587 45069 45011 46295 48216 50618
10289E0618K186j540k721K997L127J368M90L1K46p85j666j721r29p060j0262q167
$$ 50618 52804 51264 48543 51540 54667 56035 56525 56556 56802 56017 54351 52630 51701 44641 34379 26212
10273B6212p418n922j866n30L93K843K277R99N10L410L331N25j134J598n79j155
$$ 26212 18794 12872 11006 10476 10869 13712 15989 16988 17498 20908 24239 24764 23630 25228 24649 23494
10257B3494j671j967P00J980K963N397L249M781N209L297J310P56K159K878J611
$$ 23494 21823 19856 20556 22536 25499 30896 34145 38926 44135 47432 48742 49498 51657 54535 56146
10242E6146N38N089L203p00k156O82J48K346K938L868M502L587N771Q692J1770
$$ 56146 56684 61773 64976 64276 62120 62802 62950 65296 68234 72102 76604 80191 85962 94654 106424
10227A06424J3794J9849K8587M7706P3910J15614J75506K39179K84342L12252
$$ 106424 120218 140067 168654 216360 290270 405884 581390 820569 1104911 1417163
10217A417163K58451J55946M7419j39703k32848k87966l05217k48858j89366j23951
$$ 1417163 1675614 1831560 1878979 1739276 1506428 1218462 913245 664387 475021 351070
10207C51070p4400m1413k3781q576L180J1983K6016M7871P4683R8478J18770R8260
$$ 351070 276670 235257 211476 202900 206080 218063 244079 291950 366633 465111 583881 682141
10195F82141N4149O1574Q9951L3992r0685j26480q2446o4466j05029j21793q6730
$$ 682141 736290 797864 887815 921807 831122 704642 622196 557730 452701 330908 244178
10184B44178n2496l1373j9850j4069j1825q323l064k433k384p1j657m623k395
$$ 244178 191682 160309 140459 126390 114565 106242 103178 100745 98361 98290 96633 92010 89615
10171H9615k052k346p87J25l606l849j731k611k070r43j915j915n62j508j916
$$ 89615 87563 85217 84430 84555 80949 77100 75369 72758 70688 69745 67830 65915 65353 63845 61929
10156F1929R37J243L970J084N12K911M232O098J948N18J273M318K353J252k035
$$ 61929 62866 64109 68079 69163 69675 72586 76818 82916 84864 85382 86655 90973 93326 94578 92543
10141I2543n41j678n52O35j292M1M379J707J08N213O473M883M976M811N550P964
$$ 92543 92002 90324 89772 90407 89115 89156 93535 95242 95350 100563 107036 111919 116895 121706 127256 135220
10125A35220R364R237M952O301J0065J0039P015P289J0576J0999J0410Q427R522
$$ 135220 144584 153821 158773 165074 175139 185178 192193 199482 210058 221057 231467 239894 249416
10112B49416J0162R168J0242J3192J6007J5730J4529J6825J8662J8732K3737K4509
$$ 249416 259578 268746 278988 292180 308187 323917 338446 355271 373933 392665 416402 440911
10100D40911K5414K5420L0135L2121L2241L5565L7850L4275L5131L3076L0814
$$ 440911 466325 491745 521880 554001 586242 621807 659657 693932 729063 762139 792953
10089G92953K7036K1574J5749R504N789K322m216r462j5113j9151k2205k6609
$$ 792953 819989 841563 857312 866816 872605 874927 870711 861249 846136 826985 804780 778171
10077G78171k8415l3157l1888l2518l3641l1417l0384l0355k6052k3792j9888
$$ 778171 749756 716599 684711 652193 618552 587135 556751 526396 500344 476552 456664
10066D56664j7153k1770k1318k4681k4097k3132k3520k0903k1672k1204j8961
$$ 456664 439511 417741 396423 371742 347645 324513 300993 280090 258418 237214 218253
10055B18253j9494k0359j7039j4275j1449r360m808m521j401J072L65k63j096
$$ 218253 198759 178400 161361 147086 135637 126277 121469 116948 115547 116619 116984 116721 115625
10042A15625m649m008o213p137n271l388k890m36J299P81J743j178l515l520n353
$$ 115625 110976 106968 100755 93618 88347 84959 82069 81633 82932 83713 85456 84278 80763 77243 71890
10027G1890o774k678p571p755j0689j0869r080j0134o023l596j728j973M075L964
$$ 71890 65116 62438 54867 47112 36423 25554 16474 6340 317 -3279 -5007 -6980 -2905 1059
10013A059N322N052R859J2561J1328Q325M962M462K058j232l818n698j1315j1318
$$ 1059 6381 11433 21292 33853 45181 53506 58468 62930 64988 63756 59938 54240 42925 31607
9999C1607j4244j1575o015q073m325k140q68P187J0602P904Q815J0855J3587J3560
$$ 31607 17363 5788 -227 -8300 -12625 -14765 -15633 -8446 2156 10060 18875 29730 43317 56877
9985E6877J3242J5226J2510J0672M143l3j869q527j3243j3215j5399j9508j6529
$$ 56877 70119 85345 97855 108527 112670 112637 110768 102241 88998 75783 60384 40876 24347
9972B4347j3084j0370m729J395R477J2124J5329J2673R765P618O243O882P775
$$ 24347 11263 893 -3836 -2441 7036 19160 34489 47162 56927 64545 70788 77670 85445
9959H5445P726N754L893K460j565o526q022r553p609l557k258P853O117Q980Q202
$$ 85445 93171 98925 102818 105278 103713 97187 89165 79612 72003 68446 66188 74041 80158 89138 97340
9944I7340J537M138J055K315J53L000R33M141M223j051J092m456l907j943j094
$$ 97340 98877 103015 104070 106385 106538 109538 110471 114612 118835 117784 118876 114420 110513 108570 107476
9929A07476k919k878o40l02l126r33k185l924k458m689j684j430k737l146j792
$$ 107476 104557 101679 101039 100737 97611 96678 94493 90569 88111 83422 81738 80308 77571 74425 72633
9914G2633k726J102L998K351J905P407Q632N626N258Q413Q378M563L044N204M603
$$ 72633 69907 71009 75007 77358 79263 86670 95302 100928 106186 114599 122977 127540 130584 135788 140391
9899A40391K606P251J0534Q995J0784J6486K0561J9014K1065J8162J4157J0615
$$ 140391 142997 150248 160782 169777 180561 197047 217608 236622 257687 275849 290006 300621
9887C00621R316N555R76M944N857Q498J2181J2808J6601K1339K3132K3157K0805
$$ 300621 309937 315492 316468 321412 327269 335767 347948 360756 377357 398696 421828 444985 465790
9874D65790K0179J8626J3139Q055R085J5224K0036K9089L4963L6725L7522M1454
$$ 465790 485969 504595 517734 525789 534874 550098 570134 599223 634186 670911 708433 749887
9862G49887M2677M7853N5454O8330Q2651R1005R9587J03339J06062J06302J10154
$$ 749887 792564 840417 895871 964201 1046852 1137857 1237444 1340783 1446845 1553147 1663301
9851A663301J15242J12065J09253J18639J23203J30480J53053J83665K33327L04426
$$ 1663301 1778543 1890608 1999861 2118500 2241703 2372183 2525236 2708901 2942228 3246654
9841C246654M13811N40387O67226Q10809Q90004R54710J028509J017633J068306
$$ 3246654 3660465 4200852 4868078 5678887 6568891 7523601 8552110 9569743 10638049
9832A0638049J122506J211610J311472J576398K012215K736100M060137O178044
$$ 10638049 11760555 12972165 14283637 15860035 17872250 20608350 24668487 30846531
9824C0846531R658579J4912476K2352716L1980993M0520176M4046026M4948059
$$ 30846531 40505110 55417586 77770302 109751295 150271471 194317497 239265556
9817B39265556L4173953J9292816P021800j6810487l0188818l9777190m8229216
$$ 239265556 273439509 292732325 299754125 282943638 252754820 212977630 164748414
9810A64748414m2923802l5249522k5444680j6114019j0103286o563705m439134
$$ 164748414 121824612 86575090 61130410 45016391 34913105 28349400 23910266
9803B3910266l125292k254615j729690j464480j232967j114595j045775q88461
$$ 23910266 20784974 18530359 16800669 15336189 14103222 12988627 11942852 11054391
9795A1054391q67387q17393p95198q49951q04004p87314p23383o21258n23257
$$ 11054391 10187004 9369611 8574413 7724462 6920458 6133144 5409761 4788503 4265246
9786D265246m23281l53050k93423k48931k12662j75653j38105j02642p6097o1125
$$ 4265246 3841965 3488915 3195492 2946561 2733899 2558246 2420141 2317499 2241402 2180277
9776B180277n7809n8821p1398q2557q4618q4666p4880o5752n5028m9458m8415
$$ 2180277 2122468 2063647 1992249 1909692 1825074 1740408 1665528 1599776 1544748 1495290 1446875
9765A446875m7749n0129m8069m8251n0274m6284m2341m1782l4863l2040k9730
$$ 1446875 1399126 1348997 1300928 1252677 1202403 1156119 1113778 1071996 1037133 1005093 975363
9754I75363l0367k5820k1412k1306k2591k5851k4686k3127k4272k1497k0457j9080
$$ 975363 944996 919176 897764 876458 853867 828016 803330 780203 755931 734434 713977 694897
9742F94897j1935o054M054O196Q942J3000J3055J0334Q612J267m927j0376j9451
$$ 694897 682962 676908 680962 687158 696100 709100 722155 732489 741101 742368 737441 727065 707614
9729G07614k0865k0723j6760j1201n545Q28N698O014M530J0038P843K2n264j0502
$$ 707614 686749 666026 649266 638065 632520 633348 639046 645060 649590 659628 667471 667493 662229 651727
9715F51727k2335k6023k1150k2473j5362m659L62P173Q481m683j3602j9985k5393
$$ 651727 629392 603369 582219 559746 544384 539725 540087 547260 555741 551058 537456 517471 492078
9702D92078k5709j7545o198K836J2194K0553K2796L0461K9727L0224K4885J9722
$$ 492078 466369 448824 442626 445462 457656 478209 501005 531466 561193 591417 616302 636024
9690F36024J4221L770r030k6709k5894l0955l3657k7667k6404k6179k6292k5916
$$ 636024 650245 654015 644985 618276 592382 561427 527770 500103 473699 447520 421228 395312
9678C95312l0909l2211k6716j6584j3274j0269o327l005k7O30K834M924N678P827
$$ 395312 364403 332192 305476 288892 275618 265349 259022 256017 255990 256620 259454 264378 270056 277883
9664B77883N730L437K395l62o307r441j6394j9149k0907k1206j7870j1400r857
$$ 277883 283613 287050 289445 289083 282776 273335 256941 237792 216885 195679 177809 166409 156552
9651A56552o703k287K236N157Q401J2005J0159Q357J0921R610R830Q580R475Q788
$$ 156552 149849 147562 149798 154955 163356 175361 185520 193877 204798 214408 224238 232818 242293 251081
9637B51081P401P523O311J272m778p174j1208j5159j2778j2951j2818o826l339
$$ 251081 258482 266005 272316 273588 268810 261636 250428 235269 222491 209540 196722 189896 186557
9624A86557n98R11K543M627M353O912O183M903N364J252k400k074n873o326p094
$$ 186557 185959 186870 189413 194040 198393 205305 211488 216391 221755 223007 220607 218533 212660 206334 199240
9609A99240p680r321j0483r083p092m668m450j491k948q45J74N110M478N968O726
$$ 199240 191560 182239 171756 162673 155581 150913 146463 144972 142024 141179 141353 146463 150941 156909 163635
9594A63635P588R054R895R805Q050L965Q4n115k605r58m756l350m427n479k848
$$ 163635 171223 180277 190172 199977 208027 211992 212076 206961 204356 203398 198642 195292 190865 185386 182538
9579A82538m344r723j0245j0355m607k597j970Q67L158N105N244M311N160L255
$$ 182538 178194 168471 158226 147871 143264 140667 138697 139564 142722 147827 153071 157382 162542 165797
9565A65797J626L560L892M302O911P125J0341J0931J1598J0993N525p748j4611
$$ 165797 167423 170983 174875 179177 186088 193213 203554 214485 226083 237076 242601 234853 220242
9552B20242q780j53M110J4505K8538M4382O1129Q1508O1271k4281o5369m5816
$$ 220242 211462 211309 215419 229924 258462 302844 363973 445481 506752 482471 417102 371286
9540C71286l1050k8662l3408k8760k2498j2184p86Q589J5505K2661L5004L9980
$$ 371286 340236 311574 278166 249406 226908 214724 213938 222527 238032 260693 295697 335677
9528C35677L1325K7234L0611L2812J1200j4122k3553j7323j1541j2914j5472j5681
$$ 335677 367002 394236 424847 457659 468859 454737 431184 413861 402320 389406 373934 358253
9516C58253j2394n860p025p146j3413j2815K242K4315M9049P5539J02458J38744
$$ 358253 345859 339999 332974 325828 312415 299600 301842 326157 375206 450745 553203 691947
9504F91947J75906J94090J41919o5642k34822k19178j45578r2655o3173m2860
$$ 691947 867853 1061943 1203862 1138220 903398 684220 538642 445987 382814 339954
9494C39954k4084m136N512J1171J0842J812q191k344J2635K5404K2990J9477J9578
$$ 339954 315870 311734 317246 328417 339259 341071 332880 330536 343171 368575 391565 411042 430620
9481D30620J6519J0047m109k4517l6494l2830l7287m5061m0462k6905j6731l491
$$ 430620 447139 457186 453077 428560 392066 359236 321949 276888 236426 209521 192790 189299
9469A89299M439J0868J8314K7815L2969L4238K7621K7416L5950L9069j2710p8916
$$ 189299 193738 204606 222920 250735 283704 317942 345563 372979 408929 447998 435288 356372
9457C56372p3071l6542j9012j1461r266n565k865K078n39l642q832j1100j1089
$$ 356372 283301 246759 227747 216286 207020 201455 198590 200668 200129 196487 187655 176555 165466
9444A65466o409m431j991J314j811l609j531N79p19J122q11J522Q697R408O521
$$ 165466 159057 154626 152635 153949 152138 148529 146998 147577 146858 147980 147169 148691 157388 166796 173317
9429A73317O225P195O886P298P892K796N577J2156J6341J9178L3783N1792Q3129
$$ 173317 179542 186737 193623 200921 208813 211609 217186 229342 245683 264861 298644 350436 433565
9416D33565J33469J96154K54893K92087L08615K33643J38040j594j84242k53226
$$ 433565 567034 763188 1018081 1310168 1618783 1852426 1990466 1988872 1804630 1551404
9406A551404l08793k97263k30113j68348j07335o7015m4980l5717k9215j9587
$$ 1551404 1242611 945348 715235 546887 439552 372537 327557 291840 262625 243038
9396B43038j2317o502K076J192o230j6228j4669j2374j1228p945p981o576J246
$$ 243038 230721 224219 226295 227487 221257 205029 190360 177986 166758 158813 150832 144256 145502
9383A45502K743P014R321R374P806N018K701K979J825L59L201r0q857j4786j8354
$$ 145502 148245 155259 164580 173954 181760 186778 189479 192458 194283 194642 197843 197753 188896 174110 155756
9368A55756j2261p187l120j36L352N263N166K050P54j579j081j515l486m219J186
$$ 155756 143495 136308 133188 133052 136404 141667 146833 148883 149637 148058 146977 145462 141976 137757 138943
9353A38943K374J416R7L98o58o48k62K99L576O177Q210J4771J4604J1111K984
$$ 138943 141317 142733 142830 143228 142570 141922 141660 141959 145535 151712 159922 174693 189297 200408 203392
9338B03392p894j3995r868n584o726q556p030l335m905k935j219Q32o92P7k327
$$ 203392 195498 181503 171635 166051 159325 150769 143739 140404 135499 132564 131345 132177 131485 131562 129235
9323A29235J389K535J12l90O526R008Q285Q038L922O893R041O607M064K799J950
$$ 129235 130624 133159 133271 132881 139407 148415 156700 164738 168660 175553 184594 191201 195265 198064 200014
9308B00014P987P425Q49K759P678N957R441J4969J5834J5307J6807J0354N375
$$ 200014 208001 215426 216275 219034 226712 232669 242110 257079 272913 288220 305027 315381 320756
9295C20756J0657K3391L5493L0792K0147J2425N833L134K720O662M907M917M964
$$ 320756 331413 354804 390297 421089 441236 453661 459494 462628 465348 472010 476917 481834 486798
9282D86798l431j6377l1594m2671m1389l1848l1034l3228l3457l3564k5127j5950
$$ 486798 483367 466990 435396 392725 351336 319488 288454 255226 221769 188205 163078 147128
9270A47128j0533p139R23K967M376M742Q304K640k439k466k100J892L888O75L504
$$ 147128 136595 129456 130379 133346 137722 142464 150768 153408 150969 148503 146403 148295 152183 152858 156362
9255A56362M549N984O214N496N680N774j051r180j2385j7744j5365j0079n064
$$ 156362 160911 166895 173109 178605 184285 190059 189008 179828 167443 149699 134334 124255 119191
9242A19191j617J339M110L261l410q615r573q138o533n062l215j811m576q68K328
$$ 119191 117574 118913 123023 126284 122874 114259 104686 96548 90015 84953 81738 79927 75351 74483 76811
9227G6811J15K35k896l32J854j740N33J190M26K732M221M100N680M832K951K337
$$ 76811 76926 77161 74265 73933 75787 74047 74580 75770 76196 78928 83149 87249 92929 97761 100712 103049
9211A03049R94j774n214o531o386p391p466l384l16q35K864Q56K37m86j849j154
$$ 103049 104043 102269 97055 90524 84138 76747 69281 65897 65581 64746 67610 68466 68703 68217 66368 65214
9195F5214k486O68J859L720L941N653K609J874m44k14k28j713k352j676r26P65
$$ 65214 62728 63396 65255 68975 72916 78569 81178 83052 82608 82394 82166 80453 78101 76425 75499 76264
9179G6264K856J363O3j481r04q31j247n794o220o464j095J11j281q94J494K450
$$ 76264 79120 80483 80546 79065 78161 77330 76083 70289 64069 57605 56510 56621 55340 54446 55940 58390
9163E8390M600N594Q516Q464M062k42l993k145k836l979j915K222K347j41J155
$$ 58390 62990 68584 77100 85564 89626 89384 85391 83246 80410 76431 74516 76738 79085 78944 80099
9148H0099M985P87J227P08r99j821r85J915K422M115O057P179L054k164o445r420
$$ 80099 85084 85871 87098 87806 86807 84986 84001 85916 88338 92453 98510 105689 108743 106579 100134 90714
9132I0714o270n520p041l092J752j76k183q02J586K395K216M668M186J508k32
$$ 90714 84444 78924 71883 68791 70543 70367 68184 67382 68968 71363 73579 78247 82433 83941 83709
9117H3709k232l759o462l344l839l784q12j529j241j962k164P3J811M30K119M318
$$ 83709 81477 77718 71256 67912 64073 60289 59477 57948 56707 54745 52581 52654 54465 54895 57014 61332
9101F1332N027L441J582k009l947k867n012m454l025n5m73n84m90P69L111L262
$$ 61332 66359 69800 71382 69373 65426 62559 57547 53093 50068 50013 49540 48956 48466 49235 52346 55608
9085E5608O77r20k742p16Q72O355Q828N154K24l243m360k862l957l016m933m716
$$ 55608 56285 55365 52623 51907 52779 59134 67962 73116 73340 70097 65737 62875 58918 55902 50969 46253
9069D6253k007P02J326K723N90k506l082j551J726l0Q12l282j840P26J646K879
$$ 46253 44246 44948 46274 48997 49587 47081 43999 42448 44174 44144 44956 41674 39834 40560 42206 45085
9053D5085M72j278r66l041j970J018J973M42J188K829j55j080j541J25K007J399
$$ 45085 45557 44279 43313 40272 38302 39320 41293 41735 42923 45752 45597 44517 42976 43101 45108 46507
9037D6507J085k571k587k065r18k707K604J03l069j235Q24J173K069J064l672
$$ 46507 47592 45021 42434 40369 39451 36744 39348 39451 36382 35147 35971 37144 39213 40277 36605
9022C6605r28j84k80Q57j451L96K307K98R51N491M198K681J439J703J431P04Q73
$$ 36605 35677 35493 35213 36070 34619 35015 37322 37620 38571 44062 48260 50941 52380 54083 55514 56218 57091
9005E7091j500k310k055k61j887J039M714M506M848K976n7l393k244o298n612
$$ 57091 55591 53281 51226 50965 49078 50117 54831 59337 64185 67161 67104 63711 61467 55169 49557
8990D9557m514l524J188L10j421k019l796k117Q5j108J738M93M41K796J654k68
$$ 49557 45043 41519 42707 43017 41596 39577 35781 33664 33749 32641 34379 34872 35313 38109 39763 39495
8974C9495J688K588r66P72J742K170J849K697M139M427M989J511o282p225m904
$$ 39495 41183 43771 42805 43577 45319 47489 49338 52035 56174 60601 65590 67101 60819 53594 48690
8959D8690l524l554l072j805j060q67J650r50k022N82J143m107n36M02n84O59
$$ 48690 45166 41612 38540 36735 35675 34808 36458 35508 33486 34068 35211 31104 30568 30970 30386 31045
8943C1045j4J526l12k533J525L202k0k379j005J557J287K500K039J26j605K34
$$ 31045 31031 32557 32245 29712 31237 34439 34419 32040 31035 32592 33879 36379 38418 38544 36939 37173
8927C7173k134k75o5L314J223J025j683L50Q48j099Q50o31L77j246K496q51k831
$$ 37173 35039 34764 34699 38013 39236 40261 38578 38928 39776 38677 39527 38896 39273 38027 40523 39672 36841
8910C6841Q64J564J437K693K655L386O52J612J894K938O67j661J628q5q75P15
$$ 36841 37705 39269 40706 43399 46054 49440 50092 51704 53598 56536 57203 55542 57170 57085 56210 56925
8894E6925K041M015N013K466L37m75J300M008N565P004Q361R243J2310J6037K0501
$$ 56925 58966 62981 67994 70460 70797 70322 71622 75630 81195 88199 96560 105803 118113 134150 154651
8879A54651K5231K4017K7400L2810L7884M1732M4276N0585M9776O3241R8274J64035
$$ 154651 179882 203899 231299 264109 301993 343725 388001 438586 488362 551603 649877 813912
8867H13912K67635M24278O73064R98030J327037J593257J388417j08025j779020
$$ 813912 1081547 1505825 2178889 3176919 4503956 6097213 7485630 7377605 5598585
8858E598585j907508j264587p42836m53033k87973j89738j27878q4405n0676l4671
$$ 5598585 3691077 2426490 1683654 1230621 942648 752910 625032 540627 489951 455280
8848D55280l5565l7488m0412l9562l2088k4813k0322k0809j8973j7880j7878j4232
$$ 455280 419715 382227 341815 302253 270165 245352 225030 204221 185248 167368 149490 135258
8836A35258j1062r368p480l548n697p644o680n957m679l433j16j791l467l752
$$ 135258 124196 114828 107348 103800 98103 90459 83779 77822 73143 69710 69594 67803 64336 60584
8822F0584n7j002k155O06k68j047m29l242J97k561p0m89j702j302N20P1k920k412
$$ 60584 60527 59525 57370 57976 57708 56661 56232 52990 53187 50626 50556 50067 48365 47063 47583 47654 44734 42322
8804D2322q07R16l87l97J431J327j42J772j269r60l461J74K258J00m557k95P71
$$ 42322 41515 42431 42044 41647 43078 44405 44263 46035 44766 43806 40345 40519 42777 42877 38320 38025 38796
8787C8796J02j45Q55O28j16pP60M954P539P397P490O195L684p4m248r877r842
$$ 38796 38898 38753 39608 40236 40120 40113 40873 45827 53366 60763 68253 74448 78132 78058 73810 63933 54091
8770E4091m189j773l13J714K211n82J395L89j682k437j060j759j079K513L833
$$ 54091 49902 48129 47816 49530 51741 51159 52554 52943 51261 48824 47764 46005 44926 47439 51272
8755E1272K293M437P098N370o55j319l498q095p266n068o49M47j451L630N548
$$ 51272 53565 58002 65100 70470 69815 68496 64998 56903 49637 44569 43920 44367 42916 46546 52094
8740E2094N155L464J11M255P580J1091J6260J8140K3980L0979L4049L5543J5930
$$ 52094 57249 60713 60824 65079 72659 83750 100010 118150 142130 173109 207158 242701 258631
8727B58631j9481m3997m7730l3634k0444j4369j1254p995m545k272k620k201n55
$$ 258631 239150 195153 147423 113789 93345 78976 67722 59727 55182 52910 50290 48089 47534
8714D7534J055K009N453M366K597N053N799J0063Q228N796K766m91j556N68L703
$$ 47534 48589 50598 56051 60417 63014 68067 73866 83929 92157 97953 100719 100228 98672 99240 102943
8699A02943k205R15O22j283p4k278n295m868o826m208k903n363q102m221m200
$$ 102943 100738 101653 102275 100992 100918 98640 93345 88477 81651 77443 74540 69177 61075 56854 52654
8684E2654m959k439k885l873L21j654k990N1j145J533L86j828k851r78o61J802
$$ 52654 47695 45256 42371 38498 38819 37165 34175 34226 33081 34614 35000 33172 30321 29343 28682 30484
8668C0484J129j09J26L690J790j155j348L23N481K099J552L333L305L806Q64m793
$$ 30484 31613 31504 31630 35320 37110 35955 34607 34930 40411 42510 44062 47395 50700 54506 55370 50577
8652E0577p255l736k596r66n04J135j49J259J028q58j535j049L068J254J932L688
$$ 50577 43322 39586 36990 36024 35520 36655 36506 37765 38793 37935 36400 35351 38419 39673 41605 45293
8636D5293K063k039r16N203M47j870r42j95N62r84j478K356L983M652M789O427
$$ 45293 47356 45317 44401 49604 50051 48181 47239 47044 47606 46622 45144 47500 51483 56135 60924 67351
8620F7351N877J0075J4661J4223J3189J0004P040K017Q48l140r535j0574q053
$$ 67351 73228 83303 97964 112187 125376 135380 142420 144437 145285 142145 132610 122036 113983
8607A13983m276k935k945k705l543J786L839L074J015k832O23K279J304N605R235
$$ 113983 109707 106772 103827 101122 97579 99365 103204 106278 107293 104461 105084 107363 108667 114272 123507
8592A23507N187M701L302n50l175p055o322l042k59L106L888L979P598J1782J7484
$$ 123507 128694 133395 136697 136147 132972 125917 119595 116553 116294 119400 123288 127267 134865 146647 164131
8577A64131K7796L8287N7587P7661R0114R3955P9449M4602K968m2497p5280q5285
$$ 164131 191927 230214 287801 365462 455576 549531 628980 673582 676550 634053 558773 473488
8565D73488q1899o0855k7817K762K4772K2507j0370n2627o5576n3921l4736k3514
$$ 473488 391589 330734 302917 305679 330451 352958 342588 289961 224385 170464 135728 112214
8553A12214j5868j3116r733m198j554l525k932m381o38j233j592j527O4j892K999
$$ 112214 96346 83230 73497 69299 67745 64220 61288 56907 56269 55036 53444 51917 51981 50089 53088
8538E3088M854R09J071K759N024L723N002M212O618J1624J8228J9271K1016K1974
$$ 53088 57942 58851 59922 62681 67705 71428 76430 80642 87260 98884 117112 136383 157399 179373
8524A79373J9024N520n089n322l478n981j3205j9765k2911k2041j6393j2293j1288
$$ 179373 198397 203917 198828 193506 190028 184047 170842 151077 128166 106125 89732 77439 66151
8511F6151n477n237l863q16P04l23K801J73k014j960k253l097j670m682k819K60
$$ 66151 60674 55437 51574 50758 51462 51139 53940 54113 52099 50139 47886 44789 43119 38437 35618 35878
8495C5878P70k810k803J967K430K526J853k434M33K40L796K302p35K781M745N583
$$ 35878 36648 33838 31035 33002 35432 37958 39811 37377 37810 38050 41846 44148 43413 46194 50939 56522
8479E6522K118m195m639j700m820J377P364R434J1272J1484J1735J0385Q50q233
$$ 56522 58640 54445 49806 48106 43286 44663 52027 61461 72733 84217 95952 106337 107187 98954
8465I8954j0150q838n508k267k193k703r23j387q26j396j938p95L091P34Q30k480
$$ 98954 88804 79966 74458 72191 69998 67295 66372 64985 64159 62763 60825 60030 63121 63855 64685 62205
8449F2205k213m449j173l965p39O20j30Q15K422L23m344o886m833k127K287L728
$$ 62205 59992 55543 54370 50405 49666 50286 50156 50971 53393 53716 49372 42486 37653 35526 37813 41541
8433D1541O459M797N041Q922Q639N774k333r509j0277p624l861o49J372M808K994
$$ 41541 48000 52797 57838 66760 75399 81173 78840 69331 59054 51430 47569 46920 48292 53100 56094
8418E6094N206M786M939Q1l507l448n706r223l440k511L05j135n47O6l364l859
$$ 56094 61300 66086 71025 71106 67599 64151 58445 49222 45782 43271 43576 42441 41894 41960 38596 34737
8402C4737j956J396J235j734k339J035Q53J369j397k387k10N55P43L206L062J601
$$ 34737 32781 34177 35412 33678 31339 32374 33227 34596 33199 30812 30602 31157 31900 35106 38168 39769
8386C9769L487K109J84k403m184N85j924p92J112k067k92P21l291j380l767j667
$$ 39769 43256 45365 45549 43146 38962 39547 37623 36831 37943 35876 35584 36305 33014 31634 27867 26200
8370B6200p54j994Q02q13o31R89p33J361L832L297J987r14k428Q97j517k055J080
$$ 26200 25446 23452 24254 23441 22810 23799 23066 24427 28259 31556 33543 32629 30201 31098 29581 27526 28606
8353B8606k066l620m87J202q91K43M31R56J190L52Q33O60j131j607k872M20k090
$$ 28606 26540 22920 22433 23635 22744 22987 23418 24374 25564 25916 26749 27409 26278 24671 21799 22219 20129
8336B0129m48p69j609R9K039j520m20o46K39J522K053J929J141o22J38r22k02
$$ 20129 19681 18912 17303 17402 19441 17921 17501 16855 17094 18616 20669 22598 23739 23117 23255 22333 22131
8319B2131j609p39j160J81j852q00J84L378J873k690M2J464K95J779j20L49j521
$$ 22131 20522 19783 18623 18804 16952 16152 16336 19714 21587 18897 18939 20403 20698 22477 22357 22706 21185
8302B1185j714J262q63m46k93j491K476K226r08L99j086j701K133J052Q3l95q2
$$ 21185 19471 20733 19870 19424 19131 17640 20116 22342 21434 21833 20747 19046 21179 22231 22314 21919 21837
8285B1837R49O81k999k035j609J332j192r62P90j07o90J569R35l83j051K199K039
$$ 21837 22786 23467 20468 18433 16824 18156 16964 16002 16792 16685 15995 17564 18499 18116 17065 19264 21303
8268B1303L29k701l096K835K447O17L05j62L140M574J49J012N08J269K965J856
$$ 21303 21632 18931 15835 18670 21117 21734 22039 21877 25017 29591 29740 30752 31260 32529 35494 37350
8252C7350j492m224n599l032N09j598J834K02j171K388m60J638L829L503K20l439
$$ 37350 35858 31634 26035 23003 23512 21914 23748 23950 22779 25167 24707 26345 30174 33677 33897 30458
8236C0458k723j068j337J084O96p23K812L702K884K433K394j123j712k931k783
$$ 30458 27735 26667 25330 26414 27110 26387 29199 32901 35785 38218 40612 39489 37777 34846 32063
8221C2063n12n21k319j450J67L59J391K475Q33j468O8k50j242J053p34l540k406
$$ 32063 31551 31030 28711 27261 27428 27787 29178 31653 32486 31018 31086 30836 29594 30647 29913 26373 23967
8204B3967j883j550O94K069M562L795K507l00j574k394j744M69o16q09R59k29
$$ 23967 22084 20534 21228 23297 27859 31654 34161 33861 32287 29893 28149 28618 28002 27193 28152 27923
8188B7923j142j51M174N101L708L212K600R49N1m334m190m016l246k282j697l71
$$ 27923 26781 26630 30804 35905 39613 42825 45425 46374 46425 42091 37901 33885 30639 28357 26660 26289
8172B6289j010J106M68j491J652k750k043j907p72m72l76o84j639N67K07j023
$$ 26289 25279 26385 26853 25362 27014 24264 22221 20314 19542 19070 18694 18010 16371 16938 17145 16122
8156A6122J976L646Q96k61K086K514j264j896l055l554k896m779m92M788L696
$$ 16122 18098 21744 22640 22379 24465 26979 25715 23819 20764 17210 14314 9535 9043 13831 17527
8141A7527L394K60q64K21J836K78K511J286J92k565j908k055Q9k977l95K444J540
$$ 17527 20921 21181 20317 20538 22374 22652 25163 26449 26641 24076 22168 20113 20202 17225 16830 19274 20814
8124B0814M18J087P76n195j983q86P03K964j561q62Q87K584l7p46L03Q4N69J743
$$ 20814 21232 22319 23095 17900 15917 15031 15734 18698 17137 16275 17162 19746 19709 18963 19266 19350 19919 21662
8106B1662L83L424K877o030j564L023L410K414M395L786O32M596l287m165p4q135
$$ 21662 22045 25469 28346 22316 20752 23775 27185 29599 33994 37780 38412 43008 39721 35556 35482 27347
8090B7347l051k103n49n16M53J784j101p72n581k139l33J071J603o65Q3R56L282
$$ 27347 24296 22193 21644 21128 21581 23365 22264 21492 15911 13772 13439 14510 16113 15448 15531 16487 19769
8073A9769J097j317l672k018M20K851J294K039L346J996J552J896K61n82J77n85
$$ 19769 20866 19549 15877 13859 14279 17130 18424 20463 23809 25805 27357 29253 29514 28932 29109 28524
8057B8524j796J994N175N223J823j504j470o99K260K191l480m059k381l972k498
$$ 28524 26728 28722 33897 39120 40943 39439 37969 37270 39530 41721 38241 34182 31801 27829 25331
8042B5331k10J605J542l85p26j348J197L372K215L03J952K024K08L375q08k564
$$ 25331 25121 26726 28268 27883 27157 25809 27006 30378 32593 32896 34848 36872 37080 40455 39647 37083
8026C7083q70J574L097K574L981J571L829R823J0524J3339J3980J4753J4796L300
$$ 37083 36213 37787 40884 43458 47439 49010 52839 62662 73186 86525 100505 115258 130054 133354
8012A33354j7002k5795k0414j1964n216K047J992L006M947L084K426l270n594
$$ 133354 116352 90557 70143 58179 52963 55010 57002 60008 64955 68039 70465 67195 61601
7999F1601n711k330n076k423k77n74L72m28L16r02J12O10N2k038j572k250N0P09
$$ 61601 55890 53560 48484 46061 45784 45210 45582 45154 45470 44568 44680 45290 45342 43304 41732 39482 39532 40241
7981D0241j284j436o6L678N666Q444J0427J2475J3614J1490J4447J0376j1178
$$ 40241 38957 37521 37455 41133 46799 55243 65670 78145 91759 103249 117696 128072 116894
7968A16894k3544k3158j2176n384k452K393L624L461K559l02l282p216n441p11
$$ 116894 93350 70192 58016 52632 50180 52573 56197 59658 62217 61915 58633 51417 45976 45265
7954D5265k758K343K229J824N128L185k737p520m779k601j255j595l152n178l898
$$ 45265 42507 44850 47079 48903 54031 57216 54479 46959 42180 39579 38324 36729 33577 28399 24501
7939B4501J001k757k155J799R63l06k081j571o8k37R3J408j658l216K10N63J252
$$ 24501 25502 22745 20590 22389 23352 23046 20965 19394 19326 19089 19182 20590 18932 15716 15926 16489 17741
7922A7741N21P7L642M77j314m96P11k973o39mJ87j219k50K07j853J759j57P38
$$ 17741 18262 18339 21981 22458 21144 20648 21359 18386 17747 17743 17930 16711 16461 16668 14815 16574 16417 17155
7904A7155r78q12N3Q91n41J808J519j266j862k194N19K29j968J468Q73l79r01
$$ 17155 16177 15365 15418 16309 15768 17576 19095 17829 15967 13773 14292 14521 12553 14021 14894 14515 13614
7887A3614o04J992p25j033m52J630j243k810j419P35n95K356o76j424j953K678
$$ 13614 13010 15002 14277 13244 12792 14422 13179 10369 8950 9685 9090 11446 10770 9346 7393 10071
7871A0071N70n95r6j636l74j254o32K523J824n88j93n49k079J46K430J538j047
$$ 10071 10641 10046 9950 8314 7940 6686 6054 8577 10401 9813 9620 9071 6992 7138 9568 11106 10059
7854A0059k134j797J844K948O00J017J063j35j416N99o5J8R43j782l780j906Q26
$$ 10059 7925 6128 7972 10920 11520 12537 13600 13465 12049 12648 12583 12601 13544 11762 7982 6076 6902
7837F902J413K242M3j710k259J220Q40K195J073j53j333q74J234J28j416J852
$$ 6902 8315 10557 10600 8890 6631 7851 8691 10886 11959 11806 10473 9599 10833 10961 9545 11397
7821A1397L592J60k036J804rN84K260K574n56j384q34N730L117K477N729J1248
$$ 11397 14989 15149 13113 14917 14908 15492 17752 20326 19770 18386 17552 23282 26399 28876 34605 45853
7805D5853J5023J8187K2951K1555J5842j702j6516k2740k4038j9368j2002p857
$$ 45853 60876 79063 102014 123569 139411 137709 121193 98453 74415 55047 43045 35188
7793C5188o192m083k102R34J327L46o21l2J94P2l52L193O978R738P650J0425Q643
$$ 35188 28996 24913 22811 23745 25072 25418 24797 24765 24959 25031 24679 27872 34850 44588 52238 62663 71306
7776G1306L405o740q005r269q267o331q994o243j23p62k038q99m95k015l223m096
$$ 71306 74711 67971 59966 50697 42430 36099 27105 20862 20739 19977 17939 17040 16545 14530 11307 7211
7760G211k297K577P28O58r91j270l03J557r86J39J38J197L553J09j690k163j858
$$ 7211 4914 7491 8219 8877 7886 6616 6313 7870 6884 7023 7161 8358 11911 12020 10330 8167 6309
7743F309K52m12l22J555L25J361k63L3k993k173K388K469l87pj440j75L41l50
$$ 6309 6561 6149 5827 7382 7707 9068 8805 8838 5845 3672 6060 8529 8142 8135 6695 6520 6861 6511
7725F511O13k45j765Q24R52j278o75j752l92J472O34J238j20j70K68j90q27j136
$$ 6511 7124 6879 5114 5938 6890 5612 4937 3185 2793 4265 4899 6137 6017 5847 6115 5925 5098 3962
7707C962j446K79p59M35j246k62r98M80N411J010M33k266m36km98J362j048L82
$$ 3962 2516 2795 2036 2471 1225 963 -35 445 5856 6866 7299 5033 4597 4595 4097 5459 4411 4793
7689D793N76n36p54j253n32l32P17n66q2M21l72J58L09L22J351J451r77m93j901
$$ 4793 5369 4833 4079 2826 2294 1962 2679 2113 2031 2452 2080 2238 2547 2869 4220 5671 4694 4201 2300
7670B300j36o3l18J553L7k260K94J825J601k18l67n37j15l17O70k241r90K935
$$ 2300 2164 2101 1783 3336 3373 1113 1407 3232 4833 4615 4248 3711 3596 3279 3949 1708 718 3653
7652C653J544k27J701J01l62k362j630J395L408J15Q62j142m23r94j082m67p49
$$ 3653 5197 4970 6671 6772 6410 4048 2418 3813 7221 7336 8198 7056 6633 5639 4557 4090 3341
7635C341j56Lm06N26j218q08p3K303j624j561k09J471J582q0j150l26K102K44
$$ 3341 3185 3188 2782 3308 2090 1282 1209 3512 1888 327 118 1589 3171 3091 1941 1615 3717 3961
7617C961J461L258k04j990r00j93j056k23J239j559j615N13J943J598p95q49m32
$$ 3961 5422 8680 8476 6486 5586 5393 4337 4114 5353 3794 2179 2692 4635 6233 5438 4589 4157
7600D157J388P46p54R85j432k745j093J105N39j011j250L50J171J20K733M43J451
$$ 4157 5545 6291 5537 6522 5090 2345 1252 2357 2896 1885 635 985 2156 2276 5009 5452 6903
7583F903n35j484k317J188K692J859j803j126J049l78j585k42l81M42o7n01j305
$$ 6903 6368 4884 2567 3755 6447 8306 6503 5377 6426 6048 4463 4221 3840 4282 4215 3714 2409
7566B409K956n85j648L19l16r02Q36R68j598O26J350J180P03J819k304j000R54
$$ 2409 5365 4780 3132 3451 3135 2233 3069 4037 2439 3065 4415 5595 6298 8117 5813 4813 5767
7549E767o32m244p27P2J546J612R04J095n74j341J281K951J081j145r85n32j3
$$ 5767 5135 891 164 236 1782 3394 4298 5393 4819 3478 4759 7710 8791 7646 6661 6129 6116
7532F116j460J089K5j609k315N64P83j69o86k154J469J186N0R74Q00j943m254
$$ 6116 4656 5745 5770 4161 1846 2410 3193 3024 2338 184 1653 2839 2889 3863 4663 2720 -1534
7515a534K643L174J332k923N15K683j955l800k201R52r76R88L557O35k215j473
$$ -1534 1109 4283 5615 2692 3207 5890 3935 135 -2066 -1114 -2090 -1102 2455 3090 875 -598
7499e98J316J850J906j653l826j203L117J662o91J295K017k192N05Q41j566r62
$$ -598 718 2568 4474 2821 -1005 -2208 909 2571 1880 3175 5192 3000 3505 4346 2780 1818
7483A818J99K352K5k025j393M08J756L58k77j847N01L73n68J058P18q2j311j906
$$ 1818 2017 4369 4394 2369 976 1384 3140 3498 3221 1374 1875 2248 1680 2738 3456 3374 2063 157
7465A57o15J991M79q97J25K164J38O47k179j610J93J137O77o71J287q87j760J390
$$ 157 -458 1533 2012 1115 1240 3404 3542 4189 2010 400 593 1730 2407 1736 3023 2136 376 1766
7447A766M18j912M49K062j342M24j465j475J17J076J093P23O74Q6q47n83J0L52
$$ 1766 2184 272 721 2783 1441 1865 400 -1075 -958 118 1211 1934 2608 2694 1847 1264 1274 1626
7429A626k80j641K719K729J089K628j010J115j540k939q01j867j02L087P28m85
$$ 1626 1346 -295 2424 5153 6242 8870 7860 8975 7435 4496 3695 1828 1726 4813 5541 5056
7413E056o66J76o90J97k124Q56q30n85Q37L850P25p9j030l436k280j50Q08J086
$$ 5056 4390 4566 3876 4073 1949 2805 1975 1390 2227 6077 6802 6723 5693 2257 -23 -173 635 1721
7395A721J697k89J532j355j671l08Q04N42j114j542j216R13M83J829j685j658
$$ 1721 3418 3129 4661 3306 1635 1327 2131 2673 1559 17 -1199 -286 197 2026 341 -1317
7379a317M61k69J848K200j311J974o5j065J050J686j17j780r7L8p11J428J098
$$ -1317 -856 -1125 723 2923 1612 3586 3521 2456 3506 5192 5075 3295 3198 3236 2525 3953 5051
7362E051j929k549j310J345J877N89L90j040j777j78k165j026J050J755J32K40
$$ 5051 3122 573 -737 608 2485 3074 3464 2424 647 469 -1696 -2722 -1672 83 215 455
7346D55J696k767l28L583r74m73J660j392k364K136K095k6j500m62J207O66j857
$$ 455 2151 -616 -944 2639 1665 1192 2852 1460 -904 1232 3327 3301 1801 1339 2546 3212 1355
7329A355j658j578k24J775J01p81J001P24p75J084P91k50r42K111N11j147L19
$$ 1355 -303 -1881 -2105 -330 -229 -1010 -9 715 -60 1024 1815 1565 623 2734 3245 2098 2417
7312B417K0j031K232K374j51M54r28l56J57P02J141k933k411kM30j352J927K52
$$ 2417 2437 1406 3638 6012 5861 6315 5387 5031 5188 5890 7031 4098 1687 1685 2115 763 2690 2942
7294B942J30r45j533k124J710K319r41l12J182N34j10L64j843j879j428N10K128
$$ 2942 3072 2127 594 -1530 180 2499 1558 1246 2428 2962 2852 3216 1373 -506 -1934 -1424 704
7277G04L264m36m041R33K178j337r53K244q3k91J324j677j788k426P53L68m65
$$ 704 3968 3532 -509 424 2602 1265 312 2556 2473 2182 3506 1829 41 -2385 -1632 -1264 -1729
7260a729O09p96j340p14n08R30J558K880O52j028O30j580K26k88J2J069j23r05
$$ -1729 -1120 -1916 -3256 -3970 -4478 -3548 -1990 890 1542 514 1144 -436 -210 -498 -486 583 460 -445
7242d45J990j931L56l03j984K381K414M3l270k246N14N76J911k630j596M958J225
$$ -445 1545 -386 -30 -333 -2317 64 2478 2521 -749 -2995 -2481 -1905 6 -2624 -4220 738 1963
7225A963J47J079O34J003K315P48p92j778j882m69J645K464l324q84n86P56r91
$$ 1963 2110 3189 3823 4826 7141 7889 7097 5319 3437 2968 4613 7077 3753 2869 2283 3039 2048
7208B048n56j61R71k66k766q20o70P35p67j040J611O80Q43L661n37k389J072R29
$$ 2048 1492 1331 2302 2036 -730 -1550 -2220 -1485 -2252 -3292 -1681 -1001 -158 3503 2966 577 1649 2578
7190B578K091M02J093M83k708k195k114J387J491k42q32J90K27K370k14j216j341
$$ 2578 4669 5071 6164 6647 3939 1744 -370 1017 2508 2266 1434 1624 1851 4221 4007 2791 1450
7173A450j919K93J694m62k023j096P74Q83p21j073j094l47J966J745J031K366
$$ 1450 -469 -176 1518 1056 -967 -2063 -1289 -406 -1127 -2200 -3294 -3641 -1675 70 1101 3467
7157C467m68p61J401M91M94j924K88j034q52K593J10j605p75L33K635j068l46
$$ 3467 2999 2238 3639 4130 4624 2700 2988 1954 1102 3695 3805 2200 1425 1758 4393 3325 2979
7140B979m89J12j000J61J67J642m80l92J189J021N8l712J31j112J32M42J503K618
$$ 2979 2490 2602 1602 1763 1930 3572 3092 2700 3889 4910 4968 1256 1387 275 407 849 2352 4970
7122D970j367J434k469j603J832O7j809q78n58K636K9j697m62k757P03m10L853
$$ 4970 3603 5037 2568 965 2797 2864 1055 177 -381 2255 2284 587 125 -2632 -1929 -2339 1514
7105A514J542k072M9K819J02J41k133j34J052J059p36j999q34J157j237p59k65
$$ 1514 3056 984 1033 3852 3954 4095 1962 1828 2880 3939 3203 1204 370 1527 290 -469 -734
7088g34R73l36o58P49N56K17J27r43J299K095J761j9o32l320k547k90K142J770
$$ -734 239 -97 -755 -6 550 767 894 -49 1250 3345 5106 5087 4455 1135 -1412 -1702 440 2210
7070B210q4j982j725n56K719L163J211j855j064j250K769L30l242j18J700J98
$$ 2210 2126 144 -1581 -2137 582 3745 4956 3101 2037 787 3556 3886 644 526 2226 2424
7054B424k610l32R28J839Q12j222j341j97K299o52J307j190n03q12j961j61M6
$$ 2424 -186 -518 410 2249 3061 1839 498 301 2600 1948 3255 2065 1562 750 -1211 -1372 -1326
7037a326J303L481P39l838l818J170R87K041L57q4J953o2j093j99J91P77J843
$$ -1326 -23 3458 4197 359 -3459 -2289 -1302 739 1096 1012 2965 2903 1810 1611 1802 2579 4422
7020D422J633k592l567R46Q64k94J925L93j054j943k096n74l99j237J683M302
$$ 4422 6055 3463 -104 842 1706 1412 3337 3730 2676 733 -1363 -1937 -2336 -3573 -1890 2412
7004B412J251j45R88j620Q6R98O06q83k065k154n1P23L1M8k583J062K358K64k774
$$ 2412 3663 3518 4506 2886 2972 3970 4576 3693 1628 -526 -577 146 177 225 -2358 -1296 1062 1326 -1448
6985a448n05K714L481l47j184j10Q67J841l93j494k246l535J614J190j629J166
$$ -1448 -1953 761 4242 3895 2711 2601 3468 5309 4916 3422 1176 -2359 -745 445 -1184 -18
6969a8J868k117k080J829J271J185P52j021k307J829J292j67k063k927L96K252
$$ -18 1850 -267 -2347 -518 753 1938 2690 1669 -638 1191 2483 2316 253 -2674 -2278 -26
6953b6J901j060j135J649j94l201J020J303o03k12M3Q90O94J601o68M35j413K03
$$ -26 1875 815 -320 1329 1135 -2066 -1046 257 -346 -558 -515 375 1069 2670 2002 2437 1024 1227
6935A227Q19j088k512L58K199J320j479k529l1J220L372k875j885J37K39kp97
$$ 1227 2046 958 -1554 -1196 1003 2323 844 -1685 -1716 -496 2876 1 -1884 -1747 -1508 -1510 -2307
6918b307J434J652K96j782k160Q30R27O97k44l60M68L50m60J362r09q51n40J846
$$ -2307 -873 779 1075 -707 -2867 -2037 -1110 -413 -657 -1017 -549 -199 -659 703 -206 -1057 -1597 249
6900B49J612K32j793q85j519j303OJ355P91o58J703J990K320K725j132k398j220
$$ 249 1861 2093 300 -585 -2104 -3407 -3401 -2046 -1255 -1913 -210 1780 4100 6825 5693 3295 2075
6883B075k675r2P5r83J117Q41J65j026k604j282m64p94J358j643J574L08M94J346
$$ 2075 -600 -692 -617 -1600 -483 358 523 -503 -3107 -4389 -4853 -5647 -4289 -5932 -4358 -4050 -3556 -2210
6865b210J551j70j071q62J433R08J660L95n47L1j104p90J473K365K567Q00l943
$$ -2210 -659 -829 -1900 -2762 -1329 -421 1239 1634 1087 1118 14 -776 697 3062 5629 6429 2486
6848B486k227J881k51k319N7K516J949J71j515j365P04k778J81m06K96J45K307
$$ 2486 259 2140 1889 -430 -373 2143 4092 4263 2748 1383 2087 -691 -510 -916 -620 -475 1832
6831A832J51j237k17J87K057L74k555K86Q66k30N8J486K430m50j6o76q65J877
$$ 1832 1983 746 529 716 2773 3147 592 878 1744 1514 1572 3058 5488 5038 5022 4346 3481 5358
6813E358K96R95K477J92n83o34k634j212j653l9o1O08j889j369m3J272J882O75
$$ 5358 5654 6649 9126 9318 8735 8101 5467 4255 2602 2563 2502 3110 1221 -148 -191 1081 2963 3638
6795C638J306J450N43l89J675P76K71M26r80j603m281m137l111l4R07J417J591
$$ 3638 4944 6394 6937 6548 8223 8999 9270 9696 8716 7113 2832 -1305 -4416 -4450 -3543 -2126 -535
6778e35J114K085k57M52j240j784J793L465r64o47Q98K523j000k453j814m38K86
$$ -535 579 2664 2407 2859 1619 -165 1628 5093 4129 3482 4380 6903 5903 3450 1636 1198 1484
6761A484k305j608j22j177m2K538L5J03P60J696N29Q5K56J969k50p2j128j980
$$ 1484 -821 -2429 -2551 -3728 -3770 -1232 -1197 -1094 -334 1362 1891 1976 2232 4201 3951 3879 2751 771
6743G71o38M73K345j196L76L76k170J689K943K373J222n25k39l33j151o22M71
$$ 771 133 606 2951 1755 2131 2507 337 2026 4969 7342 8564 8039 7800 7467 6316 5694 6165
6726F165J335J688j665l086k004m39L99m975k019L23L648K053j268K59K98k99
$$ 6165 7500 9188 7523 4437 2433 1994 2393 -2582 -4601 -4278 -630 1423 155 414 712 413
6710D13l36M5J013j550k233J292J779Q13J783l45k301n66J805N46Q1j285l22l2
$$ 413 77 122 1135 -415 -2648 -1356 423 1236 3019 2674 373 -193 1612 2158 2239 954 632 600
6692F00J05o75J48N3Q94k476k89l62K350J278k412q23O67L116P44j063P80J171
$$ 600 705 30 178 231 1125 -1351 -1640 -2002 348 1626 -786 -1609 -942 2174 2918 1855 2635 3806
6674C806r47k259J836k92l19j75J010J965m92J01J28K977K65k570l738r32j564
$$ 3806 2859 600 2436 2144 1825 1650 2660 4625 4133 4234 4362 7339 7604 5034 1296 364 -1200
6657a200r94R72K740K486q73l550j927j296j120j132O54J95J175N97J104L80M17
$$ -1200 -2194 -1222 1518 4004 3131 -419 -2346 -3642 -4762 -5894 -5240 -5045 -3870 -3273 -2169 -1789 -1372
6640a372K196J879j553P47Q75J164o7r42j647l190k963K318J359j929J215R75
$$ -1372 824 2703 1150 1897 2772 3936 3869 2927 1280 -1910 -4873 -2555 -1196 -3125 -1910 -935
6624i35J71m78K557J344n25j143Q07m53R20q09k489q5J148o03J928P02m73j625
$$ -935 -764 -1242 1315 2659 2134 991 1798 1345 2265 1456 -1033 -1118 30 -573 1355 2057 1584 -41
6606d1k068J095J324J258J356k828J31N21o21j531P52L07Q0N66M41o61j440p80
$$ -41 -2109 -1014 310 1568 2924 96 227 748 127 -1404 -652 -345 -265 301 742 81 -1359 -2139
6588b139K154J936K937k227k557N49M84J699j485j587j045R0j278j088K28j438
$$ -2139 15 1951 4888 2661 104 653 1137 2836 1351 -236 -1281 -1191 -2469 -3557 -3329 -4767
6572d767j810M901L277l485n55J348j028J764o11R69k36j421o92N52J71j587J051
$$ -4767 -6577 -1676 1601 -1884 -2439 -1091 -2119 -355 -966 3 -233 -1654 -2346 -1794 -1623 -3210 -2159
6555b159L735J188n309m827J080K350m09l89K77J073J301k34l54j176n68K500
$$ -2159 1576 2764 -2545 -7372 -6292 -3942 -4351 -4740 -4463 -3390 -2089 -2323 -2677 -3853 -4421 -1921
6539a921K908j196o7j318r52j490J795q3K823K823J153j095j21Q5k064j898q85
$$ -1921 987 -209 -276 -1594 -2546 -4036 -2241 -2324 499 3322 4475 3380 3259 3344 1280 -618 -1503
6522a503R63J8J115P70q73j062j488j282j657L652L705k14o26k561j960k85l1
$$ -1503 -540 -522 593 1363 490 -572 -2060 -3342 -4999 -1347 2358 2144 1518 -1043 -3003 -3288 -3319
6505c319o3K593L246j221k313J31J64J898j302j99Q48oq15R61j863m79p49k440
$$ -3319 -3382 -789 2457 1236 -1077 -946 -782 1116 -186 -385 463 457 -358 603 -1260 -1739 -2488 -4928
6487d928n22L399K899K103j848j564m5J334o16k240M35R37j848j000K359l68O03
$$ -4928 -5450 -2051 848 2951 1103 -461 -506 828 212 -2028 -1593 -656 -2504 -3504 -1145 -1513 -910
6470i10J204J02l37j69J439L52J86k023j37j10k087k424n59R8J969J183K07q35
$$ -910 294 396 59 -110 1329 1681 1867 -156 -293 -403 -2490 -4914 -5473 -5375 -3406 -2223 -2016 -2851
6452b851J24K769P98j360m089j291K465J302J131o39j871J56J613J67j832n42
$$ -2851 -2727 42 840 -520 -4609 -5900 -3435 -2133 -1002 -1641 -3512 -3356 -1743 -1576 -3408 -3950
6436c950p89J077J939J236j893J607r67q78M66j603J859J60k764m77k000K375
$$ -3950 -4739 -3662 -1723 -487 -2380 -773 -1740 -2618 -2152 -3755 -1896 -1736 -4500 -4977 -6977 -4602
6420d602K760R47n58j829k399J325p14J012J827k86k367m68M87J553J985J359
$$ -4602 -1842 -895 -1453 -3282 -5681 -4356 -5070 -4058 -2231 -2517 -4884 -5352 -4865 -3312 -1327 32
6404C2j39o50o12k751O41k3j577k45R98L477K931q62j148K36q85o49R31L023J424
$$ 32 -107 -757 -1369 -4120 -3479 -3502 -5079 -5324 -4326 -849 2082 1220 72 308 -577 -1226 -295 2728 4152
6385D152J144q29j030L19L155j67k218N21j217l001j328J858M69k3j205k280j35
$$ 4152 5296 4467 3437 3756 6911 6744 4526 5047 3830 829 -499 1359 1828 1805 600 -1680 -1815
6368a815j222J15m61j740K628J103k70k712j436K061R01J529J841j32j087j448
$$ -1815 -3037 -2922 -3383 -5123 -2495 -1392 -1662 -4374 -5810 -3749 -2848 -1319 522 390 -697 -2145
6352b145k818J931J427J364K367M06J66k162k088L71P32m73P67q9L26J839O75
$$ -2145 -4963 -3032 -1605 -241 2126 2532 2698 536 -1552 -1181 -449 -922 -155 -244 82 1921 2596
6335B596j694r22P29q13j707j773J309K325jJ698j21J152o28p09N31j281k154
$$ 2596 902 -20 709 -104 -1811 -3584 -2275 50 49 1747 1626 2778 2150 1441 1972 691 -1463
6318a463j580J171J733L91p36O79J261j75m78o35J403O20j659j045J059Q74l005
$$ -1463 -3043 -1872 -139 252 -484 195 1456 1281 803 168 1571 2191 532 -513 546 1420 -1585
6301a585k327L17j86Q62r86P06K081l54j13q29l84m97J308Q75J682M355p45O17
$$ -1585 -3912 -3595 -3781 -2919 -3905 -3199 -1118 -1472 -1585 -2414 -2798 -3295 -1987 -1112 570 4925 4180 4797
6283D797K95j683l136r99K23J038R59j076j762j11J11m70o33M02K457J489j034
$$ 4797 5092 3409 273 -726 -503 535 1494 418 -1344 -1455 -1344 -1814 -2447 -2045 412 1901 867
6266H67l67N08J147L1j8l400r22K434K736j733n65j774k545K621l80j91Q14R96
$$ 867 500 1008 2155 2186 2168 -1232 -2154 280 3016 1283 718 -1056 -3601 -980 -1360 -1551 -737 259
6248B59k98R50l26p94O91k57j050p56J99J369m55n74l13k242l74K639N05o60j212
$$ 259 -39 911 585 -209 482 225 -825 -1581 -1382 -13 -468 -1042 -1355 -3597 -3971 -1332 -827 -1487 -2699
6229b699k72M45K71p26O27L343Q16l75o22J268J296j74k891q10L34J34J767j03
$$ -2699 -2971 -2526 -2255 -2981 -2354 989 1805 1430 808 2076 3372 3198 307 -503 -169 -35 1732 1629
6211A629o69m220l380K240K587J53m13l18L56K249l19j285K308K530J13k074R69
$$ 1629 960 -3260 -6640 -4400 -1813 -1660 -2073 -2391 -2035 214 -105 -1390 918 3448 3561 1487 2456
6194B456k660n07J528L59l795j611k05J126J61J126K849J717k210j606J171K871
$$ 2456 -204 -711 817 1176 -2619 -4230 -4435 -3309 -3148 -2022 827 2544 334 -1272 -101 2770
6178B770j31j323j605k34J725j798p79j2j0M15J113K33q69l7K127j178k469k149
$$ 2770 2639 1316 -289 -523 1202 -596 -1375 -1387 -1397 -982 131 364 -505 -542 1585 407 -2062 -4211
6160d211K40K265O29j030J589J801q30m91j284l234K567J999r3n05J649M23j225
$$ -4211 -3971 -1706 -1077 -2107 -518 1283 453 -38 -1322 -4556 -1989 10 -83 -588 1061 1484 259
6143B59J417J502J327l79J51L00j411J200p42k222m32k644K506r67l608l21J830
$$ 259 1676 3178 4505 4126 4277 4577 3166 4366 3624 1402 970 -1674 832 -135 -3743 -4064 -2234
6126b234O72r02L24j275n36K195k53j985J92J936m4M08o09J526J015j096q5R25
$$ -2234 -1562 -2464 -2140 -3415 -3951 -1756 -2009 -3994 -3802 -1866 -1910 -1502 -2111 -585 430 -666 -751 174
6108A74Q48J051j805Q57P75j643k096k96n13r02j255l58K328L328L35Rj93q35
$$ 174 1022 2073 268 1125 1900 257 -1839 -2135 -2648 -3550 -4805 -5163 -2835 493 828 837 644 -191
6090a91L43J950j121q44J389j671l389n81K667K83o08k26J87J281J316p00R92
$$ -191 152 2102 981 137 1526 -145 -3534 -4115 -1448 -1165 -1773 -1999 -1812 -531 785 85 1077
6073A077k92N5j09j670o51J053j469j317L508J332j163J503k424J34l58o45L7
$$ 1077 785 840 731 -939 -1590 -537 -2006 -3323 185 1517 354 1857 -567 -433 -791 -1436 -1399
6056a399l94J965O41k17J612l71J103k094j41L24j715j050P24o1R3j709n1R02
$$ -1399 -1793 172 813 596 2208 1837 2940 846 705 1029 -686 -1736 -1012 -1073 -980 -2689 -2740 -1838
6038a838j012J186K666J00k910J434J844J063k463j98K02j697P18J430n05l983
$$ -1838 -2850 -1664 1002 1102 -1808 -374 1470 2533 70 -128 74 -1623 -905 525 20 -3963
6022c963n4O96L031L96m83j527O73K265J328l68k60J9M91k09o10k424R43o02j088
$$ -3963 -4017 -3321 -290 106 -377 -1904 -1231 1034 2362 1994 1734 1753 2244 2035 1425 -999 -56 -658 -1746
6003a746R71k679M10j06K61p18J800L20j591j509k35J295l62J604R16Q92k08n47
$$ -1746 -775 -3454 -3044 -3150 -2889 -3607 -1807 -1487 -3078 -4587 -4822 -3527 -3889 -2285 -1369 -477 -685 -1232
5985a232k806k326K993J691J627k218j270J446M14k623n66Q45J953L28l469j351
$$ -1232 -4038 -6364 -3371 -1680 -53 -2271 -3541 -2095 -1681 -4304 -4870 -4025 -2072 -1744 -5213 -6564
5969f564K105J126k078j113O54K541L228J503K551k21k273n37j885j711j350J371
$$ -6564 -4459 -3333 -5411 -6524 -5870 -3329 -101 1402 3953 3732 1459 922 -963 -2674 -4024 -2653
5953b653J229L639J772l168l073j836j72J090p32O25J015K313m61k272Q47K032
$$ -2653 -1424 2215 3987 819 -2254 -4090 -4262 -3172 -3904 -3279 -2264 49 -412 -2684 -1837 195
5937A95M86K21k70k336Q18L83j12k580l019j927Q17J494J43K600L507n95j110
$$ 195 681 902 632 -1704 -886 -503 -615 -3195 -6214 -8141 -7324 -5830 -5687 -3087 420 -175 -1285
5920a285J003R95L97k31J29k36j987m81j52L16J466P63j393j415l4k451j069n1
$$ -1285 -282 713 1110 879 1008 772 -1215 -1696 -1848 -1532 -66 697 -696 -2111 -2145 -4596 -5665 -5716
5902e716J378n1n40J218Q34k249J371P39J753L678K099R28L517J827j951m249
$$ -5716 -4338 -4389 -4929 -3711 -2877 -5126 -3755 -3016 -1263 2415 4514 5442 8959 10786 8835 4586
5886D586M30L025o25k098j600j051k955l6J821J201J160j256l940k93K754J806
$$ 4586 5016 8041 7416 5318 3718 2667 -288 -324 1497 2698 3858 2602 -1338 -1631 1123 2929
5870B929r40O94N84J803l491k307j303L559q3k777L59L26K151J176L736P81k003
$$ 2929 1989 2683 3267 5070 1579 -728 -2031 1528 1445 -1332 -973 -647 1504 2680 6416 7197 5194
5853E194j507j511O16m13o09k11L93K66K14j029k390l808M21J742K106K468k488
$$ 5194 3687 2176 2792 2379 1770 1559 1952 2218 2432 1403 -987 -4795 -4374 -2632 -526 1942 -546
5836e46j028p52q40j171j48l48j130M7n96L11K62q51J552J123n25o22J434L18
$$ -546 -1574 -2326 -3166 -4337 -4485 -4833 -5963 -5916 -6512 -6201 -5939 -6790 -5238 -4115 -4640 -5262 -3828 -3510
5818c510k08l121J884J304J165Q89o61J647K635p44O69k844n98J107J830k53j517
$$ -3510 -3718 -6839 -4955 -3651 -2486 -1597 -2258 -611 2024 1280 1949 -895 -1493 -386 1444 1191 -326
5801c26K75q56J106j406k973P88K12R88J061K423q56l768m12L078M65j423j689
$$ -326 -51 -907 199 -1207 -4180 -3392 -3180 -2192 -1131 1292 436 -3332 -3744 -666 -201 -1624 -3313
5784c313j010M72L62j076P64k47o17n95J733J873k472K18L45J157K357j16N74
$$ -3313 -4323 -3851 -3489 -4565 -3801 -4048 -4665 -5260 -3527 -1654 -4126 -3908 -3563 -2406 -49 -165 409
5767D09K759j03K97j231l359l124p93K67J513L043q93n25J243J40j047p69m78
$$ 409 3168 3065 3362 2131 -1228 -4352 -5145 -4878 -3365 -322 -1215 -1740 -497 -357 -1404 -2173 -2651
5750b651J114J349p04l500J246K090K191J105l975k754j45J30J233J126k07J070
$$ -2651 -1537 -188 -892 -4392 -3146 -1056 1135 2240 -1735 -4489 -4634 -4504 -3271 -2145 -2352 -1282
5734a282P45M34R2K157j61q23j003k423O24m86r88L08J102N9K354l39j132p10
$$ -1282 -537 -103 -11 2146 1985 1162 159 -2264 -1640 -2126 -3114 -2806 -1704 -1645 709 370 -762 -1472
5716a472j467j555j382J710L19P19P42q03R43J052J34O46j763q60J492J406j910
$$ -1472 -2939 -4494 -5876 -4166 -3847 -3128 -2386 -3189 -2246 -1194 -1060 -414 -2177 -3037 -1545 -139 -2049
5699b049j061J595J686k09K415j740l172j510Q59O43J582L354k921l593j034L681
$$ -2049 -3110 -1515 171 -38 2377 637 -2535 -4045 -3186 -2543 -961 2393 -528 -4121 -5155 -1474
5683a474K765r54l232J20L47j09j4J588j64q2K241M93k71j239m19J14q29k670
$$ -1474 1291 337 -2895 -2775 -2428 -2537 -2551 -963 -1127 -1209 1032 1525 1254 15 -404 -290 -1119 -3789
5665c789k967J888J564K130J344M72k253j154j5J789L74J520J40m00j573k987
$$ -3789 -6756 -4868 -3304 -1174 170 642 -1611 -2765 -2780 -991 -617 903 1043 643 -930 -3917
5649c917K43J381J215P42p41l004M8J825K67j19L65j908j636r37k314J402J314
$$ -3917 -3674 -2293 -1078 -336 -1077 -4081 -4033 -2208 -1941 -2060 -1695 -3603 -5239 -6176 -8490 -7088 -5774
5632e774K864j143J28K387m80R8J608J441J353j851k582j666P54J005J205o73
$$ -5774 -2910 -4053 -3925 -1538 -2018 -1920 -312 1129 2482 631 -1951 -3617 -2863 -1858 -653 -1326
5616a326q53J242J023p13j636j555N8K447O28p51L05Q14r58p56J441P9p03j141
$$ -1326 -2179 -937 86 -627 -2263 -3818 -3760 -1313 -685 -1436 -1131 -317 -1275 -2031 -590 -511 -1214 -2355
5598b355j38j920K051L152j48L9Q62R91j162j274j844N01L45JK122N18K06J84
$$ -2355 -2493 -4413 -2362 790 642 681 1543 2534 1372 98 -1746 -1245 -900 -899 1223 1741 1947 2131
5580B131o51J489j699k459k187J047J597j466j321J5p64K452N04K275K472q6J015
$$ 2131 1480 2969 1270 -1189 -3376 -2329 -732 -2198 -3519 -3504 -4268 -1816 -1312 963 3435 3349 4364
5563D364o06k292k52J96m28k043j293Q41J230M80l33q17n01J406Q74r84j402p59
$$ 4364 3758 1466 1214 1410 982 -1061 -2354 -1513 -283 197 -136 -953 -1454 -48 826 -158 -1560 -2319
5545b319M281r70k900m40j028j799q54P47J253r16r27K64K180K479m70j402o37
$$ -2319 1962 992 -1908 -2348 -3376 -5175 -6029 -5282 -4029 -4945 -5872 -5608 -3428 -949 -1419 -2821 -3458
5528c458r6M7r87k064L017k99J029K557r63J35J71q97o63p00J267J995L78P72
$$ -3458 -3554 -3507 -4494 -6558 -3541 -3840 -2811 -254 -1217 -1082 -911 -1808 -2471 -3171 -1904 91 469 1241
5510A241J72j460q35J637J547j224l152j42K436j247p05o88J057j34j137J044
$$ 1241 1413 -47 -882 755 2302 1078 -2074 -2216 220 -1027 -1732 -2420 -1363 -1497 -2634 -1590
5494a590l31O25J663q6l057j001J00p44J23K743q75p52p39L0j407j658K863L274
$$ -1590 -1921 -1296 367 281 -2776 -3777 -3677 -4421 -4298 -1555 -2430 -3182 -3921 -3891 -5298 -6956 -4093 -819
5476h19o42R04L054P32P45j187j690P50P66n62j371l65o57l335k434K148P08k026
$$ -819 -1461 -557 2497 3229 3974 2787 1097 1847 2613 2051 680 315 -342 -3677 -6111 -3963 -3255 -5281
5458e281J89J938K166p14J96L74J310q06K084o68j101j520k483P96l33p09J241
$$ -5281 -5092 -3154 -988 -1702 -1506 -1132 178 -628 1456 788 -313 -1833 -4316 -3520 -3853 -4562 -3321
5441c321R73L209r06j451k073q84J714P74j255J087K214k249j930K022L70M93
$$ -3321 -2348 861 -45 -1496 -3569 -4453 -2739 -1965 -3220 -2133 81 -2168 -4098 -2076 -1706 -1213
5425a213N71J67J088L13n62r64j238P17J076m96o67j064M12q15j41l64K301k506
$$ -1213 -642 -475 613 926 364 -600 -1838 -1121 -45 -541 -1208 -2272 -1860 -2675 -2816 -3180 -879 -3385
5407c385j443r75J992K502o09j780K169K20r51K171j46j018J768p43L12r76j243
$$ -3385 -4828 -5803 -3811 -1309 -1918 -3698 -1529 -1309 -2260 -89 -235 -1253 515 -228 84 -892 -2135
5390b135j85Q48J592J384j209K24J8K268J490k901j741J454J061L74l80l80j746
$$ -2135 -2320 -1472 120 1504 295 519 537 2805 4295 1394 -347 1107 2168 2542 2162 1782 36
5373C6K42L45m97j175j457J325K061q93O06M05K535K85j151j65R88Q34j063k38
$$ 36 278 623 126 -1049 -2506 -1181 880 -13 593 998 3533 3818 2667 2502 3490 4324 3261 3023
5355C023k050j898m574J283L312l32l059j002K580J48J613k253l701L850P09j241
$$ 3023 973 -925 -5499 -4216 -904 -1236 -4295 -5297 -2717 -2569 -956 -3209 -6910 -3060 -2351 -3592
5339c592n67q85o32P66P37P98n1j225m19J589J096K238r65n55J456p17k673j56
$$ -3592 -4159 -5044 -5676 -4910 -4173 -3375 -3426 -4651 -5070 -3481 -2385 -147 -1112 -1667 -211 -928 -3601 -3757
5321c757J21N94K284p05j595J186M18R95P03Mk336n66J047K649j36q32j140j182
$$ -3757 -3636 -3042 -758 -1463 -3058 -1872 -1454 -459 244 248 -2088 -2654 -1607 1042 906 74 -1066 -2248
5303b248J409P45j60N96J613o64l10J851K362j805k048j545R60P10j618k90j700
$$ -2248 -839 -94 -254 342 1955 1291 981 2832 5194 3389 1341 -204 756 1466 -152 -442 -2142
5286b142K35Q85J942j979K34J222L982k273M99j056j359O61K299m79j415l02J234
$$ -2142 -1907 -1022 920 -1059 -825 397 4379 2106 2605 1549 190 851 3150 2671 1256 954 2188
5269B188j555r46P43J442O97J061k898k295J304J311P84r33j547j362n46j751
$$ 2188 633 -313 430 1872 2569 3630 732 -1563 -259 1052 1836 903 -644 -2006 -2552 -4303
5253d303n83J26R06J110J651K343K839M10j275o23l73r00K352n90l075k81P40
$$ -4303 -4886 -4760 -3854 -2744 -1093 1250 4089 4499 3224 2601 2228 1328 3680 3090 15 -266 474
5236D74o97o45j326j956j60M338o05k021j55k70j811J790j200l439J682K773L93
$$ 474 -223 -868 -2194 -4150 -4310 28 -577 -2598 -2753 -3023 -4834 -3044 -4244 -7683 -6001 -3228 -2835
5219b835R15K153l90k381j919R79J429j64m36j612n87K76J732J066L68K346J139
$$ -2835 -1920 233 -157 -2538 -4457 -3478 -2049 -2213 -2649 -4261 -4848 -4572 -2840 -1774 -1406 940 2079
5202B079J183j330j616p98Q79k656R92J014l34j798l634K13L430K59k40m28j676
$$ 2079 3262 1932 316 -482 397 -2259 -1267 -253 -587 -2385 -6019 -5806 -2376 -2117 -2357 -2785 -4461
5185d461r51R23K304K773L807K525n584n000j37K670N29k060j354J002K8j498
$$ -4461 -5412 -4489 -2185 588 4395 6920 1336 -3664 -3801 -1131 -602 -2662 -4016 -3014 -2986 -4484
5169d484J586J90K472J753j942l344J298K118L42j019P59J134j312o76j685n64
$$ -4484 -2898 -2708 -236 1517 -425 -3769 -2471 -353 -11 -1030 -271 863 -449 -1125 -2810 -3374
5153c374P56J070J752n92j637q09k233n80J276K06m21n15Q86R81M41K67M89N39
$$ -3374 -2618 -1548 204 -388 -2025 -2834 -5067 -5647 -4371 -4165 -4586 -5101 -4215 -3234 -2793 -2526 -2037 -1498
5135a498o47P54N71o53N43K86n47j440Q13k72o97k010p76N24J982L376r88o43
$$ -1498 -2145 -1391 -820 -1473 -930 -644 -1191 -2631 -1818 -2090 -2787 -4797 -5573 -5049 -3067 309 -679 -1322
5117a322k322K07j565k497J498J063R5J691n4l40J278k020q1J789O49J941Q40
$$ -1322 -3644 -3437 -5002 -7499 -6001 -4938 -4843 -3152 -3206 -3546 -2268 -4288 -4369 -2580 -1931 10 850
5100H50J184j761j685P66n52p23J441Q24k476j048j976k138N26K173Q51M59p81
$$ 850 2034 273 -1412 -646 -1198 -1921 -480 344 -2132 -3180 -5156 -7294 -6768 -4595 -3744 -3285 -4066
5083d066P08N32J441J014J185J057J509J287L60j273k945k702j566J090J85J073
$$ -4066 -3358 -2826 -1385 -371 814 1871 3380 4667 5027 3754 809 -1893 -3459 -2369 -2184 -1111
5067a111J002J150J024m96O21j174QN05j149m37m6j174j985n53M118j96k511n4
$$ -1111 -109 1041 2065 1569 2190 1016 1024 1529 380 -57 -103 -1277 -3262 -3815 303 107 -2404 -2458
5049b458J744R12j728j354K57j56M19J913q68N59L99l82J459j891j176R12Q89
$$ -2458 -714 198 -1530 -2884 -2627 -2783 -2364 -451 -1319 -760 -361 -743 716 -1175 -2351 -1439 -550
5032e50r83k92K16k214l83K369J325J680k527k350N47J698K351J439l272k192
$$ -550 -1533 -1825 -1609 -3823 -4206 -1837 -512 1168 -1359 -3709 -3162 -1464 887 2326 -946 -3138
5016c138l356p62O14O85K206j833K99K255K43j323N5j143P89k03J215J150J049
$$ -3138 -6494 -7256 -6642 -5957 -3751 -5584 -5285 -3030 -2787 -4110 -4055 -5198 -4409 -4612 -3397 -2247 -1198
4999a198J342l4p77J161N90k082l73k029p6L82k75K69n75N35J487N55j280k14
$$ -1198 144 110 -667 494 1084 -998 -1371 -3400 -3476 -3094 -3369 -3100 -3675 -3140 -1653 -1098 -2378 -2592
4981b592k99J260n49j967q93l58K79J106Q06k19l2j453k313J272J766L354J012
$$ -2592 -2891 -1631 -2180 -4147 -5040 -5398 -5119 -4013 -3207 -3426 -3458 -4911 -7224 -5952 -4186 -832 180
4964A80k966j988O96J017P23P50k566k305L190M435j882k44K845j171k608l170
$$ 180 -2786 -4774 -4078 -3061 -2338 -1588 -4154 -6459 -3269 1166 -716 -960 1885 714 -1894 -5064
4948e064k484J128J827K514J921J061R30p8k060l198K588O05j22j225j885p83
$$ -5064 -7548 -6420 -4593 -2079 -158 903 1833 1755 -305 -3503 -915 -310 -432 -1657 -3542 -4325
4932d325N702Q23k125j189j056J561j452m77K080J018k108P18j417l711J031J251
$$ -4325 1377 2200 75 -1114 -2170 -609 -2061 -2538 -458 560 -1548 -830 -2247 -5958 -4927 -3676
4916c676q40K108K612P59L68r67J576O2j969k098J181n16P79o31k252R43J943
$$ -3676 -4516 -2408 204 963 1331 364 1940 2002 33 -2065 -884 -1400 -621 -1252 -3504 -2561 -618
4899f18p0j612J509J470j36L9j016J442J008k832l250j483J40n30K654R41J054
$$ -618 -688 -2300 -791 679 543 582 -434 1008 2016 -816 -4066 -5549 -5409 -5939 -3285 -2344 -1290
4882a290K126j721k195m45n12K014r2k36o94m99J220J224r85N73J635R45J431
$$ -1290 836 -885 -3080 -3525 -4037 -2023 -2115 -2351 -3045 -3544 -2324 -1100 -2085 -1512 123 1068 2499
4865B499j053j864K186j40k108j020P75J429j347j756J249j434m190kn60m13J396
$$ 2499 1446 -418 1768 1628 -480 -1500 -725 704 -643 -2399 -1150 -2584 -6774 -6776 -7336 -7749 -6353
4848f353M88j20O14p58J768L476N56K698j002j219J801K491j833l624k301J315
$$ -6353 -5865 -5985 -5371 -6129 -4361 -885 -329 2369 1367 148 1949 4440 2607 -1017 -3318 -2003
4832b003J113J630m55j839L74J58k964k087J782K71j648J08L205J343k21k121
$$ -2003 -890 740 285 -1554 -1180 -1022 -3986 -6073 -4291 -4020 -5668 -5560 -2355 -1012 -1233 -3354
4816c354o93j60R12m83j865P80J499K746K225K478l070k301j016j81m68l93L05
$$ -3354 -4047 -4207 -3295 -3778 -5643 -4863 -3364 -618 1607 4085 1015 -1286 -2302 -2483 -2951 -3344 -3039
4799c039K015M29j771j907l90j421j49L387K834J501R93N90k287j464M86J137
$$ -3039 -1024 -595 -2366 -4273 -4663 -6084 -6233 -2846 -12 1489 2482 3072 785 -679 -193 944
4783I44k367l65K867j511m980q42K283Q62k032K119K641L36l13o90Q50J296j763
$$ 944 -1423 -1788 1079 -432 -5412 -6254 -3971 -3109 -5141 -3022 -381 -45 -358 -1048 -198 1098 -665
4766f65M22P98p21R30j812m3j59M68j098j978J97K58J860MJ88k36J097J672k138
$$ -665 -243 555 -166 764 -1048 -1091 -1250 -782 -1880 -3858 -3661 -3403 -1543 -1539 -1351 -1587 -490 1182 -956
4747i56j487k981o09K819j181P88O58j947L83K688k36j776M90m29K208J590J60
$$ -956 -2443 -5424 -6033 -3214 -4395 -3607 -2949 -4896 -4513 -1825 -2061 -3837 -3347 -3776 -1568 22 182
4730A82J98p75M40J70J399M13j831p0N46j239R29l31n50J766K107j098m896j17
$$ 182 380 -395 45 215 1614 2027 196 126 672 -567 362 31 -519 1247 3354 2256 -2640 -2757
4712b757n29J147o56k041l925J621L479j55p69j482J811L119o75k276J27K987
$$ -2757 -3286 -2139 -2795 -4836 -8761 -7140 -3661 -3816 -4585 -6067 -4256 -1137 -1812 -4088 -3961 -974
4696i74J697K45O04k570r38m79P09l038k424L811L864j291o24j288O46j118j06
$$ -974 723 968 1572 -998 -1936 -2415 -1706 -4744 -7168 -3357 507 -784 -1408 -2696 -2050 -3168 -3274
4679c274J553J777k227J591L62j1l485Q1K757M59q61R15k485O28l5L48J3j459
$$ -3274 -1721 56 -2171 -580 -218 -229 -3714 -3633 -876 -417 -1278 -363 -2848 -2220 -2255 -1907 -1894 -3353
4661c353k33J267J992j950o10l41m58K36J593R09j435J61k52Q25K882j406l032
$$ -3353 -3586 -2319 -327 -2277 -2887 -3228 -3686 -3450 -1857 -948 -2383 -2222 -2474 -1649 1233 -173 -3205
4644c205P50L29l43K8K374L117J379O7J157m21k363m137j366R44J909j146j935
$$ -3205 -2455 -2126 -2469 -2441 -67 3050 4429 4496 5653 5232 2869 -1268 -2634 -1690 219 -927 -2862
4627b862j005K4J011J734j612m83J095L143N44j255k25j090j210mJ292j132o78
$$ -2862 -3867 -3843 -2832 -1098 -2710 -3193 -2098 1045 1589 334 109 -981 -2191 -2195 -903 -2035 -2713
4610b713J598P03j12N82J289o31j625j26r2J738K16Q74Q09j72j748J096k545j214
$$ -2713 -1115 -412 -524 58 1347 716 -909 -1035 -1127 611 827 1701 2510 2338 590 1686 -859 -2073
4592b073o37m0J979K13P03j161k313L28J344r65J326J168k221k94N67p48k106
$$ -2073 -2710 -2750 -771 -558 145 -1016 -3329 -3001 -1657 -2622 -1296 -128 -2349 -2643 -2076 -2824 -4930
4575d930N81P95K39p58k36J756J024R85q83M91J933K242p72o53k825j78n42j696
$$ -4930 -4349 -3554 -3315 -4073 -4309 -2553 -1529 -544 -1427 -936 997 3239 2467 1814 -1011 -1189 -1731 -3427
4557c427o21m09J803J511J808k121n29k96k225J597R46o5j094J567J004L32k424
$$ -3427 -4048 -4457 -2654 -1143 665 -1456 -1985 -2281 -4506 -2909 -1963 -2028 -3122 -1555 -551 -219 -2643
4540b643M99L271Q29l398j44J299j687k794J95J672j032o35K362M39N20j97j449
$$ -2643 -2144 1127 1956 -1442 -1586 -287 -1974 -4768 -4573 -2901 -3933 -4568 -2206 -1767 -1247 -1444 -2893
4523b893O25J819j51o0j218j671l87j039n89K561j08J370K481j221M26J811l91
$$ -2893 -2268 -449 -600 -660 -1878 -3549 -3936 -4975 -5564 -3003 -3111 -1741 740 -481 -55 1756 1365
4506A365R12k21k856j336N03K802K325j660l69j898p37j40n24R51N74L96K212
$$ 1365 2277 2056 -800 -2136 -1633 1169 3494 1834 1465 -433 -1170 -1310 -1834 -883 -309 87 2299
4489B299M37m55o56l61j523k001k708Q8R24q6K524Q28P50J516k230j764L95N0
$$ 2299 2736 2281 1625 1264 -259 -2260 -4968 -4880 -3956 -4042 -1518 -690 60 1576 -654 -2418 -2023 -1973
4471a973J471j84k029o6N87J60O09J2n78L35M72N13j5j663l81J204j778J87J876
$$ -1973 -502 -686 -2715 -2781 -2194 -2034 -1425 -1413 -1991 -1656 -1184 -671 -686 -2349 -2730 -1526 -3304 -3117 -1241
4452a241K814j921j528j148P95M76k83J465K498k197k242q53j407P85p53N67j037
$$ -1241 1573 -348 -1876 -3024 -2229 -1753 -2036 -571 1927 -270 -2512 -3365 -4772 -3987 -4740 -4173 -5210
4435e210o7J039K758O41J863J522l88l705j275Q56j618J757m74p36M094K880j882
$$ -5210 -5277 -4238 -1480 -839 1024 2546 2158 -1547 -2822 -1966 -3584 -1827 -2301 -3037 1057 3937 2055
4418B055j843j757M02k42j70p28P20l75k55k80o94M546J646r99j032n00M48O71
$$ 2055 212 -1545 -1143 -1385 -1555 -2283 -1563 -1938 -2193 -2473 -3167 1379 3025 2026 994 494 942 1613
4400A613j905k041k036j690L91L34j104p77J87K058J219o20J07k037M14J577J312
$$ 1613 -292 -2333 -4369 -6059 -5668 -5334 -6438 -7215 -7028 -4970 -3751 -4371 -4264 -6301 -5887 -4310 -2998
4383b998J112J484J0j992q20L08l82J165M21q88Q10Q41l76q06K326J571j968j711
$$ -2998 -1886 -402 -392 -2384 -3204 -2896 -3278 -2113 -1692 -2580 -1770 -929 -1305 -2111 215 1786 -182 -1893
4365a893j154J064M27p01j66J182k726M65K35p6n99K261J640J327j360k582j529
$$ -1893 -3047 -1983 -1556 -2257 -2423 -1241 -3967 -3502 -3267 -3343 -3942 -1681 -41 1286 -74 -2656 -4185
4348d185N48N03j12m75R53J050j231m4l83J083L109J762l04j38R83j55j25r67
$$ -4185 -3637 -3134 -3246 -3721 -2768 -1718 -2949 -2993 -3376 -2293 816 2578 2274 2136 3119 2964 2839 1872
4330A872p85j09N26L95k153r73J037l47j132K43L193j385n32K038n88k156Q86
$$ 1872 1087 978 1504 1899 -254 -1227 -190 -537 -1669 -1426 1767 382 -150 1888 1300 -856 30
4313C0J42j383L26J16k635J079K345k1j155j091j606j752J35K237K02M3N23J81
$$ 30 172 -1211 -885 -769 -3404 -2325 20 -1 -1156 -2247 -3853 -5605 -5470 -3233 -3031 -2988 -2465 -2284
4295b284r93J083j259J329M11k379n74J860K390k709l81J315k92M00K246Q57l031
$$ -2284 -3277 -2194 -3453 -2124 -1713 -4092 -4666 -2806 -416 -3125 -3506 -2191 -2483 -2083 163 1020 -2011
4278b011j216j407j096J902J519K024K937j621n08l54L67J04K272k322Q23M40
$$ -2011 -3227 -4634 -5730 -3828 -2309 -285 2652 1031 523 169 536 640 2912 590 1413 1853
4262A853j264j041q57L06j536k06j082J150L953j06p6k058j755j7K985M89M48
$$ 1853 589 -452 -1309 -1003 -2539 -2745 -3827 -2677 1276 1170 1094 -964 -2719 -2736 249 738 1186
4245A186j826j732k180j80Q55J396k32o00j479j61J756k56J077K34K660L17Q07
$$ 1186 -640 -2372 -4552 -4732 -3877 -2481 -2713 -3313 -4792 -4953 -3197 -3453 -2376 -2142 518 835 1642
4228A642j570J035j50l77O61j804j502j588j676K230k06j18K597N68o70k18K917
$$ 1642 72 1107 957 580 1241 -563 -2065 -3653 -5329 -3099 -3305 -3423 -826 -258 -928 -1146 1771
4211A771o69k296j553K15J217J845J501j065l88r38j378J73J405N94k16j146N31
$$ 1771 1102 -1194 -2747 -2532 -1315 530 2031 966 578 -360 -1738 -1565 -160 434 218 -928 -397
4194c97K356J046J44m001k602o88L074J328K03N59J530m42k75q56O06p88p03P5
$$ -397 1959 3005 3149 -852 -3454 -4142 -1068 260 463 1022 2552 2110 1835 979 1585 797 94 169
4176A69j201k051o91L020J224j825Q23j55j701K321J169k327K407J474P56J118
$$ 169 -1032 -3083 -3774 -754 470 -1355 -532 -687 -2388 -67 1102 -1225 1182 2656 3412 4530
4160D530J651l00k589l496j805p01M88l216r08O27J867j741J742J622N87O67L382
$$ 4530 6181 5881 3292 -204 -2009 -2710 -2222 -5438 -6346 -5719 -3852 -5593 -3851 -2229 -1642 -975 2407
4143B407K77n296k136L200Q41k173l177k65j404J997K092K901j63k480n13Q85
$$ 2407 2684 -2612 -4748 -1548 -707 -2880 -6057 -6322 -7726 -5729 -3637 -736 -899 -3379 -3892 -3007
4127c007O44J567M84L47LJ775q57k729n49K685Q97o46k113l57K519j269k726m76
$$ -3007 -2363 -796 -312 35 38 1813 956 -1773 -2322 363 1260 614 -1499 -1856 663 -606 -3332 -3808
4109c808l1J021J18l04N77J044J715l486j444J744K356l55j030l55k056r40P78
$$ -3808 -3839 -2818 -2700 -3004 -2427 -1383 332 -3154 -4598 -2854 -498 -853 -1883 -2238 -4294 -5234 -4456
4092d456R30K10J46J369l03k735K17K557J359J30J589L058J312j073j838q52J961
$$ -4456 -3526 -3316 -3170 -1801 -2104 -4839 -4622 -2065 -706 -576 1013 4071 5383 4310 2472 1620 3581
4075C581k359J318j358k221j626j507J948J336Q67k284j905o94J878j098k847
$$ 3581 1222 2540 1182 -1039 -2665 -4172 -2224 -888 -21 -2305 -4210 -4904 -3026 -4124 -6971
4060f971P34J449R03R9Q1K648Q53P37j816j14L484K324p92n390q11M47K76q49
$$ -6971 -6237 -4788 -3885 -3786 -3705 -1057 -204 533 -1283 -1397 2087 4411 3619 -1771 -2582 -2135 -1859 -2708
4042b708n34n95K624K512J918k97l872k132N45j745M27K922J232m25q05J686J537
$$ -2708 -3242 -3837 -1213 1299 3217 2920 -952 -3084 -2539 -4284 -3857 -935 297 -128 -933 753 2290
4025B290n12K58l51k314K522N31l768J75J157J558j208m311r30L048P30j292J033
$$ 2290 1778 2036 1685 -629 1893 2424 -1344 -1169 -12 1546 338 -3973 -4903 -1855 -1125 -2417 -1384
4008a384J216P44O7l070K12K173J760k924j51J10q85j269k663K512J793K409K551
$$ -1384 -168 576 643 -2427 -2215 -42 1718 -1206 -1357 -1247 -2132 -3401 -6064 -3552 -1759 650 3201
3991C201J854O49l054k617m70P6L20j396q31Q42R11K081P46Q57l683o30j49j318
$$ 3201 5055 5704 2650 33 -437 -361 -41 -1437 -2268 -1426 -515 1566 2312 3169 -514 -1144 -1293 -2611
3973b611j3K704K582o60k90j580j379L02n18j16j1L012Q62j761j438R96k191o26
$$ -2611 -2624 80 2662 2002 1712 132 -1247 -945 -1463 -1579 -1590 1422 2284 523 -915 81 -2110 -2736
3955b736O52K215L343L44j66k57k321j230j491j197K396J7j798j292K53J332J188
$$ -2736 -2084 131 3474 3818 3652 3395 1074 -156 -1647 -2844 -448 -431 -2229 -3521 -3268 -1936 -748
3938g48R23j509O58N29j916L332L107Q03Q54k831o52j485k114P9P23J508J075
$$ -748 175 -1334 -676 -147 -2063 1269 4376 5179 6033 3202 2550 1065 -1049 -970 -247 1261 2336
3921B336n77j261j253K34K093m05o47j95J089J82k983j55K381R34p83q71L70n95
$$ 2336 1759 498 -755 -521 1572 1167 520 325 1414 1596 -1387 -1542 839 1773 990 119 489 -106
3903a06k112L26P07j314l26L287J054j205K30J713K81r62r08k227j629o35K169
$$ -106 -2218 -1892 -1185 -2499 -2825 462 1516 311 541 2254 2535 1573 665 -1562 -3191 -3826 -1657
3886a657L61o11o82J298R12L218k35j334J243K89j064j173l167j064N16L224L705
$$ -1657 -1296 -1907 -2589 -1291 -379 2839 2604 1270 2513 2802 1738 565 -2602 -3666 -3150 74 3779
3869C779K84n575OJ0j764j166K595J138q37j50Q14p29j200J447K758n90k608k385
$$ 3779 4063 -1512 -1506 -1496 -3260 -4426 -1831 -693 -1530 -1680 -866 -1595 -2795 -1348 1410 820 -1788 -4173
3851d173m41k32O14L064O14p5m18J218n48j811R59L77j10q77j88M6Q48k540K78
$$ -4173 -4614 -4846 -4232 -1168 -554 -629 -1047 171 -377 -2188 -1229 -852 -962 -1839 -2027 -1981 -1133 -3673 -3395
3832c395K098K587J076k779j848k401M80J25J069L56Q92J748R7j624k42J954J34
$$ -3395 -1297 1290 2366 -413 -2261 -4662 -4182 -4057 -2988 -2632 -1740 8 105 -1519 -1761 193 327
3815C27K27k292q1P16j341K307j004J24j075m10m16L48J431k173q06L380J951
$$ 327 554 -1738 -1819 -1103 -2444 -137 -1141 -1017 -2092 -2502 -2918 -2570 -1139 -3312 -4118 -738 1213
3798A213p73P31j191K09K084m1r67k24r60j1k03k551q82j037J209O07J285j753
$$ 1213 440 1171 -20 189 2273 2232 1265 1041 81 70 -133 -2684 -3566 -4603 -3394 -2787 -1502 -3255
3780c255O18Q59L136J246n56J87j078k350N40J044L04o93Q31Q82M53k88m420l554
$$ -3255 -2637 -1778 1358 2604 2048 2235 1157 -1193 -653 391 695 2 833 1715 2168 1880 -2540 -6094
3762f094J025J250J609N53j008J956J859j886j443L23j68J851R73m25r6j638k88
$$ -6094 -5069 -3819 -2210 -1657 -2665 -709 1150 -736 -2179 -1856 -2024 -173 800 375 279 -1359 -1647
3745a647J130K797P06J5O15m97q9Q38o11j588n1j802j259K73j597j470j580J94
$$ -1647 -517 2280 2986 3001 3616 3119 3030 3868 3257 1669 1618 -184 -1443 -1170 -2767 -4237 -5817 -5623
3727e623J979l91L944R32P0m95J210R86l365m188r43K51J089R44J291K239n47
$$ -5623 -3644 -4035 -91 841 911 416 1626 2612 -753 -4941 -5884 -5633 -4544 -3600 -2309 -70 -617
3710f17k852k012J268L533K00m30j34L42J45L97M05R33N40j113l50m04p39k387
$$ -617 -3469 -5481 -4213 -680 -480 -910 -1044 -702 -557 -160 245 1178 1718 605 255 -149 -888 -3275
3692c275j391O96J205R78P23o73j07P73l38o00K894M74k458j330J052O56J480
$$ -3275 -4666 -3970 -2765 -1787 -1064 -1737 -1844 -1071 -1409 -2009 885 1359 -1099 -2429 -1377 -721 759
3675G59nj186Q09J353o85j302J0k61J240j399L43k563o39K770R52j031O37R24
$$ 759 754 -432 377 1730 1045 -257 -247 -508 732 -667 -324 -2887 -3526 -756 196 -835 -198 726
3657G26o66k324k567P55L299K083J294k279j489J605o04P94r46k059q5J440p19
$$ 726 60 -2264 -4831 -4076 -777 1306 2600 321 -1168 437 -167 627 -319 -2378 -2463 -1023 -1742
3640a742J327K146p43O93q00J40j651k09J630P82j834K948m5J540j25k157n37
$$ -1742 -415 1731 988 1681 881 1021 -630 -839 791 1573 -261 2687 2642 4182 4057 1900 1363
3623A363M10j751k127O65J271J600m32N75j723m06R93k148p50r45N55L62J335
$$ 1363 1773 22 -2105 -1440 -169 1431 999 1574 -149 -555 438 -1710 -2460 -3405 -2850 -2488 -1153
3606a153p08J032O2Q47J027J271r01j468j28j23k85J300K599J678k454n079J0
$$ -1153 -1861 -829 -767 80 1107 2378 1477 9 -119 -242 -527 773 3372 5050 2596 -2483 -2473
3589b473N37R34J629q78k269j810J56K062J889k31l013k04L98L646J307K530p09
$$ -2473 -1936 -1002 627 -251 -2520 -4330 -4174 -2112 -223 -454 -3467 -3671 -3273 373 1680 4210 3501
3572C501k705Q43P22M16k655r17j535j404O31K476J375J230m21l7l315l09J064
$$ 3501 796 1639 2361 2777 122 -795 -2330 -3734 -3103 -627 748 1978 1557 1520 -1795 -2104 -1040
3555a040J49R34J033k575J35L38j035N53P05n47r63r2L08Q26k936k086K037n47
$$ -1040 -891 43 1076 -1499 -1364 -1026 -2061 -1508 -803 -1350 -2313 -2405 -2097 -1271 -4207 -6293 -4256 -4803
3537d803N67J304r45j03p38K983K990j851K329o14r79R5J571J507K50j949P16
$$ -4803 -4236 -2932 -3877 -3980 -4718 -1735 1255 -596 1733 1119 140 235 1806 3313 3563 1614 2330
3520B330k449p37q79j267P17R21N51K24J326p15J150j390J499J979k069n42O66
$$ 2330 -119 -856 -1735 -3002 -2285 -1364 -813 -589 737 22 1172 -218 1281 3260 1191 649 1315
3503A315j802j447j426n53N32K145M71K10r21k91J65J950j933j879Q57M947L81
$$ 1315 -487 -1934 -3360 -3913 -3381 -1236 -765 -555 -1476 -1767 -1602 348 -1585 -3464 -2607 2340 2721
3486B721j245k335J251r13k098J549Q77k477r71K487L755p96j774J475n48j26
$$ 2721 1476 -859 392 -521 -2619 -1070 -193 -2670 -3641 -1154 2601 1805 31 1506 958 832
3470H32j976j674l79L042M60K289J043r57K58q59k998j311K776J073j041n1r16
$$ 832 -1144 -2818 -3197 -155 305 2594 3637 2680 2938 2079 -919 -2230 546 1619 578 527 -389
3453c89j475j439r27J615K700K375j711r41r28R46J478R90L72N48j400j5l43L78
$$ -389 -1864 -3303 -4230 -2615 85 2460 749 -192 -1120 -174 1304 2294 2666 3214 1814 1799 1456 1834
3435A834j23k405j902P12P76k058j381M663K398k602l1R86q46j416m44N27N36
$$ 1834 1711 -694 -2596 -1884 -1108 -3166 -4547 116 2514 -88 -119 867 21 -1395 -1839 -1312 -776
3418g76k79k009K664J580j870n71j262J359J581j329m033N87K609L18j848J015
$$ -776 -1055 -3064 -400 1180 -690 -1261 -2523 -1164 417 -912 -4945 -4358 -1749 -1431 -3279 -2264
3402b264J353K39J062j377J373J147J336m25j054k060j971K391L679J398j65k722
$$ -2264 -911 -672 390 -987 386 1533 2869 2444 1390 -670 -2641 -250 3429 4827 4662 1940
3386A940j428J97O18k745j19M753J234j535m60j334l984k62L073J757Q11j422
$$ 1940 512 709 1327 -1418 -1537 3216 4450 2915 2455 1121 -2863 -3125 -52 1705 2516 1094
3370A094J541J41o06P3j259n00J937j608J78j974j46r65M88K240n30J488K13l29
$$ 1094 2635 2776 2170 2243 984 484 2421 813 991 -983 -1129 -2094 -1606 634 104 1592 1805 1476
3352A476M97j261J412j81J218K5j451j495k3N56K5J838j243l65K71j75J998J932
$$ 1476 1973 712 2124 1943 3161 3186 1735 240 217 773 798 2636 1393 1028 1299 1124 3122 5054
3334E054L83k378m291j439J717K032l26l991j09j564l646K040K325K710M717j704
$$ 5054 5437 3059 -1232 -2671 -954 1078 752 -3239 -3348 -4912 -8558 -6518 -4193 -1483 3234 1530
3318A530j518j500M27J906q59o9J136j836j866k830K551J674j979j415P21K106
$$ 1530 12 -1488 -1061 845 -14 -83 1053 -783 -2649 -5479 -2928 -1254 -3233 -4648 -3927 -1821
3302a821P54p93k343J821J987n95j135J512Q50l320j213K325O52J377Q09P9p87
$$ -1821 -1067 -1860 -4203 -2382 -395 -990 -2125 -613 237 -3083 -4296 -1971 -1319 58 867 946 159
3285A59m389j952K668J426Q67J243n42K38M86J513kj227K06N40K61J885J181N21
$$ 159 -4230 -6182 -3514 -2088 -1221 22 -520 -282 204 1717 1715 488 694 1234 1495 3380 4561 5082
3267E082K348q95j159k166l812j087Q87j491J568o14k20P68J046k028k302L42
$$ 5082 7430 6535 5376 3210 -602 -1689 -802 -2293 -725 -1339 -1559 -791 255 -1773 -4075 -3733
3251c733J950Q98n91J055J092q87m92k428l303K644K914N69J649k033P15o79o089
$$ -3733 -1783 -885 -1476 -421 671 -216 -708 -3136 -6439 -3795 -881 -312 1337 -696 19 -660 -6749
3234f749l45L523K365M791L808M907J725R32k308n490k821m051l044k93R57M698
$$ -6749 -7094 -3571 -1206 3585 7393 12300 14025 14957 12649 7159 4338 287 -2757 -3050 -2093 2605
3218B605L951J479J870L529p57l862m108k215j387l189j821K83k177J869M616
$$ 2605 6556 8035 9905 13434 12677 8815 4707 2492 1105 -2084 -3905 -3622 -5799 -3930 686
3203F86j705l075l141n30L793J87J049K304J930K355k148k299N49l277q15o88
$$ 686 -1019 -4094 -7235 -7765 -3972 -3785 -2736 -432 1498 3853 1705 -594 -45 -3322 -4137 -4825
3187d825K502j06K496K676J44J223r62j870P93L37j548P44p17j417j060L393K132
$$ -4825 -2323 -2429 67 2743 2887 4110 3148 1278 2071 2408 860 1604 887 -530 -1590 1803 3935
3170C935l1j71j124k926R42K66j19j376j256O46m94k555j069M2K062p45J74J747
$$ 3935 3904 3733 2609 -317 625 891 772 -604 -1860 -1214 -1708 -4263 -5332 -5290 -3228 -3973 -3799 -2052
3152b052J183O26P52q97j442O57K528J54J75O69j1j505K95J99o8j05j275l16n06
$$ -2052 -869 -243 509 -388 -1830 -1173 1355 1509 1684 2353 2342 837 1132 1331 1263 1158 -117 -433 -939
3133i39P61N56k87K272J487k274j542N71K517K3o35o13j819j686j040r8N03k32
$$ -939 -178 378 91 2363 3850 1576 34 605 3122 3145 2510 1897 78 -1608 -2648 -2746 -2243 -2475
3115b475R86R08N20K060L06k308J577L39j019L61R57j218m4L98m56K76R98j838
$$ -2475 -1489 -581 -61 1999 2305 -3 1574 1913 894 1255 2212 994 950 1348 892 1168 2166 328
3097C28M41K679J97j052j880n15n92j265m9K50k111k789J046J484P70J77K690
$$ 328 769 3448 3645 2593 713 198 -394 -1659 -1708 -1458 -3569 -6358 -5312 -3828 -3058 -2881 -191
3080a91q74q8K3P02N49j298N15J728l31j121k118l39Q28m85O37J452Q44l84K07
$$ -191 -1065 -1153 -1130 -428 121 -1177 -662 1066 735 -386 -2504 -2843 -2015 -2500 -1863 -411 433 49 256
3061B56L69M94j24J561j466p38r43l712m91K610J939o14j848K042j473n11J592
$$ 256 625 1119 995 2556 1090 352 -591 -4303 -4794 -2184 -245 -859 -2707 -665 -2138 -2649 -1057
3044a057l98q56o22k293R42K357j77J397q29n74j891j197R27J066Q77m14N11L53
$$ -1057 -1455 -2311 -2933 -5226 -4284 -1927 -2104 -707 -1536 -2110 -4001 -5198 -4271 -3205 -2328 -2742 -2231 -1878
3026a878J427q90L22l94m14q64m35M48L06K49N82n17p78j333P13O43J273O55J244
$$ -1878 -451 -1341 -1019 -1413 -1827 -2691 -3126 -2678 -2372 -2123 -1541 -2058 -2836 -4169 -3456 -2813 -1540 -885 359
3007C59K51N35J20J447L68j375K37j179p92N45j090o7Q23j528J070n77l94n89
$$ 359 610 1145 1265 2712 3080 1705 1942 763 -29 516 -574 -641 182 -1346 -276 -853 -1247 -1836
2989a836O86J032j543j70K196p54j198j70J759j908q41J430L110N89r93j828J956
$$ -1836 -1150 -118 -1661 -1831 365 -389 -1587 -1757 2 -1906 -2747 -1317 1793 2382 1389 -439 1517
2972A517N75q54m99p39l37J01m23L83k522J924P44j856Q55q37k392Q08N76j89
$$ 1517 2092 1238 739 0 -337 -236 -659 -276 -2798 -874 -130 -1986 -1131 -1968 -4360 -3552 -2976 -3165
2954c165R92J054K072O94l824p50J051O50O1R25L98k760n69J412J115j280j435
$$ -3165 -2173 -1119 953 1647 -2177 -2927 -1876 -1226 -1165 -240 158 -2602 -3171 -1759 -644 -1924 -3359
2937c359O94J464Q95m69J115K003o78m37m121l70K738N98m25N31j983j611k091
$$ -3359 -2665 -1201 -306 -775 340 2343 1665 1228 -2893 -3263 -525 73 -352 179 -1804 -3415 -5506
2920e506L00J860j990K200L544J642j805n21J20J565L979J13l135j070m48J577
$$ -5506 -5206 -3346 -5336 -3136 408 2050 245 -276 -156 1409 5388 5501 2366 1296 848 2425
2904B425J256J76k704r64J420j380l023q43K377p88j795N69P64l29K67j572j845
$$ 2425 3681 3857 1153 189 1609 229 -2794 -3637 -1260 -2048 -3843 -3274 -2510 -2839 -2572 -4144 -5989
2887e989J813K26K167N78j513Q46Q16j24l12L731l09N24j360p17n2l250j259Q55
$$ -5989 -4176 -3950 -1783 -1205 -2718 -1872 -1056 -1180 -1492 2239 1930 2454 1094 377 325 -2925 -4184 -3329
2869c329l41m64J506M62J808m53M6l65J000p58k190K127j090p20m53J940K105
$$ -3329 -3670 -4134 -2628 -2166 -358 -811 -765 -1130 -130 -888 -3078 -951 -2041 -2761 -3214 -1274 831
2852H31K992L906n64k443N66k930k224j508n53q58j60K321l369j935J768J169
$$ 831 3823 7729 7165 4722 5288 2358 134 -1374 -1927 -2785 -2945 -624 -3993 -5928 -4160 -2991
2836b991k491j904M80K104J880L03J720K302J466l376k194P23J020O72j98j104
$$ -2991 -5482 -7386 -6906 -4802 -2922 -2619 -899 1403 2869 -507 -2701 -1978 -958 -286 -484 -1588
2820a588j629K15o10J492J206J167J201J43j499p06N77K85j347J374K065M9j095
$$ -1588 -3217 -3002 -3612 -2120 -914 253 1454 1597 98 -608 -31 254 -1093 281 2346 2395 1300
2803A300j20O38K589J750j35k98k533o55j7j789J84j109j299J941K212P06j687
$$ 1300 1180 1818 4407 6157 6022 5724 3191 2536 2519 730 914 -195 -1494 447 2659 3365 1678
2786A678j495o20l161J107J136M17L09j579r1R58J639j634l31J004j116j177r76
$$ 1678 183 -437 -3598 -2491 -1355 -938 -629 -2208 -2299 -1341 298 -1336 -1667 -663 -1779 -2956 -3932
2769c932J906J867K09j951l619j930K547J31j109j150K416K493J155J019J1n86
$$ -3932 -2026 -159 50 -1901 -5520 -7450 -4903 -4772 -5881 -7031 -4615 -2122 -967 52 63 -523
2753e23n6r11j19J276Q87m7m94K328K757j426o38j45j642L06L353J922j047j499
$$ -523 -579 -1490 -1609 -333 554 507 13 2341 5098 3672 3034 2889 1247 1553 4906 6828 5781 4282
2735D282k670k323j598k335J925P15k643J370j70K278n1p12Q92K024k740N97J277
$$ 4282 1612 -711 -2309 -4644 -2719 -2004 -4647 -3277 -3447 -1169 -1220 -1932 -1040 984 -1756 -1159 118
2718A18k030K69J780K231j648j343O0l74M91o30K203J960k230k339p1J740K161
$$ 118 -1912 -1643 137 2368 720 -623 -563 -937 -446 -1076 1127 3087 857 -1482 -1553 187 2348
2701B348O93k318j169m68P01J083n13L07k20j050n36n0j297p90l13n73k22L99
$$ 2348 3041 723 -446 -914 -213 870 357 664 444 -606 -1142 -1192 -2489 -3279 -3592 -4165 -4387 -3988
2683c988J3K180J102j94O77K341M68J270k285j503p64J455L391j504o56o76p45
$$ -3988 -3975 -1795 -693 -887 -210 2131 2599 3869 1584 81 -683 772 4163 2659 2003 1327 582
2666E82J325Q73k229j350j875N9N30r41j559N01K293n91n57r57m38N0K063J915
$$ 582 1907 2780 551 -799 -2674 -2615 -2085 -3026 -4585 -4084 -1791 -2382 -2939 -3896 -4334 -4284 -2221 -306
2648c06p51J702J687k067p16K130J966j131M50K337r00j070k352m078j885j159
$$ -306 -1057 645 2332 265 -451 1679 3645 2514 2964 5301 4401 3331 979 -3099 -4984 -6143
2632f143K540J755J834J268l00j509j206K17K323K603j423l223l617J951L027
$$ -6143 -3603 -1848 -14 1254 954 -555 -1761 -1544 779 3382 1959 -1264 -4881 -2930 97
2617I7J669N73R39k351o65j216N39L218K777k097k117j556j051Q53J705K251R34
$$ 97 1766 2339 3278 927 262 -954 -415 2803 5580 3483 1366 -190 -1241 -388 1317 3568 4502
2600D502j183o24j469R97k897o92K479J468M92j906j226r82j241J345n8j267j33
$$ 4502 3319 2695 1226 2223 -674 -1366 1113 2581 3073 1167 -59 -1041 -2282 -937 -995 -2262 -2395
2583b395J719N44J384j86l01k479q15K273j99j022m3j09j78P78P60K057K86k446
$$ -2395 -676 -132 1252 1066 765 -1714 -2529 -256 -455 -1477 -1520 -1629 -1807 -1029 -269 1788 2074 -372
2565c72j57j294j54O99q78l88j310L049J206r49j310J10r48J901R95j40k880p81
$$ -372 -529 -1823 -1977 -1278 -2156 -2544 -3854 -805 401 -548 -1858 -1748 -2696 -795 200 60 -2820 -3601
2547c601O45J9J806P9J916o08j682l53K41K103J754j612j668O36r32L95k90k46
$$ -3601 -2956 -2937 -1131 -1052 864 256 -1426 -1779 -1538 565 2319 707 -961 -325 -1257 -862 -1152 -1398
2529a398k101R11J328j904K05P88j385J558J206P33l71R98J529P87K208k553j885
$$ -1398 -3499 -2588 -1260 -3164 -2959 -2171 -3556 -1998 -792 -59 -430 568 2097 2884 5092 2539 654
2512F54m05k43J624k123L92l72j06J146j916j637l99j977nK605K305J889O79j873
$$ 654 249 6 1630 -493 -101 -473 -579 567 -1349 -2986 -3385 -5362 -5367 -2762 -457 1432 2111 238
2494B38J104k96j024k252j418K251R67L327L43j297J789J020J952q09k131N30
$$ 238 1342 1046 22 -2230 -3648 -1397 -430 2897 3240 1943 3732 4752 6704 5895 3764 4294
2478D294k47j812q25r82J142j20o57P49J295J741K831K88l975j820o08l62o46
$$ 4294 4047 2235 1410 428 1570 1450 793 1542 2837 4578 7409 7697 3722 1902 1294 932 286
2461B86j830J412J988j070o5K277J997J50q05l33l227r31J871p47K042J62N2j277
$$ 286 -1544 -132 1856 786 721 2998 4995 5145 4340 4007 780 -151 1720 973 3015 3177 3229 1952
2443A952k911k462M050J265J57j537j140n1J367K55k026P72J431K141K205O67
$$ 1952 -959 -3421 629 1894 2051 514 -626 -677 690 945 -1081 -309 1122 3263 5468 6135
$$ [...]
##END NTUPLES=NMR SPECTRUM
##END=
