##TITLE=Analysis number 329770
Compound Code cc 55513
Book Reference 540/36
Project Code adrs
Chemist Name mikem
##JCAMPDX= 6.0         $$ Bruker NMR JCAMP-DX V2.0
##DATA TYPE= NMR SPECTRUM
##DATA CLASS= NTUPLES
##ORIGIN= Bruker BioSpin GmbH
##OWNER= nmr
$$ XWIN-NMR		Version 3.5
$$ Wed Sep 26 16:46:49 2007 GMT Daylight Time (UT+1h)  MAYBRIDGE\nmr@NMR_250MHZ
##.OBSERVE FREQUENCY= 250.131544655141
##.OBSERVE NUCLEUS= ^1H
##.ACQUISITION MODE= SIMULTANEOUS (DQD)
##.ACQUISITION SCHEME= undefined
##.AVERAGES= 16
##.DIGITISER RES= 18
##SPECTROMETER/DATA SYSTEM= dpx250
##.PULSE SEQUENCE= zg30
##.SOLVENT NAME= CDCl3
##.SHIFT REFERENCE= (INTERNAL, CDCl3, 0, 16.522)
##AUDIT TRAIL= $$ (NUMBER, WHEN, WHO, WHERE, WHAT)
$$ ##TITLE= Audit trail, XWIN-NMR		Version 3.5
$$ ##JCAMPDX= 5.01
$$ ##ORIGIN= Bruker BioSpin GmbH
$$ ##OWNER= nmr
$$ C:\u/data/dgb/nmr/ADRS/2550/pdata/1/auditp.txt
$$ ##AUDIT TRAIL=  $$ (NUMBER, WHEN, WHO, WHERE, WHAT)
(   1,<2007-09-26 16:46:23.07 +100>,<MAYBRIDGE\nmr>,<NMR_250MHZ>,
      <created by zg, POWCHK disabled, PULCHK disabled
       configuration hash MD5:
       76 6E 9A 78 1E 09 19 81 EC 84 63 8F B0 6A 59 2D
       data hash MD5: 64K
       D8 A6 7B FF 02 1E BB D7 24 CA FE 49 E8 51 A6 3B>)
(   2,<2007-09-26 16:46:37.82 +100>,<MAYBRIDGE\nmr>,<NMR_250MHZ>,
      <Start of raw data processing
       ef LB = 0.3 FT_mod = 6 PKNL = 1 SI = 32K 
       data hash MD5: 32K
       28 B4 F1 13 07 BE BA D4 DC 61 8D 26 70 90 37 BC>)
(   3,<2007-09-26 16:46:39.51 +100>,<MAYBRIDGE\nmr>,<NMR_250MHZ>,
      <apk 
       data hash MD5: 32K
       96 0E A0 A0 75 14 71 CA 3E F2 E9 36 74 97 D7 0D>)
(   4,<2007-09-26 16:46:40.31 +100>,<MAYBRIDGE\nmr>,<NMR_250MHZ>,
      <abs ABSG = 5 
       data hash MD5: 32K
       8D 09 F5 9E 20 CA F4 88 B4 15 E2 FF 30 C4 66 D7>)
$$ ##END=
$$ 
$$ hash MD5
$$ EA E0 51 AD F0 6C 1A D7 44 68 2C 7F 8D BC 2E 17
##$RELAX= 
##$RELAX= 
##$RELAX= 
##$RELAX= 
##$RELAX= 
##$RELAX= 
##$RELAX= 
$$ Bruker specific parameters
$$ --------------------------
##$DU= <C:\u>
##$EXPNO= 2550
##$NAME= <ADRS>
##$PROCNO= 1
##$TYPE= <nmr>
##$USER= <dgb>
##$AMP= (0..31)
100 100 100 100 100 100 100 100 100 100 100 100 100 100 100 100 100 100 
100 100 100 100 100 100 100 100 100 100 100 100 100 100 
##$AQSEQ= 0
##$AQ_mod= 3
##$AUNM= <au_zg>
##$AUTOPOS= <29 >
##$BF1= 250.13
##$BF2= 250.13
##$BF3= 250.13
##$BF4= 250.13
##$BF5= 500.13
##$BF6= 500.13
##$BF7= 500.13
##$BF8= 500.13
##$BYTORDA= 1
##$CFDGTYP= 0
##$CFRGTYP= 5
##$CHEMSTR= <none>
##$CNST= (0..31)
1 1 145 1 1 1 1 1 1 1 1 1 1 1 1 1 1 1 1 1 1 1 1 1 1 1 1 1 1 1 1 1 
##$CPDPRG= <>
##$CPDPRG1= <>
##$CPDPRG2= <>
##$CPDPRG3= <>
##$CPDPRG4= <mlev>
##$CPDPRG5= <mlev>
##$CPDPRG6= <mlev>
##$CPDPRG7= <mlev>
##$CPDPRG8= <mlev>
##$CPDPRGB= <>
##$CPDPRGT= <>
##$D= (0..31)
0 1 0 0 0 0 0 0 0 0.06 0 0 0 0 0 0 0.0002 0 0 0 0 0 0 0 0 0 0 0 0 0 0 
0 
##$DATE= 1190821581
##$DBL= (0..7)
120 120 120 120 120 120 120 120 
##$DBP= (0..7)
150 150 150 150 150 150 150 150 
##$DBP07= 0
##$DBPNAM0= <>
##$DBPNAM1= <>
$$ [...]
##$SUBNAM7= <"">
##$SUBNAM8= <"">
##$SUBNAM9= <"">
##$SW= 20.6930455092707
##$SWIBOX= (0..15)
0 0 3 0 0 0 0 0 0 0 0 0 0 0 0 0 
##$SW_h= 5175.983436853
##$TD= 65536
##$TD0= 1
##$TE= 296.16
##$TE2= 300
##$TE3= 300
##$TEG= 300
##$TL= (0..7)
0 120 120 120 120 120 120 120 
##$TP= (0..7)
150 150 150 150 150 150 150 150 
##$TP07= 0
##$TPNAME0= <>
##$TPNAME1= <>
##$TPNAME2= <>
##$TPNAME3= <>
##$TPNAME4= <>
##$TPNAME5= <>
##$TPNAME6= <>
##$TPNAME7= <>
##$TPOAL= (0..7)
0.5 0.5 0.5 0.5 0.5 0.5 0.5 0.5 
##$TPOFFS= (0..7)
0 0 0 0 0 0 0 0 
##$TUNHIN= 0
##$TUNHOUT= 0
##$TUNXOUT= 0
##$USERA1= <user>
##$USERA2= <user>
##$USERA3= <user>
##$USERA4= <user>
##$USERA5= <user>
##$V9= 5
##$VALIST= <valist>
##$VCLIST= <CCCCCCCCCCCCCCC>
##$VD= 0
##$VDLIST= <DDDDDDDDDDDDDDD>
##$VPLIST= <PPPPPPPPPPPPPPP>
##$VTLIST= <TTTTTTTTTTTTTTT>
##$WBST= 1024
##$WBSW= 4
##$XGAIN= (0..3)
0 0 0 0 
##$XL= 0
##$YL= 0
##$YMAX_a= 637806
##$YMIN_a= -724040
##$ZGOPTNS= <>
##$ZL1= 120
##$ZL2= 120
##$ZL3= 120
##$ZL4= 120
##$ABSF1= 16.522
##$ABSF2= -4.171173
##$ABSG= 5
##$ABSL= 3
##$ALPHA= 0
##$AQORDER= 0
##$ASSFAC= 0
##$ASSFACI= 0
##$ASSFACX= 0
##$ASSWID= 0
##$AUNMP= <proc_1d>
##$AZFE= 0.1
##$AZFW= 0.1
##$BCFW= 0
##$BC_mod= 0
##$BYTORDP= 0
##$COROFFS= 0
##$CY= 12.5
##$DATMOD= 1
##$DC= 0
##$DFILT= <>
##$DTYPP= 0
##$F1P= 14.0000005364418
##$F2P= -0.99999901652339
##$FCOR= 0.5
##$FTSIZE= 32768
##$FT_mod= 6
##$GAMMA= 0
##$GB= 0
##$INTBC= 1
##$INTSCL= 1
##$ISEN= 128
##$LB= 0.3
##$LEV0= 0
##$LPBIN= 0
##$MAXI= 10000
##$MC2= 0
##$MEAN= 0
##$ME_mod= 0
##$MI= 0
##$NCOEF= 0
##$NC_proc= -2
##$NLEV= 6
##$NOISF1= 0
##$NOISF2= 0
##$NSP= 0
##$NTH_PI= 0
##$NZP= 0
##$OFFSET= 16.522
##$PC= 1
##$PHC0= 154.3738
##$PHC1= 7.186253
##$PH_mod= 1
##$PKNL= yes
##$PPARMOD= 0
##$PSCAL= 4
##$PSIGN= 0
##$REVERSE= no
##$SF= 250.13
##$SI= 32768
##$SIGF1= 0
##$SIGF2= 0
##$SINO= 400
##$SIOLD= 32768
##$SREGLST= <1H.CDCl3>
##$SSB= 0
##$STSI= 32768
##$STSR= 0
##$SW_p= 5175.98343685301
##$SYMM= 0
##$S_DEV= 0
##$TDeff= 65536
##$TDoff= 0
##$TI= <Analysis number 999999
Compound Code 99
Book Reference 9
Project Code 9>
##$TILT= no
##$TM1= 0
##$TM2= 0
##$TOPLEV= 0
##$USERP1= <user>
##$USERP2= <user>
##$USERP3= <user>
##$USERP4= <user>
##$USERP5= <user>
##$WDW= 1
##$XDIM= 32768
##$YMAX_p= 360951128
##$YMIN_p= -111308
$$ End of Bruker specific parameters
$$ ---------------------------------
##NTUPLES= NMR SPECTRUM
##VAR_NAME=  FREQUENCY,     SPECTRUM/REAL,   SPECTRUM/IMAG
##SYMBOL=    X,             R,               I
##VAR_TYPE=  INDEPENDENT,   DEPENDENT,       DEPENDENT
##VAR_FORM=  AFFN,          ASDF,            ASDF
##VAR_DIM=   32768,         32768,           32768
##UNITS=     HZ,            ARBITRARY UNITS, ARBITRARY UNITS
##FACTOR=    0.157963299565203, 1,           1
##FIRST=     4132.6476996994, 0,             0
##LAST=      -1043.33573715361, 0,           0
##MIN=       -1043.33573715361, -111308,     0
##MAX=       4132.6476996994, 360951128,     0
$$ Real data points
##PAGE= N=1
##DATA TABLE= (X++(R..R)), XYDATA
$$ [...]
$$ plain form
16380 1805824 2022760 2274868 2565269 2870153 3211828 3584381 3995413 4471123 5036082
16371 5036082 5710351 6545779 7601203 8994907 10937471 13704490 17698790 23093574
16363 23093574 30122066 38698825 47143496 55514103 62101428 64654216 64986989 61636992
16355 61636992 56037534 50523746 45929468 43767185 44883678 48652280 53368786 58904785
16347 58904785 62007763 61929902 59504551 53016366 44815189 36004795 27395997 20160632
16339 20160632 14592118 10657416 7990283 6242243 5080994 4258063 3655653 3203102
16331 3203102 2855848 2574764 2354010 2179501 2024671 1883448 1761644 1646922 1514896
16322 1514896 1377868 1249008 1127427 1025020 939857 886711 854041 828247 812854 805804 785622
$$ packed form
16380A805824K16936K52108K90401L04884L41675L72553M11032M75710N64959
16371E036082O74269Q35428J055424J393704J942564K767019L994300N394784
16363B3093574P028492Q576759Q444671Q370607O587325K552788L32773l349997
16355F1636992n599458n513788m594278k162283J116493L768602M716506N535999
16347E8904785L102978p7861k425351o488185q201177q810394q608798p235365
16339B0160632n568514l934702k667133j748040j161249q22931o02410m52551
16331C203102l47254k81084k20754j74509j54830j41223j21804j14722j32026
16322A514896j37028j28860j21581j02407q5163n3146l2670k5794j5393p050k0182
$$ plain form
16311 785622 758269 720899 670234 605821 545436 486489 437758 394985 362744 336590 312751
16300 312751 300462 291433 275082 256426 240412 229905 213411 198440 188536 189493 188804 181055 172577
16287 172577 162788 156874 150970 150388 140660 133840 125063 116592 112887 109369 109433 102007 93629 94535 98286
16272 98286 97713 92648 89165 84383 76185 73365 69270 77823 80826 82233 84814 81575 75439 68515 67440
16257 67440 59518 51570 50617 50018 44482 40080 48598 56139 50633 51897 53113 52266 48681 47160 41438
16242 41438 34970 33699 29591 25838 24369 23787 17781 15855 16546 15664 24581 39909 43159 47423 48369
16227 48369 48068 51047 54009 48199 44215 42126 42587 40691 38023 36292 44101 57766 61224 62072 62462
16212 62462 57935 54505 55959 56246 51710 44408 44656 43646 39589 41817 43903 45167 44623 45647 48985
$$ packed form
16311G85622k7353l7370n0665o4413o0385n8947m8731m2773l2241k6154k3839
16300C12751j2289r029j6351j8656j6014j0507j6494j4971r904R57o89p749q478
16287A72577r789n914n904n82r728o820q777q471l705l518O4p426q378R06L751
16272I8286n73n065l483m782q198k820m095Q553L003J407K581l239o136o924j075
16257F7440p922p948r53n99n536m402Q518P541n506J264J216q47l585j521n722
16242D1438o468j271m108l753j469n82o006j926O91q82Q917J5328L250M264R46
16227D8369l01K979K962n810l984k089M61j896k668j731P809J3665L458Q48L90
16212F2462m527l430J454K87m536p302K48j010m057K228K086J264n44J024L338
$$ plain form
16197 48985 41431 34673 25561 26139 30797 34857 38270 34057 35680 35171 36803 31204 29190 34063 31528
16182 31528 35749 42508 48066 51442 60021 65414 62140 58179 53007 50619 49986 36943 34082 34025 39210
16167 39210 46682 42767 34998 38803 45421 41261 28244 17073 5961 926 3853 4302 5599 9792
16153 9792 10408 9844 9705 8551 5497 -1428 -6780 -6021 -4449 -3960 -3023 -4095 113 6299 10413 4476
16137 4476 -763 1093 2954 8813 7334 3987 1311 3963 5129 2319 10038 3294 -1916 -4674 -4543
16122 -4543 -1652 -4352 -6035 -2982 411 3426 2723 -1382 -5198 -2131 4306 2907 -1310 5632 15295
16107 15295 16951 15718 15736 14376 9913 7891 5811 12647 11754 12350 16768 22074 18535 9695 675
16092 675 -7556 -7192 -5867 1622 492 -1921 -2647 4008 10452 13194 13664 5825 2976 4395 1042 2867
$$ packed form
16197D8985p554o758r112N78M658M060L413m213J623n09J632n599k014M873k535
16182C1528M221O759N558L376Q579N393l274l961n172k388o33j3043k861n7N185
16167C9210P472l915p769L805O618m160j3017j1171j1112n035K927M49J297M193
16153I792O16n64j39j154l054o925n352P59J572M89R37j072M208O186M114n937
16137D476n239J856J861N859j479l347k676K652J166k810P719o744n210k758J31
16122d543K891k700j683L053L393L015p03m105l816L067O437j399m217O942R663
16107A5295J656j233J8j360m463k022k080O836q93N96M418N306l539q840r020
16092F75q231L64J325P489j130k413p26O655O444K742M70p839k849J419l353J825
$$ plain form
16076 2867 5007 -2283 -13353 -13370 -10132 -5487 -7138 -8753 -10822 -13544 -15983 -13929 -16585 -20946 -19612
16061 -19612 -14905 -8059 -7081 -8979 -7244 -6862 -1414 -1702 -8518 -11634 -12080 -5319 -3819 -8953 -13488
16046 -13488 -13178 -9575 -7392 1156 11666 9569 4943 1201 1933 -1492 -5630 -7576 -4456 -3583 -2006
16031 -2006 3028 4691 7025 2914 -2362 -3308 -6212 -8583 -8931 -3583 1363 3048 7417 9008 6202
16016 6202 5922 7432 7993 2752 272 5414 5665 2139 1122 -1802 145 -1509 -5632 -3232 -6486
16001 -6486 -7783 -9912 -4508 -2190 -3848 -6757 -11152 -10435 -8932 -9573 -3919 -4127 321 -4223 -225
15986 -225 -186 -204 963 -66 -1151 398 -747 -7749 -5687 1935 4447 5523 -2117 -5049 158 -3053
15970 -3053 -12535 -15446 -12472 -5259 -11039 -10588 -2519 591 -4889 -6008 -12481 -9353 -13102 -8500 -10770
$$ packed form
16076B867K140p290j1070j7L238M645j651j615k069k722k439K054k656m361J334
16061a9612M707O846R78j898J735L82N448k88o816l116m46O761J500n134m535
16046a3488L10L603K183Q548J0510k097m626l742P32l425m138j946L120Q73J577
16031b006N034J663K334m111n276r46k904k371l48N348M946J685M369J591k806
16016F202k80J510N61n241k480N142K51l526j017k924J947j654m123K400l254
16001f486j297k129N404K318j658k909m395P17J503o41N654k08M448m544L998
15986b25L9j8J167j029j085J549j145p002K062P622K512J076p640k932N207l211
15970c053r482k911K974P213n780M51Q069L110n480j119o473L128l749M602k270
$$ plain form
15955 -10770 -15972 -14288 -13672 -12096 -10122 -16141 -16657 -15098 -13590 -12166 -11495 -10251 -11217 -9637 -7289
15940 -7289 -5213 -5960 -486 4889 3097 -1823 -2877 -2371 -4730 -11307 -11437 -5036 -684 2724 -1400
15925 -1400 -3613 -2459 3157 1756 1320 1671 -4596 -10124 -12711 -15172 -12013 -8706 -12574 -12197 -3870
15910 -3870 -26 -3706 -12998 -22204 -23385 -16744 -8027 -3966 1646 2348 -1231 -6766 -6070 -2114 -664
15895 -664 -1624 1544 962 2181 3918 7258 2507 2846 3259 4283 3037 7438 9801 7834 -438 -1639
15879 -1639 -902 -7034 -1935 4337 3314 -4024 -7079 -7544 -8043 -4904 -602 -5759 -4069 -2717 -6816
15864 -6816 -3294 482 2249 1235 5246 869 -1082 -9678 -16623 -14913 -10427 -10561 -14726 -19457 -18164
15849 -18164 -6570 4294 -1005 3556 6730 975 -2374 -1584 -528 3929 14479 11639 2295 2833
$$ packed form
15955a0770n202J684O16J576J974o019n16J559J508J424O71J244r66J580K348
15940g289K076p47N474N375j792m920j054N06k359o577j30O401M352L408m124
15925a400k213J154N616j401m36L51o267n528k587k461L159L307l868L77Q327
15910c870L844l680r292r206j181O641Q717M061N612P02l579n535O96L956J450
15895f64r60L168n82J219J737L340m751L39M13J024j246M401K363j967q272j201
15879a639P37o132N099O272j023p338l055m65m99L139M302n157J690J352m099
15864f816L522L776J767j014M011m377j951q596o945J710M486j34m165m731J293
15849a8164J1594J0864n299M561L174n755l349P90J056M457J0550k840r344N38
$$ plain form
15835 2833 1708 4654 6055 6439 11056 16042 14517 15737 11013 16786 23644 25654 28895 33156 39764
15820 39764 48295 56413 71326 88464 124448 162803 210072 251359 295716 333530 345253 340123
15808 340123 320703 299212 274177 247568 238214 244144 266221 293761 327326 343892 337609 313447
15796 313447 276678 226190 175879 133244 97106 72633 57846 45059 34737 28311 22575 19334
15784 19334 17369 9823 11921 18896 22101 20380 17921 15905 13689 12372 7205 8113 8591 9762 9968
15769 9968 4222 -3659 -638 2522 -104 1207 3555 -845 -461 2793 8262 3701 4658 5340 440
15754 440 3890 1004 -2983 -7637 -8530 927 4983 4456 2606 3644 576 1896 6203 791 -5800
15739 -5800 -5235 673 5306 739 4738 7770 5738 6725 4659 5783 6808 9341 9027 4954 3297
$$ packed form
15835B833j125K946J401L84M617M986j525J220m724N773O858K010L241M261O608
15820C9764Q531Q118J4913J7138L5984L8355M7269M1287M4357L7814J1723n130
15808C40123j9420k1491k5035k6609r354N930K2077K7540L3565J6566o283k4162
15796C13447l6769n0488n0311m2635l6138k4473j4787j2787j0322o426n736l241
15784A9334j965p546K098O975L205j721k459k016k216j317n167R08M78J171K06
15769I968n746p881L021L160k626J311K348m400L84L254N469m561R57O82m900
15754D40L450k886l987m654q93R457M056n27j850J038l068J320M307n412o591
15739e800N65N908M633m567L999L032k032R87k066J124J025K533l14m073j657
$$ plain form
15724 3297 464 -203 -2314 -7290 -8779 -3829 670 10216 17507 18639 11348 5326 5909 2866 -35
15709 -35 -361 4346 7328 7553 1884 -3439 -12549 -9863 -509 -3210 -4397 -1997 2250 5602 6350 2911
15693 2911 -775 5483 10436 13200 13231 5729 2680 -577 -3390 -1091 -7070 -12709 -9741 -5323 2855
15678 2855 2189 -7365 -2044 -35 -1686 342 6868 8715 4972 2911 3523 366 280 1685 -2005 171
15662 171 7019 7202 8724 2348 -780 -4755 -1739 -2098 -4262 -318 -2284 -1373 1020 6515 4881 -2487
15646 -2487 -3599 -9356 -13852 -10763 -7690 -2297 4391 11138 10155 4697 1830 1110 -4827 -71 6755
15631 6755 -1874 -5976 -10170 -7165 -2255 -1512 1814 3582 6163 -4964 -6372 -1688 2967 1446 3532
15616 3532 9617 10203 4173 -571 2990 -2836 -6324 -8232 -13088 -13319 -11044 -5579 -10039 -13362 -1049
$$ packed form
15724C297k833o67k111m976j489M950M499R546P291J132p291o022N83l043k901
15709c5l26M707K982K25n669n323r110K686R354k701j187K400M247L352P48l439
15693B911l686O258M953K764L1p502l049l257k813K299n979n639K968M418Q178
15678B855o66r554N321K009j651K028O526J847l743k061O12l157q6J405l690K176
15662A71O848J83J522o376l128l975L016l59k164L944j966R11K393N495j634p368
15646b487j112n757m496L089L073N393O688O747r83n458k867p20n937M756O826
15631F755q629m102m194L005M910P43L326J768K581j1127j408M684M655j521K086
15616C532O085N86o030m744L561n826l488j908m856k31K275N465m460l323J2313
$$ plain form
15601 -1049 -1748 -4972 -9239 -14353 -16374 -15780 -16429 -17117 -13146 -8812 -10597 -10070 -7279 -9692 -11968 -16515
15585 -16515 -5626 -6421 -7750 -4010 -1489 -5343 -9017 -9505 -5495 -3134 76 -507 4664 -825 -443
15570 -443 -811 -3384 -11619 -12842 -12068 -13073 -13815 -7037 -5770 -10375 -8520 -2522 -108 -2991 -11372 -11237
15554 -11237 -7433 -2097 -3518 -3220 -8049 -15931 -21308 -19256 -13723 -7354 -6205 5907 4746 -2461
15540 -2461 -11579 -8634 -10576 -11445 -8037 -12044 -13604 -18272 -16330 -8252 -8417 -8557 -7476 -8032 -11524 -13798
15524 -13798 -10315 -5960 -14871 -16523 -3168 7448 4577 -303 -11055 -8945 -4968 -11228 -8719 -11344
15510 -11344 -8041 -10302 -4720 5327 7357 1332 -6388 -9843 -9092 -7024 -7502 -8122 -5502 721 269
15495 269 -3572 -6548 -7630 -3998 -8295 -10148 -2658 -4897 -11244 -9898 -1464 1841 4114 7052 4483
$$ packed form
15601a049o99l224m267n114k021N94o49o88L971M334j785N27K791k413k276m547
15585a6515J0889p95j329L740K521l854l674m88M010K361L210n83N171n489L82
15570d43l68k573q235j223P74j005p42O778J267m605J855N998K414k883q381J35
15554a1237L804N336j421K98m829p882n377K052N533O369J149J2112j161p207
15540b461r118K945j942q69L408m007j560m668J942Q078j65j40J081n56l492k274
15524a3798L483M355q911j652J3355J0616k871m880j0752K110L977o260K509k625
15510a1344L303k261N582J0047K030o025p720l455P51K068m78o20K620O223m52
15495B69l841k976j082L632m297j853P490k239o347J346Q434L305K273K938k569
$$ plain form
15480 4483 -5099 -8495 -3194 -5420 -8057 -6350 2060 8849 5726 6910 4817 1482 1760 -6139 -12831
15465 -12831 -12137 -8534 -7135 -11165 -12855 -4686 1537 3387 -724 -3180 1392 834 2189 9468 8483
15450 8483 -4063 -8489 -8666 -10093 -14415 -14183 -3104 2607 1325 2382 -580 1740 9491 7238 6091
15435 6091 8212 7681 3327 2369 3311 11343 7704 874 -788 1071 -1491 -5601 -975 308 856 2659
15419 2659 -1510 -2608 -13416 -14863 -10199 -4561 -337 -1778 166 4800 1590 -6922 -8320 -2549
15405 -2549 1951 -694 -2810 -3954 -1202 889 1920 3108 1175 4750 44 -1801 690 2387 -2180
15390 -2180 -3754 -4535 -9041 -3270 5316 4269 -1706 -3098 -2921 7424 8265 -4194 -11618 -13855 -12024
15375 -12024 -1190 3134 1549 -1157 -3745 -6066 -3371 5329 14819 11735 10486 8611 6821 6812 4118
$$ packed form
15480D483r582l396N301k226k637J707Q410O789l123J184k093l335K78p899o692
15465a2831O94L603J399m030j690Q169O223J850m111k456M572n58J355P279r85
15450H483j2546m426j77j427m322K32J1079N711j282J057k962K320P751k253j147
15435F091K121n31m354r58R42Q032l639o830j662J859k562m110M626J283N48J803
15419B659m169j098j0808j447M664N638M224j441J944M634l210q512j398N771
15405b549M500k645k116j144K752K091J031J188j933L575m706j845K491J697m567
15390b180j574p81m506N771Q586j047n975j392J77J0345Q41j2459p424k237J831
15375a2024J0834M324j585k706k588k321K695Q700R490l084j249j875j790rk694
$$ plain form
15360 4118 4243 2613 -5941 -6918 -9356 -8938 -5147 -3928 -623 2983 4434 5376 6029 -722 -1924 -2822
15344 -2822 224 5203 -817 4127 6374 238 -3432 -5399 -5468 -1489 1157 4456 2643 -910 -5854
15329 -5854 -3992 -1443 4499 7050 -3260 -3944 -4674 -3933 -3501 1949 1445 -1762 -1901 3757 3695 -2976
15313 -2976 -3435 -542 -2541 -3452 -5057 -8609 -4995 -7810 -6695 -4815 3329 15135 12893 11812 11519
15298 11519 6319 7004 1561 -9846 -12345 -8607 -7904 -5444 3079 9664 17051 19933 12165 6859 -3299
15283 -3299 -14731 -21039 -23441 -19421 -20969 -12879 -3562 -3033 -1423 -5880 -2959 -1898 2882 7832 13599
15268 13599 3733 -1423 2811 1851 2981 816 -2009 2601 8701 4514 6258 2368 -5281 -12869 -10321
15253 -10321 -4750 -7635 -6614 -10420 -10756 -12476 -9042 -4624 -4479 -1298 920 6554 -888 -2329 -2710
$$ packed form
15360D118J25j630q554r77k438M18L791J219L305L606J451R42O53o751j202q98
15344b822L046M979o020M944K247o136l670j967o9L979K646L299j813l553m944
15329e854J862K549N942K551j0310o84p30P41M32N450n04l207j39N658o2o671
15313b976m59K893j999r11j605l552L614k815J115J880Q144J1806k242j081k93
15298A1519n200O85n443j1407k499L738P03K460Q523O585P387K882p768n306j0158
15283c299j1432o308k402M020j548Q090R317N29J610m457K921J061M780M950N767
15268A3599r866n156M234r60J130k165k825M610O100m187J744l890p649p588K548
15253a0321N571k885J021l806l36j720L434M418J45L181K218N634p442j441l81
$$ plain form
15238 -2710 -2938 -247 9478 12622 13188 6239 -6490 -13300 -11915 -10874 -14633 -18360 -21822 -11976 -5847
15223 -5847 -10800 -13019 -12255 -9723 -2298 2278 -155 -2706 -5907 -8146 -9184 -6424 -9124 -11586 -16910
15208 -16910 -13829 -3231 -983 -1286 -498 -222 2994 -6246 -7970 -3828 -5257 -4389 -492 9999 11140
15193 11140 3039 -5189 -3676 -6248 -6877 -4858 -4791 -3956 -3473 -3689 -2423 -2736 -8172 -17083 -17669 -10393
15177 -10393 -1198 7177 9218 4556 -2783 -3783 -950 946 -121 -5188 -8817 -7429 -11216 -7351
15163 -7351 -5479 -3374 -1969 -5242 -11111 -12813 -3677 -4134 -7253 -10804 -11940 -2936 -1786 -9210 -10898
15148 -10898 -7356 -393 3750 2038 -6793 -8971 -4774 -3477 47 775 948 -5132 -8988 -11255 -9071
15133 -9071 -7245 -6257 961 631 4854 4034 12614 4131 -817 1303 -13796 -13513 -4016 -1626 1289
$$ packed form
15238b710k28K691R725L144N66o949j2729o810J385J041l759l727l462R846O129
15223e847m953k219P64K532P425M576k433k551l201k239j038K760k700k462n324
15208a6910L081J0598K248l03P88K76L216r240j724M142j429Q68L897J0491J141
15193A1140q101q228J513k572o29K019O7Q35M83k16J266l13n436q911n86P276
15177a0393R195Q375K041m662p339j000K833J896j067n067l629J388l787L865
15163g351J872K105J405l273n869j702R136m57l119l551j136R004J150p424j688
15148a0898L542O963M143j712q831k178M197J297L524P28J73o080l856k267K184
15133i071J826R88P218l30M223q20Q580q483m948K120j5099K83R497K390K915
$$ plain form
15118 1289 -1447 -7620 -9349 -12231 -6937 -4582 -3822 -8049 -12675 -12757 -9648 -7056 -6749 -2600 -4167 -8495
15102 -8495 -11102 -16249 -13660 -11412 -3829 -1432 -3069 -2105 -664 -647 -866 -4791 -5045 -1105 6405 2325
15086 2325 -5018 -6084 -4947 -13611 -20565 -21776 -18247 -16536 -13738 -5459 -2209 4242 2861 -2082 -9967
15071 -9967 -10011 -10929 -6478 -14372 -10815 -7118 1259 7924 4203 -2047 -3203 -11981 -16349 -16230 -5004
15056 -5004 -8403 -18118 -17850 -10601 -1890 -6282 -15987 -16908 -17201 -15132 -12920 -10694 -12626 -10538 -1659
15041 -1659 -321 -11855 -17838 -14116 -6324 -3830 -5998 -2446 -1509 -3864 -9045 -9611 -3674 -4292 -8896
15026 -8896 -12562 -13672 -12455 -9681 -10220 -16193 -18733 -15744 -4482 1069 -1866 -2388 -5964 -6929 -7440
15011 -7440 -5737 -4250 -3022 1240 6007 1672 -4678 -13304 -19739 -18760 -17281 -13142 -9590 -13577 -19267
$$ packed form
15118A289k736o173j729k882N294K355P60m227m626q2L109K592L07M149j567m328
15102h495k607n147K589K248P583K397j637R64J441J7k19l925k54L940P510m080
15086B325p343j066J137q664o954j211L529J711K798Q279L250O451j381m943p885
15071i967m4r18M451p894L557L697Q377O665l721o250j156q778m368J19J1226
15056e004l399r715K68P249Q711m392r705r21k93K069K212K226j932K088Q879
15041a659J338j1534n983L722P792K494k168L552R37k355n181n66N937o18m604
15026h896l666j110J217K774n39n973k540K989J1262N551k935n22l576r65n11
15011g440J703J487J228M262M767m335o350q626o435R79J479M139L552l987n690
$$ plain form
14996 -19267 -26105 -21223 -18352 -16201 -10986 -11000 -9207 -8206 -14335 -17106 -12878 -8137 -2355 -6800 -12268
14981 -12268 -12694 -16724 -10513 -7020 -6455 -4262 21 -5985 -7599 -3822 -5954 -10018 -13093 -10516 -2290
14966 -2290 -1122 -1780 -2839 -8802 -11424 -7999 -6329 -4193 -6766 -12165 -16971 -19021 -22287 -22468 -19644
14951 -19644 -10454 -12183 -15610 -10506 -8695 -1042 -5157 -13152 -18770 -21763 -14118 -8232 -3023 -2465 -1466
14936 -1466 -961 -2077 -2222 -1903 -6849 -9734 -11105 -7659 -5367 -5908 -7339 -1062 6465 11412 3489 -3235
14920 -3235 -7965 -3385 3697 1097 -975 -4345 -5455 -531 -652 -1547 -7803 -9428 -8669 -7370 -8954
14905 -8954 -11523 -10334 -7535 -8883 -14490 -13192 -12745 -12849 -10248 -8674 -11815 -11079 -2228 -3040 949 5446
14889 5446 966 -279 -1091 -3562 -3249 -5520 -10445 -17358 -16656 -6568 -9325 -16745 -18034 -19127 -16283
$$ packed form
14996a9267o838M882K871K151N215j4J793J001o129k771M228M741N782m445n468
14981a2268m26m030O211L493N65K193M283o006j614L777k132m064l075K577Q226
14966b290J168o58j059n963k622L425J670K136k573n399m806k050l266j81K824
14951a9644R190j729l427N104J811P653m115p995n618k993P645N886N209N58R99
14936a466N05j116j45L19m946k885j371L446K292n41j431O277P527M947p923o724
14920c235m730M580P082k600k072l370j110M924j21q95o256j625P59J299j584
14905h954k569J189K799j348n607J298M47j04K601J574l141P36Q851q12L989M497
14889E446m480j245q12k471L13k271m925o913P02J0088k757p420j289j093K844
$$ plain form
14874 -16283 -12704 -7304 -10468 -18042 -20182 -16951 -14225 -8284 -5828 -4240 -5792 -7319 -12127 -12867 -14298
14859 -14298 -13032 -11026 -9506 -11202 -9752 -9802 -450 -871 -4247 2700 3362 704 6373 8553 -2318
14844 -2318 -2162 -930 -5445 -4235 -2177 -6278 -6575 -4857 -4976 1085 -6326 -10949 -9889 -4897 247
14829 247 8961 11729 3874 -1909 -1888 -775 2357 4345 7546 2803 -4634 -1568 -927 -2023 -423 -1576
14813 -1576 -9029 -18114 -13683 -5823 669 7087 10927 6982 6096 3262 -390 -4168 -3219 -5853 -11852
14798 -11852 -10504 -12738 -10961 -4634 -3274 -1578 -2868 219 -1354 -1054 -865 1825 755 -4995 -10052
14783 -10052 -11612 -12796 -2900 3759 -5581 -12012 -19482 -12580 412 6935 3254 6031 3306 -5947
14769 -5947 -8875 -5206 539 518 1020 -8506 -10944 -7105 -7098 -5029 1468 7172 -1355 -10907 -10259 -10139 -7399
$$ packed form
14874a6283L579N400l164p574k140L231K726N941K456J588j552j527m808p40j431
14859a4298J266K006J520j696J450n0R352m21l376O947O62k658N669K180j0871
14844b318J56J232m515J210K058m101k97J718j19O061p411m623J060M992N144
14829B47Q714K768p855n783K1J113L132J988L201m743p437L066O41j096J600j153
14813a576p453r085M431P860O492O418L840l945q86k834l652l778R49k634n999
14798a1852J348k234J777O327J360J696j290L087j573L00J89K690j070n750n057
14783a0052j560j184R896O659r340o431p470O902J2992O523l681K777k725r253
14769e947k928L669N745k1N02r526k438L839PK069O497N704q527r552O48J20K740
$$ plain form
14752 -7399 -6544 -6150 -10764 -13490 -14556 -16633 -7652 855 1108 -2796 -5264 246 4997 210 -10354
14737 -10354 -11498 -11759 -5725 -2967 -6530 -5607 -5665 -3438 -6014 -3325 1855 4009 1886 1713 -1397 -4905
14721 -4905 -4030 -9720 -4188 -1750 2638 -1159 -1291 4552 6194 3265 2765 5339 2970 -3041 -3836 -4315
14705 -4315 1047 2077 3298 4199 10786 11886 8022 11476 5140 -541 111 6339 6415 2145 3841 5460
14689 5460 10534 15448 14879 14522 19082 17036 18424 20841 20140 19529 18781 17904 13917 17571 17506 18707 13009
14672 13009 8470 9047 10501 10358 9385 12905 21128 22043 16316 8121 9708 11627 11530 15450 16200 15401
14656 15401 12672 12779 18664 22923 18698 20590 13363 7439 9402 7425 6462 4768 9118 7484 6246
14641 6246 4289 7374 7297 1471 -3888 8783 9958 4705 4581 11650 13477 7641 -416 -2522 -443
$$ packed form
14752g399Q55L94m614k726j066k077Q981Q507K53l904k468N510M751m787j0564
14737a0354j144k61O034K758l563R23n8K227k576K689N180K154k123j73l110l508
14721d905Q75n690N532K438M388l797j32N843J642k929n00K574k369o011p95m79
14705d315N362J030J221R01O587J100l864L454o336n681O52O228P6m270J696J619
14689E460N074M914n69l57M560k046J388K417p01o11p48q77l987L654o5J201n698
14672A3009m539N77J454j43r73L520Q223R15n727q195J587J919r7L920P50p99
14656A5401k729J07N885M259m225J892p227n924J963j977r63j694M350j634j238
14641F246j957L085p7n826n359J2671J175n253j24P069J827n836q057k106K079
$$ plain form
14626 -443 3267 2990 -1139 -11436 -12278 -2193 3873 4366 7451 8108 1737 748 4578 9533 14300 11839
14610 11839 8980 9994 8894 5336 1392 6576 7029 7405 6644 13257 19896 20140 10334 4632 4333 5163
14594 5163 5978 7085 17415 25923 22199 23347 30451 41027 45010 36247 30345 31383 23300 22158
14580 22158 25368 27632 24230 21977 14994 13494 16741 17788 14455 10746 7970 10199 15993 13882
14566 13882 14411 19382 17809 15182 9825 6039 5560 13284 15572 9864 2288 -5702 -5074 -7359 -8851
14551 -8851 -4991 -4200 -5577 -9767 -17571 -18810 -12747 -8806 3150 6461 2238 -8140 -6817 -7108 -925
14536 -925 -3951 5808 8473 4208 4454 5532 6105 4712 3278 -2143 -4998 -5847 1554 5203 7477 -1678
14520 -1678 -5366 -2242 -9456 -15579 -12695 -5041 -1644 -870 5588 7549 13390 16504 11739 6812 5925
$$ packed form
14626d43L710k77m129j0297q42J0085O066M93L085O57o371r89L830M955M767k461
14610A1839k859J014j100l558l944N184M53L76p61O613O639K44r806n702k99Q30
14594E163Q15J107J0330Q508l724J148P104J0576L983q763n902J038q083j142
14580B2158L210K264l402k253o983j500L247J047l333l709k776K229N794k111
14566A3882N29M971j573k627n357l786m79P724K288n708p576p990O28k285j492
14551h851L860P91j377m190p804j239O063L941J1956L311m223j0378J323k91O183
14536i25l026R759K665m265K46J078N73j393j434n421k855q49P401L649K274r155
14520a678l688L124p214o123K884P654L397P74O458J961N841L114m765m927q87
$$ plain form
14505 5925 10386 2971 -3294 263 -2128 -9628 546 5984 3369 7322 7540 11205 7191 3164 1789
14490 1789 1071 -3992 -5394 -6265 -4428 4107 8763 2477 -3577 -1864 -1461 -1668 2029 -2144 -7533 -12393
14474 -12393 -7298 -780 4103 -4566 -10074 -3791 8551 6239 767 -1094 -215 -10621 -11436 -3782
14460 -3782 2063 115 -2954 265 1361 -4551 -14149 -15734 -15461 -13697 -9203 -5616 -818 239 1038
14445 1038 -5179 -4892 -6019 -4689 -3727 -885 -3348 -5955 -4906 -3042 -8773 -7077 -2149 183 -6562
14430 -6562 -11048 -2933 -5122 338 1547 3068 4037 -3459 -8987 -11774 -9018 -9569 -3263 -6565 -16931
14415 -16931 -15555 -6684 -3544 -4356 -7625 -13239 -11964 -14135 -12854 -13156 -9095 -10237 -13860 -11480 -7652
14400 -7652 -8521 -6442 -4080 -3792 -10128 -16061 -9749 -5128 -5393 -8927 -13971 -11588 -6687 -1423 872
$$ packed form
14505E925M461p415o265L557k391p500J0174N438k615L953K18L665m014m027j375
14490A789p18n063j402q71J837Q535M656o286o054J713M03k07L697m173n389m860
14474a2393N095O518M883q669n508O283J2342k312n472j861Q79j0406q15P654
14460c782N845j948l069L219J096n912r598j585K73J764M494L587M798J057P99
14445A038o217K87j127J330R62K842k463k607J049J864n731J696M928K332o745
14430f562m486Q115k189N460J209J521R69p496n528k787K756n51O306l302j0366
14415a6931J376Q871L140q12l269n614J275k171J281l02M061j142l623K380L828
14400g652q69K079K362K88o336n933O312M621k65l534n044K383M901N264K295
$$ plain form
14385 872 2568 2746 -7102 -18167 -18365 -13692 -13558 -11523 -7268 -8455 -9042 -10207 -10365 770 6234 -1898
14369 -1898 -3763 -2444 -7859 -8672 -4366 -6246 -4084 -8075 -12530 -16666 -11593 -10241 -9220 -3922 1461
14354 1461 5600 -410 -8242 -13612 -10769 -4327 2675 4712 32 -4489 -1190 3518 5157 3346 -5248
14339 -5248 -7335 -7985 -3077 -11015 -10970 -13743 -15917 -6922 -5476 -205 -173 -3623 -4663 -11663 -14802 -15654
14323 -15654 -11174 -7969 -6887 -4101 -4197 -455 -5317 -12511 -12422 -11072 -11635 -12716 -9586 -1301 -5700 -15452
14307 -15452 -18594 -24141 -16637 -13523 -8814 -7004 -6419 -1505 -2464 -3910 1642 -2658 -1492 6552 7511
14292 7511 5241 -1827 -5825 -8872 -9510 -14181 -14268 -15521 -12442 -6036 -5783 -7746 -8385 -10353 -8599 -16260
14276 -16260 -15200 -16347 -8502 -3132 -6314 -340 134 -998 -839 -3976 -5534 -9141 -11559 -11481 -10497 1769
$$ packed form
14385H72J696J78r848j1065j98M673J34K035M255j187n87j165j58J1135N464q132
14369a898j865J319n415q13M306j880K162l991m455m136N073J352J021N298N383
14354A461M139o010p832n370K843O442P002K037m680m521L299M708J639j811q594
14339e248k087o50M908p938M5k773k174Q995J446N271L2l450j040p000l139q52
14323a5654M480L205J082K786r6L742m862p194Q9J350n63j081L130Q285m399r752
14307a5452l142n547P504L114M709J810N85M914r59j446N552m300J166Q044R59
14292G511k270p068l998l047o38m671q7j253L079O406K53j963o39j968J754p661
14276a6260J060j147P845N370l182N974M74j132J59l137j558l607k418P8R84J2266
$$ plain form
14260 1769 3792 6619 6669 6658 4106 2986 -4594 -3754 -3826 -3579 -9827 -9056 -6833 -5604 -7569 -3367 -2139
14243 -2139 -9302 -4326 -4524 -10307 -9383 -13602 -16998 -10814 -9374 -5766 -9828 -14607 -14609 -12648 -9571 -9799
14227 -9799 -7659 -6886 -10875 -1190 6348 7797 5994 -4975 -7999 -8979 -10617 -8816 -11622 -6712 -4335
14212 -4335 -8669 -9541 -10421 -8765 -7289 -5998 -1792 -1440 -5934 -5067 -10 214 -5718 -11092 -3074 -5220
14196 -5220 -9623 -10485 -5767 -8961 -9722 -5857 -7336 -6669 -13578 -17795 -17738 -11055 -5362 -146 388 -7591
14180 -7591 -8231 -11007 -9407 -5677 -926 -7876 -11235 -11536 -5096 -4942 -7967 -2753 2510 1573 1395 -5023
14164 -5023 -3791 -445 1182 -1887 -2145 -2355 -7999 -11826 -7076 -9698 -8812 -5857 -26 1925 -3938
14149 -3938 -9001 -10764 -11965 -16482 -16779 -10324 -13134 -13767 -15321 -9817 -11211 -11248 2368 6243 4391
$$ packed form
14260A769K023K827N0j1k552j120p580Q40p2K47o248P71K223J229j965M202J228
14243b139p163M976j98n783R24m219l396O184J440L608m062m779kJ961L077k28
14227i799K140P73l989R685P538J449j803j0969l024r80j638J801k806M910K377
14212d335m334q72q80J656J476J291M206L52m494Q67N057K24n932n374Q018k146
14196e220m403q62M718l194p61L865j479O67o909m217N7O683N693N216N34p979
14180g591o40k776J600L730M751o950l359l01O440J54l025N214N263r37j78o418
14164e023J232L346J627l069k58k10n644l827M750k622Q86K955N831J951n863
14149c938n063j763j201m517k97O455k810o33j554N504j394l7J3616L875j852
$$ plain form
14134 4391 736 -4032 -2224 3043 -1069 221 -1801 1716 4153 -3916 -5440 -3307 3721 10082 12080
14119 12080 7877 4715 3796 4026 4147 4507 6756 6472 8353 6987 3450 2258 58 9362 12410 10217
14103 10217 2581 -4185 467 -5793 -8697 -4909 6960 10518 7492 9632 10380 9901 8014 9730 7283
14088 7283 243 -8659 -15145 -8921 4845 9754 6410 1428 -393 -1887 -1885 300 7206 6668 -1636
14073 -1636 -2421 2649 -3559 -12035 -11237 -8018 -5174 -6708 -14920 -20164 -11063 -8374 -9407 -8190 -13135
14058 -13135 -11981 -3664 -7335 -8553 -13532 -14439 -13741 -15548 -15187 -9319 -1162 -2545 -4262 841 -4208
14043 -4208 -9717 -12554 -17839 -11313 -574 1549 -2532 -12510 -18316 -17594 -9878 -3049 -1609 -180 -5758
14028 -5758 -4025 -4317 -7123 -6845 -5932 -394 5186 2499 3919 3897 3820 -6762 -3868 -1181 -2436 -5003
$$ packed form
14134D391l655m768J808N267m112J290k022L517K437q069j524K133P028O361J998
14119A2080m203l162r19K30J21L60K249k84J881j366l537j192k200R304L048k193
14103A0217p636o766M652o260k904L788J1869L558l026K140P48m79j887J716k447
14088G283p040q902o486O224J3766M909l344m982j821j494KK185O906n38q304
14073a636p85N070o208q476P98L219K844j534q212n244R101K689j033J217m945
14058a3135J154Q317l671j218m979r07O98j807L61N868Q157j383j717N103n049
14043d208n509k837n285O526J0739K123m081r978n806P22P716O829J440J429n578
14028e758J733k92k806K78R13N538N580k687J420k2p7j0582K894K687j255k567
$$ plain form
14012 -5003 2532 9104 4706 395 -1916 -4304 2481 6004 -436 -9470 -5092 6787 -5178 -13683
13998 -13683 -14386 -11808 -9460 -9256 -8981 -3089 -5012 -2614 -102 -190 -8163 -12143 -8012 -6290 -3076 -611
13982 -611 3323 -2273 -5175 -4669 -7848 -14202 -8468 -6828 -6206 -3398 -4889 -6777 3103 7252 7009 3816
13966 3816 -4979 -6080 -10988 -18639 -14119 -9902 -6274 -1236 -6000 -10373 -6598 -2391 -2281 -290 -318
13951 -318 194 -1093 -1714 -7368 -9835 -6935 -5231 -4410 -1302 -908 -3346 -3478 -4599 -3363 -2228 -66
13935 -66 -2634 -4526 -7003 -1886 2280 9275 8584 10417 1477 -392 8690 9956 8228 7932 6670 1899
13919 1899 -4086 -3632 1882 9220 3466 4955 10855 3282 2221 2452 5637 1738 -4454 -6606 -7829
13904 -7829 -1621 4864 5081 3884 -1527 -5856 -7464 -9528 -8627 -8688 -10377 -5584 -1036 -4551 -8019 -4713
$$ packed form
14012e003P535O572m398m311k311k388O785L523o440r034M378J1879j1965q505
13998a3683p03K578K348K04K75N892j923K398K512q8p973l980M131J722L214K465
13982f11L934n596k902N06l179o354N734J640O22K808j491j888R880M149k43l193
13966C816q795j101m908p651M520M217L628N038m764m373L775M207J10J991k8
13951c18N12j287o21n654k467K900J704Q21L108L94k438j32j121J236J135K162
13935f6k568j892k477N117M166O995o91J833q940j869R082J266j728k96j262m771
13919A899n985M54N514P338n754J489N900p573j061K31L185l899o192k152j223
13904g829O208O485K17j197n411m329j608k064R01o1j689M793M548l515l468L306
$$ plain form
13888 -4713 273 3261 -25 -10339 -14492 -7383 -5822 -7987 -8274 -10386 -14992 -14766 -14128 -20192 -17320
13873 -17320 -17283 -13007 -8625 -11130 -13293 -11983 -17444 -13872 -12669 -2881 -3174 3970 676 -5975 -9787
13858 -9787 -7898 -9788 -7374 -1304 -2108 -5097 -13370 -16385 -15315 -7009 536 -3651 -3686 -5485 -8639
13843 -8639 -9707 -9614 -8762 -8206 -1036 -2404 1008 3629 -525 -715 -1571 -4514 -612 4991 2022 -3382
13827 -3382 -9179 -9402 -6170 -7259 -11702 -13481 -7485 -670 2815 -3919 -7811 -2511 7383 2741 4865
13812 4865 11036 6315 3755 3122 -3995 -10732 -9422 -8721 -2740 -1480 655 5920 15250 17629 9471
13797 9471 6589 1039 -1537 -3844 -4162 -1806 -4430 -3050 -3375 -1154 -784 1079 1375 3280 2911 2947
13781 2947 3289 4915 12103 13234 13301 14848 15445 17064 30111 43643 54065 66370 76004 91081
$$ packed form
13888d713M986K988l286j0314m153P109J561k165k87k112m606K26O38o064K872
13873a7320L7M276M382k505k163J310n461L572J203R788k93P144l294o651l812
13858i787J889j890K414O070q04k989q273l015J070Q306P545m187l5j799l154
13843h639j068R3Q52N56P170j368L412K621m154j90q56k943L902N603k969n404
13827c382n797k23L232j089m443j779N996O815L485o734l892N300R894m642K124
13812D865O171m721k560o33p117o737J310P01N981J260K135N265R330K379q158
13797I471k882n550k576k307l18K356k624J380l25K221L70J863K96J905l69L6
13781B947L42J626P188J131O7J547N97J619J3047J3532J0422J2305R634J5077
$$ plain form
13767 91081 99866 106854 122894 141536 169720 206267 244285 299915 386980 528161 735569 995142
13755 995142 1311942 1594076 1799191 1868090 1764605 1545661 1231919 913644 641949 434468
13745 434468 304599 224026 166311 129067 110368 92165 68824 61967 63540 59829 42786 32099
13733 32099 27600 27989 26490 23216 17065 16685 19785 21475 16316 10106 2358 2494 -1260 3248 6136
13718 6136 7206 11181 14940 11747 9146 8974 7779 -3380 -11400 -1324 8493 9925 5734 382
13704 382 903 -193 -3158 -4524 -2328 818 1278 -2683 -3810 -8213 -14197 -16610 -6083 -2319 -4960
13689 -4960 -4935 -5699 -3592 -3874 931 6472 2133 -286 3888 7275 7176 13461 12020 9756 11819 14371
13673 14371 18810 16964 19038 15564 15132 15012 9290 8387 14110 14782 13116 12231 10572 7977 8951 8480
$$ packed form
13767I1081Q785O988J6040J8642K8184L6547L8018N5630Q7065J41181K07408K59573
13755I95142L16800K82134K05115O8899j03485k18944l13742l18275k71695k07481
13745D34468j29869q0573n7715l7244j8699j8203k3341o857J573l711j7043j0687
13733C2099m499L89j499l274o151l80L100J690n159o210p748J36l754M508K888
13718F136J070L975L759l193k601j72j195j1159q020J0076R817J432m191n352
13704C82N21j096k965j366K196L146M60l961j127m403n984k413J0527L764k641
13689d960K5p64K107k82M805N541m339k419M174L387r9O285j441k264K063K552
13673A4371M439j846K074l474m32j20n722r03N723O72j666q85j659k595R74m71
$$ plain form
13657 8480 5645 230 -1183 15 5775 3953 7589 8381 9318 12591 9118 3987 -3040 -5369 -1914
13642 -1914 -2226 -3258 -6460 -8906 -11150 -7986 -423 -126 -1852 3071 89 -5484 -5381 -3312 1374
13627 1374 -2368 -2660 -8262 -4693 -3685 -6253 -6127 -2986 -1057 4938 6563 1984 1999 -6361 -9119 -11649
13611 -11649 -8734 -6176 -5836 -3346 -4818 207 5217 2601 -7126 -3853 -128 467 2130 4674 723
13596 723 3801 2764 1946 5267 7204 9816 12552 11124 11564 11708 10975 9522 6550 -3105 -8637 -13303
13580 -13303 -14556 -11802 -10113 -8119 1683 -1131 -4631 -863 -2086 -5827 -7413 -12221 -23813 -23627
13566 -23627 -16420 -12237 -8413 -13896 -9592 -8449 -7751 -4001 -1704 2220 2051 1286 2975 -1386 -1656
13551 -1656 433 -2013 -2649 2203 1450 -3695 -4166 -7673 -12033 -7129 -3644 -7364 -3751 -7853 -7551 -9887
$$ packed form
13657H480k835n415j413J198N760j822L636P92R37L273l473n131p027k329L455
13642a914l12j032l202k446k244L164P563K97j726M923k982n573J03K069M686
13627A374l742k92n602L569J008k568J26L141J929N995J625m579J5q360k758k530
13611a1649K915K558L40K490j472N025N010k616r727L273L725N95J663K544l951
13596G23L078j037q18L321J937K612K736j428M40J44p33j453k972r655n532m666
13580a3303j253K754J689J994R802k814l500L768j223l741j586m808j1592J86
13566b3627P207M183L824n483M304J143O98L750K297L924j69p65J689m361k70
13551a656K089k446o36M852p53n145m71l507m360M904L485l720L613m102L02k336
$$ plain form
13535 -9887 -5934 -5305 -8764 -13815 -9539 -10162 -6899 2113 5015 1220 -973 -8558 -9689 -10729 -13087
13520 -13087 -12364 1754 7435 1371 -2366 -5963 -8360 -5580 -2548 -6038 -3238 1803 -4881 -3390
13506 -3390 -3284 1183 6506 10844 12040 7076 4964 5316 4649 1656 2781 4110 2594 -3060 -3753 -9869
13490 -9869 -8917 -4995 -10172 -9182 1613 2678 -1428 -663 -1641 -656 -280 -82 1408 185 -1147 -6546
13474 -6546 -5074 -6561 -1755 2343 1665 4539 6865 5516 7457 3616 3479 2913 -1279 2465 7441
13459 7441 3131 1943 10013 6328 3510 6796 6994 2288 1993 -2336 -2756 -8612 -7063 1391 -2880
13444 -2880 -9742 -9669 -3194 3905 3059 -2158 -8626 -13283 -19653 -15880 -9755 -14854 -15826 -13568 -7877 -197
13428 -197 3349 6792 2252 -2067 -8636 -13706 -7543 -3216 -1964 -1045 -459 1627 -319 -6980 -10313
$$ packed form
13535i887L953O29l459n051M276o23L263R012K902l795k193p585j131j040k358
13520a3087P23J4118N681o064l737l597k397K780L032l490K800N041o684J491
13506c390J06M467N323M338J196m964k112L52o67k993J125J329j516n654o93o116
13490i869R52L922n177R90J0795J065m106P65r78R85L76J98J490j223j332n399
13474f546J472j487M806M098o78K874K326j349J941l841j37n66m192L744M976
13459G441m310j188Q070l685k818L286J98m706k95m329m20n856J549Q454m271
13444b880o862P3O475P099q46n217o468m657o370L773O125n099r72K258N691P680
13428a97L546L443m540m319o569n070O163M327J252R19N86K086j946o661l333
$$ plain form
13413 -10313 -12030 -6851 -12614 -6406 -2614 -5752 -6700 -9481 -7527 -2656 -569 -795 -9267 -9401 -4276
13398 -4276 4229 5596 2707 1941 -1068 3925 6020 6551 8751 8024 6293 4752 4473 4412 1208 910
13382 910 4261 6033 5344 6994 2420 -5432 -7046 -976 -388 -7315 -4029 434 -110 -825 1433 1181
13366 1181 2567 -505 64 890 -186 1532 5741 10047 11141 8895 4022 854 -434 -1211 1295
13351 1295 2810 -3576 -1205 583 5565 1742 -48 -5012 -5912 -1287 1881 516 -1089 1109 2290
13336 2290 -2888 -367 -3395 111 1968 5343 2177 2927 4159 869 -3875 -11656 -14106 -7991 -2943
13321 -2943 1187 8484 21831 23952 12762 -977 -9528 -13340 -10541 -3858 -978 2485 1803 -194
13307 -194 -6388 -9126 -15233 -14929 -11233 -1447 -578 1314 7687 14456 14475 9534 1279 -1695 506 -1741
$$ packed form
13413a0313j717N179n763O208L792l138r48k781J954M871K087k26q472j34N125
13398d276Q505J367k889p66l009M993K095N31K200p27j731j541k79o1l204k98
13382I10L351J772o89J650m574p852j614O070N88o927L286M463n44p15K258k52
13366A181J386l072N69Q26j076J718M209M306J094k246m873l168j288p77K506
13351A295J515o386K371J788M982l823j790m964r00M625L168j365j605K198J181
13336B290n178K521l028L506J857L375l166P50J232l290m744p781k450O115N048
13321b943M130P297J3347K121j1190j3739q551l812K799O683K880L463o82j997
13307a94o194k738o107L04L696R786Q69J892O373O769J9m941q255k974K201k247
$$ plain form
13291 -1741 -6225 -11715 -9853 -11218 -8061 -1858 3989 1233 -5009 -8474 -7065 -2395 -4010 -10180 -9170
13276 -9170 -2631 -5434 -12063 -11584 -3410 5022 4960 4856 5991 2946 -1095 1558 6450 5426 7513 16848
13260 16848 16920 12100 4524 983 4223 5556 6506 7719 2604 5065 3373 -6578 2671 6925 4499
13245 4499 1513 -421 -4894 -10890 -9947 -5879 -2721 -4265 -5727 -11125 -16916 -11539 -1617 2084 5708
13230 5708 7543 1746 938 518 10471 9504 -73 -4590 -581 7884 10054 -1118 -9315 -9342 -5585 -281
13214 -281 1362 -6982 -8125 -8004 805 7187 8256 9903 5976 3605 6464 -499 -4172 -61 3182
13199 3182 934 7183 5296 -1894 -5236 -1352 5504 5433 7832 9915 9251 6640 6544 7369 9896 7384
13183 7384 2762 -1912 -3488 -7549 -7567 -5221 3311 6086 41 -6750 -1147 8462 4468 -2840 224
$$ packed form
13291a741m484n490J862j365L157O203N847k756o242l465J409M670j615o170J010
13276i170O539k803o629M79Q174Q432o2j04J135l045m041K653M892j024K087R335
13260A6848P2m820p576l541L240J333R50J213n115K461j692r951R249M254k426
13245D499k986j934m473n996R43M068L158j544j462n398n791N377R922L701L624
13230E708J835n797q08m20R953r67r577m517M009Q465K170j1172q197k7L757N304
13214b81J643q344j143J21Q809O382J069J647l927k371K859o963l673M111L243
13199C182k248O249j887p190l342L884O856p1K399K083o64k611r6Q25K527k512
13183G384m622m674j576m061j8K346Q532K775o045o791N603R609l994p308L064
$$ plain form
13168 224 2619 -1684 -1819 2232 5162 1236 -4726 3412 6433 -3369 -9060 -5586 -1517 -8028 -10397
13153 -10397 -6902 -8144 -5203 -7627 -4566 1435 -5950 -7180 -4635 462 4913 6573 5281 2911
13139 2911 2780 8414 10063 6039 4218 6928 10636 11198 9110 6614 11739 12699 9745 286 -2264
13124 -2264 -4255 -770 7360 1868 -1082 4597 8078 3502 -1581 -2512 -5834 -7426 -10056 -4082 997
13109 997 1483 7050 5196 3515 2418 -128 4444 6860 6968 5574 1868 1276 6211 1051 -1614 -3921
13093 -3921 344 -1700 198 -2059 -440 6311 13562 17926 15913 10704 5806 -445 -1221 -529 -397
13078 -397 1639 4232 5439 7496 10865 9268 8904 5813 6326 8263 13427 12478 9956 9708 4591 2748
13062 2748 2991 8323 4703 10420 807 -2304 4958 2916 140 20 2653 2425 11715 9233 6561
$$ packed form
13168B24K395m303j35M051K930l926n962Q138L021r802n691L474M069o511k369
13153a0397L495j242K941k424L061O001p385j230K545N097M451J660j292k370
13139B911j31N634J649m024j821K710L708N62k088k496N125R60k954r459k550
13124b264j991L485Q130n492k950N679L481m576n083r31l322j592k630N974N079
13109I97M86N567j854j681j097k546M572K416J08j394l706n92M935n160k665k307
13093c921M265k044J898k257J619O751P251M364k013n209m898o251p76O92J32
13078c97K036K593J207K057L369j597l64l091N13J937N164r49k522k48n117j843
13062B748K43N332l620N717r613l111P262k042k776j20K633k28R290k482k672
$$ plain form
13047 6561 6103 12489 12831 9175 1457 -3616 2167 6717 8560 12090 19346 14755 9891 7918 5990
13032 5990 -30 -5160 1112 6120 4032 12767 21043 19097 16477 13635 11106 11145 9919 4928 1871
13017 1871 3896 13769 14806 5753 1489 -83 3636 16655 23343 18059 17458 17560 13503 14034 22216
13002 22216 24201 19588 14062 12884 18093 12433 17140 23118 18208 10205 6019 4798 1170 3188
12988 3188 2587 1978 -6188 -6045 -750 3407 6889 11954 8818 3787 3482 8925 11627 13013 18597 24139
12972 24139 27194 26305 28553 28008 35141 36196 36441 38396 47445 58937 72654 77204 82529 88445 99298
12957 99298 120985 142767 147768 151746 165874 193382 238989 314142 411752 532108 694390 887988
12945 887988 1071165 1205986 1312979 1337165 1251486 1113212 926067 722357 543755 403534
$$ packed form
13047F561m58O386L42l656p718n073N783M550J843L530P256m591m864j973j928
13032E990o020n130O272N008k088Q735Q276j946k620k842k529L9j226m991l057
13017A871K025R873J037r053m264j572L719J3019O688n284o01J02m057N31Q182
13002B2216J985m613n526j178N209n660M707N978m910q003m186j221l628K018
12988C188o01o09q166J43N295M157L482N065l136n031l05N443K702J386N584N542
12972B4139L055q89K248n45P133J055K45J955R049J1492J3717M550N325N916J0853
12957I9298K1687K1782N001L978J4128K7508M5607P5153R7610J20356J62282J93598
12945H87988J83177J34821J06993K4186q5679j38274j87145k03710j78602j40221
$$ plain form
12935 403534 292740 215749 165696 126996 106870 96428 83451 72180 66802 56273 53425 47388
12923 47388 39466 36158 32760 28905 31000 33587 32949 35072 43002 42380 37857 35158 35428 34185 32463
12908 32463 23895 18794 21526 18788 18207 21735 23978 18260 13998 17950 15277 18285 12390 8252 7822
12893 7822 13346 11053 14172 14216 16522 19291 18007 18877 17403 20278 8981 12598 16855 18302 19140
12878 19140 19702 14048 13131 19663 22871 13612 13590 11977 7728 12820 13391 12040 12415 9525 15428 17800
12862 17800 15549 13470 15749 15020 8620 3672 1947 -2491 566 6564 4990 -3627 -9093 -8689 547
12847 547 8278 8849 5656 5814 1816 1217 478 1505 -3781 -8689 -5950 -2932 -6914 -5978 -1752 2550
12831 2550 13922 10325 5093 4934 13708 22395 26083 33237 40462 44903 42177 39745 41714 51302 51147
$$ packed form
12935D03534j10794p6991n0053l8700k0126j0442j2977j1271n378j0529k848o037
12923D7388p922l308l398l855K095K587o38K123P930o22m523k699K70j243j722
12908C2463q568n101K732k738n81L528K243n718m262L952k673L008n895m138m30
12893G822N524k293L119M4K306K769j284Q70j474K875j1297L617M257J447Q38
12878A9140N62n654r17O532L208r259k2j613m249N092N71j351L75k890N903K372
12862A7800k251k079K279p29o400m948j725m438L057N998j574q617n466M04R236
12847E47P731N71l193J58l998n99p39J027n286m908K739L018l982R36M226M302
12831B550J1372l597n232j59Q774Q687L688P154P225M441k726k432J969R588j55
$$ plain form
12816 51147 52961 53224 48120 40350 39817 42387 42835 34258 33716 36910 35319 38840 37699 38394 35502 33623
12800 33623 39194 41316 43044 39403 29409 20786 23078 24354 22782 22470 22002 23940 32270 28867 27023
12785 27023 30285 32086 32777 30789 36926 30076 33696 40248 57149 72432 96454 129566 163630
12772 163630 192659 218253 231727 224368 217687 200066 170185 141431 108309 89874 74753 60031
12760 60031 53574 46364 42114 44772 39480 35193 41525 49068 50837 51440 55664 64554 59702 55072 54141
12745 54141 46005 42794 48051 48701 45686 43740 34966 33854 38488 34256 35028 41257 38339 34617 33230
12730 33230 39149 33020 28241 28694 28475 33830 37646 38615 39678 50424 61582 68591 70895 77870 77492
12715 77492 72094 61366 57822 52193 37880 26407 24278 23578 19440 11100 5113 -2508 -11652 -24203
$$ packed form
12816E1147J814K63n104p770n33K570M48q577n42L194j591L521j141O95k892j879
12800C3623N571K122J728l641r994q623K292J276j572l12m68J938Q330l403j844
12785B7023L262J801O91j988O137o850L620O552J6901J5283K4022L3112L4064
12772A63630K9029K5594J3474p359o681j7621k9881k8754l3122j8435j5121j4722
12760F0031o457p210m250K658n292m287O332P543J769O03M224Q890m852m630r31
12745E4141q136l211N257O50l015j946q774j112M634m232P72O229k918l722j387
12730C3230N919o129m779M53k19N355L816R69J063J0746J1158P009K304O975l78
12715G7492n398j0728l544n629j4313j1473k129p00m138q340n987p621r144j2551
$$ plain form
12701 -24203 -38462 -46619 -51002 -56307 -56526 -52875 -41693 -34318 -25507 -23483 -24035 -27603 -26470 -22318
12687 -22318 -20495 -15548 -15352 -13473 2149 20030 39892 50907 58613 58672 63389 72013 72434 74905
12673 74905 66323 51475 35052 26539 26456 17831 9729 13316 19947 17567 13316 14483 12226 13177 17833
12658 17833 20695 28057 33915 37472 38129 41370 42666 38893 42516 42986 37183 31672 46448 76528
12644 76528 100390 135753 167099 180758 197674 195383 189773 188301 185275 177464 176568 181078 185914
12631 185914 180123 177536 184717 187390 186057 189580 198212 201281 196616 190539 179726 171055 166103 154202
12617 154202 148771 148932 147399 154005 168751 178663 188278 193894 203660 219658 233634 242903 246336 244687
12603 244687 240970 243199 255409 270872 281663 295778 305867 315390 317369 319259 318849 316549 315219
$$ packed form
12701b4203j4259q157m383n305k19L651J1182P375Q811K024n52l568J133M152
12687b2318J823M947J96J879J5622J7881J9862J1015P706N9M717Q624M21K471
12673G4905q582j4848j6423q513q3q625q102L587O631k380m251J167k257R51M656
12658A7833K862P362N858L557O57L241J296l773L623M70n803n511J4776L0080
12644G6528K3862L5363L1346J3659J6916k291n610j472l026p811q96M510M836
12631A85914n791k587P181K673j333L523Q632L069m665o077j0813q671m952j1901
12617A54202n431J61j533O606J4746R912R615N616R766J5998J3976R269L433j649
12603B44687l717K229J2210J5463J0791J4115J0089R523J979J890m10k300j330
$$ plain form
12590 315219 324090 341818 363594 383440 405364 424303 445960 470161 482673 482058 481242 478283 479017
12577 479017 485087 498691 515709 541853 574035 604618 626889 635632 650352 681389 711880 726947
12565 726947 744298 765306 798522 847000 917287 999243 1096321 1208926 1329771 1442147 1528453
12554 1528453 1598621 1692804 1827488 2018361 2272158 2583053 2986382 3438483 3675275 3684730
12544 3684730 3687347 3859761 4190939 4566309 4930375 5334157 5874473 6610059 7586656 8836759
12534 8836759 10371780 12219088 14333068 16623287 19089809 21802385 24965886 29007737
12526 29007737 34380883 41905874 52937411 69239852 91900779 119596605 152627618
12519 152627618 187770738 213735426 233384488 242464160 231433538 210886972 181988857
$$ packed form
12590C15219Q871J7728K1776J9846K1924J8939K1657K4201J2512o15q16k959P34
12577D79017O070J3604J7018K6144L2182L0583K2271Q743J4720L1037L0491J5067
12565G26947J7351K1008L3216M8478P0287Q1956R7078J12605J20845J12376Q6306
12554A528453P0168R4183J34684J90873K53797L10895M03329M52101K36792R455
12544C684730K617J72414L31178L75370L64066M03782N40316P35586R76597J250103
12534H836759J535021J847308K113980K290219K466522K712576L163501M041851
12526B9007737N373146P524991J1031537J6302441K2660927K7695826L3031013
12519A52627618L5143120K5964688J9649062R079672j1030622k0546566k8898115
$$ plain form
12512 181988857 146224595 111916369 82741274 60056274 43796874 33205876 26767176
12505 26767176 22834336 19931747 17184272 14703756 12688692 11110738 9837415 8701602
12497 8701602 7646501 6718105 5940389 5288272 4763008 4381784 4132625 3981538 3830524
12488 3830524 3597398 3289164 2994425 2783921 2631835 2483740 2340115 2231178 2182889 2183632
12478 2183632 2161834 2063685 1917941 1776146 1687881 1650273 1652344 1688499 1754738 1835478 1902940
12467 1902940 1918250 1865454 1834622 1911806 2115138 2218473 2006726 1648634 1310070 1075498
12457 1075498 932774 863275 825824 806748 796887 760811 703209 636910 584929 538027 509293
12446 509293 491539 489874 501996 501245 495971 471343 446806 430527 425476 422801 415150 401423 384896
$$ packed form
12512A81988857l5764262l4308226k9175095k2685000j6259400j0590998o438700
12505B6767176l932840k902589k747475k480516k015064j577954j273323j135813
12497H701602j055101r28396p77716o52117n25264l81224k49159j51087j51014
12488C830524k33126l08234k94739k10504j52086j48095j43625j08937m8289P43
12478B183632k1798r8149j45744j41795q8265l7608K071L6155O6239Q0740O7462
12467A902940J5310n2796l0832P7184K03332J03335k11747l58092l38564k34572
12457A075498j42724o9499l7451j9076r861l6076n7602o6299n1981m6902k8734
12446E09293j7754j665J2122p51n274k4628k4537j6279n051k675p651j3727j6527
$$ plain form
12433 384896 362633 349661 341053 338471 328670 323065 315742 324127 326975 308829 280769 265343 259696
12420 259696 258835 249947 244996 238817 230082 218367 207995 192513 169800 153715 149993 151816 147619
12407 147619 148221 147226 152448 157629 153059 158635 169380 172950 182348 188003 200511 208081 202697 200817
12393 200817 193475 183900 184122 185619 188935 205110 212047 213563 221707 225746 227316 222673 212525 208566
12379 208566 207945 194357 178573 172310 169249 171478 174662 180544 182348 175974 165477 167604 167885 168264
12365 168264 165241 156843 148999 139077 126502 112046 98867 92118 87042 86794 87329 84937 85646 87578
12351 87578 100222 121900 134187 136427 140911 139670 137594 143068 146842 149441 154527 165095 180150
12338 180150 191849 203232 217636 227016 220957 211872 192601 171864 150155 129152 110798 94142
$$ packed form
12433C84896k2263j2972q608k582r801n605p323Q385K848j8146k8060j5426n647
12420B59696q61q888m951o179q735j1715j0372j5482k2713j6085l722J823m197
12407A47619O02r95N222N181m570N576J0745L570R398N655J2508P570n384j880
12393B00817p342r575K22J497L316J6175O937J516Q144M039J570m643j0148l959
12379B08566o21j3588j5784o263l061K229L184N882J804o374j0497K127K81L79
12365A68264l023q398p844r922j2575j4456j3179o749n076k48N35k392P09J932
12351H7578J2644K1678J2287K240M484j241k076N474L774K599N086J0568J5055
12338A80150J1699J1383J4404R380o059r085j9271k0737k1709k1003j8354j6656
$$ plain form
12326 94142 86949 81154 74679 63436 59615 54686 52433 49408 45298 39559 31003 25713 22581 25235
12312 25235 37688 49642 55014 61287 68652 66861 60724 56548 57027 58177 55675 50788 51488 53732
12298 53732 62074 70614 83366 91830 96830 94216 90057 75840 60732 52169 39358 27894 22608
12285 22608 16135 11432 17986 20342 22085 23205 22858 28607 31644 33500 36525 36874 36086 33058 40764
12270 40764 49081 55437 58700 66094 67965 64661 59937 54658 43976 29613 19934 14721 22228 24729
12256 24729 30276 41026 46547 54638 66536 72034 65853 43241 29063 26196 22956 22583 21850 17535
12242 17535 13039 16417 21927 21660 17211 7515 5032 6029 -2480 -2426 -2249 -2530 -780 -4691 475 7150
12226 7150 7690 14848 16483 3386 -3193 -2747 -3032 -2541 6196 6683 4560 -5310 -11808 -9598 -14261 -20275
$$ packed form
12326I4142p193n795o475j1243l821m929k253l025m110n739q556n290l132K654
12312B5235J2453J1954N372O273P365j791o137m176M79J150k502m887P00K244
12298E3732Q342Q540J2752Q464N000k614m159j4217j5108q563j2811j1464n286
12285B2608o473m703O554K356J743J120l47N749L037J856L025L49p88l028P706
12270D0764Q317O356L263P394J871l304m724n279j0682j4363r679n213P507K501
12256B4729N547J0750N521Q091J1898N498o181k2612j4178k867l240l73p33m315
12242A7535m496L378N510k67m449r696k483R97q509N4J77k81J750l911N166O675
12226G150N40P158J635j3097o579M46k85M91Q737M87k123r870o498K210m663o014
$$ plain form
12210 -20275 -16395 -6579 881 9545 14089 20015 26291 28378 26125 22783 26275 20985 15982 13619
12196 13619 8896 11602 17444 21417 23500 19591 19443 23919 22243 19829 24416 26220 25534 24373 21321
12181 21321 24769 26199 22510 25849 25834 18237 22117 26721 19928 10024 12649 10464 12397 20994 26891
12166 26891 30878 29122 15492 11596 19739 17454 21584 15643 8011 5578 4154 -790 -1015 685
12152 685 4100 842 -265 3159 4918 8421 13431 17061 20822 25861 18714 14824 13871 13066 17845
12137 17845 19606 17221 16819 20627 18471 16499 11754 3913 -376 5486 12756 11707 8276 2750 5843
12122 5843 8139 5352 6912 10308 12875 15531 12967 12636 14310 19483 22352 20197 13533 15495 20318
12107 20318 25419 23668 24936 25538 27229 39418 56896 65107 72700 87925 102542 116065 125279
$$ packed form
12210b0275L880R816P460Q664M544N926O276K087k253l342L492n290n003k363
12196A3619m723K706N842L973K083l909j48M476j676k414M587J804o86j161l052
12181B1321L448J430l689L339j5p597L880M604o793r904K625k185J933Q597N897
12166B6891L987j756j3630l896Q143k285M130n941p632k433j424m944k25J700
12152F85L415l258j107L424J759L503N010L630L761N039p147l890r53q05M779
12137A7845J761k385m02L808k156j972m745p841m289N862P270j049l431n526L093
12122E843K296k787J560L396K567K656k564l31J674N173K869k155o664J962M823
12107B0318N101j751J268O02J691J2189J7478Q211P593J5225J4617J3523R214
$$ plain form
12094 125279 149048 183704 230428 298726 391733 512869 661165 838583 1034372 1186525
12084 1186525 1296879 1341070 1279623 1152559 971818 763042 575717 424025 305462 216757
12074 216757 157028 122994 106720 85455 76314 60738 51066 43410 37716 33101 28393 24865 24728
12061 24728 24606 21033 13409 13685 19957 22703 21941 27434 25332 24460 23531 21562 18255 18453 18624 13310
12045 13310 13351 13519 14038 17736 26261 26851 35660 32522 29059 23764 18482 13714 5967 2856 2905 -341
12029 -341 -77 1145 452 5485 9644 10086 9087 8143 6302 8064 8277 8879 2526 5168 15346 17936
12013 17936 14275 10952 8840 5437 8787 10283 11574 11713 10252 8062 11257 21389 35234 52222
11999 52222 79491 109776 99457 68642 39060 25570 17907 13706 5428 -4739 -6561 -811 5919
$$ packed form
12094A25279K3769L4656M6724O8298R3007J21136J48296J77418J95789J52153
12084A186525J10354M4191o1447j27064j80741k08776j87325j51692j18563q8705
12074B16757n9729l4034j6274k1265r141j5576r672p656n694m615m708l528j37
12061B4728j22l573p624K76O272K746p62N493k102q72r29j969l307J98J71n314
12045A3310M1J68N19L698Q525N90Q809l138l463n295n282m768p747l111M9l246
12029c41K64J222o93N033M159M42r99r44j841J762K13O02o353K642J0178K590
12013A7936l661l323k112l403L350J496J291J39j461k190L195J0132J3845J6988
11999E2222K7269L0285j0319l0815k9582j3490p663m201q278j0167j822N750O730
$$ plain form
11986 5919 14344 14512 20523 18421 9898 1534 -4410 -5123 -11120 -10242 -3474 1822 5418 10490 11616
11971 11616 10773 5571 2757 10830 15560 7804 5319 5598 -2 4330 3470 2563 5853 4101 2880
11956 2880 3490 7941 4959 5105 7915 8502 59 -3512 -2624 -6131 -8450 -8400 603 8429 4770 4464
11940 4464 5101 13312 6894 450 5714 9827 10902 10172 15582 18382 12364 10684 8673 9850 9247
11925 9247 6099 4775 5157 6868 5234 4228 2427 -3828 1947 -453 8838 15599 15362 14551 19686
11910 19686 23028 17411 18102 10320 1575 1084 8151 7799 2328 2785 5756 10419 11674 14690 15409 18864
11894 18864 24792 27901 24616 9674 6720 7884 11070 9895 4638 810 574 -1136 1937 7827
11880 7827 15800 11413 3288 -735 8974 15680 20085 14941 11280 13953 14735 9634 8283 7962 7144
$$ packed form
11986E919Q425J68O011k102q523q364n944p13n997Q78O768N296L596N072J126
11971A1616q43n202k814Q073M730p756k485K79n600M332q60r07L290j752j221
11956B880O10M451k982J46K810N87q443l571Q88l507k319N0R003P826l659l06
11940D464O37Q211o418o444N264M113J075p30N410K800o018j680k011J177o03
11925I247l148j324L82J711j634j006j801o255N775k400R291O761k37q11N135
11910A9686L342n617O91p782q745m91P067l52n471M57K971M663J255L016P19L455
11894A8864N928L109l285j4942k954J164L186j175n257l828k36j710L073N890
11880G827P973m387q125m023R709O706M405n144l661K673P82n101j351l21q18
$$ plain form
11865 7144 6874 6172 12547 19099 18282 16052 12900 10308 14275 17336 17267 16891 12994 7606 12530 13588
11849 13588 6981 -3825 -4565 4390 4413 7619 14075 17798 17689 18356 13272 8365 8230 4194 -903 -3229
11833 -3229 -996 5749 4234 13488 20200 18509 7603 6514 2544 -971 9444 14840 16237 11765
11819 11765 4017 4261 7515 5244 9710 12694 3875 1560 2976 2618 2731 -3582 -5106 5054 12069
11804 12069 16767 22826 24976 21290 11928 6804 -148 1360 686 2095 -2284 2169 1888 -1598 2793
11789 2793 -1659 -4563 -3526 3331 6448 6714 12894 15435 11972 9516 4581 -735 -5102 -5228 -4045
11774 -4045 -1197 1919 -1100 2462 5917 9073 4816 5140 2216 1389 5743 1799 -1423 491 1179
11759 1179 3529 223 330 6530 16442 18135 12764 6841 5538 6603 5605 5707 219 -1677 3722
$$ packed form
11865G144k70p02O375O552q17k230l152k592L967L061o9l76l897n388M924J058
11849A3588o607j0806p40Q955K3L206O456L723j09O67n084m907j35m036n097k326
11833c229K233O745j515R254O712j691j0906j089l970l515J0415N396J397m472
11819A1765p748K44L254k271M466K984q819k315J416l58J13o313j524J0160P015
11804A2069M698O059K150l686r362n124o952J508o74J409m379M453k81l486M391
11789B793m452k904J037O857L117K66O180K541l463k456m935n316m367j26J183
11774d045K848L116l019L562L455L156m257L24k924q27M354l944l222J914O88
11759A179K350l306J07O200R912J693n371n923j303J065r98J02n488j896N399
$$ plain form
11744 3722 7382 2888 -497 -955 5977 1919 -4006 -3456 -6065 -5507 -375 -1200 -287 -837 1768 1056
11728 1056 -1202 -1805 1141 5832 3206 4185 6338 2788 8643 8331 3028 3049 8316 4316 -2619 -2915
11712 -2915 928 1344 905 -4527 -9370 -12990 -10625 -8306 -4805 2577 -632 -1279 1823 1621 3825 5467
11696 5467 2892 -1844 -3701 -690 -405 -6744 -8213 3183 6562 775 -1053 -2263 -2754 -5120 -4954
11681 -4954 -7880 -10034 -14071 -12692 -9485 -3422 -85 6921 9617 6838 2518 -3667 -7193 -3095 -6523
11666 -6523 -11033 -3132 -3454 -5347 -1510 1593 2499 9008 11430 11546 6639 4137 5116 10499 11644 7297
11650 7297 3050 1381 2401 -399 1201 -4157 -4766 -103 3400 2034 -724 -5800 -10403 -8158 -3357
11635 -3357 31 -4364 -5810 -8832 -7889 -4711 -2974 -4393 -2827 3769 939 -9092 -12918 -12664 -9858
$$ packed form
11744C722L660m494l385m58O932m058n925N50k609N58N132q25R13n50K605p12
11728A056k258o03K946M691k626R79K153l550N855l12n303K1N267m000o935k96
11712b915L843M16m39n432m843l620K365K319L501P382l209o47L102k02K204J642
11696E467k575m736j857L011K85o339j469J1396L379n787j828j210m91k366J66
11681d954k926k154m037J379L207O063L337P006K696k779m320o185l526M098l428
11666f523m510P901l22j893L837L103R06O509K422J16m907k502R79N383J145m347
11650G297m247j669J020k800J600n358o09M663L503j366k758n076m603K245M801
11635c357L388m395j446l022R43L178J737j419J566O596k830j0031l826K54K806
$$ plain form
11620 -9858 -2450 657 -2117 741 -4319 -9991 -4994 -5869 -1848 697 3671 2026 -2123 -5128 -1229
11605 -1229 7133 14039 19147 9988 3940 -3026 2279 2914 -287 -891 -2913 -2551 346 5410 5227 2412
11589 2412 -1938 -3692 -1424 248 1176 4161 3079 -8392 -12474 -14896 -14026 -7982 -3062 -4903 -6651
11574 -6651 2357 10482 10901 7641 5918 9832 5278 2068 6436 5782 -3377 -8427 -8850 -14118 -16324
11559 -16324 -8161 -432 484 991 1343 -2163 1640 -6297 -4539 7459 9632 7553 6682 4808 6238
11544 6238 8510 -2550 -5369 -12695 -7806 -10271 -17726 -17777 -10078 -115 2863 1366 3707 3685 -6323
11529 -6323 -9153 -6233 -7430 -9947 -8788 -5684 -8382 -4817 -8601 -9910 -5561 1578 1948 -6418 -11748
11514 -11748 -10059 -6271 -2580 -7357 -11571 -5873 -3972 -4603 -10334 -8878 -10586 -14167 -15143 -14476 -12554
$$ packed form
11620i858P408L107k774K858n060n672M997q75M021K545K974j645m149l005L899
11605a229Q362O906N108r159o048o966N305O35l201o04k022L62K897N064j83k815
11589B412m350j754K268J672R28K985j082j1471m082k422Q70O044M920j841j748
11574f651R008Q125M19l260j723L914m554l210M368o54r159n050m23n268k206
11559a6324Q163P729R16N07L52l506L803p937J758J1998K173k079q71j874J430
11544F238K272j1060k819p326M889k465p455n1P699R963K978j497K341k2j0008
11529f323k830K920j197k517J159L104k698L565l784j309M349P139L70q366n330
11514a1748J689L788L691m777m214N698J901o31n731J456j708l581r76O67J922
$$ plain form
11499 -12554 -9392 -7665 -13191 -14283 -7937 -254 -1039 -2569 1752 -2941 -9571 -9500 -821 4268 3916
11484 3916 8996 7443 5186 6333 2713 -6707 -2665 7874 14111 14668 18642 15471 12801 10790 8925
11469 8925 13955 11727 7175 2053 -1094 -9299 -7896 -7022 -3916 -669 -3100 4665 1337 -6504 -10458
11454 -10458 -10561 -2540 3240 3216 498 -3023 -1083 3769 4290 2401 1120 4742 11454 2673 -2431
11439 -2431 2880 -951 -1718 -1598 -3014 2819 874 5390 2882 4007 2892 -1350 -1285 3298 8016 10819
11423 10819 8988 1110 -2843 -5325 -3731 -209 -1496 -1544 -229 -875 -2612 -588 4727 -5302 -5469
11408 -5469 -2178 -697 -2815 -5138 -1726 -1309 1988 2268 -2811 -8639 -9041 -4733 -2441 2362 8133
11393 8133 6979 2928 1241 -3760 -7761 -10895 -7782 -4558 -2172 -2319 -3285 1739 1058 -678 -6893
$$ packed form
11499a2554L162J727n526j092O346P683p85j530M321m693o630P1Q679N089l52
11484C916N080j553k257J147l620r420M042J0539O237N57L974l171k670k011j865
11469H925N030k228m552n122l147q205J403Q74L106L247k431P765l328p841l954
11454a0458j03Q021N780k4k718l521J940M852N21j889j281L622O712q781n104
11439b431N311l831p67J20j416N833j945M516k508J125j115m242O5M583M718K803
11423A0819j831p878l953k482J594L522j287m8J315o46j737K024N315j0029j67
11408e469L291J481k118k323L412M17L297K80n079n828m02M308K292M803N771
11393H133j154m051j687n001m001l134L113L224K386j47r66N024o81j736o215
$$ plain form
11378 -6893 -2133 -963 -8331 -14769 -21717 -20838 -9871 -7415 -10038 -8498 -11925 -5595 -2768 571 3785
11363 3785 338 -4257 -3482 4034 2066 -8141 -11014 -10590 -13643 -4306 1742 3395 5447 7347 3051
11348 3051 5998 6197 2640 -4811 -10475 -18024 -19260 -15479 -16275 -16829 -11425 -9131 -6307 -4054 -3066 699
11332 699 4069 745 -5556 -5494 -693 -4104 -3682 -1913 -7534 -5624 1275 5980 5801 1523 644 -106
11316 -106 -5370 597 -1637 -11204 -10321 -3928 4636 7544 4698 5378 3654 4982 2101 4138 -991
11301 -991 -7943 -4753 431 -694 164 -4327 -4671 -2072 -8501 -4796 360 3950 7089 8048 8396 6575
11285 6575 974 -902 -1896 -9686 -5429 -5870 -1894 -8962 -12562 -10841 -6346 -5527 -8719 -1399 1253
11270 1253 7483 8801 10374 7826 5471 3249 4175 5547 3633 7162 9291 8352 10055 8249 1488
$$ packed form
11378f893M760J170p368o438o948Q79J0967K456k623J540l427O330K827L339L214
11363C785l447m595P75P516j968j0207k873M24l053R337O048J653K052J900m296
11348C051K947J99l557p451n664p549j236L781p96n54N404K294K824K253R88L765
11332F99L370l324o301O2M801l411M22J769n621J910O899M705j79m278q79p50
11316a06n264N967k234r567Q83O393Q564K908k846O80j724J328k881K037n129
11301i91o952L190N184j125Q58m491l44K599o429L705N156L590L139R59L48j821
11285F575n601j876r94p790M257m41L976p068l600J721M495Q19l192P320K652
11270A253O230J318J573k548k355k222R26J372j914L529K129r39J703j806o761
$$ plain form
11255 1488 104 3014 12703 13116 8077 1965 916 1370 -4391 -1815 2705 3576 4365 6194 1399 2875
11239 2875 2400 5516 6777 11893 22223 27375 29391 27850 19952 13503 6519 3955 493 298 5286
11224 5286 5113 6952 4079 1842 3552 9574 6321 2908 6007 10028 7866 7318 6370 559 6086
11209 6086 1161 -1027 6638 5983 3339 -2459 -4367 -2829 842 4481 4138 2182 12179 19405 20671
11194 20671 19122 13419 4641 -3847 415 10721 14387 19666 21763 17711 14752 13403 6558 7159
11180 7159 1725 -104 1188 3747 -1721 1097 -412 -7503 -3299 3607 252 5367 8858 1633 -1368
11165 -1368 -546 -1475 -2381 -1835 -502 -3208 -1598 -699 2386 6663 132 -822 -771 2621 6015 14781 12678
11148 12678 8445 8489 6853 11035 16027 18753 22429 25572 25854 23713 17854 19555 14437 12498 12661
$$ packed form
11255A488j384K910R689M13n039o112j049M54n761K576M520Q71P89J829m795J476
11239B875m75L116J261N116J0330N152K016j541p898o449o984k564l462j95M988
11224E286j73J839k873k237J710O022l253l413L099M021k162n48r48n811N527
11209F086m925k188P665o55k644n798j908J538L671L639l43j956R997P226J266
11194B0671j549n703q778q488M262J0306L666N279K097m052k959j349o845O01
11180G159n434j829J292K559n468K818j509p091M204O906l355N115L491p225l001
11165a368Q22r29r06N46J333k706J610Q99L085M277o531r54N1L392L394Q766k103
11148A2678m233M4j636M182M992K726L676L143K82k141n859J701n118j939J63
$$ plain form
11133 12661 6595 5385 2135 6513 7127 3989 7177 9226 10465 13750 11366 14881 13294 15454 16744
11118 16744 15452 15213 18338 24442 23053 12204 6153 420 -885 148 6086 4842 10913 13828
11104 13828 9510 7617 -14 -1329 -2705 -2469 -5344 -116 2071 5459 8464 12380 12739 12017 11705
11089 11705 7802 5235 6122 9527 10786 10699 4206 815 3537 2356 -2389 1491 8972 12493 10793
11074 10793 12151 11512 7937 -3552 -3773 4269 9206 10820 11150 17532 17336 17082 17418 18616 24937 25814
11058 25814 23575 20814 16597 7898 1578 3926 2225 2235 4217 9923 13955 16213 16773 15819 14242
11043 14242 16581 19790 24550 28157 26316 26048 27727 30329 34903 32485 26442 24221 21048 15901 10980
11028 10980 9014 8885 5976 1144 2654 9001 10439 4575 1646 2904 4780 10365 14172 14897 21520
$$ packed form
11133A2661o066j210l250M378O14l138L188K049J239L285k384L515j587K160J290
11118A6744j292k39L125O104j389j0849o051n733j305J033N938j244O071K915
11104A3828m318j893p631j315j376K36k875N228K187L388L005L916L59p22l12
11089A1705l903k567Q87L405J259q7o493l391K722j181m745L880P481L521j700
11074A0793J358o39l575j1489k21Q042M937J614L30O382j96k54L36J198O321Q77
11058B5814k239k761m217q699o320K348j701J0J982N706M032K258N60r54j577
11043A4242K339L209M760L607j841k68J679K602M574k418o043k221l173n147m921
11028A0980j966j29k909m832J510O347J438n864k929J258J876N585L807P25O623
$$ plain form
11013 21520 26151 30782 19010 7894 13337 15569 8097 5063 1037 863 1127 -1644 -2937 -1612
10999 -1612 5788 12115 12111 12183 12925 12237 12170 14751 19109 16160 11477 8993 7181 9257 4381 4728 8267
10982 8267 9714 10566 12509 11538 13712 11713 7915 7102 8219 7320 7276 11602 12718 6564 2812 2043
10966 2043 11191 11579 7129 14156 17456 18339 20778 22568 18981 10073 6370 5935 8736 7863 13984 10725
10950 10725 13322 22746 26821 27133 26234 24833 19238 18012 16163 11755 7940 10346 11780 12357 16272
10935 16272 12957 6727 13629 17985 11279 9338 18540 21175 18543 15732 18356 22957 14211 10660
10921 10660 10837 7365 3324 3822 11001 10721 13161 18279 13755 10542 6109 -1159 -8952 -11815 -8224
10906 -8224 -1660 1985 3791 3907 10487 13612 14507 15913 11054 8667 787 -3584 -6072 -935 4763
$$ packed form
11013B1520M631M631j1772j1116N443K232p472l034m026j74K64k771j293J325
10999a612P400O327mP2P42o88o7K581M358k949m683k484j812K076m876L47L539
10982H267J447Q52J943r71K174j999l798q13J117q99m4M326J116o154l752p69
10966B043R148L88m450P027L300Q83K439J790l587q908l703m35K801q73O121l259
10950A0725K597R424M075L12q99j401n595j226j849m408l815K406J434N77L915
10935A6272l315o230O902M356o706j941R202K635k632k811K624M601q746l551
10921A0660J77l472m041M98P179k80K440N118m524l213m433p268p793k863L591
10906h224O564L645J806J16O580L125Q95J406m859k387p880m371k488N137N698
$$ plain form
10891 4763 1432 3239 1448 3305 -1751 -423 3602 2935 7952 13278 14262 6915 10978 14065 11446
10876 11446 12441 18273 23412 24897 23845 16218 12625 16376 20096 17256 12241 11203 13137 9452 3756
10861 3756 2552 -2714 -1402 3260 5869 4469 3282 5164 6856 8151 10669 9544 3744 5529 9090
10846 9090 8589 8970 14711 6214 -803 -3309 -3757 -1822 6361 6079 3886 4135 4308 11257 13313 8854
10830 8854 13643 21154 20513 25272 25690 22213 16828 16985 20259 19352 14829 13335 16352 14404 7446 -1836
10814 -1836 -3975 -4390 -2586 956 6693 9326 12514 14992 14085 8807 8338 5602 683 -36 5521 9030
10798 9030 6693 2687 2539 5220 5932 10750 11757 15649 11665 11276 10680 4580 3441 1516 -542 482
10782 482 10781 11909 19216 24186 22524 24362 22840 19711 16898 7737 1338 -3230 8561 20793
$$ packed form
10891D763l331J807j791J857n056J328M025o67N017N326R84p347M063L087k619
10876A1446R95N832N139J485j052p627l593L751L720k840n015j038J934l685n696
10861C756j204n266J312M662K609j400j187J882J692J295K518j125n800J785L561
10846I090n01L81N741q497p017k506m48J935Q183k82k193K49J73O949K056m459
10830H854M789P511o41M759M18l477n385J57L274r07m523j494L017j948o958r282
10814a836k139m15J804L542N737K633L188K478r07n278m69k736m919p19N557L509
10798I030k337m006j48K681P12M818J007L892l984l89n96o100j139j925k058J024
10782D82J0299J128P307M970j662J838j522l129k813r161o399m568J1791J2232
$$ plain form
10768 20793 18200 13438 8171 7221 13179 20135 13773 14206 16520 17420 13746 10185 18197 21955 25030
10753 25030 22302 18577 25041 27492 37532 46253 47864 43364 39779 33976 28101 20072 14683 13895
10739 13895 15202 16201 12447 10603 8809 8048 14108 17277 19668 14889 9134 10300 20254 23091 17410
10724 17410 18186 22084 20055 14950 9395 7828 9268 13095 19136 20867 18687 15894 18999 17941 16265
10709 16265 12686 8602 10156 14313 26525 30231 33426 37331 39151 47931 55107 53154 45795 47039
10695 47039 50674 43771 38019 36080 31111 30019 28737 23813 24566 18862 17395 15481 15178 15381 15961
10680 15961 15393 14389 15032 15243 14325 21728 25467 27096 24650 21105 24896 33009 37752 38676 38472 37596
10664 37596 27358 23854 28539 24893 20242 21698 19452 19744 19318 18994 22550 22258 20352 15241 14390
$$ packed form
10768B0793k593m762n267r50N958O956o362M33K314R00l674l561Q012L758L075
10753B5030k728l725O464K451J0040Q721J611m500l585n803n875q029n389p88
10739A3895J307R99l754j844j794p61O060L169K391m779n755J166R954K837n681
10724A7410P76L898k029n105n555j567J440L827O041J731k180k793L105j058j676
10709A6265l579m084J554M157J2212L706L195L905J820Q780P176j953p359J244
10695D7039L635o903n752j939m969j092j282m924P53n704j467j914l03K03N80
10680A5961n68j004O43K11r18P403L739J629k446l545L791Q113M743R24k04q76
10664C7596j0238l504M685l646m651J456k246K92m26l24L556k92j906n111q51
$$ plain form
10649 14390 13186 25769 45458 43192 35036 24638 25240 24198 26298 30160 27982 26146 22284 19523
10635 19523 20230 20179 17752 14869 13207 9872 3592 7827 10588 14610 16525 17767 15561 13148 16570
10620 16570 25476 31711 35741 35577 32150 31236 35444 38611 31732 23885 26329 23631 16569 14761 12681
10605 12681 11237 16771 15405 15936 15555 15103 17177 15733 17132 19543 18190 17843 16863 15453 17918 20550
10589 20550 17272 11425 16893 26496 28282 27524 26453 19836 13111 14362 15539 13903 17765 21841 22042
10574 22042 18958 16518 13409 9662 10977 22382 24859 17827 25116 34306 37516 32888 19993 16913
10560 16913 14811 8964 16560 26755 24309 26236 25159 18696 17637 19584 16223 19164 22589 25956
10546 25956 27879 25268 20145 15799 12531 10475 12386 15972 15813 13817 6970 9111 8215 12279 15210
$$ packed form
10649A4390j204J2583J9689k266q156j0398O02j042K100L862k178j836l862k761
10635A9523P07n1k427k883j662l335o280M235K761M022J915J242k206k413L422
10620A6570Q906O235M030j64l427r14M208L167o879p847K444k698p062j808k080
10605A2681j444N534j366N31l81m52K074j444J399K411j353l47r80j410K465K632
10589B0550l278n847N468R603J786p58j071o617o725J251J177j636L862M076K01
10574B2042l084k440l109l747J315J1405K477p032P289R190L210m628j2895l080
10560A6913k102n847P596J0195k446J927j077o463j059J947l361K941L425L367
10546B5956J923k611n123m346l268k056J911L586j59j996o847K141q96M064K931
$$ plain form
10531 15210 15773 16336 19525 18493 21398 22824 24447 20019 9282 14925 19083 19366 20851 21824 24027
10516 24027 25483 25841 30426 28782 17183 17402 19009 18724 15893 23026 25096 24624 23562 27478 25643
10501 25643 17659 20400 16069 12660 20702 27358 19413 9362 13345 15831 23173 31518 18057 11979
10487 11979 10578 14348 14749 16560 13803 12924 9679 8646 8969 11834 8543 12259 13427 16248 21455
10472 21455 31191 41021 33803 30990 29757 28887 23830 27531 28477 28581 30342 30417 32904 29151 28623 33313
10456 33313 32434 33640 32768 28342 27491 26131 28178 27796 23632 18215 17181 16246 16561 18987 18009 17983 18084
10439 18084 20273 26003 32881 32495 24595 19578 16941 12225 14411 11550 9378 5983 9495 13316 19584
10424 19584 19943 17648 20287 20696 19221 21202 18415 17492 27343 34461 27779 29642 36757 40835 38928
$$ packed form
10531A5210N63N63L189j032K905J426J623m428j0737N643M158K83J485R73K203
10516B4027J456L58M585j644j1599K19J607k85k831P133K070m72j062L916j835
10501B5643p984K741m331l409Q042O656p945j0051L983K486P342Q345j3461o078
10487A1979j401L770M01J811k757q79l245j033L23K865l291L716J168K821N207
10472B1455R736R830p218k813j233q70n057L701R46J04J761P5K487l753n28M690
10456C3313q79J206q72m426q51j360K047l82m164n417j034r35L15K426r78k6J01
10439A8084K189N730O878l86p900n017k637m716K186k861k172l395L512L821O268
10424A9584L59k295K639M09j475J981k787r23R851P118o682J863P115M078j907
$$ plain form
10409 38928 39674 37337 31166 29961 29993 22848 13577 19766 29913 39817 42041 33778 39350 42788 40133
10394 40133 45546 42252 46476 51132 47995 41279 37270 31838 34375 37037 43333 46359 49493 46524
10380 46524 52289 67208 87522 108383 132820 162919 215595 301170 391098 455212 523231 556693
10368 556693 513100 444558 385118 310885 248012 223573 239419 274380 303989 280083 223201
10357 223201 166764 124041 92024 75366 63788 54505 50114 52110 46942 46991 51821 44016 30839
10344 30839 26561 35616 40650 38257 33269 34451 24549 24666 28987 38573 38908 33125 33307 36698 37534
10329 37534 35189 32477 30162 36892 44225 43261 34649 35592 46892 49001 52701 54841 56272 59401 56614
10314 56614 52152 47873 45925 48670 62661 79964 83854 88511 101177 119874 146264 165955 177690
$$ packed form
10409C8928P46k337o171j205L2p145r271O189J0147R904K224q263N572L438k655
10394D0133N413l294M224M656l137o716m009n432K537K662O296L026L134k969
10380D6524N765J4919K0314K0861K4437L0099N2676Q5575Q9928O4114O8019L3462
10368E56693m3593o8542n9440p4233o2873k4439J5846L4961K9609k3906n6882
10357B23201n6437m2723l2017j6658j1578r283m391J996n168M9M830p805j3177
10344C0839m278R055N034k393m988J182r902J17M321R586L35n783J82L391Q36
10329C7534k345k712k315O730P333r64q612R43J1300K109L700K140J431L129k787
10314E6614m462m279j948K745J3991J7303L890M657J2666J8697K6390J9691J1735
$$ plain form
10301 177690 182353 194158 203303 202525 190047 168605 149994 137718 120737 102932 88370 80794
10289 80794 69893 61774 58659 53531 54620 59553 58825 54150 55539 62895 62786 57770 58363 58374 58009 56215
10273 56215 56258 56648 51086 48585 51508 50557 58335 60928 63094 61814 58031 57920 62085 52644 50848 56132
10257 56132 58630 60563 64863 68721 68662 67462 62056 60851 62232 61258 55155 55196 51920 55663 55937 58298
10241 58298 58562 64599 70069 66357 58493 53468 56826 58078 53325 47722 51512 56394 57612 54104 61067
10226 61067 72278 74923 70771 67956 63799 61838 66069 61812 55607 58322 59320 57490 58556 58376 59961
10211 59961 60109 55320 50453 51240 53603 52078 51787 51508 50485 56104 61133 56076 52596 50082 57390
10196 57390 64952 67817 70597 68701 62638 65238 76542 82292 78232 75075 79422 88309 98504 104248
$$ packed form
10301A77690M663J1805R145p78j2478k1442j8611j2276j6981j7805j4562p576
10289H0794j0901q119l115n128J089M933p28m675J389P356j09n016N93J1l65j794
10273E6215M3L90n562k501K923r51P778K593K166j280l783j11M165r441j796N284
10257E6132K498J933M300L858n9j200n406j205J381r74o103M1l276L743K74K361
10241E8298K64O037N470l712p864n025L358J252m753n603L790M882J218l508O963
10226F1067J1211K645m152k815m157j961M231m257o205K715R98j830J066j80J585
10211E9961J48m789m867P87K363j525k91k79j023N619N029n057l480k514P308
10196E7390P562K865K780j896o063K600J1304N750m060l157M347Q887J0195N744
$$ plain form
10182 104248 103177 108292 121320 138841 157085 178812 193994 212981 232192 239055 232090 219085
10170 219085 204058 195194 181640 160689 149905 152055 157861 165554 174889 179075 188157 202744 222601
10157 222601 235184 251678 270973 299184 336560 388140 467131 590100 776872 1012894 1300164
10146 1300164 1620132 1865631 2053779 2131581 2027431 1839197 1556266 1236542 940240 695138
10136 695138 511288 384525 299542 245359 209268 189224 179699 175620 168096 162890 160727 149826
10124 149826 140018 132590 132989 132339 134608 139675 134258 120310 109294 104496 104742 110297 104602 108399
10110 108399 114053 121919 120956 124995 119694 104604 100151 96130 93019 86621 83350 87839 83701 77118
10096 77118 74462 77699 76259 69425 65722 62245 76273 85758 84882 77100 74757 69959 61849 62061 60575
$$ packed form
10182A04248j071N115J3028J7521J8244K1727J5182J8987J9211O863o965j3005
10170B19085j5027q864j3554k0951j0784K150N806P693R335M186R082J4587J9857
10157B22601J2583J6494J9295K8211L7376N1580P8991J22969J86772K36022K87270
10146A300164L19968K45499J88148P7802j04150j88234k82931l19724k96302k45102
10136F95138j83850j26763q4983n4183l6091k0044r525m079p524n206k163j0901
10124A49826r808p428L99o50K269N067n417j3948j1016m798K46N555n695L797
10110A08399N654P866r63M039n301j5090m453m021l111o398l271M489m138o583
10096G7118k656L237j440o834l703l477J4028R485q76p782k343m798q110K12j486
$$ plain form
10081 60575 59806 55262 53912 66047 70896 75620 76110 79619 84845 84824 84722 83122 80221 71983 63878
10066 63878 64892 63777 59276 59598 59691 62867 62966 62171 63043 67809 80404 90245 90358 94907 104835 110690
10050 110690 112838 114946 114920 122180 121693 117509 119207 115855 117988 116958 109808 106900 103194 96726 101954
10035 101954 107104 105399 99771 93526 100674 109996 109709 106389 100157 98465 104628 96069 88894 87274
10021 87274 84693 86264 89910 96931 101614 106973 116455 117678 119359 124553 125016 126699 125828 135582 141441
10006 141441 138650 142172 159555 194654 241697 296799 346909 386414 419524 412588 380202 344284
9994 344284 296735 257513 212000 175423 155642 134154 119898 122493 120606 112669 110356 109618 117659
9981 117659 125730 131612 134243 130290 128168 131121 128801 124228 125748 122361 127612 132596 131872 129577 132340
$$ packed form
10081F0575p69m544j350J2135M849M724M90L509N226k1j02j600k901q238q105
10066F3878J014j115m501L22R3L176R9p95Q72M766J2595R841J13M549R928N855
10050A10690K148K108k6P260m87m184J698l352K133j030p150k908l706o468N228
10035A01954N150j705n628o245P148R322k87l320o232j692O163q559p175j620
10021H7274k581J571L646P021M683N359R482J223J681N194M63J683q71R754N859
10006A41441k791L522J7383L5099M7043N5102N0110L9505L3110o936l2386l5918
9994C44284m7549l9222m5513l6577j9781k1488j4256K595j887p937k313p38Q041
9981A17659Q071N882K631l953k122K953k320m573J520l387N251M984p24k295K763
$$ plain form
9966 132340 134484 131426 129595 131445 126111 115621 112515 112833 116557 113764 115635 120008 118862 119195 130077
9951 130077 138096 140149 144905 149066 152818 155787 156954 155199 156725 156971 146280 130776 124324 112997
9937 112997 102584 99226 92058 89694 89838 78394 52576 33547 15009 -3963 -19448 -35745 -35078
9924 -35078 -23491 -14449 -797 8013 10162 19159 30178 39856 40729 47172 57383 56825 67328 82675
9910 82675 93390 97612 109805 128081 146376 155079 163287 168585 166072 157262 141100 122114 103121
9897 103121 95363 90158 77485 69057 66588 74192 80593 88399 100927 117045 126695 134186 133082 134490
9883 134490 139712 140271 138980 132717 121825 113591 110989 109713 111931 136693 187251 209511 258838
9870 258838 308555 314948 337022 352798 346240 348102 345568 339633 333290 324896 325336 327836 333619 335840
$$ packed form
9966A32340K144l058j831J850n334j0490l106L18L724k793J871M373j146L33J0882
9951A30077Q019K053M756M161L752K969J167j755J526K46j0691j5504o452j1327
9937A12997j0413l358p168k364J44j1444k5818j9029j8538j8972j5485j6297O67
9924c5078J1587R042J3652Q810K149Q997J1019R678Q73O443J0211n58J0503J5347
9910H2675J0715M222J2193J8276J8295Q703Q208N298k513q810j6162j8986j8993
9897A03121p758n205j2673q428k469P604O401P806J2528J6118R650P491j104J408
9883A34490N222N59j291o263j0892q234k602j276K218K4762N0558K2260M9327
9870B58838M9717O393K2074J5776o558J862k534n935o343q394M40K500N783K221
$$ plain form
9856 335840 336823 349538 363286 367805 365159 365018 355087 346569 341624 336016 330991 325200 330665 340624
9842 340624 360942 392224 415352 441716 477709 506185 532110 565579 591137 615382 642466 669404
9830 669404 713984 789265 913519 1103882 1390722 1755337 2188836 2635770 2985741 3225225
9820 3225225 3221217 2995983 2639826 2187809 1762437 1420554 1168066 1004651 913785 865466
9810 865466 838426 829025 818920 806094 799932 793582 788564 783508 779476 788062 810127 836090 867703
9797 867703 889913 908203 930114 950125 976124 1014256 1057422 1102039 1166703 1248729 1338764 1438892
9785 1438892 1545528 1666118 1796377 1938878 2083469 2248521 2429244 2617377 2824171 3051308
9775 3051308 3300551 3589493 3935443 4353568 4879209 5543040 6347186 7311884 8487202
$$ packed form
9856C35840R83J2715J3748M519k646j41r931q518m945n608n025n791N465R959
9842C40624K0318L1282K3128K6364L5993K8476K5925L3469K5558K4245K7084K6938
9830F69404M4580P5281J24254J90363K86840L64615M33499M46934L49971K39484
9820C225225m008k25234l56157m52017m25372l41883k52488j63415r0866m8319
9810H65466k7040r401j0105j2826o162o350n018n056m032Q586K2065K5963L1613
9797H67703K2210J8290K1911K0011K5999L8132M3166M4617O4664Q2026R0035J00128
9785A438892J06636J20590J30259J42501J44591J65052J80723J88133K06794K27137
9775C051308K49243K88942L45950M18125N25641O63831Q04146R64698J175318
$$ plain form
9766 8487202 9828810 11360596 13170545 15158365 17318771 19726351 22323415 24993671
9758 24993671 27927487 31225021 35056893 40012601 46861309 56801010 71864997 94832028
9750 94832028 127909536 169057513 217940615 272476373 313813280 344146379 360951128
9743 360951128 346380134 316465472 273955594 219633011 167036192 121778137 86421951
9736 86421951 61094673 44730972 34687853 28337368 24117172 21220684 19061521 17298815
9728 17298815 15843095 14501044 13236363 12069714 10921076 9862781 8825383 7830971
9720 7830971 6932967 6084645 5333813 4699546 4179236 3753613 3410724 3132178 2894924 2686755
9710 2686755 2511935 2365053 2241629 2142798 2058671 1988275 1919183 1857510 1791953 1731727 1671608
$$ packed form
9766H487202J341608J531786J809949J987820K160406K407580K597064K670256
9758B4993671K933816L297534L831872M955708O848708R939701J5063987K2967031
9750I4832028L3077508M1147977M8883102N4535758M1336907L0333099J6804749
9743C60951128j4570994k9914662m2509878n4322583n2596819m5258055l5356186
9736H6421951k5327278j6363701j0043119o350485m220196k896488k159163j762706
9728A7298815j455720j342051j264681j166649j148638j058295j037398r94412
9720G830971q98004q48322p50832o34267n20310m25623l42889k78546k37254k08169
9710B686755j74820j46882j23424r8831q4127p0396o9092o1673o5557o0226o0119
$$ plain form
9699 1671608 1615036 1564236 1509970 1457854 1399819 1345092 1292473 1234911 1187385 1144492 1100813
9688 1100813 1072158 1040230 1007975 981166 955033 913954 871419 827582 789762 762343 746355
9677 746355 730057 724121 725515 729781 732546 722698 707738 690514 674490 660862 643570 629716 618141
9664 618141 610708 602763 601142 599816 596514 588559 578340 568427 554692 546407 537802 535382 536656 529984
9650 529984 522948 522137 525061 526810 526021 521354 513770 500793 493772 475512 453373 438391 423951 409836
9636 409836 398127 393372 390814 384986 379561 378705 377749 382444 380634 369887 364453 366494 367725 375322
9622 375322 384184 395071 414106 438094 461109 468315 476789 493578 506294 509571 513641 510456 505999
9609 505999 499465 489978 478665 461065 457714 459059 464928 470101 467475 471426 486438 496517 521463
$$ packed form
9699A671608n6572n0800n4266n2116n8035n4727n2619n7562m7526m2893m3679
9688A100813k8655l1928l2255k6809k6133m1079m2535m3837l7820k7419j5988
9677G46355j6298n936J394M266K765r848j4960j7224j6024j3628j7292j3854j1575
9664F18141p433p945j621j326l302p955j0219r913j3735q285q605k420J274o672
9650E29984p036q11K924J749p89m667p584j2977p021j8260k2139j4982j4440j4115
9636D09836j1709m755k558n828n425q56r56M695j810j0747n434K041J231P597
9622C75322Q862J0887J9035K3988K3015P206Q474J6789J2716L277M070l185m457
9609E05999o534r487j1313j7600l351J345N869N173k626L951J5012J0079K4946
$$ plain form
9596 521463 549684 575246 584474 582286 566295 553390 549878 524096 490165 466371 442240 426846
9584 426846 417485 415626 416166 415518 424971 434729 447582 459315 465163 481106 491586 498194 510877 528967
9570 528967 544967 549969 564875 591225 613458 636860 676975 716698 770590 825279 870531 877907
9558 877907 852538 824286 808237 815834 863331 925546 1021295 1205013 1493137 1821102 1934023
9547 1934023 1785425 1559973 1404910 1303155 1190842 1061284 945079 862198 821729 815349
9537 815349 854050 943281 1079929 1243065 1399544 1526206 1655272 1810599 1934143 1953611
9527 1953611 1887478 1808229 1751948 1700095 1645338 1593007 1546054 1531776 1538630 1548848 1520100 1463362
9515 1463362 1428866 1458431 1581873 1798915 2097647 2500861 3072960 3845778 4667605 4963363
$$ packed form
9596E21463K8221K5562R228k188j5991j2905l512k5782l3931k3794k4131j5394
9584D26846r361j859N40o48R453R758J2853J1733N848J5943J0480O608J2683J8090
9570E28967J6000N002J4906K6350K2233K3402M0115L9723N3892N4689M5252P376
9558H77907k5369k8252j6049P597M7497O2215R5749J83718K88124L27965J12921
9547A934023j48598k25452j55063j01755j12313j29558j16205q2881m0469o380
9537H15349L8701Q9231J36648J63136J56479J26662J29066J55327J23544J9468
9527A953611o6133p9249n6281n1853n4757n2331m6953j4278O854J0218k8748n6738
9515A463362l4496K9565J23442K17042K98732M03214N72099P72818Q21827K95758
$$ plain form
9505 4963363 4439190 3543094 2735453 2179690 1832381 1608900 1455244 1390606 1406056 1465290
9495 1465290 1548655 1604930 1602440 1571949 1572655 1625180 1696478 1760414 1814324 1871481 1938273 1975907
9483 1975907 1928727 1808988 1663329 1521740 1361850 1189612 1039670 937252 898470 907365
9473 907365 945719 1016539 1110661 1230765 1357624 1451529 1547292 1694457 1890368 1970683 1768249
9462 1768249 1433938 1152691 997976 911316 862712 828780 815052 822001 829180 820541 782530
9451 782530 727872 674531 638885 622371 615939 608416 599471 597483 600843 602008 600038 596355 593342
9438 593342 594144 599398 611404 625333 629584 635899 650201 671186 681859 690430 698073 703365 718921
9425 718921 735001 759368 776154 781663 787275 789259 782797 777075 758560 735910 720129 718151 728463
$$ packed form
9505D963363n24173q96096q07641n55763l47309k23481j53656o4638J5450N9234
9495A465290Q3365N6275k490l0491P06N2525P1298O3936N3910N7157O6792L7634
9483A975907m7180j19739j45659j41589j59890j72238j49942j02418l8782Q895
9473I07365L8354P0820R4122J20104J26859R3905R5763J47165J95911Q0315k02434
9462A768249l34311k81247j54715q6660m8604l3932j3728O949P179q639l8011
9451G82530n4658n3341l5646j6514o432p523q945j988L360J165j970l683l013
9438E93342Q02N254J2006J3929M251O315J4302K0985J0673Q571P643N292J5556
9425G18921J6080K4367J6786N509N612J984o462n722j8515k2650j5781j978J0312
$$ plain form
9412 728463 738667 744296 747657 748508 751248 751307 754616 753513 754837 760093 765245 773055 777140 787301 797145
9397 797145 803750 811779 824738 832157 841079 841152 838181 834638 837108 842230 842103 843371 850235 853071 851774
9382 851774 852338 853777 856925 856359 857524 870611 881523 890414 903361 918225 929406 931702 940026 942336
9368 942336 955390 973516 986454 1001857 1009271 1017262 1026720 1042018 1055077 1077941 1098544 1111801
9356 1111801 1133565 1151524 1173835 1193661 1215416 1242794 1273540 1317322 1386185 1485836 1634966
9345 1634966 1848762 2097117 2399989 2722326 2971534 3164713 3241823 3130770 2939209 2672248
9335 2672248 2360759 2075721 1846776 1682606 1573057 1514518 1478167 1461331 1455968 1456475 1457621
9324 1457621 1469379 1477685 1480268 1486589 1491591 1495692 1512961 1526981 1541490 1564371 1575829 1592716
$$ packed form
9412G28463J0204N629L361Q51K740N9L309j103J324N256N152P810M085J0161R844
9397G97145O605Q029J2959P419Q922P3k971l543K470N122j27J268O864K836j297
9382H51774N64J439L148n66J165J3087J0912Q891J2947J4864J1181K296Q324K310
9368I42336J3054J8126J2938J5403P414P991R458J5298J3059K2864K0603J3257
9356A111801K1764J7959K2311J9826K1755K7378L0746M3782O8863R9651J49130
9345A634966K13796K48355L02872L22337K49208J93179P7110j11053j91561k66961
9335B672248l11489k85038k28945j64170j09549n8539l6351j6836n363N07J146
9324A457621J1758Q306K583O321N002M101J7269J4020J4509K2881J1458J6887
$$ plain form
9312 1592716 1605794 1614599 1632508 1651647 1668386 1679332 1694528 1709251 1725434 1741767 1764827 1793104
9300 1793104 1817743 1839970 1870417 1891550 1906007 1931010 1961983 1985637 2014079 2046626 2073815
9289 2073815 2102836 2138009 2168730 2188701 2217027 2250068 2283809 2313646 2349536 2385659 2426289
9278 2426289 2458108 2489625 2525927 2565022 2604200 2636190 2677831 2724137 2758916 2798001 2844829
9267 2844829 2884769 2921071 2964150 3004276 3050787 3102402 3153904 3203619 3256567 3306379 3360853
9256 3360853 3421429 3481108 3542999 3604179 3661439 3730325 3796064 3863932 3935636 4010287 4085455
9245 4085455 4160749 4242695 4313357 4387933 4467322 4547794 4631465 4723003 4815592 4907932 5006639
9234 5006639 5107115 5204164 5301700 5409023 5528065 5639303 5757468 5878499 5996262 6121429
$$ packed form
9312A592716J3078Q805J7909J9139J6739J0946J5196J4723J6183J6333K3060K8277
9300A793104K4639K2227L0447K1133J4457K5003L0973K3654K8442L2547K7189
9289B073815K9021L5173L0721J9971K8326L3041L3741K9837L5890L6123M0630
9278B426289L1819L1517L6302L9095L9178L1990M1641M6306L4779L9085M6828
9267B844829L9940L6302M3079M0126M6511N1615N1502M9715N2948M9812N4474
9256C360853O0576N9679O1891O1180N7260O8886O5739O7868P1704P4651P5168
9245D085455P5294Q1946P0662P4576P9389Q0472Q3671R1538R2589R2340R8707
9234E006639J00476R7049R7536J07323J19042J11238J18165J21031J17763J25167
$$ plain form
9224 6121429 6249567 6384039 6519135 6661357 6810161 6957337 7108440 7270208 7446811 7614581
9214 7614581 7784133 7961162 8142812 8333004 8537515 8747101 8957441 9179087 9407591 9638493
9204 9638493 9878172 10129324 10383801 10644752 10904832 11178447 11460426 11764984 12082205 12406736
9194 12406736 12741194 13084907 13442610 13804831 14177494 14565128 14963793 15369918 15795185
9185 15795185 16231252 16683231 17144145 17610746 18090593 18581477 19089200 19609856 20135759
9176 20135759 20672695 21218999 21770067 22329840 22895751 23470213 24049272 24621044 25193604
9167 25193604 25770988 26335454 26899541 27455192 28009333 28552812 29072104 29572328 30052255
9158 30052255 30514127 30938143 31334776 31696547 32021771 32313757 32573049 32782013 32946404
$$ packed form
9224F121429J28138J34472J35096J42222J48804J47176J51103J61768J76603J67770
9214G614581J69552J77029J81650J90192K04511K09586K10340K21646K28504K30902
9204I638493K39679K51152K54477K60951K60080K73615K81979L04558L17221L24531
9194A2406736L34458L43713L57703L62221L72663L87634L98665M06125M25267
9185A5795185M36067M51979M60914M66601M79847M90884N07723N20656N25903
9176B0135759N36936N46304N51068N59773N65911N74462N79059N71772N72560
9167B5193604N77384N64466N64087N55651N54141N43479N19292N00224M79927
9158C0052255M61872M24016L96633L61771L25224K91986K59292K08964J64391
$$ plain form
9149 32946404 33063342 33128904 33155488 33133863 33062983 32942289 32777942 32568242 32315454 32019794
9139 32019794 31681402 31314350 30918770 30488116 30031248 29549400 29043160 28520647 27980698
9130 27980698 27428464 26861313 26283704 25706495 25128391 24550069 23967329 23384660 22813266
9121 22813266 22251497 21700281 21153708 20607759 20070196 19551239 19045641 18548846 18061707
9112 18061707 17587481 17122175 16667997 16223603 15801545 15386277 14973511 14580694 14197915
9103 14197915 13828447 13464330 13112937 12777051 12450468 12128665 11814874 11517374 11231392
9094 11231392 10957365 10684963 10421030 10171472 9921401 9677125 9442785 9213342 8993432
9085 8993432 8785683 8580932 8385261 8194922 8010128 7831058 7654960 7486025 7318044 7151262
$$ packed form
9149C2946404J16938O5562K6584k1625p0880j20694j64347k09700k52788k95660
9139C2019794l38392l67052l95580m30654m56868m81848n06240n22513n39949
9130B7980698n52234n67151n77609n77209n78104n78322n82740n82669n71394
9121B2813266n61769n51216n46573n45949n37563n18957n05598m96795m87139
9112A8061707m74226m65306m54178m44394m22058m15268m12766l92817l82779
9103A4197915l69468l64117l51393l35886l26583l21803l13791k97500k85982
9094A1231392k74027k72402k63933k49558k50071k44276k34340k29443k19910
9085H993432k07749k04751j95671j90339j84794j79070j76098j68935j67981j66782
$$ plain form
9075 7151262 6990871 6842143 6698400 6556575 6417713 6285768 6161494 6034435 5912443 5801263
9065 5801263 5690670 5569389 5459094 5351018 5254328 5155479 5052434 4952664 4862206 4767023
9055 4767023 4677351 4590366 4509280 4431335 4359001 4285046 4215143 4138440 4062072 3992838 3929828
9044 3929828 3866277 3797137 3719118 3652762 3601832 3545260 3489128 3433565 3383990 3336532 3285229
9033 3285229 3234911 3181342 3128752 3081436 3042669 3001648 2956649 2913248 2872821 2835500 2795495
9022 2795495 2758454 2713024 2669889 2631219 2603699 2578139 2545454 2507712 2472501 2445345 2409469
9011 2409469 2374446 2341905 2314366 2287719 2253144 2224717 2197652 2171504 2150241 2122272 2093522
9000 2093522 2061244 2036613 2012426 1981857 1954693 1933488 1902082 1880864 1862155 1837610 1817078
$$ packed form
9075G151262j60391j48728j43743j41825j38862j31945j24274j27059j21992j11180
9065E801263j10593j21281j10295j08076r6690r8849j03045r9770r0458r5183
9055D767023q9672q6985q1086p7945p2334p3955o9903p6703p6368o9234o3010
9044C929828o3551o9140p8019o6356n0930n6572n6132n5563m9575m7458n1303
9033C285229n0318n3569n2590m7316l8767m1021m4999m3401m0427l7321m0005
9022B795495l7041m5430m3135l8670k7520k5560l2685l7742l5211k7156l5876
9011B409469l5023l2541k7539k6647l4575k8427k7065k6148k1263k7969k8750
9000B093522l2278k4631k4187l0569k7164k1205l1406k1218j8709k4545k0532
$$ plain form
8989 1817078 1798256 1782293 1762480 1740147 1718083 1699024 1682071 1666932 1647985 1625544 1609283
8978 1609283 1591358 1571259 1556570 1543826 1527252 1512150 1497750 1485696 1471992 1460405 1449575
8967 1449575 1437230 1414532 1390640 1373015 1356274 1343530 1331554 1316105 1305500 1291632 1281706 1269430
8955 1269430 1252937 1236333 1222605 1206529 1195127 1182809 1168372 1150487 1140486 1133994 1126599 1118260
8943 1118260 1111151 1104654 1092162 1077352 1066305 1047977 1042945 1042991 1030796 1020030 1015572 1008892 998779
8930 998779 986644 981120 973969 971826 953851 940300 926716 912530 899982 888662 882400 877932 876801
8917 876801 873421 866576 854360 841853 836843 836259 832623 825861 821411 816842 804975 794154 790985 778470
8903 778470 771693 764715 759123 757781 755399 748454 740957 738652 736935 732043 727502 725251 715747 701456
$$ packed form
8989A817078j8822j5963j9813k2333k2064j9059j6953j5139j8947k2441j6261
8978A609283j7925k0099j4689j2744j6574j5102j4400j2054j3704j1587j0830
8967A449575j2345k2698k3892j7625j6741j2744j1976j5449j0605j3868r926j2276
8955A269430j6493j6604j3728j6076j1402j2318j4437j7885j0001o492p395q339
8943A118260p109o497j2492j4810j1047j8328n032M6j2195j0766m458o680j0113
8930I98779j2135n524p151k143j7975j3551j3584j4186j2548j1320o262m468j131
8917H76801l380o845j2216j2507n010n84l636o762m450m569j1867j0821l169j2515
8903G78470o777o978n592j342k382o945p497k305j717m892m541k251r504j4291
$$ plain form
8889 701456 694140 696994 695921 688106 681325 674513 674532 669858 665094 662845 660150 656413 651676 648429 647752
8874 647752 640894 633397 632273 625174 622237 621190 608680 598855 594321 596326 597561 597987 604520 616315
8860 616315 624289 632263 645393 650329 653843 655789 662854 674677 681550 700306 734535 773143 839540
8847 839540 938165 1099104 1337886 1666628 1983637 2018396 1731166 1347501 1049164 866361
8837 866361 755358 692899 646131 613502 597341 578377 565164 552470 543099 535351 530226 518887
8825 518887 507078 496239 485600 480039 472602 463534 453122 450408 449339 444386 443889 440767 434400 428760
8811 428760 426172 423261 417909 420796 417431 412517 408302 401924 400930 403524 402175 404587 407300 399866 391123
8796 391123 384117 384236 384901 378528 379817 382235 383823 388637 388479 389009 389912 385818 381688 372837 366023 368802
$$ packed form
8889G01456p316K854j073p815o781o812J9m674m764k249k695l737m737l247o77
8874F47752o858p497j124p099k937j047j2510r825m534K005J235M26O533J1795
8860F16315P974P974J3130M936L514J946P065J1823O873J8756L4229L8608O6397
8847H39540R8625J60939K38782L28742L17009L4759k87230l83665k98337j82803
8837H66361j11003o2459m6768l2629j6161j8964j3213j2694r371p748n125j1339
8825E18887j1809j0839j0639n561p437r068j0412k714j069m953m97l122o367n640
8811D28760k588k911n352K887l365m914m215o378r94K594j349K412K713p434q743
8796C91123p006J19O65o373J289K418J588M814j58N30R03m094m130q851o814K779
$$ plain form
8780 368802 363902 358757 359478 357854 357818 358118 356004 350027 344955 342842 336546 335142 330784 329723 333528
8765 333528 331737 325027 323016 327288 331837 327058 314302 309673 318598 321899 313582 307142 308536 301873
8751 301873 300777 309110 306313 303331 300236 302658 304005 304660 299419 292954 294154 302412 303547 297697 301125
8736 301125 308134 304748 296789 291538 285698 285919 291063 294672 290522 281932 276441 275789 276637 272536 266611
8721 266611 255448 262686 270660 261794 254676 251820 253159 254334 256826 258159 251974 247458 249921 254719
8707 254719 259030 253747 246687 247619 245768 240325 237840 244940 240885 242850 243057 242862 243693 243055 237455 242217
8691 242217 242989 236860 238656 232358 231801 234588 233950 236479 235712 231024 231436 227670 226682 223739 222690 214177
8675 214177 206958 209913 212941 212237 216906 215423 215978 213862 207399 205792 205174 206710 202817 200303 202586
$$ packed form
8780C68802m900n145P21j624l6L00k114n977n072k113o296j404m358j061L805
8765C33528j791o710k011M272M549m779j2756m629Q925L301q317o440J394o663
8751C01873j096Q333k797k982l095K422J347O55n241o465J200Q258J135n850L428
8736C01125P009l386p959n251n840K21N144L609m150q590n491o52Q48m101n925
8721B66611j1163P238P974q866p118k856J339J175K492J333o185m516K463M798
8707B54719M311n283p060R32j851n443k485P100m055J965K07j95Q31o38n600M762
8691B42217P72o129J796o298n57K787o38K529p67m688M12l766r88k943j049q513
8675B14177p219K955L028p04M669j483N55k116o463j607o18J536l893k514K283
$$ plain form
8660 202586 200567 203363 209898 206519 201596 198479 199893 204407 212356 207026 203110 201472 196739 193037
8646 193037 194110 195488 197288 194935 197193 194030 192105 186903 186636 187374 185989 184078 183729 183689 180882 184137
8630 184137 183137 177880 177577 179134 178659 175569 171078 171166 171547 173852 179986 183116 181901 177157 174917 174863
8614 174863 175023 166900 164997 169306 170372 170837 166895 167118 167475 173889 173021 170008 166432 168399 165076 162505
8598 162505 165819 168755 168002 168188 162739 154835 151169 151814 151504 150389 156828 155821 161333 158150 163879
8583 163879 169316 169756 168726 168393 170620 168323 164643 164732 169841 166056 153427 147116 152420 158452 156528
8568 156528 162846 169485 159765 155825 156118 160725 161535 160486 159032 153534 151136 158716 161299 162062 156350
8553 156350 160006 166182 159816 154276 151998 146363 142005 143468 140635 143334 152594 150608 148097 149842
$$ packed form
8660B02586k019K796O535l379m923l117J414M514P949n330l916j638m733l702
8646A93037J073J378J800k353K258l163j925n202k67P38j385j911l49m0k807L255
8630A84137j000n257l03J557m75l090m491Q8L81K305O134L130j215m744k240n4
8614A74863J60q123j903M309J066M65l942K23L57O414q68l013l576J967l323k571
8598A62505L314K936p53J86n449p904l666O45l10j115O439j007N512l183N729
8583A63879N437M40j030l33K227k297l680Q9N109l785j2629o311N304O032j924
8568A56528O318O639r720l940K93M607Q10j049j454n498k398P580K583P63n712
8553A56350L656O176o366n540k278n635m358J463k833K699R260j986k511J745
$$ plain form
8539 149842 146047 141290 134086 128779 127590 130764 129930 126635 130378 133353 136694 136768 134695 128211 134218
8524 134218 139284 141619 143038 144317 147751 156678 159366 165904 179686 210916 249797 260407 232692
8511 232692 204802 192427 193391 187746 174644 166818 155020 144452 139358 137072 129796 119072 122121
8498 122121 119517 118261 115958 118377 114197 116196 115006 118911 121178 119384 116046 114688 116244 117625
8484 117625 114088 111024 114367 117908 121608 115756 109501 114319 116649 122123 127015 119508 116167 114254
8470 114254 114891 120466 124620 127493 124074 124338 128567 127321 119662 110885 114226 118737 117194 118235 116516
8455 116516 117312 115161 118633 119306 118651 122303 125963 125597 125229 118002 110630 112279 112627 116351 114167 109223
8439 109223 101921 98744 98996 102261 105588 98787 91082 89025 96427 100733 95440 96235 104142 102490 103034
$$ packed form
8539A49842l795m757p204n307j189L174q34l295L743K975L341P4k073o484O007
8524A34218N066K335J419J279L434Q927K688O538J3782L1230L8881J0610k7715
8511B32692k7890j2375R64n645j3102p826j1798j0568n094k286p276j0724L049
8498A22121k604j256k303K419m180J999j190L905K267j794l338j358J556J381
8484A17625l537l064L343L541L700n852o255M818K330N474M892p507l341j913
8470A14254O37N575M154K873l419K64M229j246p659q777L341M511j543J041j719
8455A16516P96k151L472O73o55L652L660l66l68p227p372J649L48L724k184m944
8439A09223p302l177K52L265L327o801p705k057P402M306n293P95P907j652N44
$$ plain form
8424 103034 117784 120509 111605 105171 96781 94176 96024 95664 95017 96537 103960 104092 106076 102309 100311
8409 100311 97125 97917 98601 96736 99305 93096 92081 92646 97887 99887 98766 93894 90580 94529 95178
8394 95178 93794 96853 92846 86856 81284 86209 94277 90153 88307 90709 91787 90536 91423 96404 99168
8379 99168 98710 93379 87546 86576 85456 81416 82594 84825 84510 90301 92927 92507 95903 95471 94039 93331
8363 93331 90196 88136 88838 85243 83534 85354 82252 83275 87488 85114 84372 79718 73320 74692 75271
8348 75271 76424 78766 74744 77041 83212 88009 84563 83163 84689 92295 93149 82882 75346 80224 86554
8333 86554 84047 81046 73565 68626 69030 73758 74050 69990 73304 74413 68574 70150 79888 81640 74273
8318 74273 75693 79745 82610 78242 73141 71570 71916 73726 74001 76711 72699 67140 72390 75201 86138
$$ packed form
8424A03034J4750K725q904o434q390k605J848l60o47J520P423J32J984l767j998
8409A00311l186P92O84j865K569o209j015N65N241K000j121m872l314L949O49
8394I5178j384L059m007n990n572M925Q068m124j846K402J078j251Q87M981K764
8379I9168m58n331n833r70j120m040J178K231l15N791K626m20L396m32j432p08
8363I3331l135k060P02l595j709J820l102J023M213k374p42m654o398J372N79
8348G5271J153K342m022K297O171M797l446j400J526P606Q54j0267p536M878O330
8333H6554k507l001p481m939M04M728K92m060L314J109n839J576R738J752p367
8318G4273J420M052K865m368n101j571L46J810K75K710m012n559N250K811J0937
$$ plain form
8303 86138 96169 111349 134539 154737 175272 178984 164612 140956 115928 104932 96873 94332
8291 94332 89551 81798 81524 78855 78790 81669 69327 70456 76617 71021 75094 81255 78967 73374 73505
8276 73505 74471 72788 68833 74479 76690 76642 73242 68312 73475 76174 78645 79328 79966 83475 85936 83575
8260 83575 90064 104299 123730 145123 166230 173863 162227 138254 117023 105901 105463 104477 100399
8247 100399 100157 109902 131519 155692 183351 198658 194255 169105 133384 106806 96077 89207 77127
8234 77127 68008 64519 58835 66764 70084 70163 67061 67817 65229 63345 58523 61139 58863 59903 60922
8219 60922 56592 54262 59133 61932 64067 65936 63238 63179 62393 61189 53192 58617 71606 72448 74287
8204 74287 85411 90795 97812 117682 143797 166610 178412 169097 140380 105162 85162 75308 72190
$$ packed form
8303H6138J0031J5180K3190K0198K0535L712j4372k3656k5028j0996q059k541
8291I4332m781p753k74k669o5K879j2342J129O161n596M073O161k288n593J31
8276G3505R66j683l955N646K211m8l400m930N163K699K471O83O38L509K461k361
8260H3575O489J4235J9431K1393K1107P633j1636k3973k1231j1122m38r86m078
8247A00399k42R745K1617K4173K7659J5307m403k5150l5721k6578j0729o870j2080
8234G7127r119l489n684P929L320P9l102P56k588j884m822K616k276J040J019
8219F0922m330k330M871K799K135J869k698n9p86j204p997N425J2989Q42J839
8204G4287J1124N384P017J9870K6115K2813J1802r315k8717l5218k0000r854l118
$$ plain form
8191 72190 70288 67265 56039 56619 59008 61653 65779 67798 56402 52108 52160 52249 48981 49360 43566 45141
8175 45141 45135 43833 39405 41725 43828 44809 51028 47941 42897 43103 46339 48698 53724 61414 60911 56262
8159 56262 55930 60078 65598 57468 53687 56429 52099 52440 45525 46436 47590 54357 61645 61406 58523 58100
8143 58100 53137 49805 45306 40802 41288 43278 49400 56026 57944 50505 42021 39578 39311 40872 42111
8128 42111 47601 54070 54619 55059 49168 49987 52199 56792 58310 56591 66788 75052 69702 61089 58057
8113 58057 52731 49681 50926 52129 51657 54045 56262 60341 56623 58518 61754 59024 66076 78511 82024
8098 82024 82707 92023 100950 97963 93720 87148 77621 64246 56974 55550 56339 56828 55376 53711 48337
8083 48337 41775 43428 48763 53998 63058 69399 64445 63105 67797 68271 67690 72396 75298 70304 63541
$$ packed form
8191G2190j902l023j1226N80K389K645M126K019j1396m294N2Q9l268L79n794J575
8175D5141oj302m428K320K103R81O219l087n044K06L236K359N026P690n03m649
8159E6262l32M148N520q130l781K742m330L41o915R11J154O767P288k39k883m23
8143E8100m963l332m499m504M86J990O122O626J918p439q484k443k67J561J239
8128D2111N490O469N49M40n891Q19K212M593J518j719J0197Q264n350q613l032
8113E8057n326l050J245J203m72K388K217M079l718J895L236k730P052J2435L513
8098H2024O83R316Q927k987m243o572r527j3375p272j424P89M89j452j665n374
8083D8337o562J653N335N235R060O341m954j340M692M74n81M706K902m994o763
$$ plain form
8068 63541 56206 51938 48680 47230 48857 52781 55670 54569 55435 57526 65781 77124 86323 91556 106421
8053 106421 127724 139946 145268 140353 126974 109029 98485 88968 81879 70685 69136 78692 75223
8040 75223 63203 57694 61793 64010 59993 60372 65037 62952 61668 63261 64131 62023 62068 55845 61565
8025 61565 67041 65292 60434 55317 58524 58750 58451 60344 61527 60954 56349 52459 52524 60723 69757 72309
8009 72309 74089 74013 85261 90020 89822 82569 84706 89586 83718 72795 64190 63260 64887 62547 60572
7994 60572 60604 50083 46398 50029 46857 47553 51371 52140 53528 51593 54654 51492 49169 46974 45699
7979 45699 43703 46965 55846 59627 50560 46215 46589 42684 46126 42380 43597 38809 37815 45701 51541
7964 51541 55860 54018 50123 42980 38585 44148 51585 54963 46248 33046 30168 31135 30385 33669 41662
$$ packed form
8068F3541p335m268l258j450J627L924K889j101Q66K091Q255J1343R199N233J4865
8053A06421K1303J2222N322m915j3379j7945j0544r517p089j1194j549R556l469
8040G5223j2020n509M099K217m017L79M665k085j284J593Q70k108M5o223N720
8025F1565N476j749m858n117L207K26k99J893J183n73m605l890O5Q199R034K552
8009G2309J780p6J1248M759j98p253K137M880n868j0923q605r30J627k340j975
7994F0572L2j0521l685L631l172O96L818P69J388j935L061l162k323k195j275
7979D5699j996L262Q881L781r067m345L74l905L442l746J217m788r94P886N840
7964E1541M319j842l895p143m395N563P437L378q715j3202k878R67p50L284P993
$$ plain form
7949 41662 31237 34356 45666 51214 50949 44532 36878 36499 37875 40772 46938 52783 48597 40117 28858
7934 28858 25501 36495 44394 42914 36952 33084 38453 45274 45617 47611 46159 44115 41262 38154 41185
7919 41185 37737 41225 40744 44083 39573 38913 41421 42224 42390 43210 43352 39081 34274 34225 33223 34069 28894
7902 28894 30679 34458 39338 36964 43164 40929 41736 42842 44028 39178 36290 39589 40341 38619 38319
7887 38319 28892 20714 20877 25931 29908 29247 35785 41225 37761 35965 32777 29967 28711 28716 27703 35304
7871 35304 40043 37423 29683 22127 15380 18523 27375 35221 32380 23501 28400 25232 16905 24675 35492
7856 35492 40169 38927 36645 32972 33413 32333 37007 38040 31133 32367 31436 26965 21284 30990 43315
7841 43315 41615 39126 42612 40589 31411 26028 22424 18938 19775 20579 18727 27134 28660 25999 24938
$$ packed form
7949D1662j0425L119J1310N548k65o417p654l79J376K897O166N845m186q480j1259
7934B8858l357J0994P899j480n962l868N369O821L43J994j452k044k853l108L031
7919D1185l448L488m81L339m510o60K508Q03J66Q20J42m271m807m9j002Q46n175
7902B8894J785L779M880k374O200k235Q07J106J186m850k888L299P52j722l00
7887C8319r427q178J63N054L977o61O538N440l464j796l188k810j256Nj013P601
7871C5304M739k620p740p556o747L143Q852P846k841q879M899l168q327P770J0817
7856C5492M677j242k282l673M41j080M674J033o907J234r31m471n681R706J2325
7841D3315j700k489L486k023r178n383l604l486Q37Q04j852Q407J526k661j061
$$ plain form
7826 24938 21299 22071 27688 30253 29949 23219 19794 10947 13270 13296 9652 13189 17183 18731 20090 21900
7810 21900 19855 25170 29023 23923 25437 26471 25997 23569 25361 28589 32786 32645 26930 18895 12035
7795 12035 12942 22548 29530 26129 18684 24254 25878 27879 30057 22568 21012 21392 13724 13161 15150
7780 15150 10783 11119 20518 24353 19574 18096 15223 18755 17786 19712 21122 19828 19797 19469 11336 4274
7764 4274 8593 14209 21479 29383 23220 22011 19783 16998 14702 6945 1976 6541 10034 15069 18913
7749 18913 24327 25624 21798 25775 25309 25624 19849 21249 24698 21418 11491 12494 10524 10542 9699 12231
7733 12231 10629 5926 8394 6745 12607 18985 21370 24491 32091 31116 24776 23921 20355 20787 26959
7718 26959 21891 22040 28699 30365 28213 24832 25993 27670 23007 17882 15413 17515 20641 20286 12373
$$ packed form
7826B4938l639P72N617K565l04o730l425q847K323K6l644L537L994J548J359J810
7810B1900k045N315L853n100J514J034m74k428J792L228M197j41n715q035o860
7795A2035R07R606O982l401p445N570J624K001K178p489j556L80p668n63J989
7780A5150m367L36R399L835m779j478k873L532r69J926J410j294l1l28q133p062
7764D274M319N616P270P904o163j209k228k785k296p757m969M565L493N035L844
7749A8913N414J297l826L977m66L15n775J400L449l280r927J003j970J8q43K532
7733A2231j602m703K468j649N862O378K385L121P600r75o340q55l566M32O172
7718B6959n068J49O659J666k152l381J161J677m663n125k469K102L126l55p913
$$ plain form
7703 12373 7709 11768 17555 19572 24860 30160 33505 34359 23856 23683 21090 20715 16354 19765 22547
7688 22547 19156 19941 23221 24812 20529 21661 20112 18317 20172 23449 28571 28509 27902 20878 18273 15586
7672 15586 17402 17081 13266 7268 6280 9761 12057 14003 13374 15176 17203 18008 22266 20863 19844 13119
7656 13119 9640 6774 8447 12082 12358 18785 23082 21653 21619 24664 24020 21173 13382 13565 12411 14432
7640 14432 14144 10867 21292 15616 8379 13071 13750 12865 14049 21249 19959 18676 18938 16018 15387 9240
7624 9240 7237 7833 10873 7312 6392 10529 12017 6704 2561 6479 12709 19354 13104 10289 11298
7609 11298 8360 15971 14045 4118 -586 2945 7262 10588 8484 8985 13213 16616 21905 19081 17472
7594 17472 15857 8675 10935 15556 16953 23516 27707 23878 20223 15624 16893 24768 32638 33413 31377
$$ packed form
7703A2373m664M059N787K017N288N300L345Q54j0503j73k593l75m361L411K782
7688B2547l391P85L280J591m283J132j549j795J855L277N122o2o07p024k605k687
7672A5586J816l21l815n998r88L481K296J946o29J802K027Q05M258j403j019o725
7656A3119l479k866J673L635K76O427M297j429l4L045o44k847p791J83j154K021
7640A4432k88l277J0425n676p237M692O79q85J184P200j290j283K62k920o31o147
7624I240k003N96L040l561r20M137J488n313m143L918O230O645o250k815J009
7609A1298k938P611j926r927m704L531M317L326k104N01M228L403N289k824j609
7594A7472j615p182K260M621J397O563M191l829l655m599J269P875P870P75k036
$$ plain form
7579 31377 24739 22040 24414 23487 14191 4621 2454 2653 5495 14701 16280 7961 6470 10096 11700
7564 11700 10651 13445 14555 18223 18991 19141 22168 21649 16318 10164 14776 15255 18716 16425 13225 10589
7548 10589 14228 20672 34349 36240 30520 28080 28081 31700 34736 27369 14464 11551 10681 9712 8798 4943
7532 4943 2884 10896 16264 20735 19429 18512 20712 20127 19475 15599 4762 7138 6373 11498 23148
7517 23148 23290 18030 13373 5614 6817 9600 10127 7849 5456 5067 9188 8042 2773 7260 11018
7502 11018 13717 12474 6959 4353 6306 12904 13700 9899 6961 5066 7318 10939 9846 13648 15000
7487 15000 9731 3401 3698 11641 17618 21716 23482 17251 9338 6416 170 -5680 -7896 -3771 1736
7472 1736 13934 15976 8409 3959 2384 -1969 6982 12914 14468 15341 10282 9057 14756 10299 -861
$$ packed form
7579C1377o638k699K374r27r296r570k167J99K842R206J579q319j491L626J604
7564A1700j049K794J110L668P68J50L027n19n331o154M612M79L461k291l200k636
7548A0589L639O444J3677J891n720k440JL619L036p367j2905k913q70r69r14l855
7532D943k059Q012N368M471j306r17K200n85o52l876j0837K376p65N125J1650
7517B3148J42n260m657p759J203K783N27k278k393l89M121j146n269M487L758
7502A1018K699j243n515k606J953O598P96l801k938j895K252L621j093L802J352
7487A5000n269o330K97P943N977M098J766o231p913k922o246n850k216M125N507
7472A736J2198K042p567m450j575m353Q951N932J554Q73n059j225N699m457j1160
$$ plain form
7457 -861 -2279 -1214 -5619 -2646 6740 7576 10081 8973 3289 3522 6799 14544 13979 13525 15735 17825
7441 17825 16122 13207 11975 11255 6072 14309 16965 15339 16083 20718 12822 7401 13951 17567 16183
7426 16183 15753 12797 13676 12351 7420 9124 14136 13364 12680 5972 4364 7841 9247 9910 6972 7013
7410 7013 10092 12539 11427 11793 22386 19207 16257 6128 621 4046 5379 3674 -2105 1466 5721
7395 5721 4454 2022 7084 5790 1594 724 6341 10098 11131 5949 1742 -1419 -1809 -2443 5678 4489
7379 4489 -2162 4564 6566 13172 13409 8687 6985 7646 10450 15945 16735 9890 8727 11321 10879 11157
7363 11157 16191 26507 26271 23827 15726 17370 14187 19123 19531 17233 18231 19281 24823 23252 12333
7348 12333 7450 8606 12188 8923 9094 7934 9704 17756 14271 14315 12716 16122 15444 12924 11865 6419
$$ packed form
7457h61j418J065m405K973R386Q36K505j108n684K33L277P745n65m54K210K090
7441A7825j703k915j232p20n183Q237K656j626P44M635p896n421O550L616j384
7426A6183m30k956Q79j325m931J704N012p72o84o708j608L477J406O63k938M1
7410G013L079K447j112L66J0593l179k950j0129n507L425J333j705n779L571M255
7395E721j267k432N062j294m196q70N617L757J033n182m207l161l90o34Q121j189
7379D489o651O726K002O606K37m722j702O61K804N495P90o845j163K594m42K78
7363A1157N034J0316k36k444q101J644l183M936M08k298R98J050N542j571j0919
7348A2333m883J156L582l265J71j160J770Q052l485M4j599L406o78k520j059n446
$$ plain form
7332 6419 4157 -770 1450 2193 254 1510 6321 7081 3737 -86 -1138 7848 11284 7292 4296
7317 4296 4201 -3399 -1060 3413 8040 6066 10517 17670 12762 7864 6353 6487 4603 5368 6229 9590
7301 9590 8907 6843 9448 10508 12656 11973 16200 19011 16604 14010 14297 8550 10248 17986 13287 8324
7285 8324 2445 1173 8583 14238 19242 20422 13762 15331 17734 12661 4213 -2451 -5322 -3000 -6125
7270 -6125 -3626 -2740 1204 947 594 420 -7544 -8609 -1500 1047 -2156 4143 5197 3652 8492 4696
7254 4696 3070 9861 9778 10476 17644 18936 10916 9017 5680 8147 10868 10955 10778 9366 13047 18952
7238 18952 22198 21257 10882 5274 1040 3238 4217 4316 5556 3207 4248 870 -729 3406 8154
7223 8154 11464 7891 10719 4158 -616 3480 5149 10709 9262 9702 10184 11624 11001 6711 7030 11753
$$ packed form
7332F419k262m927K220P43j939J256M811P60l344l823j052Q986L436l992k996
7317D296r5p600K339M473M627j974M451P153m908m898j511J34j884P65Q61L361
7301I590o83k064K605J060K148o83M227K811k407k594K87n747J698P738m699m963
7285H324n879j272P410N655N004J180o660J569K403n073q448o664k871K322l125
7270f125K499Q86L944k57l53j74p964j065P109K547l203O299J054j545M840l796
7254D696j626O791q3O98P168J292q020j899l337K467K721Q7j77j412L681N905
7238A8952L246r41j0375n608m234K198R79R9J240k349J041l378j599M135M748
7223H154L310l573K828o561m774M096J669N560j447M40M82J440o23m290L19M723
$$ plain form
7207 11753 14449 17047 18994 10199 870 -1525 -1696 1167 2575 4261 -224 258 5919 5249 -642
7192 -642 -4661 -4971 -6879 -2901 2833 5748 3768 2514 5346 9575 4876 3366 829 -556 6226
7177 6226 10676 12765 15197 18518 11546 5353 960 -2879 -6625 -168 900 2925 4063 -2611 -7036
7162 -7036 -12200 -10087 -6341 -2593 5254 6119 5731 9344 7682 8429 14211 15409 11948 9327 4224 -688
7146 -688 -5076 -4177 3546 6861 1582 -6415 -4779 -3200 -10595 -11655 -4016 2297 6740 5213 -602
7131 -602 -5565 -758 2085 -1806 3176 7437 -433 -3840 5248 6021 2046 7885 8485 12143 12566 4513
7115 4513 2780 3135 5965 13155 14090 3395 -2845 -2462 1564 6864 8674 9500 12938 8752 7257 5202
7099 5202 8334 10093 9039 6164 6895 694 2947 515 -10818 -6611 4630 -773 -3727 7373
$$ packed form
7207A1753K696K598J947q795r329k395j71K863J408J686m485M82N661o70n891
7192f42m019l10j908L978N734K915j980j254K832M229m699j510k537j385O782
7177F226M450K089K432L321o972o193m393l839l746O457J068K025J138o674m425
7162g036n164K113L746L748P847Q65l88L613j662P47N782J198l461k621n103m912
7146f88m388Q99P723L315n279p997J636J579p395j060P639O313M443j527n815
7131f02m963M807K843l891M982M261p870l407R088P73l975N839O00L658M23q053
7115D513j733L55K830P190R35j0695o240L83M026N300J810Q26L438m186j495k055
7099E202L132J759j054k875P31o201K253k432j1333M207J1241n403k954J1100
$$ plain form
7085 7373 12812 13258 12535 16166 16556 12376 10103 8592 9967 15628 18698 14127 2960 6964 10717
7070 10717 8719 8280 3559 2657 30 3227 6598 7090 11057 16604 13629 12328 13231 12724 11314 12638
7054 12638 12053 6149 2543 2879 759 176 9234 6952 5086 9519 7183 3190 6294 12496 14501
7039 14501 5927 1562 4587 10261 13390 12370 7884 6683 3141 8280 9049 3390 970 8831 6224
7024 6224 -2230 -507 -55 -1583 4611 6192 11921 12293 6158 4025 1813 1540 3263 3924 2482 3800
7008 3800 1553 -1277 1842 7083 11303 9755 4022 -441 -1932 -25 -5204 -6704 -930 842 5037
6993 5037 6044 3698 3400 1181 2871 6289 10182 13793 13526 7782 7182 2368 -4415 -4061 2119 9966
6977 9966 18456 29501 29110 32412 39032 41220 38523 23408 18046 13814 7806 -2491 -8774 -15061
$$ packed form
7085G373N439M46p23L631L90m180k273j511J375N661L070m571j1167M004L753
7070A0717j998m39m721r02k627L197L371M92L967N547k975j301R03n07j410J324
7054A2638n85n904l606L36k120n83R058k282j866M433k336l993L104O202K005
7039A4501q574m365L025N674L129j020m486j201l542N139P69n659k420P861k607
7024F224q454J723M52j528O194J581N729L72o135k133k212k73J723O61j442J318
7008C800k247k830L119N241M220j548n733m463j491J907n179j500N774J772M195
6993E037J007k346k98k219J690L418L893L611k67n744o00m814o783L54O180P847
6977I966Q490J1045l91L302O620K188k697j5115n362m232o008j0297o283o287
$$ plain form
6963 -15061 -15114 -9220 -1876 -2458 -4912 -4041 -3751 -3211 2204 1764 5123 12485 15361 13574 8233 2898
6947 2898 3259 1059 -1364 -3487 -2452 -6609 -6675 -7584 -5310 1186 7119 -84 -6869 1129 3715 4003
6931 4003 7330 6498 6347 6242 4182 4730 5664 5650 352 4194 8965 9494 7825 11648 9643 278 -5601
6914 -5601 -4408 -3290 -3839 -4592 -3717 -7505 -7030 2190 7763 6292 11885 10648 3725 462 -819 3781
6898 3781 4125 1131 -2530 -544 1046 5625 10178 11773 10455 7701 4407 -327 4094 3789 1674
6883 1674 1195 1767 3192 11264 13056 5138 2900 8260 10645 8122 3797 1573 -1074 2282 9548
6868 9548 15135 13729 8768 5792 1211 -919 -2327 3717 2922 2477 8285 9910 8007 4392 6645
6853 6645 4595 5526 1126 3744 2160 2032 1983 1810 11582 13556 3176 3376 6427 7894 8293 6375
$$ packed form
6963a5061n3N894P344n82k454Q71K90N40N415m40L359P362K876j787n341n335
6947B898L61k200k423k123J035m157o6r09K274O496N933p203o785P998K586K88
6931D003L327q32j51j05k060N48R34j4n298L842M771N29j669L823k005r365n879
6914e601J193J118n49p53Q75l788M75R220N573j471N593j237o923l263j281M600
6898C781L44k994l661J986J590M579M553J595j318k754l294m734M421l05k115
6883A674m79N72J425Q072J792p918k238N360K385k523m325k224k647L356P266
6868I548N587j406m961k976m581k130j408O044p95m45N808J625j903l615K253
6853F645k050R31m400K618j584j28m9j73R772J974j0380K00L051J467L99j918
$$ plain form
6837 6375 -2729 -3259 7424 8013 7957 14173 8412 5594 6811 10793 10087 12357 7983 2049 -169 2843
6821 2843 2113 -731 2875 3245 4771 10996 11445 9181 5305 4515 2940 8645 13926 13614 8870 6198
6805 6198 987 3705 15599 21434 25548 29199 33677 34431 34420 32981 32870 38476 49956 63199 50705
6790 50705 33435 21941 9805 3917 822 718 -1780 -6358 -5368 -1378 15092 20852 17205 17027
6776 17027 25369 33559 43985 52950 40192 24027 19484 21124 23625 24870 22591 13310 2103 2410
6762 2410 6064 708 3463 3900 -1890 -5029 1729 2333 -871 -1653 1064 2092 3049 9370 6646 3484
6746 3484 6238 8012 8522 4394 6041 9727 6559 5815 -1071 -1948 5822 6011 7159 4890 -1816 2893
6730 2893 1690 45 3384 1243 4311 2526 844 4126 -4206 -9491 -3067 1014 -3128 -8658 -9606
$$ packed form
6837F375r104n30J0683N89n6O216n761k818J217L982p06K270m374n934k218L012
6821B843p30k844L606L70J526O225M49k264l876p90j575N705N281l12m744k672
6805F198n211K718J1894N835M114L651M478P54j1j439j11N606J1480J3243j2494
6790E0705j7270j1494j2136n888l095j04k498m578R90L990J6470N760l647j78
6776A7027Q342Q190J0426Q965j2758j6165m543J640K501J245k279r281j1207L07
6762B410L654n356K755M37n790l139O758O04l204p82K717J028R57O321k724l162
6746C484K754J774N10m128J647L686l168p44o886q77P770J89J148k269o706M709
6730B893j203j645L339k141L068j785j682L282q332n285O424M081m142n530r48
$$ plain form
6715 -9606 -9061 -8767 -10485 -7055 -3888 2194 5543 6950 3035 1371 2478 400 4951 13660 11050
6700 11050 6372 1578 394 5030 10609 15793 18102 15466 4659 -5008 -9940 -6813 -1942 -876
6686 -876 -876 -3600 -2160 -4637 1518 8493 8452 5630 1769 -6575 -9789 -6302 -7002 -5917 -821 -3630 -6863
6669 -6863 -6789 -6238 -1377 -336 -4451 -5702 -5837 2175 5947 5796 564 -5088 -1933 -930 -769 7350
6653 7350 10733 7831 6166 5043 -356 -7751 -5984 -9355 -8114 -10890 -10367 -8592 -5413 558 3082
6638 3082 3918 5246 1879 3860 3555 -350 -2197 -5138 -430 4316 -130 2562 8226 9353 4473
6623 4473 6331 4763 1009 -533 -856 1191 7117 4563 5910 4191 7833 3620 -3303 -8501 -3933
6608 -3933 5043 6990 3872 -183 -3636 -7879 -6211 95 3485 4421 782 3521 8210 8842 4623
$$ packed form
6715i606N45K94j718L430L167O082L349J407l915j664J107k078M551Q709k610
6700A1050m678m794j184M636N579N184K309k636j0807r667m932L127M871J066
6686h76%k724J440k477O155O975m1k822l861q344l214L487p00J085N096k809l233
6669f863P4N51M861J041m115j251j35Q012L772j51n232n652L155J003J61Q119
6653G350L383k902j665j123n399p395J767l371J241k776N23J775L179N971K524
6638C082Q36J328l367J981l05l905j847k941M708M746m446K692N664J127m880
6623D473J858j568l754j542l23K047N926k554J347j719L642m213o923n198M568
6608c933Q976J947l118m055l453m243J668O306L390R36l639K739M689O32m219
$$ plain form
6593 4623 -4462 -4626 -1770 -223 -3826 -2375 -3317 -2833 -4922 -5834 -4354 -3017 -3561 -402 -2652 -4832
6577 -4832 -7578 -11596 -10112 -9930 -10040 -6918 -3618 -690 10492 13197 11703 7673 4703 -189 3352
6562 3352 3946 1997 5493 3417 6752 3495 -1597 -7029 -11906 -6540 1409 1699 10572 1995 -4705
6547 -4705 -5056 -7034 -5392 -5498 -7663 -5059 4038 6813 13633 14872 7155 79 2771 5842 7316
6532 7316 9162 6403 569 -3563 720 8422 8539 7451 8008 -551 -1506 -2701 -3630 -5096 -3012 -2131
6516 -2131 -1489 3327 5005 5832 10558 9186 75 -10346 -5499 836 -1499 -2498 1916 2393 2082 -3326
6500 -3326 -6183 -5504 -8922 -6752 -1039 -896 1583 -4163 -6902 -4457 -7492 -9665 -11612 -5986 -5034 -8702
6484 -8702 -7287 -2805 902 2955 -4335 -11652 -12767 -12551 -17066 -13720 -8532 -6879 -4274 748 8969
$$ packed form
6593D623r085j64K856J547l603J451r42M84k089r12J480J337n44L159k250k180
6577d832k746m018J484J82j10L122L300K928J1182K705j494m030k970m892L541
6562C352N94j949L496k076L335l257n092n432m877N366P949K90Q873q577o700
6547d705l51j978J642j06k165K604R097K775O820J239p717p076K692L071J474
6532G316J846k759n834m132M283P702J17j088N57q559r55j195r29j466K084Q81
6516b131O42M816J678Q27M726j372r111j0421M847O335k335r99M414M77l11n408
6500c326k857O79l418K170N713J43K479n746k739K445l035k173j947N626R52l668
6484h702J415M482L707K053p290p317j115K16m515L346N188J653K605N022Q221
$$ plain form
6469 8969 15183 17049 8830 -850 -3080 -2266 -6695 -8366 -6151 -1181 4144 2875 -83 -2693 -6690
6454 -6690 -9435 -10094 -11432 -7023 462 2688 2856 2252 862 -582 -5456 -5592 -5773 -6823 -5149 2726
6438 2726 9288 3143 -104 -374 3171 10737 7008 2945 3076 5205 4344 1831 -2667 -536 9520
6423 9520 9818 5052 6320 6405 30 -4523 -14523 -17721 -9192 -4418 -2259 3930 5474 5556 6237 1873
6407 1873 742 -238 4456 7778 8242 10826 11170 13301 3992 -745 1263 2471 -1490 120 -1273 -6282
6391 -6282 -7052 368 -431 -2481 -6375 -10508 -10256 -9626 -3705 2681 4384 138 -3285 -3436 2125 934
6375 934 5407 5684 2258 936 72 3508 4084 767 1540 1816 4391 5867 6685 14272 9624 1639 2495
6358 2495 7523 7073 3987 3116 2285 3971 8441 7920 1909 1664 -1405 1413 4751 1238 3485 2168
$$ packed form
6469H969O214J866q219r680k230Q14m429j671K215M970N325j269k958k610l997
6454f690k745o59j338M409P485K226J68o04j390j444m874j36j81j050J674P875
6438B726O562o145l247k70L545P566l729m063J31K129q61k513m498K131J0056
6423I520K98m766J268Q5o375m553j0000l198Q529M774K159O189J544Q2O81m364
6407A873j131r80M694L322M64K584L44K131r309m737K008J208l961J610j393n009
6391f282p70P420p99k050l894m133K52O30N921O386J703m246l423j51N561j191
6375I34M473K77l426j322q64L436N76l317P73K76K575J476Q18P587m648p985Q56
6358B495N028m50l086q71q31J686M470n21o011k45l069K818L338l513K247j317
$$ plain form
6342 2168 -957 1431 6307 11827 9190 3030 -2144 -2619 -2733 1984 7804 2254 601 -380 -4362 -699
6326 -699 3052 982 1786 4335 4761 -1214 -5604 -2578 38 576 910 -363 -2713 -3602 -3154 -6979 -6763
6309 -6763 -9165 -8492 -8992 -6591 -3763 -2528 -3629 101 -241 -4873 -6492 -8107 -8981 -5574 136 8563
6293 8563 8090 744 1017 1607 2756 6195 8031 9447 7446 -510 -9416 -11624 -10334 -9161 -8452 -1739
6277 -1739 3515 3818 -2902 -3611 -6468 -14863 -14201 -2211 2676 284 -5750 -8734 -10512 -9392 -4010
6262 -4010 6600 2743 -8477 -7433 -4324 -11854 -18704 -12931 -7762 -599 -6367 440 1170 -502 2169
6247 2169 -3366 -3604 3311 4914 7386 3784 -2513 -3504 -9985 -11967 -8594 -9430 -10980 -13135 -12302 -4432
6231 -4432 -6456 -2603 247 -1806 -1671 -9572 -11890 -5934 3687 2160 -1814 -1585 562 3943 4624 2632
$$ packed form
6342B168l125K388M876N520k637o160n174m75j14M717N820n550j653r81l982L663
6326f99L751k070Q04K549M26n975m390L026K616N38L34j273k350q89M48l825K16
6309f763k402O73n00K401K828J235j101L730l42m632j619j615q74L407N710Q427
6293H563m73p346K73N90J149L439J836J416k001p956q906k208J290J173P09O713
6277a739N254L03o720p09k857q395O62J1990M887k392o034k984j778J120N382
6262d010J0610l857j1220J044L109p530o850N773N169P163n768O807P30j672K671
6247B169n535k38O915J603K472l602o297r91o481j982L373q36j550k155Q33P870
6231d432k024L853K850k053J35p901k318N956R621j527l974K29K147L381O81j992
$$ plain form
6215 2632 -2510 -5978 -9167 -7420 2610 12379 3984 -513 -4437 -5751 -11461 -12158 -15057 -13295 -8499
6200 -8499 -7423 -7351 -7162 269 1851 1976 1685 4823 6856 4914 4215 -2245 -963 8 -1876 417 2680
6183 2680 -5940 -16432 -10735 -5086 -4044 4519 5298 2675 -6769 -1859 -521 584 -1762 -7660 -5132
6168 -5132 2035 2208 -1855 -4152 -7071 -13751 -17055 -12311 -8354 -6679 -1508 3304 3918 4156 8322 8261
6152 8261 5546 1533 -1160 -7046 -6452 -6490 3197 10681 11235 3631 -3662 -708 1632 2509 1450 -5006
6136 -5006 -3752 -3250 -2077 -585 -3885 -4921 -864 -2544 -6536 -6349 -7812 -11911 -7870 -7635 -5165 -122
6120 -122 5541 6240 5688 3503 2168 -2661 -3376 8693 18357 10986 3680 343 2177 4872 3623 3085
6104 3085 -1381 -2067 3060 6737 6215 4315 122 -185 1470 4635 -50 -4778 -4598 -6209 -15657 -16611
$$ packed form
6215B632n142l468l189J747J0030R769q395m497l924j314n710o97k899J762M796
6200h499J076P2J89P431J582J25k91L138K033j942o99o460J282R71j884K293K263
6183B680q620j0492N697N649J042Q563P79k623r444M910J338J105k346n898K528
6168e132P167J73m063k297k919o680l304M744L957J675N171M812O14K38M166o1
6152H261k715m013k693n886N94l8R687P484N54p604p293K954K340Q77j059o456
6136e006J254N02J173J492l300j036M057j680l992J87j463m099M041K35K470N043
6120a22N663O99n52k185j335m829p15J2069R664p371p306l337J834K695j249n38
6104C085m466o86N127L677n22j900m193l07J655L165m685m728J80j611r448r54
$$ plain form
6088 -16611 -12229 -2356 3103 3383 1382 7048 13221 6247 640 2836 5282 1501 663 -2753 -1066
6073 -1066 -4759 -8107 -4008 -878 1559 1764 -1671 1189 -1552 -7276 -8500 -12780 -13293 -8115 -6017
6058 -6017 -9504 -5830 -4468 -6651 -3985 -5941 -3714 -3636 -1119 4838 666 163 -2816 -6661 -6824 -2171
6042 -2171 2212 -973 -4698 -6204 -14615 -7656 3609 2601 -3344 -6139 3176 4424 3855 6782 13108
6027 13108 13371 13479 8108 -5268 -9200 -4969 4411 14021 15616 9950 3795 5379 -1421 -4500 -6950
6012 -6950 -7476 -2548 -883 1971 2030 622 -3398 -10426 -6859 -1306 -4407 -11186 -10987 -10771 -13691 -10621
5996 -10621 -11006 -12905 -6488 -3955 766 -6794 -14501 -15709 -15172 -10764 -8010 -12406 -14136 -10751 -10688 -7551
5980 -7551 -9566 -15749 -15735 -13347 -14091 -10931 -3928 3252 -5200 -10902 -6185 6211 9106 13766 11939
$$ packed form
6088a6611M382R873N459K80k001N666O173o974n607K196K446l781q38l416J687
6073a066l693l348M099L130K437K05l435K860k741n724j224m280n13N178K098
6058f017l487L674J362k183K666j956K227P8K517N957m172n03k979l845j63M653
6042b171M383l185l725j506q411O959J1265j008n945k795R315J248n69K927O326
6027A3108K63J08n371j3376l932M231R380R610J595n666o155J584o800l079k450
6012f950n26M928J665K854N9j408m020p028L567N553l101o779J99K16k920L070
5996a0621l85j899O417K533M721p560p707j208N37M408K754m396j730L385O3L137
5980g551k015o183J4K388p44L160P003P180q452n702M717J2396K895M660j827
$$ plain form
5965 11939 11793 10300 3514 -5703 -5448 -7567 -10495 -11004 -11747 -1860 186 -2162 -5548 -6179 -6408 -4724
5949 -4724 -4560 -7832 -1926 289 -3564 -6698 -3245 -756 -2833 -3884 -3951 -832 -3757 -6928 -11257 -2934
5933 -2934 2364 -4003 -15200 -8809 -3639 -7760 -5912 444 -106 -702 -441 971 3248 508 -1253
5918 -1253 806 1314 682 1968 654 -425 -975 -4079 -2439 783 -49 4958 2836 -1370 -2195 1336
5902 1336 5733 11740 11384 8374 3300 4135 2476 3706 8838 8820 -2553 -5923 1550 -3843 -5559 -6498
5886 -6498 -11093 -6579 -8511 -13729 -7463 -3814 -5658 -4034 1202 -3388 -7080 -2703 4045 7208 2984
5871 2984 -8795 -15164 -7543 -1302 472 4780 2555 815 988 5705 1663 -1348 4136 5044 303
5856 303 -2660 -5248 -8297 -5873 -4591 -4493 -4998 -7956 -15887 -14473 -9339 -1539 3428 -2277 -4099 -1694
$$ packed form
5965A1939j46j493o786r217K55k119k928n09p43R887K046k348l386o31k29J684
5949d724J64l272N906K215l853l134L453K489k077j051o7L119k925l171m329Q323
5933b934N298o367j1197O391N170m121J848O356n50n96K61J412K277k740j761
5918a253K059N08o32J286j314j079n50l104J640L222q32N007k122m206q25L531
5902A336M397O007l56l010n074Q35j659J230N132j8j1373l370P473n393j716r39
5886f498m595M514j932n218O266L649j844J624N236m590l692M377O748L163m224
5871B984j1779o369P621O241J774M308k225j740J73M717m042l011N484R08m741
5856C03k963k588l049K424J282R8n05k958p931J414N134P800M967n705j822K405
$$ plain form
5840 -1694 1799 3438 1782 3254 9584 12105 13154 7381 -78 -58 -312 2635 5362 5040 797 3806
5824 3806 254 -5498 -13255 -15225 -7935 -7206 -5626 -4955 -1131 -1078 -9164 -9098 -8061 -5574 641 -3202
5808 -3202 -3611 -690 -8476 -6559 -1435 -6873 -10094 -1238 2722 1010 -1572 -1808 3587 3596 -2078 2115
5792 2115 8896 8194 1517 -2133 -754 5652 5360 5476 5532 4796 4363 3687 3740 -1247 -4324 3539 12290
5775 12290 15098 9447 6195 1282 -1164 -4415 -5613 -6514 -10409 -12001 -12240 -10792 -10909 -7135 -4888
5760 -4888 404 3810 -2552 -9651 -10913 -6096 -187 -7919 -11272 -5051 -5177 -6404 -7795 -7245 -8663
5745 -8663 -8403 -5147 -1120 -1882 -2229 -2490 -3313 -8468 -9782 -6560 -6410 -9054 -7179 -8820 -11178 -2605
5729 -2605 4426 -3096 -12381 -10898 -7846 -597 2434 -1488 -4612 -6374 -7145 -10223 -13971 -6339 2328
$$ packed form
5840a694L493J639j656J472O330K521J049n773p459K0k54K947K727l22m243L009
5824C806l552n752p757j970P290P29J580O71L824N3q086O6J037K487O215l843
5808c202m09K921p786J917N124n438l221Q856L960j712k582k36N395Rn674M193
5792B115O781p02o677l650J379O406k92J16N6p36m33o76N3m987l077P863Q751
5775A2290K808n651l252m913k446l251j198r01l895j592k39J448j17L774K247
5760d888N292L406o362p099j262M817N909p732l353O221j26j227j391N50j418
5745h663K60L256M027p62l47k61q23n155j314L222J50k644J875j641k358Q573
5729b605P031p522r285J483L052P249L031l922l124j762p71l078l748P632Q667
$$ plain form
5714 2328 4653 3208 -509 -3203 -10459 -16823 -17200 -6921 1568 5123 4060 5090 5277 -439 -5957
5699 -5957 -698 -2532 -4140 -294 4394 4587 -596 -3816 -8948 -4081 282 808 2516 3768 3353 144
5683 144 -140 1697 3622 1561 -1147 -1446 1441 2076 283 600 -1851 -830 1290 -614 -4211 -4145 -1734
5666 -1734 -351 -337 -5026 -15908 -14367 -7521 -11313 -13665 -8876 -2820 -1706 -3687 -3721 -3992 -8094 -17237
5650 -17237 -19772 -10778 -3636 4780 11432 8177 9129 11651 15156 15685 12299 10159 3268 1416 4219
5635 4219 9634 5683 2304 9620 14143 11551 11550 12277 8853 13238 11030 15889 14724 4456 2280 5795
5619 5795 2870 -830 -6170 -7816 -6180 -7285 -12908 -16474 -12450 -4548 -5851 -2696 3959 6725 2891
5604 2891 -6282 -3794 5080 3593 350 2473 444 -4240 -7453 -7014 -7976 -6615 1216 -603 -5153
$$ packed form
5714B328K325j445l717k694p256o364l77J0279Q489L555j063J030J87n716n518
5699e957N259j834j608L846M688J93n183l220n132M867M363N26J708J252m15l209
5683A44k84J837J925k061k708k99K887O35j793L17k451J021K120j904l597O6K411
5666a734J383J4m689j0882J541O846l792k352M789O056J114j981l4k71m102r143
5650a7237k535Q994P142Q416O652l255R52K522L505N29l386k140o891j852K803
5635D219N415l951l379P316M523k592jP27l424M385k208M859j165j0268k176L515
5619E795k925l700n340j646J636j105n623l566M024P902j303L155O655K766l834
5604B891r173K488Q874j487l243K123k029m684l213M39r62J361P831j819m550
$$ plain form
5589 -5153 -7388 -5774 -4821 -4011 477 -8968 -10032 -4778 1072 3375 1383 520 -1429 -5571 -6990 3687
5573 3687 7512 4858 1371 -6962 -13265 -12398 -10616 -8169 -12718 -12603 -6051 -2260 -6480 -6173 -9383 -8724
5557 -8724 -11218 -11923 -10968 -5624 -4230 -731 3096 -1112 -3483 -12042 -14423 -4400 -4719 -6666 -5881 -89
5541 -89 -62 -2441 -1064 3114 3633 -709 -1885 1644 -1487 -6587 -17332 -12156 -8446 -6735 -657 6610
5525 6610 7550 6324 8648 7026 6339 175 -6413 -8119 -865 3563 2302 210 946 2425 3707 2227
5509 2227 2470 5609 8205 8533 6086 5061 2481 1081 -8573 -12856 -12868 -9713 -5764 -3064 -1481 -407
5493 -407 3716 4408 -4023 -9116 -55 2039 1392 -212 263 4259 6635 5663 -3211 -9925 -13546 -19727
5477 -19727 -22041 -18532 -9645 -6856 -5302 -4006 -4861 -1093 3128 5080 -1938 618 4382 5165 7354
$$ packed form
5589e153k235J614R53Q10M488r445j064N254N850K303j992q63j949m142j419J0677
5573C687L825k654l487q333o303Q67J782K447m549J15O552L791m220L07l210O59
5557h724k494p05R55N344J394L499L827m208k371q559k381J0023l19j947P85N792
5541h9K7k379J377M178N19m342j176L529l131n100j0745N176L710J711O078P267
5525F610R40j226K324j622o87o164o588j706P254M428j261k092P36J479J282j480
5509B227K43L139K596L28k447j025k580j400r654m283j2L155L949K700J583J074
5493d07M123O92q431n093R061K094o47j604M75L996K376r72q874o714l621o181
5477a9727k314L509Q887K789J554J296q55L768M221J952p018K556L764P83K189
$$ plain form
5462 7354 11428 11178 4648 3050 -774 -131 -3784 -7887 -11946 -12292 -11010 -8210 -6876 -3577 161 -333
5446 -333 1126 6462 812 -2025 2978 -4998 -2846 -2528 -1686 -5221 -6585 -8880 -15448 -18173 -15412 -8821
5430 -8821 -9085 -8771 -11319 -10191 -13177 -15674 -8943 -2216 19 -4296 -6986 -11618 -11387 -7620 -586 942
5414 942 5547 9269 3487 -1306 486 -4104 -8887 -6570 -2080 -778 -3938 -10448 -8946 -6014 -2956
5399 -2956 1357 -3922 -6981 -5107 -1862 1284 -846 -4906 -10904 -9467 -6419 -2907 3199 -616 -7266
5384 -7266 -13408 -13348 -12564 -3105 -2615 -10808 -17034 -14149 -14626 -16111 -12432 -17615 -16413 -16054 -11560 -8044
5368 -8044 -4672 466 6321 7006 12846 5503 -5092 -13873 -5558 6723 2107 -1402 -6705 -15399 -12017
5353 -12017 -7198 1480 4688 3738 -400 40 1726 568 815 -3511 -13975 -15217 -18312 -19724 -15976
$$ packed form
5462G354M074k50o530j598l824O43l653m103m059l46J282K800J334L299L738m94
5446c33J459N336n650k837N003p976K152L18Q42l535j364k295o568k725K761O591
5430h821k64L14k548J128k986k497O731O727K235m315k690m632K31L767P034J528
5414I42M605L722n782m793J792m590m783K317M490J302l160o510J502K932L058
5399b956M313n279l059J874L245L146k130m060n998J437L048L512O106l815o650
5384g266o142O0P84R459M90q193o226K885m77j485L679n183J202L59M494L516
5368h044L372N138N855O85N840p343j0595q781Q315J2281m616l509n303q694L382
5353a2017M819Q678L208r50m138M40J686j158K47m326j0464j242l095j412L748
$$ plain form
5338 -15976 -10027 -7146 -11727 -13112 -14377 -11548 -4791 -10538 -12511 -8916 -10098 -9258 -12739 -19065 -19202
5323 -19202 -16232 -5164 -3697 439 3331 -1409 -5773 -8989 -12394 -11992 -6667 -9414 -10319 -6662 -6246
5308 -6246 -10083 -13059 -12189 -9614 -7908 -4650 -6240 -6922 -6956 -4013 832 -7162 -14953 -7592 1213 1170
5292 1170 4256 2539 -2428 -8747 -8961 -3219 4229 3400 5188 4128 -4913 -8858 -4101 2941 -136
5277 -136 -2288 -5314 -122 3017 498 -418 -10829 -14000 -12079 -8167 -11799 -16661 -16011 -12464 -9766
5262 -9766 -17646 -18459 -11954 -9225 -11511 -3026 1437 5883 5429 -3205 -6857 -1477 -5291 -2282 2714
5247 2714 584 4633 6036 2424 -1540 -3242 2496 5685 6044 2383 -2300 -8496 -14470 -15723 -16672
5232 -16672 -15542 -9939 -17559 -15137 -14090 -15891 -12593 -7776 -7569 -2828 4170 5418 -3148 -4031 -687
$$ packed form
5338a5976N949K881m581j385j265K829O757n747j973L595j182Q40l481o326j37
5323a9202K970J1068J467M136K892m740m364l216l405M02N325k747r05L657M16
5308f246l837k976Q70K575J706L258j590o82l4K943M845p994p791P361Q805m3
5292A170L086j717m967o319k14N742P448q29J788j060r041l945M757P042l077
5277a36k152l026N192L139k519r16j0411l171J921L912l632m862O50L547K698
5262i766p880q13O505K729k286Q485M463M446m54q634l652N380l814L009M996
5247B714k130M049J403l612l964j702N738L189L59l661m683o196n974j253r49
5232a6672J130N603p620K422J047j801L298M817K07M741O998J248q566q83L344
$$ plain form
5217 -687 -1435 -11358 -10218 -8633 1757 4218 2515 6673 6413 3209 4973 2602 -829 1928 4748
5202 4748 3214 -5636 -9842 -5973 4855 11515 11618 7067 2744 7393 14507 9842 8721 -2396 -7245
5187 -7245 -2360 4926 7094 1037 6820 10417 8919 6575 -2032 -16309 -21647 -12860 -6906 -5046 350
5172 350 775 -5804 -8154 -3496 2408 4074 1916 -1299 -3090 -4177 -5883 -13925 -13071 -9088 -5960 -9434
5156 -9434 -11663 -7922 1004 -1173 3115 4246 -97 -4936 -5288 -10834 -11452 -6277 -8049 -9731 -9385 -11304
5140 -11304 -15341 -12655 -11095 -11312 -14760 -13417 -5757 -1711 -5227 -1219 6073 12666 10204 9095 5375
5125 5375 1480 912 2083 3279 4193 1778 -3701 -7582 2014 4451 3520 7854 11174 14192 13681 2108
5109 2108 2811 13388 13776 16581 13770 3377 -837 815 2737 1698 -3894 -5007 -11705 -14007 -15350
$$ packed form
5217f87p48r923J140J585J0390K461j703M158k60l204J764k371l431K757K820
5202D748j534q850m206L869J0828O660J03m551m323M649P114m665j121j1117m849
5187g245M885P286K168o057N783L597j498k344q607j4277n338Q787N954J860N396
5172C50M25o579k350M658N904J666k158l215j791j087j706q042Q54L983L128l474
5156i434k229L741Q926k177M288J131m343m839l52n546o18N175j772j682L46j919
5140a1304m037K686J560k17l448J343P660M046l516M008P292O593k462j109l720
5125E375l895n68J171J196R14k415n479l881R596K437r31M334L320L018n11j1573
5109B108P03J0577L88K805k811j0393m214J652J922j039n592j113o698k302j343
$$ plain form
5094 -15350 -13790 -11093 -6279 -8401 -10422 -11634 -10540 -5745 -7578 -9605 -7773 -5089 -609 -1927 -5633
5079 -5633 -9139 -13258 -17532 -21974 -14139 -4962 -5327 -5340 -5462 -5438 -5606 -213 -3214 -6697 -9866 -5507 -5010
5062 -5010 -2207 34 222 -1809 -5413 3422 12057 6553 4890 -958 -3052 -3534 -5897 -4580 -487
5047 -487 982 -1561 -1759 2877 3485 1701 -2058 -11588 -13944 -6797 -4534 -4095 745 -186 999 1819
5031 1819 -6302 -6354 -6638 -5721 -5928 -1584 -5116 -4558 -7752 -6012 -5337 2772 4996 -98 -2664 1430 7568
5014 7568 3564 3806 -1342 -5596 -6222 -4982 -11361 -9354 -4789 -8113 -8281 -9567 -2222 -1234 -1255 -2173 -246
4997 -246 7159 4532 -1051 -8446 -15162 -8954 -6278 -7769 -3207 -4117 -15886 -16992 -14209 -5863 -197
4982 -197 -4850 -8913 -3224 2432 2135 4777 9039 185 -5059 -11137 -8770 -7100 3670 803 -2097
$$ packed form
5094a5350J560K697M814k122k021j212J094M795j833k027J832K684M480j318l706
5079e633l506m119m274m442P835R177l65j3j22K4j68N393l001l483l169M359M97
5062e010K803K241J88k031l604Q835Q635n504j663n848k094m82k363J317M093
5047d87J469k543j98M636O08j784l759r530k356P147K263M39M840r31J185Q20
5031A819q121n2k84R17k07M344l532N58l194J740O75Q109K224n094k566M094O138
5014G568m004K42n148m254o26J240o379K007M565l324j68j286P345R88k1r18J927
4997b46P405k627n583p395o716O208K676j491M562r10j1769j106K783Q346N666
4982a97m653m063N689N656k97K642M262q854n244o078K367J670J0770k867k900
$$ plain form
4967 -2097 -1930 -4683 -7333 -14350 -10214 237 1113 -2260 -7660 -8510 -10379 -5754 -4020 153 2358
4952 2358 2078 -3291 -6888 -10179 -11598 -8402 -9185 -15466 -19033 -11177 -9173 -3889 -780 -7139 -15045
4937 -15045 -9799 -3076 -4960 -3596 -2981 -409 -3553 -7219 -2393 437 -3282 -3470 -1279 2028 1165
4922 1165 -2901 -2311 -4423 -5555 -3954 -7132 -9815 -8396 -11016 -8488 -1456 941 3503 2009 -2272
4907 -2272 118 -1025 -4141 24 1888 4659 8030 5563 2627 1667 -328 -1945 -535 -4907 -16460
4892 -16460 -17955 -14164 -2471 -349 -4040 -3691 -5371 -6691 -10937 -12676 -5795 4422 8705 10510
4878 10510 3320 -5814 -9067 -11715 -9356 2906 6622 108 -814 -2439 -1688 -3477 -3362 -9186 -10386
4863 -10386 -8406 -7989 -5284 -5652 -6343 -8041 -9778 -6415 -8476 -9937 -6421 -2546 1308 -2945 -11493
$$ packed form
4967b097J67k753k650p017M136J0451Q76l373n400q50j869M625J734M173K205
4952B358k80n369l597l291j419L196p83o281l567P856K004N284L109o359p906
4937a5045N246O723j884J364O15K572l144l666M826K830l719j88K191L307q63
4922A165m066N90k112j132J601l178k683J419k620K528P032K397K562j494m281
4907b272K390j143l116M165J864K771L371k467k936r60j995j617J410m372j1553
4892a6460j495L791J1693K122l691L49j680j320m246j739O881J0217M283J805
4878A0510p190r134l253k648K359J2262L716o514r22j625P51j789J15n824j200
4863a0386J980M17K705l68o91j698j737L363k061j461L516L875L854m253q548
$$ plain form
4848 -11493 -12958 -8751 -2391 -1365 -1779 3584 4169 -769 109 1166 -3171 -2748 862 -4655 -9166 -12305
4832 -12305 -9760 -4650 -170 378 246 -3051 -6734 -8239 -8595 -1440 6350 3089 558 -971 -4710
4817 -4710 -347 9383 9526 -2643 -6323 -5340 -1902 2398 -1651 -3854 -6179 -410 -5681 -8594 -11533
4802 -11533 -16297 -12606 -3203 -496 -3556 -4373 -4566 2007 7754 9054 4571 3961 -3067 -2621 -8491 -9049
4786 -9049 -8340 -3975 -6088 -6075 -10233 -8131 -7697 -9579 -5177 -2597 -517 -2171 -769 -187 4159 2690
4770 2690 2450 8139 7445 8917 2898 -1452 -2003 -4087 -492 1756 -1893 -1019 -6196 -9829 -11513 -5240
4754 -5240 1447 -1202 -2525 846 4309 3252 -393 -2605 4484 5118 1202 2146 3587 -1889 -1741 1501
4738 1501 4883 4858 3468 -677 -5291 -10166 -12973 -3913 -3158 -5569 -6778 -7991 -2684 -2227 -7205 -10937
$$ packed form
4848a1493j465M207O360J026m14N363N85m938Q78J057m337M23L610n517m511l139
4832a2305K545N110M480N48j32l297l683j505l56P155P790l261k531j529l739
4817d710M363R730J43j2169l680R83L438M300m049k203k325N769n271k913k939
4802a1533m764L691R403K707l060q17j93O573N747J300m483o10p028M46n870n58
4786i049P09M365k113J3m158K102M34j882M402K580K080j654J402N82M346j469
4770B690k40N689o94J472o019m350n51k084L595K248l649Q74n177l633j684O273
4754e240O687k649j323L371L463j057l645k212P089O34l916R44J441n476J48L242
4738A501L382k5j390m145m614m875k807R060P55k411j209j213N307M57m978l732
$$ plain form
4722 -10937 -5035 -2319 -8796 -16594 -19514 -12531 -5935 -6619 -7788 -3874 -6460 -11588 -11583 -8433 -7044 -5364
4706 -5364 -6136 -4742 497 1934 -7996 -7792 -7521 -6719 240 -37 -2724 -1597 -3905 -3161 -1788 -340
4690 -340 -893 1458 649 -3441 -9353 -14886 -21885 -19403 -7560 -5608 -2004 -1344 -2696 -4338 1709 4170
4674 4170 90 -5920 -5995 -6752 -9030 -5156 -724 2220 1671 -2344 -6206 -1554 -5199 -6738 -5836 -5329
4658 -5329 -559 622 -4965 -5093 -5770 -3067 -5429 -4629 -9902 -13908 -13621 -4804 2534 2170 2544 1322
4642 1322 -5482 -7677 -8200 -9366 -9981 -795 5934 1457 1257 -360 -1126 -9414 -11271 -8709 -4001 -6609
4626 -6609 -7951 -7939 -9232 -7217 -5424 -10405 -9164 -8185 -3452 -478 -2972 -2599 1471 -173 1068 4977
4610 4977 3534 3326 -4638 -6954 -10219 -10898 -6283 1781 3044 208 677 3576 6405 6322 3209 1171
$$ packed form
4722a0937N902K716o477p798k920O983O596o84j169L914k586n128NL150J389J680
4706e364p72J394N239J437r930K04K71Q02O959k77k687J127k308P44J373J448
4690c40n53K351q09m090n912n533o999K482J1843J952L604O60j352j642O047K461
4674D170m080o010p5p57k278L874M432K944n49m015l862M652l645j539R02N07
4658e329M770J181n587j28o77K703k362Q00n273m006K87Q817P338l64L74j222
4642A322o804k195n23j166o15R186O729m477k00j617p66q288j857K562M708k608
4626f609j342J2j293K015J793m981J241R79M733K974k494L73M070j644J241L909
4610D977j443k08p964k316l265o79M615Q064J263k836M69K899K829q3l113k038
$$ plain form
4594 1171 -7836 -14104 -9549 2373 8639 7097 -800 -7164 -5051 -4374 -5840 -3164 -6111 -4666 -4256
4579 -4256 -215 5626 5980 -4029 -8830 -11879 -11942 -11007 -10320 -3430 4218 1416 -2014 -6277 -8652 -2206
4563 -2206 -2540 617 88 -1459 333 7294 16457 11340 1944 -7653 -8313 -7593 -8208 -11318 -12664 1464
4547 1464 4606 -6313 -11640 -7729 -8221 -7913 -6835 -4516 -5024 -9237 -11401 -11075 -3610 11659 13549
4532 13549 6147 4745 5351 -587 -9060 -15242 -13761 -11929 -9492 -4071 -720 5811 586 -3933 -1273
4517 -1273 -6951 -8353 -7165 -2216 -5630 -12838 -16972 -8557 -7635 -11825 -12541 -9940 -9714 -3639 -4383 -2005
4501 -2005 -2436 1628 -1816 -6400 -6785 -7740 -8790 -11321 -9831 -9796 -10443 -12780 -9581 -3503 -4952 -5476 -6799
4484 -6799 -7372 -10037 -8603 -5003 -9577 -12404 -12077 -13742 -16212 -8416 -2349 -5497 -11046 -10905 -8098 -12211
$$ packed form
4594A171r007o268M555J1922O266j542p897o364K113O77j466K676k947J445M10
4579d256M041N841L54j0009m801l049o3R35O87O890P648k802l430m263k375O446
4563b206l34L157n29j547J792O961R163n117r396r597o60P20o15l110j346J4128
4547A464L142j0919n327L911m92L08J078K319n08m213k164L26P465J5269J890
4532A3549p402j402O06n938q473o182J481J832K437N421L351O531n225m519K660
4517a273n678j402J188M949l414p208m134Q415R22m190p16K601K26O075p44K378
4501b005m31M064l444m584l85r55j050k531J490L5o47k337L199O078j449n24j323
4484f799n73k665J434L600m574k827L27j665k470P796O067l148n549J41K807m113
$$ plain form
4468 -12211 -13797 -19525 -16547 -8081 -4503 -3462 -8055 -11685 -9595 -3714 -7058 -1507 1438 763 1854
4453 1854 -4738 -13910 -14545 -15257 -5279 -952 -4883 -10297 -9293 -2476 665 2129 -6791 -10049 -12706
4438 -12706 -14021 -10221 -9014 -5451 -7966 -5587 1167 -1518 -4589 -714 3925 4878 3804 -375 -6733
4423 -6733 -12749 -17326 -7728 -5557 -6084 -530 -48 3626 -236 -7476 -6791 -3405 -1569 -310 -980 -6521
4407 -6521 -7890 -3831 -4303 -8809 -6409 -4053 -10229 -9675 -13790 -18872 -15041 -13444 -12955 -3898 -1162 -266
4391 -266 -2724 -5130 -5494 -1109 -1138 -8953 -12930 -10335 -1661 796 -1790 -105 -779 -6981 -6495 -1258
4375 -1258 205 -956 3165 8220 10323 8211 2672 4307 9021 8666 3809 6727 10045 10441 8943
4360 8943 4466 2870 6702 12647 3556 -5833 -13468 -5201 -2153 -3901 -3770 -9184 -11392 -10598 -7731
$$ packed form
4468a2211j586n728K978Q466L578J041m593l630K090N881l344N551K945o75J091
4453A854o592r172o35p12R978M327l931n414J004O817L141J464q920l258k657
4438a2706j315L800J207L563k515K379O754k685l071L875M639R53j074m179o358
4423f733o016m577R598K171n27N554M82L674l862p240O85L386J836J259o70n541
4407f521j369M059m72m506K400K356o176N54m115n082L831J597M89R057K736Q96
4391b66k458k406l64M385k9p815l977K595Q674K457k586J685o74o202M86N237
4375a258J463j161M121N055K103k112n539J635M714l55m857K918L318L96j498
4360H943m477j596L832N945r091r389p635Q267L048j748J31n414k208P94K867
$$ plain form
4345 -7731 -12921 -14856 -6685 -1403 -3259 -3514 -2748 -4278 -5064 -6022 -7324 -6463 899 481 -3090 -10933
4329 -10933 -19017 -18341 -17351 -5355 -3154 -3996 -2785 7310 2760 -4077 -14909 -12705 -3324 -6026 -10769
4314 -10769 -13391 -11335 -1899 4104 7979 3169 -6894 -5530 -7161 -3763 -7079 -7544 -3804 -5247 -2138
4299 -2138 1523 8307 4238 2761 2293 612 -7227 -3139 -3270 -4007 4180 6319 6796 6572 5841 4359
4283 4359 6551 848 -5897 -10453 -8522 -16059 -16480 -8873 -6805 -12424 -12134 -5430 -683 -3417 -7373
4268 -7373 -6285 -3992 -676 5212 8422 9192 9871 975 -796 -132 -8536 -13446 -10523 -8408 -3093 -4216
4252 -4216 -4114 -8222 -9097 -8504 -6802 -6040 -5018 -2131 -4053 2247 4298 -80 -4319 -7876 -3350 223
4236 223 1205 3780 1132 2283 -1556 -4955 -3309 -2017 3538 3045 -878 -6682 -8566 -5219 -8371 -5141
$$ packed form
4345g731n190j935Q171N282j856k55P66j530p86r58j302Q61P362m18l571p843
4329a0933q084O76R90J1996K201q42J211J0095m550o837j0832K204R381k702m743
4314a0769k622K056R436O003L875m810j0063J364j631L398l316m65L740j443L109
4299b138L661O784m069j477m68j681p839M088j31p37Q187K139M77k24p31j482
4283D359K192n703o745m556J931p537m21P607K068n619K90O704M747k734l956
4268g373J088K293L316N888L210P70O79q896j771O64q404m910K923K115N315j123
4252d216J02m108q75N93J702P62J022K887j922O300K051m378m239l557M526L573
4236B23R82K575k648J151l839l399J646J292N555m93l923n804j884L347l152L230
$$ plain form
4220 -5141 -1524 -176 5419 3168 -6286 -12121 -9751 -2859 -762 -443 -1007 7405 5370 -89 1722
4205 1722 -790 377 -2311 -9412 -9767 -2235 -138 -3924 -13046 -19586 -20904 -13487 -5974 6187 9691
4190 9691 12894 13511 13175 7884 2309 -3072 1487 -542 -1188 1543 548 6786 5234 1715 1398 -1853
4174 -1853 -5285 -1264 6106 9482 6064 267 -5279 -9672 -2694 2969 6856 10820 7579 3885 199
4159 199 -2588 -3024 -7060 -15439 -16889 -3553 2611 -108 -644 -1931 1049 7398 7248 4299 -1486 -6535
4143 -6535 -4708 -996 -13796 -21724 -20629 -11484 -7020 -7506 -5089 1115 8340 8744 10377 5756 -2603
4128 -2603 -7491 -8189 -10965 -10029 -5419 826 -720 -3802 -8464 -10290 -5432 -3673 -3810 -11013 -9142 -6639
4112 -6639 -4413 -7636 -6676 -1596 -5455 -4037 -511 -2362 -4556 1699 11891 9552 -251 -11716 -11154
$$ packed form
4220e141L617J348N595k251r454n835K370O892K097L19n64Q412k035n459J811
4205A722k512J167k688p101l55P532K097l786r122o540j318P417P513J2161L504
4190I691L203O17l36n291n575n381M559k029o46K731r95O238j552l519l17l251
4174a853l432M021P370L376l418n797n546m393O978N663L887L964l241l694l686
4159A99k787m36m036q379j450J3336O164k719n36j287K980O349j50k949n785n049
4143f535J827L712j2800p928J095R145M464m86K417O204P225M04J633m621q359
4128b603m888o98k776R36M610O245j546l082m662j826M858J759j37p203J871K503
4112f639K226l223R60N080l859J418L526j851k194O255J0192k339r803j1465N62
$$ plain form
4097 -11154 -11541 -11939 -9926 -12922 -18269 -17563 -13411 -8035 -6842 -5277 -6088 -8465 -10025 -13843 -2000
4082 -2000 2933 -825 -454 5236 3149 -657 -2572 -5298 -11856 -1561 4839 2286 2055 1533 12
4067 12 -1631 -9505 -13903 -6571 -9540 -14360 -13322 -10292 -7914 -10079 -8437 -1965 625 -3733 -6620
4052 -6620 -639 -1361 -7533 -4643 -2381 -2657 -6018 -9011 -2669 460 180 -952 -3015 -3237 -4322 -6360
4036 -6360 648 4106 9513 10929 6544 -2344 -13223 -17806 -17930 -16176 -12928 -10083 -3375 4829 9726
4021 9726 8226 2856 392 1954 245 -3664 -9007 -14109 -8511 6056 10123 9795 4280 -6732 -12770
4006 -12770 -11973 -12828 -4673 -7826 -10453 -7648 -5429 -1747 -2531 -1715 1719 6226 4055 3863 1464 6557
3990 6557 9767 8766 2889 -2517 -6906 -2959 -101 1358 1915 1542 2440 5941 13293 18897 14822 11281
$$ packed form
4097a1154l87l98K013k996n347P06M152N376J193J565q11k377j560l818J1843
4082b000M933l758L71N690k087l806j915k726o558J0295O400k553k31n22j521
4067A2j643p874m398P332k969m820J038L030K378k165J642O472K590m358k887
4052f620N981p22o172K890K262k76l361k993O342L129k80j132k063k22j085k038
4036f360P008L458N407J416m385q888j0879m583j24J754L248K845O708Q204M897
4021I726j500n370k464J562j709l909n343n102N598J4567M067l28n515j1012o038
4006a2770P97q55Q155l153k627K805K219L682p84Q16L434M507k171j92k399N093
3990F557L210j001n877n406m389L947K858J459N57l73Q98L501P352N604m075l541
$$ plain form
3974 11281 5036 2934 4802 -4294 -3917 5646 7675 9787 12185 9013 8409 640 -11752 -12715 -5358
3959 -5358 -1940 -5761 -4298 -5714 -3090 -2436 -8413 -16702 -20701 -20400 -14008 -8338 -4046 664 -3961
3944 -3961 -8198 -10274 -4431 1124 1505 -1651 -12062 -8032 -5383 -9439 -7057 -8611 -8214 -15182 -9588
3929 -9588 -1626 5694 9543 5809 1071 -2238 -6266 -5639 -7839 -3291 4761 2554 -4535 -5832 -4944
3914 -4944 -4003 -7434 -11049 -9218 -8912 -9084 -2017 -3746 -2880 -2351 -5155 -9491 -14268 -9561 -2663 -2639 -6392
3897 -6392 -14226 -20699 -13640 -5028 -2875 -6720 -7079 -1725 -2579 -4168 -1477 6309 4775 4994 5455 2076
3881 2076 748 1215 4265 4630 3775 4601 10468 4756 -2548 -3120 2951 -3540 -9768 -7353 -3324 3907
3865 3907 5102 6676 5675 3957 1748 3674 5292 2216 3511 -285 -3994 -7610 -8976 -12203 -11734
$$ packed form
3974A1281o245k102J868r096L77R563K029K112K398l172o04p769j2392r63P357
3959e358L418l821J463j416K624O54n977q289l999L01O392N670M292M710m625
3944c961m237k076N843N555L81l156j0411M030K649m056K382j554L97o968N594
3929i588P962P320L849l734m738l309m028O27k200M548Q052k207p089j297Q88
3914d944R41l431l615J831L06j72P067j729Q66N29k804m336m777M707O898K4l753
3897f392p834o473P059Q612K153l845l59N354q54j589K691P786j534K19M61l379
3881B076j328M67L050L65q55Q26N867n712p304n72O071o491o228K415M029P231
3865C907J195J574j001j718k209J926J618l076J295l796l709l616j366l227M69
$$ plain form
3850 -11734 -9601 -12227 -9026 137 -469 -4956 -7770 -8640 -8447 -7740 -8826 -5403 -7060 -7375 -3765 4225
3834 4225 4911 -950 -5424 -8092 -9126 -6380 -9046 -9361 -8984 -8533 -14200 -11150 -8187 -9518 -10758 -9140
3818 -9140 -3783 -1153 -5113 -8277 -5861 -2194 5944 4146 319 -482 5560 -3149 -4566 2875 7173
3803 7173 3013 1271 7655 10737 11315 9299 6614 6859 7363 11369 11945 1702 -8233 -2785 -223 -829
3787 -829 -1048 -3962 -10398 -11538 -8731 -9711 -7558 -3239 577 3314 2237 -5249 -4506 -4215 -9426 -12471
3771 -12471 -10169 -6728 -6498 -2945 -1438 -602 -908 687 599 -6079 -4662 194 843 -4908 -4759 -6118
3755 -6118 -484 3471 -2767 -2631 -2295 -3517 -1690 -5000 -4627 -1493 548 -1938 -332 645 2487 -1081
3739 -1081 1756 198 -2696 -5527 2881 7786 8034 9160 9889 13377 8663 5179 6580 11218 7541
$$ packed form
3850a1734K133k626L201R163o06m487k814q70J93P07j086L423j657l15L610P990
3834D225O86n861m474k668j034K746k666l15L77M51n667L050K963j331j240J618
3818i140N357K630l960l164K416L667Q138j798l827q01O042q709j417P441M298
3803G173m160j742O384L082N78k016k685K45N04M006N76j0243r935N448K562o06
3787h29k19k914o436j140K807r80K153M319L816K737j077p486P43K91n211l045
3771a2471K302L441K30L553J507Q36l06J595q8o678J417M856O49n751J49j359
3755f118N634L955o238J36L36j222J827l310L73L134K041k486J606R77J842l568
3739a081K837j558k894k831Q408M905K48J126P29L488m714l484J401M638l677
$$ plain form
3724 7541 3786 7642 4495 -45 2507 5705 6292 3669 -228 -2404 -5906 -15466 -19746 -15836 -3519
3709 -3519 598 1041 -3194 -9694 -12676 -9821 -15842 -17848 -13496 -8281 -4113 -3513 -15645 -15316 -8978
3694 -8978 -7622 -12612 -13332 -11406 -6178 -1414 -3632 -4734 -3502 -493 -1582 -2870 -2874 -5168 -3493 -1330
3678 -1330 -4565 -1736 -1431 -1679 -965 -41 2480 1681 -2595 -5739 -4315 2749 -2714 -500 4867 4142
3662 4142 -132 -4505 -968 -241 5985 15071 14239 4627 -475 3137 6493 9352 5635 -3221 -1966
3647 -1966 603 -2708 -6996 -4140 -1556 3987 8764 8561 2676 6801 3614 1912 150 -572 1797
3632 1797 9844 12055 8810 1538 -4036 -2799 -2762 2059 3949 2665 2089 -1288 -5307 3308 271 -3440
3616 -3440 2777 3858 6833 6255 217 -4888 -3390 784 3300 2173 -1274 -7602 -8776 -10009 -9703
$$ packed form
3724G541l755L856l147m540K552L198N87k623l897k176l502r560m280L910J2317
3709c519M117M43m235o500k982K855o021k006M352N215M168O00j2132L29O338
3694h978J356m990p20J926N228M764k218j102J232L009j089j288mk294J675K163
3678a330l235K829L05k48P14R24K521p99m276l144J424P064n463K214N367p25
3662D142m274m373L537P27O226R086q32r612n102L612L356K859l717q856J255
3647a966K569l311m288K856K584N543M777k03n885M125l187j702j762p22K369
3632A797Q047K211l245p272n574J237L7M821J890j284n76l377m019Q615l037l711
3616c440O217J081K975n78o038n105J498M174K516j127l447o328j174j233L06
$$ plain form
3601 -9703 -4814 -340 -2258 -9476 -15830 -18247 -12050 -3944 1475 -717 -2516 -4053 -4448 -3776 -4290 -11114
3585 -11114 -14894 -13174 -5892 1047 885 1000 -6750 -5603 -2997 -112 2712 1790 1441 5152 3992 1509
3569 1509 2915 3613 -5134 -8666 -10232 -8677 -9693 -12767 -14049 -16769 -16953 -9743 -10374 -11578 -9270 -4493
3553 -4493 -5170 -4743 -4094 -2387 -9625 -17464 -14118 -16450 -13725 -11487 -12180 -11294 -16346 -16430 -7938 -1204 3524
3536 3524 -2913 -7852 -3459 1799 3700 -241 -3104 -9245 -5073 5375 9313 7374 7968 7375 3673
3521 3673 1493 289 4419 5720 597 -14187 -22581 -19731 -11195 -6167 2706 4245 2590 3251 4846
3506 4846 7016 5421 7939 8126 -3158 -4769 -966 3312 5243 1550 -260 -584 415 2975 -6956
3491 -6956 -9538 -2965 -7495 -14332 -12906 -10943 -13944 -8900 -9985 -6375 -5468 -8004 -10072 -3676 -9967
$$ packed form
3601i703M889M474j918p218o354k417O197Q106N419k192j799j537l95O72n14o824
3585a1114l780J720P282O939j62J15p750J147K606K885K824r22l49L711j160k483
3569A509J406O98q747l532j566J555j016l074j282k720j84P210o31j204K308M777
3553d493o77M27O49J707p238p839L346k332K725K238o93Q86n052q4Q492O734M728
3536C524o437m939M393N258J901l941k863o141M172J0448L938j939N94n93l702
3521C673k180j204M130J301n123j4784q394K850Q536N028Q873J539j655O61J595
3506D846K170j595K518J87j1284j611L803M278J931l693j810l24R99K560r931
3491f956k582O573m530o837J426J963l001N044j085L610R07k536k068O396o291
$$ plain form
3476 -9967 -12686 -6796 -4737 -1522 6552 13342 11877 9596 981 -8784 -10676 -3988 -1105 -237 5736
3461 5736 9090 2740 -2155 4711 3419 -2406 -1114 123 -3853 -9469 -10342 -7051 -3758 -530 -1792
3446 -1792 -4434 -12166 -15979 -13380 -10782 -14440 -19444 -16079 -8293 -7433 -2231 -1322 5004 2966 6401
3431 6401 -2437 -1342 -3245 -6165 -5529 -4959 -6610 2156 4202 -1489 -82 -1475 -3278 -1427 -406
3416 -406 -853 94 4291 4719 8077 7227 988 -1192 -4951 -8542 -8829 -10327 -6183 -2996 -6232 -9445
3400 -9445 -4463 -1030 -2129 -3615 -830 -4723 -6740 -4629 1214 1593 -5906 -11488 -13681 -12096 -7846
3385 -7846 -10792 -4294 -1890 -617 1566 3767 -856 -3259 3770 2141 -2031 -5089 -4217 1146 1986
3370 1986 2777 1755 2524 7473 6011 -907 -5346 -418 -1696 -7739 -1004 -1596 -4253 -2656 -3404 3516
$$ packed form
3476i967k719N890K059L215Q074O790j465k281q615r765j892O688K883Q68N973
3461E736L354o350m895O866j292n825J292J237l976n616q73L291L293L228j262
3446a792k642p732l813K599K598l658n004L365P786Q60N202R09O326k038L435
3431F401q838J095j903k920O36N70j651Q766K046n691J407j393j803J851J021
3416d06m47R47M197M28L358q50o239k180l759l591k87j498M144L187l236l213
3400i445M982L433j099j486K785l893k017K111N843L79p499n582k193J585M250
3385g846k946O498K404J273K183K201m623k403P029j629m172l058Q72N363Q40
3370A986P91j022P69M949j462o918m439M928j278o043O735n92k657J597p48O920
$$ plain form
3354 3516 11928 14146 8670 5546 5550 2723 7735 8884 4798 -1933 -2986 -4394 -3132 180 234 -2535
3338 -2535 -4200 -4923 -5555 -5397 4559 1453 -2808 -6560 -12047 -7580 -4628 -4615 -11558 -13519 -10558 -10388
3322 -10388 -7267 -9220 -9584 -4159 -751 2711 5987 6933 3278 -1044 -3443 -5492 5211 5526 -2797
3307 -2797 -1567 -3131 -7215 -7885 -9327 -9936 -6853 -3431 1271 1094 2137 1410 7331 4441 3393 2803
3291 2803 -7737 -10538 -963 5193 -3283 -8325 -8853 77 -2721 -7313 572 3099 -1914 -128 6650
3276 6650 -1800 -2962 3631 4931 -145 -7287 -5749 -341 860 -4627 -13745 -16978 -16593 -13661 -7513
3261 -7513 2430 3220 -4094 453 4167 149 -1301 -3455 -857 1061 2109 2639 -3610 -9398 -10475
3246 -10475 -7305 -7985 -4156 852 -4338 -9386 -5537 -3629 2198 -590 -1193 6865 7147 3531 -274
$$ packed form
3354C516Q412K218n476l124Mk827N012J149m086o731j053j408J262L312N4k769
3338b535j665p23o32J58R956l106m261l752n487M467K952J3o943j961K961J70
3322a0388L121j953l64N425L408L462L276R46l655m322k399k049J0703L15q323
3307b797J230j564m084o70j442o09L083L422M702j77J043p27N921k890j048n90
3291B803j0540k801R575O156q476n042n28Q930k798m592P885K527n013J786O778
3276F650q450j162O593J300n076p142J538N408J201n487r118l233L85K932O148
3261g513R943P90p314M547L714m018j450k154K598J918J048N30o249n788j077
3246a0475L170o80L829N008n190n048L849J908N827k788o03Q058K82l616l805
$$ plain form
3231 -274 -2187 -1733 -3373 -7517 -13578 -14878 -14668 -12386 -3325 7184 5679 2406 -1031 -4025 -7980
3216 -7980 -784 -112 -298 -6116 -8427 -3189 -4979 -3023 -4564 -4418 -7805 -15718 -11070 -3818 -149 6159
3200 6159 3285 9321 6737 6173 9741 9834 -157 -10873 -12513 -6720 -2351 -3611 -1864 -502 -5048
3185 -5048 -3276 -5996 -12506 -17294 -15192 -14507 -283 3687 -4011 -9805 -9497 -8681 -7232 -7216 -8064 -3786
3169 -3786 -9121 -3162 781 3218 7126 2355 -5982 -6641 -8280 -5942 -5756 -5970 -1267 1791 2421 80
3153 80 870 -1720 -1213 -454 -4450 -9524 -11720 -9888 -3345 -6851 -7857 -5057 -8500 -939 3474 -2886
3137 -2886 153 5472 6453 7851 8119 4595 3610 2544 -1004 -2766 -233 1442 -3846 -8546 -6049 -5292
3121 -5292 -11570 -10684 -9005 -8033 -1091 187 -7610 -6457 -1690 -263 -3909 -5199 -8229 -9904 -1254
$$ packed form
3231b74j913M54j640m144o061j300K10K282R061J0509j505l273l437k994l955
3216g980P196O72j86n818k311N238j790J956j541J46l387p913M648P252L669O308
3200F159k874O036k584n64L568R3r991j0716j640N793M369j260J747J362m546
3185e048J772k720o510m788K102O85J4224L970p698n794L08Q16J449J6q48M278
3169c786n335N959L943K437L908m771q337o59j639K338J86k14M703L058O30k341
3153H0P90k590N07P59l996n074k196J832O543l506j006K800l443P561M413o360
3137b886L039N319R81J398K68l524r85j066l548j762K533J675n288m700K497P57
3121e292o278Q86J679R72O942J278p797J153M767J427l646j290l030j675Q650
$$ plain form
3106 -1254 824 -677 -6621 -8578 -9798 -6994 -3663 1679 8762 2127 -4190 -2952 -1330 -238 -150
3091 -150 -954 1620 6609 9784 6160 4221 560 -2467 -3504 1577 2902 979 -8774 -12586 -8731
3076 -8731 -3594 -7252 -4455 1554 5944 6463 3817 4202 1045 -1212 487 -5698 -11305 -11562 -6029 -3084
3060 -3084 -2143 -5207 -4326 -1294 -3290 -1438 -5123 -1115 -4402 -5547 -3699 -4240 -5693 -8989 -12111 -10469
3044 -10469 -8079 -6041 -9315 -2029 1092 -650 -3138 -4921 -6693 -2878 -2731 -6251 -6221 -2316 2831
3029 2831 -398 -1509 -2435 -5643 -8909 -8323 -2482 -3966 -1693 5814 -174 -2753 538 -224 -4084 -4468
3013 -4468 -2928 -6098 -6629 -7133 -5857 -6813 -5465 -4201 -1373 5246 11480 7829 8834 8017 5345 3177
$$ packed form
3106a254K078j501n944j957j220K804L331N342P083o635o317J238J622J092Q8
3091a50q04K574M989L175l624j939l661l027j037N081J325j923r753l812L855
3076h731N137l658K797O009M390N19k646L85l157k257J699o185n607k57N533K945
3060c084R41l064Q81L032j996J852l685M008l287j145J848n41j453l296l122J642
3044a0469K390K038l274P286L121j742k488j783j772L815J47l520L0L905N147
3029B831l229j111r26l208l266N86N841j484K273P507n988k579L291p62l860l84
3013d468J540l170n31n04J276r56J348J264K828O619O234l651J005q17k672k168
$$ [...]
##END NTUPLES=NMR SPECTRUM
##END=
