##TITLE=Analysis number 328427
Compound Code cc 55846
Book Reference 528/28
Project Code adrs
Chemist Name davee
##JCAMPDX= 6.0         $$ Bruker NMR JCAMP-DX V2.0
##DATA TYPE= NMR SPECTRUM
##DATA CLASS= NTUPLES
##ORIGIN= Bruker BioSpin GmbH
##OWNER= nmr
$$ XWIN-NMR		Version 3.5
$$ Tue Jun  5 08:17:46 2007 GMT Daylight Time (UT+1h)  MAYBRIDGE\nmr@NMR_250MHZ
##.OBSERVE FREQUENCY= 250.131544655141
##.OBSERVE NUCLEUS= ^1H
##.ACQUISITION MODE= SIMULTANEOUS (DQD)
##.ACQUISITION SCHEME= undefined
##.AVERAGES= 16
##.DIGITISER RES= 18
##SPECTROMETER/DATA SYSTEM= dpx250
##.PULSE SEQUENCE= zg30
##.SOLVENT NAME= CDCl3
##.SHIFT REFERENCE= (INTERNAL, CDCl3, 0, 16.522)
##AUDIT TRAIL= $$ (NUMBER, WHEN, WHO, WHERE, WHAT)
$$ ##TITLE= Audit trail, XWIN-NMR		Version 3.5
$$ ##JCAMPDX= 5.01
$$ ##ORIGIN= Bruker BioSpin GmbH
$$ ##OWNER= nmr
$$ C:\u/data/dgb/nmr/ADRS/200/pdata/1/auditp.txt
$$ ##AUDIT TRAIL=  $$ (NUMBER, WHEN, WHO, WHERE, WHAT)
(   1,<2007-06-05 08:17:20.39 +100>,<MAYBRIDGE\nmr>,<NMR_250MHZ>,
      <created by zg, POWCHK disabled, PULCHK disabled
       configuration hash MD5:
       76 6E 9A 78 1E 09 19 81 EC 84 63 8F B0 6A 59 2D
       data hash MD5: 64K
       40 53 AA F5 D7 91 30 BF 5B D5 DF 34 F7 3F A6 65>)
(   2,<2007-06-05 08:17:34.99 +100>,<MAYBRIDGE\nmr>,<NMR_250MHZ>,
      <Start of raw data processing
       ef LB = 0.3 FT_mod = 6 PKNL = 1 SI = 32K 
       data hash MD5: 32K
       BE 10 81 9E 13 5F A0 CE 75 3B 3D 89 8B 3B A0 34>)
(   3,<2007-06-05 08:17:37.10 +100>,<MAYBRIDGE\nmr>,<NMR_250MHZ>,
      <apk 
       data hash MD5: 32K
       4F 86 3B 25 63 0B 53 A9 25 D9 46 99 EC BB 96 74>)
(   4,<2007-06-05 08:17:38.18 +100>,<MAYBRIDGE\nmr>,<NMR_250MHZ>,
      <abs ABSG = 5 
       data hash MD5: 32K
       34 5C C1 C3 E7 59 A1 47 69 B7 E4 73 BD 5E 9C A6>)
$$ ##END=
$$ 
$$ hash MD5
$$ 91 1D 45 77 DE 10 F0 72 C3 5D F1 A4 2F B2 A7 ED
##$RELAX= 
##$RELAX= 
##$RELAX= 
##$RELAX= 
##$RELAX= 
##$RELAX= 
##$RELAX= 
$$ Bruker specific parameters
$$ --------------------------
##$DU= <C:\u>
##$EXPNO= 200
##$NAME= <ADRS>
##$PROCNO= 1
##$TYPE= <nmr>
##$USER= <dgb>
##$AMP= (0..31)
100 100 100 100 100 100 100 100 100 100 100 100 100 100 100 100 100 100 
100 100 100 100 100 100 100 100 100 100 100 100 100 100 
##$AQSEQ= 0
##$AQ_mod= 3
##$AUNM= <au_zg>
##$AUTOPOS= <36 >
##$BF1= 250.13
##$BF2= 250.13
##$BF3= 250.13
##$BF4= 250.13
##$BF5= 500.13
##$BF6= 500.13
##$BF7= 500.13
##$BF8= 500.13
##$BYTORDA= 1
##$CFDGTYP= 0
##$CFRGTYP= 5
##$CHEMSTR= <none>
##$CNST= (0..31)
1 1 145 1 1 1 1 1 1 1 1 1 1 1 1 1 1 1 1 1 1 1 1 1 1 1 1 1 1 1 1 1 
##$CPDPRG= <>
##$CPDPRG1= <>
##$CPDPRG2= <>
##$CPDPRG3= <>
##$CPDPRG4= <mlev>
##$CPDPRG5= <mlev>
##$CPDPRG6= <mlev>
##$CPDPRG7= <mlev>
##$CPDPRG8= <mlev>
##$CPDPRGB= <>
##$CPDPRGT= <>
##$D= (0..31)
0 1 0 0 0 0 0 0 0 0.06 0 0 0 0 0 0 0.0002 0 0 0 0 0 0 0 0 0 0 0 0 0 0 
0 
##$DATE= 1181027839
##$DBL= (0..7)
120 120 120 120 120 120 120 120 
##$DBP= (0..7)
150 150 150 150 150 150 150 150 
##$DBP07= 0
##$DBPNAM0= <>
##$DBPNAM1= <>
$$ [...]
##$SUBNAM7= <"">
##$SUBNAM8= <"">
##$SUBNAM9= <"">
##$SW= 20.6930455092707
##$SWIBOX= (0..15)
0 0 3 0 0 0 0 0 0 0 0 0 0 0 0 0 
##$SW_h= 5175.983436853
##$TD= 65536
##$TD0= 1
##$TE= 683.16
##$TE2= 300
##$TE3= 300
##$TEG= 300
##$TL= (0..7)
0 120 120 120 120 120 120 120 
##$TP= (0..7)
150 150 150 150 150 150 150 150 
##$TP07= 0
##$TPNAME0= <>
##$TPNAME1= <>
##$TPNAME2= <>
##$TPNAME3= <>
##$TPNAME4= <>
##$TPNAME5= <>
##$TPNAME6= <>
##$TPNAME7= <>
##$TPOAL= (0..7)
0.5 0.5 0.5 0.5 0.5 0.5 0.5 0.5 
##$TPOFFS= (0..7)
0 0 0 0 0 0 0 0 
##$TUNHIN= 0
##$TUNHOUT= 0
##$TUNXOUT= 0
##$USERA1= <user>
##$USERA2= <user>
##$USERA3= <user>
##$USERA4= <user>
##$USERA5= <user>
##$V9= 5
##$VALIST= <valist>
##$VCLIST= <CCCCCCCCCCCCCCC>
##$VD= 0
##$VDLIST= <DDDDDDDDDDDDDDD>
##$VPLIST= <PPPPPPPPPPPPPPP>
##$VTLIST= <TTTTTTTTTTTTTTT>
##$WBST= 1024
##$WBSW= 4
##$XGAIN= (0..3)
0 0 0 0 
##$XL= 0
##$YL= 0
##$YMAX_a= 569774
##$YMIN_a= -632112
##$ZGOPTNS= <>
##$ZL1= 120
##$ZL2= 120
##$ZL3= 120
##$ZL4= 120
##$ABSF1= 16.522
##$ABSF2= -4.171173
##$ABSG= 5
##$ABSL= 3
##$ALPHA= 0
##$AQORDER= 0
##$ASSFAC= 0
##$ASSFACI= 0
##$ASSFACX= 0
##$ASSWID= 0
##$AUNMP= <proc_1d>
##$AZFE= 0.1
##$AZFW= 0.1
##$BCFW= 0
##$BC_mod= 0
##$BYTORDP= 0
##$COROFFS= 0
##$CY= 12.5
##$DATMOD= 1
##$DC= 0
##$DFILT= <>
##$DTYPP= 0
##$F1P= 14.0000005364418
##$F2P= -0.99999901652339
##$FCOR= 0.5
##$FTSIZE= 32768
##$FT_mod= 6
##$GAMMA= 0
##$GB= 0
##$INTBC= 1
##$INTSCL= 1
##$ISEN= 128
##$LB= 0.3
##$LEV0= 0
##$LPBIN= 0
##$MAXI= 10000
##$MC2= 0
##$MEAN= 0
##$ME_mod= 0
##$MI= 0
##$NCOEF= 0
##$NC_proc= -4
##$NLEV= 6
##$NOISF1= 0
##$NOISF2= 0
##$NSP= 0
##$NTH_PI= 0
##$NZP= 0
##$OFFSET= 16.522
##$PC= 1
##$PHC0= -55.97108
##$PHC1= 2.844446
##$PH_mod= 1
##$PKNL= yes
##$PPARMOD= 0
##$PSCAL= 4
##$PSIGN= 0
##$REVERSE= no
##$SF= 250.13
##$SI= 32768
##$SIGF1= 0
##$SIGF2= 0
##$SINO= 400
##$SIOLD= 32768
##$SREGLST= <1H.CDCl3>
##$SSB= 0
##$STSI= 32768
##$STSR= 0
##$SW_p= 5175.98343685301
##$SYMM= 0
##$S_DEV= 0
##$TDeff= 65536
##$TDoff= 0
##$TI= <Analysis number 999999
Compound Code 99
Book Reference 9
Project Code 9>
##$TILT= no
##$TM1= 0
##$TM2= 0
##$TOPLEV= 0
##$USERP1= <user>
##$USERP2= <user>
##$USERP3= <user>
##$USERP4= <user>
##$USERP5= <user>
##$WDW= 1
##$XDIM= 32768
##$YMAX_p= 417986267
##$YMIN_p= -123241
$$ End of Bruker specific parameters
$$ ---------------------------------
##NTUPLES= NMR SPECTRUM
##VAR_NAME=  FREQUENCY,     SPECTRUM/REAL,   SPECTRUM/IMAG
##SYMBOL=    X,             R,               I
##VAR_TYPE=  INDEPENDENT,   DEPENDENT,       DEPENDENT
##VAR_FORM=  AFFN,          ASDF,            ASDF
##VAR_DIM=   32768,         32768,           32768
##UNITS=     HZ,            ARBITRARY UNITS, ARBITRARY UNITS
##FACTOR=    0.157963299565203, 1,           1
##FIRST=     4132.6476996994, 0,             0
##LAST=      -1043.33573715361, 0,           0
##MIN=       -1043.33573715361, -123241,     0
##MAX=       4132.6476996994, 417986267,     0
$$ Real data points
##PAGE= N=1
##DATA TABLE= (X++(R..R)), XYDATA
$$ [...]
$$ plain form
16011 -33944 -21744 -11162 -38354 -22388 -12469 -24119 -8117 -14221 -1629 -17217 -32965 -15136
15999 -15136 -19132 -21142 -16638 -22362 -22125 -9187 9031 -4320 -22711 -24565 -21242 -49920 -74309
15986 -74309 -32643 -3848 5959 28559 45118 39055 11626 22935 25778 31672 22569 5212 -6005
15973 -6005 -2910 2007 21439 11480 14877 21937 7925 -10498 -25893 -23354 -20321 -8285 22293
15960 22293 9123 -2412 -63321 -74396 -38694 -34952 -28295 -28090 -6767 33782 43878 25802
15948 25802 4228 10065 5160 14538 5814 -15629 -34928 -30747 -26577 -21745 -24674 -42561 -43350 -39647
15934 -39647 -33485 -13278 13786 16363 17185 24892 12893 -7986 -25883 -25344 -10944 16991 11914
15921 11914 7611 -32437 -48366 -19478 -3776 24152 33528 27813 -1672 -18109 -16603 -29545
$$ packed form
16011c3944J2200J0582k7192J5966R919j1650J6002o104J2592j5588j5748J7829
15999a5136l996k010M504n724K37J2938J8218j3351j8391j854L323k8678k4389
15986g4309M1666K8795R807K2600J6559o063k7429J1309K843N894r103j7357j1217
15973f005L095M917J9432r959L397P060j4012j8423j5395K539L033J2036L0578
15960B2293j3170j1535o0909j1075L5702L742O657K05K1323M0549J0096j8076
15948B5802k1574N837m905R378q724k1443j9299M181M170M832k929j7887p89L703
15934c9647O162K0207K7064K577Q22P707j1999k0879j7897N39J4400K7935n077
15921A1914m303m0048j5929K8888J5702K7928R376n715k9485j6437J506j2942
$$ plain form
15909 -29545 -45158 -20176 11881 27570 11815 4527 11978 6188 -5104 -12148 -25661 -33743 -21955
15896 -21955 6590 1595 -15172 -26337 -35664 -61194 -76321 -77554 -48734 -10864 -25407 -34308
15884 -34308 -36101 -31601 -21952 -13108 -5840 -10332 -26384 -29475 587 16667 19099 21205 24310 29592
15870 29592 22834 18890 5066 3944 22658 17256 16739 3856 -14502 -23151 -22028 -28672 -36924 -28962
15856 -28962 -8319 -6689 -2321 5891 783 16149 20071 36903 21584 -5871 -2630 3897 8888
15843 8888 1807 38338 75889 49202 33888 32437 8241 -27594 -29992 -36253 -9924 28750 4371
15830 4371 -9638 -8413 5904 -6234 10941 -4128 -32733 -33701 -12353 2014 -790 -16949 -16271
15817 -16271 -18120 -20896 -22429 -19115 2581 -314 -14473 -44541 -24952 9298 14418 21664 38346
$$ packed form
15909b9545j5613K4982L2057J5689j5755p288P451n790j1292p044j3513q082J1788
15896b1955K8545m995j6767j1165r327k5530j5127j233K8820L7870j4543q901
15884c4308j793M500R649Q844P268m492j6052l091L0062J6080K432K106L105N282
15870B9592o758l944j3824j122J8714n402n17j2883j8358q649J123o644q252P962
15856b8962K0643J630M368Q212n108J5366L922J6832j5319k7455L241O527M991
15843H888p081L6531L7551k6687j5314j451k4196l5835k398o261K6329L8674k4379
15830D371j4009J225J4317j2138J7175j5069k8605r68K1348J4367k804j6159O78
15817a6271j849k776j533L314K1696k895j4159l0068J9589L4250N120P246J6682
$$ plain form
15804 38346 54838 35694 35387 11812 -19994 -28278 -12333 1926 1269 4984 8312 -3644 -24519
15791 -24519 -40016 -37839 -25411 -23182 -15834 -18890 -36259 -25089 23409 58975 41316 29352
15779 29352 22669 40091 44627 16629 -27236 -47374 -43521 -18712 -27132 -47796 -45758 -45818 -30769
15766 -30769 -15602 -11730 -18267 -15459 -10096 14448 31524 19328 -17372 -47274 -47290 -60235 -58155
15753 -58155 -47206 -29397 -33271 -20431 -4260 -15500 -7135 -71 -9233 -6951 20475 -5791 7667
15740 7667 34766 13923 -9108 -17194 -12108 -5963 -20509 -15359 -6495 -24517 -42328 -42384 -20145
15727 -20145 11340 10029 8099 16807 37903 62150 33314 10502 -389 9694 21877 16800
15715 16800 7973 -14807 12137 26761 10783 18889 15757 8763 -2231 -12239 -9908 -26816 -31848
$$ packed form
15804C8346J6492j9144l07k3575l1806q284J5945J4259o57L715L328j1956k0875
15791b4519j5497K177J2428K229P348l056j7369J1170M8498L5566j7659j1964
15779B9352o683J7422M536k7998m3865k0138L853K4809q420k0664K038o0J5049
15766c0769J5167L872o537K808N363K4544J7076j2196l6700k9902j6j2945K080
15753e8155J0949J7809l874J2840J6171j1240Q365P064r162K282K7426k6266J3458
15740G667K7099k0843k3031q086N086O145j4546N150Q864j8022j7811n6K2239
15727b0145L1485j311j930Q708K1096K4247k8836k2812j0891J0083J2183n077
15715A6800q827k2780K6944J4624j5978Q106l132o994j0994j0008K331j6908n032
$$ plain form
15702 -31848 -20237 23321 53181 43448 19942 -6795 -37860 -27826 -13815 -7283 -21043 -19772
15690 -19772 -10056 -3212 3771 9915 11226 -2614 7235 14247 5310 -6769 -20882 -22700 2187
15677 2187 7762 -14693 -23339 -22435 -24458 -29307 3538 21299 24404 -7306 -22500 -2366 23616
15664 23616 14460 -11725 376 4683 -14364 -7513 11439 -15793 -34732 -17313 2908 -448
15652 -448 -22067 -48375 -42090 -40103 -41807 -22710 -13521 -10320 1426 -892 -17187 -10502 7068
15639 7068 -5762 2349 9446 -13388 -30120 -55131 -54699 -28267 -28645 4239 50528 43426 29665
15626 29665 15945 1185 988 -2469 8013 15012 11430 23436 46724 41184 16411 -19756 -31134
15613 -31134 8209 27874 38978 32743 44078 50249 46120 39949 23877 16713 3604 -15876 1397
$$ packed form
15702c1848J1611M3558K9860r733k3506k6737l1065J0034J4011O532j3760J271
15690a9772R716O844O983O144J311j3840R849P012q937j2079j4113j818K4887
15677B187N575k2455q646R04k023m849L2845J7761L105l1710j5194K0134K5982
15664B3616r156k6185J2101M307j9047O851J8952k7232j8939J7419K0221l356
15652d48k1619k6308O285J987j704J9097R189L201J1746k318j6295O685J7570
15639G068j2830Q111P097k2834j6732k5011M32K6432l78L2884M6289p102j3761
15626B9665j3720j4760j97l457J0482O999l582J2006K3288n540k4773l6167j1378
15613c1134L9343J9665J1104o235J1335O171m129o171j6072p164j3109j9480J7273
$$ plain form
15600 1397 -8788 -20543 -33124 -26302 -20837 -31353 -5858 -4975 -3731 12554 2898 -10221 2747
15587 2747 33784 32975 -1047 2102 -12570 -35792 -70593 -99244 -83030 -57311 -37001 -27109 -45162
15574 -45162 -62875 -62680 -72527 -59156 -31677 -12657 -15072 -33361 -36565 -17034 -9559 -13746 -27570
15561 -27570 -33343 -3277 -11219 -3651 -1707 20433 33727 26163 15637 11404 -8099 -8861 -9320 3825
15547 3825 23339 41706 14557 -22018 -43555 -40975 -73089 -71097 -57511 -58267 -48066 -33980 -8847
15534 -8847 1269 5652 -4596 -5263 2363 -29651 -57989 -69027 -89397 -58613 -33248 -876 -2064
15521 -2064 5333 -18124 -32222 3831 27262 36543 34478 36776 49526 47462 14489 -18219 -4153
15508 -4153 6032 -2447 8457 7889 -36888 -63642 -33788 -24715 -24918 -31678 -26783 -255 -5263 -28515
$$ packed form
15600A397j0185j1755j2581O822N465j0516K5495Q83J244J6285r656j3119J2968
15587B747L1037q09l4022L149j4672k3222l4801k8651J6214K5719K0310R892j8053
15574d5162j7713J95r847J3371K7479J9020k415j8289l204J9531P475m187j3824
15561b7570n773L0066p942P568J944K2140J3294p564j0526m233j9503p62m59J3145
15547C825J9514J8367k7149l6575k1537K580l2114J992J3586p56J0201J4086K5133
15534h847J0116M383j0248o67P626l2014k8338j1038k0370L0784K5365L2372j188
15521b064P397k3457j4098L6053K3431R281k065K298J2750k064l2973l2708J4066
15508d153J0185q479J0904n68m4777k6754K9854R073k03o760M895K6528n008k3252
$$ plain form
15494 -28515 -35414 -45050 -57304 -32723 2229 15736 33597 34451 30402 -4138 -18687 -971 -8219
15481 -8219 -37380 -35888 -34721 -38426 -30539 -17150 -42086 -32054 -32056 -37136 -9985 -2889 -8201 345
15467 345 -9211 -41339 -35305 -34149 -41460 -33842 13102 34571 46058 43179 21554 18053 19859 28327
15453 28327 23660 10895 -18197 -26757 -19779 12558 18020 26043 12694 10976 38593 48850 9224
15440 9224 -15760 16998 28321 20931 15477 20750 28826 39705 33004 24455 60 -2673 1127
15427 1127 17152 38989 26472 10560 16522 27848 30444 31806 17111 -11056 -28319 -24412 -31078
15414 -31078 -17678 -17699 -14408 -32374 -22025 -23271 -6336 27624 24834 -42112 -50160 -17779 17510
15401 17510 53381 59000 27165 -471 -2229 8175 1494 -4128 26538 22492 29665 37546 65071
$$ packed form
15494b8515o899r636j2254K4581L4952J3507J7861Q54m049l4540j4549J7716p248
15481h219k9161J492J167l705P887J3389k4936J0032kn080K7151P096n312Q546
15467C45r556l2128O034J156p311P618M6944K1469J1487k879k1625l501J806Q468
15453B8327m667j2765k9092q560O978L2337N462Q023j3349j718K7617J0257l9626
15440I224k4984L2758J1323p390n454N273Q076J0879o701q549k4395k733L800
15427A127J6025K1837j2517j5912N962J1326K596J362j4695k8167j7263L907o666
15414c1078J3400k1L291j7966J0349j246J6935L3960k790o6946q048L2381L5289
15401A7510L5871N619l1835k7636j758J0404o681n622L0666m046P173P881K7525
$$ plain form
15388 65071 54552 37497 7846 -21215 -33269 -11356 -2498 -6037 -28870 -42751 -60592 -65046
15376 -65046 -59053 -57918 -39252 -3641 2256 12851 25799 12556 19464 19044 -10312 -17791 -2924
15363 -2924 7837 -6839 11003 16145 19065 -9479 -23374 -17180 -9646 -25608 -15425 7135 5242
15350 5242 -14972 -19329 -9022 8159 13763 8878 7963 13306 18883 33517 23467 -8647 -10730
15337 -10730 -17850 -24653 -10220 -10741 -5136 7740 15276 4377 1573 21485 14111 10672 -3978
15324 -3978 -22221 -13057 -10497 -25281 -20059 4725 -6396 -22667 14011 16618 18966 -446 5035
15311 5035 29450 36384 25015 25908 37014 15482 -6148 -30025 -41208 -31651 -23516 -9143 -12988
15298 -12988 -23796 -2563 18291 14577 -1830 8140 23958 22464 4341 -25884 -9585 -5814
$$ packed form
15388F5071j0519j7055k9651k9061j2054K1913Q858l539k2833j3881j7841m454
15376f5046N993J135J8666L5611N897J0595J2948j3243O908m20k9356p479J4867
15363b924J0761j4676J7842N142K920k8544j3895O194P534j5962J0183K2560j893
15350E242k0214m357J0307J7181N604m885r15N343N577J4634j0050l2114k083
15337a0730p120o803J4433n21N605J2876P536j0899k804J9912p374l439j4650
15324c978j8243R164K560j4784N222K4784j1121j6271L6678K607K348j9412N481
15311E035K4415O934j1369Q93J1106k1532k1630k3877j1183R557Q135J4373l845
15298a2988j0808K1233K0854l714j6407R970J5818j494j8123l0225J6299L771
$$ plain form
15286 -5814 -17658 -32833 -45374 -45936 -26336 -10661 10503 -14011 -30775 -18127 -5718 5198
15274 5198 -2700 -17328 -32029 -26094 -9469 -11946 -14163 -1277 2518 -15841 -14833 2587 -20153
15261 -20153 -53408 -72967 -56090 -30274 -39179 -42854 -24229 -26793 -9107 5176 -17343 -21404
15249 -21404 10917 40025 27997 27650 43792 38339 18904 10422 5154 7764 -6421 -20352 4284
15236 4284 42270 10673 -35774 -43061 -50052 -59650 -60406 -49784 -49955 -51143 -52531 -54163 -43992 -28722
15222 -28722 -23495 -12645 -1026 -2739 3425 -15232 19503 16019 -5295 -27853 -52262 -42321 -4834
15209 -4834 8736 7614 30788 4663 -8030 -1611 -4748 -16448 -33396 -30655 1972 -5661 3787
15196 3787 23145 22866 48254 43704 21779 26700 41035 62992 66503 38487 25371 -5753 -49134
$$ packed form
15286e814j1844j5175j2541n62J9600J5675K1164k4514j6764J2648J2409J0916
15274E198p898j4628j4701N935J6625k477k217J2886L795j8359J008J7420k2740
15261b0153l3255j9559J6877K5816q905l675J8625k564J7686J4283k2519m061
15249b1404L2321K9108j2028l47J6142n453j9435q482n268K610j4185j3931K4636
15236D284L7986l1597m6447p287o991r598p56J0622j71j188j388j632J0171J5270
15222b8722N227J0850J1619j713O164j8657L4735l484k1314k2558k4409R941L7487
15209d834J3570j122K3174k6125j2693O419l137j1700j6948K741L2627p633R448
15196C787J9358k79K5388m550k1925M921J4335K1957L511k8016j3116l1124m3381
$$ plain form
15183 -49134 -49443 -26532 337 18577 8515 -4412 -2789 -1457 14385 29417 25148 31441 21876
15170 21876 -1185 19419 13011 -4194 -6879 -4990 -21935 -20531 -25431 -22637 -8615 -321 -4119
15157 -4119 -14405 9160 41117 43484 35438 13468 8590 17912 43690 22088 -10008 -2860 -13186
15144 -13186 2804 -9491 -14519 -197 -2337 -30277 -8778 7937 14345 36363 67851 67844 58933
15131 58933 50052 46274 40223 11103 29053 53936 47261 60295 75902 37630 24146 21585 23270
15118 23270 14168 10063 10329 18815 22118 3146 4272 14979 -7220 -411 25256 38778 31846
15105 31846 -7376 -34892 -23244 -25242 -29833 -19547 -10255 -27 13045 42603 63060 61565
15093 61565 54404 60499 54839 34120 20039 30775 46174 43760 30585 10506 -25864 -70134
$$ packed form
15183d9134l09K2911K6869J8240j0062j2927J623J332J5842J5032m269O293r565
15170B1876k3061K0604o408j7205k685J889j6945J404m900K794J4022Q294l798
15157d119j0286K3565L1957K367q046k1970m878R322K5778k1602l2096P148j0326
15144a3186J5990j2295n028J4322k140k7940K1499J6715O408K2018L1488pq911
15131E8933q881l778o051k9120J7950K4883o675J3034J5607l8272j3484k561J685
15118B3270r102m105K66Q486L303j8972J126J0707k2199O809K5667J3522o932
15105C1846l9222k7516J1648j998m591J0286R292J0228J3072K9558K0457j495
15093F1565p161O095n660k0719j4081J0736J5399k414j3175k0079l6370m4270
$$ plain form
15081 -70134 -38647 -2225 11344 1572 7320 3647 3410 36180 60025 39210 -3140 -10651 4237
15068 4237 18948 36204 22114 -2338 5760 7287 14328 7800 -10972 -4915 3974 73154 85717
15055 85717 74133 57662 48756 24623 5986 -20361 -15657 18206 24795 5839 1989 -9262
15043 -9262 6568 -3114 -3835 -6539 -15717 -7632 -3946 11176 21571 11144 -4626 -5848 23105
15030 23105 61243 88489 104701 77686 56960 39775 40126 36397 47008 37877 29117 3412 -1377
15017 -1377 23422 16154 -15754 -1295 27867 19513 -23346 -16799 5062 8679 -7123 13099 21348
15004 21348 29491 53233 60069 30581 13319 59137 40974 4117 -13192 4425 -3179 -13350
14992 -13350 -32939 -44730 -40483 -17053 1675 -1915 16026 29503 57723 57020 43057 25454
$$ packed form
15081g0134L1487L6422J3569r772N748l673k37L2770K3845k0815m2350p511J4888
15068D237J4711J7256j4090k4452Q098J527P041o528j8772O057Q889O9180J2563
15055H5717j1584j6471q906k4133j8637k6347M704L3863O589j8956l850j1251
15043i262J5830r682p21k704r178Q085L686J5122J0395j0427j5770j222K8953
15030B3105L8138K7246J6212k7015k0726j7185L51l729J0611r131q760k5705m789
15017a377K4799p268l1908J4459K9162q354m2859O547K1861L617j5802K0222Q249
15004B1348Q143K3742O836k9488j7262M5818j8163l6857j7309J7617p604j0171
14992a3350j9589j1791M247K3430J8728l590J7941J3477K8220p03j3963j7603
$$ plain form
14980 25454 20638 24656 46859 44508 50560 8554 -12347 -1637 -11649 -14967 -7 26348 18528
14967 18528 26183 20303 7012 -15495 -27455 -1776 -15949 -24215 -11605 14312 28520 43611
14955 43611 6357 -29665 -12478 10139 -19542 -50481 -42507 -21378 15050 43951 27457 24925
14943 24925 12237 -1689 -1320 8791 19561 34631 44053 42263 34462 33292 13599 -6248 -4996
14930 -4996 -13096 -1008 12894 19523 17666 12610 4125 27631 36548 -726 1416 34615 33038
14917 33038 34752 16396 12739 1439 2063 31256 42164 12225 -16948 21546 43464 22129
14905 22129 16178 28063 3784 3170 33974 50827 40349 30413 32097 28432 24870 44065 51763
14892 51763 36279 36325 21242 24620 21622 39792 41438 28423 16558 21299 24623 21146 22907 32574
$$ packed form
14980B5454m816M018K2203k351O052m2006k0901J0710j0012l318J4960K6355p820
14967A8528P655n880j3291k2507j1960K5679j4173q266J2610K5917J4208J5091
14955D3611l7254l6022J7187K2617k9681l0939P974K1129L6428K8901j6494k532
14943B4925j2688j3926L69J0111J0770J5070R422j790p801j170j9693j9847J252
14930d996q100J2088J3902O629j857n056q485K3506Q917l7274K142L3199j577
14917C3038J714j8356l657j1300O24K9193J0908k9939k9173L8494K1918k1335
14905B2129n951J1885k4279o14L0804J6853j0478r936J684l665l562J9195P698
14892E1763j5484M6j5083L378k998J8170J646j3015j1865M741L324l477J761R667
$$ plain form
14878 32574 27946 13643 -23124 -28289 -13091 -8914 -12142 -37211 -35708 -13292 2407 9886 -1514
14865 -1514 -20677 -23853 7809 19776 -913 -12434 5054 30348 21871 -9338 154 -16456
14853 -16456 -32273 -33093 -37104 -32583 -60561 -47876 12844 3971 -16512 -15424 -22722 -31347 -5994
14840 -5994 7961 -4894 -2285 9708 32253 11506 12380 33510 31130 44583 25622 23679 54281
14827 54281 30784 -5577 -6510 -12564 11867 23438 22024 -9400 -19069 -27759 -17429 -9339 -3723
14814 -3723 -4371 9460 27221 28063 32136 40486 14430 17238 32588 11144 7934 3566 -15234 -5203
14800 -5203 -4388 -22053 -33188 -37338 -44218 -27358 2572 10530 24438 16743 1008 -5950 4520
14787 4520 10861 -10855 -4412 24281 24906 19611 1576 -6413 -220 7827 18630 27544 43770 29105
$$ packed form
14878C2574m628j4303l6767n165J5198M177l228k5069J503K2416J5699P479j1400
14865a514j9163l176L1662J1967k0689j1521J7488K5294q477l1209R492j6610
14853a6456j5817q20m011M521k7978J2685O0720q873k0483J088p298q625K5353
14840e994J3955j2855K609J1993K2545k0747Q74K1130k380J3453j8961j943L0602
14827E4281k3497l6361r33o054K4431J1571j414l1424r669q690J0330Q090N616
14814c723o48J3831J7761Q42M073Q350k6056K808J5350k1444l210m368j8800J0031
14800e203Q15j7665j1135m150o880J6860K9930P958J3908p695j5735o958J0470
14787D520O341k1716O443K8693O25n295j8035p989O193Q047J0803Q914J6226j4665
$$ plain form
14773 29105 -2087 -21433 -349 11398 16744 11939 16913 25811 16705 14396 1028 -27534 -26303
14760 -26303 -15399 2528 -1997 3431 22897 9506 -8798 -13988 11311 42851 66094 56472
14748 56472 37203 32342 30369 42942 40305 49274 39435 30150 45484 53112 63472 35989 26663
14735 26663 40398 25170 -21369 -11179 18623 21942 4766 687 -23079 -20842 3998 9402
14723 9402 11147 25803 40649 47719 79281 82930 83553 72937 47804 29539 36320 15276 15535
14710 15535 42214 25783 46690 63893 41938 9269 10218 42393 36299 18993 3806 -3284
14698 -3284 2555 10764 13521 18890 21835 27262 4794 14405 12582 -306 -21104 -3931 -4877 -12115
14684 -12115 -4641 39752 62430 48794 63248 50397 15847 -7723 -31685 -29878 -8251 -6592
$$ packed form
14773B9105l1192j9346K1084J1747N346m805M974Q898r106k309j3368k8562J231
14760b6303J0904J7927m525N428J9466j3391j8304n190K5299L1540K3243r622
14748E6472j9269m861j973J2573k637Q969r839r285J5334P628J0360k7483r326
14735B6663J3735j5228m6539J0190K9802L319j7176m079k3766K237K4840N404
14723I402J745J4656J4846P070L1562L649O23j0616k5133j8265O781k1044K59
14710A5535K6679j6431K0907J7203k1955l2669R49L2175o094j7306j5187p090
14698c284N839Q209K757N369K945N427k2468R611j823j2888k0798J7173r46p238
14684a2115P474M4393K2678j3636J4454j2851l4550k3570k3962J807K1627J659
$$ plain form
14672 -6592 4467 25849 53606 48516 36117 20030 7519 -13341 -1555 -6523 -17137 -26615
14660 -26615 -43514 -30327 4290 23986 52381 76815 105234 140509 155764 176755 183054 201739
14648 201739 208511 203129 212169 194277 178563 146115 133189 108909 89097 81890 69249 64405
14636 64405 42091 37979 34860 16619 24266 42459 65016 86855 88834 80935 65849 38234 46009
14623 46009 62567 63492 29459 18398 55468 72360 58776 46155 37344 29879 26116 18028 22586
14610 22586 36492 83168 86444 83427 58004 33349 29335 10784 19761 4777 11542 49223 45298
14597 45298 41757 34728 -5859 -14379 10465 22882 14077 39773 44614 37541 24918 9258 2394
14584 2394 17285 10092 32272 42535 51796 55787 33611 2703 16242 20012 24376 35590 28374
$$ packed form
14672f592J1059K1382K7757n090j2399j6087j2511k0860J1786m968j0614r478
14660b6615j6899J3187L4617J9696K8395K4434K8419L5275J5255K0991O299J8685
14648B01739O772n382R040j7892j5714l2448j2926k4280j9812p207j2641m844
14636F4405k2314m112l119j8241P647J8193K2557K1839J979p899j5086k7615P775
14623D6009J6558R25l4033j1061L7070J6892j3584j2621q811p465l763q088M558
14610B2586J3906M6676L276l017k5423k4655m014j8551Q977j4984O765L7681l925
14597D5298l541p029m0587q520K4844J2417q805K5696M841p073j2623j5660o864
14584B394J4891p193K2180J0263R261L991k2176l0908J3539L770M364J1214p216
$$ plain form
14571 28374 11304 3487 26163 57429 59617 41110 15135 12648 7277 4022 22241 7180 -4425
14558 -4425 -1011 30375 40215 26795 34418 30260 12112 -3178 -5818 29742 59840 76935 105602
14545 105602 83862 42419 18835 2913 -13140 4239 20346 8922 847 -18792 -34702 -42555
14533 -42555 -50703 -30613 22390 35523 41011 13298 20762 19658 24900 63005 68437 67358 73421
14520 73421 74853 76335 35168 15321 11983 27548 56192 64950 30078 -4182 -14791 -16918 5545
14507 5545 5854 22344 35676 22084 30673 28083 31119 46311 41068 45009 34493 57816 42295
14494 42295 43343 40287 34768 17021 9489 5073 12822 -4708 -4672 7561 11667 29675 17687 10428
14480 10428 21131 12955 7919 13494 -6780 -1116 -7901 -5169 15281 35760 29381 -5036 5917
$$ packed form
14571B8374j7070p817K2676L1266K188j8507k5975k487n371l255J8219j5061j1605
14558d425L414L1386R840j3420P623m158j8148j5290k640L5560L0098J7095K8667
14545A05602k1740m1443k3584j5922j6053J7379J6107j1424q075j9639j5910p853
14533d2555q148K0090N3003J3133N488k7713P464j104N242L8105N432j079O063
14520G3421J432J482m1167j9847l338J5565K8644Q758l4872l4260j0609k127K2463
14507E545L09J6490J3332j3592Q589k590L036J5192n243L941j0516K3323j5521
14494D2295J048l056n519j7747p532m416P749j7530L6J2233M106J8008j1988p259
14480A0428J0703q176n036N575k0274N664o785K732K0450K0479o379l4417J0953
$$ plain form
14467 5917 26802 -586 -2890 7750 22637 15365 8138 -1081 -8338 -7162 -11591 -19750 -13641 15009
14453 15009 25397 27441 25682 22637 16732 37587 11617 5912 11077 -11 5967 31408 60512
14440 60512 98355 66625 23982 9382 10128 18259 2249 7797 4715 -12149 9375 27415 31637
14427 31637 6447 -18205 -12130 -2947 1647 32747 35718 27966 11429 18880 17816 -15161 -39080
14414 -39080 -24922 -4477 18855 34968 41604 53023 36806 19101 17852 -18408 -47032 -46253
14402 -46253 -40479 -28101 6222 25414 16644 11610 30527 43249 94594 80846 29698 2150
14390 2150 -6693 27 36376 49671 50972 38988 -21168 -29914 -9000 -14775 -1539 -18048 -52738
14377 -52738 -51966 -15876 13773 14011 11392 26121 44873 45064 55661 56603 37792 17937 22491 38420
$$ packed form
14467E917K0885k7388k304J0640J4887p272p227r219p257J176m429q159O109K8650
14453A5009J0388K044j759l045n905K0855k5970n705N165j1088N978K5441K9104
14440F0512L7843l1730m2643j4600P46Q131j6010N548l082j6864K1524J8040M222
14427C1637k5190k4652O075R183M594L1100K971p752j6537P451j064l2977k3919
14414c9080J4158K0445K3332J6113O636J1419j6217j7705j249l6260k8624P79
14402d6253N774J2378L4323J9192q770n034J8917J2722N1345j3748n1148k7548
14390B150q843O720L6349J3295J301j1984o0156q746K0914n775J3236j6509l4690
14377e2738P72L6090K9649K38k619J4729J8752J91J0597R42j8811j9855M554J5929
$$ plain form
14363 38420 42521 30290 29804 33727 48446 50545 34846 27348 25766 35329 46598 81501 65842
14350 65842 18669 -10353 -11813 2615 13137 14094 10944 6782 9743 14231 34510 31125 14901
14337 14901 32633 27514 29356 24705 1415 11707 -4024 22058 38615 33863 25824 41948 74511
14324 74511 73956 58598 61569 69669 60870 31838 25465 44824 31347 16824 27858 43028 45846
14311 45846 25816 13027 37221 47034 31634 15622 5465 -19928 -14906 -5033 -29860 -29038 4805
14298 4805 26523 34999 58632 63933 41009 50789 58208 21071 2189 10435 22603 23923 32295
14285 32295 46403 36209 13330 14657 46344 47287 34775 23863 28272 41957 42002 49418 65804
14272 65804 60144 41232 44280 57255 59218 56774 26210 -25404 -25373 -16391 -19618 -20381 -12370 49032
$$ packed form
14363C8420M101j2231m86L923J4719K099j5699p498j582R563J1269L4903j5659
14350F5842m7173k9022j460J4428J0522R57l150m162K961M488K0279l385j6224
14337A4901J7732n119J842m651k3290J0292j5731K6082J6557m752q039J6124L2563
14324G4511n55j5358K971Q100q799k9032o373J9359j3477j4523J1034J5170K818
14311D5846k0030j2789K4194R813j5400j6012j0157k5393N022R873k4827Q22L3843
14298D805K1718Q476K3633N301k2924R780P419l7137j8882Q246J2168J320Q372
14285C2295J4108j0194k2879J327L1687R43j2512j0912M409J3685M5P416J6386
14272F5804n660j8912L048J2975J963k444l0564n1614L1Q982l227p63Q011O1402
$$ plain form
14258 49032 70539 59642 46127 36737 6564 10335 12200 9742 2114 20803 21404 33088 24106
14245 24106 18605 24059 43345 37985 30816 24023 4206 13386 16461 13909 24601 44439 58917
14232 58917 53242 49441 53177 53709 17990 46699 73135 63347 60242 30003 29548 40867 32576 39212
14218 39212 43754 59757 53481 28600 16810 44168 50122 31468 32427 43136 32352 24703 17986
14205 17986 2073 -19164 -6593 1217 6417 11924 6961 15383 46759 71269 46150 39507 70815
14192 70815 58773 47807 68117 37983 -6220 -4627 1418 9082 18904 25019 36361 41510 43172
14179 43172 63324 54873 67112 82237 54692 26240 9443 -8040 7964 34286 55009 38499
14167 38499 48156 78984 79097 35235 18418 33742 33998 40919 43755 9987 22091 43440 47179
$$ packed form
14258D9032K1507j0897j3515r390l0173L771J865k458p628J8689O01J1684q982
14245B4106n501N454J9286n360p169o793j9817R180L075k552J0692J9838J4478
14232E8917n675l801L736N32l5719K8709K6436r788l105l0239m55J1319q291O636
14218C9212M542J6003o276k4881j1790K7358N954j8654R59J0709j0784p649o717
14205A7986j5913k1237J2571P810N200N507m963Q422L1376K4510k5119o643L1308
14192G0815j2042j0966K0310l0134m4203J593O045P664R822O115J1342N149J662
14179D3172K0152q451J2239J5125k7545k8452j6797j7483J6004K6322K0723j6510
14167C8499R657L0828J13m3862j6817J5324K56O921K836l3768J2104K1349L739
$$ plain form
14154 47179 41258 19606 29892 47567 65727 56308 60785 59343 54485 34460 22192 -4272 -12012
14141 -12012 -25432 -13564 17441 3420 4543 34974 41414 24142 31967 41690 29766 27382 39835
14128 39835 63258 94849 98698 77151 45338 67501 77301 72688 74761 48922 27637 21957 26395
14115 26395 21316 16564 3437 22439 53838 54892 51108 46136 13292 6305 -3130 207 3376
14102 3376 1993 -14755 -16073 22446 18409 17956 44036 54339 43253 21587 18503 38653 15372
14089 15372 8139 47360 45184 33935 37591 38062 38134 48340 50644 57327 72847 90519 109333 103987
14075 103987 117921 99497 98070 74035 59590 49876 40774 43030 52702 46722 68444 80588 79862
14062 79862 56718 65483 64725 47254 46500 45057 49634 58375 75167 61668 19647 34234 47222
$$ packed form
14154D7179n921k1652J0286J7675J8160r419M477j442m858k0025j2268k6464p740
14141a2012j3420J1868L1005j4021J123L0431O440j7272P825R723j1924k384J2453
14128C9835K3423L1591L849k1547l1813K2163R800m613K073k5839k1285n680M438
14115B6395n079m752j3127J9002L1399J054l784m972l2844o987r435L337L169
14102C376j383j6748j318L8519m037m53K6080J0303j1086k1666l084K0150k3281
14089A5372p233L9221k176j1249L656M71P2J0206K304O683J5520J7672J8814n346
14075A03987J3934j8424j427k4035j4445r714r102K256R672n980K1722J2144p26
14062G9862k3144Q765p58j7471p54j443M577Q741J6792j3499m2021J4587J2988
$$ plain form
14049 47222 66312 76923 100155 89519 67578 49153 41881 54097 30582 32535 34876 39844
14037 39844 29228 3184 19907 31858 38088 42899 41158 51529 72278 96329 80607 50106
14025 50106 29575 29270 60163 60024 25897 15079 22956 33740 49160 68261 51641 22260 16930
14012 16930 10616 25953 34447 13674 800 12185 24544 30740 33909 38488 59025 69651 82755
13999 82755 83674 94376 71298 59385 76325 70846 63430 69643 39612 7285 22029 58644 32760
13986 32760 -439 -16727 2679 23961 46714 60969 46584 33837 47085 44397 47161 50928
13974 50928 41564 61821 52709 29776 26267 38367 36345 21574 25995 13625 20978 38960 50914
13961 50914 58785 35591 29741 19371 -10685 13615 35242 19957 21988 52437 54492 63294 39068
$$ packed form
14049D7222J9090J0611K3232j0636k1941j8425p272J2216k3515J953K341M968
14037C9844j0616k6044J6723J1951O230M811j741J0371K0749K4051j5722l0501
14025E0106k0531l05L0893j39l4127j0818P877J0784J5420J9101j6620k9381n330
14012A6930o314J5337Q494k0773j2874J1385J2359O196L169M579K0537J0626J3104
13999H2755R19J0702k3078j1913J6940n479p416O213l0031l2327J4744L6615k5884
13986C2760l3199j6288J9406K1282K2753J4255j4385j2747J3248k688K764L767
13974E0928r364K0257r112k2933l509J2100k022j4771M421j2370P353J7982J1954
13961E0914P871k3194n850j0370l0056K4300K1627j5285K031L0449K055Q802k4226
$$ plain form
13948 39068 49738 37958 19264 7696 38012 38514 57631 43630 31430 23355 23063 26113 47216
13935 47216 44140 32866 53465 82753 75846 58997 66574 93770 71019 40522 38809 69441
13923 69441 98572 95411 88671 88411 87977 68968 55648 42699 45063 41202 48303 52153 54200 64390
13909 64390 91394 90508 70382 62262 85412 85218 72932 53758 30745 31975 53284 56746 42053
13896 42053 33050 28857 31700 54601 53915 52268 49232 59165 73355 68028 69905 67917 50728 44989
13882 44989 61625 59983 70736 106272 107366 96066 77235 80026 80017 70751 65709 82385 75657 67175
13868 67175 76939 88705 67535 56929 50131 35769 6644 3407 34255 38768 47161 48225 31392
13855 31392 14221 43958 75954 83440 76862 71558 54579 65577 53724 68986 107184 123064
$$ packed form
13948C9068J0670j1780j8694j1568L0316N02J9117j4001j2200q075k92L050K1103
13935D7216l076j1274K0599K9288o907j6849P577K7196k2751l0497j713L0632
13923F9441K9131l161o740k60m34j9009j3320j2949K364l861P101L850K047J0190
13909F4390K7004q86k0126q120K3150j94j2286j9174k3013J230K1309L462j4693
13896D2053r003m193K843K2901o86j647l036R933J4190n327J877j988j7189n739
13882D4989J6636j642J0753L5536J094j1300j8831K791rr266n042J6676o728q482
13868F7175R764J1766k1170j0606o798j4362k9125l237L0848M513Q393J064j6833
13855C1392j7171K9737L1996P486o578n304j6979J0998j1853J5262L8198J5880
$$ plain form
13843 123064 89176 84735 87818 95450 93295 54822 60647 81875 95676 96410 81713 69451 73779
13830 73779 92615 112619 119423 94546 69231 73131 84658 72417 105787 128917 156336 159380
13818 159380 154327 146625 136030 139572 117910 82839 29894 16560 31478 40676 70827 80491
13806 80491 89771 76455 63782 48830 12535 19293 30589 69727 100021 90210 89754 96887 87918
13793 87918 73376 56648 71024 79133 98439 56794 21760 41904 61199 63123 71652 83079
13781 83079 80318 61604 40680 42781 60969 54414 68738 76200 68413 62679 63645 56126 67654
13768 67654 71880 63192 45292 33455 65932 128583 151551 132776 111353 104714 112856 127818
13756 127818 128819 147009 150724 137131 141268 155669 144718 128078 119594 125911 127876 105938 105493
$$ packed form
13843A23064l3888m441L083P632k155l8473N825K1228J3801P34j4697j2262M328
13830G3779J8836K0004O804k4877k5315L900J1527j2241L3370K3130K7419L044
13818A59380n053p702j0595L542k1662l5071n2945j3334J4918R198L0151R664
13806H0491R280j3316j2673j4952l6295O758J1296L9138L0294r811m56P133q969
13793H7918j4542j6728J4376Q109J9306m1645l5034K0144J9295J924Q529J1427
13781H3079k761j8714k0924K101J8188o555J4324P462p787n734R66p519J1528
13768F7654M226q688j7900j1837L2477O2651K2968j8775k1423o639Q142J4962
13756A27818J001J8190L715j3593M137J4401j0951j6640q484O317J965k1938m45
$$ plain form
13743 105493 122667 121464 95530 77238 79978 106718 123699 92414 86240 105656 121321 111221
13731 111221 147175 150587 187214 202039 200557 194237 189858 193426 191204 183789 167264 170111 160849
13718 160849 142012 135306 141477 153528 165499 140255 136060 142531 147821 136387 160643 174277
13706 174277 130768 100083 128441 138577 148738 160768 143369 126367 124529 142874 170580 185278
13694 185278 178713 158026 147774 129092 122790 119684 132959 158171 133718 115270 128906 134402
13682 134402 123643 127632 149979 175811 185503 171929 169042 149601 168275 148759 147348 172984
13670 172984 201437 193422 199469 192584 187766 203884 220773 216222 232286 220585 207861 229304
13658 229304 220956 243012 263340 249978 269286 293227 329489 376825 429292 494153 547485 606106
$$ packed form
13743A05493J7174j203k5934j8292K740K6740J6981l1285o174J9416J5665j0100
13731A11221L5954L412L6627J4825j482o320m379L568k222p415j6525K847r262
13718A60849j8837o706O171J2051J1971k5244m195O471N290j1434K4256J3634
13706A74277m3509l0685K8358J0136J0161J2030j7399j7002j838J8345K7706J4698
13694A85278o565k0687j0252j8682o302l106J3275K5212k4453j8448J3636N496
13682A34402j0759L989K2347K5832R692j3574k887j9441J8674j9516j411K5636
13670A72984K8453q015O047o885m818J6118J6889m551J6064j1701j2724K1443
13658B29304q348K2056K0328j3362J9308K3941L6262M7336N2467O4861N3332N8621
$$ plain form
13646 606106 675812 755956 849960 950329 1042206 1156638 1328493 1559640 1924619 2482391
13636 2482391 3330279 4566727 6178494 8044344 9898485 11294491 11798051 11259219 9836722
13627 9836722 8003897 6204898 4734726 3644232 2901205 2420936 2099474 1873094 1714861
13618 1714861 1553196 1443142 1349521 1262498 1205994 1164250 1081025 1012931 969814 940740 900621
13607 900621 845492 807190 786593 743853 684996 658448 605303 554451 517601 491950 463880
13596 463880 418989 381484 362042 344949 332915 336685 308141 271090 252206 271381 282030 266684
13584 266684 275160 254275 200722 187158 213034 230941 251970 220718 170817 159343 143329 153657
13572 153657 146065 153806 147403 136739 131915 105708 83871 101367 120213 118503 132895 140221 130313
$$ packed form
13646F06106O9706Q0144R4004J00369R1877J14432J71855K31147L64979N57772
13636B482391Q47888J236448J611767J865850J854141J396006N03560n38832j422497
13627I836722j832825j798999j470172j090494p43027m80269l21462k26380j58233
13618A714861j61665j10054r3621q7023n6504m1744q3225o8094m3117k9074m0119
13607I00621n5129l8302k0597m2740n8857k6548n3145n0852l6850k5651k8070
13596D63880m4891l7505j9442j7093j2034L770k8544l7051j8884J9175J0649j5346
13584B66684Q476k0885n3553j3564K5876J7907K1029l1252m9901j1474j6014J0328
13572A53657p592P741o403j0664m824k6207k1837J7496J8846j710J4392P326r908
$$ plain form
13559 130313 130176 133545 146505 127419 127952 135672 123265 88882 50436 55589 91538 110610 100444
13546 100444 78278 66489 87600 86187 57139 60638 99081 101319 101396 94658 106006 121563 121088
13533 121088 106536 77419 91957 83341 84166 112926 102220 92020 87089 77441 101219 88376
13521 88376 72451 83760 77933 75571 101671 121533 113952 100549 108180 143051 127595 104527
13509 104527 115352 136761 115551 122440 111257 87854 68363 83372 101568 127738 109063 102937
13497 102937 111606 101249 74402 55701 65155 94855 90313 82381 63809 55783 68121 80017
13485 80017 96884 76966 80404 79918 69280 84985 78391 70434 78665 73578 107010 135029 119644
13472 119644 133605 121735 129020 155397 140251 127159 96763 87306 101987 107857 102212 81964
$$ packed form
13559A30313j37L369J2960j9086N33P720j2407l4383l8446N153L5949J9072j0166
13546A00444k2166j1789K1111j413k9048L499L8443K238P7o738J1348J5557m75
13533A21088j4552k9117J4538q616Q25K8760j0706j0200m931r648K3778j2843
13521H8376j5925J1309n827k362K6100J9862p581j3403P631L4871j5456k3068
13509A04527J0825K1409k1210O889j1183k3403j9491J5009J8196K6170j8675o126
13497A02937Q669j0357k6847j8701R454K9700m542p932j8572q026J2338J1896
13485H0017J6867j9918L438m86j0638J5705o594p957Q231n087L3432K8019j5385
13472A19644J3961j1870P285K6377j5146j3092l0396r457J4681N870n645k0248
$$ plain form
13460 81964 75737 84043 84425 56544 78373 100165 109360 119579 97956 104834 119048 115348 106756
13447 106756 94428 69875 71820 82015 76857 80461 76184 69681 94624 116048 107159 101755 119247
13434 119247 100304 41259 22879 51307 72186 52347 44025 65549 78369 65781 55509 51000
13422 51000 80510 87508 106018 92586 69722 51062 54287 57886 47558 69263 107747 123368
13410 123368 109106 109738 90748 71614 79183 93345 110521 118717 125587 99932 85782 72389
13398 72389 84568 84884 84130 90120 81229 77946 92240 82939 81434 99250 137814 148001 142190 122530
13384 122530 74030 91569 113696 92918 77577 64075 85454 82740 80802 102851 128407 134288
13372 134288 128277 102304 115624 112398 97778 92006 75063 42791 50127 61262 42521 30381
$$ packed form
13460H1964o227Q306L82k7881K1829K1792R195J0219k1623O878J4214l700q592
13447A06756j2328k4553J945J0195n158L604m277o503K4943K1424q889n404J7492
13434A19247j8943n9045j8380K8428K0879j9839q322K1524J2820j2588j0272m509
13422E1000K9510O998J8510j3432k2864j8660L225L599j0328K1705L8484J5621
13410A23368j4262O32j8990j9134P569J4162J7176Q196O870k5655j4150j3393
13398G2389J2179L16p54N990q891l283J4294r301j505J7816L8564J0187n811j9660
13384A22530m8500J7539K2127k0778j5341j3502K1379k714j938K2049K5556N881
13372A34288o011k5973J3320l226j4620n772j6943l2272P336J1135j8741j2140
$$ plain form
13360 30381 46082 54899 65448 71441 78943 88256 98841 120661 96814 114192 136792 105799
13348 105799 89126 110734 126149 120313 106117 106421 98968 89229 77839 91594 104355 117989
13336 117989 114938 106761 106124 104994 87633 95066 69840 53953 51298 61121 73799 82235 86274
13323 86274 78749 64735 55618 72649 105798 112564 113651 122085 116193 105214 81215 86188 94500
13310 94500 116987 99205 77941 88238 75968 66228 53484 44869 77639 127214 130124 102574
13298 102574 81690 78886 55344 63353 98038 112307 101989 60458 49780 40961 36886 42831
13286 42831 66915 88714 84495 55086 72013 89899 92677 98547 99120 98514 103405 92570 94784
13273 94784 106252 81193 81550 98304 130155 121126 81075 78946 105325 112045 108446 105943 95234
$$ packed form
13360C0381J5701Q817J0549N993P502R313J0585K1820k3847J7378K2600l0993
13348A05799j6673K1608J5415n836j4196L04p453r739j1390J3755J2761J3634
13336A17989l051q177o37j130j7361P433k5226j5887k655R823J2678Q436M039
13323H6274p525j4014r117J7031L3149O766J087Q434n892j0979k3999M973Q312
13310I4500K2487j7782k1264J0297j2270r740j2744q615L2770M9575K910k7550
13298A02574k0884k804k3542Q009L4685J4269j0318m1531j0678q819m075N945
13286D2831K4084K1799m219k9409J6927J7886K778N870N73o06M891j0835K214
13273I4784J1468k5059L57J6754L1851r029m0051k129K6379O720l599k503j0709
$$ plain form
13260 95234 75717 70096 88004 92275 104328 87352 93874 109969 108144 76607 67576 81943 98924
13247 98924 128757 126538 123360 113764 123796 93107 94668 105142 99441 100860 116222 138199 143875
13234 143875 157568 120760 106156 127273 148969 140436 123736 110950 130397 126788 119850 101779
13222 101779 91483 100642 122490 123378 142836 124231 106026 105241 90386 91670 91831 101050 89934
13209 89934 82325 116753 121852 133461 148781 142994 144308 142293 140681 133134 133207 118584 118945 106531
13195 106531 85765 93946 125714 160819 147863 106473 112277 137071 154921 151300 165760 182751
13183 182751 170866 169292 186642 172404 153797 154973 154210 146604 125523 108490 87218 76816
13171 76816 92600 91577 70788 119259 150559 136197 135426 166840 149486 135367 134136 119697
$$ packed form
13260I5234j9517n621J7908M271J2053j6976O522J6095j825l1537r031J4367J6981
13247I8924K9833k219l178r596J0032l0689J561J0474n701J419J5362K1977N676
13234A43875J3693l6808j4604K1117K1696q533j6700j2786J9447l609o938j8071
13222A01779j0296R159K1848Q88J9458j8605j8205p85j4855J284J61R219j1116
13209H9934p609L4428N099J1609J5320n787J314k015j612p547P3j4623L61j2414
13195A06531k0766Q181L1768L5105j2956m1390N804K4794J7850l621J4460J6991
13183A82751j1885j574J7350j4238j8607J176p63p606k1081j7033k1272j0402
13171G6816J5784j023k0789M8471L1300j4362p71L1414j7354j4119j231j4439
$$ plain form
13159 119697 104883 99804 114980 116298 132946 130143 129676 123836 134319 119746 106725 111191 124267
13146 124267 109778 108946 113867 102428 106886 113884 141126 161546 151469 130968 95905 48942
13134 48942 48527 91089 124383 140034 139645 135994 124529 125309 136300 160380 135185 115893 108873
13121 108873 87132 80747 106933 165761 173908 127458 102532 104601 160050 193027 164422 171931
13109 171931 166879 143784 147019 130650 125601 147908 158945 161995 159984 126752 135556 163244 141590
13096 141590 132852 120985 124234 119403 114446 117285 128358 111225 120954 127132 134121 154955 185251
13083 185251 185163 182617 172980 164052 160909 169197 162779 187620 164369 144573 166873 148056 134383
13070 134383 132772 131589 124377 139094 149477 162396 163859 194244 204590 183621 174999 169158 171869
$$ packed form
13159A19697j4814n079J5176J318J6648k803m67n840J0483j4573j3021M466J3076
13146A24267j4489q32M921j1439M458O998K7242K0420j0077k0501l5063m6963
13134D8942m15M2562L3294J5651l89l651j1465P80J0991K4080k5195j9292p020
13121A08873k1741o385K6186N8828Q147m6450k4926K069N5449L2977k8605P509
13109A71931n052k3095L235j6369n049K2307J1037L050k011l3232Q804K7688k1654
13096A41590q738j1867L249m831m957K839J1073j7133R729O178O989K0834L0296
13083A85251q8k546r637q928l143Q288o418K4841k3251j9796K2300j8817j3673
13070A34383j611j183p212J4717J0383J2919J463L0385J0346k0969q622n841K711
$$ plain form
13057 171869 160451 170310 172778 169020 181252 158960 123138 114295 133066 161974 151122 160887
13045 160887 192252 220504 214316 226648 264198 309706 324099 331299 365325 409849 495785 569578
13033 569578 670981 765982 832750 891956 971684 1060142 1110992 1135357 1134031 1072898 989151
13022 989151 902725 805780 709776 616437 547143 510213 490397 457050 423245 396254 363974
13011 363974 344901 349955 350172 326481 292782 289415 249398 220841 211826 216273 237336 235411 245147
12998 245147 266481 282726 292170 269935 238819 224673 216533 242785 214107 203223 193476 198119
12986 198119 208479 207419 208442 180436 190570 184531 175470 209517 211882 206555 221811 226631 211308
12973 211308 226552 239784 212993 199059 215165 226311 214187 197284 216027 212590 217735 178185
$$ packed form
13057A71869j1418R859K468l758J2232k2292l5822q843J8771K8908j0852R765
13045A60887L1365K8252o188J2332L7550M5508J4393P200L4026M4524Q5936P3793
13033E69578J01403R5001O6768N9206P9728Q8458N0850K4365j326o1133q3747
13022I89151q6426r6945r6004r3339o9294l6930j9816l3347l3805k6991l2280
13011C63974j9073N054K17k3691l3699l367m0017k8557r015M447K1063j925R736
12998B45147K1334J6245R444k2235l1116j4146q140K6252k8678j0884r747M643
12986A98119J0360j060J023k8006J0134o039r061L4047K365n327J5256M820j5323
12973B11308J5244J3232k6791j3934J6106J1146j2124j6903J8743l437N145l9550
$$ plain form
12961 178185 147100 172954 189960 191959 196625 208907 221314 231912 246479 243533 227620 218977
12949 218977 225260 243343 240100 229854 227136 239319 262077 295898 304031 302626 284889 287163 286069
12936 286069 270771 273027 282510 305749 311665 334774 349358 340277 346935 357153 387358 412753
12924 412753 445020 469137 495899 540889 622299 739081 839645 930351 1030935 1116281 1156340
12913 1156340 1129752 1091503 1069307 977516 850094 766438 693054 616552 541988 463877 406770
12902 406770 396016 380393 372022 361681 344640 354056 338231 320220 341236 344240 335866 315477
12890 315477 291860 295055 309432 287468 261414 246029 254499 267491 259987 245105 232735 213478
12878 213478 197127 178854 172031 182913 224795 253631 238135 223810 206572 195119 208673 230811
$$ packed form
12961A78185l1085K5854J7006J999M666J2282J2407J0598J4567k946j5913q643
12949B18977O283J8083l243j0246k718J2183K2758L3821Q133j405j7737K274j094
12936B86069j5298K256R483K3239N916K3109J4584r081O658J0218L0205K5395
12924D12753L2267K4117K6762M4990Q1410J16782J00564R0706J00584Q5346M0059
12913A156340k6588l8249k2196r1791j27422q3656p3384p6502p4564p8111n7107
12902D06770j0754j5623q371j0341j7041R416j5825j8011K1016L004q374k0389
12890C15477k3617L195J4377k1964k6054j5385Q470J2992p504j4882j2370j9257
12878B13478j6351j8273o823J0882M1882K8836j5496j4325j7238j1453J3554K2138
$$ plain form
12866 230811 249793 248483 236983 237408 269419 280468 263546 241663 242995 251801 276719 276230 258576
12853 258576 230227 232793 215117 199038 193113 196996 192491 179280 161971 158814 194397 232465
12841 232465 233627 237903 251372 250688 277085 297378 282580 301193 295848 261345 232822 215322
12829 215322 217880 211276 209123 218390 230388 237056 225933 216680 228699 218421 213761 218866 244294
12816 244294 235783 194675 177441 170189 152517 155042 163328 166853 186655 187368 235773 250114 221973
12803 221973 208817 250474 280948 306106 317089 294186 271506 270295 251712 270277 284125 281238
12791 281238 267062 297965 322528 345518 335050 360168 388358 394251 403084 420289 417178 415429
12779 415429 419175 396687 376778 372107 365233 350643 327093 303247 267565 281257 325622 328951
$$ packed form
12866B30811J8982j310j1500M25L2011J1049j6922k1883J332Q806K4918m89j7654
12853B58576k8349K566j7676j6079n925L883m505j3211j7309l157L5583L8068
12841B32465J162M276J3469o84K6397K0293j4798J8613n345l4503k8523j7500
12829B15322K558o604k153R267J1998O668j1123r253J2019j0278m660N105K5428
12816B44294q511m1108j7234p252j7672K525Q286L525J9802P13M8405J4341k8141
12803B21973j3156M1657L0474K5158J0983k2903k2680j211j8583J8565J3848k887
12791B81238j4176L0903K4563K2990j0468K5118K8190N893Q833J7205l111j749
12779D15429L746k2488j9909m671o874j4590k3550k3846l5682J3692M4365L329
$$ plain form
12767 328951 332810 354868 362040 357031 355812 349326 382038 406485 420455 451713 459458 437372 418568
12754 418568 435950 491025 492124 500112 542759 616731 673311 709667 743467 828545 894737 957982
12742 957982 1044295 1102772 1182306 1249840 1291692 1315413 1305097 1276910 1217635 1114805 1006396
12731 1006396 936702 874617 809570 736045 671126 630209 589532 562482 541207 494671 475863
12720 475863 498729 502132 490730 473448 439286 418596 427013 412519 391482 424718 440052 467607
12708 467607 497938 495601 474309 451943 452116 452648 446742 428716 424274 411565 430664 447613 465499
12695 465499 481873 492153 473133 447360 448902 446133 430453 463550 469551 462057 483462 509317
12683 509317 516708 513097 505062 491383 467642 433935 404235 416617 437456 469445 463087 449971
$$ packed form
12767C28951L859K2058P172n009j219o486L2712K4447J3970L1258P745k2086j8804
12754D18568J7382N5075J099P988M2647P3972N6580L6356L3800Q5078O6192O3245
12742I57982Q6313N8477P9534O7534M1852K3721j0316k8187n9275j02830j08409
12731A006396o9694o2085o5047p3525o4919m0917m0677k7050k1275m6536j8808
12720D75863K2866L403j1402j7282l4162k0690Q417j4494k1037L3236J5334K7555
12708D67607L0331k337k1292k2366J73N32n906j8026m442j2709J9099J6949J7886
12695D65499J6374J0280j9020k5773J542k769j5680L3097O001p494K1405K5855
12683E09317P391l611q035j3679k3741l3707k9700J2382K0839L1989o358j3116
$$ plain form
12671 449971 458711 481685 510988 506694 485561 480389 460459 448606 491608 530461 552941 553297
12659 553297 509269 465562 451648 435233 460452 449611 474273 505961 511571 519891 529396 521689
12647 521689 513361 470720 459123 443700 435390 473202 509859 508808 553760 610407 644788 655642
12635 655642 666639 700985 740178 783794 808685 825908 874185 905848 969705 1035667 1088532
12624 1088532 1120571 1150895 1185130 1170273 1113677 1104163 1116440 1107223 1108687 1109857 1133524 1148467
12612 1148467 1182597 1272545 1359153 1407167 1417712 1340114 1235197 1151495 1099402 1072976 1062818
12601 1062818 1065341 1084244 1112138 1136249 1141867 1135949 1184530 1181477 1175832 1164122 1195280 1218884
12589 1218884 1235091 1255879 1300664 1344102 1385893 1426251 1453819 1485368 1525012 1603982 1662159
$$ packed form
12671D49971Q740K2974K9303m294k1133n172j9930j1853M3002L8853K2480L56
12659E53297m4028m3707j3914j6415K5219j0841K4662L1688N610Q320R505p707
12647E21689q328m2641j1597j5423q310L7812L6657j051M4952N6647L4381J0854
12635F55642J0997L4346L9193M3616K4891J7223M8277L1663O3857O5962N2865
12624A088532L2039L0324L4235j4857n6596r514J2277r217J464J170K3667J4943
12612A148467L4130Q9948Q6608M8014J0545p7598j04917q3702n2093k6426j0158
12601A062818K523J8903K7894K4111N618n918M8581l053n645j1710L1158K3604
12589A218884J6207K0788M4785M3438M1791M0358K7568L1549L9644P8970N8177
$$ plain form
12578 1662159 1710374 1760770 1828296 1915819 2009179 2107600 2207960 2313498 2424102 2478175 2499779
12567 2499779 2511771 2475170 2409660 2340188 2258334 2179590 2131198 2113304 2111653 2143917 2156180
12556 2156180 2147963 2140426 2144249 2146412 2159882 2198264 2238441 2290088 2334227 2368123 2457662 2535244
12544 2535244 2622938 2753018 2872949 3018137 3185616 3364680 3556631 3771855 4016855 4270193
12534 4270193 4559353 4942377 5489044 6193200 7166515 8422873 9989431 11800678 13622003
12525 13622003 15123175 16047123 16201783 15692631 14836497 13917551 13269376 13074284 13341038
12516 13341038 14163883 15455899 17219546 19610539 22636088 26204200 30176961 34206485
12508 34206485 37872632 41020829 43905360 47298239 52199289 59576402 70202717 84488093
$$ packed form
12578A662159M8215N0396O7526Q7523R3360R8421J00360J05538J10604N4073K1604
12567B499779J1992l6601o5510o9472q1854p8744m8392j7894j651L2264J2263
12556B156180q217p537L823K163J3470L8382M0177N1647M4139L3896Q9539P7582
12544B535244Q7694J30080J19931J45188J67479J79064J91951K15224K45000K53338
12534D270193K89160L83024N46667P04156R73315J256358J566558J811247J821325
12525A3622003J501172R23948J54660n09152q56134r18946o48175j95092K66754
12516A3341038Q22845J292016J763647K390993L025549L568112L972761M029524
12508C4206485L666147L148197K884531L392879M901050P377113J0626315J4285376
$$ plain form
12500 84488093 102226256 122437338 143407729 162902670 178475257 188046812 190261922
12493 190261922 184827632 172633021 155424547 135515077 115162590 96289109 80113712
12486 80113712 67011596 56884296 49253521 43513691 39213612 35943785 33292941 31053722
12478 31053722 29119027 27365612 25779428 24279547 22889073 21590017 20362476 19145790
12470 19145790 17969399 16848994 15749071 14704690 13741968 12848620 12027777 11244801 10562128
12461 10562128 9911463 9282024 8692614 8144711 7709636 7310857 6954435 6619544 6320196
12452 6320196 6006759 5737761 5470601 5212256 4958215 4715359 4460136 4220617 4015277
12443 4015277 3819991 3600386 3435323 3266163 3117810 2974345 2858990 2746680 2630411
$$ packed form
12500H4488093J7738163K0211082K0970391J9494941J5572587R571555K215110
12493A90261922n434290j2194611j7208474j9909470k0352487j8873481j6175397
12486H0113712j3102116j0127300p630775n739830m300079l269827k650844k239219
12478C1053722j934695j753415j586184j499881j390474j299056j227541j216686
12470A9145790j176391j120405j099923j044381r62722q93348q20843p82976o82673
12461A0562128o50665o29439n89410n47903m35075l98779l56422l34891k99348
12452F320196l13437k68998k67160k58345k54041k42856k55223k39519k05340
12443D015277j95286k19605j65063j69160j48353j43465j15355j12310j16269
$$ plain form
12434 2630411 2523134 2459997 2428411 2408291 2397964 2344315 2312777 2266200 2222803 2185514 2169676
12423 2169676 2150136 2101228 2020950 1947376 1883663 1837609 1784964 1744898 1703121 1671612 1620879
12412 1620879 1604917 1578180 1537630 1522083 1528261 1512291 1497170 1470628 1454472 1426829 1406056
12401 1406056 1414134 1395903 1380209 1372494 1373200 1383915 1370165 1415632 1500912 1527761 1519654 1550391
12389 1550391 1531648 1499624 1517207 1548519 1571318 1574452 1593222 1611028 1635356 1693177 1738797
12378 1738797 1775214 1815873 1827194 1833377 1872617 1962044 2039705 2114539 2165200 2223005 2306169
12367 2306169 2401045 2468728 2545564 2631714 2713311 2815478 2922190 3033307 3140151 3288985
12357 3288985 3485829 3678964 3835264 4063052 4304581 4560611 4853515 5193304 5610224
$$ packed form
12434B630411j07277o3137l1586k0120j0327n3649l1538m6577m3397l7289j5838
12423B169676j9540m8908q0278p3574o3713m6054n2645m0066m1777l1509n0733
12412A620879j5962k6737m0550j5547O178j5970j5121k6542j6156k7643k0773
12401A406056Q078j8231j5694p715P06J0715j3750M5467Q5280K6849q107L0737
12389A550391j8743l2024J7583L1312K2799L134J8770J7806K4328N7821M5620
12378A738797L6417M0659J1321O183L9240Q9427P7661P4834N0661N7805Q3164
12367B306169R4876O7683P6836Q6150Q1597J02167J06712J11117J06844J48834
12357C288985J96844J93135J56300K27788K41529K56030K92904L39789M16920
$$ plain form
12348 5610224 6054349 6545926 7168327 7914831 8790853 9845372 11047022 12424927 13994671
12339 13994671 15751773 17742486 20010796 22624396 25794630 29781583 34963039 41874657
12331 41874657 51072902 63086948 78205487 96348637 116739155 137899805 157970162
12324 157970162 174754388 186254050 191027611 188480934 179028199 164012380 145299086
12317 145299086 125047137 105289387 87590358 72879152 61356122 52697541 46265814
12310 46265814 41476438 37832246 34918047 32491468 30373618 28467301 26725491 25094577
12302 25094577 23561992 22104425 20718525 19432054 18211585 17028399 15900611 14808654
12294 14808654 13767753 12834547 11959526 11125829 10377873 9726808 9126453 8530438 7982478
$$ packed form
12348E610224M44125M91577O22401P46504Q76022J054519J201650J377905J569744
12339A3994671J757102J990713K268310K613600L170234L986953N181456O911618
12331D1874657R198245J2014046J5118539J8143150K0390518K1160650K0070357
12324A57970162J6784226J1499662M773561k546677r452735j5015819j8713294
12317A45299086k0251949j9757750j7699029j4711206j1523030q658581o431727
12310D6265814m789376l644192k914199k426579k117850j906317j741810j630914
12302B5094577j532585j457567j385900j286471j220469j183186j127788j091957
12294A4808654j040901r33206q75021q33697p47956o51065o00355n96015n47960
$$ plain form
12285 7982478 7483050 7040542 6654138 6299812 5917327 5584640 5272948 4967946 4701380
12276 4701380 4435011 4181754 3946836 3701800 3484191 3330920 3205054 3038784 2845575
12267 2845575 2676273 2518963 2403688 2255025 2114050 1993344 1908356 1833804 1745514 1677411
12257 1677411 1614525 1545910 1494026 1420897 1346333 1283707 1247272 1211923 1148295 1097048 1030635
12246 1030635 983468 973829 947994 899035 854784 800797 748290 718370 687948 624611 607372
12235 607372 584622 559550 503960 482393 491323 471772 457567 464533 437251 418611 424751 413569
12223 413569 365846 339508 324419 312386 324292 332539 314361 316134 292496 295330 296257 278255
12211 278255 251991 219112 234089 267230 261026 272130 301985 328578 329871 333637 354161 375637
$$ packed form
12285G982478m99428m42508l86404l54326l82485l32687l11692l05002k66566
12276D701380k66369k53257k34918k45036k17609j53271j25866j66270j93209
12267B845575j69302j57310j15275j48663j40975j20706q4988p4552q8290o8103
12257A677411o2886o8615n1884p3129p4564o2626l6435l5349o3628n1247o6413
12246A030635m7167r639k5835m8959m4251n3987n2507k9920l0422o3337j7239
12235F07372k2750k5072n5590k1567Q930j9551j4205O966k7282j8640O140j1182
12223D13569m7723k6338j5089j2033J1906Q247j8178J773k3638K834R27j8002
12211B78255k6264l2879J4977L3141o204J1104K9855K6593J293L766K0524K1476
$$ plain form
12199 375637 395307 407588 407141 393151 400228 406393 398270 360600 325777 291948 258685 259066 276153
12186 276153 287292 306925 316804 312794 332808 368074 391717 382022 373521 349736 330599 317369
12174 317369 312962 330975 339987 347342 359242 359883 362558 351076 336843 341859 328298 300033 288233
12161 288233 325314 376773 382411 399710 406245 440474 472136 459384 423354 397561 397790 370439
12149 370439 333455 338565 344019 336016 335048 352008 340839 315115 333176 342662 328397 302358 289660
12136 289660 292009 296891 262863 270290 300618 305453 294599 305876 315298 327095 354773 370321
12124 370321 333652 275981 242086 281107 308567 294335 308214 314140 313297 307995 315434 303826
12112 303826 295453 290112 302427 321062 334160 326370 313200 328556 361958 391382 441451 498731
$$ packed form
12199C75637J9670J2281m47j3990P077O165q123l7670l4823l3829l3263L81J7087
12186B76153J1139J9633R879m010K0014L5266K3643r695q501k3785j9137j3230
12174C17369m407J8013R012P355J1900O41K675j1482j4233N016j3561k8265j1800
12161B88233L7081N1459N638J7299O535L4229L1662j2752l6030k5793K29k7351
12149C70439l6984N110N454q003r68J6960j1169k5724J8061R486j4265k6039j2698
12136B89660K349M882l4028P427L0328M835j0854J1277R422J1797K7678J5548
12124C70321l6669n7671l3895L9021K7460j4232J3879N926q43n302P439j1608
12112C03826q373n341J2315J8635J3098p790j3170J5356L3402K9424N0069N7280
$$ plain form
12100 498731 546606 551676 578648 619070 634349 640602 647398 623429 625077 656685 699981 763345
12088 763345 866498 1006199 1171883 1290648 1411164 1557062 1683916 1803085 1941512 2150885
12078 2150885 2443691 2850150 3429766 4172232 5036327 5972741 6914465 7721835 8278800
12069 8278800 8491700 8333737 7863610 7122679 6245170 5301580 4416887 3673116 3052225
12060 3052225 2600133 2245985 1986613 1787091 1631383 1542775 1451017 1367389 1301975 1259013
12050 1259013 1199373 1135959 1058648 1008999 959605 923209 878154 810103 739605 680473 621024
12039 621024 562610 533953 516110 489111 475350 442884 407638 389110 379449 368841 353920 350737
12027 350737 358750 374765 379673 344320 310430 307999 333404 331521 326081 314328 330247 317662
$$ packed form
12100D98731M7875N070K6972M0422J5279O253O796k3969J648L1608M3296O3364
12088G63345J03153J39701J65684J18765J20516J45898J26854J19169J38427K09373
12078B150885K92806M06459N79616P42466Q64095R36414R41724Q07370N56965
12069H278800K12900j57963m70127p40931q77509r43590q84693p43771o20891
12060C052225m52092l54148k59372j99522j55708q8608r1758q3628o5414m2962
12050A259013n9640o3414p7311m9649m9394l6396m5055o8051p0498n9132n9449
12039F21024n8414k8657j7843k6999j3761l2466l5246j8528r661j0608j4921l183
12027C50737Q013J6015M908l5353l3890k431K5405j883n440j1753J5919j2585
$$ plain form
12015 317662 329692 349171 364963 364647 365624 378948 390842 395055 364772 347786 379893 393683
12003 393683 353742 347805 376270 357730 365043 399633 438250 476193 477381 480461 495240 496905
11991 496905 482868 477747 472277 501316 554558 618789 691356 802103 892239 971020 1017317 1059616
11979 1059616 1130983 1241114 1388041 1591333 1878572 2215104 2646157 3159478 3619257 4001833
11969 4001833 4345266 4601426 4710509 4648118 4439928 4097824 3717750 3363530 3079223 2913686
11959 2913686 2925266 3022970 3259138 3675305 4373468 5496930 7293631 10187136 14494159
11950 14494159 19545176 23164073 23326924 19660331 14234929 9806250 7005172 5339653
11942 5339653 4291105 3581473 3099556 2757488 2477631 2252829 2082954 1940724 1870660
$$ packed form
12015C17662J2030J9479J5792l16R77J3324J1894M213l0283j6986L2107J3790
12003C93683l9941n937K8465j8540P313L4590L8617L7943J188L080J4779J665
11991D96905j4037n121n470K9039N3242O4231P2567J10747R0136P8781M6297M2299
11979A059616P1367J10131J46927K03292K87239L36532M31053N13321M59779L82576
11969D001833L43433K56160J09083o2391k08190l42104l80074l54220k84307j65537
11959B913686J1580R7704K36168M16167O98163J123462J796701K893505M307023
11950A4494159N051017L618897J62851l666593n425402m428679k801078j665519
11942E339653j048548p09632m81917l42068k79857k24802j69875j42230p0064
$$ plain form
11933 1870660 1826887 1778745 1725667 1687401 1626680 1576736 1518738 1437326 1359763 1257506 1201433
11922 1201433 1127946 1039284 967529 921711 888220 839224 801041 770144 746558 740489 749353 732486
11910 732486 761086 791675 861933 921502 984487 1057327 1142902 1199445 1274993 1312504 1301534
11899 1301534 1253985 1184086 1088690 990653 897654 791725 678827 600581 547243 499448 455616
11888 455616 420218 370626 345343 342805 354989 367286 367104 328501 306573 311570 316696 297694
11876 297694 247064 229272 221786 257801 264043 256296 239882 188921 162667 167363 179193 169218
11864 169218 155460 144127 151527 157326 166838 177921 173077 156849 141145 137507 141883 136789 121870
11851 121870 99420 96710 93706 105853 103918 99890 99351 116306 148128 148542 152380 165020 172376
$$ packed form
11933A870660m3773m8142n3078l8266o0721m9944n7998q1412p7563j02257n6073
11922A201433p3487q8662p1755m5818l3491m8996l8183l0897k3586o069Q864j6867
11910G32486K8600L0589P0258N9569O2985P2840Q5575N6543P5548L7511j0970
11899A301534m7549o9899r5396r8037r2999j05929j12898p8246n3338m7795m3832
11888D55616l5398m9592k5283k538J2184J2297j82l8603k1928M997N126j9002
11876B97694n0630j7792p486L6015O242p747j6414n0961k6254M696J1830r975
11864A69218j3758j1333P400N799R512J1083m844j6228j5704l638M376n094j4919
11851A21870k2450k710l004J2147j935m028n39J6955L1822M14L838J2640P356
$$ plain form
11838 172376 141236 134720 115830 109643 91007 91173 106310 109658 104970 120281 151616 138158 141970
11825 141970 146453 160852 180577 170060 180048 191199 178087 150668 132559 119153 137717 128893
11813 128893 132524 140251 138982 130335 122771 131706 144102 135517 123320 140085 174324 160923 140488
11800 140488 127828 144084 149287 161835 137211 141231 145225 149955 143851 142382 148998 130507 130914
11787 130914 170904 179295 174896 189028 183829 194077 166619 162884 180943 172189 157427 162524 160298
11774 160298 134170 129429 133983 132913 135032 131633 116519 153411 166384 174200 182282 152046 173975
11761 173975 198641 191487 182532 181686 158370 166927 187356 163772 145543 148847 183822 189873 171902
11748 171902 172115 169789 183393 186765 185422 158434 156900 182629 197000 166162 165505 197682 201055
$$ packed form
11838A72376l1140o516j8890o187j8636J66J5137L348m688J5311L1335j3458L812
11825A41970M483J4399J9725j0517R988J1151j3112k7419j8109j3406J8564q824
11813A28893L631P727j269q647p564Q935J2396q585j2197J6765L4239j3401k0435
11800A40488j2660J6256N203J2548k4624M020L994M730o104j469O616j8491M07
11787A30914L9990Q391m399J4132n199J0248k7458l735J8059q754j4762N097k226
11774A60298k6128m741M554j070K119l399j5114L6892J2973P816Q082l0236K1929
11761A73975K4666p154q955q46k3316Q557K0429k3584j8229L304L4975O051j7971
11748A71902K13k326J3604L372j343k6988j534K5729J4371l0838o57L2177L373
$$ plain form
11735 201055 189595 170277 161751 174642 175524 187904 153595 155140 164383 180481 165251 157777 156842
11722 156842 205720 219476 208983 182647 185823 188860 174141 175814 189096 155133 140580 134079
11710 134079 131894 135867 138737 127148 139394 148835 177858 171960 132791 138709 149100 160407 171469
11697 171469 165253 131009 123635 131265 153839 142100 153273 159146 142263 141535 137672 162964 169232
11684 169232 162166 157159 149670 140716 151652 140800 128075 124356 183383 197152 184603 160801
11672 160801 150879 160907 193088 227063 217388 200928 160947 153618 169570 186829 188995 198098
11660 198098 185336 189379 189988 183186 134640 117368 143548 122855 155117 201462 191907 172690
11648 172690 185863 181404 175907 193168 212153 207810 188910 170839 203015 223997 219108 220816
$$ packed form
11735B01055j1460j9318q526J2891Q82J2380l4309J545R243J6098j5230p474r35
11722A56842M8878J3756j0493k6336L176L037j4719J673J3282l3963j4553o501
11710A34079k185L973K870j1589J2246R441K9023n898l9169N918J0391J1307J1062
11697A71469o216l4244p374P630K2574j1739J1173N873j6883p28l863K5292O268
11684A69232p066n007p489q954J0936j0852j2725l719N9027J3769j2549k3802
11672A60801r922J0028L2181L3975r675j6460l9981p329J5952J7259K166R103
11660A98098j2762M043O09o802m8546j7272K6180k0693L2262M6345r555j9217
11648A72690J3173m459n497J7261J8985m343j8900j8071L2176K0982m889J708
$$ plain form
11636 220816 202656 198888 188454 173655 142926 133079 145378 178731 190979 195217 203163 220828
11624 220828 216821 198857 203165 203519 203085 199857 172363 146830 167841 186160 170501 183778 172208
11611 172208 154435 143900 163256 190712 180721 190523 185845 164359 161538 161481 146490 147181 164492
11598 164492 185260 200495 213286 208028 202065 167689 159467 159044 154378 156014 178816 190726 197451
11585 197451 189762 187994 184463 186407 210210 216308 214046 185133 204355 188495 169246 192710 216130
11572 216130 214089 235791 250273 221544 198037 173567 152915 140197 148223 161248 174605 180373
11560 180373 209458 220662 194935 193593 198241 217689 221257 234925 243187 251777 229663 232785 213725
11547 213725 206581 210401 211024 203545 211425 231137 239401 226560 218299 213971 214400 211175 188303 203457
$$ packed form
11636B20816j8160l768j0434j4799l0729r847J2299L3353J2248M238P946J7665
11624B20828m007j7964M308L54m34l228k7494k5533K1011J8319j5659J3277j1570
11611A72208j7773j0535J9356K7456r991R802m678k1486k821n7j4991O91J7311
11598A64492K0768J5235J2791n258n963l4376q222m23m666J636K2802J1910O725
11585A97451p689j768l531J944K3803O098k262k8913J9222j5860j9249K3464K3420
11572B16130k041K1702J4482k8729k3507k4470k0652j2718Q026J3025J3357N768
11560A80373K9085J1204k5727j342M648J9448L568J3668Q262Q590k2114L122j9060
11547B13725p144L820O23p479P880J9712Q264j2841q261m328M29l225k2872J5154
$$ plain form
11533 203457 211944 231750 260475 253572 234412 224861 219425 202222 204850 214257 212730 210076 194386
11520 194386 226163 248962 222227 201872 208128 202996 197410 184623 160582 164311 204356 223263
11508 223263 226194 237252 248664 268856 264491 245785 250446 275341 297832 332130 312407 255278
11496 255278 222396 226906 223760 229506 255530 234839 202538 234642 264931 255630 252297 244104 269190
11483 269190 273232 273541 261390 236005 242005 256824 263639 244782 239120 256503 269369 251226 237375
11470 237375 226091 213579 200250 185698 174518 174471 179855 190197 214947 230162 239703 240750 233205
11457 233205 236186 241416 237186 262492 269867 259500 269128 253686 235918 238002 270489 302272 327310
11444 327310 300955 254878 249743 256260 248847 234987 237564 241890 212650 211126 234083 252834 267516
$$ packed form
11533B03457Q487J9806K8725o903j9160r551n436j7203K628R407j527k654j5690
11520A94386L1777K2799k6735k0355O256n132n586j2787k4041L729M0045J8907
11508B23263K931J1058J1412K0192m365j8706M661K4895K2491L4298j9723n7129
11496B55278l2882M510l146N746K6024k0691l2301L2104L0289r301l333q193K5086
11483B69190M042L09j2151k5385O000J4819O815j8857n662J7383J2866j8143j3851
11470B37375j1284j2512j3329j4552j1180m7N384J0342K4750J5215R541J047p545
11457B33205K981N230m230K5306P375j0367R628j5442j7768K084L2487L1783K5038
11444C27310k6355m6077n135O517p413j3860K577M326k9240j524K2957J8751J4682
$$ plain form
11431 267516 285052 255634 263444 258866 241093 239289 239361 236008 258820 280426 275361 263447 248994
11418 248994 247735 251711 269894 247944 280485 275408 266758 255100 266386 292588 302966 291558
11406 291558 290692 289854 300131 284885 285823 294281 308885 325014 336800 301900 294465 307731 312101
11393 312101 326851 322220 332379 362038 375279 345955 357444 335223 323530 316473 337810 368936
11381 368936 385098 363643 335060 335104 358031 354107 337703 347974 395055 413463 391308 360491
11369 360491 329400 359686 383928 403720 383585 356675 342710 345134 327857 316465 339743 390097
11357 390097 410331 424010 407773 409768 396256 404527 418744 398116 416860 443928 462337 518889
11345 518889 555575 547373 552498 565487 615520 643094 639172 645517 656901 630118 588135 550209
$$ packed form
11431B67516J7536k9418P810m578j7773j804P2l353K2812K1606n065j1914j4453
11418B48994j259L976J8183k1950L2541n077q650j1658J1286K6202J0378j1408
11406B91558q66q38J0277j5246R38Q458J4604J6129J1786l4900p435J3266M370
11393C12101J4750m631J0159K9659J3241k9324J1489k2221j1693p057K1337L1126
11381C68936J6162k1455k8583M4K2927l924j6404J0271M7081J8408k2155l0817
11369C60491l1091L0286K4242J9792k0135k6910j3965K424j7277j1392K3278N0354
11357C90097K0234J3679j6237J995j3512Q271J4217k0628J8744K7068J8409N6552
11345E18889L6686q202N125J2989N0033K7574l922O345J1384k6783m1983l7926
$$ plain form
11333 550209 545193 512226 482500 477654 482463 498320 501157 492197 500636 474969 460426 468208 452279
11320 452279 462658 468741 459555 464768 490427 501564 495011 516421 512623 486536 501243 534156
11308 534156 561122 595478 633555 701055 767801 796049 805109 815388 838099 858230 884959 907781
11296 907781 893744 885203 905767 890931 831007 792316 738693 710833 686159 672987 640394 637989
11284 637989 631870 638058 655934 642941 660205 695487 726838 717859 688329 632243 611920 627284
11272 627284 612097 636967 674513 702053 750951 779204 828386 884145 932249 960276 966573 967408
11260 967408 943975 906138 906513 870497 807645 784870 793217 795910 849883 910930 972563 989568
11248 989568 1018993 1071310 1105377 1118843 1106821 1043967 979452 958646 907505 861798 841712
$$ packed form
11333E50209n016l2967k9726m846M809J5857K837q960Q439k5667j4543P782j5929
11320D52279J0379O083r186N213K5659J1137o553K1410l798k6087J4707L2913
11308E34156K6966L4356L8077O7500O6746K8248R060J0279K2711K0131K6729K2822
11296I07781j4037q541K0564j4836n9924l8691n3623k7860k4674j3172l2593k405
11284F37989o119O188J7876j2993J7264L5282L1351q979k9530n6086k0323J5364
11272F27284j5187K4870L7546K7540M8898K8253M9182N5759M8104K8027O297Q35
11260I67408k3433l7837L75l6016o2852k2775Q347K693N3973O1047O1633J7005
11248I89568K9425N2317L4067J3466j2022o2854o4515k0806n1141m5707k0086
$$ plain form
11237 841712 833227 823361 818508 831642 849639 884808 918325 927643 886844 847723 794106 771859
11225 771859 769952 774921 777992 819470 861843 873197 880899 914257 925854 916845 892678 892027 894622
11212 894622 879620 853219 857173 854644 888319 894247 881435 860088 874325 875462 842181 821699
11200 821699 805126 766304 726936 734721 736030 712807 713411 715477 731837 749834 734516 716867
11188 716867 701616 690377 656583 640222 660381 681941 658706 636710 652391 684943 735214
11177 735214 760782 784098 834010 883526 917546 945340 967994 937782 885185 837846 795979
11166 795979 762433 704289 690654 693459 699690 677968 673742 680997 690505 704426 717365 720034 723524
11153 723524 711480 699799 734511 775642 805785 808527 806623 822652 834787 862896 876467 871755
$$ packed form
11237H41712q485r866m853J3134J7997L5169L3517R318m0799l9121n3617k2247
11225G71859j907M969L071M1478M2373J1354P702L3358J1597r009k4167o51K595
11212H94622j5002k6401L954k529L3675N928j2812k1347J4237J137l3281k0482
11200H21699j6573l8822l9368P785J309k3223O04K066J6360J7997j5318j7649
11188G16867j5251j1239l3794j6361K0159K1560k3235k1996J5681L2552N0271
11177G35214K5568K3316M9912M9516L4020K7794K2654l0212n2597m7339m1867
11166G95979l3546n8144j3635K805O231k1722m226P255R508J3921J2939K669L490
11153G23524j2044j1681L4712M1131L0143K742j904J6029J2135K8109J3571m712
$$ plain form
11141 871755 862064 875271 871064 845993 852875 898771 910801 904850 911025 924346 936113 938274 944410
11128 944410 952961 969780 962409 939808 949838 955001 971886 980198 989844 1018437 1067696 1046352
11116 1046352 1039014 1039418 1026082 1030534 1025635 1008918 971201 913594 911982 892362 896072 937547 971828
11103 971828 1023424 1049088 1040754 1053439 1084880 1102695 1130511 1161787 1175977 1196629 1192049 1175838
11091 1175838 1179431 1207435 1237241 1252489 1275307 1266675 1268381 1256107 1266939 1272571 1258858 1259651
11079 1259651 1205905 1132222 1083916 1074951 1055557 1064918 1081297 1045350 1044067 1037379 1045143 1078982
11067 1078982 1068460 1045299 1049186 1050312 1072089 1085337 1127152 1152810 1116157 1098987 1130987 1173890
11055 1173890 1214651 1281265 1339823 1382208 1434675 1502957 1509083 1456620 1444085 1401903 1350916
$$ packed form
11141H71755r691J3207m207k5071O882M5896J2030n951O175J3321J1767K161O136
11128I44410Q551J6819p371k2601J0030N163J6885Q312R646K8593M9259k1344
11116A046352p338M04j3336M452m899j6717l7717n7607j612j9620L710M1475L4281
11103I71828N1596K5664q334J2685L1441J7815K7816L1276J4190K0652m580j6211
11091A175838L593K8004K9806J5248K2818q632J706j2274J0832N632j3713P93
11079A259651n3746p3683m8306q965j9394R361J6379l5947j283o688P764L3839
11067A078982j0522k3161L887J126K1777J3248M1815K5658l6653j7170L2000M2903
11055A173890M0761O6614N8558M2385N2467O8282O126n2463j2535m2182n0987
$$ plain form
11044 1350916 1305677 1266226 1248731 1235339 1192529 1202259 1206799 1190795 1174037 1165864 1203675 1230810
11032 1230810 1247910 1291489 1293525 1277829 1275070 1268345 1332234 1388471 1420624 1437322 1487812 1539096
11020 1539096 1614965 1682576 1780410 1855382 1916226 1965409 1977929 1982152 1993612 2002317 2023158 2001849
11008 2001849 1974092 1924144 1856950 1811419 1783478 1742623 1735531 1742291 1758654 1761221 1754097 1758421
10996 1758421 1765694 1759920 1789901 1820162 1868187 1872076 1886624 1921767 1953005 1940279 1991756 2024879
10984 2024879 2066782 2106574 2139093 2206948 2267373 2340736 2396233 2470998 2523669 2579812 2595928
10973 2595928 2593972 2602404 2593176 2586543 2599325 2623397 2649304 2681959 2723238 2752261 2798874 2856497
10961 2856497 2920887 2949448 3012972 3075676 3147014 3227910 3275865 3336279 3375563 3458567 3615632
$$ packed form
11044A350916m5239l9451j7495j3392m2810R730M540j6004j6758q173L7811K7135
11032A230810J7100M3579K036j5696k759o725O3889N6237L2153J6698N0490N1284
11020A539096P5869O7611R7834P4972O0844M9183J2520M223J1460Q705K0841k1309
11008B001849k7757m9948o7194m5531k7941m0855p092O760J6363K567p124M324
10996A758421P273n774K9981L0261M8025L889J4548L5143L1238j2726N1477L3123
10984B024879M1903L9792L2519O7855O0425P3363N5497P4765N2671N6143J6116
10973B595928j956Q432r228o633J2782K4072K5907L2655M1279K9023M6613N7623
10961B856497O4390K8561O3524O2704P1338Q0896M7955O0414L9284Q3004J57065
$$ plain form
10950 3615632 3787386 3966192 4110737 4256366 4423968 4603286 4844104 5100165 5406988
10941 5406988 5746585 6110398 6487016 6905966 7485337 8227887 9137160 10303793 11791809
10932 11791809 13723126 16225915 19434460 23578852 28737377 34850203 41544571 48049032
10924 48049032 53350552 56336560 56326402 53405135 48298630 42180140 36194259 31023178
10916 31023178 27036237 24122642 22104490 20814760 20111723 19845776 19913667 20243966 20598194
10907 20598194 20862059 20978438 21000097 21023057 21173192 21512417 22108649 23033486 24345033
10898 24345033 26124292 28458957 31466874 35288530 40138467 46198686 53605998 62345128
10890 62345128 72166617 82539004 92721528 101693033 108405064 112178313 112860290 110688589
$$ packed form
10950C615632J71754J78806J44545J45629J67602J79318K40818K56061L06823
10941E406988L39597L63813L76618M18950N79371P42550R09273J166633J488016
10932A1791809J931317K502789L208545M144392N158525O112826O694368O504461
10924D8049032N301520K986008j0158k921267n106505o118490n985881n171081
10916C1023178l986941k913595k018152j289730p03037k65947O7891L30299L54228
10907B0598194K63865J16379K1659K2960J50135L39225N96232R24837J311547
10898B4345033J779259K334665L007917L821656M849937O060219P407312Q739130
10890F2345128R821489J0372387J0182524Q971505O712031L773249O81977k171701
$$ plain form
10882 110688589 106164701 99884018 92520572 84674470 76973544 69956207 64026625 59430406
10874 59430406 56276482 54520354 54055283 54558527 55597227 56816553 57902633 58647623
10866 58647623 59044205 59128592 59068582 59053373 59127424 59269801 59382270 59394225 59395948 59573586
10856 59573586 60194629 61589224 63957508 67332373 71592203 76540092 81818187 86886811
10848 86886811 90996030 93383335 93499187 91135163 86772968 81344215 75984141 71755457
10840 71755457 69526595 69642505 72221576 77066902 83754838 91613036 99543749 106244222
10832 106244222 110521849 111737222 110034697 106243820 101505500 96940360 93202385 90491604
10824 90491604 88684961 87447997 86369554 85272996 84190863 83213538 82179315 80639135
$$ packed form
10882A10688589m523888o280683p363446p846102p700926p017337n929582m596219
10874E9430406l153924j756128m65071N03244J038700J219326J086080P44990
10866E8647623L96582Q4387o0010j5209P4051J42377J12469J1955J723J77638
10856E9573586O21043J394595K368284L374865M259830M947889N278095N068624
10848H6886811M109219K387305J15852k364024m362195n428753n360074m228684
10840G1755457k228862J15910K579071M845326O687936P858198P930713O700473
10832A06244222M277627J215373j702525l790877m738320m565140l737975k710781
10824I0491604j806643j236964j078443j096558j082133r77325j034223j540180
$$ plain form
10816 80639135 78128565 74440018 69724545 64420346 59101018 54293740 50387592 47584207
10808 47584207 45973512 45473347 45987526 47468489 49823605 52875636 56431132 60180981
10800 60180981 63891687 67516397 70948483 74011265 76365207 77551751 77290992 75455516
10792 75455516 72408201 68679745 64801737 61026064 57420608 53875272 50264352 46571108
10784 46571108 42806015 39134026 35721908 32659215 30066855 27951500 26303402 25096699
10776 25096699 24329077 23962035 23932035 24130264 24474051 24887571 25309033 25689060 26081981
10767 26081981 26620693 27498500 28968759 31290689 34765977 39568306 45638568 52542041
10759 52542041 59242031 64410082 66895705 66020949 61937853 55599642 48341762 41391800
$$ packed form
10816H0639135k510570l688547m715473n304199n319328m807278l906148k803385
10808D7584207j610695n00165N14179J480963K355116L052031L555496L749849
10800F0180981L710706L624710L432086L062782K353942J186544k60759j835476
10792G5455516l047315l728456l878008l775673l605456l545336l610920l693244
10784D6571108l765093l671989l412118l062693k592360k115355j648098j206703
10776B5096699p67622l67042l0000J98229L43787M13520M21462L80027L92921
10767B6081981N38712Q77807J470259K321930L475288M802329O070262O903473
10759E2542041O699990N168051K485623q74756m083096o338211p257880o949962
$$ plain form
10751 41391800 35506347 30974057 27720888 25457885 24003928 23220929 22958364 23227886
10743 23227886 23995117 25303658 27118878 29498477 32437008 35927054 39983905 44498938
10735 44498938 49034453 53141263 56454799 58770974 60155235 60844401 61182237 61373087
10727 61373087 61448455 61158090 60298221 58813222 56896496 54852335 53045567 51910640 51617400
10718 51617400 52019695 52601400 52805536 52145183 50342313 47546906 44151793 40530174 37124596
10709 37124596 34183921 31893528 30325575 29425392 29149553 29450209 30260106 31546410 33172575
10700 33172575 35013003 36837760 38307607 39252043 39633110 39595262 39373100 39205742 39269020
10691 39269020 39537851 39844250 40052622 40050191 39912594 39796109 39855111 40098840 40449536 40639070
$$ packed form
10751D1391800n885453m532290l253169k263003j453957p82999k62565K69522
10743B3227886P67231J308541J815220K379599K938531L490046M056851M515033
10735D4498938M535515M106810L313536K316175J384261O89166L37836J90850
10727F1373087P5368k90365q59869j484999j916726k044161j806768j134927k93240
10718E1617400M02295N81705K04136o60353j802870k795407l395113l621619l405578
10709C7124596k940675k290393j567953r00183k75839L00656Q09897J286304J626165
10700C3172575J840428J824757J469847R44436L81067l7848k22162j67358O3278
10691C9269020K68831L06399K08372k431j37597j16485N9002K43729L50696J89534
$$ plain form
10681 40639070 40359422 39367546 37658183 35418772 33012074 30819359 29200440 28311888
10673 28311888 28203575 28793963 29806356 31002842 32025754 32666783 32834772 32603422 32149349
10664 32149349 31600045 30965570 30101667 28828095 26961617 24474872 21673735 18895136
10656 18895136 16434831 14391545 12714361 11348333 10210211 9301538 8594382 8039782
10648 8039782 7573608 7163477 6788370 6442485 6098376 5757179 5455372 5168153 4856009
10639 4856009 4585971 4335783 4127071 3940639 3763347 3569694 3415967 3315961 3253055 3188626
10629 3188626 3077217 2971028 2862985 2786551 2752998 2736839 2715947 2724681 2753122 2816547 2871695
10618 2871695 2902940 2927301 2879725 2748793 2582005 2429054 2259603 2138406 2033235 1957801
$$ packed form
10681D0639070k79648r91876j709363k239411k406698k192715j618919q88552
10673B8311888j08313N90388J012393J196486J022912O41029J67989k31350m54073
10664C2149349n49304o34475q63903j273572j866478k486745k801137k778599
10656A8895136k460305k043286j677184j366028j138122r08673p07156n54600
10648H039782m66174m10131l75107l45885l44109l41197l01807k87219l12144
10639D856009k70038k50188k08712j86432j77292j93653j53727j00006o2906o4429
10629C188626j11409j06189j08043p6434l3553j6159k0892Q734K8441O3425N5148
10618B871695L1245K4361m7576j30932j66788j52951j69451j21197j05171p5434
$$ plain form
10608 1957801 1923114 1860156 1807566 1759689 1715559 1698875 1682191 1680076 1645597 1635626 1626454 1590825
10596 1590825 1566819 1568295 1585540 1600930 1619461 1608519 1602546 1620697 1625318 1651644 1632272 1615727
10584 1615727 1658720 1690566 1722024 1775390 1848247 1921875 1972220 1983935 2018152 2052058 2050253
10573 2050253 2071152 2060268 2029684 2033917 1999472 1984231 1990698 2002772 2051496 2115265 2141634 2141924
10561 2141924 2156592 2196261 2225672 2254460 2282037 2309017 2320373 2391070 2442327 2467095 2507194
10550 2507194 2573759 2582760 2570701 2599797 2596959 2623422 2676466 2741862 2853569 2950579 3021448
10539 3021448 3099584 3223943 3332544 3491922 3662846 3826955 4012323 4232236 4492915 4773373
10529 4773373 5064021 5311225 5523283 5655292 5739512 5844625 5995758 6170536 6402964 6674129
$$ packed form
10608A957801l4687o2958n2590m7877m4130j6684j6684k115l4479r971r172l5629
10596A590825k4006J476J7245J5390J8531j0942n973J8151M621K6326j9372j6545
10584A615727M2993L1846L1458N3366P2857P3628N0345J1715L4217L3906j805
10573B050253K0899j0884l0584M233l4445j5241O467J2074M8724O3769K6369K90
10561B141924J4668L9669K9411K8788K7577K6980J1356P0697N1257K4768M0099
10550B507194O6565R001j2059K9096k838K6463N3044O5396J11707R7010P0869
10539C021448P8136J24359J08601J59378J70924J64109J85368K19913K60679K80458
10529D773373K90648K47204K12058J32009Q4220J05113J51133J74778K32428K71165
$$ plain form
10519 6674129 6954473 7270325 7649376 8091895 8552641 9064262 9674286 10425364 11339723
10510 11339723 12468233 13823181 15385395 16997757 18636710 20281874 22132915 24443670
10502 24443670 27416432 31369335 36605874 43648364 53121856 66077357 84129413 109648822
10494 109648822 145942541 196620137 262406275 335025720 393486997 414115356 386725853
10487 386725853 323724686 253083701 195496522 155526727 129585381 113217903 103138879
10480 103138879 96797958 91963664 86931030 81238910 75846469 71963297 69617205 67544953
10472 67544953 64224448 59230628 53495543 48280423 43967709 40289297 36967849 33938267
10464 33938267 31236634 28886283 26866591 25103204 23527227 22060473 20708996 19438994
$$ packed form
10519F674129K80344L15852L79051M42519M60746N11621O10024P51078R14359
10510A1339723J128510J354948J562214J612362J638953J645164J851041K310755
10502B4443670K972762L952903N236539P042490R473492J2955501J8052056K5519409
10494A09648822L6293719N0677596O5786138P2619445N8461277K0628359k7389503
10487C86725853o3001167p0640985n7587179l9969795k5941346j6367478j0079024
10480A03138879o340921m834294n032634n692120n392441l883172k346092k072252
10472F7544953l320505m993820n735085n215120m312714l678412l321448l029582
10464C3938267k701633k350351k019692j763387j575977j466754j351477j270002
$$ plain form
10456 19438994 18288463 17239356 16325616 15496974 14732816 14041542 13373386 12680753 11979616
10447 11979616 11305671 10715839 10212558 9795821 9505204 9362668 9364711 9535287 9776937 9970152
10437 9970152 10013105 9770732 9260290 8621376 8028432 7591192 7303118 7121077 6976248 6814277
10427 6814277 6628737 6396356 6091558 5783315 5463620 5122969 4844445 4585526 4352139
10418 4352139 4162404 4040959 3916908 3826972 3763724 3722716 3702222 3649436 3552286 3446993
10408 3446993 3324497 3219872 3133470 3019218 2936664 2869666 2808298 2789800 2820066 2918975 3026107
10397 3026107 3185565 3360967 3564699 3818621 4065365 4220410 4244946 4121672 3868111 3593528
10387 3593528 3345475 3175333 3044068 2972528 2943363 2934347 2957118 2973638 2988447 3021207 3067255
$$ packed form
10456A9438994j150531j049107r13740q28642p64158o91274o68156o92633p01137
10447A1979616o73945n89832n03281m16737k90617j42536K043J70576K41650J93215
10437I970152M2953k42373n10442o38914n92944m37240k88074j82041j44829j61971
10427F814277j85540k32381l04798l08243l19695l40651k78524k58919k33387
10418D352139j89735j21445j24051q9936o3248m1008k0494n2786r7150j05293
10408C446993j22496j04625q6402j14252q2554o6998o1368j8498L0266R8909J07132
10397C026107J59458J75402K03732K53922K46744J55045K4536j23274k53561k74583
10387C593528k48053j70142j31265p1540k9165r016K2771J6520J4809L2760M6048
$$ plain form
10376 3067255 3093146 3124565 3159383 3223731 3327371 3433068 3506107 3593323 3703518 3818083
10366 3818083 3939299 4088472 4224516 4344528 4441835 4557394 4710387 4843192 4987310 5163275
10356 5163275 5404598 5668982 5972877 6289188 6647988 7026068 7456750 7984283 8582790
10347 8582790 9248104 10028020 10995845 12193079 13676413 15484204 17560745 19731454 21830331
10338 21830331 23764765 25680118 27999907 31148684 35543602 41592337 49797239 61007942
10330 61007942 76632689 98678594 129885857 173775874 233008116 304813106 374618164
10323 374618164 417986267 415425251 366623414 293565624 223485288 169528255 131632809
10316 131632809 105552952 87392140 74511720 65081776 58020945 52612552 48422506
$$ packed form
10376C067255K5891L1419L4818O4348J03640J05697P3039Q7216J10195J14565
10366C818083J21216J49173J36044J20012R7307J15559J52993J32805J44118J75965
10356E163275K41323K64384L03895L16311L58800L78080M30682N27533N98507
10347H582790O65314P79916R67825J197234J483334J807791K076541K170709K098877
10338B1830331J934434J915353K319789L148777M394918O048735Q204902J1210703
10330F1007942J5624747K2045905L1207263M3890017N9232242P1804990O9805058
10323C74618164M3368103k561016m8801837p3057790p0080336n3957033l7895446
10316A31632809k6079857j8160812j2880420r429944p060831n408393m190046
$$ plain form
10309 48422506 45283476 42985772 41252979 39784034 38354114 36849360 35317691 33803209
10301 33803209 32184102 30365553 28358046 26351621 24451018 22682944 21013480 19506867
10293 19506867 18111799 16821919 15693516 14653077 13701280 12833226 12032284 11286418 10572161
10284 10572161 9922352 9325597 8777996 8274848 7787105 7324062 6900727 6481274 6111544
10275 6111544 5799975 5497485 5207835 4932360 4677835 4424853 4179307 3931928 3747103
10266 3747103 3559843 3378359 3189512 3028030 2866198 2705641 2555559 2430479 2337122 2204642
10256 2204642 2074413 1983660 1899839 1837965 1776050 1690425 1619351 1549127 1490432 1450111 1406874
10245 1406874 1346919 1309422 1252179 1177345 1082555 999159 947936 899628 827857 725481 651445
$$ packed form
10309D8422506l139030k297704j732793j468945j429920j504754j531669j514482
10301C3803209j619107j818549k007507k006425j900603j768074j669464j506613
10293A9506867j395068j289880j128403j040439r51797q68054q00942p45866p14257
10284A0572161o49809n96755n47601n03148m87743m63043m23335m19453l69730
10275F111544l11569l02490k89650k75475k54525k52982k45546k47379j84825
10266C747103j87260j81484j88847j61482j61832j60557j50082j25080r3357j32480
10256B204642j30229r0753q3821o1874o1915q5625p1074p0224n8695m0321m3237
10245A406874n9955l7497n7243p4834r4790q3396n1223m8308p1771j02376p4036
$$ plain form
10234 651445 584233 556405 520718 467639 452008 425726 407447 379574 362897 327132 279762
10223 279762 259724 265818 255472 250888 237729 228948 217160 217383 250002 269914 242289 203732
10211 203732 198877 186814 188836 216446 222064 243788 263867 281470 315917 353466 388420 436803
10199 436803 479244 517175 528500 537074 518179 461702 442068 469562 434618 422676 417192 377298
10187 377298 308383 242485 182236 178659 209118 248885 283066 333205 372693 390905 411122 416548
10175 416548 411917 412975 455176 494087 481704 494337 485750 517243 562998 589215 589202 598714 588424
10162 588424 558200 589910 622754 655118 697400 710942 733237 768861 769061 738528 736974 766035
10150 766035 823844 893689 1012045 1146599 1250339 1337376 1440376 1593349 1830913 2154589
$$ packed form
10234F51445o7212k7828l5687n3079j5631k6282j8279k7873j6677l5765m7370
10223B79762k0038O094j0346m584j3159q781j1788K23L2619J9912k7625l8557
10211B03732m855j2063K022K7610N618K1724K0079J7603L4447L7549L4954M8383
10199D36803M2441L7931J1325Q574j8895n6477j9634K7494l4944j1942n484l9894
10187C77298o8915o5898o0249l577L0459L9767L4181N0139L9488J8212K0217N426
10175D16548m631J058M2201L8911j2383J2633q587L1493M5755K6217j3R512j0290
10162E88424l0224L1710L2844L2364M2282J3542K2295L5624K00l0533j554K9061
10150G66035N7809O9845J18356J34554J03740Q7037J03000J52973K37564L23676
$$ plain form
10140 2154589 2579809 3190653 4100638 5394532 7234105 9680174 12585218 15432183 17224974
10131 17224974 17258616 15589072 12999835 10445402 8390442 6885412 5741258 4830549
10123 4830549 4092478 3511182 3069793 2738384 2435922 2213780 2055037 1920314 1789012
10114 1789012 1755465 1706498 1653017 1617055 1551125 1457882 1366259 1315343 1266522 1226313 1171417
10103 1171417 1120458 1055456 1031507 1014320 992815 977921 935416 860557 778095 694164 635416
10092 635416 617334 572138 504100 490270 473594 475508 470371 481986 491026 494995 539640 570825
10080 570825 616935 636776 644198 668226 716533 786840 866370 958041 1070931 1252706 1477242
10069 1477242 1772152 2172731 2629682 3096096 3451759 3622417 3632271 3612406 3746758 4161302
$$ packed form
10140B154589M25220O10844R09985J293894J839573K446069K905044K846965J792791
10131A7224974L3642j669544k589237k554433k054960j505030j144154r10709
10123D830549p38071n81296m41389l31409l02462k22142j58743j34723j31302
10114A789012l3547m8967n3481l5962o5930r3243r1623n0916m8821m0209n4896
10103A171417n0959o5002k3949j7187k1505j4894m2505p4859q2462q3931n8748
10092F35416j8082m5196o8038j3830j6676J914n137J1615R040L969M4645L1185
10080E70825M6110J9841P422K4028M8307P0307P9530R1671J12890J81775K24536
10069A477242K94910M00579M56951M66414L55663J70658R854j9865J34352M14544
$$ plain form
10059 4161302 4887229 6026507 7647081 9713329 11986202 13966214 15100872 15001088 13695696
10050 13695696 11645735 9414430 7451251 5910176 4725126 3820351 3212596 2750137
10042 2750137 2403735 2170931 2004686 1868151 1733645 1628642 1539946 1437974 1376020 1273235
10032 1273235 1159630 1069451 1009339 956754 896596 835605 785039 738637 687458 617433 557452
10021 557452 516750 466787 434538 397038 407377 399943 404131 417231 467635 547477 629840 680561
10009 680561 732562 783280 766775 715415 659896 614788 532404 436610 385520 353071 325809
9998 325809 327824 326021 319355 292711 269926 306393 342403 314311 275884 264776 230281 230099 223194
9985 223194 198187 184985 148841 130783 134250 126164 124422 101028 100361 105276 107749 75927 36890
$$ packed form
10059D161302P25927J139278J620574K066248K272873J980012J134658r9784j305392
10050A3695696k049961k231305j963179j541075j185050r04775o07755m62459
10042B750137l46402k32804j66245j36535j34506j05003q8696j01972o1954j02785
10032A273235j13605r0179o0112n2585o0158o0991n0566m6402n1179p0025n9981
10021E57452m0702m9963l2249l7500J0339p434M188J3100N0404P9842Q2363N0721
10009F80561N2001N0718j6505n1360n5519m5108q2384r5794n1090l2449k7262
9998C25809K015j803o666k6644k2785L6467L6010k8092l8427j1108l4495j82o905
9985B23194k5007j3202l6144j8058L467q086j742k3394o67M915K473l1822l9037
$$ plain form
9972 36890 20275 33676 27370 23589 25125 35854 40295 7288 -8090 -9699 3697 43535 27729
9959 27729 27351 15373 6505 -9246 4251 17053 27978 29783 -3204 -834 12426 5070 -22169
9946 -22169 -58291 -31422 -3053 -11930 -32503 -11837 -21995 -32271 -20964 -13153 -3547 -1952 10461
9933 10461 19733 -3290 -11950 29405 48053 49818 76923 83035 89536 122677 174033 249850 330071
9920 330071 406670 474203 470797 419259 383189 368511 336864 326330 324533 352865 366338 380786
9908 380786 416104 484366 565208 690674 847923 1084370 1370994 1686704 1978426 2103558
9898 2103558 2018369 1741661 1404215 1119245 855436 679254 572714 482107 438875 405139
9888 405139 360320 330428 334931 352512 358795 369594 370120 384713 372871 363489 357009 367142 377317
$$ packed form
9972C6890j6615J3401o306l781J536J0729M441l3007j5378j609J3396L9838j5806
9959B7729l78j1978q868j5751J3497J2802J0925J805l2987K370J3260p356k7239
9946b2169l6122K6869K8369q877k0573K0666j0158j0276J1307P811R606J595J2413
9933A0461R272k3023q660M1355J8648J765K7105O112O501L3141N1356P5817Q0221
9920C30071P6599O7533l406n1538l6070j4678l1647j0534j797K8332J3473J4448
9908C80786L5318O8262Q0842J25466J57249K36447K86624L15710K91722J25132
9898B103558q5189k76708l37446k84970k63809j76182j06540r0607m3232l3736
9888D05139m4819k9892M503J7581O283J0799N26J4593j1842r382o480J0133J0175
$$ plain form
9875 377317 400744 394826 353631 306727 296556 283858 246048 204310 167153 86573 72704 52243
9863 52243 45695 47398 78310 86382 96445 121351 105723 115987 133353 148180 154683 119799 118836
9850 118836 106804 115352 105606 104799 126810 160246 183935 184813 182142 239552 279706 313147 319188
9837 319188 312560 304925 289958 219048 181673 152496 138023 139044 131631 129655 123712 115198 93572
9824 93572 94689 95560 111023 128549 123770 107327 91466 104660 109835 96279 75060 64748 73315
9811 73315 83960 111098 134095 114335 128678 145489 132608 153013 174071 173407 167514 156306
9799 156306 155353 169932 196667 186701 171479 150332 122279 93283 78664 103639 88915 84319
9787 84319 89323 113200 92845 77871 94676 106474 114598 115215 99639 82910 106766 98570 96575
$$ packed form
9875C77317K3427n918m1195m6904j0171j2698l7810m1738l7157q0580j3869k0461
9863E2243o548J703L0912Q072J0063K4906j5628J0264J7366J4827O503l4884r63
9850A18836j2032Q548r746q07K2011L3436K3689Q78k671N7410M0154L3441O041
9837C19188o628p635j4967p0910l7375k9177j4473J021p413j976n943q514k1626
9824I3572J117Q71J5463J7526m779j6443j5861J3194N175j3556k1219j0312Q567
9811G3315J0645K7138K2997j9760J4343J6811j2881K0405K1058o64n893j1208
9799A56306r53J4579K6735r966j5222k1147k8053k8996j4619K4975j4724m596
9787H4319N004K3877k0355j4974J6805J1798Q124O17j5576j6729K3856q196j995
$$ plain form
9774 96575 90147 82606 87594 117662 136618 132854 102257 84733 76875 112080 151528 160474 167226
9761 167226 134236 130639 125961 100002 68318 54624 31152 37474 59135 49100 26511 38914
9749 38914 61385 58969 31732 30276 40884 40464 57887 69210 84134 90457 100830 104658 109032
9736 109032 76281 81337 76201 97808 117555 92877 87513 86077 101610 102551 105316 105840 99881 112429
9722 112429 104488 83642 65510 70899 81330 96509 115485 138936 159112 163136 150711 154055
9710 154055 162821 161795 152857 162314 178538 214902 225863 200055 171466 158686 144616 135572 132705
9697 132705 115698 119646 140297 120856 110573 136299 129199 139541 160559 134871 86690 78212
9685 78212 108099 142885 138130 132937 152150 167903 153664 156619 149793 143964 149351 133612 153708
$$ packed form
9774I6575o428p541M988L0068J8956l764l0597j7524p858L5205L9448Q946O752
9761A67226l2990l597m678k5959l1684j3694k3472O322K1661j0035k2589J2403
9749C8914K2471k416k7237j456J0608m20J7423J1323J4924O323J0373L828M374
9736A09032l2751N056n136K1607J9747k4678n364j436J5533R41K765N24n959J2548
9722A12429p941k0846j8132N389J0431J5179J8976K3451K0176M024j2425L344
9710A54055Q766j026q938R457J6224L6364J0961k5808k8589j2780j4070r044k867
9697A32705j7007L948K0651j9441j0283K5726p100J0342K1018k5688m8181q478
9685G8212K9887L4786m755n193J9213J5753j4239K955o826n829N387j5739K0096
$$ plain form
9672 153708 151501 166341 193309 208736 197290 188548 210616 208444 209902 213261 220848 252483 268628
9659 268628 246652 270137 291448 280052 283978 286052 309973 333322 314868 291647 268417 277505
9647 277505 287067 276533 242517 250367 272262 267290 245615 229951 223407 251345 266918 292025
9635 292025 319549 338945 353631 353205 385761 414300 415613 428912 425072 413534 397937 379364
9623 379364 389332 423994 422202 419184 403416 397484 411241 418583 422176 430404 436599 423981 427461
9610 427461 435233 465960 462143 463469 454404 447466 446474 444874 437249 422763 424171 412024 397787 396338
9596 396338 406299 446354 461780 448717 437675 450274 454316 476424 475906 491403 524346 551209
9584 551209 594017 603392 578288 554740 575236 598727 607894 646024 659582 653333 603828 588138
$$ packed form
9672A53708k207J4840K6968J5427j1446q742K2068k172J458L359P587L1635J6145
9659B68628k1976K3485K1311j1396L926K074K3921K3349j8454k3221k3230R088
9647B77505R562j0534l4016P850K1895m972k1675j5664o544K7938J5573K5107
9635B92025K7524J9396J4686m26L2556K8539J313J3299l840j1538j5597j8573
9623C79364R968L4662j792l018j5768n932J3757P342L593Q228O195j2618L480
9610D27461P772L0727l817J326r065o938r92j600p625j4486J408j2147j4237j449
9596C96338R961M0055J5426j3063j1042J2599M042K2108n18J5497L2943K6863
9584E51209M2808R375k5104k3548K0496K3491R167L8130J3558o249m9505j5690
$$ plain form
9572 588138 606490 630904 618304 602602 612416 638552 657587 653961 665536 702133 699456 667665
9560 667665 647753 690544 722434 724245 743935 776622 805543 804968 813579 851571 931870 980150
9548 980150 1024470 1061343 1123323 1221151 1307549 1359259 1411840 1479893 1579419 1676141 1762929 1885621
9536 1885621 2070153 2287238 2475004 2742660 3064066 3442093 3916416 4520849 5295332 6310477
9526 6310477 7635780 9302353 11276290 13292322 15054000 16153579 16293135 15484382 14022269
9517 14022269 12283512 10681080 9439387 8558083 7968846 7664812 7584684 7669182 7869119
9508 7869119 8098680 8317880 8483714 8583471 8611318 8559031 8504250 8503979 8601273 8876842 9359170
9497 9359170 10080827 11115272 12462623 14128777 16086070 18255626 20515658 22781082
$$ packed form
9572E88138J8352K4414j2600j5702R814K6136J9035l626J1575L6597k677l1791
9560F67665j9912M2791L1890J811J9690L2687K8921n75Q611L7992Q0299M8280
9548I80150M4320L6873O1980R7828Q6398N1710N2581O8053R9526R6722Q6788J22692
9536A885621J84532K17085J87766K67656L21406L78027M74323O04433P74483J015145
9526F310477J325303J666573J973937K016032J761678J099579J39556q08753j462113
9517A4022269j738757j602432j241693q81304n89237l04034q0128Q4498J99937
9508G869119K29561K19200J65834R9757K7847n2287n4781k71R7294K75569M82328
9497I359170P21657J034445J347351J666154J957293K169556K260032K265424
$$ plain form
9489 22781082 25076959 27485234 29950354 32431245 34881597 37102062 38760670 39512988
9481 39512988 39311827 38337381 36805941 34806126 32394423 29728119 27058809 24560719
9473 24560719 22411240 20686612 19317900 18249515 17445454 16870758 16572966 16575960 16900367
9464 16900367 17506821 18360212 19428111 20709567 22117901 23624110 25114186 26312330
9456 26312330 27036394 27333547 27581322 28317221 30000011 32842726 36943711 42119292 47755396
9447 47755396 52931934 56526551 57659286 56122448 52403538 47505812 42505721 38174718
9439 38174718 34929092 32752719 31248182 29987408 28648644 27154750 25552492 23967787
9431 23967787 22389790 20908255 19527648 18347132 17474931 16908126 16642766 16688821 17000085
$$ packed form
9489B2781082K295877K408275K465120K480891K450352K220465J658608P52318
9481C9512988k01161r74446j531440j999815k411703k666304k669310k498090
9473B4560719k149479j724628j368712j068385q04061n74696k97792K994L24407
9464A6900367O06454Q53391J067899J281456J408334J506209J490076J198144
9456B6312330P24064K97153K47775P35899J682790K842715M100985N175581N636104
9447D7755396N176538L594617J132735j536838l718910m897726n000091m331003
9439C8174718l245626k176373j504537j260774j338764j493894j602258j584705
9431B3967787j577997j481535j380607j180516q72201n66805k65360M6055L11264
$$ plain form
9422 17000085 17638123 18562620 19724270 21066687 22546972 24141085 25759916 27233069
9414 27233069 28424123 29304603 30045203 30934063 32011342 33128246 34035968 34440049 34251042
9405 34251042 33447176 32007534 30002170 27652022 25122665 22623787 20229841 17949392
9397 17949392 15876815 14121092 12709541 11617391 10808463 10225144 9807059 9538731 9407187
9388 9407187 9288050 9183600 9016005 8778876 8525987 8239985 7939891 7655674 7440785 7396831
9378 7396831 7526149 7849103 8399508 9236747 10331948 11565403 12779284 13749438 14182731
9369 14182731 13829834 12764705 11214871 9531215 7999977 6726319 5729650 4969112 4403859
9360 4403859 3960901 3608739 3298167 3046124 2815403 2630557 2473626 2309901 2165810 2030918
$$ packed form
9422A7000085O38038R24497J161650J342417J480285J594113J618831J473153
9414B7233069J191054Q80480P40600Q88860J077279J116904R07722M04081j89007
9405C4251042q03866j439642k005364k350148k529357k498878k393946k280449
9397A7949392k072577j755723j411551j092150q08928n83319m18085k68328j31544
9388I407187j19137j04450j67595k37129k52889k86002l00094k84217k14889m3954
9378G396831J29318L22954N50405Q37239J095201J233455J213881R70154M33293
9369A4182731l52897j065129j549834j683656j531238j273658r96669p60538n65253
9360D403859m42958l52162l10572k52043k30721j84846j56931j63725j44091j34892
$$ plain form
9350 2030918 1902770 1768805 1667785 1620440 1550117 1453603 1350083 1264684 1197199 1145611 1087313
9339 1087313 1006402 959841 914128 851276 812880 778004 754697 723241 691809 672294 667032 639695
9327 639695 618075 642159 644516 634500 601901 606869 619668 617580 586321 529220 506863 501045
9315 501045 460695 426105 419502 419214 397244 404119 384808 377511 340700 329631 315754 292114 274001
9302 274001 262555 249397 239106 275424 290249 268719 254254 252999 263305 245809 250396 269158
9290 269158 274561 279649 287964 309942 318359 327930 377456 434274 455850 470198 459760 497888 508830
9277 508830 517496 521706 496111 452526 422737 420272 401024 363466 329036 311921 303927 288409
9265 288409 257838 223558 238838 241536 216586 191903 165099 156768 179942 195801 207428 234292
$$ packed form
9350B030918j28148j33965j01020m7345p0323r6514j03520q5399o7485n1588n8298
9339A087313q0911m6561m5713o2852l8396l4876k3307l1456l1432j9515n262k7337
9327F39695k1620K4084K357j0016l2599M968J2799k088l1259n7101k2357n818
9315E01045m0350l4590o603k88k1970O875j9311p297l6811j1069j3877k3640j8113
9302B74001j1446j3158j0291L6318J4825k1530j4465j255J0306j7496M587J8762
9290B69158N403N088Q315K1978Q417R571M9526N6818K1576J4348j0438L8128J0942
9277E08830Q666M210k5595m3585k9789k465j9248l7558l4430j7115p994j5518
9265B88409l0571l4280J5280K698k4950k4683k6804q331K3174J5859J1627K6864
$$ plain form
9253 234292 231740 203384 211952 219287 224410 241938 195984 166101 158807 178607 200743 202272 206407
9240 206407 235313 274248 305765 329146 352294 352838 340790 338017 367635 360793 350892 319477 270696
9227 270696 228461 180799 170176 162911 166464 140234 128233 126599 145582 157642 152802 148945 170468
9214 170468 175137 144000 109549 114297 122257 121967 116107 113486 126761 109693 94090 91651 106801
9201 106801 126647 142769 88445 56417 79109 111224 115822 114365 105348 120048 124196 112259
9189 112259 85300 95794 110747 121282 134258 120865 109562 113155 113917 102936 97030 95710 77511
9176 77511 74858 97746 122048 138610 124769 114425 77909 60793 75480 86743 81912 75289
9164 75289 73573 91413 93915 72585 26860 5157 30705 66233 85203 96719 90084 83477 98281
$$ packed form
9253B34292k552k8356Q568P335N123J7528m5954k9883p294J9800K2136J529M135
9240B06407K8906L8935L1517K3381K3148N44j2048k773K9618o842r901l1415m8781
9227B70696m2235m7662j0623p265L553k6230j2001j634J8983J2060m840l857K1523
9214A70468M669l1137l4451M748P960k90n860k621J3275j7068j5603k439J5150
9201A06801J9846J6122n4324l2028K2692L2115M598j457r017J4700M148j1937
9189A12259k6959J0494J4953J0535J2976j3393j1303L593P62j0981n906j320j8199
9176G7511k653K2888K4302J6562j3841j0344l6516j7116J4687J1263m831o623
9164G5289j716J7840K502k1330m5725k1703K5548L5528J8970J1516o635o607J4804
$$ plain form
9151 98281 82855 52420 29989 51355 94010 110471 99528 96432 115659 125356 148488 132307
9139 132307 136314 129115 100794 96965 92858 84111 97120 104284 120551 132470 119284 138065 140857
9126 140857 168000 222173 240151 206067 198743 182212 178500 192693 213910 194230 189292 172371
9114 172371 159704 146754 130672 114784 111274 95804 106308 140523 167995 187629 160364 156491
9102 156491 191895 229899 231321 225379 222819 217771 223699 208046 190981 193195 215837 249271 254108
9089 254108 269998 294533 319676 348878 372091 377802 350689 339263 346566 343333 345894 350926 339288
9076 339288 325777 296891 284596 272607 257905 250768 253659 237555 230782 240468 253398 247230 267207
9063 267207 312345 313530 304804 294394 308827 345506 346833 356590 397433 395686 403569 423519 406193
$$ packed form
9151I8281j5426l0435k2431K1366M2655J6461j0943l096J9227R697K3132j6181
9139A32307M007p199k8321l829m107q747J3009P164J6267J1919j3186J8781K792
9126A40857K7143N4173J7978l4084p324j6531l712J4193K1217j9680m938j6921
9114A72371j2667j2950j6082j5888l510j5470J0504L4215K7472J9634k7265l873
9102A56491L5404L8004J422n942k560n048N928j5653j7065K214K2642L3434M837
9089B54108J5890K4535K5143K9202K3213N711k7113j1426P303l233K561N032j1638
9076C39288j3511k8886j2295j1989j4702p137K891j6104o773R686J2930o168J9977
9063B67207M5138J185q726j0410J4433L6679J327R757M0843j747P883J9950j7326
$$ plain form
9050 406193 410967 472664 500841 509304 512221 514400 468786 444476 425913 383363 397349 409714
9038 409714 437155 408742 353717 338303 333675 335940 335312 332072 340085 305340 273181 286858 294727
9025 294727 309800 320362 322150 321540 300128 293604 307102 302633 318832 337851 383512 387199 381278
9012 381278 406559 436948 456375 468410 473308 463883 436974 419678 390002 372933 377727 372095
9000 372095 350813 347983 345752 354494 353409 338896 336230 331374 352737 353696 338044 315818 299645
8987 299645 298739 277710 292790 304007 307384 315957 329309 363747 365598 364704 367951 373300 370718 416068
8973 416068 449809 484951 486230 464485 432402 411601 400075 406449 392374 352552 362131 373670
8961 373670 345886 343268 363828 370912 370854 382266 385268 377240 351440 324045 310168 324210 360462
$$ packed form
9050D06193M774O1697K8177Q463K917K179m5614k4310j8563m2550J3986J2365
9038D09714K7441k8413n5025j5414m628K265o28l240Q013l4745l2159J3677P869
9025B94727J5073J0562J788o10k1412o524J3498m469J6199J9019M5661L687n921
9012C81278K5281L0389J9427J2035M898r425k6909j7296k9676j7069M794n632
9000C72095k1282k830k231Q742j085j4513k666m856K1363R59j5652k2226j6173
8987B99645r06k1029J5080J1217L377Q573J3352L4438J851q94L247N349k582M5350
8973D16068L3741L5142J279k1745l2083k0801j1526O374j4075l9822R579J1539
8961C73670k7784k618K0560P084n8J1412L002q028k5800k7395j3877J4042L6252
$$ plain form
8948 360462 364739 365386 364401 366792 364994 384542 397170 400553 389876 373432 395636 401045 398201 386498
8934 386498 400014 433370 398304 405086 425966 442924 461863 455361 452829 468851 472775 489493
8922 489493 494929 484507 464480 460774 456039 468004 459307 451453 480301 501171 498680 494472 513467
8909 513467 561104 559354 534102 518272 534718 525397 526445 528233 503672 506100 531282 547921 560411
8896 560411 585741 626703 634277 624304 641331 626865 613600 631185 657851 676103 692268 712681
8884 712681 785987 841529 900194 942312 917627 882722 830743 761028 778804 788631 812892 796817
8872 796817 801432 823932 850097 915723 960257 1060496 1178568 1380724 1692023 2061929 2392085
8861 2392085 2539062 2413507 2083470 1695763 1415355 1227952 1125405 1086425 1068045 1047467
$$ packed form
8948C60462M277O47r85K391j798J9548J2628L383j0677j6444K2204N409k844j1703
8934C86498J3516L3356l5066O782K0880J6958J8939o502k532J6022L924J6718
8922D89493N436j0422k0027l706m735J1965q697p854K8848K0870k491m208J8995
8909E13467M7637j750k5252j5830J6446r321J048J788k4561K428K5182J6639J2490
8896E60411K5330M0962P574r973J7027j4466j3265J7585K6666J8252J6165K0413
8884G12681P3306N5542N8665M2118k4685l4905n1979o9715J7776R827K4261j6075
8872G96817M615K2500K6165O5626M4534J00239J18072K02156L11299L69906L30156
8861B392085J46977j25555l30037l87707k80408j87403j02547l8980j8380k0578
$$ plain form
8851 1047467 1018974 1013940 1002017 999714 998489 984579 1003448 1037660 1055099 1024128 1001338 991648
8839 991648 1020607 1031648 1041473 1044095 1014514 985879 998736 1010973 983743 961078 971235 984739
8827 984739 989734 978069 986074 1009741 1006238 995518 998595 1015682 1015109 1015998 1043080 1070788 1069015
8814 1069015 1069025 1061265 1066563 1089406 1127212 1137754 1155241 1170498 1165763 1160183 1196391 1203066 1223117
8801 1223117 1250478 1259841 1256149 1247574 1226472 1271681 1295503 1281222 1291356 1289207 1284491 1312482
8789 1312482 1361209 1361493 1365677 1376048 1388590 1404254 1440826 1481210 1492785 1501163 1508928 1539451
8777 1539451 1563961 1543875 1523457 1547519 1562687 1576076 1613078 1646021 1663222 1669411 1674101 1735846
8765 1735846 1783383 1798210 1788688 1790080 1791715 1835972 1856766 1881680 1898357 1924590 1926884 1962157
$$ packed form
8851A047467k8493n034j1923k303j225j3910J8869L4212J7439l0971k2790r690
8839I91648K8959J1041R825K622k9581k8635J2857J2237k7230k2665J0157J3504
8827I84739M995j1665Q005K3667l503j0720L077J7087n73Q89K7082K7708j773
8814A069015J0p760N298K2843L7806J0542J7487J5257m735n580L6208O675K0051
8801A223117K7361R363l692q575k1102M5209K3822j4281J0134k149m716K7991
8789A312482M8727K84M184J0371J2542J5664L6572M0384J1575Q378P765L0523
8777A539451K4510k0086k0418K4062J5168J3389L7002L2943J7201O189M690O1745
8765A735846M7537J4827r522J392J635M4257K0794K4914J6677K6233K294L5273
$$ plain form
8753 1962157 2023873 2032455 2015894 2053975 2109502 2124235 2168906 2173617 2175315 2227464 2264571 2264078
8741 2264078 2253524 2291850 2318418 2321377 2370728 2407577 2413778 2471510 2508531 2543702 2569184 2594066
8729 2594066 2627266 2680939 2722367 2719446 2757660 2813560 2825613 2869875 2914422 2970987 3030363 3070164
8717 3070164 3084657 3108067 3122060 3138712 3182746 3244286 3278981 3305555 3372630 3421100 3490443
8706 3490443 3540463 3572317 3611623 3666025 3706195 3766666 3803593 3842957 3888093 3948773 4013707
8695 4013707 4066402 4120229 4166092 4223115 4256294 4300768 4382394 4457759 4516774 4576023 4630322
8684 4630322 4708381 4760416 4833085 4917532 4990910 5103586 5183277 5236569 5308728 5388511 5437941
8673 5437941 5474570 5558809 5623187 5678075 5755181 5827418 5863614 5929657 6026834 6143864 6234413
$$ packed form
8753A962157O1716Q582j6561L8081N5527J4733M4671M711J698N2149L7107m93
8741B264078j0554L8326K6568K959M9351L6849O201N7732L7021L5171K5482K4882
8729B594066L3200N3673M1428k921L8214N5900J2053M4262M4547N6565N9376L9801
8717C070164J4493K3410J3993J6652M4034O1540L4695K6574O7075M8470O9343
8706C490443N0020L1854L9306N4402M0170O0471L6927L9364M5136O0680O4934
8695D013707N2695N3827M5863N7023L3179M4474Q1626P5365N9015N9249N4299
8684D630322P8059N2035P2669Q4447P3378J12676P9691N3292P2159P9783M9430
8673E437941L6629Q4239O4378N4888P7106P2237L6196O6043R7177J17030R0549
$$ plain form
8662 6234413 6320379 6392563 6484257 6576798 6647129 6728186 6816854 6916856 7025485 7081699 7165302
8651 7165302 7240926 7330666 7431296 7512554 7565448 7645465 7712142 7765785 7857113 7941962 8024427
8640 8024427 8097227 8185691 8254978 8328073 8419091 8491657 8564828 8660875 8711801 8743325 8798125
8629 8798125 8884991 8950670 8996260 9049219 9093059 9120422 9135627 9179600 9226550 9219906 9222553 9265664
8617 9265664 9328399 9334046 9331289 9322950 9326594 9319740 9301590 9287923 9289835 9296335 9301655 9306860 9305829
8604 9305829 9276341 9228637 9221242 9196120 9157611 9116908 9091093 9061147 9004975 8976251 8923625 8864461
8592 8864461 8805843 8763239 8704386 8639795 8583913 8527148 8485214 8419424 8342566 8247016 8167682
8581 8167682 8103543 8037662 7948133 7857300 7744937 7619997 7538469 7463656 7425627 7350038 7292834
$$ packed form
8662F234413Q5966P2184R1694R2541P0331Q1057Q8668J00002J08629N6214Q3603
8651G165302P5624Q9740J00630Q1258N2894Q0017O6677N3643R1328Q4849Q2465
8640H024427P2800Q8464O9287P3095R1018P2566P3171R6047N0926L1524N4800
8629H798125Q6866O5679M5590N2959M3840K7363J5205M3973M6950o644K647M3111
8617I265664O2735N647k757q339L644o854j8150j3667J912O500N320N205j031
8604I305829k9488m7704p395k5122l8509m0703k5815k9946n6172k8724n2626n9164
8592H864461n8618m2604n8853o4591n5882n6765m1934o5790p6858r5550p9334
8581H167682o4139o5881q9529r0833j12363j24940q1528p4813l8029p5589n7204
$$ plain form
8570 7292834 7278953 7271842 7267713 7211461 7108224 6988294 6861786 6737292 6601078 6488646 6393601
8559 6393601 6304362 6187785 6077028 5999014 5906401 5835482 5779431 5692438 5614290 5529824 5449329
8548 5449329 5362335 5265588 5178576 5130442 5079461 4986882 4887245 4839469 4817472 4753704 4651603
8537 4651603 4568923 4515240 4449799 4400750 4340294 4275134 4210744 4125708 4029576 3976885 3955177
8526 3955177 3927702 3882541 3831338 3776376 3691856 3625148 3577435 3566436 3527860 3473746 3440005
8515 3440005 3387970 3335417 3332205 3307409 3219061 3129449 3078180 3050761 3002550 2982181 2928718 2898952
8503 2898952 2884237 2833704 2786259 2721518 2668916 2641489 2628587 2607436 2564261 2524215 2503609
8492 2503609 2497214 2456212 2421462 2410107 2388381 2315766 2265020 2283976 2247034 2202370 2156343 2096407
$$ packed form
8570G292834j3881p111m129n6252j03237j19930j26508j24494j36214j12432r5045
8559F393601q9239j16577j10757p8014r2613p0919n6051q6993p8148q4466q0495
8548E449329q6994r6747q7012m8134n0981r2579r9637m7776k1997o3768j02101
8537D651603q2680n3683o5441m9049o0456o5160o4390q5036r6132n2691k1708
8526C955177k7475m5161n1203n4962q4520o6708m7713j0999l8576n4114l3741
8515C440005n2035n2553l212k4796q8348q9612n1269k7419m8211k0369n3463k9766
8503B898952j4715n0533m7445o4741n2602k7427j2902k1151m3175m0046k0606
8492B503609o395m1002l4750j1355k1726p2615n0746J8956l6942m4664m6027n9936
$$ plain form
8480 2096407 2065401 2044477 2037949 2027666 2004685 1976373 1950264 1910804 1916007 1914504 1915042 1887278
8468 1887278 1848366 1822098 1796828 1762326 1740416 1701657 1671007 1655604 1634050 1628107 1628236 1611074
8456 1611074 1606870 1601033 1557475 1535524 1512875 1481963 1464757 1426765 1388353 1362235 1358502 1369296
8444 1369296 1385690 1382998 1382772 1386825 1393744 1383663 1359859 1316263 1279979 1267996 1252124 1250426 1249725
8431 1249725 1231738 1212513 1191201 1181050 1163712 1174525 1193760 1171718 1149413 1134755 1120558
8420 1120558 1128398 1153387 1158530 1154890 1125402 1096486 1065332 1037079 1027183 1021772 1032078 1045014
8408 1045014 1034523 998757 999999 1009819 1005542 1030084 1039585 1015250 1016527 1011559 1009875 1004190 1021275
8395 1021275 976358 985901 1016898 1024354 1034457 1052710 1092181 1142116 1175935 1261710 1392202 1544035
$$ packed form
8480B096407l1006k0924o528j0283k2981k8312k6109l9460N203j503N38k7764
8468A887278l8912k6268k5270l4502k1910l8759l0650j5403k1554n943J29j7162
8456A611074m204n837m3558k1951k2649l0912j7206l7992l8412k6118l733J0794
8444A369296J6394k692k26M053O919j0081k3804m3596l6284j1983j5872j698p01
8431A249725j7987j9225k1312j0151j7338J0813J9235k2042k2305j4658j4197
8420A120558P840K4989N143l640k9488k8916l1154k8253r896n411J0306J2936
8408A045014j0491l5766J242R820m277K4542R501k4335J277m968j684n685J7085
8395A021275m4917R543L0997P456J0103J8253L9471M9935L3819Q5775J30492J51833
$$ plain form
8383 1544035 1743748 2019451 2444202 3022059 3686436 4312417 4662003 4613333 4148648 3499695
8373 3499695 2896309 2477995 2181029 1972243 1826687 1660142 1526805 1430732 1359245 1280195
8363 1280195 1201571 1189966 1192536 1167622 1121755 1090329 1081523 1100967 1109659 1077218 1039100 1037054
8351 1037054 1027171 1019569 1034407 1056257 1073778 1125153 1183961 1227456 1288952 1401136 1518155
8340 1518155 1666196 1910745 2276816 2782736 3549398 4649565 6102131 7588751 8548858
8331 8548858 8508972 7503373 6038418 4735722 3842854 3271113 2896012 2559043 2280079
8322 2280079 2044131 1883166 1733607 1588561 1492222 1393885 1322916 1313102 1254882 1182114 1144613
8311 1144613 1125570 1103661 1114083 1115144 1095578 1097897 1105927 1125832 1176218 1174414 1145637 1097104
$$ packed form
8383A544035J99713K75703M24751N77857O64377O25981L49586m8670m64685o48953
8373C499695o03386m18314k96966k08786j45556j66545j33337r6073p1487p9050
8363A280195p8624j1605K570k4914m5867l1426q806J9444Q692l2441l8118k046
8351A037054r883p602J4838K1850J7521N1375N8808M3495O1496J12184J17019
8340A518155J48041K44549L66071N05920P66662J100167J452566J486620R60107
8331H548858l9886j005599j464955j302696q92868n71741l75101l36969k78964
8322B280079k35948j60965j49559j45046r6339r8337p0969r814n8220p2768l7501
8311A144613j9043k1909J0422J061j9566K319Q030J9905N0386j804k8777m8533
$$ plain form
8299 1097104 1021417 1011138 1013343 1048816 1128637 1227456 1360034 1575634 1883705 2304877 2856388
8288 2856388 3480511 3963268 4088340 3799938 3268958 2646381 2151868 1815486 1593574 1404377
8278 1404377 1257197 1111945 1025629 967271 893007 809112 746434 694955 679058 664614 661961
8267 661961 648046 643465 683446 709846 741549 764098 746386 756254 734051 688186 656444 610667
8255 610667 571051 541505 491948 459019 448673 425866 412253 403892 378396 377943 379074 345239
8243 345239 338327 360960 340428 309645 316128 329711 311724 295161 326797 331019 304504 294697
8231 294697 293990 289950 289202 283724 282294 269625 273206 238054 208353 227062 264961 243835 253077
8218 253077 275619 268694 251175 245721 236712 232176 243192 244488 252518 259550 251999 256404 275458
$$ packed form
8299A097104p5687j0279K205L5473P9821R8819J32578K15600L08071M21172N51511
8288B856388O24123M82757J25072k88402n30980o22577m94513l36382k21912j89197
8278A404377j47180j45252q6316n8358p4264q3895o2678n1479j5897j4444k653
8267F61961j3915m581L9981K6400L1703K2549j7712R868k2203m5865l1742m5777
8255F10667l9616k9546m9557l2929j0346k2807j3613q361k5496m53J131l3835
8243C45239o912K2633k0532l0783O483J3583j7987j6563L1636M222k6515r807
8231B94697p07m040p48n478j430j2669L581l5152k9701J8709L7899k1126R242
8218B53077K2542o925j7519n454r009m536J1016J296Q030P032p551M405J9054
$$ plain form
8205 275458 265987 234342 222030 197773 211517 199122 196344 190190 172795 158121 181462 202529
8193 202529 205529 192031 189197 185783 177094 156115 165351 172856 208099 197289 183989 190958 199741
8180 199741 186222 138123 108224 113937 142300 134720 155307 157177 161986 179932 184722 175356 180574
8167 180574 141629 92519 108330 115193 110876 125783 163023 151224 130678 125257 132336 142452
8155 142452 147638 140863 127796 126348 131750 134175 119192 132440 107472 94348 102108 108219 92169
8142 92169 102042 113460 116816 130706 115739 110858 134278 142336 139327 133123 118366 136318 158959
8129 158959 100016 65383 85691 126857 112640 93282 115594 122314 87786 78067 84258 89538
8117 89538 105093 115678 148370 139393 125531 128635 117781 104840 88073 85476 87341 89951 132770
$$ packed form
8205B75458r471l1645j2312k4257J3744j2395k778o154j7395j4674K3341K1067
8193B02529L000j3498k834l414q689k0979R236P505L5243j0810j3300O969Q783
8180A99741j3519m8099k9899N713K8363p580K0587J870M809J7946M790r366N218
8167A80574l8945m9110J5811O863m317J4907L7240j1799k0546n421P079J0116
8155A42452N186o775j3067j448N402K425j4983J3248k4968j3124P760O111j6050
8142I2169R873J1418L356J3890j4967m881K3420Q058l009o204j4757J7952K2641
8129A58959n8943l4633K0308M1166j4217j9358K2312O720l4528r719O191N280
8117H9538J5555J0585L2692q977j3862L104j0854j2941j6767k597J865K610M2819
$$ plain form
8104 132770 156225 157350 119547 63471 59641 73109 69254 61957 55388 67839 89187 76035 57597
8091 57597 65146 77519 69543 56808 64534 38437 22939 31192 61041 82413 81116 71003 67330
8078 67330 76222 92855 103226 110591 99470 80658 84818 70081 52917 29370 39429 63014
8066 63014 70779 60420 35331 43823 43487 62549 66881 60608 66779 73627 56429 55986 53513 87471
8052 87471 94877 105703 113593 96571 97451 104666 105188 85168 74309 62337 43966 60447 83551
8039 83551 114093 112948 122435 120143 84147 84490 100962 107710 93950 98971 113735 138625 140943
8026 140943 125621 88961 60974 82766 74931 67647 57129 64058 75343 63830 49972 81081
8014 81081 75548 83757 95948 83080 51934 31724 24007 35355 7657 33050 70197 93061
$$ packed form
8104A32770K3455J125l7803n6076l830J3468l855p297o569J2451K1348j3152j8438
8091E7597P549J2373p976j2735P726k6097j5498Q253K9849K1372j297j0113l673
8078F7330Q892J6633J0371P365j1121j8812M160j4737j7164k3547J0059K3585
8066F3014P765j0359k5089Q492l36J9062M332o273O171O848j7198m43k473L3958
8052H7471P406J0826P890j7022Q80P215N22k0020j0859j1972j8371J6481K3104
8039H3551L0542j145R487k292l5996L43J6472O748j3760N021J4764K4890K318
8026A40943j5322l6660k7987K1792p835p284j0518O929J1285j1513j3858L1109
8014H1081n533Q209J2191j2868l1146k0210p717J1348k7698K5393L7147K2864
$$ plain form
8002 93061 104105 89801 76253 101054 97735 97880 113051 121226 121154 110503 85738 101261 106772
7989 106772 111019 107904 94291 76825 67947 68013 86482 87615 95653 112075 119125 100073 91285 79328
7975 79328 67217 102382 108044 96850 70091 57905 91478 100812 81750 53285 62679 79692
7963 79692 51505 22829 41274 60655 63489 57309 80959 96935 103137 88689 100621 105011 86972
7950 86972 94913 111280 119341 120745 119579 116574 120231 121182 132227 116109 67979 52137 80910
7937 80910 68784 36316 44214 57275 62619 53271 35579 60817 75781 70408 44286 32519 57645
7924 57645 97096 114427 86859 57229 75348 66526 54569 50761 35373 29125 16380 64922
7912 64922 75423 43975 54268 55535 52481 61063 52582 49447 75786 81174 76676 68192 46792
$$ packed form
8002I3061J1044j4304j3548K4801l319J45J5171Q175p2j0651k4765J5523N511
7989A06772M247l115j3613j7466q878O6J8469J133Q038J6422P050j9052q788j1957
7975G9328j2111L5165N662j1194k6759j2186L3573R334j9062k8465R394J7013
7963G9692k8187k8676J8445J9381K834o180K3650J5976O202j4448J1932M390j8039
7950H6972P941J6367Q061J404j166l005L657R51J1045j6118m8130j5842K8773
7937H0910j2126l2468P898J3061N344r348j7692K5238J4964n373k6122j1767K5126
7924E7645L9451J7331k7568k9630J8119q822j1957l808j5388o248j2745M8542
7912F4922J0501l1448J0293J267l054Q582q481l135K6339N388m498q484k1400
$$ plain form
7899 46792 55516 40779 27522 37912 46578 71407 64631 43090 37606 47727 35795 56946 78607
7886 78607 54689 42079 38062 32840 23981 46713 32645 38064 43546 36505 56148 67756 75546
7873 75546 56033 20939 3876 17697 40831 41482 13477 -848 20874 25267 10715 13382 19620
7860 19620 36753 28084 10767 23769 41754 25281 11469 16312 15642 2856 4207 -5550 -12397
7847 -12397 -25669 -10201 -19544 13945 33309 8288 11535 -361 -16722 -7214 -784 3989 -1025
7834 -1025 -30065 -62075 -50381 -39229 -19058 -51010 -59307 -38765 -22256 -21469 -25870 -23443 -24263
7821 -24263 -9976 9162 42590 472 -43309 -15269 -10417 -22069 -54119 -63231 -41278 -1022
7809 -1022 10923 12413 24312 21131 -14525 -40906 -28737 -35288 -30896 -32499 -32380 -41062 -36759 5114
$$ packed form
7899D6792Q724j4737j3257J0390Q666K4829o776k1541n484J0121j1932K1151K1661
7886G8607k3918j2610m017n222q859K2732j4068N419N482p041J9643J1608P790
7873G5546j9513l5094j7063J3821K3134O51k8005j4325K1722M393j4552K667O238
7860A9620J7133q669j7317J3002J7985j6473j3812M843o70j2786J351r757o847
7847a2397j3272J5468r343L3489J9364k5021L247j1896j6361R508O430M773n014
7834a025k9040l2010J1694J1152K0171l1952q297K0542J6509P87m401K427q20
7821b4263J4287J9138L3428m2118m3781K8040M852j1652l2050r112K1953M0256
7809a022J1945J490J1899l181l5656k6381J2169o551M392j603J19q682M303M1873
$$ plain form
7795 5114 19901 28289 16811 -3939 -1229 5870 151 -4599 -26965 -56928 -82371 -50103 -34910
7782 -34910 -7528 -9209 -32042 -43419 -65531 -52671 -42895 -78435 -79675 -51269 -58325 -63394 -61485
7769 -61485 -38154 -56263 -35492 -16964 -12995 -4419 -3911 -11362 -24263 -33499 -31987 -21627 -16505
7756 -16505 -222 14101 5769 -12742 -13851 -21406 -27029 -44722 -28809 9804 22381 1558 -17925
7743 -17925 -31175 -20724 -18403 6812 17612 -9310 -11028 -10873 -20389 -17166 -17365 -6103 2400 -11271
7729 -11271 -50709 -69592 -46684 -44752 -37426 -29904 1326 13714 -2321 -16847 -16598 -2419 -16424
7716 -16424 -17074 -918 18995 7798 -8142 -28900 -14365 11769 11563 16688 960 -17892 -14853
7703 -14853 -3226 -6951 -13659 12742 3971 -10650 -16501 -14037 -23074 -4009 13056 -3396 -7242
$$ packed form
7795E114J4787Q388j1478k0750K710P099n719m750k2366k9963k5443L2268J5193
7782c4910K7382j681k2833j1377k2112J2860R776l5540j240K8406p056n069J909
7769f1485K3331j8109K0771J8528L969Q576N08p451j2901r236J512J0360N122
7756a6505J6283J4323q332j8511j109p555n623j7693J5913L8613J2577k0823j9483
7743a7925j3250J0451K321K5215J0800k6922j718J55r516L223j99J1262Q503j3671
7729a1271l9438j8883K2908J932P326P522L1230J2388j6035j4526K49J4179j4005
7716a6424o50J6156J9913j1197j5940k0758J4535K6134k06N125j5728j8852L039
7703a4853J1627l725o708K6401q771j4621n851K464r037J9065J7065j6452l846
$$ plain form
7690 -7242 -23555 -42601 -52487 -35673 -40553 -6322 -1774 -36785 -52197 -62949 -67023 -64347 -79693
7677 -79693 -85936 -68272 -69190 -67909 -71292 -66057 -79299 -93030 -67858 -65131 -61566 -61349 -60135 -25775
7663 -25775 -26062 -13845 -3706 -22204 -43994 -38121 -19636 -38629 -14921 10436 10777 -25439 -22658
7650 -22658 -8545 -27368 -11277 -7640 -19032 -27881 -18342 -26880 -22064 -13585 -1517 5711 10736
7637 10736 -13142 -32404 -34265 -57728 -77199 -49653 -62864 -73186 -70542 -52717 -30593 -13758
7625 -13758 -18439 -26314 -13765 9514 22447 2224 -36669 -13323 -9283 -11664 -32905 -41960 -49131
7612 -49131 -46166 -49460 -25866 -4801 -23595 -26718 -46237 -65522 -73745 -68756 -55425 -51460 -81289
7599 -81289 -85760 -81700 -64048 -57400 -39140 -7612 1577 -26086 -56143 -53676 -42706 -37128 -29025
$$ packed form
7690g242j6313j9046r886J6814m880L4231M548l5011j5412j0752m074K676j5346
7677g9693o243J7664r18J281l383N235j3242j3731K5172K727L565K17J214L4360
7663b5775k87J2217J0139j8498k1790N873J8485j8993K3708K5357L41l6216K781
7650b2658J4113j8823J6091L637j1392q849R539q538M816Q479J2068P228N025
7637A0736k3878j9262j861k3463j9471K7546j3211j0322K644J7825K2124J6835
7625a3758m681p875J2549K3279J2933k0223l8893K3346M040k381k1241r055p171
7612d9131K965l294K3594K1065j8794l123j9519j9285q223M989J3331L965k9829
7599h1289m471M060J7652O648J8260L1528R189k7663l0057K467J0970N578Q103
$$ plain form
7586 -29025 -32425 -70098 -73470 -63279 -70726 -64595 -53490 -39227 -35401 -43981 -51019 -43518 -46037 -44276
7572 -44276 -56366 -49572 -26669 -4456 -18695 -28755 -69239 -101629 -75383 -53834 -73142 -86263
7560 -86263 -76198 -58228 -48400 -36754 -47246 -69791 -51732 -33320 -30475 5302 19363 21392
7548 21392 2989 -7930 18576 13031 18825 18390 11974 8523 15213 25763 47854 45798 11073
7535 11073 13368 22907 11796 -9574 -22118 -15458 -24171 -25611 -5816 -13532 -15373 4230 22326
7522 22326 18536 -9267 -43934 -57466 -51002 -34137 -36293 -52951 -51365 -50600 -55090 -53683 -49421 -51827
7508 -51827 -19942 -23231 -50485 -39441 -26309 -31427 -49566 -36021 -8908 -21972 -40896 -50504
7496 -50504 -49938 -55379 -39569 -25003 -55106 -74949 -53999 -74451 -68798 -54833 -57111 -59607 -58266
$$ packed form
7586b9025l400l7673l372J0191p447O131J1105J4263L826q580p038P501k519J761
7572d4276j2090O794K2903K2213j4239j0060m0484l2390K6246K1549j9308j3121
7560h6263J0065J7970R828J1646j0492k2545J8059J8412K845L5777J4061K029
7548B1392j8403j0919K6506n545N794m35o416l451O690J0550K2091k056l4725
7535A1073K295R539j1111k1370j2544O660q713j440J9795p716j841J9603J8096
7522B2326l790k7803l4667j3532O464J6865k156j6658J586P65m490J407M262k406
7508e1827L1885l289k7254J1044J3132n118j8139J3545K7113j3064j8924r608
7496e0504N66n441J5810J4566l0103j9843K0950k0452N653J3965k278k496J341
$$ plain form
7483 -58266 -68984 -77126 -71308 -81861 -99526 -86344 -88324 -74425 -36927 -16931 -18473 -63851 -70742
7470 -70742 -45175 -28204 -36801 -46235 -44107 -21948 -17090 -33731 -20314 -24529 -42115 -60898 -77512
7457 -77512 -73659 -77048 -56933 -27392 -4742 -2695 -27362 -63557 -69301 -43454 6890 -13690 -14243
7444 -14243 -15481 -33272 -38164 -21310 -36509 -35002 -33641 -41195 -9910 -2312 -6118 -14231 -25198
7431 -25198 -31467 -16582 -28144 -32373 -34242 -30370 -69554 -67370 -67965 -58911 -27203 -4212 8399
7418 8399 -8074 6919 17245 -5154 -5654 -27793 -45484 -21701 -1992 13689 -4652 -34634
7406 -34634 -47958 -51586 -38399 -21442 -31342 -31685 -38871 -63827 -39052 -44008 -46619 -44265 -49001 -51545
7392 -51545 -45620 -51147 -55743 -45108 -25805 -10277 -10096 -5410 -31261 -58899 -32285 -7153 3163
$$ packed form
7483e8266j0718q142N818j0553j7665J3182j980J3899L7498J9996j542m5378o891
7470g0742K5567J6971q597r434K128K2159M858j6641J3417m215j7586j8783j6614
7457g7512L853l389K0115K9541K2650K047k4667l6195n744K5847N0344k0580n53
7444a4243j238j7791m892J6854j5199J507J361p554L1285P598l806q113j0967
7431b5198o269J4885j1562m229j869L872l9184K184n95R054L1708K2991J2611
7418H399j6473J4993J0326k2399n00k2139j7691K3783J9709J5681j8341k9982
7406c4634j3324l628J3187J6957r900l43p186k4956K4775m956k611K354m736k544
7392e1545N925n527m596J0635J9303J5528J81M686k5851k7638K6614K5132J0316
$$ plain form
7379 3163 -5848 -26776 -30531 -14834 -28830 -41958 -16954 4736 -7757 -37479 -28146 -14392 -38464
7366 -38464 -47082 -41431 -36557 -48447 -21756 -18720 -30263 -42147 -40915 -28111 -39632 -41517 -34581
7353 -34581 -45274 -44457 -51316 -61625 -44586 -9157 -19572 -38089 -48894 -31026 -29092 -28367 -47178
7340 -47178 -40710 -48453 -74736 -71734 -43383 -24091 -28603 -30730 -41804 -47662 -60293 -63859 -62254
7327 -62254 -26868 -27306 -29893 -43363 -56402 -62624 -49277 -45294 -30592 -34604 -31893 -29552 -38398 -35972
7313 -35972 -28975 -20581 -3522 1471 -624 1278 -357 -14050 -7450 -18800 -41223 -54992 -49686
7300 -49686 -39516 -7821 17599 4589 11377 13000 -3352 -31089 -29163 -20970 -24909 -35665 -27125
7287 -27125 -20071 -20442 -37677 -24589 -30979 -68778 -60276 -52439 -23492 -18181 -14729 -5765 -10058 -4216
$$ packed form
7379C163r011k0928l755J5697j3996j3128K5004K1690j2493k9722R333J3754k4072
7366c8464q618N651M874j1890K6691L036j1543j1884J232J2804j1521j885O936
7353c4581j0693Q17o859j0309J7039L5429j0415j8517j0805J7868J934P25j8811
7340d7178O468p743k6283L002K8351J9292m512k127j1074n858j2631l566J605
7327f2254L5386m38k587j3470j3039o222J3347L983J4702m012K711K341q846K426
7313c5972O997Q394J7059M993k095J902j635j3693O600j1350k2423j3769N306
7300d9686J0170L1695K5420j3010O788J623j6352k7737J926Q193l939j0756Q540
7287b7125P054l71j7235J3088o390l7799Q502P837K8947N311L452Q964m293N842
$$ plain form
7273 -4216 -14689 -19047 -15159 -36347 -49979 -30744 -27632 -35033 -41336 -64535 -57710 -57431 -85219 -92620
7259 -92620 -68131 -63705 -58971 -29497 -16494 -15260 -8066 -33574 -61635 -68349 -52577 -60958 -57710
7246 -57710 -45123 -29128 -42648 -43876 -29684 -11073 -4378 -13835 -19613 -26848 -21196 -36494 -54653
7233 -54653 -54771 -45872 -46280 -44623 -28085 -14887 -17261 -22199 -26509 -18253 -19018 -19979 -15908 8179 18395
7218 18395 -3251 6335 22338 -9525 -40395 -29012 -18498 -23502 -36158 -46212 -54339 -70521
7206 -70521 -43546 -38107 -24324 -26910 -58047 -66489 -32559 -44022 -70213 -82861 -84282 -84242 -76942
7193 -76942 -80321 -81592 -71449 -66358 -29299 -17352 -14599 -29638 -42952 -26708 -39820 -59100 -81256
7180 -81256 -99044 -80313 -66976 -45548 -41009 -36669 -43003 -42977 -46561 -44794 -22690 -21498 -15095 -33534
$$ packed form
7273d216j0473m358L888k1188j3632J9235L112p401o303k3199O825K79k7788p401
7259i2620K4489M426M734K9474J3003J234P194k5508k8061o714J5772q381L248
7246e7710J2587J5995j3520j228J4192J8611O695r457n778p235N652j5298j8159
7233e4653j18Q899m08J657J6538J3198k374m938m310Q256p65r61M071K4087J0216
7218A8395k1646R586J6003l1863l0870J1383J0514n004j2656j0054q127j6182
7206g0521K6975N439J3783k586l1137q442L3930j1463k6191j2648j421M0P300
7193g6942l379j271J0143N091L7059J1947K753j5039j3314J6244j3112j9280k2156
7180h1256j7788J8731J3337K1428M539M340o334K6l584J767K2104J192O403j8439
$$ plain form
7166 -33534 -40198 -37008 -27367 -23710 -23030 -21239 -12026 -20883 -12656 -23343 -45138 -75291 -76715 -63683
7152 -63683 -65385 -55330 -32920 -41804 -27800 -7396 7880 2472 -16411 -48992 -61829 -48877
7140 -48877 -55266 -59791 -59800 -57946 -52192 -67475 -41020 11684 4454 -28303 -29687 -43446 -4126 23612
7126 23612 4020 -23445 -8839 16357 2586 7041 8277 9748 19003 28548 7124 -27466 -15694
7113 -15694 17197 38143 34028 42983 40563 23597 25780 29220 -7996 -27410 -10526 583 13323
7100 13323 17103 11711 18240 4827 15119 14716 3206 11319 29907 25183 9681 11374 1801 -3842
7086 -3842 3348 -4177 -22424 -32813 -22224 -40177 -50756 -43410 -47066 -40791 -38471 -29734 -34357 -55169
7072 -55169 -44159 -46722 -31960 -40372 -31080 -11964 -22254 -29553 -30693 -37467 -15208 -25841 -34588
$$ packed form
7166c3534o664L190R641L657O80J791R213q857Q227j0687k1795l0153j424J3032
7152f3683j702J0055K2410q884J4004K0404J5276n408j8883l2581j2837J2952
7140d8877o389m525rJ854N754j5283K6455N2704p230l2757j384j3759L9320K7738
7126B3612j9592k7465J4606K5196j3771M455J236J471R255R545k1424l4590J1772
7113a5694L2891K0946m115Q955k420j6966K183L440l7216j9414J6884J1109J2740
7100A3323L780n392O529j3413J0292m03j1510Q113J8588m724j5502J693r573n643
7086c842P190p525j8247j0389J0589j7953j0579P346l656O275K320Q737m623k0812
7072e5169J1010k563J4762q412R292J9116j0290p299j140o774K2259j0633q747
$$ plain form
7059 -34588 -57406 -64286 -39492 -29317 -50623 -60887 -57248 -51620 -40813 -64900 -71942 -58680 -37071
7046 -37071 -29983 -46138 -56427 -45613 -36185 -40250 -54852 -64613 -68780 -64863 -75738 -55505 -50805
7033 -50805 -38436 -29942 -42171 -51690 -38657 2182 10023 7957 2328 -5899 17943 -107 1234
7020 1234 -31973 -51531 -54819 -62040 -43696 -15797 -20049 -8062 1597 -4501 -3353 -13498 304
7007 304 -18675 -12666 -27949 -24695 -8804 -28964 -34127 -15326 -17033 -10983 16704 -2558 -17709
6994 -17709 -41939 -27878 -26827 -30101 -35481 -19344 -27133 -34287 -43154 -30888 -30462 -35463 -32353 -39178
6980 -39178 -22810 2225 7604 8329 19647 53480 46584 31220 27474 25078 12484 -1045 -17035
6967 -17035 -17700 -20942 7324 22189 19230 19687 -14759 -9906 -21423 -11045 -19014 -13173 8962 -4869
$$ packed form
7059c4588k2818o880K4794J0175k1306j0264L639N628J0807k4087p042J3262K1609
7046c7071P088j6155j0289J0814R428m065j4602r761m167L917j0875K0233M700
7033e0805J2369Q494j2229r519J3033M0839P841k066n629q227K3842j8050J341
7020A234l3207j9558l288p221J8344K7899m252J1987R659o098J148j0145J3802
7007C04j8979O009j5283L254J5891k0160n163J8801j707O050K7687j9262j5151
6994a7709k4230J4061J051l274n380J6137p789p154q867J2266M26n001L110o825
6980c9178J6368K5035N379P25J1318L3833o896j5364l746k396j2594j3529j5990
6967a7035o65l242K8266J4865k959M57l4446M853j1517J0378p969N841K2135j3831
$$ plain form
6953 -4869 -19953 -31095 -14055 -8626 -6174 -3427 -12476 -25677 -37460 -29479 -57176 -46824 -32273
6940 -32273 -22638 -11635 -13626 -24295 -17521 1834 -2603 281 -3462 -13568 -17458 -12393 -4472 -14489
6926 -14489 -14121 -6538 9903 -11569 -43882 -92461 -81827 -68842 -54306 -43586 -56711 -43171
6914 -43171 -26260 -20956 -25874 -44185 -40209 -27161 3851 11312 11951 -27738 -24666 -6167 -12186
6901 -12186 -26189 -25808 -61108 -46578 -50879 -59839 -84824 -89075 -52328 -30399 -21726 -7624 -24010
6888 -24010 -68111 -78962 -53985 -10660 -25894 -46896 -57738 -64004 -55382 -33412 -61323 -92139
6876 -92139 -62477 -40515 -52268 -34486 -25499 -2764 -26313 -55765 -33166 -26619 -33811 -53261
6864 -53261 -39688 -33217 -53071 -59792 -98933 -121321 -123241 -99634 -82544 -77945 -49757 -31884 -41561
$$ packed form
6953d869j5084j1142J7040N429K452K747r049j3201j1783P981k7697J0352J4551
6940c2273R635J1003j991j0669O774J9355m437K884l743j0106l890N065P921j0017
6926a4489L68P583J6441k1472l2313m8579J0634J2985J4536J0720j3125J3540
6914d3171J6911N304m918j8311L976J3048L1012P461O39l9689L072J8499o019
6901a2186j4003L81l5300J4530m301q960k4985m251L6747K1929Q673J4102j6386
6888b4010m4101j0851K4977M3325j5234k1002j0842o266Q622K1970k7911l0816
6876i2139K9662K1962j1753J7782Q987K2735k3549k9452K2599O547p192j9450
6864e3261J3573O471j9854o721l9141k2388j920K3607J7090M599K8188J7873r677
$$ plain form
6851 -41561 -43510 5899 26877 11276 98 -13641 -11633 1327 -10391 -678 29099 6542
6839 6542 -33288 -37517 -31691 -30576 -26992 -2530 -3734 -39634 -57850 -40334 -3602 15484 23149
6826 23149 10614 -27387 -62404 -63209 -45273 -48854 -47530 -47247 -70870 -28931 -20338 -39708 -47925
6813 -47925 -22554 -24798 -42533 -72234 -57810 -26926 -10745 -28905 -18208 -14534 -7752 -21947
6801 -21947 -29229 -28844 -41236 -56084 -81766 -91560 -104511 -78051 -58749 -62830 -35302 -36345 -33214
6788 -33214 -10423 -4608 -21808 -38632 -12535 4210 3564 -3827 -14399 -11725 -21926 -40482 -36605
6775 -36605 -29719 -15103 27643 28009 -2520 -6766 -18082 -3086 -9589 2494 7551 971 -12179
6762 -12179 -8317 -6930 -9767 304 14000 -18822 -21918 -18208 -24569 -38535 -34669 -42076 -36002 -19481
$$ packed form
6851d1561j949M9409K0978j5601j1178j3739K008J2960j1718R713K9777k2557
6839F542l9830m229N826J115L584K4462j204l5900j8216J7516L6732J9086P665
6826B3149j2535l8001l5017q05J7936l581J324K83k3623M1939Q593j9370q217
6813d7925K5371k244j7735k9701J4424L0884J6181j8160J0697L674O782j4195
6801b1947p282L85j2392j4848k5682r794j2951K6460J9302m081K7528j043L131
6788c3214K2791N815j7200j6824K6097J6745o46p391j0572K674j0201j8556L877
6775c6605O886J4616M2746L66l0529m246j1316J4996o503J2083N057o580j3150
6762a2179L862J387k837J0071J3696l2822l096L710o361j3966L866p407O074J6521
$$ plain form
6748 -19481 -33064 -31808 -23889 -31920 -34156 -21028 -20166 -10414 -7526 -28414 -27594 -30130 -30390 5354
6734 5354 24279 12745 3033 31392 40714 32027 16836 -2856 4469 12708 41473 57489 62548
6721 62548 55713 50691 52654 56279 58550 58703 75007 70115 79173 106987 124855 153357 152741 141540
6707 141540 120796 105636 67172 25814 26580 5121 -5149 -4814 3505 9530 28897 20994 6395
6694 6395 -2757 -11619 -14272 -13901 -32792 -27347 -30243 -45141 -58722 -51786 -58223 -35888 -19770 -46482
6680 -46482 -64804 -45452 -39447 -45140 -56433 -58771 -47687 -21016 -4182 8161 -16533 -23267 -21947
6667 -21947 -81960 -107395 -96723 -74461 -41273 -60497 -82303 -77692 -28593 -26474 -49918 -50654 -54075
6654 -54075 -49802 -40989 -26225 -799 -3199 -9109 -6712 -18212 -25109 -25633 -11331 8522 -14845
$$ packed form
6748a9481j3583J256P919q031k236J3128Q62R752K888k0888Q20k536k60L5744
6734E354J8925j1534r712K8359R322q687j5191j9692P325Q239K8765J6016N059
6721F2548o835n022J963L625K271J53J6304m892R058K7814J7868K8502o16j1201
6707A41540k0744j5160l8464m1358P66k1459j0270L35Q319O025J9367p903j4599
6694F395r152q862k653L71j8891N445k896j4898j3581O936o437K2335J6118k6712
6680d6482j8322J9352O005n693j1293k338J1084K6671J6834J2343k4694o734J320
6667b1947o0013k5435J0672K2262L3188j9224k1806M611M9099K119k3444p36l421
6654e4075M273Q813J4764K5426k400n910K397j1500o897n24J4302J9853k3367
$$ plain form
6641 -14845 -22372 -11068 -19318 -27835 -25353 8410 21569 24303 -614 -13097 -10803 -5211 -16111
6628 -16111 -13992 -11440 -19327 -37775 -48701 -51291 -35634 -43444 -35550 -53984 -64037 -38245 -40909
6615 -40909 -44241 -23884 -30026 -40467 -64543 -78066 -50968 -16942 -18686 -21315 -35315 -57465 -85201
6602 -85201 -77054 -50531 -48604 -31917 -31664 -47906 -62271 -76367 -64384 -28578 -39038 -27329 -13614
6589 -13614 -22375 -32330 -8487 8130 -4428 -25784 -39495 -49647 -38552 -23375 -15404 -35834
6577 -35834 -62289 -35505 -11888 -15154 -25364 2184 -5088 -20314 -25615 -30481 -10691 -10158 -21483
6564 -21483 -33362 2274 -12594 -30766 -3099 11822 17379 -24292 -60313 -66853 -66855 -46450 -23469
6551 -23469 -24180 -21933 -8415 -39733 -51416 -49784 -46588 -26837 -20886 -20276 -38728 -29573 -15754 -7353
$$ packed form
6641a4845p527J1304q250q517K482L3763J3159K734k4917j2483K294N592j0900
6628a6111K119K552p887j8448j0926k590J5657p810P894j8434j0053K5792k664
6615d0909l332K0357o142j0441k4076j3523K7098L4026j744k629j4000k2150k7736
6602h5201Q147K6523J927J6687K53j6242j4365j4096J1983L5806j0460J1709J3715
6589a3614q761r955K3843J6617j2558k1356j3711j0152J1095J5177P971k0430
6577c5834k6455K6784K3617l266j0210K7548p272j5226n301m866J9790N33j1325
6564b1483j1879L5636j4868j8172K7667J4921N557m1671l6021o540kK0405K2981
6551b3469p11K247J3518l1318j1683J632L196J9751N951O10j8452R155J3819Q401
$$ plain form
6537 -7353 -2496 -4608 -5597 -21815 -19651 -10387 -15824 -9642 -9247 23053 244 -19830 -11456 -6205
6523 -6205 8406 18663 16576 2870 -10262 -13086 -2449 24404 22720 6660 4143 -3318 -4541
6510 -4541 11310 18851 5542 -7058 -18101 -37227 -37035 -29337 -19381 3351 -19185 -33776 6955
6497 6955 29382 27856 14882 -644 -8013 -18274 -32613 -19757 -18458 -22327 -21996 -20163 5096
6484 5096 21900 -7174 -36050 -33739 -43509 -52428 -58636 -54548 -68547 -54399 -42234 -27515 -31003
6471 -31003 -35035 -7665 10694 -11501 -17369 -27816 -44438 -49269 -36556 -29390 4381 18238 19219
6458 19219 34410 45429 22679 -9387 -17955 -26571 -53587 -53331 -30793 -31396 -47938 -60795 -64248
6445 -64248 -36206 -28823 -19026 -28725 -21072 -30711 -49021 -50559 -40203 -47572 -57500 -67550 -33975
$$ packed form
6537g353M857k112r89j6218K164R264n437O182L95L2300k2809k0074Q374N251
6523f205J4611J0257k087j3706j3132k824J0637K6853j684j6060k517p461j223
6510d541J5851P541j3309j2600j1043j9126J92P698R956K2732k2536j4591M0731
6497F955K2427j526j2974j5526p369j0261j4339J2856J299l869L31J833K5259
6484E096J6804k9074k8876K311r770q919o208M088j3999J4148J2165J4719l488
6471c1003m032K7370J8359k2195n868j0447j6622m831J2713P166L3771J3857R81
6458A9219J5191J1019k2750l2066q568q616k7016K56K2538o03j6542j2857l453
6445f4248K8042P383R797r699P653r639j8310j538J0356p369r928j0050L3575
$$ plain form
6432 -33975 -21488 -28984 -39630 -30005 -31501 -62325 -94823 -101234 -68346 -18655 -7745 -21813 -31742
6419 -31742 -28628 -14623 -21857 -22644 -39442 -30868 -14567 4078 10981 14488 11538 -23289 -62615
6406 -62615 -59461 -35056 -23643 -19906 -45891 -38016 -13683 -10926 -5166 -19577 -22534 -38249 -30714
6393 -30714 -51339 -43124 -4579 2570 -3055 16526 11455 -17035 -38529 -29989 -46480 -49320 -25979
6380 -25979 -7689 -30234 -17578 -8063 -4634 -9115 -25368 -11714 9322 -664 -19189 -38253 -38166
6367 -38166 -32718 -18397 1684 -10164 -18714 -38767 -87867 -86818 -73144 -26112 -19458 -25886 -31122
6354 -31122 -42440 -45893 -32251 -40293 -13540 -9556 -22116 -11678 12062 -4484 -20209 -15994 -52438
6341 -52438 -48165 -39389 -41637 -40901 -22856 1992 810 -21398 -31226 -21591 -39529 -34888 -18875 1537
$$ packed form
6432c3975J2487p496j0646R625j496l0824l2498o411L2888M9691J0910j4068r929
6419c1742L114J4005p234p87j6798Q574J6301J8645O903L507k950l4827l9326
6406f2615L154K4405J1413L737k5985P875K4333K757N760j4411k957j5715P535
6393c0714k0625Q215L8545P149n625J9581n071k8490k1494Q540j6491k840K3341
6380b5979J8290k2545J2656R515L429m481j6253J3654K1036r986j8525j9064Q7
6367c8166N448J4321K0081j1848q550k0053m9100J049J3674M7032O654o428n236
6354c1122j1318l453J3642q042K6753L984j2560J0438K3740j6546j5725M215l6444
6341e2438M273Q776k248P36J8045K4848j182k2208r828R635j7938M641J6013K0412
$$ plain form
6327 1537 4905 -20300 -33678 -13701 19565 16494 -4331 -21158 -45282 -30351 -11012 -10304 -10324
6314 -10324 -42701 -34165 -43162 -32245 -14565 -9880 -31514 -39153 -9037 15042 -3540 -30760 -59338
6301 -59338 -70430 -50472 -48119 -57728 -59099 -39977 -28152 -50648 -47016 -22183 -3061 -6771 -26524
6288 -26524 -29894 -38701 -30010 -19695 -12104 -7556 6324 -4276 -6013 15610 26738 26065 -13964
6275 -13964 -19974 -34296 -49626 -4928 15747 32095 35181 23895 11431 -18803 -7439 -11428
6263 -11428 -11759 -14297 -11937 -37963 -58086 -66312 -72884 -65292 -61135 -33242 -41573 -34830 -40104 -54037
6249 -54037 -44695 -55596 -44031 -36255 -27070 -33950 -13035 -5723 1143 -4119 17180 3931 -22239
6236 -22239 -19554 -11095 -14408 -17854 -15270 1093 -1815 9253 -11513 -21683 -8488 -105 4795
$$ packed form
6327A537L368k5205j3378J9977L3266l071k0825j6827k4124J4931J9339P08k0
6314a0324l2377Q536q997J0917J7680M685k1634p639L0116K4079j8582k7220k8578
6301e9338j1092J9958K353r609j371J9122J1825k2496L632K4833J9122l710j9753
6288b6524l370q807Q691J0315P591M548J3880j0600j737K1623J1128o73m0029
6275a3964o010j4322j5330M4698K0675J6348L086j1286j2464l0234J1364l989
6263a1428l31k538K360k6026k0123q226o572P592M157K7893q331O743n274j3933
6249e4037R342j0901J1565P776R185o880K0915P312O866n262K1299j3249k6170
6236b2239K685Q459l313l446K584J6363k908J1068k0766j0170J3195Q383M900
$$ plain form
6223 4795 -28828 -52398 -66961 -58387 -17420 29364 31662 14306 5681 -5228 13308 5049 -8682
6210 -8682 -11347 10996 9725 17920 -957 -30943 -62206 -61266 -27686 -12407 19473 4527 -22361
6197 -22361 -31002 -16268 -28512 -36845 -48967 -40797 -63990 -71457 -54979 -34774 -17702 -34434 -46921
6184 -46921 -22978 -16663 -12909 -20151 -25353 -8819 -20605 -30519 -20868 3255 -638 -22777 -32364
6171 -32364 -40068 -35703 -34631 -29509 -10411 3495 18160 15912 -10151 -16853 -6001 5264 -6097
6158 -6097 -29526 -29417 -18305 -39779 -24714 3254 9507 -3736 -10826 -34496 -39587 -23700 -11777
6145 -11777 -10282 -22523 -50615 -74974 -66820 -39649 -12425 -254 2507 -18036 -3276 -15408
6133 -15408 -28105 -32588 -23056 22580 20474 8553 -14066 -30209 -22876 -3389 -9137 -23508 -31572
$$ packed form
6223D795l3623k3570j4563Q574M0967M6784K298j7356q625j0909J8536q259j3731
6210h682k665K2343j271Q195j8877k9986l1263R40L3580J5279L1880j4946k6888
6197b2361q641J4734j2244q333j2122Q170k3193p467J6478K0205J7072j6732j2487
6184d6921K3943O315L754p242n202J6534j1786r914R651K4123l893k2139r587
6171c2364p704M365J072N122J9098J3906J4665k248k6063o702J0852J1265j1361
6158f097k3429J09J1112k1474J5065K7968O253j3243p090k3670n091J5887J1923
6145a1777J495j2241k8092k4359Q154K7171K7224J2171K761k0543J4760j2132
6133a5408j2697m483R532M5636k106j1921k2619j6143P333J9487n748j4371q064
$$ plain form
6120 -31572 -17045 -14198 2880 6115 8666 -12765 -2013 -25218 -37052 -21336 -21740 -31412 -32074
6107 -32074 -16376 -2383 990 14870 7835 -2047 -87 -20080 -19311 -10911 -13448 6737 20512
6094 20512 -1190 -7482 -5105 14167 28024 4985 -21431 -16793 -2101 5487 -9843 -19604 -4649
6081 -4649 -10275 -22944 -41929 -17250 -5027 -21451 -23693 -20102 -25955 -12991 -14269 -31128 -43865
6068 -43865 -23029 -28858 -19834 -19233 -22726 -20796 -9055 -16324 -7726 10463 16041 25681 7964 -28817
6054 -28817 -15762 -27923 -31426 -16187 -11642 300 -18522 -39336 -10184 -6159 -17111 -24178 -24964
6041 -24964 -21188 -10742 9944 15126 7641 -22721 -26268 -25010 -19155 -13636 -11920 -16708 -20958 -32495
6027 -32495 -47715 -36060 -53772 -93443 -64498 -9045 11830 7016 21569 42713 74972 80541
$$ packed form
6120c1572J4527K847J7078L235K551k1431J0752k3205j1834J5716m04r672o62
6107c2074J5698J3993L373J3880p035r882J960j9993P69Q400k537K0185J3775
6094B0512k1702o292K377J9272J3857k3039k6416M638J4692P588j5330r761J4955
6081d649n626j2669j8985K4679J2223j6424k242L591n853J2964j278j6859j2737
6068d3865K0836n829R024O01l493J930J1741p269Q598J8189N578R640j7717l6781
6054b8817J3055j2161l503J5239M545J1942j8822k0814K9152M025j0952p067p86
6041b4964L776J0446K0686N182p485l0362l547J258N855N519J716m788m250j1537
6027c2495j5220J1655j7712l9671K8945N5453K0875m814J4553K1144L2259N569
$$ plain form
6015 80541 66951 67127 71814 44680 40495 62271 46751 16292 9812 13551 13502 1795 -7462 -4567
6001 -4567 -20762 -33952 -45156 -47468 -19753 -21793 -29160 -16925 -40351 -10297 -17463 -6878 16114
5988 16114 37553 37525 11180 15863 22152 2899 -9235 2765 -11470 155 15222 -4296 -22093
5975 -22093 -26181 -20756 -1057 5879 4905 8487 4143 -15848 14034 36855 51621 37372 12648
5962 12648 -27356 -34637 -48027 -20883 196 24934 11758 -44214 -56198 -42371 -32433 -26896
5950 -26896 -17958 3763 21145 -12542 -26751 -41754 -45058 -35786 -29283 -31054 -23832 -9385 -24573
5937 -24573 -17584 -17601 -14263 -10611 -8447 -4245 -15765 -18172 -22496 -19422 -20713 -16482 -11359 -15695 -2134
5922 -2134 -7011 -12725 -13574 -23108 -28547 -20485 -33894 -37570 -34451 -17458 -16557 -16830 -6114 -10848 -4485
$$ packed form
6015H0541j3590J76M687k7134m185K1776j5520l0459o480L739m9j1707r257K895
6001d567j6195j3190j1204k312K7715k040p367J2235k3426L0054p166J0585K2992
5988A6114K1439k8k6345M683O289j9253j2134J2000j4235J1625J5067j9518j7797
5975b2093m088N425J9699O936r74L582m344j9991K9882K2821J4766j4249k4724
5962A2648m0004p281j3390K7144K1079K4738j3176n5972j1984J3827R938N537
5950b6896Q938K1721J7382l3687j4209j5003l304R272O503j771P222J4447j5188
5937b4573O989j7L338L652K164M202j1520k407m324L074j291M231N123m336J3561
5922b134m877n714q49r534n439Q062j3409l676L119J6993R01k73J0716m734O363
$$ plain form
5907 -4485 -12594 -54220 -43829 -29170 -17552 1715 -21547 -22072 -21681 -29832 -20006 -12143 -45653 -52756
5893 -52756 -71359 -54551 -43572 -42932 -30284 -16264 -26108 -25491 -59786 -79751 -71495 -32097 2478
5880 2478 19763 12335 -11102 -10560 -19296 -13729 -23874 -11082 -1282 927 8290 21231 23624 12475
5866 12475 -9426 -22442 -35346 -12245 -8299 -14580 -29113 -52448 -36791 -4592 -1078 973 -35080
5853 -35080 -49853 -45703 -44847 -4328 -3330 -20 9047 -6007 -23502 -27040 -9623 -29934 -35529 -28822
5839 -28822 -13281 7516 -7975 -711 19552 13886 -8948 -36259 -23282 -6110 17919 16084
5827 16084 26617 12950 -9272 -28606 -34603 -12790 -451 679 6001 5841 10697 2670 7728
5814 7728 19481 15296 1249 -15823 -30695 -26958 876 15858 -20212 -18091 -22312 -16756 7402
$$ packed form
5907d485q109m1626J0391J4659J1618J9267k3262n25L91q151R826P863l3510p103
5893e2756j8603J6808J0979O40J2648J4020r844O17l4295j9965Q256L9398L4575
5880B478J7285p428k3437N42q736N567j0145J2792R800K209P363J2941K393j1149
5866A2475k1901j3016j2904K3101L946o281j4533k3335J5657L2199L514K051l6053
5853c5080j4773M150Q56M0519R98L310R067j5054j7495l538J7417k0311n595O707
5839b8822J5541K0797j5491P264K0263n666k2834k7311J2977J7172K4029j835
5827A6084J0533j3667k2222j9334n997K1813J2339J130N322j60M856q027N058
5814G728J1753m185j4047j7072j4872L737K7834J4982l6070K121m221N556K4158
$$ plain form
5801 7402 12627 -5960 4369 -376 -3208 7835 -8623 -20137 -43641 -37301 -26782 -12123 -9489
5788 -9489 -7404 -23854 -24486 -25480 -42321 -32980 11203 1370 -41413 -26071 -14172 -33970 -23256
5775 -23256 468 11832 27733 50715 31882 1641 1394 -4067 -16284 -26745 -42675 -11403
5763 -11403 -821 7528 10018 15500 19332 -9126 -6397 -4952 -22867 -36845 -14325 -13627 -43878
5750 -43878 -56381 -41684 -15260 -14390 -19708 -12899 5073 16407 -7672 -7062 -11585 -41635 -58006
5737 -58006 -36129 -27442 -10203 24620 38938 63168 39410 38161 57729 30956 -9097 -25366
5725 -25366 -26248 -47971 -14260 3024 20348 23584 -3041 -19425 -21884 -20420 -6321 -20021 5847
5712 5847 23447 1315 -9839 -22875 -18589 -13142 -15441 -4451 -5995 16904 30900 45612 55648
$$ packed form
5801G402N225j8587J0329m745k832J1043j6458j1514k3504O340J0519J4659K634
5788i489K085j6450o32r94j6841R341M4183r833m2783J5342J1899j9798J0714
5775b3256K3724J1364J5901K2982j8833l0241k47n461j2217j0461j5930L1272
5763a1403J0582Q349K490N482L832k8458K729J445j7915j3978K2520O98l0251
5750d3878j2503J4697K6424Q70n318O809J7972J1334k4079O10m523l0050j6371
5737e8006K1877Q687J7239L4823J4318K4230k3758j249J9568k6773m0053j6269
5725b5366q82k1723L3711J7284J7324L236k6625j6384k459J464J4099j3700K5868
5712E847J7600k2132j1154j3036M286N447k299J0990j544K2899J3996J4712J0036
$$ plain form
5699 55648 55010 15137 -3715 -17804 -18698 -3452 -5374 11886 15310 -220 -11901 -23200 -31714
5686 -31714 -14450 -3614 14313 27205 -342 -3068 5689 7218 -4883 -15576 -27839 -36572 -47116
5673 -47116 -34325 -18998 -9222 -15914 -40699 -11998 16425 15814 -11421 -29368 -20839 -18957 -8903
5660 -8903 -9455 14658 38338 43338 28860 -6286 -22595 -14540 -8177 79 -2787 -8107 -23748 -27654
5646 -27654 -37006 -50135 -24587 -27009 -29657 -2553 5802 20358 26628 13058 10335 -16687 -41502
5633 -41502 -51279 -24569 -36702 -35288 -41676 7561 17621 19323 26280 26140 -2593 555 -1442 935
5619 935 12578 21621 -14708 -33574 -9110 -12121 -25151 -25189 -23640 -3413 1142 5998 -5251 -6467
5605 -6467 -3157 -18586 -34819 -25122 -16780 -23860 -13725 -4580 -35257 -46521 -7818 12677 11128
$$ packed form
5699E5648o38l9873j8852j4089q94J5246j922J7260L424j5530j1681j1299q514
5686c1714J7264J0836J7927J2892k7547k726Q757J529j2101j0693j2263q733j0544
5673d7116J2791J5327R776o692k4785K8701K8423o11k7235j7947Q529J882J0054
5660h903n52K4113K3680N000j4478l5146j6309Q055O363Q256k866n320j5641l906
5646b7654r352j3129K5548k422k648K7104Q355J4556O270j3570k723k7022k4815
5633d1502r777K6710j2133J414o388M9237J0060J702O957j40k8733L148j997K377
5619I35J1643R043l6329j8866K4464l011j3030l8J549K0227M555M856j1249j216
5605f467L310j5429j6233R697Q342p080J0135R145l0677j1264L8703K0495j549
$$ plain form
5592 11128 -3523 -28415 -40255 -14839 -5662 36 -9621 -9192 -13039 -34856 -43343 -45497 -53262 -36262
5578 -36262 -6601 8148 11858 -7359 -5280 -17121 -5086 -23117 -22024 -11631 -9394 -19138 5201
5565 5201 6873 21226 -21548 -76840 -71235 -23709 4300 9528 20299 -4072 -365 17296 11514
5552 11514 3428 10561 -34344 -28837 16967 -3046 -27783 -36905 2559 14173 30818 23655 9362
5539 9362 -6684 -23907 -29295 -20436 -1678 21022 22611 2432 -14244 -41208 -43030 -4919 25127
5526 25127 5787 -35342 -44520 -38385 -39705 -49272 -38158 -36709 -11473 -7282 -12908 -41321 -38307
5513 -38307 -32526 -14047 -26333 -10983 16105 24224 15833 12089 -16129 -27667 13777 12762 5418
5500 5418 -4278 19479 23009 19539 4992 -31387 -37898 -16940 -7679 -23206 -12203 -19251 -12603
$$ packed form
5592A1128j4651k4892j1840K5416R177N698r657M29l847k1817q487k154p765J7000
5578c6262K9661J4749L710j9217K079j1841J2035j8031J093J0393K237r744K4339
5565E201J672J4353m2774n5292N605M7526K8009N228J0771k4371L707J7661n782
5552A1514q086P133m4905N507M5804k0013k4737r122L9464J1614J6645p163j4293
5539I362j6046j7223n388Q859J8758K2700J589k0179j6676k6964j822L8111L0046
5526B5127j9340m1129r178O135j320r567J1114J449K5236M191n626k8413L014
5513c8307N781J8479j2286J5350K7088Q119q391l744k8218j1538M1444j015p344
5500E418r696K3757L530l470j4547l6379o511K0958R261j5527J1003p048O648
$$ plain form
5487 -12603 -10143 -30964 -19219 -29096 -19193 -17038 -11666 -14639 -13624 1180 -8567 -20704 -10655
5474 -10655 5336 5665 10474 43908 17888 -867 28478 9548 21210 4804 -16026 2912
5462 2912 882 726 -1151 33491 30481 27920 14003 -4777 -7321 -15178 -15525 -8862 15459 29568
5448 29568 17179 24771 7436 -6565 45343 51682 57081 47093 28649 8712 5581 3195 -938
5435 -938 -7650 -174 -16728 -16966 -16344 -10210 -13669 -19997 -19517 -14803 2761 -8504 -15186 -31743 -35416
5420 -35416 -17743 15234 -1236 -4601 -10319 -24681 -9028 19416 4266 4845 -7284 -25576 -24487
5407 -24487 -31501 -52150 -49179 -54079 -44946 -27647 -16482 15942 41654 25552 28778 13410 9363
5394 9363 12150 15461 12975 6455 -17553 -20717 -23051 -10804 -10178 -16353 -29393 -37662 -38060 -32871 -26351
$$ packed form
5487a2603K460k0821J1745r877R903K155N372k973J015J4804r747j2137J0049
5474a0655J5991L29M809L3434k6020j8755K9345j8930J1662j6406k0830J8938
5462B912k030j56j877L4642l010k561j3917j8780k544p857l47O663K4321J4109
5448B9568j2389P592j7335j4001N1908O339N399r988j8444j9937l131k386m133
5435i38o712P476j6554k38O22O134l459o328M80M714J7564j1265o682j6557l673
5420c5416J7673L2977j6470l365n718j4362J5653K8444j5150N79j2129j8292J089
5407b4487p014k0649K971m900R133J7299J1165L2424K5712j6102L226j5368m047
5394I363K787L311k486o520k4008l164k334J2247O26o175j3040q269l98N189O520
$$ plain form
5379 -26351 -9243 17249 -11288 -28931 -48088 -48458 -26637 -22059 -32425 -25849 -19703 -17142 -12283
5366 -12283 -8039 24585 30989 21337 -2326 -7032 -18781 -15573 -30166 -43257 -11594 -23752 -33185
5353 -33185 -30621 -26007 -1136 17751 6021 7094 21063 6760 -28968 -14515 2664 -6946 1550
5340 1550 13800 24188 22784 -16133 -80564 -102031 -58755 -39100 -23052 -21904 -4679 -6484 -24742
5327 -24742 -29777 -11442 -4322 20461 25299 12580 -5120 11725 11214 30459 6046 23094 33274
5314 33274 12753 4055 -115 -25413 -15942 -11148 -8553 938 -14380 -27890 -5991 19548 2667
5301 2667 -1635 9830 46979 45629 37176 5962 -5527 1223 -12134 -16354 14504 14140 20609 6417
5287 6417 -21512 -3938 8981 10007 15871 -10390 -24529 -20777 -12643 1738 -15270 -49057 -60092
$$ packed form
5379b6351J7108K6492k8537j7643j9157l70K1821M578j0366O576O146K561M859
5366a2283M244L2624O404r652k3663m706j1749L208j4593j3091L1663j2158r433
5353c3185K564M614K4871J8887j1730J073J3969j4303l5728J4453J7179r610Q496
5340A550J2250J0388j404l8917o4431k1467M3276J9655J6048J148J7225j805j8258
5327b4742n035J8335P120K4783M838j2719j7700J6845n11J9245k4413J7048J0180
5314C3274k0521q698m170k5298R471M794K595R491j5318j3510K1899K5539j6881
5301B667m302J1465L7149j350q453l1214j1489O750j3357m220L0858l64O469j4192
5287F417k7929J7574J2919J026N864k6261j4139L752Q134J4381j7008l3787j1035
$$ plain form
5274 -60092 -45503 -35208 -35112 -42629 -50492 -40588 -34339 -12601 -27208 -26061 -17240 -1816 22507 34241
5260 34241 18663 23593 45389 52042 28437 18965 20651 25074 5246 -298 12400 -6396 -31001
5247 -31001 -29242 -13543 -18908 -28717 -48622 -21634 3527 -13473 -32584 -20032 -2338 -12430
5235 -12430 -12277 230 15477 36236 22189 13843 13293 5441 7995 30439 13311 -11647 -14880
5222 -14880 -25982 -25997 -10918 7946 2963 -1929 18954 10316 -1368 -8863 -14895 6954 30115
5209 30115 24823 28565 -10691 -47909 -33887 -3493 23886 29526 15015 2871 -21218 -18765 -17596
5196 -17596 -6580 2434 11967 36495 40600 13234 -4885 -5727 1717 -9568 -4117 -16194 -42192
5183 -42192 -77075 -71282 -70871 -65902 -57319 -4611 8069 -24062 -44431 -34504 -22447 -14515 5525
$$ packed form
5274f0092J4589J0295R6p517p863R904O249K1738j4607J147Q821J5424K4323J1734
5260C4241j5578M930K1796O653k3605r472J686M423j9828n544J2698j8796k4605
5247c1001J759J5699n365r809j9905K6988K5161j7000j9111J2552J7694j0092
5235a2430J53J2507J5247K0759j4047q346n50p852K554K2444j7128k4958l233
5222a4880j1102j5J5079J8864m983m892K0883q638j1684p495o032K1849K3161
5209C0115n292L742l9256l7218J4022L0394K7379N640j4511j2144k4089K453J169
5196a7596J1016R014R533K4528M105k7366j8119q42P444j1285N451j2077k5998
5183d2192l4883N793M11M969Q583N2708J2680l2131k0369R927J2057P932K0040
$$ plain form
5170 5525 -7287 -10612 -8784 19747 27475 17763 20274 23255 30067 19088 12139 -3964 -3174 5229
5156 5229 -18303 -23191 4238 10679 -8675 -14118 3220 -6865 -6878 -857 853 9901 397 -21225
5142 -21225 -32874 -9727 23522 34861 2517 -19110 16161 19476 12408 6532 1609 -5067 -2973
5129 -2973 12644 -4738 -49042 -53643 -40707 -40843 -34412 -9965 4337 -5434 7087 4915 -17206
5116 -17206 18344 20432 13484 10910 22050 12525 2419 926 4199 17827 8603 5655 -17914
5103 -17914 -16508 -2934 12860 32814 9283 1025 699 -5319 -6589 -4385 -16766 -13356 -608
5090 -608 19746 7024 261 31480 30130 18820 25460 2791 -17699 -18227 -5533 7039 -3568
5077 -3568 -15587 -21947 -4413 25790 34231 29070 6247 -21577 -16178 -25588 -22212 1146 1339 -19163
$$ packed form
5170E525j2812l325J828K8531P728r712K511K981O812j0979o949j6103P90Q403
5156E229k3532m888K7429O441j9354n443J7338j0085j3O021J710R048r504k1622
5142b1225j1649K3147L3249J1339l2344k1627L5271L315p068n876m923o676K094
5129b973J5617j7382m4304m601J2936j36O431K4447J4302r771J2521k172k2121
5116a7206L5550K088o948k574J1140r525j0106j493L273J3628r224k948k3569
5103a7914J406J3574J5794J9954k3531q258l26o018j270K204j2381L410J2748
5090f08K0354j2722o763L1219j350j1310O640k2669k0490n28J2694J2572j0607
5077c568j2019o360J7534L0203Q441n161k2823k7824N399r410L376K3358J93k0502
$$ plain form
5063 -19163 -29934 -31298 -23455 -13049 -4057 -18784 -13283 -6625 6186 3061 -15019 -11408 20798
5050 20798 35157 33196 25029 1660 -19782 -33852 -6207 -1506 32548 55844 26062 -18530
5038 -18530 -24284 -8908 -1208 13610 40 -8136 -4466 5589 -11136 -12839 -4164 10430 39724
5025 39724 41910 19981 6705 -13858 -17729 -8974 -10935 -32140 -50625 -21044 26040 23959 -2169
5012 -2169 -21867 -27539 -25549 -4298 9109 23534 1741 -19592 7815 22852 -498 -28173
5000 -28173 -27482 -35475 -44660 -55300 -55615 -31040 -12676 -4496 -8953 -24547 -33795 -37276 -23925 -17865
4986 -17865 -17612 2480 8404 22576 21979 35631 44828 12748 -5062 -1442 25079 27458 -5478
4973 -5478 -22537 -43680 -57515 -57004 -50876 -56118 -15422 -9487 -9985 9475 32604 38775 41194 43616
$$ packed form
5063a9163j0771j364P843J0406Q992j4727N501O658J2811l125j8080L611L2206
5050B0798J4359j961q167k3369k1442j4070K7645M701L4054K3296k9782m4592
5038a8530n754J5376P700J4818j3570q176L670J0055j6725j703Q675J4594K9294
5025C9724K186k1929j3276k0563l871Q755j961k1205j8485K9581M7084k081k6128
5012b169j9698n672J990K1251J3407J4425k1793k1333K7407J5037k3350k7675
5000b8173O91p993r185j0640l15K4575J8364Q180m457j5594r248l481J3351O060
4986a7865K53K0092N924J4172n97J3652R197l2080j7810L620K6521K379l2936
4973e478j7059k1143j3835N11O128n242M0696N935m98J9460K3129O171K419K422
$$ plain form
4959 43616 58198 49138 17931 -11061 -10725 -24925 -37843 336 25229 13333 1417 11576
4947 11576 -1624 -21419 -2399 -2701 -25799 -22556 6206 18137 4267 13555 40879 33986 24059
4934 24059 -14177 -28756 -14001 3062 16988 16227 18850 1787 14532 34246 39485 46200 49153
4921 49153 38832 19354 -15845 -3201 -11294 -20542 -15243 -3127 -12753 -24700 5663 14067 29302
4908 29302 47339 35313 11570 -22750 -15629 -25117 -4553 9344 22051 21482 -5846 -24263 -27794
4895 -27794 10517 32333 24678 22043 -12610 -21627 -33026 -32164 -26117 -24538 -25542 11649 16061 21181
4881 21181 24194 7553 -11882 -11426 -14653 389 -13217 -9751 -4647 -7150 -24277 -44622 -42219
4868 -42219 -13260 5318 15042 7659 14070 31658 23296 7311 -13313 792 14338 10715 13609
$$ packed form
4959D3616J4582r060l1207k8992L36j4200j2918L8179K4893j1896j1916J0159
4947A1576j3200j9795J9020l02k3098L243K8762J1931j3870R288K7324o893r927
4934B4059l8236j4579J4755J7063J3926p61K623j7063J2745J9714N239O715K953
4921D9153j0321j9478l5199J2644q093r248N299J2116r626j1947L0363Q404J5235
4908B9302J8037j2026k3743l4320P121r488K0564J3897J2707n69k7328j8417l531
4895b7794L8311K1816p655k635l4653r017j1399Q62O047J579j004L7191M412N120
4881B1181L013j6641j9435M56l227J5042j3606L466N104k503j7127k0345K403
4868d2219K8959J8578R724p383O411J7588q362j5985k0624J4105J3546l623K894
$$ plain form
4855 13609 17037 1780 -3213 13491 21909 9674 19745 37914 53736 24089 6056 -18641
4843 -18641 -24424 -40199 -58859 -55024 -25040 -15588 -20975 -26127 -33470 -17173 -43880 -54166 -30632
4830 -30632 -12636 2001 5020 23797 21210 1961 -12041 -20878 -4363 -5940 -21028 -23863 -8280
4817 -8280 6406 31267 28900 9146 -13474 -5406 -13454 -14437 -15239 -14153 -24843 -54784 -22556 -24107
4803 -24107 -17669 -6542 -10800 -8780 -19349 -4266 8133 -9936 -22517 -25299 -9380 -64 -10720
4790 -10720 -17611 -30835 -23029 -12363 -20701 -26007 -7542 -10923 -26445 -28935 -35241 -17893 18346
4777 18346 39745 39118 31730 23965 12924 1047 -16907 -28239 -22800 -7936 8854 25475 12561
4764 12561 11122 18555 22373 32746 8770 -17247 -6154 29434 47009 37105 30467 32095 39259
$$ packed form
4855A3609L428j5257m993J6704Q418j2235J0071J8169J5822k9647j8033k4697
4843a8641n783j5775j8660L835K9984R452n387n152p343J6297k6707j0286K3534
4830c0632J7996J4637L019J8777k587j9249j4002q837J6515j577j5088k835J5583
4817h280J4686K4861k367j9754k2620Q068q048r83q02J086j0690k9941L2228j551
4803b4107O438J1127m258K020j0569J5083J2399j8069j2581k782J5919R316j0656
4790a0720o891j3224P806J0666q338n306J8465l381j5522k490o306J7348L6239
4777A8346K1399o27p388p765j1041j1877j7954j1332N439J4864J6790J6621j2914
4764A2561j439P433L818J0373k3976k6017J1093L5588J7575r904o638J628P164
$$ plain form
4751 39259 7091 -11636 -3377 17649 -3148 -3146 21922 41340 36200 25062 12758 -15412 -31757
$$ packed form
4751C9259l2168j8727Q259K1026k0797KK5068J9418n140j1138j2304k8170j6345
$$ [...]
##END NTUPLES=NMR SPECTRUM
##END=
