##TITLE=Analysis number 328975
Compound Code cc 58304
Book Reference 467/170/6
Project Code adrs
Chemist Name benw
##JCAMPDX= 6.0         $$ Bruker NMR JCAMP-DX V2.0
##DATA TYPE= NMR SPECTRUM
##DATA CLASS= NTUPLES
##ORIGIN= Bruker BioSpin GmbH
##OWNER= nmr
$$ XWIN-NMR		Version 3.5
$$ Fri Jul 20 13:24:36 2007 GMT Daylight Time (UT+1h)  MAYBRIDGE\nmr@NMR_250MHZ
##.OBSERVE FREQUENCY= 250.131544655141
##.OBSERVE NUCLEUS= ^1H
##.ACQUISITION MODE= SIMULTANEOUS (DQD)
##.ACQUISITION SCHEME= undefined
##.AVERAGES= 16
##.DIGITISER RES= 18
##SPECTROMETER/DATA SYSTEM= dpx250
##.PULSE SEQUENCE= zg30
##.SOLVENT NAME= CDCl3
##.SHIFT REFERENCE= (INTERNAL, CDCl3, 0, 16.4569)
##AUDIT TRAIL= $$ (NUMBER, WHEN, WHO, WHERE, WHAT)
$$ ##TITLE= Audit trail, XWIN-NMR		Version 3.5
$$ ##JCAMPDX= 5.01
$$ ##ORIGIN= Bruker BioSpin GmbH
$$ ##OWNER= nmr
$$ C:\u/data/dgb/nmr/ADRS/1280/pdata/1/auditp.txt
$$ ##AUDIT TRAIL=  $$ (NUMBER, WHEN, WHO, WHERE, WHAT)
(   1,<2007-07-20 13:24:14.41 +100>,<MAYBRIDGE\nmr>,<NMR_250MHZ>,
      <created by zg, POWCHK disabled, PULCHK disabled
       configuration hash MD5:
       76 6E 9A 78 1E 09 19 81 EC 84 63 8F B0 6A 59 2D
       data hash MD5: 64K
       15 8C A4 7C 2F 76 78 6F 73 13 7D 40 26 75 F7 8D>)
(   2,<2007-07-20 13:24:26.54 +100>,<MAYBRIDGE\nmr>,<NMR_250MHZ>,
      <Start of raw data processing
       ef LB = 0.3 FT_mod = 6 PKNL = 1 SI = 32K 
       data hash MD5: 32K
       94 BC 53 00 76 E7 8E 77 AE B8 6C 9A 91 07 B9 2B>)
(   3,<2007-07-20 13:24:28.19 +100>,<MAYBRIDGE\nmr>,<NMR_250MHZ>,
      <apk 
       data hash MD5: 32K
       0D 1C F2 2B 9E 87 29 E1 A9 D5 9C 43 0C C2 45 53>)
(   4,<2007-07-20 13:24:29.09 +100>,<MAYBRIDGE\nmr>,<NMR_250MHZ>,
      <abs ABSG = 5 
       data hash MD5: 32K
       EA AC 21 9A 35 D1 DA CE B7 7E 0A A2 41 1D EA 17>)
$$ ##END=
$$ 
$$ hash MD5
$$ F4 B5 15 58 F8 0B 30 83 B8 64 D7 FB 7A 3D 64 C4
##$RELAX= 
##$RELAX= 
##$RELAX= 
##$RELAX= 
##$RELAX= 
##$RELAX= 
##$RELAX= 
$$ Bruker specific parameters
$$ --------------------------
##$DU= <C:\u>
##$EXPNO= 1280
##$NAME= <ADRS>
##$PROCNO= 1
##$TYPE= <nmr>
##$USER= <dgb>
##$AMP= (0..31)
100 100 100 100 100 100 100 100 100 100 100 100 100 100 100 100 100 100 
100 100 100 100 100 100 100 100 100 100 100 100 100 100 
##$AQSEQ= 0
##$AQ_mod= 3
##$AUNM= <au_zg>
##$AUTOPOS= <11 >
##$BF1= 250.13
##$BF2= 250.13
##$BF3= 250.13
##$BF4= 250.13
##$BF5= 500.13
##$BF6= 500.13
##$BF7= 500.13
##$BF8= 500.13
##$BYTORDA= 1
##$CFDGTYP= 0
##$CFRGTYP= 5
##$CHEMSTR= <none>
##$CNST= (0..31)
1 1 145 1 1 1 1 1 1 1 1 1 1 1 1 1 1 1 1 1 1 1 1 1 1 1 1 1 1 1 1 1 
##$CPDPRG= <>
##$CPDPRG1= <>
##$CPDPRG2= <>
##$CPDPRG3= <>
##$CPDPRG4= <mlev>
##$CPDPRG5= <mlev>
##$CPDPRG6= <mlev>
##$CPDPRG7= <mlev>
##$CPDPRG8= <mlev>
##$CPDPRGB= <>
##$CPDPRGT= <>
##$D= (0..31)
0 1 0 0 0 0 0 0 0 0.06 0 0 0 0 0 0 0.0002 0 0 0 0 0 0 0 0 0 0 0 0 0 0 
0 
##$DATE= 1184934253
##$DBL= (0..7)
120 120 120 120 120 120 120 120 
##$DBP= (0..7)
150 150 150 150 150 150 150 150 
##$DBP07= 0
##$DBPNAM0= <>
##$DBPNAM1= <>
$$ [...]
##$SUBNAM7= <"">
##$SUBNAM8= <"">
##$SUBNAM9= <"">
##$SW= 20.6930455092707
##$SWIBOX= (0..15)
0 0 3 0 0 0 0 0 0 0 0 0 0 0 0 0 
##$SW_h= 5175.983436853
##$TD= 65536
##$TD0= 1
##$TE= 297.16
##$TE2= 300
##$TE3= 300
##$TEG= 300
##$TL= (0..7)
0 120 120 120 120 120 120 120 
##$TP= (0..7)
150 150 150 150 150 150 150 150 
##$TP07= 0
##$TPNAME0= <>
##$TPNAME1= <>
##$TPNAME2= <>
##$TPNAME3= <>
##$TPNAME4= <>
##$TPNAME5= <>
##$TPNAME6= <>
##$TPNAME7= <>
##$TPOAL= (0..7)
0.5 0.5 0.5 0.5 0.5 0.5 0.5 0.5 
##$TPOFFS= (0..7)
0 0 0 0 0 0 0 0 
##$TUNHIN= 0
##$TUNHOUT= 0
##$TUNXOUT= 0
##$USERA1= <user>
##$USERA2= <user>
##$USERA3= <user>
##$USERA4= <user>
##$USERA5= <user>
##$V9= 5
##$VALIST= <valist>
##$VCLIST= <CCCCCCCCCCCCCCC>
##$VD= 0
##$VDLIST= <DDDDDDDDDDDDDDD>
##$VPLIST= <PPPPPPPPPPPPPPP>
##$VTLIST= <TTTTTTTTTTTTTTT>
##$WBST= 1024
##$WBSW= 4
##$XGAIN= (0..3)
0 0 0 0 
##$XL= 0
##$YL= 0
##$YMAX_a= 370192
##$YMIN_a= -309930
##$ZGOPTNS= <>
##$ZL1= 120
##$ZL2= 120
##$ZL3= 120
##$ZL4= 120
##$ABSF1= 16.45685
##$ABSF2= -4.236322
##$ABSG= 5
##$ABSL= 3
##$ALPHA= 0
##$AQORDER= 0
##$ASSFAC= 0
##$ASSFACI= 0
##$ASSFACX= 0
##$ASSWID= 0
##$AUNMP= <proc_1d>
##$AZFE= 0.1
##$AZFW= 0.1
##$BCFW= 0
##$BC_mod= 0
##$BYTORDP= 0
##$COROFFS= 0
##$CY= 12.5
##$DATMOD= 1
##$DC= 0
##$DFILT= <>
##$DTYPP= 0
##$F1P= 14.0000005364418
##$F2P= -0.99999901652339
##$FCOR= 0.5
##$FTSIZE= 32768
##$FT_mod= 6
##$GAMMA= 0
##$GB= 0
##$INTBC= 1
##$INTSCL= 1
##$ISEN= 128
##$LB= 0.3
##$LEV0= 0
##$LPBIN= 0
##$MAXI= 10000
##$MC2= 0
##$MEAN= 0
##$ME_mod= 0
##$MI= 0
##$NCOEF= 0
##$NC_proc= -5
##$NLEV= 6
##$NOISF1= 0
##$NOISF2= 0
##$NSP= 0
##$NTH_PI= 0
##$NZP= 0
##$OFFSET= 16.45685
##$PC= 1
##$PHC0= -52.68309
##$PHC1= 9.12436
##$PH_mod= 1
##$PKNL= yes
##$PPARMOD= 0
##$PSCAL= 4
##$PSIGN= 0
##$REVERSE= no
##$SF= 250.130016295371
##$SI= 32768
##$SIGF1= 0
##$SIGF2= 0
##$SINO= 400
##$SIOLD= 32768
##$SREGLST= <1H.CDCl3>
##$SSB= 0
##$STSI= 32768
##$STSR= 0
##$SW_p= 5175.98343685301
##$SYMM= 0
##$S_DEV= 0
##$TDeff= 65536
##$TDoff= 0
##$TI= <Analysis number 999999
Compound Code 99
Book Reference 9
Project Code 9>
##$TILT= no
##$TM1= 0
##$TM2= 0
##$TOPLEV= 0
##$USERP1= <user>
##$USERP2= <user>
##$USERP3= <user>
##$USERP4= <user>
##$USERP5= <user>
##$WDW= 1
##$XDIM= 32768
##$YMAX_p= 425143921
##$YMIN_p= -486598
$$ End of Bruker specific parameters
$$ ---------------------------------
##NTUPLES= NMR SPECTRUM
##VAR_NAME=  FREQUENCY,     SPECTRUM/REAL,   SPECTRUM/IMAG
##SYMBOL=    X,             R,               I
##VAR_TYPE=  INDEPENDENT,   DEPENDENT,       DEPENDENT
##VAR_FORM=  AFFN,          ASDF,            ASDF
##VAR_DIM=   32768,         32768,           32768
##UNITS=     HZ,            ARBITRARY UNITS, ARBITRARY UNITS
##FACTOR=    0.157963299565203, 1,           1
##FIRST=     4116.35217164719, 0,            0
##LAST=      -1059.63126520582, 0,           0
##MIN=       -1059.63126520582, -486598,     0
##MAX=       4116.35217164719, 425143921,    0
$$ Real data points
##PAGE= N=1
##DATA TABLE= (X++(R..R)), XYDATA
$$ [...]
27925g165R2493L1019j4916k3067n8325l4196N2871N9398P2694j8737j48376l3876
$$ -7165 85328 116347 101431 78364 20039 -14157 38714 98112 170806 152069 3693 -30183
27913c0183O6196o7841q2289j6908Q4240K6739j03782j1520J01909O1941j2277
$$ -30183 36013 -31828 -114117 -131025 -46785 -20046 -123828 -135348 -33439 28502 16225
27902A6225P2544J5590j23399j02578p4573R9545P7239r4297Q192P4959J8219
$$ 16225 88769 104359 -19040 -121618 -196191 -96646 -19407 -113704 -105512 -30553 -12334
27891a2334o868j9800J9763N818p7895n4690O8558J17153J13490n7915l8796o0581
$$ -12334 -19202 -39002 -19239 -13421 -91316 -146006 -77448 39705 153195 95280 56484 -4097
27879d097l2858Q6716K2724j6931r92r487p7120J3330J3685q310K1975N5543m1671
$$ -4097 -36955 49761 72485 55554 54562 45075 -32045 -18715 -5030 -13340 8635 64178 22507
27866B2507J1389l1002l5039k8906K9600Q8707K3265K1575p6l100m6415n3214
$$ 22507 33896 2894 -32145 -61051 -31451 57256 80521 102096 102020 98920 52505 -709
27854g09o9547L2849K1022j716o052l2809l444M846k7287r520j9354m0484k2927
$$ -709 -70256 -37407 -16385 -18101 -24153 -56962 -60406 -55560 -82847 -92367 -111721 -152205 -175132
27841a75132J16665K7203K1331R2331J9456p0623M4800M1066j607L1783K5516
$$ -175132 -58467 -31264 -9933 82398 101854 31231 76031 117097 115490 147273 172789
27830A72789n6260r898O6694J7983l2658L0871j02838j82833L568J18334o154
$$ 172789 116529 106631 173325 191308 158650 189521 86683 -96150 -92582 25752 19598
27819A9598j9985N624K4497L7934l5389m7093O9693N2893j2534o8745m5350n616
$$ 19598 -387 5237 29734 67668 32279 -14814 54879 107772 95238 26493 -18857 -24473
27807b4473O8509L0547m627j09986p0979k1022J26835O2222k3392n3620j7856
$$ -24473 44036 74583 69956 -40030 -111009 -132031 -5196 57026 33634 -19986 -37842
27796c7842n929j2047J25901N1036l1120M1232J2376j22246q0927Q2127J5406
$$ -37842 -43771 -55818 70083 121119 89999 131231 143607 21361 -59566 22561 37967
27785C7967m8122K3006N315K1299J7884K523j6800K1188q3830J804R5551L6216
$$ 37967 -10155 12851 18166 39465 57349 59872 43072 64260 -19570 -17766 77785 114001
27773A14001n9072O9523k427r7028l3101L4890m1774L886O3078M1428n3199L805
$$ 114001 54929 124452 122025 24997 -8104 26786 -14988 -11102 51976 93404 40205 44010
27761D4010M5465o9810k2109L6442k0521M7474J46750N1454j11201j25243R8235
$$ 44010 89475 19665 -2444 33998 13477 60951 207701 259155 147954 22711 120946
27750A20946K7798o5969p2357l0692K7457l5661M0145j06596j1704O1227P0145
$$ 120946 148744 82775 10418 -20274 7183 -28478 11667 -94929 -106633 -45406 24739
27739B4739L5369j14294O12J0972o9037M0526R2552j6285L077q1604n6057L1876
$$ 24739 60108 -54186 -53574 -42602 -111639 -71113 21439 5154 8231 -73373 -129430 -97554
27727i7554J66200L914j03291J6622R8373n056J4512L0014N5914j7284r2075p701
$$ -97554 68646 72560 -30731 -14109 84264 79208 93720 123734 179648 162364 70289 62588
27715F2588k6840J07928m9650q0023J9394k4653K3319O4087p7388m6956O7996
$$ 62588 35748 143676 94026 14003 33397 8744 32063 96150 18762 -28194 39802
27704C9802O3602K5998r4029k9642J3562K4738j04723n9662N6063j270k023J17502
$$ 39802 103404 129402 35373 5731 19293 44031 -60692 -120354 -64291 -65561 -67584 49918
27692D9918K0268m107l0817Q3178j2724n3386j05191j07863l4534N9837O2452
$$ 49918 70186 66079 35262 118440 105716 52330 -52861 -160724 -195258 -135421 -72969
27681g2969M3718K1806J1154k4527M9563M6899j04098k2756K4991L3128m7068
$$ -72969 -29251 -7445 3709 -20818 28745 75644 -28454 -51210 -26219 6909 -40159
27670d0159o329O747Q621n4812K0150K4715o0639N4574J6866m690Q8380J15078
$$ -40159 -46488 -39741 -31120 -85932 -65782 -41067 -101706 -47132 -30266 -34956 53424 168502
27658A68502j3965o5136o1829k4070j00127K8152K9421L4987N0827n9874M245
$$ 168502 154537 89401 27572 3502 -96625 -68473 -39052 -4065 46762 -13112 -8867
27647h867P1631N507n2925O8809l1764Q2896o6192p981J9907q5405j12196J5969
$$ -8867 62764 68271 15346 84155 52391 135287 69095 61114 81021 -4384 -116580 -100611
27635a00611Q6493k0257m8441l8179J84136M3811p6254O9421j7859p0114p6767
$$ -100611 -14118 -34375 -82816 -120995 63141 106952 30698 100119 82260 12146 -64621
27624f4621j7974k3972N1019J2963Q0189P6369l6872q9898K6328Q4632j6378k6724
$$ -64621 -82595 -106567 -55548 -42585 37604 113973 77101 -12797 13531 98163 81785 55061
27612E5061Q0620L3092j04703r7539P5341o0717k5469J045J6940J38898k9196
$$ 55061 135681 168773 64070 -33469 41872 -18845 -44314 -43269 -26329 112569 83373
27601H3373j24344L6441Q3235j0328p5352j6480M4757K100n5920P078M230q88
$$ 83373 -40971 -4530 78705 68377 -6975 -23455 21302 23402 -32518 -25440 -21210 -22098
27589b2098M0715N5928q9592o9024J47114Q6681j11065j03845J15821O5605K3295
$$ -22098 18617 74545 -15047 -84071 63043 149724 38659 -65186 50635 116240 139535
27578A39535l6208k1596O4345J5387K4704k1389j02082j37538k1908Q3237L7224
$$ 139535 103327 81731 146076 161463 186167 164778 62696 -74842 -96750 -13513 23711
27567B3711m0742J50557Q437o1391J4066m0987K000N6757o6731M19K3862N2919
$$ 23711 -17031 133526 141963 80572 94638 53651 55651 112408 45677 46096 69958 122877
27555A22877M8954N0610o8253n1871m3362j09205l9408K0964P2802N0094P2277
$$ 122877 171831 222441 154188 102317 58955 -50250 -89658 -68694 4108 54202 126479
27544A26479r53p3579r1753L1164q139j3783K1216m864m1262L6336l501p265J33975
$$ 126479 125526 51947 -39806 -8642 -16781 -30564 -9348 -14212 -55474 -19138 -22639 -29904 104071
27531A04071J68402r0527j23430j13588j16517J68366N8843K2440j5502j11343
$$ 104071 272473 181946 58516 -55072 -171589 -3223 55620 78060 62558 -48785
27521d8785J1824Q6335m9275l2294P385M305O9384m4219l5066J9677K0803K773
$$ -48785 -36961 49374 99 -32195 -24810 -20505 48879 4660 -30406 -10729 10074 12847
27509A2847j4933m1590j30454O049Q7680Q6439M3156R6381O435J5033n8804l5384
$$ 12847 -2086 -43676 -174130 -168081 -80401 6038 49194 145575 152010 167043 108239 72855
27497G2855N8143o4330O0664m1485j13095L3316L5631k5499m0009K8354N765k8563
$$ 72855 130998 66668 127332 85847 -27248 6068 41699 16200 -23809 4545 10310 -18253
27485a8253L4037j7090n8584r5479K8047Q3770O471n5950o8600P0343N6130j8098
$$ -18253 15784 -1306 -59890 -155369 -127322 -43552 -37081 -93031 -161631 -91288 -35158 -53256
27473e3256K6938J4994J4870k0846l3436j203J27688L8856l5085M9566O5638j1745
$$ -53256 -26318 -11324 3546 -17300 -50736 -51939 75749 114605 79520 129086 194724 182979
27461A82979r4250r7507K8539n596k2133N0703M8550L7737P0771j3318j1543k6409
$$ 182979 88729 -8778 19761 14165 -7968 42735 91285 129022 199793 186475 174932 148523
27449A48523p7440k1495L8924N7580k7830p5183l3414K3437P3832j0520m0305
$$ 148523 71083 49588 88512 146092 118262 43079 9665 33102 106934 96414 56109
27438E6109o5776M8663L4823m9631L6851J5137J1900k9731K2439k2326p494J0411
$$ 56109 -9667 38996 73819 24188 61039 76176 88076 58345 80784 58458 50964 61375
27426F1375j6142n3312q207M3242R061l9939L7106P91M1666J56743k3135o3599
$$ 61375 45233 -8079 -16286 26956 36017 -3922 33184 33975 75641 232384 209249 145650
27414A45650j00526n5702m8785J4706M9138p8174n702P2513R0594L4593m1517
$$ 145650 45124 -10578 -59363 -44657 4481 -73693 -79395 -6882 83712 118305 76788
27403G6788k9529L6847o1636J962o9472j0792J17968N4057j8265L3652K2507p1632
$$ 76788 47259 84106 22470 24432 -45040 -55832 62136 116193 97928 131580 154087 82455
27391H2455m7040K5278r270k9551N4857J13749K5888j128l1242n1093j08229j32811
$$ 82455 35415 60693 51423 21872 76729 190478 216366 215238 183996 132903 24674 -108137
27379a08137j1832M6190k313Q382Q6627P605j0865q6605L3465Q180M2685q219
$$ -108137 -119969 -73779 -76092 -67710 18917 26522 15657 -70948 -37483 -29303 13382 5163
27367E163L066m2448l1323q4078m6981L4278J72585P9980P5309n0683L3850K447
$$ 5163 8229 -34219 -65542 -149620 -196601 -162323 10262 90242 165551 114868 148718 151165
27355A51165n8298m8012p7209j08702O622l4357l3228J07172O5441j7165O6608
$$ 151165 92867 44855 -32354 -141056 -134434 -168791 -202019 -94847 -29406 -46571 20037
27344B0037k0178M2725m0516p430N4307p6184m1404K828M8034P2460m9442K0620
$$ 20037 -141 42584 2068 -5362 48945 -27239 -68643 -65815 -17781 54679 5237 25857
27332B5857L0616P0359q3304p0453M2513O4548k6259q5041j26020q1638J0490
$$ 25857 56473 126832 43528 -26925 15588 80136 53877 -31164 -157184 -238822 -228332
27321b28332O6160J0644Q9524J00242J7087j6280N8885j609k232N9195n4012q8294
$$ -228332 -162172 -151528 -62004 38238 55325 39045 97930 96321 94089 153284 99272 10978
27309A0978o6700j7188M9571R581j5658P228R9849O5991j28282n6498O3469K8774
$$ 10978 -55722 -72910 -23339 -13758 -29416 -22188 77661 143652 15370 -41128 22341 51115
27297E1115k0230m2975m3020l1762k005j484P8111J25767k2522N7971j7737n1768
$$ 51115 30885 -12090 -55110 -86872 -88877 -90361 -12250 113517 90995 148966 131229 79461
27285G9461l8232j48631K6056N2488Q763O7259P4313J03231l668n9709p9511r3169
$$ 79461 41229 -107402 -81346 -28858 -20095 47164 121477 224708 221040 161331 81820 -11349
27273a1349O099L1734M5262k5759n9755L4945N7234k0892n6576J1207j9269l7609
$$ -11349 -5250 26484 71746 45987 -13768 21177 78411 57519 943 12150 -7119 -44728
27261d4728J42382p1096r4687Q3763O8133J6177k6486q3529m0670J0430j5801
$$ -44728 97654 26558 -68129 15634 83767 99944 73458 -10071 -50741 -40311 -56112
27250e6112N9794N0811l8609M9515M0246r6958l1333l0549j2546Q4745n5220j122
$$ -56112 3682 54493 15884 65399 105645 8687 -22646 -53195 -65741 19004 -36216 -37338
27238c7338J34281J2181j61287j07845J01608J03632m5235m5716O7827l83k5354
$$ -37338 96943 109124 -52163 -160008 -58400 45232 -3 -45719 22108 21725 -3629
27227c629M0189K1569o1466j21489j0135K5016R4199K4917q4356n0350k5812L5769
$$ -3629 36560 58129 -3337 -124826 -134961 -109945 -15746 9171 -75185 -125535 -151347 -115578
27215a15578J6051n710n3079p12O2403L1151q2630j4632J48633J10197m4325o6569
$$ -115578 -99527 -105237 -158316 -159028 -96625 -65474 -148104 -162736 -14103 96094 51769 -14800
27203a4800l9396J592k4929L6702O5714n1790P890K3627N0119M3131j5017p1350
$$ -14800 -54196 -52604 -77533 -40831 24883 -26907 -19017 4610 54729 97860 82843 11493
27191A1493n6701R3236L0923p8609j56566o0589J36725P7426n1467K8577L2306
$$ 11493 -45208 48028 78951 342 -156224 -216813 -80088 -2662 -54129 -25552 6754
27180F754O9760M3866p3960K0899O5328j5626j39401m1115o9112p5050Q200J25741
$$ 6754 76514 120380 46420 67319 132647 117021 -22380 -63495 -132607 -207657 -199457 -73716
27168g3716L3746N2409Q9274n5700l861M7205N9222n3683j0984M8186m4957m7269
$$ -73716 -39970 12439 101713 46013 42152 89357 148579 94896 83912 132098 87141 39872
27156C9872p1511n0740R6536N0042o7971m5015q547K3938R895L1505N51k6629
$$ 39872 -31639 -82379 14157 64199 -3772 -48787 -57334 -33396 -23501 8004 8555 -18074
27144a8074m3340J0069J21182M8996l0842k0502J9303n8653l7771K3596N8417
$$ -18074 -61414 -51345 69837 118833 87991 67489 86792 28139 -9632 13964 72381
27133G2381r6496j55948P4913M6824P4596K0693J6882K0617n8814q0022l4538
$$ 72381 -24115 -180063 -105150 -58326 16270 36963 53845 74462 15648 -64374 -98912
27122i8912k0495o904k0807J2990M55l0676l215J9119j14338M5629J13603R3424
$$ -98912 -119407 -126311 -147118 -134128 -133673 -164349 -167564 -148445 -262783 -217154 -103551 -10127
27110a0127p5733N290J4375O9301J5592j18416n0878Q361O0493L3724J908o3996
$$ -10127 -85860 -80570 -66195 3106 18698 -99718 -150596 -142235 -81742 -48018 -46110 -110106
27098a10106o5719J41738J00636o5999m1580q4372N0188J39934n0802m8159K5521
$$ -110106 -175825 -34087 66549 550 -41030 -125402 -75214 64720 13918 -34241 -8720
27087h720k6283O0417N7466R54p0043q1827l1581l3689N4279J34119J3647n4144
$$ -8720 -35003 25414 82880 83834 13791 -68036 -99617 -133306 -79027 55092 68739 14595
27075A4595q793L3913Q2287J3934l7966j8038r6653p3834o8156O7889M0800l8815
$$ 14595 5802 39715 122002 135936 97970 79932 -16721 -90555 -158711 -90822 -50022 -88837
27063h8837p5715O2636J0067Q0690N2218l1517M3708N4677M437J4493L2785N2495
$$ -88837 -164552 -101916 -91849 -11159 41059 9542 53250 107927 112364 126857 159642 212137
27051B12137J1208p9970m8227o2022j1850M7674q1999p4610R2283r18J6737l1582
$$ 212137 223345 143375 95148 33126 21276 68950 -13049 -87659 4624 3706 20443 -11139
27039a1139l7969J4187M8505m3501l3502M6454Q684N6595N7266p0332j63296m8788
$$ -11139 -49108 -34921 13584 -29917 -63419 -16965 -8281 48314 105580 35248 -128048 -176836
27027a76836m9989J8839J13135J12460k5624n6810n7584J00551p305m4576O1422
$$ -176836 -226825 -207986 -94851 17609 -8015 -64825 -122409 -21858 -29163 -73739 -12317
27016a2317M7368K8737K5802j3416j8087j961k0917l8210N2620N5311J9498j42914
$$ -12317 35051 63788 89590 76174 58087 56126 35209 -3001 49619 104930 124428 -18486
27004a8486o3166J05598L1165r6703q8430N1944J73445N7068m0428m6610K9453
$$ -18486 -81652 23946 55111 -41592 -130022 -78078 95367 152435 112007 65397 94850
26993I4850r9914p6103p508R4704N3408q9226q9518P109N6241M2018J0581N9132
$$ 94850 -5064 -81167 -88675 6029 59437 -29789 -119307 -112198 -55957 -13939 -3358 55774
26981E5774R4855k8039n5263k9874J5534P0913l7947r6778N498j5029j44913o1030
$$ 55774 150629 122590 67327 37453 52987 123900 85953 -10825 -5327 -20356 -165269 -226299
26969b26299K7227l7735N699Q9916O7017R8756M0861j02130l2238J2504p6278
$$ -226299 -199072 -236807 -231108 -141192 -74175 24581 65442 -36688 -68926 -56422 -132700
26958a32700l44J3281k40L635r9332J6962J32982L1323J09393m5087l6664N9314
$$ -132700 -133044 -119763 -120003 -116368 -215700 -198738 -65756 -34433 74960 29873 -6791 52523
26946E2523L9729L4615o6803r4238P9195p0398O5161M0266K2295p9608j1969J0508
$$ 52523 92252 126867 60064 -34174 45021 -25377 39784 80050 102345 22737 10768 21276
26934B1276k8663r186L4216N5283n1791r5400K0240O6187m2370o3444M6059N6384
$$ 21276 -7387 -16573 17643 72926 21135 -74265 -54025 12162 -30208 -93652 -47593 8791
26922H791k1245K847k1289j7498n9229l0163O0498J9323j5464j1424J52189M0469
$$ 8791 -12454 -9607 -30896 -48394 -107623 -137786 -77288 -57965 -73429 -84853 67336 107805
26910A07805j45354k6247k30n5188j6192K0615Q4234J01872m727p6398m2476J1499
$$ 107805 -37549 -63796 -64026 -119214 -135406 -114791 -30557 71315 66588 -9810 -52286 -40787
26898d0787n514j0449m7564P9890J40211N0825q6152j12180j06462M7232O9005
$$ -40787 -46301 -56750 -104314 -24424 115787 166612 80460 -31720 -138182 -90950 -21945
26887b1945Q214O958K0031P0536P935J712j76938l5435J19966Q7773K2225J6859
$$ -21945 -13731 -6773 13258 83794 91729 93441 -83497 -118932 1034 88807 111032 127891
26875A27891J0490o1618j53692j01214m0490J65947J14864P908j24433l1899q538
$$ 127891 138381 76763 -76929 -178143 -218633 -52686 62178 70086 -54347 -86246 -94784
26864i4784R9022L504P2949M5061J1830m4011l5283k8433k8494R0358M5792K6611
$$ -94784 4238 7742 80691 125752 137582 93571 58288 29855 1361 91719 137511 164122
26852A64122k1910o6709J7142m0982o9176O879j8097m0969l6026n0244K5507j7775
$$ 164122 142212 75503 92645 51663 -17513 -10634 -28731 -69700 -105726 -155970 -130463 -148238
26840a48238M4808M6073K3393N5288J502k7979K2317j1981J427M8102L3188N6694
$$ -148238 -103430 -57357 -33964 21324 22826 -5153 17164 5183 6610 54712 87900 144594
26828A44594J4558P578k0307p1059o5008m6758k1010o4012J6420L5786L2621k1729
$$ 144594 159152 166730 146423 75364 10356 -36402 -57412 -121424 -105004 -69218 -36597 -58326
26816e8326N6667Q1447m0162r6622m4123M8681j5418k2219P736R8897j572K6113
$$ -58326 -1659 79788 39626 -56996 -101119 -52438 -67856 -90075 -82339 16558 14986 41099
26804D1099r799J0802M9817o4222j9351m7747k5005K9394m7154N3014L2622J4247
$$ 41099 31300 42102 91919 27697 8346 -39401 -64406 -35012 -82166 -29152 3470 17717
26792A7717M8386L5203R3280K8020M2171l125j6016N6012J1442j57752j96979
$$ 17717 66103 101306 194586 222606 264777 261652 245636 301648 313090 155338 -41641
26781d1641j9236n4587k7792P5973p7892k3991J2850L4794J11569N1687K8789
$$ -41641 -60877 -115464 -143256 -67283 -145175 -169166 -156316 -121522 -9953 41734 70523
26770G0523L6831p8594L5713M964m5060M459o6617k7659Q9804K7805M7522j835
$$ 70523 107354 28760 64473 69437 24377 28836 -37781 -65440 24364 52169 99691 97856
26758I7856n3533n094L3096p5815q4367n3345p6998J7527N6599J79611q742m1334
$$ 97856 44323 39229 72325 -3490 -87857 -141202 -218200 -200673 -144074 35537 26795 -14539
26746a4539j1186o9018o1147l3791O0334k071J1513J29852J004m4476k337P8710
$$ -14539 -25725 -94743 -155890 -189681 -129347 -131418 -119905 9947 10951 -33525 -35862 42848
26734D2848N5417k8444O827l9696M483L2082o946j02061j5497j6455N9484J2384
$$ 42848 98265 69821 76648 36952 41435 73517 66571 -35490 -50987 -67442 -7958 4426
26722D426j72509k7533L9616P7658L2865K0978M3872L5078r448r6108o501J05533
$$ 4426 -168083 -195616 -156000 -78342 -45477 -24499 19373 54451 45003 -51105 -57606 47927
26710D7927K6355p4521l218J28919l2417k5317L4654l1161l8978J07918P3931
$$ 47927 74282 -239 -3457 125462 93045 67728 102382 71221 32243 140161 214092
26699B14092r6475p0284l883J25359O415j49168r4350n7398M4998N3663R1380
$$ 214092 117617 47333 43450 168809 175224 26056 -68294 -125692 -80694 -27031 64349
26688F4349m3012J880K1793J77691O8668n5068j09090j39839l7866M9773k1495
$$ 64349 21337 23217 45010 222701 291369 236301 127211 -12628 -50494 -721 -22216
26677b2216m4897k6294j4123J5429M7737J3470L5009P6978m9249j28897n6755
$$ -22216 -67113 -93407 -107530 -92101 -44364 -30894 4115 81093 31844 -97053 -153808
26666a53808j2259O5965R0486J5924m0354N514P8123p509m9265O6926P7623J6784
$$ -153808 -166067 -100102 -9616 6308 -34046 -28532 49591 42082 -7183 59743 137366 154150
26654A54150l7138j04150l3755M6939J6940p9532j34889m079Q9685J24796j9558
$$ 154150 117012 12862 -20893 26046 42986 -36546 -171435 -175514 -85829 38967 19409
26643A9409j86194q8132P3282J02979J19977M7380r0120o0611K9808O7655J3452
$$ 19409 -166785 -254917 -181635 -78656 41321 88701 -1419 -62030 -32222 35433 48885
26632D8885p1493m9662l372J05884N5038j05401m9789O6004O5235r2728m839J14157
$$ 48885 -22608 -72270 -75642 30242 85280 -20121 -69910 -3906 61329 -31399 -36238 77919
26620G7919L4982o2836n9472n1657k574k2401P925P3127r538r1464n1044N9392
$$ 77919 112901 50065 -9407 -61064 -63638 -86039 -78114 -4987 -14525 -105989 -157033 -97641
26608i7641j7544L1311K1794q809Q2711k1127o8012O5214J2883Q4205L1549j8552
$$ -97641 -115185 -83874 -62080 -70889 11822 -9305 -77317 -12103 780 84985 116534 97982
26596I7982j1707j1406K1482J5765J9231m2016p5021j8685M4133N477O3l1857
$$ 97982 86275 74869 96351 112116 131347 89331 14310 -4375 39758 45235 45298 13441
26584A3441p8469K1769K9408n672q0899K8003J7323j0425p0486N6555Q7427J3437
$$ 13441 -65028 -43259 -13851 -19523 -100422 -72419 -55096 -65521 -136007 -79452 7975 21412
26572B1412k7393q6215J65634R8258j02210j44339K4347O8453Q9822P531L8267
$$ 21412 -5981 -92196 73438 171696 69486 -74853 -50506 17947 107769 115300 153567
26561A53567K6315m2176n9823N1969n6284p8749N0568N7270o5858n5674J9820
$$ 153567 179882 137706 77883 129852 73568 -5181 45387 102657 36799 -18875 945
26550I45q5385m4128P2473J11855n213n3531R2559Q6195k8411J1411n6687o1949
$$ 945 -84440 -128568 -56095 55760 50547 -2984 89575 175770 147359 158770 102083 40134
26538D0134j9220O269p598k7096L1321l0073L1354L6990r7570l9722K8632J9847
$$ 40134 20914 27183 19585 -7511 23810 -6263 25091 62081 -35489 -75211 -46579 -26732
26526b6732n6552m044O3831J4365q3781K9869l0452J3125K4276k2093J0090q912
$$ -26732 -83284 -87328 -23497 -9132 -92913 -63044 -93496 -80371 -56095 -78188 -68098 -77010
26514g7010L2468P804j0878o320J5137n7645l9416O5814J03812M6367K514k3353
$$ -77010 -44542 -36738 -47616 -53936 -38799 -96444 -135860 -70046 33766 80133 82647 59294
26502E9294m3814m3357J5985n9602M6112O8183M3253R629k1613j5307n4925L333
$$ 59294 15480 -27877 -11892 -71494 -25382 42801 86054 95683 74070 58763 3838 7171
26490G171M3758p001L7984m4541q536j5869p4985j4822j6306O6172O8435m2467
$$ 7171 50929 43928 81912 37371 28835 12966 -62019 -76841 -93147 -26975 41460 -1007
26478a007K4241j6611l0002m1885M9756l9215J0424J19538Q7030k9514j08945
$$ -1007 23234 6623 -23379 -65264 -15508 -54723 -44299 75239 162269 132755 23810
26467B3810o9169l2229m145j2127M9451M158K444K2488j9536j3316k4434j095
$$ 23810 -45359 -77588 -81733 -93860 -44409 -40251 -37807 -15319 -34855 -48171 -72605 -73700
26455g3700O3159M4135L512K5875L0229j1151J2584N223P3675N285m966K9127
$$ -73700 -10541 33594 37106 62981 93210 82059 94643 99866 173541 178826 173860 202987
26443B02987m3656o2168l906m279k5971o6720o3377M4984Q652q49M0710m0852
$$ 202987 159331 97163 93257 88978 63007 -3713 -67090 -22106 -13454 -14303 26407 -14445
26431a4445J01839O9902m0256L7885r138k0234K6447K3180k0243p4546j36995
$$ -14445 87394 157296 117040 154925 145787 125553 152000 175180 154937 80391 -56604
26420e6604r5803J2325J60251q5309q1774N335P3332O9626l8224l264k3805p718
$$ -56604 -152407 -140082 20169 -65140 -146914 -141579 -68247 1379 -36845 -40109 -63914 -71632
26408g1632n674N1359N0737k9127l2828m3144m6409R1754J23614o0333p2627K4977
$$ -71632 -77306 -25947 24790 -4337 -37165 -80309 -126718 -34964 88650 28317 -44310 -19333
26396a9333M1577Q580J939M8312K2858o5488j28330N801Q0867M7384Q7604p9793
$$ -19333 22244 30824 32763 81075 103933 38445 -89885 -84084 -3217 44167 131771 51978
26384E1978n5767M8066P1710K2440k7931k0793J967J9660O4041k6095K1452M8526
$$ 51978 -3789 44277 115987 138427 110496 89703 91670 111330 175371 149276 170728 219254
26372B19254n1391J1951m9644n5358o3803q214k9345r5003L076j815J2060K387
$$ 219254 167863 179814 130170 74812 11009 2795 -26550 -121553 -118477 -120292 -108232 -105845
26360a05845J09675Q4323j21184p472r170R914O5878J2181P9288m1770m5765J4598
$$ -105845 3830 88153 -33031 -40503 -49673 -39759 26119 38300 117588 75818 30053 44651
26348D4651K6979k9961o8688M107M2030L7875R933l5900j2483o5323k8451M2877
$$ 44651 71630 41669 -27019 -22912 19118 56993 66926 31026 18543 -46780 -75231 -32354
26336c2354J6252k2826p406P8568O3988j3290p0174n0008n8033Q8724P7356m5381
$$ -32354 -16102 -38928 -46334 32234 96222 82932 12758 -37250 -95283 -6559 70797 25416
26324B5416M3256k5540n7023m5134J3899K2083n4597k9338p1840k49n12n9550
$$ 25416 68672 43132 -13891 -59025 -45126 -23043 -77640 -106978 -178818 -179067 -179579 -239129
26312b39129Q5236P8484L2419J3490O2496m8669R4834N7670K1356n8608n6418
$$ -239129 -153893 -75409 -42990 -29500 32996 -15673 79161 136831 158187 99579 43161
26301D3161j3497N5279M1257L8730K8291L7021m2311j49176j7967p3815O3983
$$ 43161 29664 84943 126200 164930 193221 230242 187931 38755 20788 -53027 10956
26290A0956L9497q0168j0496N5633o7521j28921M3686N1510K009k6292K5695j8607
$$ 10956 50453 -29715 -40211 15422 -52099 -181020 -137334 -85824 -83815 -110107 -84412 -103019
26278a03019O076J06183N4884m3672l4046O1684o4110K463o7365M359L6064k9395
$$ -103019 -96943 9240 64124 20452 -13594 48090 -16020 -13557 -80922 -76563 -40499 -69894
26266f9894L2385l8591R1059O3582j16410r040J9196J8643O5253p0258j7969p994
$$ -69894 -37509 -76100 14959 78541 -37869 -46909 -27713 -9070 56183 -14075 -32044 -40038
26254d0038J3822l7380M471L3994L9780K3933M7329j01283j30183J0181Q7348
$$ -40038 -26216 -63596 -59125 -25131 14649 38582 85911 -15372 -145555 -135374 -48026
26243d8026L8681K797n8769K6764L3211j3652M1293j6456r792l9854L8581N4348
$$ -48026 -9345 -6548 -65317 -38553 -5342 -18994 22299 5843 -3949 -43803 -5222 49126
26231D9126J8951l0585o3941m216N6442P1611P1727M6962j36451k7049J4297q6561
$$ 49126 68077 37492 -26449 -30665 25777 97388 169115 216077 79626 52577 66874 -19687
26219a9687J1683R5236o8989j13898M4020J19367l7281m850L2037p9188L1310
$$ -19687 -8004 87232 18243 -95655 -51635 67732 30451 25601 57638 -21550 9760
26208I760M3780L4958j44870J3857J18730M5270q1191K3285L3389Q5516M5510
$$ 9760 53540 88498 -56372 -42515 76215 121485 40294 63579 96968 182484 227994
26197B27994j29608n4585P6474M2108m1514m2120k0530N852k753j0558j5799j18473
$$ 227994 98386 43801 120275 162383 120869 78749 58219 64071 61318 50760 34961 -83512
26185h3512N6584P332j46215P3780M9807L8018M4078l8761K8046O6492Q2887q8006
$$ -83512 -26928 -19596 -165811 -92031 -42224 -4206 39872 1111 29157 95649 178536 90530
26173I0530m3258k8249O7942Q9475Q1481n6851j05704Q247m2816j9300N7465j8410
$$ 90530 47272 19023 86965 176440 257921 201070 95366 103613 60797 41497 98962 80552
26161H0552L4451m0197r518J4955M1553l4081o4423N6014J16388J2140p4393n3708
$$ 80552 115003 74806 65288 80243 121796 87715 23292 79306 195694 207834 133441 79733
26149G9733K4757o1918K7680l9185j320l6340L8768J6239j8660j3802k0084k596
$$ 79733 104490 42572 70252 31067 29747 -6593 32175 48414 29754 15952 -4132 -6728
26137f728J6641P9083K2248O872j10577m3212l6461k7339M9703L2667J02749J9134
$$ -6728 9913 88996 111244 118116 7539 -35673 -72134 -99473 -49770 -17103 85646 104780
26125A04780L9668k2757j23233l2989l0534N5196l110j2351j9478j9075J3059
$$ 104780 144448 121691 -1542 -34531 -65065 -9869 -12979 -25330 -44808 -63883 -50824
26114e0824P0436N732J01934m8901j58105k3527J00306M7102l2124k4805N3527
$$ -50824 19612 25344 127278 78377 -79728 -103255 -2949 44153 12029 -12776 40751
26103D0751Q2828K8758L3925o4212o4632n0945p8072o373M9978k4625o9085K0813
$$ 40751 123579 152337 186262 122050 57418 6473 -71599 -77972 -27994 -52619 -121704 -100891
26091a00891J14727L1692j17474l1425O6238J6208P681J7457j0263p4738p6598
$$ -100891 13836 45528 -71946 -103371 -37133 -20925 -13244 4213 -6050 -80788 -157386
26080a57386J0040L0191M5245J8357K8154K5049N1342N9474K9880m5376K926m930
$$ -157386 -147346 -117155 -71910 -53553 -25399 -350 50992 110466 140346 94970 97896 92966
26068I2966n1562N1601O38j4672q0756j0593J4761j3918O3084P6259j2999m9112
$$ 92966 41404 93005 93643 78971 -1785 -12378 2383 -11535 51549 127808 114809 65697
26056F5697m9298K2723m2706L5388M5824L6054p655J7781k5693J2147R375q6539
$$ 65697 16399 39122 -3584 31804 77628 113682 106027 123808 98115 110262 119637 33098
26044C3098n664m8850Q109J2904j5968J8506J8614Q1711j4374k5754p2095J5380
$$ 33098 27434 -21416 -13307 -403 -16371 2135 20749 102460 88086 62332 -9763 5617
26032E617J16199P762L571q8795K2995P6002j7880l707J7180m3101m0419m3234
$$ 5617 121816 129578 133149 44354 67349 143351 125471 121764 138944 95843 55424 12190
26020A2190p7066q8678O8669Q6749O1311r4853l8197J0310m3917J7739O9133r296
$$ 12190 -64876 -153554 -84885 1864 63175 -31678 -69875 -59565 -103482 -85743 -16610 -25906
26008b5906J17895J16805O9331q2364j13343M738J7204k2198J8213O9971K5836
$$ -25906 91989 208794 278125 195761 82418 87156 104360 82162 100375 170346 196182
25997A96182p8693j46626p1078J32906N4525O8465M6401M538o5702q8150j9406
$$ 196182 117489 -29137 -100215 32691 87216 155681 202082 206620 140918 52768 33362
25986C3362o1011o0306K9612K4179M4922R3600O0187J7706J1348j00025m2761
$$ 33362 -27649 -87955 -58343 -34164 10758 104358 164545 182251 193599 93574 50813
25975E0813J5561K9052Q2587o837l9785n7742O5732J15887n4792m0497O402m3206
$$ 50813 66374 95426 178013 171176 131391 73649 139381 255268 200476 159979 166381 123175
25963A23175N2717j7104K6407l7873J03505k4732m9663j17608p2956R6969N3952
$$ 123175 175892 158788 185195 147322 250827 226095 176432 58824 -14132 82837 136789
25952A36789J0055j01561m4329O9906K9426P21J8779K6010O8321j36758j08307
$$ 136789 146844 45283 954 70860 100286 101007 119786 145796 214117 77359 -30948
25941c0948K5296N0119Q7405p0335r5891m0849J3767j80K7833j4494J16570L5231
$$ -30948 -5652 44467 131872 61537 -34354 -75203 -61436 -61616 -33783 -48277 68293 103524
25929A03524M3242j0493j12821k7491L9891j9823J450L7719j4729r8448k1575
$$ 103524 146766 136273 23452 -4039 35852 16029 17479 55198 40469 -57979 -79554
25918g9554J10031l4727j14521J41437O5027M574j47077j13513L9932N1936M0696
$$ -79554 30477 -4250 -118771 22666 87693 92267 -54810 -168323 -128391 -76455 -35759
25907c5759K8352Q8480l8685R089q5601o2643k39p4495M3657J23565J2091K9132
$$ -35759 -7407 81073 42388 51477 -34124 -96767 -97006 -171501 -127844 -4279 7812 36944
25895C6944M6383l4752j6262J14115k5234l1346J2490l992m1581o1758j28375
$$ 36944 83327 48575 32313 146428 121194 89848 102338 98346 56765 -4993 -133368
25884a33368m0465J34066J25155k1235p0295l3085k7633k3226L8479L3694k3094
$$ -133368 -173833 -39767 85388 64153 -6142 -39227 -66860 -90086 -51607 -17913 -41007
25873d1007m1059n1526l1665j1003K7335o4211O8167J54967Q851j7321j0238k8216
$$ -41007 -82066 -133592 -165257 -176260 -148925 -213136 -144969 9998 18849 1528 -8710 -36926
25861c6926j9957M5665m4592J4045Q61r711n203L5910K6831O0735k9906J55J4498
$$ -36926 -56883 -11218 -55810 -41765 -40904 -50615 -55818 -19908 6923 67658 37752 37907 52405
25848E2405q5866O9917J825L8996K5927K9505P630K7396m6084j27373l1392R4599
$$ 52405 -33461 36456 38281 77277 103204 132709 140339 167735 121651 -5722 -37114 57485
25836E7485J2732p123k7351P0278o0596j01942N9929J61774L4975r3013J8221
$$ 57485 70217 63094 35743 106021 45425 -56517 3412 165186 200161 107148 125369
25825A25369o23K3643p4260j60160J834J01044P4953k1931n5173J910L6818M1364
$$ 125369 124746 148389 74129 -86031 -84197 16847 91800 69869 14696 16606 53424 94788
25813I4788J03018K2919o5512n2748q0546K2736P4688N0217K9627R559q1956m8550
$$ 94788 197806 220725 155213 102465 21919 44655 119343 169560 199187 208746 126790 78240
25801G8240J9184j35838k6327o4720L0379M7146O2449L8028j4357j18687N8956
$$ 78240 97424 -38414 -64741 -129461 -99082 -51936 10513 48541 34184 -84503 -25547
25790b5547k3798J4708J430L7977K2528q3233K8553o261N1493j3706l2828L4674
$$ -25547 -49345 -34637 -33207 4770 27298 -55935 -27382 -33643 17850 4144 -28684 5990
25778E990L5925M1864m3104j3408q8538o572J2284j9135J01321P8629m8522q8888
$$ 5990 41915 83779 40675 27267 -61271 -67843 -55559 -74694 26627 105256 56734 -32154
25766c2154r5544P5536J04417R0193k5950j01769k9239m8495L6565P4420K1964
$$ -32154 -127698 -52162 52255 142448 116498 14729 -14510 -63005 -26440 47980 69944
25755F9944J6171p5450j05379r699J4279K5787o193Q251n3214q6000O1024J19371
$$ 69944 86115 10665 -94714 -104413 -90134 -64347 -70540 -62289 -115503 -201503 -140479 -21108
25743b1108Q8180L786n0898L0010Q0628J1425r6043k7157m6865O9137K4222l3365
$$ -21108 67072 70858 19960 49970 130598 142023 45980 18823 -28042 41095 65317 31952
25731C1952L2991n7552N9170K4314j21448j4439J40497L1156L7441j05107q2563
$$ 31952 64943 7391 66561 90875 -30573 -45012 95485 126641 164082 58975 -23588
25720b3588p9348J6613j991k5614R1279k5899p2955k994M8612O2714M8689J4787
$$ -23588 -102936 -86323 -88314 -113928 -22649 -48548 -121503 -124497 -75885 -13171 35518 50305
25708E0305l1064R2991m9631m6046j5554j4309O5063K1360l2286Q156k3349n2127
$$ 50305 19241 112232 62601 16555 1001 -13308 51755 73115 40829 48985 25636 -26491
25696b6491O4663j5532k0211j6354m6692j8964k7074J20770O0991K5689k8195
$$ -26491 38172 22640 2429 -13925 -60617 -79581 -106655 14115 75106 100795 72600
25685G2600J6104n1812M6232J17077p7735O384Q2356o7140r9768q3990J4578n5065
$$ 72600 88704 36892 83124 200201 122466 128850 211206 144066 44298 -39692 -25114 -80179
25673h0179q0563K3629n548Q3106j717j02988k9111k5497M3406l795p172N7168
$$ -80179 -160742 -137113 -142661 -59555 -61272 -164260 -193371 -218868 -175462 -179257 -186429 -129261
25661a29261P9316J8224M0445K4468n6759M2052O126Q8180J2473M5893L4124o3059
$$ -129261 -49945 -31721 8724 33192 -23567 18485 24611 112791 125264 171157 205281 142222
25649A42222j24227n0176m0955J9888R502K3985M6371O6225o3405j1386N7172
$$ 142222 17995 -32181 -73136 -53248 -43746 -19761 26610 92835 29430 18044 75216
25638G5216l0196r1307l325J16353J2003l7077K6311k0002j15539j5417K3124
$$ 75216 45020 -46287 -49612 66741 78744 41667 67978 47976 -67563 -82980 -59856
25627e9856n2377k6212J13893l1218m4558M9858j077N1485j8859L9250O0344o6303
$$ -59856 -112233 -138445 -24552 -55770 -100328 -50470 -51547 -62 -18921 20329 80673 14370
25615A4370m0910M9145J02657m2975k7760P6138j9857p3446l0164k5422K8296
$$ 14370 -26540 22605 125262 82287 54527 130665 110808 37362 7198 -18224 10072
25604A0072O648n0734K7097M8956p5447r5381q1892L740J26164J73406J2667j3677
$$ 10072 16720 -34014 -6917 42039 -33408 -128789 -210681 -206941 -80777 92629 105296 91619
25592I1619j01429K650J5028r5101P167Q2345m1167L3920J8011n2905O2851J7064
$$ 91619 -9810 -7160 7868 -87233 -80066 2279 -38888 -4968 13043 -39862 22989 40053
25580D0053J1919k1342k7781l1474n1634K9101O9929J3785O64k387J5040M3195
$$ 40053 51972 30630 2849 -28625 -80259 -51158 18771 32556 33220 30833 45873 89068
25568H9068J1847Q4146n7822k4958J6503m3297l89N4775r537p591q6853r7953
$$ 89068 100915 185061 127239 102281 118784 75487 75098 129873 120336 112745 25892 -72061
25556g2061k8839J49195n419j38223k1551K2886J00512N0718L9162J37039o227
$$ -72061 -100900 48295 42876 -95347 -116898 -94012 6500 57218 96380 233419 227192
25545B27192p7721k4422m4885k1458m7690m0343L7518L3121n3547q0655j4729
$$ 227192 149471 125049 80164 58706 11016 -29327 8191 41312 -12235 -92890 -107619
25534a07619J00625J4811o8920Q2603M7474k6832l6937q3216o6718J40804J058
$$ -107619 -6994 7817 -61103 21500 68974 42142 5205 -78011 -144729 -3925 -2867
25523b867q0681K9955O0266J4548r6098k6635J02235M3798l2921L4610r540N5510
$$ -2867 -83548 -53593 6673 21221 -74877 -101512 723 44521 11600 46210 36670 92180
25511I2180N7857K3220r4958r7521L2386L7635j7596j07516l1726n541j7131M3874
$$ 92180 150037 173257 78299 -19222 13164 50799 33203 -74313 -106039 -111580 -128711 -84837
25499h4837J12300j655o9212j1090L3089Q0954j6192k0887n372R2829N7468N4650
$$ -84837 27463 25808 -43404 -54494 -21405 59549 43357 22470 17098 109927 167395 222045
25487B22045m3906J7409M8201j48802q5794M014N2709N0417o3292q5186o6757
$$ 222045 178139 195548 243749 94947 9153 13167 65876 116293 53001 -32185 -98942
25476i8942r819Q3082P8366m1457M1200m6008M8112l6558k9621j3610k3397m8814
$$ -98942 -108761 -25679 52687 11230 52430 6422 54534 17976 -11645 -25255 -48652 -97466
25464i7466O7571L3467N3022k4271Q4441p3395q3936l3531l7741J02337R3865
$$ -97466 -29895 3572 56594 32323 116764 43369 -40567 -74098 -111839 -9502 84363
25453H4363J8704M182L1501M3621L4472n9120p0280m6965p5788O1688M0602L8073
$$ 84363 103067 107249 138750 182371 216843 157723 87443 40478 -35310 26378 66980 105053
25441A05053J32070L5217j32909j33212k8602M3634J45425J13897K9296j31452
$$ 105053 237123 272340 139431 6219 -22383 21251 166676 280573 309869 178417
25431A78417p0778l7109K4047q614j8618l4993j0330L7502N9044l870K6893J4094
$$ 178417 107639 70530 94577 85963 67345 32352 22022 59524 118568 114698 141591 155685
25419A55685r4647j19080L8045L5609j5304l9926k3614O1841K5000o5972m2045
$$ 155685 61038 -58042 -19997 15612 308 -39618 -63232 -1391 23609 -42363 -84408
25408h4408r592Q99N638J6209n655R227L1076R0108K7716j708m3858p6685L4253
$$ -84408 -94000 -93101 -87463 -71254 -76909 -67682 -36606 53502 81218 79510 35652 -41033 -6780
25395f780L0221M0861q714j9368o150o0432P9692p3448m3934k1659J7534L8560
$$ -6780 23441 64302 55588 36220 30070 -30362 49330 -24118 -68052 -89711 -72177 -33617
25383c3617j49847j8712K2740M3983J78260M8520J5441L9520j9949p7769k7286
$$ -33617 -183464 -202176 -179436 -135453 42807 91327 106768 146288 126339 48570 21284
25372B1284L6480J29209R530k138j3548k9889r9385r7992m4908K9761J5143O9336
$$ 21284 57764 186973 196503 194365 180817 150928 51543 -46449 -91357 -61596 -46453 22883
25360B2883L0076P603P6484M2314j5797l9628M3167N2095J6904p2138l0395N0666
$$ 22883 52959 60562 137046 179360 163563 123935 167102 219197 236101 163963 133568 184234
25348A84234K8656J50007m2501j38014m0981J04609j8233m8319q9360n3310M1074
$$ 184234 212890 362897 320396 182382 141401 246010 227777 179458 90098 36788 77862
25337G7862Q2206O532p4241j20127J788K9825r199m6732M8632L4920J2457R0291
$$ 77862 160068 166600 92359 -27768 -25980 3845 -5354 -52086 -3454 31466 43923 134214
25325A34214R4653q7732o4521k73m7960n1863k1992l2869K2183J09180M4553j48341
$$ 134214 228867 141135 76614 76341 28381 -23482 -45474 -78343 -56160 53020 97573 -50768
25313e0768j9671J42191j2260j21744N7367N9375N7173j28539j17649J15212J01523
$$ -50768 -70439 71752 59492 -62252 -4885 54490 111663 -16876 -134525 -19313 82210
25302H2210n1598q5060O0644L7537l436o945L788r796M2723M7187k1567j23470
$$ 82210 30612 -54448 6196 43733 40297 33352 37140 27344 70067 117254 95687 -27783
25290b7783k8541Q0173J3972J65671N0553p0198n0397q6791n0831J9084j16110
$$ -27783 -56324 23849 37821 203492 254045 183847 133450 46659 -4172 14912 -101198
25279a01198K2888P3196P2840N1804N3832m1299j23452M4799m163j5254j5799
$$ -101198 -78310 -5114 67726 119530 173362 132063 8611 53410 49247 33993 18194
25268A8194j4019K8187J9695k2154p2168J0652k3927K1494L3293k145r2984M5933
$$ 18194 4175 32362 52057 29903 -42265 -31613 -55540 -34046 -753 -2898 -95882 -49949
25256d9949P6669O52j7592m4541L2495k080k1804L0320l670M2992Q084k9469k9646
$$ -49949 26720 27372 9780 -34761 -2266 -4346 -26150 4170 500 43492 51576 22107 -7539
25243g539j1822l0686K2673p3820k3697N6732l8166k0001m3318O0185Q5069M1596
$$ -7539 -19361 -50047 -27374 -101194 -124891 -68159 -106325 -126326 -169644 -109459 -24390 17206
25231A7206o753n3566n925P6585Q307L4523M6662K2888q270p7802k8353l5993
$$ 17206 10453 -43113 -49038 27547 35854 70377 117039 139927 131657 53855 25502 -10491
25219a0491M3408N0346M2141j01208n3335L8772Q3563n7684r0504Q940L9221j8207
$$ -10491 32917 83263 125404 24196 -29139 9633 93196 35512 -54992 -46052 -6831 -25038
25207b5038l0132L0546N1966J2246j222J7380n8288J4062J0753m5100k1963n6708
$$ -25038 -55170 -24624 27342 39588 38366 55746 -2542 11520 22273 -22827 -44790 -101498
25195a01498M994m77O6377O1847R2813J11175J3203n8786k997N7630j6155j7588
$$ -101498 -96504 -96981 -30604 31243 124056 235231 248434 189648 186651 244281 228126 210538
25183B10538r7579n7108l5591J7314M5259L0978O8260O7438q670k12116n8943
$$ 210538 112959 55851 20260 37574 82833 113811 182071 249509 240839 28723 -30220
25172c0220Q9605r4421l9175P6077J6837O478j112k0304n692l4544J6674P4886
$$ -30220 59385 -35036 -74211 1866 18703 25181 24069 3765 -1927 -36471 -19797 55089
25160E5089L780p4166M0440J01632p6938l4027j8660L4006m9726j291J35247M3168
$$ 55089 58869 -15297 25143 126775 49837 15810 -2850 31156 -18570 -19861 115386 158554
25148A58554k9671j00142p9413J13748M7691m4440N4444r2138M0012j9644j8620
$$ 158554 128883 28741 -50672 63076 110767 66327 120771 28633 68645 49001 30381
25137C0381l80j21715j0257K1259K483O7788j18872P2748O3179J1090m5568m3791
$$ 30381 30001 -91714 -101971 -80712 -78229 -10441 -129313 -56565 6614 17704 -27864 -71655
25125g1655l5410m3830m4070J45168R1220J4543L6829l8156K9858p0857n2184
$$ -71655 -107065 -150895 -194965 -49797 41423 55966 92795 54639 84497 13640 -38544
25114c8544K2289o0400n176L3003J03866L0925j2400n8533j00937J7923J06616
$$ -38544 -16255 -76655 -81831 -48828 55038 85963 73563 15030 -85907 -67984 38632
25103C8632m1900p5929N8816O562Q6504N1888Q2476J44750j22775j35371M6424
$$ 38632 -3268 -79197 -20381 -13819 72685 124573 207049 351799 229024 93653 140077
25092A40077O896Q9853j0900l4648p4526j58735k7197M4420L9890J8261p4795
$$ 140077 146973 236826 225926 191278 116752 -41983 -69180 -24760 15130 33391 -41404
25081d1404M6669N3622M6605R171p2419P2074N4513o7646j8581l3671j16058l3306
$$ -41404 5265 58887 105492 114663 42244 114318 168831 101185 82604 48933 -67125 -100431
25069a00431K5901K9796n3498q4423P3902J35706J4385L369o897M6583J2872n707
$$ -100431 -74530 -44734 -98232 -182655 -108753 26953 41338 44707 37810 84393 97265 91558
25057I1558o6813k855P0688Q3140M5449m6526j37662o5510n7620J21672J37103
$$ 91558 24745 21890 92578 175718 221167 174641 36979 -28531 -86151 35521 172624
25046A72624o4261r7552j1797n8362j23386J5127R7752J06667L8595L7765q9591
$$ 172624 108363 10811 -986 -59348 -182734 -167607 -69855 36812 75407 113172 23581
25035B3581j06126k3110O9605L5599q3434L2018J688k2890N9232J23832L4930
$$ 23581 -82545 -105655 -36050 -451 -83885 -51867 -50179 -73069 -13837 109995 144925
25024A44925r731L3883N0038j07046o4718j08851K2107Q4922Q0548J4722K5114
$$ 144925 135194 169077 219115 112069 47351 -61500 -39393 45529 126077 140799 165913
25013A65913o3397r0026j8531J22998L7376m8659k2049k1447P7096L6034j24291
$$ 165913 102516 12490 -6041 116957 154333 105674 83625 62178 139274 175308 51017
25002E1017m8572M3906k4682k2929j8494K3333N9640L7581L4511l2874m3317K2891
$$ 51017 2445 46351 21669 -1260 -19754 3579 63219 100800 135311 102437 59120 82011
24990H2011L2435q761J8401l6492o9844m8538m7722n2742m291l2497K4702R4444
$$ 82011 114446 105685 124086 87594 17750 -30788 -78510 -131252 -135543 -168040 -143338 -48894
24978d8894m2914k496R8599O9326Q2385l9235q2418l6131j6760M6038k4430L5906
$$ -48894 -91808 -94304 4295 73621 156006 116771 34353 -1778 -18538 27500 3070 38976
24966C8976L5013J784m8244m7666k5950l2970Q1747J6205J3972O5375j5746j7103
$$ 38976 73989 75773 27529 -20137 -46087 -79057 2690 18895 32867 98242 82496 65393
24954F5393o752n263K1647Q556j5683O3574q7603p1527m9159k757Q3475O2725
$$ 65393 58641 53378 75025 83581 67898 131472 43869 -27658 -76817 -79574 3901 66626
24942F6626J6981o8233J5861k738J6823M6270M882k729j1184k2541q877p6770
$$ 66626 83607 15374 31235 28497 45320 91590 96472 93743 82559 60018 51141 -25629
24930b5629j28295m0177N4422O7496n496m7247K9360N8486J29833R7266p0162
$$ -25629 -153924 -194101 -139679 -72183 -77679 -124926 -95566 -37080 92753 190019 119857
24919A19857l6087j5499j0911j2556p2983j22819L9345J14427J308M8524k5790
$$ 119857 83770 68271 57360 44804 -28179 -150998 -111653 2774 4082 52606 26816
24908B6816L2644p7536l0097Q7567k9592M1812j1591L5662J5248q2989L5934M2557
$$ 26816 59460 -18076 -48173 39394 9802 51614 40023 75685 90933 7944 43878 86435
24896H6435Q3728m4658j33007j4020j2194r4252m0576j7103L2425M5597j1993
$$ 86435 170163 125505 -7502 -21522 -33716 -127968 -168544 -185647 -153222 -107625 -119618
24885a19618L6289K527L7576L3195L1390N1037N0808l3570j18357K257N6627n7054
$$ -119618 -83329 -80802 -43226 -10031 21359 72396 123204 89634 -28723 -26466 30161 -26893
24873b6893j33658P382J6726N6770K8197P0262M2867j1454m0155K6597q9328r1270
$$ -26893 -160551 -153169 -136443 -79673 -51476 18786 61653 50199 10044 36641 -52687 -143957
24861a43957J12447N9841M3527m248Q7561k294j09881q2623r6956M5580R8701
$$ -143957 -31510 28331 71858 67610 155171 152877 42996 -39627 -136583 -91003 7698
24850G698k1016j1078M0875O3353N8597p4729n8396m1458L8348l3478k5413l5873
$$ 7698 -13318 -24396 16479 79832 138429 63700 5304 -36154 2194 -31284 -56697 -92570
24838i2570L8245j00n9358j9065M5417J01374Q9820j06776j42263Q1287J05828
$$ -92570 -54325 -54425 -113783 -132848 -87431 13943 103763 -3013 -145276 -63989 41839
24827D1839j04908O6823p978P9776K5188K1838K7990r4414j17301J0921P8663
$$ 41839 -63069 3754 -4224 75552 100740 122578 150568 56154 -61147 -50226 28437
24816B8437J03835J5567j4822l8552q2983j0895K6276O7970k5148r2823j9749
$$ 28437 132272 147839 133017 94465 11482 587 26863 94833 69685 -23138 -42887
24805d2887R8979O6716n6843J7241O3559N1414j3894p7147j55176j79618P2566
$$ -42887 56092 122808 65965 83206 146765 198179 184285 107138 -48038 -227656 -155090
24794a55090J62399J26032O0602j4857m8569q5440j4748L6646l4417k1140L3753
$$ -155090 7309 133341 193943 179086 130517 45077 30329 66975 32558 11418 45171
24783D5171J0089l6377N8866K2423k9162q5120j4833L624l1544M392k5489O0822
$$ 45171 55260 18883 77749 100172 71010 -14110 -28943 -25319 -56863 -52471 -77960 -17138
24771a7138L755j1709O2498K9959l0037l1635J7865O3698j31047j38026N6068
$$ -17138 -13383 -25092 37406 67365 37328 5693 23558 87256 -43791 -181817 -125749
24760a25749J08468J43746O9100o2234o4470k2808K0457K0424M3346n595o0602
$$ -125749 -17281 126465 195565 133331 68861 46053 66510 86934 130280 124685 64083
24749F4083J4297J7087l8780m4790P459N6072m185n2921L583P1881p1696o4754
$$ 64083 78380 95467 56687 11897 19356 75428 71243 18322 21905 93786 22090 -42664
24737d2664M3596K6023J4841N222M8390j29840K4445J40848j7268o0958l8216
$$ -42664 932 26955 41796 47018 95408 -34432 -9987 130861 113593 52635 14419
24726A4419O09l546R670O2158L4454l7705n5394P4500M6889M9455n9919m7521
$$ 14419 15028 11482 21152 83310 117764 80059 24665 99165 146054 195509 135590 88069
24714H8069n4383P556p141o035n4201P226q076p7634m3175J09400P4980Q711L4156
$$ 88069 33686 41242 34101 28066 -26135 -18909 -26985 -104619 -147794 -38394 36586 45297 79453
24701G9453q5368k0786L7413j9506J2554p7605q3701M2061N6527K2215q595J4925
$$ 79453 -5915 -26701 10712 -8794 3760 -73845 -157546 -115485 -58958 -36743 -45338 -30413
24689c0413l8145M1553l8157j7945J1124L3361M2852O0383K1986j1999k3534j52100
$$ -30413 -68558 -27005 -65162 -83107 -71983 -38622 4230 64613 86599 74600 51066 -101034
24677a01034j31063L8847O8427L3173J1284L879p062N5507P0410k7731P8525p11
$$ -101034 -232097 -193250 -124823 -91650 -80366 -76487 -83549 -28042 42368 14637 93162 92451
24665I2451L6520K5743o7112r2234Q326q1753o8442N8353j00188m7075J14239
$$ 92451 128971 154714 87602 -4632 3694 -78059 -146501 -88148 -188336 -235411 -121172
24654a21172K861J8138J25748J8384M811j1508R301J5538o646o7695o2002M3294
$$ -121172 -118311 -100173 25575 43959 48770 37262 46563 62101 55455 -12240 -74242 -30948
24642c0948n0864l4256m9232N720K0690j844P8771m0600K7687P023Q2206j37143
$$ -30948 -81812 -116068 -165300 -159580 -138890 -140734 -61963 -102563 -74876 -67853 14353 -122790
24630a22790q2246J0363k893O9947O7868p2247k5469L8025M998J3885m4205L7840
$$ -122790 -205036 -194673 -197566 -127619 -59751 -131998 -157467 -119442 -114444 -100559 -144764 -106924
24618a06924N835J126j377o7772Q1185R9170M3088K2225n5227n285O5749L3762
$$ -106924 -101089 -99963 -101340 -169112 -87927 11243 54331 76556 21329 16044 81793 115555
24606A15555m0116p2366O371Q6234R32j07518j31501l922J9487j1785j8429o688
$$ 115555 75439 3073 9444 95678 96610 -10908 -142409 -146331 -126844 -138629 -157058 -163746
24594a63746K8807K1644l591J01228N5785J1669l0407o6354J4067L8679M6376
$$ -163746 -134939 -113295 -116886 -15658 40127 51796 21389 -44965 -30898 7781 54157
24583E4157R9324p1203k9053N0801P629k5128J8628m883k720l5983j3571N7686
$$ 54157 153481 82278 53225 104026 111655 86527 105155 100272 97552 61569 47998 105684
24571A05684p51j8033m5328m0382m4565l4355j3784l4539K9288J64674K1494j8185
$$ 105684 104933 86900 41572 1190 -43375 -77730 -91514 -126053 -96765 67909 89403 71218
24559G1218j8196o857l2341p6963n7962L8206p573J562O9837R8751j7781L6339
$$ 71218 53022 46165 13824 -63139 -121101 -82895 -90468 -88906 -19069 79682 61901 98240
24547I8240l2224J2116O512K59p5423n2724J041J0967m6130J6107J3541o784K5881
$$ 98240 66016 78132 84644 84903 9480 -43244 -42203 -31236 -77366 -61259 -47718 -54502 -28621
24534b8621l871l1514K2538l7979R802k5794J8447J31157O5201J0392O7956p916
$$ -28621 -32492 -64006 -41468 -79447 -69645 -95439 -76992 54165 119366 129758 197714 189798
24522A89798m2614K229R471j187L170q3010p6181p0927N7462K8847N1547J07326
$$ 189798 147184 149413 158884 157697 160867 77857 1676 -69251 -11789 17058 68605 175931
24510A75931J00328n7775o5992j0507l204j01724q5120k0761j24200M8258O2719
$$ 175931 276259 218484 152492 141985 138781 37057 -48063 -68824 -193024 -144766 -82047
24499h2047j4461O2284Q522J04095J19495O303O3274r6139j84656k5337L6150
$$ -82047 -96508 -34224 -25702 78393 197888 204191 267465 171326 -13330 -38667 -2517
24488b517r5368M3296M9315L1579j06356M5023P4752M5617J9819r546K3979k319
$$ -2517 -97885 -54589 -5274 26305 -80051 -35028 39724 85341 105160 95614 119593 117274
24476A17274j7234M5004K2811p0476r8496p1619K9649Q180O1397k0209n2490p1480
$$ 117274 100040 145044 167855 97379 -1117 -72736 -43087 -34907 26490 6281 -46209 -117689
24464a17689K8208Q3188M5296n6074O6766Q8138K2696N1859n9564k5525l9169
$$ -117689 -89481 -6293 39003 -17071 49695 137833 160529 212388 152824 127299 88130
24453H8130l0183l3239M8454N2516l1886l4088n9570l7649J1742K5420O7949l3832
$$ 88130 57947 24708 73162 125678 93792 59704 134 -37515 -25773 -353 67596 33764
24441C3764m231j53720n9577J25833L7790K9963N8224J7438m8897m5720O9817
$$ 33764 29533 -124187 -183764 -57931 -20141 9822 68046 85484 36587 -9133 60684
24430F0684o8631o9505J6271l3495k4072L1296N281M863O1164m1467L4344K2693
$$ 60684 -7947 -77452 -61181 -94676 -118748 -87452 -82171 -77308 -16144 -57611 -23267 -574
24418e74l1065q233n3234J3207J2270J02062L1016o5L12m4390p6455l8427J31636
$$ -574 -31639 -39872 -93106 -79899 -67629 34433 65449 65384 65696 21306 -55149 -93576 38060
24405C8060L9407r2759q9656Q7306R6065N2831o7340m7043k9659L439M9279M7202
$$ 38060 77467 -15292 -104948 -17642 78423 131254 63914 16871 -12788 -9349 39930 87132
24393H7132q0661l2163m313J13223J9578r7058J8563p109M1072O6306M1376r9431
$$ 87132 6471 -25692 -30005 83218 102796 5738 24301 17192 58264 124570 165946 66515
24381F6515o696M1154p8132k1350l3402j12919m3607q24J3832k5373L0029M3253
$$ 66515 59819 100973 22841 1491 -31911 -144830 -188437 -189261 -175429 -200802 -170773 -127520
24369a27520J44793O2249n6654q2475L4651J15999O9978j16022m5851Q3246Q4744
$$ -127520 17273 79522 22868 -59607 -24956 91043 161021 44999 -852 82394 167138
24358A67138o3631j6735J3936j8843j9442m3727m5473l8998M1176N4049l2264
$$ 167138 103507 86772 100708 81865 62423 18696 -26777 -65775 -24599 29450 -2814
24347b814l4410M238J4388j8640j0689m6580K0567P7224m8291n5308L3040j26514
$$ -2814 -37224 -32986 -18598 -37238 -47927 -94507 -73940 3284 -45007 -100315 -67275 -193789
24335a93789j03758N1705O0678N7646J58673O7700m0667m7744m3696K9625j1611
$$ -193789 -297547 -245842 -185164 -127518 31155 98855 58188 10444 -33252 -3627 -15238
24324a5238K7511J18895J1815L16K8952O0924n6381j52009j55785k832P8252N9254
$$ -15238 12273 131168 142983 143299 172251 233175 176794 24785 -131000 -133832 -55580 3674
24312C674L8129J11303r6186j0291L9219j5713j0111K2794j930K096P8733K7005
$$ 3674 41803 153106 56920 46629 85848 70135 60024 82818 80888 82984 161717 188722
24300A88722p7322o1321J2561K4025L0575N5032p767m5395N160O7352k7621l3882
$$ 188722 111400 50079 62640 86665 117240 172272 164505 119110 124270 191622 164001 130119
24288A30119j29717K2420R5459N2580j5881m8071p8358n1193L6738n9868O6879
$$ 130119 402 22822 118281 170861 154980 106909 28551 -22642 14096 -45772 21107
24277B1107Q4204k3650q2095N2603J08513m5959j5483n6222L5389K2586m2773
$$ 21107 105311 81661 -434 52169 160682 114723 99240 43018 78407 100993 58220
24266E8220r9063j1296m6985N639n2155M8070J57354n8847J4023m3673o2543o029
$$ 58220 -40843 -52139 -99124 -93485 -145640 -97570 59784 937 14960 -28713 -91256 -97285
24254i7285K5535J17462O9404j07149l1900L7083L7476j0437q0019p2555N4132
$$ -97285 -71750 45712 115116 7967 -23933 13150 50626 40189 -39830 -112385 -58253
24243e8253n53K3693j5505N1216N6507K7999R4341r7732p7381j25791m790J09198
$$ -58253 -58806 -35113 -50618 598 57105 85104 179445 81713 4332 -121459 -126249 -17051
24231a7051K9913L7346n5112n086O7077J8336j9191p98m4831J6964J13951J91
$$ -17051 12862 50208 -4904 -9990 57087 75423 56232 55434 10603 27567 141518 141709
24219A41709L929n1515m8379J12810n5528j14242l3918l7835m2706J1056K7130
$$ 141709 145638 94123 45744 158554 103026 -11216 -45134 -82969 -125675 -114619 -87489
24208h7489L1244P8099r6674K9298M3780k6968P821J02391L3764M2932n1195m178
$$ -87489 -56245 21854 -74820 -45522 -1742 -28710 -20889 81502 115266 158198 107003 102825
24196A02825N6960K2328k0047L4321j30636j51339q7031m1198J63938Q7432K756
$$ 102825 159785 182113 162066 196387 65751 -85588 -172619 -213817 -49879 37553 40309
24185D0309L1869L3299p8707L2839N2068j01044j44382J00728J10199j7414l2241
$$ 40309 72178 105477 26770 59609 111677 10633 -133749 -33021 77178 59764 27523
24174B7523L4178L9933l7182n0415k0831P7877p5685O3475P4193M3195r6318p2465
$$ 27523 61701 101634 64452 14037 -6794 71083 -4602 58873 133066 176261 79943 7478
24162G478m1099n5185J3453R6917l2810o4996M2410J33930k4053j01347p2279
$$ 7478 -33621 -88806 -75353 21564 -11246 -76242 -33832 100098 76045 -25302 -97581
24151i7581l1833P3295N2063M2417J07636o0397m0560M7717N7071r5177r7844
$$ -97581 -129414 -56119 -4056 38361 145997 85600 45040 92757 149828 54651 -43193
24140d3193l7416p1304m6701O5246N0538o1584Q4383M6514K2416M3132o8354J3944
$$ -43193 -80609 -151913 -198614 -133368 -82830 -144414 -60031 -13517 8899 52031 -16323 -2379
24128b379P0832m9129P223M4818o3600m2878r8265l52J17337O1899M0487k9952
$$ -2379 68453 19324 26547 71365 7765 -35113 -133378 -133730 -16393 45506 85993 56041
24116E6041j4672M4844m1488m0632J5618P5509P7008L151j3693J9913p9096r6055
$$ 56041 41369 86213 44725 4093 19711 95220 172228 175379 161686 181599 102503 6448
24104F448l2204n4301Q6847J82402M8574J0067p5828j90438m7576L1400L3576
$$ 6448 -25756 -80057 6790 189192 237766 247833 172005 -18433 -66009 -34609 -1033
24093a033P1857m3911j9114J20340Q4250j21731q5319N3011J2664L1800m3877
$$ -1033 70824 26913 7799 128139 212389 90658 5339 58350 71014 102814 58937
24082E8937k5160M1869L67j50354n3237M6618k373Q7458L1524p7964l84K1659
$$ 58937 33777 75646 76013 -74341 -127578 -80960 -83333 4125 35649 -42315 -42699 -21040
24070b1040P028Q1421M4511Q8449k8741j4048k0625l1437L1725o671K6546J1664
$$ -21040 -14012 67409 111920 200369 171628 157580 136955 105518 137243 130572 157118 168782
24058A68782o5428N5047N3328n4353o9673j8173r0122O0607K5561O3270M619m2844
$$ 168782 103354 158401 211729 157376 87703 69530 -20592 40015 65576 128846 133465 90621
24046I0621j11134j2141P899L5094L9511Q272J2515M4172m5585j13344k9635r2508
$$ 90621 -20513 -32654 -24755 10339 49850 58122 70637 114809 69224 -44120 -73755 -166263
24034a66263l4702J4885R6335J7140J3065N8620L9321j8968M1431M9156M4909
$$ -166263 -200965 -186080 -89745 -72605 -59540 -920 38401 19433 60864 110020 154929
24023A54929r064q431p7477o0374m379j0875O8855j9999K0941n902j8043q4151
$$ 154929 145865 137434 59957 -417 -4796 -15671 53184 33185 54126 48224 30181 -53970
24011e3970m3480Q033k7630J0104P2925M1692k6056k5583l6082N2312K3913L5537
$$ -53970 -97450 -89417 -117047 -106943 -34018 7674 -18382 -43965 -80047 -27735 -3822 31715
23999C1715L7690J4957K0919m3127j5810o1205L1017r268l6120Q2254K304k2093
$$ 31715 69405 84362 105281 62154 46344 -14861 16156 6888 -29232 53022 55326 33233
23987C3233r9072j33245Q8361M3250L0868m4405P1900P5492k779n1811j9024j5439
$$ 33233 -65839 -199084 -110723 -67473 -36605 -81010 -9110 66382 63603 11792 -7232 -22671
23975b2671o0005p8837K7833J18515J08072L4650l1776Q22q6605J5099r1N6649
$$ -22671 -82676 -161513 -133680 -15165 92907 127557 95781 96603 9998 25097 25006 81655
23963H1655n4673n1268k7907l7445L8207l6612k9139N6204l5024o3873k6299J2770
$$ 81655 26982 -24286 -52193 -89638 -51431 -88043 -117182 -60978 -96002 -159875 -186174 -173404
23951a73404J6607R7873k5113j6648O8843k2618P9442K7305j6510J1072j5335
$$ -173404 -156797 -58924 -84037 -100685 -31842 -54460 24982 52287 35777 46849 31514
23940C1514P0233r387J5358k2711j1700k8650l5625L9117N8976K7039l4407K7111
$$ 31514 101747 92360 107718 85007 73307 44657 9032 48149 107125 134164 99757 126868
23928A26868J7229j05298p7376j2529J0229Q4625N2985n4728q4953r6859j43300
$$ 126868 144097 38799 -38577 -51106 -40877 43748 96733 42005 -42948 -139807 -283107
23917b83107Q6157Q5593Q2057j9265n9995L0017L826N201M5668K2110q763M2026
$$ -283107 -196950 -111357 -29300 -48565 -108560 -78543 -74717 -69516 -23848 -1738 -10501 31525
23905C1525O2396O4339j880O2796k3880r9739l0451n165J0306m2381J1417j6993
$$ 31525 93921 158260 156380 219176 195296 95557 65106 59941 70247 27866 39283 22290
23893B2290p5810j2375Q0900O198k1946r88l2337M8674m035m0161j3773P7052
$$ 22290 -53520 -65895 15005 21203 -743 -1731 -34068 14606 10571 -29590 -43363 33689
23881C3689O1403K1817j9720N8521J3605l8380k2230n4530M846k8939P7490N340
$$ 33689 95092 116909 97189 155710 169315 130935 108705 54175 59021 30082 107572 112912
23869A12912o2684L5177L369r6452K6014m2251m5481Q4528Q1250p2808j5701M3399
$$ 112912 50228 85405 88774 -7678 18336 -23915 -69396 15132 96382 23574 7873 51272
23857E1272J6071p3919p6443j3505K9308p9683l4052o63Q162o798Q0446J07253
$$ 51272 67343 -6576 -83019 -96524 -67216 -146899 -180951 -181614 -173452 -180250 -99804 7449
23845G449K8286K8975m9501o5580L6209L0577l4333N6360j8741l6429Q8601K6907
$$ 7449 35735 64710 15209 -50371 -14162 16415 -17918 38442 19701 -16728 71873 98780
23833I8780Q2381k0872j30316n7433m4633P712Q8837m1947N9789j7579l5289P1490
$$ 98780 181161 160289 29973 -27460 -72093 -64381 24456 -17491 42298 24719 -10570 60920
23821F0920P2434O239q2249m6306j4731J5235Q656n5736l2233K1170q6325l8774
$$ 60920 133354 139593 57344 11038 -3693 11542 20198 -35538 -67771 -46601 -132926 -171700
23809a71700N536R7469j9524K4145O9337L3111l7549K8743K2911j3173J21983
$$ -171700 -166164 -68695 -88219 -64074 5263 38374 825 29568 52479 39306 161289
23798A61289L2446o1401k1372l8207p4545K5253L973l7911J1787n2488r0071R81
$$ 161289 193735 132334 110962 72755 -1790 23463 27436 -10475 1312 -51176 -141247 -140266
23786a40266k731K5493Q5217N0673m5511j13458l822J25307N6556j9262J2747
$$ -140266 -142997 -117504 -32287 18386 -27125 -140583 -144405 -19098 37458 18196 30943
23775C0943K4680j22825j1505n9766l1684N3132k3836q942N8297Q6627K0196K6032
$$ 30943 55623 -67202 -78707 -138473 -170157 -117025 -140861 -149803 -91506 -4879 15317 41349
23763D1349n2891j7190j5123k6483j04528l2357J15897J19475O4234M1120o4450
$$ 41349 -11542 -28732 -43855 -70338 -174866 -207223 -91326 28149 92383 133503 69053
23752F9053n391J149m4352r5133n8888M8911l7275O3443J1180q0460k9113K0716
$$ 69053 63662 64811 20459 -74674 -133562 -84651 -121926 -58483 -47303 -127763 -156876 -136160
23740a36160O5069M8235P5357J4154N842n5547p4552n4567Q0186o537K0080Q2119
$$ -136160 -71091 -22856 52501 66655 72497 16950 -57602 -112169 -31983 -38520 -18440 63679
23728F3679N5064k820o6865m2244j3635m3854R1532m0073O370N3084j4240r4363
$$ 63679 118743 115923 49058 6814 -6821 -50675 40857 784 7154 60238 45998 -48365
23716d8365J5058k5035K590K5921J24919k8078m0902L5132N097o2041q9598P0076
$$ -48365 -33307 -58342 -55752 -29831 95088 67010 26108 61240 66337 4296 -85302 -15226
23704a5226J9431k8947O9604m9206K7085o3924o5177O4145J17008R8718R146l0066
$$ -15226 4205 -24742 44862 -4344 22741 -41183 -106360 -42215 74793 173511 182657 152591
23692A52591j8042o0513o86N5967k0635k4650n8220m2357k0751p8827J9243J3420
$$ 152591 134549 74036 73350 129317 108682 84032 25812 -16545 -37296 -116123 -96880 -83460
23680h3460J4379O3390O6504J2734q688L4519k7841p7948q4132n2967L4694n8197
$$ -83460 -69081 -5691 60813 73547 64859 99378 71537 -6411 -90543 -143510 -108816 -167013
23668a67013K3176M9260k883R434L5090k346L3297P029m5119q1430K590J9797
$$ -167013 -143837 -94577 -97460 -88026 -52936 -55282 -21985 -14956 -60075 -141505 -138915 -119118
23656a19118K749R8113O4687m6933p3275J4591J36877N7038j8048n9508K8330
$$ -119118 -116369 -18256 46431 -502 -73777 -59186 77691 134729 116681 57173 85503
23645H5503j6121r1663r9798N2681M3118k7356Q8465R7702J3005k8513j08727
$$ 85503 69382 -22281 -122079 -69398 -26280 -53636 34829 132531 145536 117023 8296
23634H296J6659J12209J7495O506J0830p4070J9216P613m7161j6986J3482L3133
$$ 8296 24955 137164 154659 161165 171995 97925 117141 124754 77593 60607 74089 107222
23622A07222k2449o6428j0266N6229j7500p6198k335R1096j0146p9387J6905L0300
$$ 107222 84773 18345 8079 64308 46808 -29390 -31725 59371 49225 -30162 -13257 17043
23610A7043j3144M0306N488J0502k3627o7219L1899m306K1894M9947j1554o3600
$$ 17043 3899 44205 49693 60195 36568 -30651 1248 -3058 18836 68783 57229 -6371
23598f371k9490Q1395J4501m6474K4746M6404J1587O437N716r2066r7650J7549
$$ -6371 -35861 45534 60035 13561 38307 84711 96298 102735 108451 16385 -81265 -63716
23586f3716k5107k3604k5707M2481k1917J02683Q0648l4388m7826j1854L1081
$$ -63716 -88823 -112427 -138134 -95653 -117570 -14887 65761 31373 -16453 -28307 2774
23575B774O0967J3485k6559n6491l4571l6866Q1321K9039m4268n2681M8063L2090
$$ 2774 63741 77226 50667 -5824 -40395 -77261 4060 33099 -11169 -63850 -15787 16303
23563A6303k5357j13748L6958p715K9186K9392Q956l2409O263n5175M1720L5270
$$ 16303 -9054 -122802 -85844 -93559 -64373 -34981 -26025 -58434 -52171 -107346 -65626 -30356
23551c0356n4542O9660N5942o6710l7565K1966K6931N4743J08905K3276o6943
$$ -30356 -84898 -15238 40704 -26006 -63571 -41605 -14674 40069 148974 172250 105307
23540A05307o3800q3456J2971M1463k5658j2653j06885j0546l6790M7821J14888
$$ 105307 41507 -41949 -28978 12485 -13173 -25826 -132711 -143257 -180047 -132226 -17338
23529a7338l3994k1194K8932N7774J1719n4240k2118l1988j1188L1078l8003j5687
$$ -17338 -51332 -72526 -43594 14180 25899 -28341 -50459 -82447 -93635 -62557 -100560 -116247
23517a16247K137M2424O704R0193N4958p4565p8242q869N5319N4650k173J852
$$ -116247 -114110 -71686 -64982 25211 80169 5604 -72638 -81507 -26188 28462 26289 28141
23505B8141O4435o8831q3105P1921L6687j14372l7597j207O1588L4727N354Q9184
$$ 28141 92576 23745 -59360 12561 49248 -65124 -102721 -103928 -42340 -7613 -2259 86925
23493H6925K6132l7911p3058k4782n99J04687N0860o4880k3629R13O9500n2279
$$ 86925 113057 75146 2088 -22694 -23293 81394 132254 67374 43745 44658 114158 61879
23481F1879o9657p1059K7372K2674n4087l6279O6671J25758n1868K1834J4448
$$ 61879 -7778 -78837 -51465 -28791 -82878 -119157 -52486 73272 21404 43238 57686
23470E7686m8764L3934K4581j09766j0819Q4830l6115k5171N5291o0478j01167
$$ 57686 8922 42856 67437 -42329 -53148 31682 -4433 -29604 25687 -34791 -135958
23459a35958P776J14446M3899l0646m1389R17n6587N0575K6794N122M0609o128
$$ -135958 -128182 -13736 30163 -483 -41872 -40955 -97542 -46967 -20173 -15051 25558 19430
23447A9430k4339k0313J1555R0569L5997m4999M3613l9933r4696l6890P5957J13216
$$ 19430 -4909 -25222 -13667 76902 112899 67900 111513 71580 -23116 -60006 15951 129167
23435A29167P9580j5901p1695j4370J6474l525P986J7854k7793J5241m8262j25314
$$ 129167 208747 192846 121151 106781 123255 119730 127716 145570 117777 133018 84756 -40558
23423d0558p7932j3633l0990K0576R8842K6372M0941o471J5860L9125j8512o3099
$$ -40558 -118490 -132123 -163113 -142537 -43695 -17323 23618 17147 33007 72132 53620 -9479
23411i479p798L4223m2765L9446R0545M4647l7057p6688k9193K1611K7764J1824
$$ -9479 -17277 16946 -25819 13627 104172 148819 111762 35074 5881 27492 55256 67080
23399F7080n5075n748L2988J24302m3837j30247q03R6142L9796j4443j6319k2848
$$ 67080 12005 6257 39245 163547 119710 -10537 -11340 84802 124598 110155 93836 70988
23387G0988K1490p3890k6018K5180j07069m6695l360p3026M5783J20268k178o7664
$$ 70988 92478 18588 -7430 17750 -89319 -136014 -139374 -212400 -166617 -46349 -48527 -116191
23375a16191J7969J32933N584q996L9994m283r581k0805n0144o8579o8035J02153
$$ -116191 -98222 34711 40295 31299 71293 67010 57429 36624 -13520 -82099 -150134 -47981
23363d7981Q0018J4001r8339m533n790N7346K0686n8613P88L6227K2822p7480
$$ -47981 32037 46038 -52301 -56834 -62624 -5278 15408 -43205 -42417 -6190 16632 -60848
23351f0848O1561M3780o7803l5014o0172o3004J36791P3146j2256l7822J1193
$$ -60848 713 44493 -23310 -58324 -118496 -181500 -44709 28437 16181 -21641 -10448
23340a0448L1013M0042K9352q157l6906l9156N7641m0365J7031k8047o039O8524
$$ -10448 20565 60607 89959 81802 44896 5740 63381 23016 40047 12000 5961 74485
23328G4485j5630k9797n2849l4915L4337Q0311K0419j504m2035N2915J19471O0097
$$ 74485 58855 29058 -23791 -58706 -24369 55942 76361 74857 32822 85737 205208 265305
23316B65305n7404n1823q1483p6076P146N6945o8364O101P4122k7067j434l0202
$$ 265305 207901 156078 74595 -1481 5665 62610 -5754 347 74469 47402 45968 15766
23304A5766k6675J02217N1541q028r4867q2358O003N5460L1437n9832o8959Q2109
$$ 15766 -10909 91308 142849 134821 39954 -42404 -36401 19059 50496 -9336 -78295 3814
23292C814L7710K4908L0569j0157J5044q2001j7095j0244k3130m5655M1678o0173
$$ 3814 41524 66432 97001 86844 101888 19887 2792 -7452 -30582 -76237 -34559 -94732
23280i4732q1323k2011K7539R3531O5602O134K0540O6740j4244O830j14243j14184
$$ -94732 -176055 -198066 -170527 -76996 -11394 -5260 15280 82020 67776 74606 -39637 -153821
23268a53821N9217L4975M6713J0503n665M8095m5274j9333m7452o0854j8759j597
$$ -153821 -94604 -59629 -12916 -2413 -8078 40017 -5257 -24590 -72042 -132896 -151655 -153252
23256a53252Q757O5182J258N675R5185j502j35172o5642N3771R7746r443M3363
$$ -153252 -144495 -79313 -78055 -72380 22805 21303 -113869 -179511 -125740 -27994 -37437 5926
23244E926L8638r2163j804J4156O6538L3139j4228N1758n2720j4379j1034j02774
$$ 5926 44564 -47599 -49403 -35247 31291 64430 50202 101960 49240 34861 23827 -78947
23232g8947q678J47275Q0652R3030Q348j9891R410j9553j12398K320k9235n2393
$$ -78947 -87625 59650 140302 233332 241680 221789 231199 211646 99248 101568 72333 19940
23220A9940Q0906J7454q7984J216j1313O138O2348J8425r9801M7710M4524j5318
$$ 19940 100846 118300 30316 31532 20219 26357 88705 107130 7329 55039 99563 84245
23208H4245j8160Q851O3319J34444N7358n0830j12021q9417O4169m2142J6131
$$ 84245 66085 74936 138255 272699 330057 279227 167206 77789 141958 99816 115947
23197A15947N298n0068k4911j0833l9803j35968N8271L2521M6773K3056J13585
$$ 115947 121245 71177 46266 35433 -4370 -140338 -82067 -49546 -2773 20283 133868
23186A33868K496L593j609k0087M6311l3766j20750K6269P5703r4301n2789m718
$$ 133868 136364 139957 138348 118261 164572 130806 10056 36325 112028 17727 -35062 -39780
23174c9780K7650J13833n6666p129l8649j3196N8010J01303j3916p6948Q024j0448
$$ -39780 -12130 101703 45037 37908 -741 -13937 44073 145376 131460 54512 62536 52088
23162E2088k1624r6866j6507J1209N9072P365q1487Q4866N9623l6746o1751m8612
$$ 52088 30464 -66402 -82909 -71700 -12628 -5263 -86750 -1884 57739 20993 -40758 -89370
23150h9370J3608n7152O094J14435P2726j9399j4979o970p4333l2320k6361n8492
$$ -89370 -75762 -132914 -126820 -12385 60341 40942 25963 18993 -55340 -87660 -114021 -172513
23138a72513R544p241n479P032L6306L9933J6390R0827L6456K1806j40033J2999
$$ -172513 -162969 -170210 -175689 -168657 -132351 -92418 -76028 14799 51255 73061 -66972 -53973
23126e3973J8817l1311l1346Q2381o533K2865j0199M0302j3961k228Q3504N1767
$$ -53973 -35156 -66467 -97813 -15432 -21965 900 -9299 31003 17042 14814 98318 150085
23114A50085o376p949l1157j51921j00695k0671L6894Q1556l0874M9633K8749
$$ 150085 143709 135760 104603 -47318 -148013 -168684 -131790 -50234 -81108 -31475 -2726
23103b726K6285R0914O0320m7760o4915l5673M7725r5013o8876q4777L957k3603
$$ -2726 23559 114473 174793 127033 62118 26445 74170 -20843 -89719 -174496 -170539 -194142
23091a94142k2558P2121J80217L8747j8197j1652k1245o1680m4016O0273M9135
$$ -194142 -216700 -144579 35638 74385 56188 44536 23291 -38389 -82405 -22132 27003
23080B7003M4472j5718o4431o2493O2237k1358k0058J1163k1085J2218N4007K5599
$$ 27003 71475 55757 -8674 -71167 -8930 -30288 -50346 -39183 -60268 -48050 5957 31556
23068C1556m7942p0937P4765l9253p4322R615J11635M4732J9129R845j560k0496
$$ 31556 -16386 -87323 -12558 -51811 -126133 -116518 -4883 39849 58978 68823 67263 46767
23056D6767N2174P8931q7506j5636J22571m3388j5129j244J9979q3898p1629j2123
$$ 46767 98941 177872 90366 74730 197301 153913 138784 137540 157519 73621 1992 -10131
23044a0131N8367k8586J8790p3325l6255N4784l0403o8887J5117p211P3513k2330
$$ -10131 48236 19650 38440 -34885 -71140 -16356 -46759 -115646 -100529 -107740 -34227 -56557
23032e6557l8217k9824O0723J6483N91Q2403P1133Q7834m0154m5473Q6254M9120
$$ -56557 -94774 -124598 -63875 -47392 -46801 35602 106735 194569 154415 108942 195196 244316
23020B44316J3194q5923q0749l0410L6124R4897j01896j44067p3591l6548K2363
$$ 244316 257510 171587 90838 60428 96552 191449 89553 -54514 -128105 -164653 -142290
23009a42290p858P7582R3749l159N0669J4631k7336J7449L871n8885p334J7463
$$ -142290 -150148 -72566 21183 18024 68693 83324 55988 73437 77308 18423 11089 28552
22997B8552m4420p2673l98O5091O6571m9411l0645Q0432Q2644p1545o7601l0309
$$ 28552 -15868 -88541 -88939 -23848 42723 -6688 -37333 43099 125743 54198 -13403 -43712
22985d3712N0985M953o9275k6234k4J04046m216m3746l4317j9800K2236N0804
$$ -43712 7273 12226 -57049 -83283 -83307 20739 16523 -27223 -61540 -81340 -59104 -8300
22973h300p8144j01314j04998J55217O5237j2764o668R671o4512N039n873O2845
$$ -8300 -86444 -187758 -292756 -137539 -72302 -85066 -91734 -82063 -146575 -141536 -147409 -84564
22961h4564j090L95R9191k559m606n0576j6292O1581L9581l170P210j5222q7207
$$ -84564 -85654 -85259 13932 11373 6767 -43809 -60101 1480 41061 37891 45101 29879 -57328
22948e7328l5333r990J1011K11549Q1281n7118k9927k0450J4298j2831M6911o0087
$$ -57328 -92661 -102651 -91640 119909 201190 144072 114145 93695 107993 95162 142073 81986
22936H1986m5788j72O2463J1413K9318n8768k5565J25214Q059r8575n2843M634
$$ 81986 36198 36026 98489 109902 139220 80452 54887 180101 188160 89585 36742 41376
22924D1376N7425l1504j5724l0718p0101N3907P3320R4742P766j19884N2629J14605
$$ 41376 98801 67297 51573 20855 -49246 4661 77981 172723 180489 60605 113234 227839
22912B27839l8192k2801K8351J04613M6399m1085j0285q3676l2648J23083L38564
$$ 227839 189647 166846 195197 299810 346209 305124 294839 211163 178515 301598 640162
22901F40162K42014K20439L77975L77442L22985K10325l4760j60742p7200k61852
$$ 640162 882176 1102615 1480590 1858032 2181017 2391342 2356582 2195840 2118640 1856788
22891A856788m18312l34120l15955k03583k57000j10370l9007K174K3582J2415
$$ 1856788 1438476 1104356 788401 584818 327818 217448 178441 180615 204197 216612
22881B16612o7755k9619K8075m839j3929N9629l9227o5987q8653J7830L3630j11467
$$ 216612 148857 119238 147313 142474 128545 188174 148947 82960 -5693 12137 45767 -65700
22869f5700o0102K4818P6035J30617K7933P486j03865k4867l1363j6925k3246
$$ -65700 -125802 -100984 -24949 105668 133601 141087 37222 12355 -19008 -35933 -59179
22858e9179m8626j7076l4997j5791N0288R1294M8902n406M3268Q6799K3630j61298
$$ -59179 -107805 -124881 -159878 -175669 -125381 -34087 14815 9409 52677 139476 163106 1808
22846A808m1323J984N7325J06578L962L0809J5180o7991k1012j808J8879P5878
$$ 1808 -39515 -37531 19794 126372 130334 161143 176323 108332 87320 85512 104391 180269
22834A80269j7209M9317j5480k8575m9847r9978l6701k1851m5957P8990M5739
$$ 180269 163060 212377 196897 168322 118475 18497 -18204 -40055 -86012 -7022 38717
22823C8717o1508L2291l0885J4972O0593p3745L1478Q5552R5011K7799K0999j07938
$$ 38717 -22791 9500 -21385 -6413 54180 -19565 11913 97465 192476 220275 241274 133336
22811A33336r9638K2024R1481o2742q1K2725k995k3930o2757l9362Q143K6927
$$ 133336 33698 55722 147203 84461 84380 107105 104110 80180 17423 -21939 -13796 13131
22799A3131L3399r4834k4360P5373J8712R0681n8828Q2656r5563p5448P5245M4311
$$ 13131 46530 -48304 -72664 2709 21421 112102 53274 135930 40367 -35081 40164 84475
22787H4475l9519n3345N039L494l2055l5906K993J17911m4268m3113O707N7027
$$ 84475 44956 -8389 -3350 144 -31911 -67817 -64824 53087 8819 -34294 -27587 29440
22775B9440M2168m8557J4128m0136J9405N010m7354O9617P0775j2971n6019M881
$$ 29440 71608 23051 37179 -2957 16448 21458 -25896 43721 114496 101525 45506 50387
22763E0387P5233o347k4559q2354n7345n9325n4756R366O596J5650K8774K5053
$$ 50387 125620 119273 94714 12360 -44985 -104310 -159066 -149700 -143104 -127454 -98680 -73627
22751g3627P4210q314M8220l1511O0105P4599j21211l6988K8017k3106P768K6359
$$ -73627 583 -7731 40489 8978 69083 143682 22471 -14517 13500 -9606 -1838 24521
22739B4521R0942n970j1258M6271J1878o8204m4240J9208k8469p776l3901R288
$$ 24521 115463 109493 98235 144506 156384 88180 43940 63148 34679 26903 -6998 2290
22727B290R7596m5393P821L7018R7599m1093k4885l8923J9952O4286m2739p29
$$ 2290 99886 54493 62314 99332 196931 155838 130953 92030 111982 176268 133529 132800
22715A32800K1815m7891r1819p9295k1511N8602Q3147O93j9143K9866J767j06605
$$ 132800 154615 106724 14905 -64390 -85901 -27299 55848 56541 37398 67264 69031 -37574
22703c7574l6924J16120J26477K920r7168p0338J9998o64n3044n485L5137n4033
$$ -37574 -74498 41622 168099 171019 73851 3513 23511 22847 -30197 -35682 -545 -54578
22691e4578p8609M4092N6582J6255j7533J0009O2610K8719M9604p098K5466L7629
$$ -54578 -133187 -89095 -32513 -16258 -33791 -23782 38828 67547 117151 110053 135519 173148
22679A73148o8318M0087k7848k158j7094o4923p5579p8396n4906k5281K7748P6793
$$ 173148 104830 144917 117069 114911 97817 32894 -42685 -121081 -175987 -201268 -173520 -96727
22667i6727J21847J9187l5718m3428j0169J02482O2097K7062J5329k6502J17168
$$ -96727 25120 44307 8589 -34839 -45008 57474 119571 146633 161962 135460 252628
22656B52628N0259l2922j47939l5683K3906k0121o0020k2969M0778M1242m9313
$$ 252628 302887 269965 122026 86343 110249 90128 30108 7139 47917 89159 39846
22645C9846q7609j67751k3751J34455R2796M3382J7553J8532Q4651N3816J106
$$ 39846 -47763 -215514 -239265 -104810 -12014 31368 48921 67453 152104 205920 207026
22634B07026o2804j01880k5072m363J22437P744j1184j07807n1767P09O8318J4193
$$ 207026 144222 42342 17270 12907 135344 143088 131904 24097 -27670 -26961 41357 55550
22622E5550K5762O346O0419L7201j54493k5230O9038L6639m7889l2093L4044J6496
$$ 55550 81312 87658 148077 185278 30785 5555 74593 111232 63343 31250 65294 81790
22610H1790Q6392J00705O1398L4308N373N8309J8667l1870j28271l9724Q3462
$$ 81790 168182 268887 330285 364593 369966 428275 446942 415072 286801 247077 330539
22599C30539l0870R772L439r0346O5549J06391r0715p7787l6144M5192n1309p9656
$$ 330539 299669 309441 312880 222534 288083 394474 303759 225972 189828 235020 183711 104055
22587A04055r0206M3593k5943O8669J52454L610k7353o2149n1423M7109J6506
$$ 104055 13849 57442 31499 100168 252622 256232 228879 166730 115307 162416 178922
22576A78922N1073o4227m6355n4241j4729O0293L7488m1675O6540J610k7448m3881
$$ 178922 229995 165768 119413 65172 50443 110736 148224 106549 173089 174699 147251 103370
22564A03370J0830l819m5829j04730L3923M3534l5847m5529R9016M9752J0255
$$ 103370 114200 110381 64552 -40178 -6255 37279 1432 -44097 54919 104671 114926
22553A14926K1469n4087n9074O0775N8430M7562l2047q3909n7661Q2463P4262
$$ 114926 136395 82308 23234 84009 142439 190001 157954 74045 16384 98847 173109
22542A73109l9015k4874O6266L1512J27537m7982j31350m0437n12O3140j03947
$$ 173109 134094 109220 175486 206998 334535 286553 155203 114766 114254 177394 73447
22531G3447j24608r1936K3580J28107J09660j2941J6558M8073n3635k4976K1771
$$ 73447 -51161 -143097 -119517 8590 118250 105309 121867 169940 116305 91329 113100
22520A13100O2885J5310j6044j59307N680L1358p000P1457L0630j4829P0030R2872
$$ 113100 175985 191295 175251 15944 21624 52982 45982 117439 148069 133240 203270 296142
22508B96142R3771q3247r6050l6827o7076O878r4117p5044k84r448l2866k8182
$$ 296142 389913 306666 210616 173789 106713 113591 19474 -55570 -55854 -65302 -98168 -126350
22496a26350j6749J3957O8083J53334R7850K6517J1832L5499J02866n8045j16576
$$ -126350 -143099 -129142 -61059 92275 190125 216642 228474 263973 366839 308794 192218
22485A92218q5619N0212Q7342l1973o661J21004J14120J06707J57773J08195O1304
$$ 192218 106599 156811 244153 212180 205519 326523 440643 547350 705123 813318 874622
22474H74622J14050q9913j71910j03716o9394j14270j24430o7129k2257p7937
$$ 874622 988672 898759 726849 623133 553739 439469 315039 247910 225653 147716
22464A47716k7716K9170O8775J1311N1335K0502q4210J10886j1823l3936m0318
$$ 147716 120000 149170 217945 229256 280591 301093 216883 327769 315946 282010 241692
22453B41692K0562N5734k677l6046L9289q2798j08386K9040K6676L6589M9461
$$ 241692 262254 317988 315311 279265 318554 235756 127370 156410 183086 219675 269136
22442B69136L9219K9317N3086n0169j9564J32527M2421m807N355P8324J17171
$$ 269136 308355 337672 390758 340589 321025 453552 495973 491166 496521 574845 692016
22431F92016P3231J96788L00837M08521M26998L12717J43399K3430k1803L0564
$$ 692016 765247 962035 1262872 1671393 2098391 2411108 2554507 2577937 2556134 2586698
22421B586698k2497l54853m08843l71089l53732j76764o6000l0884o2831l6631
$$ 2586698 2564201 2209348 1800505 1429416 1075684 898920 832920 802036 739205 702574
22411G02574J5550n4601m3837p0393P3880Q8561J19174R2399J23086O7871M5807
$$ 702574 718124 663523 619686 549293 623173 711734 830908 923307 1046393 1114264 1160071
22400A160071J04688L3287l7745k3530j1834K2898l355L3566N9117Q7150J07968
$$ 1160071 1264759 1298046 1260301 1236771 1224937 1247835 1244480 1278046 1337163 1424313 1532281
22389A532281J21987J01288Q5683L4197R1702J54071K32981J19508J22959J76079
$$ 1532281 1654268 1755556 1841239 1875436 1967138 2121209 2354190 2473698 2596657 2772736
22379B772736J64704R0171Q3502K19428L42328K93381K59376K11581L31353L68354
$$ 2772736 2937440 3027611 3111113 3330541 3672869 3966250 4225626 4437207 4768560 5136914
22369E136914N44431P32743Q29352R81553J234415J509559J792940K363057L109661
$$ 5136914 5681345 6414088 7243440 8224993 9459408 10968967 12761907 15124964 18234625
22360A8234625M027984N321680P468535J1098322J7080527K5312682L5422375
$$ 18234625 22262609 27584289 35052824 46151146 63231673 88544355 123966730
22353A23966730M5946224N8061744P4918712P8374448M3876063q906050k6747003
$$ 123966730 169912954 227974698 302893410 381267858 425143921 416237871 389490868
22346C89490868r741905j3817323n6579437q9781646q0599124m9076247k7274576
$$ 389490868 379748963 365931640 309352203 219570557 138971433 89895186 62620610
22339F2620610j6315193j0685934p260097n010397l904829l136942k568385j909444
$$ 62620610 46305417 35619483 28359386 23348989 19444160 16307218 13738833 11829389
22331A1829389j413241j265510j060277q57312p44022n27481n08382n68732m95366
$$ 11829389 10416148 9150638 8090361 7233049 6489027 5961546 5453164 4884432 4389066
22322D389066k56296j87271l55324l15267l05418j96814j35333j73681j64561
$$ 4389066 4132770 3945499 3590175 3274908 2969490 2772676 2637343 2463662 2299101
22313B299101k25339r8417p3276p2634n3225l4440j4363j30224j56341j43110
$$ 2299101 2073762 1975345 1902069 1829435 1776210 1741770 1727407 1597183 1440842 1297732
22303A297732r8939n5196m7921r416K2245k9848K1143j3320J3459K0805N5559
$$ 1297732 1198793 1143597 1095676 1086260 1108505 1078657 1099800 1086480 1099939 1120744 1176303
22292A176303r4303j22558p8411N4150k9353j07332n9614l4o8990n3330M8028
$$ 1176303 1082000 959442 881031 935181 905828 798496 738882 738848 669858 616528 664556
22281F64556k3475j6845Q2726K02470J88319J86576K44930K55150L92996M43461
$$ 664556 641081 624236 706962 909432 1097751 1284327 1529257 1784407 2177403 2620864
22271B620864K19828m8044k21257j05235r9650m02691n16139k88530j38978k28292
$$ 2620864 2840692 2792648 2571391 2466156 2366506 1963815 1447676 1159146 1020168 791876
22261G91876j36605q5028k0234N3318l6429j31870q3418J287K8676l9527j07168
$$ 791876 655271 570243 550009 603327 566898 435028 351610 352897 381573 342046 234878
22250B34878N902K1970Q981P3755l5094q823m2974j11038N370r8989j7380J01895
$$ 234878 240780 262750 271731 345486 310392 301569 258595 147557 152927 53938 36558 138453
22238A38453J09917J26886r579j15650j13282O223m5144L6078O6591P2722P950
$$ 138453 248370 375256 365677 250027 136745 142968 97824 133902 200493 273215 281165
22227B81165k2065n265l1164M5556P8857O787k6913K965J1156j40027m8295L3033
$$ 281165 259100 253835 222671 268227 347084 353871 326958 329923 341079 201052 152757 185790
22215A85790M7691M2559J9905m4235L2748R0914j22210n5403J34651o3160q6079
$$ 185790 233481 276040 295945 251710 284458 375372 253162 197759 332410 269250 183171
22204A83171o2364R5603J26702M1847P3985L0078m0929j22889o0201k6342q7606
$$ 183171 120807 216410 343112 384959 458944 489022 448093 325204 265003 238661 151055
22193A51055q9817k7858r8216n1078K4866N509N4953J1710K9684O084L9241Q7023
$$ 151055 61238 33380 -64836 -115914 -91048 -85539 -30586 -18876 10808 16892 56133 143156
22181A43156R648j06018q5758j1079Q1662n2633N9003O0580n0291M1267K8488
$$ 143156 152804 46786 -38972 -50051 31611 -21022 37981 98561 48270 89537 118025
22170A18025n196l496p0215k3729K1136j0275k6000m3771n2904Q5718M2791P273
$$ 118025 112829 109333 39118 15389 36525 26250 250 -43521 -96425 -10707 32084 39357
22158C9357m7632l0093K1849k7369k0026o5070K3773O4474L8686l5000n8463m8293
$$ 39357 -8275 -38368 -16519 -43888 -63914 -128984 -105211 -40737 -2051 -37051 -95514 -143807
22146a43807n9630J25274M2796p8999R7474k400n8205M7795O2014N3621o5722
$$ -143807 -203437 -78163 -35367 -114366 -16892 -19292 -77497 -29702 32312 85933 20211
22135B0211J9382M0281r2974o220k721j08078j7239q4222r349J20982K06374J10142
$$ 20211 39593 79874 -13100 -19320 -22041 -130119 -147358 -231580 -240929 -119947 86427 196569
22123A96569q8208o0945K3143l469J5525O7387p6972l3530O7988L6554k5426r7205
$$ 196569 108361 47416 70559 67090 82615 150002 73030 39500 107488 144042 118616 21411
22111B1411q5397K0353P2899k9981m4369K6869j2552n5234M3508L0464M3006p517
$$ 21411 -63986 -43633 29266 -715 -45084 -18215 -30767 -86001 -42493 -12029 30977 23460
22099B3460j00906n9677j177P2890O0099m0437m5704k8829m3767L2106O1891J2375
$$ 23460 -77446 -137123 -138300 -65410 -5311 -45748 -91452 -120281 -164048 -131942 -70051 -57676
22087e7676O744j1594P3855j2167N423k5497N949m5438l7919n073j4580J48704
$$ -57676 -50932 -62526 11329 -838 4585 -20912 -14963 -60401 -98320 -103393 -117973 30731
22075C0731J32666o4595j53481n5332Q552O2261M7633Q2676R2101L3718j29213
$$ 30731 163397 98802 -54679 -110011 -101459 -39198 8435 91111 183212 216930 87717
22064H7717p7226J4428j20219j4318O219m2485q6410k2324J29623J2127O5071
$$ 87717 10491 24919 -95300 -109618 -103399 -145884 -232294 -254618 -124995 -112868 -47797
22053d7797r6109M1655L5450M3358J1361n4921k2786P8261j9917q3090O8313k7051
$$ -47797 -143906 -102251 -66801 -23443 -12082 -67003 -89789 -11528 -31445 -114535 -46222 -73273
22041g3273K337m924M6952l8233K6777n579K2829k1815L0758J7875m7340J4283
$$ -73273 -70936 -75860 -28908 -67141 -40364 -45943 -23114 -44929 -14171 3704 -43636 -29353
22029b9353m7903m8686P5727O2810K4569N050P975n8740l1611P9450Q2106K5898
$$ -29353 -77256 -125942 -50215 12595 37164 42214 50189 -8551 -40162 39288 121394 147292
22017A47292q8247j34385O6417J3001j01935J1834Q5203k7429k732K1045L2521
$$ 147292 59045 -75340 -8923 4078 -97857 -86023 -820 -28249 -30981 -9936 22585
22006B2585j9638J01021o0109N513L2980L1518k8375o9156o9406j38816J8804
$$ 22585 2947 103968 43859 49372 82352 113870 85495 16339 -53067 -191883 -173079
21995a73079Q4922J8527J1251O721r2008O619n4262p5040k479M8301N5516J19845
$$ -173079 -88157 -69630 -58379 -51658 -143666 -137047 -191309 -266349 -268828 -220527 -165011 -45166
21983d5166L9465O034M3014p987o919o1003k9991j0559N553m210N962k1573J5697
$$ -45166 -5701 333 43347 35360 28441 -32562 -62553 -73112 -67559 -71769 -65807 -87380 -71683
21970g1683J07830N0959P038n3168k8524p1930m4506Q9929O298k3354P2139K9598
$$ -71683 36147 87106 94144 40976 12452 -59478 -103984 -14055 -7757 -31111 41028 70626
21958G0626L9346O2288J5114o1771l1596k5557O4072j4835k333r4427r687j0625
$$ 70626 109972 172260 187374 125603 94007 68450 132522 117687 115354 20927 11240 615
21946F15R1408L0945m3443K634J9541k4288p6702k3095p3500n7324N8871R7721
$$ 615 92023 122968 79525 82159 101700 77412 710 -22385 -95885 -153209 -94338 3383
21934C383J19691p3822j00849M8558l7508k3633J4370p3542j6661o417j24938
$$ 3383 123074 49252 -51597 -3039 -40547 -64180 -49810 -123352 -140013 -146430 -271368
21923b71368N7551P4572J9789L3996L7119M9674L7328q8318o5396l0726L2537
$$ -271368 -213817 -139245 -119456 -85460 -48341 1333 38661 -49657 -115053 -145779 -113242
21912a13242k9149J04256J26219n2602r6890j5681r57J7600M7101J22529O2876
$$ -113242 -142391 -38135 88084 35482 -61408 -77089 -78046 -60446 -13345 109184 172060
21901A72060o9615k9279L6185m8012o1287j0869l7420q913q8694N027K2481K0423
$$ 172060 102445 73166 109351 61339 52 -10817 -48237 -57150 -145844 -140817 -118336 -97913
21889i7913J02747j1991j76114L1343O2927L3262P2192K4155o1737j28452k3027
$$ -97913 4834 -7157 -183271 -151928 -89001 -55739 16453 40608 -21129 -149581 -172608
21878a72608j3411m1621R2792L8910Q7678l1574j6292o4605l2064N286J0900m0117
$$ -172608 -186019 -227640 -134848 -95938 -8260 -39834 -56126 -120731 -152795 -147509 -136609 -176726
21866a76726J10038R9928q9259j0707N5090j364m4882K2634j7810K8975J04109
$$ -176726 -66688 33240 -56019 -66726 -11636 -13000 -57882 -35248 -53058 -24083 80026
21855H0026J4006N2610j85485j12865Q787P3696O377K1593M6709n7870l3908R0676
$$ 80026 94032 146642 -38843 -151708 -142921 -69225 -62848 -41255 5454 -52416 -86324 4352
21843D352J8625j33752j0362O2521k5300j16100o0108M8212L7020J37987J7096
$$ 4352 22977 -110775 -121137 -58616 -83916 -200016 -260124 -211912 -174892 -36905 -19809
21832a9809o1521J4065n0810O8419M7462N1744J08131m1800k02893r5148J21304
$$ -19809 -81330 -67265 -118075 -49656 -2194 49550 157681 115881 -87012 -182160 -60856
21821f0856J14811k6877p163O6545m316n3217P4821j1025n9124j0938P5396O4646
$$ -60856 53955 27078 19915 86460 82144 28927 103748 92723 33599 22661 98057 162703
21809A62703k17p9702J6230n4261n8039L0698O4897Q0678M1094o604Q9104J07920
$$ 162703 162486 82784 99014 44753 -13286 17412 82309 162987 204081 197477 286581 394501
21797C94501J65413K68506K95211M03451L95451K16633N6571j28233q9201j05984
$$ 394501 559914 828420 1123631 1527082 1922533 2139166 2195737 2067504 1978303 1872319
21787A872319l44200m58569l02446k52395j86622p1055O502q8418m5089l2034
$$ 1872319 1528119 1069550 767104 514709 328087 257032 263534 175116 130027 97993
21777I7993k7446J9437l4765K2704n4413n2622j8960K9031K8501L6942J4998k3541
$$ 97993 70547 89984 55219 77923 23510 -29112 -48072 -19041 9460 46402 61400 37859
21765C7859K7991j2193j0168k2434j04108L0944Q4950n2913o7936N9617M7207
$$ 37859 65850 53657 43489 21055 -83053 -52109 32841 -20072 -88008 -28391 18816
21754A8816n806n0392j5991m807j9555k6300P2155P6612Q667L4911k0291j08576
$$ 18816 13010 -37382 -53373 -58180 -77735 -104035 -31880 44732 53399 88310 68019 -40557
21742d0557m7555m3399q1331M808P0629M1525M3725O7348o0744L8014l6572l6176
$$ -40557 -88112 -131511 -212842 -208034 -137405 -95880 -52155 15193 -45551 -7537 -44109 -80285
21730h0285Q846j8334M2075m1874j4975O2575L7416N2615m2290O0068p8900m9523
$$ -80285 -71439 -89773 -47698 -89572 -104547 -41972 -4556 48059 5769 65837 -13063 -62586
21718f2586m8806j6340L7069J05576j1149j6228N6381l0136j9076q7538j670j3264
$$ -62586 -111392 -127732 -90663 14913 3764 -12464 43917 13781 -5295 -92833 -94503 -107767
21706a07767M4770Q1053R892r5334m1863o0679m6715N5440P6347R1577n3306L212
$$ -107767 -62997 18056 27948 -67386 -109249 -169928 -216643 -161203 -84856 6721 -46585 -43373
21694d3373O0633k4220j5187K0928l8862p0119o5246Q2889j4516P0913N6407J5574
$$ -43373 17260 -6960 -22147 -1219 -40081 -110200 -175446 -92557 -107073 -36160 20247 35821
21682C5821K8521n5512j10634m481K6085m1210L8763M5042k8006K3579O4176j525
$$ 35821 64342 8830 -101804 -106285 -80200 -121410 -82647 -37605 -65611 -42032 22144 20619
21670B0619m9345n8883j3934j8707j3812J6759J07671O1774J7293m249j19072
$$ 20619 -28726 -87609 -101543 -120250 -134062 -117303 -9632 52142 69435 65186 -53886
21659e3886j09003O906j7972O9370J09842N2034j15727n5732n0515J4634M4467
$$ -53886 -162889 -155983 -173955 -104585 5257 57291 -58436 -114168 -164683 -150049 -105582
21648a05582Q8105M7302l9871O88m6263j42906q235Q4745M2373N7341O322j5700
$$ -105582 -17477 29825 -10046 -9358 -55621 -198527 -206762 -122017 -79644 -22303 -15981 -31681
21636c1681J2741k8519l9294K8891J261k7677K8967P5436k8049q4858P2188J03748
$$ -31681 -18940 -47459 -86753 -57862 -56601 -84278 -55311 20125 -7924 -92782 -20594 83154
21624H3154p6486q3774M2290j4986k910o3692n8185J31368J66354J9046j558j7692
$$ 83154 6668 -77106 -34816 -49802 -52712 -116404 -174589 -43221 123133 142179 140621 122929
21612A22929j03794j34284M1201O3976k1787m9366l9307n9806R0368L2653O4653
$$ 122929 19135 -115149 -73948 -9972 -31759 -81125 -120432 -180238 -89870 -57217 7436
21601G436L5210M4142n5026j7028J7172j4786l1021J829M7685o0965M6128J5463
$$ 7436 42646 86788 31762 14734 31906 17120 -13901 -12072 35613 -25352 20776 36239
21589C6239j5934n3745p5818P439j8852r5859O1636R1882L9799L0824j3305M2548
$$ 36239 20305 -33440 -109258 -101819 -120671 -216530 -154894 -63012 -23213 7611 -5694 36854
21577C6854m947n4531m4001L5694N278j2279j8722n9549k2331j20366P2232J37905
$$ 36854 31907 -22624 -66625 -30931 -25653 -37932 -56654 -116203 -138534 -258900 -186668 -48763
21565d8763O7762j1528k67l9488m1407l6286m2970k1952J35245Q4235K5465l8010
$$ -48763 18999 7471 7204 -32284 -73691 -109977 -152947 -174899 -39654 44581 70046 32036
21553C2036m2659K1311K790m0398N7434J6301m4524O024J2288J7293p2504l9465
$$ 32036 -10623 10688 13478 -26920 30514 46815 2291 8315 20603 37896 -34608 -74073
21541g4073N3067p016l1572J01117K6615l7581M0785O3533j0326j9215q2079l3454
$$ -74073 -21006 -28022 -59594 41523 68138 30557 71342 134875 124549 105334 23255 -10199
21529a0199N0080K8670P373j7145q819J6872r033k0225k7760Q6488j10672M60
$$ -10199 39881 68551 75924 58779 49960 66832 57799 37574 9814 96302 -14370 -13910
21517a3910K3093m4693m5913K8037K1257M4287k8400p048M9590p922o7405l9568
$$ -13910 9183 -35510 -81423 -53386 -32129 12158 -16242 -23290 26300 18378 -49027 -88595
21505h8595p7073K4140L062J8748m0276J2581m1885M365N8649L7746P8784O533
$$ -88595 -165668 -141528 -138466 -119718 -159994 -147413 -189298 -184933 -126284 -88538 -9754 -3221
21493c221O4927l0289p3521j03934l3028O4112J52782l2725m8460J2073Q171k2257
$$ -3221 61706 31417 -42104 -146038 -179066 -114954 37828 5103 -43357 -31284 -23113 -45370
21481d5370O1044j3144q7598m999n3318O5762J2229o4403j219k5256J35000O2038
$$ -45370 15674 2530 -85068 -90067 -143385 -77623 -65394 -129797 -131016 -156272 -21272 40766
21469D0766j8550p4230k3784j2372N0676N255o1418k9289J9092N4898J04473j7779
$$ 40766 22216 -52014 -75798 -88170 -37494 -32239 -93657 -122946 -103854 -48956 55517 37738
21457C7738p7956k4846Q5033j05Q053M9868K1419o7627k3408J8566l1788p8953
$$ 37738 -40218 -65064 19969 19864 27917 77785 99204 31577 8169 26735 -5053 -84006
21445h4006O9792O1918o303J1027q0149o6971k6915R9959N9414M4207l5610j1627
$$ -84006 -14214 47704 41401 52428 -27721 -94692 -121607 -21648 37766 81973 46363 34736
21433C4736N4243J401r4481m6898O4247N1687k0843j01232Q2004N7329j5998K7350
$$ 34736 88979 90380 -4101 -50999 13248 64935 44092 -57140 24864 82193 66195 93545
21421I3545p1042K4456J490J9416k8774o0316n9121r6375o3399k8046J08153Q0238
$$ 93545 22503 46959 48449 67865 39091 -21225 -80346 -176721 -240120 -268166 -160013 -79775
21409g9775M7521n5874N3551J04366M6991k6987K701q1523j14144n2536J5209
$$ -79775 -32254 -88128 -34577 69789 116780 89793 92494 10971 -103173 -155709 -140500
21398a40500O4561M4758l6117l7812J5847L2224O06k9279J0718q6750P5299J1379
$$ -140500 -75939 -31181 -67298 -105110 -89263 -57039 -56433 -85712 -74994 -161744 -86445 -75066
21386g5066Q670J03789K8125K9289M8699j9647k4509j46462o3117N1114M3081
$$ -75066 -66396 37393 65518 94807 143506 123859 99350 -47112 -110229 -59115 -16034
21375a6034r368k9970j17103m6247J03398N9900j43922R86J32988n123l1042Q465
$$ -16034 -25402 -55372 -172475 -218722 -115324 -55424 -199346 -198360 -65372 -70495 -101537 -93072
21363i3072K5570N2064k6414n7602l2332k7431o31L6093J20335j1141n2287J2314
$$ -93072 -67502 -15438 -41852 -99454 -131786 -159217 -159848 -123755 -3420 -14561 -66848 -54534
21351e4534L3790Q5803L8330r4417j7746M7302p0737k2593K0603M8656p819n4767
$$ -54534 -20744 65059 103389 8972 -8774 38528 -32209 -54802 -34199 14457 6638 -48129
21339d8129J2901N398n5106n9634J0489J9362j5763L9890J6409n757M4115p0684
$$ -48129 -35228 -29830 -84936 -144570 -134081 -114719 -130482 -90592 -74183 -79940 -35825 -106509
21327a06509Q5489J21575o3039q1525r5309P844J9249L4695R3291L4227p1018
$$ -106509 -21020 100555 37516 -44009 -139318 -131474 -112225 -77530 15761 49988 -21030
21316b1030r4181J6689J00743J8825q255O634l6560m8817M8797L110Q060K4287
$$ -21030 -115211 -98522 2221 21046 12791 19425 -17135 -65952 -17155 -14045 -5985 18302
21304A8302k0754R251m0220k7502N1615j9927j10091q728J48418O5691L3237L8436
$$ 18302 -2452 6799 -33421 -60923 -9308 -29235 -139326 -148054 364 66055 99292 137728
21292A37728p9047K5421K8445j06652o0217J9234N7943k0592r0355o3040K0594
$$ 137728 58681 84102 112547 5895 -54322 -35088 22855 2263 -88092 -151132 -130538
21281a30538J24267N6639J2593N734j2800J0002R4807M4386q5578q6852n4389
$$ -130538 -6271 50368 62961 68695 55895 65897 160704 205090 119512 32660 -21729
21270b1729k8970m8824k995J116J5015j5473m4963N1341J01378M3030l7235J3541
$$ -21729 -50699 -99523 -102518 -101402 -86387 -101860 -146823 -95482 5896 48926 11691 25232
21258B5232q579r8076R348J13765R6195J0267j43386o6968l3767j9282M1397L3518
$$ 25232 16653 -81423 -72075 41690 137885 148152 4766 -62202 -95969 -115251 -73854 -40336
21246d0336J0319k4979m5972l982Q8062J00990L4639j8766j03052n9477J379K0939
$$ -40336 -30017 -54996 -100968 -104950 -16888 84102 118741 99975 -3077 -62554 -61175 -40236
21234d0236j0859m1325m4643q6077L4430R0959j559R5418N9704L1779j12723j53189
$$ -40236 -51095 -92420 -137063 -223140 -188710 -97751 -99310 -3892 55812 87591 -25132 -178321
21222a78321m4606R793j3096l1116J6504P091Q5546O0882L6667R3892l5074j9424
$$ -178321 -222927 -213134 -226230 -257346 -240842 -233751 -148205 -87323 -50656 43236 8162 -11262
21210a1262r1121K8834K0179M8925j9448p1810P4936O0685o2078j6099J8231j24491
$$ -11262 -102383 -73549 -53370 -4445 -23893 -95703 -20767 39918 -22160 -38259 -20028 -144519
21198a44519k0904M986k9339K7008K2252R4152J02600j8607j8384r6700o673J3600
$$ -144519 -165423 -160437 -189776 -162768 -140516 -46364 56236 37629 19245 -77455 -84128 -70528
21186g0528j2048k8631N5902k3904o5709m4883N6420l1600N1210K4854K5622j4932
$$ -70528 -82576 -111207 -55305 -79209 -144918 -189801 -133381 -164981 -113771 -88917 -63295 -78227
21174g8227m6016J02424O534n3171R6907N9194j04331j7376m7886J1186R0781
$$ -78227 -124243 -21819 -15285 -68456 28451 87645 -16686 -34062 -81948 -70762 20019
21163B0019J4184K3449K1492n6803j45193m0277P5389R2039J22276k4133n3967
$$ 20019 34203 57652 79144 22341 -122852 -163129 -87740 4299 126575 102442 48475
21152D8475l0123l150J1647O5554l5836j23759j07321j8772l84L2745P847o3372
$$ 48475 18352 15202 26849 92403 56567 -67192 -174513 -193285 -193669 -160924 -153077 -216449
21140b16449L0710P5620J8079o3711q1144J13771J65946j5504j6191j2910K1082
$$ -216449 -185739 -110119 -92040 -155751 -236895 -123124 42822 27318 11127 -1783 19299
21129A9299k5438m7779n5680L1841L187L5902l1886j8479l895J1374J7688j2549
$$ 19299 -6139 -53918 -109598 -77757 -74570 -38668 -70554 -89033 -92928 -81554 -63866 -76415
21117g6415K6657M3323q1904k1531l49Q696J8997Q8878J9266J3235M9006M5934
$$ -76415 -49758 -6435 -88339 -109870 -110219 -101523 -82526 6352 25618 38853 87859 133793
21105A33793j04314j04980m998N1031J9958n1529l665j0475q3456k273p4807k7768
$$ 133793 29479 -75501 -80499 -29468 -9510 -61039 -64704 -75179 -158635 -160908 -235715 -263483
21093b63483O3140J32192n7207j0061O8962Q3561L4789J1652N5785q7376k0321
$$ -263483 -200343 -68151 -125358 -135419 -66457 17104 51893 63545 119330 31954 11633
21082A1633l3750o2935Q0330O8535O5806K3503l6650j9906q1945O5096O81n0229
$$ 11633 -22117 -85052 -4722 63813 129619 153122 116472 96566 14621 79717 80398 30169
21070C0169r8216m1854Q0944k6176p4776m9842J80276J64876L5706q4801M1415
$$ 30169 -68047 -109901 -28957 -55133 -129909 -179751 525 165401 201107 116306 157721
21059A57721K1550j68754k9826p716J27075n086m5904L0593P9861j0418o7588
$$ 157721 179271 10517 -19309 -27025 100050 94964 49060 79653 159514 149096 81508
21048H1508L2881M7706k4454j06528l6884K3876M895R5569m4810j04441n1607
$$ 81508 114389 162095 137641 31113 -5771 18105 23000 118569 73759 -30682 -82289
21037h2289l188n5295L4065j7531q5462R361M6387P823K6100M4227M0054O8237
$$ -82289 -85477 -140772 -106707 -124238 -209700 -200339 -153952 -146129 -120029 -75802 -35748 32489
21025C2489o0724r5379o8881k9340J75494J51038o3702q7263M578n805j6475K8522
$$ 32489 -28235 -123614 -192495 -221835 -46341 104697 40995 -46268 -41690 -47495 -63970 -35448
21013c5448q021l9422R565n6413N4940R2467n8121o3004m375P9195P1030r5343
$$ -35448 -43469 -82891 -73326 -129739 -74799 17668 -40453 -103457 -107832 -28637 42393 -52950
21001e2950k9779J3797N5644J3281o3752m6124Q3071M0606N5204l0781m6453L26
$$ -52950 -82729 -68932 -13288 -7 -63759 -109883 -26812 13794 68998 38217 -8236 -7910
20989g910J41050m802q5435n4920O1071n4231k9499L8417p0272j26391P5983J01539
$$ -7910 133140 128338 42903 -12017 49054 -5177 -34676 3741 -66531 -192922 -116939 -15400
20977a5400L735k7284k906P027r2036J1508M6045Q394q418P4793j1133o6936m0438
$$ -15400 -11665 -38949 -41855 -34828 -126864 -115356 -69311 -60917 -69335 5458 -5675 -72611 -113049
20964a13049M2323L4323l1228j12839m4585K4773P9769J13117K1120j35399l5746
$$ -113049 -70726 -36403 -67631 -180470 -225055 -200282 -120513 -7396 13724 -121675 -157421
20953a57421j482Q3401L6595p608m9755j3656J1853M3968K5525L9074J17727j6555
$$ -157421 -158903 -75502 -38907 -46515 -96270 -109926 -98073 -54105 -28580 10494 128221 111666
20941A11666j20615J3622p0091o2595l5999j8697J1714J32701J3601j55703q3913
$$ 111666 -8949 4673 -65418 -128013 -164012 -182709 -170995 -38294 -24693 -180396 -264309
20930b64309J43032L5189K5171q9491n6926L7029J80115J9290L9869J0227O1715
$$ -264309 -121277 -86088 -60917 -150408 -207334 -170305 9810 29100 68969 79196 140911
20919A40911J5581q803o6145p0260r2670j01773o2978M8741K0791J24487K7185
$$ 140911 156492 147689 81544 11284 -81386 -183159 -246137 -197396 -176605 -52118 -24933
20908b4933l5300n9180Q6785R8434j1312l1849l3505L9800K4519K5414J514M2044
$$ -24933 -60233 -119413 -32628 65806 54494 22645 -10860 28940 53459 78873 80387 122431
20896A22431O5764j19265j80237j23745j7865K5072P9956L9210j4216J81l1646
$$ 122431 188195 68930 -111307 -235052 -252917 -227845 -147889 -108679 -122895 -122714 -154360
20885a54360L8103k2466l831O9115N083M9463L9523J278l8748j07064N0242J30383
$$ -154360 -116257 -138723 -142554 -73439 -68356 -18893 20630 21908 -16840 -123904 -73662 56721
20873E6721j08725j49982l9069J18841K2634p5480L6424r269l6684N5038R7354
$$ 56721 -52004 -201986 -241055 -122214 -99580 -175060 -138636 -147905 -184589 -129551 -32197
20862c2197K2763j05942K3318m587m3899r893L2053O91N0685M1904K3401n3256
$$ -32197 -9434 -115376 -92058 -96645 -140544 -150437 -118384 -117693 -67008 -25104 -1703 -54959
20850e4959O8441j4684o4546n3156M0534M9116l5005j2734l5085M1062k5791j03813
$$ -54959 13482 -1202 -65748 -118904 -78370 -29254 -64259 -76993 -112078 -71016 -96807 -200620
20838b00620J3307R7042j3565n1152q2670j2343J37803P1830p9812k1761N8835
$$ -200620 -187313 -90271 -103836 -154988 -237658 -250001 -112198 -40368 -120180 -141941 -83106
20827h3106J8450Q61P9654n1201q9768j9203J3637m2888J4576J8371L9032P4958
$$ -83106 -64656 -63795 15859 -35342 -125110 -144313 -130676 -173564 -158988 -140617 -101585 -26627
20815b6627N6583p9632J4111L6175j7562P105l5085o2987L7710k0241K8933P6352
$$ -26627 29956 -49676 -35565 610 -16952 -9847 -44932 -107919 -70209 -90450 -61517 14835
20803A4835L8989L8667m5496q2801j6036L5613J42240M3264K3472J11289m8835
$$ 14835 53824 92491 46995 -35806 -51842 -16229 126011 169275 192747 304036 255201
20792B55201j15526o9656k4156Q0253R2204M0147O7035J81413L1335J73327P4854
$$ 255201 139675 70019 45863 126116 218320 258467 325502 506915 538250 711577 786431
20781G86431J82361L3632j05092n044N6639r6831j28423j55546j13485k210J0809
$$ 786431 968792 1002424 897332 892288 948927 852096 723673 568127 454642 452432 463241
20770D63241J1988K2317R1985J33355J01167j1518M715J06413m650K6242j16351
$$ 463241 475229 497546 589531 722886 824053 812535 817250 923663 919013 945255 828904
20759H28904k26359q6030o6810j59618q9607k3835p7960j2468k079l7804k0099
$$ 828904 602545 516515 449705 290087 200480 176645 98685 86217 84138 46334 26235
20748B6235m854Q057j2436M5758j6427m5863J6272J6275o9109K8019j6167m0885
$$ 26235 21381 29438 17002 62760 46333 470 16742 33017 -36092 -8073 -24240 -65125
20736f5125J2607Q2904K2650K5950n3661J0973j9291r0913j32388k1188J08486
$$ -65125 -52518 30386 53036 78986 25325 36298 17007 -73906 -206294 -227482 -118996
20725a18996P3853Q5501K2163m0054J3270N4165k6265M767n774j43405N6601r442
$$ -118996 -45143 40358 62521 22467 35737 89902 63637 68404 62630 -80775 -24174 -33616
20713c3616j2107q98J8712J0505n8559J7036j7139O8328j3735j09574o7952L3211
$$ -33616 -45723 -46621 -27909 -17404 -75963 -58927 -76066 -7738 -21473 -131047 -198999 -165788
20701a65788J90495N2198p2271K4555r4862q1795k7011J16575P6036M3982k9604
$$ -165788 24707 76905 4634 29189 -65673 -147468 -174479 -57904 18132 62114 32510
20690C2510k4001j0388L1910l6910K553Q7886n5883j41786l969O3017p2291q5662
$$ 32510 8509 -1879 30031 -6879 -4326 83560 27677 -114109 -118078 -55061 -127352 -213014
20678b13014k5506M0006L0827O3095L9946p676l7575P8827J12599O0532k0244
$$ -213014 -238520 -198514 -167687 -104592 -64646 -72322 -109897 -31070 81529 142061 121817
20667A21817j12063r7271p4902L7964R0187k1184N4210P2679L0676j80315q5118
$$ 121817 9754 -87517 -162419 -124455 -34268 -55452 -1242 71437 102113 -78202 -163320
20656a63320R7991k260r173J4094m6925N3761O5704o7966K9613k7024m7252l9627
$$ -163320 -65329 -67589 -76762 -62668 -109593 -55832 9872 -58094 -28481 -55505 -102757 -142384
20644a42384K2784J0992r0384M2142J00026R6141R518m8426N7653l0089k7878
$$ -142384 -119600 -108608 -198992 -156850 -56824 39317 48835 409 58062 27973 95
20633I5K5762j972k518l689L161M8662Q6332o6642k0162l2684L679k7634K340
$$ 95 25857 23885 21367 17678 20839 69501 155833 89191 69029 36345 40024 12390 14730
20620A4730j7061l8641L4011M947l1238Q0207J05941J5679p6287j99901O2965
$$ 14730 -2331 -40972 -6961 -2014 -33252 46955 152896 168575 92288 -107613 -44648
20609d4648J30928N4393p1325j1567O4952K6826n2581K880k0798M0181N617r8177
$$ -44648 86280 140673 69348 57781 122733 149559 96978 99858 79060 119241 124858 26681
20597B6681k2355k5230K443m235J0204J03524J11633N2532o2599n27L4202n7533
$$ 26681 4326 -20904 -18461 -22696 -12492 91032 202665 255197 192598 192071 226273 168740
20585A68740j94L4659o5320k5046j17163j41117q8766J25285J82142N7458J787
$$ 168740 168546 203205 137885 112839 -4324 -145441 -234207 -108922 73220 130678 132465
20574A32465k3574q8678o7105M1124N6773j03574j30851K8594L3279j9451m6627
$$ 132465 108891 20213 -46892 -5768 51005 -52569 -183420 -154826 -121547 -140998 -187625
20563a87625J7676O7236J01675K0998L6200J6479R3321N328m7580r7807J2985
$$ -187625 -169949 -102713 -1038 19960 56160 72639 165960 171288 123708 25901 38886
20552C8886P2081p8848n092Q5527K3523p1045j2723J28752q730n9693K4747m4798
$$ 38886 110967 32119 27027 112554 136077 65032 52309 181061 172331 112638 137385 92587
20540I2587o3523o3641j9092N7433N8196N39q8784M8652q1031m256L4665P9311
$$ 92587 29064 -34577 -53669 3764 61960 62499 -26285 22367 -58664 -62920 -28255 51056
20528E1056J516M168O7496N6056K4836q5255n3156J6521l8194K7101l9545j20440
$$ 51056 52572 56740 124236 180292 205128 119873 66717 83238 45044 72145 32600 -87840
20516h7840j1859J0800M6644m6281o012Q0169N0955N2075l7767l6916m8481p0830
$$ -87840 -99699 -88899 -42255 -88536 -94548 -14379 36576 88651 50884 13968 -34513 -105343
20504a05343M8707M8164L278q4472N441O7379O6091M2928m0824L0029r53l5945
$$ -105343 -56636 -8472 -5194 -89666 -84225 -16846 49245 92173 51349 81378 80425 44480
20492D4480j04877j4979l339j7833o2691M7001R1055N4357O7758m400j8739n4354
$$ 44480 -60397 -75376 -78715 -96548 -159239 -112238 -21183 33174 100932 96532 77793 23439
20480B3439Q3159P3351P5459j1019J4458p910n9854p080k0889j7127l399k1206
$$ 23439 106598 179949 255408 244389 258847 250937 191083 184003 163114 145987 142588 121382
20468A21382m6503k3947M9107L0789N8893O5454j8184J573J3812N9113r0049n5822
$$ 121382 74879 50932 100039 130828 189721 255175 236991 238564 252376 311489 221440 165618
20456A65618p8063J11148P7806j06455n5770k7615l9159l8247k1006L5771l8052
$$ 165618 87555 198703 276509 170054 114284 86669 47510 9263 -11743 24028 -14024
20445a4024J0909n960J6064N2634M9968m6690p332N5708P702r523m1678J2510
$$ -14024 -3115 -9075 6989 59623 109591 62901 55569 111277 118979 109456 67778 80288
20433H0288M7843M3303k3283k0235m9115m5051J4840J0243K3362O169j3113j6217
$$ 80288 128131 171434 148151 127916 78801 33750 48590 58833 82195 88364 75251 59034
20421E9034m8063P9810J04623p003J1805j37667m0733k3791L0115j5436n676j9810
$$ 59034 10971 90781 195404 188401 200206 62539 21806 -1985 28130 12694 7018 -12792
20409a2792n296L6090L1197L6856M488j599L5244n598J2577O925K9359k6215n8659
$$ -12792 -18088 18002 49199 86055 90543 88944 124188 118590 131167 138092 167451 141236 82577
20396H2577n9109l0666L2953O1057K9896M8441R274j13366N3613R0099l4846j2850
$$ 82577 23468 -7198 25755 86812 116708 165149 174423 61057 114670 204769 169923 157073
20384A57073k7342p1514K8487J6834J22409m0716n080J7182q4790N402J4822m2
$$ 157073 129731 58217 86704 103538 225947 185231 180151 197333 112543 117945 132767 132725
20372A32725O3506l4132j00170K4570l9074n3582m5721M2442M54Q7748P5448m7541
$$ 132725 196231 162099 61929 86499 47425 -6157 -51878 -9436 -8982 78766 154214 106673
20360A06673j8711N295j5367N2308R5799n0977o7002j4638J7038l1526O6806J06841
$$ 106673 87962 93257 77890 130198 225997 175020 108018 93380 110418 78892 145698 252539
20348B52539q877O1885M9591M7499J02318P6290m2667n0590L0921n5693n4826
$$ 252539 243662 305547 355138 402637 504955 581245 538578 487988 518909 463216 408390
20337D08390j2455k5598k1626K2708N701L508Q852l2292J51r6733l2792J28716
$$ 408390 395935 370337 348711 371419 377120 380628 389480 357188 357339 260606 227814 356530
20325C56530K4480o1104p373N2100M3296j1682m7232p3167r8978n5031K2061N1553
$$ 356530 381010 319906 312533 364633 407929 396247 349015 275848 176870 121839 143900 195453
20313A95453N6292K6041J5238N713l1074k5495O0762J08954P5782j9752r6378
$$ 195453 251745 277786 293024 298737 267663 242168 302930 411884 487666 467914 371536
20302C71536L2480L5860o550l7441l8172N9221m378j27820o7663M8349O2409J2326
$$ 371536 404016 439876 433326 395885 357713 416934 412556 284736 217073 265422 327831 340157
20290C40157J37073R5476q548N676L9761P7525l4778K6894L258j30422q5076N9142
$$ 340157 477230 572706 564158 569834 609595 687120 652342 679236 682494 552072 466996 526138
20278E26138N5788j5173M0600J63252J20632J01075J5922J2327j19477K0998P8253
$$ 526138 581926 566753 607353 770605 891237 992312 1008234 1020561 901084 922082 1000335
20267A000335M1614L1719Q3858J05389J27756K18635J35813R6429J08296M49772
$$ 1000335 1041949 1073668 1157526 1262915 1390671 1609306 1745119 1841548 1949844 2399616
20257B399616N03328J84563L1743P9948J06324L7236Q5094L4187o53M7780J22931
$$ 2399616 2902944 3087507 3119250 3199198 3305522 3342758 3427852 3462039 3461386 3509166 3632097
20246C632097J51227L41969M34397N05437O07795O63764P23121P48711N56978
$$ 3632097 3783324 4125293 4559690 5065127 5672922 6336686 7059807 7808518 8365496
20237H365496N61350M95671P24174P72805P01447J033649J492520K123630K856261
$$ 8365496 8926846 9422517 10146691 10919496 11620943 12654592 14147112 16270742 19127003
20228A9127003M153947O103130Q744176J2383518J6936596K1306734K5764116
$$ 19127003 23280950 29384080 38128256 50511774 67448370 88755104 114519220
20221A14519220L1498471L2748941J7312240m394222r333305l39703l070119k2398720
$$ 114519220 146017691 178766632 196078872 191684650 182351345 182011642 178941523 156542803
20213A56542803l4446415k6437631j1928588l14604Q610264J6065638K2355658
$$ 156542803 122096388 95658757 83730169 83415565 92025829 108091467 130447125
20206A30447125K8985296L1375201J6337739p247427j4000771m670119o057562
$$ 130447125 159432421 190807622 207145361 199897934 185897163 181227044 175169482
20199A75169482k5315678l9490558l4297867k2246789j3811694q874385n999571
$$ 175169482 149853804 110363246 76065379 53818590 40006896 31132511 25132940
20192B5132940m373112l211020k416204j806578j229283r45377p89901n27714
$$ 25132940 20759828 17548808 15132604 13326026 12096743 11151366 10361465 9833751
20184I833751l19195l34454m63804n88764n87230n85867m99753o88837q58461
$$ 9833751 9514556 9180102 8716298 8127534 7540304 6954437 6454684 5765847 4907386
20175D907386p05573m47304k17023k05782q4982n037J6903J89708R9253j45096
$$ 4907386 4201813 3754509 3537486 3331704 3246722 3241685 3258588 3448296 3547549 3402453
20165C402453k08596j72114q5630j74938k74704k93457k24763j47875j11639k02560
$$ 3402453 3193857 3021743 2936113 2761175 2486471 2193014 1968251 1820376 1708737 1506177
20155A506177n1740m3091l7868j57363j27381n1525l0830o2485p8661j11266K5098
$$ 1506177 1454437 1411346 1373478 1216115 1088734 1037209 1006379 943894 865233 753967 779065
20144G79065m774K6999j8737j37390Q3003N7514o8422j2299l3832O116K060j33552
$$ 779065 774291 801290 782553 645163 728166 785680 717258 704959 671127 677243 679303 545751
20132E45751P488Q2387L7557L538j4644j0144L6031R423p1726o1999q6191l8726
$$ 545751 553239 635626 673183 676721 662077 651933 687964 697387 625661 563662 477471 438745
20120D38745J3281r1822J5536K3714j367N636k7389O8790j6567j0284K1919L1650
$$ 438745 452026 360204 375740 399454 398087 403723 376334 445124 428557 418273 440192 471842
20108D71842q8556j13684j22010L7427J6657M968L5405P5308P3854r7483J9478
$$ 471842 383286 269602 147592 185019 201676 206644 242049 317357 391211 293728 313206
20097C13206p1279Q446J3491J1788n689K5519L9812L5313P8316m7168m4614K6473
$$ 313206 241927 250373 263864 275652 269963 295482 335294 370607 448923 401755 357141 383614
20085C83614l5098n527O0348n8176q35o8052n944n4278j60408n109K9059K0222
$$ 383614 348516 342989 403337 345161 344326 276274 270330 216052 55644 50535 79594 99816
20073I9816L8313L8013j123j2635K3256J01381J8151o8514n9110j01716K8607
$$ 99816 138129 176142 175019 162384 185640 287021 305172 236658 177548 75832 104439
20062A04439Q2772o1439o5991M0904J02814J0555q8724j1212K673N5029J5026
$$ 104439 187211 125772 59781 100685 203499 214054 125330 114118 116791 171820 186846
20051A86846N9489k258l5611r0134l4808n0936l264N0243r73j00103J5827R88
$$ 186846 246335 244077 208466 118332 83524 32588 29324 79567 78594 -21509 -5682 -4694
20039d694L1816o007K7989o1178m8938j1060j0083L4851Q814K0455j297K1231
$$ -4694 27122 21115 49104 -12074 -61012 -72072 -82155 -47304 -38490 -18035 -19332 1899
20027A899M3450p7980P657N14M144l6239N4368n4720j8160j4601n715l5381P9252
$$ 1899 45349 -32631 -24974 -24460 -20316 -56555 -2187 -56907 -75067 -89668 -95383 -130764 -51512
20014e1512J29963J6716m9068j05232R048J8093L0396j8119P682k7980K6882O0669
$$ -51512 78451 95167 46099 -59133 -50085 -31992 -1596 -19715 -12033 -40013 -13131 47538
20002D7538J085L5686M6151l7958M2976J3995p1162m2153q3723m535K20110J12284
$$ 47538 48623 84309 130460 92502 135478 149473 78311 36158 -47565 -52100 168010 280294
19990B80294k4468n4808J4344l3532q9900m5252o065N6367J8808J362o791p1951
$$ 280294 255826 201018 215362 181830 91930 46678 40613 96980 115788 117150 110359 38408
19978C8408J422k9387M9260J25541K3406l6034N8942M7878o0734J5054J6926q170
$$ 38408 39830 10443 59703 185244 208650 172616 231558 279436 218702 233756 250682 242512
19966B42512n8853j28978o8266J3535J4932L6182j5102j4427n0505j6273n0517
$$ 242512 183659 54681 -13585 -50 14882 51064 35962 21535 -28970 -45243 -95760
19955i5760J1473Q9274M2149p7987l0731J36268L4253J4077J3142n0083p797n1525
$$ -95760 -84287 4987 47136 -30851 -61582 74686 108939 123016 136158 86075 78278 26753
19943B6753Q1351l520n5073q380M9150N8028J2497k8786p2259J5644J11732l7818
$$ 26753 108104 104584 49511 41131 90281 148309 160806 132020 59761 75405 187137 149319
19931A49319J741l603M9609M7900J38353J68595K17047O7635j36916j58748j62274
$$ 149319 151060 147457 197066 244966 383319 551914 768961 836596 699680 540932 378658
19920C78658j07292j34526p5721M1296J9616k0674R2177J67032J88879P3339l642
$$ 378658 271366 136840 61119 102415 122031 101357 193534 360566 549445 622784 619142
19909F19142m8125m6643j38313j59929j42289m3684Q97J2536j0691j9190M1056
$$ 619142 571017 524374 386061 226132 83843 40159 41056 53592 42901 23711 64767
19898F4767J3410m2681L3128L8329N0964L5263j6039j6171n9539j21948k422J32649
$$ 64767 78177 35496 68624 106953 157917 193180 177141 160970 101431 -20517 -22939 109710
19886A09710N2613j2374l9708j8294j9171N4005p7578m51n485M7149O5882J21165
$$ 109710 162323 149949 110241 91947 72776 126781 49203 48752 43267 90416 156298 277463
19874B77463O9228P4384J23279J41639J20253k3633o5185j70558j72692r0381
$$ 277463 346691 421075 544354 685993 806246 782613 717428 546870 374178 283797
19864B83797j45530o4065q5217O0826J03318L5532n6262M8557J84468K18393R3177
$$ 283797 138267 74202 -11015 49811 153129 188661 132399 180956 365424 583817 676994
19853F76994k2428j91795k04762p7343m9630M3309K084n3917K6009o3832k19728
$$ 676994 654566 462771 258009 180666 131036 174345 176429 122512 148521 84689 -135039
19842a35039k7586Q0160R215J4365O6116q463j11737R287J25903k6815n2223q5170
$$ -135039 -162625 -82465 -73250 -58885 7231 -1232 -112969 -103682 22221 -4594 -56817 -141987
19830a41987O1390J18728M5657k6716o6672p1527o4748K0822Q0187J31153j227
$$ -141987 -80597 38131 83788 57072 -9600 -81127 -145875 -125053 -44866 86287 85060
19819H5060p9482J8937J9917N9739j06872m4374P60j1091P6896J06533k994m1929
$$ 85060 5578 24515 44432 104171 -2701 -47075 -46315 -57406 19490 126023 123029 81100
19807H1100l4021J4063n0541o2924O9447N2039j03690J9453m1069J05959P5307
$$ 81100 47079 61142 10601 -52323 17124 69163 -34527 -15074 -56143 49816 125123
19796A25123n4317L2364q8614o7729j1059P1169L2779j4597J1932m2751p5555
$$ 125123 70806 103170 14556 -53173 -64232 6937 39716 25119 37051 -5700 -81255
19785h1255j3530N6174j7261K0442Q1172L2578r4933j08439J20773N9534J2799
$$ -81255 -94785 -38611 -55872 -35430 45742 78320 -16613 -125052 -4279 55255 68054
19774F8054O828O5760n3852n768K3390P1838m6681L3973p5476m9546n3475l1459
$$ 68054 74882 140642 86790 81022 104412 176250 129569 163542 88066 38520 -14955 -46414
19762d6414p8303k8064P1694j8174M9942O1749l4385O204J7109L0977j8300K1899
$$ -46414 -124717 -152781 -81087 -99261 -49319 12430 -21955 -15751 1358 32335 14035 35934
19750C5934j1939j13532k7084N0491l3102j5969m4797m104N6583O2649L8974P1180
$$ 35934 23995 -89537 -116621 -66130 -99232 -115201 -159998 -164102 -107519 -44870 -5896 65284
19738F5284R6210K3595j11476q4039O899M8352L3451m3551m7660J01829K9158
$$ 65284 161494 185089 73613 -10426 -3527 44825 78276 34725 -12935 88894 118052
19727A18052q8430l8083j265N9350L7140p2734j68765l2462O3232Q8011O4375
$$ 118052 29622 -8461 -9726 49624 86764 14030 -154735 -187197 -123965 -35954 28421
19716B8421n6580j31783l9492Q2060P2527P754l7817o6952j1060j21894L1619
$$ 28421 -28159 -159942 -199434 -117374 -44847 -37093 -74910 -141862 -152922 -274816 -243197
19705b43197J63148P4798l384P787m9477q5132o2563N3864N1467M9783l2593L9357
$$ -243197 -80049 -5251 -8635 -848 -50325 -135457 -198020 -144156 -92689 -42906 -75499 -36142
19693c6142M6847J5093m4531p8057j6590R047J4435P953k3585L4176J12114N5186
$$ -36142 10705 25798 -18733 -96790 -113380 -104333 -89898 -81945 -105530 -71354 40760 95946
19681I5946l5408m9038l4502j6852M4416n4158k4311R1986m4662j1017N7365r672
$$ 95946 60538 11500 -23002 -39854 4562 -49596 -73907 18079 -26583 -37600 19765 10093
19669A0093k7428K9339L5047J16662r201n0141M2860J8180N5127N2108O681J6925
$$ 10093 -17335 12004 47051 163713 154512 104371 147231 165411 220538 272646 279327 296252
19657B96252J37970R2292Q1488J66659L8355K0840J47671L1431l8302k1945J126
$$ 296252 434222 526514 608002 774661 813016 833856 981527 1012958 974656 952711 953837
19646I53837R813p6539j40857j94557m001J3509J5529J12855J41843J86529J56968
$$ 953837 963650 887111 746254 551697 547696 561205 576734 689589 831432 1017961 1174929
19635A174929K6483j18465J5902N2867j48605j45790k21798j85881j21988L6093
$$ 1174929 1201412 1082947 1098849 1151716 1003111 857321 635523 449642 327654 363747
19625C63747n4169n2407k9922p7444K1077J1667N4631J06908m870j22906k31104
$$ 363747 309578 257171 227249 149805 170882 182549 237180 344088 339218 216312 -14792
19614a4792l1991J11965n6799L4697j1987p2295J5614n0840M2344Q3644Q4292
$$ -14792 -46783 65182 8383 43080 31093 -41202 -25588 -76428 -34084 49560 133852
19603A33852K8557J2744j20969p8181l3885K0513R3706J10804L5142j01056l56
$$ 133852 162409 175153 54184 -23997 -57882 -37369 56337 167141 202283 101227 100871
19592A00871M8716R5493Q0340K0398o7128j10542p0178k9082M4291O920j4325
$$ 100871 149587 245080 325420 345818 278690 168148 97970 68888 113179 120099 105774
19581A05774m6773K7921l0868o3682J54M907J7520M5362J22478O5304l0041Q478
$$ 105774 59001 86922 56054 -7628 -7474 -2567 14953 60315 182793 248097 218056 226534
19569B26534q7204j6594K0358L6215o0850m6339J6344K8463P171j57711o6745
$$ 226534 139330 122736 143094 179309 118459 72120 88464 116927 124098 -33613 -100358
19558a00358R3161J5819n0741k0227M8309M2120j7440p8683K1479J46684J07088
$$ -100358 -7197 8622 -42119 -62346 -14037 28083 10643 -68040 -46561 100123 207211
19547B07211o4134j32872K912m716n2014m1547M9261K0043M2571l0880M6991Q7182
$$ 207211 143077 10205 13117 8401 -43613 -85160 -35899 -15856 26715 -4165 42826 130008
19535A30008J18455R0395o0204R18M4649o7293l5746m0202j40819o9595L9770
$$ 130008 248463 338858 278654 279572 324221 256928 221182 180980 40161 -29434 10336
19524A0336R0585R4979L4079q384j038L1082O5625P7747j2409n6207k2361K6591
$$ 10336 100921 195900 229979 221595 220557 251639 317264 395011 382602 326395 304034 330625
19512C30625r8620j21035K0544j5130q773M3421o457m1758O5901Q1863K6114j12209
$$ 330625 232005 110970 131514 116384 107611 151032 144575 102817 168718 250581 276695 164486
19500A64486k9596k32m5320n4819k2598o0685N7873J1677l766n0837q132N1093
$$ 164486 134890 134658 89338 34519 11921 -48764 9109 20786 17020 -33817 -41949 9144
19488I144N2945J5116L2674l3985m8002O2605J50563M1462N1085L9898J023j25015
$$ 9144 62089 77205 109879 75894 27892 90497 241060 282522 333607 373505 374528 249513
19476B49513J4574J5079Q8178O663l8029L2435m890L599O7672J2958M9343J14902
$$ 249513 264087 279166 367344 374007 335978 368413 363523 367122 434794 447752 497095 611997
19464F11997J12399l4176o9363l626l6083j11575j39360M2877N0765M5351Q0053
$$ 611997 724396 690220 620857 617231 581148 469573 330213 373090 423855 469206 549259
19453E49259j9409j42555r0075N7070J92807Q3326L4643M7232Q7923R0393J74211
$$ 549259 529850 387295 297220 354290 547097 630423 665066 712298 800221 890614 1064825
19442A064825J91997R1726J68888J57305K01461M2050j41396q2359r9361j1034
$$ 1064825 1256822 1348548 1517436 1674741 1876202 1918252 1776856 1694497 1595136 1584102
19432A584102J00759J99195M03059L85615M57679L46101J49374K60810M34675
$$ 1584102 1684861 1884056 2287115 2672730 3130409 3476510 3625884 3886694 4321369
19423D321369M99757M88475M00526O92469R72868J329956J851025K640169M300423
$$ 4321369 4821126 5309601 5710127 6402596 7375464 8705420 10556445 13196614 17497037
19414A7497037O762107J0254181J4584197J8384213K1568923K6350862K8857643
$$ 17497037 24259144 34513325 49097522 67481735 89050658 115401520 144259163
19407A44259163P411240k5537394m0404845k8942083j5690982q078310l625773
$$ 144259163 151670403 126133009 85728164 56786081 41095099 33016789 29391016
19400B9391016l9255L640177P716274J2177874J6337772J9517236K3450790K5780223
$$ 29391016 29351761 32991938 40708212 52886086 69223858 88741094 112191884 137972107
19392A37972107Q116119k3285081m0732430l0351606j6977775r763981o022734
$$ 137972107 146088226 122803145 82070715 51719109 34741334 24977353 18954619
19385A8954619l794438k367351j702757j273929r75114q37497n28774k80315j48165
$$ 18954619 15160181 12792830 11090073 9816144 8841030 8003533 7474759 7194444 7046279
19376G046279j48864j67171P017P6633K9805r2084o7474K20625M32914L68739
$$ 7046279 6897415 6730244 6737261 6813894 6843699 6751615 6684141 6904766 7337680 7706419
19366G706419N00909P71961J081803J392551J958694L061100M743401P536407
$$ 7706419 8207328 8979289 10061092 11453643 13412337 16473437 21216838 28753245
19358B8753245J1562517J6188808K0009064K3445129K8630170K8087912O78181
$$ 28753245 40315762 56504570 76513634 99958763 128588933 156676845 157355026
19351A57355026l2088024m1914310k7627278j4609774p361624k903540Q38167
$$ 157355026 125267002 83352692 55725414 41115640 33754016 30850476 31688643
19344C1688643M664700R040396J3892414J8047911K1240142K5738079K5981684
$$ 31688643 36353343 45393739 59286153 77334064 98574206 124312285 150293969
19337A50293969K216099l0696211m3325310k9283099j6099453r307488n981277
$$ 150293969 152510068 121813857 78488547 49205448 33105995 23798507 17817230
19330A7817230m017279k678015j754386j114306p96393o70976n47424m73449n51120
$$ 17817230 13799951 11121936 9367550 8253244 7456851 6785875 6238451 5765002 5213882
19321E213882o11532l56667k10507l18867l82890k95829l20366k21936k28710
$$ 5213882 4602350 4245683 4035176 3716309 3333419 3037590 2717224 2495288 2266578
19312B266578j56062o1009J701n7447J26284p4989j27029j94271j33044j37246
$$ 2266578 2110516 2049507 2051208 1993761 2120045 2045056 1918027 1723756 1590712 1453466
19302A453466k09671j22149m5373M127j36666j22948l2223J8074L209J8732q289
$$ 1453466 1243795 1121646 1076273 1080400 943734 820786 788563 806637 809846 828578 820289
19291H20289j1549l2451q021n4321r0574r1945J6553l859k8266K7948M5501j9569
$$ 820289 808740 776289 768268 713947 623373 531428 547981 544122 515856 543804 589305 569736
19279E69736M3981l9292j4391p7199L2079j6412j08415p376L6793j4180r2012
$$ 569736 613717 574425 560034 482835 514914 498502 390087 382711 419504 405324 313312
19268C13312k9590M2692Q6249j00232j27898N0806J3351j70032k19J5862O0872
$$ 313312 283722 326414 412663 312431 184533 235339 248690 78658 78439 94301 155173
19257A55173P7542P5241k589j0105p1724j15773N274L6940p5728P1105M0539l8084
$$ 155173 232715 307956 305367 295262 223538 107765 113039 149979 74251 145356 185895 147811
19245A47811P3075O5559J332j3918L2966N7986j683l4947j05663j16942o5035
$$ 147811 220886 286445 287777 273859 306825 364811 363128 328181 222518 105576 40541
19234D0541q300J2360Q7439M1391j22548j68157M175O3059j9728N3357P8619l2875
$$ 40541 32241 44601 132040 173431 50883 -117274 -113099 -50040 -69768 -16411 62208 29333
19222B9333K535O3748j1809n6019m3133O3062P0315M8662Q4507M2529p6032n3591
$$ 29333 31868 95616 83807 27788 -15345 47717 118032 166694 251201 293730 217698 164107
19210A64107L9347K9801L089Q8341l963k2232m925k4783r7074J3826o2039r7815
$$ 164107 203454 233255 236344 324685 320722 298490 293565 268782 171708 185534 123495 25680
19198B5680p3230j1492j405J3984M953M0269J22900O1563O1835l668r445p3493
$$ 25680 -47550 -59042 -60447 -46463 -41510 -1241 121659 183222 245057 241389 231944 158451
19186A58451K064p9016k8303q5664p9870l2057J7616K5843k5160k5117L0874K8951
$$ 158451 160515 81499 53196 -32468 -112338 -144395 -126779 -100936 -126096 -151213 -120339 -91388
19174i1388k975M7766O6288m2879R9017R916k2355J7615l7906p8366K7177M1350
$$ -91388 -94363 -46597 19691 -23188 75829 85745 63390 81005 43099 -35267 -8090 33260
19162C3260k7640r5711m8578Q886m3457K4484P7138Q3471o3558j10370m2392k6678
$$ 33260 5620 -90091 -138669 -129783 -173240 -148756 -71618 11853 -51705 -162075 -204467 -231145
19150b31145L0346j8945N7102R1996K0664m4955K1064O6554J9170o7633j26439
$$ -231145 -200799 -219744 -162642 -70646 -49982 -94937 -73873 -7319 11851 -55782 -182221
19139a82221L3575N9548J06013P3425l2007k5443P750j10291l6035j1438K5856
$$ -182221 -148646 -89098 16915 90340 58333 32890 40640 -69651 -105686 -117124 -91268
19128i1268R6160L5159p2708m0776K456M542m8686k7349M3392J16115J17458n3402
$$ -91268 4892 40051 -32657 -73433 -70977 -66435 -115121 -142470 -99078 17037 134495 81093
19116H1093o5430l5928p6251j1356N5914J10474R143r894o2000n2106l1582q049
$$ 81093 15663 -20265 -96516 -107872 -51958 58516 67659 57765 -4235 -56341 -87923 -95972
19104i5972r452J7078Q1268J1015l0997l4929p944p7050q2512j5574O6408P5568
$$ -95972 -105424 -88346 -7078 3937 -27060 -61989 -69933 -146983 -229495 -245069 -178661 -103093
19092a03093Q9335N439J1663r8863l0781q0256j4987P3252M8665m0771m4336O8627
$$ -103093 -13758 -8319 3344 -95519 -126300 -206556 -221543 -148291 -99626 -140397 -184733 -116106
19080a16106J6664j3183P9793M9040p3196m7146L9529Q4417J34597J0881j33452
$$ -116106 -99442 -112625 -32832 16208 -56988 -104134 -64605 19812 154409 165290 31838
19069C1838j76055p482l4560k7567j7731J2721L7284K6324p317J86o3670J3434
$$ 31838 -144217 -151699 -186259 -213826 -231557 -218836 -181552 -155228 -162545 -162359 -226029 -212595
19057b12595r902p158l6689N9711P0325J171k3364p967O1958P9797P8395K6373
$$ -212595 -222497 -229655 -266344 -206633 -136308 -135137 -158501 -166468 -104510 -24713 53682 80055
19045H0055L3352M7671k14670j38337l8756L6909J26594l924n4961N1772m5967
$$ 80055 113407 161078 -53592 -191929 -230685 -193776 -67182 -71106 -126067 -74295 -120262
19034a20262k7936O14M8761O5331K2523k184l3860n7291N3970J11200P7791j1968
$$ -120262 -148198 -147584 -98823 -33492 -10969 -13153 -47013 -104304 -50334 60866 138657 126689
19022A26689l293m2588j02469q1503m4065O4203L1827j12021k3173N2859K4853
$$ 126689 123396 80808 -21661 -103164 -147229 -83026 -51199 -163220 -186393 -133534 -108681
19011a08681j0871J6132J1691N0757j4479m2753n7696m2039R2040N5636o239j0117
$$ -108681 -119552 -103420 -91729 -40972 -55451 -98204 -155900 -197939 -105899 -50263 -56502 -66619
18999f6619p943k2723K8716Q5123N3034k9318o4339o2250j0606J04504N8358l5774
$$ -66619 -74562 -97285 -68569 16554 69588 40270 -24069 -86319 -96925 7579 65937 30163
18987C0163k3836K1926j4180k4987n1497j9541j4200L8952q108j5580J331l5649
$$ 30163 6327 28253 14073 -10914 -62411 -81952 -96152 -57200 -65308 -80888 -79557 -115206
18975a15206M9292M4906L221M8433J1787j44n5121k7755j8226o4576L3757k0098
$$ -115206 -65914 -21008 -17787 30646 42433 42289 -12832 -40587 -58813 -123389 -89632 -109730
18963a09730q921J3615j7849j3536K3470N7492P1495P1792k8646n7090Q2074J01704
$$ -109730 -118651 -105036 -122885 -136421 -112951 -55459 16036 87828 59182 2092 84166 185870
18951A85870m2785q6493m6828j8460o6021M8809L1663n590L5576M0200R4902P8378
$$ 185870 143085 56592 9764 -8696 -74717 -25908 5755 165 35741 75941 170843 249221
18939B49221N8547M6892j5097j34595j52564p7768j4580M9144J0256p6281l5982
$$ 249221 307768 354660 339563 204968 52404 -25364 -39944 9200 19456 -56825 -92807
18928i2807l8769K5579N1649q7385k1165J7342K8809l1222J26611M9853p3598
$$ -92807 -131576 -105997 -54348 -141733 -162898 -145556 -116747 -147969 -21358 28495 -45103
18917d5103l8060P5723J16697p599n7797p1956j00271M8683N1403l939j4212l0414
$$ -45103 -83163 -7440 109257 101658 43861 -28095 -128366 -79683 -28280 -32219 -46431 -76845
18905g6845j0985K8103N3250M9795Q7541M4345N130p2302J11590r712k02114r5896
$$ -76845 -87830 -59727 -6477 43318 130859 175204 180334 108032 219622 209910 7796 -88100
18893h8100K9524k6476N5180J29692J62615J06191O8120J35201J52786K31424
$$ -88100 -58576 -85052 -29872 99820 262435 368626 436746 571947 724733 956157
18883I56157J56146j26337l11306k89655r8277l6344j24062j37555K2166j3455
$$ 956157 1112303 985966 674660 385005 286728 250384 126322 -11233 10933 -2522
18873b522O7543J35495P1883N9761J20533M788q3185j09755r3698k6685j25424
$$ -2522 65021 200516 272399 332160 452693 457481 374296 264541 170843 144158 18734
18862A8734n2929k2877r0577m5104N3122L5196Q0656P6773L8188k5855m4120l9188
$$ 18734 -34195 -57072 -147649 -192753 -139631 -104435 -23779 52994 91182 65327 21207 -17981
18850a7981P9483k7593j25245l1945m6377P948R8612N9953L4421o214p206m0993
$$ -17981 61502 33909 -91336 -123281 -169658 -161710 -63098 -3145 31276 25062 17856 -23137
18838b3137l5331N255m8905m4565J27521J41021J86139J19988J02231J52244l5461
$$ -23137 -58468 -53213 -102118 -146683 -19162 121859 307998 427986 530217 682461 647000
18827F47000j80606j70631j58257n3484L6828P426J7391o2466j0498J10329J32537
$$ 647000 466394 295763 137506 84022 120850 128276 145667 83201 72703 183032 315569
18816C15569P0933N2042J61024P5706n7426k33744k10348r8155r7574j7139j29544
$$ 315569 386502 438544 599568 675274 617848 384104 173756 75601 -21973 -39112 -168656
18805a68656k2834P2006n6165R0855O8669q43O8074n0102m2584N8045l6072p8848
$$ -168656 -191490 -119484 -175649 -84794 -16125 -16968 51106 1004 -41580 16465 -19607 -98455
18793i8455o5054K7144J5610j00096Q5514J22739Q6318R052n9412k7534n7786
$$ -98455 -163509 -136365 -120755 -220851 -135337 -12598 73720 82772 23360 -4174 -61960
18782f1960j8821J0393n5133m0564n6841Q4778q80O6296L0562k3994M0384o992
$$ -61960 -80781 -70388 -125521 -166085 -222926 -138148 -139028 -72732 -42170 -66164 -25780 -32772
18770c2772P6872P4836J02795J97606K95202K38101p2471l98947k46714n6155
$$ -32772 44100 118936 221731 419337 714539 952640 880169 481222 234508 178353
18760A78353o1376j24632K4379J0706m1301K5868K530j01401R4081J12474r6782
$$ 178353 116977 -7655 16724 27430 -13871 11997 14527 -86874 7207 119681 22899
18749B2899o1215l6457q2919k716K4254K2419o2155m9418k9673m9853j4022O2592
$$ 22899 -38316 -74773 -157692 -160408 -136154 -113735 -175890 -225308 -254981 -304834 -318856 -256264
18737b56264Q9865M7484j4823m3679L0154K3023L8857L3812K7953J0301j1405
$$ -256264 -166399 -118915 -133738 -177417 -147263 -124240 -85383 -51571 -23618 -13317 -24722
18726b4722r630r1365r7797q8453Q3538K01863N3878O560M1247L3881j56091m3427
$$ -24722 -34352 -125717 -223514 -311967 -228429 -26566 27312 33872 75119 109000 -47091 -90518
18714i0518J24466k0699p3524n6640p990P0741N5158K8048R169m9270P336Q028
$$ -90518 33948 13249 -60275 -116915 -124905 -54164 994 29042 38211 -11059 -3723 4305
18702D305l3026j2272N5259J0820j3702q5146j74614L6078O9505J3681O2514K6977
$$ 4305 -28721 -40993 14266 25086 11384 -73762 -248376 -212298 -142793 -129112 -66598 -39621
18690c9621J6179N1917m7389j43599q0374P9893M7428K0422m1339Q929L6049j9164
$$ -39621 -23442 28475 -18914 -162513 -242887 -162994 -115566 -95144 -136483 -127554 -91505 -110669
18678a10669O967l9206o4595l1294p029P6914O8165j26854n0470Q216R0974J44504
$$ -110669 -103702 -142908 -207503 -238797 -245826 -168912 -100747 -227601 -278071 -269855 -178881 -34377
18666c4377J04357n4095o3932r7910J4157M5364k2765J6122J1325J17983Q028
$$ -34377 69980 15885 -48047 -145957 -131800 -86436 -109201 -93079 -81754 36229 44257
18655D4257j14575o9990l4945J9410K9661n8058M974J07607o5197o4057O0432
$$ 44257 -70318 -140308 -175253 -155843 -126182 -184240 -179266 -71659 -136856 -200913 -140481
18644a40481m7222q0872Q3972K7878M0961J3035o9507J3778L8350O7304k5411
$$ -140481 -187703 -268575 -184603 -156725 -115764 -102729 -172236 -158458 -120108 -52804 -78215
18633g8215j1182m8043M6225Q9119J65472j3719m0255m3309l0852p3348N6540
$$ -78215 -89397 -137440 -91215 -2096 163376 149657 109402 66093 35241 -38107 18433
18622A8433j7480l7863k4705K7757l0576k9018k6371K8198j122j3238O0494k6729
$$ 18433 953 -36910 -61615 -33858 -64434 -93452 -119823 -91625 -92747 -105985 -45491 -72220
18610g2220q2131K7380K992j5252k3968Q867O0659R137n5130P10N636L6682m2297
$$ -72220 -154351 -126971 -123979 -139231 -163199 -154332 -93673 -84536 -139666 -138956 -133320 -96638 -138935
18597a38935L4387j3281j3628o8304L5507J03570n0452r1881J57129M6863m1973
$$ -138935 -104548 -117829 -131457 -199761 -164254 -60684 -111136 -203017 -45888 975 -40998
18586d0998l4748o1546M0028P2830j035j36211p2964J9804J31518Q1327k5014
$$ -40998 -75746 -137292 -97264 -24434 -25469 -161680 -234644 -214840 -83322 -1995 -27009
18575b7009Q1971q3499K5365r04j13867K1375R8676K996k6014J9841l9600N127
$$ -27009 54962 -28537 -3172 -4076 -117943 -96568 2108 5104 -20910 -1069 -40669 -35542
18563c5542M7607Q5311M2009n3834j4500q195j9437n3504L660q8080m9142O4014
$$ -35542 12065 97376 139385 85551 71051 62856 43419 -10085 -6425 -94505 -143647 -79633
18551g9633m6772o493K7623k6791M9959L0188j0196K1232j9539O9245j97j32497
$$ -79633 -126405 -132898 -105275 -132066 -82107 -51919 -62115 -40883 -60422 8823 8626 -123871
18539a23871j8125J16360M9977L0044o5153P3655J0551j30533p0725M2541J3143
$$ -123871 -141996 -25636 24341 54385 -10768 62887 73438 -57095 -127820 -85279 -72136
18528g2136J3268L6310j44291J2243n9674j5055P5931O085k5545m4509K3496J20759
$$ -72136 -58868 -22558 -166849 -154606 -214280 -229335 -153404 -147319 -172864 -217373 -193877 -73118
18516g3118J19886j5438j8149o0245q7881N5656n766L2218J15431l492o4722j9760
$$ -73118 46768 31330 13181 -47064 -134945 -79289 -85055 -52837 62594 59102 -5620 -25380
18504b5380M9313N2142k4142o7348M7583J1977J8460m5301k6792K7980l1806k4230
$$ -25380 23933 76075 51933 -15415 32168 44145 62605 17304 -9488 18492 -13314 -37544
18492c7544l7850j2891r4487j1298K6462j3790q9731j0305M5492P9121J8978l6987
$$ -37544 -75394 -88285 -182772 -194070 -167608 -181398 -271129 -281434 -235942 -156821 -137843 -174830
18480a74830P515M594l6348j2590k2807J2222O3214k0256M0139L6832K3452o5935
$$ -174830 -167315 -162721 -199069 -211659 -234466 -222244 -159030 -179286 -139147 -102315 -78863 -144798
18468a44798l9097q272N6852J5892R1734Q4201J4708j23292q8663l1734M6844
$$ -144798 -183895 -192167 -135315 -119423 -27689 56512 71220 -52072 -140735 -172469 -125625
18457a25625L1489o0531N917K2042r372J0609Q8543j03892p8061L5630O9271J8077
$$ -125625 -94136 -154667 -148750 -126708 -136080 -125471 -36928 -140820 -218881 -183251 -113980 -95903
18445i5903L6245L6372j7799L9363M8408k8054K5505m8047j85O8675o2549j26858
$$ -95903 -59658 -23286 -41085 -1722 46686 18632 44137 -3910 -4095 64580 2031 -124827
18433a24827N9929M3144n1697j3082m1112j5252O308J28309P4349n8131k04520
$$ -124827 -64898 -21754 -73451 -86533 -127645 -142897 -136589 -8280 66069 7938 -196582
18422a96582l9034Q4708O403M0350O7544L746o3292k4892P9378P3809n507r19
$$ -196582 -235616 -150908 -144505 -104155 -36611 -32865 -96157 -121049 -41671 32138 26631 25712
18410B5712o1489N9254R069L8822J16093k5020r8531j69441m4202L043r4468L063
$$ 25712 -35777 23477 32546 71368 187461 162441 63910 -105531 -149733 -146690 -241158 -238095
18398b38095J45973l9777l7117P0561J08567n1369o7019N6858j6589K038K5452
$$ -238095 -92122 -131899 -169016 -98455 10112 -41257 -108276 -51418 -68007 -65969 -40517
18387d0517o6594M1451k1963j3870o0235q8989R835R7728M2714Q5550L3515k0104
$$ -40517 -107111 -65660 -87623 -101493 -161728 -250717 -240882 -143154 -100440 -14890 18625 -1479
18375a479m6604o9569L8502k2248j74m2127J7707k8623M6692M632R3360Q5119
$$ -1479 -48083 -117652 -79150 -101398 -101572 -143699 -125992 -154615 -107923 -103291 -9931 75188
18363G5188j5893q7065q662r7828M3958l5647Q5549J5132j7120J1102k8855j6351
$$ 75188 59295 -27770 -36432 -134260 -90302 -125949 -40400 -25268 -42388 -31286 -60141 -76492
18351g6492L3036k6860j11468j4526J9978o7910m3059J18843O2807N8839r498
$$ -76492 -43456 -70316 -181784 -196310 -176332 -244242 -287301 -168458 -105651 -46812 -56310
18340e6310j41165q0448M0436M3914K2298n1224k8484O2155K3299J483n8135k8047
$$ -56310 -197475 -277923 -237487 -193573 -171275 -222499 -250983 -188828 -165529 -164046 -222181 -250228
18328b50228o5869M0691L3303K2Q0096J54167k017k063Q620n8898j8102J9990
$$ -250228 -316097 -275406 -242103 -242081 -161985 -7818 -9835 -11898 -3278 -62176 -80278 -60288
18316f0288Q0843J9529k7740m5797N6050j0506l7892J7467J7305k5851m7960J4128
$$ -60288 20555 40084 12344 -33453 22597 12091 -25801 -8334 8971 -16880 -64840 -50712
18304e0712K6893K426q2352k8714K4407L7968k0533P600j1021o0434n2063L7940
$$ -50712 -23819 -21393 -103745 -132459 -108052 -70084 -90617 -83017 -94038 -154472 -206535 -168595
18292a68595J05213K4055q3955j7337L4856N4969K1271j07755k0773R2128r794
$$ -168595 -63382 -39327 -123282 -140619 -105763 -50794 -29523 -137278 -158051 -65923 -75717
18281g5717p5732m2303O068N4528J23976L8785n4855N225J34244J12528j03601
$$ -75717 -151449 -193752 -187684 -133156 -9180 29605 -25250 -20025 114219 226747 123146
18270A23146k8394o1207L0618N7151M0163k3044J6688L0991n9184j25406j17546
$$ 123146 94752 33545 64163 121314 161477 138433 155121 186112 126928 1522 -116024
18259a16024m2196J9543j4241N1077O2225M0562m3597j44782K8379Q5758K9876
$$ -116024 -158220 -138677 -152918 -101841 -39616 946 -42651 -187433 -159054 -73296 -43420
18248d3420Q971o8215o1022m0320L0360M2714J42592k3833m5356l1197P7263j7049
$$ -43420 -34449 -102664 -163686 -204006 -173646 -130932 11660 -12173 -57529 -88726 -11463 -28512
18236b8512Q564O3460J28748M6912r8042j21004o9524L3707L2636m9309r3584
$$ -28512 -19948 43512 172260 219172 121130 126 -69398 -35691 -3055 -52364 -145948
18225a45948p2539l2880L0421J047q606O8158R7700K6381k9682n3567j5960K0911
$$ -145948 -218487 -251367 -220946 -219899 -228505 -160347 -62647 -36266 -65948 -119515 -135475 -114564
18213a14564L5361M708o6210q5417j1654L0482R6065p1171K2102J28895K3072
$$ -114564 -79203 -74495 -140705 -226122 -237776 -207294 -111229 -182400 -160298 -31403 -8331
18202h331k3926L2299P090j24947j33359N4156P1699L0284N9037n894N1951o6411
$$ -8331 -32257 42 7132 -117815 -251174 -197018 -125319 -95035 -35998 -41892 10059 -56352
18190e6352p4079N7681P4751l9235m6434J55863R1713k6152j15579n1403k3836
$$ -56352 -130431 -72750 2001 -37234 -83668 72195 163908 137756 22177 -29226 -53062
18179e3062P0933P206n1628j4603l0370p123m5499m5079J37653Q2290J8359j14890
$$ -53062 17871 25077 -26551 -41154 -71524 -78647 -124146 -169225 -31572 50718 69077 -45813
18167d5813j58575P6976J70925q433p8078n7380N029M0141k8048k907J47950R0431
$$ -45813 -204388 -127412 43513 35080 -42998 -100378 -95349 -55208 -83256 -86163 61787 152218
18155A52218M2542K6261J143l6309m391L1346M9406m8740n7875P2211J84195K9401
$$ 152218 194760 221021 222164 185855 181464 212810 262216 213476 155601 227812 412007 441408
18143D41408l3353K8853K5604j04815m2238L1229K7995J65009J21639M6573J01586
$$ 441408 408055 436908 462512 357697 315459 346688 374683 539692 661331 707904 809490
18132H09490M2739J8433J61574J43578K9417J61324J79534J50107K09948L89780
$$ 809490 852229 870662 1032236 1175814 1205231 1366555 1546089 1696196 1906144 2295924
18122B295924L38281L92799N34886P46974J186798J308785J795576K875762M628373
$$ 2295924 2634205 3027004 3561890 4308864 5495662 6804447 8600023 11475785 16104158
18113A6104158P510593J1766664J7454972K2421322K3549700K9659849M4545074
$$ 16104158 23614751 35381415 52836387 75257709 98807409 128467258 173012332
18106A73012332P841143o7025404n1102826k5446195j2885124p382389m615495
$$ 173012332 180853475 113828071 62725245 37279050 24393926 17011537 12396042
18099A2396042k917683j954643j519369j208543p73649n02097l11892l21601k87876
$$ 12396042 9478359 7523716 6004347 4795804 4022155 3520058 3208166 2886565 2598689
18090B598689l60215k67359j20132j57383j04065j71727j97990j85574r9288p9439
$$ 2598689 2238474 1971115 1850983 1693600 1589535 1417808 1219818 1034244 934956 855517
18080H55517q3582j20895o1354l0772r4181m8040J00915M5948o3772l6996j43905
$$ 855517 771935 651040 589686 558914 464733 416693 517608 563556 499784 462788 318883
18069C18883q5231p176J9740K4753r0309j04970O570K5344l4535Q3815q1794O250
$$ 318883 233652 226476 246216 270969 180660 75690 82260 107604 73069 156884 75090 81340
18057H1340k1983M97K6428m9837M9379K4982m4996J408n1038N7955M3297M0069
$$ 81340 59357 59854 86282 36445 85824 110806 65810 67218 16180 74135 117432 157501
18045A57501m5952j01533J3457m4896M0782j605M8454M9412k5308q673J1798p5851
$$ 157501 111549 10016 23473 -21423 19359 17754 66208 115620 90312 81639 93437 17586
18033A7586k4989m694M4976L062m0373l5408j1999n1117j08002L2524K9407M3927
$$ 17586 -7403 -12097 32879 35941 -4432 -39840 -51839 -102956 -210958 -178434 -149027 -105100
18021a05100J00112L2748P6602n8579j12713P6233O8584p7601j53762j3876R1076
$$ -105100 -4988 27760 104362 45783 -66930 9303 77887 286 -153476 -167352 -76276
18010g6276J3129M1411K6420l6999R44J6851M396m572n0256J647O304J7432R2741
$$ -76276 -63147 -21736 4684 -32315 -31371 -14520 -10124 -14696 -64952 -63305 -57001 -39569 53172
17997E3172r861m9144j53941p8691L0554J28409K03787q250l1428j05342k9538
$$ 53172 43311 -5833 -159774 -238465 -207911 -79502 124285 116035 84607 -20735 -50273
17986e0273N9565K4515m4488o0076Q9710M0923O9032L3215N0817j55947j28739
$$ -50273 9292 33807 -10681 -70757 18953 59876 128908 162123 212940 56993 -71746
17975g1746J1184k5893N6726R2393J07759N9182Q9051J62848J89452J18304l8216
$$ -71746 -60562 -86455 -29729 62664 170423 229605 318656 481504 670956 789260 751044
17964G51044R9707J05366O6443j67797j45956r5447j2519L7703j78062j99659
$$ 751044 850751 956117 1022560 854763 708807 613360 600841 638544 460482 260823
17954B60823q4384R920j36178j36488Q674p7404j00733O544R3369J00650K9400
$$ 260823 176439 186359 50181 -86307 -77633 -155037 -255770 -249226 -155857 -55207 -25807
17943b5807k4612J74l145p8310m0955n953l2875m4532K7212K7161K766O4560P8213
$$ -25807 -50419 -50245 -53390 -131700 -172655 -178608 -211483 -256015 -228803 -201642 -198876 -134316 -56103
17930e6103j1840p8895m1575N875J00816J16897j19320K0622N0526o649j9273
$$ -56103 -67943 -146838 -188413 -182538 -81722 35175 -84145 -63523 -12997 -19646 -38919
17919c8919J52213Q3131M7221K5751j8934r224O6852J21086J02006R4589R1584
$$ -38919 113294 196425 243646 269397 250463 241239 308091 429177 531183 625772 717356
17908G17356J62971R4849n0503j10437k18023j83161r0041o7815j74249j42199
$$ 717356 880327 975176 924673 814236 596213 413052 323011 255196 80947 -61252
17898f1252q160K9074J4980r502P871j4052o0459L5238M1220j1130n2k6322m2869
$$ -61252 -69412 -40338 -25358 -34860 -26989 -41041 -101500 -66262 -25042 -36172 -36224 -62546 -105415
17885a05415Q8861K6643j17731m3665L5887J7109j2663O5724l3966q3091o4345
$$ -105415 -16554 10089 -107642 -151307 -115420 -98311 -110974 -45250 -79216 -162307 -226652
17874b26652J16811P5699L9825L2929r994p4078J1920k5612k1888P5777o0203
$$ -226652 -109841 -34142 5683 38612 28618 -45460 -33540 -59152 -81040 -5263 -65466
17863f5466J373L2547K0142n3196p22j8834n0895N1949R2414L8285l4298j54201
$$ -65466 -64093 -31546 -11404 -64600 -65322 -84156 -135051 -83102 9312 47597 13299 -140902
17851a40902J0531k2210J9313L4356q490J19064k2629q4501j04776l4794J85064
$$ -140902 -130371 -152581 -133268 -98912 -107402 11662 -10967 -95468 -200244 -235038 -49974
17840d9974P3686m6819k2391K4182Q2284K3866j32642o9108O7422N0462N3677
$$ -49974 23712 -23107 -45498 -21316 60968 84834 -47808 -116916 -49494 968 54645
17829E4645p1802r1949j53494n2235J5006N8191J25967L2671q0342K9413J2000
$$ 54645 -17157 -109106 -262600 -314835 -299829 -241638 -115671 -83000 -163342 -133929 -121929
17818a21929l6981M1890J5716N2562m5767k8837N4042n8559n9762M4373o485N6747
$$ -121929 -158910 -117020 -101304 -48742 -94509 -123346 -69304 -127863 -187625 -143252 -149737 -92990
17806i2990Q220j4864p9629r1006r8537M6044N5036J07081O8345n7050r5654o8063
$$ -92990 -84770 -99634 -179263 -270269 -368806 -322762 -267726 -160645 -92300 -149350 -245004 -313067
17794c13067p3133O5944L4234L4578N3078P7146k6966K8621N5725l3940q6346
$$ -313067 -386200 -320256 -286022 -251444 -198366 -121220 -148186 -119565 -63840 -97780 -184126
17783a84126L0403R0995K4094l2220p9183O1043J22774j949n7086r0253J7818
$$ -184126 -153723 -62728 -38634 -70854 -150037 -88994 33780 31831 -25255 -115508 -97690
17772i7690K4681J0920q2088L6281O0512j6967n3266j7991l1933j03885N9567
$$ -97690 -73009 -62089 -144177 -107896 -47384 -64351 -117617 -135608 -167541 -271426 -211859
17761b11859Q5004N5973J662j07088j0393Q2114j1919l6175N5649P3011j21328
$$ -211859 -126855 -70882 -69220 -176308 -186701 -104587 -116506 -152681 -97032 -24021 -145349
17750a45349o4173N6924n4857M4384Q9550j6031O9271O3327m2894q4058j7262
$$ -145349 -209522 -152598 -207455 -163071 -73521 -89552 -20281 43046 152 -83906 -101168
17739a01168L3495K4120l2224N0336J00191k2991p7239l8543l2947j8223k0857
$$ -101168 -67673 -43553 -75777 -25441 74750 51759 -25480 -64023 -96970 -115193 -136050
17728a36050O630o369P8906O112N629m196o5200O0358N0774l5627l1213O6196
$$ -136050 -129420 -135789 -56883 -50771 -45142 -49338 -114538 -54180 -3406 -39033 -70246 -4050
17716d050l5192l6114j7394L6523K6781q937j001p7535K4914j8949k0763q650
$$ -4050 -39242 -75356 -92750 -56227 -29446 -38383 -39384 -116919 -92005 -110954 -131717 -140367
17704a40367k5515n983p6060l7793J34074J08488o090K860l6625k6287J8944J47816
$$ -140367 -165882 -171865 -247925 -285718 -151644 -43156 -49246 -46386 -83011 -109298 -90354 57462
17692E7462L0884M2996J464m9193K9606J2453K8915q9674j2906r9112K7959O7821
$$ 57462 88346 131342 132806 83613 113219 125672 154587 64913 52007 -47105 -19146 48675
17680D8675n2062j6988j5277k334M3785j7432p2925j47457l6785J07395j62J2317
$$ 48675 -3387 -20375 -35652 -37986 5799 -11633 -84558 -232015 -268800 -161405 -161567 -149250
17668a49250R414j11981K5370N6417Q3890P1252l7268j2872L4689M7370K9607
$$ -149250 -139836 -251817 -226447 -170030 -86140 -14888 -52156 -65028 -30339 17031 46638
17657D6638l399j11704o4639n2014J3608P9605M2976k116J8051k2446q2222j05406
$$ 46638 43239 -68465 -133104 -185118 -171510 -91905 -48929 -51045 -32994 -55440 -137662 -243068
17645b43068P1843Q4368p6783j4306N9536J7532l337l491k7457J7168M8416K2593
$$ -243068 -171225 -86857 -163640 -177946 -118410 -100878 -104215 -107706 -135163 -117995 -69579 -46986
17633d6986R3580m921j40465K8053O89p04m702J5479J5732K3650L9875m9340n1820
$$ -46986 46594 41673 -98792 -70739 -70050 -70754 -75456 -59977 -44245 -20595 19280 -30060 -81880
17620h1880j2458p2354l3821N8448j7879L4468O580O357k0499J6254p5361N9863
$$ -81880 -94338 -166692 -200513 -142065 -159944 -125476 -118896 -112539 -133038 -116784 -192145 -132282
17608a32282Q632q74m427k9198J5871J9139M5286J22904M6694p9262m1171m5525
$$ -132282 -123650 -124524 -128951 -158149 -142278 -123139 -77853 45051 91745 12483 -28688 -74213
17596g4213K6754j0446o6037p9487m5935P6678o8850K605n1578M6939q368J34708
$$ -74213 -47459 -57905 -123942 -203429 -249364 -172686 -241536 -238931 -290509 -243570 -251938 -117230
17584a17230j2975j16134L6943M5550O6897J8924k3818j6035O8112N0900n2472
$$ -117230 -130205 -246339 -209396 -163846 -96949 -78025 -101843 -117878 -49766 1134 -51338
17573e1338n2112O144l6105m8451R5575J87152K6496o2762J2793J63316L2083
$$ -51338 -103450 -97306 -133411 -181862 -86287 100865 127361 64599 77392 240708 272791
17562B72791J4234K5475j4974L2402n5856r1467k1882p6302o1254m3245m5322
$$ 272791 287025 312500 297526 329928 274072 182605 160723 84421 23167 -20078 -65400
17551f5400l2900O8541m925L5806J4269o2809J6585j7892l143J7192K0753K1820
$$ -65400 -98300 -29759 -34684 1122 15391 -47418 -30833 -48725 -51868 -34676 -13923 7897
17539G897R058J181J5791r817j15727l2087P3023K7132K6467k8796m4000j3722
$$ 7897 16955 18136 33927 24110 -91617 -123704 -50681 -23549 2918 -25878 -69878 -83600
17527h3600P6612K1781M0716m8778l0167J1970K6819p5932m1600l7865R645J30462
$$ -83600 -6988 14793 55509 6731 -23436 -11466 15353 -60579 -102179 -140044 -130399 63
17515F3N5125N773k5760j02904M3231J49455J06351k3109O1829J50510M7613k6260
$$ 63 55188 60961 35201 -67703 -24472 124983 231334 208225 270054 420564 468177 441917
17503D41917o6821p2980p7489k4850J12943m5389o8896l2393j48410l9471J28502
$$ 441917 375096 302116 224627 199777 312720 267331 198435 166042 17632 -21839 106663
17492A06663R4980J17162J08323Q601n4165O9824m9870O0437R5802j6190J7601
$$ 106663 201643 318805 427128 435729 381564 451388 401518 461955 557757 541567 559168
17481E59168n7866j3730L8067m1643L3801L5192J2511r912K0865R8342J74978
$$ 559168 501302 487572 525639 483996 517797 552989 565500 555588 576453 674795 849773
17470H49773J3578J9152l0736j2610J84448J96423J07759J16897J54005J76872
$$ 849773 863351 882503 851767 839157 1023605 1220028 1327787 1444684 1598689 1775561
17460A775561K38298K23366K78105L08394M11372N56805M77907M93186K81992
$$ 1775561 2013859 2237225 2515330 2823724 3235096 3791901 4269808 4762994 5044986
17451E044986K84246O03855Q42133J047761J206396J907083K957320M297147O481851
$$ 5044986 5329232 5933087 6775220 7822981 9029377 10936460 13893780 18190927 24672778
17442B4672778R461252J3177117J6754604K1070260K8898217L1766745J2063464
$$ 24672778 34134030 47311147 64065751 85136011 114034228 145800973 157864437
17435A57864437K963974J6799501L0216662K138127m2299701l2481588j1436058
$$ 157864437 160828411 177627912 207844574 209982701 167683000 135201412 123765354
17428A23765354p606651k7821683l0606934j9125935j0995476o762758m439031
$$ 123765354 116158703 88337020 57730086 38604151 27608675 20845917 16406886
17421A6406886k940765k018365j354129j028660q49639o23637n88963l93987k35882
$$ 16406886 13466121 11447756 10093627 9064967 8215328 7591691 7002728 6608741 6372859
17412F372859k50685n28799m05577k54908j54228j03956k44815q9042R8534K12964
$$ 6372859 6122174 5593375 5187798 4932890 4778662 4674706 4429891 4340849 4439383 4652347
17402D652347J42254J15490K53711M95861L21324J40975M50551O57593P53683
$$ 4652347 4794601 4910091 5163802 5659663 5980987 6121962 6572513 7230106 7983789
17393G983789R05944J185346J728927K843906M428864O489613R299452J2863171
$$ 7983789 8889733 10075079 11804006 14647912 19076776 25566389 34865841 47729012
17385D7729012J6457071K1354159K9251312K8448773P520063M001099J8914708
$$ 47729012 64186083 85540242 114791554 143240327 150760390 154761489 173676197
17378A73676197K7949396q686143m2343002k6796048q097454r663913k9309455
$$ 173676197 201625593 192939450 150596448 123800400 115702946 106039033 76729578
17371G6729578k7158716j6176937r216717n759154l895337k751730j745521j177657
$$ 76729578 49570862 33393925 24177208 18418054 14522717 11770987 10025466 8847809
17363H847809r78783o85360n54190o68629n08627k15019l02996n62962n61383
$$ 8847809 7869026 7183666 6629476 5960847 5452220 5237201 4934205 4371243 3809860
17354C809860l08068k68233l27001l35738k08747k37880k23752j76659r2616q4232
$$ 3809860 3501792 3233559 2906558 2570820 2362073 2124193 1900441 1723782 1631166 1546934
17344A546934n2681j13579p8327M1819K1536L4347J12161M7345J7402q4006n1379
$$ 1546934 1494253 1380674 1302347 1344166 1365702 1400049 1512210 1559555 1576957 1492951 1441572
17333A441572k4168j55245j81492l6275o0725j12479o5514J516K0360q4863p4111
$$ 1441572 1417404 1262159 1080667 1044392 983667 871188 805674 807190 827550 742687 668576
17322F68576o4054j0461L1498o2730P489K72K0477j06764l9766J27497j12018
$$ 668576 604522 594061 625559 562829 570318 570590 591067 484303 444537 572034 460016
17311D60016K7904O374O611k6738P496l4420j6417R9786n6531K4637N999p9158
$$ 460016 487920 494294 500905 474167 481663 447243 430826 530612 474081 498718 504717 425559
17299D25559j23304K6368J22037J8822k9605o2601N5994M7668m0433j43687k1218
$$ 425559 302255 328623 450660 469482 439877 377276 433270 480938 440505 296818 275600
17288B75600q7708J01027O3534M6080N5795j9810m891N3824q3495n7935p4290
$$ 275600 187892 288919 352453 398533 454328 434518 429627 483451 399956 342021 267731
17277B67731L7629M8360j32584o4587p917J5135q6990J308J66967K1590n87p2393
$$ 267731 305360 353720 221136 156549 148632 163767 76777 78085 245052 266642 266055 193662
17265A93662q0650J6304K2612l435r2870o6910N5449o8363J3592K06935J15824
$$ 193662 113012 129316 151928 148493 55623 -11287 44162 -24201 -10609 196326 312150
17254C12150j4418j68391J5125N8702M1216n4016j44291N633j7377N3593j6962
$$ 312150 297732 129341 144466 203168 244384 190368 46077 51710 34333 87926 70964
17243G0964M8624l3845k95N9806K301n3053o4427k5446m1184Q0718M2175J0158
$$ 70964 119588 85743 85448 145254 147555 94502 30075 4629 -36555 44163 86338 96496
17231I6496q2733K0582M8844N0187K5312j295J6185j20879J8380J0281m6292o5277
$$ 96496 13763 34345 83189 133376 158688 157393 173578 52699 71079 81360 35068 -30209
17219c0209n9599l4830K222R5214N8812J1206l4655J33878j11267j85405m8022
$$ -30209 -89808 -124638 -122416 -27202 31610 42816 8161 142039 30772 -154633 -202655
17208b02655O2782O9729P3421O2478l1901j0475K4354k8925j4802p110m5545k6761
$$ -202655 -139873 -70144 3277 65755 33854 23379 47733 18808 4006 -3104 -48649 -75410
17196g5410J09116N143j3208M296o3170J6823m80l0919N7404k2733j13916n8199
$$ -75410 33706 38849 25641 29937 -33233 -16410 -16890 -47809 9595 -13138 -127054 -185253
17184a85253J1137J7196k394O7491N4827J32379M7703q0136n5660J7991R0606
$$ -185253 -174116 -156920 -159314 -91823 -36996 95383 143086 62950 7290 25281 115887
17173A15887k0346j54686L400K1657L4L925N8450m2854Q106P5516L0682R729p3696
$$ 115887 95541 -59145 -55745 -34088 -34054 -30129 28321 -14533 -6427 69089 99771 109500 35804
17160C5804j16605J9122l224M2722j7513m0260P5326R3060l2192l2876j0092o042
$$ 35804 -80801 -61679 -64903 -22181 -39694 -79954 -4628 88432 56240 23364 13272 7230
17148G230M2464J3983j62479j15954n2669J0269O0451O8562M7305j4053P9665
$$ 7230 49694 63677 -98802 -214756 -267425 -257156 -196705 -128143 -80838 -94891 -15226
17137a5226M3979o1297j7797p1311K7390K6588k6093o0611K5875L6831p355k4263
$$ -15226 28753 -32544 -50341 -121652 -94262 -67674 -93767 -154378 -128503 -91672 -99027 -123290
17125a23290j13284k3662J58647N2485q4857K1776O1604l1963Q419m794m6727
$$ -123290 -236574 -260236 -101589 -49104 -133961 -112185 -50581 -82544 -74125 -78919 -125646
17114a25646N0622L4906j4410J6756Q6569m0846p9779k659L8649j06460k6428
$$ -125646 -75024 -40118 -54528 -37772 48797 7951 -71828 -74487 -35838 -142298 -168726
17103a68726j08688m7796J56092K8450r8439L3079J15992P7855J0017l2503p1015
$$ -168726 -277414 -325210 -169118 -140668 -239107 -206028 -90036 -12181 -2164 -34667 -105682
17092a05682M7470J65530n1167o5640k8261m6914O07o6762k4259M1148O759J9366
$$ -105682 -58212 107318 56151 -9489 -37750 -84664 -84057 -150819 -175078 -133930 -127171 -107805
17080a07805N32K9695N52l6902O9038l00j21437O5180q222N678P8306M3573o4483
$$ -107805 -107273 -77578 -77026 -113928 -44890 -45190 -166627 -101447 -109669 -103991 -25685 17888 -46595
17067d6595K2846J9554m4637j2285Q5488r0496j5341J12616P3864j9324k35212
$$ -46595 -23749 -4195 -48832 -61117 24371 -66125 -81466 31150 105014 85690 -149522
17056a49522j19417J6551K9813k7501N63N402L7537P5602J7901q6163n7793l211
$$ -149522 -268939 -252388 -222575 -250076 -249513 -244111 -206574 -130972 -113071 -199234 -257027 -260238
17044b60238O8229N4622r633j7863K8520K3972l0003K963J40953J6383k3642m3242
$$ -260238 -192009 -137387 -147020 -164883 -136363 -112391 -142394 -139431 1522 17905 -5737 -48979
17032d8979L2100o840j087r1661r3725k7773M338j167L5390n0197O9240P9721
$$ -48979 -16879 -23719 -24806 -116467 -210192 -237965 -233627 -234794 -199404 -249601 -180361 -100640
17020a00640l4174q68P8464L5746r4376J9286j75072j13666J25341J13618N5000
$$ -100640 -134814 -135682 -57218 -21472 -115848 -96562 -271634 -385300 -259959 -146341 -91341
17009i1341j5578m5374j7821J2826J9405n1236m9893J5002k475L2506j8138l907
$$ -91341 -106919 -152293 -170114 -157288 -137883 -189119 -239012 -224010 -226485 -193979 -212117 -216024
16997b16024K4055o6523j3775P1495P0860k3898L1394N1090r846J3511k556N3360
$$ -216024 -191969 -258492 -272267 -200772 -129912 -153810 -122416 -71326 -81172 -67661 -70217 -16857
16985a6857O9549n4146J2586r004l0751l5212O3060k713p7402J295N3482K1216
$$ -16857 52692 -1454 11132 2128 -28623 -63835 -775 -3488 -80890 -79595 -26113 -4897
16973d897j22254J3062L5143p7564n7411L5844Q1370n3322M942L2479l2246P7917
$$ -4897 -127151 -114089 -78946 -156510 -213921 -178077 -96707 -150029 -145087 -112608 -144854 -66937
16961f6937L3073o0394N9727O348k3094l7210M477J0100l1117J2572N102l8770
$$ -66937 -33864 -94258 -34531 -28183 -51277 -88487 -84010 -73910 -105027 -92455 -87353 -126123
$$ [...]
##END NTUPLES=NMR SPECTRUM
##END=
