##TITLE=Analysis number 328206
Compound Code cc 58309
Book Reference 467/144/3
Project Code adrs
Chemist Name benw
##JCAMPDX= 6.0         $$ Bruker NMR JCAMP-DX V2.0
##DATA TYPE= NMR SPECTRUM
##DATA CLASS= NTUPLES
##ORIGIN= Bruker BioSpin GmbH
##OWNER= nmr
$$ XWIN-NMR		Version 3.5
$$ Mon May 14 09:49:34 2007 GMT Daylight Time (UT+1h)  MAYBRIDGE\nmr@NMR_250MHZ
##.OBSERVE FREQUENCY= 250.131544655141
##.OBSERVE NUCLEUS= ^1H
##.ACQUISITION MODE= SIMULTANEOUS (DQD)
##.ACQUISITION SCHEME= undefined
##.AVERAGES= 16
##.DIGITISER RES= 18
##SPECTROMETER/DATA SYSTEM= dpx250
##.PULSE SEQUENCE= zg30
##.SOLVENT NAME= CDCl3
##.SHIFT REFERENCE= (INTERNAL, CDCl3, 0, 16.4554)
##AUDIT TRAIL= $$ (NUMBER, WHEN, WHO, WHERE, WHAT)
$$ ##TITLE= Audit trail, XWIN-NMR		Version 3.5
$$ ##JCAMPDX= 5.01
$$ ##ORIGIN= Bruker BioSpin GmbH
$$ ##OWNER= nmr
$$ C:\u/data/dgb/nmr/ADRS/930/pdata/1/auditp.txt
$$ ##AUDIT TRAIL=  $$ (NUMBER, WHEN, WHO, WHERE, WHAT)
(   1,<2007-05-14 09:49:06.18 +100>,<MAYBRIDGE\nmr>,<NMR_250MHZ>,
      <created by zg, POWCHK disabled, PULCHK disabled
       configuration hash MD5:
       76 6E 9A 78 1E 09 19 81 EC 84 63 8F B0 6A 59 2D
       data hash MD5: 64K
       BE A3 11 E5 B2 D6 27 C4 8B 8A 33 B2 A7 96 04 43>)
(   2,<2007-05-14 09:49:21.21 +100>,<MAYBRIDGE\nmr>,<NMR_250MHZ>,
      <Start of raw data processing
       ef LB = 0.3 FT_mod = 6 PKNL = 1 SI = 32K 
       data hash MD5: 32K
       61 B3 05 40 B1 74 0B 28 E9 69 E9 9A 7B 39 FC 9D>)
(   3,<2007-05-14 09:49:23.21 +100>,<MAYBRIDGE\nmr>,<NMR_250MHZ>,
      <apk 
       data hash MD5: 32K
       95 A6 5E 2A FA B8 DA E7 46 BC 49 FF 9F D2 A0 54>)
(   4,<2007-05-14 09:49:24.15 +100>,<MAYBRIDGE\nmr>,<NMR_250MHZ>,
      <abs ABSG = 5 
       data hash MD5: 32K
       45 9B E3 50 D7 F6 F7 4A E8 91 FF D7 24 50 C4 27>)
$$ ##END=
$$ 
$$ hash MD5
$$ 8E 76 03 2E 00 8A 51 B3 5A 7C 74 BC C7 D3 28 A4
##$RELAX= 
##$RELAX= 
##$RELAX= 
##$RELAX= 
##$RELAX= 
##$RELAX= 
##$RELAX= 
$$ Bruker specific parameters
$$ --------------------------
##$DU= <C:\u>
##$EXPNO= 930
##$NAME= <ADRS>
##$PROCNO= 1
##$TYPE= <nmr>
##$USER= <dgb>
##$AMP= (0..31)
100 100 100 100 100 100 100 100 100 100 100 100 100 100 100 100 100 100 
100 100 100 100 100 100 100 100 100 100 100 100 100 100 
##$AQSEQ= 0
##$AQ_mod= 3
##$AUNM= <au_zg>
##$AUTOPOS= <6 >
##$BF1= 250.13
##$BF2= 250.13
##$BF3= 250.13
##$BF4= 250.13
##$BF5= 500.13
##$BF6= 500.13
##$BF7= 500.13
##$BF8= 500.13
##$BYTORDA= 1
##$CFDGTYP= 0
##$CFRGTYP= 5
##$CHEMSTR= <none>
##$CNST= (0..31)
1 1 145 1 1 1 1 1 1 1 1 1 1 1 1 1 1 1 1 1 1 1 1 1 1 1 1 1 1 1 1 1 
##$CPDPRG= <>
##$CPDPRG1= <>
##$CPDPRG2= <>
##$CPDPRG3= <>
##$CPDPRG4= <mlev>
##$CPDPRG5= <mlev>
##$CPDPRG6= <mlev>
##$CPDPRG7= <mlev>
##$CPDPRG8= <mlev>
##$CPDPRGB= <>
##$CPDPRGT= <>
##$D= (0..31)
0 1 0 0 0 0 0 0 0 0.06 0 0 0 0 0 0 0.0002 0 0 0 0 0 0 0 0 0 0 0 0 0 0 
0 
##$DATE= 1179132545
##$DBL= (0..7)
120 120 120 120 120 120 120 120 
##$DBP= (0..7)
150 150 150 150 150 150 150 150 
##$DBP07= 0
##$DBPNAM0= <>
##$DBPNAM1= <>
$$ [...]
##$SUBNAM8= <"">
##$SUBNAM9= <"">
##$SW= 20.6930455092707
##$SWIBOX= (0..15)
0 0 3 0 0 0 0 0 0 0 0 0 0 0 0 0 
##$SW_h= 5175.983436853
##$TD= 65536
##$TD0= 1
##$TE= 683.16
##$TE2= 300
##$TE3= 300
##$TEG= 300
##$TL= (0..7)
0 120 120 120 120 120 120 120 
##$TP= (0..7)
150 150 150 150 150 150 150 150 
##$TP07= 0
##$TPNAME0= <>
##$TPNAME1= <>
##$TPNAME2= <>
##$TPNAME3= <>
##$TPNAME4= <>
##$TPNAME5= <>
##$TPNAME6= <>
##$TPNAME7= <>
##$TPOAL= (0..7)
0.5 0.5 0.5 0.5 0.5 0.5 0.5 0.5 
##$TPOFFS= (0..7)
0 0 0 0 0 0 0 0 
##$TUNHIN= 0
##$TUNHOUT= 0
##$TUNXOUT= 0
##$USERA1= <user>
##$USERA2= <user>
##$USERA3= <user>
##$USERA4= <user>
##$USERA5= <user>
##$V9= 5
##$VALIST= <valist>
##$VCLIST= <CCCCCCCCCCCCCCC>
##$VD= 0
##$VDLIST= <DDDDDDDDDDDDDDD>
##$VPLIST= <PPPPPPPPPPPPPPP>
##$VTLIST= <TTTTTTTTTTTTTTT>
##$WBST= 1024
##$WBSW= 4
##$XGAIN= (0..3)
0 0 0 0 
##$XL= 0
##$YL= 0
##$YMAX_a= 318943
##$YMIN_a= -346897
##$ZGOPTNS= <>
##$ZL1= 120
##$ZL2= 120
##$ZL3= 120
##$ZL4= 120
##$ABSF1= 16.45544
##$ABSF2= -4.237732
##$ABSG= 5
##$ABSL= 3
##$ALPHA= 0
##$AQORDER= 0
##$ASSFAC= 0
##$ASSFACI= 0
##$ASSFACX= 0
##$ASSWID= 0
##$AUNMP= <proc_1d>
##$AZFE= 0.1
##$AZFW= 0.1
##$BCFW= 0
##$BC_mod= 0
##$BYTORDP= 0
##$COROFFS= 0
##$CY= 12.5
##$DATMOD= 1
##$DC= 0
##$DFILT= <>
##$DTYPP= 0
##$F1P= 14.0000005364418
##$F2P= -0.99999901652339
##$FCOR= 0.5
##$FTSIZE= 32768
##$FT_mod= 6
##$GAMMA= 0
##$GB= 0
##$INTBC= 1
##$INTSCL= 1
##$ISEN= 128
##$LB= 0.3
##$LEV0= 0
##$LPBIN= 0
##$MAXI= 10000
##$MC2= 0
##$MEAN= 0
##$ME_mod= 0
##$MI= 0
##$NCOEF= 0
##$NC_proc= -6
##$NLEV= 6
##$NOISF1= 0
##$NOISF2= 0
##$NSP= 0
##$NTH_PI= 0
##$NZP= 0
##$OFFSET= 16.45544
##$PC= 1
##$PHC0= -53.20514
##$PHC1= 7.014757
##$PH_mod= 1
##$PKNL= yes
##$PPARMOD= 0
##$PSCAL= 4
##$PSIGN= 0
##$REVERSE= no
##$SF= 250.130016648001
##$SI= 32768
##$SIGF1= 0
##$SIGF2= 0
##$SINO= 400
##$SIOLD= 32768
##$SREGLST= <1H.CDCl3>
##$SSB= 0
##$STSI= 32768
##$STSR= 0
##$SW_p= 5175.98343685301
##$SYMM= 0
##$S_DEV= 0
##$TDeff= 65536
##$TDoff= 0
##$TI= <Analysis number 999999
Compound Code 99
Book Reference 9
Project Code 9>
##$TILT= no
##$TM1= 0
##$TM2= 0
##$TOPLEV= 0
##$USERP1= <user>
##$USERP2= <user>
##$USERP3= <user>
##$USERP4= <user>
##$USERP5= <user>
##$WDW= 1
##$XDIM= 32768
##$YMAX_p= 318052012
##$YMIN_p= -1232366
$$ End of Bruker specific parameters
$$ ---------------------------------
##NTUPLES= NMR SPECTRUM
##VAR_NAME=  FREQUENCY,     SPECTRUM/REAL,   SPECTRUM/IMAG
##SYMBOL=    X,             R,               I
##VAR_TYPE=  INDEPENDENT,   DEPENDENT,       DEPENDENT
##VAR_FORM=  AFFN,          ASDF,            ASDF
##VAR_DIM=   32768,         32768,           32768
##UNITS=     HZ,            ARBITRARY UNITS, ARBITRARY UNITS
##FACTOR=    0.157963299565203, 1,           1
##FIRST=     4115.99961152801, 0,            0
##LAST=      -1059.983825325, 0,             0
##MIN=       -1059.983825325, -1232366,      0
##MAX=       4115.99961152801, 318052012,    0
$$ Real data points
##PAGE= N=1
##DATA TABLE= (X++(R..R)), XYDATA
$$ [...]
22431a13713j50957J0869R9070J32381J9277j46070P193r175l4190L8808J4548
22420a31959M7823M2613j42460r992P9552Q3331j29614O1860J7475J1693N8425
22409a1253M0613k1502O405o3209k7541K7832k8197M8546J10950o57K6386j1335
22397I7038j06480o7293k1234O877L9350O4509l8314k02796j16760R0034K47986
22386g083J01032O0794M2815j01287j63732k9578P3813K466J16342J1476j728
22375A05330q9722n6773K3161l9526j21150K7867O4891L5268P8207J9493q3442
22364c6396K0218j3002n0603L748N3724J28829N014j81138P6088M4015N059l6791
22352A8765N4918n033p8349N9216j15586k16889M3913J49533j9082j18290l3852
$$ y = [-113713, -264670, -253801, -154731, -22350, -3073, -149143, -141950, -151125, -185315, -146507, -131959, -84136, -41523, -183983, -193975, -114423, -31092, -160706, -98846, -81371, -69678, -11253, 29360, 7858, 14263, -48946, -76487, -48655, -76852, -28306, 82644, 81987, 108373, 97038, -9442, -76735, -97969, -91092, -51742, 12767, -25547, -228343, -345103, -255069, -7083, 93949, 154743, 197558, 96271, -67461, -97039, -23226, -20760, 95582, 107058, 105330, 15608, -41165, -18004, -57530, -178680, -150813, -85922, -50654, 27553, 47046, -36396, -16178, -29180, -79783, -76035, -22311, 106518, 111532, -69606, 6482, 50497, 55556, 18765, 73683, 68650, -9699, 49517, -66069, -282958, -239045, -89512, -108594, -226884, -260736]
22341b60736J79318J02223R6920l3762P1072J11560j29468N1063Q2052k3887J626
22330B47981j86243R014P1782J13022J01211m8657k30032k55347N3525l4150j78032
22319c35926P4056R1421J63329J00486L5404j14411j9941K3213r3968K04367K0492
22308A48522M160J27952n9118j1426r6272r0160l5729l1569n7840N5089M9j11613
22296a57955M9987J29268Q3921n3555K1884J4140j22031L9722Q2959j4586r5634
22285b1880j3573j6620j06246O964O5975o0860N9354P9620J1282n8264M2051j03653
22273a15850j140o6840O0991J57477n2500o5541j60412j8228O5244J01138q3289
22262a78950j37829O425l2097P9732K59659P5009r9664j12846j1966L1445J21648
$$ y = [-260736, -81418, 20805, 117725, 83963, 155035, 266595, 137127, 188190, 270242, 246355, 247981, 61738, 70752, 142534, 255556, 356767, 308110, 78078, -177269, -123744, -157894, -335926, -261870, -170449, -7120, 93366, 128770, 14359, -5582, 17631, -76337, 128030, 148522, 152682, 280634, 221516, 210090, 113818, 23658, -12071, -43640, -101480, -46391, -46342, -157955, -107968, 21300, 105221, 51666, 73550, 87690, -34341, 5381, 88340, 73754, -21880, -35453, -52073, -158319, -151355, -85380, -146240, -86886, -7266, 4016, -54248, -12197, -115850, -116990, -183830, -122839, 34638, -17862, -83403, -243815, -262043, -196799, -95661, -178950, -316779, -310354, -342451, -262719, -3060, 71949, -27715, -140561, -152527, -121082, 566]
22251E66P1138m8839K6997L0117o6887p3818l6001J28283q4833j55984j28378
22240c37639j5067R3905J12094R7367J91832n2357j7920j48753k1174Q9879j95949
22229b03782j90671K8795O4029J1887J14763q5845K6044Q0840m0856Q7230N9721
22218d7845l4601k0509j26850K6375K03743R0971k64741j71623Q5907J32683P9331
22207d7159R8745J1136r9305r5619R8072j42197j09471R4011J62146M0837R0321
22196A01517N7444k73696q7738J85895J7516p7335K3453k4619o3528p5366l1804
22185b48261L6603O7998q1740m9047J31918Q1974p7344j38996K1940J67264N680
22174h2011j66556O050R4298k5338j0779o9896L2264J70038K7976l4319m1519
$$ y = [566, 71704, 22865, 49862, 79979, 13092, -60726, -96727, 31556, -53277, -209261, -337639, -352706, -258801, -146707, -49340, 142492, 90135, 72215, -76538, -97712, -7833, -203782, -394453, -365658, -301629, -289742, -174979, -260824, -234780, -153940, -194796, -107566, -47845, -82446, -102955, -229805, -203430, 313, 91284, -173457, -345080, -259173, -126490, -47159, 51586, 62722, -36583, -132202, -34130, -176327, -285798, -191787, -29641, 11196, 101517, 158961, -114735, -202473, -16578, 938, -76397, -52944, -77563, -141091, -216457, -248261, -211658, -143660, -225400, -274447, -142529, -60555, -137899, -276895, -254955, -87691, -82011, -248567, -242517, -148219, -173557, -184336, -254232, -221968, -51930, -23954, -58273, -99792]
22163i9792K1463N5361P1023j20660n7964o7782l4360P1250J44405N5699r6558
22152e7915j65718L6471k045P0220M8669n6586J7040k5166J6714n436J27588O0779
22140F4615p5473j13989q7674J61116R9222j0356n9109Q3095m6443r3499O3586
22129a4909J10920M2139m3516M50q1936L0571p4049l2374j39738n7506K01877
22118e8071K16776R4634j69983N3149P435Q20r8447r6241p7395j5425J29898J9045
22106F195P4293J32159Q5776N1111j61435l0729o0121m3046l3655K16154J3099
22095B49801p7939j0837n4989j84067j48102n2327J20638Q1273K7874J24080q411
22084F6994J9848r1133j15712m5167N2324M6640J49220R5957j39951n5913J25407
$$ y = [-99792, -78329, -22968, 48055, -72605, -130569, -198351, -232711, -161461, -17056, 38643, -57915, -223633, -187162, -189207, -118987, -70318, -126904, -109864, -135030, -118316, -123752, 3836, 64615, -10858, -124847, -212521, -51405, 47817, 37461, -21648, 61447, 15004, -78495, -14909, 96011, 138150, 94634, 95084, 13148, 43719, -30330, -62704, -202442, -259948, -58071, 158705, 253339, 83356, 136505, 143940, 144760, 46313, -49928, -127323, -142748, -12850, 6195, 80488, 212647, 298423, 349534, 188099, 157370, 97249, 54203, 20548, 236702, 249801, 171862, 161025, 106036, -78031, -226133, -278460, -157822, -76549, -48675, 75405, 66994, 86842, -4291, -120003, -165170, -112846, -66206, 83014, 178971, 39020, -16893, 108514]
22073A08514O0733m5049Q7180P815j83647R0477m3134k09091k7111o9357K7184
22062a95486J90474K34874L1026j51320q6852k7884k7736j17854M1985Q8445K8388
22051H060R9915m7349j4280O3342O1628J41102j35951j19796P9321n7849r0007
22040a1864j56509R8502J61096J1610q5213j0660M1539j56313o3393J19225j7927
22029f9907N891P0053J1791P0154l8165k31250R1802K82166P7499O3027K5516
22018C58577k35273l3455N510j96163N1108l501P6929P0952J493k08687K5676
22007h6834J60881P4062J14937N4244j15977o5080N1047k5947j82546Q6572O4246
21996A29605O3J8401l5335J5916j33107j09637R632K28377J21815p0415j38811
$$ y = [108514, 169247, 124198, 211378, 219193, 35546, 126023, 82889, -126202, -153313, -222670, -195486, -5012, 229862, 260888, 109568, 22716, -5168, -32904, -150758, -108773, -20328, 8060, 107975, 60626, 46346, 109688, 171316, 312418, 176467, 56671, 135992, 78143, -11864, -168373, -69871, 91225, 102835, 17622, 6962, 48501, -107812, -171205, -51980, -69907, -64016, 6037, 17828, 87982, 49817, -181433, -89631, 192535, 270034, 333061, 358577, 123304, 89849, 95359, -100804, -49696, -53197, 23732, 94684, 96177, -112510, -86834, 74047, 148109, 263046, 317290, 201313, 136233, 187280, 161333, -21213, 65359, 129605, 129668, 148069, 112734, 128650, -4457, -114094, -104462, 123915, 245730, 175315, 36504]
21985C6504n637J29121O5283j62889o8570L7803O7218Q333Q7796K3731o2910L7585
21973A93368j5668j25968K3069K23100O6123m1108m6535j20917Q09O297J03635
21962B66205k6628q5631m0548j33541n1612O5707l072l3580j13218j8247O4620
21951a09545J02354n9861K491J33537J1951R418L4751L7674n2566o6976J2151
21940E5379j3131j14896l4634J20382Q5480p1923o6391N5742J03139j79980j11365
21929a72198J06067P0041K20373j00151p507J41586O376k9298r8174j48394J7074
21918E795J02002j0163P4987M8504j85806q1387J8439j1221j3132L9026m9760
21907f2716O7817K987J27210N7640k01007j46533J13196J21758n2812j40007O2347
$$ y = [36504, 30867, 159988, 225271, 62382, -6188, 31615, 98833, 107166, 194962, 218693, 155783, 193368, 177700, 51732, 74801, 297901, 364024, 322916, 276381, 155464, 156273, 162570, 266205, 239577, 153946, 113398, -20143, -71755, -6048, -9120, -42700, -155918, -174165, -109545, -7191, -67052, -64561, 68976, 80927, 90345, 125096, 162770, 110204, 43228, 55379, 42248, -72648, -107282, 13100, 98580, 26657, -39734, 16008, 119147, -60833, -172198, -66131, 3910, 224283, 124132, 116625, 258211, 264587, 235289, 137115, -11279, 5795, 107797, 97634, 172621, 221125, 35319, -46068, -27629, -38850, -51982, -12956, -62716, 5101, 8088, 135298, 192938, -8069, -154602, -41406, 80352, 27540, -112467, -50120]
21896e0120N1341j04333L1490J84993j9750n3377k3929l0187k3134o4210Q9388
21885a1828J03513l5250o4321j6883O6762j8783j03492j05769j8547L6096O5286
21874a03216l5513P3666K2513K6381Q390l1646p8050p8478j58518L1748Q9635
21863b33088P0519k5727P6226M5280M2429J03897l1786j32042N1780r0583J1955
21852a11140J2766P4304L9770P2310J81934j56001j52051k0620K5325j04782q0515
21841b18700Q3627r0251l1865J33246m7123m6752J19199J14490O0556R9999P5051
21830B51477o1580j37980j63581m600O9577R1788o0713j64511J87963P6729K7261
21819A11830K6718j13766q2946R9797P8900l77o4901j62598j02635L1851m20J87030
$$ y = [-50120, 1221, -103112, -71622, 113371, 93621, 40244, 16315, -13872, -37006, -101216, -11828, 91685, 56435, -7886, -24769, 41993, 23210, -80282, -186051, -204598, -168502, -103216, -138729, -65063, -42550, -16169, -7779, -39425, -117475, -195953, -354471, -322723, -233088, -162569, -188296, -112070, -66790, -24361, 79536, 47750, -84292, -32512, -123095, -111140, -98374, -24070, 15700, 88010, 269944, 113943, -38108, -58728, -33403, -138185, -218700, -135073, -225324, -257189, -123943, -171066, -217818, -98619, 15871, 76427, 176426, 251477, 189897, 51917, -111664, -116264, -46687, 45101, -15612, -180123, 7840, 84569, 111830, 138548, 24782, -58164, 41633, 120533, 120156, 55255, -107343, -209978, -178127, -178547, 8483]
21807H483J46508l0434j35064n6772J4281O2604N2708Q4619j80311p3406q457
21796a15241P5852p7578k2345J23934j0426j62073N687M3922J37694l9098J50325
21785A10653J6022L1737p2587j68342k9085j50693O2190J50005r5731j14099J26729
21774a33201K7978r442N6892O7557J11852n7174M1808R5341j47548k35270M9167
21763a32040J69289k4820j39645k3871N8769j662o29R4583K9793j04518Q3220
21752H469n6582r999J32948L5137j16147K716p8372J15529k22244J7989K21644
21741E1088J10105m2541p9083J1232l5002J10634O1511k6252n0077j07245j48789
21730a44419K1338j12073J21666K35592p412r6941J22473j24824o5696m8817o0013
$$ y = [8483, 154991, 124557, -10507, -67279, -52998, 9606, 62314, 146933, -33378, -106784, -115241, -39389, -116967, -139312, -15378, -25804, -187877, -182190, -138268, -574, -39672, 110653, 126675, 158412, 85825, -82517, -111602, -262295, -200105, -50100, -145831, -259930, -133201, -105223, -114665, -57773, 9784, 121636, 64462, 106270, 201611, 54063, -181207, -132040, 37249, 12429, -127216, -151087, -92318, -93980, -94609, -26, 29767, -74751, 8469, -48113, -58112, 74836, 109973, -6174, -3458, -81830, 33699, -188545, -170556, 51088, 161193, 118652, 39569, 50801, 15799, 126433, 187944, 161692, 111615, 4370, -144419, -123081, -235154, -113488, 122104, 114692, 17751, 140224, 15400, -50296, -99113, -159126]
21719a59126J02933J96373M5265q1549k23013Q936K32108J42096j57267l08312
21709b01556k0197P4891j0177r4474Q743R7363J27022N4133r3746j68507K0990
21698b05515L6946r041k2641J59317J0671O2332N5674J28015j84159j12266P9235
21687a432r8341J15898n1598j75899K4201K19199r502l14034R1298J05837M6547
21676d7826p5188j838J44975J3168L9912J3617M7022j8720j14843o1997r3461
21665a55179k9194p7053J80777O4591p3849J4993l1925r5774J34430J19216j11448
21654f0415q3068n0244j32036M5978K356O024M6931j82443M1520J33309O1489
21643a70599J16839k3188l754O4814p9141L6027K8687l0182m743K13667l0528
$$ y = [-159126, -56193, 140180, 185445, 103896, -119117, -110181, 121927, 264023, 106756, -201556, -221753, -146862, -157039, -251513, -242770, -145407, -18385, 35748, -57998, -226505, -205515, -168569, -177610, -200251, -40934, -30263, 32069, 87743, 215758, 31599, -80667, -1432, -99773, 16125, -35473, -211372, -187171, 32028, 22526, -291508, -200210, -94373, -47826, -123014, -124852, 20123, 33291, 73203, 86820, 133842, 115122, 279, -61718, -155179, -184373, -261426, -80649, -16058, -89907, -74914, -106839, -202613, -68183, 51033, -60415, -143483, -193727, -325763, -279785, -277429, -271405, -224474, -406917, -365397, -232088, -170599, -53760, -76948, -80702, -15888, -95029, -59002, -30315, -60497, -65240, 148427, 117899]
21632A17899m1756q5438m8847j61272n0534J81935J78785N3689j04458O892M3136
21621I0031j14453k13928j17862J3160O2681J35377L3322o5718N5121J12791L4068
21610B4590m8105j39080P238J1297J30473J26787k0933j07767j48146k9358J6781
21599a76223R4421J21605j66342j29844j2040m2483J28017K13347K23147o1073
21589A92532k70021j35682j24185l8952J80658J60972O1289j65333o086J39887
21579d921Q1712j78607r4137J95084p9172o007k8892N4789K8927Q7693Q0154R9147
21567B35770L5033j12681l1924n9323K7833m551K3197j37029N7151P8042N2771
21556A64289Q8271j29541j02726j7382k0367m76J29429K21265P1670j05907k97461
$$ y = [117899, 76143, -9295, -58142, -219414, -269948, -88013, 90772, 144461, 40003, 46895, 90031, -24422, -238350, -356212, -343052, -280371, -144994, -111672, -177390, -122269, -9478, 24590, -23515, -162595, -155357, -144060, -13587, 113200, 92267, -15500, -163646, -193004, -176223, -81802, 39803, -126539, -256383, -268423, -310906, -182889, 30458, 253605, 192532, -77489, -213171, -337356, -376308, -195650, -34678, 26611, -138722, -144808, -4921, 76791, -101816, -195953, -869, -80041, -86048, -114940, -60151, -31224, 56469, 136623, 235770, 270803, 158122, 126198, 66875, 94708, 90157, 113354, -23675, 33476, 111518, 164289, 252560, 123019, 20293, 2911, -17456, -17932, 111497, 332762, 404432, 298525, 1064]
21545A064m5154m0347L8375J19939j40731j21259J73103J07822k04895q1736p2992
21534b66811r3178n4325P6339K2656P505p0002q103L8401R8574J54772J00218
21523F046P1000q9663o6206P1791P1881j678k0824j10141q7676P1798K50764R4238
21511B61330O2174j02630j00246j14985K6250Q3006o2276j8864j3381q5299o6680
21500a31601J5206J0816Q53M4206J30888l4134l1146j47822N7786l4076o4662
21489a83686k0504j75706q6912J10583P8434N5187m1039j7292K3448P2201k3212
21478b08498L8662K02144o5454q8849J70420J1736p981q9237j09619L0617n5189
21467a71248L7246J0780J74160J6495r104m7948l3200P3868M4720N3901m1398
$$ y = [1064, -44090, -84437, -46062, 73877, -66854, -188113, -15010, 92812, -112083, -193819, -266811, -359989, -414314, -337975, -315319, -307814, -377816, -385919, -347518, -248944, -94172, 6046, 77046, -12617, -78823, -7032, 64849, 63171, 42347, -67794, -155470, -83672, 167092, 261330, 323504, 220874, 120628, 5643, 31893, 114899, 52623, 33759, 20378, -64921, -131601, -116395, -105579, -104726, -60520, 70368, 36234, 5088, -142734, -84948, -119024, -183686, -204190, -379896, -466808, -356225, -277791, -222604, -263643, -280935, -257487, -185286, -208498, -169836, 32308, -33146, -121995, 48425, 60161, 52180, -37057, -146676, -116059, -171248, -134002, -123222, 50938, 67433, 58329, 10381, -22819, 51049, 95769, 149670, 108272]
21456A08272L132m5694N9140j39347n9770Q7785K26489J0493l0920j45780p3831
21445c1q1072o1603k6998l1052k8063n3443M8032k6338j1293n9775L5631J23277
21433a72728J22618O267j0397P0182m0872m5582o4404j03413n4965J00219J78233
21422a4842K6270q6963q4468K4854O7216J093j04892m5677R3053O5239J580l172
21410f0709l3001m1685J2332P8996Q0184O2801j08189l6097O2380J03422j0794
21399A09640j79201j34149J05439m1782K029L6098J25903r4456j62693j8375N9996
21388a91551J69798M4799R97j74014o2920P2497J08413O8057r4130o6985k9967
21377a55006k7352J1n6048J4861J49448J72165l7663k4896o7231J8146J45933
$$ y = [108272, 111404, 65710, 124850, -14497, -74267, 13518, 240007, 250500, 219580, 73800, -31, -81103, -142706, -169704, -200756, -228819, -282262, -234230, -260568, -271861, -331636, -296005, -172728, -50110, -43843, -54240, 15942, -24930, -70512, -134916, -238329, -293294, -193075, -14842, 11428, -75535, -160003, -135149, -67933, -66840, -171732, -217409, -124356, -59117, -57537, -60709, -93710, -135395, -123063, -44067, 36117, 98918, -9271, -45368, 17012, 120434, 109640, -69561, -203710, -98271, -140053, -138024, -101926, 23977, -70479, -233172, -251547, -191551, -21753, 23046, 24043, -149971, -212891, -140394, -31981, 36076, -58054, -125039, -155006, -182358, -182347, -238395, -223534, -74086, 98079, 60416, 35520, -31711, -13565, 132368]
21366A32368q3933o0564O0370O9777M933l4900L7971p1872j72179J7563q298o743
21354a15507M2865o5814K0467J93591J10647j37666j38777j14296j11359Q1031
21344b34818K03144q0191r901m3080N0151J21739O281L8400L5263l1324q7686
21333c2022p4503q1628P5681J70791j9068m1751K8113N2886l4917n0037r0133
21322i6588N7726j1611N6858p2834p795L8556R1446n9352n7623O2915m341L9691
21310C7048m5492N2436Q6424r1104j00948J76752N7334K4832P2336m9967j84373
21299C5278k50873o4509K2409J2143J03341l6596n7931q1370K38564J62793j16825
21288c3576j37717l3462J80716K53462N0826j00792j74492k5470m6413R3567j41816
$$ y = [132368, 48435, -12129, 48241, 118018, 122951, 88051, 126022, 54150, -118029, -100466, -108764, -115507, -72642, -138456, -117989, 75602, 186249, 48583, -90194, -204490, -315849, -234818, -31674, -111865, -121766, -164846, -114695, 7044, 13325, 51725, 86988, 55664, -32022, -106525, -188153, -112472, 58319, 39251, -2500, 25613, 78499, 43582, -6455, -96588, -38862, -50473, 6385, -66449, -74244, -35688, 55758, -3594, -61217, 1698, -2643, 37048, -8444, 43992, 130416, 39312, -61636, 115116, 172450, 197282, 269618, 219651, 35278, -215595, -280104, -257695, -245552, -142211, -178807, -236738, -318108, -79544, 83249, -33576, -171293, -204755, -24039, 229423, 280249, 179457, 4965, -20505, -66918, 26649, -115167]
21277a15167q5755N2994J4072l6586l7461N3530J7501J43535r146K2019K5342
21266D4878l7954L3384p3008N0190J62549j75675k16538L08K28350j0082J06463
21255A12865J33791J67748p0634j58006K5145r4489j65263N9170O1298j7513q8580
21244c4468k07758n5903r95R2283O2430M9312J05996K2139L7251j05473j22159
21233a57345j27J39881q9460l019P9176P6945J36103J43178j17470L5470l7990
21222B05342m4501r8584k35580o5521L2811J4011m1472R1601J8146M1490J61526
21211G9269J59242O849P1682M7427j65488j75031j62062R8884M1547m8579l5769
21200h2029M1550J2552J15715J0560m0474K7949p1681k8710M9692l1350j61101
$$ y = [-115167, -200922, -147928, -133856, -170442, -207903, -154373, -136872, 6663, -2483, 19536, 44878, 6924, 40308, -32700, 17490, 180039, 4364, -212174, -211866, 16484, 6402, 112865, 246656, 414404, 343770, 185764, 210909, 116420, -48843, 10327, 71625, 54112, -34468, -242226, -298129, -299124, -206841, -144411, -95099, 10897, 33036, 70287, -35186, -157345, -157472, -17591, -107051, -110070, -30894, 46051, 182154, 325332, 207862, 243332, 205342, 160841, 62257, -173323, -238844, -206033, -192022, -233494, -141893, -123747, -82257, 79269, 238511, 245360, 317042, 364469, 198981, 23950, -138112, -39228, 2319, -46260, -82029, -40479, -27927, 87788, 98348, 57874, 85823, 14142, -14568, 35124, 3774, -157327]
21189a57327j0299o2392k3240K55871L1224m9094J34164j81471m8223L5644n0452
21178a25595r5883j53095l946J80038N4501j09696j16546M1409J01568J18583
21168a08662R7906q699J1748j71190L0473J15693J42004J37243q9059P8592k2469
21157B13580m8852j13973j29681r1935q987l1187J04156N7530l6615J14704P1858
21146A00598R6740m3822q8327j02111P7599N935Q3876p6645j06054l9904J01286
21135I171J73576p2297q5695j32167m4529M4473O8807k8307j40787M8612J57186
21124a957R4107j7442j85121m0601P6331J14332J8242q9642j03207q8525j868
21113b25351J21886o0076J24409J75421m6249n1414K8820P0457L7454L7618L1220
$$ y = [-157327, -167626, -230018, -253258, 2613, 33837, -15257, 118907, -62564, -110787, -75143, -125595, -221478, -374573, -378519, -198481, -143980, -253676, -370222, -328813, -227245, -108662, -10756, -19455, -7707, -178897, -148424, -32731, 109273, 246516, 157457, 236049, 213580, 164728, 50755, -78926, -170861, -179848, -211035, -106879, -49349, -85964, 28740, 100598, 197338, 153516, 65189, -36922, 40677, 46612, 130488, 53843, -52211, -92115, 9171, 182747, 110450, 24755, -107412, -151941, -107468, -38661, -66968, -207755, -159143, -1957, 92150, 74708, -110413, -151014, -74683, 39649, 57891, -31751, -134958, -223483, -225351, -103465, -163541, -39132, 136289, 90040, 38626, 67446, 137903, 175357, 212975, 244195]
21102B44195J9075p4048k25790j02429Q4214N157R1913l195K8417j0701k36678
21091a79870J23335k6659m4353l5642j0203P8051l686j15504j19987K386J20820
21080b11312M2195j38699J3926K8904M1253J41976J24224n5302p3651o9559M2854
21069a13191M8751j69996o2041q365O0302J65993o9031q9243j63694j0126P5423
21058c35218N8455Q7428P0436o5048r4554j556L9951j27366R8787J38418J8819
21047a11448P4778l2777R6231J11594r4476k5775l466l8018N6651K1125M2837
21036I7256k1188j29151M2181L2876j57394M3783J52803J63381J12j1153o2695
21025A50811k9772J4368K9647J19392r3450j73905p1734J08708j9409Q4541j02635
$$ y = [244195, 263270, 189222, -36568, -138997, -54783, -49626, 42287, 39092, 67509, 56808, -179870, -56535, -83194, -127547, -163189, -173392, -95341, -99027, -214531, -334518, -332132, -211312, -169117, -307816, -293890, -264986, -223733, -81757, 42467, -12835, -86486, -156045, -113191, -64440, -234436, -296477, -304842, -244540, -78547, -147578, -236821, -400515, -410641, -335218, -276763, -189335, -118899, -183947, -278501, -280057, -240106, -367472, -268685, -130267, -111448, -36670, -69447, 26784, 138378, 43902, 18127, 14661, -23357, 33294, 54419, 97256, 76068, -53083, -10902, 21974, -135420, -91637, 61166, 224547, 224659, 213506, 150811, 121039, 135407, 165054, 284446, 190996, 17091, -54643, 54065, 34656, 119197, 16562]
21014A6562p5846p6505l3636J31210j5534R1569J37346j8955j45416j34696q764
21003a32665P9489K6206J05756J45426L863k22871j70503o3252R0147P6995M1499
20992a9910M7207r3813N2405P8874J0171L4808J11878j33858k18601j44496n0324
20981c25659M3906P7897J52669k6392J18549O1330J9652k45379j64178r7003k799
20970c87407Q6809o1509L9995l0385J16770j314K7645m2686J4261R6072n5648
20959a97397j12415o9584K9615J02038N0278K34130j12564j52188J42667J3465
20949g1955j79950K7174P073J21333M5754J6480j12316L103m7531o7751J67233
20938i1353P1484R7893O8754R7254p9754j29697j32854J2500J36632p5039Q1084
$$ y = [16562, -59284, -135789, -169425, -38215, -53749, 37820, 175166, 156211, 10795, -123901, -132665, -53176, -26970, 78786, 224212, 228075, 5204, -165299, -228551, -138404, -61409, -19910, 27297, -66516, -14111, 64763, 74934, 109742, 221620, 87762, -130839, -275335, -325659, -281753, -203856, -51187, -77579, 40970, 102300, 121952, -123427, -287605, -384608, -387407, -300598, -362107, -322112, -352497, -235727, -237041, -209396, -252082, -237821, -141749, -197397, -309812, -379396, -349781, -247743, -197465, 36665, -75899, -228087, -85420, -71955, -251905, -224731, -217658, -96325, -50571, -34091, -146407, -143304, -190835, -258586, -91353, -19869, 78024, 146778, 244032, 164278, 34581, -98273, -85773, 50859, -24180, 56904]
20927E6904K4872k16806n4030m9216Q0330P0300P0256J39214r4255l0625R5554
20916I2498J1905o6537J70217P7976k13641J8261R6597j90309N9437k7964J7149
20905D5589j09346j42219k6215J83205P0847r6976L4683N9475M8964K571l8026
20894C2552q9327L7228Q2244o9853j9681j66957j54631L3096K2894J01805J69317
20883b1313M9557L1038N0672j12497m057J22978K5130k25607k272N3590m8414
20872h1195m3460R5553P5592n8327j8278L6714K588O6242p4333o979K0393m6083
20860c1573M4411O289K3000j0939j35393q8204J29651P8564K5600l5344L799J36147
20848A46008m6252k27072k357J55461J02694j05841j36086q726o2685j70589P0513
$$ y = [56904, 81776, -135030, -189060, -238276, -157946, -87646, -17390, 121824, 27569, -3056, 92498, 104403, 37866, 208083, 286059, 72418, 90679, 187276, -3033, 56404, 28440, 45589, -63757, -205976, -232191, -48986, 21861, -75115, -40432, 19043, 68007, 70578, 32552, -56775, -19547, 62697, -7156, -26837, -193794, -348425, -315329, -292435, -190630, -21313, 28244, 59282, 109954, -2543, -6600, 116378, 141508, -84099, -86371, -32781, -81195, -124655, -29102, 46490, -11837, -30115, 6599, 9187, 75429, 1096, -5883, 14510, -31573, 12838, 19127, 42127, 31188, -104205, -192409, -62758, 15806, 41406, 6062, 9861, 146008, 99756, -127316, -129673, 25788, 128482, 22641, -113445, -122171, -184856, -355445, -284932]
20837b84932k264J80179l2310k52865N7413J18832k991J00733J61199J8098m3249
20826A7843o2930m5177o1812K1447P3007O5649P3886j141o3604p5819m9775o0441
20814a68867O3577R9288r1106k5537Q5837O5996J78221m0241j60023j4795O3475
20803E5825j3958m7615j09206p6971j84889j16140L5369J21737O314k474k0085
20792c52093p2686J14461K54243L4000J5439R124q2952o7811o931M6918J71587
20781F3299O6265j59637j76898n454J44975R6891R3204M4980j14586L02M4624
20770I7965j21567m7595N8149k0027J39736K3111J5110j00606j10210L5681m1249
20759g1502P687m170k47810n2301R4810K7379J44498k0315M0208n0309k3065r0717
$$ y = [-284932, -287196, -107017, -139327, -392192, -334779, -215947, -218938, -118205, 42994, 61092, 17843, -45087, -90264, -152076, -130629, -57622, 8027, 81913, 80772, 17168, -58651, -108426, -168867, -105290, -6002, -97108, -122645, -36808, 29188, 207409, 167168, 7145, -7650, 55825, 41867, -5748, -114954, -191925, -376814, -492954, -457585, -335848, -329534, -332008, -352093, -424779, -310318, -56075, -22075, -6636, 2488, -80464, -148275, -155206, -108288, 63299, 129564, -30073, -206971, -212425, -67450, 29441, 122645, 167625, 53039, 53341, 97965, -23602, -71197, -13048, -33075, 106661, 129772, 144882, 44276, -65934, -30253, -71502, -63815, -67985, -315795, -368096, -273286, -245907, -101409, -121724, -81516, -131825, -154890, -245607]
20747b45607k6966l1062M5493K9896J2743L4815J72798n5055l11765j22719J30811
20736c66618O7453J1970k2218J137o682M8730J46635N2320N6357j985l6555O3753
20724A4297J4590q6356l8654j2417k1172l3517K8288j3683j35182m6349M3633
20713b86522J33062P0932J91069j57958k56344j2453N2054Q1007R9691n0571N1410
20702h4623N8656j71816j37486J4630J58169P7054p1412r833P7859N1772K00594
20691A63564k0116n0915J11841k17370J33340J1938j77911j09408M3448m257l1712
20680a47558j01393J07235R6405o575J0662j29838j8079N6714M3425j63843k17738
20669d70583M3485K19463K21298L2108p5938p4937j47806L9250O1715m3259O9890
$$ y = [-245607, -272573, -303635, -258142, -228246, -215503, -180688, -7890, -62945, -374710, -497429, -366618, -299165, -287195, -309413, -308276, -314958, -266228, -119593, -67273, -10916, -12901, -49456, 14297, 28887, -57469, -96123, -108540, -129712, -163229, -134941, -148624, -283806, -330155, -286522, -153460, -82528, 108541, -49417, -305761, -318214, -266160, -185153, -85462, -136033, -84623, -25967, -197783, -335269, -320639, -162470, -85416, -156828, -166661, -88802, -37030, 163564, 143448, 92533, 204374, -12996, 120344, 132282, -45629, -155037, -111589, -115846, -147558, -248951, -141716, -45311, -51886, -41224, -171062, -189141, -132427, -89002, -252845, -470583, -427098, -207635, 13663, 45771, -30167, -105104, -252910, -213660, -151945, -195204, -125314]
20658a25314P7497j91217p5423J71955K08596r119k02990M9851P7669N6971M6871
20647H5347j02187j56653K7582m1948o4953P5729J01300J4434j72283Q8892J9130
20636a25610J81185j01445k83422o9094O9499J06280P3913J05997Q0005r6298
20626e8990P4015o8343k19415l27Q8110J26033M4847R6339J70721r1995k32466
20615g1471j4472K07772q1542j92389j29735O978J40283m186J8719q9736l9654
20604b49433n436J71584J01782m4392p5106j0405j11520k8793J45028J33248J3480
20593D0037j83410j29188j342o1471p1966M4925J42816l3604M3298J02321J25934
20582A8350Q574l0769K2118p860J56463J5909N4221J45622o5036k36097p7354
$$ y = [-125314, -47817, -239034, -314457, -142502, 66094, 56975, -146015, -96164, -18495, 38476, 85347, -16840, -173493, -145911, -187859, -252812, -177083, -75783, -61349, -233632, -144740, -125610, 55575, -45870, -329292, -398386, -328887, -222607, -148694, -42697, 37308, -58990, 15025, -53318, -272733, -273060, -184950, -58917, -14070, 82269, 252990, 160995, -71471, -85943, 121829, 40287, -152102, -281837, -274859, -134576, -138762, -120043, -209779, -249433, -254869, -83285, 18497, -25895, -101001, -111406, -222926, -251719, -106691, 26557, 40037, -143373, -272561, -273903, -335374, -407340, -362415, -219599, -253203, -209905, -107584, 18350, 26924, -3845, 18273, 10413, 166876, 182785, 237006, 382628, 317592, 81495, 4141]
20571D141n5338O9040l8802K0201k6993j37175j8072J00466J28557k5497j61446
20560a40918q1761p4581M4162o681O8278n8600P4609J78506n6602P9032Q5720
20549A11164k17816j25631K2596J21714N5870K2875p3195r0305j154Q0736J03898
20538A0752j4327k9593J13339L0187l7635n235J30875p2892m3577j06738j42958
20527a67802m4426O9595J88953O2969o0336m0314n939k11676j74390J68821J17302
20516i7243o8198j1734J12152N9220r1917q3932l3180J17100J99372q5106j95506
20505a78972n1379J6880J18387N9047N4142J5072m5270L5142Q8726J7554j87172
20494e7843j28902K2213Q1205J56932L7288j38313m4183j26535r1493M0892J82715
$$ y = [4141, -51197, 17843, -20959, -758, -27751, -164926, -182998, -82532, 46025, 20528, -140918, -222679, -297260, -253098, -259779, -191501, -250101, -175492, 3014, -53588, 25444, 111164, -106652, -232283, -209687, -87973, -32103, -9228, -82423, -172728, -173882, -93146, 10752, -3575, -33168, 80171, 110358, 72723, 67488, 198363, 125471, 81894, -24844, -167802, -212228, -142633, 46320, 109289, 48953, 8639, 2700, -208976, -383366, -214545, -97243, -165441, -177175, -65023, -5803, -97720, -181652, -214832, -97732, 101640, 16534, -178972, -230351, -213471, -95084, -36037, 18105, 33177, -12093, 23049, 111775, 129329, -57843, -186745, -164532, -83327, 73605, 110893, -27420, -71603, -198138, -289631, -248739, -66024]
20483f6024L5310O2357p898K9424k6969r1931O700N3636j36501l5289j03389Q4029
20471a96545J37523m3596j50533N966J00016Q6742J07667L5200j27101l6057m5142
20460a25860j6815O4241P1960j40292m0134M8198P9478j01289r0792j7743J26000
20449a43048M9946J06512j38818r1004L3747J55338O9880Q6486k3648j58102l4641
20438h7352M600q059k3847o4080K6049J1240q3952L2968j0260J08910P4094J8827
20426h62j57282p3736l2488R4747M5853J07017p290q7658J2469L0757k5680J7776
20414g6377j84288Q058Q3565k8675l7065m4268j55971p4219K11805J55644K00916
20403E9125j05870j25208J23864J79105j09758k74148j26359J34298P7829J08017
$$ y = [-66024, -30714, 31643, 23745, 53169, 26200, -65731, -59031, -5395, -141896, -177185, -280574, -196545, -59022, -102618, -253151, -247185, -147169, -60427, 47240, 82440, -44661, -80718, -125860, -142675, -78434, -6474, -146766, -186900, -138702, -59224, -160513, -251305, -269048, -143048, -93102, 13410, -125408, -216412, -182665, -27327, 42553, 129039, 105391, -52711, -87352, -82752, -90811, -114658, -178738, -152689, -141449, -225401, -192433, -202693, -93783, -19689, -862, -158144, -231880, -264368, -169621, -123768, -16751, -24041, -111699, -99230, -68473, -94153, -76377, -260665, -252607, -169042, -197717, -234782, -279050, -435021, -509240, -297435, -141791, 59125, -46745, -171953, -48089, 131016, 21258, -252890, -379249, -244951, -167122, -59105]
20393e9105r204j231o00O7553R247j12892Q3496O5468N363O148K7981j87710r5227
20380b00713k909j5804J86423K1269j20744j14974L617P5240J47549m0982k19872
20369b81900J04766P2284j26289n5961O8551L6191O8670M6710K15899j93636l01477
20358c46192k7433R4783Q7921N0684R2452J0387j31140j43931J20006J20461p634
20347g9636J06688Q3300k89249j35197k9819j62437O4278N5870J29970M7273p9026
20336b87985m4961P9164P4172J21222j6128J4095J10681N5675j59965j86032M4960
20325a95102J82339m8205m5725m0640l871j12683r0030J261J49706R761j55150
20314c48339J6295K00793P1596q4610P550P4172R6756M4456J45241k8070k13079
$$ y = [-59105, -68309, -69540, -70140, -2587, 6660, -106232, -22736, 42732, 48095, 54243, 82224, -105486, -200713, -203622, -219426, -33003, -11734, -132478, -247452, -243835, -168595, -21046, -62028, -281900, -177134, -104850, -231139, -287100, -218549, -182358, -113688, -66978, 148921, -44715, -346192, -373625, -278842, -190921, -140237, -47785, -37398, -168538, -312469, -192463, -72002, -79636, 27052, 110352, -178897, -314094, -343913, -506350, -442072, -386202, -256232, -208959, -287985, -332946, -253782, -179610, -58388, -74516, -60421, 50260, 105935, -54030, -240062, -195102, -12763, -60968, -106693, -147333, -151204, -263887, -353917, -352656, -202950, -193189, -348339, -332044, -131251, -59655, -144265, -136715, -62543, 34213, 78669, 223910, 195840, -17239]
20303a7239k7310l5159k2746r0288n6030M8963l6008K9372o6965p1620Q8290j40083
20291c96823O5142K17943J45414j39219m8723m767p1602J31608O1123K4411P1864
20280E6371Q1473p2848j8260j10487n1797P0274l681Q6119M3349j34448p9794
20269a33729j41141j5832j0424J89985N2886n3155k1818r5391J0026K12502J13954
20258A07863j28647q5865k4751K25593K0946K9047J5422K7628o3221j83951K4529
20247c5407J48745O6376r3381p7698N2222R2743j3498j52079m6918j5642p3543
20236a48080Q274l7467R7528Q0776r1515o7767R0385O630Q2316M1831J589j06531
20224d2031j28086m7903P6929O9008N1133N0582j8791O2560k7990j35605r9432
$$ y = [-17239, -44549, -79708, -102454, -192742, -248772, -199809, -235817, -206445, -273410, -345030, -256740, -396823, -331681, -113738, 31676, -107543, -156266, -161033, -232635, -101027, -39904, -15493, 56371, 137844, 64996, 46736, -63751, -115548, -45274, -48955, 37164, 80513, -53935, -133729, -274870, -290702, -301126, -111141, -58255, -111410, -133228, -228619, -218593, -6091, 107863, -20784, -106649, -131400, 94193, 115139, 144186, 159608, 187236, 124015, -59936, -35407, 113338, 179714, 86333, 8635, 60857, 153600, 140102, -11977, -58895, -74537, -148080, -139806, -177273, -79745, 1031, -90484, -158251, -67866, -61236, 21080, 62911, 64500, -42031, -170117, -218020, -141091, -72083, -20950, 29632, 10841, 73401, 45411, -90194, -189626]
20213a89626R19K13028m0701J6931P0464l1296l0143K7044K297L2208p9371k8909
20201c7155K0972q330o3658n5494p8424J43948j8417m456J00046L9471J1090p0359
20189b0766o8295O719J0485P5098J22801L6838r180K5574l6638M3061j75958p526
20177B213r1792j1562j3704L0916K774o8918J6024K26106M4674j04081j52100
20166a19450M9946J32941P0912M559p9872r8218j26904o5603l1490P7898m7945
20155b33226L5807Q5606m1249J22194N1495j1421N669J07585J22112j15966j76348
20144d7742j06971k0751K6772m8651k3279J7263j5430J06740K2188r6633r0077
20133b76571P6737J09673j9076N6836q7424K8832K9540o7221n4797k13750m0052
$$ y = [-189626, -188707, 24321, -16380, 551, 71015, 39719, 9576, 36620, 38917, 71125, -8246, -37155, -16183, -24513, -88171, -143665, -222089, -78141, -96558, -101014, -968, 38503, 49593, -20766, -89061, -82342, -71857, 3241, 126042, 162880, 153700, 179274, 142636, 185697, 9739, 2213, -89579, -101141, -114845, -83929, -81155, -150073, -134049, 92057, 136731, 32650, -119450, -69504, 63437, 134349, 138908, 59036, -39182, -166086, -231689, -263179, -185281, -233226, -197419, -111813, -153062, -30868, 20627, 9206, 14875, 122460, 244572, 128606, -47742, -154713, -175464, -148692, -197343, -220622, -203359, -218789, -112049, -89861, -186494, -276571, -199834, -90161, -109237, -52401, -139825, -110993, -81453, -148674, -203471, -417221, -457273]
20122d57273O0838O4565M4351Q3829L7622p234r6972Q7768N2073J12214N9105
20111D0886K9169J57424o1014j58816j28723J45075Q3670o6920o6510p4356m9515
20100a49630K667J84010J08224k9582j26093j60326J10390j575j17051l569O849
20089a75686K2600J397j48193k93J31508M6117j33168J8205J30032M4244O5241
20078B004o7030l3349M3814J5293o9132R3763j03687p7916J72012K750m4957N4938
20066a1497K2305j42144j37235J5587N0089P5019o8087J02040J75582q5053m3782
20055d7176P4835j35882p2026J29221J54674l4353Q3792j8955J57P529j29871
20044A1945j20371L2166J29972m6534o4443r4937M2380J24324J13037j85170j00378
$$ y = [-457273, -396435, -331870, -287519, -203690, -166068, -173302, -270274, -182506, -130433, -18219, 40886, 70055, 227479, 166465, 7649, -121074, 24001, 107671, 40751, -25759, -100115, -149630, -146963, 37047, 145271, 115689, -10404, -170730, -60340, -61915, -178966, -182535, -175686, -153086, -151689, -299882, -300175, -168667, -122550, -255718, -237513, -107481, -63237, 2004, -65026, -98375, -54561, -39268, -108400, -14637, -118324, -196240, -24228, -21478, -66435, -11497, 10808, -131336, -268571, -252984, -202895, -127876, -195963, -93923, 81659, -3394, -47176, 27659, -108223, -180249, -51028, 103646, 69293, 153085, 134130, 134287, 141816, 11945, -108426, -76260, 53712, 7178, -57265, -152202, -109822, 14502, 127539, -57631, -158009]
20033a58009J08588N3386j29067q9811P0150O0450J02695l3407j10569n6396k21139
20022d03129L8617k8921l7101K07271K08140m1682l9188J00780M2764m0612o3096
20011e6157j20057P681O8749Q3338m1685n8434l2954p835m0692M8319J67333l6808
19999a9202j15431O8552j0192R217l5572Q0873J47464j130q09m0595M1375J8258
19987A42808n2762k36888j04423J10597N9325N6423R0356o9165j51006j30632
19977b85367J00438P0046Q2808J15751j25175j63916o631O8907O9034J27059J49389
19966B02343J03552J73660L3920J77394J02164R6739K58978R2327j70836j21959
19956I48282K6233J57342l5948j5953K9497m4425K5191Q9217J37194M3203P9172
$$ y = [-158009, -49421, 3965, -125102, -214913, -144763, -84313, 18382, -15025, -125594, -181990, -403129, -364512, -393433, -430534, -223263, -15123, -56805, -95993, 4787, 47551, 6939, -56157, -176214, -168533, -99784, -16446, -58131, -116565, -149519, -157354, -198046, -149727, 17606, -19202, -134633, -66081, -76273, -67056, -102628, -21755, 125709, 124579, 123770, 83175, 124550, 142808, 90046, -146842, -251265, -140668, -81343, -24920, 65436, -3729, -154735, -285367, -184929, -114883, -32075, 83676, -41499, -205415, -212046, -143139, -74105, 52954, 202343, 305895, 479555, 513475, 690869, 793033, 889772, 1148750, 1241077, 1070241, 948282, 974515, 1131857, 1095909, 1079956, 1109453, 1065028, 1090219, 1179436, 1316630, 1359833, 1439005]
19945A439005J61781k4653l4211j08537q9050m1686l32312j87490j23253k73183
19935C86411j66240M6748j67891j86330m1531j32590p2312J10056P1440J03088
19925d9151j7922N8806m9023j16344N0800j4073p620J00508o3441n0683j8368
19914a76511p4841J54905J15225M3435k6726j25524m5746j39138j1136O9587p7948
19903b94418O3265R148O70M3609k549j3365J8126r9049J31920K72476K8314p3889
19891H4258p4657o0011l6204l8962P6678N6141Q5972Q3843j10280J6744M6661
19880A30183M397R045n12l3826J3280L4924m9433p2908N8096p1784p798k461j53525
19867a42322o6537l0917j11708M4678J40312J55580L1823q5576N0587J73003R260
$$ y = [1439005, 1600786, 1576133, 1541922, 1433385, 1344335, 1302649, 970337, 782847, 659594, 386411, 220171, 266919, 99028, -87302, -128833, -261423, -333735, -223679, -152239, -49151, -67073, -8267, -57290, -173634, -122834, -136907, -144527, -44019, -107460, -158143, -176511, -251352, -96447, 18778, 62213, 35487, -90037, -135783, -274921, -286057, -216470, -294418, -231153, -222005, -221335, -177726, -180275, -193640, -175514, -274563, -142643, 129833, 158147, 84258, 9601, -50410, -86614, -125576, -48898, 7243, 93215, 177058, 66778, 83522, 130183, 134580, 143625, 143113, 109287, 122567, 157491, 108058, 35150, 93246, 21462, 13664, 11203, -142322, -208859, -239776, -351484, -306806, -166494, -10914, 20909, -64667, -14080, 158923, 168183]
19856A68183q1321r7849Q8869J5101p5283o9277L5208j21991o9229j23497P3097
19845b57989J79488J02400N982L468j70671P9375Q0155j93558j0096P7037N5627
19834d8782N2630J20794j21165k2540j15074k8367J23836M6259o4733k56069L6815
19823b76396J18751k30765j19985L5308m4239J6400J29231O0543J5858J41506
19813a53788J10140J6797L435j11493j05262k4223J47414J12838j33253J00249
19803c7146o3697p3628L3167k3960m9328J30774N6588J07914l9767j17083K7842
19792d8324N7177p3901l0049P8898P2948k41561P2081J33648q5354n6666n898
19781a27001l1112k2285N5200j18147l532O7488K63134R4705k44298j42913J28279
$$ y = [168183, 86862, -10987, 77882, 92983, 17700, -51577, -16369, -138360, -207589, -331086, -257989, -78501, 23899, 29881, 33349, -137322, -57947, 22208, -171350, -181446, -104409, -48782, 3848, 124642, 3477, -19063, -134137, -162504, -38668, 7591, -57142, -313211, -276396, -157645, -388410, -508395, -473087, -517326, -500926, -371695, -311152, -295294, -153788, -43648, -26851, -23416, -134909, -240171, -264394, -116980, -4142, -137395, -37146, -100843, -174471, -141304, -165264, -214592, -83818, -27230, 80684, 40917, -76166, -48324, 8853, -65048, -95097, -16199, 56749, -184812, -112731, 20917, -64437, -121103, -127001, -158113, -180398, -125198, -243345, -246877, -179389, 83745, 178450, -65848, -208761, -80482]
19770h0482M4849N4071r6597o0773j00766o7519J72705k0376M879L8389K4746
19759h6874p7938J40159J30689J7979j80489q3275N234j1071L520J06339P0133
19748C4406j81204j46483P2206J8993J19424L6436k0335L2075l8597j43899K3241
19737a93737j7385j8362l1954J7289R8091N3064k0974j10334L4106J11273n922
19726h4845N2121j83115j43754k3865m4285Q923q2839J77180J94279R8776q793
19715d0217p9896m5977N5606q1798O26J37572K7481Q6171J38657K7606j04798
19704A21033J7100J8496p6868r8001L4643K4974o4901q8578P6696J53599N5943
19693A74136p0222l3502M9277q0394O7964J06982j36928r7324j3397Q5527o8416
$$ y = [-80482, -35633, 18438, -78159, -138932, -239698, -307217, -134512, -154888, -150009, -111620, -86874, -164812, -24653, 106036, 124015, -56474, -139749, -134515, -145586, -142066, -35727, 34406, -146798, -293281, -221075, -202082, -82658, -46222, -66557, -34482, -73079, -216978, -193737, -211122, -229484, -261438, -244149, -146058, -92994, -113968, -224302, -190196, -78923, -84845, -32724, -215839, -359593, -383458, -427743, -418820, -501659, -324479, -130200, -31424, -40217, -120113, -166090, -110484, -192282, -191656, -54084, -26603, 59568, 198225, 225831, 121033, 138133, 156629, 79761, -18240, 16403, 41377, -23524, -112102, -35406, 118193, 174136, 103914, 70412, 119689, 39295, 107259, 214241, 77313, -20011, -33408, 52119, -16297]
19682a6297K2172J27029J30935L911q0221m8115K5939j07017j0677K54440M5766
19671C47865n4761N6754o8694j25215j00286m2904j1821n6313n3107n1525M4861
19660a15146K23872K37559J76151r5566j55950r7031l6671j07533N8819K8442
19650A16946p2732o7351R7810n8648O645m4833J62870K1301Q5755N708J9612J0696
19638B83779o7537j421J71860p7325j28143j66646j3256P2601J23730q9689j21531
19627a3578P6328k1915n5443K3230O0591q5256m517j73271J6941J95767L5160
19616E4037K9785j04690j43622m6598K8923J04246R6766j10423q317k3650N837
19605a17706R8881N3196p8554j2125K5069j39361J8333J74831j46606M7304J04946
$$ y = [-16297, 5875, 132904, 263839, 267750, 187529, 139414, 165353, 58336, 47659, 302099, 347865, 293104, 349858, 281164, 155949, 55663, 12759, 938, -55375, -108482, -160007, -115146, 108726, 346285, 522436, 426870, 270920, 173889, 137218, 29685, 88504, 116946, 44214, -23137, 74673, 16025, 22670, -22163, 140707, 162008, 247763, 253471, 273083, 283779, 216242, 214821, 386681, 309356, 181213, 14567, 1311, 73912, 197642, 107953, -13578, 62750, 40835, -14608, 8622, 69213, -16043, -20560, -193831, -176890, 18877, 54037, 83822, -20868, -164490, -211088, -182165, -77919, 18847, -91576, -99893, -123543, -117706, -18825, 34371, -44183, -56308, -31239, -170600, -152267, 22564, -124042, -76738, 28208]
19594B8208K7211N1569Q8020n9061j17618n7071L57R7025k7569Q056K2195k6580
19582C4742L3223o9862Q4709P4004P2721o5740j11268J16321K4234n2354M5816
19571A86546J46179j21839M858N9418l1600q8634j19841Q7904n852L9021R2309
19560B48469k8951R1286m533j02139o5221n7775J67804n8478p1626J17267L4224
19549B70327M2097j20459n6427M3396P3015k230k073m1113k8645J06389O2052
19538C46329j08958j4286j6646P505L5068n9424R3614l8611k3447L0541J91211
19527D42896k10715m6918J06980J08952Q1015m3596k3131J5562N9077p9015J250
19516D12357R7597l4056q7657J337k864j7484K9642J13477R9427p9715j70450
$$ y = [28208, 55419, 106988, 195008, 135947, 18329, -38742, -38385, 58640, 31071, 39127, 61322, 34742, 67965, -1897, 82812, 156816, 229537, 163797, 52529, 168850, 193084, 140730, 186546, 332725, 210886, 215744, 275162, 243562, 154928, 35087, 122991, 117139, 156160, 248469, 219518, 310804, 306271, 204132, 138911, 81136, 248940, 190462, 118836, 236103, 270327, 312424, 191965, 135538, 178934, 251949, 249719, 247646, 206533, 177888, 284277, 346329, 237371, 223085, 206439, 213944, 249012, 189588, 283202, 244591, 221144, 251685, 442896, 232181, 185263, 292243, 401195, 482210, 438614, 415483, 431045, 490122, 411107, 412357, 509954, 475898, 388241, 389578, 386714, 369230, 398872, 512349, 611776, 532061, 361611]
19505C61611r1545j12168J03438R4621J6899L5836Q3232q1425N7453N1339j64530
19494C54761Q903J62113O3504j02762j3805L8158J50126p5103p0781o4283j07409
19483C43422L2298R7898M1559k9568N7262l3075J924O1291R2727J39114L8522
19472H43374K687P5862L957J49537n1639j14737J5113J56062L3142k8244L6686
19461A121800K01212R4606j70637M160k0550L9904o4967J21090J00084K51073
19451A677775J12400L2755K46262J54456R6159L08052L67719L62960L20343M77126
19441D156007L50584J0151J16526J56025M2930K07616K15568M15870N23419O39953
19431F834649N10450N74782Q37819R73298R38315R17604R01402O95589J094575
$$ y = [361611, 270066, 157898, 261336, 355957, 372856, 408692, 491924, 410499, 467952, 519291, 354761, 363664, 525777, 589281, 486519, 472714, 510872, 660998, 585895, 515114, 450831, 343422, 375720, 473618, 515177, 485609, 542871, 509796, 511720, 573011, 665738, 804852, 843374, 846061, 921923, 925880, 1075417, 1023778, 909041, 924154, 1080216, 1113358, 1085114, 1121800, 1323012, 1417618, 1246981, 1251141, 1230591, 1270495, 1205528, 1326618, 1426702, 1677775, 1790175, 1822930, 2069192, 2223648, 2319807, 2627859, 2995578, 3358538, 3678881, 4156007, 4506591, 4516742, 4633268, 4789293, 4832223, 5039839, 5255407, 5671277, 6194696, 6834649, 7345099, 7919881, 8757700, 9730998, 10669313, 11586917, 12488319, 13183908, 14278483]
19422A4278483J295300J446871J443028J974685K904954M250602O075361Q553393
19414D2222677J1863456J6021358K0742806K5370900K6509863K4351557K6577931
19407A93660548L1445743K6335559N629399o328057p94138K997302j0323093k8074653
19399B14548610k4122225r621435j612321N56658O182237J1351583J4381055K1298338
19391B32962500K6547545J5073477o918054j1113642l522084n831972k6077478
19384B21120292l9640072l2512234k2803906k1855138k3581252j9947601j4016005
19377D6764084r237957o225707m491867l419197k585387j882150j508854j138740
19369A6274225q81700r11192r79460q65984r30392r51473r75791q48352o14988
$$ y = [14278483, 15573783, 17020654, 18463682, 20438367, 23343321, 27593923, 33669284, 42222677, 54086133, 70107491, 90850297, 116221197, 142731060, 167082617, 193660548, 225106291, 251441850, 257071249, 250743192, 249949054, 252946356, 242623263, 214548610, 190426385, 180804950, 179192629, 179749287, 185931524, 197283107, 211664162, 232962500, 259510045, 274583522, 267665468, 256551826, 253029742, 247197770, 221120292, 181480220, 148967986, 126164080, 104308942, 80727690, 60780089, 46764084, 37526127, 31300420, 26808553, 23389356, 20803969, 18921819, 17412965, 16274225, 15392525, 14481333, 13501873, 12635889, 11705497, 10754024, 9778233, 8929881, 8314893]
19360H314893o79623p36946m39551k99788k1683j5650j58948j89848q2388j60668
19350E529800q2704j89824l99264m45944l56807n17239l37258l12947k31203k36440
19340B420170j87976k682J11960j16867o8065N0635k4649p0328j09350k46742
19330A756106p156j5446m4454j33266j67698j73352J06682j17966j77070M8994
19320A075374O116k6300J4005k8902M3266L1907N1296r8442p0202m1830N0260
19309A006548q7260j82563p0898J3019L1227j05104n0713R0730j37947Q1634J75082
19298G63755l0288l4384k83862K9J44935P3744j16425m4530k6479K3891l0410
19287D39976N9514J65010R6520N7705M4020j3220j20993j85692N580j05152p2262
$$ y = [8314893, 7635270, 6898324, 6458773, 6158985, 6137302, 6121652, 5962704, 5772856, 5690468, 5529800, 5447096, 5257272, 4858008, 4412064, 4055257, 3538018, 3200760, 2887813, 2656610, 2420170, 2232194, 2229512, 2341472, 2224605, 2156540, 2207175, 2182526, 2112198, 2002848, 1756106, 1748950, 1733504, 1689050, 1555784, 1388086, 1214734, 1321416, 1203450, 1026380, 1075374, 1081490, 1055190, 1069195, 1040293, 1083559, 1115466, 1166762, 1068320, 998118, 956288, 1006548, 919288, 736725, 665827, 678846, 710073, 604969, 554256, 644986, 507039, 588673, 763755, 733467, 699083, 415221, 415250, 560185, 633929, 517504, 472974, 446495, 470386, 439976, 499490, 664500, 761020, 818725, 862745, 849525, 728532, 542840, 548420, 443268, 371006]
19276C71006J08721J2821L8371J29610p919k4908q6995p1766N3691J24952j8931
19265F28653j93537k05229J01236J17867K7962p2076q2439M1334N4468J1182Q18
19254D30239q2492l6167J24997K8367j46739p1465j40548l3374J25946O0273l7162
19243B21875j21365j08718N1741R4802r1108j44469o0603J77511J83433O0187
19233B63286q6886L9131p8402r3833j74455J4116j1335J94482o2951L0089k7031
19222F211L166N9352J9690P2575l9586j51941m9206O465N4725L13762J47321J2151
19210D54685j05585k4798q5703J9447O3639O5969J17602K64069K62198K15740
19200A247263J3835k35428r3459r0334j3329j68587j00201N9176Q2336J10206
$$ y = [371006, 479727, 492548, 530919, 660529, 652610, 627702, 540707, 468941, 522632, 647584, 628653, 435116, 229887, 331123, 448990, 476952, 404876, 322437, 363771, 418239, 429421, 430239, 347747, 311580, 436577, 464944, 318205, 246740, 106192, 72818, 198764, 259037, 221875, 100510, -8208, 43533, 138335, 47227, -97242, -157845, 19666, 203099, 263286, 176400, 215531, 137129, 43296, -131159, -117043, -128378, 66104, 3153, 33242, 6211, 9377, 68729, 88419, 160994, 121408, -30533, -79739, -73274, -18549, 295213, 442534, 454685, 349100, 324302, 238599, 258046, 321685, 387654, 505256, 769325, 1031523, 1247263, 1261098, 1025670, 932211, 841877, 828548, 659961, 559760, 618936, 701272, 811478]
19190H11478n0942O1019J62031P3495o3568m9291K5353k3779l0545l9569k11043
19179F64639j85144j86760l4086J68866o5718q2288o966o2486k3504q7875P0332
19168A69010P7868M207Q6648p1045J06417P999j40272k4171K24461P6918j26604
19157C91436j47383J33790K8973q865J10597J17074J26885J82717K75340J25771
19147A336335L434J9766J7116m3398m65l5591j6922j03132o9689j03976M8202
19136A051680K56939J03493k0601K25213K20081J96699n928k76758q9775k5374
19126A635669j76075k22396r9023j57211N6625l2907k10889j8277q9493r5756
19116E90267L3700o8325q1747n4402k678j59318q1901J24142N976o9191r0844
$$ y = [811478, 760536, 821555, 983586, 1057081, 993513, 944222, 969575, 945796, 915251, 875682, 664639, 479495, 292735, 258649, 427515, 361797, 279509, 272543, 210057, 186553, 98678, 169010, 246878, 251085, 337733, 266688, 373105, 381104, 240832, 216661, 441122, 518040, 391436, 244053, 377843, 406816, 397951, 508548, 625622, 752507, 935224, 1210564, 1336335, 1339769, 1359535, 1376651, 1333253, 1332788, 1297197, 1280275, 1177143, 1107454, 1003478, 1051680, 1308619, 1412112, 1391511, 1616724, 1836805, 2033504, 2027576, 1750818, 1661043, 1635669, 1459594, 1237198, 1138175, 980964, 1037589, 1004682, 793793, 775516, 686023, 590267, 623967, 555642, 473895, 419493, 416815, 257497, 175596, 299738, 305714, 236523, 145679]
19105A45679j36081j26836M2234j8561l1342j00528O0054P578N5137J15424M662
19094A7420P7740n8786n0561M5283K0236j6072p1023L7002Q2227j57597o8214
19083a42345r3105J5938Q2423P7203L3089r4641J26987R2649j32623L36Q6057
19072E1968J41582J0495p2448j39469l865J95699n0707j03942J42122J19117O5791
19061C56343o3873q2798j26043n1254P0527J5527L1153j3759r6041j28312J2954
19050g5576L3473k6648R244N1843j52756O5005p5605O6469N6099K0826J00517
19039G2891L4777l9302J42963R0705p1801j25587k207N9260m5700j21252j19690
19028a24943K8190J58199O7451L7289j05162k81220o6479M6002J84745J70669
$$ y = [145679, 9598, -117238, -75004, -93565, -124907, -225435, -165381, -157803, -102666, 12758, 17420, 95160, 36374, -14187, 31096, 51332, 35260, -35763, 1239, 83466, -74131, -142345, -235450, -219512, -137089, -59886, -26797, -121438, 5549, 98198, -34425, -34089, 51968, 193550, 204045, 131597, -7872, -11737, 183962, 133255, 29313, 171435, 290552, 356343, 292470, 209672, 83629, 32375, 102902, 118429, 149582, 135823, 39782, -88530, -75576, -42103, -68751, -59507, -7664, -160420, -95415, -171020, -104551, -48452, -27626, 72891, 107668, 68366, 211329, 302034, 230233, 104646, 102439, 161699, 115999, -5253, -124943, -96753, 61446, 128897, 166186, 61024, -220196, -286675, -240673, -55928, 114741]
19018A14741J02726j34919J4744j9804j08929K0126N4309K739o6378n29k6244
19007d7418J13378R1756n6243J2127R4594l7386j78007O8857J58867J17871j65853
18996A72543q3377P9191q4858N4269K3831n7202J09392n59j02572l4820L8687
18985A14525O1767L6257m0744j05741j41912J61632L9048j17926J56397O1545
18975B24848Q8530o5942m1683k4846j3096n9242K0915J98632j50917k59672l090
18964h5563J7152n9635J57327k706J2482P2152O8146p7944j28698R1451j5966
18953D8198J25945P7495N562J14937J65426o3866o565N8338k7655j48023j50532
18942A99260j67590n2143m7945L5435Q3145P641J05652O3347O8958J9207q1602
$$ y = [114741, 217467, 82548, 97292, 77488, -31441, -11315, 42994, 45733, -20645, -21174, -47418, 65960, 157716, 101473, 113600, 208194, 170808, -7199, 61658, 220525, 338396, 172543, 89166, 168357, 83499, 137768, 161599, 104397, 213789, 213230, 110658, 75838, 114525, 176292, 212549, 171805, 66064, -75848, 85784, 124832, 6906, 163303, 224848, 313378, 247436, 205753, 180907, 167811, 108569, 129484, 328116, 177199, -82473, -85563, -68411, -128046, 29281, 26575, 39057, 111209, 179355, 101411, -27287, 64164, 48198, 174143, 251638, 257200, 372137, 537563, 473697, 467132, 525470, 497815, 349792, 199260, 31670, -20473, -68418, -32983, 50162, 57803, 163455, 226802, 295760, 314967, 233365]
18931B33365j24036N6966J02163M4987j37988j22625l8650J40339L3647o3619
18921A24549j06414j44222J07808K56671R3266j07901k05348j9988J56618J92669
18911C47708J11641j45071k14583P8862k5002L9219J4573r1428j29253j93795
18901b07129N8691R4188R324O7246J84583J77386j1705l4547O245j06640j15630
18890A22012j8835J80601p3715R528p838j77516K8445J61791j0485j12412O3093
18879A64669K4183j68036j00151J52776J77876k01607j58494M8320J34801J15069
18869A89406p0983j9860l9193Q7939K247k4247n1504l9330J3052Q3210J9479P494
18857A57710K0834J23708J8395R3988K6799M9546p5149J74619K46871J27267J31722
$$ y = [233365, 109329, 166295, 268458, 313445, 175457, 52832, 14182, 154521, 188168, 124549, 18135, -126087, -18279, 238392, 331658, 223757, 18409, -1579, 155039, 347708, 459349, 314278, 99695, 178557, 153555, 192774, 207347, 115919, -13334, -207129, -148438, -54250, -44926, 22320, 206903, 384289, 372584, 338037, 344282, 237642, 122012, 103177, 283778, 210063, 219591, 211753, 34237, 62682, 224473, 213988, 101576, 164669, 188852, 20816, -79335, 73441, 251317, 49710, -108784, -60464, 74337, 189406, 118423, 98563, 59370, 147309, 149556, 125309, 73805, 34475, 47527, 130737, 150216, 157710, 178544, 302252, 320647, 414635, 441434, 490980, 415831, 590450, 837321, 964588, 1096310]
18846A096310J78402l9361m9109j1937J76561J21899j37450j39856m213L234O3772
18835A258252J7774m0823r0065J32774K39477J74415J31937N9001L8611K7585
18825A948938J896j20335k79939k24584j53952k92203j148O6060p3339j11653
18815G59741k0886N6343j26557j86346j14682O5642o5937j15602P4025p1996L7508
18804B91253k8934j9618J88072Q2978k11137L0521Q813l8716J4507R4563M4465
18793D56767L9365j5821j06386n9849j11531J2181R4984j1120p1l6060O9238R4017
18781D25714J19808P1265n0162M4287M1228p5124m5473m1429J10669J95620R9990
18770H96393k8544K35124L52212L37242L24637J938n20373m75320l91506j86486
$$ y = [1096310, 1274712, 1235351, 1186242, 1174305, 1350866, 1472765, 1335315, 1195459, 1191246, 1194480, 1258252, 1276026, 1235203, 1145138, 1277912, 1517389, 1691804, 1823741, 1882742, 1921353, 1948938, 1950834, 1830499, 1550560, 1325976, 1172024, 879821, 878673, 944733, 871394, 759741, 738855, 795198, 668641, 482295, 367613, 433255, 367318, 251716, 325741, 253745, 291253, 262319, 242701, 430773, 513751, 302614, 333135, 341948, 303232, 317739, 412302, 456767, 496132, 480311, 373925, 314076, 202545, 214726, 309710, 298590, 298519, 262459, 331697, 425714, 545522, 616787, 566625, 610912, 652140, 577016, 531543, 490114, 600783, 796403, 896393, 867849, 1102973, 1455185, 1792427, 2117064, 2119002, 1598629, 1123309, 731803, 545317]
18760E45317j60877j11028J9469J93453J32882O1463K0440O2191P7062j791j33547
18749G05034o2100q102p4408J90352J37410j5010J14466J068L1626j9564L6402
18738A037174K7317j6685J19023J18122J07554L50416J83889J48819K70525J84453
18728B530607P1850K00928K04286J50463L3192n7512K64054M11241L15922L13689
18718D438720M11542M74357O76128N56796N51967O14542Q18696J163056J512040
18709A1217844J922273K361230L572893N641652Q865107J3275720J8376849K4648039
18701H9881607L0491461K7608774J8032795J6365585M034145k4310665k6769261
18694A35334441k1203246k4326512k1403973j2049598l597621L444383J0047013
$$ y = [545317, 384440, 273412, 292881, 486334, 619216, 680679, 701119, 763310, 840372, 838581, 705034, 642934, 634832, 560424, 750776, 888186, 873176, 987642, 988710, 1020336, 1000772, 1037174, 1064491, 1047806, 1166829, 1284951, 1392505, 1742921, 1926810, 2075629, 2346154, 2530607, 2602457, 2803385, 3007671, 3158134, 3191326, 3133814, 3397868, 3809109, 4125031, 4438720, 4850262, 5324619, 6000747, 6557543, 7109510, 7724052, 8542748, 9705804, 11217844, 13140117, 15501347, 19074240, 24715892, 33580999, 46856719, 65233568, 89881607, 120373068, 147981842, 166014637, 182380222, 186414367, 162103702, 135334441, 114131195, 89804683, 68400710, 56351112, 52753491, 56197874, 66244887]
18687F6244887J6481521K3023474K6911332K0490243J3695518J2805594o505414
18680A73147155k8465186k5308554k3611643k5837596k0418173j3019345p981320
18673B8505338n065063l329384k330365j675277j275714q96283p79507o64366
18665A2489379k70730k20236l48123K7869L27830L03367N64874P86244R80252
18656A4640726J564914K075034K883055M469508O782852J0547424J5412535K1443460
18648G9819508K8261874L2657068K6123930J7779084J6150114m496399k9734035
18641A66561144k6484417k3677875k6800863k0201784j0014601j485988N866899
18634F3762515J2584474J9681006K6696308K8207926J9070504J4679147J0984360
$$ y = [66244887, 82726408, 105749882, 132661214, 153151457, 166846975, 179652569, 173147155, 144681969, 119373415, 95761772, 69924176, 49506003, 36486658, 28505338, 23440275, 20110891, 17780526, 16105249, 14829535, 13933252, 13153745, 12489379, 12218649, 11998413, 11650290, 11678159, 12005989, 12309356, 12874230, 13660474, 14640726, 16205640, 18280674, 21163729, 25633237, 32416089, 42963513, 58376048, 79819508, 108081382, 140738450, 166862380, 184641464, 200791578, 196295179, 166561144, 140076727, 116398852, 89597989, 69396205, 59381604, 57895616, 63762515, 76346989, 96027995, 122724303, 150932229, 170002733, 184681880, 195666240]
18627A95666240j6279446l1943087k6117107k7317765k7810296j9897991j2293369
18620C4007179p688060n061710l418899k395234j823709j283424j151607j105158
18612A0079378j168841r74165p31074n94343m81966m29668m11738m82802k28140
18603D576641p4750k01549j44185m6767j24797k61446k71197k65746j40126l00883
18593B745195k99162k46953n1296n6954n313j9460j40909q3782m7963j20593M5443
18582A718253P7381j14050m3140j87345k35608j34066k1188K67163J13670j87425
18572A253645K6676o1205j58673j51029o2250n3262j24956k392Q467N3687K8086
18561G56794k6987J2478m7807j31033O2558p4565j22582O8272O2977N4648j3329
$$ y = [195666240, 179386794, 147443707, 121326600, 94008835, 66198539, 46300548, 34007179, 26319119, 21257409, 17838510, 15443276, 13619567, 12336143, 11184536, 10079378, 8910537, 7936372, 7205298, 6610955, 6128989, 5699321, 5287583, 4804781, 4576641, 4501891, 4300342, 4156157, 4109390, 3984593, 3723147, 3451950, 3186204, 3046078, 2745195, 2446033, 2199080, 2147784, 2090830, 2085517, 2066057, 1925148, 1841366, 1793403, 1672810, 1718253, 1795634, 1681584, 1638444, 1451099, 1215491, 1081425, 1060237, 1327400, 1441070, 1253645, 1280321, 1219116, 1060443, 909414, 847164, 793902, 668946, 666554, 675021, 728708, 756794, 729807, 742285, 694478, 563445, 626003, 551438, 428856, 497128, 560105, 614753, 601424]
18550F01424L2074K3189J94997O4725j06820n4205j7454j49613k8799K0888o1534
18539E18872O7764O9089j07003l018M1484j16783j4057p5007k4535R2124M8221
18528D97151P2774N0376j1457k4315j77793l2749J38683K3863l5319l9419J69723
18517F31518N230k52677j16310j28237P0589K06872J46795p4319k0968M5922J28035
18506F42450O2979j8527j49255k36604o1806Q7520J6949K03K9296P19R2130o7475
18494C98579n6484Q8824j78594k47428o7170j07195J76573K50483n6662n8775
18484A42151N0528j26091P0647m3364j5819K18363O4071o5409j19907j04234r8082
18473b7146j4561k7257o9647m5866k0176M3305K2461R3933Q6488l7937j2672K4437
$$ y = [601424, 633498, 656687, 851684, 916409, 809589, 755384, 737930, 588317, 559518, 580406, 518872, 586636, 655725, 548722, 545704, 587188, 470405, 456348, 381341, 356806, 448930, 497151, 569925, 620301, 608844, 584529, 406736, 373987, 512670, 536533, 501214, 461795, 631518, 636748, 384071, 267761, 139524, 210113, 416985, 563780, 489461, 468493, 514415, 642450, 705429, 686902, 537647, 301043, 239237, 326757, 343706, 343909, 373205, 373924, 466054, 398579, 342095, 430919, 252325, 4897, -62273, -169468, 7105, 257588, 200926, 142151, 192679, 66588, 137235, 93871, 78052, 296415, 360486, 295077, 175170, 70936, -27146, -41707, -68964, -138611, -184477, -204653, -161348, -138887, -44954, 41534, 3597, -9075, 15362]
18461A5362L0698J22943Q4692n6969j53573M4506P9569K2922K3807P571l9919
18450A81609k4000K0128m6538J05551J4325J07191L7097l5171k42856k2008P4574
18439A69902l9447o2577K4625j07020j06020n955N5459J02289j4919j43852j8743
18428a46258J59564P8493M4065N3117j01774J8238o8370Q2793J13123j68862o1903
18417B226N6535J47312J79530Q764m5231p9550j56901j39976M76L7978n7251J20604
18405G4516J01528j03746p4233J11226O5616K0507J30901R6647k09581k01658
18395A1723M992j60607M960Q8446p1556M9038O8285M7482J5348N5090j29438J0319
18383e918Q5586R4443J57953J75322j07045l22558o9278Q6135J19003R8872J50685
$$ y = [15362, 46060, 169003, 253695, 196726, 43153, 87659, 167228, 190150, 213957, 221528, 181609, 157609, 177737, 131199, 236750, 251075, 358266, 395363, 360192, 117336, 95328, 169902, 130455, 67878, 92503, -14517, -120537, -126492, -71033, 31256, 16337, -127515, -146258, 13306, 91799, 135864, 188981, 87207, 105445, 37075, 119868, 232991, 64129, 2226, 58761, 206073, 385603, 394367, 349136, 269586, 112685, -27291, -26815, 11163, -46088, 74516, 176044, 72298, -1935, 109291, 174907, 195414, 326315, 422962, 213381, 11723, 16715, -143892, -138932, -50486, -122042, -73004, -4719, 42763, 58111, 113201, -16237, -5918, 79668, 174111, 332064, 507386, 400341, 77783, 8505, 94640, 213643, 312515, 463200]
18372D63200J14000O8712o5179j34374o1405l3500k73276q1074J3976o9392N5592
18361b720L0204o079N9488K1485p0728o1126m1086r078q4542J61700L11076j6200
18349B92394j10822O8762P1175J01216r1118l1230j19477k6772P9063J36358J07173
18338D76722m2357q6185R1577J00730K6203o9717N6462q3879j01387J6464n0543
18327C34090j10796k40433j16208O9835J05507R0187K1709Q7023O2797J35876
18317D39587R3009N7481k02227n9127J12772K077m6156m0680j8582l546M873m5986
18305B93495q0626J6868N7152j88840j20345K0883k2352R743j6618P6619J6048
18294F2027l4427M6987M2841n7350m6853M4445J12598k6365l6367Q2241M1231
$$ y = [463200, 577200, 645912, 580733, 446359, 384954, 351454, 78178, -2896, 11080, -58312, -2720, 27484, 21405, 80893, 102378, 31650, -29476, -70562, -79640, -164182, -2482, 308594, 292394, 181572, 250334, 321509, 422725, 331607, 300377, 180900, 154128, 233191, 369549, 476722, 434365, 348180, 439757, 540487, 566690, 496973, 553435, 469556, 368169, 384633, 334090, 223294, -17139, -133347, -63512, 41995, 132182, 153891, 240914, 303711, 439587, 532596, 590077, 387850, 328723, 441495, 443572, 397416, 356736, 338154, 334608, 339481, 293495, 212869, 229737, 286889, 98049, -22296, -1413, -23765, -14022, -30640, 45979, 62027, 27600, 74587, 117428, 60078, 13225, 57670, 170268, 143903, 107536, 189777, 231008]
18283B31008J7973R2398K9691K32228J80586j35624R643L9515K11451j47559j50854
18272F10456j40134r4500n7746Q7103l0605J68249L8786O2635K38295K10119m0427
18261A052231J469j03042J5901j9711k58205l31923j77786J53065K3109j01514
18251B53594k1662j67266n5068O4736l4031l0739p2807R9884J56249P8045P7207
18240C48142j16227j07959k97756j35232J66882K39556M9961m0477Q1968J30353
18230C19211K8449j58503j43826j6780j3159J6197q2902R6194J64143J20756J46576
18219D76356l2450j03829j20414j48244J45050k1515K3367o6926k07697M7786
18209h516J07736J14477n7514K4269R0220n7861k0430l3369o3056K37330J56696
$$ y = [231008, 248981, 341379, 371070, 603298, 783884, 648260, 657903, 697418, 908869, 761310, 610456, 470322, 375822, 318076, 405179, 374574, 542823, 581609, 644244, 882539, 1092658, 1052231, 1053700, 950658, 966559, 946848, 688643, 356720, 178934, 331999, 355108, 253594, 231932, 64666, 9598, 74334, 40303, 9564, -63243, 36641, 192890, 270935, 348142, 231915, 123956, -173800, -309032, -142150, 97406, 147367, 106890, 188858, 319211, 347660, 189157, 45331, 28551, 15392, 31589, -51313, 44881, 209024, 329780, 476356, 443906, 340077, 219663, 71419, 216469, 194954, 218321, 151395, -56302, -8516, 99220, 213697, 156183, 180452, 270672, 212811, 192381, 159012, 95956, 333286, 489982]
18198D89982j55465k02323o462m281K08451J32877K11486K33049J79797J2313
18188A099424j9125p0648r0142j70437j23394m3955j15596K1248R3002J65510
18178G45887n9754N8471J40990J78604M896L9450j6734O0837k8871j51336m6537
18167I25903p3293j23956r3343j2990L0460N5725O0841q2966q118O485j64238
18156E20510m2302O2078J0833N1381J70013J63460J65886J06402J23905J45790
18146A477956J80272L635J62589K26301K54988M12228L71661J68308K98360O3186
18136C619484q6320k30096k8549l2433m1712J50973K1595K6900P2794J61915K08586
18125C843137K69933N04933P90095R81690P56950R74548J349370J535115J949784
$$ y = [489982, 334517, 132194, 125732, 121451, 329902, 462779, 674265, 907314, 1087111, 1099424, 1080299, 1009651, 919509, 749072, 625678, 581723, 466127, 487375, 580377, 745887, 686133, 744604, 885594, 1064198, 1069094, 1108544, 1091810, 1152647, 1123776, 972440, 925903, 852610, 728654, 635311, 622321, 652781, 708506, 769347, 686381, 678263, 684748, 520510, 478208, 540286, 551119, 602500, 772513, 935973, 1101859, 1208261, 1332166, 1477956, 1658228, 1661863, 1824452, 2050753, 2305741, 2717969, 3089630, 3257938, 3556298, 3619484, 3533164, 3303068, 3274519, 3242086, 3200374, 3351347, 3372942, 3399842, 3472636, 3634551, 3843137, 4113070, 4618003, 5408098, 6389788, 7146738, 8121286, 9470656, 11005771, 12955555]
18116A2955555K716271M255406O728932J1384535K1058265L5765042M9934877
18109A44798883N7287356O3999062M7742915o8674722j04337975n8917316k8817280
18102E3080923j5243290r200259o056240m052202k846850k055910j511402q88056
18094A1226714n61154m80502m75982p48644q98240q19993o50249k25674M9421
18085F415697o0067r4183J8697k79300p14678p00261p21236p18121o31978l20565
18075B194005j82787q0966j70852j12374k30199O8661J72708K30059J82837J63104
18065B234196J29120n7951l48156j58718k56711k67433J10576J60220N3871L9366
18055A638380L31805M72340N24636P90185J000843J101613J068737N18310p4986
$$ y = [12955555, 15671826, 19927232, 26656164, 38040699, 59098964, 94864006, 144798883, 202086239, 266085301, 313828216, 245153494, 140815519, 81898203, 53080923, 37837633, 28637374, 22581134, 18528932, 15682082, 13626172, 12114770, 11226714, 10665560, 10185058, 9709076, 8960432, 8062192, 7242199, 6591950, 6366276, 6415697, 6355630, 6261447, 6280144, 6000844, 5286166, 4585905, 3864669, 3146548, 2514570, 2194005, 2011218, 1930252, 1759400, 1647026, 1416827, 1485488, 1658196, 1888255, 2071092, 2234196, 2363316, 2305365, 1957209, 1798491, 1541780, 1274347, 1384923, 1545143, 1599014, 1638380, 1970185, 2442525, 2967161, 3757346, 4758189, 5859802, 6928539, 7446849, 7371863]
18046G371863n57441n46887m41309l05550l95671o63588n33187n85300k80188
18037C062742l69818m54044l75608l34567k70167k22347j63534q9401m5653m5946
18027F91657k31272q8527J78264R5343q1593j51162k40023p860P7987j7104o5400
18016A60310J83529J95857J91349o0385p7047m5640M4482J05492P9206k1903l7109
18005G18141r991K298n9120Q0743K91325J36836m4443J18268K04847K17876M05118
17994B061898L68801L16712M16097L73052O68198Q14639Q14563P23093Q87821
17985G444874P70751M17238L98505P13659K58999j05004N4960L35425n2969p01258
17975I535180p77996n34939m50076p13735r14406j083996p88722o43802n40640
$$ y = [7371863, 6814422, 6267535, 5826226, 5520676, 5125005, 4461417, 3928230, 3342930, 3062742, 2692924, 2238880, 1863272, 1528705, 1258538, 1036191, 872657, 783256, 737603, 691657, 460385, 371858, 550122, 645465, 563872, 412710, 172687, 164827, 242814, 225710, 160310, 343839, 539696, 731045, 670660, 593613, 547973, 592455, 697947, 777153, 755250, 718141, 708150, 710448, 651328, 732071, 1023396, 1160232, 1115789, 1234057, 1438904, 1656780, 2061898, 2430699, 2747411, 3163508, 3536560, 4204758, 5019397, 5833960, 6557053, 7444874, 8215625, 8632863, 9031368, 9745027, 10004026, 9899022, 9953982, 10289407, 10236438, 9535180, 8757184, 8222245, 7772169, 7058434, 6144028, 5060032, 4271310, 3627508, 3086868]
17966C086868n93217m08656l24573j17934k7257Q7226o2041j31199j07373O2920
17956A464764J62560j17449k38334p9939m807R4544Q5611M19006M42972K36506
17946B465434J98959L11331M09653O2960J51646J81923K18892J46910L69187K41828
17936D758723j06732J39398L54143Q5002j38299k32207m1913J85414J77484j38402
17926E042611n14928m50664l81385l63542o74368m26802k26903l45809m28846
17917A229364j68932r1379k01590j38826K7159M8197j6090q9982J41868n377j9105
17906G15307p7646j21870j27526L4919Q6069k22661N441P3074J10944L0349m3879
17895D62521O2357L8428N580N2968O4473K2899J1265R3765M5381j8009k1855j29517
$$ y = [3086868, 2493651, 2084995, 1760422, 1642488, 1615231, 1702457, 1640416, 1509217, 1401844, 1464764, 1627324, 1509875, 1271541, 1191602, 1186795, 1281339, 1366950, 1785956, 2228928, 2465434, 2664393, 2975724, 3385377, 3448337, 3599983, 3781906, 4000798, 4147708, 4516895, 4758723, 4651991, 4791389, 5145532, 5230534, 5092235, 4860028, 4818115, 5003529, 5181013, 5042611, 4527683, 4077019, 3695634, 3332092, 2657724, 2230922, 2004019, 1658210, 1229364, 1060432, 969053, 767463, 628637, 655796, 703993, 687903, 597921, 739789, 734412, 715307, 637661, 515791, 388265, 423184, 509253, 286592, 292033, 365107, 476051, 506400, 462521, 524878, 563306, 568886, 621854, 686327, 709226, 720491, 814256, 859637, 841628, 819773, 690256]
17883F90256j58092M5059O1070p3320l3612L1270n8985r8193j93883n809J6972
17872B22733j16408k801j05150K5746n557J0006P0420J26714O0189J5134l5173
17861B65853o4257n2891l0173l9822l9521o6777M373R0474r2368q9657k27847
17850c42613m4332J40902J86223R8920l09K5427P5257J69803j43292p8326k1673
17839F5987J1763M0519j58552j21660k5570l5131j4121j9655L0279M7151l0533
17828b09523J6293M5141R6622N0706r7803M1463J31813l6138R5131J38030N3632
17817C25367k1373j03472o2145r4278l6322J44257J25563K15384J96127P4455
17807G63563J53891O8116J4889J92103K69808j0556j61103J60909J16197j58093
$$ y = [690256, 532164, 577223, 638293, 564973, 531361, 562631, 503646, 405453, 211570, 205761, 222733, 106325, 103524, -1626, 24120, 18563, 28569, 98989, 225703, 285892, 301026, 265853, 201596, 148705, 118532, 78710, 39189, -27588, -23215, 67259, -25109, -114766, -342613, -386945, -246043, -59820, 39100, 38791, 64218, 139475, 309278, 165986, 87660, 65987, 77750, 118269, -40283, -161943, -187513, -222644, -236765, -256420, -226141, -178990, -209523, -193230, -148089, -51467, -761, -98564, -57101, 74712, 38574, 133705, 271735, 325367, 303994, 200522, 138377, 44099, 7777, 152034, 277597, 492981, 689108, 763563, 917454, 985570, 1000459, 1192562, 1462370, 1451814, 1290711, 1451620, 1567817, 1409724]
17797A409724k71230l02907k28657j56840r8012J1946r8384k20704m3511L162
17787D587p2432L8357K71500O5545M5864l1767j15176l0326j32327k30885j2748
17776a99808q5656k0990J91986N6450p3576M3762j3194J32823K7137M725J11396
17765A75055M3867j01441l8131P2362m5935k3916P89J6585p2982J15660L57151
17754D99064J40484N7994K58904L16820K15531Q6553p0705j00507q1784m3873
17744A278481j78501k89617l04410j64296j22750q3863j77772o8639n7505L7028
17734a31844M3982Q6477P080l3993n2877P1222k4177r2315O8087p4563K6024J29585
17722B2688K2769j12577K9155k5465L7229J0909j7764J43493j70162j64712L3553
$$ y = [1409724, 1138494, 835587, 606930, 450090, 352078, 364024, 265640, 44936, 1425, 4587, -67845, -29488, 242012, 307557, 353421, 321654, 206478, 176152, 43825, -187060, -199808, -285464, -306454, -114468, -58018, -131594, -87832, -101026, 31797, 58934, 63659, 175055, 218922, 117481, 79350, 151712, 105777, 81861, 82650, 99235, 26253, 141913, 499064, 639548, 697542, 956446, 1273266, 1488797, 1575350, 1504645, 1404138, 1322354, 1278481, 1099980, 810363, 505953, 341657, 218907, 135044, -42728, -111367, -168872, -131844, -87862, -1385, 5695, -28298, -81175, -9953, -34130, -126445, -58358, -132921, -106897, 22688, 45457, -67120, -37965, -63430, -26201, -15292, -33056, 110437, -59725, -224437, -190884]
17711a90884O7155P1956J28734n7698J46911N8391P7157l4920j95119j93325k45308
17700c66950L3637R2654j1215n772J83131O9653O9804j17000q0058n0289j07513
17689b89918M1797p6283J4785j1884K02017J62166j64686q8329P5806J90734M5389
17678A01594O1471p2016m1878j45706j44397M2464J16110M5736m8186K7222L9537
17667a8049J0703l200j34220N7836P5910J73349R0100Q3623k9119j11653k90036
17656i4756j3830R9932m7458N8327R145l2960M4836P3N0249J14918m3452J8282
17644A63306P5234M0522l4647p7972j5811o3807R4187J09554n4908j30760q0880
17633B4018m5366q4761j73805N293J93224J29045n2211l3709j36095J14078J72214
$$ y = [-190884, -123729, -51773, 76961, 19263, 166174, 224565, 301722, 266802, 71683, -121642, -366950, -333313, -240659, -251874, -257646, -74515, -4862, 64942, -52058, -132116, -182405, -289918, -248121, -324404, -309619, -321503, -119486, 42680, -122006, -210335, -134529, 56205, 101594, 163065, 91049, 49171, -96535, -240932, -198468, -82358, -36622, -84808, -57586, -18049, -7346, -10546, -144766, -86930, -11020, 162329, 252429, 336052, 306933, 195280, -94756, -108586, -8654, -56112, 2215, 11360, -21600, 23236, 23309, 73558, 188476, 145024, 163306, 238540, 279062, 244415, 166443, 150632, 86825, 181012, 290566, 235658, 104898, 24018, -21348, -106109, -279914, -274621, -81397, 47648, -4563, -38272, -174367, -60289, 111925]
17622A11925l5886k03236n9319J5080J35728J99435k8702j10939j76345q6233
17612b38492M4054l8743o0921J0814J02231R2110L1234P8485m8214l4998J13057
17601E0617M5905r3288M500m6988p7449l2985p7359p5674R7669J96165J54527
17590A45640k3857j72383P8072J97744N3168q5338J5833J24463O0195j09214j23363
17579A60960m9530m1765m8124K7477J17552l3250r4440N6834J07294J03219o9398
17568B36829q2214j23384j94710L7139J2261L6552p0699p7652K3777L5121K5630
17557a41350n7127O1495J01456m5296N6356Q1886O0548j11186q5602P2094Q1129
17546G4403j8044m6695O3815q8164j54848J06101P9696J4068P1749M4666J56211
$$ y = [111925, 76039, -127197, -186516, -171436, -35708, 163727, 135025, 24086, -152259, -238492, -194438, -233181, -294102, -283288, -181057, -88947, -57713, 20772, -27442, -62440, 50617, 96522, 3234, 7734, -39254, -116703, -149688, -227047, -302721, -205052, -8887, 145640, 121783, -50600, 27472, 225216, 278384, 193046, 208879, 333342, 393537, 284323, 160960, 111430, 69665, 21541, 49018, 166570, 133320, 38880, 95714, 203008, 306227, 236829, 154615, 31231, -163479, -126340, -114079, -77527, -148226, -225878, -202101, -166980, -141350, -198477, -136982, -35526, -80822, -24466, 57420, 117968, 6782, -78820, -6726, 74403, 56359, 9664, 73479, -14685, -169533, -63432, 16264, 30332, 102081, 146747, 302958]
17535C02958p7618n8700K1014M8253l3297j8961L0375j91686j02333j02239J2770
17524a69464j7766P8961o0935o3624J68747J14142n0458n9853J3125L1616j9336
17513c4845M4132P647o1615L4982J03431o5653L7239N6879n4521M3137P2861p8069
17501A05605n8697L4212J44745k15933n4156O9517j15393n119J19358M4498j13581
17490d4944j20263K13203R4271o4581j35982m195K35269M2494k1252J5398m9089
17479A60329j36944M1156P0823J31776q6723r2533l0771m5630K3165J6851O0633
17468A12132R0510n2617J03571n3868p240m7344n3739q7999n362l6889J8679p6982
17456i7148L4576J76614J49999J4059m0978P0748O9063j29658O2377K9900K01805
$$ y = [302958, 225340, 166640, 187654, 235907, 202610, 183649, 214024, 22338, -79995, -182234, -169464, -187230, -108269, -169204, -232828, -64081, 50061, -397, -60250, -47125, -15509, -34845, 9287, 16934, -44681, -9699, 93732, 28079, 65318, 122197, 67676, 110813, 183674, 105605, 46908, 81120, 225865, 9932, -44224, 25293, -90100, -95219, 24139, 68637, -44944, -165207, 47996, 142267, 77686, -58296, -62491, 172778, 215272, 194020, 209418, 160329, 23385, 64541, 135364, 267140, 180417, 87884, 57113, 11483, 34648, 51499, 112132, 202642, 150025, 253596, 199728, 192488, 145144, 91405, 3406, -1956, -38845, -20166, -97148, -62572, 114042, 264041, 278100, 237122, 307870, 376933, 247275, 309652, 339552, 541357]
17445E41357K14819J91210L16389L25004K83072k4716n95475n15947k26024j00874
17435D08815N8595l5170j51906m7327J5211m4171o259k0013O554K2022R530j73619
17423D2262N9591J4131m5754L9878K9809P0394J10286N8264N5444o306K2775l4574
17411D16200J2917P5477K0569q1682L6245J02443j88104M6066m1787j57992j02027
17400A38325j05799N35J00366K34785q1541j81763J20589J24688K0438j68534
17390B02089j90817m4446J39962Q8252j7025n8390M4856Q9009J6472O1862J11713
17379D43537J24245N2055p5398j59832p0411q9294j08654J1307J0939j08714j4682
17368A5098J45970O9450M5454m8458K5761O0317M4318K43309J76828r5172j4181
$$ y = [541357, 756176, 947386, 1263775, 1588779, 1871851, 1847135, 1251660, 735713, 509689, 408815, 467410, 432240, 280334, 233007, 248218, 204047, 197788, 177775, 184329, 206351, 215881, 42262, 101853, 115984, 70230, 110108, 139917, 210311, 320597, 378861, 434305, 427999, 450774, 416200, 429117, 504594, 525163, 443481, 479726, 582169, 394065, 440131, 398344, 240352, 138325, 32526, 33061, 133427, 368212, 286671, 104908, 225497, 350185, 370623, 202089, 11272, -33174, 106788, 195040, 178015, 119625, 164481, 253490, 269962, 331824, 443537, 567782, 619837, 544439, 384607, 314196, 224902, 116248, 127555, 138494, 29780, 15098, 161068, 230518, 275972, 227514, 253275, 313592, 357910, 601219, 778047, 682875, 668694]
17357F68694J25723n2567n9861j17185l2600o8481P7812j37546N1285p0359p7032
17346C07883J4944J6556j03515n6546Q8823K08863N4359O7119J34820N0982O1338
17335H45626k2767k7536j73468K2520m8038o1499q2800o8090P8542J23017k0468
17324E65039J07537K57591K03482j841j8222K90125O7368N1454N7179R5026J59887
17313A834625R5156J37076J54935K53453J99903K56435P17605P59873M24229N98041
17303E431331O54335N65630M73898L81362N52053N62661Q56669R96119J265405
17294A1739463J911695K577759L368372M944721P449372J1695629J8245328K6779579
17286H8711918L7174493M7949030N1527444M5358247L6261076J1069804n94749
$$ y = [668694, 794417, 741850, 681989, 564804, 532204, 463723, 541535, 403989, 455274, 384915, 307883, 322827, 339383, 235868, 179322, 268145, 477008, 531367, 598486, 733306, 784288, 845626, 822859, 795323, 621855, 644375, 596337, 534838, 452038, 383948, 462490, 585507, 565039, 672576, 930167, 1133649, 1131808, 1113586, 1403711, 1471079, 1522533, 1579712, 1674738, 1834625, 1929781, 2066857, 2221792, 2475245, 2675148, 2931583, 3649188, 4409061, 4833290, 5431331, 6085666, 6651296, 7125194, 7506556, 8058609, 8621270, 9477939, 10474058, 11739463, 13651158, 16228917, 19597289, 24542010, 31991382, 43687011, 61932339, 88711918, 125886411, 173835441, 225362885, 270721132, 306982208, 318052012, 317457263]
17279C17457263o410435j5081678k3962763m7463132n2680927m8649745l8553990
17272H4654593k4730063j5439478j0019511o919601m765530l384922k317077j732241
17264A5346170j327981j034402p79758o80249p14153o22796m46558m68865m62400
17255H809008l13113j56610p2851J0361J14459K27211L92635M62112L49989K00372
17245A0023573M29893N99538O30150Q23333J192350J707952K445852L486842N051956
17236B6391439P689585J2349427J8897266K7482935L7454413M6585551M7125928
17229B23976544M0150644K7268064L964589j129311q558053j5429971k8754478
17222B41488028m8694313m7944827m3084276l1889653j9998838j2534068q097719
$$ y = [317457263, 311046828, 295965150, 272002387, 224539255, 171858328, 123208583, 84654593, 59924530, 44485052, 34465541, 27545940, 22780410, 19395488, 17078411, 15346170, 14018189, 12983787, 12204029, 11523780, 10809627, 10186831, 9740273, 9271408, 8809008, 8495895, 8339285, 8266434, 8276795, 8391254, 8618465, 9011100, 9473212, 9823201, 10023573, 10453466, 11053004, 11683154, 12506487, 13698837, 15406789, 17852641, 21339483, 26391439, 34081024, 46430451, 65327717, 92810652, 130265065, 176850616, 223976544, 264127188, 291395252, 295359841, 294230530, 285672477, 270242506, 241488028, 192793715, 144848888, 101764612, 69874959, 49876121, 37342053, 29244334]
17215B9244334n685725m043898k976131k137485j584357j340512j067084p56314
17207I652828p19875p01084o97005p36312n31751m70597m90631n05874m67782
17198D331917k77848k81557j86320k13292j72161j57494r0610j55729j26072l2906
17188B637928j59432n9611k6179k20919l43429j22125K6817K26128j04496k31625
17178A623057p2714j67354j12262L3615K18575j0259L6409q6737o7378m7374J52805
17167A500383J08665j74377j52837m4898q755Q0709O964l910j04598r357m8111
17156A149878o682o838M3233M8468n1334j23858n9259r5623n4462q2947o5980
17145F94596m0307K6269N7177n8592k92386l9462Q0954J02320J41909J37360J01786
$$ y = [29244334, 23558609, 19514711, 16538580, 14401095, 12816738, 11476226, 10409142, 9652828, 8932953, 8231869, 7534864, 6798552, 6266801, 5796204, 5305573, 4799699, 4331917, 4054069, 3772512, 3586192, 3372900, 3200739, 3043245, 2952635, 2796906, 2670834, 2637928, 2478496, 2418885, 2392706, 2171787, 1828358, 1706233, 1733050, 1959178, 1854682, 1623057, 1550343, 1382989, 1270727, 1304342, 1522917, 1512658, 1549067, 1462330, 1394952, 1347578, 1500383, 1609048, 1434671, 1281834, 1236936, 1228181, 1308890, 1315854, 1311944, 1207346, 1197989, 1149878, 1143196, 1136358, 1179591, 1228059, 1176725, 1052867, 993608, 897985, 843523, 760576, 694596, 654289, 680558, 737735, 679143, 386757, 347295, 428249, 530569, 672478, 809838, 911624]
17134I11624J79745q334Q3990K36779k4507K2494L125J09012M6562j70098l68897
17123A021495k97072j13326l2865j13154j0221j7665L2831j42067J1011P2443
17113D11410n9679r8008o8816R4274O3193K5978M6210O793j21750J25154L2679
17102D57438n1784p0728j52932l882J36192J72828N6377j06750j78543n4044j07841
17091I6331q7150J45616L1969R4708J44628N5944l0423j51830N2554J71304K64844
17080G88495J62068J36000K21229L2673p8313N1938j91960j59917j15907k9631
17070H16675N0538j59485k15406j83969j49132J00491K2849Q1295M4734j12469
17060B96121j33822k41181l3494J73430J78128J570P1067K405q66j27472Q6052
$$ y = [911624, 1091369, 1083035, 1167025, 1403804, 1379297, 1401791, 1404916, 1513928, 1560490, 1390392, 1021495, 724423, 611097, 578232, 465078, 454857, 437192, 470023, 327956, 338967, 411410, 351731, 253723, 184907, 279181, 342374, 368352, 414562, 421355, 299605, 424759, 457438, 405654, 334926, 181994, 178112, 314304, 487132, 543509, 436759, 258216, 204172, 96331, 9181, 154797, 186766, 281474, 426102, 482046, 451623, 299793, 352347, 523651, 788495, 950563, 1086563, 1307792, 1340465, 1262152, 1314090, 1122130, 962213, 846306, 816675, 867213, 707728, 492322, 308353, 159221, 259712, 282561, 363856, 408590, 296121, 162299, -78882, -112376, 61054, 239182, 240752, 311819, 314224, 313358, 185886, 271938]
17049B71938r0672p227L6717j4402J44593q707r678q1464j37983m790P2004J11208
17037B81537R512m299l9456l0186p5852l0439o7758j90363j8843O9829N0266O5360
17025A9308J44648n1247j15806j18340K1617P0693l3442n1241p646j5545J38231
17014A230R1615j3503J7403J68372J1605m2245j05591j12712R6352Q8026q6714
17003A13838j05976k3849K1456p55j05749J18334N7705J10360N0216j31031q8669
16992A5880J10808n283q3726M8326M788J00834J2884n5658j5189P5725K1289p7927
16980A52751j05999Q368j13419L120n3370j82964j8418N7965p4871M7294R2458
16969a87085L5929J35660J52238J59058p7869j5005l906N3165P7247j21656j23331
$$ y = [271938, 181266, 174039, 210756, 196354, 340947, 332240, 322562, 241098, 103115, 98325, 170329, 281537, 291049, 286750, 247294, 217108, 141256, 110817, 43059, -147304, -166147, -96318, -46052, 19308, 163956, 112709, -3097, -121437, -99820, -29127, -62569, -113810, -121456, -137001, 1230, 92845, 79342, 96745, 265117, 276722, 234477, 128886, 16174, 112526, 200552, 113838, 7862, -15987, 5469, 4714, -101035, 17299, 75004, 185364, 235580, 104549, 15880, 126688, 121405, 37679, 86005, 90793, 191627, 204511, 148853, 133664, 209389, 230678, 152751, 46752, 55120, -58299, -55179, -108549, -291513, -309931, -251966, -326837, -279543, -187085, -151156, -15496, 136742, 295800, 217931, 202926, 199020, 252185, 329432, 207776, 84445]
16958H4445n1725n6001r5746N0950M2826q8047q7811m2918o2479P0028J8445J2133
16946b05900N2624o2197M2346J41750K32594J14768p4558p9430j14535q945Q1971
16935A20488J6559l4970k1327j83424j37924J24166P5662M472N2256r0642p6898
16924a51582m655J0812N7814q0267j17462P1688k125J55258K19149r162l3595
16913A15873Q884o7655n9648J11187k9733k4531J8228j16098j4416Q8466M7371
16902G7928j17655J2520Q2454N9071Q4376Q2208o5084J26095j1453p2243j53612
16891A04605Q5068j33595q7687j9866p6338L0156K636k8236N0400J03585N7873
16880H8601j50753j58641J30306L6838J22116O5153m12k9165j0895J1994R6268
$$ y = [84445, 32720, -23281, -119027, -68077, -25251, -113298, -201109, -244027, -306506, -236478, -218033, -205900, -153276, -215473, -173127, -31377, 201217, 315985, 241427, 161997, 47462, 38517, 120488, 137047, 102077, 80750, -102674, -240598, -116432, -40770, -36298, 15958, -74684, -151582, -156237, -145425, -87611, -167878, -285340, -213652, -215777, -60519, 158630, 149468, 115873, 124757, 57102, -2546, 108641, 78908, 54377, 72605, -43493, -57909, 30557, 77928, -39727, -27207, 55247, 114318, 198694, 280902, 215818, 341913, 330460, 258217, 104605, 189673, 56078, -31609, -51475, -127813, -97657, -95021, -123257, -72857, 30728, 88601, -62152, -220793, -90487, -53649, 68467, 133620, 133208, 104043, 93148, 105142, 201410]
16869B01410K2156j25310O5728P0228k7138j59742m1109j1924n0814j34287J02246
16858h8556K1109O4037O762N9340K2172j31962R17J58161j7889j4379j81276Q1667
16846a9897M5171Q6710n99J46052M2572O7611m2407k936p0959j22224j47457J7536
16834h27l6707l2186j38663K4189l3799n6304j16487P1806K18237J54429j6666
16823C7022K232J25738j73374o0811L8936L5838k7867J25689J32674q8054M2466
16812A90489Q0628k2158q4275r0435l7035j45757l714O0067J3231j12197m2456
16801a93612J69823l2472P4145K02589j18561k00731L0934J54740M4757k1910
16791A09702o846j36844j21036J34177J5074M3227m4834l3839Q3310J32002J3613
$$ y = [201410, 223566, 98256, 163984, 234212, 207074, 47332, 6223, -5701, -56515, -190802, -88556, -67447, -3410, 3352, 62692, 84864, -47098, -46181, 111980, 94091, 79712, -101564, -19897, 25274, 111984, 111385, 257437, 300009, 367620, 325213, 322277, 251318, 129094, -18363, -827, -37534, -69720, -208383, -184194, -217993, -274297, -390784, -318978, -100741, 53688, 37022, 39254, 164992, -8382, -69193, -30257, 5581, -22286, 103403, 236077, 148023, 190489, 271117, 248959, 164684, 74249, 37214, -108543, -112257, -52190, -38959, -151156, -193612, -23789, -56261, 17884, 220473, 101912, -98819, -67885, 86855, 131612, 109702, 102856, -33988, -155024, -20847, -5773, 37454, -7380, -41219, 42091, 174093, 187706]
16780A87706k9170j16421n4759J16017Q700n9038j4518J39172P5139m7086o7714
16769A38028k692K37274J9038j43478n1204J77474M7734J07574J83510J27513
16759H40771R3667J41821J33024J01353K61686L07390j02806q3287p8033j61153
16749A454433k34712j61626l14553j48626l2433J5285L8825j20868q6581r944
16739C99200j23620r9767k7456q4224j32624M0402L5238r7471O8091r1731r2639
16728b06601N8719j1038P3769Q5494M154K7552P8284M4660p8624m5715R3125K9806
16716A53585r2530p0417j57967q277n4000J48154J56330K24231n1358j16841K5169
16705A56079K64678K64128J92927L97911K53164L8525o1181r4803j92528n5415
$$ y = [187706, 158536, 42115, -12644, 103373, 112073, 53035, 38517, 177689, 252828, 205742, 138028, 135336, 372610, 391648, 248170, 196966, 374440, 422174, 529748, 713258, 840771, 934438, 1076259, 1209283, 1310636, 1572322, 1879712, 1776906, 1693619, 1615586, 1454433, 1219721, 1058095, 743542, 594916, 562483, 577768, 616593, 495725, 409144, 399200, 275580, 175813, 148357, 64133, -68491, -28089, 7149, -90322, -22231, -113962, -206601, -147882, -158920, -85151, 343, 4497, 32049, 110333, 154993, 76369, 30654, 123779, 153585, 61055, -9362, -167329, -175606, -229606, -81452, 74878, 299109, 247751, 130910, 156079, 420757, 684885, 877812, 1275723, 1528887, 1567412, 1506231, 1411428, 1218900, 1163485]
16695A163485j15328l14061k12924J40800Q1128j34208j94053k40378j43181q1234
16685d9954L0423R0164Q1586O7283j59436q0236m9397K0386k2230K5879R7539
16674E2007j89752N2115o297N505J6039J17425J89900j73520k48593L5905L568
16663a45698n7187q348J48383R9672P6201J6341j20526N6934O7162j67509L9171
16652D596L2909M7464L4159j84366J89409M0452j95008K8882N468j10103K463
16641a03675J05358O4597p1784L7966J84651O1109p7710j37580l8659K9328j71921
16630a18320k42554Q8295J92890M5248j32991M8600J80938K11757R4315j79296
16620A88882k14590j13191J7273l9129N0307q7730o5129J13416j3556p3062J9481
$$ y = [1163485, 1048157, 734096, 521172, 661972, 743100, 608892, 414839, 174461, 31280, -49954, -19531, 70633, 152219, 219502, 60066, -20170, -69567, -49181, -71411, -45532, 52007, -137745, -85630, -91927, -86422, -70383, 47042, 236942, 63422, -185171, -149266, -145698, -202885, -211233, -62850, 36822, 113023, 129364, 8838, 65772, 132934, -34575, 4596, 37505, 84969, 119128, -65238, 124171, 164623, -30385, -1503, 3965, -106138, -103675, 1683, 66280, -5504, 32462, 217113, 278222, 200512, 62932, 24273, 53601, -118320, -360874, -272579, -79689, -34441, -167432, -118832, 62106, 273863, 368178, 188882, -25708, -138899, -121626, -160755, -110448, -198178, -263307, -149891, -163447, -236509, -217028]
16609b17028l8737Q8496M3865L9550J33398o7249j57371q8096o4652J19304J25756
16598h2764R0470M3179q5845M7521O9406l0674j97866k6188M7428J95196N6151
16587A26014j40513j37294P4209n3036Q5302M5499M1123L3906p5235l186p9677
16576h2888L0136O8402n2233p5777J01479Q3353j53349l4132J55862m0087j2555
16565a1789o2093j558m3009P5163N7551r053j049j27410o6323k0231N1409M5499
16553a12893j00476m2903l275O2055l6970J24256L30614k2043j87754r8578k8157
16542a16124K08053O794j70848o7061N9227j0385O9989q1429j31812P3980P58
16531a58858Q1398M1651K1373j0184J05009J18231M3398m5102j04343q8170K7633
$$ y = [-217028, -255765, -167269, -123404, -83854, 49544, -17705, -175076, -263172, -327824, -208520, -82764, 7706, 50885, -34960, 12561, 81967, 51293, -146573, -172761, -125333, 69863, 126014, -14499, -151793, -77584, -130620, -45318, 181, 41304, 75210, -25, -3211, -82888, -52752, 15650, -36583, -112360, -10881, 72472, -80877, -115009, 40853, 766, -11789, -73882, -75440, -118449, -43286, 14265, 5212, 4163, -123247, -189570, -209801, -158392, -112893, -213369, -256272, -259547, -197492, -234462, -110206, 220408, 198365, 10611, -87967, -116124, 91929, 98723, -72125, -139186, -79959, -90344, -20355, -101784, -233596, -159616, -158858, -77460, -35809, -14436, -24620, 80389, 198620, 242018, 196916, 92573, 4403, 32036]
16520C2036j19281j5271R7821j41208j37363J12346R4537K3701j29365K151N7497
16509a22399J45223j11608N1500R3123k7927Q0509k2523j88990r2918K41914J64765
16498B10669k7300o2771j29821m3773j31881J17829R8512L822m4711O0245m0819
16487A0001q6602L8105m595J38840l5050O9071l4117j51925j47592L7716L204
16476a62944N5620J01673J5373l5992M0003n4027m6334J488j35860q258J54212
16465g5046j63439q0781L7017o5l7018o450q7572P6545J58213R504J5373O8192
16453h5527n1624m0161k3893j9772O2419M1197j25301j06016K9506o282M0618
16442b84836Q7905k5811P046p7549N433K19586J10912J6101L8720J1049j65890
$$ y = [32036, -87245, -102516, -4695, -145903, -283266, -170920, -76383, -52682, -182047, -179896, -122399, 22824, -88784, -37284, 55839, 27912, 108421, 85898, -103092, -196010, 45904, 210669, 183369, 120598, -9223, -52996, -184877, -67048, 31464, 35286, -9425, 50820, 10001, -76601, -38496, -43091, 95749, 60699, 129770, 95653, -56272, -203864, -166148, -162944, -107324, -5651, 9722, -26270, 13733, -40294, -86628, -85140, -221000, -229258, -75046, -238485, -319266, -282249, -282314, -319332, -325782, -413354, -336809, -178596, -169092, -153719, -85527, -137151, -177312, -201205, -220977, -158558, -117361, -242662, -348678, -319172, -325454, -284836, -196931, -222742, -215696, -293245, -287812, -68226, 42686, 58787, 97507, 108556, -57334]
16431e7334j30338k1083J23803q719j4039q4180J1892O9091k12844k8876J81281
16420a71346J61568l9315o3809P5585l8715j02622K4619p2910j08556K6188Q0410
16409b28903L7275m5167K6756J34344q163o890K4981J14264J62329r1315q1820
16398C7691k684L2398k3955q9860k2090j95487K04566J42041p2794o4108L0056
16387b4226j26381l3396L3989p0812O1242M8034M2528K6969o560j33516r1055
16376b73184k3052J5582j1989k1092N1209J66726J0279j08068P1225J63272K09624
16365B50532j3443q2945R6480L677q3449j08423N3699K6830j10706K4773L1162
16354H8187p9296J7516N8681o4479n8346O1142J50916q4149j46659j16128r1988
$$ y = [-57334, -187672, -208755, -84952, -93671, -107710, -191890, -179998, -110907, -323751, -352627, -171346, -9778, -49093, -112902, -37317, -76032, -178654, -154035, -226945, -335501, -309313, -228903, -191628, -236795, -210039, -75695, -83858, -90748, -65767, 48497, 210826, 119511, 37691, 35007, 67405, 43450, -46410, -68500, -263987, -59421, 82620, 9826, -54282, -24226, -150607, -184003, -150014, -220826, -159584, -111550, -69022, -42053, -48613, -182129, -273184, -296236, -280654, -292643, -313735, -262526, -95800, -85521, -193589, -122364, 40908, 250532, 237089, 154144, 250624, 254301, 170852, 62429, 116128, 142958, 32252, 57025, 88187, 8891, 26407, 85088, 20609, -37737, 23405, 174321, 90172, -56487, -172615, -264603]
16343b64603p0769j6473J53685J46579j758K8819j1659j03939L427K50454K38661
16332C52424j21552p4087J17739r0625n94m9855r9229r1126O0474L4239j41694
16321a03886M9544N7577o6098O992p6933Q2191j05186j23761L3967M3216M3047
16310a59330r4839k4484P5636J44266J16189L9207j27121n0896j07203L6366K21378
16299F9169J48004p8883r8737J0684j13161n2400L5517n4857j04928n508K2325
16288b22775m3031N6236J8173J20315r6654r510J29059L9877j37548M0734o8984
16277a74108m1201k6910k1403m0917j48445o9761J50107K00807K6067n8684J4924
16266a89524j4149L9289K5845l9305j30506K0227M4664L4375J08089J0420k5070
$$ y = [-264603, -335372, -351845, -198160, -51581, -53339, -24520, -36179, -140118, -136691, 113763, 352424, 230872, 156785, 274524, 183899, 183305, 133450, 34221, -56905, 3569, 37808, -103886, -54342, 3235, -62863, -55871, -132804, -50613, -155799, -279560, -245593, -202377, -159330, -254169, -278653, -203017, -58751, 57438, 96645, -30476, -81372, -188575, -152209, 69169, 217173, 138290, 39553, 50237, -62924, -115324, -79807, -134664, -239592, -245100, -222775, -265806, -209570, -191397, -71082, -167736, -177246, -48187, -8310, -145858, -105124, -174108, -215309, -242219, -263622, -304539, -452984, -522745, -372638, -171831, -145764, -204448, -189524, -203673, -164384, -138539, -177844, -308350, -288123, -243459, -209084, -100995, -90575, -115645]
16255a15645M4468m4649j01557k2024j45133l4512J77538n0842o380l7093L9611
16244b96218R3717R1168j9465k09943j40868J33455J76979J86151q9057m3417
16234a17498O0002L6235j2168q4397k9219k944Q0089l6276j26480J57274J20273
16223D4891j55243J8352M5081J0024n5555j79793m2660O4254P6671J28270N6719
16212A1011J44004P5050n0757n1448j96211j13373O2285j3189O0642j2833k0301
16201a05120L103R3107N3524q5582j46280P392J3850o3010L1604l227o2302o808
16189b69749j3363l8209J24402Q1759o8476M5068J60779J23911l3177l4694j53519
16178g5268K6166J2011N2949j02512n3272j05927Q7747r0925j47776N8409O1136
$$ y = [-115645, -71177, -115826, -217383, -239407, -384540, -419052, -241514, -292356, -298736, -335829, -296218, -202501, -111333, -130798, -340741, -481609, -348154, -171175, 14976, -74081, -117498, -57496, -21261, -33429, -117826, -147045, -149989, -69900, -106176, -232656, -75382, 44891, -110352, -92000, -46919, -36895, -92450, -272243, -314903, -250649, -173978, -45708, 11011, 155015, 230065, 179308, 127860, -68351, -181724, -119439, -132628, -71986, -84819, -105120, -102017, -8910, 44614, -40968, -187248, -179856, -166006, -229016, -197412, -200639, -262941, -269749, -283112, -321321, -196919, -115160, -183636, -138568, 22211, 146122, 112945, 78251, -75268, -49102, -37091, 15858, -86654, -139926, -245853, -158106, -249031, -396807, -338398, -277262]
16167b77262J32806R7652L6350o0435p9719l4406r426M8492N4243j4376j09010
16156b15091p6639k3621J43371N4132j00338M9478O411m1172j10060l3921P1467
16145b75983q0384o2643J5729K1975N7398J0663O112j7416M2294r121o2836J16745
16133b37467M4498o7440j43481L0817J56417m6958p1131j320N839J12919J38290
16122g9017J42327j28859k40888q5177J78811J7052K7097L3047P4149N95q4208
16111a45071j56598J18882l1837k9866j23714O8866J30268J7719j9697N082K4635
16100a41331k7945N4177L1480J37071Q2197j19086j10490j2859J09655J01218
16090A04087j5715k6396q7943j4062L4646L049J5968o5242p5274m6542L822k6704
$$ y = [-277262, -144456, -46804, -10454, -70889, -150608, -185014, -194440, -145948, -91705, -106081, -215091, -291730, -315351, -171980, -117848, -218186, -168708, -162297, -203469, -313529, -347450, -275983, -356367, -419010, -403281, -381306, -323908, -313245, -307133, -324549, -282255, -291376, -354212, -237467, -192969, -260409, -403890, -373073, -216656, -263614, -334745, -336065, -330226, -217307, -79017, 63310, -65549, -306437, -391614, -212803, -195751, -168654, -135607, -61458, -60863, -145071, -301669, -182787, -214624, -244490, -368204, -299338, -169070, -151351, -171048, -165966, -141331, -169276, -115099, -83619, 53452, 135649, 16563, -93927, -106786, 2869, 104087, 88372, 61976, -25967, -40029, -5383, -2334, 13634, -51608, -126882, -173424, -169602, -196306]
16078a96306m9655k9570O3564J06036Q5627J41247M3926n4713q6241k739q2396
16067f1220k0708J5273L0209k2345K3568J2555n7803p240q951J56543o7414j62516
16055a70049P8514Q2969o7337P356k9563l8151o4481M4677J18749q96o933o6144
16043a11289r0683K4207R2734N3651N9893l548N3361p8939p5412j27166j9184
16032b22375Q1999k980o0492q702j0201m3456j0743J26450L2494O6406k4625l08322
16020c84547k02806L3005J00576J56053N2759L0809j5116J6863L8243J0252p673
16009a71582m4237k7238K9866P3009p3322R2465N9588L5709L2227j97369J22695
15998f8189P4138o5812p2483n3377q2483M4253K580n1103j9812M0918L6533L227
$$ y = [-196306, -245961, -275531, -211967, -105931, -20304, 120943, 164869, 110156, 23915, 21176, -61220, -81928, -66655, -36446, -58791, -35223, -22668, -80471, -87711, -96662, 59881, -7533, -170049, -91535, -8566, -75903, -68547, -98110, -136261, -200742, -156065, -37316, -38212, -45145, -111289, -201972, -177765, -85031, -31380, 28513, 24965, 78326, -613, -76025, -203191, -222375, -140376, -143356, -203848, -212550, -222751, -266207, -276950, -150500, -118006, -51600, -76225, -384547, -587353, -554348, -453772, -297719, -244960, -214151, -229267, -212404, -174161, -163909, -171582, -215819, -243057, -213191, -140182, -213504, -121039, -61451, -25742, 6485, -190884, -68189, 5949, -59863, -132346, -185723, -268206, -223953, -221373, -272476, -292288, -251370, -214837, -211610]
15986b11610j04236J12539K65066J8536j40195m8000K0114m1080l9358L2246K07131
15975G1153j9809k2645J517q4033j4786o5908j450n7433R631j7189p337J4009
15963a94280j23567J81064O5271n0130k3577l5850L5786J38732J57271K7871j32877
15952D5714o5936L8728N9215j0452p3292m3129O098j3352r9203Q2970k44581j32628
15940d49848n5264K00757L6347p6555j3161p619J52740K26378N9522p6281J13607
15929A10623J05730j15481l3425L1411q8891J3596n1854j74662o3038O4708O3818
15918a37465P9065j9235K2217j7132M6205P4535N2742l1980L7304m7406j47741
15907h8891j11364N7153Q1753R3855k0490j86704j08179M1916K0033p7741l681
$$ y = [-211610, -315846, -203307, 61759, 80295, -59900, -107900, -87786, -128866, -168224, -135978, 71153, 51344, 28699, 30216, -53817, -68603, -134511, -135961, -193394, -183763, -200952, -208289, -194280, -317847, -136783, -71512, -121642, -145219, -181069, -145283, -6551, 150720, 178591, 45714, -20222, 18506, 77721, 67269, -6023, -49152, -43054, -56406, -155609, -72639, -317220, -449848, -505112, -304355, -268008, -344563, -357724, -365343, -212603, 13775, 73297, -2984, 110623, 216353, 100872, 67447, 98858, 9967, 23563, -28291, -202953, -265991, -201283, -137465, -58400, -77635, -55418, -72550, -26345, 48190, 100932, 68952, 106256, 58850, -88891, -200255, -143102, -61349, 32506, 12016, -174688, -282867, -240951, -220918, -298659, -302340]
15896c02340L7468Q175m3784j15974J70734K21625J6606j70156j678J48053N172
15885b6099k13790j42183L1197n8805j35077J96434J37218N0886M5822J1771P5246
15874b7380p5262j46718j29097l5109J81187J55331J5221J07461L7648j39168
15864e5886m7361O9615J10529K230L3628p5735L2916l6602p2691J4243P6871O6807
15852A18564P2274r3803k4301J5058o2233p0606Q2309p182p0353m253p3610k01164
15840c19300l6901J2974q829j345Q0821J67214K68081o5325k49446r6141l1654
15829b79851L5897o7517M0449P4670R4583J20148J04124l1060p6001J3478j4734
15818A4186m5555l7920p516k9999j05831L7959L8272L1871R556P9362Q5136r2268
$$ y = [-302340, -264872, -256697, -300481, -416455, -245721, -24096, -7490, -177646, -179324, -31271, -26099, -239889, -382072, -350875, -409680, -544757, -348323, -211105, -160219, -114397, -102626, -27380, -102642, -249360, -378457, -413566, -232379, -77048, -61827, 45634, 83282, -55886, -103247, -33632, 76897, 79127, 112755, 37020, 69936, 33334, -39357, -25114, 51757, 118564, 190838, 97035, 72734, 87792, 25559, -45047, 37262, 30080, -40273, -44526, -118136, -319300, -356201, -343227, -352056, -353401, -272580, -105366, 162715, 97390, -152056, -248197, -279851, -243954, -311471, -271022, -196352, -101769, 18379, 122503, 91443, 15442, 28920, 14186, -31369, -69289, -76805, -106804, -212635, -174676, -136404, -104533, -94977, -15615, 69521, -22747]
15806b2747r6173P1102K28878j54381j51663r9777Q4153J35471j81733J9261J14874
15795e2735J05046j43126J0921J34881j07069j84930O4845k9057n9725J21602
15785a39347J49205N0376j37634j23847n0912O935P6182j7349j1588r6839r3772
15774c88590K7938J90982L8223l8064K4705p8324o6908j37403P3837K33523q2451
15763b02532j04764l6378J99504P3160O6837k4613o3267k21925j47624J82999
15753b78603J48867m9920O3199R2152J25014l8703j80705l8265m7993P5879P9774
15742d9304j0942j2652M6524q1506l6805r3661P3016J00910j12058P3254J31040
15731B7816J24467o145o237L4525j12058j49227j3644J2664P107j60325o0097
$$ y = [-22747, -118920, -47818, 181060, 26679, -124984, -224761, -140608, -5137, -186870, -167609, -52735, 52311, -90815, -79894, 54987, -52082, -237012, -172167, -201224, -260949, -139347, 9858, 60234, -77400, -201247, -252159, -245224, -169042, -186391, -197979, -294818, -388590, -360652, -169670, -131447, -169511, -144806, -223130, -290038, -427441, -353604, -120081, -202532, -307296, -343674, -144170, -71010, -4173, -28786, -92053, -313978, -461602, -278603, -129736, -179656, -116457, -24305, 100709, 62006, -118699, -156964, -204957, -129078, -49304, -60246, -72898, -26374, -107880, -144685, -238346, -165330, -64420, -176478, -103224, 27816, 152283, 146138, 139901, 174426, 62368, -86859, -100503, -87839, -80732, -241057, -301154]
15720c01154K26637J63330p2331n3991J09652n0967j37949j92762r3587J87852
15710b15270Q4396k4247p3426N703J63529J58834J24251k40812j86966J12436
15700i1572N9835J30859o198j31032j5774R286j61880p8896O7627r147k7726O720
15688b47898J05151M28l1675K6687q0891O3389q1598j5892P1400P7474K2431q5941
15676a76935L3753N9791L0626k8111j37395p334L3773J35729L4992j07251r0938
15665b19300N9171J68312k642M0107J09640p4037j89124M0594n3151j64059j09599
15654c94088J77082Q4676o3315q2070K7930R881p9526J41256J08455j23915l281
15643a96915k932m9102j03555m87N6743J2709J56782J72260p404j66537N56q865
$$ y = [-301154, -74517, 88813, 16482, -37509, 72143, 21176, -116773, -309535, -403122, -215270, -130874, -155121, -228547, -222844, -59315, 99519, 223770, -17042, -204008, -91572, -31737, 99122, 92924, -38108, -53882, -44596, -206476, -285372, -217745, -226892, -254618, -247898, -142747, -142319, -173994, -147307, -228198, -164809, -246407, -262299, -190899, -113425, -90994, -176935, -143182, -83391, -52765, -80876, -218271, -225605, -191832, -56103, -21111, -128362, -219300, -160129, 8183, 5541, 45648, 155288, 81251, -107873, -67279, -120430, -284489, -394088, -217006, -132330, -195645, -277715, -249785, -239904, -319430, -178174, -69719, -193634, -196915, -199847, -248949, -352504, -352991, -296248, -283539, -126757, 45503, 38099, -128438, -127882, -136747]
15631a36747M0677L7778j4778k2486L9604l6050q597n1182o5840j36606M2330
15620c11897J9798L2286L3096P3567R6013N0422j8783K2865Q3416j43326n6453
15609a18996p8257j4622J3708j0965o946n5562P5432O420J256j13602j07335J78252
15597b31217J3418k3560M6724J52422r6693j15551k2219Q3608J3913o9085J6326
15586b31914n2415l4201p8657r5197J02374J50760K08774M2460j43648l9884J09887
15575f1661P318j41306m7763P9169p1245j5050P8912O5074l600j12445O8176j6873
15563a71294o6656P5927J84274j6344j63055j55224o9586J08143J26926m0425
15553a87314J7800k901l6602L9796L1245J10705J30797l1283j59602q430M2549
$$ y = [-136747, -96070, -58292, -73070, -95556, -55952, -92002, -100599, -151781, -217621, -354227, -311897, -292099, -259813, -226717, -153150, -57137, -6715, -25498, -2633, 80783, -62543, -118996, -197253, -211875, -198167, -209132, -216078, -271640, -196208, -189788, -188532, -302134, -409469, -231217, -217799, -241359, -194635, -42213, -138906, -254457, -276676, -193068, -179155, -248240, -231914, -284329, -318530, -397187, -492384, -390010, -239250, -30476, 11984, -131664, -171548, -61661, -54343, -195649, -243412, -164243, -235488, -250538, -171626, -106552, -110152, -222597, -154421, -171294, -237950, -162023, 22251, 5907, -157148, -312372, -381958, -273815, -146889, -187314, -169514, -172415, -209017, -169221, -137976, -27271, 103526, 72243, -87359, -95789, -53240]
15542e3240J21922O9747j02712P3529Q3950k9582j41675J795j30530j8362j088
15531a26246p3164j32969l8447J1406J97349J99409q1279q4534M4255k28914j52281
15520d65415J56907J79684o870k3357P1665M444k14341N0788R5917J02548o9462
15509a17492J07919N1412l255j03142j29959M2500j9308p2886m0568R6149J74402
15498a4228j01960k5726N4238J29867k6421j33319p2152m7067j0486J92838J73290
15487A18874n5166j51017k393P9924N815m2341j2922j5134n9574j11952K2526
15476b23360Q841J67926L8823M9132J8430j3652P5883o7684q3921j0540n4873
15465i4995N7722N7693k3868p1153L1422n0432J1874N6712p5426n1094l8399J59579
$$ y = [-53240, 68682, 138429, 35717, 109246, 193196, 163614, 21939, 23734, -106796, -125158, -126246, -199410, -332379, -370826, -359420, -162071, 37338, -43941, -128475, -84220, -313134, -465415, -308508, -128824, -135694, -159051, -87386, -82942, -297283, -246495, -150578, -48030, -117492, -9573, 41839, 38584, -64558, -194517, -152017, -171325, -244211, -284779, -188630, -14228, -116188, -141914, -87676, 42191, 15770, -117549, -189701, -236768, -247254, -54416, 118874, 63708, -87309, -89702, -9778, -3963, -46304, -59226, -74360, -133934, -245886, -223360, -214519, -46593, -7770, 41362, 59792, 46140, 122023, 54339, -29582, -40122, -94995, -37273, 20420, -3448, -74601, -43179, -93611, -81737, -25025, -100451, -151545, -189944, -30365]
15453c0365L80o1349l1545O5688r6331j37257J70398L7282J33098K0523P0339
15442A40861j27497j59116j26669O4456K457j6528L2621p3787p5307R9661J31278
15431a07570L15j5122j89672J5113Q9631O5306J07506O8768m7449J12333N4408
15420A53567m1715k3488j01140N5112k6535j83775q8859K8847M6082q326K1793
15409a68437K3214m818j18549k4203R4489J43541M8845L3883m2903j12175j67233
15398b94346Q3698L00461J29442j29397j8615R3713j6526r6211p5774n5831r5346
15387a74732N730J022J35219J15762j7555L2211o7831n2818j3129J07071K4570
15376I5520m5791Q7357j96476k5315J50729Q6989K5271J09689L1904P0341m7623
$$ y = [-30365, -29985, -91334, -122879, -57191, -153522, -290779, -120381, -83099, 49999, 70522, 140861, 13364, -145752, -272421, -207965, -205508, -222036, -189415, -263202, -338509, -238848, -107570, -107255, -122377, -312049, -296936, -207305, -141999, -34493, 34275, -13174, 99159, 153567, 111852, 88364, -12776, 42336, 15801, -167974, -256833, -227986, -181904, -190230, -168437, -145223, -150041, -268590, -292793, -198304, -54763, -5918, 27965, -14938, -127113, -294346, -210648, 89813, 219255, 89858, 71243, 164956, 148430, 52219, -23555, -79386, -174732, -169002, -167980, -32761, 83001, 65446, 97657, 29826, -22992, -36121, 70950, 95520, 49729, 137086, -59390, -84705, 66024, 153013, 178284, 287973, 319877, 390218, 342595]
15365C42595N1586J6739o8113k2880M8581j69047j74260p5188R2382N514q6805
15354c8896o5606j1027J06096N9976j5923j213J63437J75369q3247j41912O3399
15343B10453K60446K22161J3208J2065n4143k0859J07184m8832n0726j40597k53775
15332B56585j98474R0300M196k5757j8150o7836k5513J72387K6973j24379m2602
15321D7730M0923m3281Q5052M8890m8854l1874K71615K21401O08q6912J7190L8099
15309E60587K6891j79122k22596m3381M9835k3522j97142j5250J03438L4197P3724
15298A67659q5223q2827J55401J02027K7818k151j3357O0660J1072O8046l082
15287D06043N0737L4810l0909k67232J5481N6980j08505j14168q8140o1584R8620
$$ y = [342595, 394181, 410920, 342807, 319927, 368508, 199461, 25201, -49987, 42395, 47909, -38896, -104502, -115529, -9433, 50543, 34620, 33407, 196844, 372213, 288966, 147054, 210453, 470899, 693060, 706268, 718333, 664190, 643331, 750515, 701683, 650957, 510360, 256585, 58111, 148411, 152607, 126850, 108700, 40864, 15351, 187738, 214711, 90332, 47730, 88653, 45372, 130424, 179314, 130460, 98586, 370201, 591602, 592210, 505298, 522488, 560587, 587478, 408356, 185760, 142379, 192214, 168692, -28450, -43700, 59738, 93935, 167659, 82436, -391, 155010, 257037, 284855, 282704, 269347, 330007, 341079, 409125, 406043, 456780, 491590, 460681, 193449, 208930, 265910, 157405, 43237, -44903, -106487, -7867]
15276g867K27478M926j5088k14545r6080J8150k2365O0525Q7882N7776o0982O6181
15264A05991n9970p7482J1364q5041o2153q5455M9334J56957J46648J03077m2505
15253A60765j09654r8221Q0434m1848q9538J36302Q7038m6375j20367p6908l0800
15242a49172j53139j41368P2856J25774P1001P2751J05229O4734q7335j19720
15232a38389j4308k888O764M4970L9369k3119p4213N0133K02044O1670j23910
15221B8123j5556k9407q1475L0116k1491p4930j21863j17500J75794J19385R9873
15210h931J07992j30015j94659J08984L6779R947q8280M8479q4235P486J97208
15199A0755Q9163O421P5840j23593j15511q2008J08355J62995o9820j42765q8576
$$ y = [-7867, 219611, 224537, 209449, -5096, -101176, -83026, -105391, -44866, 43016, 100792, 39810, 105991, 46021, -31461, -20097, -105138, -167291, -252746, -203412, -46455, 100193, 203270, 160765, 51111, -47110, 33324, -8524, -98062, 38240, 125278, 78903, -41464, -118372, -149172, -302311, -443679, -370823, -245049, -174048, -101297, 3932, 68666, -18669, -138389, -152697, -155585, -148821, -103851, -64482, -87601, -161814, -111681, 90363, 152033, 28123, 12567, -16840, -98315, -68199, -89690, -164620, -286483, -403983, -228189, -108804, -8931, 99061, -30954, -225613, -116629, -79850, -69903, -158183, -109704, -193939, -186453, 10755, 99918, 106339, 182179, 58586, -56925, -138933, -30578, 132417, 62597, -80168, -168744]
15188a68744J4743j03314O3454J26210m4256l5701J03270q004l4237J51176R4255
15177A58852P0640O9751j15893p3016o346P8748J15889M3468j07563j43602j80170
15166h9242l7921P3444j1581j34966k6880R1242P6630K07718O9068l8153l8975
15155A40384N0637M3567p5628j96806k2869Q9784M8118M7143P9634Q1312p173
15144B78103j00746k0115Q0417j8423j76500j63395p1812O3636M5936J31873J01200
15133A50174n5981o460j74187l3676J98253R4451N9074N039n2313j6593r5642
15122G2139O684p4990j27034N7362J64021J81158L4190l267l6948j50037k21131
15111i7853O3043J84616M4619j61652p0969J63556Q5681k9466l4870n3627j06783
$$ y = [-168744, -154001, -257315, -193861, -67651, -111907, -147608, -44338, -52342, -86579, 64597, 158852, 229492, 299243, 183350, 110334, 103988, 182736, 298625, 342093, 234530, 90928, -89242, -127163, -53719, -65300, -200266, -227146, -135904, -59274, 148444, 217512, 179359, 140384, 191021, 234588, 158960, -37846, -60715, 29069, 77187, 124330, 203964, 285276, 278103, 177357, 157242, 237659, 219236, 42736, -120659, -192471, -128835, -82899, 48974, 150174, 94193, 87733, -86454, -120130, 78123, 172574, 231648, 236687, 184374, 167781, 72139, 78823, 3833, -123201, -65839, 98182, 279340, 313530, 310263, 273315, 123278, -97853, -34810, 149806, 194425, 32773, -38196, 125360, 211041, 181575, 146705, 93078, -13705]
15100a3705R0450M172m4370J0509q8203M9861n3661N0583M9692Q6751P3573j71385
15088D4267K3172K14581L2866k6454k7091L6687O5656j43914M4790J6604j52032
15077A29132j72059j0160Q2337J6839J00347m5116n3777m6763Q512j38578O8338
15066f0948K56148P6151m3270j24195j43327o1011l6087J39128N858J02364J18589
15055B29400l1527J483p850N6035O2630n9210j38122j06493Q9413J23533j24130
15044I5162J0419k4578P6404J43740M9916R78m998l9611O145j39470P1688J52478
15032C98273J02038j01220n5661J77615k5675n1706n7925N5977Q1342j36531r6848
15021B89679J46j09389J0488J37053K15552R7919k06284j40032j926K5729k972
$$ y = [-13705, 76745, 80917, 36547, 47056, -41147, 8714, -44947, 5636, 55328, 142079, 215652, 44267, 67439, 282020, 314886, 288432, 261341, 298028, 363684, 219770, 264560, 281164, 129132, -42927, -53087, 29250, 46089, 146436, 101320, 47543, 780, 9292, -129286, -60948, 195200, 271351, 228081, 103886, -39441, -100452, -136539, 2589, 8447, 110811, 229400, 197873, 199356, 191506, 247541, 310171, 250961, 112839, 6346, 95759, 219292, 95162, 105581, 81003, 157407, 301147, 351063, 352041, 347043, 307432, 313577, 174107, 245795, 398273, 500311, 399091, 343430, 521045, 495370, 443664, 385739, 441716, 523058, 386527, 289679, 289825, 180436, 190924, 327977, 543529, 641448, 435164, 295132, 293206, 318935, 315963]
15010C15963l5442K5221M6113J6070J5858J12425p3077k8266O792R1388J5469
14999E08514K3063L0674N4325k0981j25962j34207q4761o0577J31935J25016K6084
14988D73123o2766J9566J06030P1514J4584Q0986J04513J9688P5623Q9778J71738
14977A164377J01695J73022O7756k8299J31127R6811K75708K00653L18325L97655
14967B898830N88855O44178Q38688J263677J759485K348263L078996L889074M784172
14958B2094218N355102M586422L242314K052918j06987k530144l760288m310999
14950B6622556m467869m114484l343034k338891j533317r29022n29134j21060
14942I245745K67192P30086J071961J503940K297232L207209M515399O099737
$$ y = [315963, 280521, 305742, 351855, 367925, 383783, 496208, 423131, 394865, 401657, 493045, 508514, 531577, 562251, 616576, 595595, 469633, 335426, 250665, 190088, 322023, 447039, 473123, 410357, 429923, 535953, 607467, 622051, 703037, 807550, 827238, 902861, 992639, 1164377, 1266072, 1439094, 1506850, 1478551, 1609678, 1706489, 1982197, 2182850, 2501175, 2898830, 3487685, 4131863, 4970551, 6234228, 7993713, 10341976, 13420972, 17310046, 22094218, 27449320, 32035742, 35278056, 37330974, 37223987, 34693843, 30933555, 26622556, 22154687, 18040203, 14697169, 12358278, 10824961, 9895939, 9366805, 9245745, 9512937, 10243023, 11314984, 12818924, 15116156, 18323365, 22838764, 28938501]
14934B8938501P996173R715841J0344304Q915565O500553L896044n70388n867224
14926F9869369q496444r171675r547297q718437o701612m785698l355913k077787
14918A7014506j476219q59750l39185K05734O97871J110524J966565K935501M286792
14909B5542339O154389Q237723J0804213J2934464J3923024J3761433J1841145
14902A03198730P120528K090567k963036q852557j3153924j3760172j3203419
14895F0476717j2105775r632946o706056m580527k984190j934528j011610k15240
14887B1305845P19373J640639K545260L843331N841559Q306564J1409594J5177565
14879G0789730J8959498K1073505J9534418J4510621R702628K262235r427729
$$ y = [28938501, 36934674, 46650515, 56994819, 65910384, 72410937, 76306981, 75736593, 69869369, 61372925, 52201250, 42653953, 33935516, 27233904, 22448206, 19092293, 17014506, 15538287, 14678537, 14339352, 14545086, 15242957, 16353481, 18320046, 21255547, 25542339, 31696728, 39934451, 50738664, 63673128, 77596152, 91357585, 103198730, 110319258, 112409825, 109446789, 100594232, 87440308, 73680136, 60476717, 48370942, 38737996, 32031940, 27451413, 24467223, 22532695, 21521085, 21305845, 22025218, 23665857, 26211117, 30054448, 35896007, 44202571, 55612165, 70789730, 89749228, 110822733, 130357151, 144867772, 154570400, 156832635, 147404906]
14872A47404906j7122432j8756816j9876023j9829232j6063628j1309949p689903
14865C6756923n439837l689254k622210j752762q37036O3520R56853J955297L035172
14856B8426666M551624O816301R214915J1779252J3710086J3920636J2438179
14849A00857659R867539M971811k031452p241885j0903812j4002326j4722712
14842F6794822j3029551j1021840q671250o327340m550531l139613k131560j485233
14834A6437904q10546j59211K64201O33218J301442K464203L706587N076735O772843
14825C5687376Q899824J0652815J0534289Q296835N612863K542285k873715q023089
14817G1329483r881735j0062636j0472588r286568o756332m736067l274401k343232
$$ y = [147404906, 130282474, 111525658, 91649635, 71820403, 55756775, 44446826, 36756923, 31317086, 27627832, 25005622, 23252860, 22415824, 22479344, 23436197, 25391494, 28426666, 32978290, 39794591, 49009506, 60788758, 74498844, 88419480, 100857659, 110725198, 115697009, 113665557, 106423672, 95519860, 81517534, 66794822, 53765271, 42743431, 34072181, 27744841, 23194310, 20054697, 17923137, 16437904, 15627358, 15468147, 15732348, 16365566, 17667008, 20131211, 23837798, 28914533, 35687376, 44587200, 55240015, 65774304, 74071139, 79684002, 82226287, 79352572, 71329483, 61447748, 51385112, 40912524, 31625956, 24869624, 20133557, 16859156, 14515924]
14809A4515924j547431j030592o99504k48341J57790L88341R24293J646775K296398
14800A6403653L306243M225069M881685M948232L826200K302925P19931j382626
14792C9231312l797645m746121n104123n232143m479160l433522k427093j890686
14784H120819j481480j085754p32307o93488n02974l38195j06519k10757k50402
14775B718943k20225k20584k13153j40616o2071Q7095n8841j84339J1166J8936
14765A736311l818j13130Q2336Q8043j16782l61027k86753j83107j05922J23462
14755H59613J37607J08019j21510j29909K8166O9043J55517j51946j15451q8514
14745G50635n5454j40047N2067J29076J03144P9770k09L9812P0455l5992p2108
$$ y = [14515924, 12968493, 11937901, 11238397, 10990056, 11147846, 11536187, 12460480, 14107255, 16403653, 19709896, 23934965, 28816650, 33764882, 37591082, 39894007, 40613938, 39231312, 35433667, 30687546, 25583423, 20351280, 15872120, 12438598, 10011505, 8120819, 6639339, 5553585, 4821278, 4127790, 3624816, 3286621, 3180102, 2969345, 2718943, 2498718, 2278134, 2064981, 1924365, 1862294, 1949389, 1890548, 1706209, 1717375, 1736311, 1732493, 1619363, 1701699, 1789742, 1672960, 1311933, 1025180, 842073, 736151, 859613, 997220, 1105239, 983729, 853820, 881986, 951029, 1106546, 954600, 839149, 750635, 695181, 555134, 607201, 736277, 839421, 919191, 918982, 958794, 1029249, 993257, 921149]
14734I21149k1872r7031j48979k54981o3019J58376L3380o1105q8386k0491o8988
14723B88053J35599K82384p4990j18503p6040L728l5541L0101J07850J89788J06756
14712H39185q0536j41931l3178j52674J03753N8832p1616j55985O9191J8954j28706
14701C25289N5949j2196j62242p4058Q7843j7375N5792l8433n4350N9916J93785
14690D19920o0732j86146p9008L4093l8288M469J08218K5757R7884n6134k191
14679B67842J12164Q8084q3523n2744n8730K8292l5526K6835o4971n1506j36795
14668C9422j5267K42077j2832L3557j01641j78921o1956j39515r7200J26540R3638
14657g2098n6669o5079K05735J97352J2438p108p2882r7455j33585k4767L7289
$$ y = [921149, 899277, 802246, 653267, 398286, 335267, 493643, 527023, 465918, 377532, 357041, 288053, 423652, 706036, 631046, 512543, 436503, 440231, 404690, 434791, 542641, 732429, 839185, 758649, 616718, 583540, 430866, 534619, 593451, 521835, 365850, 435041, 453995, 325289, 381238, 369042, 206800, 132742, 220585, 203210, 259002, 220569, 166219, 226135, 419920, 359188, 173042, 94034, 128127, 89839, 94308, 202526, 228283, 326167, 270033, 267842, 380006, 468090, 384567, 331823, 273093, 301385, 265859, 292694, 227723, 176217, 39422, 24155, 266232, 253400, 286957, 185316, 6395, -55561, -195076, -292276, -165736, -72098, -128767, -193846, 11889, 209241, 221679, 214571, 141689, 44234, -89351, -114118, -76829]
14646g6829M5918j5439J22841J22400l4854l721j4337M3385O4872k4967Q441K866
14634B40576j40435p0299J43632r4547p8715l3710J0845R0044L3062p4660p0222
14623d4429O6609R3552P537r0991J22574P9222M3417j22390q5475j5852j1002
14612D2772m9650n7371J12991q7394M2758O6547m8099R9770j7662j0829j70374
14601g6541j28149J2549l8911p720L9798R8852J14744J14722J00352q0896O9454
14590B18254O0059q6376K1489P3300J70229m0307k78252j25943J6228O3228J02346
14579A94255n555j31379O6451L0098j4119j52488j944m4451K128J24267K15380
14568B82643l1370n0922J58321K5738q7525Q323P6963J6329r1273R072j62442
$$ y = [-76829, -30911, -46350, 76491, 198891, 164037, 160316, 145979, 189364, 254236, 229269, 237710, 240576, 100141, 29842, 173474, 78927, 212, -33498, -22653, 67391, 100453, 25793, -44429, 22180, 115732, 123269, 32278, 154852, 234074, 277491, 155101, 69626, 53774, 42772, -6878, -64249, 48742, -38652, 4106, 70653, 22554, 122324, 104662, 93833, -76541, -204690, -192141, -231052, -238772, -198974, -100122, 14622, 129344, 229696, 148800, 218254, 278313, 191937, 213426, 286726, 456955, 416648, 138396, 12453, 28681, 91909, 194255, 188700, 57321, 123772, 153870, 139751, -12737, -14681, -59132, -57004, 67263, 282643, 251273, 200351, 358672, 384410, 296885, 305208, 382171, 398500, 307227, 316299, 153857]
14557A53857j98890K5327N6533j5027K5000k06883N3633R2659P3595J22805l3605
14546A49004p49j9501J4098J5851n1957L7670Q4348K4672j00208K7060j25633
14535E4655m9450O0461n7145j1478J43030q685M5531N5269p7703l6052n9827J5807
14523G4413n7504j75640K8318J10213l0010J4614j14325n4703n202K5383K5074
14512a59369K0196R448j5938N7603J57731J7773o7966k0058q6748Q7059j8568
14501a8837k1226j1895j26432J53653K15506p2832L4305j8816k36011N5296J96351
14490A49062J46920K1459L287k9550r8316n1258O2041M0495j60524Q768J16850
14479B09234J30366J50308j39764K2441p3671j3748o0693Q1375R6238J30307J32715
$$ y = [153857, -45033, -19706, 36827, 21800, 46800, -160083, -106450, -13791, 59804, 182609, 149004, 148255, 128754, 142852, 158703, 106746, 144416, 228764, 253436, 153228, 180288, 54655, 5205, 65666, 8521, -2957, 140073, 131388, 176919, 232188, 154485, 118433, 58606, 74413, 16909, -158731, -130413, -20200, -50210, -35596, -149921, -204624, -209826, -184443, -159369, -139173, -129725, -145663, -88060, 69671, 87444, 19478, -580, -87328, -269, -18837, -40063, -51958, -178390, -24737, 190769, 117937, 152242, 133426, -102585, -47289, 149062, 295982, 317441, 320728, 291178, 192862, 141604, 203645, 244140, 83616, 92384, 209234, 339600, 489908, 350144, 372585, 298914, 285166, 224473, 305848, 402086, 532393, 665108]
14468F65108j29577j36045P0344Q1206N0750n4383M2286p4311L5583N4762M5123
14457F50846m1696k6898j891k11748P1778R5666j62673j48178o3964N2232M5437
14446B58911L284M6391J04629R2022j1409L2300o3869k54690J95893R079J3888
14435D26429J91412J35597P2762J79181R1391O1032l6067j59086o8504j69717
14425G24430k4043J13338n9312k25204L2540r5304j58516J15734L9291j05749
14415C57205p6469J27061j21285L9785K07587R7803K7792N8705J23776J2866J3714
14404H68540R6691J30528K53671J869j77510j68802j39738K1618j8181p2527p590
14393G88569n5965j29623k3013l4663q3569r2973J89451Q0362j33935r169r1998
$$ y = [665108, 535531, 399486, 469830, 551036, 601786, 547403, 589689, 515378, 550961, 605723, 650846, 609150, 582252, 580361, 368613, 440391, 536057, 373384, 225206, 161242, 213474, 258911, 262195, 308586, 413215, 505237, 493828, 526128, 462259, 207569, 403462, 412541, 426429, 617841, 753438, 826200, 1005381, 1096772, 1157804, 1121737, 962651, 894147, 724430, 700387, 813725, 754413, 529209, 561749, 466445, 307929, 423663, 462954, 357205, 280736, 407797, 286512, 326297, 533884, 631687, 659479, 718184, 841960, 854826, 868540, 965231, 1095759, 1349430, 1351299, 1173789, 1004987, 865249, 886867, 868686, 796159, 788569, 732604, 602981, 579968, 545305, 461736, 368763, 558214, 638576, 504641, 495472, 403474]
14382D03474J23442L11812K67357J88030N6528m1002R5301K1305K08203k0149
14372A614301k6366n0307J01153J72999J05467M6549j7654J4084Q698j45257K2511
14361A846178K29311L2845j05905r2366l7790J13002j25695j15976P4876J62809
14351A981289Q2707J98699l8529l3946m7859O9351o7006j21660j25816q0970l7292
14340A778968O6189J44657K9098r1899k1023m4003o1937J31112R0290l03695k71726
14329A446031k27919j08442P6542R5966r9839j95540j32201r1112R9565O4015
14319I27066o2788j92509j55068l1625l6238J21713j58055p9917K3746J02689
14309D59014N4910j40593P0969J1886q9354n8662M5360J36941j62416j09169j7823
$$ y = [403474, 526916, 838728, 1106085, 1294115, 1350643, 1309641, 1404942, 1426247, 1634450, 1614301, 1587935, 1537628, 1638781, 1811780, 1917247, 1963796, 1946142, 1960226, 1968924, 1823667, 1846178, 2075489, 2108334, 2002429, 1910063, 1872273, 1985275, 1859580, 1743604, 1818480, 1981289, 2063996, 2262695, 2224166, 2190220, 2142361, 2211712, 2144706, 2023046, 1897230, 1816260, 1778968, 1845157, 1989814, 2018912, 1927013, 1905990, 1861987, 1800050, 1931162, 2021452, 1717757, 1446031, 1218112, 1109670, 1186212, 1282178, 1182339, 986799, 854598, 763486, 863051, 927066, 864278, 671769, 516701, 485076, 448838, 570551, 412496, 332579, 356325, 459014, 513924, 373331, 444300, 456186, 366832, 308170, 353530, 490471, 328055, 218886, 201063]
14298B01063k6045J35876J09223n3772j01692j74348J2325P7507r5492k9391J50731
14287B05985J54519o1230p3906o4892O1004q7126j16015K02722J12340q3697k1015
14276B28689P5184L1754J17442q8663k13327j22277L2207J00282K9205L842j24504
14265F9834J429j08433r4602p3697J10301J05015M6862p788P5167M4555j42468
14254B6175O0348j45743j05993r5278N1433K76958J3786p9494j32240n4784k0419
14243b05251l4138N9051R5449R0123J10111K7192j18473J9418o4351o2973q271
14232i2113Q5941R7341O0845J4029q8504R230l9816J22198n929K7595P8566m732
14220B64651K0388M8541j4085M9594o4649q036l6195j03679J02566L5383j17628
$$ y = [201063, 175018, 310894, 420117, 366345, 264653, 90305, 102630, 180137, 84645, 55254, 205985, 360504, 299274, 225368, 160476, 221480, 134354, 18339, 221061, 333401, 249704, 228689, 303873, 335627, 453069, 364406, 151079, 28802, 61009, 161291, 190496, 194338, 69834, 71263, -37170, -131772, -205469, -95168, 9847, 56709, 48921, 124088, 168643, 26175, 86523, -59220, -165213, -260491, -209058, 67900, 81686, 2192, -130048, -184832, -205251, -239389, -180338, -84889, 5234, 115345, 142537, 24064, 43482, -20869, -83842, -92113, -6172, 91169, 152014, 166043, 77539, 86769, 46953, 169151, 163222, 190817, 269383, 264651, 285039, 333580, 319495, 369089, 304440, 296404, 260209, 156530, 259096, 294479, 176851]
14209A76851j62451k6823k557L1976L1651J86403K2596N229R0547N3791O7185
14198D74398p8357r6361r6229Q7386j42966r3248J30703J17033J41216J55316
14188E98891R7455j03138k14924k61502q4373J13472J02678N994J90523J44371
14178E89447l7355n5717K3969r3069q3359j5407M1864K1567m6282K0532m9270
14167C16920J01507r3793j14489N4633Q8287K5970K5140j18346r9542R0360R9591
14156C76238m6679R1475R0098j09727j50521r6399N8626r130n3342J53512J34058
14145D38209R2054J19055l7595j22804j7824j56568k7347m0K6570P1111j58129
14134B26692r7549k15640k8834o1185J8494k3529N386N8843K8381P9026j7233
$$ y = [176851, 14400, -12423, -14980, 16996, 48647, 235050, 257646, 262875, 353422, 407213, 474398, 396041, 299680, 203451, 290837, 147871, 54623, 185326, 302359, 443575, 598891, 696346, 593208, 378284, 116782, 32409, 145881, 248559, 254553, 445076, 589447, 552092, 496375, 520344, 427275, 343916, 328509, 370373, 391940, 345658, 366190, 316920, 418427, 324634, 210145, 264778, 353065, 379035, 404175, 285829, 186287, 276647, 376238, 329559, 421034, 511132, 401405, 250884, 154485, 213111, 203981, 150639, 304151, 438209, 530263, 649318, 611723, 488919, 471095, 314527, 287180, 287140, 313710, 384821, 226692, 129143, -86497, -115331, -176516, -158022, -181551, -176165, -117322, -88941, -9915, -27148]
14123b7148Q2702O7285K05882K6536j29597p6386k07j02270k7589O4762K19085
14112C03055n0713k57909j00730K9083R171J0520n3886l5422J2236J46323J39360
14101A51088O2523j03605r2737M0806J67783J33198m7572j12184k2317n8089j2945
14090A05949j17930m946J08155Q9423J2462J30045P3631j18999q0804L9535L4208
14079B70729m4058M0577K6232j898J58307n951p5457r0528j6377K3178K8069L841
14067C16664Q392J23375J01056j06696o7602L1846p0814k7136O8103k3863O6673
14056D19998P3944J55660L5003n8156j08379O3544k2762O2832K7829L1410J40089
14045H21012N0925k4745n6615k03938M8269j7403J42183j0924j22979m9469Q920
$$ y = [-27148, 55554, 122839, 328721, 355257, 225660, 149274, 149067, 46797, 19208, 83970, 303055, 252342, -5567, -106297, -77214, -68043, -57523, -111409, -146831, -134595, 11728, 151088, 213611, 110006, 17269, 58075, 225858, 359056, 311484, 199300, 176983, 118894, 105949, -11981, -16927, 91228, 180651, 193113, 323158, 396789, 277790, 196986, 236521, 270729, 226671, 267248, 293480, 291582, 449889, 443938, 368481, 277953, 261576, 284754, 312823, 316664, 325056, 448431, 549487, 442791, 375189, 407035, 336221, 309085, 377188, 353325, 419998, 493942, 649602, 684605, 626449, 518070, 581614, 558852, 621684, 649513, 680923, 821012, 871937, 847192, 790577, 586639, 634908, 617505, 759688, 748764, 625785, 576316, 585236]
14034E85236M9152j21672J7569P9152J21773J02204K5845o8437J32265J12841
14024A035928o72r7156j40100j43023m9920r59J43753N3335o3531k4371O1377
14013G74661J87522L1693p8921k8622r6840o1662O8770J1153O8671R0228L5518
14002A002171p3371j37623N1658K0643J56490J05909L7151J09769o5388q3976
13992A123433Q7422J79628l0476O9596O1277P2360J38163q7779J19324J09172
13982A842120K010R7552M6186L7070o7659Q1183j5840J9388K68889K82069K82426
13971B875394J67810J8681J23881K71793J98081P1907K06754M44701K69704K85795
13961D934501K47695L12249K74933L58420N81332M48667N16705N42140N36524
$$ y = [585236, 634388, 512716, 530285, 609437, 731210, 833414, 859259, 790822, 923087, 1035928, 1035256, 938100, 798000, 654977, 605057, 604098, 747851, 801186, 737655, 713284, 774661, 962183, 993876, 914955, 886333, 789493, 727831, 796601, 807754, 876425, 966653, 1002171, 928800, 791177, 842835, 863478, 1019968, 1125877, 1163028, 1272797, 1207409, 1123433, 1210855, 1390483, 1360007, 1429603, 1490880, 1563240, 1701403, 1613624, 1732948, 1842120, 1844130, 1941682, 1987868, 2024938, 1957279, 2038462, 2022622, 2042010, 2310899, 2592968, 2875394, 3043204, 3061885, 3185766, 3457559, 3655640, 3727547, 3934301, 4379002, 4648706, 4934501, 5182196, 5494445, 5769378, 6127798, 6709130, 7157797, 7674502, 8216642, 8753166]
13952H753166P38762R50117P75949P90403R87093J234761J337866J369552J600857
13943A8538526K094750K109444K361090K556208L088397L522798M009228M576460
13935D2856901N223380N875735O794541P821674R009795J0251908J1448442J3030446
13927A12312822J4472877J6217907J7793434J8675163J9239624J9392422J8934098
13920B37038347J7784793J6038720J3551540J0806245P802526M549500J499087
13913C09070758j117871l143034m467927n512937o173904n913329n392340m682688
13905B72666728l885594k886190j804673o37959N98815J671587K753919L987030
13897B72463663M808970N550063O320709O671644O452288N701004M337595K637267
$$ y = [8753166, 9491928, 10442045, 11217994, 12008397, 12995490, 14230251, 15568117, 16937669, 18538526, 20633276, 22742720, 25103810, 27660018, 30748415, 34271213, 38280441, 42856901, 48080281, 53956016, 60750557, 68572231, 77582026, 87833934, 99282376, 112312822, 126785699, 143003606, 160797040, 179472203, 198711827, 218104249, 237038347, 254823140, 270861860, 284413400, 295219645, 303022171, 307571671, 309070758, 307952887, 304809853, 300341926, 294828989, 288655085, 282741756, 277349416, 272666728, 268781134, 265894944, 264090271, 263452312, 264051127, 265722714, 268476633, 272463663, 277272633, 282822696, 289143405, 295815049, 302267337, 307968341, 312305936, 314943203]
13889C14943203K75703k749016n804806r040560j1981176j4814416j7178411j8572731
13881B35077790j9454685j9547874j8974001j8161643j6990740j5497541j3953415
13874A12497891j2434900j1045460r774227q483228p374668o508027n754298m836110
13866D6286973m268342l854729l466871l166940k839323k391310k046783j957901
13858B2294774j672317j664308j445273j093391j033829j062604q14307q96898
13850A2611847o82854o46710p12465o34381n52925o28981n06733m84444m10606
13841G351748k61101k47351m00536k78988k34740j89737k06971j48490j46430
13832E237404k01504l60795l09693k63797j48728L3798j36538j27560j60968J415
$$ y = [314943203, 315218906, 312469890, 306665084, 297624524, 285643348, 270828932, 253650521, 235077790, 215623105, 196075231, 177101230, 158939587, 141948847, 126451306, 112497891, 100062991, 89017531, 79243304, 70760076, 63385408, 56877381, 51123083, 46286973, 42018631, 38163902, 34697031, 31530091, 28690768, 26299458, 24252675, 22294774, 20622457, 18958149, 17512876, 16419485, 15385656, 14323052, 13508745, 12611847, 11928993, 11282283, 10569818, 9935437, 9382512, 8753531, 8246798, 7762354, 7351748, 7090647, 6843296, 6442760, 6163772, 5929032, 5739295, 5532324, 5383834, 5237404, 5035900, 4675105, 4365412, 4101615, 3952887, 3986685, 3850147, 3722587, 3561619, 3563034]
13822C563034l4288j60522k00277j73627q1983l6973n6367j73313n3659l5247
13812B556778J20608q2081K544l1420k16362r6077r2203k6600L1700j05994L3264
13801B094157p4691o0264j85500j72443J20384P8552O0158k64421j32920K58800
13791A721812l0778q081l2636l3624m1152n569J38443K3474m2154k53484l9383
13780A396868k1135N124K3195p1046O3455J57488m6081k78869k16718m3067K9154
13769I98368k7793M0329K312q0885o7346P0931j91914K4068Q4414N0117K02544
13758A105145j17758j6076J74240l3727r6210j02931m8076P5341N6732j47084
13748H49596j93974J91878R0330l09072j82332J8318J33735j00359m7107J37182
$$ y = [3563034, 3528746, 3368224, 3167947, 2994320, 2912337, 2875364, 2818997, 2645684, 2592025, 2556778, 2677386, 2595305, 2597849, 2566429, 2350067, 2253990, 2161787, 2135187, 2166887, 2060893, 2094157, 2019466, 1959202, 1773702, 1601259, 1721643, 1800195, 1860353, 1595932, 1463012, 1721812, 1691034, 1682953, 1650317, 1616693, 1575541, 1569972, 1708415, 1731889, 1689735, 1436251, 1396868, 1375733, 1380857, 1404052, 1333006, 1396461, 1553949, 1507868, 1228999, 1012281, 969214, 998368, 970575, 1010904, 1013216, 932331, 864985, 935916, 744002, 768070, 852484, 902601, 1105145, 987387, 971311, 1145551, 1111824, 1015614, 912683, 864607, 939948, 996680, 849596, 655622, 847500, 937830, 628758, 446426, 464744, 598479, 498120, 451013, 588195]
13738E88195j37925j81746r1351j4905o296l3118J25883J30788N0829j29967J40368
13727D40755J44562m8087N9453l1220j33162J11388k8680j32937j4630j42689
13717B24753j6671J12137r1274l8229K26408O4431K3891r276O1134O6576p3998
13706E49882n0242j33436M3290j11756j07180R4529J09535j02417j82045p8524
13696C1636J66790R0016m1500K648p9175J73972P0209n3933K9365m6777O1211
13685D04462p1168j33284J8304r7138M3879K24953K9816j03307J48368l5619o8622
13674C60644k7429J14755J79052j21851j11269k49j2144j00035J0159J00379j45583
13663B46429j4554N294J5290J05247J41805n6102k05664j09952p4154J23192m6385
$$ y = [588195, 450270, 268524, 177173, 162268, 155972, 122854, 248737, 379525, 430354, 300387, 440755, 585317, 537230, 596683, 565463, 432301, 543689, 515009, 382072, 367442, 224753, 208082, 320219, 228945, 190716, 417124, 481555, 505446, 496170, 557304, 623880, 549882, 499640, 366204, 409494, 297738, 190558, 285087, 394622, 292205, 110160, 31636, 198426, 288442, 246942, 249590, 170415, 344387, 414596, 360663, 390028, 343251, 404462, 333294, 200010, 218314, 121176, 165055, 390008, 419824, 316517, 464885, 429266, 360644, 333215, 447970, 627022, 505171, 393902, 393653, 381509, 281474, 291633, 392012, 246429, 231875, 237169, 252459, 357706, 499511, 443409, 237745, 127793, 53639, 176831, 130446]
13652A30446R6415J54411j28145k0916K5142N2672K16979j32290q5402m3154J09458
13641C75616l9035j3138r1482j0622N6277j22106q4551j32764j3253K01925K57811
13630C84678j6138k4714j1532r9899r7497p0396Q6900o218j2625L0210R2331N5574
13618C10674m8868M4238L7577m1003j763j99335j70081J34415J19995j28670q9663
13607c2484q2569p225K1009K7414M2255J59648n5307j82153j3457Q597J45284
13596C1012k1871p4378j04852M0423M3862J89476J1261J3228l8882m9131M4601
13585H4749J58096k567l6414N9673j26168J12131J27122M0710o8975j79620n7786
13574A10951K13486O8621q0113j26876P8472J6331j8912j7057k8486P1203M760
$$ y = [130446, 226861, 381272, 253127, 232211, 257353, 310025, 527004, 394714, 309312, 266158, 375616, 336581, 323443, 231961, 221339, 277616, 155510, 70959, -61805, -75058, 126867, 384678, 368540, 343826, 332294, 232395, 134898, 64502, 151402, 145184, 132559, 162769, 255100, 310674, 261806, 306044, 343621, 302618, 300855, 101520, -68561, 65854, 185849, 57179, -32484, -115053, -122278, -101269, -73855, -31600, 128048, 72741, -109412, -122869, -114272, 31012, 9141, -65237, -170089, -129666, -85804, 103672, 114933, 128161, 89279, 40148, 84749, 242845, 240278, 203864, 263537, 137369, 249500, 376622, 417332, 348357, 168737, 110951, 324437, 393058, 312945, 186069, 264541, 280872, 261960, 244903, 216417, 287620, 292380]
13563B92380Q951L6076J31543j32577p2669M274o4707P6662l0844j42817J6957
13552A23229o4542o6431J3105J14302P8755k8554R0531J1394q5727k2423n2466
13541A11173L4026Q7041K5934o2502r2030j6018O2730n1521J3140q3275Q0976
13530A09674R2024M3363J131o4352n0024n8968j81112j9571l5237j370P3142J55491
13518F4191J741o8740l5377j05768j05352J69628M350j6008k4509Q0964R4795
13507E9915Q4924K4073l9503j05155j38705P3661J93864J55164J92473K76334
13497G77045J29830J08196L7886l31069k93948j44939l8817O5039J7668n0586
13487B76305Q313J02678n9259N5356N4118L9734L735o6364L1528p4367J5794J88714
$$ y = [292380, 301331, 337407, 468950, 336373, 263704, 267978, 203271, 279933, 249089, 106272, 123229, 58687, -7744, 5361, 119663, 198418, 169864, 260395, 271789, 186062, 163639, 111173, 145199, 232240, 258174, 195672, 103642, 87624, 150354, 98833, 111973, 28698, 109674, 201698, 245061, 246192, 181840, 131816, 72848, -108264, -127835, -163072, -164442, -91300, 64191, 65932, -2808, -38185, -143953, -249305, -79677, -75327, -91335, -115844, -34880, 59915, 144839, 168912, 129409, 24254, -114451, -40790, 153074, 308238, 500711, 777045, 906875, 1015071, 1052957, 721888, 427940, 283001, 244184, 309223, 326891, 276305, 284618, 387296, 328037, 383393, 437511, 477245, 480980, 414616, 446144, 371777, 387571, 576285]
13475E76285O1359l1667n6728J01982J60455N6488N2592L1056Q6289J10694J05926
13464A254731R7071J21536J24860J7336J30460N2047J64045R6917P6436j1976
13454B123463L8866O8251K94759K3402j19109k43232k64845j30841m2331r3292
13444A655091N4933M5343k6678o5659j53205M9093N6488j41933J79360J89940
13434A842773J07502l6104M8818O1481N7878m6627k37484j95827j47672q9597
13424A365141L767m3092p9681j3982J74353k0110k86514k10959m9753L21n5369
13413G84122r6479p5614l5038j9413Q0795Q0551J39071K7982K8669j3865l48483
13402E52298j99436R6261J52127N9837q8303o1483K86806J31314n0141o6593R0766
$$ y = [576285, 637644, 605977, 549249, 651231, 811686, 868174, 920766, 951822, 1038111, 1148805, 1254731, 1351802, 1473338, 1598198, 1615534, 1745994, 1798041, 1962086, 2059003, 2135439, 2123463, 2162329, 2230580, 2525339, 2548741, 2429632, 2186400, 1921555, 1790714, 1748383, 1655091, 1710024, 1755367, 1728689, 1663030, 1509825, 1558918, 1615406, 1473473, 1652833, 1842773, 1950275, 1914171, 1962989, 2024470, 2082348, 2035721, 1798237, 1602410, 1454738, 1365141, 1368908, 1325816, 1246135, 1232153, 1406506, 1386396, 1099882, 888923, 839170, 839491, 784122, 687643, 612029, 576991, 557578, 638373, 718924, 857995, 885977, 914646, 900781, 552298, 352862, 449123, 601250, 661087, 572784, 511301, 798107, 929421, 879280, 812687, 903453]
13391I03453P2421r9867n4917n7987K9136k6687K2167J59273j15473q4922l3603
13380G12994K888k04047K19J7563j65324o7887P0300n4184j18996P8287J76451
13369D48264q865J03042r7709j78494n9617k4037R6302J52478O7617J21011r9637
13358E20355q7J56989J23064j03420j58235L2893R2451M1854j53045n7481L9500
13347E34838r3417N4610N2146k417q467R258L6114J0700M4210j87264k06190l0559
13335B13562l5620R4790K9644o835J85346J48067k0102j3365J26402L0398q4078
13324F68209j39409l5342J20260K14070L9719l1917N4437L12153K11293n1328
13314A362145m549j16998j73949N4146m693j27900l9411n6075j60253j10041j83290
$$ y = [903453, 975874, 876007, 821090, 763103, 792239, 765552, 787719, 946992, 831519, 746597, 712994, 715882, 511835, 512054, 529617, 364293, 296406, 366706, 312522, 193526, 271813, 448264, 439399, 542441, 444732, 266238, 206621, 182584, 278886, 431364, 498981, 619992, 520355, 520268, 677257, 800321, 696901, 538666, 571559, 664010, 705864, 552819, 495338, 534838, 441421, 496031, 548177, 545760, 537293, 546551, 582665, 593365, 637575, 450311, 244121, 213562, 177942, 272732, 302376, 295541, 480887, 628954, 608852, 595487, 721889, 752287, 668209, 528800, 493458, 613718, 827788, 867507, 835590, 890027, 1202180, 1413473, 1362145, 1357596, 1240598, 1066649, 1120795, 1116102, 988202, 948791, 892716, 732463, 622422, 439132]
13303D39132j73454j41334q5725O394J42139M2541j93339M9691M2134p8198R1229
13292A41210J02176K08293K23049R5190o8700n9118J53642j89843q2541q0867
13282D42491j15800J32269O9313j06483k4535O9089k4332j14383m1130j65723
13272A20776q314N1745J65205l4203k03843k8880J75199R2885q673j62372r2418
13261F7107n9064k3582L1317Q0345Q3202M4917N5792k21080k20116j28651P9826
13250b09987J66073L5407J01334J32475j64900J07303R1675M8589l5484J62060
13240D34545L7683j11515l7836p0224j09124J37068r23j93402j34386j4215K9240
13229c3089J12912R2174o4636j71717L9132J40338n4309j30514m7578P9923P7647
$$ y = [439132, 265678, 124344, 38619, 45013, 187152, 229693, 36354, 86045, 128179, 49981, 141210, 243386, 451679, 674728, 769918, 701218, 642100, 795742, 605899, 523358, 442491, 326691, 458960, 528273, 421790, 397255, 466344, 442012, 327629, 286499, 120776, 112462, 164207, 329412, 295209, 91366, 62486, 237685, 330570, 321897, 159525, 67107, 8043, -15539, 15778, 96123, 179325, 224242, 280034, 58954, -161162, -289813, -209987, -43914, -8507, 92827, 225302, 60402, 167705, 259380, 307969, 272485, 434545, 472228, 360713, 322877, 252653, 143529, 280597, 279674, 86272, -48114, -62329, -33089, 79823, 171997, 107361, -64356, -25224, 115114, 60805, -69709, -117287, -37364, 40283]
13218D0283J17196j2715N463J12045L490n7732J44185q784j45467p0539J89584
13207C17009n9233k04025j09735M593N8031J26687J52216q9247j02181J00029
13197A94144r322N5363k8930j45743l4821P3480K10266J01475J14785n7346j14196
13186C59155j13332j01941j4898j00294J5017q479n7916m7697L3940J57252O7421
13175A88228L6177j16191J7347L1616J23598j21829N4873J24796J11901J02080
13165E52596l6330j82333k69091Q4080L47431p5406j32847p9840j04235j50647
13155d6622j8320r004p1023N4849J74636O5467j22557K8806J98395J34273J5658
13144D04558P5028j7980j02183m0101k34385L3123K62572J8116M0843J12020K7993
$$ y = [40283, 157479, 144764, 150227, 262272, 265762, 208030, 352215, 343431, 197964, 127425, 317009, 257776, 53751, -55984, -51391, 6640, 133327, 285543, 196296, 94115, 194144, 184822, 240185, 211255, 65512, 30691, 104171, 314437, 415912, 530697, 473351, 359155, 245823, 143882, 128984, 28690, 43707, 35228, -22688, -70385, -36445, 120807, 188228, 224405, 108214, 125561, 157177, 280775, 158946, 213819, 338615, 450516, 552596, 516266, 333933, 64842, 148922, 496353, 420947, 288100, 208260, 104025, -46622, -64942, -73946, -144969, -90120, 84516, 149983, 27426, 56232, 254627, 388900, 404558, 479586, 461606, 359423, 319322, 84937, 118060, 380632, 398748, 439591, 551611, 579604]
13133E79604M9156j07133P6887j67416j9011R3058m6026O2794k3222j32188P0058
13122D36561j07321m6104q4531l7280K18670J52879R4762k7684L0382j0614j48404
13111D71316k5586J28110q1061k30777j25618n3542K35595K11953J05085q2982
13101E52493j29787K330P1661J09857N1128p5701j06279j55243r5368j8752K4385
13090B30724J25165l5731N882Q3315J6886K6772K05393O9196q8260j15752l7418
13079D86172j12160K3367M8674M7270l0692m6544m922o317Q528P6353m5716J5632
13067D59645J57279n4537j59295O4531M5552r6196p2084L9743O4977p179J05833
13056E48269J57144q1641l2187J10390K5236k6515o6161O176j7516p5268M202
$$ y = [579604, 628760, 521627, 598514, 431098, 412087, 505145, 459119, 521913, 498691, 366503, 436561, 329240, 283136, 198605, 161325, 379995, 532874, 627636, 599952, 630334, 619720, 471316, 445730, 573840, 492779, 262002, 136384, 82842, 318437, 530390, 635475, 552493, 422706, 425036, 496697, 606554, 657682, 581981, 475702, 320459, 225091, 206339, 230724, 355889, 320158, 326040, 409355, 426241, 453013, 658406, 727602, 639342, 523590, 486172, 374012, 397379, 446053, 493323, 462631, 416087, 411165, 404848, 413376, 489729, 444013, 459645, 616924, 562387, 403092, 467623, 513175, 416979, 344895, 384638, 449615, 442436, 548269, 705413, 623772, 591585, 701975, 727211, 700696, 634535, 640711, 623195, 547927, 552129]
13045E52129J0424n4349J365O4295n0119l6885R5581K6865P7832Q5750k1628o6934
13033F84326J8734l3550k6411O3101J68099J43231k25246j87468K53088L7488
13023H95392M3862j01563K5141N9877M2859j3635P2502J86338o7281j63268J74202
13012A154426M2606Q5374r701j75671j19351J54115K62110J08339l5083n1248
13002A415916o0260o416K58496J69124K05776O6186L1365K04695J19304J53481
12992B557667K80971K22596K91846K75338L23171K74144L60677M18198K59391
12983E263999K27645L44917M93423N86471O01544Q39104J237243J733813K185375
12974A3513534K660574L177479M244895N873814P352159R460804J1733868J3283992
$$ y = [552129, 562553, 508204, 509569, 573864, 523745, 486860, 582441, 609306, 687138, 772888, 751260, 684326, 703060, 669510, 643099, 706200, 874299, 1017530, 792284, 604816, 857904, 895392, 939254, 837691, 862832, 922709, 965568, 951933, 1024435, 1210773, 1143492, 980224, 1154426, 1197032, 1282406, 1272705, 1097034, 977683, 1131798, 1393908, 1502247, 1467164, 1415916, 1355656, 1349240, 1607736, 1776860, 1982636, 2048822, 2080187, 2284882, 2404186, 2557667, 2838638, 3061234, 3353080, 3628418, 3951589, 4225733, 4586410, 5004608, 5263999, 5491644, 5836561, 6329984, 6916455, 7517999, 8357103, 9594346, 11328159, 13513534, 16174108, 19351587, 23596482, 29470296, 36822455, 46283259, 58017127, 71301119]
12966G1301119J2774165J0619146P831014N101142J799608k506830n642051p745156
12958I3532157q905480r672777j0175443r704984q426593o482290m247099k363792
12950C3553699p67221M87831J827167L087592M748676O458776Q681261J1269743
12942F9347524J3753603J5590078J6597863J6158855J4490270J2793254J1152765
12935A69884212P445045K886175l09548l481313o451988r424818j1184093j0957458
12927A38406214j0312192j0520210j0859179j0365986j0072018r860140r538774
12920F6877715q531316o825316m683666k700763q26147Q98430K470165M256690
12912E0935792N935597P333154Q598913R397522Q788473Q316198P784558O188790
$$ y = [71301119, 84075284, 94694430, 102525444, 107626586, 109426194, 106919364, 101277313, 93532157, 84626677, 74953900, 64778457, 55073473, 46646880, 40164590, 35917491, 33553699, 32786478, 33274309, 35101476, 38189068, 42937744, 49396520, 58077781, 69347524, 83101127, 98691205, 115289068, 131447923, 145938193, 158731447, 169884212, 177329257, 180215432, 179905884, 176424571, 169972583, 160547765, 149363672, 138406214, 128094022, 117573812, 106714633, 96348647, 86276629, 76416489, 66877715, 58346399, 51521083, 46837417, 44136654, 43310507, 44208937, 46679102, 50935792, 56871389, 64204543, 72803456, 82200978, 90989451, 99305649, 107090207, 113278997]
12904A13278997M568629K881042P88484n97743j531496k610917k573872r56924
12896A13246200R41614K776364M128621M932038N749605N814509M354131J847414
12888A43790496n3146k390273n457103q352334j0339500j1302488j1067463j0585883
12880H4242306r959194q449085o590068m429012k193174K66102K463659M595428
12872E9946962O907378R343136J1544256J2914352J2985859J2708102J3031718
12865A39381763J3837682J4842263J5077274J4581998J3956236J2270419P534642
12858B31482277J604229k783626n944124r804865j4376901j7577473j8340650
12851A64258867j9327485k0091698j9198183j6500878j3063254j0092624p485124
$$ y = [113278997, 117847626, 120728668, 121517152, 120919409, 119387913, 116776996, 114203124, 113246200, 114187814, 116964178, 121092799, 126024837, 131774442, 137588951, 141943082, 143790496, 143737350, 141347077, 135889974, 127537640, 117198140, 105895652, 94828189, 84242306, 74283112, 65834027, 59243959, 54814947, 52621773, 52887875, 55351534, 59946962, 66854340, 76197476, 87741732, 100656084, 113641943, 126350045, 139381763, 153219445, 168061708, 183138982, 197720980, 211677216, 223947635, 231482277, 233086506, 230302880, 224358756, 214553891, 200176990, 182599517, 164258867, 144931382, 124839684, 105641501, 89140623, 76077369, 65984745, 58499621]
12844E8499621n257446l609606j797667l05749J683827M231742O686464R209127
12836F9340313J1522861J2951696J3358245J2657479J0916106Q909597O223911
12829A45880208K531932k204311p194857j1180535j3814062j5962874j6968275
12822H1087226j5389976j2152026r081168o828944n446314m523815l765554l180320
12814B0719109k655297k036571j634968j186682r16127o49974o06433l42813k22397
12805A0467847r4038j90185k50112n41049n78367k60171j78911l14199k93037
12796G767778k76541k57446j61052k18596l12129m20470l41692m79276n44023
12787D756553k59096j60945m83390k34380p4349o7655J3985j6675j03484M6194
$$ y = [58499621, 53242175, 49632569, 47834902, 47529153, 49212980, 53444722, 60131186, 69340313, 80863174, 93814870, 107173115, 119830594, 130746700, 139656297, 145880208, 148412140, 146207829, 139012972, 127832437, 114018375, 98055501, 81087226, 65697250, 53545224, 44464056, 37635112, 32188798, 27664983, 23899429, 20719109, 18063812, 16027241, 14392273, 13205591, 12289464, 11639490, 11033057, 10690244, 10467847, 10373809, 10183624, 9933512, 9392463, 8814096, 8553925, 8375014, 8060815, 7767778, 7491237, 7233791, 7072739, 6854143, 6542014, 6121544, 5779852, 5300576, 4756553, 4497457, 4336512, 3853122, 3618742, 3544393, 3476738, 3490723, 3474048, 3370564, 3416758]
12777C416758l9711j10305K4854J29223J29101j13760J20416K28175P2212P6249
12767C933212L3790Q2704o2821k13294j72332O693r2807k59442k73035r9705K09325
12756C092288J05549k1452O8229K43241K20586K58483J88753J6749J055K48072
12746D421553m9043l52548l07789j68542r0472j47028p6659j68411q2790J9723
12736B997994J59898K8385M7620J53958K2306j55712k09338j47989j82375o2015
12726B652732n8879P5405Q067l0414l8360o8229j5783p8571j28163k7825M7746
12715B337726N9246J58488J75727j29477P8161Q1161J0816n3566o0691o9184j85537
12704B402870o8928r9121m8972M2034o3516O6767K32910J380J39618J26624R2399
$$ y = [3416758, 3377047, 3266742, 3291596, 3420819, 3549920, 3436160, 3556576, 3784751, 3856963, 3933212, 3967002, 4049706, 3986885, 3773591, 3601259, 3607952, 3515145, 3255703, 2982668, 2882963, 3092288, 3197837, 3176385, 3244614, 3487855, 3708441, 3966924, 4155677, 4172426, 4173481, 4421553, 4372510, 4019962, 3712173, 3543631, 3453159, 3306131, 3229472, 3061061, 2978271, 2997994, 3157892, 3186277, 3233897, 3387855, 3410161, 3254449, 3045111, 2897122, 2714747, 2652732, 2593853, 2669258, 2677325, 2646911, 2608551, 2540322, 2524539, 2445968, 2317805, 2289980, 2337726, 2396972, 2555460, 2731187, 2601710, 2679871, 2761032, 2771848, 2718282, 2657591, 2588407, 2402870, 2333942, 2234821, 2185849, 2227883, 2164367, 2231134, 2464044, 2465424, 2605042, 2731666, 2824065]
12693B824065J75938K02981j46219j00906r5731K9611m0673L4264J38420K6201
12683C047951j14947m1352M7262o708j73884k60081K4694M3367j5716P4308j29800
12672B495094k27288l1387m7083n4495n9287j48424o6065j10575j4467j05320
12662A630703J8167J7734R2255m8786m8146R3124K1291J5040P6517K5553J5321
12651A908773k4129j85067j67732j583o2245j3591j73996p0134q0414j01771K6532
12640A054643j61668l4821N6474J37885J56126j373j00245N5533J72416J3589
12630A348559l9185q7442K4566o7072N3623J21530N6722o7470j29530k18403j61545
12619H34353j4231Q7693P7199o5358o8650o5876j8856M0374J22380K4759n456
$$ y = [2824065, 3000003, 3202984, 3056765, 2955859, 2860128, 2889739, 2849066, 2883330, 3021750, 3047951, 2933004, 2891652, 2938914, 2932206, 2758322, 2498241, 2522935, 2566302, 2550586, 2624894, 2495094, 2267806, 2236419, 2189336, 2134841, 2075554, 1927130, 1861065, 1750490, 1736023, 1630703, 1648870, 1666604, 1758859, 1710073, 1661927, 1755051, 1776342, 1791382, 1867899, 1893452, 1908773, 1884644, 1699577, 1531845, 1530262, 1468017, 1454426, 1280430, 1210296, 1129882, 1028111, 1054643, 892975, 858154, 914628, 1052513, 1208639, 1207266, 1107021, 1162554, 1334970, 1348559, 1309374, 1221932, 1246498, 1179426, 1233049, 1354579, 1411301, 1343831, 1214301, 995898, 834353, 820122, 907815, 985014, 919656, 851006, 785130, 766274, 806648, 929028, 953787, 948331]
12608I48331m3183k7194J8179o6270P5614L2283j20145j50542O250K620k3857
12597F52086L9335J9819n8588K1728J66580n6559k4140j50196o6732J22291K03725
12586H69349r805j09552L8087m5185j70828k6123m8474j2835N3805R6933o1750
12575E73622n592M3449K8336k5326K56836K378K2596n0229j76836j54552n2523
12564D62159q482K397j56062O8125J16547R7J0160K06869n4757k1901N075j01293
12552E28934j13023M3652m3566o6795p7248m4244J16828q0500L5242K04951J22004
12541F26235K4896q8124L0940J28446J9307l9974O4789j422J7163m3468n7764
12530F81024K8673p2703J41220k20308l59051q263K41746N7091O7301J50855J67248
$$ y = [948331, 905148, 877954, 896133, 829863, 905477, 937760, 817615, 667073, 673323, 675943, 652086, 691421, 711240, 652652, 674380, 840960, 784401, 760261, 610065, 543333, 665624, 869349, 859544, 749992, 788079, 742894, 572066, 545943, 497469, 484634, 538439, 635372, 573622, 568030, 611479, 639815, 614489, 871325, 873703, 896299, 846070, 669234, 514682, 462159, 453677, 456074, 300012, 368137, 484684, 484781, 494941, 701810, 647053, 625152, 630227, 528934, 415911, 459563, 415997, 349202, 271954, 227710, 344538, 264038, 299280, 504231, 626235, 651131, 563007, 593947, 722393, 741700, 701726, 766515, 765093, 782256, 738788, 681024, 709697, 636994, 778214, 557906, 198855, 190592, 432338, 489429, 556730, 707585, 874833]
12519H74833J10401p7061k11225N5807n1478n1637J14403q2374l2734J40210n331
12508G83814P3561K8410L3729Q1284K46901N6726o385m125j61539P0019O7096
12497A269491j08923j6438J21596M2786r0684n8466n3645j10071k4057J8743Q5772
12486A076104k5609N7525k361m6356k1816j01135j054n7987J61176J59488O4454
12475A262429O1116Q4912L7129J43291J61433j65826j24247l4400L1834R9056
12465A556727R400O0787j972k5423j10579n7585n3984J0872n1107P2707q2668
12454A327175j46911m3622L8491J1984j90685O530P5795K30428K44722O4386q3109
12443A535184J19825K9003j77026k3427n7706O1610R7089J35203L1139l8118L3732
$$ y = [874833, 985234, 908173, 696948, 752755, 701277, 649640, 764043, 681669, 648935, 789145, 783814, 857375, 885785, 919514, 1000798, 1247699, 1304425, 1298040, 1293915, 1132376, 1202395, 1269491, 1160568, 1144130, 1265726, 1308512, 1217828, 1159362, 1105717, 995646, 971589, 990332, 1076104, 1050495, 1108020, 1105659, 1059303, 1037487, 936352, 935298, 877311, 1038487, 1197975, 1262429, 1323545, 1408457, 1445586, 1588877, 1750310, 1584484, 1460237, 1425837, 1457671, 1556727, 1566127, 1626914, 1624942, 1599519, 1488940, 1431355, 1377371, 1388243, 1337136, 1409843, 1327175, 1180264, 1136642, 1175133, 1187117, 996432, 1002962, 1078757, 1309185, 1553907, 1618293, 1535184, 1655009, 1684012, 1506986, 1483559, 1425853, 1487463, 1584552, 1719755, 1750894, 1712776, 1746508]
12432A746508K8J20512O479K28380K03314Q9938j34127q5938j43488J82320L3675
12421B247601J44749R6569j37164K6657L9026Q7145J30916O4948O98j6081J18095
12410B803159K01219K19658L52314M08840M63886N08344K96080M54937O47115
12401F355552P40853Q47998Q72291J126185J399804J820199K229747K505774K856205
12392B0754608L424594M196682N075812O837835R290010J2865074J7483711K2239070
12384A02167396K5667219K5732139K0614198J0291825m040826j9083627k7532130
12377A33816194k6715251k1166158j4919484r607949n376873j956564J398846
12370E5472761M797796Q245966J1985583J5940753J9195640K1027718K1151829
$$ y = [1746508, 1746536, 1867048, 1873527, 2101907, 2305221, 2395159, 2261032, 2175094, 2031606, 2213926, 2247601, 2392350, 2488919, 2351755, 2378412, 2417438, 2504583, 2635499, 2700447, 2701145, 2685064, 2803159, 3004378, 3224036, 3576350, 3985190, 4449076, 4957420, 5253500, 5708437, 6355552, 7096405, 7944403, 8816694, 9942879, 11342683, 13162882, 15392629, 17898403, 20754608, 24179202, 28375884, 33451696, 40289531, 49579541, 62444615, 79928326, 102167396, 127834615, 153566754, 174180952, 184472777, 180431951, 161348324, 133816194, 107100943, 85934785, 71015301, 61407352, 56030479, 54073915, 55472761, 60270557, 68516523, 80502106, 96442859, 115638499, 136666217, 157818046]
12363A57818046J7668982Q412878m214169j5864161k2922713k4535484k2558863
12356I3804516j9246585j5195655j1241660q198198n791867m147761l140099k437264
12348B4405427j891197j671796j380946j187980o04319m14087n5650K14883P72819
12339A8187154J114824J578015K169198K579118L333012M309312N419290O781368
12331D5471291Q984277J2083199J6308533K1113667K5009749K6609691K3465869
12324A79046276J3597765j098796j3628418j9080438j9866034j8228133j5141189
12317A05601033j0441857m896418P54517O400138J2335311J8607275K5685884
12310A54045883L2607559L7783837L8119946L1873076J8799752R3659k0058974
$$ y = [157818046, 175487028, 183899906, 179685737, 163821576, 140898863, 116363379, 93804516, 74557931, 59362276, 48120616, 39922418, 34130551, 29982790, 26842691, 24405427, 22514230, 20842434, 19461488, 18273508, 17669189, 17255102, 17199452, 17414335, 18187154, 19301978, 20879993, 23049191, 25628309, 28961321, 33270633, 38689923, 45471291, 54455568, 66538767, 82847300, 103960967, 128970716, 155580407, 179046276, 192644041, 191545245, 177916827, 158836389, 138970355, 120742222, 105601033, 95159176, 90262758, 91017275, 97417413, 109752724, 128359999, 154045883, 186653442, 224437279, 262557225, 294430301, 313230053, 313323712, 293264738]
12303B93264738l5380481m1124853l9082759l2305625k3802027j6606764j0868440
12296I4093789n826794j133306L786537Q284202J1970573J4055510J3584242J0288926
$$ y = [293264738, 257884257, 216759404, 177676645, 145371020, 121568993, 104962229, 94093789, 88266995, 87133689, 90920226, 99204428, 111175001, 125230511, 138814753, 149103679]
$$ [...]
##END NTUPLES=NMR SPECTRUM
##END=
