##TITLE=Analysis number 328971
Compound Code cc 58324
Book Reference 467/174/2
Project Code adrs
Chemist Name benw
##JCAMPDX= 6.0         $$ Bruker NMR JCAMP-DX V2.0
##DATA TYPE= NMR SPECTRUM
##DATA CLASS= NTUPLES
##ORIGIN= Bruker BioSpin GmbH
##OWNER= nmr
$$ XWIN-NMR		Version 3.5
$$ Fri Jul 20 10:26:13 2007 GMT Daylight Time (UT+1h)  MAYBRIDGE\nmr@NMR_250MHZ
##.OBSERVE FREQUENCY= 250.131544655141
##.OBSERVE NUCLEUS= ^1H
##.ACQUISITION MODE= SIMULTANEOUS (DQD)
##.ACQUISITION SCHEME= undefined
##.AVERAGES= 16
##.DIGITISER RES= 18
##SPECTROMETER/DATA SYSTEM= dpx250
##.PULSE SEQUENCE= zg30
##.SOLVENT NAME= CDCl3
##.SHIFT REFERENCE= (INTERNAL, CDCl3, 0, 16.4519)
##AUDIT TRAIL= $$ (NUMBER, WHEN, WHO, WHERE, WHAT)
$$ ##TITLE= Audit trail, XWIN-NMR		Version 3.5
$$ ##JCAMPDX= 5.01
$$ ##ORIGIN= Bruker BioSpin GmbH
$$ ##OWNER= nmr
$$ C:\u/data/dgb/nmr/ADRS/1270/pdata/1/auditp.txt
$$ ##AUDIT TRAIL=  $$ (NUMBER, WHEN, WHO, WHERE, WHAT)
(   1,<2007-07-20 10:25:51.16 +100>,<MAYBRIDGE\nmr>,<NMR_250MHZ>,
      <created by zg, POWCHK disabled, PULCHK disabled
       configuration hash MD5:
       76 6E 9A 78 1E 09 19 81 EC 84 63 8F B0 6A 59 2D
       data hash MD5: 64K
       F5 C3 5F 63 4F 51 D9 A1 EF 0E EB 74 FE FF 88 8B>)
(   2,<2007-07-20 10:26:03.86 +100>,<MAYBRIDGE\nmr>,<NMR_250MHZ>,
      <Start of raw data processing
       ef LB = 0.3 FT_mod = 6 PKNL = 1 SI = 32K 
       data hash MD5: 32K
       73 DB 17 70 42 7C E9 42 25 E4 0A 57 3D F3 12 33>)
(   3,<2007-07-20 10:26:05.50 +100>,<MAYBRIDGE\nmr>,<NMR_250MHZ>,
      <apk 
       data hash MD5: 32K
       8C CB 41 F8 A9 7D A0 CF 7C 09 26 EE 47 54 74 5B>)
(   4,<2007-07-20 10:26:06.17 +100>,<MAYBRIDGE\nmr>,<NMR_250MHZ>,
      <abs ABSG = 5 
       data hash MD5: 32K
       5B A4 84 2D 93 F8 18 3F 13 7C E7 3A A9 7E BC CE>)
$$ ##END=
$$ 
$$ hash MD5
$$ 1F BD 92 79 E6 3D 47 FE AC A0 1B 5F BD C1 4A 1C
##$RELAX= 
##$RELAX= 
##$RELAX= 
##$RELAX= 
##$RELAX= 
##$RELAX= 
##$RELAX= 
$$ Bruker specific parameters
$$ --------------------------
##$DU= <C:\u>
##$EXPNO= 1270
##$NAME= <ADRS>
##$PROCNO= 1
##$TYPE= <nmr>
##$USER= <dgb>
##$AMP= (0..31)
100 100 100 100 100 100 100 100 100 100 100 100 100 100 100 100 100 100 
100 100 100 100 100 100 100 100 100 100 100 100 100 100 
##$AQSEQ= 0
##$AQ_mod= 3
##$AUNM= <au_zg>
##$AUTOPOS= <6 >
##$BF1= 250.13
##$BF2= 250.13
##$BF3= 250.13
##$BF4= 250.13
##$BF5= 500.13
##$BF6= 500.13
##$BF7= 500.13
##$BF8= 500.13
##$BYTORDA= 1
##$CFDGTYP= 0
##$CFRGTYP= 5
##$CHEMSTR= <none>
##$CNST= (0..31)
1 1 145 1 1 1 1 1 1 1 1 1 1 1 1 1 1 1 1 1 1 1 1 1 1 1 1 1 1 1 1 1 
##$CPDPRG= <>
##$CPDPRG1= <>
##$CPDPRG2= <>
##$CPDPRG3= <>
##$CPDPRG4= <mlev>
##$CPDPRG5= <mlev>
##$CPDPRG6= <mlev>
##$CPDPRG7= <mlev>
##$CPDPRG8= <mlev>
##$CPDPRGB= <>
##$CPDPRGT= <>
##$D= (0..31)
0 1 0 0 0 0 0 0 0 0.06 0 0 0 0 0 0 0.0002 0 0 0 0 0 0 0 0 0 0 0 0 0 0 
0 
##$DATE= 1184923550
##$DBL= (0..7)
120 120 120 120 120 120 120 120 
##$DBP= (0..7)
150 150 150 150 150 150 150 150 
##$DBP07= 0
##$DBPNAM0= <>
##$DBPNAM1= <>
$$ [...]
##$SUBNAM7= <"">
##$SUBNAM8= <"">
##$SUBNAM9= <"">
##$SW= 20.6930455092707
##$SWIBOX= (0..15)
0 0 3 0 0 0 0 0 0 0 0 0 0 0 0 0 
##$SW_h= 5175.983436853
##$TD= 65536
##$TD0= 1
##$TE= 297.16
##$TE2= 300
##$TE3= 300
##$TEG= 300
##$TL= (0..7)
0 120 120 120 120 120 120 120 
##$TP= (0..7)
150 150 150 150 150 150 150 150 
##$TP07= 0
##$TPNAME0= <>
##$TPNAME1= <>
##$TPNAME2= <>
##$TPNAME3= <>
##$TPNAME4= <>
##$TPNAME5= <>
##$TPNAME6= <>
##$TPNAME7= <>
##$TPOAL= (0..7)
0.5 0.5 0.5 0.5 0.5 0.5 0.5 0.5 
##$TPOFFS= (0..7)
0 0 0 0 0 0 0 0 
##$TUNHIN= 0
##$TUNHOUT= 0
##$TUNXOUT= 0
##$USERA1= <user>
##$USERA2= <user>
##$USERA3= <user>
##$USERA4= <user>
##$USERA5= <user>
##$V9= 5
##$VALIST= <valist>
##$VCLIST= <CCCCCCCCCCCCCCC>
##$VD= 0
##$VDLIST= <DDDDDDDDDDDDDDD>
##$VPLIST= <PPPPPPPPPPPPPPP>
##$VTLIST= <TTTTTTTTTTTTTTT>
##$WBST= 1024
##$WBSW= 4
##$XGAIN= (0..3)
0 0 0 0 
##$XL= 0
##$YL= 0
##$YMAX_a= 361496
##$YMIN_a= -322381
##$ZGOPTNS= <>
##$ZL1= 120
##$ZL2= 120
##$ZL3= 120
##$ZL4= 120
##$ABSF1= 16.45191
##$ABSF2= -4.241262
##$ABSG= 5
##$ABSL= 3
##$ALPHA= 0
##$AQORDER= 0
##$ASSFAC= 0
##$ASSFACI= 0
##$ASSFACX= 0
##$ASSWID= 0
##$AUNMP= <proc_1d>
##$AZFE= 0.1
##$AZFW= 0.1
##$BCFW= 0
##$BC_mod= 0
##$BYTORDP= 0
##$COROFFS= 0
##$CY= 12.5
##$DATMOD= 1
##$DC= 0
##$DFILT= <>
##$DTYPP= 0
##$F1P= 14.0000005364418
##$F2P= -0.99999901652339
##$FCOR= 0.5
##$FTSIZE= 32768
##$FT_mod= 6
##$GAMMA= 0
##$GB= 0
##$INTBC= 1
##$INTSCL= 1
##$ISEN= 128
##$LB= 0.3
##$LEV0= 0
##$LPBIN= 0
##$MAXI= 10000
##$MC2= 0
##$MEAN= 0
##$ME_mod= 0
##$MI= 0
##$NCOEF= 0
##$NC_proc= -5
##$NLEV= 6
##$NOISF1= 0
##$NOISF2= 0
##$NSP= 0
##$NTH_PI= 0
##$NZP= 0
##$OFFSET= 16.45191
##$PC= 1
##$PHC0= -49.65563
##$PHC1= 9.642126
##$PH_mod= 1
##$PKNL= yes
##$PPARMOD= 0
##$PSCAL= 4
##$PSIGN= 0
##$REVERSE= no
##$SF= 250.130017530655
##$SI= 32768
##$SIGF1= 0
##$SIGF2= 0
##$SINO= 400
##$SIOLD= 32768
##$SREGLST= <1H.CDCl3>
##$SSB= 0
##$STSI= 32768
##$STSR= 0
##$SW_p= 5175.98343685301
##$SYMM= 0
##$S_DEV= 0
##$TDeff= 65536
##$TDoff= 0
##$TI= <Analysis number 999999
Compound Code 99
Book Reference 9
Project Code 9>
##$TILT= no
##$TM1= 0
##$TM2= 0
##$TOPLEV= 0
##$USERP1= <user>
##$USERP2= <user>
##$USERP3= <user>
##$USERP4= <user>
##$USERP5= <user>
##$WDW= 1
##$XDIM= 32768
##$YMAX_p= 404560363
##$YMIN_p= -484982
$$ End of Bruker specific parameters
$$ ---------------------------------
##NTUPLES= NMR SPECTRUM
##VAR_NAME=  FREQUENCY,     SPECTRUM/REAL,   SPECTRUM/IMAG
##SYMBOL=    X,             R,               I
##VAR_TYPE=  INDEPENDENT,   DEPENDENT,       DEPENDENT
##VAR_FORM=  AFFN,          ASDF,            ASDF
##VAR_DIM=   32768,         32768,           32768
##UNITS=     HZ,            ARBITRARY UNITS, ARBITRARY UNITS
##FACTOR=    0.157963299565203, 1,           1
##FIRST=     4115.11654144544, 0,            0
##LAST=      -1060.86689540757, 0,           0
##MIN=       -1060.86689540757, -484982,     0
##MAX=       4115.11654144544, 404560363,    0
$$ Real data points
##PAGE= N=1
##DATA TABLE= (X++(R..R)), XYDATA
$$ [...]
18949A09226n3230j39551K2072P2632J12795o2262k5168N4566J04921j65479j66950
18938a36428p9695Q2048J36133R7199J35j15989K7043l5463N7769M8254p5598
18927E408j06443L1800K7235J72412L4913p1850l3422j17422n5339R0649J8200
18916c859L0329J13872k8654N9824P3482N8000k2481r8915p3639Q278K81022P864
18904D05123k13526O2239n721j4419M2936k6452q8582M1278N0816P5764P9396
18893D08852M6171n5088J1103o1589N140J10283J43114O143p3587l2330n3487
18882D54725p7592O2007O1848j56856l4690K03901J66464l159m5450q3388l669
18871E44141q3910j32247J5866J20680J35844N2353K1373j22426l8080o4001m4217
$$ plain form
18949 109226 55996 -83555 -61483 11149 123944 61682 36514 91080 196001 30522 -136428
18938 -136428 -216123 -134075 2058 99257 99392 -16597 10446 -25017 32752 81006 5408
18927 5408 -101035 -69235 -42000 130412 165325 93475 60053 -57369 -112708 -22059 -3859
18916 -3859 26470 140342 111688 171512 244994 302994 280513 181598 107959 116237 397259 405123
18904 405123 191597 253836 248115 233696 276632 250180 161598 202876 253692 329456 408852
18893 408852 455023 399935 411038 349449 354589 464872 607986 614129 540542 508212 454725
18882 454725 377133 439140 500988 344132 309442 513343 679807 676648 631198 547810 544141
18871 544141 460231 327984 343850 464530 600374 652727 674100 551674 513594 449593 405376
18860D05376m2132N5094k2277o7973J8700r2101j7046L2136j0730n9295m6577
18849A53175n5602J43157O5067p002P2618R7986O236j2627L6694j56252j01393
18838B42057q4940o9478M4361K6804P9497J45796j7863j16740p2580J2432k7719
18827A61627l3131Q419M7275m2468L9346m8901R104M9014p7000o9808M1537Q9085
18815A74099n4202L599K2752m1435k9247j8435K0881K8172Q3179O1172o4282j6094
18803A70159m926P7696R8560J422n5887j4921R9162M0219k1143N6007P018O483
18791D59849r5914J3912K7209n5635p9577l1337J16254p222P9638M7200P77m9586
18779D25568p6323q8523M9929J89775L9426m243l0305o289q171j836J01583Q4202
$$ plain form
18860 405376 363244 418338 396061 328088 346788 254687 237641 269777 259047 199752 153175
18849 153175 97573 240730 305797 298795 371413 469399 475635 463008 499702 343450 242057
18838 242057 157117 87639 132000 158804 238301 384097 366234 249494 176914 189346 161627
18827 161627 128496 136915 184190 141722 181068 132167 141271 190285 113285 43477 85014 174099
18815 174099 119897 123496 146248 104813 75566 57131 78012 106184 189363 250535 186253 170159
18803 170159 165233 242929 341489 342911 287024 272103 371265 411484 390341 446348 453366 459849
18791 459849 363935 377847 405056 349421 269844 238507 354761 347539 427177 474377 475154 425568
18779 425568 349245 260722 310651 500426 539852 535609 505304 499015 490844 489008 590591 674793
18767F74793K56753R9014J39269j8128p392J7434j27882q2966K9861M621N2414
18756A037791J67415O5989r985L3345J45991K51227L33859K45062J77237K86150
18746B734081L73583M85048N96915O06511O76505O46802P59810Q39838O99634
18737H418727N98550N72087P37122M45236J79887n3411P9674N3933J06107K61165
18727A1399077M14472P66550J067560J315925J678076K076784K646298L636188
18719B5000930M460837N272837N696370N454067M742610L920307K888531J942607
18711E9379096K06398j324924l430070o444096o499760n546480m155563j581343
18703C0603258J006334L053221M160144M595877M385170L887875K954060J926570
$$ plain form
18767 674793 931546 1030560 1169829 1151701 1144309 1161743 1033861 950895 980756 985377 1037791
18756 1037791 1205206 1271195 1261210 1294555 1440546 1691773 2025632 2270694 2447931 2734081
18746 2734081 3107664 3592712 4189627 4796138 5472643 6119445 6879255 7719093 8418727
18737 8418727 9017277 9589364 10326486 10771722 10951609 10898198 10977872 11031805 11137912 11399077
18727 11399077 11813549 12580099 13647659 14963584 16641660 18718444 21364742 25000930
18719 25000930 29461767 34734604 40430974 45885041 50627651 54547958 57436489 59379096
18711 59379096 59585494 58260570 54830500 48386404 41886644 36340164 32184601 30603258
18703 30603258 31609592 34662813 38822957 43418834 47804004 51691879 54645939 56572509
18695E6572509L11127j373479l151134o261282o989232o374053n413390l799710
18687B3521356k165138j211212o59095k20350N6159R0952L1983j27112j38695
18678A9178848k85370l48403j98464k10519p7730L29290O01169Q83983J197154
18669B1069958J645007J975038K637981L516822M507392N420183N698655N678214
18661E2149250M965212M100215K943866J928325L84954j397475l323041o686450
18653E5064856p242603o354537n027682k160822O00187K610879M130626M753150
18645D6374054M608727M138947L196684J811777J76669j587376l247712o735229
18637D8736541q181534p662514o910487n277523l536425k367603j640536j015992
$$ plain form
18695 56572509 56883636 55510157 52359023 46097741 39108509 32734456 27321066 23521356
18687 23521356 21356218 20145006 19485911 19265561 19321720 19412672 19444655 19317543 19178848
18678 19178848 18893478 18545075 18346611 18136092 18058362 18387652 18988821 19872804 21069958
18669 21069958 22714965 24690003 27327984 30844806 35352198 40772381 46471036 52149250
18661 52149250 57114462 61214677 64158543 66086868 66471822 65074347 61751306 55064856
18653 55064856 47822253 41467716 36440034 34279212 34879399 37490278 41620904 46374054
18645 46374054 50982781 55121728 58318412 60130189 60306858 58719482 55471770 48736541
18637 48736541 40555007 32892493 25982006 20704483 17168058 14800455 13159919 12143927
18629A2143927r22387p81408n43473m50542n16907n46820m19589l44229k49213
18620G369359k05084j93764k78853k10639j20097j14393j74719j87574j66747
18611E717489k70762l47398k66132l35128k48036k55737q8769k12491k08426j57315
18601C327295q6496r0984j59752q5322k6832o473j06250r1476j76055j07661o8975
18590B321019j15210p2190k8445k42365j48448m3104r8407J2622j29204l019k9957
18579A423292p4750p5584m5468o6458j14404k2641J11746J20155j14169J8837
18569A160556j30678q1007k3098l9980j16799J4351m9481j0608J27444K793o8068
18558G85425J17330J02773n5118r5961k6564l4542J22251p4975j04559M1389M0244
$$ plain form
18629 12143927 11221540 10440132 9896659 9446117 8929210 8382390 7962801 7618572 7369359
18620 7369359 7164275 6970511 6691658 6481019 6360922 6246529 6071810 5884236 5717489
18611 5717489 5446727 5099329 4833197 4498069 4250033 3994296 3905527 3693036 3484610 3327295
18601 3327295 3240799 3149815 2990063 2904741 2877909 2871436 2765186 2673710 2497655 2389994 2321019
18590 2321019 2205809 2133619 2105174 1862809 1714361 1671257 1572850 1585472 1456268 1453249 1423292
18579 1423292 1348542 1272958 1227490 1161032 1046628 1023987 1135733 1255888 1141719 1160556
18569 1160556 1029878 948871 925773 885793 768994 783345 733864 723256 850700 853493 785425
18558 785425 902755 1005528 950410 854449 827885 793343 915594 840619 736060 777449 817693
18547H17693J2201l5742j60334o5012K965l1093l0698p311j0278J7846j48R4008
18535F04097m857p1029J4457O9345m8520j25301j8109k0869M4997K8842L5913
18524E08966o6020j2389M7728P1853p6361m0116r1341m4039J8479p2810q5981
18513A57969K9114O4681m2220k1173R1029K196j4587L9772J25100j3130J3128
18502D31879j02137n2876K3218m5174j0174J27768L6434O2332n0373o6886N1084
18491D05095l2050K9320L5809K6563j4662l1329m94O7472Q1559K8432L8617j40222
18479D94110r0518P257o2569j80075q9646J04859L3362k876m6845j8752M5153
18468A93460m0933K3219n2260o4110r019J49828J8161o5799J7186L3296R3799
$$ plain form
18547 817693 829894 794152 633818 568806 571771 540678 509980 502669 492391 510237 510089 604097
18535 604097 599240 528211 542668 612013 563493 438192 420083 399214 444211 473053 508966
18524 508966 442946 430557 478285 550138 473777 433661 342320 298281 316760 243950 157969
18513 157969 187083 251764 209544 188371 279400 281596 267009 306781 431881 418751 431879
18502 431879 329742 276866 300084 254910 244736 372504 408938 471270 420897 354011 405095
18491 405095 373045 402365 438174 464737 450075 418746 418252 485724 567283 595715 634332 494110
18479 494110 403592 410849 348280 168205 78559 183418 216780 213904 167059 148307 193460
18468 193460 152527 175746 123486 59376 50357 200185 218346 152547 169733 203029 296828
18457B96828o8809K518o365l4616P7665p6930j01578N2806J5110o6662N2052M4474
18445A86493K9028R379j69M1019J991N3033j9240j55224j4591l4316L1523P6001
18433B04927p9272K3905j20310m8308J907P313J21404J05869R6449k7341P34J84875
18421D72152m9288j92432j4173J23290j9865l3805j0460m5710j40741j69590R9584
18410A8962K6016n3066J0782J45867j1982l3241o1467k2859J37761N6327R213
18399B22313n8008m0557k8790q232M1828Q7024p620q9567j28898Q0602j9963L035
18387E3167k6933p9047J7772O0001O8398J24663M4257J12998K7166j7368K1187
18376D06261q5408m3365j32951n1051m1411m158N9851N7566J44547M1695q905
$$ plain form
18457 296828 228019 230537 224172 189556 267221 190291 88713 141519 156629 89967 142019 186493
18445 186493 215521 224900 224731 265750 267741 320774 301534 146310 131719 97403 128926 204927
18433 204927 125655 149560 29250 -19058 -17151 -9838 111566 217435 313884 286543 287277 472152
18421 472152 422864 230432 216259 339549 319684 285879 275419 229709 88968 -80622 18962
18410 18962 44978 -8088 2694 148561 136579 103338 41871 19012 156773 213100 222313
18399 222313 164305 123748 94958 86726 128554 215578 207958 118391 -10507 70095 50132 53167
18387 53167 26234 -52813 -35041 24960 93358 218021 262278 375276 402442 385074 406261
18376 406261 320853 277488 144537 93486 52075 47917 107768 165334 309881 351576 342671
18365C42671m4795o0655j0537J8494J02301m828P941j34609o3610m114M2171J74600
18353C65030Q2173o3370n8948R167n5220K4407N4891J06554R9715k2452k05205
18342C36742k015N6397O659K1946o7416n8383q6912Q033M5102m0309J5419K8740
18330B64003O0346Q7682J18502j33365k6890n8067q6259o5199R8882j1294q2768
18319A65573L1972p0441r3359k4874M4857Q2948r6581q453Q2844J25414P1912
18308C11812k0585Q2092o4010m6220p8277o3003J22541Q2797J4226k6452n2447
18297B62474L9135K8458J10360l4163l9797Q5320L1112n5694r2190l8985K2218
18286C18248J4726o3614P7022m031j15699m3607K6579J11413Q5708o6485K9097
$$ plain form
18365 342671 297876 237221 226684 245178 347479 342651 350592 215983 152373 148259 190430 365030
18353 365030 447203 383833 324885 334052 278832 303239 358130 464684 564399 541947 336742
18342 336742 334727 391124 397783 419729 352313 293930 207018 215051 260153 219844 235263 264003
18330 264003 324349 412031 530533 397168 370278 312211 225952 160753 259635 248341 165573
18319 165573 197545 127104 33745 8871 53728 136676 40095 31642 114486 239900 311812
18308 311812 291227 373319 309309 263089 184812 121809 244350 327147 341373 314921 262474
18297 262474 301609 330067 440427 406264 366467 451787 482899 427205 335015 296030 318248
18286 318248 332974 269360 346382 342351 226652 183045 209624 321037 406745 340260 369357
18275C69357Q8095j48433q4599L6235M8023O8517N146k1724J7717k1069m6363
18264C10902l6222P5279P4236j3466r8231J9868L9926o1189M8672n2129k2566
18253B85080n4267L4387N9007q2591R2130J8792O443l2158j36991M1644L6112
18242B67588J7790j16532N1353M2663R7197l1942M0757L580Q930j3144J80262
18231E48502j9814q235p030j21092j79236m93j5000L3673j00938K1695J00968
18220B53000J17140k3637j60m8522o8871q0982K7535Q1088J05186k9613Q971J3135
18208C54270J8208Q5949R5169K1395l0474L4883j8947o3457m2664J2363N5403
18197E22098M985M4911M554l3284j29118r9464M1720J53016n6015j9065L3036
$$ plain form
18275 369357 457452 309019 224420 260655 308678 377195 382341 360617 378334 357265 310902
18264 310902 274680 349959 424195 410729 312498 332366 372292 311103 359775 307646 285080
18253 285080 230813 265200 324207 241616 333746 352538 358981 326823 189832 231476 267588
18242 267588 285378 168846 220199 262862 360059 328117 368874 372454 381384 368240 548502
18231 548502 528688 520453 513423 392331 213095 212602 197602 231275 130337 152032 253000
18220 253000 370140 346503 346343 297821 228950 147968 175503 256591 361777 332164 341135 354270
18208 354270 372478 458427 553596 574991 544517 579400 560453 496996 454332 466695 522098
18197 522098 527083 571994 576548 543264 414146 314682 356402 509418 453403 434338 467374
18186D67374N0687J03934M9231J6437j26142j26929r180J7598j0276J32436M4067
18175F09237j10946P4771J58436J02879M926j13459M846M098k9998k102l0708
18164F71980L4083R8705q3562o7119J4261J35143J68819O8137L1836o2637Q5867
18153A095513J84817O0291L7936Q7500K40885J76448J06324K18103K57312K58405
18143B723534L34782M78156L60237L22197O04740P72052O89703J138072J145668
18134H569141J219431J064729Q81904R84311R80470O33452K00938m22664j083628
18125A3028084j119800q72486p00647l21902k4205L32330O72548R37671J395931
18116A3327524K057368L117885M626401P167926J0172602J1832765J1409863Q982901
$$ plain form
18186 467374 518061 621995 671226 687663 561521 434592 425412 443010 432734 565170 609237
18175 609237 498291 573062 731498 834377 839303 725844 730690 734788 704790 702688 671980
18164 671980 706063 804768 721206 654087 668348 803491 972310 1040447 1072283 1009646 1095513
18153 1095513 1280330 1340621 1378557 1466057 1706942 1883390 1989714 2207817 2465129 2723534
18143 2723534 3058316 3536472 3896709 4218906 4823646 5595698 6285401 7423473 8569141
18134 8569141 9788572 10853301 11735205 12719516 13699986 14333438 14534376 14111712 13028084
18125 13028084 11908284 11035798 10335151 10013249 9989044 10321374 10993922 11931593 13327524
18116 13327524 15384892 18502777 23129178 30297104 40469706 52302471 63712334 72695235
18108G2695235M826777J104247K607902N260736M550762j1741738k4968699j9154473
18100C5180749j1371437o410781l675242k083841j496005j126694p21118p29395
18092G566236o14498l52660l03808l57666j44026M4707n866j07363j13246r5154
18082E516656o5017j25306j78953m1972k20564l37860k59397k27120j57136k29914
18072C673417j63761p7885j23943j99389j13215k23425j69464j50323j46927q9526
18062B215559j22856o6144j09535m54p3180k53145j63079q7087m1388j3644J2552
18051A297599L8496o3945j40687j20644l0914J13766m08j81871m9730l2M0695
18040I02325L3316Q9007K1758k06497J0269j77601j09097O0480J54665L1849o6707
$$ plain form
18108 72695235 77522012 78626259 81234161 86494897 91045659 79303921 54335222 35180749
18100 35180749 23809312 17398531 13723289 11639448 10143443 9016749 8295631 7566236
18092 7566236 6951738 6599078 6295270 5937604 5793578 5838285 5832419 5725056 5611810 5516656
18082 5516656 5451639 5326333 5147380 5105408 4884844 4546984 4287587 4060467 3903331 3673417
18072 3673417 3509656 3431771 3307828 3108439 2995224 2771799 2602335 2452012 2305085 2215559
18062 2215559 2092703 2026559 1917024 1916570 1843390 1590245 1427166 1340079 1298691 1285047 1297599
18051 1297599 1336095 1272150 1131463 1010819 979905 1093671 1093263 911392 861662 861630 902325
18040 902325 935641 1024648 1046406 839909 850178 672577 563480 623960 778625 810474 743767
18029G43767j39017j5745O8919j1826j26092L0215n334m7840m2226o2905l1051
18018C60865R1212r4511q9162J4354R9928o2034m467J26116q3886j52208L0949
18007B37156J71997O8526P4794j02511j57584k2212P3895q0558j02133O7503R2555
17996C21428J179k6692M519n9265k688N6808K0970m0729L7125K06317Q5419m7482
17984E56909j15506j34940r2309L9149L7407r4540M476j7052r3064M2750O0549
17973A93829J5501Q619n5424n773m2486q4741o528J03757O7688M2939k9856q6064
17961A21461N6590J9038M8222r914j41832K2017J824O8092N2987J34046K6710
17950C99241N5501j48436j63422k051N5061L3154l1432O6833P9542k1817r1956
$$ plain form
18029 743767 604750 589005 657924 646098 520006 550221 544887 497047 454821 391916 360865
18018 360865 452077 357566 268404 282758 382686 320652 316185 442301 358415 206207 237156
18007 237156 409153 477679 552473 449962 292378 270166 344061 263503 161370 228873 321428
17996 321428 322607 295915 300434 241169 238481 295289 316259 275530 312655 518972 604391 556909
17984 556909 441403 306463 214154 253303 290710 196170 200646 183594 90530 133280 193829
17973 193829 209330 217949 162525 156752 114266 29525 22997 126754 194442 237381 207525 121461
17961 121461 178051 197089 245311 235397 93565 115582 117406 185498 238485 372531 399241
17950 399241 454742 306306 142884 140833 195894 229048 197616 264449 343991 322174 230218
17939B30218R4612N0189j64313j27389r8293J01307J78356o1440j19189M9101
17929A33159m479R305j1496L0168J9099q6035J5922p0881o5301O0713J1562L250
17917D4986N964j47665J02436J53396l3898M2063M5531O0651Q191o7021m6942
17906A67692n2239Q6050R7520o1947N1511l8301q6516l8367m3382L7519J3906
17895A33446L4389P754j17694k5323J655K4976J6264N3069n5939P67M1992P3529
17883A88885K1903K0712j34150o64N6935L8181k05440k8124J25063N9762M0447
17872A83510o6441R68L4444l3365O1671l2799k8027k0096p2773R894P7725P8548
17860A93259j902L277L363O2595l2103K6267j06249j53747K5583K0520N6480J5812
$$ plain form
17939 230218 324830 375019 210706 83317 -14976 86331 264687 203247 84058 133159
17929 133159 128680 137985 126489 156657 175756 89721 105643 34762 -30539 30174 41736 44986
17917 44986 50950 -96715 5721 159117 125219 167282 212813 273464 281655 214634 167692
17906 167692 115453 201503 299023 237076 288587 250286 163770 125403 82021 119540 133446
17895 133446 167835 175589 57895 32572 34227 59203 75467 128536 72597 73364 115356 188885
17883 188885 210788 231500 97350 96686 153621 191802 -13638 -41762 83301 143063 183510
17872 183510 117069 118037 152481 119116 180787 147988 119961 99865 27092 36986 114711 193259
17860 193259 191357 194634 197997 260592 228489 254756 148507 -5240 20343 40863 97343 113155
17848A13155l1320O7820R7985L4842P6926k8365j05292p5207P9496k6530R3235
17837B96745j4195j14991o3748l0826R7936K43573J35330r8009j29884n5479o4976
17826B01476O7734N8855Q0622O6781j45005m4613O8159P0313O9975P0294Q3657
17815F48248j15797j15359n5075l7458l5158M1727j02664j08594N9446m9281p3645
17804E6390J84418J58339o2985q4914j20671q1134j8606M7872M3181l3578P7547
17793A65859Q8683j09736n1617j9944j55471O6763K2063l0711j2288O8776o5070
17782c2693J22674M1432k707r344P8324K7020m1970n6709j788P1266N7461M6028
17770B98994J54107J1662j01144N8329N3569p26m073J23273O7872j09039r2939
$$ plain form
17848 113155 81835 149655 247640 282482 359408 331043 225751 150544 230040 203510 296745
17837 296745 282550 167559 103811 72985 170921 414494 549824 451815 321931 266452 201476
17826 201476 269210 328065 408687 475468 330463 285850 354009 424322 494297 564591 648248
17815 648248 532451 417092 362017 324559 289401 331128 228464 119870 179316 130035 56390
17804 56390 240808 399147 336162 251248 130577 49443 30837 78709 121890 88312 165859
17793 165859 254542 144806 93189 73245 -82226 -15463 6600 -24111 -36399 32377 -32693
17782 -32693 89981 131413 128706 119362 197686 224706 182736 126027 124239 195505 252966 298994
17770 298994 453101 464763 363619 421948 475517 474791 470718 593991 661863 552824 459885
17759D59885j12847l2940N8891M2094j9252p3073o5297j05766l4072L1566q0880
17748F8309J9075q4779k4732K3731J65324p5540k11074n3696J84551J13248j11292
17737A3125n5313J21452Q2931m1031l5023Q775O694j52446P0583Q8064M978L2631
17725A45420m7149K5848m1792M487q5261q0358J1318J69322J17050m6627j24887
17714D7371j18986N013P6642m5993L1043M4663L1251P2995M8274o4914k07752
17703h0393j45797M0710O8148l7950j09148R7394L8827R5074K00156j1586l2887
17692A22548m8415m0107p5734l3472j7006O1729P1030o4142k0458k3127Q4997
17681A7843Q0068K1322k6125k2200l5131R1477R3452J0224o1119j80831j46582
$$ plain form
17759 459885 347038 314098 372989 415083 395831 322758 257461 151695 117623 149189 68309
17748 68309 87384 2605 -22127 1604 166928 91388 -119686 -173382 11169 124417 13125
17737 13125 -42188 79264 162195 121164 86141 94916 101610 -50836 19747 107811 112789 145420
17725 145420 98271 124119 82327 86814 1553 -78805 -67487 101835 218885 172258 47371
17714 47371 -71615 -66602 10040 -35953 -4910 39753 71004 143999 192273 127359 -80393
17703 -80393 -226190 -185480 -117332 -155282 -264430 -167036 -128209 -33135 167021 155435 122548
17692 122548 74133 34026 -41708 -75180 -92186 -30457 40573 -23569 -44027 -67154 17843
17681 17843 97911 119233 93108 70908 35777 127254 220706 230930 169811 -11020 -157602
17670a57602P5482P717j5515N863j3080K4359N5354K7327J5268j03363m3217J781
17658a19626k808j6411m6133k1893J27405J17699J05054j8159q9880J1744m0410
17647F582m3475j4171j3080m4697L7423r1315r1075J32986P1034M2387K002j02216
17635a07615n0137J01869J36932N4837J4125l638j4711m368L8526j62822j27687
17624a24689n1314J04983m3149j5185L7336q866N8575J2426p2689j5155K5614
17613i2113m2040r897J04459Q4196J7308n8623R546P3222J29922j69218o2897
17602a6135J16525O4424j66989l5162Q6777j20312L6091L7164k0571M117M7113
17591C3042p1201L1575K2879m0210n9001j065J74195n697j44554q6497L6242R8570
$$ plain form
17670 -157602 -82120 -74403 -89918 -84055 -97135 -72776 -17422 9905 25173 -78190 -121407 -119626
17658 -119626 -122434 -138845 -184978 -206871 -79466 38233 143287 125128 35248 46992 6582
17647 6582 -36893 -51064 -64144 -108841 -71418 -162733 -253808 -120822 -49788 -7401 -5399 -107615
17635 -107615 -157752 -55883 81049 135886 150011 146373 131662 127294 165820 2998 -124689
17624 -124689 -176003 -71020 -114169 -129354 -92018 -100884 -42309 -29883 -102572 -117727 -92113
17613 -92113 -134153 -144050 -39591 44605 61913 3290 12836 86058 215980 46762 -16135
17602 -16135 100390 164814 -2175 -37337 49440 -70872 -34781 2383 -18188 -14071 33042
17591 33042 -38159 -6584 16295 -23915 -82916 -83981 90214 84517 -60037 -146534 -110292 -11722
17579a1722J9029q6585j7802L3344N9694J810j6415j00490M693P8753J5522L4050
17567A3881J21614k1399j6634p181o3260o5330n0835O8946l4843q5929j2503N8726
17555i4747N2611L4161L3723p514J50830p2017P7156Q0842k691k0534k4073r7955
17543A09792j21576j02340k3828P5782L7263J39228k0619P679n1692o7945J07354
17532H9098o565k0633K0076m9683j11200o1917j9813R4544N4788L1692k3181k6568
17520b9362J4987O4995o9023r3250m0693Q1375K0918m8985M2013m2787O8551j6190
17508d7451L3952N3504M2673P419N0864k8159k1065J40002R5602l393n2871l7616
17496B33461k40601o0199J36812K1640r711p060J3762q3217J1596L9016O4377
$$ plain form
17579 -11722 7307 -79278 -97080 -63736 -4042 -2232 -18647 -119137 -114444 -35691 -20169 13881
17567 13881 135495 114096 97462 90281 27021 -38309 -89144 -20198 -55041 -140970 -153473 -94747
17555 -94747 -42136 -7975 25748 18234 169064 97047 174203 255045 252354 231820 207747 109792
17543 109792 -11784 -114124 -137952 -62170 -24907 114321 93702 101381 49689 -18256 89098
17532 89098 82533 61900 81976 32293 -78907 -140824 -160637 -66093 -11305 20387 -2794 -29362
17520 -29362 -14375 50620 -18403 -111653 -152346 -70971 -50053 -99038 -57025 -99812 -31261 -47451
17508 -47451 -13499 40005 82678 90097 140961 112802 91737 231739 327341 323948 271077 233461
17496 233461 -7140 -67339 69473 91113 81402 74342 88104 4887 16483 55499 119876
17485A19876J3739o0423q619m20O1508o1822j3297l6064k2957M9460M8858J5965
17473A05804m37p8019j05876J8032k7428r737J9366j0340n5359M0033N0675L4691
17461a8595j2539M169O3504l5063R540m2167j04588r9195J6451K52066K04245
17450B37828N0200j43553k2934R1759N6873J3183J13274J70832l3409N609L1651
17439E71313n7159l5876l884j06372j01912o1943J9932P6045m4357R8182N6757
17428D10726N2838m7280m3467o9611j32663K8172j05588L1816J11130K2566r3951
17417A64688n9456m1361O3699k5885o9127j9090j245J42028J24829j48564j38028
17406g512k9028J41882J26113j76115j57475J04371O2892J99827J22068Q0170
$$ plain form
17485 119876 133615 73192 64573 64153 125661 63839 50542 14478 -8479 40981 89839 105804
17473 105804 105367 27348 -78528 -60496 -87924 -97661 -78295 -88635 -143994 -103961 -53286 -18595
17461 -18595 -31134 -26965 36539 1476 11016 -31151 -135739 -234934 -218483 33583 237828
17450 237828 288028 144475 121541 213300 270173 283356 396630 567462 534053 539662 571313
17439 571313 514154 478278 474394 368022 266110 204167 224099 300144 255787 353969 410726
17428 410726 463564 416284 372817 303206 170543 198715 93127 124943 236073 258639 164688
17417 164688 105232 63871 127570 101685 32558 13468 12223 154251 279080 130516 -7512
17406 -7512 -36540 105342 231455 55340 -102135 2236 65128 264955 387023 467193
17396D67193R7368R0848K6930l4417P620J7571n3700m8582K0684K3165k1973K9888
17384F22595j24789r4766n7222J9940O8446N8134l2835P8011J36359l0600j57918
17373D85355j80271K1891N0849j78858j14995P0957J30920O3915K5802m7265J00246
17362D28546J18434J8171q0079n0857R407q5496R996Q8789J06370O2242j9119
17351F06404J31508j9162j9868K05753J31318N7202J85520K9154Q9751J85386
17341A582966N4205J51122Q4160J9269J02653K10398J89951K26148K54737K78435
17331C154044J99431M02970M95739P23795P71439Q88729J090678R93782J043031
17322I763638J374499J442803J289697J259026J233598J044257N20965L87683
$$ plain form
17396 467193 564561 655409 682339 647922 655542 673113 619413 570831 591515 614680 592707 622595
17384 622595 497806 403040 345818 365758 434204 492338 459503 537514 673873 643273 485355
17373 485355 305084 326975 377824 198966 83971 154928 285848 349763 375565 328300 428546
17362 428546 546980 565151 485072 434215 443622 358126 368122 456911 563281 625523 606404
17351 606404 737912 718750 698882 904635 1035953 1093155 1278675 1307829 1397580 1582966
17341 1582966 1637171 1788293 1872453 1891722 1994375 2204773 2394724 2620872 2875609 3154044
17331 3154044 3353475 3756445 4252184 4975979 5747418 6636147 7726825 8720607 9763638
17322 9763638 11138137 12580940 13870637 15129663 16363261 17407518 17928483 18316166
17314A8316166J26031j72508l74568m00078m75029l37498j13607L41878R77987
17305A7888774J774606K745540M165580N674270P284958Q475887R280408R738762
17297F7028785R739353R319899Q817152O716083L424331j403781n829443p346752
17289I0465627q855261r156061j0924928j1893935j0875872q849344o147003l895276
17281A9867947k581397j793270j078813n82176k90396j07802K06499K88022M60770
17272A4389384N63114Q85053Q56391R19729R92255J031663J013782R95856Q71957
17263B2519184N36543L02269K4682l52309n47626o13144o02927p04734p21078
17254A9840860l82191J52141O28126J401915K141716L424716M807739O382139
$$ plain form
17314 18316166 18442197 18269689 17895121 17495043 17020014 16682516 16568909 16910787 17888774
17305 17888774 19663380 22408920 26574500 32248770 39533728 48009615 57290023 67028785
17297 67028785 76768138 86088037 94905189 101621272 105045603 103641822 97812379 90465627
17289 90465627 81610366 72454305 61529377 49635442 38759570 29910226 23763223 19867947
17281 19867947 17286550 15493280 14414467 13832291 13541895 13434093 13640592 13928614 14389384
17272 14389384 14952498 15837551 16693942 17613671 18605926 19637589 20651371 21647227 22519184
17263 22519184 23055727 23357996 23382678 23030369 22482743 21869599 21266672 20561938 19840860
17254 19840860 19458669 19610810 20238936 21640851 23782567 27207283 32015022 38397161
17246C8397161P696221Q561274Q887983Q827197Q492386Q177959O530167L564464
17238I9134812o46836n318551p028103q233353q553495j0138881j1264937j0334625
17230C7616031q680962o209515m144711k587957j760956j314889q73230p14876
17222A1328935m46705k23646j81583k56800r7620j01288j45683j78535k95345
17213I401730l43501l37601l10360m57319n42614m49105l01002k75614k23049
17204F161565m44564m09923j62727o8886k99687l61318j27432k9085m9290j68599
17194D040054j98806k77748j40449j50543n0685r7457n7215m2277j24205q0441
17184B820228r8276j58806q4210p8828r2551p8139l8373j5081q4788r2139m0512
$$ plain form
17246 38397161 46093382 54654656 63542639 72369836 80862222 89040181 95570348 99134812
17238 99134812 98487976 93169425 86141322 77907969 69354474 59215593 47950656 37616031
17230 37616031 28935069 22725554 18580843 15992886 14231930 12917041 12043811 11328935
17222 11328935 10882230 10658584 10477001 10220201 10122581 10021293 9875610 9697075 9401730
17213 9401730 9058229 8720628 8410268 7952949 7410335 6961230 6660228 6384614 6161565
17204 6161565 5717001 5307078 5144351 5075465 4775778 4414460 4287028 4257943 4208653 4040054
17194 4040054 3841248 3563500 3423051 3272508 3221823 3124366 3067151 3024874 2900669 2820228
17184 2820228 2721952 2563146 2478936 2400108 2307557 2229418 2191045 2175964 2091176 1999037 1958525
17173A958525q8430j75807k22725R4367Q9560j43868l9575n0503j41587p4269
17163A205688o9646m0658M3972j2194j30912j21173J07364K7159L8400K2123N388
17152A075511r1835r6168j11987J21927r493j9155m1006J3939M2696O1022m8033
17141H97418q240n379J7975r5269r3232K6932M4993K8632m6320k4573J09967J80474
17129A033378O0753J1429l6576j2049M5628k5544J0403k4269m8895N3004L2551
17118A099813R6987o0267r1416p6229O6449j16236l93808j62019K2137n3989J05097
17107D36519k3738j67954l1886M5311o4800Q3410J17491O5942P1174M7154l8751
17096E39872j6321j3725m0387N355O7368L2703p2954o456j940R8754j2786n8924
$$ plain form
17173 1958525 1870095 1694288 1471563 1565930 1655490 1511622 1472047 1421544 1279957 1205688
17163 1205688 1136042 1095384 1139356 1127162 996250 875077 982441 1009600 1048000 1070123 1075511
17152 1075511 983676 887508 775521 897448 887955 868800 827794 841733 884429 945451 897418
17141 897418 889178 883799 901774 806505 713273 740205 785198 813830 767510 742937 852904 1033378
17129 1033378 1094131 1105560 1068984 1056935 1102563 1077019 1087422 1063153 1014258 1067262 1099813
17118 1099813 1196800 1136533 1045117 968888 1035337 919101 525293 363274 385411 331422 436519
17107 436519 412781 244827 212941 258252 193452 276862 394353 460295 531469 578623 539872
17096 539872 523551 509826 469439 474794 542162 574865 501911 495455 493515 592269 579483 520559
17084E20559j8404o4298j27061m0641J04969p3502K2817L9572R9372K702m0428
17073D25657Q5517P690j04546o953J03626j7261P6673O4754k7946r0664O3323
17062E79870J27848J35750k9253j62835n1915r8981J514o6365m5888o6070L9066
17051C62741j12505N9089K7620n4821M0715J21457N3815k6585j3260O6554j09039
17040D15781j32597l6608j09967n2613P1914K12355J27054n0967j3959R7936R5543
17029F23872q0925j11849j0367o9390j10547n034l8459L5759j02761o7147R5290
17018A58442p5451k0320Q57p7589o1888J36372R5540M1644p2307P505P2086L7702
17006B42593K1936r1811j9811R2189l0004j32566n8251j2873m8205K7183N7620
$$ plain form
17084 520559 502155 437857 310796 270155 375124 301622 324439 364011 463383 466085 425657
17073 425657 511174 518864 414318 407365 510991 493730 570403 635157 607211 516547 579870
17062 579870 707718 843468 814215 651380 599465 500484 501998 435633 389745 323675 362741
17051 362741 250236 309325 336945 282124 322839 444296 498111 471526 458266 524820 415781
17040 415781 283184 246576 136609 83996 155910 368265 495319 444352 430393 528329 623872
17029 623872 542947 431098 420731 351341 240794 235760 197301 233060 130299 63152 158442
17018 158442 82991 62671 63528 -14061 -75949 60423 155963 197607 125300 132805 204891 242593
17006 242593 264529 172718 152907 245096 215092 82526 24275 11402 -36803 -9620 48000
16995D8000N5493Q659J48392L8613l6023j5611l507j9996j11733n2994J67872
16984B27165P5745n4869m5796p8292J1157k2340R5911K9691J4359J05724j8258
16973C40197j29784j16984p2976M0256K3236L4515L2250M0001K0387K9416j46940
16962I3574k7892l5399O0130N4729k4141j01658j72353J35782J20243k8248J26863
16951B01630J1352k7374N907j35905n8433Q371Q334K7082q449q2967K9710J8992
16939a750N9124n7173k9365L5051J42501k43J4443n3087o0910k4733J92651N1782
16927B68291l5239j3574j14398J8894m7849L6109r579n573J5350P7288O9143j01214
16915A57649l4927k5936O430k7783k5067j01856N9612K08185J18672j06727n5494
$$ plain form
16995 48000 103493 112152 260544 299157 263134 247523 244016 224020 112287 59293 227165
16984 227165 302910 248041 202245 123953 135110 112770 208681 238372 252731 358455 340197
16973 340197 210413 93429 20453 60709 83945 118460 150710 190711 211098 240514 93574
16962 93574 65682 30283 90413 145142 121001 19343 -153010 -17228 103015 74767 201630
16951 201630 212982 185608 191515 55610 -2823 5548 13882 40964 32515 -50452 -20742 -1750
16939 -1750 57374 201 -29164 5887 148388 148145 162588 109501 48591 23858 216509 268291
16927 268291 233052 219478 105080 123974 76125 112234 102655 97082 112432 189720 258863 157649
16915 157649 122722 96786 103216 75433 50366 -51490 8122 216307 334979 228252 172758
16904A72758J00935k8810J5671J842n3933j56024k9069N3799p013p8961q7696
16893i6501P2057K34115L7402j19773j99717O5387M9182O9323J3048j65563k0225
16882f1265Q9025K018n5022K3567K3957n2561r1164k8795O6469J27409N0306K2811
16870A16755M510O6331r3764j6032J17008M997r7044n1115J6733M1546k6670j60349
16858g7094N4214P2998p091K6271K4093J52769J40513R4227o6200q0044j2962
16847C21694J0124j5714k9937j56621j9005k1971l2968Q6896K0278j76269j3950
16836b7443O6708M3582K3878r1064Q986P3987k480n5819q2398j0557O4757n3883
16824d1746j8639J41255q6119o9247k0237j4031r8887M1590J28529O2145J17143
$$ plain form
16904 172758 273693 244883 260554 262396 208463 52439 23370 77169 70156 -8805 -96501
16893 -96501 -24444 209671 247073 127300 -72417 -7030 42152 111475 124523 -41040 -61265
16882 -61265 27760 29778 -25244 -1677 22280 -30281 -121445 -150240 -83771 43638 93944 116755
16870 116755 121265 187596 93832 77800 194808 199805 102761 51646 68379 109925 83255 -77094
16858 -77094 -22880 50118 43027 69298 93391 246160 386673 480900 414700 334656 321694
16847 321694 331818 316104 286167 129546 110541 88570 55602 142498 162776 -13493 -27443
16836 -27443 39265 82847 106725 15661 24647 98634 96154 40335 -42063 -52620 12137 -41746
16824 -41746 -60385 80870 -5249 -74496 -94733 -108764 -207651 -166061 -37532 24613 141756
16813A41756r7893n8409j5833M6584K9934J24023j9729n2004l4035K3960R212
16802I7566M8371J8055P0600j21541j16410l774O2785N2975j2042P1590m0270
16791A27905J27681N8352m5107n614L6733p8461j56294j06637L7566m5552l2124
16780h1552j16874K0416O5124O6875N64O2409O2925Q4821J10826L3617J8061J6738
16768C43950l7106n2229M2169O7730L0401J54229k9372r6827j45041l1602Q0893
16757C27195J320o9117j16704j54958q377O0603J9203M688M8698q482r4623L8249
16745D7695j27595K5527J70878r041p4614n5905m5042M4785K5510J11030K7041
16734A40269j4763J8633j5416O076L368J15332J13055K078j65574n2187n5075
$$ plain form
16813 141756 43863 -14546 -30379 16205 46139 170162 150433 98429 64394 88354 97566
16802 97566 145937 163992 234592 113051 -3359 -7133 55652 108627 96585 168175 127905
16791 127905 255586 313938 268831 263217 299950 221489 65195 -41442 -3876 -49428 -81552
16780 -81552 -198426 -178010 -112886 -46011 -45447 16962 79887 164708 275534 309151 327212 343950
16768 343950 306844 254615 296784 364514 394915 549144 519772 422945 277904 246302 327195
16757 327195 328515 259398 142694 -12264 -20641 39962 59165 63853 112551 104069 9446 47695
16745 47695 -79900 -54373 116505 107464 32850 -23055 -68097 -23312 2198 113228 140269
16734 140269 125506 144139 128723 134799 138167 253499 366554 368632 203058 150871 95796
16723I5796J07395K03414L8590n586k2377k0519m5187M9313J4568l0034J75549
16712E60922J02422p519J37949k252o4493m8785j48725j90170j28009n5136J817
16701A58021R1050m0806o2568j20221n3001R9140k9258m6277Q935j32522M7057
16690h0450O2502L2058j16620n2791J17654J54123Q0205q2762o8060m4488J06356
16679A07727n3262p9760j40434Q6313O292K0772m0928O923P2368R5280J22354
16668B03645k7832j36509l6165p7231K2957L1203r1637n560Q392J3356J12147
16657A6766K6148L7053J3954j6783O5373m4785j01236n7391O845L9126p17J37453
16645A21806J72751L7643k08051q398J11922q9987p9335N9384n0653j09001r7650
$$ plain form
16723 95796 203191 406605 445195 439609 417232 396713 351526 400839 415407 385373 560922
16712 560922 663344 655825 793774 791522 727029 678244 529519 339349 211340 156204 158021
16701 158021 249071 208265 145697 25476 -27525 71615 42357 -3920 5015 -127507 -80450
16690 -80450 -17948 14110 -102510 -155301 -37647 116476 196681 113919 45859 1371 107727
16679 107727 54465 -25295 -165729 -79416 -73124 -52352 -93280 -86357 -13989 81291 203645
16668 203645 175813 39304 3139 -74092 -51135 -19932 -111569 -117129 -108737 -95381 16766
16657 16766 42914 79967 93921 77138 142511 97726 -3510 -60901 -54056 -14930 -15647 121806
16645 121806 294557 332200 124149 115751 227673 137686 58351 117735 67082 -41919 -139569
16634a39569k653M6569J28796o3475l0786O8893o8052P1980k6081l5138l1046
16623h0562q8150r5272J09815K1959j847N9562J23640L2289m3865o2720J6768
16612h383m0448j9886k7284m9560j03894J07894L161n1875M2098J06667P4226
16601C2716M7110J02857p9262q6060p5570q9061j552m5984j861O1736J65202O8228
16589I8499L2387j8699o0338k7004J7389R761M107N2862M8737r6774k4167J21386
16577A58146j369q0286j207N751K3815M0619q9507j27838M9835j528R2515o290
16565F2656n3076J0243J01593J1656m6834j51594l887Q7281O7958q533K1124j80516
16553h1929l0361J3671Q8373J71541q4214q9330K0508M590j9528J01875m87j14124
$$ plain form
16634 -139569 -142222 -95653 33143 -30332 -61118 7775 -60277 11703 -14378 -49516 -80562
16623 -80562 -168712 -263984 -154169 -132210 -134057 -74495 49145 81434 37569 -25151 -8383
16612 -8383 -48831 -68717 -96001 -145561 -249455 -141561 -138400 -190275 -148177 -41510 32716
16601 32716 79826 182683 103421 17361 -58209 -147270 -148822 -194806 -196667 -134931 30271 98499
16589 98499 130886 112187 51849 24845 42234 51995 56102 108964 157701 60927 36760 158146
16577 158146 156777 76491 75284 81035 104850 145469 55962 -71876 -22041 -23569 68946 62656
16565 62656 9580 19823 121416 133072 86238 -65356 -69243 18038 85996 77463 98587 -81929
16553 -81929 -112290 -98619 -10246 161295 77081 -12249 8259 12849 -6679 95196 94709 -19415
16541a9415j40251l4879q2048j5575m6765J70824j3415L8825R9986J14890J35582
16530B07759m3906j06312j20275M717Q1812J13687K4439k4543N6413q1019r0866
16519B1906m8988J05407L4180j02244p5874j0771R9838l9434m0769J18938J05008
16508A67197p4683l7661n7770j9062o3783m5721M597J14894Q6073j08073j25779
16497a59771K8146O8743K9416M6425K3631K1074J01947L7281j29872j0502R3740
16486A50258l7848p5834j11357O1672J22914p9072q1814k7897j6955N4052q1478
16475a23359M7666k4972o8812J35894n189p306N3247J14128m9675L6564N3232
16464A61418j23857n9164J3596j64057l4686J57367O0079o3057j20807Q36R2547
$$ plain form
16541 -19415 -159666 -194545 -276593 -292168 -338933 -168109 -181524 -142699 -42713 72177 207759
16530 207759 163853 57541 -62734 -58017 23795 137482 161921 137378 193791 112772 21906
16519 21906 -27082 78325 112505 10261 -65613 -76384 23454 -15980 -56749 62189 167197
16508 167197 92514 54853 -2917 -21979 -85762 -131483 -126886 -11992 74081 -33992 -159771
16497 -159771 -131625 -62882 -33466 12959 36590 57664 159611 196892 67020 56518 150258
16486 150258 112410 36576 -74781 -13109 109805 30733 -51081 -78978 -95933 -41881 -123359
16475 -123359 -75693 -100665 -169477 -33583 -38772 -46078 7169 121297 71622 108186 161418
16464 161418 37561 -21603 -8007 -172064 -206750 -49383 10696 -52361 -173168 -172332 -79785
16453g9785o1704R272Q1023j2413J00344J5K5486M796M175k9185o5266P248m1915
16440e7909r6424j27559J07908L4587j39799N81L00033K13301j16488m1172j3911
16429F3148J50400l2453p9202R900K6297o2768r4168J73634J27331O046k9671
16418B58494l8326p3211q8024q1316J2880N0682M7159N6448n3811j32400o6312
16407a07737O6539j8384O1476N1354K0420j02979J0808J21441j3780K2162M249
16396A15569j9188r2206L323L1552J01007l1740j23999J6753k660R1935K8705
16385A19051m4884N4448M8629p4787l2809l0670r1700k9788J25547R9418p4905
16374F7550j09149N6314N8013N4959J7502p2858L4725n3271L8798m9651j13940
$$ plain form
16453 -79785 -141489 -132217 -51194 -63607 36737 36752 62238 67034 71209 42024 -23242 -15994 -57909
16440 -57909 -154333 -281892 -173984 -139397 -279196 -278615 21418 234719 118231 77059 63148
16429 63148 213548 181095 101893 111793 138090 75322 -18846 154788 282119 288165 258494
16418 258494 220168 146957 58933 -22383 -9503 41179 88338 144786 90975 -41425 -107737
16407 -107737 -41198 -59582 1894 53248 73668 -29311 -18503 102938 89158 111320 115569
16396 115569 96381 4175 7498 39050 140057 108317 -15682 1071 -1589 90346 119051
16385 119051 74167 128615 177244 102457 69648 38978 -52722 -82510 43037 142455 67550
16374 67550 -41599 14715 72728 127687 145189 72331 107056 53785 92583 42932 -71008
16363g1008q4456J03959J60207q383o8356j9385N663m3450k9274M9505J60551
16352A55573j7036o9780j66506n3597N2340O3452m4078r0480r2669Q675J35282
16341a18824J28392R6297N7955p1572K7911l2250r4142q6993j06025k4425L26
16330b23350J20987K1974k9639l4894o409P7347N4353j19629q216N0209Q0158
16319a7109L2796o0362j13039n0010R0237r394j8870r424j869J49551Q1592n5316
16307A8783p9335m7872j28809j2601J41873P6436J17742P273l3610L7584j1248
16296H6216j47504l4627O6697M144Q2145o4139l7760M9544n0055o9521l7861K4995
16284a27726J67535k5675p5630q0386k2455J69760l1665n0637k252l2463n3337
$$ plain form
16363 -71008 -155464 -51505 108702 100319 31963 12578 18241 -25209 -54483 -4978 155573
16352 155573 138537 68757 -97749 -151346 -99006 -35554 -79632 -170112 -262781 -254106 -118824
16341 -118824 9568 105865 163820 92248 120159 87909 -6233 -93226 -199251 -223676 -223350
16330 -223350 -102363 -80389 -110028 -144922 -151331 -73984 -19631 -139260 -147476 -97267 -17109
16319 -17109 15687 -44675 -157714 -207724 -117487 -126881 -145751 -155175 -157044 -7493 74099 18783
16307 18783 -60552 -108424 -237233 -249834 -107961 -31525 86217 93490 59880 97464 86216
16296 86216 -61288 -95915 -29218 -25074 57071 -7068 -44828 4716 -45339 -114860 -152721 -127726
16284 -127726 39809 14134 -61496 -141882 -164337 5423 -26242 -76879 -79131 -111594 -164931
16273a64931Q9139j0704j59006L3382J26463k2025N3082O8669M1915j1434j16739
16262g2189K1233P9761M8568P268L3414j13972m4422J17021Q7934n5078j03183
16251F355O059J3048k9749Q8124k887q3899l0691n3143j09605P0596J58656N1391
16239H4255J819l2813P2964O778r3681m5801o2338m9492R0310n4077j78761J1446
16227b49391J04748R0920N4277M1264m5872j44599p8457m6390J75641P5711o9326
16216i1474N5132Q83J4737n9005M2167J05750K8090Q169J8204J4068l7159l4970
16204F4592n2653P5881o6357o083q1399j6005r8045n5943J46094J9710l3919m6276
16192a50403Q1708P8056O0j30217J3380J0531J8571j3758k0398l4153k2781Q6379
$$ plain form
16273 -164931 -75792 -86496 -245502 -212120 -85657 -107682 -54600 14069 55984 44550 -72189
16262 -72189 -50956 28805 77373 84641 118055 4083 -40339 76682 164616 109538 6355
16251 6355 12414 25462 -4287 83837 80950 -2949 -33640 -86783 -196388 -125792 32864 84255
16239 84255 86074 53261 126225 133003 39322 -6479 -68817 -118309 -27999 -82076 -260837 -249391
16227 -249391 -144643 -53723 554 41818 -4054 -148653 -227110 -273500 -97859 -22148 -91474
16216 -91474 -36342 -35459 -20722 -79727 -37560 68190 96280 104449 122653 136721 99562 64592
16204 64592 11939 87820 21463 15380 -66019 -82024 -180069 -236012 -89918 -70208 -104127 -150403
16192 -150403 -68695 9361 9421 -120796 -107416 -96885 -78314 -92072 -112470 -146623 -169404 -83025
16180h3025N7330l3762j0165R1185k6262p8529j51163j13240N6043J08406K7970
16169a55212J2134j06476q5745J05302m584j47J35615O8382n8092o2432M5771
16158a05484l6209J1883M0994O0367j6376j3301J1560J41993j7363m6660j07839
16147g6435O9922M5971j4517N9742k1557j42707j10523J09527n1118n9114Q7334
16136a03475P0648N0096k9790k7315L4644J39206r0990r1176N3975J479m8063
16125d0761O396M0082o047n7330J0322O3396M4434j03544n7480j9377J74324Q9248
16113A43663o0844j44470j18715J9243j6178n0022m7734K9564L2319J21916K05
16102i1053L9987p9858j52646L1482Q1791Q8371q4692M6139k7858l5172J05052
$$ plain form
16180 -83025 -25695 -59457 -69622 21563 -4699 -83228 -234391 -347631 -291588 -183182 -155212
16169 -155212 -143078 -249554 -335299 -229997 -234581 -234728 -99113 -30731 -88823 -151255 -105484
16158 -105484 -141693 -129810 -88816 -28449 -44825 -58126 -46566 95427 78064 31404 -76435
16147 -76435 -6513 39458 24941 84683 63126 -79581 -190104 -80577 -131695 -190809 -103475
16136 -103475 -32827 17269 -12521 -39836 -5192 134014 43024 -48152 5823 7302 -40761
16125 -40761 -34365 5717 -330 -57660 -47338 16058 60492 -43052 -100532 -119909 54415 143663
16113 143663 82819 -61651 -180366 -161123 -177301 -227323 -275057 -245493 -213174 -91258 -91053
16102 -91053 -51066 -130924 -283570 -252088 -170297 -81926 -166618 -120479 -148337 -183509 -78457
16091g8457Q0644J7516j11451j451O3127K4165J7262p6366L2892o5688L0152J37144
16079F9489M9113k3302L926k6033p3726N4517m9095J975l4783p355K1006k9006
16067d3274P4265O533j14071j05736j4457J13344J60871q5062j25536o3884j5079
16056b12086j36610L720M8458J73626o018L6004K3532P6701j15254n3000p1567
16045b32494M6482k6160P487K4278N1721M8817J04028r3335k8792q3101k7736
16034b08805n9311j4282J06336M1877o6378O3423n3432q10k0410m9091L7669L7270
16022a85944k9748j2568p0330O1337K5799J01044M895J815m5166n0757J13500
16011h6123J52321j01327j19392Q0586L7689Q8153j55384j02913J33860J25578
$$ plain form
16091 -78457 2187 19703 -91748 -93199 -30072 -5907 11355 -65011 -32119 -97807 -67655 69489
16079 69489 118602 95300 99226 73193 -533 53984 4889 6864 -27919 -35274 -14268 -43274
16067 -43274 30991 37524 -76547 -182283 -196740 -83396 77475 -7587 -133123 -197007 -212086
16056 -212086 -348696 -344976 -296518 -122892 -128910 -92906 -69374 7327 -107927 -160927 -232494
16045 -232494 -186012 -212172 -204685 -180407 -128686 -79869 24159 -69176 -97968 -181069 -208805
16034 -208805 -268116 -282398 -176062 -134185 -200563 -137140 -190572 -191382 -211792 -260883 -223214 -185944
16022 -185944 -215692 -228260 -298590 -237253 -211454 -110410 -105515 -103700 -148866 -199623 -86123
16011 -86123 66198 -35129 -154521 -73935 -36246 51907 -103477 -206390 -72530 53048
16001E3048P1814j45384j09116j749R1500q1851r8374J39690K03525o7164j67720
15990a11781N695q962j444n8823k1849K0195O7060m0831l68k2242n8449J26783
15978a05016l0243q445p1646j855J51233L8874r8638j45287J16306L8180j22984
15967b39521k667J56449J91676j23979k15599K2346J63833l9227N2270J07795
15957G3376M0074K8780o6930q0714J25189m4900M4560N9827m8202o8774K0338
15946H2624j15314j2654p958P6250M5345o9291q391j192J0501k4218j9926p5261
15934a19485P4371Q8174j152k0370k064l2911M8365J20739j04704j46696O7596
15923b8137P8840k6781j9446N813j38372j1742J42932J8920j0495J27466J36532
$$ plain form
16001 53048 124862 -20522 -129638 -131387 -39887 -121738 -220112 -80422 123103 55939 -111781
15990 -111781 -106086 -115048 -116492 -175315 -197164 -176969 -109909 -150740 -151108 -173350 -231799 -105016
15978 -105016 -135259 -143704 -215350 -217205 -65972 -27098 -125736 -271023 -154717 -116537 -239521
15967 -239521 -242188 -85739 105937 -18042 -233641 -211295 -47462 -86689 -34419 73376
15957 73376 113450 142230 75300 -5414 119775 74875 119435 179262 131060 62286 82624
15946 82624 -32690 -45344 -53302 22948 68293 -998 -9389 -10581 -80 -24298 -44224 -119485
15934 -119485 -45114 43060 41908 21538 19474 -13437 34928 155667 50963 -95733 -28137
15923 -28137 50703 23922 4476 10289 -128083 -139825 3107 22027 11532 138998 275530
15912B75530j55791k13004n3885J40584P3333k6816N6257j991L0483K0645q7146
15901E8199k2307N0308n1315L3576j2221m0011m7018j06259j8015J10140j14961
15890a59884m2869Q1968O3830p5732p1434p412o1510m7058Q0366J08210J08815
15879b2710R5053M015k1081j25568m1027Q6216L1632J6362n8240r9409j1177Q0697
15867f5237P9796P4682j45423j75598M0109K493R5102N096o5992J8598L3316m451
15855a07509k5681J04153j60690j1690J02732J126o276m4996P5678L8325K8916
15844e912N9103j38494m9456P5509j1767m0036J0396P7585l5366j6807R984N8171
15832g090j2833n1868p1435Q4533n5297j9415j66055l7157J46478J57406k7301
$$ plain form
15912 275530 119739 -93265 -147150 -6566 66767 39951 96208 94217 124700 145345 58199
15901 58199 35892 86200 34885 68461 56240 16229 -30789 -137048 -155063 -44923 -159884
15890 -159884 -202753 -120785 -56955 -132687 -204121 -211533 -273043 -320101 -239735 -131525 -22710
15879 -22710 72343 76358 55277 -70291 -111318 -25102 6530 22892 -35348 -134757 -145934 -65237
15867 -65237 14559 89241 -56182 -231780 -191671 -189178 -94076 -88980 -154972 -136374 -103058 -107509
15855 -107509 -133190 -29037 -189727 -201417 -98685 -97559 -103835 -148831 -73153 -34828 -5912
15844 -5912 53191 -85303 -134759 -59250 -71017 -111053 -100657 -23072 -58438 -75245 -65261 -7090
15832 -7090 -19923 -71791 -143226 -58693 -113990 -133405 -299460 -336617 -190139 -32733 -60034
15821f0034J7128K0390j2038n9014L4896J26254n5668r7787J1274k2945Q2541
15810a5003J3513k0363M4083j7495N7219Q8796M3555p5796j60882j28792k3325
15799a94490Q7012K380M6945J5148q936L7540m5725p8407J8709l8164J0612R6136
15787e1240p6408P3741J30036n6547k12233j6278N2572O390j1091N9751P3251
15776b8056o5991q3651R9588l5556j02446J38450K0095j73067q1992j0848L0287
15765b93187P0387M8876q1633q2862J10070J19794O4462p2202M757j21700K9169
15754b04069J53566O0461k3513j11208L8824Q3802M6883Q971o3586q1799l0024
15743a21692K8401J42914N3215K0377n3396N5386R2468J166k03444m7030j06907
$$ plain form
15821 -60034 -42906 -22516 -34554 -93568 -58672 67582 11914 -85873 -74599 -97544 -15003
15810 -15003 -1490 -21853 22230 4735 61954 150750 194305 118509 -42373 -171165 -194490
15799 -194490 -107478 -105098 -58153 -43005 -51941 -14401 -60126 -138533 -119824 -157988 -147376 -51240
15787 -51240 -127648 -53907 76129 19582 -192651 -208929 -156357 -149967 -161058 -101307 -28056
15776 -28056 -94047 -177698 -78110 -113666 -216112 -77662 -57567 -230634 -312626 -323474 -293187
15765 -293187 -222800 -173924 -255557 -338419 -228349 -108555 -44093 -116295 -111538 -233238 -204069
15754 -204069 -50503 9958 -13555 -124763 -85939 -2137 44746 53717 -9869 -91668 -121692
15743 -121692 -93291 49623 102838 123215 69819 125205 217673 218839 15395 -31635 -138542
15732a38542j19972M108P9729m8390o8112k9727M7225l8183N2209m0694o0212
15721c60561M4278J11477R8066q7041L5809J18964J18416n6056j2650o7763j03062
15710a60123n7201n2626J93609J08876j33518p2783k129n5558R3472l5055l890
15699a76926Q4269j011J9250Q4472k7465j39777n8964L4829J18761J3117k5593
15688g5038k5075m659R1563k4465j82118l2881K3934J9792L8048N9735n724j1672
15676a28560Q2405P9851o414k9382Q5414N2392j6716l6052m8079k1355j19134
15665a05630q9322j1981J3042M2594K10677M6025n5764O0946P8243r5784q2214
15654A0832j9920k244k0075J7175j6516n3114r0240o574J75232M1487J3560j15078
$$ plain form
15732 -138542 -258514 -254406 -174677 -223067 -291179 -320906 -273681 -311864 -259655 -300349 -360561
15721 -360561 -316283 -204806 -106740 -193781 -157972 -39008 79408 23352 10702 -57061 -160123
15710 -160123 -217324 -269950 -76341 32535 -100983 -173766 -175895 -231453 -137981 -173036 -176926
15699 -176926 -92657 -93668 -74418 10054 -17411 -157188 -216152 -181323 -62562 -49445 -75038
15688 -75038 -100113 -104772 -13209 -37674 -219792 -252673 -228739 -208947 -170899 -111164 -116888 -128560
15676 -128560 -46155 33696 27282 -2100 83314 135706 118990 82938 34859 13504 -105630
15665 -105630 -194952 -206933 -193891 -151297 59380 105405 49641 110587 188830 93046 10832
15654 10832 -9088 -11332 -31407 -14232 -30748 -83862 -174102 -180676 -5444 36043 49603 -65475
15642f5475r0368N5073N2038R275r64P23j0280J2260R331K1088j6630j45798l719
15629a73446M1455j2743m501N4601R3455o0971m3819J08221Q8782m8225j68573
15618a25764p9949j7185N8080J3491P742K0362J21182N862j58793j16482j0371
15607b81825J4980L6938R3116J6852L7785q4434j09578Q9245o616j9890J23277
15596i0150O8257J6593Q7031L2879j02503j11293j26712r7208O1367O8605J144
15585a91990M1918n6884N8622l468J3406N7052O655q9887j6056J10872N9396m9921
15573f0285R302P6233m9493r2045o8476k6062l3880n4421L237j2634j6762L8303
15561b86983O8511o9688N6706l7485j30004M4673K15130M8126J689j47720j3713
$$ plain form
15642 -65475 -155843 -100770 -48732 -39457 -40421 -39698 -49978 -37718 -28387 -7299 -23929 -169727 -173446
15629 -173446 -131991 -144734 -149235 -94634 -1179 -62150 -105969 2252 91034 42809 -125764
15618 -125764 -205713 -222898 -164818 -151327 -143585 -123223 -2041 3821 -154972 -271454 -281825
15607 -281825 -266845 -229907 -136791 -119939 -82154 -166588 -276166 -186921 -193537 -213427 -90150
15596 -90150 -21893 -5300 81731 114610 12107 -99186 -225898 -323106 -261739 -193134 -191990
15585 -191990 -150072 -206956 -148334 -151802 -138396 -81344 -74689 -164576 -180632 -69760 -10364 -60285
15573 -60285 -50983 25250 -24243 -116288 -184764 -210826 -244706 -299127 -295890 -308524 -325286 -286983
15561 -286983 -218472 -288160 -231454 -268939 -398943 -354270 -139140 -91014 -89325 -237045 -250758
15550b50758M0280R1742O6396p4725o8226L4974O932J27727j14434j05651k2793
15539b68536J34874O2338l630L3953J21573K6451k21562j03793L3002K7136J6686
15528a41508p8021j91776Q9801J66759K7347N3763j23483K1747Q5454N6753n2031
15517h5195j47565m0479N1625J00829O3375P0856j4477j24014k8037j5588K849
15506a65821M5763M2175m88n85p5275P8565Q3310l067N9734P382m7517l0945N918
15493h51L1084j02234j13650J9166R257J22495n4164o0819J06938R7733j14922
15482e9967p0217k9061n7322r7850J2975Q6115J05823q008o7966k9999L7858Q3511
15470i4108M4621l3815L7131j8235K9430n0305n7880n3644L3284q8856q6408M0996
$$ plain form
15550 -250758 -210478 -118736 -52340 -127065 -195291 -160317 -153385 -25658 -140092 -245743 -268536
15539 -268536 -133662 -71324 -74954 -41001 80572 107023 -114539 -218332 -185330 -158194 -141508
15528 -141508 -219529 -411305 -321504 -154745 -127398 -73635 -197118 -175371 -89917 -33164 -85195
15517 -85195 -232760 -273239 -221614 -120785 -57410 13446 -1031 -125045 -153082 -168670 -165821
15506 -165821 -120058 -77883 -78371 -78956 -154231 -75666 7644 4577 64311 71693 24176 -6769 -851
15493 -851 30233 -72001 -185651 -166485 -157228 -34733 -88897 -149716 -42778 54955 -59967
15482 -59967 -130184 -159245 -216567 -314417 -301442 -215327 -109504 -117512 -185478 -215477 -177619 -94108
15470 -94108 -49487 -83302 -46171 -64406 -34976 -85281 -143161 -196805 -163521 -252377 -338785 -297789
15458b97789J07251L9993l2742J54770J09631l0463q0948j1749j0018J5947o4233
15447a00350L0385j2863O8342N4266j06632m6825M4253J8928Q763j7242q1582
15436a40557P553k6029L6906P4131k49J55263n2691k685K2802R9008M6037o3747
15424A55742J2109m6671j77547n6555K6471J85619R0211n6812k0008r142J09260
15413B12677M5167M668n2221j17776j00170l1044j59905P8830K449K6130j3008
15402a04203M0777K5788J4479M6961R0157P3052j19778J9141j20823k545p0998
15391a07992p9609Q8863J00802L0569p1907N604J9647m2406R1362J2862o9068
15380b1273O6602m9004j27330J72617N4137j4459l1234O9945R276N1017R2685
$$ plain form
15458 -297789 -190538 -150545 -183287 -28517 81114 50651 -30297 -42046 -52064 -36117 -100350
15447 -100350 -69965 -82828 -14486 39780 -66852 -113677 -69424 -50496 -41733 -58975 -140557
15436 -140557 -133004 -159033 -122127 -47996 -48245 107018 54327 51642 74444 173452 219489 155742
15424 155742 167851 121180 -56367 -112922 -86451 99168 189379 132567 112559 103417 212677
15413 212677 257844 262512 210291 92515 -7655 -38699 -198604 -119774 -117325 -91195 -104203
15402 -104203 -63426 -37638 -23159 23802 113959 187011 67233 86374 -34449 -36994 -107992
15391 -107992 -187601 -98738 2064 32633 -39274 -33670 -14023 -56429 34933 47795 -21273
15380 -21273 45329 -3675 -131005 41612 95749 81290 50056 120001 129277 180294 272979
15369B72979q4259l6349R2095O3724k05787j11362J26930p7132k1131Q559O645
15358C4912M1211J4852M4822O1745j26254o1408K0615l2128m9492l4672N8752
15347b7045N6983p4418P163K0523Q0596M6888p8997j8230P0954m6997K9449j5118
15335E1751j24905K9732N9456m8409l6970J0317K8643l6438o7450N8045R3281
15324A7053m4897m9437k5300R4301l9639k1984j02362p064J50842R223O4995l020
15312D2711m7279l4370n159R2466J4523p2753N3908m7867M8332o8298o6960k4537
15300a15283m5737J1433o382P5006n208r49P053K8149k2741j27659p4143R2818
15288a83643O7807Q7393R6914J7794r8092m2319J1311J5509r800L0463p8192o7105
$$ plain form
15369 272979 188720 152371 244466 308190 102403 -8959 117971 40839 19708 28267 34912
15358 34912 76123 90975 135797 197542 71288 9880 30495 -1633 -51125 -85797 -27045
15347 -27045 29938 -44480 -37317 -16794 63802 110690 31693 13463 84417 37420 66869 51751
15335 51751 -73154 -43422 16034 -32375 -69345 -59028 -30385 -66823 -134273 -76228 17053
15324 17053 -27844 -77281 -102581 -8280 -47919 -69903 -172265 -179329 -28487 -19264 45731 42711
15312 42711 -4568 -38938 -44097 48369 62892 -9861 44047 -3820 44512 -23786 -90746 -115283
15300 -115283 -161020 -149587 -155969 -80963 -86171 -87120 -80067 -51918 -74659 -202318 -276461 -183643
15288 -183643 -115836 -28443 68471 86265 -11827 -54146 -42835 -27326 -37126 -6663 -84855 -151960
15276a51960P87J41507P3979o1686n6782J3423k2086K9168O1731j7569R6536j9589
15264H7459j97860k2528r1859Q1279L5970P132N9988j03904J3823M7494j00488
15253a83494K5728o3399J3002P4152j6018p5791l8940j06120q5050j1470J90969
15242b76431K7740K0567N7959L3310j35118k7025K01739M3945r9077k12583M1882
15231c23092K7775l3754K8359K29893N781J0025R5883j26998n5541K3741L262
15220a14666r132m0934O2499J26858Q7340J2379j13251p1353j56851j02421Q9830
15209b29702J22163J6283n9100o7855l6189K7397R0247q7550r5244P3640p6571
15198c22481o0783J56704J63354Q5405k8447j03424n2509j1306k8631k293J63425
$$ plain form
15276 -151960 -151173 -9666 64313 2627 -54155 -40732 -62818 -33650 28081 10512 107048 87459
15264 87459 -110401 -132929 -224788 -143509 -107539 -100407 -40419 -144323 -130500 -83006 -183494
15253 -183494 -157766 -221165 -208163 -134011 -150029 -225820 -264760 -370880 -455930 -467400 -276431
15242 -276431 -248691 -228124 -170165 -136855 -271973 -298998 -97259 -53314 -152391 -364974 -323092
15231 -323092 -295317 -329071 -300712 -70819 -65038 -55013 40870 -86128 -141669 -117928 -114666
15220 -114666 -123798 -164732 -102233 24625 111965 124344 11093 -60260 -217111 -319532 -229702
15209 -229702 -107539 -91256 -150356 -218211 -254400 -227003 -136756 -224306 -319550 -245910 -322481
15198 -322481 -383264 -226560 -63206 22199 -6248 -109672 -162181 -173487 -202118 -204411 -40986
15187d0986M7668j42812j09250L7684N0190J19903L8808l7456R2268o6750o3076
15176g3809k529J16973M7784J5167o2117N1700j19521k2865L6464M8017j8382
15165A6882k6328j8220j4551n0252j76714j305J23406N2572K5861R6707n7851
15154b9793q6657J5773J17231P4752o3643r0829R177K0497m8336n7026j55416
15143b94270K6551R3257Q8948O5518m5563J3951N7684j060j5285O8781j55012
15132i6500K6354O9516J61699K078j8163j26006n9560m6614j0890J17511o4525
15121d5100P7520O5214m7591r2195j26973n031o2217m5036M8427J675L2124M368
15109a94815K1628J36062O4888j06047K5740j18198O7820J77842K5028N4043P0169
$$ plain form
15187 -40986 6682 -136130 -245380 -207696 -157506 -37603 1205 -36251 56017 -10733 -73809
15176 -73809 -76338 40635 88419 103586 41469 93169 -26352 -49217 -12753 35264 16882
15165 16882 -9446 -27666 -42217 -92469 -269183 -270488 -147082 -94510 -68649 28058 -29793
15154 -29793 -116450 -100677 16554 91306 27663 -63166 -53989 -33492 -81828 -138854 -294270
15143 -294270 -267719 -174462 -85514 -19996 -65559 -51608 6076 5016 -10269 58512 -96500
15132 -96500 -70146 -630 161069 163147 144984 18978 -40582 -87196 -98086 19425 -45100
15121 -45100 32420 97634 50043 -42152 -169125 -174156 -236373 -281409 -232982 -231307 -199183 -194815
15109 -194815 -173187 -37125 27763 -78284 -52544 -170742 -102922 74920 99948 153991 224160
15098B24160N1637q2504K3571L3451l7317j09268q8050J05569J31526N583j47052
15087A11306j95502J03179J42668M6010n0799m9860N5926K0636Q0798r6635o8354
15076I9373J11502J15642r9642l6842n0808l3655N6485l8336j0112O0303j17003
15065E6907q3046J4472q3523L8474N6327n6183J11960K0291m9997p6487Q3176
15054C2371Q0617J8644p3823R804L5727M3126N3297l8082l1945p2147R3442l9487
15042A11544K1812J29101l2826J32942N199K4146N0076n6528o1032j173J00296
15031D23557j8728K5147m5668m1953M6371K5410O4448R3284Q0668Q9125R1866
15020H33527J07808Q0984Q5970J10586M6889J14988K09066J57328K34498J88209
$$ plain form
15098 224160 275797 193293 216864 250315 212998 103730 15680 121249 252775 258358 111306
15087 111306 -84196 18983 161651 207661 156862 107002 162928 183564 264362 167727 99373
15076 99373 210875 326517 226875 190033 139225 105570 162055 123719 113607 173910 56907
15065 56907 -26139 -11667 -95190 -56716 -389 -56572 55388 75679 25682 -50805 32371
15054 32371 112988 131632 57809 67613 103340 146466 199763 161681 129736 57589 151031 111544
15042 111544 133356 262457 229631 362573 367772 391918 441994 385466 324434 323261 423557
15031 423557 404829 429976 384308 342355 388726 414136 478584 571868 652536 741661 833527
15020 833527 941335 1022319 1108289 1218875 1265764 1380752 1589818 1747146 1981644 2169853
15010B169853J36887M5516P7794O4213J39531n776q717N5020J34310K8774J76785
14999C014190K81733K24912N14260O26334P68262R19116R71581J160552J230734
14990I711674J363950J244791J041474Q81491M98867J45717l22l83711j055548
14981A3448383j172857j131292j067370r47841o44890l90261j15678j71802P6819
14972G883211L97355O75032J030333J265401J578936J938885K118934K332996
14964A9221083K410806K291873K191518J630637R01994K54702m41204j276585
14956B7184824j829250k151213k278873k230850k063125j615158j217721q42461
14948A2956173l42076j06992L7751M62350Q98296J239399J703124K148959K565388
$$ plain form
15010 2169853 2306740 2352256 2430050 2494263 2633794 2628018 2619301 2674321 2808631 2837405 3014190
14999 3014190 3295923 3520835 4035095 4661429 5429691 6348807 7320388 8480940 9711674
14990 9711674 11075624 12320415 13361889 14243380 14742247 14887964 14887642 14503931 13448383
14981 13448383 12275526 11144234 10076864 9129023 8484133 8093872 7978194 7806392 7883211
14972 7883211 8280566 8955598 9985931 11251332 12830268 14769153 16888087 19221083
14964 19221083 21631889 23923762 26115280 27745917 28647911 28902613 28461409 27184824
14956 27184824 25355574 23204361 20925488 18694638 16631513 15016355 13798634 12956173
14948 12956173 12614097 12507105 12544856 13007206 13905502 15144901 16848025 18996984 21562372
14939B1562372L072758L378589L514486L399004L157287K692511J796347Q97187
14931D3470541k87898j289856k219894k999215l523015l654304l375635k914243
14923B3206481k175470j651878j012025n23084j83483L50209Q46351J406311K137849
14914B2401261K724642L428984M057711M430789M535486M369836L977707L074809
14906E3001225J884470L99601p61283k176351l971893n032441n092765n054787
14898C3195776m754123l702870k864434k047139j242994q39598m31292J36511
14890A7449837N31138R55463J592374K036668K470584K861518L133741L176272
14882C4207595L107646K649296J995669R33523j1922j084132k166307k994198
$$ plain form
14939 21562372 24635130 28013719 31528205 34927209 38084496 40777007 42573354 43470541
14931 43470541 43182643 41892787 39672893 36673678 33150663 29496359 26120724 23206481
14923 23206481 21031011 19379133 18367108 17844024 17660541 18010750 18857101 20263412 22401261
14914 22401261 25125903 28554887 32612598 37043387 41578873 45948709 49926416 53001225
14906 53001225 54885695 55285296 54524013 52347662 48375769 43343328 38250563 33195776
14898 33195776 28441653 24738783 21874349 19827210 18584216 17744618 17313326 17449837
14890 17449837 17980975 18936438 20528812 22565480 25036064 27897582 31031323 34207595
14882 34207595 37315241 39964537 41960206 42893729 42881807 41797675 39631368 36637170
14874C6637170l552166l901257l795601l188312k774473k107493j456889j249951
14866A4611028q87123m35114k62028O5542N44011Q79161J004913J449396J815244
14857A8785030K049201K073549K009656J913780J589202J017395L18726l02780
14849B9453759j154624j963507k580646k761810k694602k520084k076336j668142
14841A2034008j314140r89853n51338l19355j21398J11133J46178L56791N87126
14832I939152P45100P59378R25913R31088P00359O71212L61554J0501l12901p40361
14822A3990995r54129j296927j421906j283412j236131j127882p48082n46915
14814E375611o24734n20804l58720k45249p5050j62666j58810j78066j76829j35647
$$ plain form
14874 36637170 33085004 29183747 25388146 22199834 19425361 17317868 15860979 14611028
14866 14611028 13723905 13288791 13026763 13092305 13636316 14515477 15520390 16969786 18785030
14857 18785030 20834231 22907780 24917436 26831216 28420418 29437813 29756539 29453759
14849 29453759 28299135 26335628 23754982 20993172 18298570 15778486 13702150 12034008
14841 12034008 10719868 9730015 9178677 8859322 8737924 8849057 8995235 9352026 9939152
14832 9939152 10684252 11443630 12369543 13300631 14000990 14672202 15033756 15044257 14731356 13990995
14822 13990995 13036866 11739939 10318033 9034621 7798490 6670608 5922526 5375611
14814 5375611 4750877 4230073 3871353 3626104 3551054 3388388 3229578 3051512 2874683 2739036
14804B739036q2146O9640j96945j13536n1610n3289k0884p7111n7657J0005j20167
14793B045336p6365j33810j73025n9519m692q7337o0483j68662j02467n270J04271
14782A277977N6812m0481j32393p4546j574O4931j40085O5N2018O9831J6317j61936
14770I86936j33815k1853m6248j27516N1751Q2554N3630K3165N3721K9781j18179
14759H33927m7872m914N6011l4258p9097r5069K2654m2527p3843p0721m6807L4777
14747D52261M3055J02248r7023n4920j04613M2719J8615l0065q8686l2434K7379
14736B78536O3469N6166J09586p9134q8422q4540L9222J10620l931L2356K4193
14725D58121o257o3022o8470o9634J3552J15795P1273k7883K6772R3321M9672
$$ plain form
14804 2739036 2656890 2726530 2529585 2416049 2364439 2311150 2290266 2213155 2155498 2165503 2045336
14793 2045336 1968971 1835161 1662136 1602617 1597925 1510588 1450105 1281443 1178976 1173706 1277977
14782 1277977 1334789 1294308 1161915 1087369 1085795 1150726 1010641 1010706 1062724 1132555 1148872 986936
14770 986936 853121 831268 785020 657504 709255 791809 845439 868604 922325 952106 833927
14759 833927 786055 781141 837152 802894 723797 628728 651382 608855 535012 464291 417484 452261
14747 452261 495316 597564 500541 445621 341008 383727 402342 372277 283591 251157 278536
14736 278536 342005 398171 507757 428623 340201 255661 294883 405503 401572 433928 458121
14725 458121 451864 388842 320372 250738 264290 380085 451358 423475 450247 543568 593240
14714E93240N2552K7400p8742j56676j47644L1499j8331r3083j01930j3521R0754
14703A85518J57848Q5430j33483q3020O6665J27991j11793n3300L2081O0624r0328
14692B44233j23649j41811N4936Q5800O5988P5549R559m3531L0757R848l8324
14681B29355k0915N8656P8354p805O0591p2332j12028n6505J4757j00711j31498
14670f0081n9997J09042O1517m3953K9641K9703j4873l0593J54250M7710L4097
14659B56463J8431p3881j31455K7613R599l9254O1585M8891Q6842j68505j20270
14648b3941J1386J38644q369p648r6102Q5185Q1916M5335k306j9062R46n803J61946
14635C62127O7357n6197j73268k22683j6223J25430n8629j4270K282K5563P1542
$$ plain form
14714 593240 645792 673192 594450 437774 290130 321629 303298 210215 108285 94764 185518
14703 185518 343366 428796 295313 212293 278958 406949 295156 241856 273937 334561 244233
14692 244233 120584 -21227 33709 119509 185497 261046 270605 227074 257831 267679 229355
14681 229355 208440 267096 345450 337645 398236 325904 213876 157371 172128 71417 -60081
14670 -60081 -120078 -11036 50481 6528 36169 65872 50999 20406 174656 222366 256463
14659 256463 274894 201013 69558 97171 106770 67516 129101 177992 264834 96329 -23941
14648 -23941 -12555 126089 117720 110072 13970 99155 181071 226406 224100 205038 205984 200181 362127
14635 362127 429484 373287 200019 -22664 -38887 86543 27914 13644 15926 41489 113031
14624A13031j3804j31750M8106J5595M2886j108m2945j49856J14087M5863n2332
14613a2227O9566q2210j5534J7027K4140O0311O713j9952L6071O1103L3397p3297
14601A05108l2130L9263R4705M3977q5596P5269L1983j5323J58912J68120Q8989
14590F73277N6428l3825N2458L4759O0481O7536R4901o655q8321n1421n4539k15814
14578E89265k02415k0194Q0458R8906m0029j5673J02666R376o940M4344J12635
14567G52399J14945J37683Q5264k5942M1033J50780m5667r1543j9150k12247p1952
14556H15603j12315j44423p0595j58057j00047J877L8159j5782R9005O434K4388
14545C84247K4498j9417n2817R69l0964Q0833r6648j34703n1152M2302p8913j8399
$$ plain form
14624 113031 99227 -32523 15583 31178 74064 72956 30011 -119845 -5758 40105 -12227
14613 -12227 57339 -24871 -40405 -23378 762 61073 67786 47834 83905 145008 178405 105108
14601 105108 72978 112241 206946 250923 165327 240596 272579 257256 416168 584288 673277
14590 673277 729705 695880 748338 783097 843578 911114 1006015 999360 911039 859618 805079 589265
14578 589265 386850 366656 447114 546020 505991 490318 592984 602360 595420 639764 752399
14567 752399 867344 1005027 1090291 1064349 1105382 1256162 1210495 1118952 1099802 887555 815603
14556 815603 703288 558865 488270 330213 230166 232043 270202 254420 353425 359859 384247
14545 384247 408745 389328 336511 337480 306516 387349 290701 155998 104846 147148 68235 49836
14533D9836J23286M733k0719J24170O6993k729J4978q6515j03625O873R1061R82
14521B69324j8247J7238o7151j27318j5991o6663P7680N0667R416O1307p4650
14510A15612o8957j17187P9375K57379o5674j19510N0894O3675j5441j5518N764
14499A70412m1329p3514l4303m3450O6068K1537O6954j6162j00182L3723J33776
14488A83530M2816P6985m0661o0492L3246j33770j52197O4447o4189Q1348R9013
14477A30076n4924O8639J32316L9442m2237j44852p208R5391q231J7289o425O5181
14465B84457Q160r3272L0703l3996r2217m524M0832o079M3863J1761o4366K687
14453A28009j7492P605K2584R0958P7541m1942j37033j21562P667m6954r6613
$$ plain form
14533 49836 173122 177855 157136 281306 348299 345570 360548 274033 170408 177281 268342 269324
14521 269324 251077 268315 201164 73846 57855 -8808 68872 119539 128955 190262 115612
14510 115612 46655 -70532 8843 266222 200548 81038 131932 195607 180166 164648 170412
14499 170412 129083 55569 21266 -22184 43884 65421 132375 116213 16031 49754 183530
14488 183530 226346 303331 262670 202178 235424 101654 -50543 13904 -50285 31063 130076
14477 130076 75152 143791 276107 315549 273312 128460 121252 216643 208412 225701 219276 284457
14465 284457 292617 199345 230048 196052 103835 99311 140143 134064 177927 189688 125322 128009
14453 128009 110517 118122 140706 231664 309205 267263 130230 8668 16335 -30619 -127232
14442a27232j2604J61832J23787K245N1578l4181p3107N201N1501m5836J35800
14431B38984J22716m6879j56348K8240J15190j2559j17931o7723k4219J19831
14421A99302M1807j33171k7763O8339J8216n2495o2035o0146r9028o3554J4945
14410a55583n9246R3738J67983O8157M7659J55961l6128j32788q9296p901O5420
14399A17976L9202j74819n6600Q9672Q5474j23628j05615P5016O0647O66M7033
14388E5024O9158j13194j91022p8761R0995J89221K1037r840L71P2135j8158J6719
14376A03685K4689l9486M244l7067k0219L72j41455l4535N2442Q3267M4245o9038
14364b8856j4488L8591N2043J05924J46158K8151k4398r2968o9926o0205P697
$$ plain form
14442 -127232 -139836 21996 145783 148028 199606 165425 92318 97519 149020 103184 238984
14431 238984 361700 314821 158473 186713 301903 289344 171413 103690 79471 199302
14421 199302 241109 107938 80175 148514 166730 114235 52200 -7946 -106974 -170528 -155583
14410 -155583 -214829 -121091 46892 115049 162708 318669 282541 149753 60457 52556 117976
14399 117976 157178 -17641 -74241 15431 100905 -22723 -128338 -53322 7325 7991 55024
14388 55024 124182 10988 -180034 -258795 -167800 21421 42458 32618 32989 105124 86966 103685
14376 103685 128374 88888 93132 56065 35846 36218 -105237 -139772 -87330 -4063 40182 -28856
14364 -28856 -43344 -4753 47290 153214 299372 327523 303125 210157 140231 80026 87723
14353H7723J06426L5272l9041j38386p3374L3920Q504l9571L7661j0765j56577
14342a48208P3867J8495R2893N1087o8760j16213p1511P2386N2826J1486m8675
14331h0327q9111n9110J02397L428Q0746J23571J5780J4073m8457j4081p5604
14320b6695l1187J38281R7235r0825o3131L929m749L0315j9652J213K9553M8181
14308A12468l5096o1884j11985R3323Q9328L2360j831J21453J35041O0006L0698
14297D63881j11133j52509l2067r904L0352K7485P9207p2801p9845l2418J8784
14286A29032N158N6226P6902J52559J99080J78843K85959J97824J13418R2593
14276A487594J22143J75324P7636O6561K5398o6017k13560k92728k77969l60261
$$ plain form
14353 87723 194149 229421 190380 51994 -21380 12540 21044 -18527 19134 8369 -148208
14342 -148208 -74341 -55846 37047 88134 19374 -96839 -168350 -95964 -43138 -31652 -80327
14331 -80327 -169438 -228548 -126151 -122723 -41977 81594 97374 111447 62990 48909 -26695
14320 -26695 -57882 80399 177634 86809 23678 27607 22858 53173 33521 34734 64287 112468
14308 112468 77372 15488 -96497 -3174 86154 118514 116683 238136 373177 433183 463881
14297 463881 352748 200239 168172 158268 188620 216105 295312 222511 142666 110248 129032
14286 129032 134190 190416 267318 419877 618957 797800 1083759 1281583 1395001 1487594
14276 1487594 1609737 1785061 1862697 1929258 1954656 1888639 1675079 1382351 1104382 744121
14266G44121k46284k10805q8545P0986O781n3147k7524M6308j26551r5480n1362
14255c1502k0526L0576J6366J30659J15685P7642l7003j58500j22308N2562K4078
14244G7729J04418n8860j49894o2918J39411R9514m292o0152J481k0104j28241
14233f1908q859Q095K9047K6332m7911O434L8360R623p487l792P3555K6260r5512
14220g763p148K7876l865j49590k4886J73977K3724K1274p1122l9743l902o3325
14208a24493N4687l6083J8848J7177n8662L3469J06980k5154J0900n0366j13189
14197a65886n6571N5926O1647Q1051M034o5508j02635N1787R7271O6161n0109
14186b2832k5828L1044l1093n0940o5508k33818N1805R1203n4075K7276N730J8570
$$ plain form
14266 744121 497837 287032 198487 269473 276254 223107 195583 241891 115340 19860 -31502
14255 -31502 -52028 -21452 -5086 125573 241258 318900 281897 123397 1089 53651 77729
14244 77729 182147 123287 -26607 -89525 49886 149400 145108 84956 86437 66333 -61908
14233 -61908 -70767 -62672 -33625 -7293 -55204 -48770 -10410 -787 -8274 -12066 61489 87749 -7763
14220 -7763 -14911 12965 9100 -140490 -165376 8601 32325 53599 -17523 -57266 -61168 -124493
14208 -124493 -69806 -105889 -87041 -69864 -128526 -95057 11923 -13231 -2331 -52697 -165886
14197 -165886 -222457 -166531 -104884 -23833 -19799 -85307 -187942 -136155 -38884 27277 -22832
14186 -22832 -48660 -17616 -48709 -99649 -165157 -398975 -347170 -255967 -310042 -282766 -277036 -258466
14174b58466K5308k1927n0461J06977K2855p1344j4583j5052n676O9515R8401
14163a14453L3990j82790j7410N4772O3949L0405m9820k1244K6283k4220J1424
14152a89114k1952p2266n6154P4447O2005j45338Q728p7703N3229J11573J32903
14141a19642N8122p3531K5582l6986o0739o6522n6923P6350K0961J15579N6288
14130f1461l5547L3109m1438L0439m795O8188P005p6504o3760j10370j03306O9664
14118b88776K769l1166O6293J06861K0119p0394k8424n0218K0387M3955J05355
14107a03239k5617m2510j6667j56249J09913O8843O4691R6063m930J42440j23959
14096H779q6062j4094m0780k6258m4894m9624J8653P4687p6924O1768K5134j20040
$$ plain form
14174 -258466 -233158 -255085 -305546 -198569 -175714 -247058 -261641 -276693 -282369 -212854 -114453
14163 -114453 -80463 -263253 -280663 -225891 -161942 -131537 -181357 -202601 -176318 -200538 -189114
14152 -189114 -211066 -283332 -339486 -265039 -203034 -348372 -339644 -417347 -364118 -252545 -119642
14141 -119642 -61520 -135051 -109469 -146455 -207194 -273716 -330639 -254289 -233328 -117749 -61461
14130 -61461 -97008 -63899 -105337 -74898 -79693 -11505 -4500 -81004 -144764 -255134 -358440 -288776
14118 -288776 -286007 -317173 -250880 -144019 -123900 -194294 -222718 -272936 -252549 -208594 -103239
14107 -103239 -128856 -171366 -188033 -344282 -234369 -165526 -100835 -4772 -9702 132738 8779
14096 8779 -77283 -91377 -132157 -158415 -203309 -252933 -234280 -159593 -236517 -174749 -149615 -269655
14084b69655p829P1060k7050n0810L4899J19385j6850Q1888J75400k7545q5372
14073b479m8176R6530M8230k1641j03756M2323Q2511R880j6222N7184Q377J4161
14061A66922r0925r7169o1416L628M6452J04461Q2117J8013J60707n4796n5252
14050B22742n9852m7717j11494J0217J42192L2667j17640K1463O6359j02170j47660
14039i0893Q404l3037n4716r9995j8047R2162j3985M3561k0678r477o2907M5349
14027b14259P909q818k7415P3579M8419k4858o4270m3754k2208P6421r969j02591
14015c11814n0428K8507Q9875N3453o279j0417q5492j9689J06062L3002p9381
14004b52601j9426n7113O8397J50577j32575q7020O8443J47876m3067m0473J02817
$$ plain form
14084 -269655 -277484 -206424 -233474 -284284 -249385 -130000 -146850 -64962 110438 82893 -2479
14073 -2479 -50655 45875 94105 72464 -31292 11031 93542 103422 87200 144384 152761 166922
14061 166922 75997 -21172 -82588 -78960 -32508 71953 154070 172083 332790 277994 222742
14050 222742 162890 115173 3679 13896 156088 188755 71115 92578 158937 56767 -90893
14039 -90893 -82489 -115526 -170242 -270237 -288284 -196122 -210107 -166546 -187224 -196701 -259608 -214259
14027 -214259 -206350 -215168 -242583 -169004 -120585 -145443 -209713 -253467 -275675 -199254 -209223 -311814
14015 -311814 -362242 -333735 -243860 -190407 -196686 -207103 -292595 -312284 -206222 -173220 -252601
14004 -252601 -272027 -329140 -260743 -110166 -242741 -329761 -261318 -113442 -156509 -196982 -94165
13993i4165O7874L9590J0734M536m5399j34026M238K49906M7359j01403j13372
13982f4128m4769Q6632J65228O175j54746m2850k1839j22534j5637r7007O6103
13971b39372k0864r4148n5333J37352O9060j26245k7596J26681K31166J33842
13961A34543M7632o423M0475K8944l42k3473l7098p7k2943k6290N6074O4653J69695
13948D25370j882p5289l0418l7404n7330l2500j7536m5138J03545J14538j40890
13937B05066q2792n7776R8765L6423m8454m5855M3968K2946N4981r966L4414o1094
13925A90626k2068l1558m1270l4334m7380N440q6483r3295M5008l8199m5581R2227
13913a06867P5809j56086n5297P2704O8881K3009L9422k9232J03251P5311j28470
$$ plain form
13993 -94165 -26291 13299 24033 28569 -16830 -150856 -146618 103288 150647 49244 -64128
13982 -64128 -108897 -22265 142963 149138 -5608 -48458 -70297 -192831 -208468 -305475 -239372
13971 -239372 -260236 -354384 -409717 -272365 -203305 -329550 -357146 -230465 701 134543
13961 134543 182175 175752 216227 245171 244829 221356 184258 184181 161238 134948 191022 255675 425370
13948 425370 423488 348199 317781 280377 223047 190547 173011 127873 231418 345956 205066
13937 205066 122274 64498 163263 199686 151232 105377 149345 172291 227272 217306 251720 190626
13925 190626 168558 137000 95730 61396 14016 19456 -67027 -160322 -115314 -153513 -199094 -106867
13913 -106867 -31058 -187144 -242441 -169737 -100856 -77847 -38425 -67657 35594 110905 -17565
13902a7565n2938K2242m0678r6916k8008Q1450Q1618Q9450N8121j6813O7565m6362
13890A01166n8516J08016J15461J16347O6023j40227k2916J04599J2345j10243
13880B92055K6044R0432J05310r0851j08409J23753k0507l9951m8441m81M5219
13869C74173J67052J56078J7363l5965n844J50151L2809M2799Q7986J12003J24802
13858A223407J11436J20291q7687R830J57869J36797J63498J60837K29985J26613
13848B352876J23389K87236M09272M63607N18870N67649M76962O46706P59016
13839F605583J012554J248994J271582J345188J658230J973617K358916K610471
13831B0085135K986752L483514L963931M302264M783895N031990N074382N024172
$$ plain form
13902 -17565 -70503 -48261 -88939 -185855 -213863 -132413 -50795 38655 96776 79963 147528 101166
13890 101166 42650 150666 266127 382474 448497 308270 285354 389953 402298 292055
13880 292055 318099 408531 513841 422990 314581 438334 417827 377876 329435 328954 374173
13869 374173 541225 697303 714666 678701 672857 823008 855817 898616 986602 1098605 1223407
13858 1223407 1334843 1455134 1367447 1377277 1535146 1671943 1835441 1996278 2226263 2352876
13848 2352876 2476265 2763501 3172773 3636380 4155250 4722899 5199861 5846567 6605583
13839 6605583 7618137 8867131 10138713 11483901 13142131 15115748 17474664 20085135
13831 20085135 23071887 26555401 30519332 34821596 39605491 44637481 49711863 54736035
13823E4736035M852735M357869L498589K218614J076226M2518q02104j450196
13815F8530286j620426j087411l29708R83038K689761M906782P838959J1760327
13807I3671608J6832892K2876169K9121703L4704663L8425364L9928708L9329975
13800C14891082L5845574K9530831J8210532O082344p774569k4687074l6309027
13793C35789693m3900832n0192713m8158071m1682114l4618740k4927574j6198257
13786G6111392j0459536p071848m864593l658492k854094k418683k197403j979334
13778D0607409j741269j538229j337567j163455j021457j072492r83603j080077
13770C0669260j178421j136896j196415j180840j217542j155305j210758j200483
$$ plain form
13823 54736035 59588770 63946639 67445228 69663842 70740068 70782586 69980482 68530286
13815 68530286 66909860 65822449 65492741 66475779 69165540 74072322 81911281 93671608
13807 93671608 110504500 133380669 162502372 197207035 235632399 275561107 314891082
13800 314891082 350736656 380267487 398478019 404560363 396785794 372098720 335789693
13793 335789693 291888861 241696148 193538077 151855963 117237223 92309649 76111392
13786 76111392 65651856 58580008 53715415 50056923 47202829 44784146 42586743 40607409
13778 40607409 38866140 37327911 35990344 34826889 33805432 32732940 31749337 30669260
13770 30669260 29490839 28353943 27157528 25976688 24759146 23603841 22393083 21192600
13762B1192600j046613r82377q62112p30287q72803q45767p68198p23880o33472
13753A3727091n59165n68575n58398m98365m11879m38822m54549n03239l99020
13744I335079l32301l91713l32009m31066l17678k71870l49471k33795k78433
13735F396743m17091j28897m7451k44899k04021k23868j85513j28706j33048j07503
13725D575746k14320k07910j36233j89410j38686j09898p2201j9424n4057n8003
13715C375604k4160j13995j77452j48929J9359j43070j47473j06132j78840o0042
13705B294870J8101K049R9743J44319n6672o9597p3774M0784N9605O5968n778
13694B519618j29842m7814K8963M8815j9377r8590p6267o8579r6226j00001K7339
$$ plain form
13762 21192600 20145987 19163610 18301498 17571211 16698408 15852641 15084443 14360563 13727091
13753 13727091 13167926 12599351 12040953 11542588 11130709 10691887 10237338 9734099 9335079
13744 9335079 9002778 8611065 8279056 7847990 7530312 7258442 6908971 6675176 6396743
13735 6396743 5979652 5850755 5803304 5558405 5354384 5130516 4945003 4816297 4683249 4575746
13725 4575746 4361426 4153516 4017283 3827873 3689187 3579289 3507088 3487664 3433607 3375604
13715 3375604 3351444 3237449 3059997 2911068 2930427 2787357 2639884 2533752 2354912 2294870
13705 2294870 2312971 2315020 2414763 2559082 2502410 2432813 2359039 2399823 2459428 2525396 2519618
13694 2519618 2389776 2341962 2370925 2419740 2400363 2301773 2225506 2156927 2060701 1960700 1988039
13683A988039P8791j4200r7824m4667l6135j80075j32695q6417q6236q5987m8241
13672A254353L0108p9655q7555j2306k5174O6581N679m7893Q5640j46304o3435
13661I80039N7087J14469k5211l7682o874q9268j73421J9739R4298J01507P3471
13650A108154M1643q4113j37796L7360P9786n630J848j73718K6559L3184M0992
13639I68269l9375p0917J47504J8646m9018m5144j5541r6744Q6477M8939L6794
13628I89890p3598j6665J79072L5544q7071o8273j3576L3232J3935o2617l0971
13617H98902N6206L9527q628k4816m4707k5126J13755N5868j0500O2281J40258
13606A253020P7370j3533l6502j27346L8051O0302Q6365j19863n4665q3189m6680
$$ plain form
13683 1988039 2066830 2052630 1954806 1910139 1874004 1693929 1561234 1474817 1388581 1302594 1254353
13672 1254353 1284461 1204806 1117251 1104945 1079771 1146352 1152031 1104138 1189778 1043474 980039
13661 980039 1037126 1151595 1126384 1088702 1081828 992560 819139 838878 933176 1034683 1108154
13650 1108154 1149797 1065684 927888 965248 1045034 1039404 1041252 867534 894093 927277 968269
13639 968269 928894 857977 1005481 1024127 975109 929965 914424 817680 904157 953096 989890
13628 989890 916292 899627 1078699 1114243 1027172 958899 945323 978555 992490 929873 898902
13617 898902 955108 994635 986007 961191 916484 891358 1005113 1060981 1050481 1112762 1253020
13606 1253020 1330390 1316857 1280355 1153009 1191060 1251362 1337727 1217864 1163199 1080010 1033330
13595A033330p7444r7488M4414M9665m7721l0459M3459O344j5546m9470l6134
13584H22950n6308L0105q01p0844J30904J15894r5458n7525J05729J25224J32472
13573A182342j81415j24696O0524j55868p9488N6749Q7736n6454k2921p4650j04113
13562E87746L329O4010M6293J16384j54339j16414K9274q3412l2544O8067J66780
13551F95174l9876j34528j2179M4732l1633O1513l2081j09265j3396Q1497J3836
13540E23794o8170N2587J80965L8860o0510K18508K42768J17304J19101p8628
13530A286579j55435O1544l7831r7204j64252j77861O5793j5028j13286j54486
13520D98533j38192L2843J40420j04118L2218k5064N1108q264m642J05884M0775
$$ plain form
13595 1033330 955886 858398 902812 952477 904756 874297 917756 924100 908554 859084 822950
13584 822950 766642 796747 795946 725102 856006 971900 876442 818917 924646 1049870 1182342
13573 1182342 1000927 876231 936755 780887 701399 758148 845884 789430 766509 691859 587746
13562 587746 591075 655085 701378 817762 663423 547009 576283 492871 460327 528394 695174
13551 695174 655298 520770 508591 553323 521690 583203 551122 441857 428461 509958 523794
13540 523794 455624 508211 689176 728036 667526 886034 1128802 1246106 1365207 1286579
13530 1286579 1131144 1192688 1154857 1057653 893401 715540 781333 766305 653019 498533
13520 498533 360341 393184 533604 429486 461704 436640 487748 479484 474842 580726 621501
13509F21501o5791M4457J14309n1927N1985j3598q8960k3323K6321N1527O1585
13498G28086m5279j60644J74764R2355n7475O5107J14632R5755O3002J70947J91565
13487A432815J49263L5819P1675L2150l5679J9309k46612j37733j733n247M1953
13476A355980J60335l1283m8008J4381r1508n2714k00712j10153j21506k08278
13466F66534p7431o3595l8031J13970R4953M4573j87228m9330N5854J7879j13619
13455D64529k0572J02982k6304R9458M8601J07358j04622n5609r0462n974O7203
13444E86588N5534N9499n8862O246L0985K5051n245j8731p3613J07160n3150J2926
13432F74388j2367r1815J13552l1346j8692J189q3793m0735J16077K1827n3015
$$ plain form
13509 621501 555710 600167 714476 662549 714534 700936 611976 588653 614974 666501 728086
13498 728086 682807 522163 696927 789282 731807 796914 911546 1007301 1070303 1241250 1432815
13487 1432815 1582078 1617897 1689572 1721722 1686043 1705352 1458740 1321007 1319274 1314027 1355980
13476 1355980 1516315 1485032 1437024 1451405 1359897 1307183 1106471 996318 874812 666534
13466 666534 589103 525508 487477 601447 696400 740973 553745 504415 560269 578148 464529
13455 464529 443957 546939 520635 620093 668694 776052 671430 615821 525359 519385 586588
13444 586588 642122 701621 642759 649005 679990 705041 699796 681065 607452 714612 661462 674388
13432 674388 662021 570206 683758 652412 633720 634909 551116 510381 626458 648285 595270
13421E95270L8249M9938q8934j48040K0454J24227J831q4631j44805Q337J47146
13410E19042M0732p7457p795J15308Q7004K982P559N0004N9233j00155o1017k3699
13398F11741l1731l2564j8367q9062j2537m4268O2536L0650R1327k2359l512l232
13386E38622k2875M2098K8012L902M8361K7711m4915m3764j198n0946R6430n1962
13374E69476M2071K1191p3585j120P169L4568j3791N694K6136k3815n9278o5200
13362D69516O3939M6872K1762J24569M682j19832O4349M7700p9842J3223j9349
13351F37589K10097J26329j62281o0478K9191J12883L7112J55448O1447m224J5551
13340A158664K3714j6698k5876K4231J5090J17026j8406j585Q6133N473n6328
$$ plain form
13421 595270 633519 683457 594523 446483 466937 591164 592995 508364 363559 371896 519042
13410 519042 559774 482317 474522 589830 676834 679816 687375 737379 796612 696457 635440 611741
13398 611741 580010 547446 529079 440017 427480 383212 445748 476398 567725 545366 541854 538622
13386 538622 515747 557845 585857 589759 638120 665831 620916 577152 575954 525008 621438 569476
13374 569476 611547 632738 559153 558033 565202 599770 585979 591673 617809 593994 534716 469516
13362 469516 533455 580327 602089 726658 731340 611508 675857 723557 643715 656938 637589
13351 637589 847686 974015 811734 751256 780447 893330 930442 1085890 1147337 1143113 1158664
13340 1158664 1182378 1165680 1139804 1164035 1179125 1296151 1277745 1276160 1362293 1367766 1311438
13329A311438j1144M5377K5499l5065P2154J33476J83644K06685K35431J66865
13319B334360J62108J39774J81917K02305J94932Q5903L0945j23379j50941k67671
13309B790253l07129l70710k15615k75698k19517p5219j9453l9314j16833k6745
13299A124020Q2262R7476Q6660N0127O6393j1379k9429q7437j05459k4191O1849
13288A310892L1599o960J8928m2942k1097r4174p9192K3669j05267q5305l4851
13277I15300P0290l3267L1541K4480M9193J73780J82257M2561j3985k6213J39283
13266A555220J21752J6535m8174K6398J09028R4253r7095j20009j48178p9517
13256A430213q0643p5199q6226j21703l4554k30365j49986n4966Q1650K4497O5209
$$ plain form
13329 1311438 1300294 1345671 1371170 1336105 1408259 1541735 1725379 1932064 2167495 2334360
13319 2334360 2496468 2636242 2818159 3020464 3215396 3301299 3332244 3208865 3057924 2790253
13309 2790253 2483124 2112414 1896799 1621101 1401584 1326365 1306912 1267598 1150765 1124020
13299 1124020 1206282 1303758 1390418 1440545 1506938 1495559 1466130 1378693 1273234 1249043 1310892
13288 1310892 1342491 1335531 1354459 1311517 1290420 1196246 1117054 1140723 1035456 950151 915300
13277 915300 985590 952323 983864 1008344 1057537 1231317 1413574 1456135 1442150 1415937 1555220
13266 1555220 1676972 1693507 1645333 1671731 1780759 1875012 1777917 1657908 1509730 1430213
13256 1430213 1349570 1274371 1188145 1066442 1031888 801523 651537 596571 678221 702718 767927
13245G67927Q5184R8670J17689Q5145J34439O7779L246k9373J53691K1937L7024
13234A543358M1406l0675r5718j44965j71978j15049j33410l2053O1500m7228
13224H75188n6341j56371p6014M886J2943k2406p1643Q5998J3140M1950L4171
13213F85501J17017M1243p276N5238Q3977o5370J0308m966j3462N6825j33407
13202H25628o1255n122k13328o718p4141m5772l9531L8913L0723K3658J6641p3937
13190D15759N5474L8557j812M576L8172P2085L8281L5158N856J5418L1483J6772
13178G65779J2787q7220K6543L4861p8966j50755m3981K5637L7663p1065M3947
13167E15230j6589l2345j54067K6732O0693j1926O85P0403M9026M6462j03003
$$ plain form
13245 767927 853111 951781 1069470 1154615 1289054 1356833 1360079 1330706 1484397 1506334 1543358
13234 1543358 1584764 1554089 1458371 1313406 1141428 1026379 892969 860916 922416 875188
13224 875188 818847 662476 586462 591348 604291 581885 510242 596240 609380 651330 685501
13213 685501 802518 843761 836485 891723 975700 910330 920638 915672 902210 959035 825628
13202 825628 764373 759251 545923 539205 465064 419292 379761 418674 449397 473055 489696 415759
13190 415759 471233 509790 507978 512554 550726 622811 661092 696250 702106 717524 749007 765779
13178 765779 778566 691346 717889 752750 673784 523029 479048 504685 542348 471283 515230
13167 515230 498641 466296 312229 338961 399654 387728 388413 458816 507842 554304 451301
13156D51301k9792J7227r733l1855m5074O6917l0690p453K1075K1656N6564Q5776
13144E65919o4473p9375n7393N9000p5540o5527o151N3839R5359m1320j01306
13133B83032L1597J3185k3587o8271m9085J30286K4955l7587L6374J45247K266
13122D88412j05202j94809M5088J24037J27779j9674j12298l3154j05796o3654
13112A50729J18921k711K6306Q1352o6106n5438o2257j12738j7577M4458Q0473
13101A85412J78060K502m711n2510p4342n6414J20429K16287J47721l817j57494
13090E01123q3301m0172J9289j7168K704p1996j37262M1694J34j5190J9464N9160
13078B78479L1523m250m9626L4743q485R057q0872N6786L5655k8804R2438r5399
$$ plain form
13156 451301 421509 438736 429003 397148 352074 418991 388301 380848 401923 423579 480143 565919
13144 565919 501446 422071 364678 423678 348138 282611 276460 330299 425658 384338 283032
13133 283032 314629 327814 304227 235956 186871 317157 342112 304525 340899 486146 488412
13122 488412 383210 188401 233489 357526 485305 465631 353333 320179 214383 150729
13112 150729 269650 266939 293245 374597 308491 253053 190796 78058 60481 104939 185412
13101 185412 363472 365974 361263 308753 234411 177997 298426 514713 662434 658617 501123
13090 501123 417822 377650 396939 379771 382475 310479 173217 214911 215045 199855 219319 278479
13078 278479 310002 305752 256126 290869 282384 291441 210569 267355 303010 274206 366644 271245
13066B71245p9283l0667K8995L2017r136r024p1729q664P0706Q0137j918R2106
13054C64785J13347R8840j5322O6142J4290j37187m9025j10217k1500m6637J6614
13043B94130k4578J6308J47779J79624n4174J3317N209q1959J23400M834Q1547
13032G05437K4043J1320J04349Q0434N9397J45674J15542Q7298J5871l9699l9738
13021A269928n074O0315J59339K41287L45621K52390K01132J69324K50779K73770
13011C218811K99601M63566L90249M43711N24358N44613M86141N33092L79853
13002G283995M49567M62501K86390J88468J94408Q6151J50147J91278L65396M20175
12992A0078476O18501R53954J232686J514461K010429K522283K871064L258755
$$ plain form
13066 271245 191962 161295 190290 222307 213171 204147 132418 123754 194460 274597 272679 364785
13054 364785 478132 576972 561650 627792 642082 504895 455870 345653 324153 277516 294130
13043 294130 269552 285860 433639 613263 559089 572406 577615 495656 619056 623890 705437
13032 705437 729480 740800 845149 925583 984980 1130654 1246196 1333494 1349365 1309666 1269928
13021 1269928 1264854 1325169 1484508 1725795 2071416 2323806 2524938 2694262 2945041 3218811
13011 3218811 3518412 3981978 4372227 4815938 5340296 5884909 6371050 6904142 7283995
13002 7283995 7733562 8196063 8482453 8670921 8865329 8951480 9101627 9292905 9658301 10078476
12992 10078476 10696977 11650931 12883617 14398078 16408507 18930790 21801854 25060609
12984B5060609L312728L520500L641955L384486K868379K155048J293268O13627
12976D5850600l39607j174967j808662k291189k383718k425437k338960k035616
12968C1052444j820970j331816p01657q2189M65957J026050J567142K176492K876766
12959C5228219L465727L894146M250969M602864M733248M664816M121740L317813
12951F8279542K500679J696490Q00842l69188j219241j929532k391074l005445
12943F4363073l536355l717483l525001l402263l283586k914514k707411k283846
12935C8992614j701318j390727q07512j00985M61818J076531J604918J984840
12927D0120179K241568K376603K369882K420260K327468K147219J611813J205730
$$ plain form
12984 25060609 28373337 31893837 35535792 38920278 41788657 43943705 45236973 45850600
12976 45850600 45510993 44336026 42527364 40236175 37852457 35427020 33088060 31052444
12968 31052444 29231474 27899658 27198001 27115812 27581769 28607819 30174961 32351453 35228219
12959 35228219 38693946 42588092 46839061 51441925 56175173 60839989 64961729 68279542
12951 68279542 70780221 72476711 73277553 72908365 71689124 69759592 67368518 64363073
12943 64363073 60826718 57109235 53584234 50181971 46898385 43983871 41276460 38992614
12935 38992614 37291296 35900569 35093057 34992072 35453890 36530421 38135339 40120179
12927 40120179 42361747 44738350 47108232 49528492 51855960 54003179 55614992 56820722
12919E6820722Q73107M57595n9906j09236k06527P0494L10437M46756N45430R84133
12909F0133005J275259J395228J559512J390224J156463O21653j50150r68890
12901F6412304j366504j997318k387630k713037k949886k711278k422683k364642
12893D7499326j920376j164722m91355J54783R64607J681196K281902K741161
12885E1746522L265836L773589M247361M564256M621721M542215M425596M177047
12877H5364143L702706L099020K216979J264465k2017j363214k593838l701632
12869H7966612m494444n593707o018096o138701n957187n614469n087743m495368
12861D4566897l729082k743925j837094r29440j78994M60135J269016J853639
$$ plain form
12919 56820722 57693829 58151424 58091518 57982282 57775755 57846249 58156686 58603442 59148872 60133005
12909 60133005 61408264 62803492 64363004 65753228 66909691 67531344 67381194 66412304
12901 66412304 65045800 63048482 60660852 57947815 54997929 52286651 49863968 47499326
12893 47499326 45578950 44414228 43922873 44077656 45042263 46723459 49005361 51746522
12885 51746522 55012358 58785947 63033308 67597564 72219285 76761500 81187096 85364143
12877 85364143 89066849 92165869 94382848 95647313 95625296 94262082 91668244 87966612
12869 87966612 83472168 77878461 71860365 65721664 59764477 54150008 49062265 44566897
12861 44566897 40837815 38093890 36256796 35327356 35148362 35608497 36877513 38731152
12853C8731152K247822K920370L229763L197692L085436K774792K131734J266268
12845E9585029K29350p39207j717583k919290l754158m324963m547011m539125
12837C7273042m576120m195717l607810k875067k130779j767369j370982j106754
12829A5642444j067995r29315p99084n69532l41164j89299k65375k89520k09980
12820A0981180k13646j13492j65447j93653k12626k11161l36972m14308l31493
12811H788382m04771l61459k81488k46111m16703l67300l07437k76512j89821
12802E936780k61843l61439k30340j68079p5444k01431j54574l9536Q956q1874
12792D371176j49797j28892l9637J6582j82676j60352j86075j01978n6592M7570
$$ plain form
12853 38731152 40978974 43899344 47129107 50326799 53412235 56187027 58318761 59585029
12845 59585029 59814379 59075172 57357589 54438299 50684141 46359178 41812167 37273042
12837 37273042 32696922 28501205 24893395 22018328 19887549 18120180 16749198 15642444
12829 15642444 14574449 13645134 12846050 12276518 11935354 11746055 11480680 11191160 10981180
12820 10981180 10767534 10654042 10488595 10294942 10082316 9871155 9534183 9119875 8788382
12811 8788382 8383611 8022152 7740664 7494553 7077850 6710550 6403113 6126601 5936780
12802 5936780 5674937 5313498 5083158 4915079 4839635 4638204 4483630 4444094 4453050 4371176
12792 4371176 4221379 4092487 4052850 4069432 3886756 3726404 3540329 3438351 3381759 3429329
12782C429329n1955j7310m6387j1100l3710P953K4659j46118j07199M052j76426
12771B875788j06300j00807o6331J47514J51740K3943j77219p0993J5791K4045
12761B717171l4717r1733j23853n0477j26936p4204j36999m3150j6997l5708L4953
12750B017350j6936l7919n3273J9900l3835j02440j6941q9837n4298N1550L9617
12739A722938p769j3892q2269n1383m5429L3661p7214j27160l3480j7686J43775
12728A444092M0498N0619L2800j9710J4917o8436j66064k6033P3220o7116m6609
12717A262178n4151l0008J14589m0453m9440K3186n4678j9323K8814J857M8954
12706A231525L133m7750L7916M4888r630j80642n2824N9940R3071N8477j45955
$$ plain form
12782 3429329 3377374 3360064 3313677 3302577 3268867 3276820 3301479 3155361 3048162 3052214 2875788
12771 2875788 2769488 2668681 2602350 2749864 2901604 2925547 2748328 2677335 2693126 2717171
12761 2717171 2682454 2590721 2466868 2416391 2289455 2215251 2078252 2035102 2018105 1982397 2017350
12750 2017350 2000414 1962495 1909222 1929122 1895287 1792847 1775906 1686069 1631771 1683321 1722938
12739 1722938 1715169 1701277 1619008 1567625 1522196 1555857 1478643 1351483 1318003 1300317 1444092
12728 1444092 1484590 1535209 1568009 1548299 1563216 1494780 1328716 1302683 1375903 1308787 1262178
12717 1262178 1208027 1178019 1292608 1252155 1202715 1225901 1171223 1151900 1180714 1182571 1231525
12706 1231525 1234658 1186908 1224824 1269712 1260082 1079440 1026616 1086556 1179627 1238104 1092149
12695A092149L42J98842J73133q8647j7715m6372j21162j9888k6379j08849L723
12684A039177j06942j21627o0269M7668M2817Q1564R760k674j964L7175n8728
12673I05957O7575P7681K0375j0114K6n5726j47751k6444k39j0307N3258J13p8456
12660G95948p060J07288j3611j53974j7699N3619m252m8348p8063M8900q26o5364
12648F16558k5270L7613J4022R1774Q0083M1360l2991j14831p9880J4694m3247
12637E99885j1730O2568o1115k9276m0492R5499k9713j04189k9769o3292J01193
12626D89569J60035k3855M6361j99860n3541N4135L6251l2381j7309k6851l6454
12615C96100L5790K660J03091O3178r5578j02593n7055K3853M7459L767J15125
$$ plain form
12695 1092149 1092491 1291333 1464466 1375819 1358104 1311732 1190570 1170682 1144303 1035454 1039177
12684 1039177 932235 810608 750339 798007 840824 922388 932148 929474 927510 964685 905957
12673 905957 973532 1051213 1071588 1061474 1061500 1005774 858023 831579 831340 821033 874291 874404 795948
12660 795948 788888 896176 882565 728591 710892 764511 760259 711911 633848 682748 681922 616558
12648 616558 591288 628901 642923 734697 814780 856140 823149 708318 628438 643132 599885
12637 599885 588155 650723 589608 560332 519840 615339 585626 481437 451668 388376 489569
12626 489569 649604 625749 672110 472250 418709 472844 509095 476714 459405 432554 396100
12615 396100 431890 434550 537641 600819 505241 402648 345593 369446 416905 420672 535797
12604E35797J86360j4037p326p2793j43946J0142J21673Q3671r2289r7181K5035
12593E35106J29852j9849q7035j8575L9952M1919M258M852n3861J89203J88612
12582I54434K606n6754j3J00831J9594j5668p2766j31809k0855j34274k2140k0986
12570F02200q964p3756Q5086J73230K9303j25971m0510J43642n5984j35549M3186
12559F35913J09319M375R378m6236j05729p9548q069J46620K9739j12004n1940
12548E31818P8185R2338R773m5516J4447P6478l8299L1104J12638N3479K7082
12537I43527J3211l642M028M5174K3462j31260l8101j33226k6441K8918k193O1679
12525G85136M8692o0508k8296J27016O0516K4275Q9481N3323n2484j91906j23355
$$ plain form
12604 535797 722157 708120 700794 628001 484055 494197 615870 699541 607252 510071 535106
12593 535106 664958 645109 558074 539499 579451 621370 625628 630480 576619 765822 954434
12582 954434 957040 900286 900273 1001104 1020698 1005030 932264 800455 779600 645326 623186 602200
12570 602200 593236 519480 604566 777796 807099 681128 640618 784260 728276 592727 635913
12559 635913 745232 749607 758985 712749 607020 527472 519403 666023 695762 583758 531818
12548 531818 610003 702341 712114 666598 681045 757523 719224 750328 862966 916445 943527
12537 943527 956738 953096 957124 1002298 1025760 894500 856399 723173 696732 725650 723457 785136
12525 785136 833828 773320 745024 872040 932556 956831 1046312 1099635 1047151 855245 731890
12514G31890n3950N0693M3542J37224K5896j87118j54897q161R6044k7642j1398
12503F42123j4352M2898P6282K9062m6371N2084k9984q7089J0059J15852O6105
12492H56669N903l985J7303O2263k6534r3744m2699L9171j6067q4798K1470j0410
12480G24542q8337p2914J7966J37084N1549p6998O9229o3397L1058J03m5935P2607
12468G56557J12091P5997j18848j93139J16048R1293J79626J3581M2240l6033
12458A039413q6761j1552k0430J44126P3413N8625O0144J02511m6711o2718j25005
12447A125055L0866J40277R2462o1437J67057J69020J03789l0697K6887J80718
12437A943997K35766M0886J16408L02635K83874K93200L53582N27424N39324L92800
$$ plain form
12514 731890 677940 728633 772175 909399 935295 748177 593280 585119 681163 653521 642123
12503 642123 627771 670669 746951 776013 729642 781726 751742 664653 674712 790564 856669
12492 856669 862572 858587 875890 938153 911619 817875 775176 814347 798280 713482 734952 724542
12480 724542 636205 563291 581257 718341 769890 692892 762121 698724 729782 729885 683950 756557
12468 756557 868648 944645 825797 632658 748706 839999 1019625 1033206 1075446 1039413
12458 1039413 952652 941100 920670 1064796 1138209 1196834 1256978 1359489 1312778 1250060 1125055
12447 1125055 1155921 1296198 1388660 1327223 1494280 1663300 1767089 1736392 1763279 1943997
12437 1943997 2179763 2220649 2337057 2639692 2923566 3216766 3570348 4097772 4637096 5029896
12427E029896N02414P34491O96589P01442P32308P69125P17137O60516O44983
12418A1188901M75932L28733Q6882J50036K14385K91574N01544N97227Q50860
12409A4686074J178249J618277J945857K399929K812921L536232M242852M854941
12401C7275332N336044N421654N007196M161212L058444J921899M86561j047493
12393F1620849k730681m569462o123303o179469m904359l370569j514648J47061
12385C2375419J349490K532572L421466M103489M465034M329619L666048K762123
12377E9005260J817001P10586n64776k392908m106919n322486n730370n286610
12369C8128778m510539l441411k521089j640037r31946n51562l26464k83055k47880
$$ plain form
12427 5029896 5532310 6266801 6963390 7664832 8397140 9166265 9883402 10543918 11188901
12418 11188901 11664833 11993566 12080448 12230484 12444869 12736443 13237987 13835214 14686074
12409 14686074 15864323 17482600 19428457 21828386 24641307 28177539 32420391 37275332
12401 37275332 42611376 48033030 53040226 57201438 60259882 62181781 62668342 61620849
12393 61620849 58890168 54320706 48197403 42017934 37113575 33743006 32228358 32375419
12385 32375419 33724909 36257481 39678947 43782436 48247470 52577089 56243137 59005260
12377 59005260 60822261 61532847 60968071 58575163 54468244 49145758 43415388 38128778
12369 38128778 33618239 30176828 27655739 26015702 25083756 24532194 24205730 23922675 23674795
12360B3674795j06539m9182l5313J10089J76483L96199P35179R29768J291112
12351B7122591J879481K014169K406141L082814L789202M456350M989225N420868
12343E5160841N454984N049661M261715L262011K494149J428067j15024k028805
12335G4967599l713014m403717m075391l121620j711610O2434K098888M110966
12327F4214535N806616O800088P531986P494446O590228N060664L359182J292761
12319A08150506j028980l823981o698404r028982j0138499r504889p750137n426954
12311E4749680l254501j538477j73001Q83805J676863J948434J860477J389583
12303E7542863P11750k81438j300837k275402l501330m520882n019134m578898
$$ plain form
12360 23674795 23568256 23519074 23483761 23593850 23770333 24166532 24901711 25831479 27122591
12351 27122591 29002072 31016241 33422382 36505196 40294398 44750748 49739973 55160841
12343 55160841 60615825 65665486 69927201 73189212 75683361 77111428 76996404 74967599
12335 74967599 71254585 66850868 62775477 59653857 57942247 58004681 60103569 64214535
12327 64214535 70021151 76821239 84353225 91847671 98437899 103498563 106857745 108150506
12319 108150506 107121526 103297545 96599141 87570159 77431660 67926771 60176634 54749680
12311 54749680 51495179 49956702 49783701 50667506 52344369 54292803 56153280 57542863
12303 57542863 58254613 57973175 56672338 54396936 50895606 46374724 41355590 36776692
12295C6776692l624904k675557j891990j444151j091538p88003o99872o66781
12287B3893896o63023k82510l58333l40143m84478n52551k04446P2125K73037
12278B1353574N96690Q47164J218842J528631J856276K437808L235489L801457
12270C6875931L918652M013884L870374L346249K613645J617106N00312p32751
12262E6023402k000088l341180m289451m636363m098231l190932k195579j218414
12254C1053164l13630Q55715J883718K809180L289401L484580L171803K447004
12246D8680935J830574J103285j61872j859325l739252m996407n358903n053542
12238C0445493m470274l582452k506371j845017j569262j343601j160581j038397
$$ plain form
12295 36776692 33151788 30476231 28584241 27140090 26048552 25260549 24560677 23893896
12287 23893896 23230873 22948363 22590030 22249887 21765409 21212858 21008412 21080537 21353574
12278 21353574 21950264 22797428 24016270 25544901 27401177 29838985 33074474 36875931
12270 36875931 40794583 44808467 48678841 52025090 54638735 56255841 56756153 56023402
12262 56023402 54023314 50682134 46392683 41756320 37658089 34467157 32271578 31053164
12254 31053164 30739534 31595249 33478967 36288147 39577548 43062128 46233931 48680935
12246 48680935 50511509 51614794 51452922 49593597 45854345 40857938 35499035 30445493
12238 30445493 25975219 22392767 19886396 18041379 16472117 15128516 13967935 12929538
12230A2929538r01615p39639p46117o67620l83540l56697k30121j69406j82242
12221H552541k14212k04835k13369k73993j27653j50406j81799j10759o617K3622
12211G092520j06055r2524k2735o1457j95210q0978J1931l9514j07898j55106
12201F242974j88982l39970j57184j88434k57952j03261k10367k49918l2522J32750
12191D647134P1980R1353J53209j7336J49246J91971J05267J07496k4132p6478
12181E399710j27755j36695k64313l93768l35161k35807j59961k35855j35936
12172C374459o8503k020j35295J2002P8095K1928R9272m6487k8025l964J09725
12161C411187p5313j949o3244K4393o12k13919j50588l7198j23408j79992j20252
$$ plain form
12230 12929538 12027923 11288284 10542167 9874547 9491007 9134310 8904189 8734783 8552541
12221 8552541 8338329 8133494 7920125 7646132 7518479 7368073 7186274 7075515 7068898 7092520
12211 7092520 6986465 6893941 6871206 6809749 6614539 6533561 6545492 6505978 6398080 6242974
12201 6242974 6053992 5714022 5556838 5368404 5110452 5007191 4796824 4546906 4514384 4647134
12191 4647134 4719114 4810467 4963676 4946340 5095586 5287557 5392824 5500320 5476188 5399710
12181 5399710 5271955 5135260 4870947 4477179 4142018 3906211 3746250 3510395 3374459
12172 3374459 3305956 3303936 3168641 3180643 3258738 3280666 3379938 3333451 3305426 3301462 3411187
12161 3411187 3335874 3333925 3270681 3295074 3294462 3080543 2929955 2892757 2769349 2589357 2469105
12150B469105j02718M9829J10480p3371m2572R8824L4405L4212j67749k3380l2712
12139B354353J0880J75648J26410N5388l322k4768P4968J52080J16288l200N1638
12128C086363M9016o6130j63495j7425j54226j56227r6532j06034L0699M2266
12118B448275j2214Q9140N6196J47712N9891o2765j04643o38O1386J7305N9094
12107B758739M2316j81869l55184l10559j32560L7863n4924j57251K626L8970
12097A688167j07519j22882J7681l8493n3070J13941J22643k5844j50555j11413
12087A332656M6928P9553k1045j18550J11303K8367k1812j6543p3195p7080R208
12076A279790P480Q3207M693r7066j40838k4223N2302J8368n028O9183J3194l1773
$$ plain form
12150 2469105 2366387 2416216 2526696 2453325 2410753 2509577 2543982 2578194 2410445 2387065 2354353
12139 2354353 2365233 2540881 2667291 2722679 2719357 2694589 2769557 2921637 3037925 3034725 3086363
12128 3086363 3135379 3069249 2905754 2888329 2734103 2577876 2481344 2375310 2406009 2448275
12118 2448275 2436061 2525201 2581397 2729109 2789000 2726235 2621592 2620954 2682340 2699645 2758739
12107 2758739 2801055 2619186 2264002 1953443 1820883 1858746 1803822 1646571 1649197 1688167
12097 1688167 1580648 1457766 1475447 1436954 1383884 1497825 1620468 1594624 1444069 1332656
12087 1332656 1379584 1459137 1438092 1319542 1430845 1459212 1437400 1420857 1347662 1270582 1279790
12076 1279790 1287270 1370477 1375170 1278104 1137266 1113043 1165345 1183713 1178685 1247868 1261062 1229289
12064A229289j16729M2787J39462N7580J27978J498r2505m5450j9428m1092l2905
12053A250485j06206j32795l0488q8613n7906R4736J11865J5368N1817N9634n2893
12042A115004L9706J00826n839l0436J4364n3125K9435n4383o9768K4036Q2384
12031A192204n594k7500q4728j44070l9683j04590j56924M8082J83826J29266
12021I90289J4004Q9164o3041j22404j3281j068r544P0740Q2983O3968J6795q4523
12009A034082n6433K7720j18189j13372m057J11899Q3074L0237K6066p5956L9318
11998I84389O8830J322P290J6875j5890K9589L6579R3079j80j95284l7355P4567
11986A063811O5662M0866K246m788j50341j43018p859L1646j28743N2604m1327
$$ plain form
12064 1229289 1112560 1155347 1294809 1352389 1480367 1481865 1389360 1343910 1324482 1283390 1250485
12053 1250485 1144279 1011484 980996 892383 834477 929213 1041078 1056446 1108263 1167897 1115004
12042 1115004 1154710 1255536 1249697 1219261 1233625 1180500 1209935 1155552 1085784 1109820 1192204
12031 1192204 1186610 1159110 1074382 930312 890629 786039 629115 677197 861023 990289
12021 990289 1004293 1093457 1030416 908012 894731 893663 884119 954859 1037842 1101810 1118605 1034082
12009 1034082 977649 1005369 887180 773808 769751 881650 964724 994961 1021027 945071 984389
11998 984389 1053219 1054541 1061831 1078706 1062816 1092405 1128984 1222063 1221883 1026599 989244 1063811
11986 1063811 1129473 1170339 1172585 1167797 1017456 874438 866579 898225 769482 822086 780759
11975G80759N817j5392N285N3271m8403j60872l3946q1143k6441r9906J31729
11964E10758J73626L3635m2954J1454J20266J13245p0609r2360Q5122J47107L6505
11953A025795J3381k616k02154L0526Q2746O2720j2387l5622L2407M5004L1362
11942A071162o7320n4983m1576p1808o850P0966M8603P1210N6825l0839q1506
11931I63884P830P276p9687K3356N3145R925O3721k4723K3566Q7565m8210l9881
11919A047767p0958n6327R296m7310J2204O7558q9583j02372j5832p9277p6076
11908E99090l3504N766m8050j1941O364Q8342J09977O2547q9233R473J19452j2193
11896H06090j01631Q1299n6088O4315M3891J1278N5718l8416j5508o0316J2830
$$ plain form
11975 780759 786576 771184 776469 829740 781337 620465 586519 505376 478935 379029 510758
11964 510758 684384 718019 675065 686519 806785 920030 849421 757061 842183 989290 1025795
11953 1025795 1039176 1036560 834406 864932 947678 1010398 998011 962389 994796 1039800 1071162
11942 1071162 1003842 948859 907283 835475 828625 899591 948194 1019404 1076229 1045390 963884
11931 963884 971714 978990 899303 922659 975804 985729 1049450 1024727 1048293 1135858 1087648 1047767
11919 1047767 976809 920482 929778 882468 894672 962230 872647 770275 754443 675166 599090
11908 599090 565586 571352 523302 511361 517725 606067 716044 778591 689358 698831 818283 806090
11896 806090 704459 785758 729670 793985 837876 849154 904872 866456 850948 790632 803462
11885H03462m7310M0567J10035o8643k0308P2243P9220n9454j76689K4794Q5460
11874H43377J64279R975m3L2739J7881j19885n448J3755p3944N0348m1194M0708
11862I32548o9327l9027K0859p4190K3546J34758K4711l0176j0941j793n362l9567
11850H66039k66837r6698L448R0994p4179q586M2044l2511k2352m0829j1794m8187
11838D00552n5110L2673K3988m5098n5931n8154Q8775P5955J23639q896j6652
11827E05741o0348L9812Q6040J03749q7641l3079M1107R0059J20503p4444m5977
11816F85522o3387n6854Q531N5813r505r7064k5763Q4823L0941r527l2664k6934
11804E43932o7923j9145o9871k9072R9497N7899j08147p7253J38702J51500L0493
$$ plain form
11885 803462 756152 796719 906754 838111 817803 890046 969266 909812 733123 757917 843377
11874 843377 1007656 1017631 1017588 1050327 1068208 948323 942875 956630 882686 933034 891840 932548
11862 932548 863221 824194 845053 770863 794409 929167 953878 923702 912761 910968 905606 866039
11850 866039 599202 502504 505952 596946 522767 514181 556225 523714 501362 460533 448739 400552
11838 400552 345442 378115 402103 357005 301074 242920 331695 407650 531289 522393 505741
11827 505741 445393 485205 571245 674994 587353 554274 595381 685440 805943 731499 685522
11816 685522 622135 565281 573812 629625 620120 523056 497293 582116 613057 603530 570866 543932
11804 543932 476009 456864 386993 357921 457418 515317 407170 329917 468619 620119 650612
11793F50612l4351j09041j12704j9891K2347P9055Q1770l5444j40372n5616L4390
11782C60755p4965O8896k6720j08451O1106J38172N7093q8284j0730l6720J3464
11771C53616l454l2974l3659j2619l0042j4551J511N2638N257J849J09416M5468
11759D42456r3863o8471J9026k1138k3463L5236R6004n7254n3265o2303l3902
11748A79063m6844j27098N086Q9521J37983J01402m4693j35454k2458Q5314p4773
11737A47049M3427r092M6022k7848L7376Q2754O46l3502N0668L8082j04822r9098
11725A71662k6179K7352N3094J7349j1216r6327J9795P973R500q4284M0702J05454
11713B34875k3920n1983J6256K6602L5453o3867j00753Q2207P4391R4389R3306
$$ plain form
11793 650612 616261 507220 394516 374625 396972 476027 557797 522353 381981 326365 360755
11782 360755 285790 354686 327966 219515 280621 418793 475886 387602 376872 340152 353616
11771 353616 350162 317188 283529 270910 240868 226317 227828 280466 285723 287572 396988 442456
11759 442456 348593 280122 299148 278010 254547 289783 385787 328533 275268 212965 179063
11748 179063 132219 5121 10207 99728 237711 339113 294420 158966 136508 221822 147049
11737 147049 190476 181384 227406 199558 236934 319688 320334 286832 337500 375582 270760 171662
11725 171662 145483 172835 225929 243278 232062 135735 155530 163503 173003 88719 129421 234875
11713 234875 210955 158972 175228 201830 237283 173416 72663 154870 229261 323650 416956
11702D16956j09987j77897K5086J02321J06184j1574j2447m2692M4325k3377L76
11691C17274K4857N5991Q8149L5244p8240j09312j69044p5632L600J02072J36387
11680C31346J83070j42050k20428P2648P5741l8401R281M49n5412J044q2995j1263
11668A23030n2526J13393q3303n2708L7791L0914j4645N0958P0604j7971M756
11657B10293l6789L5249N1424k3131j49129k646o4103p3937L6408m335R6531K24083
11645B99918Q5714o6100j6357j8143J3180p1695P0374J7686j18121K1679J40508
11634C58643j7513N6007k0950m1288j32168n4017L3345o5655m643n7979o3738
11623i956P1152J9634k8662r968M9151L8482N6577K1892k8334j24770k3839J14905
$$ plain form
11702 416956 306969 129072 154158 256479 362663 351089 338642 295950 340275 316898 317274
11691 317274 342131 398122 486271 521515 443275 333963 164919 89287 92887 194959 331346
11680 331346 514416 372366 151938 224586 300327 261926 271207 271656 216244 217288 134293 123030
11668 123030 70504 183897 100594 47886 85677 116591 101946 152904 223508 205537 210293
11657 210293 173504 208753 260177 237046 87917 85271 21168 -52769 -16361 -20696 75835 299918
11645 299918 385632 319532 303175 285032 298212 226517 296891 314577 196456 218135 358643
11634 358643 341130 397137 376187 334899 202731 148714 182059 116404 111761 53782 -9956
11623 -9956 61196 80830 52168 42200 91351 129833 186410 208302 179968 55198 31359 146264
11611A46264J9329j78J3105M6219j3201j14619o841Q7738R402j07764M3094K2014
11599A44562L4741J22730l7161j0863j09959q7125Q9845K9882j1436J8889j2116
11588A71989K8816r0785l2689K9873N4230J07287k1982l0040L6055J6058q420
11577B60392n3879p471P114o1631n300p264J48964O2783l4184n3023j7087J1604
11565B51018Q9455n7847K1301m301M8334L3476l0503p4533p3955k7800L2131R7789
11553C04565j3748q5915q3191J610J23462r1919k3869J06396j3820L1515N9958
11542C15044j95035p9662J42307M3221m6623R3499J51687P0674J340L0834l0131
11531D97155j99272k0025j08473o5242O7064R1276r2082p3608k8398N6392M254
$$ plain form
11611 146264 165593 165415 178520 224739 211538 96919 90078 177816 187218 79454 122548 144562
11599 144562 179303 302033 264872 254009 144050 56925 146770 176652 165216 184105 171989
11588 171989 200805 110020 77331 107204 161434 268721 246739 216699 252754 268812 260392
11577 260392 206513 199042 206156 144525 139225 131961 280925 343708 309524 256501 239414 251018
11565 251018 340473 282626 303927 299626 347960 381436 350933 276400 202445 174645 206776 304565
11553 304565 290817 204902 121711 123321 246783 154864 130995 237391 223571 255086 315044
11542 315044 120009 40347 182654 225875 179252 272751 424438 495112 496452 527286 497155
11531 497155 297883 277858 169385 104143 171207 262483 170401 96793 68395 124787 129041
11520A29041J7082K9069m2019k8425L8977o4144P8958N6726L155m7250O5171N072
11508B41413r0018M5514O2842J5017o0634j8713o1534M7803M9840M3114p5427
11497A99217k3965J0733J1470p6047o6687n0077j3497Q2705N9031J37023O7373
11486C37279o7010r1875N3579j4640r9226N9914P1945r9289p9635Q8312J24262
11475B83616m273q1083J902j14753p6465M5274J32361q3772L9612O2375m9962
11464A54832K3121M455r5661j71114N9431J32714R7926O3555q5855M8877J220
11453B33501l7357p773K9601m2711O0425m4711r688J9808O2142J7127j7755l1755
11441B30854p3556R6556J01522n1564j3446J851k7977Q021j31110k8527m5935
$$ plain form
11520 129041 146123 175192 133173 104748 143725 79581 158539 215265 218420 171170 236341 241413
11508 241413 151395 196909 259751 274768 214134 195421 133887 181690 231530 274644 199217
11497 199217 175252 185985 197455 121408 54721 4644 -8853 73852 132883 269906 337279
11486 337279 270269 178394 231973 217333 118107 178021 249966 150677 71042 159354 283616
11475 283616 279343 198260 200162 85409 8944 54218 186579 102807 142419 204794 154832
11464 154832 177953 182408 86747 -84367 -24936 107778 205704 269259 183404 232281 233501
11453 233501 196144 188371 217972 175261 235686 190975 181287 201095 263237 280364 262609 230854
11441 230854 157298 253854 355376 303812 290366 292217 264240 272261 141151 112624 66689
11430F6689Q1521N403p0090O3687J35711O1450p2301j018P9101r760o9829j29430
11418A41134K3545J10822K3400l9258l5766L7066J18938r850j1770O038n1358
11407C12941k074l0684k3350R6063N2051l593j6995M8705j7248q8823K5796k3421
11395C29368m5544O0682J02887K1793k9600K8859j09721j1162M944q5638q1026
11384A85842j8191L8183J08608K4648j01550o8651r2430l0361N6556k601j04023
11373c970j8030L4806O026R4237o5874L7741o3584P5981J1239J7576J24059p4048
11361A76159q2446J325n0283O5577L9380j6601J0813Q7516M4994r4701l0974J375
11349A52134l5068N0113K8359J02509q8087r663o3436r3624m3577Q5248N8165
$$ plain form
11430 66689 148210 153613 83523 147210 282921 344371 272070 271052 350153 340393 270564 141134
11418 141134 164679 275501 298901 259643 223877 260943 379881 370031 358261 364299 312941
11407 312941 310867 280183 256833 352896 404947 401354 384359 433064 415816 326993 352789 329368
11395 329368 283824 344506 447393 469186 439586 468445 358724 347562 352506 266868 185842
11384 185842 167651 205834 314442 339090 237540 168889 76459 46098 102654 100053 -3970
11373 -3970 -22000 12806 18832 113069 47195 84936 21352 97333 108572 126148 250207 176159
11361 176159 93713 95038 44755 110332 149712 133111 143924 231440 276434 181733 150759 152134
11349 152134 117066 167179 195538 298047 209960 200297 136861 43237 -340 84908 143073
11338A43073J6651p2464L4841o9082K1791R9497M4459N77k9253j0601J11218J05479
11326C96186J4310j12441m0350J27463O3120m9158n4241J02646k9510K6761O9815
11315E14601k5856m4051j53959p6673j324l6696O7555j1515N2983M9152K429o4528
11303B72118O5563r3710j26010j018K8196P757L6859N9266J69462l9010j14089
11292B65384j59605L6564J90510Q190j1827K9562L0594L3461J8898p1762k9214
11281C40755Q8928l6906j23143N7582o2227m8609J30460l9023J235j03465l2331
11270A73256o1971p707P5878l7889j5045K9599j10975j685L0225L0370J14060
11259B18116J25188O0802n8720M8651m8635L7350j0892r4487j6404j2940n753
$$ plain form
11338 143073 159724 87260 122101 53019 74810 174307 218766 219343 190090 179489 290707 396186
11326 396186 410496 298055 257705 385168 448288 399130 344889 447535 418025 444786 514601
11315 514601 488745 444694 290735 214062 212738 176042 243597 232082 285065 334217 336646 272118
11303 272118 337681 243971 117961 116943 145139 152896 189755 249021 418483 379473 265384
11292 265384 105779 142343 332853 341043 329216 358778 389372 422833 441731 369969 340755
11281 340755 429683 392777 269634 327216 264989 216380 346840 307817 309052 205587 173256
11270 173256 111285 103578 179456 141567 126522 156121 45146 43461 73686 104056 218116
11259 218116 343304 404106 345386 394037 345402 382752 371860 277373 260969 248029 242276
11248B42276J6894O9175O371j1704j06397l7762K0410r9547n5114R4097R5458
11237B34157J4248j7891N687l0736k7908R0892R5448q7544j10939n5282o3876
11226D6256J0668j00928Q2417P1110n5240j9220L0468m8830n4650O417L3920J31766
11214A34154R3660n5813K5514K2959L5009j39060j7860j17581k7185J65961J01468
11203B21226k6452l3908J4363n7679o9586K7207k3937n1511M1058J35395q5285
11192I0891l9401m330R0024o923K5188j4787m2611p9947m3024M6790J42722n8786
11180A05806J38m9519Q0374m772j5978k8613q534L0174J9609K4227q1320k7722
11168D3870n2430l2760L1736J20056r855j34153q8557j3457j5876J62574J32460
$$ plain form
11248 242276 259170 328345 334716 323012 216615 178853 199263 99716 44602 138699 234157
11237 234157 248405 230514 236201 205465 177557 268449 363897 276353 165414 110132 46256
11226 46256 56924 -44004 38413 109523 54283 35063 65531 16701 -37949 -31532 2388 134154
11214 134154 227814 172001 197515 220474 255483 116423 98563 -19018 -46203 119758 221226
11203 221226 194774 160866 175229 117550 47964 75171 51234 -277 40781 176176 90891
11192 90891 51490 47160 137184 130261 155449 140662 98051 18104 -24920 21870 164592 105806
11180 105806 105944 56425 136799 132027 116049 87436 78902 109076 128685 152912 71592 43870
11168 43870 -8560 -41320 -9584 110472 100617 -33536 -122093 -135550 -151426 11148 143608
11157A43608j04828p7073j59090l936Q7163N6405l0050L5263P9819O616j18967
11146h5070n5696J6663L9588P9448k6725M8578o3209j78230J29326R3615M0008
11135C8296K6177o0352J06308J16039j11778j72110m0216R3447K3642j1669L4508
11124D2292j3586k6548J23003O3132j29431P6234n3025k27449j2940J47111Q6857
11113G5650q552p0054j11961m6444n356K1065O4091j01145j12008J66946J21677
11102f091L6089L4433J16078j13552j56066M8713R360l8829J03923P8331j1019
11091A01370p105l3270R0746P7289J0874m2139m0963O602j13771j05029P7963
11080B2567O8034q1607j02804N9155N6827q5033r2589K2436L7620q0176m1141
$$ plain form
11157 143608 38780 -38293 -197383 -201319 -114156 -57751 -87801 -52538 27281 33897 -85070
11146 -85070 -140766 -124103 -84515 -5067 -31792 16786 -46423 -224653 -95327 -1712 38296
11135 38296 64473 4121 110429 226468 114690 -57420 -97636 -4189 19453 7784 42292
11124 42292 28706 2158 125161 188293 58862 135096 82071 -145378 -158318 -11207 75650
11113 75650 67098 -2956 -114917 -161361 -166717 -145652 -81561 -182706 -294714 -127768 -6091
11102 -6091 29998 64431 180509 66957 -89109 -40396 -31036 -69865 34058 112389 101370
11091 101370 94265 60995 151741 229030 239904 197765 156802 163404 49633 -55396 22567
11080 22567 90601 8994 -93810 -34655 22172 -62861 -155450 -133014 -95394 -175570 -216711
11069b16711N0925j4097m8792J0308L2982N9633O4566j9093J841O143K8584P8067
11057C4356P2964p9811j03358K1324M6465J11514j26007K5642K53j29689j04528
11046b30875r294P7152J09546J86688r9625j21656J0292N7912K6674o9281M0245
11035b2222m4952J3996R097K7247J02632L103j1540K5570o6107J1776O5764m0232
11023G4132q025L226Q074n1597j2556j37382o2319Q5075M9658l4586O8382L1669
11011A3751K9560p8885K6570p084l0160J69127J23080P0158j32050j42159r5305
11000e3397o470P9009l2171J5380K3946k553o8912P9266k4223n0041K9014O7747
10988E6595n0030r4319K8724K8111J47262n6322n5446n4039q548j4423n0370J17220
$$ plain form
11069 -216711 -165786 -179883 -228675 -218367 -185385 -125752 -61186 -80279 -78438 -72295 -43711 34356
11057 34356 107320 27509 -75849 -54525 -8060 103454 -22553 3089 3342 -126347 -230875
11046 -230875 -240169 -163017 -53471 133217 33592 -88064 -77772 -19860 6814 -62467 -22222
11035 -22222 -67174 -53178 -44081 -16834 85798 88901 77361 102931 36824 48600 114364 74132
11023 74132 66107 69333 77407 25810 13254 -124128 -186447 -101372 -51714 -86300 -17918 13751
11011 13751 43311 -35574 -9004 -16088 -46248 122879 245959 316117 184067 41908 -53397
11000 -53397 -59867 19142 -13029 2351 26297 23744 -45168 34098 9875 -40166 -11152 56595
10988 56595 6565 -87754 -59030 -30919 116343 60021 4575 -49464 -58012 -72435 -122805 -5585
10976e585j6964j3603k6653M3361L6610M2456l5316j10444r6316N0716L3975k5201
10964a22964l8954r1882p5577k367J62421k6843k8808J29130O7117k7136l2684
10953h8547J2987L0035m839R1205K382O427L9756L9177J04174p9759n5517l8383
10941E9098j29112o0772O7690j0015K5927J92524N5605q529j00935r4327J5272
10930A2426N363L3048J64159o5130j15879j3651l6754n8426P5029m6013n5515
10919a01343j363R0261l2223p6647J1451R901M8353O6299j07679K7760J8019K5109
10907b2102Q9730M8612q1502l2351O3556P2475P1730q4308p26l7181q5386j06862
10895a04315R737O2508o8686q4158K6402N577J14479j683J6588j0137p3820r5336
$$ plain form
10976 -5585 -22549 -36152 -62805 -19444 17166 59622 24306 -86138 -182454 -131738 -97763 -122964
10964 -122964 -161918 -253800 -329377 -331744 -169323 -196166 -224974 -95844 -28727 -55863 -88547
10953 -88547 -75560 -45525 -50364 40841 43223 49650 89406 128583 232757 152998 97481 59098
10941 59098 -70014 -130786 -63096 -73111 -47184 145340 200945 192416 91481 -2846 12426
10930 12426 17789 50837 214996 149866 33987 20336 -16418 -74844 185 -45828 -101343
10919 -101343 -102706 -12445 -44668 -121315 -109864 -99963 -51610 14689 -92990 -65230 -47211 -22102
10907 -22102 67628 116240 34738 2387 65943 138418 210148 125840 125114 87933 2547 -104315
10895 -104315 -94578 -32070 -100756 -184914 -158512 -152935 -38456 -40139 -23551 -33688 -107508 -202844
10883b02844l2565o8248m512P6880K3173L208K3086j972K1384n1092q403L1153
10871a90752J08930O504m5453m6771J11767J38082m5471j2778K819l6677n9645
10860f9445L9228J00381M5313j5414j02672j19654l3535L1022M5382O9328p4926
10849h4992j17167K3586J08271R8643L5142K3528Q4128r0897o5927q161L4122
10838D0276O5996r461r7739N7429l8129P012l3780k6445N9228j1710r8963n052
10826i1338M2141O1165K7680P5545J02255o1627j11422j58540P725M5033M4845
10815a6538l9651j25336L2093J6650K3992M7646K1762o4213N5283n7618m9487
10804a55417J34219k0809l2916K1292J10235p8698m1278l3111N6760J4597L9164
$$ plain form
10883 -202844 -235409 -303657 -308169 -231289 -208116 -204908 -181822 -183794 -162410 -213502 -221905 -190752
10871 -190752 -81822 -75318 -120771 -167542 -55775 82307 36836 24058 26877 -9800 -69445
10860 -69445 -30217 70164 115477 100063 -2609 -122263 -155798 -124776 -79394 -10066 -84992
10849 -84992 -202159 -178573 -70302 28341 63483 87011 171139 80242 14315 6154 40276
10838 40276 106272 96811 -928 56501 18372 25384 -8396 -34841 24387 12677 -86286 -91338
10826 -91338 -49197 11968 39648 115193 217448 155821 44399 -114141 -106416 -61383 -16538
10815 -16538 -56189 -181525 -149432 -132782 -108790 -61144 -39382 -103595 -48312 -105930 -155417
10804 -155417 -21198 -42007 -74923 -53631 56604 -22094 -63372 -96483 -39723 -25126 14038
10793A4038K8795k0952l466Q5187q2044j44453o533J5923K6486n2949k3821o415
10781a70204l9387p8745l2728O4635L3351N0487N8302j14652N7810J25009M232
10770d1890j71190o9873K5668R3694J08035J0008k561K3887j8051o707N8858M8984
10758E8862O3404j13222O0271q3914m7731j24036j55079m0513J33141K47605P9957
10747G8745q5967N7918o3687j10003j6416L6608N1986K8460M7679j8661n3937
10736d7275p8614r4169m9935o5332M3446R9889L7801J800R5769j1474J1837K6219
10724c0038O4167K2403r309k8814m8302k3843o153N8663J109r165n1359J3142
10712d7499R5768L2911M1032r7084P786P1304N9590o5400j16523J3244l3071m7407
$$ plain form
10793 14038 42833 21881 18415 103602 21558 -122895 -129428 -113505 -87019 -139968 -163789 -170204
10781 -170204 -209591 -288336 -321064 -256429 -223078 -172591 -114289 -228941 -171131 -46122 -41890
10770 -41890 -213080 -282953 -257285 -163591 -55556 -45548 -48109 -24222 -42273 -48980 9878 58862
10758 58862 122266 9044 69315 -14599 -62330 -186366 -341445 -381958 -248817 -1212 78745
10747 78745 -7222 50696 -12991 -122994 -139410 -102802 -50816 -22356 25323 6662 -47275
10736 -47275 -125889 -220058 -269993 -335325 -291879 -191990 -154189 -152389 -56620 -68094 -56257 -30038
10724 -30038 34129 56532 47223 18409 -29893 -53736 -59889 -1226 -117 -9282 -60641 -47499
10712 -47499 48269 81180 122212 25128 32914 104218 163808 98408 -18115 -4871 -37942 -85349
10700h5349j23862j43991J5070Q2580P4564K2968Q8288J99733o9812j22751r9511
10689a62073R74n4888k9863N7257j8845R6690P0212J3996q4828m8613N2705r262
10677a16538j9603l3882k3564L4420N2192J95037m7064p0986J41312K6580K3449
10666A61353l3763p5788j4925p2391R0624J7267p8334M8076o765o0524m945l224
10654c3339R3005L6577j52638L8955J7039N9144L967N1176k4022j16617j25918
10643a52671j652j1245L9924J1046P7259L1625n2867p088J83490l2795m1757K1014
10631F4283j07405k2765k1378J29315J00871M210K1229Q977o3526L3010m0075
10620A06746r0430n2519L3979p6662N5198p1644R36L7951J4782n9109r2239N1014
$$ plain form
10700 -85349 -209211 -353202 -338132 -255552 -180988 -158020 -69732 130001 60189 -62562 -162073
10689 -162073 -161099 -215987 -245850 -188593 -207438 -110748 -40536 -26540 -111368 -159981 -107276 -116538
10677 -116538 -136141 -170023 -193587 -159167 -106975 88062 40998 -29988 111324 137904 161353
10666 161353 127590 51802 36877 -35514 55110 72377 -5957 42119 35354 -25170 -30115 -33339
10654 -33339 59666 96243 -56395 -17440 -401 58743 62710 113886 89864 -26753 -152671
10643 -152671 -154323 -165568 -125644 -114598 -37339 -5714 -58581 -65669 117821 85026 43269 64283
10631 64283 -43122 -65887 -87265 42050 142921 147131 168360 177337 113811 146821 106746
10620 106746 16316 -36203 -2224 -78886 -23688 -95332 -94396 -56445 -41663 -100772 -193011 -141997
10608a41997l5302p0887L7800O8657L7590K9288O0369q989O7819m8343M5310J64950
10596B06265M2566j57162q1521M2509K6549l3226l7518o3565O5719O6101p7491
10585g74r2820j57679P7746K12047M0013M4880O5826o6417q5533k6362L1426L0581
10573G2934j0936q1457o7533l8162L7491L1032q7432n7294O0861L8035P3897m9838
10561g8402n42o4680K3444J46158m495p0768j20328N9635Q0409J3029j2076j14147
10549a42763l3660J3458r988l3649J12835M1759l3257J07881l8084J8281l5525
10538c2712k7136M6282L8112Q6838j38228o1687p2605n6471J6602o0160k7308
10527b88473J23336R8596K9482o8437r1819o2408k0404j8576Q5944K8443N3997
$$ plain form
10608 -141997 -177299 -248186 -210386 -141729 -104139 -74851 -14482 -23471 44348 -3995 41315 206265
10596 206265 248831 91669 10148 52657 79206 45980 8462 -55103 10616 76717 -774
10585 -774 -93594 -251273 -173527 38520 78533 123413 189239 122822 37289 10927 42353 72934
10573 72934 61998 -19459 -86992 -125154 -87663 -56631 -144063 -201357 -140496 -102461 -28564 -78402
10561 -78402 -78944 -143624 -120180 25978 21483 -49285 -169613 -109978 -29569 -16540 -28616 -142763
10549 -142763 -176423 -162965 -172953 -206602 -93767 -52008 -85265 22616 -15468 2813 -32712
10538 -32712 -59848 -13566 24546 111384 -26844 -88531 -161136 -217607 -201005 -261165 -288473
10527 -288473 -165137 -66541 -37059 -105496 -197315 -259723 -280127 -298703 -212759 -184316 -130319
10516a30319P6920J29487p1930r7747q4768j7630P2603j0365J4101P6447N0269
10505G068j26861j20857M0077J9778L8014J4636L7442n3221k4385O8652M1551
10494e8106O6106J9683J44122q1982j03146m799O2113L080J9798r6169j11158
10483a40458N7148Q9107M720l1078K2362j4877m9579p4707N9579M0523p0422m2004
10471a49686N0597Q1527R7383M8757p8072o3783K9300l0379J01005P9033m8587
10460A17095o5937o6477n6876k5781J8769J23171M2004m1677M1765j8810j1563
10449E5683J05087j03765j12425M1553J09815J08477j0055j25847n9742p902j20576
10438a19697m9662J03810J1334n7001K4059J12057k0532o4531n7138J2481j170
$$ plain form
10516 -130319 -53399 76088 4158 -93589 -178357 -195987 -123384 -133749 -119648 -43201 7068
10505 7068 -119793 -240650 -200573 -180795 -142781 -128145 -90703 -143924 -168309 -99657 -58106
10494 -58106 8000 27683 171805 89823 -13323 -18122 43991 47071 66869 -29300 -140458
10483 -140458 -83310 5797 10517 -20561 1801 -13076 -62655 -137362 -77783 -37260 -107682 -149686
10471 -149686 -99089 -17562 79821 128578 50506 -13277 16023 -14356 86649 165682 117095
10460 117095 51158 -15319 -72195 -97976 -79207 43964 85968 44291 86056 67246 55683
10449 55683 160770 57005 -55420 -13867 95948 204425 194370 68523 8781 879 -119697
10438 -119697 -169359 -65549 -54215 -111216 -87157 24900 4368 -60163 -117301 -104820 -105990
10427a05990n900o3338R1078J46031R8119n4234r1289o1053J8177N8005J02103
10416A31709J4281K5023n7849j06174o5254J60427Q6699l3958p8279j24005O1808
10405A4428M6525M3762J7541r4926r2597K5601J24930R7826n4899k82487j97242
10394c51538N520R8807O0523J11660k9557R1509j4038K6153m9346k2424L2671
10383d0060q7223q6675J02201J22531P2672j98798p844P5716L6582p4528M670
10372h0756K4701M6649R3747J17681M5425k1720R818r228O8645N6681r7334j58263
10360I6046K8238J67428R9656K9788m728O7570r1306k4709l8244q82M016K8094
10348C60967L6642q1403L7374J01072R8976p119k9519k1216p0L0926J7022m1949
$$ plain form
10427 -105990 -111890 -175228 -84150 61881 160000 105766 14477 -46576 -28399 29606 131709
10416 131709 145990 171013 113164 6990 -58264 102163 188862 154904 76625 -47380 14428
10405 14428 60953 104715 122256 27330 -65267 -39666 85264 183090 128191 -154296 -351538
10394 -351538 -346018 -247211 -186688 -75028 -104585 -13076 -27114 -961 -50307 -72731 -40060
10383 -40060 -127283 -213958 -111757 10774 83446 -115352 -123196 -47480 -10898 -85426 -80756
10372 -80756 -56055 -9406 84341 202022 247447 225727 235545 226317 294962 351643 254309 96046
10360 96046 124284 291712 391368 421156 416428 483998 392692 367983 329739 328857 332873 360967
10348 360967 397609 316206 353580 454652 553628 546509 516990 495774 495704 526630 543652 501703
10336E01703o8825m2798n7173J27555p2447j06433J8002J4531k8992K9779K7397
10325C42299K8013J22449m6932j39979o6098R5749O5448m729q4082k5996j28815
10314A57327K5443K62688J59997m2134q0160n6484r4530k2702O4736N4703R2298
10303E21182K0278q0304o1409Q2915J00865r1391j15070j7513p5799q0769N3845
10292B56830Q4630j37854p7220n3501p4550J05536Q3218k6963K5541O563O6584
10281B58814m439r409l2760P1770J053L3122n5638l1650J53503j3644J152J7016
10269C88890L9543N5412m8695r8582N9910P6700j0860m2981p6171o9831J25047
10258C98382j7995o9098K0441J37901K8493J28492J06952L3000j77468k46057
$$ plain form
10336 501703 432878 390080 332907 460462 388015 281582 299584 314115 285123 314902 342299
10325 342299 370312 492761 445829 305850 239752 335501 400949 396220 312138 286142 157327
10314 157327 182770 445458 605455 563321 483161 426677 332147 309445 374181 428884 521182
10303 521182 541460 461156 399747 482662 583527 492136 377066 359553 283754 202985 256830
10292 256830 341460 203606 126386 72885 -1665 103871 187089 160126 185667 192230 258814
10281 258814 254375 244966 212206 283976 285029 318151 262513 230863 384366 370722 371874 388890
10269 388890 428433 483845 435150 336568 396478 473178 462318 419337 343166 273335 398382
10258 398382 380387 311289 331730 469631 498124 626616 733568 766568 589100 343043
10248C43043R931O4003m7804r1612l3957K0724k2688m50L9408o455o063O0772
10236C28852L8648J37070M0279j02593k7014r795J0891L0798j691p4282j11984
10225B59179J253K1922R1040M8699R0942o3108q4151n1564M9328L5228j1517j32749
10213B54502K2990J6278n3670k1358N1114O9768q2717Q4085Q5230L2232n0334
10202D08120L8756k3853j7906j17581j16385Q3570P8281K4384J04807j9874j34063
10191C08256k4129l2774p0052k3608K1772q577j24993M8856J57192J04629n0479
10180C06093J7024Q273n0449q4163m8665R0838M1476m4580o6471N3501K01341
10169D24218L7800M3895m4340j7100p6112L2133J07009q8975o5262R7308r5404
$$ plain form
10248 343043 352974 416977 369173 277561 243604 264328 241640 241190 280598 274143 268080 328852
10236 328852 367500 504570 544849 442256 415242 405447 416338 447136 445445 371163 259179
10225 259179 260432 282354 373394 422093 513035 449927 365776 314212 363540 398768 387251 254502
10213 254502 277492 293770 240100 218742 269856 339624 256907 340992 426222 458454 408120
10202 408120 446876 423023 405117 287536 171151 254721 333002 357386 462193 442319 308256
10191 308256 284127 251353 181301 157693 179465 170888 45895 94751 251943 356572 306093
10180 306093 323117 331390 280941 196778 148113 238951 280427 235847 169376 222877 424218
10169 424218 462018 505913 461573 444473 368361 400494 507503 418528 353266 450574 355170
10158C55170r9448N5558k348j36377j47545m8490Q540M3895m695M0193m3566j44562
10146a23675M6696K6219K7245K6037k77J6827o0573n6564K2760L4501N3452N7015
10134F9663l78j03814p2116N3739R6000r955p1909J339k8761k16K7921P1334O495
10121C9342n8448P74N9040l5481k1185M0664l8417o4643m1696p8110l8654n6948
10109b93762J10270J20464R5761j716m0568j94338J9864J67045O1153o5720n7672
10098g9219j25231j73458j2211K2381L1046M3261R4177j0878J40434N9946K5299
10087A5547L0822N1424m128O0954n8028m7289j16225m7466l9032r9210P1588O6554
10075a14489j6241J77593M1403k2435K419O6770m781p3855j2001M1937l1407J16202
$$ plain form
10158 355170 255722 311280 308932 172555 25010 -23480 -14940 28955 24260 64453 20887 -123675
10146 -123675 -76979 -50760 -23515 2522 2245 19072 -41501 -98065 -75305 -40804 12648 69663
10134 69663 69285 -34529 -106645 -52906 43094 33139 -38770 -37431 -66192 -66408 -38487 32847 39342
10121 39342 -19106 -18332 40708 5227 -15958 24706 -13711 -78354 -120050 -198160 -236814 -293762
10109 -293762 -183492 -63028 32733 31017 -9551 -203889 -184025 -16980 44173 -21547 -79219
10098 -79219 -204450 -377908 -390119 -367738 -336692 -293431 -199254 -210132 -69698 -9752 15547
10087 15547 46369 97793 93665 154619 96591 49302 -66923 -114389 -153421 -252631 -181043 -114489
10075 -114489 -130730 46863 88266 65831 68250 135020 130239 56384 44383 86320 54913 171115
10063A71115O8533j07942j22314q5076K3111j4581L3446L0166m7642j413N753
10052d6844M6110l0134N0468o6377m8239J2551p9461Q838k266m0039J86159l8378
10040d7612p5208P6508l7136L6115J32411N535R7388l4304L6944R846P8917J13147
10028C92551J40871m6067k776J00388J16509n158k589k3674M7110k6106r1974
10017E99085j06318K1759j2228n0327Q0625J15432P8915J23944K9280j7789J70951
10006A033329J28108J7863L6364N9333M7841J85033N8101j7940J7761m3004K2633
9995A545422J4415K589p5004J59205J87358m4756k6419K42219K25516J36859K32104
9984B599508J39230J69417R0137J14388L30711K03032K03647K85053J93454J80493
$$ plain form
10063 171115 239648 131706 9392 -75684 -52573 -67154 -33708 -3542 -51184 -52597 -46844
10052 -46844 -734 -30868 19600 -46777 -95016 -82465 -161926 -153088 -155354 -195393 -9234 -47612
10040 -47612 -122820 -46312 -83448 -47333 85078 90613 188001 153697 190641 200487 279404 392551
10028 392551 533422 487355 484579 584967 701476 696318 693729 670055 717165 691059 599085
10017 599085 492767 514526 502298 451971 532596 648028 726943 850887 880167 862378 1033329
10006 1033329 1161437 1179300 1215664 1274997 1322838 1507871 1565972 1548032 1565793 1522789 1545422
9995 1545422 1559837 1562426 1487422 1646627 1833985 1789229 1762810 2005029 2230545 2367404 2599508
9984 2599508 2738738 2908155 2998292 3112680 3443391 3646423 3850070 4135123 4328577 4509070
9974D509070K64612K74759K68795L96769K11148J22207M27882M48081M13247L50167
9964G686737M73067Q44011Q76365J212326J202580J240053J131024J306222J237938
9955A7210323J164241J083539J063852J004732Q21449Q10332P30702O26125L46604
9946B4861899K72713K94643L27917Q8664j00568k29769J9481N27996Q58662J212873
9936B8134511J410968J589159J653190J741569J615724J648137J606996J627360
9928D1027614J686667J647308J446036J270752J155736N76259L7265n01291q10933
9919D7535413r48564j019793r53485q97429p60358m96164l36069k5358K65232
9910D2363425M60518N25788L60435K00446J48171L94576P60760R22774R96169
$$ plain form
9974 4509070 4773682 5048441 5317236 5714005 5925153 6047360 6475242 6923323 7336570 7686737
9964 7686737 8159804 9003815 9880180 11092506 12295086 13535139 14666163 15972385 17210323
9955 17210323 18374564 19458103 20521955 21526687 22348136 23158468 23889170 24515295 24861899
9946 24861899 25134612 25429255 25757172 25845836 25745268 25515499 25534980 26062976 26921638 28134511
9936 28134511 29545479 31134638 32787828 34529397 36145121 37793258 39400254 41027614
9928 41027614 42714281 44361589 45807625 47078377 48234113 48810372 48847637 48346346 47535413
9919 47535413 46586849 45567056 44613571 43716142 42955784 42459620 42123551 42098193 42363425
9910 42363425 42823943 43349731 43710166 43910612 44058783 44453359 45214119 46136893 47133062
9901D7133062J125858J117025P63361L71215N9742l46451p11566j177203j445748
9892D6889295j446941j268393p96085q00207j141984j195629j280400r59132n67483
9883C7433041m22309k06987R5101M21087J042446J420952J910348K066795J932483
9874D5692957J568955J387462J156492Q45271N40025K42473N2583J11361P9715
9865E1677294R7733L932k11568o04416j017299j190203j156857r14272n22518
9856D6161826o5103N72865J133505J732734K043327K138192J991123J774107J729995
9847E9212571J975925K244356K338981J944976J596903J101059R04597P26870
9839G2046238K91448l99749r82372j460172j521344j701338j679275j280740r32039
$$ plain form
9901 47133062 48258920 49375945 50139306 50510521 50570263 50223812 49512246 48335043 46889295
9892 46889295 45442354 44173961 43377876 42577669 41435685 40240056 38959656 38000524 37433041
9883 37433041 37010732 36803745 36898846 37319933 38362379 39783331 41693679 43760474 45692957
9874 45692957 47261912 48649374 49805866 50651137 51191162 51433635 51486218 51597579 51677294
9865 51677294 51775027 51778959 51567391 50962975 49945676 48755473 47598616 46684344 46161826
9856 46161826 46096723 46669588 47803093 49535827 51579154 53717346 55708469 57482576 59212571
9847 59212571 61188496 63432852 65771833 67716809 69313712 70414771 71319368 72046238
9839 72046238 72337686 71937937 70955565 69495393 67974049 66272711 64593436 63312696 62380657
9830F2380657p81096o01832l83152j67305k248p3609k18184j15026K36239P60344
9820F1034788J285764J777662J754303J319472P73142J13422n15051j198985j760187
9811F4584330k099946k346656k723539k885429k786675k403643k221297k302438
9803D4814707k143561j918259j924626j679827j453793j229826q70566n73933
9795C3020316l62677o8378K86928J99214j65379l51401p48135j016946j201558
9786B9591984j119526r98600r33473j129637j496519j490014j740242j987432
9778A8696541j907080j702281j463082j114816r06151q46040o97251m52494m90694
9769I116652l84580k98625l02708l57221l23547m10322l20207l19310k78802r4005
$$ plain form
9830 62380657 61599561 60997729 60614577 60447272 60445024 60371415 60153231 60038205 60274444 61034788
9820 61034788 62320552 64098214 65852517 67171989 67945131 68058553 67543502 66344517 64584330
9811 64584330 62484384 60137728 57414189 54528760 51742085 49338442 47117145 44814707
9803 44814707 42671146 40752887 38828261 37148434 35694641 34464815 33594249 33020316
9795 33020316 32657639 32589261 32876189 33075403 32910024 32558623 31810488 30793542 29591984
9786 29591984 28472458 27473858 26540385 25410748 23914229 22424215 20683973 18696541
9778 18696541 16789461 15087180 13624098 12509282 11603131 10757091 10059840 9607346 9116652
9769 9116652 8732072 8433447 8130739 7773518 7449971 7039649 6719442 6400132 6121330 6027325
9759F027325j01702q4445k34281k34028j27999l7295j34386j04890j13208k10482
9749D644609k30251j38951l3043j25514j14243o0134j13619j67328o427j04734
9739C550365k00917j24579o8492j03654n9338l8409l7370p0983k640N3476j0333
9728B887126j53420o0653k6503l6160o4347k1291k9538k3508n8270n1134q1337
9717B280965J7103m571J3592L3766O545K0555k2397R8993p8553j74409q0533m1134
9705B069922j9102K9569R5804p6605j08911K418L3175Q910p9068j747j2033J9827
9693A962159J59791o771p173o2785m3694Q4585J80423j818J0213J30423l4923
9682B370430k30Q5476q13p3041q1277j07579j21079o9707j00226j42364Q3720
$$ plain form
9759 6027325 5925623 5841178 5606897 5372869 5244870 5207575 5073189 4968299 4855091 4644609
9749 4644609 4414358 4275407 4242364 4116850 4002607 3942473 3828854 3661526 3655099 3550365
9739 3550365 3349448 3224869 3156377 3052723 2993385 2954976 2917606 2846623 2843983 2897459 2887126
9728 2887126 2733706 2673053 2646550 2610390 2546043 2524752 2495214 2471706 2413436 2362302 2280965
9717 2280965 2298068 2293497 2307089 2340855 2347400 2367955 2345558 2444551 2365998 2191589 2111056 2069922
9705 2069922 2050820 2080389 2176193 2099588 1990677 1993095 2026270 2035180 1956112 1954365 1942332 1962159
9693 1962159 2121950 2115179 2108006 2045221 2001527 2086112 2266535 2264717 2274930 2405353 2370430
9682 2370430 2370200 2455676 2454863 2381822 2300545 2192966 2071887 2002180 1901954 1759590 1843310
9671A843310K2991K2872P7747J11746M1278l8438R5064K28136N1526L139j8181
9660B441190M8335o3903j0471q92l1562L5775j10199j30462p7678q4184n9977
9649A955972q6543l7283J738j17828k7571j55M0299J26793J06730M8917P5020
9638B086089J34420M4763K13005J61427J96748K61236J08001L0690j1752J4636
9628C239263j57002k76129k53553j11053r5480j76155K891J5680j28684r3423
9618A966355N3707J200J6014K48878K05428J84046J32036L1460J55229J99890
9608C194243J8370Q2880Q3322o855r4670j11015p4060p5223p4988k3929j02926
9597B815149j27806j01341j9205j42477j36240j4394p081K1688Q2001l9161N9507
$$ plain form
9671 1843310 1866301 1889173 1966920 2078666 2119944 2081506 2176570 2404706 2456232 2459371 2441190
9660 2441190 2489525 2425622 2415151 2414259 2382697 2418472 2308273 2177811 2100133 2015949 1955972
9649 1955972 1869429 1832146 1833884 1716056 1688485 1688330 1728629 1855422 1962152 2011069 2086089
9638 2086089 2220509 2265272 2478277 2639704 2836452 3097688 3205689 3236379 3224627 3239263
9628 3239263 3082261 2806132 2552579 2441526 2346046 2169891 2172782 2188462 2059778 1966355
9618 1966355 2020062 2021262 2037276 2286154 2491582 2675628 2807664 2839124 2994353 3194243
9608 3194243 3212613 3295493 3378815 3371960 3277290 3166275 3092215 3016992 2942004 2918075 2815149
9597 2815149 2687343 2586002 2566797 2424320 2288080 2273686 2266605 2288293 2370294 2331133 2390640
9586B390640R2729J13953K26422K63909J96839J65899K20226K35390K84924K26968
9576D417899K76036J82196J44966J09905K07167J93044J43030L01013K68712M76658
9566F720626K80402K84565K12385J37462K32603K15836J62201P5616P9052K19521
9556H620269K44478M45525O34014P20656J018957J212322J606427J846801K036050
9547A8385499K578791K911674L016743K640525K377727J953715J331479P11170
9539C5907323n2242j138246k383501l202437l586829l252635k427199j780176
9531A8084058j327538r00266k91280M713L11219O24264J160353J612828J970417
9522B1248768K182675K479758K473498K507569K355670K208151J648171J015835
$$ plain form
9586 2390640 2483369 2597322 2823744 3087653 3284492 3450391 3670617 3906007 4190931 4417899
9576 4417899 4693935 4876131 5021097 5131002 5338169 5531213 5674243 5975256 6243968 6720626
9566 6720626 7001028 7285593 7497978 7635440 7868043 8083879 8246080 8321696 8400748 8620269
9556 8620269 8864747 9310272 9944286 10664942 11683899 12896221 14502648 16349449 18385499
9547 18385499 20964290 23875964 26892707 29533232 31910959 33864674 35196153 35907323
9539 35907323 35855081 34716835 32333334 29130897 25544068 22291433 19864234 18084058
9531 18084058 16756520 15856254 15564974 15569687 15880906 16505170 17665523 19278351 21248768
9522 21248768 23431443 25911201 28384699 30892268 33247938 35456089 37104260 38120095
9514C8120095K40818l88662j105454j713181k128205k251087k241726j897220
9506B6635378j660619j351519j026172p59223n72421j59318K10583M71011Q97668
9497B2685368J235104J678393K422041K908624L574874M239818M752346N038201
9489D8534769N080904M737928M089915L131618K084237O77194r65834k643745
9481F4726986l842331m654241m910965m794753m226887l510574k657375j824169
9473C4305691r39244p7723O90009J337136K264860L225259M052081M627215N218295
9464E4703579N738151N575420N241750M489008L471303K080696L12589j430998
9456H0181498l082670m568221n558859o202391o393441n870190n120737m355655
$$ plain form
9514 38120095 38360913 37972251 36866797 35153616 33025411 30774324 28532598 26635378
9506 26635378 24974759 23623240 22597068 21837845 21265424 21106106 21316689 21787700 22685368
9497 22685368 23920472 25598865 28020906 30929530 34504404 38744222 43496568 48534769
9489 48534769 53615673 58353601 62443516 65575134 67659371 68336565 67370731 64726986
9481 64726986 60884655 56230414 51319449 46524696 42297809 38787235 36129860 34305691
9473 34305691 33366447 33288724 33978733 35315869 37580729 40805988 44858069 49485284 54703579
9464 54703579 60441730 66017150 71258900 75747908 79219211 81299907 81612496 80181498
9456 80181498 77098828 72530607 66971748 60769357 54375916 48505726 43384989 39029334
9448C9029334l283559k344969j790761j248246o81810j62381L52247Q99628J468549
9439C2238032K181235K775801L230903L478126L720976L747673L441040K903740
9431E7717526K200411J312327q3781j399518k250347l020523l768664m193423
9423D6514008m088982l495468k814561k395746j872195j133918o11259j29961
9415B9971918M24237J075800J873161K528397L287906L917419M530600M843531
9407E2452969M838256M813273M311682L533440K321416Q05114o76169k395396
9399G0004585m020163n019704n714929n685273n356288m645453m013451l272770
9391C2276554k382075j693124j181470o53292J27509O63528J277634J814374K225051
$$ plain form
9448 39029334 35745775 33400806 31610045 30361799 29679989 29517608 29869855 30769483 32238032
9439 32238032 34419267 37195068 40425971 43904097 47625073 51372746 54813786 57717526
9431 57717526 59917937 61230264 61146483 59746965 57496618 54476095 50707431 46514008
9423 46514008 42425026 38929558 36114997 33719251 31847056 30713138 30101879 29971918
9415 29971918 30396155 31471955 33345116 35873513 39161419 43078838 47609438 52452969
9407 52452969 57291225 62104498 66416180 69949620 72271036 73076150 72399981 70004585
9399 70004585 65984422 60964718 55249789 49564516 44208228 39562775 35549324 32276554
9391 32276554 29894479 28201355 27019885 26366593 26494102 27157630 28435264 30249638 32474689
9382C2474689K395818K608765K683918K473633K037721J509008P02107k15885
9374D6669774j319431k174469k929753l556387l761870l481377l225794k720047
9366B3500646k083165j527514j124361j004654q10441m50527l65575j52015j6101
9357A5966293K87127M92121N92853R64185J111941J236126J394517J734396J516111
9348B5295670J139851R53665M47043L8020n25811j007270j369789j814190j960926
9339B1196263j909559j708052j433320j133125r85679p97861l67351j19166K50907
9330A2993057L63779N99942R26536J122970J376023J667032J467505J317192J105534
9321B2939570Q35202L28027o0931p47708j498017j997406k283485k287897j895988
$$ plain form
9382 32474689 34870507 37479272 40163190 42636823 44674544 46183552 46885659 46669774
9374 46669774 45350343 43175874 40246121 36689734 32927864 29446487 26220693 23500646
9366 23500646 21417481 19889967 18765606 17760952 16950511 16499984 16134409 15982394 15966293
9357 15966293 16253420 16745541 17338394 18302579 19414520 20650646 22045163 23779559 25295670
9348 25295670 26435521 27389186 27836229 27874249 27348438 26341168 24971379 23157189 21196263
9339 21196263 19286704 17578652 16145332 15012207 14026528 13228667 12861316 12742150 12993057
9330 12993057 13356836 13956778 14883314 16006284 17382307 19049339 20516844 21834036 22939570
9321 22939570 23774772 24102799 24041868 23294160 21796143 19798737 17515252 15227355 13331367
9312A3331367j440989j073855q60237p63192o37757m07864k89165k47307j24718
9303G486283k51548j18263j53620j53379n64q7871j14229j50755j23878r5749
9293F236427j61696j77221k12366k04130j70790J5182q4897j53749q2670j577
9283E002513M9719k3334p2927j47928j02020o8718m2558L2436M4735q5518k34354
9272D352046n0676Q4820J31937l1698j46789o3418P6218o6406j39047m999r147
9261D132841N2135j21818M1584p795l341j34340j40392R4253K0265j03763r3509
9250C736120j08383M3765R608j7409L2809P1901Q243j05248j24196M6639P4304
9239C668153J1760m864p6794m9148N2015N9902k2275m8885j4260q4345M9327J58888
$$ plain form
9312 13331367 11890378 10816523 9956286 9193094 8555337 8147473 7858308 7611001 7486283
9303 7486283 7234735 7116472 6962852 6809473 6808909 6721038 6606809 6456054 6332176 6236427
9293 6236427 6074731 5897510 5685144 5481014 5310224 5325406 5240509 5086760 5004090 5002513
9283 5002513 5052232 5028898 4955971 4808043 4706023 4637305 4594747 4627183 4671918 4586400 4352046
9272 4352046 4301370 4386190 4518127 4486429 4339640 4276222 4352440 4286034 4146987 4141988 4132841
9261 4132841 4184976 4063158 4104742 4096947 4093606 3959266 3818874 3913127 3933392 3829629 3736120
9250 3736120 3627737 3671502 3681110 3663701 3696510 3768411 3776654 3671406 3547210 3593849 3668153
9239 3668153 3679913 3675049 3598255 3549107 3601122 3661024 3638749 3589864 3575604 3491259 3540586 3699474
9227C699474j4285K9656o0507r6874k2358l0438Q226N462k2897r763m3184p018
9215C435494Q740j31650j8446Q9859P062O7230P224o0201p2499j9410R373r9206
9203C223570j1053j24682o4402p82P1844O4116k192j24932q9595j0047m158L8730
9191B966417l1282r4297n1445J54297o4916N5631O3488r242j62101m1455N907
9180B791002P8637q3655k9000R3102Q8995k5801m9100o9023j3520m0181p0954
9169B670502L587M9616j36340l4251J48876J114j25296O1862J10237o7561l1530
9158B650816p8401l1353q0451r5690R6182J403n3251j04301m1277J07459N1422
9147B422558J0944N5967j12790J1709O6525l2934k8371J14068q54p0531m8663
$$ plain form
9227 3699474 3685189 3714845 3654338 3557464 3535106 3504668 3512894 3518356 3495459 3485696 3442512 3435494
9215 3435494 3444234 3312584 3294138 3383997 3391059 3458289 3465513 3405312 3332813 3313403 3322776 3223570
9203 3223570 3212517 3087835 3023433 3022651 3094495 3158611 3156419 3031487 2941892 2931845 2927687 2966417
9191 2966417 2935135 2840838 2789393 2943690 2878774 2934405 2997893 2988651 2826550 2785095 2791002
9180 2791002 2869639 2785984 2756984 2850086 2939081 2913280 2864180 2795157 2781637 2741456 2670502
9169 2670502 2674089 2723705 2587365 2553114 2701990 2703104 2577808 2639670 2749907 2682346 2650816
9158 2650816 2572415 2541062 2460611 2364921 2461103 2462506 2409255 2304954 2263677 2371136 2422558
9147 2422558 2433502 2489469 2376679 2388388 2454913 2421979 2393608 2507676 2506822 2436291 2387628
9136B387628j13073O6997J10780p5401l9181R7259l6867j30559P6905l5980q9342
9125B219166Q780O3190L3977R332k6514p237P4672n1646p0644j34739l5337L1241
9113B114241N8278k0012j56805j6512P3988l7474Q3954N8707J47135K487k7491
9102B280496r6874j47208L4242j0890o3832q8619J305q4946j0412N3864m2387
9091A824739j11041N4402N1300L883O4878q5942j37488j06736q572q172J7424
9080A558675J25902N4399J45868J33871N4610p7146o1742M0177O1411J1248l1526
9069B015747m3731q5425m6342q8773M911L1208R456r8284r8026K0621k6818p0002
9057A524542J2255O8488k2215q2453N9103J12396Q2144J43735P8654J21790j3806
$$ plain form
9136 2387628 2274555 2341552 2452332 2376931 2337750 2435009 2398142 2267583 2344488 2308508 2219166
9125 2219166 2227946 2291136 2325113 2334445 2307931 2300694 2375366 2323720 2253076 2118337 2083000 2114241
9113 2114241 2172519 2152507 1995702 1979190 2053178 2015704 2099658 2158365 2305500 2307987 2280496
9102 2280496 2183622 2036414 2070656 2059766 1995934 1907315 1908620 1823674 1813262 1867126 1824739
9091 1824739 1713698 1768100 1819400 1823283 1888161 1802219 1664731 1557995 1549423 1541251 1558675
9080 1558675 1684577 1738976 1884844 2018715 2073325 1996179 1934437 1974614 2036025 2047273 2015747
9069 2015747 1972016 1886591 1840249 1751476 1756387 1787595 1797051 1698767 1600741 1621362 1594544 1524542
9057 1524542 1536797 1605285 1583070 1500617 1559720 1672116 1754260 1897995 1976649 2098439 2084633
9046B084633k64980j36182J48412m773L0427P7006k16897j34951j38667j92470
9036A251558o2380Q2842J8494J9133o7258q9470R0226R1704K9121J0989j3378
9025A361581P9155K9487Q1658l0547J44196Q7331n9274n1007J6332K8478k2467
9014A664923j84635q0240M8705N0287k2656j47161j1301J28311k4360j8580k3002
9003A380291n0366j70229k49101P3194K9158J188l7052J51742J2786J06138J93087
8992A440836J97828m657j3080K4907m0709p0675j29533j15570q0678n1271q8290
8981A069108l7546L8955O4128k3962j23092n149P5627l8745M4945K05645N4039
8970A323953n9190n318l7132M3247R5173O6981N4123K789n0012m3467k03858k1798
$$ plain form
9046 2084633 1819653 1683471 1831883 1827110 1857537 1934543 1717646 1582695 1444028 1251558
9036 1251558 1189178 1272020 1290514 1309647 1242389 1152919 1243145 1334849 1363970 1374959 1361581
9025 1361581 1440736 1470223 1551881 1521334 1665530 1752861 1693587 1642580 1658912 1687390 1664923
9014 1664923 1480288 1400048 1448753 1499040 1476384 1329223 1317922 1446233 1421873 1403293 1380291
9003 1380291 1329925 1159696 910595 983789 1012947 1014135 977083 1128825 1141611 1247749 1440836
8992 1440836 1638664 1634007 1620927 1645834 1605125 1534450 1404917 1289347 1208669 1157398 1069108
8981 1069108 1031562 1070517 1134645 1110683 987591 982442 1058069 1019324 1064269 1269914 1323953
8970 1323953 1264763 1259445 1222313 1265560 1360733 1427714 1481837 1484626 1434614 1391147 1187289 1165491
8958A165491O0600O6053o3177O5580j38263n7914P7460k1228j616m1583N1587
8947A162990P132r6949p0020l681P3235M116O8902M3507o2009O9074L5426j71353
8935A060370j07193J4706P1351N5819K7914J20748k1323j2952o3593J4740J05437
8924A266024k1935j06818n8727O2416n379K7520m9984j36787K4781N7085m0578
8913A017618K9767P5635J25845N0065m8097K0343n0315o9227K5890m2019q1736
8902A053769N665j82107k9697L4444j3088J07187R9659Q0716P2691l1164P3818
8891A271893R7983P3515Q0213J8255J18403J38811K4863j4144j04246k28818j38403
8880A338325j26750L3228K5551J47703J26675p7466k4538M6233O8833N5598J00494
$$ plain form
8958 1165491 1226091 1292144 1228967 1294547 1156284 1098370 1175830 1154602 1152986 1111403 1162990
8947 1162990 1170122 1073173 1003153 999472 1072707 1076823 1145725 1189232 1127223 1196297 1231723 1060370
8935 1060370 953177 967883 1039234 1095053 1122967 1243715 1222392 1209440 1145847 1160587 1266024
8924 1266024 1244089 1137271 1078544 1140960 1135581 1163101 1113117 976330 1001111 1058196 1017618
8913 1017618 1047385 1123020 1248865 1298930 1250833 1271176 1220861 1151634 1177524 1135505 1053769
8902 1053769 1059434 877327 847630 882074 868986 976173 1075832 1156548 1229239 1198075 1271893
8891 1271893 1369876 1443391 1523604 1541859 1660262 1799073 1823936 1809792 1705546 1476728 1338325
8880 1338325 1211575 1244803 1270354 1418057 1544732 1467266 1442728 1488961 1557794 1613392 1713886
8869A713886n8389l1633q7696j31799L3413N0794J66815J82157M7931l0405J56412
8858B011486K47637J87309J17377Q9557L0889R0821q208j54923k90646k44150
8848B077149k03679p4737q6712p6236j31629p3281n7078J4154q8153j85899J3484
8837A127383O9772m0476l8878Q2131J39564l4090j4003n3415J0758l3592R4286
8826A309440k1230l8770j8640o9962l5827j3300M7817J11889J41371J90580J10553
8815A713921J58129K24450K61764K43058J12522j6396M1835N4420R5947k46772
8805B642878m01040l67697j00269j95848j92608j92246m5498n4288N2262j04068
8795A041578O0603j00281j05811N7232o8191o4611K25J01249N0040L5480j9567
$$ plain form
8869 1713886 1655497 1623864 1536168 1404369 1437782 1488576 1655391 1837548 1885479 1855074 2011486
8858 2011486 2259123 2446432 2563809 2653366 2684255 2775076 2766868 2611945 2321299 2077149
8848 2077149 1873470 1798733 1712021 1635785 1504156 1430875 1373797 1387951 1299798 1113899 1127383
8837 1127383 1197155 1156679 1117801 1199932 1339496 1305406 1291403 1237988 1248746 1215154 1309440
8826 1309440 1288210 1249440 1230800 1160838 1125011 1111711 1159528 1271417 1412788 1603368 1713921
8815 1713921 1872050 2096500 2358264 2601322 2713844 2697448 2739283 2793703 2889650 2642878
8805 2642878 2241838 1874141 1773872 1578024 1385416 1193170 1147672 1093384 1145646 1041578
8795 1041578 1102181 1001900 896089 953321 885130 820519 820744 921993 972033 1007513 987946
8784I87946p1172m9731p0578R3301R2065J46071q8392o8495J2608Q4061p879J10906
8772A170711P0068M9050K7910J27967J46290J19586K4095L2285J0226J497J9539
$$ plain form
8784 987946 916774 867043 796465 889766 981831 1127902 1039510 971015 983623 1067684 1059805 1170711
8772 1170711 1240779 1289829 1317739 1445706 1591996 1711582 1735677 1767962 1778188 1779685 1799224
$$ [...]
##END NTUPLES=NMR SPECTRUM
##END=
