##TITLE=Analysis number 328989
Compound Code cc 58604
Book Reference 528/54
Project Code adrs
Chemist Name davee
##JCAMPDX= 6.0         $$ Bruker NMR JCAMP-DX V2.0
##DATA TYPE= NMR SPECTRUM
##DATA CLASS= NTUPLES
##ORIGIN= Bruker BioSpin GmbH
##OWNER= nmr
$$ XWIN-NMR		Version 3.5
$$ Mon Jul 23 12:45:27 2007 GMT Daylight Time (UT+1h)  MAYBRIDGE\nmr@NMR_250MHZ
##.OBSERVE FREQUENCY= 250.131544655141
##.OBSERVE NUCLEUS= ^1H
##.ACQUISITION MODE= SIMULTANEOUS (DQD)
##.ACQUISITION SCHEME= undefined
##.AVERAGES= 16
##.DIGITISER RES= 18
##SPECTROMETER/DATA SYSTEM= dpx250
##.PULSE SEQUENCE= zg30
##.SOLVENT NAME= CDCl3
##.SHIFT REFERENCE= (INTERNAL, CDCl3, 0, 16.522)
##AUDIT TRAIL= $$ (NUMBER, WHEN, WHO, WHERE, WHAT)
$$ ##TITLE= Audit trail, XWIN-NMR		Version 3.5
$$ ##JCAMPDX= 5.01
$$ ##ORIGIN= Bruker BioSpin GmbH
$$ ##OWNER= nmr
$$ C:\u/data/dgb/nmr/ADRS/1330/pdata/1/auditp.txt
$$ ##AUDIT TRAIL=  $$ (NUMBER, WHEN, WHO, WHERE, WHAT)
(   1,<2007-07-23 12:45:05.02 +100>,<MAYBRIDGE\nmr>,<NMR_250MHZ>,
      <created by zg, POWCHK disabled, PULCHK disabled
       configuration hash MD5:
       76 6E 9A 78 1E 09 19 81 EC 84 63 8F B0 6A 59 2D
       data hash MD5: 64K
       95 EF 00 B3 C1 4B 4C AE 70 E9 92 64 34 20 BB E1>)
(   2,<2007-07-23 12:45:17.51 +100>,<MAYBRIDGE\nmr>,<NMR_250MHZ>,
      <Start of raw data processing
       ef LB = 0.3 FT_mod = 6 PKNL = 1 SI = 32K 
       data hash MD5: 32K
       16 C7 5D 30 86 0E 97 0E 13 24 E0 A2 F3 7D 1F 92>)
(   3,<2007-07-23 12:45:19.19 +100>,<MAYBRIDGE\nmr>,<NMR_250MHZ>,
      <apk 
       data hash MD5: 32K
       37 98 4D 68 73 A7 9F 0A 48 A4 03 2A AB A6 CF 04>)
(   4,<2007-07-23 12:45:19.96 +100>,<MAYBRIDGE\nmr>,<NMR_250MHZ>,
      <abs ABSG = 5 
       data hash MD5: 32K
       95 2C B8 F4 8A A5 78 94 97 B9 39 A0 11 F4 83 57>)
$$ ##END=
$$ 
$$ hash MD5
$$ 94 FD 78 63 E1 55 22 EF DF 18 06 3C CA AD D0 EF
##$RELAX= 
##$RELAX= 
##$RELAX= 
##$RELAX= 
##$RELAX= 
##$RELAX= 
##$RELAX= 
$$ Bruker specific parameters
$$ --------------------------
##$DU= <C:\u>
##$EXPNO= 1330
##$NAME= <ADRS>
##$PROCNO= 1
##$TYPE= <nmr>
##$USER= <dgb>
##$AMP= (0..31)
100 100 100 100 100 100 100 100 100 100 100 100 100 100 100 100 100 100 
100 100 100 100 100 100 100 100 100 100 100 100 100 100 
##$AQSEQ= 0
##$AQ_mod= 3
##$AUNM= <au_zg>
##$AUTOPOS= <21 >
##$BF1= 250.13
##$BF2= 250.13
##$BF3= 250.13
##$BF4= 250.13
##$BF5= 500.13
##$BF6= 500.13
##$BF7= 500.13
##$BF8= 500.13
##$BYTORDA= 1
##$CFDGTYP= 0
##$CFRGTYP= 5
##$CHEMSTR= <none>
##$CNST= (0..31)
1 1 145 1 1 1 1 1 1 1 1 1 1 1 1 1 1 1 1 1 1 1 1 1 1 1 1 1 1 1 1 1 
##$CPDPRG= <>
##$CPDPRG1= <>
##$CPDPRG2= <>
##$CPDPRG3= <>
##$CPDPRG4= <mlev>
##$CPDPRG5= <mlev>
##$CPDPRG6= <mlev>
##$CPDPRG7= <mlev>
##$CPDPRG8= <mlev>
##$CPDPRGB= <>
##$CPDPRGT= <>
##$D= (0..31)
0 1 0 0 0 0 0 0 0 0.06 0 0 0 0 0 0 0.0002 0 0 0 0 0 0 0 0 0 0 0 0 0 0 
0 
##$DATE= 1185191103
##$DBL= (0..7)
120 120 120 120 120 120 120 120 
##$DBP= (0..7)
150 150 150 150 150 150 150 150 
##$DBP07= 0
##$DBPNAM0= <>
##$DBPNAM1= <>
$$ [...]
##$SUBNAM7= <"">
##$SUBNAM8= <"">
##$SUBNAM9= <"">
##$SW= 20.6930455092707
##$SWIBOX= (0..15)
0 0 3 0 0 0 0 0 0 0 0 0 0 0 0 0 
##$SW_h= 5175.983436853
##$TD= 65536
##$TD0= 1
##$TE= 296.16
##$TE2= 300
##$TE3= 300
##$TEG= 300
##$TL= (0..7)
0 120 120 120 120 120 120 120 
##$TP= (0..7)
150 150 150 150 150 150 150 150 
##$TP07= 0
##$TPNAME0= <>
##$TPNAME1= <>
##$TPNAME2= <>
##$TPNAME3= <>
##$TPNAME4= <>
##$TPNAME5= <>
##$TPNAME6= <>
##$TPNAME7= <>
##$TPOAL= (0..7)
0.5 0.5 0.5 0.5 0.5 0.5 0.5 0.5 
##$TPOFFS= (0..7)
0 0 0 0 0 0 0 0 
##$TUNHIN= 0
##$TUNHOUT= 0
##$TUNXOUT= 0
##$USERA1= <user>
##$USERA2= <user>
##$USERA3= <user>
##$USERA4= <user>
##$USERA5= <user>
##$V9= 5
##$VALIST= <valist>
##$VCLIST= <CCCCCCCCCCCCCCC>
##$VD= 0
##$VDLIST= <DDDDDDDDDDDDDDD>
##$VPLIST= <PPPPPPPPPPPPPPP>
##$VTLIST= <TTTTTTTTTTTTTTT>
##$WBST= 1024
##$WBSW= 4
##$XGAIN= (0..3)
0 0 0 0 
##$XL= 0
##$YL= 0
##$YMAX_a= 471450
##$YMIN_a= -451230
##$ZGOPTNS= <>
##$ZL1= 120
##$ZL2= 120
##$ZL3= 120
##$ZL4= 120
##$ABSF1= 16.522
##$ABSF2= -4.171173
##$ABSG= 5
##$ABSL= 3
##$ALPHA= 0
##$AQORDER= 0
##$ASSFAC= 0
##$ASSFACI= 0
##$ASSFACX= 0
##$ASSWID= 0
##$AUNMP= <proc_1d>
##$AZFE= 0.1
##$AZFW= 0.1
##$BCFW= 0
##$BC_mod= 0
##$BYTORDP= 0
##$COROFFS= 0
##$CY= 12.5
##$DATMOD= 1
##$DC= 0
##$DFILT= <>
##$DTYPP= 0
##$F1P= 14.0000005364418
##$F2P= -0.99999901652339
##$FCOR= 0.5
##$FTSIZE= 32768
##$FT_mod= 6
##$GAMMA= 0
##$GB= 0
##$INTBC= 1
##$INTSCL= 1
##$ISEN= 128
##$LB= 0.3
##$LEV0= 0
##$LPBIN= 0
##$MAXI= 10000
##$MC2= 0
##$MEAN= 0
##$ME_mod= 0
##$MI= 0
##$NCOEF= 0
##$NC_proc= -2
##$NLEV= 6
##$NOISF1= 0
##$NOISF2= 0
##$NSP= 0
##$NTH_PI= 0
##$NZP= 0
##$OFFSET= 16.522
##$PC= 1
##$PHC0= -49.54369
##$PHC1= 5.045677
##$PH_mod= 1
##$PKNL= yes
##$PPARMOD= 0
##$PSCAL= 4
##$PSIGN= 0
##$REVERSE= no
##$SF= 250.13
##$SI= 32768
##$SIGF1= 0
##$SIGF2= 0
##$SINO= 400
##$SIOLD= 32768
##$SREGLST= <1H.CDCl3>
##$SSB= 0
##$STSI= 32768
##$STSR= 0
##$SW_p= 5175.98343685301
##$SYMM= 0
##$S_DEV= 0
##$TDeff= 65536
##$TDoff= 0
##$TI= <Analysis number 999999
Compound Code 99
Book Reference 9
Project Code 9>
##$TILT= no
##$TM1= 0
##$TM2= 0
##$TOPLEV= 0
##$USERP1= <user>
##$USERP2= <user>
##$USERP3= <user>
##$USERP4= <user>
##$USERP5= <user>
##$WDW= 1
##$XDIM= 32768
##$YMAX_p= 427207664
##$YMIN_p= -50643
$$ End of Bruker specific parameters
$$ ---------------------------------
##NTUPLES= NMR SPECTRUM
##VAR_NAME=  FREQUENCY,     SPECTRUM/REAL,   SPECTRUM/IMAG
##SYMBOL=    X,             R,               I
##VAR_TYPE=  INDEPENDENT,   DEPENDENT,       DEPENDENT
##VAR_FORM=  AFFN,          ASDF,            ASDF
##VAR_DIM=   32768,         32768,           32768
##UNITS=     HZ,            ARBITRARY UNITS, ARBITRARY UNITS
##FACTOR=    0.157963299565203, 1,           1
##FIRST=     4132.6476996994, 0,             0
##LAST=      -1043.33573715361, 0,           0
##MIN=       -1043.33573715361, -50643,      0
##MAX=       4132.6476996994, 427207664,     0
$$ Real data points
##PAGE= N=1
##DATA TABLE= (X++(R..R)), XYDATA
$$ [...]
$$ plain form
17627 3610 -9628 2772 3441 5538 4667 14011 24249 19724 9094 8204 8717 3436 -2590 -3353 -8713
17612 -8713 -10633 -13590 -3716 -6875 -5397 3229 23379 21896 13128 13230 4347 -5512 3360 16010
17598 16010 18534 27365 20031 3498 2126 7934 7768 3140 -1362 7026 6782 1467 17384 5391
17584 5391 -4533 13455 19872 12397 14817 9609 8643 -3759 -20204 -25666 -28966 -29006 -16530 -15304
17570 -15304 -19355 -16383 -15749 -8021 691 12199 14970 15624 8859 -6113 -11905 3471 4287 -2511
17556 -2511 -11702 -19604 -24349 -27320 -17704 -19662 -27484 -29265 -23408 -3532 -5179 -17614 -17615 -12229 -9182
17541 -9182 -2058 1903 7519 -5496 -3211 8748 -2222 -11887 -11362 -23239 -34085 -35617 -19616
17528 -19616 -226 -688 -5368 1998 -5376 -10579 -4466 3252 -2470 922 14707 19928 2835 2244
$$ packed form
17627C610j3238J2400O69K097q71R344J0238m525j0630q90N13n281o026p63n360
17612h713j920k957R874l159J478Q626K0150j483q768J02q883r859Q872J2650
17598A6010K524Q831p334j6533j372N808j66m628m502Q388k44n315J5917j1993
17584E391r924J7988O417p475K420n208r66j2402j6445n462l300m0J2476J226
17570a5304m051K972O34P728Q712J1508K771O54o765j4972n792J5376Q16o798
17556b511r191p902m745k971R616j958p822j781N857J9876j647j2435jN386L047
17541i182P124L961N616j3015K285J1959j0970r665N25j1877j0846j532J6001
17528a9616J9390m62m680P366p374n203O113P718n722L392J3785N221j7093n91
$$ plain form
17514 2244 2976 -2596 5726 10033 8134 2025 -1918 -10158 -8047 4967 4131 3701 989 -15736 -9841
17499 -9841 -4634 -1310 -7314 -13253 -15268 6723 16516 23189 10040 215 5474 13518 15385 21940
17485 21940 10096 18497 28789 20278 16225 14127 2983 -11909 -11414 -6153 -11582 -4819 -7793 -9785
17471 -9785 -4226 -7332 -9426 -15614 -15672 -9596 -8349 -16 -5710 -5388 -9151 -7303 4843 1791 -5801
17456 -5801 -11013 -2915 3901 -1493 5925 -13788 -12277 -1443 6308 27116 43521 43500 32620 56643
17442 56643 108578 153013 156513 99278 59014 30654 16971 3506 -4 8471 16719 -1889
17430 -1889 -8305 5173 12562 15051 5257 -5472 -3438 4369 14372 13438 7298 7872 16839 1863
17416 1863 -1914 14941 13307 15970 3644 -2442 3057 134 -6723 -6675 -15091 -10315 -4014 -12604 -25952
$$ packed form
17514B244P32n572Q322M307j899o109l943q240K111J3014q36m30k712j6725N895
17499i841N207L324o004n939k015K1991R793O673j3149r825N259Q044J867O555
17485B1940j1844Q401J0292q511m053k098j1144j4892M95N261n429O763k974j992
17471i785N559l106k094o188n8O076J247Q333n694L22l763J848J2146l052p592
17456e801n212Q098O816n394P418j9713J511J0834P751K0808J6405k1j0880K4023
17442E6643N1935M4435L500n7235m0264k8360j3683j3465l510Q475Q248j8608
17430a889o416J3478P389K489r794j0729K034P807J0003r34o140N74Q967j4976
17416A863l777J6855j634K663j2326o086N499k923o857M8q416M776O301q590j3348
$$ plain form
17401 -25952 -17701 -10103 -14132 -16184 -13842 -10414 -6321 -3380 -18563 -17427 -15707 -7411 1862 821
17387 821 -2387 -12882 -4500 928 -9470 -2769 5261 5625 2143 -7057 -5447 1065 6738 -1605 -17286
17372 -17286 -26262 -10103 -11010 -13471 -1279 -5768 2613 4311 -8641 -12833 -7280 -997 -12927 -12573
17358 -12573 1055 7214 6090 15004 11624 17160 14137 -4964 -20247 -24555 -10383 -1330 -3811
17345 -3811 -13131 -23970 -21562 -12394 -382 667 -13458 -23684 -25656 -19118 -13349 -17396 -14838 -11412
17331 -11412 -2362 -576 -926 -4913 5776 4166 2714 -1615 -17661 -13468 -9922 -21512 -26760 -28353
17317 -28353 -23199 -25589 -23061 -14700 -6901 2391 -11019 -12495 -8567 -14798 -19242 -12297 -7190 715
17303 715 -504 -1776 317 -2809 -6663 -10091 -28922 -28444 -34051 -31614 -32057 -23604 -2411 -939 -8844
$$ packed form
17401b5952Q251P598m029k052K342L428M093K941j5183J136J720Q296R273j041
17387H21l208j0495Q382N428j0398O701Q030L64l482r200J610O512N673q343j5681
17372a7286q976J6159r07k461J2192m489Q381J698j2952m192N553O283j1930L54
17358a2573J3628O159j124Q914l380N536l023j9101j5283m308J4172R053k481
17345c811r320j0839K408R168J2012J049j4125j0226j972O538N769m047K558L426
17331a1412R050J786l50l987J0689j610j452m329j6046M193L546j1590n248j593
17317b8353N154k390K528Q361P799R292j3410j476L928o231m444O945N107P905
17303G15j219j272K093l126l854l428j8831M78n607K437m43Q453K1193J472p905
$$ plain form
17288 -8844 -6766 -3209 -2199 -3176 -4468 -20154 -19632 -13986 -26124 -31388 -23003 -5212 630 -13594
17274 -13594 -20578 -25580 -23437 -7630 1575 8656 9100 11530 633 -4976 -4516 -9578 301 6083
17260 6083 13300 19901 11725 3988 -6748 -23615 -14010 -2045 71 9595 -6419 -27683 -23175
17247 -23175 -8275 -4125 -14129 -5231 -6033 -12379 -6245 -10836 -28906 -26037 -19547 -14195 -9121 -5371
17233 -5371 -15091 -24963 -22088 -6722 -4165 -3571 7217 17540 14505 11711 -9451 -8027 6597 7630
17219 7630 -1810 -9396 -16316 -30684 -31694 -28708 -16969 -11231 -23042 -16599 -16808 -22527 -21417 -12998
17205 -12998 -2759 -15823 -15601 1730 -9215 -11913 -7931 -3953 -5316 1508 621 7579 -468 -11410
17191 -11410 -21572 -22454 -20305 -20922 -28222 -34748 -25288 -10052 1772 1742 -4333 368 -3226 -6816 -21974
$$ packed form
17288h844K078L557J010r77j292j5686N22N646j2138n264Q385J7791N842j4224
17274a3594o984n002K143J5807R205P081M44K430j0897n609M60n062R879N782
17260F083P217O601q176p737j0736j6867R605J1965K116R524j6014k1264M508
17247b3175J4900M150j0004Q898q02o346O134m591j8070K869O490N352N074L750
17233e371r720r872K875J5366K557N94J0788J0323l035k794k1162J424J4624J033
17219G630r440p586o920j4368j010K986J1739N738j1811O443k09n719J110Q419
17205a2998J0239j3064K22J7331j0945k698L982L978j363O824q87O958q047j0942
17191a1410j0162q82K149o17p300o526R460J5236J1824l0o075M701l594l590j5158
$$ plain form
17176 -21974 -11992 23079 25470 6499 -8040 -8497 -2929 -5489 -12871 -15602 -16894 -4929 -6397 -7685
17162 -7685 116 -10025 -8677 -2830 -136 -18272 -22862 6130 27580 33189 17219 2632 6029
17149 6029 2214 -723 -6015 -12925 -13851 -2856 -887 -3301 2169 12452 25915 21754 14510 10245
17135 10245 9146 2089 -735 -4616 -5792 -14529 -6350 -11505 -10171 262 12097 8936 186 -11290
17121 -11290 -17212 -17237 -9993 -4137 -9234 -5837 -16287 -27222 -27944 -14785 -3736 -6701 -19788 -24005
17107 -24005 -16856 -15450 -11556 -2310 7444 4856 835 -1405 -4495 -5650 -9461 -12135 -15801 -10301
17093 -10301 -4748 258 -12464 -19006 -12235 -3865 -6965 -12846 -22152 -16496 -18743 -13662 -15437 -8141
17079 -8141 -2619 -600 7859 16984 3880 72 9663 6195 4879 2133 -8169 -3649 329 -7676
$$ packed form
17176b1974R982L5071K391j8971j4539m57N568k560p382k731j292J1965j468j288
17162g685P801j0141J348N847K694j8136m590K8992K1450N609j5970j4587L397
17149F029l815k937n292o910r26J0995J969k414N470J0283J3463m161p244m265
17135A0245j099p057k824l881j176q737Q179n155J334J0433J1835l161q750j1476
17121a1290n922k5P244N856n097L397j0450j0935p22J3159J1049k965j3087m217
17107b4005P149J406L894R246R754k588m021k240l090j155l811k674l666N500
17093a0301N553N006j2722o542O771Q370l100n881r306N656k247N081j775P296
17079h141N522K019Q459R125j3104l808R591l468j316k746j0302M520L978q005
$$ plain form
17065 -7676 -6281 1577 -7634 -5346 -102 -13807 -22728 -15962 -24623 -28987 -13214 -1991 -6599 -8755
17051 -8755 -3090 -7640 -20566 -26698 -11753 3861 2974 -36 -4336 -18677 -12044 -1734 -7914 -18758
17037 -18758 -25248 -21395 -14461 -10274 -13549 -11673 -3682 -2299 -9019 -19807 -29131 -26158 -13360 -3222
17023 -3222 -3783 4652 6007 13601 15883 5892 -8001 -18073 -5879 3920 -186 -8255 -9700 -10495
17009 -10495 -833 2080 -5723 -9215 -20365 -32941 -34049 -25690 -24000 -22155 -26217 -12834 115
16996 115 4019 5945 -1014 -2739 5902 14922 14004 2280 -3537 3196 2764 -14938 -6133 6846 9483
16981 9483 5467 5581 1078 -2547 -8607 -18611 -9424 2280 6091 1013 -3159 -5283 -731 5505
16967 5505 4343 9884 11976 13754 -818 -12733 -904 4748 -4056 -7221 -14645 -11613 -13953 -11135
$$ packed form
17065g676J395P858r211K288N244j3705q921O766q661m364J5773J1223m608k156
17051h755N665m550j2926o132J4945J5614q87l010m300j4341O633J0310o180j0844
17037a8758o490L853O934M187l275J876P991J383o720j0788r324K973J2798J0138
17023c222n61Q435J355P594K282r991j3893j0072J2194R799m106q069j445p95
17009a0495R662K913p803l492j1150j2576j108Q359J690J845m062J3383J2949
16996A15L904J926o959j725Q641R020r18j1724n817O733m32j7702Q805J2979K637
16981I483m016J14m503l625o060j0004R187J1704L811n078m172k124M552O236
16967E505j162N541K092J778j4572j1915J1829N652q804l165p424L032k340K818
$$ plain form
16953 -11135 -7883 -13891 -15661 -815 14846 18108 19523 18449 19628 23822 19827 16201 1367 -4294
16939 -4294 -2879 11974 26729 17121 8603 5583 2701 -5790 -12907 -24856 -20127 -19572 -19300 -28543
16925 -28543 -20978 -7974 8199 1502 -11548 4774 9825 829 -2011 115 -8386 -9864 -10595 -17069
16911 -17069 -12536 -2515 -7336 -5698 -6507 -11365 -16093 -20688 -14590 -7530 9506 21447 15170 4102
16897 4102 8796 3341 -4696 -2582 -7204 4049 3976 -1762 3966 23098 12427 2135 -4453 -12345
16883 -12345 -5316 -4192 2664 7529 12500 17554 13165 23341 17909 13938 8123 -2748 8294 20685
16869 20685 14769 20375 31234 29935 12270 -3150 -14131 -8100 -9986 -11248 -7000 3213 6214
16856 6214 -12069 -3101 10425 -1491 -1510 5712 13857 12372 405 -8049 -3788 3074 2804 1812 -6271
$$ packed form
16953a1135L252o008j770J4846J5661L262J415j074J179M194l995l626j4834n661
16939d294J415J4853J4755r608q518l020k882q491p117j1949M729N55K72r243
16925b8543P565J3004J6173o697j3050J6322N051q996k840K126q501j478p31o474
16911a7069M533J0021m821J638q09m858m728m595O098P060J7036J1941o277j1068
16897D102M694n455q037K114m622J1253p3n738N728J9132j0671j0292o588p892
16883a2345P029J124O856M865M971N054m389J0176n432l971n815j0871J1042J2391
16869B0685n916N606J0859j299j7665j5420j0981O031j886j262M248J0213L001
16856F214j8283Q968J3526j1916j9P222Q145j485j1967q454M261O862k70r92q083
$$ plain form
16841 -6271 -7454 -16870 -21467 -13155 -4588 1541 1952 8366 6847 3650 10728 8328 14529 5147 2129
16826 2129 11577 14441 13609 13143 8005 -12443 -16216 -22856 -26889 -31764 -38395 -35584 -18543 -14678 -207
16811 -207 -7406 -2891 8576 13674 20958 20300 15140 -6729 -5274 -8029 -21598 -19740 -15684 -239
16797 -239 8201 182 3216 15094 4693 -11647 765 2656 -1058 1086 12277 15946 15197 10225
16783 10225 18680 23498 21590 9522 3112 -5736 -12103 -7173 -6097 -4501 -22703 -32464 -11113 2393
16769 2393 1581 -11483 -12047 -3183 -9711 -12022 -13825 -2789 222 1726 -3349 -15535 -10462 -4974
16755 -4974 -12651 -18983 -9249 -2752 -6587 -14346 -12115 -4874 -4547 -5119 5880 -2250 -10301 -8550 -13061
16740 -13061 -7322 -11888 -1851 835 3162 -4204 -12763 -27588 -25367 -12884 -5083 10312 4336
$$ packed form
16841f271j183r416m597Q312Q567O129M11O414j519l197P078k400O201r382l018
16826B129R448K864q32m66n138k0448l773o640m033m875o631K811J7041L865J4471
16811b07p199M515J1467N098P284o58n160k1869J455k755j3569J858M056J5445
16797b39Q440q019L034J1878j0401j6340J2412J891l714K144J1191L669p49m972
16783A0225Q455M818j908j2068o410q848o367M930J076J596j8202r761K1351J3506
16769B393q12j3064n64Q864o528k311j803J1036L011J504n075j2186N073N488
16755d974p677o332R734O497l835p759K231P241L27n72J0999q130q051J751m511
16740a3061N739m566J0037K686K327p366q559j4825K221J2483P801J5395n976
$$ plain form
16727 4336 -4992 11164 20555 15917 4955 4803 -36 1186 3248 -4568 1167 6089 26637 18979
16713 18979 11942 2107 -4610 -5156 -2056 8075 -6769 -16694 -7192 -20981 -25460 -19230 -20118 -3802
16699 -3802 -10863 -30451 -30074 -27976 -24209 -14506 -3631 -153 -5522 -1626 13327 23562 10333 6786
16685 6786 10151 7 -8941 5305 15235 11645 9978 -7057 -15020 -14475 -294 2002 476 3264
16671 3264 12505 11892 4222 -6546 -16463 -12274 -5472 -4057 5209 15880 11379 -8006 -17506 -19260
16657 -19260 -22155 -19576 -21297 -5141 9712 17105 1376 -8793 -11896 -11418 -7933 -10474 -333
16644 -333 -1599 3545 4128 -4397 545 10272 13607 -803 4100 12288 11180 14087 3503 -2602 -5294
16629 -5294 -21817 -37291 -26399 -15145 -4862 -8696 -21615 -10316 -9206 -17962 -22346 -13411 -5649
$$ packed form
16727D336r328J6156R391m638j0962j52m839J222K062p816N735M922K0548p658
16713A8979p037r835o717n46L100J0131j4844r925R502j3789m479O230q88J6316
16699c802p061j9588L77K098L767R703J0875L478n369L896J4953J0235j3229l547
16685F786L365j0144q948J4246R930l590j667j7035p963N45J4181K296j526K788
16671C264R241o13p670j0768r917M189O802J415R266J0671m501j9385r500j754
16657a9260k895K579j721J6156J4853P393j5729j0169l103M78L485k541J0141
16644c33j266N144N83q525M942R727L335j4410M903Q188j108K907j0584o105k692
16629e294j6523j5474J0892J1254J0283l834j2919J1299J110q756m384Q935P762
$$ plain form
16616 -5649 -2282 -430 7262 1382 -7766 -2870 5089 2564 -6635 -6463 -1220 7043 9522 17103 17748
16601 17748 13264 19298 24544 11475 -1051 -8131 -3776 -10729 -15204 -3156 5716 6842 -4020
16588 -4020 -3529 2577 1641 10729 15766 12222 5892 -7199 -10453 -7027 -11674 -5919 8320 13460 2586
16573 2586 -2558 8142 6387 3316 16424 21340 3711 -251 -9772 -7341 -9055 -1071 -763 -12813
16559 -12813 -19713 -10351 -14949 -8411 -15391 -16336 -14497 -1008 8592 -1642 -3561 1358 -17230 -20085
16545 -20085 -16202 -7687 -15761 -20398 -20525 -8768 -5788 7369 15493 23497 28006 17115 8270 1023
16531 1023 4778 4254 4298 3356 7146 8964 -6001 -1670 468 4396 13528 5982 -6001 -6070 -7519 -26514
16515 -26514 -29343 -16021 -9137 -12222 -22948 -31388 -34966 -12233 5010 11266 -5676 -9684 -10412
$$ packed form
16616e649L367J852P692n880r148M896P959k525r199J72N243Q263K479P581O45
16601A7748m484O034N246j3069j2526p080M355o953m475J2048Q872J126j0862
16588d020M91O106r36R088N037l544o330j3091l254L426m647N755J4239N140j0874
16573B586n144J0700j755l071J3108M916j7629l962r521K431j714P984L08j2050
16559a2813o900R362m598O538o980r45J839J3489R600j0234j919M919j8588k855
16545b0085L883Q515q074m637j27J1757K980J3157Q124Q004M509j0891q845p247
16531A023L755n24M4r42L790J818j4965M331K138L928R132p546j1983o9j449j8995
16515b6514k829J3322O884l085j0726q440l578K2733J7243O256j6942m008p28
$$ plain form
16502 -10412 -6019 -9263 -9930 10673 27546 11858 -963 -5106 -13044 -16123 -13265 -16766 -19618 -27906
16488 -27906 -16493 1770 -362 -77 -7895 -27504 -22821 -386 5705 -5182 -12398 -17452 -14651
16475 -14651 -24032 -25936 -11422 6718 1476 -5376 -6383 -21501 -19297 -1621 4391 -5383 -408
16462 -408 -3992 -3781 -2031 -12447 -29180 -23668 -8892 -3591 -7102 -11233 -13877 -20912 -27911 -23667
16448 -23667 -17218 -26583 -35609 -31990 -28839 -37322 -37869 -29712 -30089 -22445 -25500 -21737 -15587 -12991 -3696
16433 -3696 7416 15166 889 -6886 -6891 9368 20573 8148 9876 4345 -8356 -21930 -20341 -23273
16419 -23273 -24286 -19674 -19105 -15634 -24914 -18499 -9238 -13049 -21328 -23607 -13530 1511 294 -7981
16405 -7981 -15098 -23849 -23198 -19940 -21105 -18240 -12672 -14416 -19537 -16581 -12762 -16681 -28436 -16700
$$ packed form
16502a0412M393l244o67K0603J6873j5688j2821m143p938l079K858l501k852q288
16488b7906J1413J8263k132K85p818j9609M683K2435O091j0887p216n054K801
16475a4651r381j904J4514J8140n242o852j007j5118K204J7676O012r774M975
16462d08l584K11J750j0416j6733N512J4776N301l511m131k644p035o999M244
16448b3667O449r365r026L619L151q483n47Q157l77P644l055L763O150K596R295
16433c696J1112P750j4277p775nJ6259J1205j2425J728n531j2701j3574J589k932
16419b3273j013M612N69L471r280O415R261l811q279k279J0077J5041j217q275
16405g981p117q751O51L258j165K865N568j744n121K956L819l919j1755J1736
$$ plain form
16391 -16700 -10677 -29472 -23786 -10623 -5366 5149 16110 6350 14032 14412 5144 6459 9615 8664
16377 8664 9904 18307 20771 8801 15333 13162 1774 2252 -12183 -13340 -13197 -7931 -14490 -12680
16363 -12680 -17559 -21119 -13484 -13822 -25726 -26261 -20222 -25181 -12338 -1121 -6855 -21644 -30251 -18591
16349 -18591 -20689 -15615 6538 6634 -1125 -9298 -6885 -2078 -5991 3667 -12773 -23270 -13033 -5385
16335 -5385 -8592 -7444 -9952 -7565 -10507 -15920 -4111 2857 -2004 -798 2541 10203 15543 18499
16321 18499 18529 1900 -2956 10273 23992 32821 14844 10472 4966 -4295 -15147 -20004 -15329 -4004
16307 -4004 -3225 1013 8997 5236 1194 -1354 9124 14440 10220 7190 1400 -8402 -14453 -10784 -19518
16292 -19518 -22243 -23818 -26820 -18328 -24855 -33480 -21851 -7652 -959 3635 2385 2318 -5702 -11004
$$ packed form
16391a6700O023j8795N686J3163N257J0515J0961r760P682L80r268J315L156r51
16377H664J240Q403K464j1970O532k171j1388M78j4435j157J43N266o559J810
16363a2680m879l560P635l38j1904n35O039m959J2843J1217n734j4789q607J1660
16349a8591k098N074K2153R6p759q173K413M807l913R658j6440j0497J0237P648
16335e385l207J148k508K387k942n413J1809O968m861J206L339P662N340K956
16321A8499L0j6629m856J3229J3719Q829j7977m372n506r261j0852m857M675J1325
16307d004P79M238P984l761m042k548J0478N316m220l030n790r802o051L669q734
16292a9518k725j575l002Q492o527q625J1629J4199O693M594j250o7q020n302
$$ plain form
16278 -11004 -21017 -18153 -13934 -18299 -16715 -1905 10922 -3447 -13577 -14070 -8543 -6687 -20301
16265 -20301 -23877 -16018 -850 -8454 -8672 -11834 -2938 4958 4135 5127 9496 -4344 -5453 -7702 -13747
16250 -13747 -13046 13219 20847 11352 9188 9224 17058 17439 14460 21573 19746 2743 -1494 9149 4147
16235 4147 -1151 10360 6052 -123 1689 -1870 -7513 -9406 -15348 -13323 -21005 -21605 -19275 -14267 -17766
16220 -17766 -14797 -12007 -4653 -11321 -13836 -1831 -4691 3727 2809 -9395 -5459 5806 9904 6456
16206 6456 1272 142 1543 -5342 -5985 -11903 -16176 -9773 810 10405 2043 -1281 -5791 -15770 -5053
16191 -5053 -3826 -5062 -5919 -3995 4698 7233 5996 1703 1351 3711 -6212 3428 6467 1490 -10035
16176 -10035 -18213 -34744 -24966 -7016 -5045 -3988 5210 -1512 -1044 7885 8409 -8015 -22083 -35242
$$ packed form
16278a1004j0013K864M219m365J584J4810J2827j4369j0130m93N527J856j3614
16265b0301l576P859J5168p604k18l162Q896P896q23R92M369j3840j109k249o045
16250a3747P01K6265P628r495k164L6P834L81k979P113j827j7003m237J0643n002
16235D147n298J1511m308o175J812l559n643j893n942K025p682o00K330N008l499
16220a7766K969K790P354o668k515J2005k860Q418r18j2204L936J1265M098l448
16206F456n184j130J401o885o43n918m273O403J0583R595q362l324m510r979J0717
16191e053J227j236q57J924Q693K535j237m293l52K360r923R640L039m977j1525
16176a0035q178j6531R778J7950J971J057R198o722M68Q929N24j6424j4068j3159
$$ plain form
16162 -35242 -36487 -16474 -2095 -4977 -20527 -30717 -21157 -6735 -16952 -13972 -20747 -25938 -15030
16149 -15030 -4771 -16073 -4222 5261 13631 21419 24476 42130 43750 30431 17489 15737 13932
16136 13932 8806 -10735 -13656 -5365 -8514 -3086 7727 11085 15542 6704 12876 17919 12335 887
16122 887 -8424 -8057 -4612 -6851 -10831 -8153 -3339 -9333 -27358 -27471 -32948 -22121 -3255 3769 944
16107 944 -3390 5213 16745 19631 15133 15090 13254 7360 5263 -59 5411 9974 1960 -677 -17476
16092 -17476 -16172 -3985 2358 8787 12083 2599 -2121 1962 -9903 -13877 -105 -6616 -17593
16079 -17593 -19754 -13991 -16207 -15709 -1463 9946 6665 -831 -1783 1059 -1289 -1379 -2621 -332 6318
16064 6318 -3737 -118 3508 2902 -8857 -9598 -7693 5317 15479 12509 20399 2302 -10368 -30312
$$ packed form
16162c5242j245K0013J4379k882j5550j0190R560J4422j0217K980o775n191J0908
16149a5030J0259j1302J1851R483Q370P788L057J7654J620j3319j2942j752j805
16136A3932n126j9541k921Q291l149N428J0813L358M457q838O172N043n584j1448
16122H87r311L67L445k239l980K678M814n994j8025j13n477J0827J8866P024k825
16107I44m334Q603J1532K886m498m3j836n894k097n322N470M563q014k637j6799
16092a7476J304J2187O343O429L296r484m720M083j1865l974J3772o511j0977
16079a7593k161N763k216M98J4246J1409l281p496r52K842k348r0j242K289O650
16064F318j0055L619L626o06j1759p41J905J3010J0162k970P890j8097j2670j9944
$$ plain form
16050 -30312 -26306 -11165 -2859 -4413 3814 8923 15236 12295 17237 9882 4087 -9294 -19788 -12481
16036 -12481 -2399 -8875 -12736 -18788 -17223 -8563 12708 21680 6443 -2722 13429 5818 -11799
16023 -11799 -29832 -23545 -8588 12106 8132 6384 8330 -1614 -7249 3927 4038 2643 9348 6875
16009 6875 10204 9982 7115 7100 3828 2397 -3608 -1579 12 -4220 -12265 -13674 -9801 -387 3853
15994 3853 7560 17478 12525 985 15495 21259 29454 25419 12323 10446 4877 -8638 -10384 -15883
15980 -15883 -809 20326 17856 5685 2583 8346 2684 -9488 -13437 -6379 4452 5949 4229
15967 4229 2699 -3272 -1173 -16693 -21333 -9993 -3744 -19544 -20231 -9398 1367 -1747 1439 -9865
15953 -9865 -15729 -9977 -736 -4067 -8928 -3923 -9500 -10981 -5559 -9685 -19058 -22403 -8136 288
$$ packed form
16050c0312M006J5141Q306j554Q227N109O313k941M942p355n795j3381j0494P307
16036a2481J0082o476l861o052J565Q660K1271Q972j5237r165J6151p611j7617
16023a1799j8033O287J4957K0694l974j748J946r944n635J1176J11j395O705k473
16009F875L329k22k867j5l272j431o005K029J591m232q045j409L873R414M240
15994C853L707R918m953j1540J4510N764Q195m035j3096j877n569j3515j746n499
15980a5883J5074K1135k470j2171l102N763n662j2172l949P058J0831J497j720
15967D229j530n971K099j5520m640J1340O249j5800o87J0833J0765l114L186j1304
15953i865n864N752R241l331m861N005n577j481N422m126r373l345J4267Q424
$$ plain form
15939 288 -3372 -2799 -9825 -3468 1289 6139 17511 21010 11276 -8999 -516 3077 3299 7843 5444
15924 5444 6952 -7952 -10753 11667 15798 7890 13684 10609 -3355 -24337 -13186 -6999 -23576
15911 -23576 -33192 -19122 -15023 -9919 -9629 -4017 45 15155 17076 -11423 -22373 -3452 1467
15898 1467 -4382 -9079 2537 15775 19276 21634 16348 13668 367 -2283 -10013 -2901 -472 -1018
15884 -1018 -2504 -4923 -2720 -862 5102 -330 -2431 12316 17145 13440 12004 16286 14937 6368
15870 6368 -8462 -5086 -625 -6721 1317 7199 7562 -872 -2157 -418 7493 20818 30317 29865 32207
15855 32207 28212 16675 4045 5172 18222 10876 1076 -62 7247 14202 20912 43272 42710 30938
15841 30938 26108 31153 24424 21378 8329 5970 -15838 -25233 -13076 -10517 -17440 -9200 -5213 -1145
$$ packed form
15939B88l660N73p026O357M757M850J1372L499r734k0275Q483L593K22M544k399
15924E444J508j4904k801K2420M131p908N794l075j3964k0982J1151O187j6577
15911b3576r616J4070M099N104K90N612M062J5110J921k8499j0950J8921M919
15898A467n849m697J1616J3238L501K358n286k680j3301k650p730P112K429n46
15884a018j486k419K203J858N964n432k101J4747M829l705j436M282j349q569
15870F368j4830L376M461o096Q038N882L63q434j285J739P911J3325R499m52K342
15855C2207l995j1537j2630J127J3050p346r800j138P309O955O710K2360n62j1772
15841C0938m830N045o729l046j3049k359k1808r395J2157K559o923Q240L987M068
$$ plain form
15827 -1145 5986 -340 -3260 -11066 -22490 -28363 -23725 -18891 -34293 -20935 -4894 1800 481 -8229
15813 -8229 -17041 -11942 -9995 2009 -5648 -19390 -20430 -1840 12295 2574 -17284 -5219 11578
15800 11578 10402 14603 -2055 -7121 -4662 -4235 589 -4632 -10105 -2956 8499 8562 1733 -1286 5801
15785 5801 2033 -4189 -8101 498 15134 15418 12566 5658 -2711 -6500 -15219 -15688 -14772 -8109 14286
15770 14286 15161 7869 2550 8538 6501 6990 7301 7890 -1257 -6068 -18879 -23114 -18175 -19550 -11664
15755 -11664 993 -3893 -16893 -10377 -5229 -3574 12966 24620 19260 3025 -14810 -16847 -25901
15742 -25901 -26061 -22978 -17061 -14149 -13703 -11923 -8744 -3611 -8321 -20289 -11672 5918 9585 9712 4938
15727 4938 2776 8930 -1294 -2581 -5971 9061 17185 22643 17580 7884 -1500 4249 -1280 10000
$$ packed form
15827a145P131o326k920p806j1424n873M638M834j5402J3358J6041O694j319q710
15813h229q812N099J947J2004p657j3742j040J8590J4135r721j9858J2065J6797
15800A1578j176M201j6658n066K459M27M824n221n473P149J1455O3o829l019P087
15785E801l768o222l912Q599J4636K84k852o908q369l789q719m69R16O663K2395
15770A4286Q75p292n319N988k037M89L11N89r147m811j2811m235M939j375P886
15755a1664J2657m886j3000O516N148J655J6540J1654n360j6235j7835k037r054
15742b5901j60L083N917K912M46J780L179N133m710j1968Q617J7590L667J27m774
15727D938k162O154j0224j287l390J5032Q124N458n063r696r384N749n529J1280
$$ plain form
15713 10000 9224 12562 9870 8327 12381 -2278 -810 6335 1023 434 1329 -1269 922 -13980 -5751
15698 -5751 5058 20069 25203 15129 2992 -4313 14484 28305 20964 21539 19124 9455 15729
15685 15729 4176 -14643 -19236 -11839 -4971 -4378 2212 8173 11010 -237 -12792 -12995 -7108 -4205
15671 -4205 -21148 -37838 -36398 -19234 -18135 -14917 -4277 4382 3701 -2446 1250 12472 22235 18604
15657 18604 14428 -3 1277 7137 2286 7903 24892 34612 24985 2030 -15245 -24090 -18849
15644 -18849 -5048 -2981 -14301 -10892 7105 1791 -9682 -8693 -2387 3681 1486 -728 -6142 -1355
15630 -1355 1683 5856 5077 2589 16376 19151 16293 5711 -9596 -9722 -5132 -2051 -2674 -7333 -8789
15615 -8789 -10728 -6773 -5636 -1302 2122 -2375 -15827 -12035 -10043 6883 8643 8766 11158 6715
$$ packed form
15713A0000p76L338k692j543M054j4659J468P145n312n89Q95k598K191j4902Q229
15698e751J0809J5011N134j0074j2137p305J8797J3821p341N75k415r669O274
15685A5729j1553j8819m593P397O868N93O590N961K837j1247j2555k03N887K903
15671d205j6943j6690J440J7164J099L218J0640Q659o81o147L696J1222R763l631
15657A8604m176j4431J280N860m851N617J6989R720r627k2955j7275q845N241
15644a8849J3801K067j1320L409J7997n314j1473R89O306O068k195k214n414M787
15630a355L038M173p79k488J3787K775k858j0582j5307j26M590L081o23m659j456
15615h789j939L955J137M334L424m497j3452L792J992J6926J760J23K392m443
$$ plain form
15601 6715 -130 2006 -14961 -22866 -20087 -9140 -3825 3215 9378 -4268 -7531 3791 2973 -8208
15587 -8208 -1039 4700 5128 -1952 -11244 -1649 1344 8099 -3858 -10263 -12690 -12891 -3073 -1611 -14723
15572 -14723 -15131 -15364 -14394 -17320 -16098 -15537 -13549 -12477 -6009 1506 -2477 3745 13916 22408 14484
15557 14484 -12831 -15830 -15936 -12732 -6128 6279 6975 96 17126 23037 8186 2096 -2870 -7891
15543 -7891 -7739 -3385 176 1608 -8450 -14781 -22638 94 22063 16422 6874 1035 2882 -10252
15529 -10252 -15841 -8895 -4665 11537 21782 14900 7377 3946 5291 -9513 -8686 3892 -1165 2888
15515 2888 5115 2441 -2894 -11510 -11068 -7707 -9972 -1597 -11535 -20692 -25167 -21435 -14046 -7350 7118
15500 7118 15393 -935 -5008 2918 -6672 -13338 -8101 -2970 7686 4348 2603 -15382 -32859 -32311
$$ packed form
15601F715o845K136j6967p905K779J0947N315P040O163j3646l263J1322q18j1181
15587h208P169N739M28p080r292R595K993O755j1957o405k427k01R818J462j3112
15572a4723m08k33R70k926J222N61J988J072O468P515l983O222J0171Q492p924
15557A4484k7315k999j06L204O604J2407O96o879J7030N911j4851o090m966n021
15543g891J52M354L561J432j0058o331p857K2732K1969n641r548n839J847j3134
15529a0252n589O946M230J6202J0245o882p523l431J345j4804Q27J2578n057M053
15515B888K227k674n335q616M42L361k265Q375r938r157m475L732P389O696J4468
15500G118Q275j6328m073P926r590o666N237N131J0656l338j745j7985j7477N48
$$ plain form
15486 -32311 -14436 -8851 -6089 -12155 -18814 -17578 -24386 -27681 -37964 -35627 -22191 -13773 -15306 -2741
15472 -2741 -1439 -1631 5741 -1211 -3362 -3631 760 2639 3316 8112 1924 -4159 -4859 -4933 -7075 628
15456 628 2659 -5456 -2100 -11382 -12921 -6746 847 11765 16059 15463 6377 -2312 2988 4063 8588
15441 8588 8507 8201 -2573 -9449 -18921 -18034 -6542 1598 11167 14247 9631 -143 -8619 -6223 2511
15426 2511 4071 -11068 1228 2243 -18407 -23847 -17825 -3754 -13228 -16583 -16009 -20888 -8459 168
15412 168 -2485 -13383 -18052 -12990 -11880 -3086 -2075 -1497 -8578 -6681 -1951 -6606 -14238 -10188 -9760
15397 -9760 -6051 1659 -1332 -359 8429 9588 5095 -12115 -21962 -9584 4511 10176 9149 23864
15383 23864 34368 28681 6157 -2034 -4252 -5749 4454 8914 14767 10031 1878 -11554 981
$$ packed form
15486c2311J7875N585K762o066o659J236o808l295j0283K337J3436Q418j533J2565
15472b741J302j92P372o952k151k69M391J879O77M796o188o083p00p4k142P703
15456F28K031q115L356r282j539O175P593J0918M294n96r086q689N300J075M525
15441H588q1l06j0774o876r472Q87J1492Q140R569L080m616r774q476K396Q734
15426B511J560j5139J2296J015k0650n440O022J4071r474l355N74m879J2429Q627
15412A68k653j0898m669N062J110Q794J011N78p081J897M730m655p632M050M28
15397i760L709P710k991R73Q788J159m493j7210r847J2378J4095N665j027J4715
15383B3864J0504n687k2524q191k218j497J0203M460N853m736q153j3432J2535
$$ plain form
15370 981 -1759 -8620 4953 11204 8402 10709 25009 23146 7921 1097 4991 -3367 1178 6831
15356 6831 11813 4414 -4563 -3596 -3851 3074 8835 5968 851 5103 -4486 -3536 1132 -4427 -24714
15341 -24714 -25187 -10357 10766 30556 32715 26522 17508 15653 6123 3423 -891 -783 -11208 -18022
15327 -18022 -21580 -1269 7409 3809 -9349 -19352 -1238 6644 14578 22574 34371 35420 34784
15314 34784 14207 -673 -12098 -8175 -4474 -10927 -10150 383 1690 3797 2822 5297 3297 7935
15300 7935 -3115 -14261 -12032 -16843 -7773 13030 17637 9748 -10906 -13907 -25216 -14560 -5050
15287 -5050 -8953 -8092 -1548 -8862 -7298 -9469 522 8331 -7108 -1263 809 -4798 -2322 -944 -3976
15272 -3976 -9204 -17742 -25032 -20614 -16424 -5626 -13118 -14467 -1298 4969 -596 -6988 -9262 -5892
$$ packed form
15370I81k740o861J3573O251k802K307J4300j863j5225o824L894q358M545N653
15356F831M982p399q977R67k55O925N761k867n117M252r589R50M668n559k0287
15341b4714m73J4830K1123J9790K159o193r014j855r530k700m314J08j0425o814
15327a8022l558K0311Q678l600j3158j0003J8114P882P934P996J1797J049o36
15314C4784k0577j4880j1425L923L701o453P77J0533J307K107r75K475k000M638
15300G935j1050j1146K229m811R070K0803M607p889k0654l001j1309J0656R510
15287e050l903Q61O544p314J564k171R991P809j5439N845K072n607K476J378l032
15272c976n228q538p290M418M190J0798p492j349J3169O267n565o392k274L370
$$ plain form
15258 -5892 -5835 -8945 -7981 -13040 -10188 -7707 -18070 -17023 1358 1375 -10524 -22861 -30220 -24232 -30597
15243 -30597 -33937 -21597 -14371 -5830 8327 27318 9279 9870 13590 17397 18516 425 1992
15230 1992 2439 -5431 1481 3981 -3274 -9987 4052 -4827 -10486 -14911 -25842 -30753 -8462 -740
15216 -740 7173 8971 4066 6571 -7850 -15632 -7626 4280 -1223 -1923 -3869 -3132 1766 -7114 -14459
15201 -14459 -4466 1197 6153 9279 12971 15902 19572 31426 25212 4945 -11788 -14486 -11905 -13482
15187 -13482 -10229 -8341 -25327 -22492 1263 9913 10747 -1727 -4612 -7913 -14870 -12260 -11884 -15444
15173 -15444 -9452 -5318 7037 4275 -2056 -8148 -10385 -10220 4690 23234 15520 5637 11198 -2776
15159 -2776 -3246 -1430 -12667 -1753 6816 5056 7706 -1852 34 -4867 -2192 -2090 -4369 -3677 -13550
$$ packed form
15258e892N7l110R64n059K852K481j0363J047J8381J7j1899j2337p359N988o365
15243c0597l340J2340P226Q541J4157J8991j8039N91L720L807J119j8091J567
15230A992M47p870O912K500p255o713J4039q879n659m425j0931m911K2291P722
15216g40P913J798m905K505j4421p782Q006J1906n503p00j946P37M898q880p345
15201a4459R993N663M956L126L692K931L670J1854o214k0267j6733k698K581j577
15187a3482L253J888j6986K835K3755Q650Q34j2474k885l301o957K610L76l560
15173a5444N992M134J2355k762o331o092k237J65J4910J8544p714r883N561j3974
15159b776m70J816j1237J0914Q569j760K650r558J886m901K675J02k279O92r873
$$ plain form
15144 -13550 -23023 -20972 -14810 -18047 -11489 7461 -1074 -6594 -12303 -14427 -7711 -15956 -15184 -16869
15130 -16869 -20228 -10454 -1888 2078 -2814 7 3230 3738 9724 18628 26386 30466 28051 10636
15116 10636 4774 -3042 -13927 -6439 6565 21424 10134 -12080 -28809 -13201 -16642 -18035 -5875
15103 -5875 5758 2927 1527 -6108 -16491 -19537 -22720 -12579 -17654 -6891 3145 3520 -494 -4123
15089 -4123 3878 8014 -457 4520 1420 -16820 -29732 -28102 -18356 -9245 -13769 -19386 -20431 -19007
15075 -19007 -15911 -8783 -15553 -14440 -19432 -15628 -23260 -37881 -38244 -26941 -18456 -19248 -30511 -15913
15061 -15913 105 8877 6128 14658 21226 31359 26058 27563 25735 24870 23086 26678 30827 13909
15047 13909 5373 -136 -2950 -434 -2620 -8913 -6357 -2957 -1032 -1080 -2713 -3156 -8183 -10983 -3488
$$ packed form
15144a3550r473K051O162l237O558J8950q535n520n709k124O716q245P72j685
15130a6869l359R774Q566L966m892K821L223N08N986Q904P758M080k415j7415
15116A0636n862p816j0885P488J3004J4859j1290k2214j6729J5608l441j393J2160
15103e875J1633k831j400p635j0383l046l183J0141n075J0763J0036L75m014l629
15089d123Q001M136q471M977l100j8240j2912J630R746R111m524n617j045J424
15075a9007L096P128o770J113m992L804p632j4621l63J1303Q485p92j1263J4598
15061a5913J6018Q772k749Q530O568J0133n301J505j828q65j784L592M149j6918
15047A3909q536n509k814K516k186o293K556L400J925m8j633m43n027k800P495
$$ plain form
15032 -3488 1153 1352 -96 -88 -21053 -18736 -9376 2183 2620 -7807 1715 3268 -2430 10338 11166
15017 11166 426 -15679 -11480 -8423 -2580 5354 4748 209 -9327 -17548 -5732 -12778 -24454 -23048
15003 -23048 -23308 -21826 -18689 -17165 -11163 -7145 -117 -1469 -4101 1650 -6656 -8313 -17270 -18474 -7140
14988 -7140 6940 12807 20571 41872 67049 103492 159328 177058 121789 62158 30061 18005
14976 18005 16761 20967 11974 14633 3 -1035 10983 15108 8890 7277 3870 3372 4295 -2275
14962 -2275 2548 -2387 -4052 -8394 -8491 -5782 4649 5890 3781 2972 -12667 -17947 -7180 -4927 -5030
14947 -5030 6665 7527 11929 22163 16934 13469 2404 -5357 -7875 179 5637 7596 17952 35743
14933 35743 35091 21309 18271 20341 13360 5183 -6381 -2291 14763 11018 11998 14529 15451 3126
$$ packed form
15032c488M641J99j448Qk0965K317R360J1559M37j0427R522J553n698J2768Q28
15017A1166j0740j6105M199L057N843P934o06m539r536q221J1816p046j1676J406
15003b3048k60J482L137J524O002M018P028j352k632N751q306j657q957j204J1334
14988g140J4080N867P764K1301K5177L6443N5836J7730n5269n9631l2097j2056
14976A8005j244M206q993K659j4630j038J2018M125o218j613l407m98R23o570
14962b275M823m935j665m342r7K709J0431J241k109q09j5639n280J0767K253j03
14947e030J1695Q62M402J0234n229l465j1065p761k518Q054N458J959J0356J7791
14933C5743o52j3782l038K070o981q177j1564M090J7054l745R80K531R22j2325
$$ plain form
14919 3126 -5913 -17805 -23483 -7650 -8492 -3781 3798 9591 8781 16398 10897 6578 4478 -2561 -14415
14904 -14415 -25594 -15219 4354 23608 29215 19993 13697 -6582 -13928 -26793 -30778 -19040 -16582
14891 -16582 -20379 -18235 1442 -7349 -22308 -16413 -2809 -12216 -19668 -27914 -25479 -17439 -22804 -24597
14877 -24597 -21665 -6399 11202 17415 22134 16732 10531 9389 18361 14050 2922 -4288 -272 4577
14863 4577 9950 12016 10715 3108 -4456 -1002 4613 11455 4400 -8880 -14634 -13093 5597 7070
14849 7070 4595 12081 866 -11140 -3883 275 -1668 -9512 -6287 -426 -14997 -10024 -8658 -11361
14835 -11361 -11557 -10060 -10789 -5932 -5792 -2551 5528 15569 9271 18395 20764 15777 13847 1201 -10629
14820 -10629 -13098 1154 11081 -1422 -16074 -16106 -8984 -2056 -2464 -2127 2874 13748 14997 5548
$$ packed form
14919C126r039j1892n678J5833q42M711P579N793q10P617n501m319k100p039j1854
14904a4415j1179J0375J9573J9254N607r222o296k0279p346j2865l985J1738K458
14891a6582l797K144J9677q791j4959N895J3604r407p452q246K435Q040n365j793
14877b4597K932J5266J7601O213M719n402o201j142Q972m311j1128p210M016M849
14863D577N373K066j301p607p564L454N615O842p055j3280n754J541J8690J473
14849G070k475P486j1215j2006P257M158j943p844L225N861j4571M973J366k703
14835a1361j96J497p29M857J40L241Q079J0041o298R124K369m987j930j2646j1830
14820a0629k469J4252R927j2503j4652l2P122O928m08L37N001J0874J249r449
$$ plain form
14806 5548 11861 3348 -941 2867 269 9515 23037 22166 27795 17326 14952 6510 -4049 2384
14792 2384 -6014 -4308 -4565 30 -1766 1372 -4548 -5661 11781 5269 245 -685 1809 5532 24
14777 24 -1490 13391 20115 17455 8746 7528 8257 9297 17982 22603 11039 5755 -4031 -4622 2475
14762 2475 -6206 -4663 -10065 -6350 -1079 -9365 -8902 -1019 -11763 -16407 -2377 -5234 -3439 7843
14748 7843 4828 -10963 -15436 -13320 -8069 -12273 -20122 -35169 -30202 -2773 14595 13245 4299 -4679
14734 -4679 -547 -7035 -13551 -5750 -5183 -4082 -8296 -1041 7706 -1725 -5082 -4391 -6037 -11192 -7052
14719 -7052 -9962 -2035 -1051 3495 4514 3223 3864 2901 -1972 -4442 -2548 -1239 -4889 14107 31218
14704 31218 22857 12727 4271 3795 6830 2232 -1597 -5526 -10529 -14824 -13693 -11850 -3777 -8398
$$ packed form
14806E548O313q513m289L808k598R246J3522q71N629j0469k374q442j0559O433
14792B384q398J706k57M595j796L138n920j113J7442o512n024r30K494L723n508
14777B4j514J4881O724k660q709j218P29J040Q685M621j1564n284r786n91P097
14762B475q681J543n402L715N271q286M63P883j0744m644J4030k857J795J1282
14748G843l015j5791m473K116N251m204p849j5047M967K7429J7368j350q946q978
14734d679M132o488o516P801N67J101m214P255Q747r431l357O91j646n155M140
14719g052k910P927R84M546J019j291O41r63m873k470J894J309l650J8996J7111
14704C1218q361j0130q456m76L035m598l829l929n003m295J131J843Q073m621
$$ plain form
14690 -8398 -12936 -12157 -4589 4868 21567 32885 23393 5623 6548 -4898 -16721 -6397 1784 2838
14676 2838 1770 5400 2394 -25534 -24398 -21267 -13738 3646 6537 -2707 2900 1377 -8283 -17549
14662 -17549 -24297 -19097 -8216 3447 8624 8660 12778 8459 -7338 -12078 -9559 -2204 3939 2461
14648 2461 -2994 8658 15865 14560 25047 25154 21648 23925 27179 15708 1880 -5195 -2615 1088
14634 1088 3959 3460 6232 17212 13540 18504 13340 -6 -2662 -952 2566 5794 6113 9165 10951
14619 10951 -11351 -17198 -1911 10390 10650 -3681 9943 12722 2578 5983 9431 6385 4676
14606 4676 8377 6353 -399 -11644 -10876 -11774 -9521 -6785 -1524 3868 6678 5264 8539 -6884 -5455
14591 -5455 3346 893 6309 11474 -309 -7318 -17297 -23235 -27637 -19522 -20234 -36689 -20399 -7822
$$ packed form
14690h398m538P79P568R457J6699J1318r492j7770R25j1446j1823J0324Q181J054
14676B838j068L630l006k7928J136L131P529J7384K891r244N607j523r660r266
14662a7549o748N200J0881J1663N177L6M118m319j5797m740K519P355O143j478
14648B461n455J1652P207j305J0487J07l506K277L254j1471j3828p075K580L703
14634A088K871m99K772J0980l672M964n164j3346k656J710L518L228L19L052J786
14619A0951k2302n847J5287J2301K60j4331J3624K779j0144L405L448l046j709
14606D676L701k024o752j1245P68q98K253K736N261N392K810j414L275j5423J429
14591e455Q801k453N416N165j1783p009r979n938m402Q115p12j6455J6290J2577
$$ plain form
14577 -7822 454 7036 -2166 -10817 -11217 -19244 -20644 -9531 -13916 -16059 -20766 -13947 597 2926
14563 2926 -7733 1031 2725 18980 14219 -5623 -4999 -9557 -10248 -8707 3576 18110 7556 666
14549 666 674 3353 11414 1771 -4105 9409 8041 7438 2408 -6365 -11538 -14278 -8972 2512 880
14534 880 -6511 -17295 -18725 -14845 -13752 2157 -2012 496 -1086 -3943 2786 4906 -1733 -12381
14520 -12381 -17932 -26239 -11363 -8381 3606 9804 -92 -3553 2037 -5846 -17405 -17850 -10071 2494
14506 2494 4598 -5623 -7997 -16683 -13984 -9250 -3543 12172 -4968 -7482 -1218 -13113 -10513 5343
14492 5343 19138 18947 13988 13665 6901 9173 2561 8416 13460 14210 6348 -5465 -4527 4202 13058
14477 13058 9149 -2598 -5492 -10665 428 21296 21524 1595 -9396 -17942 -10486 -6265 -8731
$$ packed form
14577g822Q276O582r202q651m00q027j400J1113m385k143m707O819J4544K329
14563B926j0659Q764J694J6255m761j9842O24m558o91J541J2283J4534j0554o890
14549F66QK679Q061r643n876J3514j368o03n030q773n173k740N306J1484j632
14534H80p391j0784j430L880J093J5909m169K508j582k857O729K120o639j0648
14520a2381n551q307J4876K982J1987O198r896l461N590p883j1559m45P779J2565
14506B494K104j0221k374q686K699M734N707J5715j7140k514O264j1895K600J5856
14492E343J3795j91m959l23o764K272o612N855N044P50p862j1813R38Q729Q856
14477A3058l909j1747k894n173J1093K0868K28j9929j0991q546P456M221k466
$$ plain form
14464 -8731 -12377 -18285 -23723 -20247 -21275 -17698 -29402 -27235 -27798 -34626 -20504 -13253 -17130 -17453 -18954
14449 -18954 -5331 10244 13003 7026 11004 1196 -8092 -7403 -1824 2940 9354 3745 -5063 -4507
14435 -4507 335 -5085 -7290 -4490 -7094 -16434 -21827 -8376 -10765 -21840 -17768 -16366 -14174 -4284
14421 -4284 15691 5469 -1794 -9794 7118 8052 6449 7817 13273 17264 16029 11886 10041 8454
14407 8454 5999 7816 16119 15921 12489 16248 13702 -9848 -27166 -24198 -9722 -13186 -10909 -9477
14393 -9477 2548 11689 -2846 -2253 4560 -1197 -9643 -14349 -20677 -15576 -24141 -24003 -16041 -21268 -22304
14378 -22304 -15209 2110 8751 5144 -2155 11793 18794 9279 -4378 -19733 -17284 -3531 19904
14365 19904 25528 36673 40894 21251 16923 17629 18711 5567 -3901 -9301 -17371 -9821 -4269 10074
$$ packed form
14464h731l646n908n438L476j028L577j1704K167n63o828J4122P251l877l23j501
14449a8954J3623J5575K759n977L978r808r288O89N579M764O414n609q808N56
14435d507M842n420k205K800k604r340n393J3451k389j1075M072J402K192R890
14421d284J9975j0222p263q000J6912R34j603J368N456L991j235m143j845j587
14407H454k455J817Q303j98l432L759k546k3550j7318K968J4476l464K277J432
14393i477J2025R141j4535N93O813n757q446m706o328N101q565J38P962n227j036
14378b2304P095J7319O641l607p299J3948P001r515j3657j5355K449J3753K3435
14365A9904N624J1145M221j9643m328P06J082j3144r468n400q070P550N552J4343
$$ plain form
14351 10074 21489 10495 -3637 -14994 -14503 -15287 -11370 -13195 -22940 -13422 -24952 -14524 -19586
14338 -19586 -14750 -2572 6219 4115 4505 4892 3216 3861 -32 -2523 -9182 -8166 -13409 -8044 5128
14323 5128 17061 14697 7207 -637 -9436 -7016 -5059 -18007 -19500 -6609 -5010 -7661 -2106 2852
14309 2852 445 1519 6591 18738 13835 6046 14970 14916 15283 8219 -7061 -5809 -3085 -2128 1443
14294 1443 1348 -907 -2675 -10655 -17254 -11996 -1882 -2224 -515 832 -14694 -6166 6594 12138 5486
14279 5486 2371 8258 10158 12392 8740 -874 -888 -2189 -7385 -4992 -9721 -17561 -19362 3104 6498
14264 6498 7213 16323 9375 -5479 -11710 -12318 -3367 -11404 -14945 -14172 -10821 6363 5500 6811 1185
14249 1185 177 -1368 11462 24055 11577 12014 -3032 -4877 3843 13229 11958 6653 19265 7429
$$ packed form
14351A0074J1415j0994j4132j1357M91p84L917j825r745R518j1530J0428n062
14338a9586M836J2178Q791k104L90L87j676O45l893k491o659J016n243N365J3172
14323E128J1933k364p490p844q799K420J957j2948j493J2891J599k651N555M958
14309B852k407J074N072J2147m903p789Q924n4L67p064j5280J252K724R57L571
14294A443r5k255j768p980o599N258J0114l42J709J347j5526Q528J2760N544o652
14279E486l115N887J900K234l652r614j4j301n196K393m729p840j801K2466L394
14264F498P15R110o948j4854o231o08Q951q037l541P73L351J7184q63J311n626
14249A185j008j545J2830J2593j2478M37j5046j845Q720R386j271n305J2612j1836
$$ plain form
14235 7429 3280 800 -1096 -912 6226 6553 6568 1997 -4726 -16134 -15996 -19192 -18154 -16528 -574
14220 -574 3555 -3359 -3654 11024 1857 -1906 -5095 -8821 -10047 -6038 -18840 -18113 -5300 3174 10771
14205 10771 6994 2166 4311 -962 -1399 -1892 3098 7260 4110 -5718 -5888 -2446 -4719 3623 -541
14190 -541 -7410 1823 -3275 -13612 -10802 -2069 -3062 -6931 5233 22570 33835 33411 23636 17734
14176 17734 12089 14501 9254 1106 4051 2228 7387 31292 20475 11699 15977 9148 -9766 -12727
14162 -12727 -15778 -5715 9416 9359 5260 16217 27654 16933 -3896 -15292 -12663 1122 22567
14149 22567 26411 15393 -5333 -13982 -17630 -9521 -9357 -14934 -11828 -14610 -21832 -23366 -11370 4830
14135 4830 6215 14095 1737 -14926 -3500 7078 45 -4309 -2609 -13401 -18956 -17536 -6975
$$ packed form
14235G429m149k480j896J84P138L27J5m571o723j1408J38l196J038J626J5954
14220e74M129o914k95J4678r167l763l189l726j226M009j2802P27J2813Q474P597
14205A0771l777m828K145n273m37m93M990M162l150r828j70L442k273Q342m164
14190e41o869R233n098j0337K810Q733r93l869J2164J7337J1265m24r775n902
14176A7734n645K412n247q148K945j823N159K3905j0817q776M278o829j8914k961
14162a2727l051J0063J5131n7m099J0957J1437j0721k0829j1396K629J3785K1445
14149B2567L844j1018k0726q649l648Q109J64n577L106k782p222j534J1996J6200
14135D830J385P880j2358j6663J1426J0578p033m354J700j0792n555J420J0561
$$ plain form
14122 -6975 -5071 1449 13473 13808 4171 -16402 -15863 -1846 2288 5330 8209 1503 42 2144
14108 2144 7493 17078 28517 18967 6915 225 5332 6442 7939 13642 213 -13509 -14824 -15942
14094 -15942 -18790 -14671 -10552 -1007 8203 -6386 -4957 4745 -494 -4904 -9878 -8135 -4667 484
14080 484 2676 4427 -13306 -12577 338 11423 4910 -24 1197 5655 -276 -11801 -24318 -15687
14066 -15687 5042 4070 -1467 4969 7278 2601 -13574 -23126 -26548 -11710 -4703 -6007 -661 3207
14052 3207 3736 -6828 -4135 605 5273 3427 4705 5257 -5466 -13402 -5749 -6078 1665 7895 11824
14037 11824 10593 11193 7400 12233 11912 18971 24303 23782 24156 23347 28263 20413 12206 9014 24567
14022 24567 30974 25156 10456 -508 -5499 -14195 -15215 -18456 -17038 -8923 -9189 -13900 -7010 -3913
$$ packed form
14122f975J904O520J2024L35r637k0573N39J4017M134L042K879o706j461K102
14108B144N349R585J1439r550j2052o690N107J110J497N703j3429j3722j315j118
14094a5942k848M119M119R545R210j4589J429R702n239m410m974J743L468N151
14080D84K192J751j7733P29J2915J1085o513m934J221M458n931j1525j2517Q631
14066a5687K0729r72n537O436K309m677j6175r552l422J4838P007j304N346L868
14052C207N29j0564K693M740M668j846J278N52j0723p936P653l29P743O230L929
14037A1824j231O00l793M833l21P059N332n21L74q09M916p850q207l192J5553
14022B4567O407n818j4700j0964m991q696j020l241J418Q115k66m711O890L097
$$ plain form
14008 -3913 -5917 -15777 -9550 -5920 -14074 -10995 -3337 -13769 -5874 -4713 -10919 -10434 993 4082
13994 4082 -3423 -1154 -1277 4718 -825 3485 8886 8973 4935 3349 8291 4130 -4416 -10767 -11781
13979 -11781 -8663 -9423 -10291 -7974 -11819 -3635 12073 20012 7943 8773 11655 10819 12374 3323 -1645
13964 -1645 -4220 -3381 17415 18431 8858 4257 11681 21689 12732 9043 2808 -3594 -9534 -10309 -14908
13949 -14908 -21043 -9854 7355 9992 23165 25288 6541 -17833 -20992 -6273 -4012 -853 11174
13936 11174 23511 21527 17405 8937 -5863 1107 1150 2083 2864 2080 -12456 -22156 -19232 -5501 12635
13921 12635 2600 -8320 -9027 3018 8473 12017 4998 -11181 -5823 -2206 4152 10315 5047 -11552
13907 -11552 -12660 -6649 -484 1966 4517 10888 13331 16436 11156 7523 310 -1363 -4970 -16979
$$ packed form
14008c913k004r860O227L630q154L079P658j0432P895J161o206M85J1427L089
13994D082p505K269j23N995n543M310N401Q7m038j586M942m161q546o351j014
13979a1781L118p60q68K317l845Q184J5708P939j2069Q30K882q36J555r051m968
13964a645k575Q39K0796J016r573m601P424J0008q957l689o235o402n940p75m599
13949a4908o135J1189J7209K637J3173K123j8747k4374l159J4719K261L159J2027
13936A1174J2337j984m122q468j4800O970M3R33P81p84j4536r700K924J3731J8136
13921A2635j0035j0920p07J2045N455L544p019j6179N358L617O358O163n268j6599
13907a1552j108O011O165K450K551O371K443L105n280l633p213j673l607j2009
$$ plain form
13893 -16979 -19816 -24206 -19728 -196 10362 5434 -4016 -10577 4770 14483 16509 15386 9478 16946
13879 16946 15698 18516 10025 -272 -2935 7565 7888 8406 11148 12460 16245 6734 -3230 -5401
13865 -5401 -19058 -24085 -16768 -13136 -1707 6732 25786 16336 11002 16363 14906 14681 20285 6815
13851 6815 2166 16778 13163 2214 -25186 -31229 -16246 -1010 3618 -10162 -4350 -6375 -2797
13838 -2797 7239 7905 7960 4360 3148 3235 -9485 -15942 -18375 -27769 -33677 -26731 2539 6427 938
13823 938 13838 19637 16390 17932 14766 14332 18648 22760 27951 18699 10059 3080 -7676 -17776
13809 -17776 -16583 -6386 -8032 -5152 -1154 4200 -4805 -3569 -2215 -7341 -5500 -5178 -18749 -14001
13795 -14001 -6127 -13223 -14837 -4286 -5213 -10603 -13311 -8650 -2958 -2617 -11572 -9687 -1805 10710
$$ packed form
13893a6979k837m390M478J9532J0558m928r450o561J5347R713K026j123n908P468
13879A6946j248K818q491j0297k663J0500L23N18K742J312L785r511r964k171
13865e401j3657n027P317L632J1429Q439J9054r450n334N361j457k25N604j3470
13851F815m649J4612l615j0949k7400o043J4983J5236M628j3780N812k025L578
13838b797J0036O66N5l600j212Q7j2720o457k433r394n908O946K9270L888n489
13823I38J2900N799l247J542l166m34M316M112N191r252q640o979j0756j0100
13809a7776J193J0197j646K880L998N354r005J236J354n126J841L22j3571M748
13795a4001P874p096j614J0551r27n390k708M661N692L41q955J885P882J2515
$$ plain form
13781 10710 -1159 -6263 -5996 5406 -1561 399 -7137 -19756 -17781 -10023 7781 10114 6504 -2722
13767 -2722 -3492 -542 -8130 -11524 -11551 -7315 7242 8531 9914 8954 522 -724 -2124 -12504 -13977
13752 -13977 -11630 -4732 11220 10398 3642 -3075 1345 13353 12693 1479 -1488 -4277 -8723 -4896
13738 -4896 3847 11213 2374 -6235 -4982 -4693 5028 8369 7109 16727 13811 9759 21316 16016 3729
13723 3729 -6119 1073 13790 10821 258 3951 4986 1811 -7661 -4954 -4663 -3013 -3369 1902 1446
13708 1446 -7744 -7429 -4971 8677 15906 14955 14943 -551 -9042 -11495 1259 9426 10448 7888 18412
13693 18412 17908 10845 2263 -4772 -411 -2618 -7379 -8208 -13262 -11960 271 160 -7771 -7244 -14326
13678 -14326 71 7764 9551 9748 21481 24185 18213 241 -20383 -22266 -21623 -14664 -18250 -10854
$$ packed form
13781A0710j1869n104K67J1402o967J960p536j2619J975P758J7804K333l610r226
13767b722p70K950p588l394k7M236J4557J289J383r60q432j246j400j0380j473
13752a3977K347O898J5952q22o756o717M420J2008o60j1214k967k789m446L827
13738d896Q743P366q839q609J253K89R721L341j260R618k916m052J1557n300j2287
13723C729r848P192J2717k969j0563L693J035l175r472K707K91J650l56N271m56
13708A446r190L15K458J3648P229r51j2j5494q491k453J2754Q167J022k560J0524
13693A8412n04p063q582p035M361k207m761q29n054J302J2231j11p931N27p082
13678a4326J4397P693J787J97J1733K704n972j7972k0624j883O43O959l586P396
$$ plain form
13664 -10854 -2270 855 -7943 -6332 1083 -4300 -15770 -10470 -4470 1666 -849 -4512 -5168 -7282
13650 -7282 -9909 -6154 -1755 -7884 -7552 -10723 -24267 -13294 -2247 4390 20034 23012 30154 22360
13636 22360 26455 1665 -4562 1411 4759 -1882 9112 24532 14121 9435 -5411 -18023 -19819
13623 -19819 -31116 -30778 -29868 -25973 -18428 -7850 9073 29174 33611 21104 14067 6992 5712 9955
13609 9955 12983 16335 16583 8896 2565 6234 18020 19819 5809 9107 16330 17319 10668 9516 8173
13594 8173 9932 6003 5522 1129 5946 37745 50319 50820 67160 77929 60529 52604 53175 26811
13580 26811 14521 11073 12100 23805 22108 20234 23303 20442 7365 -4033 -888 -3757 -12510
13567 -12510 -7277 1544 -8790 -1380 -607 -14724 -20846 -18073 -6776 -3343 -5704 654 6964 6824
$$ packed form
13664a0854Q584L125q798J611P415n383j1470N300O000O136k515l663o56k114
13650g282k627L755M399o129L32l171j3544J0973J1047O637J5644K978P142p794
13636B2360M095k4790o227N973L348o641J0994J5420j0411m686j4846j2612j796
13623a9819j1297L38R10L895P545J0578J6923K0101M437j2507p037p075j280M243
13609I955L028L352K48p687o331L669J1786J799j4010L298P223R89o651j152j343
13594H173J759l929m81m393M817L1799J2574N01J6340J0769j7400p925N71k6364
13580B6811j2290l448J027J1705j697j874L069k861j3077j1398L145k869q753
13567a2510N233Q821j0334P410P73j4117o122K773J1297L433k361O358O310j40
$$ plain form
13553 6824 16094 14787 8166 11786 26020 24620 24271 38756 57535 74363 99472 145755 206262
13540 206262 239890 206790 150302 116663 91985 82052 66241 38827 28010 14580 3418 12329
13528 12329 20341 27401 23144 19461 21216 16778 1698 2231 3076 8022 5067 3693 3039 925 3164
13513 3164 11771 11129 14840 19254 7334 4141 9677 12111 10875 8920 11497 15776 30249 53780
13499 53780 79185 101001 136936 188452 233207 221265 146893 96425 80570 66198 54660 40960
13487 40960 39587 27044 22019 22977 33532 39101 41980 25770 14035 14710 35497 33073 32656 27278
13473 27278 27447 23536 10590 2989 2740 3565 1875 5221 6065 5668 1495 7091 -7550 -15652 -16390
13458 -16390 3184 6696 2222 6763 22898 28928 29137 48064 57410 58321 57105 48043 24376 16333
$$ packed form
13553F824R270j307o621L620J4234j400l49J4485J8779J6828K5109M6283O0507
13540B06262L3628l3100n6488l3639k4678r933j5811k7414j0817j3430j1162Q911
13528A2329Q012P060m257l683J755m438j5080N33Q45M946k955j374o54k114K239
13513C164Q607o42L711M414j1920l193N536K434j236j955K577M279J4473K3531
13499E3780K5405K1816L5935N1516M4755j1942p4372n0468j5855j4372j1538j3700
13487D0960j373j2543n025R58J0555N569K879j6210j1735O75K0787k424m17n378
13473B7278J69l911j2946p601k49Q25j690L346Q44l97m173N596j4641q102p38
13458a6390J9574L512m474M541J6135O030K09J8927R346R11j216r062k3667q043
$$ plain form
13444 16333 18773 17192 13725 8092 2006 -9189 -13572 -7039 1974 4659 -8504 -4654 558 2828
13430 2828 3389 9269 11353 9565 3182 -5899 -11932 -4056 14096 23448 16032 20307 23637 13423
13416 13423 -4652 -15675 4926 14801 8125 -6808 -1454 1314 -3236 -15397 -10729 -11724 -9516
13403 -9516 -11129 -9527 -13533 -6645 688 -1930 -3277 -9030 -5784 -4666 3958 15080 9435 5613
13389 5613 7549 -7118 447 11475 14163 20397 20632 13622 20299 24904 23674 20096 18786 11105
13375 11105 22293 22175 26512 24385 17133 3072 -5931 5057 10300 6963 469 -701 10186 12074
13361 12074 16587 -9635 -23972 -24507 -17811 -11865 -13842 -21434 -10478 -603 9442 13558 1330
13348 1330 -11261 -10709 -22832 -17633 -5444 -12422 -25394 -11969 -842 13627 8799 -16285 -11496
$$ packed form
13444A6333K440j581l467n633o086j1195m383O533R013K685j3163L850N212K270
13430B828N61N880K084j788o383r081o033P876J8152R352p416M275L330j0214
13416A3423j8075j1023K0601R875o676j4933N354K768m550j2161M668r95K208
13403i516j613J602m006O888P333k618j347n753L246J118Q624J1122n645l822
13389E613J936j4667P565J1028K688O234K35p010O677M605j230l578j310p681
13375A1105J1188j18M337k127p252j4061r003J0988N243l337o494j170J0887J888
13361A2074M513k6222j4337n35O696N946j977p592J0956R875J0045M116j2228
13348A330j2591N52j2123N199J2189o978j2972J3425J1127J4469m828k5084M789
$$ plain form
13335 -11496 3142 -975 -6964 -13580 -13830 -4634 -5972 -7612 -3420 4246 4095 -4363 -31936 -46844
13321 -46844 -42120 -36264 -28346 -15067 -20539 -31102 -32813 -22515 -6286 13233 2758 -15201 1567
13308 1567 4207 1230 -3453 -9332 -10458 -6137 15009 14886 25040 24013 19041 11495 6162 -8640
13294 -8640 -3164 3499 -1258 -8157 -13460 -23064 -18097 -6481 -8207 5115 3702 -14179 -15223 -3967
13280 -3967 -404 -19855 -31454 -29159 -11892 -3718 -4324 -5973 -10097 -1868 -2691 -1229 -467 -1302 -102
13265 -102 2446 9906 9830 -2602 3171 12026 7181 585 16785 27333 20660 13197 7867 10651 12929
13250 12929 8383 -764 6738 19676 26297 29058 13985 -6873 -9399 -2776 2189 7416 2335 4631
13236 4631 11679 11232 13831 15849 17779 9589 12651 18429 3145 -639 -4266 -16679 -19530 -9949
$$ packed form
13335a1496J4638m117n989o616k50R196j338j640M192P666j51q458k7573j4908
13321d6844M724N856P918J3279n472j0563j711J0298J6229J9519j0475j7959J6768
13308A567K640k977m683n879j126M321K1146j23J0154j027m972p546n333j4802
13294h640N476O663m757o899n303r604M967J1616j726J3322j413j7881j044J1256
13280c967L563j9451j1599K295J7267Q174o06j649m124Q229q23J462P62q35J200
13265a02K548P460p6j2432N773Q855m845o596J6200J0548o673p463n330K784K278
13250A2929m546r147P502J2938O621K761j5073k0858k526O623M965N227n081K296
13236D631P048m47K599K018J930q190L062N778j5284l784l627j2413k851R581
$$ plain form
13222 -9949 -13393 -12253 -19159 -15699 -8000 -2700 3663 8655 -586 -14626 -13253 -14425 -9359 2964
13208 2964 9674 11311 828 -4198 2175 -2287 2244 -229 -11294 -16861 -12029 -4419 -8679 -13655
13194 -13655 -13215 -17464 -16800 -9209 -11304 -18057 -11126 -7351 -125 1326 -8397 -26427 -25658 -6467 1894
13179 1894 2173 5505 -1614 -11335 -11119 2945 10700 13124 4520 -1890 428 -5687 -4130 5659 2043
13164 2043 -7951 -12366 -4842 -14674 -16293 -10197 -11103 -9918 -6196 -11001 -25456 -16903 3755 -3870
13150 -3870 -1653 8323 9880 1628 -6983 4371 24151 18435 7425 -11585 -13342 -8536 6420
13137 6420 18679 12831 13007 4541 -4158 -4781 -5230 -5236 -14143 -18115 -10198 2462 -70 3701 -4742 -14370
13121 -14370 1806 16661 6080 -62 -659 5488 -2678 -665 20994 10301 6210 4580 -5938
$$ packed form
13222i949l444J140o906L460P699N300O363M992r241j4040J373j172N066J2323
13208B964O710J637j0483n026O373m462M531k473j1065n567M832P610m260m976
13194a3655M40m249O64P591k095o753O931L775P226J451r723j8030P69J9191Q361
13179A894K79L332p119r721K16J4064P755K424q604o410K318o115J557R789l616
13164B043r994m415P524r832j619O096r06J185L722m805j4455Q553K0658p625
13150c870K217R976J557q252q611J1354J9780n716j1010j9010j757M806J4956
13137F420J2259n848J76q466q699o23m49oq907l972P917J2660k532L771q443r628
13121a4370J6176J4855j0581o142n97O147q166K013K1659j0693m091j630j0518
$$ plain form
13108 -5938 -11607 -14383 -17110 -4533 -6273 -23771 -24462 -21349 -21877 -10109 -4575 -887 8228 14924
13094 14924 11029 7436 14945 12218 7076 1107 6503 7883 10072 11993 16862 19841 16356 17721
13080 17721 7511 3344 7683 -6234 -8496 -4430 -1666 -3673 5919 7329 -7384 -8033 -6952 -6299
13066 -6299 -1784 -1199 -6656 -16685 -22512 -18100 1164 2752 -2558 -2286 -3695 3740 -11726 -2536
13052 -2536 5334 789 1950 -8165 -7522 -3312 -3965 -7188 -7384 -5398 1772 3865 -6531 -6273 -3443
13037 -3443 -4408 -10687 -14910 -11182 -2150 3745 1937 1834 4718 -4218 -5643 -1915 617 -272 -6801
13022 -6801 -13180 -10763 -6898 -6737 -4098 -4791 -13226 -12990 -7113 -2786 -1450 -323 -4881 -2851 -12047
13007 -12047 -27834 -24194 -13606 -3939 -1032 -15862 -7237 -3096 -5625 -548 2663 667 1750 -1837
$$ packed form
13108e938n669k776k727J2577j740j7498o91L113n28J1768N534L688R115O696
13094A4924l895l593P509k727n142n969N396J380K189J921M869K979l485J365
13080A7721j0210m167M339j3917k262M066K764k007R592J410j4713o49J081O53
13066f299M515N85n457j0029n827M412J9264J588n310K72j409P435j5466R190
13052b536P870m545J161j0115O43M210o53l223j96J986P170K093j0396K58K830
13037c443r65o279m223L728R032N895j808j03K884q936j425L728K532q89o529
13022f801o379K417L865J61K639o93q435K36N877M327J336J127m558K030r196
13007a2047j5787L640J0588R667K907j4830Q625M141k529N077L211j996J083l587
$$ plain form
12993 -1837 -3768 -3588 -4133 -823 3033 16 -8898 -6197 17363 18587 8429 -1148 -15108 -4886
12979 -4886 3133 -4578 -5381 235 -3412 -5206 -5379 -218 49 6060 8913 -14170 -15371 -17079 -9696
12964 -9696 730 -1047 688 13180 9343 -3848 9029 12883 6800 480 -13322 -21260 -17068
12951 -17068 -16012 -4561 -13576 -24999 -23462 -2344 8859 14595 -3168 -5742 7853 4573 -2201
12938 -2201 688 -3271 -5126 -4000 -6185 -8669 -14410 -11006 4391 4899 3878 -6248 -7576 11559
12924 11559 19637 17893 11213 2230 383 -94 6698 20251 9987 586 -2557 499 -897 -1440
12910 -1440 -6781 -4493 -8544 -15247 -9324 -350 932 2312 3365 1655 4625 -2513 -3259 9436 14318
12895 14318 14444 12011 18186 19137 14587 6563 14998 8741 7871 17620 14762 11051 4271 -1439 9116
$$ packed form
12993a837j931J80n45L310L856l017q914K701K3560J224j0158r577j3960J0222
12979d886Q019p711q03N616l647j794j73N161K67O011K853k3083j201j708P383
12964i696J0426j777J735J2492l837j3191J2877L854o083o320j3802p938M192
12951a7068J056J1451r015j1423J537K1118J1203N736j7763k574J3595l280o774
12938b201K889l959j855J126k185k484n741L404J5397N08j021j0126j328J9135
12924A1559Q078j744o680q983j847m77O792J3553j0264r401l143L056j396n43
12910a440n341K288m051o703N923Q974J282J380J053j710K970p138p46J2695M882
12895A4318J26k433O175R51m550q024Q435o257q70R749k858l711o780n710J0555
$$ plain form
12880 9116 19512 19842 24051 30507 30850 23225 27122 24329 21193 17983 -7612 -9693 -906 -3109 -57
12865 -57 15691 3140 -1299 -845 2957 2014 571 1209 -1298 -3546 2580 3837 1379 -11164 -23572
12850 -23572 -22533 -20995 -19276 -17871 -19118 -830 10043 -1183 -7360 831 1102 -8675 -4986 1551
12836 1551 -7263 -5667 307 14722 18457 8406 4949 732 -3792 -9322 -10824 -3635 13584 8663
12822 8663 773 -9861 -12580 -10751 -2968 -6631 -7498 4318 8967 3839 3436 4486 -1975 -5682 -415
12807 -415 -7853 -19234 -15743 -207 7676 1493 -10477 -15409 -16970 -14588 -12856 -1109 9772 13269
12793 13269 9913 8138 -13419 -22519 -7190 -541 7935 11084 13007 25020 25014 15160 15078 20451 21135
12778 21135 7858 6141 9711 11063 9647 71 1634 11731 10328 1557 4953 2099 -2534 -1069
$$ packed form
12880I116J0396L30M209O456L43p625L897k793l136l210k5595k081Q787k203L052
12865e7J5748j2551m439M54L802r43j443O38k507k248O126J257k458j2543j2408
12850b3572J039J538J719J405j247J8288J0873j1226o177Q191K71r777L689O537
12836A551q814J596N974J4415L735j0051l457m217m524n530j502P189J7219m921
12822H663p890j0634k719J829P783l663q67J1816M649n128m03J050o461l707N267
12807d15p438j1381L491J5536P883o183j1970m932j561K382J732J1747J0881L497
12793A3269l356j775k1557r100J5329O649Q476L149J923J2013or854q2N373O84
12778B1135j3277j717L570J352j416r576J563J0097j403q771L396k854m633J465
$$ plain form
12764 -1069 14603 6318 3968 9101 15429 12562 6202 -957 -540 22 5168 4440 12328 33306 30945
12749 30945 9711 -7603 -22091 -20194 256 10332 6756 7556 13510 10217 14912 14296 25988
12736 25988 13776 -960 8260 7448 5269 5413 3019 16622 30013 33099 25189 30533 18553 12212
12722 12212 3195 -5060 -11263 -13935 -4472 -9344 -10023 -12626 -8597 7045 11392 3476 3014 2037 -6231
12707 -6231 -3056 8707 -5930 -19233 -6474 -7665 -7895 -6487 -10590 -4533 3193 8762 7788 12728
12693 12728 10016 6313 443 705 11102 1806 -7935 -9368 6926 18040 13657 -4709 -9938 -3693
12679 -3693 5196 8417 16684 9029 4641 -37 -7744 -3601 -4278 4554 10368 18160 15243 13223 2442
12664 2442 8855 13614 14445 12514 5257 1063 -4018 -9757 -9204 649 12899 8016 6052 -6059 -4856
$$ packed form
12764a069J5672q285k350N133O328k867o360p159M17N62N146p28P888K0978k361
12749C0945k1234j7314j4488J897K0450J0076l576Q00N954l293M695o16J1692
12736B5988j2212j4736R220q12k179J44k394J3603J3391L086p910N344j1980o341
12722A2212r017q255o203k672R463m872o79k603M029J5642M347p916m62r77q268
12707f231L175J1763j4637j3303J2759j191k30J408m103O057P726N569r74M940
12693A2728k712l703n870K62J0397r296r741j433J6294J1114m383j8366n229O245
12679c693Q889L221Q267p655m388m678p707M143o77Q832N814P792k917k020j0781
12664B442O413M759Q31j931p257m194n081n739N53R853J2250m883j964j2111J203
$$ plain form
12649 -4856 -3856 -10872 -12091 -8733 -1001 -2527 812 13027 6351 -2262 -5767 3481 13714 9750
12635 9750 2415 1836 -2511 -6724 -10498 -1816 -7081 -6463 -1256 6602 2940 2865 -1124 -8254 3423
12620 3423 -10920 -16389 -5098 7200 12593 20344 21257 4576 -6577 -5933 -13879 -21887 -15326 1621
12606 1621 14279 10806 3214 7123 6742 4921 7929 13675 20107 13174 15787 11236 2261 -6494 2778
12591 2778 20229 25403 18992 17232 4102 -5685 -6862 2976 -1095 -9993 -11808 10389 19765 12719
12577 12719 851 4102 9491 8433 13469 13140 7563 -2303 -2235 -13546 -16860 -26145 -31684 -18147
12563 -18147 -6890 -5271 -7848 -9997 -6751 -1987 -11081 -12476 -2134 7843 -6047 -14403 -11975 -8602
12549 -8602 -649 -5966 -6292 6304 14122 2680 -9021 -7041 -5463 -954 5128 4295 -6406 -6997
$$ packed form
12649d856J000p016j219L358P732j526L339J2215o676q613l505R248J0233l964
12635I750p335n79m347m213l774Q682n265O18N207P858l662p5l989p130J1677
12620C423j4343n469J1291J2298N393P751R13j6681j1153O44p946q008O561J6947
12606A621J2658l473p592L909l81j821L008N746O432o933K613m551q975q755R272
12591B778J7451N174o411j760j3130r787j177R838m071q898j815K2197R376p046
12577A2719j1868L251N389j058N036l29n577r866O8j1311l314r285n539J3537
12563a8147J1257J619k577k149L246M764r094j395J0342R977j3890q356K428L373
12549h602P953n317l26J2596P818j1442j1701J980J578M509O082q33j0701n91
$$ plain form
12535 -6997 -9535 -5085 -10667 -18514 -18910 -3142 3833 20366 17722 9392 5310 3445 -5217 834
12521 834 4920 54 -15784 -17565 -13888 -950 -7376 -18009 -26786 -5165 16714 11495 11689 15806
12507 15806 16263 7552 -6935 -29519 -35402 -32805 -34041 -17025 -7522 -7771 -11456 -8113 2875 7872
12493 7872 7521 -872 -7862 -12831 -4725 -10702 -13448 -11779 -7883 -2486 1288 7463 -595 -10608 -15532
12478 -15532 -23071 -9044 9871 3565 -242 3033 562 1547 13828 6856 -1186 4145 7130 18511
12464 18511 19333 13716 14276 12695 -4070 -26000 -12109 4274 10998 13253 5875 2625 3316 6650
12450 6650 16585 13318 4653 -212 -5405 -9312 -15107 -14548 -1669 6384 13329 12312 1827 3807
12436 3807 5482 -2083 -10072 1284 14401 24452 24084 13163 9592 16329 20018 8158 -7653
$$ packed form
12535f997k538M450n582p847l96J5768O975J6533k644q330m082j865q662O051
12521H34M086m866j5838j781L677J2938o426j0633q777K1621K1879n219J94M117
12507A5806M57q711j4487k2584n883K597j236J7016R503k49l685L343J0988M997
12493G872l51q393o990m969Q106n977k746J669L896N397L774O175q058j0013m924
12478a5532p539J4027J8915o306l807L275k471R85J2281o972q042N331K985J1381
12464A8511Q22n617N60j581j6765k1930J3891J6383O724K255p378l250O91L334
12450F650R935l267q665m865n193l907n795N59J2879Q053O945j017j0485J980
12436C807J675p565p989J1356J3117J0051l68j0921l571O737L689j1860j5811
$$ plain form
12423 -7653 4677 14340 11867 3531 -11495 -9980 -13288 -7375 -9154 -9844 8282 14691 12777 -171
12409 -171 -8045 3278 13696 12949 1145 -1771 6 16097 20473 15209 -10166 -13179 -1043 8677
12395 8677 1165 -3487 -2293 -18484 -1834 8454 9728 6746 227 6647 14372 4719 -1437 -4554
12381 -4554 1547 -5628 -2615 -6409 -18214 -13289 1027 -8208 -20228 -3548 4290 13464 7368 -2862
12367 -2862 1320 -1777 -14228 -16214 -6174 -162 2980 2217 -4925 -11356 -1594 969 12824 7606
12353 7606 4302 8097 5918 14153 9407 -12364 -21011 -28637 -19753 -3039 1774 10060 10724 -2903
12339 -2903 -14525 -12830 282 4060 791 1458 -1669 1564 7423 -4278 -7075 -1896 -5972 -11133
12325 -11133 -10926 -12974 -13416 -3397 8143 -1008 -1708 -379 2513 6255 -2571 -10677 -26785 -20444
$$ packed form
12423g653J2330R663k473q336j5026J515l308N913j779o90J8126O409j914j2948
12409a71p874J1323J0418p47j1804k916J777J6091M376n264k5375l013J2136R720
12395H677p512m652J194j6191J6650J0288J274k982o519O420P725r653o156l117
12381d554O101p175L013l794j1805M925J4316r235j2020J6680P838R174o096j0230
12367b862M182l097j2451j986J0040O012L142p63p142o431R762K563J1855n218
12353G606l304L795k179Q235m746k1771q647p626Q884J6714M813Q286O64j3627
12339b903j1622J695J3112L778l269O67l127L233N859j1701k797N179m076n161
12325a1133K07k048m42J0019J1540r151p00J329K892L742q826q106j6108O341
$$ plain form
12311 -20444 -6170 -2018 -5694 3211 6609 5133 8549 9130 7353 6261 3313 -1205 2052 393
12297 393 -9118 -14314 -13684 -23635 -25355 -14976 -13926 1513 4218 -7332 -1917 -4011 -4458 -10252 -11260
12282 -11260 -69 11143 22469 39724 50762 37485 20727 10229 -1404 -5293 -17318 -2385
12270 -2385 11922 4981 -875 6371 4110 -10138 -11968 -14966 -10501 907 13531 21698 13932 15454
12256 15454 30753 29191 17663 14389 20606 28314 27429 16980 8339 6311 -3063 -2090 7986 11597
12242 11597 24687 25435 11462 9486 29137 18127 11523 15487 10343 2475 -110 13001 25061
12229 25061 22965 12824 -666 -8317 -17123 -5978 -5457 4964 6940 19531 22329 14696 4923
12216 4923 -2733 -2278 3516 -11760 -18250 -13247 -7348 -4837 -7874 8492 22381 13351 -16705 -13929
$$ packed form
12311b0444J4274M152l676Q905L398j476L416N81j777j092k948m518L257j659
12297C93r511n196O30r951j720J0379J050J5439K705j1550N415k094m47n794j008
12282a1260J1191J1212J1326J7255J1038j3277j6758j0498j1633l889j2025J4933
12270b385J4307o941n856P246k261j4248j830k998M465J1408J2624Q167p766J522
12256A5454J5299j562j1528l274O217P708q85j0449q641k028r374R73J0076L611
12242A1597J3090P48j3973j976J9651j1010o604L964n144p868k585J3111J2060
12229B5061k096j0141j3490p651q806J1145N21J0421J976J2591K798p633r773
12216D923p656M55N794j5276o490N003N899K511l037J6366J3889r030l0056K776
$$ plain form
12202 -13929 4278 -2482 -886 6845 12917 16285 12776 14449 11395 109 6305 7702 11531 14407
12188 14407 8760 2346 9191 18032 23902 21735 21316 42555 39433 21572 6016 3110 5937 4375
12174 4375 -3843 -6431 -4259 -4745 -5293 -14068 -23486 -28045 -12894 -9007 -17703 -10564 -5837 -4302 -2557
12159 -2557 -1122 16355 28355 23508 8187 4588 -2558 6744 9236 5352 7227 -5827 -4772 687
12145 687 1452 15799 16274 -478 -8534 -7790 -16835 -38185 -50111 -45777 -23898 -5768 -141 13727
12131 13727 12264 9385 5432 -5594 -10059 -8860 -12455 -11188 1238 20235 36633 45165 39891
12118 39891 40002 37084 45619 48999 58328 48221 42890 29401 19408 9492 11418 272 -12464 -12851
12104 -12851 -12424 -15269 -7909 587 -11962 -19570 -21487 -19379 -6264 -7060 2391 9099 4197 -2988
$$ packed form
12202a3929J8207o760J596P731O072L368l509J673l054j1286O196J397L829K876
12188A4407n647o414O845Q841N870k167m19K1239l122j7861j5556k906K827j562
12174D375q218k588K172m86n48q775r418m559J5151L887q696P139M727J535J745
12159b557J435J7477J2000m847j5321l599p146R302K492l884J875j3054J055N459
12145F87P65J4347M75j6752q056P44r045k1350j1926M334K1879J8130N627J3868
12131A3727j463k879l953j1026m465J199l595J267J2426J8997J6398Q532n274
12118C9891J11k918Q535L380R329j0107n331j3489r993r916J926j1146j2736l87
12104a2851M27k845P360Q496j2549p608j917K108J3115p96R451O708m902p185
$$ plain form
12090 -2988 2333 3289 4470 -353 -20582 -37199 -30340 -16617 -12816 -2230 15400 32555 31180
12077 31180 19772 16377 21004 21132 25074 47296 65968 75292 78362 77258 57170 25032 9520
12064 9520 -1542 8224 21945 29694 17958 5358 1810 16794 26339 24096 23618 18735 11097 5485
12050 5485 9944 4546 1044 -6172 4999 12599 4432 6377 10711 25842 30917 29924 5497 -6929
12036 -6929 -9976 -13543 -19460 -20101 -11066 2737 156 162 -2514 4957 459 4903 58 -13482 -1395
12021 -1395 6029 14244 187 -8895 -4393 -2827 7497 21516 15574 3935 2433 11217 14936 22355
12007 22355 15977 3754 -6340 -4307 5999 20547 22805 23150 11713 13708 21730 11289 4709
11994 4709 9010 7743 4642 6240 -565 -1094 445 -3487 -3939 4984 12512 13311 9104 15041 9192
$$ packed form
12090b988N321R56J181m823k0229j6617O859J3723L801J0586J7630J7155j375
12077C1180j1408l395M627J28L942K2222J8672R324L070j104k0088l2138j5512
12064I520j1062R766J3721P749j1736j2600l548J4984R545k243m78m883p638n612
12050E485M459n398l502p216J1171P600q167J945M334J5131N075r93k4427j2426
12036f929l047l567n917o41R035J3803k581Ok676P471m498M444m845j3540J2087
12021a395P424Q215j4057r082M502J566J0324J4019n942j1639j502Q784L719P419
12007B2355o378j2223j0094K033J0306J4548K258L45j1437J995Q022j0441o580
11994D709M301j267l101J598o805n29J539l932m52Q923P528P99m207N937n849
$$ plain form
11979 9192 9164 6169 -1159 8474 11267 -6878 -12393 -17899 -16023 -7435 -2389 2869 2038 524 10695
11964 10695 14928 12769 -3168 -3426 -10483 -3942 8635 14690 10824 -4024 -23314 -36613 -22320
11951 -22320 -11115 -10444 -8732 -10109 -373 -2806 -16562 -20540 -13262 -3798 5144 14071 7267 9498
11937 9498 12519 -260 -2294 3098 5173 133 -7847 -21325 -27331 -11161 6770 276 -13148
11924 -13148 -15176 -9406 -4871 2547 13612 19690 7865 5450 9481 4955 3728 4401 6256 -2208
11910 -2208 -7074 -6106 920 8259 11417 3558 4367 4078 5341 11270 3490 -2302 2574 -74 -9983
11895 -9983 -13933 -16640 -17038 -19681 -12121 -11311 -12552 -118 -676 -10741 -15614 -18646 -22747 -21664 -15133
11880 -15133 -7097 -6686 4324 14036 807 -5880 1018 -1015 1162 3033 7271 12008 4851 -5267
$$ packed form
11979I192k8k995p328R633K793j8145n515n506J876Q588N046N258q31j514J0171
11964A0695M233k159j5937k58p057O541J2577O055l866j4848j9290j3299J4293
11951b2320J1205O71J712j377R736k433j3756l978P278R464Q942Q927o804K231
11937I498L021j2779k034N392K075n040p980j3478o006J6170J7931o494j3424
11924a3148k028N770M535P418J1065O078j1825k415M031m526j227O73J855q464
11910b208m866R68P026P339L158p859Q09k89J263N929p780n792M876k648r909
11895i983l950k707l98k643P560Q10j241J2434n58j0065m873l032m101J083O531
11880a5133Q036M11J1010R712j3229o687O898k033K177J871M238M737p157j0118
$$ plain form
11866 -5267 -2350 -13823 -8318 7466 18460 17033 15173 7070 3842 9166 13472 3644 7817 19439
11852 19439 31179 27175 15321 2046 -2655 26 17041 29010 26509 14083 8736 4065 -2305
11839 -2305 2518 -7584 3223 7555 5144 8873 8484 7316 2509 -14901 -21877 -1743 8840 21203
11825 21203 16670 11400 15238 7904 -3923 -7335 4883 10708 4629 135 -2844 -3563 1010 3940
11811 3940 -2591 6637 16313 11390 7727 -8206 -10099 1565 14114 15886 20798 18411 11505 3664
11797 3664 2913 5616 6842 -183 -4803 -3791 -15069 -21394 -27391 -28627 -30405 -27711 -24126 -31814 -34506
11782 -34506 -26746 -19219 -13512 -8456 -6370 -1158 7559 2311 7525 9104 -3297 -8641 -25329 -34327
11768 -34327 -25462 -19509 -13913 -9292 -9144 -3257 -5114 2826 11674 15805 8576 234 5595 -2108 -10079
$$ packed form
11866e267K917j1473N505J5784J0994j427j860q103l228N324M306r828M173J1622
11852A9439J1740m004j1854j3275m701K681J7015J1969k501j2426n347m671o370
11839b305M823j0102J0807M332k411L729l89j168m807j7410o976K0134J0583J2363
11825B1203m533n270L838p334j1827l412J2218N825o079m494k979p19M573K930
11811C940o531R228R676m923l663j5933j893J1664J2549J772M912k387o906p841
11797C664p51K703J226p025m620J012j1278o325n997j236j778K694L585p688k692
11782c4506P760P527N707N056K086N212Q717n248N214J579j2401n344j6688q998
11768c4327Q865N953N596M621J48N887j857P940Q848M131p229q342N361p703p971
$$ plain form
11753 -10079 12079 20639 21414 13094 -10566 -24074 -8717 1256 -3307 -7045 788 1906 -1795 1820
11739 1820 28745 33598 15562 -7565 -2796 -108 -13905 -20114 -6425 -6258 6271 12949 21129
11726 21129 18596 5221 1163 1930 8096 4549 10912 12426 13708 28789 22954 25267 12651 14366
11712 14366 24296 14481 539 -779 3794 22638 9929 -13846 -23016 -9716 -7438 -3864 -11403
11699 -11403 -17100 598 17863 19322 20543 11608 -2731 3813 -842 -4280 11476 31383 27209
11686 27209 23151 19050 3455 -11343 -4270 19870 30510 25792 30313 39123 37279 28424 34389
11673 34389 35268 33247 29685 27231 20183 15396 14112 737 2399 7851 15048 28961 21186 8224
11659 8224 11409 23518 30260 28166 23996 28817 27076 34733 34530 24064 22012 18542 17659 25394 30228
$$ packed form
11753a0079K2158Q560P75q320k3660j3508J5357R973m563l738P833J118l701L615
11739A820K6925M853j8036k3127M769K688j3797o209J3689J67J2529O678Q180
11726B1129k533j3375m058P67O166l547O363J514J282J5081n835K313j2616J715
11712A4366R930r815j3942j318M573J8844j2709k3775r170J3300K278L574p539
11699a1403n697J7698J7265J459J221q935j4339O544m655l438J5756J9907m174
11686B7209m058m101j5595j4798P073K4140J0640m718M521Q810j844q855N965
11673C4389Q79k021l562k454p048m787j284j3375J662N452P197J3913p775j2962
11659H224L185J2109O742k094m170M821j741P657k03j0466k052l470q83P735M834
$$ plain form
11644 30228 24168 12774 -3604 224 5705 -1385 -7489 -2604 18869 25724 36967 35791 13619
11631 13619 645 1503 8128 10004 7469 4262 6770 3492 -430 5788 3497 4174 5023 4624 13857
11616 13857 16711 4587 -888 4481 12960 20094 19898 18533 17306 19006 12333 7830 4474 -1709
11602 -1709 1504 14399 9101 3941 7757 4433 -3978 -466 -3398 3449 6152 2912 8053 14894
11588 14894 1186 900 9577 4700 -3113 -1043 6099 -2900 -12002 8190 5411 -14782 -2002 5962
11574 5962 8828 7522 18366 21445 31556 29480 22255 25662 29987 38972 42511 29219 21637 12393
11560 12393 7944 -540 7492 13423 18727 13011 14027 10433 13495 15385 12964 12962 5148 -6738 -3095
11545 -3095 -5518 -9555 -12068 1498 11876 26586 40691 20884 7855 -484 1775 12891 30182
$$ packed form
11644C0228o060j1394j6378L828N481p090o104M885K1473O855J1243j176k2172
11631A3619j2974Q58O625J876k535l207K508l278l922O218k291O77Q49l99R233
11616A3857K854j2124n475N369Q479P134j96j365j227J700o673m503l356o183
11602a709L213J2895n298n160L816l324q411L512k932O847K703l240N141O841
11588A4894j3708k86Q677m877p813K070P142q999r102K0192k779k0193J2780P964
11574E962K866j306J0844L079J0111k076p225L407M325Q985L539j3292p582r244
11560A2393m449q484Q032N931N304n716J016l594L062J890k421kp814j1886L643
11545c095k423m037k513J3566J0378J4710J4105j9807j3029q339K259J1116J7291
$$ plain form
11532 30182 44407 47594 36967 12892 -6957 3253 4019 -1420 2032 5291 11255 9257 -695
11519 -695 -11482 -12027 -5711 5631 -4252 -8641 15597 35040 38286 35426 30389 11778 4119 -8342
11505 -8342 -9698 -3842 3078 1188 2625 21002 29387 33053 25651 31343 30639 30741 36502 26021 33062
11490 33062 52581 51539 52573 46645 38503 37676 53380 76560 76549 58482 45221 56481 64821 81050
11476 81050 92962 106490 126321 150425 182917 240755 306039 409620 569257 865294 1314097
11465 1314097 1883398 2288521 2187870 1643369 1073734 697164 483057 345990 252798 204251
11455 204251 179391 152121 119172 91444 80106 75273 68265 72712 72062 57939 55854 50831 42516
11442 42516 32674 26861 18382 21540 27877 29671 34623 23907 19652 22030 26171 33445 42448 44170
$$ packed form
11532C0182J4225L187j0627k4075j9849J0210P66n439L452L259N964j998r952
11519f95j0787n45O316J1342r883m389K4238J9443L246k860n037j8611p659j2461
11505h342j356N856O920j890J437J8377Q385L666p402N692p04J02N761j0481P041
11490C3062J9519j042J034n928q142q27J5704K3180j1j8067j3261J1260Q340J6229
11476H1050J1912J3528J9831K4104L2492N7838O5284J03581J59637K96037M48803
11465A314097N69301M05123j00651n44501n69635l76570k14107j37067r3192m8547
11455B04251k4860k7270l2949k7728j1338m833p008M447o50j4123k085n023q315
11442D2516r842n813q479L158O337J794M952j0716m255K378M141P274R003J722
$$ plain form
11428 44170 28520 33111 34255 29669 40744 50498 51653 48885 54292 41915 36682 31748 22358 22129
11414 22129 24700 24370 21436 13634 7763 32717 58877 51145 40132 29463 33003 36140 40559 34806
11400 34806 11727 12443 11875 10160 13376 19160 28662 24560 20692 6244 -5986 6074 10233 8786
11386 8786 15567 14161 4565 16898 18930 17380 23211 25527 38672 21862 14672 20477 14998 5554
11372 5554 -1887 -15625 -16561 -3202 -967 -4041 -4809 -9510 -8347 -1154 11703 20802 39949 46535
11358 46535 60402 61252 56441 51888 58566 58974 61358 64140 54116 47312 41704 37881 33331 39646
11344 39646 49855 60358 71705 72378 65323 58931 49619 44401 41634 50190 55603 60799 53877 62565
11330 62565 66219 50466 46327 46323 56961 64552 73685 91152 113076 141224 141034 129722 118672 106396
$$ packed form
11428D4170j5650M591J144m586J1075R754J155k768N407j2377n233m934r390k29
11414B2129K571l30k934p802n871K4954K6160p732j1013j0669L540L137M419n753
11400C4806k3079P16n68j715L216N784R502m102l868j4448j2230J2060M159j447
11386H786O781j406r596J2333K032j550N831K316J3145j6810p190N805n479r444
11372E554p441j3738r36J3359K235l074p68m701J163P193J2857R099J9147O586
11358D6535J3867Q50m811m553O678M08K384K782j0024o804n608l823m550O315
11344C9646J0209J0503J1347O73p055o392r312n218k767Q556N413N196o922Q688
11330F2565L654j5753m139mJ0638P591R133J7467K1924K8148j90j1312j1050j2276
$$ plain form
11316 106396 120788 157042 211334 273478 341481 388503 389439 360271 295935 234230 189094 158624
11304 158624 134076 121394 117204 111576 90031 75532 72326 61021 67839 69370 70312 74430 67212
11291 67212 55806 47037 40425 45082 51950 56652 63666 63300 47311 34272 50305 60235 57447 49578
11277 49578 44868 37411 31188 31972 50898 68355 74581 63951 55400 44954 62174 78437 87034
11264 87034 71555 53097 44993 31015 20140 19857 28847 31596 36078 34985 31690 42744 57042
11251 57042 50703 53977 71677 80025 79476 74465 80076 101792 112972 128206 120069 98871 81309
11238 81309 81125 87962 89200 100755 113614 112051 117760 117823 112141 103663 93907 75344 71117 69427
11224 69427 77471 80229 90930 99718 104133 114409 121464 139656 147456 156886 164968 174442 177711 151976
$$ packed form
11316A06396J4392L6254N4292O2144O8003M7022R36k9168o4336o1705m5136l0470
11304A58624k4548j2682m190n628k1545j4499l206j1305O818J531R42M118p218
11291F7212j1406q769o612M657O868M702P014l66j5989j3039J6033R930k788p869
11277D9578m710p457o223P84J8926J7457O226j0630q551j0446J7220J6263Q597
11264H7034j5479j8458q104j3978j0875k83Q990K749M482j093l295J1054J4298
11251E7042o339L274J7700Q348n49n011N611K1716J1180J5234q137k1198j7562
11238H1309j84O837J238J1555J2859j563N709O3n682q478r756j8563m227j690
11224F9427Q044K758J0701Q788M415J0276P055J8192P800R430Q082R474L269k5735
$$ plain form
11210 151976 119100 94790 93553 96451 125650 158268 174823 175604 166726 157373 145545 154758 150142
11197 150142 136933 141174 140348 140586 144012 152428 165080 190919 215869 264367 346681 434844 470079
11184 470079 466507 422985 365339 316867 263163 217566 181332 172513 169450 160961 168133 178618
11172 178618 168993 160814 151895 138472 128915 119705 135679 154595 168033 179629 186757 201972 210554
11159 210554 206164 211762 231111 232726 227231 232476 248661 268540 282366 292674 289942 274123 246695
11146 246695 224832 227026 250307 265407 270801 278463 273801 270488 262466 260118 268543 298926 314718
11133 314718 325599 340139 337541 336331 363353 378250 390408 395077 425575 484892 528185 560796
11121 560796 577230 589304 616338 626818 631774 646364 667161 682289 694962 695763 700954 712788
$$ packed form
11210A51976l2876k4310j237K898K9199L2618J6555P81q878r353j1828R213m616
11197A50142j3209M241q26K38L426Q416J2652K5839K4950M8498Q2314Q8163L5235
11184D70079l572m3522n7646m8472n3704m5597l6234q819l063q489P172J0485
11172A78618r625q179q919j3423r557r210J5974J8916J3438J1596P128J5215Q582
11159B10554m390N598J9349J615n495N245J6185J9879J3826J0308k732j5819k7428
11146B46695k1863K194K3281J5100N394P662m662l313q022k348Q425L0383J5792
11133C14718J0881J4540k598j210K7022J4897J2158M669L0498N9317M3293L2611
11121E60796J6434J2074K7034J0480M956J4590K0797J5128J2673Q01N191J1834
$$ plain form
11109 712788 720990 735721 783666 828525 896316 957422 1003043 1072549 1128512 1157565 1177751 1194276
11097 1194276 1228386 1290294 1370558 1475663 1579311 1692272 1835877 2001641 2148709 2274648
11087 2274648 2414181 2562928 2744055 2992840 3326775 3749705 4327905 5109269 6047821
11078 6047821 6827013 7124822 7086254 7169177 7646799 8519785 9759288 11400558 13537263
11069 13537263 16237298 19434625 23075102 27461434 33525733 42723764 57112777 80482950
11061 80482950 119871057 184957508 279940886 382565525 427207664 373863223 261657775
11054 261657775 164648549 105774953 72198753 52303421 39976714 32102158 26822932
11047 26822932 22871479 19410526 16166437 13419820 11408555 9954392 8853625 8032084
$$ packed form
11109G12788Q202J4731M7945M4859O7791O1106M5621O9506N5963K9053K0186J6525
11097A194276L4110O1908Q0264J05105J03648J12961J43605J65764J47068J25939
11087B274648J39533J48747J81127K48785L33935M22930N78200P81364R38552
11078F047821P79192K97809l8568Q2923M77622Q72986J239503J641270K136705
11069A3537263K700035L197327L640477M386332O064299R198031J4389013K3370173
11061H0482950L9388107O5086451R4983378J02624639M4642139n3344441j12205448
11054B61657775r7009226n8873596l3576200j9895332j2326707p874556n279226
11047B6822932l951453l460953l244089k746617k011265j454163j100767q21541
$$ plain form
11039 8032084 7451658 7089905 6953448 6939051 6718805 6029377 5107545 4336066 3789252 3406084
11029 3406084 3121068 2893750 2716437 2624851 2651151 2812743 2965937 2830345 2432439 2085624
11019 2085624 1871437 1712248 1578530 1464864 1367406 1287316 1213447 1141490 1075901 1036559
11009 1036559 1006948 967612 933732 899355 857229 803653 759338 723545 661431 618473 598058
10998 598058 583675 556929 531688 502068 465768 451194 447728 462991 476507 473662 458133 453256
10986 453256 443208 437709 426448 420073 430035 425732 426151 425420 418209 409761 374866 341469 325083
10973 325083 315372 322757 307565 298946 290394 288777 264731 232777 219635 223952 235661 238683 233449
10960 233449 236839 247737 249541 247285 242592 234815 233446 224017 222558 238134 253806 262637 256514
$$ packed form
11039H032084n80426l61753j36457j4397k20246o89428r21832p71479n46814l83168
11029C406084k85016k27318j77313r1586K6300J61592J53194j35592l97906l46815
11019B085624k14187j59189j33718j13666r7458q0090p3869p1957o5589l9342
11009A036559k9611l9336l3880l4377m2126n3576m4315l5793o2114m2958k0415
10998E98058j4383k6746k5241k9620l6300j4574l466J5263J3516k845j5529m877
10986D53256j0048n499j1261o375R962m303M19p31p211q448l4895l3397j6386
10973C25083r711P385j5192q619q552j617k4046l1954j3142M317J1709L022n234
10960B33449L390J0898J804k256m693p777j369r429j459J5576J5672Q831o123
$$ plain form
10947 256514 256031 255540 246996 231353 224861 218645 221762 230311 227434 228941 249328 278662 340938 433237
10933 433237 518166 573917 551664 503774 439818 368896 302741 262396 241650 216054 191323
10922 191323 181765 164805 159874 158629 135491 129487 122099 108255 111631 120204 115733 105196 97457
10909 97457 105030 120325 133370 124109 107884 88802 64790 39321 18935 26226 44677 59265
10897 59265 72630 77028 79428 80556 78216 90197 99719 99655 90902 77304 64221 74758 78358 74126
10883 74126 61163 64242 69893 81371 80703 70550 78355 92354 93863 91696 107921 135092 130496
10870 130496 104483 78158 83562 107801 105837 109344 100200 88485 92977 97821 99125 91278 84426
10857 84426 83008 83487 78778 61734 49042 50544 56828 48573 56876 54314 39001 39115 46326 43536
$$ packed form
10947B56514m83m91q544j5643o492o216L117Q549k877J507K0387K9334O2276R2299
10933D33237Q4929N5751k2253m7890o3956p0922o6155m0345k0746k5596k4731
10922A91323r558j6960m931j245k3138o004p388j3844L376Q573m471j0537p739
10909I7457P573J5295J3045r261j6225j9082k4012k5469k0386P291J8451J4588
10897E9265J3365M398K400J128k340J1981R522o4q753j3598j3083J0537L600m232
10883G4126j2963L079N651J1478o68j0153P805J3999J509k167J6225K7171m596
10870A30496k6013k6325N404K4239j964L507r144j1715M492M844J304p847o852
10857H4426j418M79m709j7044j2692J502O284q255Q303k562j5313J14P211k790
$$ plain form
10843 43536 41797 55357 61728 47362 54708 61574 53571 37267 31575 37818 44729 42517 50703 48263
10829 48263 49899 45891 25742 28009 47632 63434 63954 46975 30511 32452 42874 45050 45149 45810
10815 45810 43782 37198 21052 9582 -5983 -11899 -9202 -4284 9510 13883 7825 18788 21393
10802 21393 6854 -348 2792 419 -7858 -1241 9992 16735 26727 35383 40880 47293 46803 57461
10788 57461 55702 47035 58649 65123 48361 35496 32729 31374 25841 14232 16332 10498 34385
10775 34385 47671 42788 25914 19149 5153 1141 3032 19270 14577 9428 7410 1466 5268
10762 5268 8781 7694 9091 -3673 -7260 -4060 -2904 226 26898 35285 40032 33358 32362 33791
10748 33791 43902 49383 44684 49058 41040 34444 34434 25339 18568 14417 13660 14455 17194 27193 34647
$$ packed form
10843D3536j739J3560O371j4366P346O866q003j6304n692O243O911k212Q186k440
10829D8263J636m008k0149K267J9623J5802N20j6979j6464J941J0422K176R9O61
10815D5810k028o584j6146j1470j5565n916K697M918J3794M373o058J0963K605
10802B1393j4539p202L140k373q277O617J1233O743R992Q656N497O413m90J0658
10788E7461j759q667J1614O474j6762j2865k767j355n533j1609K100n834K3887
10775C4385J3286m883j6874o765j3996m012J891J6238m693n149k018n944L802
10762E268L513j087J397j2764l587L200J156L130K6672Q387M747o674r96J429
10748C3791J0111N481m699M374q018o596j0r095o771m151p57P95K739R999P454
$$ plain form
10733 34647 34345 47738 49257 48482 47167 39562 27788 29706 30684 31193 28582 21906 3178 -3683 -1847
10718 -1847 -3530 -7845 -14506 593 3419 1232 2667 -7630 -20460 -14553 578 13647 19189
10705 19189 23360 25312 33925 27968 28165 36288 40130 40269 33003 31816 21197 -6723 -21818 -22316
10691 -22316 -5337 11911 22010 23556 18494 21015 43427 47526 31146 28957 31281 30529 32641
10678 32641 33716 13066 9555 8483 14847 28539 32130 26264 15418 3138 11217 15399 24142
10665 24142 48476 55912 54213 62787 63902 51691 55552 72247 80154 104205 130019 159727 204528
10652 204528 254983 323444 437465 623283 938326 1419821 1979181 2301888 2099099 1521390
10642 1521390 963648 598756 402057 286436 221851 179712 145584 134226 121055 102375
$$ packed form
10733C4647l02J3393J519p75j315p605j1774J918R78N09k611o676j8728o861J836
10718a847j683m315o661J5099K826k187J435j0297j2830N907J5131J3069N542
10705A9189M171J952Q613n957J97Q123L842J39p266j187j0619k7920j5095m98
10691b2316J6979J7248J0099J546n062K521K2412M099j6380k189K324p52K112
10678C2641J075k0650l511j072O364J3692L591n866j0846j2280Q079M182Q743
10665B4142K4334P436j699Q574J115j2211L861J6695P907K4051K5814K9708M4801
10652B04528N0455O8461J14021J85818L15043M81495N59360L22707k02789n77709
10642A521390n57742l64892j96699j15621o4585m2139l4128j1358j3171j8680
$$ plain form
10632 102375 95929 77239 56507 33996 34868 48762 48356 42090 33992 31636 40791 46199 32132
10619 32132 17397 9139 7524 10578 10623 25535 23757 16913 25582 10786 4847 4636 4370 302 8141
10604 8141 31422 37301 31539 42602 51648 50042 46144 47253 53137 39279 31243 25343 16003 13908
10590 13908 10573 11220 7940 8254 19365 20435 11077 21004 27766 20182 12205 6083 14181 12428 -1042
10575 -1042 -13124 -1934 9673 14128 11272 3 -389 2613 1467 10202 6001 11137 10201 8335
10561 8335 -3399 -274 2993 7038 11892 13617 17891 28627 32567 32890 26031 18468 16381 20879
10547 20879 17897 5500 3020 -2829 -5677 -7524 -6638 -7251 4040 8611 -5820 -15532 -30167 -2335
10533 -2335 14434 8527 10455 26928 45014 43941 23279 1790 5709 15745 27261 40068 48557
$$ packed form
10632A02375o446j8690k0732k2511Q72J3894m06o266q098k356R155N408j4067
10619C2132j4735q258j615L054M5J4912j778o844Q669j4796n939k11k66m068P839
10604H141K3281N879n762J1063R046j606l898J109N884j3858q036n900r340k095
10590A3908l335O47l280L14J1111J070r358R927O762p584p977o122Q098j753j3470
10575a042j2082J1190J1607M455k856j1269l92L002j146Q735m201N136r36j866
10561H335j1734L125L267M045M854J725M274J0736L940L23o859p563k087M498
10547B0879k982j2397k480n849k848j847Q86o13J1291M571j4431r712j4635K7832
10533b335J6769n907J928J6473J8086j073k0662k1489L919J0036J1516J2807Q489
$$ plain form
10520 48557 45997 15838 19739 29593 17446 144 -766 -550 -5357 -1660 -8253 -11169 -8232 5361
10506 5361 17201 19185 14230 12165 13213 18365 17539 19566 31477 20165 18394 19806 23106 23446
10492 23446 23295 17194 17622 17365 12105 17049 12601 21095 21593 17350 8952 5308 8049 10987 -119
10477 -119 4401 9601 8690 6722 16032 30261 22339 1062 115 20030 19348 12449 14945 7373 2019
10462 2019 4976 3644 9858 -2419 1982 -8859 -13768 -12597 -23571 -16863 1157 14682 5480
10449 5480 3570 7245 7329 14303 18248 7848 3190 15482 22278 25921 23957 19581 12369 10878 4922
10434 4922 10850 1048 378 7597 14056 13094 7722 -2505 -4462 -12750 -12035 2312 -2808 -13595 571
10419 571 -518 6441 1689 -11402 -1517 2410 -5204 -8886 -3107 -13566 -22679 -502 6176 10771
$$ packed form
10520D8557k560l0159L901R854j2147j7302r10K16m807L697o593k916K937J3593
10506E361J1840J984m955k065J048N152q26K027J1911j1312j771J412L300L40
10492B3446j51o101M28k57n260M944m448Q494M98m243q398l644K741K938j1106
10477a19M520N200r11j968R310J4229p922k1277r47J9915o82o899K496p572n354
10462B019K957j332O214j2277M401j0841m909J171j0974O708J8020J3525r202
10449E480j910L675Q4O974L945j0400m658J2292O796L643j964m376p212j491n956
10434D922N928r802o70P219O459r62n372j0227j957q288P15J4347n120j0787J4166
10419E71j089O959m752j3091R885L927p614l682N779j0459r113K2177O678M595
$$ plain form
10405 10771 16188 18682 25453 20176 20280 11392 4959 10228 18558 30322 24463 878 -10765 -5741
10391 -5741 5796 1755 -7168 -7389 -8275 -15664 -3137 -367 4376 7968 -3214 -4875 3464 13514
10377 13514 13259 4680 5554 15237 4992 -2770 10431 11076 881 -7924 -4198 -7729 4091 16370
10363 16370 14472 12311 12498 10139 15074 26701 9308 -1751 3564 9375 19508 25856 12886
10350 12886 7900 20072 27974 12514 8459 -458 -16398 -17384 -18539 -14379 -19721 -9337 -8518 -15481
10336 -15481 -9680 429 3186 11525 9013 11488 1423 4793 7895 14010 9557 5064 6991 -1149
10322 -1149 -7752 -12031 -8158 -18495 -13582 12279 15706 14794 5334 8039 12118 8883 13371 5201
10308 5201 -5336 -8967 -7594 6756 -4606 -4175 4132 8809 15501 18091 16321 2722 -3823 -4867
$$ packed form
10405A0771N417K494O771n277J04q888o433N269Q330J1764n859k3585j1643N024
10391e741J1537m041q923k21q86p389J2527K770M743L592j1182j661Q339J0050
10377A3514k55q579Q74R683j0245p762J3201O45j0195q805L726l531J1820J2279
10363A6370j898k161J87k359M935J1627j7393j1059N315N811J0133O348j2970
10350A2886m986J2172P902j5460m055q917j5940r86j155M160n342J0384Q19o963
10336a5481N801J0109K757Q339k512K475j0065L370L102O115m453m493J927q140
10322a149o603m279L873j0337M913K5861L427r12r460K705M079l235M488q170
10308E201j0537l631J373J4350j1362M31Q307M677O692K590j770j3599o545j044
$$ plain form
10294 -4867 -1657 8111 6890 7657 12615 19863 -3103 -12980 -5265 -3867 -8961 7417 7779 -12988
10280 -12988 -21320 -33525 -29162 -33783 -28454 -22561 -14826 4341 9714 5108 14826 18531 17220 24889
10266 24889 23432 16852 -6896 -626 5423 2111 4233 3267 311 -8851 -11102 -13538 -6306 2836
10252 2836 6002 -1948 -6844 -3416 -13912 -23116 -7644 3222 5748 4620 2766 -12 -6311 -7117
10238 -7117 -4348 -11617 -2754 -8133 -1641 5664 1750 1838 -6941 -937 4087 -1721 844 5729 9283
10223 9283 -1098 -7402 -10616 -4902 -6232 7646 17515 21893 29878 32662 28185 13883 19461 23657
10209 23657 16204 5330 -1413 -1997 -15719 -7032 6640 12497 8390 -5473 1443 -997 3440 9091
10195 9091 11950 22298 35912 16344 714 -493 209 -5309 -6016 -14565 -8761 6681 11646 9261
$$ packed form
10294d867L210R768j221P67M958P248k2966r877P715J398n094J6378L62k0767
10280a2988q332j2205M363m621N329N893P735J9167N373m606R718L705j311P669
10266B4889j457o580k3748O270O049l312K122r66k956r162k251k436P232R142
10252B836L166p950m896L428j0496r204J5472J0866K526j128j854k778o299q06
10238g117K769p269Q863n379O492P305l914Q8q779O004N024n808K565M885L554
10223I283j0381o304l214N714j330J3878R869M378P985K784m477j4302N578M196
10209B3657p453j0874o743n84j3722Q687J3672N857m107j3863O916k440M437N651
10195I091K859J0348J3614j9568j5630j207P02n518p07q549N804J5442M965k385
$$ plain form
10181 9261 6997 -1238 2240 13399 6980 1656 3079 135 -2299 14715 19889 24256 14257 2209
10167 2209 -6550 -4066 1673 -12933 -33056 -23553 -12395 -16818 -12213 -9352 -16423 -12954 -1339 -7897
10153 -7897 -13579 -9681 -9854 -14758 -5335 14861 19900 12799 -13536 -14428 -5457 -4336 -2942 5161 15771
10138 15771 10891 -4867 5325 -8071 -16950 -25832 -25158 -18693 -20263 -18560 -10506 -10015 -14241 -14629
10124 -14629 -12334 9524 9883 -710 -8794 -7801 1763 549 -3001 -12616 -15610 -2230 6896 -808
10110 -808 -1944 -15164 -27718 -14250 11465 17074 21122 26183 30772 23493 11974 14048 19516 21824
10096 21824 14711 -795 -13440 -6782 1691 -3843 -2034 5751 -1558 550 16461 5514 2095
10083 2095 2439 7032 -1997 -4140 2033 -10824 -8888 -1316 5632 5427 -1809 3236 9851 20361 8790
$$ packed form
10181I261k264q235L478J1159o419n324J423k944k434J7014N174M367r999j2048
10167B209q759K484N739j4606k0123R503J1158m423M605K861p071L469J1615o558
10153g897n682L898j73m904R423K0196N039p101k6335q92Q971J121J394Q103J0610
10138A5771m880j5758J0192j3396q879q882O74O465j570J703Q054M91m226l88
10124a4629K295K1858L59j0593q084R93R564j214l550r615k994J3380R126p704
10110h08j136j3220j2554J3468K5715N609M048N061M589p279j1519K074N468K308
10096B1824p113j5506j2645O658Q473n534J809P785p309K108J5911j0947l419
10083B095L44M593r029k143O173j2857J936P572O948k05p236N045O615J0510j1571
$$ plain form
10068 8790 7493 11432 15499 25170 31594 22499 30421 25543 76 -18169 -23962 -11624 5955 7595
10054 7595 3695 -7069 -8312 477 0 -1191 -160 4444 7440 -5881 -9365 7451 -1644 7079
10040 7079 4816 -947 8499 23783 3553 -1124 5539 18063 10320 13355 13798 19072 13736 6489
10026 6489 -3 5683 13835 7284 9531 -2418 -7456 2458 12015 15377 20070 14532 9380 17846
10012 17846 20420 12481 4460 14397 20316 5992 7800 9676 8840 8016 6278 6775 15908 414 -13677
9997 -13677 -2749 8319 23918 34614 18320 4848 2306 14117 22028 14037 5879 17030 31622
9984 31622 37397 22595 12361 10366 6264 18068 24895 28026 25509 14927 13266 2393 2572 -4691
9970 -4691 -7884 -4902 -7570 -1537 -1422 -7167 431 -4575 -14744 -10593 -4650 -2268 7235 9140 8121
$$ packed form
10068H790j297L939M067R671O424r095P922m878k5467j8245n793J2338J7579J640
10054G595l900j0764j243Q789m77j191J031M604K996j3321l484J6816r095Q723
10040G079k263n763R446J5284k0230m677O663J2524p743L035M43N274n336p247
10026F489o492N686Q152o551K247j1949n038R914R557L362M693n538n152Q466
10012A7846K574p939q021R937N919j4324J808J876q36q24j738M97R133j5494j4091
9997a3677J0928J1068J5599J0696j6294j3472k542J1811P911p991q158J1151J4592
9984C1622N775j4802j0234j995m102J1804O827L131k517j0582j661j0873J79p263
9970d691l193K982k668O033J15n745P598n006j0169M151N943K382R503J905j019
$$ plain form
9955 8121 7601 -2657 -6726 -9042 166 178 1772 2755 -4179 -368 7587 7778 13286 19601 12146 5676
9939 5676 -1946 9600 7738 5594 11753 2776 -4302 -10411 -22402 -13805 -11521 73 17641 19450
9925 19450 19242 11499 5624 5960 10891 15059 20351 10914 3333 -449 -7173 -3601 -5536 -3865 5949
9910 5949 -8619 -15790 -5252 15451 31258 25698 23015 21569 23122 15401 2468 5846 15430 20557
9896 20557 18744 21174 23530 37403 25756 16282 10119 258 3460 17191 23228 21201 22540 19233
9882 19233 19372 3860 -1142 8650 -2488 -3423 8694 12120 4330 5124 17598 18666 22490 35146
9868 35146 36165 19877 10945 5782 11340 12703 15555 19488 16366 13338 18625 30639 23797 11578
9854 11578 -1349 -7915 -5744 -7324 -7044 -4979 9553 25886 25953 9003 17863 20474 22814 30089
$$ packed form
9955H121n20j0258m069k316R208J2J594R83o934L811P955J91N508O315p455o470
9939E676p622J1546j862k144O159q977p078o109j1991Q597K284J1594J7568J809
9925A9450k08p743n875L36M931M168N292r437p581l782o724L572j935J671R814
9910E949j4568p171J0538K0703J5807n560k683j446J553p721j2933L378R584N127
9896B0557j813K430K356J3873j1647r474o163r861L202J3731O037k027J339l307
9882A9233J39j5512n002R792j1138r35J2117L426p790P94J2474J068L824J2656
9868C5146J019j6288q932n163N558J363K852L933l122l028N287J2014o842j2219
9854A1578j2927o566K171j580K80K065J4532J6333O7j6950Q860K611K340P275
$$ plain form
9840 30089 37328 29658 29854 30314 25453 28874 37222 33506 31789 39344 42182 35646 25686 9912 17229
9825 17229 13869 18627 19441 13649 3358 3920 5295 8050 1981 2563 1394 11271 21204 26112 37877
9810 37877 25241 7494 -1510 9785 9390 5557 10739 7999 14836 8168 15437 25207 26905 16519
9796 16519 7013 116 1732 -681 1937 -6734 -13073 -9385 4103 21638 27184 18218 23054 26586
9782 26586 16335 11803 11840 20246 16462 -13433 -21217 -16972 -7683 6808 31053 28238 7957 5950
9768 5950 8115 11132 9821 -1023 13702 15919 15179 18312 7436 8256 16430 2744 -1765 -5587
9754 -5587 3114 11822 20072 34273 24088 5030 14221 27249 31932 33332 23854 20242 13920 15229
9740 15229 26288 28127 20940 23520 24883 43411 46585 43530 34912 27687 20400 22712 22483 28674
$$ packed form
9840C0089P239p670J96M60m861L421Q348l716j717P555K838o536r960j5774P317
9825A7229l360M758Q14n792j0291N62J375K755o069N82j169R877R933M908J1765
9810C7877j2636j7747r004J1295l95l833N182k740O837o668P269R770J698j0386
9796A6519r506o897J616k413K618q671o339L688J3488J7535N546q966M836L532
9782B6586j0251m532L7Q406l784k9895p784M245R289J4491K4245k815k0281k007
9768E950K165L017j311j0844J4725K217p40L133j0876Q20Q174j3686m509l822
9754e587Q701Q708Q250J4201j0185j9058R191J3028M683J400r478l612o322J309
9740A5229J1059J839p187K580J363J8528L174l055q618p225p287K312k29O191
$$ plain form
9726 28674 12887 1973 11950 18276 41488 48902 50982 45354 34162 22117 28817 23860 21340
9713 21340 32252 27938 22734 21900 19637 21786 23486 27439 15300 9480 40692 51588 45155 36653
9699 36653 27515 18876 20022 37754 47873 53718 51646 51807 63047 60612 55327 61043 74064 71307
9685 71307 58487 56605 53800 46899 51169 65945 61164 61146 70517 71914 68015 60113 56749 62632 59714
9670 59714 60035 50654 46001 58100 70758 78781 78768 75561 88432 86710 93640 111704 112488 110634 107377
9655 107377 113151 106442 107393 118927 115486 120535 124917 139776 145250 147181 157169 175012 181802 173398
9641 173398 176414 176918 185041 193710 219383 239636 250695 257939 263234 267122 278187 295672 307343
9628 307343 325646 349215 360801 378560 419320 458788 485706 524297 566563 593904 634419 681672
$$ packed form
9726B8674j5787j0914R977O326K3212P414K080n628j1192j2045O700m957k520
9713B1340J0912m314n204q34k263K149J700L953j2139n820L1212J0896o433q502
9699C6653r138q639J146J7732J0119N845k072J61J1240k435n285N716J3021k757
9685G1307j2820j882k805o901M270J4776m781j8R371J397l899p902l364N883k918
9670E9714L21r381m653J2099J2658Q023j3l207J2871j722O930J8064P84j854l257
9655A07377N774o709R51J1534l441N049M382J4859N474J931R988J7843O790q404
9641A73398L016N04Q123Q669K5673K0253J1059P244N295L888J1065J7485J1671
9628C07343J8303K3569J1586J7759M0760L9468K6918L8591M2266K7341M0515M7253
$$ plain form
9616 681672 725534 772171 846108 928999 1009846 1112316 1224907 1323200 1435937 1569940 1718664
9605 1718664 1895569 2104728 2326633 2557391 2770011 2982379 3178262 3334619 3448548 3525922
9595 3525922 3541152 3500350 3400858 3265182 3096103 2886586 2654247 2433264 2235516 2045987
9585 2045987 1868637 1709787 1560039 1430422 1319398 1199021 1085211 990726 912882 838138
9575 838138 782465 728486 677616 621672 581733 546784 514806 485937 463498 439734 417809 394304
9563 394304 379711 360560 325735 304012 288659 277181 251339 224209 225199 214741 198826 195881
9551 195881 186043 181440 184123 181548 175504 162818 155371 146222 137896 144461 137068 128781 130855 130418
9537 130418 114975 115145 112225 103436 112648 118293 95244 79953 87322 87307 97397 118814 97107 77596
$$ packed form
9616F81672M3862M6637P3937Q2891Q0847J02470J12591R8293J12737J34003J48724
9605A718664J76905K09159K21905K30758K12620K12368J95883J56357J13929P7374
9595C525922J5230m0802r9492j35676j69079k09517k32339k20983j97748j89529
9585B045987j77350j58850j49748j29617j11024j20377j13810r4485p7844p4744
9575H38138n5673n3979n0870n5944l9939l4949l1978k8869k2439k3764k1925k3505
9563C94304j4593j9151l4825k1723j5353j1478k5842k7130R90j0458j5915k945
9551A95881r838m603K683k575o044j2686p447r149q326O565p393q287K074m37
9537A30418j5443J70k920q789R212N645k3049j5291P369j5J0090K1417k1707j9511
$$ plain form
9523 77596 69079 62590 58871 53138 59010 65506 77177 80727 61861 49739 43236 50535 59028 62983
9509 62983 54099 45675 36456 33144 48937 55029 63803 58029 47425 45082 40199 40361 34942 23590
9495 23590 7105 14531 22109 30029 42068 47325 30459 29774 27297 20724 20455 28610 36162 39214
9481 39214 43963 54180 44778 35866 25219 18769 19417 22566 27138 27430 24160 37401 51405 51722
9467 51722 39080 34675 20691 9305 3608 14007 14112 17685 16671 31480 35932 26048 11627
9454 11627 14202 19020 19440 10083 18351 23898 25835 28433 31100 18256 2780 -2332 -12157 -11191 2770
9439 2770 8718 18107 30847 20265 21830 21052 3961 -9433 -3436 -5770 -10378 -6554 8282 12514
9425 12514 9697 -2673 -10802 -10774 5785 21845 12585 1010 5374 2482 4102 2062 -1192 6293
$$ packed form
9523G7596q517o489l719n733N872O496J1671L550j8866j2122o503P299Q493L955
9509F2983q884q424r219l312J5793O092Q774n774j0604k343m883J62n419j1352
9495B3590j6485P426P578P920J2039N257j6866o85k477o573k69Q155P552L052
9481C9214M749J0217r402q912j0647o450O48L149M572K92l270J3241J4004L17
9467E1722j2642m405j3984j1386n697J0399J05L573j014J4809M452r884j4421
9454A1627K575M818M20r357Q268N547J937K598K667j2844j5476n112r825R66J3961
9439B770N948R389J2740j0582J565p78j7091j3394N997k334m608L824J4836M232
9425A2514k817j2370q129K8J6559J6060r260j1575M364k892J620k040l254P485
$$ plain form
9411 6293 94 1474 8453 18192 19266 16058 10462 17515 16314 11519 9312 -4597 -9095 -7347 -2280
9396 -2280 1977 8810 6586 -1085 -93 3134 10578 9566 920 -4911 350 19125 24273 20751 10277
9381 10277 6970 8038 11486 9500 1114 -3258 -5864 223 4860 2797 -2856 -436 12657 16627
9367 16627 584 246 8329 11697 7259 516 -1400 6303 6699 -530 -11142 -17545 -15604 -6112 -7316
9352 -7316 -8873 4842 9066 -2967 -15529 -14 15521 31164 40940 38174 15328 3400 -1664
9339 -1664 4619 14730 16227 15810 16670 10983 7760 6602 -3306 -12520 -19379 -5857 -7608 -9499 12181
9324 12181 15896 7004 7181 3661 -7025 -12753 -4981 5625 9930 4377 5085 6502 6363 -5332 -6003
9309 -6003 -3034 752 421 -2882 -5731 -16635 -14660 -758 7357 1182 -7453 -1914 15997 22879
$$ packed form
9411F293o199J380O979R739J074l208n596P053j201m795k207j3909m498J748N067
9396b280M257O833k224p671R92L227P444j012q646n831N261J8775N148l522j0474
9381A0277l307J068L448j986q386m372k606O087M637k063n653K420J3093L970
9367A6627j6043l38Q083L368m438o743j916P703L96p229j0612o403J941R492j204
9352g316j557J3715M224j2033j2562J5515J5535J5643R776k766k2846j1928n064
9339a664O283J0111J497m17Q60n687l223j158r908r214o859J3522j751j891K1680
9324A2181L715q892J77l520j0686n728P772J0606M305n553P08J417j39j1695o71
9309f003K969L786l31l303k849j0904J975J3902Q115o175q635N539J7911O882
$$ plain form
9295 22879 22716 8586 -2001 -6132 -13738 -5469 3839 8636 15243 8261 1086 -2977 -2213 14923
9281 14923 19367 -2242 -6688 -1470 -4715 -6322 10056 11263 8777 5966 5716 14323 15965 8871
9267 8871 12406 13093 10243 8142 -692 -771 379 -370 -6445 -8715 1429 13732 19077 18819 7670
9252 7670 -4265 -10538 -161 2405 8540 18978 33591 25527 20042 8343 2384 7368 20870
9239 20870 9195 -465 5941 4123 11050 10803 5074 4128 3275 23 3403 4152 14602 3895 191
9224 191 -2013 -8083 -8141 -11292 -6002 -3464 -19920 -27042 -17887 -26329 -22956 -8147 -12147 -23074 -25426
9209 -25426 -10470 -14213 -7532 3019 6068 8403 22608 13689 5029 13645 18545 22723 13351 2074
9195 2074 -6794 -5325 6829 4930 10629 6188 3256 13393 15957 10517 12789 7096 4091 4753 9533
$$ packed form
9295B2879j63j4130j0587m131p606Q269R308M797O607o982p175m063P64J7136
9281A4923M444k1609m446N218l245j607J6378J207k486k811k50Q607J642p094
9267H871L535O87k850k101q834p9J150p49o075k270J0144J2303N345k58j1149
9252G670j1935o273J0377K566O135J0438J4613q064n485j1699n959M984J3502
9239B0870j1675r660O406j818O927k47n729r46q53l252L380P49J0450j0707l704
9224A91k204o070n8l151N290K538j6456p122R155q442L373J4809m000j0927k352
9209b5426J4956l743O681J0551L049K335J4205q919q660Q616M900M178r372j1277
9195B074q868J469J2154j899N699m441k932J0137K564n440K272n693l005O62M780
$$ plain form
9180 9533 2806 -14049 -27799 -25456 -15742 2418 1320 -21413 -14487 -8040 4314 9561 12465 12026
9166 12026 2329 5572 10164 4818 2421 -535 -12066 -10495 -4161 3791 1964 3170 11071 11252 5730
9151 5730 14235 17648 19636 27401 27066 11742 16630 11049 14233 19348 17377 15018 9161 7314 -5255
9136 -5255 -4985 -13363 -2807 -3603 -14644 -15352 2123 9149 20252 18854 7360 -10458 -23306 -13422
9122 -13422 -13547 -19256 -9474 9335 14200 10091 5399 4133 8133 18256 20773 19261 13970 11574
9108 11574 2652 4489 -225 -2601 -10276 -2549 9917 4843 -1156 -6904 1353 1305 -6963 -18541 -11019
9093 -11019 -4690 9050 4230 -2363 -580 2708 -1430 6439 8755 12529 -1603 -1607 11845 8640 961
9078 961 -4698 -3366 -7087 -21448 -25452 -11433 -7756 3402 378 -7062 -13970 -8883 -1643 -8779
$$ packed form
9180I533o727j6855j3750K343R714J8160j098k2733O926O447J2354N247K904m39
9166A2026r697L243M592n346k397k956j1531J571O334P952j827J206P901J81n522
9151E730Q505L413J988P765l35j5324M888n581L184N115j971k359n857j847j2569
9136e255K70q378J0556p96j1041p08J7475P026J1103j398j1494j7818j2848R884
9122a3422j25n709R782J8809M865m109m692j266M000J0123K517j512n291k396
9108A1574q922J837m714k376p675P727J2466n074n999n748Q257m8q268j1578P522
9093a1019O329J3740m820o593J783L288m138P869K316L774j4132mJ3452l205p679
9078I61n659J332l721j4361m004J4019L677J1158l024p440o908N087P240p136
$$ plain form
9064 -8779 -28425 -14697 2912 16555 26710 31623 26928 25895 41546 31805 17645 8849 5588
9051 5588 -4388 -8384 -12623 -9555 -4819 -4796 -6640 4275 9619 5734 2065 -1259 -1569 -3573 -19489
9036 -19489 -7672 2866 2655 -7466 -12481 -16637 -10488 -11416 -10435 -7533 -6823 -4023 -18650 -36035
9022 -36035 -39325 -24590 -17682 -12036 -11979 -18807 -17632 -11107 -311 -6600 -21327 -19350 -4371 -5194
9008 -5194 -18445 -17631 -8141 -2704 -2811 -4115 -11371 -10235 5398 -2082 -5287 -15189 -34213 -33182 -30018
8993 -30018 -32575 -7816 5949 -3677 -17673 -14868 5273 15205 14864 15784 10287 -187 3013 13642
8979 13642 12671 4688 4973 8935 4595 3232 -3959 -12778 -23411 -3715 -978 675 4025 -2143 11111
8964 11111 17215 -3452 -8626 -458 -3962 -11820 -7954 -9748 -18047 -18549 -21841 -19646 -6269 5222
$$ packed form
9064h779j9646J3728J7609J3643J0155M913m695j033J5651r741j4160q796l261
9051E588r976l996m239L068M736K3j844J0915N344l885l669l324l10k004j5916
9036a9489J1817J0538k11j0121n015m156O149r28R81K902P10K800j4627j7385
9022c6035l290J4735O908N646N7o828J175O525J0796o289j4727J977J4979q23
9008e194j3251Q14R490N437j07j304p256J136J5633p480l205r902j9024J031L164
8993c0018k557K4759J3765r626j3996K805K0141R932l41R20n497j0474L200J0629
8979A3642r71p983K85L962m340j363p191q819j0633J9696K737J653L350o168J3254
8964A1111O104k0667n174Q168l504p858L866j794q299n02l292K195J3377J1491
$$ plain form
8950 5222 -5119 -6100 3144 2112 4160 801 1402 -9677 -12110 -1643 2149 3060 7369 -1425 -6998
8935 -6998 -7990 -1394 93 -1326 -4298 -2931 -421 3832 12161 -310 -8129 -13381 -12160 -5309 -3077
8920 -3077 6853 20681 12638 4409 -13354 -15038 -13050 -10449 -8061 -18647 -15250 -226 14864 30414
8906 30414 20311 19605 22622 13708 14992 4852 -1989 2620 -525 4786 10183 14853 -1437 -2958
8892 -2958 13571 35272 45205 30292 -4010 -19110 -13543 -9984 -17666 -8385 -6464 -3921 -10599 -15816
8878 -15816 -8791 9078 7330 -899 -1637 -5575 1058 648 897 -12524 -10444 -7670 -4805 -1865 4168
8863 4168 16152 12319 8435 -2128 2056 9088 32063 57354 91768 134462 201289 254505 242730
8850 242730 182882 122801 94041 68011 49811 37691 24423 29868 28571 23873 5578 -913
$$ packed form
8950E222j0341r81R244j032K048l359O01j1079k433J0467L792R11M309q794n573
8935f998r92O596J487j419k972J367K510M253Q329j2471p819n252J221O851K232
8920c077R930J3828q043q229j7763j684J988K601K388j0586L397J5024J5090J5550
8906C0414j0103p06L017q914J284j0140o841M609l145N311N397M670j6290j521
8892b958J6529K1701R933j4913l4302j5100N567L559p682R281J921K543o678n217
8878a5816P025J7869j748q229p38l938O633m10K49j3421K080K774K865K940O033
8863D168J1984l833l884j0563M184P032K2975K5291L4414M2694O6827N3216j1775
8850B42730n9848o0081k8760k6030j8200j2120j3268N445j297m698j8295o491
$$ plain form
8838 -913 2418 10931 3659 -9509 -8810 -2820 8731 4370 3811 15180 22062 15293 17565 19196 11478
8823 11478 13258 21613 18172 21066 25607 35690 40957 42680 34013 43818 72054 99349 126445 169856
8809 169856 255755 373618 497762 504597 388619 270796 192895 131724 89059 57851 38999
8798 38999 37992 31381 14596 19520 36849 29381 14910 14748 15286 11141 6572 5712 -1512 2209 519
8783 519 15320 15199 11264 28640 21925 11029 4220 -2835 -15455 -10722 -6609 -7266 7154 19731
8769 19731 20809 27070 32109 57268 69542 119282 188835 241851 246286 191906 124616 65633 33382
8756 33382 25422 12622 18977 20190 19298 15635 10214 5096 -936 -8656 -12888 -17526 -4643 -9971
8742 -9971 -4252 -6371 -18988 -22515 2900 14587 19084 7760 6419 21607 19801 6736 3119
$$ packed form
8838i13L331Q513p272j3168O99N990J1551m361n59J1369O882o769K272J631p718
8823A1478J780Q355l441K894M541J0083N267J723q667R805K8236K7295K7096M3411
8809A69856Q5899J17863J24144O835j15978j17823p7901o1171m2665l1208j8852
8798C8999j007o611j6785M924J7329p468j4471j62N38m145m569q60p224L721j690
8783E19J4801j21l935J7376o715j0896o809p055j2620M733M113o57J4420J2577
8769A9731J078O261N039K5159J2274M9740O9553N3016M435n4380o7290n8983l2251
8756C3382p960j2800O355J213q92l663n421n118o032p720m232m638J2883n328
8742i971N719k119j2617l527K5415J1687M497j1324j341J5188j806j3065l617
$$ plain form
8729 3119 3666 4383 15064 9259 16673 12642 6544 8532 -5877 -19864 -31210 -18348 -21134 -21922
8715 -21922 -7509 3031 -8592 -19502 -13689 -15498 -18582 -10228 -11449 -16300 -10266 -1720 -5953 -2627
8701 -2627 4773 -1080 -2176 -8230 -22155 -21469 -31799 -27563 -33815 -21542 -9985 -2444 -1683 5008
8687 5008 8222 7202 12482 3632 -3487 -9105 -11576 -8132 -9594 -2781 2403 5214 1526 11285 5133
8672 5133 -11328 -27396 -25816 -14976 266 12891 -4900 -18089 -13438 430 16148 19082 12237
8659 12237 11006 -3842 -24877 -36635 -27766 -2279 -4626 -13097 -3150 -4238 16673 19357 1645
8646 1645 1078 -1446 5092 15887 18945 9691 5649 11650 15828 12259 10169 6947 1898 2865 10234
8631 10234 6285 -2180 -1475 18682 22596 26027 20567 6675 -6594 -9209 -1039 2547 13353 17191
$$ packed form
8729C119N47P17J0681n805P414m031o098J988j4409j3987j1346J2862k786p88
8715b1922J4413J0540j1623j0910N813j809l084Q354j221m851O034Q546m233L326
8701b627P400n853j096o054j3925O86j0330M236o252J2273J1557P541P61O691
8687E008L214j020N280q850p119n618k471L444j462O813N184K811l688R759o152
8672E133j6461j6068J580J0840J5242J2625j7791j3189M651J3868J5718K934o845
8659A2237j231j4848k1035j1758Q869K5487k347q471R947j088K0911K684j7712
8646A645n67k524O538J0795L058r254m042O001M178l569k090l222n049R67P369
8631A0234l949q465P05K0157L914L431n460j3892j3269k615Q170L586J0806L838
$$ plain form
8617 17191 13195 -121 -2037 -4528 -8956 -11451 -18739 -12368 7448 5714 2231 -5440 8198 17153
8603 17153 5720 8197 11605 9689 13849 8063 -6938 -15968 -14762 127 1633 6589 9783 12654
8589 12654 13448 12919 8619 -1237 -18023 -23517 -17067 -10295 -2949 -4294 -100 10495 13626 8429 10351
8574 10351 9249 8619 20995 14101 1861 -3801 -11981 -3308 7718 6472 3441 14670 7940 -5906
8560 -5906 1109 7193 12051 17840 11867 -1178 -13508 -9955 -1421 5127 4707 11443 9003 11433 24220
8545 24220 24277 13971 20945 38744 53212 65351 66801 47357 29257 12568 5202 10307 17294
8532 17294 9635 7874 5070 11265 16324 17230 13884 1460 -4885 -1817 -1933 -3647 -2366 2665 -498
8517 -498 -920 4499 12236 19743 16039 3744 -5671 9399 6155 248 -1316 -7468 -18060 -15698 -18194
$$ packed form
8617A7191l996j3316j916k491m428k495p288O371J9816j734l483p671J3638Q955
8603A7153j1433K477L408j916M160n786j5001r030J206J4889J506M956L194K871
8589A2654P94n29m300r856j6786n494O450O772P346j345M194J0595L131n197J922
8574A0351j102o30J2376o894j2240n662q180Q673J1026j246l031J1229o730j3846
8560e906P015O084M858N789n973j3045j2330L553Q534O548m20O736k440K430J2787
8545B4220N7j0306O974J7799J4468J2139J450j9444j8100j6689p366N105O987
8532A7294p659j761k804O195N059R06l346j2424o345L068j16j714J281N031l163
8517d98m22N419P737P507l704j2295r415J5070l244n907j564o152j0592K362k496
$$ plain form
8502 -18194 -3238 12477 37264 45487 52670 81855 118645 114075 87806 56036 31571 19040
8490 19040 18440 3758 27 8995 22280 30375 19009 1139 -8930 2346 4087 10168 13427
8477 13427 11469 9424 2530 -6795 -16677 -12572 -14009 -11703 -15282 -762 8748 8946 4077 7503 446
8462 446 -2864 -12692 -14131 -16044 -5875 -6592 -6866 8692 17059 31343 45582 53883 46010 29356
8448 29356 16953 12520 4901 -3991 -6305 -5419 -16819 -12272 -3747 -65 -4493 -3209 -3893 -5198 2276
8433 2276 -8277 -26347 -32470 -30660 -22024 -12948 -10765 -2121 11550 17383 9110 7479 14604 21251
8419 21251 23054 13317 15042 14113 -4022 -10354 -3605 8772 -874 6344 13826 2036 -2914 15062
8405 15062 19427 21127 14691 -3304 -18416 -19400 -14420 -8101 -4145 4798 -580 -4868 -3872 4832 2983
$$ packed form
8502a8194J4956J5715K4787Q223P183K9185L6790m570k6269l1770k4465j2531
8490A9040o00j4682l731Q968J3285Q095j1366j7870j0069J1276J741O081L259
8477A3427j958k045o894r325r882M105j437K306l579J4520R510J98m869L426p057
8462D46l310r828j439j913J0169p17k74J5558Q367J4284J4239Q301p873j6654
8448B9356j2403m433p619q892k314Q86j1400M547Q525L682m428J284o84j305P474
8433B276j0553j8070o123J810Q636R076K183Q644J3671N833q273j631P125O647
8419B1251J803r737J725r29j8135o332O749J2377r646P218P482j1790m950J7976
8405A5062M365J700o436j7995j5112r84M980O319L956Q943n378m288R96Q704j849
$$ plain form
8390 2983 -7875 -14057 1599 11202 10046 11057 6081 12306 17613 11632 -2768 -4444 11094 8021
8376 8021 7161 7962 750 3915 -4840 -22906 -17077 -7768 -9011 -25903 -33661 -33420 -33666 -21874 3234
8361 3234 24657 1294 464 16928 10356 8350 -4332 -12199 -14235 -568 -11812 -5640 1995 -11793
8347 -11793 -14935 -16472 -1518 6212 7312 3346 -2119 -1725 -9488 -11015 -7007 1954 6366 5023 10178
8332 10178 11592 22110 22957 23281 22203 11166 693 -5594 -3877 -11824 -19887 -7279 8046 9819
8318 9819 12270 9950 3382 -2169 -8770 -14189 -13576 -13189 -26506 -37812 -32708 -26673 -25955 -25269 -26209 -14635
8302 -14635 -6731 -4641 2735 7773 -9824 -22548 -18728 -3574 20943 20912 1100 -10832 -1471 2133
8288 2133 -1067 6322 1062 -4693 2240 3295 -7849 -22088 -26099 -20562 -14496 -7382 -4203 -1560
$$ packed form
8390B983j0858o182J5656R603j156J011m976O225N307n981j4400j676J5538l073
8376H021q60Q01p212L165q755j8066N829R309j243j6892p758K41k46J1792K5108
8361C234K1423k3363q30J6464o572k006j2682p867k036J3667j1244O172P635j3788
8347a1793l142j537J4954P730J100l966n465L94p763j527M008Q961M412j343N155
8332A0178J414J0518Q47L24j078j1037j0473o287J717p947q063J2608J5325J773
8318I819K451k320o568n551o601n419O13L87j3317j1306N104O035P18O86r40J1574
8302a4635P904K090P376N038j7597j2724L820J5154K4517l1j9812j1932R361L604
8288B133l200P389n260n755O933J055j1144j4239m011N537O066P114L179K643
$$ plain form
8274 -1560 2159 10992 8498 262 -3296 4707 13870 114 -13082 -10778 1026 995 -4742 -257 -4168
8259 -4168 -12474 -21652 -28834 -31334 -15560 -3585 6471 7099 3508 -6854 -12502 -17637 -19568 -11252
8245 -11252 -1060 -4367 -9991 -15695 -26988 -28618 -21715 -16719 -17307 -21938 -16469 -20825 -23695 -12790
8231 -12790 -891 -4781 3748 -6956 -9639 -7819 -10849 -26062 -29796 -22768 -15486 5269 6540 -3285
8217 -3285 -6435 -14044 -7721 624 3811 4140 14684 23915 31088 26317 16084 3748 -13692 -6824
8203 -6824 9566 18456 18079 14671 10465 7171 -1652 -10196 -9070 -13647 2502 6909 -2315 -11222 -11582
8188 -11582 6077 17766 10241 2185 8071 7869 -501 -11354 890 4713 13511 9757 5393 -171
8174 -171 -4505 4152 3627 1597 9642 12407 4758 76 1092 430 -7758 -14083 -10400 -11064 -1205 2658
$$ packed form
8274a560L719Q833k494q236l558Q003R163j3756j3196K304J1804l1n737M485l911
8259d168q306r178p182k500J5774J1975J0056O28l591j0362n648n135j931Q316
8245a1252J0192l307n624n704j1293j630O903M996n88m631N469m356k870J0905
8231a2790J1899l890Q529j0704k683J820l030j5213l734P028P282K0755J271r825
8217c285l150p609O323Q345L187L29J0544R231P173m771j0233j2336j7440O868
8203f824J6390Q890l77l408m206l294q823q544J126m577J6149M407r224q907l60
8188a1582J7659J1689p525q056N886k02q370j0853J2244L823Q798l754m364n564
8174a71m334Q657n25k030Q045K765p649m682J016o62q188o325L683o64R859L863
$$ plain form
8158 2658 3695 -11098 -21683 -15759 -6117 -9768 -2080 3764 5988 -849 -10304 -11634 -19890 -36194
8144 -36194 -31777 -15544 -3117 -12513 -15529 -1928 -853 -5465 -799 3974 -4401 -7873 -7875 3012
8130 3012 6504 3139 4518 -6299 -15313 -5716 4671 17194 17049 14199 6721 -7737 -6758 2853
8116 2853 -6924 3603 6168 3404 2737 421 11730 19050 20722 13855 14227 18496 17330 3252 -13132
8101 -13132 -11009 -14103 -5245 -2417 -2673 8648 15261 1596 -2931 -4043 -734 4613 5727 -104
8087 -104 -4283 -19938 -27029 -17600 -15485 -23035 -7149 1977 -1579 -6559 -9710 -7082 9015 3163
8073 3163 -4378 2169 18624 20477 9799 -1197 -329 -6954 -9033 -7637 -12059 -10370 -6647 -4925
8059 -4925 9236 13986 7115 5363 11336 -1859 -1124 1161 33 -5861 -18690 -9780 -7095 -1678
$$ packed form
8158B658J037j4793j0585N924R642l651P688N844K224o837r455j330q256j6304
8144c6194M417J6233J2427r396l016J3601J075m612M666M773q375l472kJ0887
8130C012L492l365J379j0817r014R597J0387J2523j45k850p478j4458R79R611
8116B853r777J0527K565k764o67k316J1309P320J672o867L72M269j166j4078j6384
8101a3132K123l094Q858K828k56J1321O613j3665m527j112L309N347J114n831
8087a04m179j5655p091R429K115p550J5886R126l556m980l151K628J6097n852
8073C163p541O547J6455J853j0678j0996Q68o625k079J396m422J689L723J722
8059d925J4161M750o871j752N973j3195P35K285j128n894j2829Q910K685N417
$$ plain form
8045 -1678 3037 6633 14595 16740 21657 25313 28239 17718 9616 218 -22571 -29554 -13026 1878
8031 1878 -1122 -5169 5473 -8329 -19425 -21044 -13394 -16314 -6270 -10886 -18233 -7414 -7408 3495
8017 3495 635 -7315 -13040 -7422 -6844 2519 12277 7572 -1428 -3448 3702 -1907 -6891 -16048 -21077
8002 -21077 -14829 -5764 -6993 3648 -2768 -2784 -2197 1128 -6668 -2380 -3523 -364 1430 -11374 -13981
7987 -13981 -6894 4712 27849 28509 8968 2675 -345 -3739 -5112 -5681 -2805 -7715 -20637 -16277
7973 -16277 -9682 -9292 -16460 -32753 -20397 -8046 726 7940 10906 -7883 -9745 9738 11521 8277
7959 8277 -3085 2101 8784 2041 -2147 -1873 -5599 2946 5931 -2645 4778 24149 26614 11432
7945 11432 15631 10482 8407 16161 32713 46657 32020 4171 -8545 -12553 -2384 11013 15470
$$ packed form
8045a678M715L596P962K145M917L656K926j0521q102r398k2789o983J6528J4904
8031A878l000m047J0642j3802j1096j619P650k920J0044m616p347J0819OJ0903
8017C495k860p950n725N618N78R363R758m705r000k020P150n609m984r157n029
8002b1077O248R065j229J0641o416j6N87L325p796M288j143L159J794j2804k607
7987a3981P087J1606K3137O60j9541o293l020l394j373n69K876m910j2922M360
7973a6277O595L90p168j6293J2356J2351Q772P214K966j8789j862J9483J783l244
7959H277j1362N186O683o743m188K74l726Q545K985q576P423J9371K465j5182
7945A1432M199n149k075P754J6552J3944j4637k7849j2716m008J0169J3397M457
$$ plain form
7932 15470 22387 21193 19167 19775 19460 20042 -370 -8533 -2508 -2881 -13570 -5652 -3163 -7666 -6143
7917 -6143 6816 5485 -14940 -14422 -20035 -13698 -18233 -19823 -8883 -5674 -18159 -8538 3097 7709
7903 7709 -4423 -13655 -2979 4938 7738 9182 3694 6474 20472 18522 18586 24258 20457 12863 5012
7888 5012 5551 -5593 -3244 -3416 5796 8835 -205 -2890 -1345 -3265 2461 10731 16558 14787 4131
7873 4131 -7854 -15721 -6337 6249 5088 1437 9343 16148 15063 7633 16756 18108 12803 2542
7859 2542 -3585 -2256 7949 9168 8210 4948 6315 -9513 -14870 -7276 -4393 3048 -5384 -21018
7845 -21018 -15348 -10868 -11232 -11201 -11972 -13226 -102 -89 6943 -285 -19470 -9473 3214 1861 -2930
7830 -2930 -5859 -7752 -16022 -5418 2488 -2338 -23061 -14339 6357 -3430 -18901 -13207 -11252 -17404
$$ packed form
7932A5470O917j194k026O08l15N82k0412q163O025l73j0689P918K489m503J523
7917f143J2959j331k0425N18n613O337m535j590J0940L209j2485R621J1635M612
7903G709j2132r232J0676P917K800J444n488K780J3998j950O4N672l801p594p851
7888E012N39j1144K349j72R212L039r040k685J545j920N726Q270N827j771j0656
7873D131j1985p867R384J2586j161l651P906O805j085p430R123J352n305j0261
7859B542o127J329J0205J219r58l262J367j5828n357P594K883P441q432j5634
7845b1018N670M480l64L1p71j254J3124J3P032p228j9185R997J2687j353m791
7830b930k929j893q270J0604P906m826k0723Q722K0696r787j5471N694J955o152
$$ plain form
7816 -17404 -19971 -13765 -13607 -3400 8670 11666 -10034 -26198 -30295 -23038 -15280 -12961 -14737 -7346
7802 -7346 -3226 -9036 -11683 -15285 -14307 -18656 -13262 -7603 -7457 -2699 -9657 -25526 -8554 -559 -20202
7787 -20202 -24492 -11907 1583 9356 -5908 -12174 -15631 -4045 2170 -5436 -9348 -3565 -15517
7774 -15517 -28396 -34709 -31154 -27465 -30826 -27539 -13788 6018 -58 -10351 -11454 -13726 -5926 -2374
7760 -2374 -6843 -9882 -961 2045 -902 877 -5223 -9912 -17065 -14586 -15584 -16996 -13785 -11060 -841
7745 -841 5595 -886 -528 -2315 -8493 -15672 -13636 -16310 -12739 -9646 -7088 4532 15167 15206 3425
7730 3425 -5578 -2539 -9382 -2067 4981 3887 19192 31328 26672 17842 10891 6384 -6298 -25948
7716 -25948 -20471 -21888 -21723 -17386 -6461 10033 8430 -2967 -8884 -14363 -7227 -11243 -8088 8634
$$ packed form
7816a7404k567O206J58J0207J2070K996k1700j6164m097P257P758K319j776P391
7802g346M120n810k647l602R78m349N394N659J46M758o958j5869J6972P995j9643
7787b0202m290J2585J3490P773j5264o266l457J1586O215p606l912N783j1952
7774a5517j2879o313L555L689l361L287J3751J9806o076j0293j103k272P800L552
7760b374m469l039Q921L006k947J779o100m689p153K479r98j412L211K725J0219
7745h41O436o481L58j787o178p179K036k674L571L093K558J1620J0635L9j1781
7730C425r003L039o843P315P048j094J5305J2136m656q830o951m507j2682j9650
7716b5948N477j417J65M337J0925J6494j603j1397n917n479P136m016L155J6722
$$ plain form
7702 8634 10787 9095 6653 3256 3232 542 4859 -4937 -7707 4009 10270 1144 -3371 -2176 -18860
7687 -18860 -12489 1053 3728 -8239 -11244 -7464 -17588 -20640 -15960 -6215 5187 17555 8944
7674 8944 8719 -5394 -8039 -7366 -19747 -16721 -4850 2391 6540 5452 848 6439 -3454 -4751 -4651
7659 -4651 2210 4412 2596 7482 14805 12968 16998 -3368 -7310 -3530 7730 -649 -9693 -19105
7645 -19105 -27192 -22921 -20882 -16444 -11056 -7111 -3374 -14567 -16484 -8245 -5153 1372 19493 19194
7631 19194 -1947 -15287 -12940 -5423 -5597 -10752 -15541 -17708 -18643 -5962 6865 2801 -8359 -13231
7617 -13231 -6987 -10862 -12823 -8555 -17816 -18165 -4577 -2845 -2480 859 -2225 -21307 -18680 -9284 -3780
7602 -3780 2877 -12180 -19567 -21055 -13857 -7819 -2268 -442 2164 -5111 -9744 9075 4317 -9182
$$ packed form
7702H634K153j692k442l397k4k690M317r796k770J1716O261r126m515J195j6684
7687a8860O371J3542K675j1967l005L780j0124l052M680R745J1402J2368q611
7674H944k25j4113k645O73j2381L026J1871P241M149j088m604N591r893j297J00
7659d651O861K202j816M886P323j837M030k0366l942L780J1260q379r044r412
7645a9105q087M271K039M438N388L945L737j1193j917Q239L092O525J8121k99
7631A9194k1141j3340K347P517j74n155m789k167r35J2681J2827m064j1160m872
7617a3231O244l875j961M268r261l49J3588J732L65L339l084j9082K627R396N504
7602c780O657j5057p387j488P198O038N551J826K606p275m633J8819m758j3499
$$ plain form
7588 -9182 -2386 -7738 -594 7089 14183 1275 -10401 -18863 -24611 -24644 -11126 -20062 -17462 -21866 -33685
7573 -33685 -26542 -10196 -9045 -12286 -6219 178 -14019 -17910 -2528 748 5856 -15078 -21746 -7868
7559 -7868 -9403 -4113 1570 6508 20720 9885 7190 6554 3638 585 -2411 -10658 -13011 -13469 -16240
7544 -16240 -17258 -1607 -332 -8769 -13666 -4305 -20272 -32762 -29998 -30859 -26567 -18097 -17686 -21266
7530 -21266 -20057 -14401 -13253 -7512 1803 11079 22344 16586 3875 -4419 8068 20911 25665 17245
7516 17245 -13491 -21082 -3300 15050 13120 2066 -451 -4462 -11799 -13149 -5149 -6667 -7392 1273
7502 1273 -782 -63 722 3432 10343 -5178 -21150 -30219 -18430 -8468 3615 9944 11764 3596
7488 3596 2507 16703 12893 4520 8101 13668 10897 2310 2088 4322 610 -2059 4828 17 -11915
$$ packed form
7588i182O796n352P144P683P094j2908j1676q462n748l3J3518q936K600m404j1819
7573c3685P143J6346J151l241O067O397j4197l891J5382L276N108k0934o668J3878
7559g868j535N290N683M938J4212j0835k695o36k916l053k996q247k353m58k771
7544a6240j018J5651J275q437m897R361j5967j2490K764q61M292Q470M11l580
7530b1266J209N656J148N741R315R276J1265n758j2711q294J2487J2843M754q420
7516A7245l0736p591J7782J8350j930j1054k517m011p337j350Q000j518p25Q665
7502A273k055P19P85K710O911j5521j5972r069J1789R962J2083O329J820q168
7488C596j089J4196l810q373L581N567k771q587k22K234l712k669O887m811j1932
$$ plain form
7473 -11915 -7478 -4153 -6871 -2160 -2333 -6447 -8732 -556 6315 5286 8781 986 6385 15088 3478
7458 3478 307 -1728 -6177 -8325 -2191 8836 10101 -6552 -9301 -2390 -17071 -26980 -23152 -15646
7444 -15646 -2624 3900 -7186 -21479 -32090 -22794 -15600 -10516 3550 12793 -5771 -1730 6589
7431 6589 8094 50 -824 -5813 -10379 1605 13912 7793 7067 14323 10872 -9423 -9662 -4840 -8
7416 -8 588 3934 -6052 -23913 -23152 -12264 -6353 5551 -5666 -8611 3037 11629 11116 7399 4370
7401 4370 6477 4588 -2101 8797 11799 2425 -755 3433 -708 -932 -16369 -24021 -34237 -33053
7387 -33053 -22398 -21033 -9864 2844 7678 11194 -2576 -5889 -14336 -15314 -11410 -7342 -10247 -4810
7373 -4810 1497 6577 1044 -10483 -1897 29 -9404 3987 12180 20600 16567 13242 4742 7390
$$ packed form
7473a1915M437L325k718M711j73m114k285Q176O871j029L495p795N399Q703j1610
7458C478l171k035m449k148O134J1027J265j6653k749O911j4681r909L828P506
7444a5646J3022O524j1086j4293j0611R296P194N084J4066R243j8564M041Q319
7431F589J505q044q74m989m566J1984J2307o119p26P256l451k0295k39M822M832
7416hN96L346r986j7861P61J0888N911J1904j1217k945J1648Q592n13l717l029
7401D370K107j889o689J0898L002r374l180M188m141k24j5437p652j0216J184
7387c3053J0655J365J1169J2708M834L516j3770l313q447r78L904M068k905N437
7373d810O307N080n533j1527Q586J926r433J3391Q193Q420m033l325q500K648
$$ plain form
7359 7390 13338 1170 -7937 -2596 3872 -9752 -9808 -6941 -1159 6878 -16772 -9452 2119 648
7345 648 -8073 -4314 -9973 -8598 -8454 -18808 -13058 -16297 -20692 -13480 -7426 -1609 -645 3017 -4740
7330 -4740 1704 16958 29533 31826 25213 13595 12097 2223 -10498 -2081 11377 -1997 -1105 3768
7316 3768 3749 9262 3104 535 10567 9650 13685 24682 32505 29086 11950 -506 -11273 -5273
7302 -5273 -3556 -14032 -4002 13907 8360 3891 2233 -9944 -14612 -11548 2560 3960 9768 18388
7288 18388 10814 -707 -13841 -20789 -21555 -19024 -25338 -28266 -21397 -29804 -19143 -22760 -25204 -9175
7274 -9175 -17054 -22403 -29499 -24454 -9979 -11335 -5031 2137 1269 -3505 -10150 -20316 -24498 -22406 -15722
7259 -15722 -13929 -8744 -5127 -13013 -6418 7716 3817 10855 19137 17811 13853 19746 25101 21220
$$ packed form
7359G390N948j2168r107N341O468j3624n6K867N782Q037k3650P320J1571j471
7345F48q721L759n659J375J44j0354N750l239m395P212O054N817R64L662p757
7330d740O444J5254J2575K293o613j1618j498r874j2721Q417J3458j3374Q92M873
7316C768j9N513o158k569J0032r17M035J0997P823l419j7136j2456j0767O000
7302e273J717j0476J0030J7909n547m469j658j2177m668L064J4108J400N808Q620
7288A8388p574j1521j3134o948p66K531o314k928O869q407J0661l617k444J6029
7274i175p879n349p096N045J4475j356O304P168q68m774o645j0166m182K092O684
7259a5722J793N185L617p886O595J4134l899P038Q282j326l958N893N355l881
$$ plain form
7245 21220 16316 4364 -24 -3926 -7269 -1053 3487 3413 2662 3017 4327 7109 10584 10026 1943 6501
7229 6501 18852 21501 27923 17211 10029 14628 23299 23773 4176 -11795 -3606 387 -9120 -15602
7215 -15602 -20732 -10473 542 8624 7392 322 -7875 -4394 -11771 -4405 -5632 -5938 -9808 -13579
7201 -13579 -24789 -4405 7270 14988 8451 3499 10078 5720 -18530 -26559 -24582 -21192 -19365 -12462
7187 -12462 -17761 -21123 -18053 -14073 -3545 3060 3035 5022 -777 639 318 15982 10950 9015 14510
7172 14510 16826 10982 7944 5817 3641 13788 32412 28506 9378 -4679 -4168 -9088 -8240 -8593
7158 -8593 -9439 -4277 2667 12028 11937 2821 1343 -1137 1528 15960 25253 18549 12536 11404 13844
7143 13844 16293 16131 14247 4593 4524 12238 25714 27114 10374 4183 -6080 -4964 -3661 -21296
$$ packed form
7245B1220m904j1952m388l902l343O216M540p4p51L55J310K782L475n58q083M558
7229F501J2351K649O422j0712p182M599Q671M74j9597j5971Q189L993r507o482
7215a5602n130J0259J1015Q082j232p070q197L481p377P366j227l06l870l771
7201a3579j1210K0384J1675P718o537m952O579m358k4250q029J977L390J827O903
7187a2462n299l362L070L980J0528O605k5J987n799J416l21J5664n032j935N495
7172A4510K316n844l038k127k176J0147J8624l906j9128j4057N11m920Q48l53
7158h593q46N162O944R361r1r116j478k480K665J4432R293o704o013j132K440
7143A3844K449j62j884r654o9P714J3476J400j6740o191j0263J116J303j7635
$$ plain form
7129 -21296 -24892 -15240 -7868 -5384 -17544 -9950 -2133 -3113 -1403 8930 16531 25387 23756 10652
7115 10652 7111 13290 9524 6291 3151 4580 7876 11620 13634 18689 25312 21055 1147 -3174
7101 -3174 -12840 -14611 -10445 -5061 2559 4906 15883 29031 24890 11969 -1259 -2529 -5197 -3866
7087 -3866 4588 -239 -322 -3345 -1849 -6567 -26747 -17095 3756 -926 -5795 -2489 -7895 -3869 5546
7072 5546 1055 -8565 6882 13506 14008 6862 12573 22730 22306 1452 -9796 -6752 -5379 2698
7058 2698 -5002 -14281 -23152 -23136 -4999 379 -6854 -16620 -7320 -2901 -12724 -26031 -31329 -37514 -36306
7043 -36306 -28569 -13688 -8288 -2967 -636 -661 -5872 -7336 9519 16496 9243 6455 -5629 -5237 6831
7028 6831 8597 9333 20475 5747 -5868 -2552 3556 4381 -629 8587 8413 3274 6655 859 -1856
$$ packed form
7129b1296l596R652P372K484j2160P594P817r80J710J0333P601Q856j631j3104
7115A0652l541O179l766l233l140J429L296L744K014N055O623m257j9908m321
7101c174r666j771M166N384P620K347J0977J3148m141j2921j3228j270k668J331
7087c866Q454m827q3l023J496m718k0180R652K0851m682m869L306n406M026R415
7072E546m491r620J5447O624N02p146N711J0157m24k0854j1248L044J373Q077
7058B698p700r279q871J6J8137N378p233r766R300M419r823j3307n298o185J208
7043c6306P737J4881N400N321K331k5n211j464J6855O977p253k788j2084L92J2068
7028F831J766P36J1142j4728j1615L316O108Q25n010R216j74n139L381n796k715
$$ plain form
7013 -1856 9666 3936 869 -9398 -10106 -2364 12370 24726 19548 -1333 -4877 -11442 -23629 -29717
6999 -29717 -19546 -4589 -10929 -8465 -5075 -14975 -20381 -6921 9087 3978 2340 1596 -947 -713
6985 -713 4417 -2150 -19730 -18713 -10448 -8276 -13798 -20243 -19306 -4469 4233 12126 18863 23235 13558
6970 13558 3285 -10113 -21616 -27829 -28964 -23506 -17032 -5541 7945 9082 7162 5803 5855 5956
6956 5956 -369 -9026 -9472 8698 25506 27858 21467 12886 5945 8164 4234 -8860 -9007 -4966 3579
6941 3579 3691 5382 527 12419 7536 3706 1399 -1328 462 -9619 -11264 -19823 -20027 -7949 -9694
6926 -9694 -29577 -36743 -39382 -28947 -29654 -12973 2844 16880 9905 -4260 -10752 -10288 -6032 -10641
6912 -10641 -8999 -8860 -8838 -5305 3050 -10733 -12509 -11467 -13609 -16389 -14447 -16315 -5960 3774 -7537
$$ packed form
7013a856J1522n730l067j0267p08P742J4734J2356n178k0881l544o565j2187o088
6999b9717J0171J4957o340K464L390r900n406J3460J6008n109j638p44k543K34
6985g13N130o567j7580J017Q265K172n522o445R37J4837Q702P893O737M372r677
6970A3558j0273j3398j1503o213j135N458O474J1491J3486J137j920j359N2J01
6956E956o325q657m46J8170J6808K352o391q581o941K219l930j3094j47M041Q545
6941C579J12J691m855J1892m883l830k307k727J790j0081j645q559k04J2078j745
6926i694j9883p166k639J0435p07J6681J5817J4036o975j4165o492M64M256m609
6912a0641J642J39K2L533Q355j3783j776J042k142k780J942j868J0355R734j1311
$$ plain form
6897 -7537 -10722 -8086 -2432 -21460 -32450 -3336 6965 1784 2296 3127 119 -11683 -12015 2321
6883 2321 2897 8637 6335 7350 6218 -12640 -13237 13810 18414 12071 8269 11024 19087 10711 6671
6868 6671 9860 1082 243 5232 -3823 -9095 -13851 -10081 5340 698 3162 10655 9366 -2683 -11754
6853 -11754 -21467 -6173 -3064 -5113 -2414 -12768 -17283 -5172 -2996 11914 10960 -1305 -10866 -21052
6839 -21052 -18068 -13781 -6751 8314 -6160 -17724 -15396 -2753 12703 14488 18831 4008 -8210
6826 -8210 -8629 -6075 7028 23540 18136 -1885 -19736 -15988 -8258 -4630 -8224 -9506 -20212 -13981
6812 -13981 -502 8517 15120 14428 786 -7021 -1304 -3295 -4777 -4765 -12195 -7467 2849 9000 7537
6797 7537 5636 -4833 -6808 1414 12980 12528 10962 -9072 -11577 2402 5592 -1921 650 -3480
$$ packed form
6897g537l185K636N654j9028j0990K9114J0301n181N12Q31l008j1802l32J4336
6883B321N76N740k302J015j132j8858n97K7047M604o343l802K755Q063q376m040
6868F671L189q778q39M989r055n272m756L770J5421m642K464P493j289j2049r071
6853a1754r713J5294L109k049K699j0354m515J2111K176J4910r54j2265r561j0186
6839b1052K984M287P030J5065j4474j1564K328J2643J5456J785M343j4823j2218
6826h210m19K554J3103J6512n404k0021j7851L748P730L628l594j282j0706O231
6812a3981J3479R019O603o92j3642p807N717j991j482J2p430M728J0316O151j463
6797G537j901j0469j975Q222J1566m52j566k0034k505J3979L190p513K571m130
$$ plain form
6783 -3480 5083 7864 15193 21473 14734 6442 -4346 -15042 -9996 -8096 -5322 -10034 -11483 -776
6769 -776 -7165 -4957 -16350 -9616 7190 9718 2041 578 2318 -4073 -16520 -14990 -14570 -10007 -3016
6754 -3016 -18736 -8681 6723 6246 1104 5494 -15772 -24309 -33927 -29870 -21378 -11556 -1490 869
6740 869 5730 2366 -8241 -24779 -25318 -15018 -23405 -31367 -30021 -25889 -5767 4678 8987 5304
6726 5304 -1665 2219 9126 16767 19938 13060 11442 -2660 -6625 3987 -3849 -12251 -5656 -2726
6712 -2726 -4442 6837 227 3041 16381 17005 20542 34471 52859 69836 80342 70039 43103
6699 43103 32088 23842 19549 19646 15658 15513 15951 7019 12874 14230 13786 12257 4956 1888 -5756 -11463
6683 -11463 -11438 -9996 -6894 1498 1752 -4863 3935 13432 20899 24885 18167 4842 -890 6876 6509
$$ packed form
6783c480Q563K781P329O280o739q292j0788j0696N046J900K774m712j449J0707
6769g76o389K208j1393O734J6806K528p677j463J740o391j2447J530M20M563O991
6754c016j5720J0055J5404m77n142M390k1266q537r618M057Q492R822J0066K359
6740H69M861l364j0607j6538n39J0300q387p962J346M132K0122J0445M309l683
6726E304o969L884O907P641L171o878j618j4102l965J0612p836q402O595K930
6712b726j716J1279o610K814J3340O24L537J3929J8388J6977J0506j0303k6936
6699D3103j1015q246m293R7l988j45M38q932N855J356m44j529p301l068p644n707
6683a1463K5J442L102Q392K54o615Q798R497P467L986o718j3325n732P766l67
$$ plain form
6668 6509 2341 -10016 -18133 -22203 -22992 -11367 -23715 -21950 -17967 -7709 -10237 4421 12858 9809
6654 9809 -6012 -16488 -11626 -4978 11047 17106 17966 14075 -3710 -16386 -17044 -13497 -22200 -30399
6640 -30399 -11381 3407 -9981 -7772 -3976 -5242 -21346 -21735 -28258 -17830 -4203 562 12929
6627 12929 10008 15055 13000 1724 -3210 5132 15901 6130 9792 -90 -4492 -3098 4182 -5414
6613 -5414 -18751 -4559 8678 8366 -3575 -6549 8826 16570 10118 2649 3959 19148 13706 3427
6599 3427 6614 9727 -2329 -13434 -10453 -17354 -17995 -12949 -7651 -276 1336 4273 3135 4618 8282
6584 8282 8343 5924 8294 6035 7480 10363 13724 5090 -3447 5952 15186 7249 10203 8344 5504
6569 5504 1472 -1287 -4978 -17110 -16175 -14136 -6937 -5644 -15965 -21938 -14681 -1669 6474 2129
$$ packed form
6668F509m168j2357q117m070p89J1625j2348J765L983J0258k528J4658Q437l049
6654I809j5821j0476M862O648J6025O059Q60l891j7785j2676o58L547q703q199
6640c0399J9018J4788j3388K209L796j266j6104l89o523J0428J3627M765J2367
6627A2929k921N047k055j1276m934Q342J0769r771L662r882m402J394P280r596
6613e414j3337J4192J3237l12j1941k974J5375P744o452p469J310J5189n442j0279
6599C427L187L113j2056j1105K981o901o41N046N298P375J612K937j138J483L664
6584H282O1k419K370k259J445K883L361q634q537R399R234p937K954j859k840
6569E504m032k759l691j2132R35K039P199J293j0321n973P257J3012Q143m345
$$ plain form
6555 2129 -1745 -9426 -221 15134 12724 20183 10843 12978 13894 8033 3704 8437 11127 8985 -2106
6540 -2106 -10161 -5189 -6695 -5153 2407 3792 -4220 -13255 -10358 3947 8249 11186 19098 24876 25554
6525 25554 22159 15167 11652 11682 6200 -3255 -5790 -2245 -4089 -2866 -3532 -15965 -17414 -24184 -27572
6510 -27572 -14840 -14341 -14622 -10662 -1840 -6403 -10802 -11390 489 13411 15909 3246 8210 8903 1432
6495 1432 10118 14542 20844 18635 7483 2695 -1089 -700 6177 3635 -3157 -452 -2221 -14061 -18692
6480 -18692 -1423 6907 11830 8694 -6067 -16139 -4500 -13182 -21452 -15675 -8425 -2454 -1123 -3263
6466 -3263 999 13480 4204 -9563 -14230 -9478 -18030 -6341 9962 9382 6314 12062 26795 21273
6452 21273 3083 -5222 -6771 -7199 8307 25077 16909 5541 -1644 -1905 -5504 14902 18556 -1363
$$ packed form
6555B129l874p681R205J5355k410P459r340K135R16n861m329M733K690k142j1091
6540b106q055M972j506J542P560J385q012r035K897J4305M302K937P912N778O78
6525B5554l395o992l515L0n482r455k535L545j844J223o66j2433j449o770l388
6510b7572J2732M99k81L960Q822m563m399n88J1879J2922K498j2663M964O93p471
6495A432Q686M424O302k209j1152m788l784L89O877k542o792K705j769j1840m631
6480a8692J7269Q330M923l136j4761j0072J1639q682q270N777P250N971J331k140
6466c263M262J2481r276j3767m667M752q552J1689J6303n80l068N748J4733n522
6452B1273j8190q305j549m28J5506J6770q168j1368p185k61l599K0406L654j9919
$$ plain form
6438 -1363 -10377 -21594 -20621 -21420 -29567 -14824 -8626 -12420 -4177 -4815 -4818 -3150 -7063 -9365 6993 8658
6422 8658 1740 11171 13254 11434 14261 7256 16510 14316 21036 24042 7549 -572 -17325 -21531
6408 -21531 -8251 8107 17135 20970 27174 27104 12818 -1488 -5861 -10871 -13761 -1947 -502 8394
6394 8394 10635 -735 -12484 -19245 -2751 1445 -4510 -8618 -1874 1458 748 -2922 -121 0 40
6379 40 -10133 -17937 -31767 -34530 -35018 -25774 -18926 -20335 -15767 -19596 -15601 -9917 -183 10812 10451
6364 10451 4274 -9236 -4339 1869 5792 1156 -9079 -10676 -15655 -203 10823 14333 10916 -10497
6350 -10497 -15602 -2921 319 5697 4543 -5871 -16833 -12660 -6790 -9495 -6660 -438 2685 4136
6336 4136 3698 -1557 693 -777 -3383 3677 10867 2462 -9410 -4891 3004 14676 1264 163
$$ packed form
6438a363r014j1217R73p99q147J4743O198l794Q243o38lJ668l913k302J6358J665
6422H658o918R431K083j820K827p005R254k194O720L006j6493q121j6753m206
6408b1531J3280J6358R028L835O204p0j4286j4306m373n010k890J1814J445Q896
6394H394K241j1370j1749o761J6494M196n955m108O744L332p10l670K801J21M0
6379D0j0173p804j3830k763m88R244O848j409M568l829L995N684R734J0995l61
6364A0451o177j3510M897O208L923m636j0235j597m979J5452J1026L510l417k1413
6350a0497n105J2681L240N378j154j0414j0962M173N870k705K835O222L123J451
6336D136m38n255K250j470k606P060P190q405j1872M519P895J1672j3412j101
$$ plain form
6322 163 5137 7562 -3518 3907 15254 15614 12632 212 -15814 -33618 -25126 -7272 -6692 -627
6308 -627 180 -3142 7424 2165 -4585 4351 14534 -65 -3160 -5496 -7197 2175 1854 8964 14231
6293 14231 12691 8774 -1937 -9335 6043 19227 7346 4375 -5106 -14022 -4400 7153 9788
6280 9788 6787 -1975 -10752 -12696 -14461 -17447 -19130 -15257 -6826 -10166 -12862 -8858 1775 820 -3764
6265 -3764 -12685 -6182 -2139 -1712 -4109 -2823 474 1013 -4789 -3361 1171 1666 -1886 2717 3027 14227
6249 14227 11316 20278 12820 1347 -13956 9741 21231 28564 25854 19699 16291 14062 14976 7946
6235 7946 -1488 -21130 -34742 -34285 -5528 9895 13194 -767 -15225 -13802 -18196 -16612 -5263
6222 -5263 1463 -17459 -21764 2169 13520 4838 -12787 -21084 -23209 -15670 -16885 -27273 -13739
$$ packed form
6322A63M974K425j1080P425J1347L60k982j2420j6026j7804Q492J7854N80O065
6308f27Q07l322J0566n259o750Q936J0183j4599l095k336j701R372l21P110N267
6293A4231j540l917j0711p398J5378J3184j1881k971r481q916R622J1553K635
6280I788l001q762q777j944j765k986j683L873Q431l340k696M004J0633r55m584
6265c764q921O503M043M27k397J286L297N39n802J428M532M95l552M603L10J1200
6249A4227k911Q962p458j1473j5303K3697J1490P333k710o155l408k229R14p030
6235G946r434j9642j3612M57K8757J5423L299j3961j4458J423m394J584J1349
6222e263O726j8922m305K3933J1351q682j7625q297k125P539j215j0388J3534
$$ plain form
6209 -13739 -5518 955 -2092 2382 7161 1485 -9456 -12300 -15465 -13272 -10646 446 -6342 32
6195 32 -110 -1120 -896 1965 10169 20356 31742 34002 29352 14924 4766 5111 -6269 31 4961
6180 4961 782 -5973 14132 10469 3494 3324 -5683 -15279 -8441 -5846 3750 -814 2398 10610 4058
6165 4058 -7798 -20428 -24161 -30480 -21769 -5758 -5174 -22580 -25696 464 18669 9511 -5217
6152 -5217 -9201 -9733 -10734 -14065 -8665 -9375 -3093 -13445 -22832 -23015 -20099 3322 11492 5546 -15
6137 -15 -2777 -4838 -10140 -15318 -21764 -24608 -17344 -1413 1388 -5726 1441 -2805 -13036 -11819 4721
6122 4721 7232 10834 -2809 -7375 5526 8338 8805 7412 9398 -8392 -15524 -16599 -28166 -20684
6108 -20684 -5068 81 3466 5286 5522 4113 2601 -960 5000 18474 6402 -8162 -13565 -27518
$$ packed form
6209a3739Q221O473l047M474M779n676j0941k844l165K193K626J1092o788O374
6195C2j42j010K24K861Q204J0187J1386K260m650j4428j0158L45j1380O300M930
6180D961m179o755K0105l663o975j70r007r596O838K595R596m564L212Q212o552
6165D058j1856j2630l733o319Q711J6011N84j7406l116K6160J8205r158j4728
6152e217l984n32j001l331N400p10O282j0352r387j83K916K3421Q170n946n561
6137a5k762k061n302n178o446k844P264J5931K801p114P167m246j0231J217J6540
6122D721K511L602j3643m566J2901K812M67j393J986j7790p132j075j1567P482
6108b0684J5616N149L385J820K36j409j512l561N960J3474j2072j4564n403j3953
$$ plain form
6094 -27518 -38411 -43931 -38808 -31677 -13911 -11437 -6277 -2455 -1411 -3700 -499 10129 11668 6231
6080 6231 -4457 -4145 -7197 -4254 -9925 -20210 -17998 -6510 11701 6962 18630 19059 18213 16130
6066 16130 8627 2699 -2330 -2195 2737 2104 230 2875 3783 -1604 4114 14830 8322 551 -7063
6051 -7063 -14620 -1726 11705 10417 10759 5405 -3736 -19822 -17546 -4929 2582 -2268 -121 8200
6037 8200 13781 9642 3276 -1234 -7698 -16061 -23267 -28830 -22445 -21578 -19522 -8938 -5904 -14853 -19073
6022 -19073 -20517 -7631 -5517 -7016 2687 7726 6769 17028 16201 9232 14089 10088 11641 10106 16374
6007 16374 21563 33095 19702 5733 -2525 -15888 -11642 -15682 -11938 -3720 -3094 5203 -9976 -8612
5993 -8612 -15917 -18195 2706 5566 -1260 -12510 -5049 -5096 -2378 1252 2565 4269 -1050 2866 -7429
$$ packed form
6094b7518j0893n520N123P131J7766K474N160L822J044k289L201J0628J539n437
6080F231j0688L12l052K943n671j0285K212J1488J8211m739J1668M29q46k083
6066A6130p503n928n029J35M932o33j874K645R08n387N718J0716o508p771p614
6051g063p557J2894J3431j288L42n354r141j6086K276J2617P511m850K147Q321
6037H200N581m139o366m510o464q363p206n563O385Q67K056J0584L034q949m220
6022a9073j444J2886K114j499R703N039r57J0259q27o969M857m001J553j535O268
6007A6374N189J1532j3393j3969q258j3363M246m040L744Q218O26Q297j5179J364
5993h612p305k278K0901K860o826j1250P461m7K718L630J313J704n319L916j0295
$$ plain form
5978 -7429 -11078 11199 22798 16891 -621 -6770 -581 -15800 -26793 -26372 -4231 2737 6730 4691
5964 4691 2167 4594 13507 2428 2952 10754 11089 12697 15648 3228 -12662 -11262 1372 13944
5950 13944 8153 -4798 -4468 3011 2342 -2169 -1747 -15301 -27532 -19192 -9001 -5815 5073 18485
5936 18485 27348 23256 16437 4184 12148 -2120 -14027 -7893 13652 13485 2964 -7622 -28084
5923 -28084 -30270 -33548 -42120 -48023 -36786 -29263 -22554 -20420 -30004 -21954 -13884 -9858 -15252 -11825
5909 -11825 -8127 -7895 -3426 8533 12614 22914 20554 8745 -154 -3610 -4255 -1185 -1144 3660 9933
5894 9933 7938 -10617 -10173 -8585 -7656 -9345 -9375 7018 5308 4128 2434 7848 203 -5667 -4519
5879 -4519 -1024 -520 -4313 -3050 -6212 -2282 -5881 10177 9876 10771 4474 -11779 -19142 4522 5868
$$ packed form
5978g429l649K2277J1599n907j7512o149O189j5219j0993M21K2141O968L993k039
5964D691k524K427Q913j1079N24P802L35J608K951j2420j5890J400J2634J2572
5950A3944n791j2951L30P479o69m511M22j3554j2231Q340J0191L186J0888J3412
5936A8485Q863m092o819j2253P964j4268j1907O134K1545j67j0521j0586k0462
5923b8084k186l278q572n903J1237P523O709K134r584Q050Q070M026n394L427
5909a1825L698K32M469J1959M081J0300k360j1809q899l456o45L070M1M804O273
5894I933j995j8555M44J588R29j689l0J6393j710j180j694N414p645n870J148
5879d519L495N04l793J263l162L930l599J6058l01Q95o297j6253p363K3664J346
$$ plain form
5864 5868 -4766 1845 -1965 -16091 -18990 -20842 -29885 -19360 -18266 -34407 -30068 -29800 -34591 -28288
5850 -28288 -9900 6163 5325 -9174 -17029 -21091 -15639 -24421 -20386 47 -4991 6555 12203 4462
5836 4462 -1402 -8397 -13192 -28770 -24849 -10265 -8173 571 10164 11593 9733 -4494 -15314 -27085
5822 -27085 -18344 -1148 -2936 -227 1921 11836 5731 -3597 -6625 -10200 -1751 13176 14247 16157
5808 16157 18242 13359 9086 7655 708 -5563 -3571 12363 7034 1109 -2944 -14837 -16850 -6844
5794 -6844 -5365 2881 -1164 -278 2021 -8427 -2362 -3719 -4568 -5942 -17462 -17661 -9249 -21570 -21090
5779 -21090 -12574 2258 14631 12974 8124 -1329 -2206 9976 -640 -20421 -15491 -10281 -4789 8403
5765 8403 6081 -14703 -16401 -4807 7701 4510 193 -6460 -20864 -9708 8954 1869 -6037
$$ packed form
5864E868j0634O611l810j4126k899j852r043J0525J094j6141M339K68m791O303
5850b8288J8388J6063q38j4499p855m062N452q782M035K0433n038J1546N648p741
5836D462n864o995m795j5578L921J4584K092Q744R593J429j860j4227j0820j1771
5822b7085Q741J7196j788K709K148R915o105r328l028l575Q449J4927J071J910
5808A6157K085m883m273j431o947o271J992J5934n329n925m053j1893k013J0006
5794f844J479Q246m045Q86K299j0448O065j357q49j374j1520j99Q412j2321M80
5779b1090Q516J4832J2373j657m850r453q77J2182j0616j9781M930N210N492J3192
5765H403k322k0784j698J1594J2508l191m317o653j4404J1156J8662p085p906
$$ plain form
5752 -6037 -22754 -29391 -19274 -19487 -16542 -25968 -24574 -20027 -17783 -13790 -2080 -4641 -17372 -18052
5738 -18052 -15567 -17069 -10324 -7297 -1483 3287 18185 18477 27754 13333 10203 14774 17264 15044
5724 15044 11915 6984 12208 8375 6293 9433 20089 21628 9955 -812 -3352 7009 1537 -4813
5710 -4813 -9350 -4049 7689 12321 1080 -12833 -1309 7453 13189 13855 8750 4226 6140 4154
5696 4154 1690 4824 14569 13620 22033 25764 31019 25508 21894 30385 21342 -4045 -11821 -14578 -6363
5681 -6363 -7536 -8901 -5632 -14179 -13578 13276 10209 6987 -5699 -14946 -17883 -1848 5343 7076
5667 7076 7994 8953 -3555 -10471 -3056 -10249 -8918 -10518 -10642 808 17731 10177 5729 8263 3403
5652 3403 -81 -5472 -5094 2823 2394 5095 -6516 -5071 3131 7903 -2052 -7147 -14081 -7031 -3554
$$ packed form
5752f037j6717o637J0117k13K945r426J394M547K244L993J1710k561j2731o80
5738a8052K485j502O745L027N814M770J4898K92R277j4421l130M571K490k220
5724A5044l129m931N224l833k082L140J0656J539j1673j0767k540J0361n472o350
5710d813m537N301J1738M632j1241j3913J1524Q762N736O66n105m524J914j986
5696D154k464L134R745r49Q413L731N255n511l614Q491r043k5387p776k757Q215
5681f363j173j365L269q547O01K6854l067l222j2686r247k937J6035P191J733
5667G076R18R59j2508o916P415p193J331j600j24J1450J6923p554m448K534m860
5652C403l484n391L78P917m29K701j1611J445Q202M772r955n095o934P050L477
$$ plain form
5637 -3554 -6785 -397 11282 5197 1244 -7408 -13448 -6280 1738 1138 -5310 -8331 -7567 -1369 9090
5622 9090 14975 11297 10708 22213 16566 13370 1672 1039 11368 16914 12351 9091 16669 18755 16907
5607 16907 2957 8581 5755 5230 17032 8454 6528 5422 -2319 16302 36177 25723 21125 16082
5593 16082 8735 3142 329 8106 4855 -2784 -1878 -7892 -2368 2740 -2371 -6605 -12770 -10449 -12656
5578 -12656 -15195 -11653 -14910 -30960 -25372 -4920 -9346 -8592 -6112 -3415 -15579 -11974 -11543 -18746
5564 -18746 -9647 -2081 -864 -9740 2848 -3365 -5978 -787 2145 -141 8347 9118 1416 1264 -7949
5549 -7949 -26858 -26166 -14077 44 5005 -2595 -8072 -15054 -13588 -753 -15556 -27463 -47292
5536 -47292 -41456 -14647 -5494 -137 10415 2155 -7628 -4366 -4057 -18091 -10924 -1786 -82 22
$$ packed form
5637c554l231O388J1679o085l953q652o040P168Q018o00o448l021P64O198J0459
5622I090N885l678n89J1505n647l196j1698o33J0329N546m563l260P578K086j848
5607A6907j3950N624k826n25J1802q578j926j106p741J8621J9875j0454m598n043
5593A6082p347n593k813P777l251p639R06o014N524N108n111m234o165K321k207
5578a2656k539L542l257j6050N588K0452m426P54K480K697j2164L605M31p203
5564a8746R099P566J217q876J2588o213k613N191K932k286Q488P71p702j52r213
5549g949j8909O92J2089J4121M961p600n477o982J466J2835j4803j1907j9829
5536d7292N836K6809R153N357J0552q260r783L262L09j4034P167R138J704J04
$$ plain form
5522 22 -3015 -10882 -6153 -2801 7798 16275 17303 4279 583 9027 9278 6664 5920 -4238 -18850
5507 -18850 -16397 -12353 -22773 -26270 -12572 -15726 -21428 -19588 -23591 -20971 -18474 -12923 2866 -10103
5493 -10103 -1003 8695 8862 871 2926 -13234 -28203 -13580 2682 5414 12260 6708 -11262 -19696
5479 -19696 -20576 -21160 -28684 -19560 -19831 -2379 6761 -3702 -1550 -3795 -12327 -5086 -277 6640 6735
5464 6735 7285 2317 3780 6435 3698 -4071 -20860 -17096 -9361 -10011 -14140 -18567 -20309 -20875 -15836
5449 -15836 -13306 -14266 -11011 -15556 -10564 -7656 -11744 -5314 -1749 -4772 -2211 7430 18955 3308
5435 3308 -1937 2198 657 1536 3301 -1138 -3470 -5314 -1843 -4331 -9033 -12286 -13428 -3017 3029
5420 3029 -5526 -9776 -11815 -204 -190 2702 7332 3515 -107 -7843 -13264 -621 -1699 406 11553
$$ packed form
5522B2l037p867M729L352J0599Q477J028j3024l696Q444K51k614p44j0158j4612
5507a8850K453M044j0420l497J3698l154n702J840m003K620K497N551J5789j2969
5493a0103R100R698J67p991K055j6160j4969J4623J6262K732O846n552j7970q434
5479a9696q80n84p524R124k71J7452R140j0463K152k245q532P241M809O917R5
5464F735N50m968J463K655k737p769j6789L764P735o50m129m427j742n66N039
5449a5836K530r60L255m545M992K908m088O430L565l023K561R641J1525j5647
5435C308n245M135j541Q79J765m439k332j844L471k488m702l253j142J0411O046
5420C029q555m250k039J1611J4K892M630l817l622p736n421J2643j078K105J1147
$$ plain form
5405 11553 4785 -706 2055 9756 6485 7864 5416 -6003 -11263 -8485 -12218 -13048 -9649 -4144 1970
5390 1970 -7385 -11251 -12699 -21883 -30959 -22398 -10924 -1691 -10493 -16487 -19154 -12456 -11631 -11561 -3091
5375 -3091 -4775 -23336 -14567 5170 -2186 -18070 -12066 10768 16996 7977 2969 7546 3844 -99
5361 -99 -6466 1610 -2397 -9810 -6768 -1239 -4580 -9038 -9554 -18202 -28582 -10213 -1165 4488 1856
5346 1856 15525 12888 -95 -13057 -12410 -7008 6602 20599 24490 19593 22771 22731 6584 4655
5332 4655 8795 -1626 -10160 2872 5208 -1964 -6081 -5774 -16876 -23520 -14272 -10588 -19671 -15833
5318 -15833 -12125 -14345 -4347 -4640 5411 9740 7879 1933 8276 14854 12117 923 -15083 -20968
5304 -20968 -488 5544 -4796 -16881 -11978 -10947 -16236 -21240 -14493 -19188 -15136 -13428 -15976 -3421
$$ packed form
5405A1553o768n491K761P701l271J379k448j1419n260K778l733q30L399N505O114
5390A970r355l866j448r184r076Q561J1474R233q802n994k667O698Q25P0Q470
5375c091j684j8561Q769J9737p356j5884O004K2834O228r019n008M577l702l943
5361i9o367Q076m007p413L042N529l341m458n16q648j0380J8369R048N653k632
5346A856J3669k637j2983j2962O47N402J3610J3997L891m897L178m0j6147j929
5332D655M140j0421q534J3032K336p172m117L07j1102o644R248L684r083L838
5318a5833L708k220R998k93J0051M329j861n946O343O578k737j1194j6006n885
5304b0968K0480O032j0340j2085M903J031n289n004O747m695M052J708k548J2555
$$ plain form
5290 -3421 -4715 -11897 -12983 -15466 -5652 4568 5648 1810 -2639 -9289 -5630 -6910 -4071 -6621 -26697
5275 -26697 -24047 -16006 -25896 -28032 -5487 13521 12067 2521 -12314 -19721 -25128 -22665 -7785 -19
5261 -19 -6853 -22230 -25206 -5766 6491 -252 -2271 -618 4425 2585 -1148 2603 -1454 -2197 -6539
5246 -6539 -14730 -27737 -34189 -29365 -21407 -10778 -1819 -323 796 2500 -9655 -17937 -26633 -13202
5232 -13202 1876 -1465 -12831 -6607 113 503 6260 4683 4458 4557 -5893 -8855 6631 9987 -11517
5217 -11517 -10179 -10968 -5535 -2383 -7839 -6143 -11103 -11854 -15073 -14550 -22563 -8161 3580 2721 -369
5202 -369 -3664 -7790 -19450 -13582 -838 -5332 -17838 -21079 -1288 14842 14760 2494 -14121 -13993
5188 -13993 -3793 11747 15103 9686 8345 6030 -3701 -7238 -6550 -10283 -1612 6099 4430 5384 8125
$$ packed form
5290c421j294p182j086k483R814J0220J080l838m449o650L659j280K839k550k0076
5275b6697K650Q041r890k136K2545J9008j454r546j4835p407n407K463J4880P766
5261a9o834j5377k976J9440J2257o743k019J653N043j840l733L751m057p43m342
5246f539q191j3007o452M824P958J0629Q959J496J119J704j2155q282q696J3431
5232a3202J5078l341j1366O224O720L90N757j577k25R9j0450k962J5486L356k1504
5217a1517J338p89N433L152n456J696m960p51l219N23q013J4402J1741q59l090
5202c69l295m126j1660N868J2744m494j2506l241J9791J6130q2j2266j6615J28
5188a3993J0200J5540L356n417j341k315r731l537O88l733Q671P711j669R54K741
$$ plain form
5173 8125 -7498 -22518 -18877 3237 15154 16635 24436 23616 23206 19601 2521 4886 -2542 -3352
5159 -3352 8859 10153 6329 -869 -8813 -9811 -20437 -37765 -46977 -31471 -24148 -23922 -6176 11237
5145 11237 13921 1579 -8864 -12950 -19191 -12014 -3907 7296 12348 9359 9492 12559 14938 11875
5131 11875 8647 11394 14472 1527 2588 -6513 -9311 -16281 -19181 -5100 -6117 -17627 -20979 -13859
5117 -13859 -18469 -17982 -19545 -16591 -9052 -12004 -11016 -4538 -8077 -15145 -12170 2798 148 2406 8608
5102 8608 6645 1501 -8862 -22870 -25517 -14244 -21850 -17793 -14470 -21385 -12617 -3294 -591 -14693
5088 -14693 -13525 4508 1416 -4427 -5016 1432 11620 11204 -6690 -25774 -41038 -36788 -21493 -18582
5074 -18582 -23993 -19841 -5816 -15350 -13391 1895 8004 5539 -2945 2930 18208 18627 5068 196
$$ packed form
5173H125j5623j5020L641K2114J1917J481P801q20m10l605j7080K365p428q10
5159c352J2211J294l824p198p944r98j0626j7328r212J5506P323K26J7746J7413
5145A1237K684j2342j0443m086o241P177Q107J1203N052k989J33L067K379l063
5131A1875l228K747L078j2945J061r101k798o970k900J4081j017j1510l352P120
5117a3859m610M87j563K954P539k952R88O478l539p068K975J4968k650K258O202
5102H608j963n144j0363j4008k647J1273p606M057L323o915Q768R323K703j4102
5088a4693J168J8033l092n843n89O448J0188m16j7894j9084j5264M250J5295K911
5074a8582n411M152J4025r534J959J5286O109k465q484N875J5278M19j3559m872
$$ plain form
5060 196 1530 -300 2148 -2727 -5737 10145 14322 10086 -930 211 -226 8276 -4491 -8036 -8547
5045 -8547 -15751 -5307 5931 -1979 7508 -774 -11931 -17371 -23714 -26700 -26741 -23273 -27471 1676
5031 1676 11302 5942 -12957 -19384 -7647 -7910 -5624 -11899 -29243 -41671 -28615 -14370 -14286 -13420
5017 -13420 -1299 22438 13674 5991 10156 6514 1474 -5960 2356 9923 13266 10244 6634 1935
5003 1935 -5975 -2127 -6263 -8997 -12815 -10701 -6152 499 4465 24111 27949 9913 3117 -1407
4989 -1407 6325 15483 3541 8878 16317 5257 -3332 -7783 2467 3290 20158 27830 5475 -15213
4975 -15213 -15112 -3716 16817 11534 -4712 -17478 -4104 5968 -841 -94 16100 12409 653
4962 653 -8067 -2311 -8244 -8990 -1103 285 -3645 -6326 6312 14343 -3632 -176 4313 16632 20429
$$ packed form
5060A96J334j830K448m875l010J5882M177m236j1016J141m37Q502j2767l545n11
5045h547p204J0444J1238p910R487q282j1157n440o343k986m1L468m198K9147
5031A676R626n360j8899o427J1737k63K286o275j7344j2428J3056J4245Q4Q66
5017a3420J2121K3737q764p683M165l642n040p434Q316P567L343l022l610m699
5003A935p910L848m136k734l818K114M549O651L966J9646L838j8036o796m524
4989a407P732R158j1942N337P439j1060q589m451J0250Q23J6868P672k2355k0688
4975a5213J01J1396K0533n283j6246j2766J3374J0072o809P47J6194l691j1756
4962F53q720N756n933p46P887J388l930k681J2638Q031j7975L456M489J2319L797
$$ plain form
4947 20429 12605 8688 2039 5869 9025 8590 6851 11671 6516 -4095 13114 16888 16408 5730
4933 5730 -13451 -20207 -28079 -22191 -753 8142 9432 6349 -7931 -20710 -25960 -18414 -22511 -21863
4919 -21863 -6636 5387 13532 9407 -1023 867 3504 11013 31846 33305 29095 12490 -12898
4906 -12898 -22388 -6073 11701 11980 5597 6536 9210 6201 10905 23287 7241 10656 9908 387
4892 387 3943 12111 17678 23888 18414 -5268 -14968 -14422 1596 18032 21632 21063 14523 9300 9331
4877 9331 9182 17708 7976 2746 4179 9037 2943 2569 7406 7180 10118 6888 4927 -8155 -8380 3330
4861 3330 3038 15107 27550 23136 20097 13758 2552 -11041 -13771 -9467 -10405 10186 27639 23524
4847 23524 20354 20353 5303 11502 10120 4634 8623 18861 22447 18348 28101 29320 23629 9170 3494
$$ packed form
4947B0429p824l917o649L830L156m35j739M820n155j0611J7209L774m80j0678
4933E730j9181o756p872N888K1438Q895J290l083j4280j2779n250P546m097O48
4919b1863J5227J2023Q145m125j0430J890K637P509K0833J459m210j6605k5388
4906a2898r490J6315J7774K79o383R39K674l009M704J2382j6046L415p48r521
4892C87L556Q168N567O210n474k3682r700N46J6018J6436L600n69o540n223L1
4877I331j49Q526r732n230J433M858o094l74M837k26K938l230j961j3082k25J1710
4861C330k92J2069J2443m414l039o339j1206j3593k730M304r38K0591J7453m115
4847B3524l170jj5050O199j382n486L989J0238L586m099R753J219n691j4459n676
$$ plain form
4832 3494 9894 8254 1761 -11021 -6806 5089 6905 7886 8890 12412 17637 20727 11705 16986 37512
4817 37512 42794 30151 17431 7607 -3904 -4794 -5869 3278 -71 -377 11874 15281 20458 12992
4803 12992 6758 3810 12696 8427 14598 25764 20710 4878 -10008 -8016 -4015 8351 25524
4790 25524 18586 -7723 -9412 -3262 386 3151 -14352 -13638 -5994 -4554 1658 -3490 138 -4134
4776 -4134 -13441 -4338 9150 2626 -3568 1440 -1642 9881 17788 28117 26017 10119 13767 23460
4762 23460 20097 12224 9874 2610 14615 30184 29212 26088 26028 17151 14127 16040 12029 15216 5189
4747 5189 3663 10025 5825 -11274 935 16060 7495 -4758 -5327 3390 9793 6436 1329 -738
4733 -738 -10572 -16771 -21331 -20393 -12403 -14194 -27233 -14188 -13627 -16830 -7658 1806 -4217 -12393 -4634
$$ packed form
4832C494O400j640o493j2782M215J1895J816R81J004L522N225L090r022N281K0526
4817C7512N282j2643j2720r824j1511q90j075R147l349l06J2251L407N177p466
4803A2992o234k948Q886m269O171J1166n054j5832j4886J992M001J2366J7173
4790B5524o938k6309j689O150L648K765j7503P14P644J440O212n148L628m272
4776d134r307R103J3488o524o194N008l082J1523P907J0329k100j5898L648R693
4762B3460l363p873k350p264J2005J5569r72l124o0q877l024J913m011L187j0027
4747E189j526O362m200j7099J2209J5125q565j2253n69Q717O403l357n107k067
4733g38r834o199m560R38P990j791j3039J3045N61l203R172R464o023q176P759
$$ plain form
4718 -4634 5519 6609 -7593 -6726 -4192 4611 8089 -4925 -12206 -16101 -10225 -16615 -19029 -9586
4704 -9586 -5268 2311 11324 -3523 -2145 -2971 -10210 2010 -5443 -11097 -17217 -10957 2478 -11710
4690 -11710 -26402 -15716 -5281 -7999 -9420 -13112 764 10642 -103 -1651 8090 -5803 -11049
4677 -11049 -10320 -14024 -4015 -6423 1867 12040 -426 -9610 -8335 -14847 -16028 -5798 8439 8132
4663 8132 6366 5541 -12152 -17705 -55 18263 18316 8815 6080 5542 -1398 -14646 -5044 3648 -7
4648 -7 -3904 -6820 2838 3155 -2131 -2331 -6782 2949 17138 15155 5651 -9303 -12080 -5564 -4391 -3799
4632 -3799 6113 10225 8586 9052 -2005 -14825 -17597 -12099 -20920 -17441 -11710 8689 10544 6641
4618 6641 5553 -4645 -994 12933 8071 -9726 -12981 -5802 -1034 -3398 -14892 -12161 -5217 -5314
$$ packed form
4718d634J0153J090j4202Q67K534Q803L478j3014p281l895N876o390k414R443
4704i586M318P579R013j4847J378q26p239J2220p453n654o120O260J3435j4188
4690a1710j4692J0686J0435k718j421l692J3876R878j0745j548R741j3893n246
4677a1049P29l704J0009k408Q290J0173j2466r184J275o512j181J0230J4237l07
4663H132j766q25j7693n553J7650J8318N3r501k735n38o940j3248R602Q692l655
4648gl897k916R658L17n286k00m451R731J4189j983r504j4954k777O516J173N92
4632c799R912M112j639M66j1057j2820k772N498q821L479N731K0399J855l903
4618F641j088j0198L651J3927m862j7797l255P179M768k364j1494K731O944r7
$$ plain form
4604 -5314 121 4547 6 -11647 -5720 -6659 -4699 -24302 -36163 -27125 -18964 -16277 -22633 -22764 -21357
4589 -21357 -13247 2742 4318 10488 13473 4441 11057 10101 5442 5798 -3927 395 -5154 -3485 19366
4574 19366 25935 17228 9359 1375 10703 7551 340 -1258 5750 6188 -6903 -12976 -21473 -23973 -13473
4559 -13473 6396 22191 18846 6787 7734 275 3997 2332 -6634 702 -373 -5273 -4392 -7903
4545 -7903 -3927 -6512 -17300 -8360 -8890 -9216 -10754 -8020 -11849 -12527 -1590 7570 22484 23333 15256
4530 15256 12238 -5240 -9322 -34 6409 3543 512 12877 16946 487 -7155 -8371 9046 11958
4516 11958 -7919 -15802 -6648 2558 -517 -15563 -10292 -14585 -13346 -1967 7781 -4613 -16310
4503 -16310 -21284 -30007 -27843 -32967 -43578 -34477 -11628 -5879 2644 13057 22149 13318 5932 -2076
$$ packed form
4604e314N435M426m541j1653N927r39J960j9603j1861R038Q161K687o356j31J407
4589b1357Q110J5989J576O170K985r032O616r56m659L56r725M322n549J669K2851
4574A9366O569q707p869p984R328l152p211j598P008M38j3091o073q497k500J0500
4559a3473J9869J5795l345j2059R47p459L722j665q966P336j075m900Q81l511
4545g903L976k585j0788Q940n30l26j538K734l829o78J0937R160J4914Q49q077
4530A5256l018j7478m082R288O443k866l031J2365M069j6459p642j216J7417K912
4516A1958j9877p883R154R206l075j5046N271m293J239J1379R748j2394j1697
4503a6310m974q723K164n124j0611R101K2849N749Q523J0413R092q831p386q008
$$ plain form
4489 -2076 -3905 8256 14445 5400 9734 26052 24046 20256 21761 11152 23723 21349 12630 13955
4475 13955 16149 13421 16521 18877 15532 8063 4449 -193 -5339 -18557 -19910 -9573 1392 17767
4461 17767 6957 -4038 -5241 -1024 8096 4822 6760 11333 7311 15498 6628 -256 -299 -7863 -7648
4446 -7648 -1472 9416 12745 10643 4162 -8732 -11378 -5720 -1039 5129 -6398 -4923 -5015 -18759
4432 -18759 -17124 -17636 -5100 14217 31192 23218 12670 10363 7248 2876 -1631 -3441 -9549 -13387
$$ packed form
4489b076j829J2161O189r045M334J6318k006l790J505j0609J2571k374q719J325
4475A3955K194k728L100K356l345p469l614m642n146j3218j353J0337J0965J6375
4461A7767j0810j0995j203M217R120l274J938M573m022Q187q870o884m3p564K15
4446g648O176J0888L329k102o481j2894k646N658M681O168j1527J475r2j3744
4432a8759J635n12J2536J9317J6975p974j0548k307l115m372m507j810o108l838
$$ [...]
##END NTUPLES=NMR SPECTRUM
##END=
