##TITLE=Analysis number 323440
Compound Code cc 54863
Book Reference 511/10/2
Project Code adrs
Chemist Name stevem
##JCAMPDX= 6.0         $$ Bruker NMR JCAMP-DX V2.0
##DATA TYPE= NMR SPECTRUM
##DATA CLASS= NTUPLES
##ORIGIN= Bruker BioSpin GmbH
##OWNER= nmr
$$ XWIN-NMR		Version 3.5
$$ Thu Nov 16 12:04:40 2006 GMT Standard Time (UT+0h)  MAYBRIDGE\nmr@NMR_250MHZ
##.OBSERVE FREQUENCY= 250.131544655141
##.OBSERVE NUCLEUS= ^1H
##.ACQUISITION MODE= SIMULTANEOUS (DQD)
##.ACQUISITION SCHEME= undefined
##.AVERAGES= 16
##.DIGITISER RES= 18
##SPECTROMETER/DATA SYSTEM= dpx250
##.PULSE SEQUENCE= zg30
##.SOLVENT NAME= DMSO
##.SHIFT REFERENCE= (INTERNAL, DMSO, 0, 16.522)
##AUDIT TRAIL= $$ (NUMBER, WHEN, WHO, WHERE, WHAT)
$$ ##TITLE= Audit trail, XWIN-NMR		Version 3.5
$$ ##JCAMPDX= 5.01
$$ ##ORIGIN= Bruker BioSpin GmbH
$$ ##OWNER= nmr
$$ C:\u/data/dgb/nmr/ADRS/470/pdata/1/auditp.txt
$$ ##AUDIT TRAIL=  $$ (NUMBER, WHEN, WHO, WHERE, WHAT)
(   1,<2006-11-16 12:04:13.19 +000>,<MAYBRIDGE\nmr>,<NMR_250MHZ>,
      <created by zg, POWCHK disabled, PULCHK disabled
       configuration hash MD5:
       49 4B E0 1D 92 C2 6B 37 9F E6 65 BC 52 41 86 1D
       data hash MD5: 64K
       09 FE 63 E7 66 E2 23 A4 AE 90 0A 0B 97 0F C5 56>)
(   2,<2006-11-16 12:04:30.45 +000>,<MAYBRIDGE\nmr>,<NMR_250MHZ>,
      <Start of raw data processing
       ef LB = 0.3 FT_mod = 6 PKNL = 1 SI = 32K 
       data hash MD5: 32K
       0C D2 D0 0F 07 B6 B5 B6 03 3D 21 9C CC FF A2 95>)
(   3,<2006-11-16 12:04:32.17 +000>,<MAYBRIDGE\nmr>,<NMR_250MHZ>,
      <apk 
       data hash MD5: 32K
       59 92 8E 1F 59 EF 45 36 18 72 B6 BA E8 CD C0 2A>)
(   4,<2006-11-16 12:04:32.92 +000>,<MAYBRIDGE\nmr>,<NMR_250MHZ>,
      <abs ABSG = 5 
       data hash MD5: 32K
       50 65 64 10 C0 43 BC 8C 19 7F 63 E6 AD EC 50 49>)
$$ ##END=
$$ 
$$ hash MD5
$$ 77 CA BB 96 81 CF 92 BA 33 5E 4F 9B 96 83 58 B2
##$RELAX= 
##$RELAX= 
##$RELAX= 
##$RELAX= 
##$RELAX= 
##$RELAX= 
##$RELAX= 
$$ Bruker specific parameters
$$ --------------------------
##$DU= <C:\u>
##$EXPNO= 470
##$NAME= <ADRS>
##$PROCNO= 1
##$TYPE= <nmr>
##$USER= <dgb>
##$AMP= (0..31)
100 100 100 100 100 100 100 100 100 100 100 100 100 100 100 100 100 100 
100 100 100 100 100 100 100 100 100 100 100 100 100 100 
##$AQSEQ= 0
##$AQ_mod= 3
##$AUNM= <au_zg>
##$AUTOPOS= <20 >
##$BF1= 250.13
##$BF2= 250.13
##$BF3= 250.13
##$BF4= 250.13
##$BF5= 500.13
##$BF6= 500.13
##$BF7= 500.13
##$BF8= 500.13
##$BYTORDA= 1
##$CFDGTYP= 0
##$CFRGTYP= 5
##$CHEMSTR= <none>
##$CNST= (0..31)
1 1 145 1 1 1 1 1 1 1 1 1 1 1 1 1 1 1 1 1 1 1 1 1 1 1 1 1 1 1 1 1 
##$CPDPRG= <>
##$CPDPRG1= <>
##$CPDPRG2= <>
##$CPDPRG3= <>
##$CPDPRG4= <mlev>
##$CPDPRG5= <mlev>
##$CPDPRG6= <mlev>
##$CPDPRG7= <mlev>
##$CPDPRG8= <mlev>
##$CPDPRGB= <>
##$CPDPRGT= <>
##$D= (0..31)
0 1 0 0 0 0 0 0 0 0.06 0 0 0 0 0 0 0.0002 0 0 0 0 0 0 0 0 0 0 0 0 0 0 
0 
##$DATE= 1163678651
##$DBL= (0..7)
120 120 120 120 120 120 120 120 
##$DBP= (0..7)
150 150 150 150 150 150 150 150 
##$DBP07= 0
##$DBPNAM0= <>
##$DBPNAM1= <>
$$ [...]
##$SUBNAM7= <"">
##$SUBNAM8= <"">
##$SUBNAM9= <"">
##$SW= 20.6930455092707
##$SWIBOX= (0..15)
0 0 3 0 0 0 0 0 0 0 0 0 0 0 0 0 
##$SW_h= 5175.983436853
##$TD= 65536
##$TD0= 1
##$TE= 683.16
##$TE2= 300
##$TE3= 300
##$TEG= 300
##$TL= (0..7)
0 120 120 120 120 120 120 120 
##$TP= (0..7)
150 150 150 150 150 150 150 150 
##$TP07= 0
##$TPNAME0= <>
##$TPNAME1= <>
##$TPNAME2= <>
##$TPNAME3= <>
##$TPNAME4= <>
##$TPNAME5= <>
##$TPNAME6= <>
##$TPNAME7= <>
##$TPOAL= (0..7)
0.5 0.5 0.5 0.5 0.5 0.5 0.5 0.5 
##$TPOFFS= (0..7)
0 0 0 0 0 0 0 0 
##$TUNHIN= 0
##$TUNHOUT= 0
##$TUNXOUT= 0
##$USERA1= <user>
##$USERA2= <user>
##$USERA3= <user>
##$USERA4= <user>
##$USERA5= <user>
##$V9= 5
##$VALIST= <valist>
##$VCLIST= <CCCCCCCCCCCCCCC>
##$VD= 0
##$VDLIST= <DDDDDDDDDDDDDDD>
##$VPLIST= <PPPPPPPPPPPPPPP>
##$VTLIST= <TTTTTTTTTTTTTTT>
##$WBST= 1024
##$WBSW= 4
##$XGAIN= (0..3)
0 0 0 0 
##$XL= 0
##$YL= 0
##$YMAX_a= 507203
##$YMIN_a= -247549
##$ZGOPTNS= <>
##$ZL1= 120
##$ZL2= 120
##$ZL3= 120
##$ZL4= 120
##$ABSF1= 16.522
##$ABSF2= -4.171173
##$ABSG= 5
##$ABSL= 3
##$ALPHA= 0
##$AQORDER= 0
##$ASSFAC= 0
##$ASSFACI= 0
##$ASSFACX= 0
##$ASSWID= 0
##$AUNMP= <proc_1d>
##$AZFE= 0.1
##$AZFW= 0.1
##$BCFW= 0
##$BC_mod= 0
##$BYTORDP= 0
##$COROFFS= 0
##$CY= 12.5
##$DATMOD= 1
##$DC= 0
##$DFILT= <>
##$DTYPP= 0
##$F1P= 14.0000005364418
##$F2P= -0.99999901652339
##$FCOR= 0.5
##$FTSIZE= 32768
##$FT_mod= 6
##$GAMMA= 0
##$GB= 0
##$INTBC= 1
##$INTSCL= 1
##$ISEN= 128
##$LB= 0.3
##$LEV0= 0
##$LPBIN= 0
##$MAXI= 10000
##$MC2= 0
##$MEAN= 0
##$ME_mod= 0
##$MI= 0
##$NCOEF= 0
##$NC_proc= -6
##$NLEV= 6
##$NOISF1= 0
##$NOISF2= 0
##$NSP= 0
##$NTH_PI= 0
##$NZP= 0
##$OFFSET= 16.522
##$PC= 1
##$PHC0= -49.06175
##$PHC1= 3.957968
##$PH_mod= 1
##$PKNL= yes
##$PPARMOD= 0
##$PSCAL= 4
##$PSIGN= 0
##$REVERSE= no
##$SF= 250.13
##$SI= 32768
##$SIGF1= 0
##$SIGF2= 0
##$SINO= 400
##$SIOLD= 32768
##$SREGLST= <1H.DMSO>
##$SSB= 0
##$STSI= 32768
##$STSR= 0
##$SW_p= 5175.98343685301
##$SYMM= 0
##$S_DEV= 0
##$TDeff= 65536
##$TDoff= 0
##$TI= <Analysis number 999999
Compound Code 99
Book Reference 9
Project Code 9>
##$TILT= no
##$TM1= 0
##$TM2= 0
##$TOPLEV= 0
##$USERP1= <user>
##$USERP2= <user>
##$USERP3= <user>
##$USERP4= <user>
##$USERP5= <user>
##$WDW= 1
##$XDIM= 32768
##$YMAX_p= 451439028
##$YMIN_p= -1176773
$$ End of Bruker specific parameters
$$ ---------------------------------
##NTUPLES= NMR SPECTRUM
##VAR_NAME=  FREQUENCY,     SPECTRUM/REAL,   SPECTRUM/IMAG
##SYMBOL=    X,             R,               I
##VAR_TYPE=  INDEPENDENT,   DEPENDENT,       DEPENDENT
##VAR_FORM=  AFFN,          ASDF,            ASDF
##VAR_DIM=   32768,         32768,           32768
##UNITS=     HZ,            ARBITRARY UNITS, ARBITRARY UNITS
##FACTOR=    0.157963299565203, 1,           1
##FIRST=     4132.6476996994, 0,             0
##LAST=      -1043.33573715361, 0,           0
##MIN=       -1043.33573715361, -1176773,    0
##MAX=       4132.6476996994, 451439028,     0
$$ Real data points
##PAGE= N=1
##DATA TABLE= (X++(R..R)), XYDATA
$$ [...]
15492A91267l71605k28927l149j56382K19327J37086J70636K74087J4013n42965
15482b96612R1413N39158J37824l34614j62804J50744j14557k14545k29992P0130
15472c63855P4046K01367K67958j04024j71962j43495n104K41166J4776L465l2245
15461a7907k2156j02954r2700j52789p9299M06980K71644m81879l58981R4119
15451e35922j9511J53386L19098J77415L52714j7494j20245K4658j16901l35847
15441a18649j57706J30119J83114n0996k75431k84199J30599R1569k363m3796
15431c97739j66919K9836K70597J80943n5162L2442J93822L9845K1290j11310
15421C7645l09036K0111r2019N4904j6413K41431K93823j44905m01761P3174K82606
$$ plain form
15492 191267 -180338 -409265 -412414 -568796 -349469 -212383 -41747 232340 246353 -296612
15482 -296612 -205199 333959 471783 137169 -25635 125109 10552 -203993 -433985 -363855
15472 -363855 -289809 -88442 179516 75492 -96470 -239965 -245069 -3903 10873 14338 -17907
15461 -17907 -40063 -143017 -235717 -388506 -467805 -60825 210819 -271060 -630041 -535922
15451 -535922 -555433 -402047 -82949 94466 447180 429686 309441 334099 217198 -118649
15441 -118649 -276355 -146236 36878 -14118 -289549 -573748 -443149 -351580 -353943 -397739
15431 -397739 -564658 -534822 -264225 -83282 -138444 -106002 87820 127665 148955 37645
15421 37645 -271391 -251280 -343299 -288395 -304808 -63377 230446 85541 -316220 -243046 39560
15410C9560m5574k07724k30706L2665L8834J67634j36345P9066m5075J28275P3267
15399a06123l55799k40633J8003J87248L80521K33518r6310k42871k09179j46842
15389e78467J17987l1652P1029R0178k87576j73915J60750P1240o9102l5605J57137
15378e07996K19181K49001L90939L0060l46557l62040J49604p4167k49293N8031
15368d43237L41411J42692l27821r6935M30661j57164j40038J06294j07590l98019
15358f49746M24968J03064j05088r1745j41783N844J22221J14645K34176k02722
15348a86166n3002K15263k35792j32751K04554k0147p8237j62513k4403M6527
15338d26667R6674p6555j15726M2747j06605M20502J98559J24657O9479L9115
$$ plain form
15410 39560 -6014 -213738 -444444 -411779 -372945 -205311 -341656 -262590 -307665 -179390 -106123
15399 -106123 -461922 -702555 -684552 -497304 -116783 116735 20425 -222446 -431625 -578467
15389 -578467 -460480 -492132 -421103 -330925 -618501 -792416 -631666 -560426 -629528 -665133 -507996
15378 -507996 -288815 -39814 351125 381185 34628 -327412 -177808 -251975 -501268 -443237
15368 -443237 -101826 40866 -286955 -383890 46771 -110393 -250431 -144137 -251727 -649746
15358 -649746 -224778 -121714 -226802 -318547 -460330 -454486 -332265 -217620 16556 -186166
15348 -186166 -239168 -23905 -259697 -392448 -187894 -208041 -286278 -448791 -473194 -426667
15338 -426667 -329993 -406548 -522274 -479527 -586132 -165630 32929 157586 227065 266180
15328B66180k3260j73793R2771J55118j13818m24081J16862J20896K23593J27476
15318C67944k60619k77548M860K43622J3450N203j40925J73414j40152m8589J62000
15307A02660J89736m2723p8591k57190M2796j93665j85011j57994L17448K77779
15297A5245m2235Q0358l08734j69319L29346J97002L2785j17863k59077O8094
15287a74398K50504j58911q527O7753j24667k71824l13432L5682M4273M22529
15277b31018R3578l23062j1367l1217O1316J38390L21535J20098j93087l23425
15267c78259R4650l6836J17859J00603R3851J03308q2823l21643K80649L72679
15257C44038k05247k43385J66967k4275j76579r6270m0643J6150J21987K83707
$$ plain form
15328 266180 242920 69127 161898 317016 203198 -220883 -104021 16875 240468 367944
15318 367944 107325 -170223 -165363 78259 91709 96912 -44013 129401 -10751 -59340 102660
15307 102660 292396 249673 171082 -86108 -43312 -236977 -421988 -579982 -262534 15245
15297 15245 -26990 53368 -255366 -424685 -95339 101663 134448 16585 -242492 -174398
15287 -174398 76106 -82805 -91332 -23579 -148246 -420070 -733502 -697820 -653547 -231018
15277 -231018 -137440 -460502 -471869 -503086 -441770 -303380 18155 138253 -54834 -378259
15267 -378259 -283609 -320445 -202586 -101983 -8132 95176 12353 -309290 -28641 344038
15257 344038 138791 -104594 62373 38098 -138481 -234751 -275394 -259244 -137257 146450
15247A46450J19531J1439n5418q0016k25357P252p1186j77884K715N2224k67713
15236e37963q9629l3608N8150Q3912k5887P8134r6742k3296L429R2882J92663
15225b97955j01217O5518J18444m4924k02301l34612K87764K17747K72311m4739
15215f3964q8988k3939r8524K6324j61668J9545K3328J8152j56536N0268k0202
15204d76204Q6143L5644k77391j7134l6606j57844J34634J08300J3984n3444L16414
15193c23504L43986K11693j05639j3382j30059l48196N1379J38109P9706J51906
15183E5999j00748r4614P4489m7011k73781O3293k6923L02266J18304N9441n8688
15172G2027k31219j46477L8085J34063R4013k85817j58070N7201M7646k3206N2819
$$ plain form
15247 146450 265981 277420 222002 141986 -83371 -76119 -147305 -325189 -322474 -270250 -537963
15236 -537963 -627592 -661200 -603050 -519138 -545025 -466891 -563633 -586929 -583500 -490618 -297955
15225 -297955 -399172 -333654 -215210 -260134 -462435 -797047 -509283 -291536 -19225 -63964
15215 -63964 -152952 -176891 -275415 -249091 -410759 -391214 -367886 -349734 -506270 -456002 -476204
15204 -476204 -390061 -354417 -631808 -648942 -685548 -843392 -708758 -600458 -586474 -639918 -323504
15193 -323504 20482 232175 126536 113154 -16905 -365101 -313722 -175613 -95907 55999
15183 55999 -44749 -139363 -64874 -111885 -385666 -322373 -349296 -47030 71274 130715 72027
15172 72027 -159192 -305669 -267584 -133521 -39508 -325325 -483395 -426194 -378548 -401754 -348935
15161c48935K75152J14236j34140k53942j03915L3461P9776m59107J13883L23843
15151c59688P4331M1165J27415j2916r2073k63480k9356o0421J53057P4211l2283
15140c80038j44610Q8041J76683L9726J81653n7977M0965L0618P085o3202j87480
15129b68536j95161k20680K46456J72266K90726N4673P0513l1049R437o654j87523
15118f5532Q8186J50695k05466Q3656k9240j81073N4882r9065N8724K09526K46801
15107C12094L68162p7865l40171J85699N015l33516k11257k04561p6473Q223K44642
15096a20008m291K83194j04459P8588L42880j0910k16423j23920n1442j48608
15086g5399N7016M136j3784q8931N7814p4817Q4941j4856N8358L8935k58545p4025
$$ plain form
15161 -348935 -73783 40453 -93687 -347629 -451544 -418083 -338307 -797414 -683531 -359688
15151 -359688 -285357 -244192 -116777 -129693 -221766 -485246 -514602 -575023 -421966 -347755 -380038
15140 -380038 -524648 -436607 -259924 -220198 -38545 -96522 -55557 -24939 -17854 -81056 -268536
15129 -268536 -463697 -684377 -437921 -265655 25071 79744 150257 119208 128645 121991 -65532
15118 -65532 22654 173349 -32117 51539 22299 -158774 -103892 -202957 -144233 65293 312094
15107 312094 680256 602391 262220 447919 452934 119418 -91839 -296400 -372873 -364650 -120008
15096 -120008 -124299 158895 54436 133024 475904 464994 248571 124651 73209 -75399
15086 -75399 -18383 -14247 -28031 -116962 -59148 -133965 -49024 -63880 -5522 33413 -225132 -299157
15074b99157J16396J38212j8067K74981J33088j4029j78705k39541n8126K30995
15064H6047J2812j05867j68446O3321J1742j03826J94739l67J18321j89959r706
15053i1189J46669J94011q8591j27383L4228o0624o9185j5062L6846M9287n1730
15042d2723j40698j08432n443J03444K07644L47503Q1092k49667j64616l26132
15032b98028J60878J90338J9619j0683M152j97155J60436j36257P8321k75581
15022c03960l9014k6499J66529j66455j58181K70384J635k36116l2379k51086
15012g75142j7260R0713J82938L72426k82424n1924M8341K42345j56710p2090
15002d18787q4114l310K19699J56878P5840j62726j9806M2354J85388J6040J8896
$$ plain form
15074 -299157 -182761 -44549 -62616 212365 345453 331424 152719 -86822 -144948 86047
15064 86047 98859 -7008 -175454 -112133 -100391 -204217 -9478 -9845 108476 -81483 -91189
15053 -91189 55480 249491 160900 33517 67745 7121 -62064 -77126 -40280 9007 -42723
15042 -42723 -183421 -291853 -297296 -193852 13792 361295 442387 192720 28104 -298028
15032 -298028 -137150 53188 72807 62124 66276 -130879 29557 -106700 -28379 -303960
15022 -303960 -342974 -369473 -202944 -369399 -527580 -257196 -255561 -491677 -524056 -775142
15012 -775142 -792402 -701689 -518751 -146325 -428749 -480673 -432332 -189987 -346697 -418787
15002 -418787 -502901 -506211 -286512 -129634 -53794 -216520 -236326 -193972 -8584 7456 26352
14991B6352j73116J69122K45882k86882m58533r562J61318J57226J47306r4550
14981a15437k8633j58342k4531r0966m5273j40704K31214K12737M1593L8084O7818
14970a2440j13604l67029k60876j50762L13700j3019j10480J60124J84240J98393
14960a71753Q290j9731O6662m5262j84886j62974j96329J85362J93846J0130n9430
14949c76075O9737K66650j81151j93331j91702k6817j10371P8988J25564n933
14939e44441K191J00502R1752J13788r0769j39928k4884O1099Q9548K5462J47686
14928a67994l8017o1953L9608P578K70655K46098j09870k66581k03725l925K88684
14917E58J40399q1034l00377k7216n6997m27381q7590J23771J77696J83329K56430
$$ plain form
14991 26352 -146764 22358 268240 -18642 -477175 -486737 -325419 -168193 -20887 -115437
14981 -115437 -144070 -302412 -326943 -417909 -463182 -603886 -372672 -159935 -118342 -80258 -12440
14970 -12440 -126044 -493073 -753949 -904711 -591011 -604030 -714510 -554386 -370146 -171753
14960 -171753 -163463 -183194 -116532 -161794 -346680 -509654 -705983 -520621 -326775 -316645 -376075
14949 -376075 -306338 -39688 -220839 -414170 -605872 -632689 -743060 -664072 -538508 -544441
14939 -544441 -542250 -441748 -349996 -236208 -326977 -466905 -491789 -430690 -341142 -315680 -167994
14928 -167994 -206011 -267964 -228356 -220778 49877 295975 186105 -80476 -284201 -288126 558
14917 558 140957 59923 -240454 -267670 -324667 -752048 -839638 -715867 -538171 -354842 -98412
14906i8412L581l02137k82875N9552K93937Q2041K01235L0754K10672j44672j69935
14895a16259J07743J38469m45976j12390L66204O673q9142J40243N5531j0870
14885D0226j27112o4023r0703r8513j03575J21389J16638k27395j18979K20275
14875c31772P2777j6133K30168n563j63967l27678J01895J47303k86070m63514
14865a042554j30943M20052K98162k8270O0814N6759L98551n6053j92309j10695
14855c26486q9120l76000M6290L13225q4897J62909m8623L3732n6325k36614k7657
14844f89566j36209n5164K16358M3824j75898M3178K13750K45538p1075m64410
14834h29674J1865L62413L17542K00301k4457m9937r5327J10809J01203L0611
$$ plain form
14906 -98412 -94831 -396968 -679843 -620291 -326354 -244313 -43078 -12324 198348 53676 -116259
14895 -116259 -8516 129953 -316023 -428413 -62209 -55536 -144678 -4435 51096 40226
14885 40226 -86886 -150909 -241612 -340125 -443700 -322311 -205673 -433068 -552047 -331772
14875 -331772 -258995 -275128 -44960 -50523 -214490 -542168 -440273 -292970 -579040 -1042554
14865 -1042554 -1173497 -753445 -455283 -483553 -422739 -365980 32571 -23482 -215791 -326486
14855 -326486 -415606 -791606 -745316 -432091 -516988 -354079 -402702 -368970 -425295 -661909 -689566
14844 -689566 -825775 -880939 -664581 -620757 -796655 -753477 -539727 -294189 -365264 -829674
14834 -829674 -817809 -455396 -137854 62447 37990 -11947 -107274 3535 104738 135349
14824A35349n9810q2518J51837j85650j06001M762j31410k27553J92397J29661
14814a78936K2107p8132k51073r0313P7946j99920o4841j29537K94950K73417
14804c24332k60703L70302m4671k27772l58714R1931K51651J66041J18211k3936
14794b41992j37294r4117k10431L0899J49244J77569L1993n32k4553j9682K64143
14783g4753K06105l41554j83706o7956K44749L7017R7648L893J6632K82308J22670
14772C43053m07703J31925J64263j3889k62513l55368j3027J38005L31651O9791
14762A26188j03416O3896j55951r6682J2495j08149j77849J31379J46304P0817
14752i0968k0573l05599j80552K39026M1798M5727j7063R7197k60111q1571j2587
$$ plain form
14824 135349 75539 -6979 144858 -40792 -146793 -142031 -273441 -500994 -308597 -178936
14814 -178936 -156829 -234961 -486034 -576347 -498401 -698321 -763162 -892699 -597749 -324332
14804 -324332 -585035 -214733 -259404 -487176 -845890 -753959 -502308 -336267 -218056 -241992
14794 -241992 -379286 -473403 -683834 -652935 -503691 -326122 -294129 -294661 -319214 -338896 -74753
14783 -74753 131352 -210202 -393908 -461864 -217115 -180098 -82450 -78557 -61925 220383 343053
14772 343053 -64650 67275 231538 217649 -44864 -400232 -413259 -275254 56397 126188
14762 126188 22772 86668 -69283 -165965 -153470 -261619 -439468 -308089 -161785 -90968
14752 -90968 -111541 -417140 -597692 -358666 -316868 -271141 -288204 -191007 -451118 -532689 -545276
14741e45276J29121J51328l9479j2682m5664O511J67316J04834J23991P0159k56065
14730a45906j13816J48738q5083j03390j65632l0483R5583j06521p8694P7074
14720e08130j11232J02455K95020P6116J777j25533k37105j13257k09811K51361
14710e78339m4367k17764l7743O5577L2300J14765J61143J61429K22510J50213
14700B9724J64915M5860p1601q9130q7529j94594l08934j43540j0822K01179P0228
14689c94244J14059K96562q2740M7208p6006J91054k06241k29551J10170l7013
14679b66742L5205J4789r9168k41460J23972P4395J2726J20703o1927P5976k15168
14668d26699L2278J40953J15988K03678k7706J39413o3678n5420J8586o7125o7039
$$ plain form
14741 -545276 -416155 -264827 -304306 -316988 -362652 -356141 -188825 -83991 40000 110159 -145906
14730 -145906 -259722 -110984 -196067 -299457 -465089 -495572 -399989 -506510 -585204 -508130
14720 -508130 -619362 -516907 -221887 -145771 -143994 -269527 -506632 -619889 -829700 -578339
14710 -578339 -622706 -840470 -878213 -812636 -780336 -665571 -504428 -342999 -120489 29724
14700 29724 194639 240499 168898 79768 -7761 -202355 -511289 -654829 -665651 -464472 -394244
14689 -394244 -280185 16377 -66363 -19155 -95161 95893 -110348 -339899 -229729 -266742
14679 -266742 -231537 -216748 -315916 -557376 -433404 -359009 -346283 -225580 -287507 -211531 -426699
14668 -426699 -394421 -253468 -137480 66198 38492 177905 114227 58807 77393 10268 -56771
14657e6771l04920M9593J02896K697J21297R6862k44841j93040L53594J70502
14647I7869k05283L5936J18602J63678q1772l26684J71426n1088k29989k89144
14637e96449o1562L1180L1143L54739M58783l22257J00968K7955l11881J09086
14627a78295J23859J24277o9824k08722O8534p3325j42701J8530J96479k651j79976
14616c23815j87537l59987L62352K23223L1918o1118o9377k12569Q8375m4022
14606e52557j87571R4157Q6724J15945M6164k84946J3024M31437J09423J27180
14596a020Q9382j56727k07529K59368j16712r3701k9833p1157J14521R7152j71843
14585b88099k0842j42171M7945q6858q8594J7693N26104K3770k76612q7557j72139
$$ plain form
14657 -56771 -361691 -312098 -209202 -206505 -85208 11654 -233187 -426227 -72633 97869
14647 97869 -107414 -71478 47124 210802 129030 -197654 -26228 -77316 -307305 -596449
14637 -596449 -658011 -626831 -595688 -240949 217834 -104423 -3455 24500 -287381 -178295
14627 -178295 -54436 69841 17 -208705 -140171 -213496 -356197 -337667 -141188 -143839 -323815
14616 -323815 -511352 -871339 -508987 -285764 -253846 -314964 -384341 -596910 -508535 -552557
14606 -552557 -740128 -645971 -559247 -443302 -397138 -682084 -669060 -237623 -128200 -1020
14596 -1020 88362 -68365 -275894 -16526 -133238 -226939 -256772 -327929 -213408 -116256 -288099
14585 -288099 -308941 -451112 -403167 -490025 -578619 -560926 -34822 -11052 -287664 -375221 -547360
14574e47360K13566j28061m4995k7261P3155J73086j4476P8733L6919k78026l6850
14563e01570j65007k57024r0865J23256L80554N1841J6812k18624k57217L26064
14553e91780o5096j87145J90805K49865j33888k87584P1145J52908K00737J72575
14543b27458j66184m13405P2499J63555P2452J78172r8287k29267K6506L6200
14533e85217J36025K83165K4881j78755r5164l2078L40275L5428n7967j8810q3368
14522b31585k19987Q0191n5531n334q1382Q9898J64800K88046r4412m4851J4158
14511i5989j78404K7017o2855k29158J44281J78003j63489j22511m602J37688
14501c70019Q9040R2670q6195j95775k75900R5908M34894L7652j68825N2201N3550
$$ plain form
14574 -547360 -333794 -461855 -506850 -534111 -460956 -287870 -302346 -223613 -186694 -464720 -501570
14563 -501570 -666577 -923601 -1014466 -891210 -510656 -458815 -442003 -660627 -917844 -591780
14553 -591780 -656876 -844021 -653216 -403351 -537239 -824823 -753678 -600770 -400033 -227458
14543 -227458 -393642 -807047 -734548 -570993 -498541 -320369 -418656 -647923 -621417 -585217
14533 -585217 -449192 -166027 -141146 -319901 -415065 -447143 -106868 -71440 -129407 -148217 -231585
14522 -231585 -451572 -371381 -426912 -432246 -513628 -423730 -258930 29116 -65296 -110147 -95989
14511 -95989 -274393 -247376 -310231 -539389 -395108 -217105 -380594 -503105 -507707 -370019
14501 -370019 -280979 -188309 -274504 -470279 -746179 -650271 -215377 -177725 -346550 -294349 -240799
14490b40799j3911j6454K17962k9887j39823k4096k8074N3184q7099m3584J58230
14479a94351k00980k63163j62556P0999L20449Q2335O2921J25586l8683k09278
14469d06721j11728J86353p445n6219J21612j7251j79282j54059N6894J41292
14459d26554m7500Q9701k25253N1953o1864K48483J7161P4352k01871o73J27351
14448c54714j55544O3956k60870j78136J65408K05134n9562o6206J59211k2705
14438e04028N8147M5195j09754P5522L58893l0021j11584Q4616j46965N9396k41454
14427d62037M3698K06644J23307R3186j41219J4654M7072j51701K63943O7684
14417A05231j52723j36605n32029k2365J76339R7038J1344n0379o8009L46916
$$ plain form
14490 -240799 -254710 -271164 -53202 -83089 -222912 -247008 -275082 -221898 -308997 -352581 -194351
14479 -194351 -395331 -658494 -821050 -750051 -429602 -347267 -284346 -158760 -197443 -406721
14469 -406721 -518449 -332096 -339541 -395760 -274148 -291399 -470681 -624740 -567846 -426554
14459 -426554 -474054 -384353 -609606 -557653 -619517 -371034 -353873 -279521 -481392 -482065 -354714
14448 -354714 -510258 -446302 -707172 -885308 -719900 -514766 -574328 -640534 -481323 -504028
14438 -504028 -445881 -400686 -510440 -434918 -76025 -106046 -217630 -133014 -279979 -220583 -462037
14427 -462037 -418339 -211695 -88388 4798 -136421 -121767 -74695 -226396 37547 105231
14417 105231 -47492 -184097 -716126 -738491 -562152 -465114 -453770 -504149 -572158 -225242
14407b25242L13085P4623J77518k36234J0304j722q6380K54545k7026l13187j9275
14396g8991k79n1885j28300M2837l6143j21800j70123j26842J15903J37553J09893
14385c08177m6747K69869J32899m82621P1130K54471j74655l00625m27008M8201
14375i63263j29423o0687R1427J16415R9754J16811J68009j16666j88017J35160
14365g30480K3299J42522J07477K56048m8777K11584J77736m31223N4012K76222
14355C8420j35672l12685j94391J47888j10576j2559K04943o2550K33244J46549
14345e7389k41178k86361J45711K16262k26323j05704o8441O9119m29J07283O6519
14334c80931J69600j22746k90477m21470j30749L39625K26034N4471L4732J0836
$$ plain form
14407 -225242 87843 162466 339984 103750 114054 112332 25952 280497 253471 -59716 -78991
14396 -78991 -79270 -131155 -259455 -216618 -252761 -374561 -544684 -671526 -555623 -418070 -308177
14385 -308177 -354924 -85055 47844 -434777 -363647 -109176 -283831 -584456 -1011464 -963263
14375 -963263 -1092686 -1153373 -1061946 -945531 -845777 -728966 -560957 -677623 -865640 -730480
14365 -730480 -707181 -564659 -457182 -201134 -249911 -38327 139409 -291814 -237802 38420
14355 38420 -97252 -409937 -604328 -456440 -567016 -579575 -374632 -437182 -203938 -57389
14345 -57389 -298567 -584928 -439217 -222955 -449278 -554982 -623423 -554304 -554733 -447450 -380931
14334 -380931 -211331 -334077 -624554 -1046024 -1176773 -837148 -611114 -556643 -521911 -511075
14324e11075q7584K24743J53819J08112k25475P7870L13079p2568L2161m60566
14314d47484l02116j58688Q7203J29377J81974K19057m681J37765k82867j29024
14304e69484J71290L9508j57166k17474J01837J44847K18386J67895r1363j72723
14294c64447k16531r0103j199o8756K49011K92534R0052j21090l31938r9439o502
14283f68408k83646K62282L12807l4427l9065J31492K27075k4442k16028l42732
14273f75092k89622k07587L25448o822L20279R6978n2777J46548J42035j69167
14263c69779q5785N1430j6226J17308K51669J95337n3073k97877j85775K38934
14253a53837J44753P36k68567n8270L29367j8576L7163o6142j79758J2231o7521
$$ plain form
14324 -511075 -598659 -373916 -220097 -111985 -337460 -259590 53489 -19079 13082 -447484
14314 -447484 -749600 -908288 -821085 -691708 -509734 -290677 -295358 -157593 -440460 -569484
14304 -569484 -398194 -358686 -515852 -733326 -631489 -486642 -268256 -100361 -191724 -364447
14294 -364447 -580978 -671081 -672280 -741036 -492025 -199491 -109439 -230529 -562467 -661906 -668408
14283 -668408 -952054 -689772 -376965 -411392 -450457 -318965 -91890 -116332 -332360 -675092
14273 -675092 -964714 -1172301 -846853 -853675 -533396 -436418 -489195 -342647 -200612 -369779
14263 -369779 -455564 -404134 -420360 -303052 -51383 143954 90881 -206996 -392771 -153837
14253 -153837 -9084 -8348 -276915 -335185 -5818 -24394 12769 -53373 -233131 -220900 -288421
14242b88421J01563K7924n4396l1955K50824k1823j90439K48153N6199k8998o8616
14231A5j90127O6516M3498J2736k03207P4628J13388O305j86684L4698j51080
14220c79314q6966k85653k72208J72240R2844J79713J64487J56404J5862J03096
14210a39495K67744j59888k87444j23286j65326J59948l4790M0743K19123j10169
14200c32840m13359q3003L13099J62080O727L6526M09832k27283k66133K8257
14190c66097l0722j41867K52917J19430q9237N3305L50015k25212m8850J50156
14180B3838J52805P8344k08560j16363N2362J1622N4497M7273j07338J8528n4116
14169d7108J32466j02788j72967J71531P1466k5140l4277k05446o7443j28104
$$ plain form
14242 -288421 -186858 -158934 -213330 -245285 5539 -16284 -206723 41430 97629 68631 15
14231 15 -190112 -123596 -80098 -67362 -270569 -195941 -82553 -76248 -262932 -228234 -379314
14220 -379314 -466280 -751933 -1024141 -851901 -759057 -579344 -414857 -258453 -242591 -139495
14210 -139495 128249 -31639 -319083 -442369 -607695 -447747 -482537 -441794 -222671 -332840
14200 -332840 -746199 -829202 -516103 -354023 -347296 -310770 99062 -128221 -394354 -366097
14190 -366097 -396819 -538686 -285769 -166339 -255576 -202271 147744 -77468 -126318 23838
14180 23838 176643 254987 46427 -69936 -17574 -5952 48545 95818 -11520 7008 -47108
14169 -47108 85358 -17430 -190397 -18866 52600 27460 -6817 -212263 -279706 -407810
14159d07810q8893J03326J40598J67234o6528r0473k3954l3927n0721K5812K96874
14148b8462L5320l50569j21948p324r4188J84699K42557j16130k24937J580p753
14137d87155m1964J28066J12778R1524o68M078j98060j75504J99367R2612k19366
14126d94292m9225n4811J67262L2763K581K55494o1455j03151j97592j9845J24371
14115c97900o167J47463J15483R617M5174o088j07539p1313j65070k10833J11328
14104e35845K44752P711o2225m6657r0307K55500k7980n0463r935L4225m2792
14093c24016K9336k8685J03712K62813j51734J4773M34692j03428k36982M3563
14083D4044J237j44646l21019j79251j00148J01238Q5139K14674r0977N9836K3501
$$ plain form
14159 -407810 -496703 -393377 -252779 -85545 -152073 -242546 -266500 -300427 -351148 -325336 -28462
14148 -28462 6858 -343711 -465659 -472983 -567171 -382472 -139915 -256045 -480982 -479402 -487155
14137 -487155 -529119 -401053 -288275 -196751 -197419 -193341 -391401 -566905 -367538 -274926 -494292
14126 -494292 -543517 -598328 -431066 -398303 -395722 -140228 -201683 -304834 -502426 -522271 -397900
14115 -397900 -404067 -256604 -141121 -131504 -86330 -92418 -199957 -271270 -436340 -647173 -535845
14104 -535845 -291093 -283382 -345607 -392264 -482571 -227071 -255051 -305514 -315449 -281224 -324016
14093 -324016 -294680 -323365 -219653 43160 -108574 -93801 340891 237463 481 44044
14083 44044 45281 -99365 -420384 -599635 -699783 -598545 -513406 -298732 -389709 -329873 -306372
14072c06372j44929m6827r3864o026J28308M45905K65892n2509k48942k26004
14062b85368j97848J80761O2120j49462j2016k55049K183J90366n6783p7684R2500
14051e06280J02880J57618K21598N2621L11543K2179l25352R610K19337p3149
14041A92605k01982k56306J9109k11401J70312O6550j21969j55421K27763K14294
14031e6446J81269J6867k0085k17824m05626m8453r9862l00455L4804J49464M6953
14020g19394J55214P1929N7131Q5531M12243l8826j79619J08299J88910l33238
14010a91820l52839P7917J21449K01918J89542q944l42276M652L4517j66801P1885
13999c60800J16509K42198J17940l1274k8693J31953P8911j1959o9652l2247j85733
$$ plain form
14072 -306372 -451301 -498128 -591992 -598018 -469710 -23805 242087 189578 -59364 -285368
14062 -285368 -483216 -302455 -240335 -389797 -401813 -656862 -654679 -464313 -521096 -598780 -506280
14051 -506280 -403400 -245782 -24184 28437 339980 362159 36807 46417 265754 192605
14041 192605 -9377 -265683 -246574 -457975 -287663 -221113 -343082 -498503 -270740 -56446
14031 -56446 124823 141690 121605 -96219 -501845 -550298 -650160 -950615 -915811 -766347 -719394
14020 -719394 -564180 -492251 -435120 -349589 62654 23828 -155791 -47492 141418 -191820
14010 -191820 -544659 -466742 -345293 -143375 46167 37223 -305053 -300401 -265884 -432685 -360800
13999 -360800 -244291 -2093 115847 84573 55880 187833 266744 254785 185133 152886 -32847
13988c2847m50880N8608J85098J9392P204p2444j6602j31862O4919K13506q1492
13977b37400k87724J72849P0326k55580n0858k64056j15748j19401J01246J84359
13967h01987K75640k52430L14253K30044J3895L05191K24813J92684j72502k59636
13957F9965j53741j18199J51171R5477m0078p6769K2483J82599r5835j00718L7012
13946b6633j62595j58470J07545J10061J42258J53442k22127j3732o8911P7225
13936f1937o9264j73763n4360J70258k2469j47100J97868K21923J79638K58845
13926D99639L2830L7156K11214L46411J35286k99977N447J44480O4154o3977k69774
13915H42889m46863m54328o8093j20989j81755Q0294l93235m0208J47324J36438
$$ plain form
13988 -32847 -483727 -425119 -240021 -220629 -213425 -285869 -302471 -434333 -369414 -155908 -237400
13977 -237400 -525124 -352275 -281949 -537529 -588387 -852443 -968191 -1087592 -986346 -801987
13967 -801987 -526347 -778777 -464524 -234480 -220585 84606 309419 502103 329601 69965
13957 69965 -83776 -201975 -50804 44673 4595 -72174 -49691 132908 37073 -63645 -26633
13946 -26633 -189228 -347698 -240153 -130092 12166 165608 -56519 -70251 -139162 -61937
13936 -61937 -131201 -304964 -359324 -189066 -211535 -358635 -160767 61156 240794 499639
13926 499639 532469 569625 780839 1127250 1262536 962559 968006 1112486 1176640 1112663 842889
13915 842889 396026 -58302 -126395 -247384 -429139 -348845 -742080 -782288 -634964 -498526
13905d98526K09640J79417N8184N2224R7240j39115j20037J01639J22632q5778
13895b2480k49718j85018R4764P0945J86123J62804k8771J38173j573N9290q7448
13884A37091L9986k41376n8944J08191j45945m41768k90085n4768M5836R3562
13874h08220M06643K34041J59630N4259k67637j04087K60691j15J51876n0206
13864C6875J9897m0114o5516n8392k15015l2986l145j84345j40706q2156J51797
13853f13806J91849J67774k45496j23880J32054J80986L80853L5278q4165n1316
13843b9869q3274k29187l25026n8455q7755K7096K81919L30638O652k59470l3330
13832d60061O8405K16130j98418L7646O387M4547J39735j75599j86270j4997M06136
$$ plain form
13905 -498526 -288886 -109469 -51285 939 98179 -40936 -160973 -59334 63298 -22480
13895 -22480 -272198 -457216 -362452 -291507 -105384 57420 28649 166822 165249 224539 137091
13884 137091 177077 -64299 -123243 -15052 -160997 -602765 -892850 -947618 -901782 -808220
13874 -808220 -401577 -167536 -7906 46353 -221284 -325371 -64680 -64795 87081 36875
13864 36875 56772 16658 -48858 -107250 -322265 -355251 -358396 -542741 -683447 -765603 -613806
13853 -613806 -421957 -254183 -499679 -623559 -491505 -310519 70334 105612 21447 -29869
13843 -29869 -113143 -342330 -667356 -725811 -813566 -786470 -504551 -173913 -167261 -426731 -460061
13832 -460061 -391656 -175526 -373944 -336298 -329911 -285364 -145629 -321228 -507498 -522495 -116359
13821a16359j6015k9301J59688q9297n4119j24636q4090M1901l51466j76777K99738
13810e40733M47863J07665K31181j82263j05655j26886j39740K03397K40510J01589
13800B36928k46388l22264j03377J35872J2092J45301J33388j34499P9151L04997
13790B41201j97821l6697O8796l09676n994r2437l5962L3560j41880J53542J3891
13779c09477j57480J48927P8367K44928P3910M2937k45401l41459k68284j75790
13769i08822K3882M56780K05108r3177J68575q527N2893J06884J74942J03129
13759B81667k56563M9136j8367l4790l7651j79763m6588K3579J0533M1036J71219
13748C448j06204m8696P4282j05302r0866Q974L9014j39416K32246J70288Q8416
$$ plain form
13821 -116359 -132374 -161675 -1987 -91284 -145403 -270039 -354129 -312228 -663694 -840471 -540733
13810 -540733 -92870 14795 245976 63713 -41942 -168828 -308568 -105171 135339 236928
13800 236928 -9460 -331724 -435101 -299229 -287137 -141836 -8448 -142947 -63796 241201
13790 241201 43380 6683 75479 -234197 -240191 -332628 -368590 -335030 -476910 -323368 -309477
13779 -309477 -466957 -318030 -239663 5265 79175 122112 -123289 -464748 -733032 -908822
13769 -908822 -884940 -428160 -223052 -316229 -147654 -156181 -103288 3596 178538 281667
13759 281667 25104 74240 55873 21083 -16568 -196331 -242919 -219340 -208807 -167771 3448
13748 3448 -102756 -151452 -77170 -182472 -273338 -264364 -225350 -364766 -132520 37768 126184
13737A26184K6994N4444j6524r7972r8974l9891l05755O7086L12625J95386m28000
13726b04397j91417J13532M4040M2946J41955L8800j81725j94207R0968J11353
13716a88152R1805L95049K7090o4972j07166K15134r1165k23922N7531j0542K07878
13705C08568j99835m594l1926l02002k44881J51674J14135J51891J32616J03453
13695A79099R2290k50900j54244m7319j64740J86670j09342L7877K65778J34254
13685A69423K981L56083q4758k98960k00560j54597m02082J64645N93632K73214
13675D19021j22100k76009L5207q3943k67853J15288K59997j30777P1810L7010
13665E7651K30411N2953n7105K55380Q2964K3576O6288m245k16900l23799p008
$$ plain form
13737 126184 153178 207622 191098 93126 -5848 -45739 -351494 -284408 28217 223603 -204397
13726 -204397 -395814 -282282 -238242 -195296 -53341 -14541 -196266 -390473 -299505 -188152
13716 -188152 -96347 298702 325792 260820 153654 368788 277623 53701 111232 100690 308568
13705 308568 108733 104139 72213 -229789 -474670 -322996 -208861 -56970 75646 179099
13695 179099 271389 20489 -133755 -181074 -345814 -159144 -268486 -230609 35169 169423
13685 169423 172404 528487 443729 144769 -55791 -210388 -612470 -447825 145807 419021
13675 419021 296921 20912 56119 -27824 -295677 -180389 79608 -51169 20641 57651
13665 57651 288062 341015 283910 539290 622254 645830 712118 707873 490973 167174 160166
13654A60166j34216j05308r7332O5165P1695j08447p8795j12110j25942K94170
13644a70954N78893j24420N6438n5581q528N8379o6516L1249k06979L7861L01337
13633D31179L14015k26333k26125j71287R6866M4548p4706m1219P7649j15563
13623A09024n1432J76684k48740L7043J12391k59662N2250n3747L16147J83950
13613C73908M4998L1740J83712L7061L9078M8214j27740P6734J20673k64209k24353
13602C39816O247K18012J98106J15572k44072k30091j53469p9894J7987J38583
13592C26797J69019l6860O8344J77645Q0324j12397j92165m07803j40546K12288
13582A44646M8009l1846P9015p0K2994J33766n3803j7408L28328L1293J07602
$$ plain form
13654 160166 25950 -79358 -176690 -111525 -39830 -148277 -227072 -339182 -465124 -170954
13644 -170954 407939 283519 339957 284376 275848 334227 267711 298960 91981 129842 431179
13633 431179 745194 518861 292736 121449 218315 262863 188157 146938 224587 109024
13623 109024 57592 234276 -14464 22579 134970 -124692 -72442 -126189 189958 373908
13613 373908 418906 450646 634358 671419 710497 758711 630971 707705 828378 564169 339816
13602 339816 346063 564075 762181 877753 633681 403590 250121 170227 188214 326797
13592 326797 495816 458956 527300 704945 785269 672872 480707 72904 -67642 144646
13582 144646 192655 160809 239824 239754 262748 396514 342711 325303 653631 684924 792526
13571G92526p4849j76472j32039l7081J94446l08697j85619J75809K50590R0120
13561E88734P2778L1175J07349j36776J33358K79450l84405l29952J93980J1620
13551E67311K03290L88116p3070n41149j81095L5362J78155P5404Q2656q3317
13541F51663l2657j18308L52149P7227m31016m8580J33429J06757m1198m1853
13531F07613j34956q4620k30723j74437K90577L53081K65376J68070O2770L4109
13521A156860j31549j06745q0903Q298j69422j1187P5186J82717l61772k28979
13511C32504P9305j23877j10174p4134J48270k23640M4311N4971J44561M0951
13501C13048l06257J6419k7127J2782J91686J73627O3644J26793o6298j36799
$$ plain form
13571 792526 717677 541205 409166 372085 566531 257834 72215 248024 498614 588734
13561 588734 661512 692687 800036 663260 796618 1076068 691663 361711 555691 567311
13551 567311 770601 1158717 1085647 544498 363403 398765 576920 652324 734980 651663
13541 651663 619006 500698 852847 930074 499058 450478 583907 690664 649466 607613
13531 607613 472657 388037 157314 -17123 273454 626535 891911 1059981 1122751 1156860
13521 1156860 1025311 918566 837663 845961 676539 665352 740538 923255 561483 332504
13511 332504 411809 287932 177758 103624 251894 28254 72565 127536 272097 313048
13501 313048 6791 23210 -3917 8865 200551 374178 437822 564615 498317 361518
13491C61518j12710r230K16406k81591P8773J6337n3605j94856R6676O1010j44122
13480C4606N4027J41008J83515k2684j59240j86114K20243k3304j59027o9959
13470A3071Q5130j88510L9742J74611K6173o9311k04443L64586J88933j11069
13460C18913L215K300N8440r754K6318J83387k41923o7144K2729J78442l9330
13449D35593j95176l9793J66958K36660J58392J25603J6105o8589P9246k13684
13439G01315k7533j1791j45640O0965m3544M92828K21931j66053j93197Q0934
13429I70215R5999J71367J17201J53266L94725K68125K54714O2593L5945M7271
13419B571421Q6224L04273N0681K82326K38803O0467L37497L43426L13386K44856
$$ plain form
13491 361518 248808 239578 455984 174393 253166 269503 215898 21042 117718 178728 34606
13480 34606 88633 229641 413156 390472 231232 45118 265361 242057 83030 13071
13470 13071 98201 -90309 -50567 124044 150217 80906 -123537 241049 429982 318913
13460 318913 322128 324428 382868 373114 399432 582819 340896 273752 296481 474923 435593
13449 435593 240417 200624 367582 604242 762634 888237 904342 835753 914999 701315
13439 701315 673782 661991 516351 577316 533772 1026600 1248531 1082478 889281 970215
13429 970215 1066214 1237581 1354782 1508048 1902773 2170898 2425612 2488205 2524150 2571421
13419 2571421 2657645 2961918 3012599 3294925 3533728 3594195 3931692 4275118 4588504 4833360
13409D833360L69539J89958N39743O40130M01943J83176K32980L85475N13917
13400H290221M69336J63835J63350M8176J49532K00207L03747J15686j54720k28394
13390I520976j37477q5746q5134N4470l461J58851Q9409J31912M02455K90150
13380A0336405L04403R8733L4260O7557J53947J90383M95818M54392K56167L45264
13370A2737329L30597O59459Q17430N78748J69746J46468J61208k92345m4521
13361A5264119J05666J45435J31961l95613k00649m33285j04343l02888p5283
13352A4135120m92762n40038k78517k23431l18522m13946j46941r6660l41299
13343A1283004l19393k95019n562M6562J4646q8776k44108j92147K66040J48747
$$ plain form
13409 4833360 5202899 5392857 5932600 6572730 6974673 7157849 7390829 7776304 8290221
13400 8290221 8759557 8923392 9086742 9134918 9284450 9484657 9788404 9904090 9749370 9520976
13390 9520976 9383499 9297753 9212619 9267089 9263628 9422479 9511888 9643800 10046255 10336405
13380 10336405 10640808 10739541 10773801 10841358 10995305 11185688 11681506 12135898 12392065 12737329
13370 12737329 13067926 13727385 14544815 15123563 15293309 15439777 15600985 15308640 15264119
13361 15264119 15369785 15515220 15647181 15251568 15050919 14617634 14513291 14210403 14135120
13352 14135120 13642358 13102320 12823803 12600372 12281850 11867904 11720963 11624303 11283004
13343 11283004 10963611 10668592 10663030 10709592 10724238 10635462 10391354 10199207 10465247 10613994
13333A0613994K89463L37439k06112j86978J79364o5492m7948K99727K1561m55624
13323A0779394o03965n09538j16384m1422k33214l27115o50495m36802o00939
13314G259520l04188m49742l78033q0387m11569m8507l9393j92863l04380m74059
13304D576399j11874p8763l35486m13843l92049M3379j29491q6597o9972k79697
13294B722006k25070l4077J20767P1175J0511j47080J17891K69550j84541j35750
13284B585382j39635l12108p9447k85914p5016m5641j48145K5014J87197J28801
13274A840488j65066j14278K5281j32903n3475r9463n9696j31574j47877R620
13264I71057j04793j95954k0522L05608J02973N0601J16151L945j35693k72252
$$ plain form
13333 10613994 10903457 11240896 11034784 10847806 11027170 10961678 10913730 11213457 11235018 10779394
13323 10779394 10175429 9665891 9549507 9508085 9274871 8947756 8297261 7860459 7259520
13314 7259520 6955332 6505590 6127557 6047170 5635601 5587094 5547701 5354838 5050458 4576399
13304 4576399 4464525 4385762 4050276 3636433 3244384 3287763 3158272 3071675 3001703 2722006
13294 2722006 2496936 2462859 2583626 2654801 2665312 2518232 2636123 2905673 2721132 2585382
13284 2585382 2445747 2133639 2054192 1768278 1693262 1647621 1499476 1524490 1711687 1840488
13274 1840488 1675422 1561144 1586425 1453522 1400047 1300584 1240888 1109314 961437 971057
13264 971057 866264 670310 649788 955396 1058369 1108970 1225121 1229066 1093373 821121
13254H21121J08693O1417j96216J12206J61477l9777R3564j26294r1267o4409
13244H40515O3285L38234L66903j8273k03728j52719J54921k06436k22255k41223
13234G19224l51724j09063J40268J90861p87R5790J82206L4628k26982p0942M60638
13223A064117j2183q3612K66957R2437q9483k66698o6284M1527L26382L51695
13213A624855R1292p3019j53807J69136K856r959M39526J30893j14370k61175
13203A846228J3057l962K13369O6702j53705j40182J72438N4837P2661J31964
13193B273407m0862j9984k18945j2103J73125J16660L41212L17530J04111K7289
13183C061440J15263K93266p8099P9833M24807L15395P8241L51871L33269L20635
$$ plain form
13254 821121 929814 991231 795015 907221 1068698 1028921 1122485 996191 904924 840515
13244 840515 903800 1242034 1608937 1590664 1386936 1234217 1389138 1182702 960447 719224
13234 719224 367500 258437 398705 589566 588779 684569 866775 901403 674421 603479 1064117
13223 1064117 1051934 968322 1235279 1327716 1238233 971535 905251 946778 1273160 1624855
13213 1624855 1716147 1643128 1489321 1658457 1661313 1651354 2090880 2221773 2107403 1846228
13203 1846228 1859285 1855323 2068692 2135394 1981689 1841507 2013945 2068782 2141443 2273407
13193 2273407 2232545 2212561 1993616 1981513 2154638 2271298 2612510 2930040 3034151 3061440
13183 3061440 3176703 3469969 3391870 3471703 3896510 4211905 4290146 4642017 4975286 5295921
13173E295921K48167J97502L66472L75220L53549M60040P8795L35074N20901P56701
13163H988342P60597O79715R08395J250786J143408J118088J265677J558511J719046
13154A9392565J911787K037481K296621K421668K827658L081423L429991L698770
13146D1097964L671241L497578L313008L189627K626030K173364J540733Q59782
13138F1969327M06421r7000n43280r88770j361107j184670j048652r87586n12536
13129E5652147q45968n87689J25657O98214J106241J020522J365944J933833K316759
13120F2785660K989356L436681L949030M524023N777558O832371P842523R042541
13112A07179743J0060926J1398708J2334025J2676073J2558794J1851165J0405084
$$ plain form
13173 5295921 5544088 5741590 6108062 6483282 6836831 7296871 7375666 7710740 8231641 8988342
13163 8988342 9748939 10428654 11337049 12587835 13731243 14849331 16115008 17673519 19392565
13154 19392565 21304352 23341833 25638454 28060122 30887780 33969203 37399194 41097964
13146 41097964 44769205 48266783 51579791 54769418 57395448 59568812 61109545 61969327
13138 61969327 62375748 62278748 61735468 60746698 59385591 58200921 57152269 56164683 55652147
13129 55652147 54806179 54218490 54344147 55042361 56148602 57169124 58535068 60468901 62785660
13120 62785660 65775016 69211697 73160727 77684750 83462308 90294679 98137202 107179743
13112 107179743 117240669 128639377 140973402 153649475 166208269 178059434 188464518
13105A88464518Q511915O073943K735529j57035l307017o144808q007854r299698
13097A78869493r890869j0229116r760020q893589p708603o555961n737027m544098
13089A15550210l906562l070351j863042j126768m56482l08667M55118J613334
13081A06886790J939685K549735M055112N067143O283560P209932Q426714R627058
13073A52045729J0587287J0765654J0706394J0014647Q331555N876627L241247
13066B11569140J66214k927919o193782q923535j1044360j2576897j2821558j2636662
13058A44610641j2124662j1193705r790461q456015p630474o500929n316500m729190
13050G8868705l748676k983479k765930k283698j945514j924489j332673q46377
$$ plain form
13105 188464518 196976433 203050376 205785905 205628870 202321853 196177045 188169191 178869493
13097 178869493 168978624 158749508 148989488 140095899 132387296 125831335 120094308 115550210
13089 115550210 111643648 108573297 106710255 105583487 105127005 104818338 105273456 106886790
13081 106886790 108826475 111376210 115431322 120498465 126782025 133991957 142418671 152045729
13073 152045729 162633016 173398670 184105064 194119711 202451266 208327893 211569140
13066 211569140 211735354 208807435 202613653 193690118 182645758 170068861 157247303 144610641
13058 144610641 132485979 121292274 111501813 103045798 95415324 88914395 83597895 78868705
13050 78868705 75120029 72136550 69370620 67086922 65141408 63216919 61884246 61037869
13042F1037869m08176k86925K5033P21053J065256J355899J001394J387177J246122
13033F7144702J518441R51189L45602r5893q60230j655758k254892k606144k752149
13024E9734868l247081l523542l800161l966140l530721l345894l067659k574138
13016C2679532k271296j975029j788065j812221j602132j465972j584517j155751
13008A9024549j180904j125949o11680p31190p89965p11675o73177p33265m29703
12999A2037041l19302k84487l27706m89192o32627o70097n36832m25627j45849
12990H205322K2150K2479l96825l06357k13606l28760k82908L9125l37498k66993
12980F156129k03573j97243j11151R2569j13264j03877j66595k02258n4102l30260
$$ plain form
13042 61037869 60629693 60342768 60367801 61088854 62154110 63510009 64511403 65898580 67144702
13033 67144702 68663143 69614332 69959934 69864041 69003811 67348053 65093161 62487017 59734868
13024 59734868 56487787 52964245 49164084 45197944 41667223 38321329 35253670 32679532
13016 32679532 30408236 28433207 26645142 24832921 23230789 21764817 20180300 19024549
13008 19024549 17843645 16717696 16106016 15374826 14584861 13873186 13200009 12466744 12037041
12999 12037041 11717739 11433252 11105546 10616354 9983727 9313630 8776798 8351171 8205322
12990 8205322 8227472 8249951 7853126 7546769 7333163 7004403 6721495 6760620 6423122 6156129
12980 6156129 5952556 5755313 5644162 5736731 5623467 5519590 5352995 5150737 5096635 4766375
12970D766375L7115q7332j04770k11787k53790o2807k26062k27983M0949K45454
12960C915362N1319L9677N3603j81547j63652n3911J76227l36817L7635j15929
12950C421967k65858j02265O3136P3850j24621J41350Q3374k62987k57365K31227
12940C001808J17112n0659k80704k99280l94955J61559K46194R817k57526j24993
12930B128373p4786o8647j9339J02146J76319R3431N8149q5010j77311m2369P8131
12919B169087j53256K19183L8271j81289j94755J1897o8251j00424J48110j2103
12909A876470K05566j47507j06818j3236K7714K0854r6416k1817k50528j67468
12899A326814Q3904Q2934K72153p750j86183k8676k41227J87488K55643P1841
$$ plain form
12970 4766375 4803490 4716158 4611388 4399601 4145811 4083004 3856942 3628959 3669908 3915362
12960 3915362 3966681 4006358 4059961 3878414 3714762 3660851 3837078 3500261 3537896 3421967
12950 3421967 3156109 3053844 3116980 3190830 3066209 3207559 3290933 3027946 2770581 3001808
12940 3001808 3118920 3068261 2787557 2488277 2093322 2254881 2501075 2510892 2253366 2128373
12930 2128373 2053587 1984940 1965601 2067747 2244066 2337497 2395646 2310636 2133325 2090956 2169087
12919 2169087 2015831 2235014 2273285 2091996 1897241 1909138 1840887 1740463 1888573 1876470
12909 1876470 2082036 1934529 1827711 1814475 1842189 1863043 1766627 1744810 1494282 1326814
12899 1326814 1410718 1493652 1765805 1758055 1571872 1543196 1301969 1489457 1745100 1816941
12889A816941k13048j62634k61181M4530J03967n2037q2671K533K04252j40254
12879A260398O0143J64456p8747k87264j29211l6172k48977K95777M26270K14154
12869A640827P7520k73049p5102j44858k14368k59401k54120J53202K07755L08313
12859A166719K24404k10981k81844o5047J28740M3479k70647j6092J79592K63019
12849A161342N4792k02368l53526J0346m01873l4634K31906j40416K47793M41927
12839A015289m9427k42795l04278R4695P3877j21742L4690k24273J06862p1425
12829C11473k75990J77209O06230N4851j88540l7324N5300j5981J29084p8187
12819G38125p7383J98019q8861k71552O9752j4334m4736j08144n4919J6877N7053
$$ plain form
12889 1816941 1603893 1441259 1180078 1224608 1328575 1276538 1193867 1196400 1400652 1260398
12879 1260398 1320541 1484997 1406250 1118986 989775 953603 704626 1000403 1426673 1640827
12869 1640827 1718347 1445298 1370196 1225338 1010970 751569 497449 650651 858406 1166719
12859 1166719 1391123 1180142 898298 833251 961991 1005470 734823 718731 898323 1161342
12849 1161342 1216134 1013766 660240 670586 268713 234079 465985 325569 573362 1015289
12839 1015289 965862 723067 418789 513484 587361 465619 500309 276036 382898 311473
12829 311473 35483 212692 818922 873773 685233 647909 703209 687228 816312 738125
12819 738125 660742 858761 769900 498348 568100 553766 509030 400886 345967 362844 419897
12808D19897O0240K49124J42200M9698Q2557j40309k91286o5243j66289K1974
12798C62563J85012R7769J8237k32098k62270j13726K35290K64411j9984L4338
12788E69542M3807n9283j82673K08317N39716J64396j4976j55864j23961o1299
12778I27722j01709j62407M847j48394j74566P3290L2971J49528j3586k16257
12768C71439L5560J04638Q5875j13981k49323n7398p2677o5959L4301M06022J96904
12757F75401M4955j87649l01402m0836L4832K87064r8042j23661J18851m9168
12747C60345j62438q5725j8567J27151q016k9713K01384K0710l0886J2157j50330
12736B36072J86744o0094r9969k00305O2957P8621K65590M0980N2251j15086o0399
$$ plain form
12808 419897 480137 729261 871461 921159 1003716 863407 572121 506878 340589 362563
12798 362563 547575 645344 663581 431483 169213 55487 290777 555188 535204 569542
12788 569542 613349 554066 371393 579710 1119426 1283822 1268846 1112982 989021 927722
12778 927722 826013 663606 668453 520059 345493 418783 451754 601282 587696 371439
12768 371439 406999 511637 597512 483531 234208 176810 104133 38174 72475 478497 675401
12757 675401 720356 532707 231305 190469 225301 512365 414323 290662 409513 360345
12747 360345 197907 112182 93615 220766 212750 183037 384421 405131 374245 386402 236072
12736 236072 422816 362722 262753 62448 125405 204026 469616 510596 562847 447761 387362
12725C87362j7745j15450l89278Q834K03795K05886j08806J26643M1892j28954
12715B14179k2532j18395M8075j7512j30659l048k7720J37592M36957K1264r1759
12704D46442r247m0968J58436L4074k94161j8424J11349n2496j83814j23212k51618
12693b23639j87304K27376K03018J55306Q0114j4289j69745j49767j55670J34892
12683i9708M33256L0151q3344K68260K5589K17957k03937j19492O3726J57800
12673F90258O3244Q8112l13839k28057K04322L34310k5788n182q3166m5191l86356
12662B92667K02887q6026L4504J2071k0322q9942j29015q4255N01881L13400K15734
12651A163584j43450J18202O2933J74935J34815r7942k60780j49628o8789j33732
$$ plain form
12725 387362 369617 254167 -135111 -126277 77518 283404 174598 301241 343133 214179
12715 214179 191647 73252 121327 103815 -26844 -29892 -57612 79980 516937 538201 446442
12704 446442 437195 396227 554663 588737 294576 276152 387501 335005 151191 27979 -223639
12693 -223639 -410943 -183567 19451 174757 254871 240582 70837 -78930 -234600 -99708
12683 -99708 333548 363699 280355 548615 574204 792161 588224 468732 532458 690258
12673 690258 753502 841614 527775 299718 504040 838350 812562 807380 724214 679023 292667
12662 292667 495554 409528 444032 456103 435781 345839 216824 132569 634450 947850 1163584
12651 1163584 1020134 1138336 1201269 1376204 1511019 1413077 1152297 1002669 933880 800148
12641H00148j22471J20615j26441j51068J24994K84910k0597j58443J0391J71324
12631I33362o7878k0031J8241k85603L0039J17022J23732k08265r4298O5283l8142
12620E73462Q827K67073m4087L2528j37267J92783K15757J06907k83563n0100
12610H82320p9363L40240o1933r3506K63571k12649l66890j89576m7220Q6054
12600E21048P5240P8776j90520j12083k5322K15121j4142j99148J14868j53024
12590C10814l16207L443R0513J70935j6585J98694r96J5764J07568J27976p9347
12579F12572o6910P6839J31618k7697m44226j1804p7408K9417p2023L4113N88670
12568G73161J34l63484p0027J85458l47457j1167k1802J71631O3890O2223l1500
$$ plain form
12641 800148 677677 798292 671851 520783 645777 930687 910090 751647 762038 933362
12631 933362 865484 845453 863694 578091 608130 725152 848884 640619 546321 611604 573462
12620 573462 582289 849362 805275 837803 700536 893319 1109076 1215983 932420 882320
12610 882320 802957 1143197 1081264 987758 1251329 1038680 671790 482214 434994 521048
12600 521048 596288 675064 484544 372461 347139 562260 548118 348970 463838 310814
12590 310814 -5393 -1950 88563 259498 242913 441607 440611 456375 563943 691919 612572
12579 612572 545662 622501 754119 726422 282196 270392 192984 222401 150378 184491 773161
12568 773161 773295 409811 339784 525242 177785 166618 144816 316447 380337 442560 411060
12557D11060R5032Q4714J04350j6318k55828k49663J67749L98073J65099j18086
12547G86182j8860r501j97590j19239J88801O8571l4284p9809L9849j9888j04318
12536D99914j75137l9285N188k45186j7093j15666m9477L12608K25408K1930q5254
12525C37950O976K92776J61556k57178j42506j1764k84335j59599J79920j64306
12515d0510j76095K58384K59484q9443q0438J91763J80159k10790j97712l9002
12505E5800P3694J08231K53941K57731J28524k97664k48881J18435J49824R0153
12495F89788j6180j10885j76140l7928l7973k3963o9596j68785J46846K9970r2832
12484A32322j08174l4747K06230j70889n30459J3192L18419J51363J44313j60017
$$ plain form
12557 411060 506092 590806 695156 678838 423010 173347 341096 739169 904268 786182
12547 786182 767322 757821 560231 440992 629793 698364 664080 584271 624120 604232 499914
12536 499914 324777 285492 290680 45494 28401 -87265 -136742 175866 401274 423204 337950
12525 337950 344926 637702 799258 542080 399574 387810 103475 -56124 123796 -40510
12515 -40510 -216605 41779 301263 211820 131382 323145 503304 292514 94802 55800
12505 55800 129494 237725 491666 749397 877921 580257 331376 449811 599635 689788
12495 689788 673608 562723 386583 348655 310682 286719 217123 48338 195184 225154 132322
12484 132322 24148 -10599 195631 24742 -505717 -492525 -174106 -22743 121570 -38447
12474c8447K6655p0995o7987J45018P5231J49491j1071m1164q6233q3860j73406
12463a76768J92024m495k16240j08566J75680Q2084M7639K0348l59235r0384J58787
12452b79126q9308O7514J36711k9509L6187q8115P8606j0554O5962j01382J836
12441b11178K3588K62100K80457j38115L773k32404k6640K30591q8957r4124q3235
12430g4144j63058K8855J34676J1426J53008K62251M5470J36179k06846L7605
12420C65422N0757j26588m4590l20336J37505j3685J39223j99946j53139J01910
12410f3467J16965k87510J61670L29584j04018j26659j99793n6606J04495P7406
12400d7933J2608K35587J25904J03220j14118q6437j385j29410J8135J78219j32490
$$ plain form
12474 -38447 -11792 -82787 -150774 -5756 69475 218966 207895 166731 80498 -3362 -176768
12463 -176768 15256 10761 -205479 -314045 -138365 -56281 -8642 11706 -347529 -437913 -279126
12452 -279126 -368434 -300920 -164209 -193718 -157531 -245646 -167040 -177594 -111632 -213014 -211178
12441 -211178 -187590 74510 354967 216852 220625 -11779 -38419 192172 103215 9091 -74144
12430 -74144 -237202 -208347 -73671 -62245 90763 353014 398484 534663 327817 365422
12420 365422 416179 289591 245001 -75335 62170 48485 187708 -12238 -165377 -63467
12410 -63467 53498 -234012 -72342 257242 153224 26565 -173228 -229834 -125339 -47933
12400 -47933 -35325 200262 326166 429386 315268 228831 227446 98036 116171 294390 161900
12389A61900j38875J00442J31796N3119N6737K20463j91224k39666M8681j6935
12379A86438k2008k75702l69302j47391K76307K46725n5342J17652J27648q703
12369G6322K10255K0513P3270j85546P5461L5077j25940J34697p5320l45043J49714
12358D3460K19223j66583l56410j8698K43453K25404K42993j06554l15255j154
12348I879K62150M3189K18751J26347J47274p7078k33807k80885m0727N0552q4279
12337A41366J5200k1686j92553r4390M06514K1507j12698j6241p571K3018J25719
12326B88185o1248N1971K1260K64305j84277j50632J83108k8293r6401J5692K9294
12315C32964J20595J45939l0789r4281M2153q2255r1275K94219l4088l26449M4592
$$ plain form
12389 161900 23025 123467 255263 308382 365119 585582 394358 154692 203373 186438
12379 186438 164430 -111272 -480574 -627965 -351658 -104933 -160275 -42623 85025 76322
12369 76322 286577 307090 380360 194814 270275 305352 179412 314109 238789 -106254 43460
12358 43460 262683 96100 -260310 -279008 -35555 189849 432842 326288 11033 9879
12348 9879 272029 315218 533969 660316 807590 730512 496705 215820 175093 225645 141366
12337 141366 156566 134880 -57673 -152063 254451 275958 163260 147019 139448 162466 288185
12326 288185 226937 278908 300168 564473 380196 229564 412672 384379 287978 303670 332964
12315 332964 453559 599498 568709 474428 516581 434326 343051 637270 603182 276733 321325
12304C21325J36939j84689n8078j991J01139P9714J65336k07456j8998m48809
12294a15568J3645L60282k30159j24747R415J77669j2790l18956m4865J0152J10468
12283a65454J51872L14543J1091K13933l5845r8753r2993K45737J84869O5791
12273G94791j78415r7848n7655L04308J34860k81659K14581R1928J82708J78003
12263A285602k275l81770k55445J14332j17356n4941j28356p5473J86869K67259
12253H38446Q9444j54732j06953k16600k59613J24065J9728K48863K48827j91852
12243F39623m59154n0028L41309L8297n78461j71779J85653L41701J82086j21491
12233C47756l2678q1690J61637N5872L2966L5658K23038L3614J34814k43506l28035
$$ plain form
12304 321325 458264 273575 215497 213506 314645 394359 559695 352239 333241 -115568
12294 -115568 -101923 258359 28200 -96547 -87132 90537 77747 -241209 -286074 -275922 -165454
12283 -165454 -13582 300961 312052 525985 490140 391387 298394 544131 729000 794791
12273 794791 616376 518528 460873 765181 900041 618382 832963 924891 1107599 1285602
12263 1285602 1283327 901557 646112 760444 643088 588147 459791 384318 571187 838446
12253 838446 927890 773158 666205 449605 189992 314057 333785 582648 831475 639623
12243 639623 180469 130441 471750 510047 -68414 -240193 -54540 287161 469247 347756
12233 347756 315078 233388 395025 450897 483863 519521 742559 776173 910987 667481 339446
12222C39446j22607j45136j89733J60781Q000Q7866P1070M0562Q6143J70843J00071
12211F07306K03437J3830l16571k40975o2339O7786J31024j18124O3523N86141
12201I35038j49161j59903j02088j31625o8153p8405M1712o4867k01070L900K07516
12190B32894K56463j79581j37980P3830K58378j95798J6099P1625l563K44508
12180F36875K05122R1002k53384j11380J88463j1371k96183p556n2681q4546K6016
12169C30377k25357J42411N8623J67023K82688k4815l41950k70097Q8492J08860
12159C16255K07169k9735j60460J34787J25534o6230k31997j25127j6707K60092
12149D13581j0499j12052K9137n6694j47159N1515J55787Q1684k56235j70960
$$ plain form
12222 339446 216839 71703 -118030 42751 50751 138617 209687 250249 336392 507235 607306
12211 607306 810743 824573 508002 267027 204688 272474 403498 285374 348897 935038
12201 935038 785877 625974 523886 392261 324108 245703 287415 222548 21478 25378 232894
12190 232894 489357 309776 171796 245626 504004 308206 324305 395930 392367 636875
12180 636875 841997 932999 679615 568235 756698 745327 449144 441588 388907 304361 330377
12169 330377 105020 247431 306054 473077 755765 730950 389000 118903 207395 316255
12159 316255 523424 493689 333229 468016 593550 527320 295323 170196 153489 413581
12149 413581 403082 291030 320167 263473 116314 167829 323616 405300 149065 -21895
12139b1895K53043K98524J85078r1001j25414j65838k6630n5366j66094p0667
12129A3740J7404J52271M60799L60214k07055j23452m1378K2475j52601J76559
12119F78976L55584O8723P8174l46794J20248P2534j54904k48443m7670J71322
12109G47750j03250K10107M1033k10821l43947J83314K88013k3983k31898m1987
12099E14331Q7983L10549m6917j84610j47853J07607K76559J36012o8189j2361
12089I73111L9782k62710k04844Q7868K3139q8380K25185j55536j21743J54400
12079F70272j70872J77174L33824J27836R1284k1032K31228L5726q3421j42810
12069A249209o4550J0134J01742m3285j72097J9652k38204k54824O162J33406
$$ plain form
12139 -21895 231148 529672 714750 623749 498335 332497 305867 250501 84407 13740
12129 13740 31144 183415 644214 1004428 797373 673921 632543 655018 502417 678976
12119 678976 1034560 1103283 1181457 834663 954911 1027445 872541 624098 576428 747750
12109 747750 644500 854607 895640 684819 340872 524186 812199 788216 556318 514331
12099 514331 602314 912863 865946 681336 533483 641090 917649 1053661 985472 973111
12089 973111 1012893 750183 545339 633207 656346 567966 793151 637615 515872 670272
12079 670272 499400 676574 1010398 1138234 1229518 1208486 1439714 1475440 1392019 1249209
12069 1249209 1184659 1194793 1296535 1253250 1081153 1100805 862601 607777 613939 747345
12059G47345k7199N9024o9761k21022O2139J01050O3108R3856l1530N947R688
12048G92645q7489p5157J48729M77888K02364K51962O21038N62913O48962O71115
12038D214970M37174N10444K71220r4108o35289q50558o39541j60575k9279n49443
12028B475015l56410j49594m0740j55305k25271j91432j36766j56863J292p6931
12018I86995n1112L636K75237J26884j65531j09987k21413m0681k45303j18401
12008D40324K59499K86814L87918L82491o0229j79252P9645K07251M29939R28746
11998C163146J205530J568017K040987J822985J141134N91174M27421m36325k153071
11989I370998k806262j982467j240314q27900o07556j58825J44809j48921l59442
$$ plain form
12059 747345 720146 779170 709409 488387 550526 651576 714684 808540 777010 782957 792645
12048 792645 705156 629999 778728 1256616 1458980 1710942 2331980 2894893 3543855 4214970
12038 4214970 4652144 5162588 5433808 5339700 4704411 3853853 3214312 3053737 3024458 2475015
12028 2475015 2118605 1969011 1928271 1772966 1547695 1356263 1219497 1062634 1063926 986995
12018 986995 935883 939519 1214756 1341640 1176109 1066122 844709 804028 558725 440324
12008 440324 699823 986637 1374555 1757046 1696817 1517565 1597210 1804461 2234400 3163146
11998 3163146 4368676 5936693 7977680 9800665 10941799 11532973 11960394 11524069 9370998
11989 9370998 6564736 4582269 3341955 2514055 1906499 1747674 1892483 1743562 1384120
11980A384120j27283J3920n2268o4698J7909K09929o1958r3638k8522n5687o4811
11969A077013j22130q3152q5489j58927J21769K64636k573J51245O9285k21002
11959A010675n6737M39401K68785J18697P94526J290587J634554J922456J822057
11950I245001R03053M57212Q71179M59946j628303k894833k114220j282450p53181
11941C263404o43105m82031n0372J03076j91203m86585l55849L00957m5326p2057
11931A340909L1736j72582l31950k05671p1563K63469M0043k59779O0542J14672
11921H09826l10580k60582L70258P6185j9132j35814k14970L10293M05549M08810
11911A439843K1815K48258O67071O21785N07151O30402K43057J27354L87764l80861
$$ plain form
11980 1384120 1256837 1270757 1218489 1153791 1171700 1381629 1319671 1226033 1197511 1141824 1077013
11969 1077013 954883 871731 786242 627315 749084 1013720 1011147 1162392 1231677 1010675
11959 1010675 953938 1393339 1662124 1780821 2575347 3865934 5500488 7422944 9245001
11950 9245001 10148054 10605266 11476445 11936391 10308088 7413255 5299035 4016585 3263404
11941 3263404 2620299 2138268 2087896 2190972 1999769 1513184 1157335 1458292 1412966 1340909
11931 1340909 1372645 1200063 868113 662442 590879 854348 894391 634612 695154 809826
11921 809826 499246 238664 608922 685107 665975 530161 315191 625484 1031033 1439843
11911 1439843 1461658 1709916 2376987 2998772 3505923 4136325 4379382 4506736 4894500 4513639
11901D513639j090527j007521n25597k19541N6684m34549j57650L41854q6879
11892A389913P0099K44814J6954n5929L3548r1889j23444L079P5667l2641K10818
11881A740989J22376j56317p4674K8975n4719k05830J69298M73139J76419J6208
11871B235864n3400J43766J98859k16975J41844j00669l54419l9836J93685K52983
11861B401702K26210O7685K66014q8943k8067K12762L90490O4237N9492R3677
11851C665259q5189K0394R7228o7694J56897J83465P177K22655K209J82697J34388
11840D519486J82452P4126k3212j20397j7396L28286r8179M43714L72215J45127
11830E806222N2057O2360J3096R1845j89437j1380p2229k3463J82350J77252Q6044
$$ plain form
11901 4513639 3423112 2415591 1889994 1670453 1727137 1292588 1134938 1476792 1389913
11892 1389913 1460012 1704826 1721780 1665851 1699399 1607510 1484066 1487145 1562812 1530171 1740989
11881 1740989 1863365 1707048 1632374 1661349 1606630 1400800 1570098 2043237 2219656 2235864
11871 2235864 2182464 2326230 2525089 2308114 2449958 2349289 1994870 1955034 2148719 2401702
11861 2401702 2627912 2695597 2961611 2872668 2844601 3057363 3447853 3512090 3571582 3665259
11851 3665259 3580070 3600464 3697692 3629998 3786895 3970360 3977537 4200192 4202401 4385098 4519486
11840 4519486 4701938 4776064 4752852 4632455 4615059 4943345 4845166 5288880 5661095 5806222
11830 5806222 5858279 5920639 5933735 6025580 5836143 5824763 5752534 5729071 5911421 6088673 6174717
11819F174717j77413M8849K03468m3333M9060J52586j50940J42985J94329L7161
11809F631469P7205O8306L91731J44039o8618J33009J22942j1627N8348M09046
11799G955850K79342P3416K29755J77336L02063o2735K71576J66683m266k71910
11789I117110j66238L18361L39973J61769J34848k19299l50320r4143L7420k44582
11779I034899j27602m3915O8744K56956J47893K65415j38542k47195m4695o5038
11769I106920M4852K17181L84708o8108j65633J69398K05470j16794K12514K25470
11759A0215978K12194o4747q2789L77253J69499k8741k0409k00694J13137J69888
11749A0860569j6762K31464N6658L1439m88494k52049k7652r1940j68514k74670
$$ plain form
11819 6174717 5997304 6046153 6249621 6206288 6255348 6407934 6256994 6399979 6594308 6631469
11809 6631469 6708674 6776980 7168711 7312750 7244132 7377141 7500083 7488456 7546804 7955850
11799 7955850 8235192 8308608 8538363 8715699 9017762 8955027 9226603 9393286 9389020 9117110
11789 9117110 8950872 9269233 9609206 9770975 9905823 9686524 9336204 9242061 9279481 9034899
11779 9034899 8907297 8863382 8932126 9189082 9336975 9602390 9463848 9216653 9171958 9106920
11769 9106920 9151772 9368953 9753661 9685553 9519920 9689318 9894788 9777994 9990508 10215978
11759 10215978 10428172 10363425 10280636 10657889 10827388 10798647 10778238 10577544 10690681 10860569
11749 10860569 10843807 11075271 11131929 11163368 10674874 10422825 10395173 10303233 10134719 9860049
11739I860049L65870J00037J61062N835N8347o9419J61709L39090j6802Q9585
11729A1055363K12137J92091j12563o6068J32089j88261m40457k76189r2347o4732
11719A0351063j80594m5048j9384j20216l08011k11496j32531l33061P037P3536
11709I081295N5792j44119q7049N4660j89367l29797M1641O2464J99924J00487
11699H845931q9134J67602P29620P09616J60682Q6238L26595L40666Q2397k95966
11689A1064247k4993l64245m35232l9286j39756p5010p8256k65339J5950J17383
11679I775463P40860R28917M23591J62828j34646L79615O73314j202168j877481
11670I870293p30920m14187m57387r4433J7950j46132j95472Q5667J79766P031
$$ plain form
11739 9860049 10225919 10325956 10487018 10492853 10551200 10481781 10643490 10982580 10965778 11055363
11729 11055363 11267500 11459591 11347028 11280960 11413049 11224788 10784331 10508142 10415795 10351063
11719 10351063 10170469 10125421 10106037 9985821 9677810 9466314 9333783 9000722 9007759 9081295
11709 9081295 9137087 8992968 8905919 8960579 8771212 8441415 8483056 8545520 8745444 8845931
11699 8845931 8756797 8924399 9654019 10363635 10524317 10610555 10937150 11277816 11360213 11064247
11689 11064247 11039254 10675009 10239777 10200491 10060735 9985725 9907469 9642130 9658080 9775463
11679 9775463 10516323 11445240 11868831 12031659 11897013 12276628 12949942 11747774 9870293
11670 9870293 9139373 8725186 8267799 8173366 8191316 8045184 7849712 7935379 8115145 8122176
11660H122176J04845K05750J67748K7397m827J39071j08425j37343J96272j32352
11650H580312j84962p210k0766J94801J13703k7421j47451j23580M64216O15741
11640I457383O53411J132103J612423K990915O332149J2259521J9097596K1307892
11632G4843393J7028682O912715M155110J5646613P56951l6269008l0778885j7212221
11624C5083350r429420n624843l573547k545593j962325j587499q42644o84249
11616H833230o97735p18251j32033k46137k48098k32281n24889l5458l05054n23348
11606E169946n1053m1382l47164k68744k66469j27150m1453j0251J62681l27004
11596C851957j25271o1598J2294J87211r6458l57626j70325J4988n7360m50335
$$ plain form
11660 8122176 8227021 8432771 8600519 8627916 8623089 8762160 8653735 8516392 8712664 8580312
11650 8580312 8395350 8388140 8367374 8562175 8675878 8648457 8501006 8377426 8841642 9457383
11640 9457383 10110794 11242897 12855320 15846235 22178384 34437905 53535501 74843393
11632 74843393 91872075 98784790 102939900 118586513 119343464 83074456 52295571 35083350
11624 35083350 25653930 20029087 16455540 13909947 11947622 10360123 9517479 8833230
11616 8833230 8135495 7417244 7285211 7039074 6790976 6558695 6033806 5998348 5693294 5169946
11606 5169946 5118893 5077511 4730347 4461603 4195134 4067984 4026531 4016280 4178961 3851957
11596 3851957 3726686 3665088 3677382 3864593 3768135 3410509 3240184 3255172 3197812 2747477
11586B747477k78215J18340J52298k91291r3043L9096J78524M9580r4947p6493
11576B451326m809L32489J81985j66640j67318k21834J27862L1056j01626p5286
11566B387205J92009N299k04452Q1765k2257j34579o8041m4414J0586M5877j52987
11555B096011l05552J18753P8918j8373m6226j2277Q5575R4680L1442k63736q742
11544A850473l1333k45984j41003O9630R0891l2493j76586J57793K94296o3589
11534A772095k93201O9314M06454l0315m9408j05313L1201J73412j2451k71569
11524A690219O9104K11256J85071j04560j87837L21342L07206K36993M5936j16099
11514B658631j40233o3470l2608n770Q6550r4343L490O3532j01518o4600l6321
$$ plain form
11586 2747477 2469262 2587602 2739900 2448609 2355566 2394662 2573186 2622766 2527819 2451326
11576 2451326 2446517 2779006 2960991 2794351 2627033 2405199 2533061 2564117 2462491 2387205
11566 2387205 2579214 2584513 2380061 2461826 2439569 2304990 2236949 2192535 2203121 2248998 2096011
11555 2096011 1790459 1909212 1988130 1969757 1923531 1911254 1996829 2091509 2122951 1859215 1850473
11544 1850473 1819140 1573156 1432153 1501783 1592674 1560181 1383595 1541388 1835684 1772095
11534 1772095 1478894 1548208 1954662 1924347 1874939 1769626 1800827 1974239 1961788 1690219
11524 1690219 1759323 1970579 2155650 2051090 1863253 2184595 2491801 2728794 2774730 2658631
11514 2658631 2518398 2454928 2422320 2416550 2503100 2408757 2412247 2475779 2374261 2309661 2273340
11503B273340k34073j45818o385J28298J02434j23666o3712J34603J11808k58846
11493A917983J83875L38235j43705K91018M77953J65531K25106K39812K70808
11484C966616K86334j84855K86998M14300M81713O72695J016310K053043L297619
11475A2290773O314595J1883580J9085657K2226067J7200909O361875L955713
11468I9319169J6382128O70077l7625624l0681117j6667112r284051n601254l491912
11460A3020304k025484j251585j126417p92646p25610p11483n09271m89357q19585
11451D568866o59061k19833q4524j02878j76649j55957k11154n0939J72203J42640
11441C222714l79416k39165J04037k5812k27109J51811j22392j83205j08475M0211
$$ plain form
11503 2273340 2039267 1893449 1887064 2015362 2117796 1994130 1930418 2065021 2176829 1917983
11493 1917983 2101858 2440093 2296388 2587406 3065359 3230890 3455996 3695808 3966616
11484 3966616 4252950 4068095 4355093 4769393 5251106 5923801 6940111 8993154 12290773
11475 12290773 18605368 30488948 49574605 71800672 89001581 95363456 99319169
11468 99319169 115701297 116371374 78745750 48064633 31397521 22113470 16512216 13020304
11460 13020304 10994820 9743235 8616818 7824172 7098562 6387079 5877808 5388451 4568866
11451 4568866 3909805 3689972 3605448 3502570 3325921 3169964 2958810 2907871 3080074 3222714
11441 3222714 2843298 2604133 2708170 2682358 2455249 2607060 2484668 2301463 2192988 2233199
11431B233199k16385l22374M8790N791k17830K08754R2195J09275j70673k08977
11421A561765l9657n8372J27019P3171J0760J68115L3611q3957j92479j25807
11411A474169j9039j19514j71548O895O3907j55932k19812k05680P827M58684
11401A119957K09173Q8963n1969l32540L36751L53713o1511r0283k49207l22352
11391A000695K5822P9467L0937j06821j37295J49945J19087J16919n0495L81192
11381A609453m3492l33797k53957m0946k9951K3918L097J11078k15978l63941
11371D65484O346m8649M2779j3697J79854k0677J30350K25930j80568j59919J01934
11360G29167K15581K96785N3038k84328j51709j81445P2770J65638m7283K52117
$$ plain form
11431 2233199 2016814 1694440 1743230 1749021 1531191 1739945 1832140 1941415 1770742 1561765
11421 1561765 1522108 1463736 1590755 1663926 1674686 1842801 1876412 1792455 1599976 1474169
11411 1474169 1455130 1335616 1164068 1170963 1234870 1078938 859126 653446 661273 1119957
11401 1119957 1329130 1418093 1366124 1033584 1370335 1724048 1662537 1572254 1323047 1000695
11391 1000695 1026517 1105984 1136921 1030100 892805 1042750 1161837 1278756 1228261 1609453
11381 1609453 1565961 1232164 978207 937261 907310 931228 934325 1045403 829425 465484
11371 465484 471830 423181 465960 452263 632117 611440 741790 967720 787152 627233 729167
11360 729167 944748 1241533 1294571 1010243 858534 677089 749859 915497 868214 1120331
11350A120331j01395l53930M8081J80314J14345j53862k95425K42225L84189J59218
11340A344091P6309l74759R7034r2898j35515j3148j68880j01129p7695J39357
11330F92767j13534j23980J32925J01462o3538N9462K01326K15517l55098n15643
11320B31666k9957L22985J71653j84960p289j09846R6121J38846k291N3259J85962
11309H66149R856r3779l074l5474M6590k51315j36560K67180K4352k08995o4776
11298D20154N3377K8160M42008k107k56142q3124n0267K00749K26646J7425j84714
11287H12165J445k1216j35744k23586j49946k7915J56704M947J3018J17577o2673
11276D84776N0460J86749M5044J56246N504j45974j26717k40679j6620p828K13694
$$ plain form
11350 1120331 1018936 665006 713087 893401 1007746 853884 558459 800684 1184873 1344091
11340 1344091 1420400 1045641 1142675 1049777 914262 901114 732234 631105 553410 692767
11330 692767 579233 455253 588178 689640 626102 685564 886890 1102407 747309 231666
11320 231666 201709 524694 696347 511387 504098 394252 490373 629219 626928 680187 866149
11309 866149 876005 782226 779152 743678 790268 538953 402393 669573 693925 484930 420154
11298 420154 473531 501691 943699 941592 685450 602326 552059 752808 979454 996879 812165
11287 812165 813610 792394 656650 433064 283118 255203 411907 416854 429872 547449 484776
11276 484776 535236 721985 767029 923275 928779 782805 656088 415409 398789 390961 604655
11265F04655j20378k40643L0614O1133m7349l4248o5426J40043q2744j17582j88443
11254f0368K06601j19744L2561J89407O3621J04985M7643J53470m8299l14246
11244B55631J79993R4771P1515J31316R502k18642n4081J33581m1985L9429K00575
11233H01605j80714j18674j43105k46866J1701J45560L45739j28962l11848Q233
11223A82669K34928K663M16789L78493l14844k00604J14953K2449N2541J67969
11213A058006j07104k30360k36786Q72k6252n1545J15374P0657o7212q1486j67189
11202B76975j08420l1921j9737J23847q4671l01913k20780K29960K85182N04268
11192F52790J05333j34571L85191O0661K87070j63187l6008J21232n21831m62675
$$ plain form
11265 604655 484277 243634 274248 335381 288032 253784 188358 328401 245657 128075 -60368
11254 -60368 146233 26489 59050 248457 312078 417063 464706 618176 569877 255631
11244 255631 435624 530395 601910 733226 742728 524086 470005 603586 561601 601030 801605
11233 801605 620891 502217 359112 112246 123947 269507 615246 486284 174436 182669
11223 182669 417597 420260 837049 1215542 900698 700094 815047 837496 890037 1058006
11213 1058006 950902 720542 483756 484628 458376 406831 522205 592862 525650 444164 276975
11202 276975 168555 136634 116897 240744 156073 -145840 -366620 -136660 148522 652790
11192 652790 758123 623552 1008743 1069404 1356474 1193287 1157279 1278511 756680 294005
11182B94005l1504K24195j8977l1041j2672K38651j53k04908n4690l64499J47049
11171A85456J59568K57998J3973n5473J13577k08477k85766j19099M3389L35747
11161D40893J0587o4768N2385j47711l8784M25697q1183J59984Q3048j13271R215
11150G36092o9605k2568L2150P7748k76503P255J26133o6223k7264j87270k09504
11139A20441R9061J36759J86827j80214j67851N7732Q0845J75411L2365l76572
11129A64804j35941K43354J75873l3649j45790o4531r4587J6990P46M7202N1165
11118B25636Q4122J19668l09199l09804K98831K72015J30249J69263n7257J0570
11108F34094O5302P3128k43704j32376P76k712L8391j10184J91875p7438n5735
$$ plain form
11182 294005 262501 486696 467719 436678 424006 662657 662504 457596 402906 38407 185456
11171 185456 345024 603022 616995 561522 675099 466622 180856 61757 105146 440893
11161 440893 451480 386712 439097 291386 252602 678299 597116 757100 840148 726877 736092
11150 736092 666487 643919 676069 753817 477314 484569 610702 544479 517215 329945 120441
11139 120441 219502 356261 543088 362874 195023 252755 333600 509011 541376 164804
11129 164804 28863 272217 448090 414441 268651 204120 109533 126523 127269 174471 225636
11118 225636 309758 429426 120227 -189577 109254 381269 511518 680781 623524 634094
11108 634094 699396 772524 528820 396444 397220 394508 432899 322715 514590 437152 381417
11097C81417k59345j87269l5607M9253J75550K40105j0952K34009j73094j66675
11087B47392j74337K5043K3376O9273J73189K39649k1622J6870J19287j14197
11077F03923k45890l63245J21979K49893r2200k45931k84612Q5131j16760K81140
11067f572K87641q576r1714K8938M4336k04844L3927L09076J92546J3565K68731
11056H67054K89398J82055k95754o6993k06495M6550L89111M83583k02652l08270
11046A177587r8530J41053J62742r3938o2842j7766J87651K17394J00259J57203
11036A870813K33410K04021k68545l18276l41088J25085J12809K35674P1688J24117
11026B049708K73285L31089L60002J73090K79776j37081q27689n65022p4593Q3680
$$ plain form
11097 381417 122072 -65197 -100804 -51551 123999 364104 353152 587161 414067 247392
11087 247392 73055 98098 121474 190747 363936 603585 581963 598833 718120 603923
11077 603923 358033 -5212 116767 366660 274460 28529 -256083 -170952 -287712 -6572
11067 -6572 281069 272493 180779 209717 254053 49209 83136 392212 584758 598323 867054
11056 867054 1156452 1338507 1042753 975760 769265 815815 1204926 1688509 1485857 1177587
11046 1177587 1079057 1220110 1382852 1288914 1226072 1208306 1395957 1613351 1713610 1870813
11036 1870813 2104223 2308244 2039699 1721423 1380335 1505420 1618229 1853903 1925591 2049708
11026 2049708 2322993 2654082 3014084 3187174 3466950 3329869 2502180 1937158 1862565 1946245
11016A946245L9971k53911J86197L73995k8660k80974k13803l24170n88432j25024
11006G31434J89998j93876J05689p1014l6753J79730K65255J61751k88348j97923
10996H45943N884k28771r1689R8982j87539J70257Q7662M408M60573L43385k15485
10985A293610k75464k49990r6825j25197J69255K7169j68042j31413P519K00615
10975F51237K58729r0742l85166k48584o3158m9350o6186Q1872Q7471K53029K90197
10964G19349k18416k71817n4146r2413p5392L8577O1219j1575k34970K30006Q4838
10953A75260k1401J61201N617J00320j18974k23161J62742K08826O8067K05448
10943G23945Q5619l9473m3243P5778j85275j34598Q3641j57307m8729J33618q3616
$$ plain form
11016 1946245 1986216 1732305 1918502 2292497 2263837 1982863 1769060 1444890 856458 731434
11006 731434 921432 727556 833245 762231 725478 905208 1170463 1332214 1043866 845943
10996 845943 851827 623056 531367 630349 442810 613067 700729 705137 1165710 1509095 1293610
10985 1293610 1018146 768156 671331 546134 715389 742558 574516 443103 450622 651237
10975 651237 909966 819224 434058 185474 122316 72966 6780 88652 176123 429152 719349
10964 719349 500933 229116 174970 82557 7165 45742 106961 95386 -139584 90422 175260
10953 175260 153859 315060 320677 420997 302023 78862 241604 450430 518497 723945
10943 723945 809564 770091 726848 802626 617351 482753 566394 409087 360358 493976 410360
10932D10360J21452j21662k03547j02194J84299l5182j07703m8971q3934J99597
10922B12515L5952J15869K46953j18449l19767k72775q2649K25969J03859j4268
10912A33209J48497l92231n01070K88647K69878J78828j42468j30328n3425M30013
10902B29550O5576l5713o010j45020J36830k60215k72938M0390J75045L5477k0458
10891e7486J82224p0082j47525o5692j4227j5912m8852N5154K86872J81894j78582
10880A07786j89911p9610j3941k12131L5730J99448Q0350L06762M4145K8217n6165
10869B50680m388Q4117q0809k91520L2904O1909J0859Q6678k03683j29047J55370
10858b6930q7159J20791J05831j26130l15164Q3365K43829J04161J32805p6256
$$ plain form
10932 410360 531812 410150 206603 104409 288708 253526 145823 96852 12918 212515
10922 212515 248467 364336 611289 492840 173073 -99702 -182351 43618 147477 133209
10912 133209 281706 -110525 -611595 -322948 -53070 125758 -16710 -147038 -200463 229550
10902 229550 295126 259413 253403 108383 245213 -15002 -287940 -247550 -72505 -37028 -57486
10891 -57486 124738 54656 -92869 -158561 -172788 -188700 -237552 -182398 104474 286368 107786
10880 107786 -82125 -161735 -175676 -387807 -352077 -152629 -72279 234483 278628 306845 250680
10869 250680 246292 330409 249600 -41920 -9016 52893 63752 150430 -53253 -182300 -26930
10858 -26930 -114089 6702 112533 -13597 -328761 -245396 -1567 102594 235399 159143
10848A59143J04608j41715j12691J5845o7579l5251m3889k6373N7171r8794k38163
10837d27688j14212o7441r7070J59600K30630j07854j75203l6356M20307K92993
10827G7706q5950j27871J0734j86164J48609K6266K4464J42782O3815j16911J5048
10816g472j37851o3083k13467O0022J96693P0644O4655k42472J2738K61127q545
10805g011r7042Q851q8136p1446J15675k10563K9510J38440J22414r1536L8752
10794a12092M983j64689j69013k12446J20349K87723L10491k05198j75362K35477
10784g9777M6355r0125q0594q3251k037J57576k08174k30608L49244J43746j37349
10773b14994J8404K84864m7524j12141n0012j03969k46426K16219M8134n43274
$$ plain form
10848 159143 263751 122036 9345 25190 -42389 -77640 -121529 -147902 -90731 -189525 -427688
10837 -427688 -541900 -609341 -706411 -546811 -316181 -424035 -599238 -635594 -215287 77706
10827 77706 -8244 -136115 -125381 -311545 -162936 -136670 -112206 30576 94391 -22520 -7472
10816 -7472 -145323 -208406 -421873 -361851 -165158 -94514 -29859 -272331 -259593 1534 -7011
10805 -7011 -104053 -95202 -183338 -254784 -139109 -349672 -320162 -181722 -59308 -150844 -112092
10794 -112092 -107109 -271798 -440811 -653257 -532908 -245185 65306 -139892 -315254 -79777
10784 -79777 -33422 -123547 -204141 -287392 -289429 -131853 -340027 -570635 -221391 -77645 -214994
10773 -214994 -196590 88274 40750 -71391 -121403 -225372 -471798 -255579 -207445 -750719
10763g50719p4386L59317J45111J82531J39481l7992k15281n0778p8033j42062
10753e22811l925Q1606J1776p9241M9936P6609J2461M2364j78204R4630P2136
10742c42663L2087J64710J74127k21853l18573L252j824k83990P0726Q2921j21202
10731g62282J12621k51819J91466M63630K66403J11420M9968J3951o4575k44108
10721a13325N4216J77728j00470j93751K23311k08484J43756K48993k5207p6632
10711A30135K79331m3381J2886J51757J15981N4579O0799l8493j27208R4121o7096
10700F23411j73897r6451J98269j3349k6414K84829N496j25867p818K90843K11350
10689A170402m87973k06860P3496J38880L5560k9837j05557r8623r6694q1061
$$ plain form
10763 -750719 -825105 -465788 -320677 -138146 1335 -36657 -251938 -302716 -380749 -522811
10753 -522811 -526736 -445130 -433354 -512595 -462659 -386050 -373589 -331225 -509429 -414799 -342663
10742 -342663 -310576 -145866 28261 -193592 -512165 -508913 -510737 -794727 -724001 -641080 -762282
10731 -762282 -649661 -901480 -710014 -246384 20019 131439 181407 195358 130783 -113325
10721 -113325 -59109 118619 18149 -175602 47709 -160775 -17019 231974 206767 130135
10711 130135 409466 366085 378971 530728 646709 701288 762087 723594 596386 690507 623411
10700 623411 449514 353063 551332 537983 511569 796398 801894 676027 668209 959052 1170402
10689 1170402 682429 475569 549065 687945 723505 693668 588111 489488 392794 311733
10679C11733q297j2484m8151j02894m5885j23974J93839J51474Q823j16630M6937
10668B54491J94790n485n2694r503J71940J05612j3995j8439r850K52490L5084
10657I04441R2352P1970J37667K35003K79910j70632k2842L697J69610K82011
10647A983187J65485K72638K80015K36738K71825K65775L90242O79728R03039
10638E448672J020785J102581J257725J222951J341734J049330R16928Q80624
10630A4241330J035420R99744K258593L618125N021883O838171Q997585J1850735
10622E4861586J5165915J7703553J7896912J5747311J3505476J0749063O864880
10615A52494696J795662j054053O87139O678063J5259571K4091187L0696079L1684487
$$ plain form
10679 311733 303436 290952 242801 139907 94022 -29952 163887 315361 324184 207554 254491
10668 254491 449281 443796 391102 381599 553539 659151 645156 626717 616867 869357 904441
10657 904441 996793 1068763 1206430 1441433 1721343 1550711 1527869 1531566 1701176 1983187
10647 1983187 2148672 2421310 2701325 2938063 3209888 3475663 3865905 4545633 5448672
10638 5448672 6469457 7572038 8829763 10052714 11394448 12443778 13360706 14241330
10630 14241330 15276750 16276494 18535087 22153212 27175095 34013266 43010851 54861586
10622 54861586 70027501 87731054 105627966 121375277 134880753 145629816 152494696
10615 152494696 154290358 153236305 153923444 160601507 175861078 199952265 230648344 262332831
10607B62332831K7386171K1117604J4364925L840382j0084799j8018935j4805633
10600B86132546k595660J3433915K7791110L6418428L6507963K8374397J8303487
10593D44366186P072842j0126551l1997631m3723179l8666272k4480088q376329
10586B94068978N318536J3302266J3599952Q368481J890754n860254j7738686
10579C12950027l1360506l7355984l2204920k2272007j2439970n000681j088014
10572A71227945m67925k169222m682409q533931j3737635j8446694k0023144j8411348
10564H4755637j4908871j1034760q143692o374157m862158l707922k845617k797184
10556C0081276k384120j965809j935626j616161j153116j109965j010053j011929
$$ plain form
10607 262332831 289719002 310836606 325201531 329041913 318957114 300938179 286132546
10600 286132546 283536886 296970801 324761911 361180339 397688302 426062699 444366186
10593 444366186 451439028 441312477 409314846 365591667 326925395 302445307 294068978
10586 294068978 299387514 312689780 326289732 334658213 336548967 330688713 312950027
10579 312950027 281589521 244233537 212028617 189756610 177316640 172315959 171227945
10572 171227945 170760020 168590798 163908389 155374458 141636823 123190129 103166985 84755637
10564 84755637 69846766 58812006 50668314 44294157 39431999 35724077 32878460 30081276
10556 30081276 27697156 25731347 23795721 22179560 21026444 19916479 18906426 17894497
10548A7894497r33316p09254o21327o92259p72211p79578m70741m01642o38274
10539A1875895n68246k40424n17311j08431j64882k34500m12814m42259l26593
10530H860435k9745k38178m60724l68672l08141j14816O6267k71706k68123l95916
10520F470681k31409L46893K99769l19419k12722m65252l19740k21846k71722
10511E075233k39651N0114j88088k8630j30897l7137o1474j68940J26974O1498
10501D459002p6686j75894j88620K6195J9507L84j70619P404J0329j98643j7669
10490C694690k95685l06684j59722K38484J02608j8797k3685j81810k32571r1839
10480B724989j63636r1264q9082j6617J59461K70761Q9339q9652j59577j51896
$$ plain form
10548 17894497 16961181 16251927 15630600 14938341 14166130 13386552 12915811 12514169 11875895
10539 11875895 11307649 11067225 10549914 10441483 10276601 10042101 9629287 9187028 8860435
10530 8860435 8830690 8592512 8131788 7763116 7454975 7340159 7406426 7134720 6866597 6470681
10520 6470681 6239272 6586165 6885934 6566515 6353793 5888541 5568801 5346955 5075233
10511 5075233 4835582 4885696 4697608 4668978 4538081 4500944 4439470 4270530 4397504 4459002
10501 4459002 4382316 4206422 4017802 4043997 4063504 4063888 3893269 3900673 3911002 3712359 3694690
10490 3694690 3399005 3092321 2932599 3171083 3273691 3254894 3231209 3049399 2816828 2724989
10480 2724989 2561353 2470089 2381007 2364390 2523851 2794612 2883951 2794299 2634722 2482826
10470B482826j4670M00112q3864j23545J01803j40259l12550n01958J33309M977
10460A946181J4242J56151J10534j35232r0473J28271j09459p7347j77154k69255
10450A496459L566R1980M0936J65049N4604k65716J29929P021l13642R0073j217
10439A499042J30917R8249l21754j6959K18273J14567M6817R0699k60853k3837
10429A575161J04592j48994q9117j32445K44659L50490L46253l2292j81773n2572
10419A983962K1822l1941K58869p6727J56273K59145J56399j19550l59601j04310
10409B144341p3062o4411j79479l7289k67828l81365M8470K56444J12180k35162
10399A322839j96942R6852K5534k27369J63295J71887m7116r8925Q0408k14655
$$ plain form
10470 2482826 2468156 2868268 2784404 2660859 2762662 2622403 2309853 1807895 1941204 1946181
10460 1946181 1960423 2116574 2227108 2091876 2001403 2129674 2020215 1942868 1765714 1496459
10450 1496459 1500025 1592005 1632941 1797990 1852594 1586878 1716807 1723828 1410186 1500259 1499042
10439 1499042 1629959 1728208 1406454 1389495 1607768 1722335 1769152 1859851 1598998 1575161
10429 1575161 1679753 1530759 1441642 1309197 1553856 1904346 2250599 2218307 2036534 1983962
10419 1983962 2005784 1973843 2232712 2155985 2312258 2571403 2727802 2608252 2248651 2144341
10409 2144341 2071279 2006868 1827389 1790100 1522272 1140907 1189377 1445821 1558001 1322839
10399 1322839 1125897 1222749 1248283 1020914 1184209 1356096 1308980 1210055 1290463 1075808
10389A075808N9894K67108Q2801l10093m7697l90042p1417L13774L35401o6879
10379A248658j81708r8004j04774j15202M3364K9061M2135q8387k44018K21848
10369G52973o6989O9885L03677m6042j60962r0440J05884M9334r154J30642r536
10358A029272j01970J14906J15959k31599j91035Q3764j09204M10627L73820O61
10348A495201j84715J42983J42485j55620j38970j03569J66532M9971j18869k74813
10338A020616m851o0082J0717l84394J61711K65595l1551n0418K6577k77253j08419
10327E68248P8307k4947J75056j02699l36835J10951J31100J32352K05882M519
10317I41934L5717j13620j27949j24708r1409M0374K43239J80053q4460l15432
$$ plain form
10389 1075808 1135702 1402810 1485611 1175518 1127821 737779 666362 980136 1315537 1248658
10379 1248658 1066950 968946 864172 748970 792334 821395 863530 775143 531125 752973
10369 752973 685984 755869 1059546 1013504 852542 762102 867986 917320 908166 1038808 1029272
10358 1029272 927302 1042208 1158167 926568 735533 819297 710093 1120720 1494540 1495201
10348 1495201 1310486 1453469 1595954 1440334 1301364 1197795 1364327 1414298 1295429 1020616
10338 1020616 1015765 955683 966400 582006 743717 1009312 977761 927343 953920 676667 568248
10327 568248 646555 621608 796664 693965 357130 468081 599181 731533 937415 941934
10317 941934 977651 864031 736082 611374 519965 560339 803578 983631 899171 583739
10307E83739l2572k3877K59674K0716K23860J91735j54959l49738j14472J43760
10297G47866J17379R6751K20389o7234j22538k03427j23126l2812K244O7503o5321
10286F37674K55634R8912m31899k88363J05784J86174q9197k8920K29552K48808
10276I24159Q2309l19103j75991L0725p750o6831P5815j9041k38170l235L835
10265B86722L765J82985M47626M5032l82869o1690r655L20568J76290N1539J02154
10254A162467j49994m4609k55691k05851K7431j4823k75341j77335P1400J67871
10244C05525J86963L2628K16597J72722J10956n9670m46941j67141j5221o4243
10234B72175L60723J1343j69912j02211n9815j32369J58607J0906m5572M9819
$$ plain form
10307 583739 551167 527290 786964 807680 1031540 1223275 1068316 718578 604106 747866
10297 747866 865245 961996 1182385 1115151 992613 789186 666060 633248 635492 702995 637674
10286 637674 893308 992220 560321 271958 377742 563916 474719 445799 675351 924159
10276 924159 1006468 687365 511374 542099 534349 467518 543333 524292 286122 282887 286722
10265 286722 290487 473472 921098 966130 583261 521571 511916 832484 1008774 1060313 1162467
10254 1162467 1012473 967864 712173 506322 533753 518930 243589 66254 137654 305525
10244 305525 492488 525116 741713 914435 1025391 965721 518780 351639 336418 272175
10234 272175 632898 644241 474329 372118 312303 179934 338541 349447 303875 353694
10224C53694m1032j24972J3746K75656K67285n8399j17364q431J08242j54675
10214E13750k35813l6685J56465k3336J21187J15907J02218j27567n5564L13567
10204H44129J52666j78107k96132j87948R970J43186J143j00041L44025K884j64292
10193E71483r9170j02815K60048O5132l6868n2572k3841J98134j46156r1470M15870
10182I57775J43944j6889j42625N0358J78j58720N2790J41033J64849J06225K89958
10171A588876J77326K03018J94598J32283K64600N9268k31933k09284j27822K5353
10161B076283j32800M3502j14260M5653K39012q41J6165J0784k20187l0527Q5911
10150B018695J94502j85412j5449J22833j63303j16682n1406k50361P182j99376
$$ plain form
10224 353694 312662 187690 201436 477092 744377 685978 568614 560183 668425 513750
10214 513750 277937 241252 397717 374381 495568 611475 713693 586126 530562 844129
10204 844129 996795 818688 522556 334608 344578 487764 488907 388866 732891 735775 571483
10193 571483 472313 369498 629546 694678 657810 605238 581397 779531 633375 541905 957775
10182 957775 1101719 1084830 942205 992563 992741 834021 886811 1027844 1192693 1298918 1588876
10171 1588876 1766202 1969220 2163818 2296101 2560701 2619969 2388036 2178752 2050930 2076283
10161 2076283 1943483 1986985 1872725 1918378 2157390 2156549 2172714 2183498 1963311 1932784 2018695
10150 2018695 2213197 2027785 2012336 2135169 1971866 1855184 1803778 1553417 1560599 1361223
10140A361223l0370o6860L6498j00927Q7259p9781l14180p1198J19790J5237p5779
10129H80912Q9406L2429l76441l50396j25616K80835j50594p3666J2555J09033
10119C28457j10896k79497L3355M67156J98620j38153j16812K01844K32807R0813
10109I07694k01685J07273l278J13553j70733m52416k01481K33292j26637K3860
10099B29442L56189M5769m9860O149J98199M7843j30451j34192J16164p3907l20206
10088B91139m2838P7627J2378o4780j94666k44247J2431J51880K48872O7834l07174
10077H456j11744J14075J26831m4526R8784j28123l9252L16846J24480J44249
10067F10076K13439J96411k40411k82402k65455j91292n1936k405J74459L04015
$$ plain form
10140 1361223 1330853 1263993 1300491 1199564 1286823 1207042 892862 821664 941454 956691 880912
10129 880912 970318 1002747 626306 275910 150294 431129 280535 206869 219424 328457
10119 328457 217561 -61936 -28581 438575 637195 499042 382230 584074 816881 907694
10109 907694 706009 813282 810004 923557 752824 300408 98927 332219 205582 229442
10099 229442 585631 631400 581540 587689 785888 833731 703280 569088 685252 611345 291139
10088 291139 248301 325928 338306 273526 78860 -165387 -152956 -1076 247796 315630 8456
10077 8456 -103288 10787 137618 93092 191876 63753 24501 341347 465827 610076
10067 610076 823515 1019926 779515 497113 231658 40366 -11570 -13975 160484 464499
10057D64499K74662R1879k22655n32443j75724J76796L00852J55722j87998J82484
10047E28074O0507k13583K94188N2092k55276N8498l9214r9626k0358J07777o9104
10036D03975J96390M7922l33667k17473Q0635K5587k1863q0640L4713K2446L54220
10025E12245k16879n3793K13871n4422n7526J10291p1589j86196j09716K30769
10015C17055j80086K064n2747P4070P6768l2848j1947K22183R740J300L53197
10004G78749j61673k78001J16402L60914J84203P8243j50141P6230K00234k85354
9994I19806j95909n8125L8580k62450l17125j33483L08115J17191J21307j56597
9984C81310j39103J54840r4023n238J21245K14006M5699l0758k41271K3820J26045
$$ plain form
10057 464499 739161 831040 608385 75942 -99782 77014 377866 533588 345590 528074
10047 528074 588581 374998 669186 721278 466002 524500 485286 385660 365302 473079 403975
10036 403975 600365 648287 314620 97147 177782 203369 181506 100866 135579 158025 512245
10025 512245 295366 241573 455444 401022 343496 453787 382198 196002 86286 317055
10015 317055 136969 139033 86286 160356 237124 204276 192329 414512 424252 425552 778749
10004 778749 617076 339075 455477 816391 1000594 1078837 928696 1004926 1205160 919806
9994 919806 723897 665772 704352 441902 124777 -8706 299409 416600 537907 381310
9984 381310 242207 397047 303024 297786 419031 633037 678736 647978 406707 430527 556572
9973E56572l56820l05003K16549K74670N2798J43537q6151J21428J30738m7725
9963G00593p8341Q2906o3767k3896J57201l2402j66007j0187M7476J45616j69172
9952E90020K49243J67323m08537Q1902o3254p4518J74027K4859n3292j73913j90083
9941C23777k50178k4717J91612P6201l8457k1726O6703L17801J18646J17659R8488
9930I75809p3059l7504q3140j77695q7788n3944q0668o695J38375O4676j4721
9919E63646j13106k58550J27621J34036r628P3410l3280J9692J71507r9962p4571
9908E00815j21j28397j24931j41943J64275L24500J30326N004k96633l03844J0926
9897A39977J61736O4112Q8259J01876K05927j13978o3819K89722J00263j16659
$$ plain form
9973 556572 199752 -105251 111298 385968 438766 582303 496152 617580 748318 700593
9963 700593 622252 705158 641391 617495 774696 742294 576287 566100 613576 759192 590020
9952 590020 839263 1006586 598049 679951 616697 542179 716206 741065 687773 513860 323777
9941 323777 73599 48882 240494 316695 278238 256512 323215 641016 759662 877321 975809
9930 975809 902750 865246 782106 604411 516623 462679 382011 375316 513691 578367 563646
9919 563646 450540 191990 319611 453647 444019 517429 484149 503841 675348 575386 500815
9908 500815 500694 372297 247366 105423 269698 594198 724524 729528 432895 129051 139977
9897 139977 301713 365825 454084 555960 761887 647909 584090 873812 974075 857416
9887H57416q2606j7659J18913j71392r4326m35759M33464R6137J65736r6666k54916
9876E18342M8449J59106J52223j48327j02259Q9049j04377l13003J50228J25130
9866E74561k55085J59894L12069j10926l02204K5843J77088j49506m0850J23740
9856E14624L63998Q9827k90163K00093l289j20527J27081k41788j19644M2944
9846E63156j26635K38186L45770Q2156j90611l62846l4841L00414O7762J17537
9836A000048r438Q1674L34031k44452o7885R8355M8724j31667R958k4698j51161
9825I43489l3728j10559j2086k05701j42986L9390K51706K25124N2576J51037
9815A158262M7913J54676k16606k96649k54824j49763K04499k1810r3850l753
$$ plain form
9887 857416 774810 757151 876064 704672 610346 174587 608051 704188 869924 773258 518342
9876 518342 566791 725897 878120 729793 627534 716583 612206 299203 449431 574561
9866 574561 319476 479370 791439 680513 378309 404152 581240 431734 390884 514624
9856 514624 878622 968449 678286 878379 875090 754563 881644 639856 520212 563156
9846 563156 436521 674707 1020477 1102633 912022 549176 514335 814749 882511 1000048
9836 1000048 990610 1072284 1406315 1161863 1093978 1192333 1241057 1109390 1119348 1094650 943489
9825 943489 909761 799202 787116 581415 438429 477819 729525 954649 1007225 1158262
9815 1158262 1206175 1360851 1144245 847596 592772 443009 647508 625698 531848 528095
9805E28095J63233K81048J42082O206k37477j32661J03764K05439R8932l7240
9795A121421j23629K60L6176j08064M6648k84279k06503k6426J72943k19289l53402
9784E5856j08K81479m4552l3510J79377r4561L4794K12527J87982m9627J05955
9773H35612K93644J81668m0447j06231k42597k02737r3839n950j03385l1306j55300
9762C29132k19298Q7876J8729J91750k27972K8818J06080K12051P1797K24849
9752H23812Q6644j22818j09323O7874m7835k98428k21457J98806R2489R0809k6993
9741E33580q5448L5913K17547j55710k03993J36219o2372q586q8974R0030K1171
9730D29377q6320j26002P0026J33224n9480J06069Q1120j66307j57987q6068p9431
$$ plain form
9805 528095 691328 972376 1114458 1120664 883187 750526 854290 1059729 1158661 1121421
9795 1121421 997792 998052 1034228 926164 972812 688533 482030 455604 628547 409258 55856
9784 55856 55748 337227 292675 259165 438542 343981 378775 591302 779284 729657 835612
9773 835612 1129256 1310924 1270477 1164246 921649 718912 625073 619123 515738 484432 329132
9762 329132 109834 197710 216439 408189 180217 209035 315115 527166 598963 823812
9752 823812 910456 787638 678315 746189 698354 399926 178469 377275 469764 560573 533580
9741 533580 448132 484045 701592 545882 341889 478108 415736 407150 318176 408206 429377
9730 429377 343057 217055 287081 420305 360825 466894 548014 381707 223720 137652 58221
9719E8221K9777P2858J22224J5653J0300k9250N1071L844m850N4599j00756k28968
9707E4723o9000K55250J22223Q123k20631j33037K76585J42933r8871n0406M1583
9696C29475k66112j02961R4110K04169J33446M536o8899N5019j58566J0438M5590
9685B80245J47970m4316Q6362L8543J21373m1654m04795m24K94118m716k4351
9674D48355J35444L10244j08894k44063l1965K02088O9436j22457m3948K04911
9664H19151k7759k21978k39821k58201j25209M613K26277L53679R7329L20435
9654I48516J77089K25398J92565j73069r8146r800Q936K60253m70639l80508k52267
9643D28328j33595j5875j87099l56985j84503J67500L4876M70900J19688j19630
$$ plain form
9719 58221 87998 160856 283080 298733 309033 279783 330854 334698 329848 384447 283691 54723
9707 54723 -14277 240973 363196 371319 150688 17651 294236 437169 338298 287892 329475
9696 329475 63363 -39598 54512 258681 392127 396663 327764 382783 224217 234655 280245
9685 280245 428215 383899 470261 508804 630177 588523 183728 183304 477422 472706 448355
9674 448355 583799 894043 785149 541086 509121 711209 780645 658188 614240 819151
9664 819151 791392 569414 329593 71392 -53817 -49204 177073 530752 628081 948516
9654 948516 1125605 1351003 1543568 1370499 1272353 1262553 1271489 1531742 1061103 680595 428328
9643 428328 294733 278858 91759 -265226 -449729 -282229 -247353 223547 343235 223605
9633B23605k9615K2371Q6731P3950L15572K47759J2022k28219n9873j23134Q4721
9622F25890K09813j55455k12101K53083K55519O1726n7679j44728J78623N8162
9612A072853r0348l60377l83996k02261q4172K6711K41496K68355j29805K26873
9602E85329L6313l17227J37064j11514J99531R8001j3604k77856j14541J36918
9592C58414m1048l29922j7495L2170J01190P0320j9290p130J56798k27215K79341
9581C56133L45405K5892l43130j05160J05728J16796j84070j94781k53332j3454
9571a43973L07144Q3683m7174n1903K04168j38170n168J55055K41099k3360l7920
9560E43481j56475Q9162J64315J32358j55355j30298P8635r1685k12753J6116
$$ plain form
9633 223605 193990 216361 303092 377042 692614 940373 952395 724176 664303 541169 625890
9622 625890 835703 680248 468147 721230 976749 1038475 980796 836068 1014691 1072853
9612 1072853 982505 622128 238132 35871 -48301 -21590 219906 488261 358456 585329
9602 585329 621642 304415 441479 329965 529496 627497 613893 336037 221496 358414
9592 358414 317366 -12556 -30051 2119 103309 173629 154339 147209 304007 76792 356133
9581 356133 701538 727430 384300 279140 384868 501664 317594 122813 -130519 -143973
9571 -143973 163171 246854 199680 147777 351945 213775 208607 363662 604761 581401 543481
9560 543481 387006 476168 640483 772841 617486 487188 565823 474138 261385 277501
9550B77501j778J77995j40077J42629J38163J21546J27495R5878n05439j52547
9540B81366n0599j8705o8874J52626p2237L1824k25337k04382L64840M79819L31673
9529A002014j995o5479m48767k33343K90224Q7220K5702j28774k94018M58K15695
9518D48937J77902J03210n5260k22094L74077K18492J6275O967j63008j55272
9508G50226m0020J09123l3688J24536j6639P4879j58023l12818J10338K09871
9498H17785Q4572j45291q6361k39921k43768K49243R890m5896K34372r8726j79135
9487C56764M7208k09424L76168K64596Q5034j34297O0927l68642k28967O09J35556
9476C85532K0229k8991r1146K6769L156K82208m5972Q1623M3961q6052p4565J61874
$$ plain form
9550 277501 275723 453718 313641 456270 594433 715979 843474 939352 433913 281366
9540 281366 230767 212062 143188 295814 223577 255401 30064 -174318 190522 670341 1002014
9529 1002014 1000019 934540 485773 252430 542654 629874 655576 526802 232784 233242 448937
9518 448937 626839 730049 674789 452695 826772 1045264 1061539 1068506 905498 750226
9508 750226 710206 819329 785641 910177 893538 968417 810394 497576 607914 817785
9498 817785 902357 757066 670705 430784 187016 436259 446149 400253 634625 535899 356764
9487 356764 403972 194548 570716 835312 920346 786049 846976 478334 249367 249976 385532
9476 385532 405761 376770 285624 312393 315549 597757 551785 633408 677369 591317 516752 678626
9464F78626L79464K1199l8078r5053J09501J9422J09038k21593j98234j3758J80288
9453I30822K74353q6991j40882j45642P1813r44j63141k44432L48295P7509M3008
9442I63768o7855m11405K0452K31930J43031j65915l3578J59158j5232J37481
9432I61835l6593j64025N9032j39197L8122J25865r2708j17623q6200J47152N70273
9421A265933L7499k16589j54617J65751q110k9003J33737o8711j73220n4085j25656
9410G72929p7873p6816P2613j66634J05095L73948l3529k3725o3171M826L4562
9399I22225q2580J32635J27961o0779l09542j16926K46335M37784q1707l29513
9389H85893n0909j01878n8775N4456L04115j06365K29690P3111j69028k01281
$$ plain form
9464 678626 1058090 1079289 1041211 946158 1055659 1075081 1184119 962526 764292 750534 930822
9453 930822 1205175 1118184 977302 831660 903473 902529 739388 494956 843251 920760 963768
9442 963768 895913 484508 504960 736890 879921 714006 680428 839586 824354 961835
9432 961835 925242 761217 820249 681052 719174 845039 752331 634708 548508 695660 1265933
9421 1265933 1303432 1086843 932226 1097977 1089867 1060864 1194601 1125890 952670 898585 772929
9410 772929 695056 618240 690853 524219 629314 1003262 969733 946008 882837 887663 922225
9399 922225 839645 972280 1100241 1039462 729920 612994 859329 1297113 1215406 885893
9389 885893 834984 733106 674331 728787 1032902 926537 1156227 1229338 1060310 859029
9379H59029k69207K1527L25231K15740J5461k43384M7012J06031k17612J85181
9369A045009J59141j0110L9757L7833o0329j95024j1836K23748J21926R6386j12191
9358A334310j12002n8185r0291j0J86256M2770J76613q1038k39310k1697M2458
9347A179874j11167m6092R028Q3352j46280j54023k11558j08346Q1320k3855j69186
9336C83067m3556O9240l6926L30927K00726j71655m45774j31610K04536n6631
9326C02344k73884k0760M58847o6958R9522o7316j92909o2758L32435M5950J5260
9315E69773J96596K90195r3458k80045k70781J2032N2228k36846o9987O5377J9861
9304B54945J66196M50393J2941k35301J05446N0927k02694j73892K64880Q3715
$$ plain form
9379 859029 589822 611349 936580 1152320 1167781 924397 971409 1077440 859828 1045009
9369 1045009 1204150 1194040 1233797 1271630 1211301 1016277 1004441 1228189 1350115 1446501 1334310
9358 1334310 1222308 1164123 1073832 1073822 1260078 1302848 1479461 1398423 1159113 1137416 1179874
9347 1179874 1068707 1022615 1031643 1114995 968715 814692 603134 494788 576108 552253 383067
9336 383067 339511 408751 371825 702752 903478 731823 286049 154439 358975 302344
9326 302344 28460 7700 466547 399589 499111 431795 238886 176128 508563 554513 569773
9315 569773 766369 1056564 963106 683061 412280 424312 476540 239694 169707 235084 254945
9304 254945 421141 871534 884475 649174 754620 805547 602853 428961 693841 777556
9294G77556J41620j11217p2462j70590l47434m27826J60957M48686j61377l87338
9284a49425O3986M61939L72873J74440k415k3116J48009j83457m26676j78645
9274B57513r8711k5744j3695j39791J50449Q3864J45839O8486k5652k48726P5285
9263B29117N903j66785j93544K54585N4065J26776K88717r2833l52303J31720
9253B85418J88436J02234K797K9699J56126j69535j31344K96101J36950k59053
9243F37829j01020q5342n8350J61224L12151Q4062k02905j72246O1837j38922
9233D98318R3209N7242J05231k42544l29584j94798J00037j07361J27619K00533
9223C07902J48815l11398j88015q0306K02142K05117J84926l7720l70056l10463
$$ plain form
9294 777556 919176 807959 735497 564907 217473 -210353 -49396 399290 237913 -149425
9284 -149425 -85439 376500 749373 923813 921398 898282 1046291 862834 436158 257513
9274 257513 158802 133058 119363 -20428 130021 213885 359724 428210 402558 153832 229117
9263 229117 235020 68235 -125309 129276 183341 310117 598834 506001 153698 285418
9253 285418 473854 576088 578885 608584 764710 595175 463831 759932 896882 637829
9243 637829 536809 451467 393117 554341 866492 950554 747649 575403 637240 498318
9233 498318 591527 648769 754000 511456 181872 -12926 87111 -20250 107369 307902
9223 307902 456717 145319 -42696 -123002 79140 284257 469183 431463 61407 -249056
9213b49056k1053m2518l55976m4376K23501O8383l5741K40448q3721K49700K15236
9202A64827j08380k4594M81J83351Q7654l6090l7639j62211j5768Q3063J48919
9191B83613J01016L74399l4675m06296m5069K88867K30915K63373l66302l58166
9181C31675O6281j19350M68Q5492j77776J10580p2592L7525J20446J57009J04116
9170F43874Q1227k95195j75725J66240L2939m4310j31270q3979l6492j57134k23276
9159b23101o5458J27748J07557M12510J76242l13115j89148j6444L95526k72076
9149A40241j30041M52626J08211J58883K70365J8486j72273L17338J17840m83096
9139G98580m59956q5925P76K81361J21312o5998j04286j16831j18830m3358j8582
$$ plain form
9213 -249056 -270109 -312627 -668603 -712979 -489478 -421095 -456836 -216388 -300109 -50409 164827
9202 164827 56447 31853 32334 215685 303339 267249 229610 67399 51631 134694 283613
9191 283613 384629 759028 724353 318057 272988 561855 792770 1056143 689841 331675
9181 331675 397956 278606 279074 364566 186790 297370 224778 262303 382749 539758 643874
9170 643874 725101 429906 254181 420421 453360 409050 277780 193801 157309 175 -223101
9159 -223101 -288559 -160811 -53254 359256 535498 222383 33235 16791 412317 140241
9149 140241 10200 462826 571037 729920 1000285 1018771 846498 1163836 1281676 798580
9139 798580 338624 252699 253475 534836 656148 590150 485864 369033 250203 206845 188263
9128A88263j54527q003K95261R9707J3705j07408M2107K88862m5871j42598j37295
9117C32203j13682O51m109O0115R4171j34375k68599R9251Q9776m9193l7561j04606
9105c5958Q5034R0495j25857j59299R3267l3247O9139M16997j79282m12153k99711
9094d90575J64513J43879K48671L06153J4632L6709k4672k50357m8233J32230
9084B32950n3820j35897m0784J22033K46297m3207l7003j00757j34427j61334
9074a05949k593P1382L05790K66874j18372j68517j78902j72050j13174j36502
9064c52013P2890L72750L66719J34450j92814k65444l75816J07360K29374K32835
9054C30291k3841L3163N9447L7508m8560q8611p1822q8484j35252K45O1347J67021
$$ plain form
9128 188263 33736 25733 320994 420701 434406 326998 369105 657967 612096 469498 332203
9117 332203 218521 219172 215063 275178 369349 234974 -33625 65626 155402 106209 68648 -35958
9105 -35958 49076 139571 13714 -145585 -52318 -85565 -16426 400571 221289 -190864 -490575
9094 -490575 -326062 -182183 66488 372641 387273 423982 399310 148953 100720 232950
9084 232950 179130 43233 2449 124482 370779 327572 290569 189812 55385 -105949
9074 -105949 -108542 -37160 268630 535504 417132 248615 69713 -102337 -215511 -352013
9064 -352013 -279123 93627 460346 594796 401982 136538 -239278 -131918 97456 330291
9054 330291 306450 339613 399060 436568 388008 299397 227575 139091 3839 4084 65431 232452
9042B32452J1621l7472J72020l922J04745j15610J64647k21303j61188k40198
9032i4208j83804J00144J15553M12763L01593m0099l08843k6651J0216m5892j30893
9021A09879l6627M4412j62909k29218O8599L22001M23594o8191k71605L3206J8371
9010B51512K25035P9311p020j88655j29601k70963M2391N623k00958J02474p338
8999i8189J22275K717q040K45264J1261q2193n0487Q0470k49032j42932J69427
8988E41m9585j21771J86645J50203j27031n2602K06597J84N212j56369Q8986r2515
8976C8495M3208k7031K51067K33317r0208j02751k17838l17299Q6485J82916r648
8965G0713l4542K48034J78075k6893p7080l80R4127l52439l44899n2323p2788
$$ plain form
9042 232452 244073 206601 378621 374699 479444 363834 528481 307178 145990 -94208
9032 -94208 -278012 -177868 -62315 350448 652041 611942 303099 276448 286664 240772 109879
9021 109879 73252 117664 -45245 -274463 -205864 116137 539731 471540 199935 233141 251512
9010 251512 476547 555858 548838 360183 230582 -40381 2010 7633 -193325 -90851 -98189
8999 -98189 24086 26803 18763 264027 275288 193095 142608 223078 -25954 -168886 541
8988 541 -49044 -170815 15830 166033 39002 -13600 192997 193181 198393 42024 131010 38495
8976 38495 81703 54672 305739 539056 448848 346097 128259 -189040 -102555 80361 70713
8965 70713 36171 284205 462280 435387 358307 357927 452054 99615 -245284 -297607 -370395
8954c70395J27065L55091j6524O051J02955J35090Q6210K62000K20684k19346
8944F88881k52353L7900J55k49841K18677R7976k32047R6978L85542J76962R9998
8933A068828k12448m54891j49754J94334k0314R4696j98291j60513M0495P4919
8923B77061O8141K32578J00220L12061J5607m11045p7886j43035j79408N9786
8913B54080p8905k19251l316J81939J59478J25136q408K22828J19610o143j47681
8902E99367j171J66565K88184m8445j2372j03333j77207J06511k5070l7894j35099
8891F20036N5894j2608q6499L8599L3951Q2295L4552k00728J0152O0151N4433
8880F90228n2656N1365J42292q9371m0458m9699o9078J14513k25461K3575K7297
$$ plain form
8954 -370395 -243330 111761 95237 101288 204243 339333 425543 687543 908227 688881
8944 688881 436528 474428 474583 224742 443419 541395 309348 406326 791868 968830 1068828
8933 1068828 856380 401489 251735 446069 425755 520451 322160 161647 202142 277061
8923 277061 345202 577780 678000 990061 1005668 594623 516737 373702 194294 254080
8913 254080 175175 -44076 -47392 134547 294025 419161 410753 633581 753191 747048 599367
8902 599367 598196 764761 1052945 1004500 992128 888795 711588 818099 793029 755135 620036
8891 620036 675930 663322 576823 615422 649373 731668 766220 565492 575644 635795 690228
8880 690228 637572 688937 831229 741858 701400 651701 582623 697136 471675 495250 522547
8869E22547J2262j6440P6960j87837J41037J32735L5182L78588j0734L453j2332
8858A075421N0380J94158L71013P5326j48505k15844k15506j26705j2533j28519
8848I18686l10817o5268m0606m9361J44603L07168j12796j31082K615l742k0296
8837F39104j63781j16143J00416j0007j36741m1063J75662P5570o3496j63988
8827B95533k50911R5278J98188J21870P7707r5923j44643J37338J43105J59498
8817G37040P2150r5277l42279j79897k3419J53133j03654j06359k41270o94J38321
8806G795K3913p6714l0152R7158J56667j98591j46595R4540N37659P1916l01435
8795B36161j42187m1724K78324L9794L9963J07421n2384l03671k00821L0159K72457
$$ plain form
8869 522547 534809 518369 595329 407492 548529 681264 716446 1095034 1084300 1087753 1075421
8858 1075421 1125801 1319959 1690972 1766298 1617793 1401949 1186443 1059738 1047205 918686
8848 918686 607869 542601 501995 452634 597237 904405 791609 660527 663142 659400 639104
8837 639104 475323 359180 459596 449589 312848 271785 447447 523017 459521 295533
8827 295533 44622 139900 338088 459958 537665 441742 297099 434437 577542 737040
8817 737040 809190 713913 371634 191737 168318 321451 217797 111438 -129832 -130526 7795
8806 7795 31708 -45006 -75158 22000 178667 -19924 -166519 -71979 465680 537596 236161
8795 236161 93974 52250 330574 370368 410331 517752 465368 161697 -39124 -8965 263492
8784B63492J2655j08578k912j5122O4061M64351J82886j21675l22071K22373J46721
8773G86181p2891p4208J57846R5452j01840r8478k23021j14366r0757L16010K45784
8762H25712J84157j71539k37873K43844J25864n8881p0445j12620J26085r463
8752H44841k20901j34360J57087N9175J79766r9721m59106k81697K68195K47417
8742E60696L04422J43678N0719K6124n0294r4170l21061j45252N245o9950k41267
8731A68890o3637M26384L23475J4196q4690j98604l5344K14891L40399K11764
8721A317724k0846J55794M2317l4566r1909k93008j10893m5080P4708J64112K1694
8710A180047j75435k21046k0763j57082n16171Q2049K15978R4520o6548q6700
$$ plain form
8784 263492 276147 167569 164657 149535 213596 677947 860833 739158 417087 639460 786181
8773 786181 713290 639082 796928 892380 790540 692062 469041 354675 263918 579928 825712
8762 825712 1009869 838330 600457 844301 970165 911284 840839 728219 854304 844841
8752 844841 623940 489580 646667 705842 885608 785887 326781 45084 313279 560696
8742 560696 865118 1008796 1059515 1085639 1035345 941175 620114 474862 480107 410157 168890
8731 168890 105253 531637 855112 869308 784618 586014 550670 765561 1105960 1317724
8721 1317724 1296878 1452672 1494989 1460423 1368514 1075506 964613 919533 994241 1158353 1180047
8710 1180047 1004612 783566 762803 605721 89550 171599 387577 482097 415549 328849
8700C28849m0866K11372J9278j12833k80195j33706K64042K27792j33j22136k75193
8689H6271j71850J98273K25673J03113j35472J04314j46592K06442n1498J8139
8679D36813K27714l5473K52573j55786j85828K53659O0554r0600l6061n2206L07646
8668I83005M45686l08033j99092q5135j7820p0264m3954k80812m5296L99367P3039
8657H50691k65706j71915l038L43180j4533l52643n25480k45518L20626J22146
8647E7810k00518r7871J32449p7682o717K07361J45263j20658J19948O0949k7070
8636A93264j21089k16326J55730o0622J27823K7439K36624J18520k9286O3788
8626D95865M2769K69855N5671k6993j13501R1329M5843R6485r6134k70163p010
$$ plain form
8700 328849 287983 499355 518633 405800 125605 -8101 255941 483733 483600 361464 86271
8689 86271 -85579 112694 338367 441480 306008 410322 263730 470172 418674 436813
8679 436813 664527 629054 881627 725841 540013 793672 854226 763626 727565 675359 983005
8668 983005 1428691 1120658 921566 836431 818611 748347 704393 423581 378285 777652 850691
8657 850691 584985 413070 410032 753212 738679 386036 -139444 -384962 -64336 57810
8647 57810 -142708 -240579 -108130 -185812 -192529 14832 160095 39437 159385 220334 193264
8636 193264 72175 -144151 11579 -49043 78780 106219 342843 461363 432077 495865
8626 495865 538634 808489 864160 837167 723666 814995 860838 957323 861189 591026 584016
8615E84016J19805j3033M0184k34725j34811q34J04070J15194j54384k93594P6838
8604B08726J17062l2270j21278J19315J72800j27524m05044K66850N01476j99216
8594E00897j21724j86237j52906M7855K63095q1234j90564l88636L05196K61131
8584B56873J07530j37541k27874K44930J45636j33279l1333p9528m5648J16022
8574B15788J5967J3873j0888k31329j75936P2212k7585o9997n5057j0638K63246
8563c44K44186J73012q530P7236L8920j0647O0903j66010l00971K22754J9395
8552C49904n4759j72595l83962j42773K77099o1941J84674l4484J17562j11378
8542c2653n5298M6680J77934q2978N7919q6289j28023Q4667J54261N8382J02096
$$ plain form
8615 584016 703821 690788 730972 496247 361436 360602 464672 579866 425482 131888 208726
8604 208726 325788 293518 172240 291555 464355 336831 -68213 198637 700113 500897
8594 500897 379173 192936 40030 87885 350980 269746 79182 -309454 -4258 256873
8584 256873 364403 226862 -1012 243918 389554 256275 224942 145414 99766 215788
8574 215788 231755 245628 234740 3411 -172525 -100313 -127898 -197895 -252952 -263590 -344
8563 -344 243842 416854 408324 485560 524480 513833 574736 408726 107755 330509 349904
8552 349904 295145 122550 -261412 -404185 -127086 -189027 -4353 -38837 78725 -32653
8542 -32653 -87951 -41271 136663 53685 111604 25315 -102708 -18041 136220 194602 296698
8531B96698k89503L3312p9640p7997L55497N4767l7888l08665k12305Q3043K40484
8520E7803j81447l7391j44613Q1937K36041N4554O0669k9152O727Q0835k6196
8509A59767r8199k6239J03636J75206j8427j69934M1518O3058j1387J66810k00470
8498A85339o8509j0272l1556q8603p2540l7410L38818K11444K3303k03066k19210
8487B7738m2495J00879J74654J7480j08650Q1694J64927N0675L0768M9139n8196
8476D88613J971r806j14716J53707J44046P9915k29162j00171K00452k92316j21732
8465B00801l5093Q3728j61901l0210r445N9889L4098J37730R4152p0638K7151
8454C30262K3333J36663J3034j46646q0696N4186j4911J25116q3243n8399m2759
$$ plain form
8531 296698 7195 40507 -39133 -117130 238367 293134 255246 -53419 -265724 -182681 57803
8520 57803 -123644 -161035 -305648 -223711 12330 66884 127553 98401 105128 185963 159767
8509 159767 61568 35329 138965 314171 295744 125810 167328 230386 218999 385809 185339
8498 185339 116830 106558 75002 -13601 -86141 -123551 215267 426711 450014 246948 27738
8487 27738 -14757 86122 260776 278256 169606 251300 416227 466902 497670 546809 488613
8476 488613 490584 480778 366062 519769 663815 743730 514568 414397 614849 322533 200801
8465 200801 165708 249436 87535 57325 47880 107769 141867 279597 373749 303111 330262
8454 330262 353595 490258 503292 356646 275950 330136 315225 440341 357098 298699 255940
8443B55940R3013j30606m20735r5754J75510r5348k3042M9832j44681j67496J77691
8432c25676J01354N6590J48249K26702m44463j03459K61071K42056m8359j64833
8422e0768q3333J11403O2685L8976M1161O4879J06666j03234j22795M22613N70080
8411A058333j82080k24558k02395k70854J92831M14156k5978j64832j75051k653
8401D16919k03686j59184J25652L63805J08152k54857K21779Q64451R30630J239346
8391C653007J956516K247165J724511Q85776P29468J064003j89420k807915k900123
8382F362988j980874r34948k74342J83865P6199l15190p643L07713j40780l39750
8372B937238r3932j3609N63988K45314J92337P5160L10664J91820n45589q17210
$$ plain form
8443 255940 348953 218347 -202388 -298142 -122632 -217980 -241022 -191190 -335871 -503367 -325676
8432 -325676 -224322 -167732 -19483 207219 -237244 -340703 -79632 162424 114065 -50768
8422 -50768 -134101 -22698 39987 78963 120124 185003 291669 188435 65640 488253 1058333
8411 1058333 876253 651695 449300 178446 371277 785433 759455 594623 419572 416919
8401 416919 213233 54049 179701 543506 651658 396801 618580 1483031 2413661 3653007
8391 3653007 5609523 7856688 9581199 10466975 11196443 12260446 12071026 9263111 6362988
8382 6362988 4382114 3447166 3172824 3356689 3432888 3117698 3110055 3417768 3276988 2937238
8372 2937238 2843306 2829697 3393685 3638999 3831336 3906496 4217160 4408980 3863391 3046181
8362C046181q56277o44592k06181R7548N5284p4328j777J24256J61507K27322
8352A928943K5440K35064P13671J463895K309421L573998L926829L394386K208713
8343A9780360J107280K168608O49534m767413o090908m232105k553625j359391
8335D702340r20193n43429n74042n87426k93950r9663J1090J69830k6152M4309
8325A882714k95348k98011m52286J8756O4701M7961j58296M6974K76195K32599
8315A365959n7964p0059j63642k9643k9620m0537r9064J11477N99872L37884K57058
8304B181721J077640J485459J673808J804109J361315O79301P75540N24869j140021
8295A0423741k451980k529082j759998j056966p11123j39700J11866k24160o8262
$$ plain form
8362 3046181 2189904 1545312 1339131 1436679 1491963 1417635 1415858 1540114 1701621 1928943
8352 1928943 1954383 2189447 2903118 4367013 6676434 10250432 14177261 17571647 19780360
8343 19780360 20887640 23056248 23705782 18938369 12847461 8615356 6061731 4702340
8335 4702340 3782147 3238718 2664676 2077250 1783300 1683637 1694727 1864557 1838405 1882714
8325 1882714 1587366 1289355 837069 855825 920526 968487 810191 857165 1133360 1365959
8315 1365959 1307995 1237936 1074294 1044651 1015031 974494 875430 986907 1586779 1924663 2181721
8304 2181721 3259361 4744820 6418628 8222737 9584052 10263353 11038893 11563762 10423741
8295 10423741 7971761 5442679 3682681 2625715 1914592 1774892 1886758 1662598 1594336
8286A594336J73715l47902m7577j70875k53831l37808m00860m3378r149K43935
8276D00606K20317K46046N644j41273l68911k91739M7935j02286J55729J84183
8266C56251J88396k3618L9389k13294j57491j50229j23735J22721l8592L64214
8256C64012J48072K15855j85071m38591k22716q8326K7126L66708J9974Q9763
8246B96806K05352j86539l29916Q4409K14496K48409K4971l61041k21946J84497
8236A59498K32737K8682K21964k8638K24635l3218j62393l18635p2038q6579K48059
8225D14074j4828j54909k40212k55729r8681n647K47825J5760k27283j55785R0211
8214c85204R5384M3853J26945K76635L7448n7825J97999J55720k58892j39253
$$ plain form
8286 1594336 1768051 1420149 1372572 1201697 947866 610058 209198 165820 156671 400606
8276 400606 620923 866969 872613 731340 362429 70690 118625 16339 172068 356251
8266 356251 544647 521029 560418 347124 189633 39404 -84331 38390 -202 364012
8256 364012 512084 727939 542868 104277 -118439 -206765 -179639 187069 207043 296806
8246 296806 502158 315619 -14297 70112 284608 533017 557988 196947 -24999 159498
8236 159498 392235 420917 642881 614243 838878 805660 643267 324632 252594 166015 414074
8225 414074 399246 244337 4125 -251604 -350285 -355932 -108107 -92347 -319630 -475415 -385204
8214 -385204 -289820 -245967 -119022 157613 195061 137236 335235 490955 232063 92810
8204I2810j20304J01306r0558j28990n591j00231N7460K04803K08849k56623q6040
8193a23109O368l19165K67057J84551j67745N6784m8014j26422K40710L36340
8183C07355K26453r8787J020J29138k713n5069l00354p6082j01972k56905O7301
8172a60615L1619j28883J2999K1115J15048n5521r4536J15369K66312M3479j48279
8161A8107J5122M5413K24368p5156O6874l71447k68116j02788J76259J14798K6369
8150a30197O2500L18466M6040p9093J63148j5622m97937l28669J72579J40502
8140a48283K48851J49760J6410o8274j18827k15127J68190J80233O62O7105j60831
8129A19869k49552k33575O6739J64694L24362R3348m2736k75087j5018K75749
$$ plain form
8204 92810 -27494 73812 -16746 -145736 -151327 -251558 -194098 10705 219554 -37069 -123109
8193 -123109 -116741 -435906 -168849 15702 -152043 -95259 -143273 -269695 -28985 307355
8183 307355 533808 435021 436041 565179 562466 507397 207043 130961 28989 -227916 -160615
8172 -160615 -128996 -257879 -244880 -223765 -108717 -164238 -258774 -143405 122907 166386 18107
8161 18107 33229 78642 303010 227854 294728 -76719 -344835 -447623 -271364 -156566 -130197
8150 -130197 -67697 250769 296809 217716 380864 365242 -132695 -461364 -288785 -148283
8140 -148283 100568 250328 266738 198464 79637 -135490 32700 212933 213595 280700 119869
8129 119869 -129683 -363258 -296519 -131825 192537 285885 243149 -31938 -46956 228793
8119B28793J29377O6813k65755k53593j69060l0297K7120L9157j09122J64509
8109a72058k5989L42662J85706q9611J48726P3055K16988M66011N03061J49668
8099A798219O1526M31133K86223J04643k18630m38695k20731k22250j48031l56850
8089A076557J60610J01808j93099k66444p5011l3666j789M7380k49526m32313
8079A34507n6682K27170J58620J65682K16692J36934n04580l81576J16729P8198
8069B91694J27719l0095K62645j5363m7329P5728L3963O8282j41525L1686J43684
8058H01089K01682N20081L80930J87584L99486M45030K94671K3287R8644O7105
8048C419589r9875j95690l73186n17756l67627l13840o8799j5327n5997r9593
$$ plain form
8119 228793 358170 424983 159228 -94365 -263425 -293722 -266602 -227445 -336567 -172058
8109 -172058 -198047 144615 330321 240710 389436 462491 679479 1145490 1648551 1798219
8099 1798219 1859745 2290878 2577101 2681744 2463114 2024419 1803688 1581438 1433407 1076557
8089 1076557 1237167 1338975 1145876 879432 804421 770755 768966 816346 566820 134507
8079 134507 77825 304995 463615 629297 845989 982923 478343 96767 213496 291694
8069 291694 419413 389318 651963 636600 589271 664999 698962 767244 625719 657405 801089
8058 801089 1002771 1522852 1903782 2091366 2490852 2935882 3230553 3253840 3352484 3419589
8048 3419589 3319714 3124024 2750838 2233082 1865455 1551615 1482816 1467489 1411492 1311899
8038A311899O1392k71973m44357j11021K08415p0818j02487K4788j5287j42488
8028D48063L7184j72771m8577K54043J14095j5993m1656j94275Q964j67273j85685
8017C6119J88091J23054M5688J03143J08453J72749J31134o857J4265J65054J20862
8006A201755J89088K02431r9009q9353R8457K57595J06220m99720k08132M1682
7996A201014j27782l14053m532K83878r435j71854m10921l12206K8258Q3048K07688
7985D53103j009L8635j18028P6990J10872j36620J55472J54374n8303m9445j28540
7974D97501O5337m0617j79389j83882P5981M51877J62998j01462k64516l10920
7964A72908J06420j15804K86233P5677k59699p5118J3279J18469o6346k39291
$$ plain form
8038 1311899 1373291 1101318 656961 545940 754355 683537 581050 605838 590551 448063
8028 448063 485247 312476 263899 517942 632037 616044 574388 380113 389077 221804 36119
8017 36119 224210 347264 392952 496095 604548 777297 908431 901574 915839 1080893 1201755
8006 1201755 1390843 1593274 1494265 1404912 1503369 1760964 1867184 1367464 1159332 1201014
7996 1201014 1073232 759179 754647 1038525 1029090 857236 446315 134109 162367 245415 453103
7985 453103 452094 490729 372701 449691 560563 423943 579415 733789 675486 626041 497501
7974 497501 562838 522221 342832 158950 234931 686808 849806 748344 483828 172908
7964 172908 279328 163524 449757 525434 265735 190617 203896 322365 256019 16728
7954A6728j32437P9427J10969R4927J51982j43148L6468p150J67103j56902O4882
7943B82849N2959k30949O7617n7128k55932j72972p5523K44122R4495m3242R4951
7932A247K35697r6988m76397K38862K53836q60k31254j08451j00829m2370K47846
7921g9661j35617O7090J34137J878J46795L67215J5441l20684k96370q1962L977
7910a77761K9941M9352m1351n7938q8495l7516m3187p066J7397J12481J5648p1643
7898c00138J93337M33672j00908r1561Q1142p5181j93539p0930O7983n8575j46856
7887b61554J94486P9428k81189k11730J72492J03387k05279j90643K80826J43337
7877a76439j0750J2504k22271K2423L35893M8144j99081k53690L30054L86053
$$ plain form
7954 16728 -115709 -36282 74687 169614 321596 178448 214916 207766 374869 217967 282849
7943 282849 335808 104859 172476 115348 -140584 -313556 -389079 -144957 -50462 -93704 1247
7932 1247 236944 139956 -336441 -97579 156257 155397 -75857 -184308 -285137 -327507 -79661
7921 -79661 -215278 -148188 -14051 -12173 134622 501837 517278 196594 -99776 -181738 -177761
7910 -177761 -147820 -98468 -139819 -197757 -286252 -323768 -366955 -374021 -356624 -244143 -228495 -300138
7898 -300138 -106801 326871 225963 134402 215544 140363 -53176 -124106 -56123 -114698 -261554
7887 -261554 -67068 12360 -268829 -480559 -308067 -204680 -409959 -600602 -319776 -176439
7877 -176439 -187189 -174685 -396956 -374533 -38640 9504 -189577 -443267 -113213 272840
7867B72840q8053k57227r6608j28227R5320m4818P1960P1579j93827j92402J79188
7856c10275j27637O0944J70168N6407J20426K1429K24967K12677j04514K8573
7846C53165j22097r3522O7556J86984j26751j17363j76522l72243J85307l0469
7836b45955K45590O3376k64381j89045J14156L75283M1703m9504r7735P714M4156
7825D5358J7810r5996r6375k42974j08702J81272K41764O4754j52510j06120Q5690
7814a66029r9523j70518k03169J61239K07416p446L8284N1164J98895J61031j08522
7803F2822k7891j23085k86699J31716k5851j03088R3564O943J41848K12780J343
7792H4402j68182p0714n82000R8153M53778K83j40840Q7370J32568L3572K5876
$$ plain form
7867 272840 184787 -72440 -169048 -297275 -201955 -246773 -174813 -103234 -297061 -489463 -310275
7856 -310275 -437912 -376968 -206800 -150393 -29967 -8538 216429 429106 324592 353165
7846 353165 231068 137546 205102 392086 265335 147972 -28550 -400793 -215486 -245955
7836 -245955 -365 63011 -201370 -390415 -276259 99024 140727 91223 -6512 1202 45358
7825 45358 63168 -32828 -129203 -372177 -480879 -299607 -57843 6911 -145599 -251719 -166029
7814 -166029 -265552 -436070 -639239 -478000 -270584 -278030 -239746 -188582 10313 171344 62822
7803 62822 34931 -88154 -374853 -243137 -268988 -372076 -278512 -271569 -129721 83059 84402
7792 84402 -83780 -154494 -736494 -638341 -184563 -184280 -325120 -237750 -105182 -71610 -45734
7781d5734J7953j41136j18346N3493j09364j43362k7862J95198L10985j22310
7771a30485r5048K9615j81201m7365Q4638J49685j30863Q9675J09746j87137r3895
7760d02635K95885q4599J76121J43679j66466l67648q857m9295J24900J93822
7750a45093J80923j22933k92769j40647k1744j12801J31457K39218M84717j59283
7740D1045n90638j95805o8301L37754L49840L8505r0298K4685J01822j76649j59982
7729c88022o5628p6906J08273L55153J46616K9306P306k3574p546l34378j92597
7718d41997R0657M38744J97581m6713j63516p9807j40443n5470n757q96K49881
7707D2264J30446j76939n6900n9529m3404r4655J48683J88805J21014j96474k32196
$$ plain form
7781 -45734 -27781 -168917 -287263 -233770 -343134 -486496 -514358 -319160 -8175 -130485
7771 -130485 -225533 -195918 -377119 -424484 -339846 -190161 -321024 -231349 -121603 -308740 -402635
7760 -402635 -106750 -191349 -15228 128451 -38015 -405663 -414520 -463815 -338915 -145093
7750 -145093 35830 -87103 -379872 -520519 -542263 -655064 -523607 -284389 200328 41045
7740 41045 -549593 -745398 -813699 -475945 -126105 -87600 -177898 -153213 -51391 -228040 -388022
7729 -388022 -453650 -530556 -422283 -67130 79486 108792 116098 92524 84978 -249400 -441997
7718 -441997 -351340 87404 284985 238272 74756 -5051 -145494 -200964 -206721 -207617 42264
7707 42264 172710 -4229 -61129 -120658 -164062 -258717 -110034 78771 199785 3311 -228885
7696b28885J95102J95753l1541j44980l34743K14678J95978J35544k11688n1538
7686f6320M4441j03204k69255j59474N3701K30850K15499k6025L3511N3477p3204
7675f6003j23588m7019J02685j56040q6362J83430J87617n9056k57278l63673
7665f85287K74901J59574J03173k43766k7382j2449k03337j0016o0220R7310M7492
7654e60007J54315l8064O134K68700K63689j76652R6916J76472j34543l69572
7644c12612q6681K00010K29819L2224m6594j7052l0902J01978n3327j05654p2639
7633a61430j69995J02335K53167N95712L8034m03431k76383j51044m2047k47788
7623d62870N823J38240K28890N8236j00150J8037J02538K87254o4156l6766j45083
$$ plain form
7696 -228885 -33783 161970 130429 -14551 -349294 -134616 61362 196906 -14782 -66320
7686 -66320 -21879 -125083 -394338 -553812 -500111 -269261 -53762 -79787 -46276 7201 -66003
7675 -66003 -189591 -236610 -133925 -289965 -376327 -192897 -5280 -64336 -321614 -685287
7665 -685287 -410386 -250812 -147639 -391405 -418787 -431236 -634573 -644589 -704809 -607499 -560007
7654 -560007 -405692 -443756 -437622 -168922 94767 -81885 15031 191503 56960 -312612
7644 -312612 -399293 -199283 30536 62760 16166 -886 -31788 70190 16863 -88791 -161430
7633 -161430 -331425 -229090 24077 619789 657823 254392 -21991 -173035 -215082 -462870
7623 -462870 -457047 -318807 -89917 -31681 -131831 -113794 -11256 275998 211842 175076 29993
7612B9993K5144Q9606l14427k12509L1496K18790O218K3198L7586p82J51305j34404
7600d8786k07508n8615J28087J07847J31760J67572J78559O5258k09355j29282
7590A25537J93320J15167L1921j0943p2024k69916k52030k06467L729O3282O4983
7579b13441j29886o6313Q4498J89806P3236L00074N753j83001k88815n1062K5239
7568b53912M7290K72250k3702k50746L44651n8810J00945J78307J03527l95537
7558F4263j40777q3469n6294j84017Q0416K35999j26501k42595K29736K72329
7548D9090J80237k66343k30691j8489Q892l599K48852j18219j04537l3291j83355
7537d71453R2644j28593Q5942p2481m962K7088j94629j98010j24941Q6777L36984
$$ plain form
7612 29993 55137 144743 -169684 -382193 -350697 -131907 -125689 -102491 -64905 -65687 85618 -48786
7600 -48786 -256294 -314909 -186822 -78975 52785 220357 398916 464174 254819 125537
7590 125537 318857 434024 465945 455002 382978 113062 -138968 -345435 -341706 -278424 -213441
7579 -213441 -343327 -409640 -325142 -135336 -62100 237974 243727 60726 -228089 -279151 -253912
7568 -253912 -206622 65628 41926 -208820 135831 77021 177966 356273 459800 64263
7558 64263 -76514 -159983 -216277 -400294 -319878 -83879 -210380 -452975 -223239 49090
7548 49090 229327 -37016 -267707 -286196 -277304 -280903 -32051 -150270 -254807 -288098 -471453
7537 -471453 -378809 -507402 -421460 -493941 -498903 -471815 -666444 -864454 -989395 -902618 -565634
7526e65634J21468J34967m9741m1042j80858j0166K57234M01640O4110j21617
7516A0361k60450p8816j48573J77915r123j97626q9010L09111L07029N8361q9332
7505a0153j67773r8138P194r5836R4354J72210P8930o9019j4371J73495j24814
7494e3921j465J09892k13135l29491J49664j9870j33431N547K34249r9026p7773
7483d28760J19286J52125p0802l6506q0478j41859l6304N1210o1002j40048m2739
7472g15877Q8839J46922j9574N0733K74023o8595j53955L9422K45687j30069k45286
7461d87730r1667J82687J13787j50183K73964L60433R8959Q354m0481j10047k31195
7450g3119k7690o7237j40960j46468k7849K36494K38876j808p9693p0109J11866
$$ plain form
7526 -565634 -444166 -309199 -358940 -399982 -580840 -591006 -333772 67868 131978 10361
7516 10361 -250089 -328905 -477478 -299563 -308686 -506312 -595322 -286211 20818 79179 -10153
7505 -10153 -177926 -276064 -268870 -364706 -270352 -98142 -19212 -88231 -102602 70893 -53921
7494 -53921 -55386 54506 -158629 -488120 -338456 -358326 -491757 -486210 -251961 -350987 -428760
7483 -428760 -309474 -157349 -228151 -264657 -345135 -486994 -523298 -472088 -533090 -673138 -715877
7472 -715877 -627038 -480116 -499690 -448957 -174934 -243529 -397484 -358062 -112375 -242444 -487730
7461 -487730 -579397 -396710 -282923 -433106 -159142 201291 300250 308604 268123 158076 -73119
7450 -73119 -100809 -168046 -309006 -455474 -483323 -246829 -7953 -9761 -89454 -159563 -47697
7439d7697P5997r6960o1931k7633j35263M1616K29964J67633o47R5000j55294
7428H4785k57761J31182r2555j36501J77471N9496l33145q4834o3177j9709Q754
7417e25994J40968o7147Q8787k13773J19641o5015Q5646j01790L6766p661l4404
7406e43976n2268j22306Q9265K27936p860l5827Q3144L31516N1984K4824q9172
7395d2740r6165k42134J63106K38240m47193K12043J81642l588J66330K2228l09427
7384a57658Q6798K27213j56333k61807J10738J20734M2076q397L51660j08490
7374B46534k30331m5602m3551J10536P4449j39273j49652J51959j72654r2790
7364b90375P2450L053j88160l38205K52281L84309j0136k88482j2134J23679K04446
$$ plain form
7439 -47697 28300 -68660 -130591 -158224 -293487 -251871 -21907 145726 145079 240079 84785
7428 84785 -172976 -41794 -134349 -270850 -93379 -33883 -367028 -451862 -515039 -534748 -525994
7417 -525994 -385026 -452173 -363386 -577159 -457518 -522533 -436887 -538677 -501911 -509572 -543976
7406 -543976 -596244 -718550 -629285 -401349 -409209 -445036 -361892 -30376 21608 46432 -42740
7395 -42740 -138905 -381039 -217933 20307 -426886 -214843 -33201 -36789 129541 151769 -157658
7384 -157658 -70860 156353 20 -261787 -151049 -30315 11761 3364 355024 246534
7374 246534 16203 -29399 -72950 37586 112035 -27238 -176890 -24931 -197585 -290375
7364 -290375 -217925 -214872 -403032 -741237 -488956 -104647 -114783 -403265 -415399 -291720 -87274
7353h7274J14892J56344k09634k79282N1651J21858k9523r1802j21866j15275
7343d89911J64491J62660o0480n1889J19676j21866J9335j0275m3325L3735K11269
7332f6580m9753k1747J67123K49175J20054k18992k50664k28098Q07R4887K15820
7321A2032m4688j71106j19644J61936K08001R0514j08745K09890m8590m84386
7311b94786o7994l3509j02042j37973K07021J6067J34594J01303L57607Q0344
7301B60632O3583k66250k56997O5140L82042K14650j74908J4002K768j00997j01671
7290A01994p2444j8783l66334r6731K74416K352Q9922j05128M7209Q2251N9077
7279b199j42548K18662N8075k7275k29554p2300L57512m2574j07113N5280K2276
$$ plain form
7353 -87274 27618 183962 -25672 -304954 -253303 -131445 -160968 -252770 -374636 -489911
7343 -489911 -325420 -162760 -223240 -275129 -155453 -277319 -257984 -268259 -311584 -277849 -66580
7332 -66580 -116333 -138080 29043 278218 398272 179280 -71384 -299482 -298675 -203788 12032
7321 12032 -32656 -203762 -323406 -161470 46531 137045 28300 238190 189600 -294786
7311 -294786 -362780 -396289 -498331 -636304 -429283 -413216 -278622 -177319 180288 260632
7301 260632 324215 57965 -199032 -133892 248150 462800 287892 301894 304662 203665 101994
7290 101994 29550 10767 -355567 -452298 -177882 -175530 -85608 -190736 -143527 -61276 -2199
7279 -2199 -144747 73915 131990 104715 -124839 -197139 160373 117799 10686 65966 88242
7268H8242r1639p8219k21968j55026O1008m3250j98641j81885L82808J39271q4241
7257c83540K91143J4109r119Q0282Q5643r8475o7908l76111o3569j25088J74653
7246d77980M03839M95897q5764n24914j19755J21326K02143j37103k54498j3369
7236c90178L59862K25725m9414j92396j49212l53096k95364L48783M97199k6828
7226b4919k79101l26982Q7439J99698L15687j74359k70791p4979J06442K33549
7216b08316Q6672j94007j8408J3791j85641k3948K03250J72798K93261J29546
7206B68998K86007k0236k05232j23014j71913m4207l2546K72524r1592j92153
7196e3364L9151K58822j56479o9549j64138j49869q998J42633Q2800P6374l96653
$$ plain form
7268 88242 -3397 -81616 -303584 -458610 -397602 -440852 -639493 -821378 -438570 -299299 -383540
7257 -383540 -92397 -78288 -87407 -7125 78518 -19957 -87865 -463976 -527545 -652633 -477980
7246 -477980 -74141 421756 335992 -188922 -308677 -187351 14792 -122311 -376809 -390178
7236 -390178 -30316 195409 145995 -46401 -195613 -548709 -844073 -495290 1909 -24919
7226 -24919 -304020 -631002 -543563 -343865 -28178 -202537 -473328 -548307 -441865 -208316
7216 -208316 -121644 -315651 -334059 -320268 -505909 -529857 -326607 -153809 139452 268998
7206 268998 555005 534769 329537 206523 34610 -9597 -42143 230381 138789 -53364
7196 -53364 -14213 244609 88130 18581 -145557 -295426 -304424 -161791 -78991 -2617 -399270
7185c99270J4596m5855K35424K11422k86348j34742m7610q3395k11535q7655J90318
7174f44650J73469j76767K9124m8026J20615L65619J79301R8938j70656j46280
7164b19313j09047k48351p2186L02135M69915L57775j45057l61745k47614m2397
7154c15885K14963m8750L2482q9937j43229J8483p9528j51391R7797L8823J19830
7143c06342P5811k95683o6233L8378L6545K45606J94728q2986q5854Q7209p834
7132a66655M1287j25878p7131r901M7399N2343L1986k6661O6940L4931K2193j02610
7120b11757l6276K14163k3864l19131j16235J01159L08134P9357K15767j03243
7110A08074J7928j02741K5419l06758j55727n6386J0839J22785j20470N9393p0005
$$ plain form
7185 -399270 -384674 -430529 -195105 16317 -270031 -404773 -452383 -535778 -747313 -834968 -644650
7174 -644650 -471181 -647948 -618824 -666850 -546235 -180616 -1315 97623 -73033 -219313
7164 -219313 -328360 -576711 -648897 -346762 123153 480928 335871 -25874 -273488 -315885
7154 -315885 -100922 -149672 -117190 -207127 -350356 -331873 -411401 -562792 -464995 -426172 -306342
7143 -306342 -230531 -526214 -592447 -554069 -517524 -271918 -77190 -160176 -246030 -158821 -166655
7132 -166655 -125368 -251246 -328377 -338278 -290879 -238536 -206550 -233211 -166271 -131340 -109147 -211757
7120 -211757 -248033 -33870 -57734 -376865 -493100 -391941 -83807 -4450 211317 108074
7110 108074 126002 23261 48680 -258078 -413805 -470191 -459352 -336567 -457037 -397644 -467649
7099d67649R7738K51468n4623j08389j39296o8862o764k77058j11564N20357L44627
7088b0015j36491l71927k2934Q5816K37567K57968K13842M5316k30464j87512
7078a28834R2377q079k9883n919j92292j32913j29063j41784Q3475k3168j10555
7067g26638J06486K1333J49438K09741J04676j40149l73373j12967J50640K08629
7057d02184K87017J58039K6938P3140j1033K0518j00297j04026j51067R6859J48789
7046D2693j57583j26220Q7454J53999K733J1592j11071j53482k15576j42960J01230
7035e07191K32550K08901q0485l39310r6517k42861O6380J30389j33646J08983
7025f52807J81774N4889J06712K07510J07233j34316J26423j85435j53682K04166
$$ plain form
7099 -467649 -369911 -118443 -173066 -281455 -420751 -489613 -496377 -773435 -884999 -364642 -20015
7088 -20015 -156506 -528433 -551367 -465551 -227984 29984 243826 289142 58678 -128834
7078 -128834 -36457 -44536 -74419 -80338 -272630 -405543 -534606 -676390 -592915 -616083 -726638
7067 -726638 -620152 -598819 -449381 -239640 -134964 -275113 -648486 -761453 -610813 -402184
7057 -402184 -115167 42872 69810 142950 131917 152435 52138 -51888 -202955 -106096 42693
7046 42693 -114890 -241110 -153656 343 3076 14668 -96403 -249885 -465461 -608421 -507191
7035 -507191 -274641 -65740 -146225 -485535 -582052 -824913 -758533 -628144 -761790 -652807
7025 -652807 -471033 -416144 -309432 -101922 5311 -129005 -2582 -188017 -341699 -137533
7015a37533N5495r3962L42600J49737k54677J89116K18205k23917p423n8767k36174
7004e7300j03644j89584k95255j80112j59605P9346r166J36123K28208K70343
6994b80646K2643m0088j70687Q9422K42907J12776N7831J27830j1791N1034k11070
6983i839n50862J86738L9769J39899p6420J8227Q6076K88112J54965K0237l66464
6972f9562m05311R6705p2641O178R38j48584k826K56023O5173J32073Q4290j7465
6960g5009j3602N3791q5305K07082K21642j54137k02816m05578j70218O0021L22533
6949b41596o8822k72538k5969K0997K5283j28326j3577K75628K28572N7917J13072
6938b9359N7629l1526N1234k8329P9014R2234L7453j67029j56521O2407m735l30328
$$ plain form
7015 -137533 -82038 -176000 166600 316337 61660 250776 468981 245064 237641 178874 -57300
7004 -57300 -160944 -350528 -645783 -825895 -985500 -906154 -915320 -779197 -550989 -280646
6994 -280646 -258003 -298091 -468778 -379356 -136449 -23673 34158 161988 150197 201231 -9839
6983 -9839 -560701 -373963 -334194 -194295 -270715 -252488 -166412 121700 276665 296902 -69562
6972 -69562 -474873 -378168 -450809 -444631 -443693 -592277 -595103 -339080 -273907 -141834 -57544 -75009
6960 -75009 -88611 -34820 -120125 86957 308599 154462 -48354 -453932 -624150 -564129 -241596
6949 -241596 -310418 -582956 -608925 -587928 -562645 -690971 -704548 -428920 -200348 -142431 -29359
6938 -29359 28270 -3256 47978 19649 98663 190897 228350 61321 -95200 -32793 -37528 -367856
6926c67856k93921R3658K45887K75723O6623j40165l6696J31212o0190r8625j39638
6915c23988n0882J46297j06918L5006R8256R2058J17821M9900l3202j80575j53659
6904c09886J35803L06951k5581k00298k65427l7052J427J92810J67596m3436J76894
6893I9801j64370j61512K78414K38440j87360J0551L3619N0767K50431k64107
6883A84674j93303J19289k553O0374j5681k01785p7548j5559j81842m7804J78995
6872a92743j46790J19038j40258j28540J47631R0757j75450L7756J00420J24726
6862a63453J26946j47351k01365N0018N7132m0801L69498J47948L2484j69896
6852F1160j7347n4132L4044k6231J07069j9181m60324m02283K15860L2781J16897
$$ plain form
6926 -367856 -661777 -568119 -322232 -46509 20114 -120051 -156747 -25535 -85725 -184350 -323988
6915 -323988 -374870 -228573 -335491 -300485 -202229 -110171 7650 57550 24348 -156227 -309886
6904 -309886 -174083 132868 107287 -93011 -358438 -395490 -394063 -201253 -33657 -77093 99801
6893 99801 -64569 -226081 52333 290773 103413 113964 147583 198350 448781 184674
6883 184674 -8629 110660 108107 168481 152800 -48985 -126533 -142092 -323934 -371738 -192743
6872 -192743 -339533 -220495 -360753 -489293 -341662 -250905 -426355 -388599 -288179 -163453
6862 -163453 -36507 -183858 -385223 -335205 -278073 -318874 50624 198572 231056 61160
6852 61160 43813 -10319 23725 -2506 104563 85382 -374942 -777225 -561365 -528584 -411687
6841d11687K78132K47790m2217l09390j82641p8387P5583k5297K9265o9821m1507
6830e30177M737O2669J93974L58174J75817j2224J57825K4022k05826j15307j13267
6819D17K2288K00583j6266k68462k65165k41731K92079J46062j60544l84752O3017
6808f12474J77436J76936J138K24996J98406j06871n3325k46853l3166r3521J30634
6797b36664j03343P3891L24402J37908j99970k26770K8628j3513n1154K39349
6787b7236K03945l49499k73111M204o1788K14185J39687K73290J94842l01339
6777A7180l6531O7119l2727j27284p0788k09531p6394j08666j08145L35989p8582
6766d28360O4842L34599p5272j06492J15513n0254J02292N7587q3397j01476l0031
$$ plain form
6841 -411687 -133555 114235 72018 -237372 -420013 -498400 -422817 -448114 -418849 -488670 -530177
6830 -530177 -525440 -462771 -268797 89377 265194 252970 410795 434817 228991 113684 417
6819 417 22705 223288 207022 -61440 -326605 -568336 -276257 -130195 -290739 -675491 -612474
6808 -612474 -435038 -258102 -256964 -31968 166438 59567 6242 -240611 -273777 -367298 -236664
6797 -236664 -340007 -266116 58286 196194 -3776 -230546 -201918 -215431 -266585 -27236
6787 -27236 176709 -172790 -445901 -441697 -503485 -289300 -149613 123677 318519 17180
6777 17180 -19351 47768 15041 -112243 -183031 -392562 -468956 -577622 -685767 -349778 -428360
6766 -428360 -363518 -28919 -104191 -210683 -95170 -145424 -43132 14455 -68942 -170418 -200449
6755b00449m2145j66864n5367L79839M43457J02887l01794K6621l451l32660l54902
6744e04828o1736L17400Q4942q3177P4332J73344j86468J21037M0179j31370j11729
6733b68074l4774P7618P4022J91933L8847o0217j5901m7164j52346k60079M89230
6722C3095R9631k04141j72895K17182J9752j59773R990j03215J08905L8159k22776
6711c36086k7937J59195J86237R3316R5547O5717J13243l15941j35469J86922
6701H4744j57369j21460K32959j09425j83587j62301N2776K82499L10467q007
6691B21296j37585k99633k02084j32666P8050J47557K60567J62586J83237k18307
6681F3018k51262o2577k518N5292J19850J03468j43314M1245K23812k8240k01473
$$ plain form
6755 -200449 -242594 -409458 -464825 -84986 358471 461358 159564 186185 182734 -149926 -504828
6744 -504828 -566564 -249164 -164222 -247399 -173067 277 -186191 -65154 -24975 -156345 -268074
6733 -268074 -302848 -225230 -151208 40725 79572 19355 3454 -43710 -196056 -456135 33095
6722 33095 132726 -71415 -244310 -27128 -7376 -167149 -157159 -260374 -151469 -113310 -336086
6711 -336086 -364023 -204828 -18591 74725 170272 235989 349232 33291 -102178 84744
6701 84744 -72625 -194085 38874 -70551 -254138 -416439 -363663 -81164 229303 221296
6691 221296 83711 -215922 -418006 -550672 -472622 -325065 -64498 98088 281325 63018
6681 63018 -188244 -250821 -253339 -198047 -78197 25271 -118043 -76798 147014 118774 -82699
6670h2699K4036j3155k22435o347j56285Q7890K9866K27057o5654m0270N3313
6659a64683J72622J4785Q4634m2220j80170l41213q5988K27845p2199q7577j24856
6648e99020k1371K23345P623k4341l8979k87061L5437J26663N7318M0579P9653
6637d00154L58104k49971p2966L9712M4574J25314J09266j0611l7221k45750k45254
6626e84957O9956j3654J80881J08124M1609j7029P6877j33635q1395J76744R7471
6615g9008N9103k17974k03206M571q0427j00731K05913J84116J10610J17920R2992
6604I3879N2608m4656K4295Q580l70325l88237J85468R9383L1686L09536N924
6593H141j99070j33092O7778P8713j15532N7662J07217K74406J53038q2203j53817
$$ plain form
6670 -82699 -58663 -71818 -294253 -300600 -456885 -368995 -339129 -112072 -177726 -217996 -164683
6659 -164683 7939 22724 107358 65138 -115032 -456245 -542233 -314388 -386587 -474164 -599020
6648 -599020 -620391 -397046 -389423 -413764 -452743 -739804 -704367 -577704 -520386 -479807 -400154
6637 -400154 -42050 -292021 -364987 -325275 -280701 -155387 -46121 -56732 -93953 -339703 -584957
6626 -584957 -515001 -528655 -347774 -239650 -198041 -215070 -138193 -271828 -353223 -176479 -79008
6615 -79008 -19905 -237879 -441085 -436514 -516941 -617672 -411759 -227643 -117033 887 93879
6604 93879 146487 101831 126126 134706 -235619 -623856 -438388 -339005 -307319 2217 8141
6593 8141 -190929 -324021 -256243 -177530 -293062 -235400 -128183 146223 299261 217058 63241
6582F3241j32479k92402k60604K09121L43313M61313o678k01552k50306j86713
6572b53746k66483P2575J68105j21279j69704M8483J7370J35104K97268m455r8492
6561a75254J32601j34380k31565j61643K09680K3016j09307j17292L9430J54278
6551c70436j31217J2635j92513j24474K08060K07820r0313j23656L4914J67006
6541d02174j05309p264K34585Q5960J67886l1627O5407l4886j00327j83695J58186
6530a53258J61497J827k10317k68435r100J80258J76513j39875j95494J62885
6520b93499P3771J76336J97533k15894j93680O943J18382j89062k52521m4183
6510f15874J77250M2701L55156K28231k52885N831j34889m0683J93586M02706
$$ plain form
6582 63241 -69238 -361640 -622244 -413123 -69810 391503 384825 183273 -67033 -253746
6572 -253746 -520229 -447654 -279549 -400828 -570532 -522049 -504679 -369575 -72307 -76762 -175254
6561 -175254 -42653 -177033 -408598 -570241 -360561 -337545 -446852 -564144 -524714 -370436
6551 -370436 -501653 -489018 -681531 -806005 -597945 -390125 -480438 -604094 -569180 -402174
6541 -402174 -507483 -514747 -280162 -194202 -26316 -57943 7464 -27422 -127749 -311444 -153258
6530 -153258 8239 10066 -200251 -468686 -477786 -297528 -121015 -260890 -456384 -293499
6520 -293499 -219728 -43392 154141 -61753 -255433 -248490 -130108 -319170 -571691 -615874
6510 -615874 -438624 -395923 -40767 187464 -65421 -59590 -194479 -235162 -41576 361130
6500C61130J86963j32842l18232o40594k19988K15338j1027K87762K90549j27237
6490a08178j05223j70737O3738K4250o095J8149K34593K2156L70844j97361k29280
6479h3144j87193J65782j52868j38695r040J6458J71830L19877R5791L8451l02814
6468f5565p2112L0322J14010m60991j01681k823r3991m8074J12148N6638m2961
6457e75080L51026K64098l0660j69544K21869K60119J02535j59022o195j6505
6447B42641J56333j50194j47318q3049o9838k20970j09674K92043o1408J2964
6437a38470Q1730m8684J01787r2044j53698j94496L31893M63165l1008k06678
6427A13497j47242M4862k375j49200k41205M3361J89525o8494k55153J7218M58711
$$ plain form
6500 361130 548093 415251 97019 -543575 -763563 -548225 -559252 -271490 19059 -108178
6490 -108178 -213401 -384138 -320400 -296150 -302245 -284096 -49503 -27347 343497 146136 -83144
6479 -83144 -270337 -104555 -257423 -396118 -405158 -388700 -216870 103007 198798 237249 -65565
6468 -65565 -137677 -107355 6655 -454336 -556017 -558840 -652831 -700905 -588757 -532119 -575080
6457 -575080 -224054 40044 9384 -160160 61709 321828 424363 265341 259146 242641
6447 242641 398974 248780 101462 18413 -51425 -272395 -382069 -90026 -151434 -138470
6437 -138470 -56740 -105424 -3637 -95681 -249379 -443875 -111982 351183 320175 113497
6427 113497 -33745 11117 8742 -140458 -381663 -338302 -148777 -217271 -472424 -455206 3505
6416C505J19605j88227Q603J15129Q3991p0326k14021k15522k26367K6446n0155
6405f07339O7383j2451J19103K06601J4087o016K25503m6723k66678L3817K43105
6394b9608m2784P4714j10112k6914L2959J00994M9190o2815k3511O5307l80314
6383c52894k41928J28303k00829J38337n1180k5681J58144J91652m0929R6439
6373b00566K35233J9934q9540K3123k07051r4977j19626q4246L8234l32019J61313
6362f50188L56690J15560k89350K88734J17562l3860r2906k00362J30140J14151
6352a43829L11217K7407k13771k18783j92289k1055J18784n1554j81133J10886
6342d54120l5273L3117K49405j29220o0623K80540L25032j55195l20299K6097
$$ plain form
6416 3505 123110 -65117 -56514 58615 142606 72280 -141741 -357263 -583630 -557184 -607339
6405 -607339 -539956 -552407 -433304 -226703 -212616 -218632 6871 -39852 -306530 -272713 -29608
6394 -29608 -72392 2322 -107790 -134704 -101745 -751 48439 -14376 -37887 27420 -352894
6383 -352894 -594822 -466519 -667348 -529011 -580191 -605872 -447728 -256076 -297005 -200566
6373 -200566 34667 54601 -34939 -11816 -218867 -313844 -433470 -517716 -479482 -811501 -650188
6362 -650188 -293498 -177938 -467288 -178554 -60992 -94852 -187758 -388120 -257980 -143829
6352 -143829 167388 194795 -18976 -237759 -430048 -451103 -332319 -383873 -565006 -454120
6342 -454120 -489393 -456276 -206871 -336091 -396714 -116174 208858 53663 -266636 -240539
6332b40539J79129k08444J15155J85858k28769r5795J46993o5451j24718O9536
6322b67045J40768k52807k30572N3766J02325j29968J58771p450k9105K25013
6312b36304l0914J00157l3775p0210O129J90874J72154k14801j11477j45007k55497
6301f28671J49229j14024J89299m0320l3565J95894J38484l6267k37805J02956
6291c14790J95835K51731O4397j00855m526j8894k0539J71019K34947k10603j59121
6280H8601l03558j75002R2734R4857J1782p322j17039L4597J22646N87K00468
6269D3351J50471j01186j82729K46558J04074j42462Q073m4293J3106L12350j51916
6258B55397k40518P2998J46616l57165k82554M0168n3385j6648M02450J29537
$$ plain form
6332 -240539 -61410 -269854 -154699 31159 -197610 -293405 -146412 -211863 -336581 -267045
6322 -267045 -126277 -379084 -609656 -555890 -453565 -583533 -424762 -432212 -461317 -236304
6312 -236304 -267218 -167061 -200836 -271046 -264917 -74043 98111 -116690 -228167 -373174 -628671
6301 -628671 -479442 -593466 -404167 -444487 -478052 -282158 -143674 -179941 -417746 -314790
6291 -314790 -118955 132776 197173 96318 91792 72898 52359 223378 458325 247722 88601
6280 88601 -214957 -389959 -297225 -202368 -190586 -197908 -314947 -280350 -157704 -157117 43351
6269 43351 193822 92636 -90093 156465 260539 118077 126150 81857 94963 407313 255397
6258 255397 14879 87877 234493 -122672 -405226 -365058 -418443 -435091 -32641 96896
6248I6896j70074J3283m50394l27263N7130R4878J58528J36764R2740K62620j7450
6237e2342q4061M9676L4714j6577N0565j90539j8390q3206k26219J39190q3010
6226d80199K29077K47880K9603j25022l69707J6883n5357J55623J5148j03057
6216d39128K8570K13104K15151J48910k43212l76615p6547P38427K57793k41334
6206B25119n3590j22211j92439j20024n1617J7251J58131J65964K49431q2466
6196A93549k37387J07611R7352O7053L92254j49414k84421l91682j56246K2843
6186c38488J61576K20604N5726n3692m6260o8942p0514l65153r006L68067R5530
6175e0552l3107j20604K77458K03131r0202l11338l5126N9983j5123n4527j26711
$$ plain form
6248 96896 -73178 -59895 -510289 -837552 -780422 -685544 -527016 -390252 -297512 -34892 -52342
6237 -52342 -136403 -86727 -52013 -68590 -18025 -208564 -226954 -310160 -536379 -397189 -480199
6226 -480199 -251122 -3242 26361 -98661 -468368 -451485 -506842 -351219 -336071 -439128
6216 -439128 -410558 -197454 17697 166607 -76605 -453220 -529767 208660 466453 225119
6206 225119 171529 49318 -143121 -263145 -314762 -297511 -139380 26584 276015 193549
6196 193549 -43838 63773 161125 228178 620432 471018 186597 -205085 -361331 -338488
6186 -338488 -176912 43692 99418 45726 -534 -69476 -139990 -505143 -514149 -146082 -50552
6175 -50552 -83659 -204263 73195 276326 186124 -125214 -160340 -100357 -115480 -170007 -296718
6164b96718j4189Q6630K4631J28356R7210n9996M7790L0265j20499k9823M9823
6153e6520k63252J28546J13486K4705k028K836j12302J23983P8134j17871j98505
6142b78788l82473j92456J27125L99070k4132j07468L8021J58212J0707K32395
6132a9787j80104k60260l3383P2052m6433m689K33788l9526J95802p75j52561
6121b35876J39928J52813j26207j16354O8884j73552L45128O4092j12200L8434
6111D5090r5962L11450J23831k12140N7129j21584l45233j91012L78730j18647
6101a68348j76606L196J16681R5141K46860J42019k34267l97735N1860q1066n9104
6090d61369m9500J3921O376j9880K25004R2478n9353j37864m8623j18127J29275
$$ plain form
6164 -296718 -310907 -224277 -199646 -71290 25920 -34076 13714 43979 -76520 -106343 -56520
6153 -56520 -319772 -191226 -77740 -53035 -55063 -52227 -164529 -40546 37588 -80283 -278788
6142 -278788 -661261 -853717 -726592 -327522 -351654 -459122 -421101 -262889 -252182 -19787
6132 -19787 -199891 -460151 -493534 -421482 -467915 -472604 -238816 -278342 -82540 -83315 -235876
6121 -235876 -95948 56865 -69342 -185696 -116812 -290364 54764 118856 6656 45090
6111 45090 -50872 260578 384409 172269 229398 107814 -237419 -428431 -49701 -168348
6101 -168348 -344954 -341758 -225077 -129936 116924 258943 24676 -373059 -321199 -402265 -461369
6090 -461369 -510869 -496948 -490572 -510452 -285448 -192970 -252323 -390187 -438810 -556937 -427662
6079d27662K12978l1601R9840J95889P3769l482j61391r8407l1547j86805j77620
6068e36039J19741J61336O5907M3952K63929l2907m9283K12361Q1176r6564k52737
6057a9128j162k35652j80635j39750p546K4967n2128l4718p232N8489J47488j94474
6045f41481K7348O4140Q6169k242n0227R6637p4790J90956J53449Q8285n3604
6034a15360j10333J61582j87120m5986m3224k6976L43949K62989l23770j23706
6024b07955J91828j47805L5009J81313n7088k072L376J98343K71475J33251M9204
6013F48879k83292l48400r7980R7476k19229m9301K83718L49258j02482k85653
6003g006l5148N5344k21431j50263m9194Q8626L36380R4400k2340p4038j04477
$$ plain form
6079 -427662 -214684 -246285 -146445 49444 123213 119731 -41660 -140067 -171614 -358419 -536039
6068 -536039 -416298 -254962 -189055 -145103 118826 85919 36636 248997 330173 233609 -19128
6057 -19128 -20290 -255942 -436577 -576327 -583873 -558906 -611034 -645752 -652984 -594495 -447007 -641481
6045 -641481 -614133 -549993 -463824 -466066 -516293 -419656 -494446 -303490 -150041 -61756 -115360
6034 -115360 -225693 -64111 -251231 -297217 -340441 -367417 -23468 239521 -84249 -207955
6024 -207955 -16127 -163932 -128923 52390 -4698 -6770 -3394 194949 466424 599675 648879
6013 648879 365587 17187 -80793 16683 -202546 -251847 31871 381129 278647 -7006
6003 -7006 -42154 13190 -208241 -358504 -407698 -319072 17308 111708 89368 15330 -89147
5992h9147k49925K50997K57684k20421j5647j71601j61795k13958l41638K72992
5982f82459J93707Q7687K12845J90128J5626j13192K71773j59598k10641k54797
5972d48921K429J05089K83459J48254k40056j86882j80502L4567J01392P7198
5962c03973j20744r6411K81414K63309J22951j24056l8950O3440L0084k10530
5952a33466o0604J42410J48368m1563P1895j70653l49060n7883K26359o0177j14862
5941c99236L8449K49312n2221k1485n7226M9288m745N1822K19018P3721r7485
5930D9212k32465O6911L16411J84298k90051j58544j80354P8274K2944P0683m151
5919g6832L56110P0180m24518j14942j8003O7414o5323j16869n3225J63909K04193
$$ plain form
5992 -89147 -339072 -88075 169609 -50812 -66459 -238060 -399855 -613813 -955451 -682459
5982 -682459 -488752 -401065 -188220 1908 17534 -95658 176115 16517 -194124 -448921
5972 -448921 -446492 -341403 -57944 90310 -149746 -336628 -517130 -482563 -381171 -303973
5962 -303973 -424717 -521128 -239714 23595 146546 22490 -16460 46980 77064 -133466
5952 -133466 -194070 -51660 96708 55145 127040 -43613 -392673 -450556 -224197 -284374 -399236
5941 -399236 -360787 -111475 -163696 -185181 -242407 -193119 -197864 -146042 72976 146697 49212
5930 49212 -183253 -116342 200069 384367 94316 -64228 -244582 -166308 -143364 -72681 -76832
5919 -76832 279278 349458 -75060 -190002 -208005 -140591 -205914 -322783 -376008 -212099 -7906
5908g906l332o9904p7699K05870K51696r4194l56549l3218o1762k24346L90M38799
5896c2155J77722j62306j5824K11894r243j40216j08516j68358j59397K5004j1681
5885c93076N268j09382M6683n4928J00026O0206K54769L8252j08550k50544J04742
5874c06534K3850N0041J94569p5094j75681O6549n8385o4307j27230J64175L31372
5863B3325J55444m87783M5199J24576J5724J85185J05559k28340l06835K6062
5853c41884K7687J36280J45548k16772K12874J07570k27337P954M3602R3571R6734
5842H5827o0683j04629R5624j93737k90671j03142J18100L91396J74051j23459
5832a1323q6664J74729K1578j92752K6430l4034k64253J01433Q6354J40155J31597
$$ plain form
5908 -7906 -11238 -81142 -158841 47029 298725 204531 -152018 -185236 -246998 -471344 -470954 -32155
5896 -32155 145567 -16739 -32563 179331 170088 29872 -78644 -247002 -406399 -381395 -393076
5885 -393076 -387808 -497190 -450507 -505435 -405409 -345203 -90434 -52182 -160732 -411276 -306534
5874 -306534 -282684 -232643 -38074 -113168 -288849 -222300 -280685 -344992 -472222 -308047 23325
5863 23325 178769 -309014 -263815 -139239 -123515 61670 167229 -61111 -367946 -341884
5853 -341884 -314197 -177917 -32369 -249141 -36267 71303 -156034 -148080 -104478 -10907 85827
5842 85827 25144 -79485 16139 -177598 -468269 -571411 -453311 -61915 112136 -11323
5832 -11323 -97987 76742 98320 -94432 -68002 -102036 -366289 -264856 -178502 -38347 93250
5821I3250J93863J33638k38193j20108j41284k30636j8168J02677K93632j53036
5811h4365m51842P6077R7462M63713K68706m806j68209m67454j47389O9262N8703
5800b90142K81096p355j77306L4407J2821j35107L2970q9171j53385k16844J28924
5789e79092J67754K01730K44237J47198j3214k70286n843O2018J22354J52827
5779B29683k92992j08892K48046J53159j18025k0524o823j8944J21569J8759k04852
5768A64O739J90895J10118k27210j52037J21680J06988m3014k40572l40449k4524
5757d91222N4647j21415J56485K53969K6556p2993J41466L4041l24661Q4837j60318
5746d18608k69578l4187J64648K82256J0863K35213J47965k50775l90504k26879
$$ plain form
5821 93250 287113 420751 182558 62450 -78834 -309470 -327638 -224961 68671 -84365
5811 -84365 -536207 -460130 -362668 101045 369751 364945 196736 -270718 -418107 -348845 -290142
5800 -290142 -9046 -16401 -193707 -159300 -146479 -281586 -248616 -337787 -491172 -708016 -579092
5789 -579092 -411338 -209608 34629 181827 168613 -101673 -107516 -45498 76856 229683
5779 229683 -63309 -172201 75845 229004 110979 90455 83632 64688 186257 205016 164
5768 164 6903 197798 307916 80706 -71331 50349 157337 114323 -126249 -466698 -491222
5757 -491222 -436575 -557990 -401505 -147536 -120980 -193973 -52507 -18466 -343127 -258290 -418608
5746 -418608 -688186 -722373 -557725 -275469 -264606 -29393 118572 -132203 -522707 -749586
5736g49586J15623K17818K1816k4031k05415q6336K66197j86473J06098k5490
5726e49779J79682K61439o8187k49629j34494K6987L28761J54392l2213j5972
5716i9013l94442l63534K50895J27483o2067J25888k30132K00056J57392J69778
5706a17696K6683K4498k09021J12062L03184J64185j93911k62093j57553N0161
5696b59501R2479J65270M39913L30254k46988k25071J01601j23446o0045N3335
5686B67801j65423k81700L1646K21174Q1491J66176j53854j48368j78533j04061
5676b63651o1110k2436K27614J53917k93537o4908K28435J25321l2230J15938
5666A13353p6137r8157K46421J62894j61065k49836k79447L51661K17225J55015
$$ plain form
5736 -749586 -633963 -416145 -394329 -418360 -623775 -710111 -443914 -630387 -524289 -549779
5726 -549779 -370097 -108658 -176845 -426474 -560968 -533981 -205220 -50828 -83041 -99013
5716 -99013 -493455 -856989 -606094 -478611 -540678 -414790 -644922 -444866 -287474 -117696
5706 -117696 -91013 -66515 -275536 -163474 139710 303895 109984 -152109 -309662 -259501
5696 -259501 -167022 -1752 438161 768415 521427 296356 397957 274511 214466 267801
5686 267801 102378 -179322 -147676 73498 154989 321165 167311 18943 -159590 -263651
5676 -263651 -324761 -347197 -119583 34334 -259203 -324111 -95676 29645 -2585 113353
5666 113353 37216 -60941 185480 348374 187309 -62527 -341974 9687 226912 381927
5656C81927K22720J53605j71733l37980j83207k6213P8772j64l92498k00480o8752
5645e44003J69966j15006J28308Q4374K30020J2438p1523J39526j77478j86727
5635c30105J74870k9164J62446k52551r9220L18664R3246j28911j30840J94805
5625b6760q6042j6994K3368j83908p9245P1968q4181M6034J51265J81683J96564
5614A93752j11043j77226J18878j3935k64584j3327o8138J9329N7205J9601j21996
5603c61484M5768M51534M16271l081P6350q4172j10186l37221p2224J28427J18409
5592B68391l24307l88137K66317M9971J5640j22990O5353K6021m1267R8001o7932
5581a54939J06321L2699j26043j38622j51072J94979J73171O4206J55634J1226
$$ plain form
5656 381927 604647 758252 586519 248539 65332 39119 117891 117727 -274771 -475251 -544003
5645 -544003 -374037 -489043 -360735 -276361 -46341 -33903 -105426 34100 -143378 -330105
5635 -330105 -155235 -184399 -21953 -274504 -373724 -55060 38186 -90725 -221565 -26760
5625 -26760 -112802 -129796 -106428 -290336 -369581 -297613 -381794 -335760 -184495 -2812 193752
5614 193752 82709 -94517 24361 10426 -254158 -267485 -335623 -316294 -259089 -239488 -361484
5603 -361484 -315716 135818 552089 549008 625358 541186 431000 93779 21555 149982 268391
5592 268391 -55916 -444053 -177736 -127765 -112125 -235115 -169762 -143741 -185008 -87007 -154939
5581 -154939 -48618 -15919 -141962 -280584 -431656 -236677 -63506 700 156334 167560
5571A67560j75555J02776k8763j21262k66875K05029K77557k10543j75920Q0988
5561a45008K12905j17395j36936J47544k50305j36356L42508Q0994j37013L8211
5551a00851K20803L029k17389J57727L7124M4206K0705j28735k21417l8116k24638
5540d47552O9328J11318M2798r7836K24262J81766r9899P9904n10K93117l2643
5529C24053r6153j72182m35792l2471K497J60840J67451j37009p4336J69674p4648
5518a98076j36467N489k15108r496M8241p3741K10992o9576O859K29924J68402
$$ plain form
5571 167560 -7995 94781 66018 -55244 -322119 -117090 160467 -50076 -225996 -145008
5561 -145008 67897 -49498 -186434 -38890 -289195 -425551 -83043 -2049 -139062 -100851
5551 -100851 119952 122981 -94408 63319 100443 144649 165354 36619 -184798 -222914 -447552
5540 -447552 -378224 -266906 -224108 -321944 -97682 84084 -15815 64089 63579 356696 324053
5529 324053 227900 55718 -380074 -412545 -410048 -249208 -81757 -218766 -293102 -123428 -198076
5518 -198076 -334543 -329054 -544162 -553658 -505417 -579158 -368166 -437742 -430883 -200959 -32557
$$ [...]
##END NTUPLES=NMR SPECTRUM
##END=
