##TITLE=Analysis number 323971
Compound Code cc 55810
Book Reference 468/193
Project Code adrs
Chemist Name colinb
##JCAMPDX= 6.0         $$ Bruker NMR JCAMP-DX V2.0
##DATA TYPE= NMR SPECTRUM
##DATA CLASS= NTUPLES
##ORIGIN= Bruker BioSpin GmbH
##OWNER= nmr
$$ XWIN-NMR		Version 3.5
$$ Thu Nov  9 16:59:15 2006 GMT Standard Time (UT+0h)  MAYBRIDGE\nmr@NMR_250MHZ
##.OBSERVE FREQUENCY= 250.131544655141
##.OBSERVE NUCLEUS= ^1H
##.ACQUISITION MODE= SIMULTANEOUS (DQD)
##.ACQUISITION SCHEME= undefined
##.AVERAGES= 16
##.DIGITISER RES= 18
##SPECTROMETER/DATA SYSTEM= dpx250
##.PULSE SEQUENCE= zg30
##.SOLVENT NAME= CDCl3
##.SHIFT REFERENCE= (INTERNAL, CDCl3, 0, 16.522)
##AUDIT TRAIL= $$ (NUMBER, WHEN, WHO, WHERE, WHAT)
$$ ##TITLE= Audit trail, XWIN-NMR		Version 3.5
$$ ##JCAMPDX= 5.01
$$ ##ORIGIN= Bruker BioSpin GmbH
$$ ##OWNER= nmr
$$ C:\u/data/dgb/nmr/ADRS/2590/pdata/1/auditp.txt
$$ ##AUDIT TRAIL=  $$ (NUMBER, WHEN, WHO, WHERE, WHAT)
(   1,<2006-11-09 16:58:49.58 +000>,<MAYBRIDGE\nmr>,<NMR_250MHZ>,
      <created by zg, POWCHK disabled, PULCHK disabled
       configuration hash MD5:
       49 4B E0 1D 92 C2 6B 37 9F E6 65 BC 52 41 86 1D
       data hash MD5: 64K
       D6 2E 90 F1 97 EF EE 0E 50 F4 EA DC D1 D5 82 28>)
(   2,<2006-11-09 16:59:04.99 +000>,<MAYBRIDGE\nmr>,<NMR_250MHZ>,
      <Start of raw data processing
       ef LB = 0.3 FT_mod = 6 PKNL = 1 SI = 32K 
       data hash MD5: 32K
       0E 79 E4 24 48 8F A2 C5 ED 95 75 F3 0A 3A 26 FD>)
(   3,<2006-11-09 16:59:06.69 +000>,<MAYBRIDGE\nmr>,<NMR_250MHZ>,
      <apk 
       data hash MD5: 32K
       DE 95 67 08 BA BA 6E 16 3B 84 B2 33 44 E9 43 B4>)
(   4,<2006-11-09 16:59:07.52 +000>,<MAYBRIDGE\nmr>,<NMR_250MHZ>,
      <abs ABSG = 5 
       data hash MD5: 32K
       AE 2B 44 81 B3 B2 6A 67 CC D5 1B 4E D4 E4 79 D0>)
$$ ##END=
$$ 
$$ hash MD5
$$ AC 68 5F 66 59 34 30 21 45 3E B9 5C 93 D6 DD 2C
##$RELAX= 
##$RELAX= 
##$RELAX= 
##$RELAX= 
##$RELAX= 
##$RELAX= 
##$RELAX= 
$$ Bruker specific parameters
$$ --------------------------
##$DU= <C:\u>
##$EXPNO= 2590
##$NAME= <ADRS>
##$PROCNO= 1
##$TYPE= <nmr>
##$USER= <dgb>
##$AMP= (0..31)
100 100 100 100 100 100 100 100 100 100 100 100 100 100 100 100 100 100 
100 100 100 100 100 100 100 100 100 100 100 100 100 100 
##$AQSEQ= 0
##$AQ_mod= 3
##$AUNM= <au_zg>
##$AUTOPOS= <4 >
##$BF1= 250.13
##$BF2= 250.13
##$BF3= 250.13
##$BF4= 250.13
##$BF5= 500.13
##$BF6= 500.13
##$BF7= 500.13
##$BF8= 500.13
##$BYTORDA= 1
##$CFDGTYP= 0
##$CFRGTYP= 5
##$CHEMSTR= <none>
##$CNST= (0..31)
1 1 145 1 1 1 1 1 1 1 1 1 1 1 1 1 1 1 1 1 1 1 1 1 1 1 1 1 1 1 1 1 
##$CPDPRG= <>
##$CPDPRG1= <>
##$CPDPRG2= <>
##$CPDPRG3= <>
##$CPDPRG4= <mlev>
##$CPDPRG5= <mlev>
##$CPDPRG6= <mlev>
##$CPDPRG7= <mlev>
##$CPDPRG8= <mlev>
##$CPDPRGB= <>
##$CPDPRGT= <>
##$D= (0..31)
0 1 0 0 0 0 0 0 0 0.06 0 0 0 0 0 0 0.0002 0 0 0 0 0 0 0 0 0 0 0 0 0 0 
0 
##$DATE= 1163091528
##$DBL= (0..7)
120 120 120 120 120 120 120 120 
##$DBP= (0..7)
150 150 150 150 150 150 150 150 
##$DBP07= 0
##$DBPNAM0= <>
##$DBPNAM1= <>
$$ [...]
##$SUBNAM7= <"">
##$SUBNAM8= <"">
##$SUBNAM9= <"">
##$SW= 20.6930455092707
##$SWIBOX= (0..15)
0 0 3 0 0 0 0 0 0 0 0 0 0 0 0 0 
##$SW_h= 5175.983436853
##$TD= 65536
##$TD0= 1
##$TE= 683.16
##$TE2= 300
##$TE3= 300
##$TEG= 300
##$TL= (0..7)
0 120 120 120 120 120 120 120 
##$TP= (0..7)
150 150 150 150 150 150 150 150 
##$TP07= 0
##$TPNAME0= <>
##$TPNAME1= <>
##$TPNAME2= <>
##$TPNAME3= <>
##$TPNAME4= <>
##$TPNAME5= <>
##$TPNAME6= <>
##$TPNAME7= <>
##$TPOAL= (0..7)
0.5 0.5 0.5 0.5 0.5 0.5 0.5 0.5 
##$TPOFFS= (0..7)
0 0 0 0 0 0 0 0 
##$TUNHIN= 0
##$TUNHOUT= 0
##$TUNXOUT= 0
##$USERA1= <user>
##$USERA2= <user>
##$USERA3= <user>
##$USERA4= <user>
##$USERA5= <user>
##$V9= 5
##$VALIST= <valist>
##$VCLIST= <CCCCCCCCCCCCCCC>
##$VD= 0
##$VDLIST= <DDDDDDDDDDDDDDD>
##$VPLIST= <PPPPPPPPPPPPPPP>
##$VTLIST= <TTTTTTTTTTTTTTT>
##$WBST= 1024
##$WBSW= 4
##$XGAIN= (0..3)
0 0 0 0 
##$XL= 0
##$YL= 0
##$YMAX_a= 537892
##$YMIN_a= -454779
##$ZGOPTNS= <>
##$ZL1= 120
##$ZL2= 120
##$ZL3= 120
##$ZL4= 120
##$ABSF1= 16.522
##$ABSF2= -4.171173
##$ABSG= 5
##$ABSL= 3
##$ALPHA= 0
##$AQORDER= 0
##$ASSFAC= 0
##$ASSFACI= 0
##$ASSFACX= 0
##$ASSWID= 0
##$AUNMP= <proc_1d>
##$AZFE= 0.1
##$AZFW= 0.1
##$BCFW= 0
##$BC_mod= 0
##$BYTORDP= 0
##$COROFFS= 0
##$CY= 12.5
##$DATMOD= 1
##$DC= 0
##$DFILT= <>
##$DTYPP= 0
##$F1P= 14.0000005364418
##$F2P= -0.99999901652339
##$FCOR= 0.5
##$FTSIZE= 32768
##$FT_mod= 6
##$GAMMA= 0
##$GB= 0
##$INTBC= 1
##$INTSCL= 1
##$ISEN= 128
##$LB= 0.3
##$LEV0= 0
##$LPBIN= 0
##$MAXI= 10000
##$MC2= 0
##$MEAN= 0
##$ME_mod= 0
##$MI= 0
##$NCOEF= 0
##$NC_proc= -4
##$NLEV= 6
##$NOISF1= 0
##$NOISF2= 0
##$NSP= 0
##$NTH_PI= 0
##$NZP= 0
##$OFFSET= 16.522
##$PC= 1
##$PHC0= -44.43799
##$PHC1= 3.60659
##$PH_mod= 1
##$PKNL= yes
##$PPARMOD= 0
##$PSCAL= 4
##$PSIGN= 0
##$REVERSE= no
##$SF= 250.13
##$SI= 32768
##$SIGF1= 0
##$SIGF2= 0
##$SINO= 400
##$SIOLD= 32768
##$SREGLST= <1H.CDCl3>
##$SSB= 0
##$STSI= 32768
##$STSR= 0
##$SW_p= 5175.98343685301
##$SYMM= 0
##$S_DEV= 0
##$TDeff= 65536
##$TDoff= 0
##$TI= <Analysis number 999999
Compound Code 99
Book Reference 9
Project Code 9>
##$TILT= no
##$TM1= 0
##$TM2= 0
##$TOPLEV= 0
##$USERP1= <user>
##$USERP2= <user>
##$USERP3= <user>
##$USERP4= <user>
##$USERP5= <user>
##$WDW= 1
##$XDIM= 32768
##$YMAX_p= 538498473
##$YMIN_p= -149145
$$ End of Bruker specific parameters
$$ ---------------------------------
##NTUPLES= NMR SPECTRUM
##VAR_NAME=  FREQUENCY,     SPECTRUM/REAL,   SPECTRUM/IMAG
##SYMBOL=    X,             R,               I
##VAR_TYPE=  INDEPENDENT,   DEPENDENT,       DEPENDENT
##VAR_FORM=  AFFN,          ASDF,            ASDF
##VAR_DIM=   32768,         32768,           32768
##UNITS=     HZ,            ARBITRARY UNITS, ARBITRARY UNITS
##FACTOR=    0.157963299565203, 1,           1
##FIRST=     4132.6476996994, 0,             0
##LAST=      -1043.33573715361, 0,           0
##MIN=       -1043.33573715361, -149145,     0
##MAX=       4132.6476996994, 538498473,     0
$$ Real data points
##PAGE= N=1
##DATA TABLE= (X++(R..R)), XYDATA
$$ [...]
15879A1127k0315m5966Q174j0245M8326K6981l4964L954j008k274K7351L7292
15867D8433j0962k5457j5668L408K6500j0539M501l227j3116m940j9195N4922
15855C4660N5217j0893K3513n485m0673m4269r005q209J4523k4814J5720r217
15843h932m890K743J4601o394k6749k503K7523R630k4649l0003L5580K5493Q322
15830A9772l647j4857l411q886l3281L3610J2915k4780j8207K9544K7286L5207
15818E1265L707k8487n5237j0508M916K4758M3413j0814k0981k6868j8703n73
15806d4112j6295j14O039O0465J1413l8328l4896l226M1513l056j8608k0781k86
15793f0272J944j1652q7N9887J3805J764m2794L961K6259K5352l2284l0176k4801
$$ y = [11127, -9188, -55154, -46980, -57225, -8899, 18082, -16882, -12928, -13936, -16210, 11141, 48433, 37471, 12014, -3654, -246, 26254, 15715, 20216, 16989, 3873, -1067, -20262, 34660, 89877, 78984, 102497, 97012, 56339, 12070, 3065, -5144, 9379, -15435, 285, -8932, -13822, -11079, 3522, -2872, -29621, -32124, -4601, 5029, -19620, -49623, -14043, 11450, 19772, 16125, 1268, -2143, -11029, -44310, -10700, 2215, -22565, -40772, -11228, 16058, 51265, 54972, 26485, -28752, -39260, -34344, -9586, 33827, 23013, 2032, -24836, -43539, -44112, -60407, -60521, -54482, 5983, 17396, -20932, -55828, -59054, -17541, -20597, -39205, -59986, -60272, -58328, -69980, -70067, -10180, 3625, 5389, -37405, -33444, -7185, 18167, -14117, -44293, -69094]
15780f9094K9901M3792K0717m5809j387k866j8098L0464K1578j1767Q850J0282
15768A6563k1712l3457J1282M237k871J1911j7147j8043J0214L9083j7939j1866
15756b9745K0130L511j3802j4698j5350N5120K3187n993R577J2060l361L582N164
15743D9382J732l5863n977j8879j3331M565K24J618k2976n895K9149M5403j348
15730B7804l7445l5341l0395L0344N7501J288l3328N706j7664k3044l3155j1348
15718i9077J6955L4736K1037K7665L6467o143l0455k0077R246Q833P388J1551
15706A8126L65r558k4744j0322j7480J9742R604J2344N6379J2935l3147m1129
15694f885l1082o743j3897M5543L7246l169j1750n8317k1572K2557j5721m1906
$$ y = [-69094, -39193, 4599, 25316, -20493, -21880, -24746, -42844, -12380, 9198, -2569, 6281, 16563, -5149, -38606, -27324, -23087, -25958, -14047, -31194, -49237, -39023, 60, -17879, -29745, -9615, -6104, -19906, -34604, -49954, 5166, 28353, 22360, 31937, 43997, 40636, 44218, 49382, 51114, 15251, 9274, -9605, -22936, -18371, -18147, -16529, -39505, -45400, -16251, 29152, 27804, -9641, -44982, -75377, -45033, 12468, 13756, -19572, -13866, -31530, -54574, -87729, -99077, -82122, -47386, -26349, 1316, 37783, 31640, 1185, -18892, -9646, -813, 6575, 18126, 18491, 8933, -15811, -26133, -43613, -23871, -14267, -1923, 54456, 67391, 34244, -6885, -37967, -44710, -58607, -13064, 24182, 21013, 9263, -49054, -70626, -48069, -63790, -105696]
15682a05696J7285L2191K6965p827l3914J416Q422O474K985R878k2184N0887K3988
15669A0870j0389l8776j3375J2917l9258r919K1272K1591P94Q356R621r715o117
15656d2128K0123J6822J9010L265k1884O82J7427J2442j7548k963r914J4719j4297
15643d244k6294m69J4091l2930N033M5404r057M359J3393o40j0068j7693n622
15630b4737K415k402R588j3268K874j1291l2262l0205K0521M5966K0212L3173
15618B0584k795l1684m6527k7608L2753M4164Q485j6722J0101J5353q490j0563
15606a2949J0890m677L4326N255k5537r403K6714n757J8096k4342k0679j1460
15594a9523l4724k1889L023L8228M3751k154K728k260o411l718K2483j4709l3480
$$ y = [-105696, -88411, -56220, -29255, -37082, -70996, -69580, -61158, -54684, -51699, -41821, -64005, -13118, 10870, 481, -38295, -51670, -38753, -78011, -87930, -66658, -45067, -44273, -35917, -26296, -36011, -42128, -22005, -5183, 13827, 17092, -4792, -4110, 13317, 25759, 8211, 5248, -4666, 10053, -4244, -30538, -31007, -16916, -49846, -44813, 591, -8466, -4107, 9286, 8646, -1422, -19115, -24737, -22322, -24724, -15136, -28404, -25530, -36821, -69083, -99288, -78767, -32801, -12589, 20584, 17789, -13895, -60422, -88030, -55277, -11113, -2628, -19350, -9249, 6104, -2386, -12949, -2059, -6736, 27590, 32845, 7308, -2095, 24619, 18862, 36958, 12616, -8063, -19523, -54247, -76136, -73113, -34885, 8866, 6712, 9440, 7180, 769, -2949, 19534, 4825, -28655]
15581b8655K960K0620l8633j0502L5039p153J0286j3349q539k6244R033K7051
15569b8086N2652l0991r520j5769K740L2651J2280m474o618k0712j2043j6083
15557d3973K162j7848K5352M0482Q934j1528l2628j2442J3623O7732J3993n6174
15545b315j8369j3894k5132L5219j4929j4763j0376m255K0874l928j6142k2858
15533i0868J0654q031O562K5504K011L5233m607K6758M9983r946l3245m1592l1500
15520f3084Q839N621J8353n75j635M998P773J062k3026j3037l0777k019M7491
15507d0016J2006J4743K3571n513m683m5124J741n13m609M6038J6184L1299q542
15494C6582n678j2306K1514K2273l7248j8953P6014J2673m7790m3401q271K4192
$$ y = [-28655, -25695, -5075, -43708, -54210, -19171, -26324, -16038, -29387, -37926, -64170, -55137, -28086, 24566, -6425, -15945, -31714, -28974, 3677, 15957, 11483, 4865, -15847, -27890, -43973, -41811, -59659, -34307, 6175, 15109, 3581, -29047, -41489, -27866, 39866, 53859, -2315, -20684, -34578, -59710, -24491, -39420, -54183, -64559, -68814, -47940, -51868, -68010, -90868, -80214, -88245, -81683, -56179, -54168, -18935, -23542, 3216, 53199, 43253, 10008, -31584, -63084, -54245, -48624, -30271, -30846, -32481, -27483, -19710, -18648, -41674, -54711, -85488, -87507, -40016, -28010, -13267, 10304, 4791, 108, -45016, -43275, -43788, -48397, -2359, 13825, 45124, 36582, 30904, 18598, 40112, 62385, 25137, 6184, 82198, 94871, 47081, 3680, -4591, 19601]
15482A9601j0835k4504j5045J8329j3044l8676J302L2622L216O5522L6555l7013
15470C8030n9255m1085K7722N5053K1761j4096k8009k51L6694J4550r332l5723
15458F059k9357j5185k2717n073J650J5274J3044J946J4339k773k4451m784J5586
15445c6442K2756M4555J0131l2139K7800j4921l8329k178J7844j4991j0040l465
15433b9419k664J0032P875K1200L3240J0128q909k5233j7970j9781N2806L906
15421C5211P548K7350o910n1796m8173j2028j1203K346N6982K3145K0278K9146
15409G1896k5414k3586L491N758k0705L6332J4399j5731J479m5748l6792J1120
15397b3501j9333j8298K2785j1686K2213K8972l645k470R58M0672K776m178K3357
$$ y = [19601, 8766, -15738, -30783, -12454, -25498, -64174, -62872, -30250, -27034, 38488, 75043, 38030, -21225, -62310, -34588, 20465, 42226, 28130, 121, -130, 36564, 51114, 41782, 6059, -23298, -38483, -61200, -66273, -64623, -49349, -36305, -34359, -20020, -22793, -47244, -52028, -36442, -13686, 30869, 41000, 8861, 36661, 21740, -16589, -18767, -923, -15914, -25954, -29419, -32083, -22051, -14176, 7024, 40264, 50392, 41483, 16250, -1720, -21501, 31305, 35211, 42759, 70109, 63199, 11403, -36770, -48798, -60001, -57655, -673, 22472, 42750, 71896, 46482, 22896, 26387, 32145, 11440, 47772, 62171, 46440, 47919, 2171, -34621, -23501, -42834, -61132, -38347, -50033, -27820, 1152, -2493, -4963, -4005, 36667, 39443, 35265, 58622]
15384E8622K0957k6304l1689m4587j1215J4773K3414J1892Mn8413O348j9959n678
15371f1835K285m087l0448L7416K2749j371L7516J3958k1757p705J4069k8388
15359b7598m5108N91M5192k1166k9567L5614M2407L0817n36k4019k4330j8215
15347c5918l314M48K7274J2764J3804Q658m3420j9189L9772O572q732N1224m311
15334D5632n1542j4884Q14K8610J0592K5422q684K5323l411k3534k0964j8381
15322e007l2531l6845L0250J9185j7907L059N0472J4603l2923l4955m245R397
15310c7447L3533K4615L900N477l4078k6344K220k9941O252j2919K9253M9570
15298A4091J568j9556J067k1404P04k0726M9952J9271l955l888K0239o410K8307
$$ y = [58622, 79579, 53275, 21586, -23001, -34216, -19443, 3971, 15863, 15867, -42546, -36198, -56157, -61835, -59550, -63637, -94085, -56669, -33920, -35291, 2225, 16183, -5574, -13279, 790, -27598, -72706, -72115, -26923, -48089, -77656, -42042, 365, 31182, 30646, 6627, -17703, -35918, -39232, -38784, -11510, 1254, 15058, 23716, -19704, -38893, 879, 7451, -1281, 49943, 45632, -5910, -20794, -19980, 8630, 19222, 44644, 35960, 61283, 57872, 34338, 13374, -5007, -37538, -74383, -44133, -24948, -42855, -39796, 10676, 25279, -7644, -42599, -46844, -37447, -3914, 20701, 24601, 30078, -4000, -30344, -28124, -58065, -51813, -64732, -35479, 14091, 15659, -3897, -2830, -24234, -23530, -44256, 5696, 24967, 21012, 17124, 37363, 30953, 59260]
15285E9260J7017j2067l1643O472Q65n6152k5046J4888J7252j1671m1573K4586
15273c7812K7060N7478J8831k7359n0273k1131J395K963m4062j1131J4858J7222
15261e1961L8800P014j7706k6222k448K5649K7039p0o155o676j0588o798K3179
15248f943J5497J3793j9762k0132K3682K3305n388l2847m6625L3217J1424J0629
15236a50m16p544P693k2820j532K3677l2229K6161M0796J3076J4672k4184l5551
15223A649q055l785J8558l053K1827J5212j3093J2649l694l1352l0839K783J1901
15210i292n512R555J2446J2696J9083j9623J197n1225l8027L5140N0218m039j9918
15197g301L6353J1334j258j4218o0508J0416J5678l909l464j2460J5476K0369
$$ y = [59260, 76277, 64210, 32567, 39039, 39904, -16248, -41294, -26406, -9154, -20825, -62398, -37812, -10752, 46726, 65557, 38198, -12075, -33206, -31811, -28848, -72910, -84041, -69183, -51961, -13161, -6147, -23853, -50075, -52523, -26874, 165, 95, -6060, -12736, -23324, -30122, -6943, 8554, 22347, 2585, -17547, 6135, 29440, 24052, -8795, -55420, -22203, -10779, -150, -566, -8110, -417, -23237, -24769, -1092, -33321, -7160, 33636, 46712, 61384, 37200, 1649, -6406, -10191, 8367, 5314, 27141, 42353, 29260, 41909, 38215, 6863, -23976, -21193, -9292, -14804, -5249, 7197, 19893, 38976, 19353, 20550, -30675, -68702, -33562, 16656, 12617, -7301, 29052, 40386, 39128, 24910, -35598, -25182, -9504, -13413, -16877, -29337, -13861, 6508]
15185F508J7073O306k125k216l5161l4616P437L2303J2522o296l7202J4720k889
15172b3636J5086j878j0496k6448J7825K6887j4535k2766l05M6691l4850L529
15160b4896R216j2029j3410R45J04P525O474K2331j3485q187j6404o302p223l82
15146e5723r335k5863K5370K0623K5703R944j454k2739N40M4406L2723k8295l9310
15133b3410j1585K7809o588l1910k3514N499j2522M2228L7533k7419m7438J6316
15121e5001L1624K0496j252k8285Q487N0365K5175k9389l4040K2403k8776l9311
15109e7504j2277L4618M2114K2780k5710j6580K828o242L1252j8373k385k3237
15097b8716k711O655K621P934J3449Q951m0384Q926j2707j9711m693N5520k2475
$$ y = [6508, 23581, 29887, 27762, 25546, -9615, -44231, -36794, -4491, 8031, 1735, -35467, -20747, -23636, -8550, -10428, -20924, -47372, -29547, -2660, -17195, -39961, -40266, 6425, -28425, -24896, -15680, -27709, -41119, -40174, -40070, -32545, -26071, -3740, -17225, -25412, -41816, -48118, -55341, -55723, -65058, -90921, -65551, -44928, -19225, -9281, -10735, -33474, -32934, 11472, 44195, 15900, -23410, -34995, -7186, -13774, -45684, -69198, -63699, -76221, -33993, 3540, -23879, -71317, -55001, -23377, -2881, -4133, -32418, -23931, 26434, 51609, 22220, -11820, 10583, -18193, -57504, -69781, -35163, 6951, 29731, 4021, -12559, -9731, -15973, 15279, -3094, -5479, -28716, -31427, -24772, -22151, -14217, -768, 8183, -32201, -23275, -35982, -55693, -60386, -4866, -27341]
15084b7341k5180Q182M3968j7737k4661l6906n330r955j4662L4521N523M4697
15072b4881J1124M964q931J1597L4243k7334n0825k9430o050K8580k3556k5012
15060a05511J8515N093K5595L3638N1871j3762L719L3797k0468k7560K0797j2091
15048A3633l893l4015j9651K2876K4622J2707k5206k2613n642o802L0099R564
15036d321p415N908j3140q894M7897K3691l4893j8425k301o248Q340J0746J6599
15023A7544j6194l313J3710j0091K1306j6059j0758k7493J0697Q404j4823J5599
15011a1471J1629J9051j8748j7212J8974q919L3291L1604n0505p4348L0588L4564
14999a502R211l4167j1764N0563P4503K9403j7586m9286k7261j1573n7715m199
$$ y = [-27341, -52521, -44339, -371, -18108, -42769, -79675, -85005, -94960, -109622, -75101, -69578, -24881, -13757, -8793, -17724, -6127, 28116, 782, -50043, -79473, -85523, -56943, -80499, -105511, -86996, -81903, -56308, -22670, 29201, 15439, 19158, 52955, 32487, 4927, 25724, 13633, 9740, -24275, -43926, -21050, 3572, 16279, -8927, -31540, -37182, -43984, -13885, -4321, -11736, -5828, -18968, -27862, 20035, 43726, 8833, -9592, -11893, -18141, -9801, 945, 17544, 1350, -1963, 11747, 1656, 22962, 6903, -3855, -31348, -20651, -12247, -27070, -11471, 158, 19209, 461, -16751, 2223, -6696, 26595, 58199, 7694, -66654, -36066, -1502, 7709, -26458, -38222, 12341, 86844, 116247, 98661, 49375, 22114, 10541, -47174, -51373]
14987e1373K7324r442M211L414L0155K0182N43j7102k933l559K0021l59Q117j4006
14973A5193l1223n570J1210l1750L1047J3878K267R717J8586n1888k8119R877
14961c6775j303J8162n483k6284K7829J8693L109m133k4590l0656J4605P584j0770
14948e0012j4655j058L243K2326m3195j1267m538J7258K0209j9824J4457p574
14936g4630k9156j628J3618K7154L8861O70J4334J7995K699j9541k6699q279J7018
14923b7584l269J8802K3892L532k3937K6145j2588l1676n526k2622O960L8815
14911i056n539l0463k8528k0031m312n660L175J0713O702O325J6139J7463j3954
14898e7026j5655J8089j1297J157J5887o279J1340J164L8327M7458l8382n2607
$$ y = [-51373, -24049, -33491, -29280, -25866, 4289, 24471, 25014, 7912, 4979, 1420, 21441, 21082, 29199, 15193, -16030, -21600, -10390, -42140, -11093, 2785, 5052, 14769, 33355, -18533, -46652, -36775, -38078, -19916, -25399, -51683, -23854, -5161, -2052, -6185, -30775, -61431, -46826, -39242, -50012, -64667, -65725, -62482, -40156, -83351, -94618, -99156, -81898, -61689, -81513, -67056, -74630, -103786, -105414, -91796, -64642, -25781, -25111, -10777, 7218, 9917, -9624, -36323, -44602, -27584, -30853, -12051, 11841, 15373, -8564, 17581, 4993, -26683, -32209, -54831, -47871, -9056, -14595, -45058, -73586, -93617, -97929, -103589, -100414, -89701, -82999, -76674, -60535, -43072, -57026, -72681, -54592, -65889, -64732, -48845, -55124, -43784, -42620, -4293, 43165, 4783, -47824]
14886d7824L4296k7647q518J8877q261J3875K5122K851P07j9207q34j1223q748
14873c6534M705J4324R35J3425K3205R482L2524J6709j6003q0383j1273J363p007
14860c4528R982K7646K5614r31k2541k8572p187K138j1264L802K8146K0782l440
14847I647J1580M033K764l3810P520R758L197k3803k7120J8095R532o654L48l1864
14833d6777l5780J0138K1841L5195j7790q811N588J3889J9706j3855J9695r494
14821f455l0616j7040k8196O022O0552j058o0325k5840K5131J0444J9831l980
14809e1530K8379j6464k6523J7509M8319K8057K091j6923j5326J4200J2966m056
14797B0699K0500k6577j6518J2350o821k2672l0458M829M5989M652n2190l5566
$$ y = [-47824, -13528, -41175, -49693, -30816, -39077, -25202, -80, 2771, 3478, -15729, -16563, -27786, -36534, -31829, -17505, -16570, -3145, 20060, 29542, 62066, 78775, 62772, -17611, -28884, -27521, -34528, -24546, 3100, 28714, 27783, 5242, -23330, -30517, -28379, -39643, -35841, -7695, 13087, 9647, 21227, 25260, 28024, -5786, 1734, 11492, 14689, -9114, -36234, -18139, -8607, -15261, -14913, -46777, -82557, -72419, -50578, -15383, -33173, -41984, -36396, -22507, -2801, -16656, 3039, -6455, -37071, -54111, -82307, -76285, -15733, -16791, -77116, -102956, -77825, -67381, -47550, -51530, -23151, -39615, -66138, -48629, -310, 27747, 29838, 12915, -2411, 11789, 24755, 20699, 41199, 14622, -1896, 10454, 3633, -19039, -49497, -44668, 1321, 5973, -46217, -81783]
14785h1783j3247K450K8878K8971o79j3610K8526J1577k0609k0218n5568p793
14773a13105M6028K0900P295j7401L072K940K019K9207K2761j4653k6438J5212
14761b2163L4264k5981K143J2530j8120l0412n432N254M765k829K3979N8102K3210
14748E9310n481j7884Q065N893R996l5345n3155K7649M3362M813j9999n4291k628
14735b9695J2322L7111m0145j3038j7087J1863N752N08K1412L0108l1836j397
14723a4122M8861j0073k2036J548j4746j7053J5113M7873m311l3887j8241j4893
14711c5967p601l37N102l735J1181K292J9573k303m3976L448L0351j889j2348
14698c6209j6940l9677P462O9720J7024K2488k6156j1284l7801j4285K653K547
$$ y = [-81783, -95030, -92580, -63702, -34731, -35410, -49020, -20494, -8917, -29526, -49744, -105312, -113105, -67077, -46177, -38882, -56283, -53211, -50271, -48252, -19045, 3716, -10937, -37375, -22163, 12101, -13880, -11737, 793, -17327, -47739, -53171, -47917, -43152, -45981, -22002, 36100, 59310, 53829, 35945, 44010, 49903, 59899, 24554, -28601, -952, 42410, 47223, 27224, -27067, -29695, -17373, 19738, -20407, -33445, -50532, -38669, -32917, -32409, -10997, 19111, -12725, -14122, 34739, 24666, 2630, 4178, -10568, -27621, -12508, 35365, 31054, -2833, -21074, -35967, -43568, -43905, -38803, -42538, -31357, -29065, -9492, -11795, -55771, -52323, -21972, -23861, -36209, -53149, -92826, -85364, -15644, 1380, 23868, -2288, -13572, -51373, -65658, -63005, -60458]
14686f0458L6041J1818j8089j3361m4000O807K2822J9179J7009L0063J1749r902
14674I678l4848l5301K12J9458L1284k744m682K0944n325k4384k0139J9191n508
14661c2164O993j3353J7090j1229m9345K8485K6059q359l569r857O096N2184K7090
14648C6121j4762K5582K53Q488k8488P072K5198k7836j4546M9391K7033Q921j09
14635A02318k1182k3654n3742j1171l050j3784R336L5213J5936q903j1963l1458
14623a6104L1956J0465J2075n6917m0765O750k9452O5910P6873j26m2168k3276
14611d779m927p856P459n681k722L2143J8793l939m6407n6713m167L4842N8765
14598A4811L0052J1835j160j0971k9209l195j6761o040L2720M1722j5810k0890
$$ y = [-60458, -24417, -12599, -30688, -44049, -88049, -81242, -58420, -39241, -22232, 7831, 19580, 9678, -25170, -60471, -60259, -40801, -9517, -12261, -16943, 4001, -1324, -25708, -45847, -26656, -32164, -25171, -38524, -21434, -32663, -82008, -53523, -27464, -35823, -39392, -49249, -43153, 9031, 36121, 21359, 46941, 47194, 55682, 27194, 34266, 59464, 31628, 17082, 66473, 93506, 102427, 102318, 81136, 57482, 3740, -7431, -10481, -24265, -14929, 20284, 36220, 27317, 15354, -16104, 15852, 26317, 38392, -18525, -59290, -52540, -81992, -16082, 60791, 60665, 18497, -4779, -9706, -17562, -10103, -15784, -18506, 13637, 32430, 28491, -17916, -74629, -78796, -43954, 14811, 44863, 56698, 55538, 44567, 15358, 12163, -4598, -10638, 22082, 63804, 47994, 27104]
14586B7104m2094l9643J8060j3638k5027j603M8716L5829q754j1321M916L681
14574c774J6399j5577n1056l1906P569k7N397M3431J16J2866j1364j1708J2464
14561b7170J7536j1178j965R036K9842k985l4828j8255m936j0227R790N8243K3916
14548C6819L500n7703k8296L1411J5890k7005q66k791j4020M2883L2566K756p305
14535B7839l8254o068O0734K3038j1970k0017k9564R751j8068j6741K893J7112
14523F85R821L2855k5519k6513j3797K5066j3334k299P67Q272J5383p082R445
14510A3750j4218J32j7392m2101P205P303J1726L7566L3183j4222M5781p619J710
14497F2804l8035l6209l9437J1999j1789L438Q566m290J6953K9186k7408J8494
$$ y = [27104, -14990, -54633, -36573, -50211, -75238, -76841, -28125, 7704, -1050, -12371, -7455, -3774, 12625, -2952, -54008, -85914, -78345, -78372, -72975, -29544, -29428, -16562, -27926, -39634, -27170, -9634, -20812, -22777, -13741, 16101, 13116, -21712, -39967, -44903, -55130, -45340, 12903, 36819, 40319, -17384, -45680, -14269, 1621, -25384, -26250, -29041, -43061, -178, 32388, 35144, 27839, -10415, -16483, 44251, 67289, 55319, 35302, 5738, 15489, -2579, -19320, -16427, 685, 10506, 43361, 17842, -8671, -22468, 2598, -10736, -13035, -12268, -3996, 11387, 4305, 13750, -468, -336, -17728, -59829, -52624, -45321, -33595, 3971, 37154, 22932, 68713, 61094, 62804, 24769, -11440, -50877, -38878, -50667, -47229, -38663, -42953, -26000, 3186, -24222, -5728]
14485e728N1175k6655l3977J3294l103k8511p363J0402j2288l1323q226M3797
14473c8506Q247M933L0215L9788k5980J390J311n0653n0574N965K6184J1849R351
14460b6480L4077J8231J4715k8306Q301Q014K7881J0552K3614L4403l0067l1771
14448F3164k5093k5684k1386J6259N0354r604k921K7210L2478n152j4832k8176
14436E6617j8376j4248M712M389J1898Q407K5668N931m1639r334J2013L59l2377
14423A4020j9521J8320M586k1433j9379l3952P123K8740J8370J4562j8143M77
14411f230n259j9794J6542K6103k1513n1468L165J2657M502K6411K992m1128M1070
14398a1950j2380k4839J0162L8552L2580P572k5143k243J9565J4571P026P871
$$ y = [-5728, 45447, 18792, -15185, -1891, -4994, -33505, -40868, -30466, -42754, -74077, -82303, -38506, -30259, -25326, 4889, 44677, 18697, 20087, 21398, -29255, -79829, -73864, -47680, -35831, -26480, 7597, 25828, 40543, 12237, 20538, 28552, 56433, 66985, 90599, 125002, 94935, 63164, 38071, 12387, -8999, 7260, 57614, 48010, 45089, 72299, 104777, 99625, 84793, 56617, 38241, 23993, 28705, 33094, 44992, 53399, 79067, 84998, 43359, 34025, 46038, 46397, 14020, -5501, 12819, 17405, -4028, -23407, -57359, -50236, -21496, -3126, 11436, -6707, -6230, -11489, -31283, -14741, 11362, -10151, -61619, -58454, -45797, -41295, -14884, -11892, -53020, -11950, -24330, -49169, -39007, -455, 32125, 39697, 14554, 12311, 31876, 46447, 53473, 61344]
14386F1344j2089p243k505j608l6882J4588J435n6838l99Q485k1522K9314k1897
14373d5817K073K9660m142k6424o975L3586N4637K8858k5970l1648M422J4895
14361B7155l1770o7319J8398N2136P572M0447m4194k4777J4451N299J4813m428
14349G783L6406J9796j8654r714j3903J9710K4883R714l3j4580m2154j5553k1970
14336a8269m560M6566j598m417J8253r803l3302l1061o040k6732J580J506K7170
14323d0707K2911n485j676K2158K4765l8522p5284R494Q778k0164r410M0232k1090
14310h4000J2402K2820K0203O879j1671l0893j3408j5277j3426K3167M5276L61
14298c7567q938j1081j8473J7903K8760j3797r522K5800M2405Q770p2136l9451
$$ y = [61344, 49255, 42012, 39507, 37899, 1017, 15605, 17040, -39798, -40197, -31712, -53234, -23920, -45817, -43744, -14084, -18226, -44650, -51625, -18039, 36598, 65456, 39486, 7838, 12260, 27155, -4615, -71934, -53536, -1400, 6172, 46619, 2425, -22352, -7901, -2602, 12211, 7783, 44189, 63985, 45331, 35617, 21714, 41424, 66307, 76021, 75988, 61408, 19254, 3701, -18269, -22829, 23737, 22139, 17722, 35975, 26172, -7130, -38191, -44231, -70963, -69383, -67877, -40707, -17796, -23281, -24957, -2799, 21966, -16556, -91840, -82346, -73568, -93732, -103142, -62910, -84000, -71598, -48778, -28575, -21696, -33367, -64260, -77668, -92945, -106371, -83204, -37928, -37567, -46505, -57586, -76059, -58156, -29396, -43193, -52715, -26915, 15490, 24260, -47876, -87327]
14286h7327N499M4859J3073j6446j6096J2328K519J6732K7874j2303q287J9860
14274B285L2899J653m8207m550K8789L6973n186m2559M0360p536m1953j1002M3136
14261B5102j5641l6274l0487J659o75k8L006J5635k0958J3089L1649k0258k0946
14248e5127k208R926J5835j8567K6962M913N985r183j2090J8701K2149k6678k6772
14235d6154m8203j4136J3677J0486J0052J2550N6782J6155J2451N709k7882P867
14223I354j3320j3864J1172m2376j2586K0820L2598k1299q637j5694J581K8005
14211b4246M2814j3432k0752p425J5672q700l6435j4044K450K2904J9402J834
14199a9958n558l4965R511K4583K7169j8006R182M8850L0385J798q087q664o409
$$ y = [-87327, -81828, -36969, -23896, -40342, -56438, -44110, -41591, -24859, 3015, -9288, -17575, 2285, 35184, 36837, -11370, -15920, 12869, 49842, 44656, 2097, 42457, 34921, -7032, -18034, 25102, 9461, -26813, -57300, -55641, -56316, -56344, -53338, -37703, -58661, -45572, -13923, -34181, -55127, -57335, -47409, -31574, -50141, -23179, -18266, -12281, -21464, -33554, -14853, 7296, -19382, -46154, -94357, -108493, -94816, -84330, -74278, -61728, -4946, 11209, 23660, 29369, 1487, 9354, -3966, -17830, -6658, -49034, -61620, -40800, -8202, -29501, -38138, -53832, -52251, -24246, 18568, 5136, -15616, -23041, -7369, -16069, -52504, -66548, -64098, -41194, -21792, -19958, -25516, -60481, -50970, -26387, 782, -17224, -8042, 40808, 71193, 72991, 64904, 56240, 49831]
14186D9831J197J9685J2983n847j3781k4807l8041r090p333O816j1669k717j0361
14173c3134j2268j4423n016R176p804J3920k926l77J3054J3130R746J1214J2442
14160F734l5554r744m839M0353J5970r147k9403n452k8279j8657M3483K3927O898
14147c710k4038j1041J4325N396m9210r236M7407K7823R768l4178o307K5523j7196
14134b4674q789j3318J2828K4430k5282m0922r417l071L2432P045J6570N0217
14122A8049K8430j2462k6718J980P855m1522l2134L1677M376n940j9378k3516
14110f9303J9035L9455J6367J4423j3258k1096k5436j1179p64j3991K3643K9269
14098a2835o678k822L4147k2554k0014k1294K7117M3097j8420k9004m201o84l7178
$$ y = [49831, 51028, 70713, 83696, 77849, 64068, 39261, 1220, -7870, -15203, -8387, -20056, -22773, -33134, -45402, -59825, -64841, -55665, -63469, -49549, -52475, -52852, -39798, -26668, -16922, -5708, 6734, -28820, -38564, -43403, -3050, 12920, 3773, -25630, -31082, -59361, -78018, -34535, -10608, -3710, -27748, -38789, -24464, -19068, -68278, -77514, -30107, -2284, 7484, -26694, -33001, -7478, -24674, -33463, -46781, -33953, -9523, -34805, -75727, -85144, -88215, -55783, -48738, -32168, 18049, 46479, 34017, 7299, 9279, 17134, -24388, -56522, -24845, -20469, -26409, -45787, -69303, -50268, -10813, 5554, 19977, 6719, -14377, -39813, -50992, -51756, -65747, -42104, -12835, -19513, -22335, 11812, -10742, -30756, -52050, -24933, 18164, -256, -29260, -33461, -34145, -71323]
14085g1323M6313R096j6730m1447r184J4633M4522K0490O696L7682l712m3702
14073f666J3859k3142k0476J2723p414K1481K9703k836k0339j8785k2904R012
14061c5784R974J0583j1342n828K1169J7341j1422J701o702J7018L2970n386m4400
14048a0108k8378J8822m088j3200j5712k4389m317N4590N2794k202l5958k0480
14036c2626M9872J0824m429j700j1163l0635j4494L5943L0765n796r308k1136
14024c883j6055m535J4358K2318k947o0048j2447J7311J9615j6917K9402J7104
14012C276k569k4889J8086k3558k2531J2321J3730J6882l0010K5921O5657o803
14000D5513l7545j6466L156k3921l0579J2248J0604j0733L9845J7517m860L3469
$$ y = [-71323, -25010, -15914, -32644, -74091, -83275, -68642, -24120, -3630, 3066, 40748, 37036, -6666, 7193, -15949, -36425, -23702, -31116, -9635, 20068, 17232, -3107, -21892, -44796, -35784, -25810, -15227, -26569, -32397, -11228, 6113, -5309, -3608, -10310, 6708, 39678, 34292, -10108, -38486, -19664, -23752, -36952, -52664, -77053, -81370, -26780, 26014, 23812, -12146, -32626, 17246, 28070, 23641, 21941, 10778, -19857, -34351, 1592, 32357, 26561, 17253, -3883, -19938, -24473, -10115, 12203, 9256, -50792, -63239, -45928, -26313, -43230, -13828, 3276, 707, -24182, -6096, -29654, -52185, -39864, -26134, -9252, -39262, -13341, 52316, 45513, 7968, -8498, -5342, -29263, -59842, -47594, -36990, -47723, -7878, 9639, 4779, 38248]
13988C8248K8395l2731j5938J2565J8265q015l1621k6308k881j8456Q559M0425
13976A0507M8510m3641m4310j8612L1580K2474K5680K818K5275o859J4669P945
13964G6036L1692k843M548O2979N3841J4276L4581P1205O2509K3707K2450J3933
13952D68914N046l8268o8455l0039m5656l5814k3537o7162l8551j9496O975j6669
13940I7288n9164J087j5479k0926J3070L7041j2402M16M884j2076k1688j4422
13928b371J097l2144l0050J7946q944J7370M2027K1062q497m3376m0921N579N1294
13915i928j1672j1400J0452j2529J2284L5J4068R968p636J4172L339J1616n122
13902A7647j7124j3230P840q126n4306L5198N3625k778k3837j2351l876l0R646
$$ y = [38248, 66643, 33912, 17974, 30539, 48804, 40789, 9168, -17140, -20021, -38477, -29918, 10507, 59017, 15376, -28934, -47546, -15966, 6508, 32188, 35006, 60281, 53422, 68091, 76036, 107728, 104885, 109433, 172412, 226253, 240529, 275110, 346315, 408824, 432531, 454981, 468914, 473960, 435692, 367237, 337198, 291542, 255728, 232191, 165029, 126478, 106982, 113957, 97288, 38124, 39211, 23732, 2806, 15876, 52917, 40515, 40931, 45815, 33739, 12051, -2371, -1274, -33418, -63468, -45522, -54466, -37096, 4931, 25993, 17496, -25880, -66801, -61222, -9928, -21600, -33000, -22548, -35077, -22793, -22758, -8690, 1278, -6358, 7814, 11153, 22769, 17647, 523, -12707, -4867, -12993, -67299, -32101, 21524, 18746, -5091, -17442, -21318, -21348, -11702]
13889a1702J3053K5857J209k1938R243j3121k8067n7751J3522J0268J3640m132
13877d9919K2033P77Q725L606K021l8386m51L5078L5423K3821J8988k1174j503
13864C9039K082o430j0247N392m9812l9881J5955N3233K4877k0601J2888J4229
13852D0724k0385r53J9494O90J6664j0818l0919O729o296o004J8224L0517k5181
13839C2486J1312j4563l6820M452K1169k3186n941j792R002P985j055R724m212
13826H561Q085L7351n579n4904o354M165J5921L085j1091K914Q669k7686m2498
13813e9361n300M8067O319j8339K9436j4755k2554N1902K5072l4535k2455n731
13801b2234j2991L2221K7118m712m2338J2347O996m0441k4292M2050J3688L9964
$$ y = [-11702, 1351, 27208, 28417, 6479, 15722, 2601, -25466, -83217, -69695, -59427, -45787, -49919, -27886, -27109, -18384, -14778, -12757, -51143, -51594, -16516, 18907, 42728, 61716, 40542, 39039, 41121, 34691, 24444, 29836, -19976, -59857, -43902, 9331, 34208, 13607, 26495, 40724, 20339, 19386, 38880, 39570, 56234, 45416, 14497, 21226, 14930, 8926, 27150, 57667, 32486, 43798, 29235, -7585, -3133, 18036, -5150, -11091, -12883, -3881, 4104, 3049, 12773, 8561, 16646, 53997, 48418, -6486, -12840, -8675, 7246, 10331, -760, 2154, 10823, -16863, -59361, -64661, -16594, -10275, -28614, 822, -13933, -36487, 15415, 40487, 5952, -16503, -22234, -35225, -3004, 24114, 19402, -22936, -10589, -3593, -44034, -68326, -26276, -12588, 27376]
13789B7376o213q274M873J1773k2205l1257K1593J5008j4683P794o299j0528j8331
13776b9373M573J8171K7575K2605Q234K5935m1395n8588j7379K9238K2878k2765
13764a0291J6101j0103k6531j4734J554K7168K4241k7919k0329k2499J8412n047
13752d9977k0059M518P5282l668l2421k188J3842j9270J8839L5655J5751k9718
13740F586m6301j8516J3548L5187M4662Q724k3797l7004K0906L3522j7314l5233
13728a5030o662J772j3475J2303r309p585J9199j9025N0175P205n5504J6915K2390
13715C369L943k980k876N4034l1018n1401P055L1936k2408j8364L5002K5587j8882
13702A2997N632j1687j4247j1340o844K7897m854k2410K4296M6742j4160k6063
$$ y = [27376, 21163, 12889, 17762, 29535, 7330, -23927, -2334, 12674, -2009, 5785, -514, -11042, -29373, -24800, -6629, 20946, 43551, 51785, 77720, 36325, -22263, -39642, -10404, 12474, -10291, 5810, -4293, -30824, -45558, -44004, -16836, 7405, -20514, -40843, -63342, -44930, -49977, -70036, -65518, 9764, 6096, -26325, -28513, -14671, -33941, -15102, 20553, 36304, 6586, -39715, -58231, -44683, -9496, 35166, 43890, 20093, -16911, 3995, 37517, 20203, -15030, -21692, -19920, -33395, -21092, -30401, -37986, -18787, -37812, 12363, 19568, -35936, -19021, 3369, 7312, 4332, 1456, 55490, 24472, -26929, -19874, 12062, -10346, -28710, 6292, 31879, 12997, 18629, 6942, -7305, -18645, -25489, 2408, -2446, -24856, -560, 46182, 32022, 5959]
13690E959M2681q73m6043j0910j1677K0740M4159k838l9808m6054L317L4236Q1
13677g030j9626L875L006J0708J8455k1236k6459K1526M154J3385j1402k9476
13665d0120q420K1085M8390m828n0555j0027O9931P4104n7399m5283J4579j1350
13653A07M3164R7052p297o0454o5510p796M571L5979J4529k5679Q103k545l110
13640C1114j2191j4949j9859k9694k3184N5J0230K1490L664N420O965J7031K475
13627a433M488j1289K088j8562l1274J6446Q269l7327r325O511k8562Q434K4063
13614f7473K5963N263o013J9443j2917J8183M033m859L5263L310K0392l780j6050
13601B0758p857J8107K4827J1725l3315j6713n4014n4311L6979M5165K8186k8527
$$ y = [5959, 48640, 47767, 1724, -9186, -20863, -123, 44036, 41198, 1390, -44664, -41347, -7111, -7030, -26656, -22781, -19775, -9067, 9388, -11848, -38307, -16781, -12627, 758, -10644, -40120, -48540, -27455, 20935, 16107, -34448, -44475, 25456, 99560, 42161, -3122, 11457, 107, 43271, 140323, 133026, 72572, 7062, -734, 3837, 39816, 54345, 28666, 36769, 34224, 31114, 18923, 3974, -15885, -45579, -68763, -68708, -58478, -36988, -33324, -27904, -20939, -3908, -1433, 3055, -8234, -6146, -24708, -55982, -39536, -31267, -68594, -77919, -71408, -99970, -91536, -67473, -41510, -36247, -42260, -22817, -35734, -17551, -13518, -18377, 16886, 20196, 40588, 36808, 20758, 12901, 31008, 55835, 67560, 34245, 17532, -36482, -90793, -53814, -8649, 19537, -8990]
13589h990r225Q609q81N998j7970N604j1605l1240J4470J7055j2356J0535L0099
13576A03k3830j149L6886J542l2792j8930O8753L0580k4411p0691Q778M899r392
13563b9654K3381k2250l536O1722K8250k9450o2496M645J1231M092k7434k4081
13551f5580M293K7757K6059J5482J1613R148K937j5253m712J2653N249j0875p764
13538A1007l8433J0552K0056L886K2276l140K139L423j2551m5241j7250M2251
13526a025J2941n6359j4982P591q1L4544q031N0233K284m1079J0237J009M351
13513A633l5542J1207L691K2399O189Q065o659m584L3603N688L2463K12k5168
13500E3197O18Q558m8887l3342l2417l3206J8123J9319L5213K8849K2861p821
$$ y = [-8990, -18215, -9606, -10487, -4489, -22459, -16855, -28460, -59700, -45230, -28175, -40531, -29996, 103, -23727, -24876, 12010, 13552, -19240, -38170, 30583, 61163, 36752, -33939, -25161, -20262, -29654, -6273, -28523, -32059, 29663, 57913, 28463, -34033, -29388, -18157, -14065, -41499, -65580, -61287, -33530, -7471, 8011, 19624, 28772, 31709, 16456, 11744, 24397, 29646, 18771, 11007, -27426, -16874, 3182, 7068, 29344, 26204, 28343, 31766, 19215, -26026, -43276, -1025, 11916, -44443, -59425, -51834, -51915, -17371, -25402, 24831, 27115, -13964, -3727, -2718, 1633, -33909, -22702, -19011, 3388, 9577, 17642, 10983, 6399, 40002, 45690, 78153, 78365, 53197, 53815, 62373, 13486, -19856, -52273, -85479, -67356, -48037, -12824, 16025, 38886, 31065]
13488C1065k9051M936n679J2249K0862O781m147l4470K5854J1761l9660J2239
13476A2740L6624j0583l8734k3916N17L5549J4135J2973m0297k1512M6980L3251
13464E7727p232j7938l5487k8101l2187j972M4727K1994n812J3600L8656l7377
13452A0598j1352R273J9053K070n1079J537L3420p781K5290M868o696k84j8127
13439A0790O4070J6204m7946l9296J0860L4726r19K1424k3920n0802k1278k1037
13427d7124K132J0123K5429J7730K754K726L3854K5549q769k1312l1937J5089
13415B6244L6081j7553l6502P337K0701k955m809l0439J2157M8855P635j0765
13403E5987k5254m274o734j013K2949J5885L0850j2570P970L7889l8939p3638
$$ y = [31065, 2014, 6950, 1271, 13520, 34382, 41163, 37016, 2546, 28400, 40161, 501, 12740, 49364, 38781, 47, -23869, -23352, 12197, 26332, 39305, -992, -22504, 24476, 57727, 50495, 32557, -2930, -31031, -63218, -65190, -20463, 1531, -4281, 9319, 47975, 10598, -754, 8519, 27572, 29642, -21437, -19900, 13520, 5739, 31029, 35897, 29201, 28917, 10790, 74860, 91064, 43118, 3822, 14682, 49408, 48489, 69913, 45993, -4809, -26087, -47124, -44992, -34869, -9440, 8290, 11044, 13770, 47624, 73173, 64404, 43092, 11155, 26244, 62325, 44772, 8270, 15607, 36308, 33353, 28544, -1895, 10262, 59117, 66752, 55987, 30733, 26459, 19725, 18712, 41661, 57546, 88396, 75826, 83796, 121685, 82746, 9108]
13391I108j8019k259K420L3240M1297K1839o968J2769k4036l3096l428K9697J2018
13378G4582k9499k5170K4163P374m165L0748j418J8982k1758o296l5964l6063
13366d484O116R403K1528Q858l9028N369K7278k0411l1489q844l258K9785J4181
13353A5004k042k2525m7781O793K104J123N6220L651k6289j4281j5367k4360k330
13340g0080M267j462j1347K1583M4331j6m3193l6830L7902O6753N062j8051j5877
13327a6958Q496J329k6905l8735m580L5542J7424J0499M9934L0663p447l8449
13315B0813l3768j0954l6740N096l4359j6828J7781M1353M5301O3483k914j698
13303E6566J0658J895j0561n4812J7899j937N870n109K512J0747m977k6521j6227
$$ y = [9108, -8911, -11170, -8750, 24490, 65787, 87626, 80658, 93427, 69391, 36295, 32867, 62564, 74582, 45083, 19913, 44076, 51450, 47285, 78033, 76615, 95597, 73839, 67543, 31579, -4484, 1632, 11035, 32563, 41421, 2393, 7762, 35040, 14629, -16860, -25704, -28962, 823, 15004, 12962, -9563, -57344, -50551, -48447, -47324, 8896, 12547, -13742, -28023, -43390, -67750, -70080, -65813, -67275, -78622, -57039, -12708, -12724, -55917, -92747, -54845, 11908, 16970, -1081, -16958, -8462, -7133, -34038, -72773, -77353, -41811, -24387, -13888, 36046, 66709, 59262, 20813, -12955, -23909, -60649, -55553, -89912, -106740, -88959, -47606, -2305, 61178, 58264, 56566, 67224, 69119, 58558, 3746, 21645, 19708, 25578, 20469, 22981, 33728, 28751, 2230, -13997]
13290a3997k4590L8284J1468m327p295m821j0513K0082N908j0474J1487M0766
13278E1978r111m5300j271M9455J1744o185l8570k4817L5297J1651j2461j9031
13266C379K2786j248p897Q352K4089k9500j6283j1267J8747J6186M874j5010j1346
13253E862k3844o324K1415K9110j1592n7241J6020n45J0343l4704j8922L3021
13241c7401M5034J3088o434L2963M613k9961l9250O613J8312P507R577M5801k2416
13228D8046m9161j4837j0020J2111M3097k6601k650L020P701j91K898k345L9314
13215E0382J8673j6578n3160m2878l3415K2855K6832o531k042k4606J7955O6404
13203B3891j5078k1881j6222N417J4837r5M701M62M503r396K339K9126j2578J7478
$$ y = [-13997, -38587, -303, 11165, 6838, -457, -5278, -15791, 4291, 10199, -275, 11212, 51978, 42867, -2433, -3704, 45751, 57495, 51310, 12740, -12077, 23220, 34871, 22410, 3379, 26165, 24917, 17020, 25372, 49461, 19961, 3678, -7589, 11158, 27344, 32218, 17208, 5862, -17982, -24306, -2891, 26219, 14627, -42614, -26594, -27139, -16796, -51500, -70422, -37401, 7633, 20721, 14287, 47250, 51863, 21902, -17348, -10735, 7577, 15084, 24661, 70462, 48046, -1115, -15952, -25972, -13861, 29236, 2635, -15, 3005, 10706, 10515, 13413, 11068, 50382, 69055, 52477, -683, -43561, -76976, -54121, -27289, -33820, -35862, -60468, -42513, 23891, 8813, -13068, -29290, -23873, -9036, -9131, -4430, -3968, 535, -8861, -6522, 22604, 10026, 27504]
13189B7504L3744j4413m5182j4077K3264K289K1753L5067L28k0656L261o446K2331
13176F8767n1483o5075l7904L4848K2925L5295K5701J3631j1947k3872J6350J8469
13164D5705k5217L5560L249m2411L8678k3956q903k4508J925K2632J8018j9192
13152B1580j2903m2832r371L7528M540K440Q88N2452K9171l4322q053j538j9720
13139A9860k2112J815M155o485J6391R528j2745M006L4315K012n759p590k19K0800
13125E7972l649n2138K168K7526n041l2148K2237j7110k7229J6968K5265J1912
13113B6733l8164K5206M388R093n696K8273K7312k460r459j4451k4258j3402J7631
13100C0746R843J4679R885K2673L137l9912l6301k1843K3995L6225J2579k1857
$$ y = [27504, 61248, 46835, 1653, -12424, 10840, 13129, 34882, 69949, 70277, 49621, 52882, 46436, 68767, 17284, -47791, -85695, -50847, -27922, 7373, 33074, 46705, 34758, 10886, 27236, 45705, 20488, 56048, 59297, 16886, 55564, 31608, 22705, -1803, 122, 22754, 40772, 21580, 8677, -34155, -43526, -5998, -1458, 982, 1870, 54322, 83493, 49171, 41118, 39580, 19860, -2252, -437, 3718, -2767, 13624, 23152, 10407, 14413, 48728, 50740, 44981, 37391, 37172, 57972, 54323, 2185, 4353, 31879, 26838, -5310, 16927, -183, -27412, -10444, 14821, 26733, -11431, 13775, 18163, 27256, 21560, 49833, 77145, 74685, 65226, 50775, 26517, 13115, 30746, 40589, 55268, 65153, 87826, 90963, 51051, 14750, -7093, 16902, 53127, 65706, 43849]
13088D3849o206P314k9415k8860p559J7563j545m923p754J2927K0199N307J0265
13075C1162m9053P613M3815j6728j9319k7674j9740J198J7671N907N3780j6229
13063A2403l6491J0712K0481K4077L0202j4825j6453Q550j338k9874k5814M0514
13051B2144L3332k5883j7079k2313q168l7449M6714L7854k137r52l4335j2180
13039b0452O76J1521L5087l916l1155j614N283J8562L4897L7625j1145k61p9134
13026d026m1310J4906K7414K9166J6243l1281n9445M9555L9168k0625m968l116
13014A1681L2952J2076m235p979J892j6434K742R573j1655N49J8832l6407M3318
13001E6905q73k1085m461k7220k5668j8320j7796K670N0749J8236J6764J3420
$$ y = [43849, 37643, 44957, 15542, -13318, -20877, -3314, -4859, -9782, -17536, -4609, 15590, 20897, 31162, -17891, -10278, 33537, 16809, -2510, -30184, -49924, -48726, -31055, -25148, 28632, 12403, -24088, -13376, 7105, 31182, 61384, 46559, 30106, 38656, 37318, 7444, -18370, 22144, 55476, 29593, 12514, -9799, -17967, -55416, -8702, 29152, 27015, 26063, -8272, -20452, -19776, -8255, 26832, 22916, -8239, -9853, -4570, 13992, 48889, 86514, 75369, 75108, -4026, -45336, -30430, -3016, 26150, 42393, 11112, -48333, 1222, 40390, 19765, 14797, 11681, 44633, 56709, 52474, 44495, 46387, 29953, 32695, 42268, 30613, 31162, 49994, 13587, 56905, 56032, 34947, 30486, 3266, -22402, -40722, -58518, -55848, -5099, 13137, 29901, 43321]
12989D3321j6424L0800M2839l475k1124k4687k5408l0802K0598J0295q437J8021
12977C5517l1121K1875J5804J9313K7312l9801l5961j6536l4014J1852L1668j7555
12965a1647o671j2150M8056J2568j3067K7486K0236k3738l6643m5455J2270J3896
12953a4859K4717k552J5637P430K1102J5836Q025k0294L0001R682k4204K3369
12941I3890o882k7868k336j4254O858o5058l7896J3224o380J1523K5823M9351
12929C9995J8412M170J7882m091l4751q024l189J1463J0554J3915n3499k4738
12917a1901j2661N3550j4344o095L5480K351j4854J9635L0417j8049j3233K7359
12905G7655j3301J4231o730q000j2524k5005P662K2927L7616R650j7818j6795
$$ y = [43321, 26897, 57697, 100536, 97061, 75937, 51250, 25842, -4960, 15638, 25933, 17496, 35517, 4396, 26271, 42075, 61388, 88700, 48899, 12938, -3598, -37612, -25760, 5908, -11647, -18318, -30468, 17588, 30156, 17089, 44575, 64811, 41073, 4430, -41025, -28755, -14859, 9858, 7306, 22943, 30373, 51475, 67311, 75336, 55042, 85043, 94725, 70521, 93890, 87008, 59140, 56804, 42550, 49408, -15650, -53546, -40322, -46702, -35179, -9356, 39995, 58407, 62577, 80459, 76368, 41617, 33593, 30404, 41867, 52421, 66336, 12837, -11901, -24562, 28988, 14644, 8549, 44029, 46380, 31526, 51161, 81578, 63529, 50296, 77655, 64354, 78585, 71855, 63855, 51331, 26326, 33988, 56915, 94531, 104181, 86363, 69568]
12893F9568j0608L43j2327l3530n841l024K0737R244k2470J2044K0207l0888k3617
12880a0162K048M3615m725k771J7019j1102J0288J2116r953o735K9400k6271K0909
12867F3676R039k8453k504j0992K0150K3435j7430n697p98R73j61N08M1508K9143
12853A22397j9563l304l3394j9656p003J680N6146K1494k9111m4324l6987J4778
12841B3153L9832j3666M643M3928K2899m4192o1110J61n833J0560J2362k0405
12829A2332j3123O81Q674N810K3573N8009Q991J624O315j0874M650J406m8628
12816E9440P155q000J5150L1135K6453P37n2103j4946L2398M5530j0632l8413
12804I3904k9844K9439J7829k2477J73K709K0222k5973k9466n189J4311J5206
$$ y = [69568, 58960, 59303, 46976, 13446, 7605, 4581, 25318, 34562, 12092, 24136, 44343, 13455, -10162, -8114, 35501, 30776, 28005, 45024, 33922, 44210, 56326, 46373, 39638, 69038, 42767, 63676, 72715, 44262, 41758, 30766, 50916, 74351, 56921, 51224, 50426, 51399, 51238, 51746, 93254, 122397, 102834, 99530, 66136, 46480, 39477, 41157, 97303, 118797, 89686, 45362, 8375, 23153, 62985, 49319, 53962, 97890, 120789, 76597, 15487, 15648, 9815, 20375, 32737, 12332, -791, -110, 8564, 14374, 37947, 95956, 104947, 106571, 112886, 102012, 106662, 108068, 59440, 66595, 58595, 73745, 104880, 131333, 132070, 79967, 65021, 97419, 142949, 132317, 93904, 64060, 93499, 111328, 88851, 89024, 91733, 111955, 85982, 56516, 51327, 65638, 80844]
12792H0844K6738P043L5991j8822j3017m3247j6514Q316M5945P381j501k849j3811
12779A02497j3260n1766K3479R341K421j4457j5670N705K6631P5121m76R849l371
12766A56044l8187O861j2525J1707j4905P1k9590k0089o407L4586J8946o021k875
12753I7616K2551J2872l4882k3612K5351j5781k2512K5113L2410m7031k9452j4655
12741B7988n6377J0011L1827K2786J6027q222q486N3677J2799r34m601Q379J7474
12728A22348K6400j4276J0999k4794n5740L5123N3413j3691l2165m8938k8168
12717C0511P947P2078L6531J032k2995k4781n1333m5714K4590O7852J9117k9297
12705H5538m971J7716M171J8636n991k4302Q093k6247K0604M2104L9204k2284
$$ y = [80844, 107582, 114625, 150616, 131794, 118777, 75530, 59016, 67332, 113277, 120658, 119157, 116308, 102497, 89237, 37471, 60950, 70291, 72712, 58255, 42585, 48290, 74921, 150042, 149566, 159415, 156044, 117857, 124718, 112193, 123900, 108995, 109066, 79476, 59387, 52980, 87566, 106512, 100491, 97616, 120167, 133039, 98157, 74545, 99896, 84115, 61603, 86716, 119126, 72095, 42643, 27988, -28389, -18378, 13449, 36235, 52262, 44040, 35554, 89231, 102030, 101096, 96495, 104874, 122348, 148748, 134472, 145471, 120677, 64937, 100060, 153473, 139782, 107617, 58679, 30511, 38458, 110536, 147067, 148099, 125104, 100323, 48990, 3276, 27866, 95718, 114835, 85538, 80567, 98283, 102454, 121090, 115099, 90797, 98890, 72643, 93247, 135351, 174555, 152271]
12693A52271j9189K525K3421K2429M1940M1872r797K5676M8696N7209O7525Q8400
12681E42978J19825J12265Q6623J10177J15021O8333N9558l1572l1270n2244o3539
12670A036155j23901j11678q9551j38445j27354m2706k9702k2863n2727q2978
12660B14250j7358J6793j714l935j1574l7316K477p304m924J9522l3006R519K4585
12647A70015J9917l2436m327K359J3750K6216m4422k6170P332j4008J519J586
12635A21331k7449J9953j8041m2804j3958J1956R63K5072N0029O383p218J266
12623A27483K2797k6453j4704Q145k6263l7516k6219M1035M0673n354k265M2054
12611A43413k0525k2021r035o568P598o914j2911L4568M984J3369k201l257l3947
$$ y = [152271, 133082, 135607, 159028, 181457, 223397, 265269, 255472, 281148, 329844, 387053, 454578, 542978, 662803, 775068, 861691, 971868, 1086889, 1155222, 1214780, 1183208, 1151938, 1099694, 1036155, 912254, 800576, 711025, 572580, 445226, 402520, 372818, 349955, 297228, 214250, 196892, 213685, 211971, 208036, 196462, 159146, 161623, 154319, 149395, 168917, 135911, 145430, 170015, 189932, 157496, 153169, 155528, 169278, 195494, 151072, 124902, 132234, 118226, 119745, 121331, 93882, 113835, 95794, 52990, 39032, 50988, 51951, 77023, 127052, 133435, 126217, 127483, 150280, 123827, 109123, 117268, 91005, 53489, 27270, 68305, 108978, 103624, 101359, 143413, 122888, 100867, 91832, 85264, 92862, 85948, 73037, 107605, 112589, 125958, 123757, 120500, 86553]
12598H6553j1758p636q579N676k3123j3224L0481J6566j5767K775L0147L2490
12586A24601K0520N311k9431M657r292k8333k6695J5433L4026J8919R817K1857
12574A61390N7929N0368R642p737R005J6620p363M08Q885j7133l0453J2008M9951
12561C13520k778Q978k1335l2855j246J1043r118O024J8935J3265j7818O115L158
12548B95888k3300m5924r638J2642Q674J8534P747J5680J0145J2230k8488m5287
12536B28903Q313N5168M5805J8261R963J1460J4292j9088J3774K6000P4630N0950
12524E38431N7165J03819O5715R9896R0218J87308K83652L81121O02171R58635
12514C368131J496826K084342K009345N70313j006692k041989k168855j362594
$$ y = [86553, 74795, 67159, 58580, 64256, 41133, 27909, 58390, 74956, 59189, 61964, 92111, 124601, 145121, 150432, 121001, 125658, 116366, 88033, 61338, 76771, 110797, 129716, 139533, 161390, 219319, 269687, 279329, 271592, 280597, 297217, 289854, 290262, 299147, 282014, 251561, 263569, 313520, 310742, 319720, 298385, 265530, 264284, 275327, 266209, 272233, 291168, 304433, 286615, 292730, 295888, 272588, 226664, 217026, 229668, 238342, 256876, 264623, 280303, 290448, 302678, 274190, 228903, 237216, 292384, 338189, 356450, 366413, 377873, 392165, 373077, 386851, 412851, 487481, 538431, 595596, 699415, 765130, 865026, 955244, 1142552, 1426204, 1807325, 2409496, 3368131, 4864957, 6949299, 8958644, 9528957, 8522265, 6480276, 4311421, 2948827]
12506B948827q17402m73087k96566j95321j06505j32214j37141o8319o8875l7969
12496F15428m2365m5677r914m9323n4414k4003J2150j579j3105n0410l6042L7679
12484C38425l796p737l0869P799K7181M44M3726J8417J2174J884k6789k1028l4256
12471C25575n044k981M206k4687J0095J1150j2870N703j7966J3175K5308M302
12459C35966L3785N6633O7465N1989P6699Q7592J16500J32681J84694J73253K08332
12448A525589J66126J03340j1879j41518j68575j44831j61231q5395m5135k7173
12438A009318j2297N441L193j7010P424j6032J8599M2662M6258K4802k093m8163
12426A062102j8588L7259J1976L6141L7553J10378J21468J14404J25984O4431
$$ y = [2948827, 2131425, 1658338, 1361772, 1166451, 1059946, 927732, 790591, 722272, 653397, 615428, 573063, 527386, 517472, 468149, 413735, 389732, 401882, 400303, 387198, 336788, 300746, 338425, 334629, 326892, 296023, 303822, 331003, 331447, 375173, 393590, 405764, 407648, 380859, 359831, 325575, 320531, 317550, 321756, 297069, 307164, 318314, 305444, 311147, 293181, 306356, 331664, 335966, 369751, 426384, 493849, 545838, 622537, 710129, 826629, 959310, 1144004, 1317257, 1525589, 1691715, 1795055, 1783176, 1641658, 1473083, 1328252, 1167021, 1081626, 1036491, 1009318, 997021, 1002462, 1005655, 988645, 996069, 980037, 998636, 1041298, 1087556, 1112358, 1110265, 1062102, 1043514, 1080773, 1092749, 1128890, 1166443, 1276821, 1398289, 1512693, 1638677, 1703108]
12416A703108j1903Q751j9186p1040q2913j08545j06965m5376m5267m7196M134
12405A177602K5525Q2330R6789k5863k2210l1312j9048r051k5393j7686M8655
12394A280338O3141J5219L1359P9845J09530J24144J88218K19300J86175J80308
12384B477577Q1889L2770k9628r1983n4634l9918n3914r0549j34411j44771j41224
12373A811204k08091j74638j04351j12518j13362p0005n7780k8903n9099Q541
12363H90998l42j839J3122q800J3326K7400M3775J215K1918L4356K5152j0700
12351A049581k3405O6733O5900R3440O4285Q6477R2867J02281J55580J94356K09707
12340B157802K09276J61134J24961O4967Q856j10476j18107j56242j71920j53716
$$ y = [1703108, 1691205, 1699956, 1680770, 1609730, 1526817, 1418272, 1311307, 1265931, 1220664, 1173468, 1177602, 1203127, 1285457, 1382246, 1356383, 1334173, 1302861, 1283813, 1274762, 1249369, 1231683, 1280338, 1343479, 1358698, 1390057, 1469902, 1579432, 1703576, 1891794, 2111094, 2297269, 2477577, 2559466, 2592236, 2562608, 2470625, 2415991, 2376073, 2322159, 2231610, 2097199, 1952428, 1811204, 1603113, 1428475, 1324124, 1211606, 1098244, 1028239, 970459, 941556, 882457, 890998, 890656, 888817, 901939, 893139, 906465, 933865, 977640, 978855, 1000773, 1035129, 1060281, 1049581, 1026176, 1092909, 1158809, 1252249, 1316534, 1403011, 1495878, 1598159, 1753739, 1948095, 2157802, 2367078, 2528212, 2653173, 2718140, 2726996, 2616520, 2498413, 2342171, 2170251, 2016535]
12330B016535j35795o5698m4096n0883o3310j920r575j9555k0171l6691J9375
12319A588216N9758Q9447O0167j1254K0858L6170P391K6546L2634N7645J30489
12308B098067J57042J31632J39502J65330K08769J96372K15631K52813K48205
12299C813363K62328K70478J96192J13684J6418L6051N1590P0091J15324J52502
12289E098021K54360K50992L23694L19016M07186N30618O00522P47487Q65232
12280I397128J057736J289404J541604J807728K017723K260689K509627K859230
12272B4740869L325964M000325N044233O714655R217456J2719335J6882649K1003973
12264A03649459K4119307K5609624K5141002K2935011J8568480J2157381L742301
$$ y = [2016535, 1880740, 1815042, 1770946, 1720063, 1656753, 1654833, 1645258, 1625703, 1605532, 1568841, 1588216, 1647974, 1737421, 1797588, 1786334, 1807192, 1843362, 1850753, 1877299, 1909933, 1967578, 2098067, 2255109, 2386741, 2526243, 2691573, 2900342, 3096714, 3312345, 3565158, 3813363, 4075691, 4346169, 4542361, 4656045, 4672463, 4708514, 4760104, 4830195, 4945519, 5098021, 5352381, 5603373, 5927067, 6246083, 6653269, 7183887, 7784409, 8531896, 9397128, 10454864, 11744268, 13285872, 15093600, 17111323, 19372012, 21881639, 24740869, 28066833, 32067158, 37111391, 43826046, 53043502, 65762837, 82645486, 103649459, 127768766, 153378390, 178519392, 201454403, 220022883, 232180264, 235922565]
12257B35922565n350280j3608583j9774501k3416153k5062113k4901513k3139211
12250A00670211j9800798j5706978j1642313q379090o041421m529378l685391
12243C0884842l151146k711900k415981k187339j900744j629898j365726j223092
12235A4299016j164807j118921r67452q87548q05210o96196n58985m38761l77702
12226G283434k92802k38624k17257j48687j6393Q3286O1558n6814j32534k69287
12216F055880l86563l82418m10640l03173j89199j82390j77874r5961k2302j331
12206C904029R864O93k4070q3405j10801j49847j86921k03914j39162j58424o7371
12195B790671l5355K1675O245Q771l320m7604m9011l9843n0073K8037J51095K74155
$$ y = [235922565, 230572285, 216963702, 197189201, 173773048, 148710935, 123809422, 100670211, 80869413, 65162435, 53520122, 45141032, 39099611, 34570233, 30884842, 27733696, 25021796, 22605815, 20418476, 18517732, 16887834, 15522108, 14299016, 13134209, 12015288, 11047836, 10160288, 9355078, 8658882, 8099897, 7661136, 7283434, 6990632, 6752008, 6534751, 6386064, 6369671, 6452957, 6514515, 6457701, 6325167, 6055880, 5669317, 5286899, 4876259, 4573086, 4383887, 4201497, 4023623, 3927662, 3905360, 3904029, 3913893, 3914586, 3890516, 3807111, 3696310, 3546463, 3359542, 3155628, 3016466, 2858042, 2790671, 2755316, 2776991, 2783236, 2792007, 2788687, 2741083, 2692072, 2652229, 2602156, 2630193, 2781288, 3055443]
12183C055443L29458L64966M46958L77123K03789l2363k06384k50134k90189k36399
12173C762268j16649r0190k27427l31731l46633l35254k95238k15107j44923j09210
12163A549906j01939o6852q0968j10336n7385p2041n4165J6091J7606j2069k7495
12152A000353J6628k5084k6781J8997L5900K6032L9274Q1796N0426J24272K19214
12141A561027K57677L11427K50801O3240j48278k37696k73122k61430k22983j29873
12131A170790j30194r6707m3295p3619q3200o4646k0390k2903l1799k9984n1040
12120E23013n0051m8836k9044O123Q649m2913Q386J5907k9629k7548k3650j387
12108C09020k3483J8155K2823n6423L711N4421K9393j3478o08k5798k6863o687
$$ y = [3055443, 3384901, 3749867, 4196825, 4573948, 4777737, 4745374, 4538990, 4288856, 3998667, 3762268, 3645619, 3555429, 3328002, 2996271, 2649638, 2314384, 2019146, 1804039, 1659116, 1549906, 1447967, 1381115, 1300147, 1189811, 1132426, 1060385, 1006220, 1022311, 1039917, 1027848, 1000353, 1016981, 991897, 965116, 984113, 1020013, 1046045, 1085319, 1167115, 1217541, 1341813, 1561027, 1818704, 2130131, 2380932, 2444172, 2295894, 2058198, 1785076, 1523646, 1300663, 1170790, 1040596, 943889, 900594, 826975, 743775, 679129, 658739, 635836, 604037, 574053, 523013, 472962, 424126, 395082, 401205, 409854, 366941, 375327, 391234, 361605, 334057, 310407, 309020, 285537, 303692, 326515, 270092, 273803, 328224, 357617, 344139, 343531, 317733, 290870, 284183]
12096B84183J5569K0410J1644l3660l2836l1553p174j6986J348P743j7986N229
12084B05931J5815K6239K6318k7328l4853k970j2057L7169K7466p713l2321k7453
12072A94243K6720K8180J6357q792l7948m7806j8602K5388k8436j7615K2699L9661
12060A94049k289l789L5752m250k202L7649j8077k7178L2543K2968q598O153J0102
12047B72833K3957p306N376l0986k6902n2049l7846M927K0508J3345N9120J8039
12035B63016L5374K5613j2636j4235J7263j8302l5897K9069J1136k0741n7199
12024B22461j4781j2892l3173l8518L0187M1182J6508l3390k5521P471j840L6431
12012A94125L1046J8180K1249k0079P448l3362K092R574O0115k3329N622L1850
$$ y = [284183, 299752, 320162, 331806, 298146, 265310, 233757, 226583, 209597, 210945, 218688, 200702, 205931, 221746, 247985, 274303, 246975, 212122, 209152, 197095, 234264, 261730, 254017, 221696, 194243, 220963, 249143, 265500, 256708, 218760, 170954, 152352, 177740, 149304, 131689, 154388, 194049, 191760, 187971, 223723, 219473, 217271, 254920, 236843, 209665, 242208, 265176, 256578, 262731, 272833, 296790, 289484, 294860, 263874, 236972, 184923, 147077, 152004, 172512, 185857, 244977, 263016, 298390, 324003, 311367, 297132, 314395, 296093, 260196, 289265, 300401, 279660, 222461, 207680, 194788, 161615, 123097, 153284, 194466, 210974, 177584, 152063, 159534, 157694, 194125, 225171, 243351, 264600, 244521, 251969, 218607, 220699, 230273, 290388, 267059, 272681, 304531]
12000C04531J5468j2135j1318k7633l1123m1373l5978Q576K335J570J143K3620
11988A97683Q34L7866L8721L6187R6022N0805l6843p3452o2809j5349j8516l4086
11976B17063j3456n1209n1834l4164M6808L2468J7161n7442L935N1021j5503k5554
11964A19294M69K8720M210J4459n454k502q604k2993N3013L0351M4308M9851N2721
11951C57843J04872N5347K836j4199k379k5585l6166j8762L053k9983l9850j5102
11939C41925j4001L898j1104p498l2320k0117L3860Q23P921J7307K0617M1842
11927C83153Q1854M7346J6352J3296m748n2798q0811p5970j9621l3521q360j3685
11915B52487j4852k0210J5q30j5615N2429L1749p112L7535L9806M2490O6967L0954
$$ y = [304531, 319999, 307864, 296546, 268913, 237790, 196417, 160439, 169015, 171350, 172920, 174063, 197683, 198517, 236383, 275104, 311291, 407313, 458118, 421275, 347823, 285014, 269665, 251149, 217063, 203607, 152398, 100564, 66400, 113208, 145676, 162837, 105395, 109330, 160351, 144848, 119294, 119763, 148483, 152693, 167152, 161698, 159196, 150592, 127599, 180612, 210963, 255271, 305122, 357843, 462715, 518062, 520898, 506699, 504320, 478735, 442569, 423807, 426860, 396877, 357027, 341925, 327924, 331822, 320718, 313220, 280900, 260783, 294643, 295466, 303387, 320694, 341311, 383153, 465007, 512353, 528705, 542001, 537253, 484455, 403644, 327674, 308053, 274532, 266172, 252487, 237635, 217425, 217440, 216610, 200995, 253424, 285173, 278061, 315596, 355402, 397892, 464859, 495813]
11902D95813K1269J5869L3422j0846l0804o3113n2155j5132K6256K0609K365l8225
11890D05328l7247n4864m4946m103L7522k3211l3539K577K1752J5239N8455O4177
11878D07140N3413M6270M6626J07102J03897J54754J19018J1160j7476o5894j38037
11867H27973j71745j19590o6674q2664l4420k7479n9557k481L4824j1474j8093
11856B68620K7072Q490L082r37l528K2505J0810L8694K5247q781J9294N0991J08184
11843E69743J15967J14023J20707R2917J20521R2057N3210O4725J8691l3565q9210
11832A239786j45680j16858j33697j27603o6372n4607r0358j05482j11848k6056
11822B61225K5777L412j2078j3909k032k1918k4017q758k762R824l9221L374L3992
$$ y = [495813, 517082, 532951, 566373, 555527, 524723, 461610, 409455, 394323, 420579, 441188, 443553, 405328, 368081, 313217, 268271, 264168, 301690, 278479, 244940, 247517, 269269, 284508, 342963, 407140, 460553, 506823, 553449, 660551, 764448, 919202, 1038220, 1049380, 1031904, 966010, 827973, 656228, 536638, 469964, 387300, 352880, 325401, 265844, 263363, 298187, 286713, 268620, 295692, 304182, 307264, 306327, 302799, 325304, 336114, 374808, 400055, 391274, 410568, 461559, 569743, 685710, 799733, 920440, 1013357, 1133878, 1225935, 1279145, 1343870, 1362561, 1328996, 1239786, 1094106, 977248, 843551, 715948, 649576, 594969, 504611, 399129, 287281, 261225, 287002, 290414, 278336, 264427, 262395, 240477, 216460, 207702, 204940, 214764, 175543, 178917, 212909]
11809B12909J6307m361k6011l7979k8053n931J1821L2157L0932k2679l604k3079
11797A52429p990j8313J371j9912k0837K6763J7162q968L2413K7530K9688m6368
11785A64968K4814J6796P305J0417M393j0385q467k3797k2691k8287J854K7803
11773A64723K8578K3910m573j1084l3480n221O30q043J487K7763L6753L0921k504
11760B49860k1057R739k918l1199K984J9172n004k9684j4443k6302j0655L5168
11748A75661M161L0666K2874l0790j6339m904k55j334K7513P5512M4447J6784
11736C43996l1625k4580r486j8824m6962m6547j4624L9341K400J7073l379j9572
11724A87211l599L1811P572q627K6325k1594k1155r506l4344j5089j0110j3587
$$ y = [212909, 229216, 224855, 198844, 160865, 132812, 126881, 138702, 170859, 201791, 179112, 175508, 152429, 144439, 126126, 127497, 107585, 86748, 113511, 130673, 121705, 154118, 181648, 211336, 164968, 189782, 206578, 213883, 224300, 228693, 218308, 209841, 186044, 163353, 135066, 136920, 164723, 193301, 217211, 212638, 201554, 168074, 162853, 163483, 155440, 156927, 184690, 221443, 252364, 249860, 228803, 238542, 235624, 204425, 207409, 226581, 221577, 191893, 177450, 151148, 140493, 175661, 179822, 210488, 233362, 202572, 186233, 181329, 181074, 179740, 207253, 282765, 327212, 343996, 312371, 287791, 278305, 259481, 212519, 165972, 151348, 190689, 193089, 210162, 206783, 187211, 183612, 215423, 222995, 214368, 240693, 219099, 197944, 188438, 154094, 139005, 128895, 115308]
11712A15308K0708M9221L949l0597K1746J7789j3762j0243J691K8453L254K2505
11700B30022j8269j0676L033K8284K7133Q429k9663k7K7574N340j5750j761J3795
11687B67464o192o2955j4585K3509J8999o0239o1640N149M9627J829l3829L365
11675A30502P3608J7501n481J0360J5823P121J5163q423J7415j6871m7353l864
11663B05501r012l5128K0487J782k2205l3351J7J8530K627K9306M1622J2748k9090
11650B03834k8620J528l0712m769K7374m003j3372j7262J2824k948m374K6687
11638A66187K6179J3845L1937M7803k0664j7530J4259j4369K109k2805p439l7577
11626A81935j7739l8722j2648J8895j9686o33J7995M252J0842J7095Q127J367
$$ y = [115308, 136016, 185237, 189186, 158589, 180335, 198124, 184362, 174119, 175810, 204263, 207517, 230022, 211753, 201077, 204110, 232394, 259527, 267956, 238293, 238266, 265840, 271180, 255430, 253669, 267464, 261272, 198317, 183732, 207241, 226240, 166001, 104361, 109510, 159137, 160966, 127137, 130502, 204110, 221611, 216130, 226490, 242313, 249434, 264597, 256174, 273589, 256718, 209365, 205501, 196489, 161361, 181848, 183630, 161425, 128074, 128091, 146621, 149248, 178554, 220176, 232924, 203834, 175214, 176742, 146030, 141261, 168635, 164632, 151260, 133998, 146822, 143874, 139500, 166187, 192366, 206211, 238148, 285951, 265287, 247757, 262016, 247647, 249756, 226951, 219512, 181935, 164196, 125474, 112826, 131721, 112035, 111402, 129397, 133649, 144491, 161586, 169713, 171080]
11614A71080j2212k1866O523n8592j7048N0286Q5939N2481k8378l6575l0929k0348
11602A40361K3749J8056j093J7291k0354p696l3425n7730J9103J1779K7078K3609
11590A60728K0822l0404p5328k82L5444L5473Q021l0276j9100j1626J2390j000
11578A04862l3603J9909J4113O042J136N374j4525n086J7902J6758M391M899n7495
11565H4677j6358J4346N016N529l4K9166K7486J1165j3912p118m181J005J2065
11552A48852j0810K3696K1044j9248q450l9501l829m964j7010P410K9365K9782
11540A56337j0937n284K7812j2827k0275q002J2077L2466L1035j4462m2015k0013
11528A25912M5661K1549k9728m6581P231q076k8122M704k999j1900l724K539J7121
$$ y = [171080, 158868, 137002, 143525, 84933, 67885, 118171, 204110, 256591, 228213, 191638, 160709, 140361, 164110, 182166, 181073, 198364, 178010, 170314, 136889, 79159, 98262, 110041, 137119, 160728, 181550, 151146, 75818, 75536, 110980, 146453, 154474, 124198, 105098, 93472, 105862, 104862, 71259, 91168, 105281, 111323, 112459, 117833, 103308, 98222, 116124, 132882, 137273, 142172, 84677, 68319, 82665, 87681, 93210, 93176, 122342, 149828, 160993, 147081, 139963, 135782, 136787, 148852, 138042, 161738, 182782, 163534, 155084, 115583, 111754, 106790, 89780, 97190, 126555, 156337, 145400, 140116, 167928, 155101, 134826, 126824, 138901, 171367, 202402, 187940, 145925, 125912, 171573, 193122, 163394, 116813, 124044, 115968, 87846, 92550, 89551, 77651, 73927, 76466, 93587]
11515I3587L7411K8289R513k0389j6359K3576L216M29K492J2014j7165K2263j06
11502A78771K2466K9963K8001N159l2120l2514N495K91K0273J67k4433k7018J6085
11489A90586P284K5623n203n5700j1089J6150k3230k7534l115J1710k8054q57
11477I6571J7761N8760R284l4401J0149l7025K611J882n111q529L2977J7898l7975
11464A24852k0836P070K9508K637k2733j8449j161K5245J3686O570N8972L6833
11452B42194m8288l9755L548O765N67K8339q427j7336m731K1681r299k727J7809
11439A90340j2666k7378P773L041l1102J0441K2299j5978k1064K2550L3947O209
11427A88412j7409L2461p102j1455m754j4633k6142K690K7294j3070r715K6452
$$ y = [93587, 130998, 159287, 168800, 148411, 132052, 155628, 158844, 159273, 161765, 173779, 156614, 178877, 178771, 201237, 231200, 259201, 264360, 232240, 199726, 205221, 205512, 225785, 225952, 201519, 174501, 190586, 197870, 223493, 218290, 162590, 151501, 167651, 144421, 116887, 113772, 125482, 97428, 96571, 114332, 173092, 182376, 147975, 158124, 121099, 123710, 125592, 120481, 111952, 144929, 162827, 124852, 104016, 111086, 140594, 143231, 120498, 102049, 100888, 126133, 139819, 146389, 205361, 242194, 193906, 154151, 157699, 164464, 165031, 193370, 184943, 167607, 162876, 184557, 175258, 172531, 190340, 177674, 150296, 158069, 161110, 130008, 140449, 162748, 146770, 125706, 148256, 182203, 188412, 171003, 203464, 196362, 184907, 180153, 165520, 139378, 142068, 169362, 156292, 146577, 173029]
11415A73029O14l172K4108j1593k6929o818J5165Q389k8246k786j65J2417o7845
11402H6168m731M1882L2183o804L7149K9404k2509J112L4046j2377k1540J2747
11390B06730K5877j0924j8585P962k3913l496L428L7303J2276l1404j3933J7752
11378B09073K2071j433j6948Q880J9421N994J3534J0457j0067j8282k0406L875
11366B26169Q68q712J3067k1618j7516M0334n341k6947J5721J9153J4030j6371
11354B32837l7559J1636M2694o631j8175P075K7539L4634J7877J5950j2491o3178
11342B52208l1716J7604M3637O555K207J3485L7756r340p563K1037L7062N1005
11330D33937L6288L7242J14826R4835J04266N7004J2793m4925p3943o7060p5380
$$ y = [173029, 173643, 170471, 194579, 182986, 156057, 149239, 164404, 172793, 144547, 141761, 141596, 154013, 86168, 81437, 123319, 155502, 148698, 185847, 215251, 192742, 193854, 227900, 215523, 193983, 206730, 232607, 221683, 203098, 211060, 187147, 183651, 187079, 224382, 236658, 205254, 191321, 209073, 231144, 229711, 212763, 221643, 241064, 247058, 260592, 271049, 260982, 242700, 222294, 226169, 227037, 218325, 231392, 209774, 192258, 232592, 227251, 200304, 216025, 235178, 249208, 232837, 195278, 206914, 249608, 242977, 224802, 231877, 259416, 294050, 311927, 327877, 315386, 252208, 220492, 238096, 281733, 288288, 290495, 303980, 341736, 332396, 324833, 345870, 382932, 433937, 470225, 507467, 622293, 717128, 821394, 878398, 891191, 846266, 772323, 705263, 629883]
11319F29883n6589j2805L3691K0277P4401M0279K4134j2979n8299r5072o1005
11308E25916q617J2900k6540k5263J0380j7773j9182O012L5780j0260L5040P2502
11296E90895L0971K7967o476L4378Q7728Q2245J28176J50175J57625J45056R3203
11285A521943K0028m0056q8671q7448l5616l2158j7368M001L0625O1624O1168
11274A398072J0717q13J0273N5687K5462l650J7382N738l8728r2973j13616r7338
11262A176213p4457m4348k6496K1116K6002M1683K2358J7544J0946L7940J06714
11251A315215J60972R8413J27833J96078J49247N8982O644r1837j10489k8461
11241A882597o1970k1327N2538Q1718O8946L862p9332j02081j14809j26070j49324
$$ y = [629883, 573294, 560489, 594180, 614457, 688858, 729137, 753271, 740292, 681993, 586921, 525916, 517299, 530199, 503659, 478396, 488776, 471003, 451821, 457833, 493613, 483353, 518393, 590895, 621866, 649833, 643357, 677735, 765463, 847708, 975884, 1126059, 1283684, 1428740, 1521943, 1541971, 1501915, 1413244, 1325796, 1290180, 1258022, 1240654, 1244655, 1275280, 1336904, 1398072, 1408789, 1407976, 1418249, 1473936, 1499398, 1495748, 1513130, 1518868, 1480140, 1387167, 1273551, 1176213, 1101756, 1057408, 1030912, 1052028, 1078030, 1119713, 1142071, 1159615, 1170561, 1208501, 1315215, 1476187, 1574600, 1702433, 1898511, 2047758, 2106740, 2113384, 2021547, 1911058, 1882597, 1820627, 1799300, 1851838, 1933556, 2002502, 2006364, 1927032, 1824951, 1710142, 1584072, 1434748]
11230A434748o7380l1366n8001l3686m5421J1387M04K349M3233O6088J0247j3646
11218A318956P101K5167K2500J8843L3522J3617n9427q036N8665O1700R998n751
11206A496855n327J9602N9151N9858O1372n0116j25061j63148j49258r6268j32195
11195I75465q0413j15138n4418M646O967O758L534J4893n033k4615k5689J7264
11183G24221j7487Q533k283K4201M6470M2082M2592M4294O4237K8277p544n8285
11171I39308p6918k3821m7001n6490k6973k9907j8470M0482J9144J9321l0090
11160G08585k8052r708l7218m808P839j9327J4408J2842J9863J784m635L1612
11148F93185M0321J6709L3905O712j9265J712O9564p085k0333l1593j5765m2268
$$ y = [1434748, 1367368, 1336002, 1278001, 1244315, 1198894, 1210281, 1210685, 1213034, 1256267, 1322355, 1332602, 1318956, 1326057, 1351224, 1373724, 1392567, 1426089, 1439706, 1380279, 1372243, 1430908, 1492608, 1502606, 1496855, 1491528, 1511130, 1570281, 1630139, 1691511, 1641395, 1516334, 1353186, 1203928, 1107660, 975465, 895052, 779914, 725496, 730142, 737109, 743867, 747401, 762294, 757261, 732646, 706957, 724221, 706734, 715267, 712984, 737185, 783655, 825737, 868329, 912623, 976860, 1005137, 997593, 939308, 862390, 838569, 791568, 735078, 708105, 678198, 659728, 700210, 719354, 738675, 708585, 680533, 670825, 633607, 628799, 636638, 617311, 631719, 644561, 664424, 666208, 661573, 693185, 733506, 750215, 784120, 790832, 771567, 773279, 842843, 835758, 815425, 783832, 768067, 725799]
11136G25799o3317l2241K801j3894L8554O3657M1570N920M357J0260N924p017
11124G82373l2961l1310K1771K8467K1867J6349J1570J9166K8824J107J4252K8899
11112I10374L0149J862m7999m1878k5438L3865m1146n4053j98j5283n3510k4302
11100F72443J1517J2740M5545M9971O992K3107L3841O4750N7176Q362m9721j1443
11088I25280M8616K2516K592L79K8570P592K3528M2785j0640k6146m1428l5240
11076I88404l3729p591n7585p1677j9627l7529j5002j314L4790J3646k8132j4960
11064G49694l8044J2921K8059j303K4028P1761N1278q449j3856K250J5134K4646
11052I18119J6644j8997n595J0201m9401j6375k5665l9663j2779J2175p994j563
$$ y = [725799, 662482, 630241, 633042, 619148, 657702, 721359, 762929, 768849, 773206, 783466, 789390, 782373, 749412, 718102, 739873, 768340, 790207, 806556, 818126, 837292, 866116, 867223, 881475, 910374, 940523, 942385, 894386, 852508, 827070, 860935, 819789, 765736, 765538, 750255, 696745, 672443, 683960, 696700, 742245, 792216, 799208, 822315, 856156, 920906, 978082, 986444, 936723, 925280, 973896, 996412, 999004, 999383, 1027953, 1035545, 1059073, 1101858, 1091218, 1065072, 1023644, 988404, 954675, 947084, 889499, 817822, 798195, 760666, 745664, 744350, 779140, 792786, 764654, 749694, 711650, 724571, 752630, 751327, 775355, 847116, 898394, 889945, 876089, 878339, 893473, 918119, 934763, 915766, 910171, 920372, 870971, 854596, 828931, 789268, 776489, 788664, 780670, 779107]
11040G79107J9635l822J1217l4241K2961N82l0172J0883N0709L5095j9140J8048
11028H60862O1547R462n3080j6159N6299L6936n216J409P268k1819P559j6196
11016I28872j1003K8315k958K3737M5525M9425J9483J9767J5273J529L841k262
11004A119544l462r706M341P507O854J9754L3972M6204L6495M712L2356O166K8765
10991A333502q692n0490j8350N2386L7283P974K1878M816M2360J4927J7260J1599
10979A466453J8418K0921N5257O580l5545K4417M6530L3247j6566j6862J241L3960
10967A638051j6902J5476N5028P2326N1730J6608M1865Q098l2793Q216O231K0718
10955A884652K804j56J607Q7121Q0790M8222K1437K3344j577M0490L7101O5373
$$ y = [779107, 798742, 794920, 806137, 771896, 794857, 795439, 765267, 776150, 826859, 861954, 842814, 860862, 922409, 931871, 878791, 862632, 918931, 955867, 950651, 952060, 959328, 937509, 945068, 928872, 917869, 946184, 943226, 966963, 1012488, 1061913, 1081396, 1101163, 1116436, 1117965, 1121806, 1119544, 1116082, 1106376, 1110717, 1118224, 1125078, 1144832, 1178804, 1225008, 1261503, 1266215, 1298571, 1304737, 1333502, 1324810, 1274320, 1255970, 1308356, 1345639, 1353613, 1375491, 1380307, 1422667, 1437594, 1454854, 1466453, 1484871, 1505792, 1561049, 1567629, 1532084, 1556501, 1603031, 1636278, 1619712, 1602850, 1604091, 1638051, 1621149, 1636625, 1691653, 1763979, 1815709, 1832317, 1874182, 1882280, 1849487, 1857703, 1863934, 1884652, 1887456, 1887300, 1888907, 1976028, 2056818, 2105040, 2126477, 2149821, 2148244, 2188734, 2225835, 2291208]
10943B291208O6120P0342N2837J2743M6699N7571R4958O6315M6921N8449R3553
10932B957716O3367Q4067Q2535Q9124J32348J65897J59747J41706J59391J87355
10922D223253K43623K13687K71097K90573L60217M23984M12394M27484M67332
10913G333644M59165O33855Q70224J071812J325777J726867K246174K966712M007452
10904B2641682N445153O966149Q399994R097581Q438863O063935K385455j790798
10896F7648014n435579p738433q423960p756336o306178m633827l261410k180721
10888B1911570j433548q90325n05082k61206N8776K83381M21307M58498M50361
10879B0493732N06789N97050P77258J112458J519892K055625K776828L698624
$$ y = [2291208, 2357328, 2427670, 2480507, 2493250, 2539949, 2597520, 2692478, 2758793, 2805714, 2864163, 2957716, 3021083, 3105150, 3187685, 3276809, 3409157, 3575054, 3734801, 3876507, 4035898, 4223253, 4466876, 4680563, 4951660, 5242233, 5602450, 6026434, 6438828, 6866312, 7333644, 7792809, 8426664, 9296888, 10368700, 11694477, 13421344, 15667518, 18634230, 22641682, 28086835, 35052984, 43452978, 52550559, 60989422, 67053357, 69438812, 67648014, 62212435, 54474002, 46050042, 38293706, 31987528, 27353701, 24092291, 21911570, 20478022, 19587697, 19082615, 18821409, 18880185, 19163566, 19584873, 20043371, 20493732, 21000521, 21597571, 22374829, 23487287, 25007179, 27062804, 29839632, 33538256]
10871C3538256M784760O072668P523461R109439J0701454J2052615J2914481J3067256
10863A09764390J2154099R997803O784225K880341j244635n149925q282872j0321575
10855A16581851j1034804j0500657r111167p199339n042817k870041j081879K46710
10847F9987857R62053J185632J205349J319252J714711K369432L234493M171729
10839H6150508N216822O272072O960126O938825N756832L374294L98449k383767
10831A18684161m356076n158492m767253l336172j243264J291145L685700N430814
10823A10230563N873190M589629J852044j562155m713431o588633o703263n279289
10815I7698655l066485r40985N29040J093402J129791J025076J327502K452685
$$ y = [33538256, 38323016, 44395684, 51919145, 61028584, 71730038, 83782653, 96697134, 109764390, 121918489, 131916292, 138700517, 141580858, 140336223, 135186298, 126903426, 116581851, 105547047, 95046390, 85935223, 78735884, 73693067, 70823026, 69741147, 69987857, 70949910, 72135542, 73340891, 74660143, 76374854, 78744286, 81978779, 86150508, 91367330, 97639402, 104599528, 111538353, 117295185, 120669479, 121067928, 118684161, 114328085, 109169593, 104402340, 101066168, 99822904, 101114049, 104799749, 110230563, 116103753, 120693382, 122545426, 120983271, 116269840, 109681207, 102977944, 97698655, 94632170, 93691185, 94220225, 95313627, 96443418, 97468494, 98795996, 101248681]
10807A01248681M263844O319963P918248Q673300Q653456Q157424P477761O495355
10799A59208032N036644K903196j14427l751326p412565j0263194j1954431j2434085
10791A21217844j2212530j1457985j0411837r347565q424620p575317o714221
10784E5073769n840019m964186m092770l285025k597383j862275j227563o00620
10776C0603928j77617J14949L06406K99655K12749J66460K50539N32770J139466
10767C3449305K221064L698530N450259P361403Q928538R373506Q033536M906422
10759H3422563M93064m094628p782564r619252r618104q228227o349741m702996
10751C3520115l569843k850215k364511j860803j330384q80298m70023j67560
$$ y = [101248681, 105512525, 111832488, 119750736, 128424036, 137077492, 145234916, 152712677, 159208032, 164244676, 167147872, 167033445, 163282119, 155869554, 145606360, 133651929, 121217844, 109005314, 97547329, 87135492, 77787927, 69363307, 61787990, 55073769, 49233750, 44269564, 40176794, 36891769, 34294386, 32432111, 31204548, 30603928, 30426311, 30541260, 30847666, 31147321, 31360070, 31526530, 31777069, 32309839, 33449305, 35670369, 39368899, 44819158, 52180561, 61109099, 70482605, 78516141, 83422563, 83915627, 79820999, 72038435, 62419183, 52801079, 44572852, 38223111, 33520115, 29950272, 27100057, 24735546, 22874743, 21544359, 20664061, 20194038, 20026478]
10743B0026478J17233L15810M39054N14985O56917Q27171J180139J755991K446463
10734B8280241L313684M508913N844475P055678P769380P654836O743569N278128
10726G6448904L542181K045339R32038Q5076o83143j449250k236784k890556l321906
10717G2471899l331293k751491j613277l04776O23729P08890j97335j746462l340782
10708F0519102m515985n064660m904389m313411l508932k499730j596553q21085
10700C3294357m3823O31901J291945J875816K181186K166639J782076R87606n36
10691D4167167q17169j188536j058284m12854L13574J042051J500951J630363
10683D5177263J472432J196473Q45904N66973L28826k621n97696j426596k383361
$$ y = [20026478, 20143711, 20459521, 20898575, 21413560, 22070477, 22897648, 24077787, 25833778, 28280241, 31593925, 36102838, 41947313, 49002991, 56772371, 64427207, 71170776, 76448904, 79991085, 82036424, 82968462, 83053538, 82370395, 80921145, 78684361, 75793805, 72471899, 69140606, 66389115, 64775838, 64471062, 65094791, 65803681, 65606346, 63859884, 60519102, 56003117, 50938457, 46034068, 41720657, 38211725, 35711995, 34115442, 33294357, 33250534, 33882435, 35174380, 37050196, 39231382, 41398021, 43180097, 44167703, 44167167, 43349998, 42161462, 41103178, 40690324, 41003898, 42045949, 43546900, 45177263, 46649695, 47846168, 48692072, 49259045, 49587871, 49585250, 48987554, 47560958, 45177597]
10674D5177597l057399l226203k914734k244863j245798k01749P18652J327059
10666C4332562J484835J152911M48133l30254q95528j107559r53909p06510m24148
10657C3000533n61426j236535k140844k909765l376395l324706k879282k337542
10649A4234038j790825j405693j125525r10968p42265n72985m36158l13353j87222
10640F749044r9420q6934l3761j4539m1326l9225p8112j09155j64601j99941l17485
10629E564545l54166l57644k97778k29371j68076j31711q8457j04420j33430j11365
10619C588127j22585j09561j00512j29991p2557j11193p6616r3415r6679l4801
10609B640217N4815M7927M1453P5593J18840J27464J34671J28396J01384j2385
$$ y = [45177597, 42120198, 38893995, 35979261, 33734398, 32488600, 32286851, 33005503, 34332562, 35817397, 36970308, 37418441, 37088187, 36192659, 35085100, 34131191, 33424681, 33000533, 32439107, 31202572, 29061728, 26151963, 22775568, 19450862, 16571580, 14234038, 12443213, 11037520, 9911995, 9001027, 8258762, 7685777, 7249619, 6936266, 6749044, 6649624, 6562690, 6528929, 6514390, 6473064, 6433839, 6355727, 6246572, 6081971, 5882030, 5564545, 5210379, 4852735, 4554957, 4325586, 4157510, 4025799, 3937342, 3832922, 3699492, 3588127, 3465542, 3355981, 3255469, 3125478, 3052921, 2941728, 2865112, 2771697, 2675018, 2640217, 2695032, 2742959, 2784412, 2860005, 2978845, 3106309, 3240980, 3369376, 3470760, 3458375]
10599C458375r6851j80727k31838k42371k42866j62295m2355n3297m3870j3301
10589B148604M863o82o410m7982j00440r7308o3774p4915k6582K5698L1580l8773
10577A753879Q754l126j6703n5713p3617j20451q0751m8395l8831q092j9134k840
10565A294980K0084l9627l3767J7406n731M797K0202K1385K359K4886L7350M4467
10553A408791j7641m6376n434j2217l4307j7443j0746K7442P956j8964k3544l2611
10541A224906j4933J8588o820l2010Q598j1187q15L7684l709K6849j5354R115
10529A240912K1554l0871J6488M1363L6577L0314K5993J9319J3697J9600M415
10518A439361L164P165K5740L0835P315j2010l769j8259p391N68j3659M2582N7210
$$ y = [3458375, 3361524, 3180797, 2948959, 2706588, 2463722, 2301427, 2259072, 2205775, 2161905, 2148604, 2153467, 2152785, 2146375, 2098393, 1997953, 1900645, 1836871, 1761956, 1735374, 1761072, 1792652, 1753879, 1762633, 1759507, 1742804, 1687091, 1613474, 1493023, 1412272, 1363877, 1325046, 1316954, 1297820, 1294980, 1315064, 1275437, 1241670, 1259076, 1253345, 1258142, 1278344, 1299729, 1302088, 1326974, 1364324, 1408791, 1391150, 1344774, 1339340, 1327123, 1292816, 1275373, 1264627, 1292069, 1300025, 1281061, 1257517, 1224906, 1209973, 1228561, 1221741, 1189731, 1198329, 1187142, 1186327, 1224011, 1220302, 1247151, 1231797, 1240912, 1262466, 1231595, 1248083, 1289446, 1326023, 1356337, 1382330, 1401649, 1415346, 1434946, 1439361, 1442525, 1449690, 1475430, 1506265, 1513580, 1501570, 1497801, 1479542, 1472151, 1472719, 1459060, 1501642, 1558852]
10505A558852q742K7050K1115l872J870P7427L2359q555n1456N0104L6442P151
10493A739745M8504L0619J5524J5330Q4802M3639L4823N2400O4349L9661L8357
10482B207753M1341P6032J11918R3222J9875p150L0077L3679j1144j0776K1831
10471B606658J2862P789R388L8495Q8317M9999N1663J05151R4284N6879O7651
10460C189136k09o5828o3791j04631m5104j6096M6183K9169o361O232M0178M9679
10448C058557J15212R0681O8292O8185O0541Q0400J14183J45349J21925J21491
10438D044816J00471P9972L9367l734o3433r7976n2899o5813m4135J270n58j6616
10426C920732R416m5467r703J2211L3586M552L6228K0032L7123P3269o153K1833
$$ y = [1558852, 1550110, 1577160, 1598275, 1594403, 1596273, 1673700, 1706059, 1697504, 1646048, 1696152, 1732594, 1739745, 1788249, 1818868, 1834392, 1849722, 1934524, 1978163, 2012986, 2065386, 2129735, 2169396, 2207753, 2249094, 2325126, 2437044, 2530266, 2550141, 2542991, 2573068, 2606747, 2595603, 2584827, 2606658, 2619520, 2627309, 2636697, 2675192, 2763509, 2813508, 2865171, 2970322, 3064606, 3121485, 3189136, 3188927, 3123099, 3059308, 2954677, 2909573, 2893477, 2939660, 2968829, 2962468, 2968700, 3008878, 3058557, 3173769, 3264450, 3332742, 3400927, 3461468, 3541868, 3656051, 3801400, 3923325, 4044816, 4145287, 4225259, 4264626, 4260892, 4197459, 4099483, 4046584, 3980771, 3936636, 3937906, 3937348, 3920732, 3930148, 3884681, 3874978, 3887189, 3920775, 3925327, 3961555, 3981587, 4018710, 4091979, 4085826, 4107659]
10414D107659P5571K2572l64K656J320M9106M0387M6521N3120P4865O3677R4366
10402D631456R5935M8074j1247K182M0147K8100m931m9672k7591K4657P0775Q3099
10390D930984J54874K10100K06258K43219L53075M87424O72214Q70368J019274
10381I147790J032086O15236j9196m34700m85021k08801Q3945L98241P25059J250458
10371A2105097J798994K054554J632010M66107p93009j564947j530326j047757
10363A3120723n35080j21710J89372M01411N62091P19597R17992J149933J457159
10354A7861488J846368K266455K625276K742728K717305K593589K699789L320938
10346C8673936M497460O041133Q107444J0961474J5013243K0878436K9101611
$$ y = [4107659, 4183230, 4205802, 4205438, 4208094, 4209414, 4258520, 4298907, 4345428, 4398548, 4473413, 4537090, 4631456, 4727391, 4775465, 4764218, 4766400, 4806547, 4834647, 4829716, 4780044, 4752453, 4777110, 4847885, 4930984, 5085858, 5295958, 5502216, 5745435, 6098510, 6585934, 7258148, 8128516, 9147790, 10179876, 10795112, 10775916, 10341216, 9856195, 9647394, 9731339, 10129580, 10854639, 12105097, 13904091, 15958645, 17590655, 18056762, 17263753, 15698806, 14168480, 13120723, 12585643, 12463933, 12653305, 13054716, 13616807, 14336404, 15254396, 16404329, 17861488, 19707856, 21974311, 24599587, 27342315, 30059620, 32653209, 35352998, 38673936, 43171396, 49212529, 57319973, 68281447, 83294690, 104173126, 133274737]
10339A33274737M0345607N5949246P5949433R3255686Q9976504M9747260j5496116
10332E23002357p3407389j01297660r2138732o7109295m5141395l0352158k1098613
10325I2457115j5405881j1637511q932211o915972n332481m105652l118271k481554
10317C4527582k353852k548670k699057k717588k446640k008604j650429j391434
10309A6711308j150935r86533q91096q58290p50674p25336p00947n91103m77834
10300I578560m26595l83545l59313l46927l49830l50992k80440k67577k70836
10291F542505k19613j88114j68964j61893j83478j97763k04769j67684j41054
10282D909173j65034j42594j39744j09629p7985n0544n9095n3101j4146j3031
$$ y = [133274737, 173620344, 229569590, 305519023, 398774709, 488751213, 538498473, 523002357, 449594968, 348297308, 256158576, 189049281, 143907886, 113555728, 92457115, 77051234, 65413723, 56481512, 49565540, 44233059, 40127407, 37009136, 34527582, 32173730, 29625060, 26926003, 24208415, 21761775, 19753171, 18102742, 16711308, 15560373, 14573840, 13682744, 12824454, 12073780, 11348444, 10647497, 10056394, 9578560, 9151965, 8768420, 8409107, 8062180, 7712350, 7361358, 7080918, 6813341, 6542505, 6322892, 6134778, 5965814, 5803921, 5620443, 5422680, 5217911, 5050227, 4909173, 4744139, 4601545, 4461801, 4352172, 4274187, 4223643, 4164548, 4111447, 4097301, 4084270]
10272D084270k8585K7934J20321K42460L48950L82227L45730O0267k82747n02822
10262D798005n20608m05275l28545k74492k00079j53724j26563j17063j12761
10253B558895j46491j26693r6186o6780m6526j3622j5603r065J1983j4796j0915
10242B024201k6676o4296n7828J156m8296r2886j13516q6141r1209q6669n3414
10231A304426m0197l9964l1123O139M5038J5225l9510m8796j9157K7678L975P714
10219A191448m501j9327n1585k8074j9753k3739K9936N6532k7192R686N5535K1351
10207A190317k3752j9429p5556o2487j20347o8275r1412p401j1074k4570k1463
10196F64551N537l6631j8974p823K3647J8527M4441N1165J5780k083K6797J5343
$$ y = [4084270, 4055685, 4083619, 4203940, 4446400, 4795350, 5177577, 5523307, 5583574, 5300827, 4798005, 4277397, 3872122, 3543577, 3269085, 3069006, 2915282, 2788719, 2671656, 2558895, 2412404, 2285711, 2189525, 2122745, 2076219, 2062597, 2046994, 2037929, 2049912, 2035116, 2024201, 1997525, 1933229, 1875401, 1876557, 1828261, 1735375, 1621859, 1535718, 1444509, 1357840, 1304426, 1264229, 1224265, 1193142, 1199281, 1244319, 1259544, 1220034, 1171238, 1152081, 1179759, 1183734, 1191448, 1186947, 1167620, 1116035, 1087961, 1068208, 1044469, 1074405, 1130937, 1103745, 1113431, 1168966, 1190317, 1166565, 1147136, 1071580, 1009093, 888746, 820471, 729059, 721658, 710584, 686014, 664551, 670088, 633457, 614483, 606660, 630307, 648834, 693275, 744440, 760220, 758137, 784934, 800277]
10184H00277n9820p249k4126J9089R4680J00242N5593n71l2099o2657n7554o3464
10172G62341p4493n7557l3954m6064n6877n4696j0910M6908L3809K704k0100J4757
10160E05868k0258l4265j4085l4041N546l314L0377J7982l5877j5064j8555P208
10148C91522L5187j6520k7020n045j7428q685R770J2461j2698l7731P397K2540
10136C53750p224q554K1526J0075O735L1128K1057J9812p339j856J0412R337L8658
10123D97517M5146O1193N3914l0654q7155m0720k8459q4255p4331n2622L5147
10112B94721K7786l078l9300P029L0772L021L680R394n5860k373J32k780L7930
10099C11074L7460O576j294K6029n1332q833K487o684M119k8690J4324K4897J9255
$$ y = [800277, 740457, 733208, 709082, 728171, 822851, 923093, 978686, 978115, 946016, 883359, 825805, 762341, 687848, 630291, 596337, 550273, 493396, 438700, 427790, 474698, 508507, 511211, 491111, 505868, 485610, 451345, 437260, 403219, 408765, 405451, 435828, 453810, 417933, 402869, 384314, 391522, 426709, 410189, 383169, 378124, 360696, 352011, 361781, 374242, 361544, 323813, 331210, 353750, 346526, 337972, 359498, 369573, 376308, 407436, 428493, 448305, 440966, 439110, 449522, 458859, 497517, 542663, 603856, 657770, 627116, 539961, 499241, 470782, 386527, 312196, 259574, 294721, 322507, 319429, 280129, 287158, 317930, 320951, 324631, 334025, 278165, 275792, 275924, 273144, 311074, 348534, 355110, 353816, 379845, 328513, 319680, 322167, 315483, 319602, 290912, 305236, 330133, 349388]
10086C49388j5914j0905M4887L3334M993J5570L2654P6872O1156L1613O4678M8713
10074G37039K268m8767p4710j12374k5652l2069j3948l6113l4560j380N671J2651
10062C78056K4660O8028M5057L7862M3481L1369N1211N1551L1967J12910J57049
10051A033201J58993K15191L25743N31097Q20261J232267J899756K329063J680985
10042A0226557k65716j706792k594434j962288j112879o38903m03322k61013j70015
10033A111195j75110j46445q9632k8751K0567L4333M4140K8992L2329M4806J9950
10022H96374m1587k7399l5650l0401j6991m9581j9081J717L1916q676k5726R13
10010F75828m507O548J9974k0878l1978j7831J1889O9247J6837M645M8066Q2066
$$ y = [349388, 333474, 322569, 367456, 400790, 405783, 421353, 454007, 530879, 592035, 623648, 688326, 737039, 739307, 690540, 615830, 503456, 477804, 445735, 431787, 395674, 361114, 359734, 365405, 378056, 402716, 470744, 515801, 553663, 597144, 628513, 679724, 731275, 763242, 876152, 1033201, 1192194, 1407385, 1733128, 2264225, 3084486, 4316753, 6216509, 8545572, 10226557, 9960841, 8254049, 5659615, 3697327, 2584448, 1945545, 1542223, 1281210, 1111195, 936085, 789640, 700008, 671257, 691824, 726157, 770297, 799289, 831618, 876424, 896374, 854787, 827388, 791738, 761337, 744346, 694765, 675684, 677401, 709317, 700641, 674915, 675828, 671321, 677869, 697843, 676965, 644987, 627156, 639045, 708292, 725129, 729774, 777840, 859906]
9998H59906O8907L4665Q8132J48892K04666L11069M71004N56604M71713J98738
9988C414296j51615m22960n63532n24891l55459k36232j41984j07846q8824o9848
9978G51105l9173k0897j5034J0943M953p462m533l4825n0157k7470m0577l2806
9966D94067M086J9585l406J3314J8846L0912L1137L0640J7743L5628J5312L6734
9954G44598N4105P1525O9320P2871O5142P0120P4732R7618K00531J95742K60575
9943A976879L72790N03311P13955J025906J394180J570351J539975J203092M39106
9934A0739545l29611q78959j031729o84804o884P99668J475465J713060J219187
9925A3014938L2084j217865k096054k227008j777670j233185q20157n23410l20032
$$ y = [859906, 928813, 963478, 1051610, 1200502, 1405168, 1716237, 2187241, 2743845, 3215558, 3414296, 3262681, 2839721, 2276189, 1751298, 1395839, 1159607, 1017623, 909777, 820953, 751105, 711932, 691035, 676001, 686944, 691897, 684435, 679902, 645077, 594920, 567450, 526873, 494067, 498153, 517738, 514332, 527646, 546492, 577404, 608541, 639181, 656924, 692552, 707864, 744598, 798703, 870228, 939548, 1012419, 1077561, 1147681, 1222413, 1320031, 1520562, 1716304, 1976879, 2349669, 2852980, 3566935, 4592841, 5987021, 7557372, 9097347, 10300439, 10739545, 10409934, 9530975, 8499246, 7814442, 7807558, 8607226, 10082691, 11795751, 13014938, 13047022, 11829157, 9733103, 7506095, 5728425, 4495240, 3675083, 3151673, 2831641]
9916B831641j92310j0932J23694K18371K91020L08807R9215j64131m02022n11117
9906B592236m56081l48764k99081j63906j10959j24778j31159n9934o8070l1525
9896G97979k9731l1388l2357J401J8648l1129l9524j6531k7174m1918o274J3570
9884E75572K8060J5759l0944k29Q655L3334K8343Q377j996j485m0555j7677k0995
9871E84219l8323l7354p1201k5676J4429L2720L126l6703j0572K8035J7759J397
9859D61856M4757K3898M830J9565J1810n5837k6292J4034o70L759k8389K001j6700
9846D58622q87K6253L7789O396L592N0066j1203n1080n4080m5948k9480j3235
9834C76805m5258k8985k4168l8153j6874j0914j2679q458L3672k289j930j7002
$$ y = [2831641, 2639331, 2628399, 2752093, 2970464, 3261484, 3570291, 3669506, 3505375, 3103353, 2592236, 2136155, 1787391, 1488310, 1324404, 1213445, 1088667, 957508, 897574, 829504, 797979, 768248, 736860, 704503, 705904, 724552, 693423, 653899, 637368, 610194, 568276, 562002, 575572, 603632, 619391, 588447, 588218, 596873, 630207, 658550, 666927, 664931, 663446, 622891, 605214, 584219, 545896, 508542, 437341, 411665, 426094, 458814, 461940, 425237, 414665, 442700, 460459, 461856, 506613, 530511, 535341, 554906, 566716, 510879, 484587, 498621, 497951, 501710, 473321, 475322, 458622, 457735, 483988, 521777, 528173, 531765, 581831, 570628, 519548, 465468, 419520, 390040, 376805, 331547, 302562, 278394, 240241, 223367, 212453, 199774, 191316, 224988, 222699, 220769, 203767]
9822B03767L5526K0314N502j1009k8556K3749M7520k1192k1695L124Q964M1582
9810C07596L6945r001N569q593q259J5040J0037l036J3477J1742j4335n4254q6803
9797B16125l0322K2677J5111J5069P443k4303j8575J854k1530Q639K1910K9477
9785B43575k0718r474L9140J906K9931K9585Q844k9003l0168K7798J4670L7755
9773C43841P7365R9406P4629J05373J69027K49087L19348M31285N80440N50688
9763C000489K48407k11728n82073o86759m67783l00186k19294j53513o3074k9583
9753E34903p5031m2649k2682K7953L5858j2177p2612K0323K9474M3967O1098N8339
9741E86764N8286P3959J1976j5953q2748n8293k4665m7401n1883j387N632m3340
$$ y = [203767, 239293, 259607, 265109, 254100, 225544, 249293, 296813, 275621, 253926, 257050, 266014, 307596, 344541, 335540, 341109, 332516, 324257, 339297, 349334, 346298, 359775, 371517, 357182, 302928, 216125, 185803, 208480, 223591, 238660, 246103, 221800, 203225, 205079, 183549, 192188, 214098, 243575, 222857, 213383, 252523, 254429, 284360, 313945, 322789, 293786, 263618, 291416, 306086, 343841, 421206, 520612, 595241, 700614, 869641, 1118728, 1438076, 1869361, 2449801, 3000489, 3248896, 3037168, 2455095, 1768336, 1300553, 1000367, 781073, 627560, 564486, 534903, 459872, 417223, 394541, 422494, 458352, 446175, 373563, 393886, 423360, 467327, 528425, 586764, 645050, 719009, 730985, 715032, 632284, 573991, 549326, 501925, 450042, 448655, 454287, 410947]
9729D10947m1114O268J4219K0928J7745k4176J2690K2213L511N0298P7620j5014
9717E56135J2898L7371R302k223M911O4226n120J7608J8224M1817O2158O6756
9705H84063J03965M9208M1880O6736N9070L6567k227k7837l7600k3303j0087n3261
9693A087174o1503n0584k2547m6193o7665j0170l4971l8433j2643P556J1097J987
9681G63105J6080N1908O7473m268j5578o0573J1655N0321R7033Q0554O9494Q3972
9669A211176L5351N7493L0931N2588M4769J01285J14464N7511M1884L9003L6739
9658A823194p7523j12372j31898j33211j01874l6761j2927r120m4901l0959m6064
9647A085584q0558j6456j9740M474K4341L3880L3812P6411M1304Q5466J06308
$$ y = [410947, 369833, 376101, 390320, 411248, 428993, 404817, 417507, 439720, 443231, 493529, 571149, 556135, 569033, 606404, 615706, 613483, 618394, 682620, 677500, 695108, 713332, 755149, 817307, 884063, 988028, 1037236, 1079116, 1145852, 1204922, 1241489, 1239262, 1211425, 1173825, 1150522, 1140435, 1087174, 1025671, 975087, 952540, 906347, 838682, 828512, 793541, 755108, 742465, 750021, 761118, 763105, 779185, 831093, 898566, 894298, 878720, 818147, 829802, 880123, 977156, 1057710, 1127204, 1211176, 1246527, 1304020, 1334951, 1387539, 1432308, 1533593, 1648057, 1705568, 1747452, 1786455, 1823194, 1745671, 1633299, 1501401, 1368190, 1266316, 1229555, 1216628, 1207508, 1162607, 1131648, 1085584, 1005026, 988570, 968830, 973304, 997645, 1031525, 1065337, 1141748, 1183052, 1268518, 1374826]
9636A374826P5320M2855N8782M690L6662P2766M8808O2722O2496L2510K6186Q2
9624A898705l2502o1146n5364j2969p62m1444l0576k2655p2164o9358m1105p3056
9612A385604l4931k766q9336o5169l1456m8370r558k7915N4j6822k4115K7759
9600A062979N2289M3703L8740K40N860q177M7296J02607J21612J49222J55427
9589A771798Q4721J4800m3470n1573o4248m4151j2854M9546L7764l7683l3930
9578A670720l8604r5126q8784p6354l0964m376k531R075k0989m7449J326K1557
9566A297501K0359J4246K8738L4274K4791K1378P2736J02755K8379L8436O6246
9555A749839R382j50L917N7280J06981J08321N2173N5727P8004P7516R5256Q8384
$$ y = [1374826, 1450146, 1493001, 1551783, 1556473, 1593135, 1665901, 1714709, 1777431, 1839927, 1872437, 1898623, 1898705, 1866203, 1805057, 1749693, 1736724, 1735962, 1694518, 1663942, 1641287, 1569123, 1499765, 1458660, 1385604, 1350673, 1347907, 1258571, 1193402, 1161946, 1113576, 1104018, 1076103, 1076157, 1059335, 1035220, 1062979, 1115268, 1158971, 1197711, 1197951, 1203811, 1195634, 1242930, 1345537, 1467149, 1616371, 1771798, 1856519, 1871319, 1827849, 1776276, 1712028, 1667877, 1655023, 1704569, 1742333, 1704650, 1670720, 1632116, 1536990, 1448206, 1371852, 1340888, 1336512, 1333981, 1343056, 1322067, 1274618, 1275944, 1297501, 1317860, 1332106, 1360844, 1395118, 1419909, 1441287, 1514023, 1616778, 1645157, 1683593, 1749839, 1759221, 1759071, 1762988, 1820268, 1927249, 2035570, 2087743, 2143470, 2221474, 2298990, 2394246, 2482630]
9543B482630R3020J32140J19824J48416K33922K90096K75833L66437M41704N91790
9533E175812P79388J014585J342165J780256K275418K666167K763096K227642
9525B0024529J089320m07136j690994k368257k413246j998578j517286r99708
9517I718644o06357l10175j06927R3770K68634L09246K62904J72823N4235n2275
9507I804522j33991j68286l7734Q7323L31149O38509R58100J376385J767651K152786
9497A6776414K498639K698656K721450K794387L030506L308644L435495L433175
9489D0697366L349262K910582J955533N97043p67587j842216k599253l134090
9481D1166640l586718l730390l593212l192119k614592k092430j680156j321768
$$ y = [2482630, 2575650, 2707790, 2827614, 2976030, 3209952, 3500048, 3775881, 4142318, 4584022, 5175812, 5955200, 6969785, 8311950, 10092206, 12367624, 15033791, 17796887, 20024529, 21113849, 20706713, 19015719, 16647462, 14234216, 12235638, 10718352, 9718644, 9112287, 8802112, 8695185, 8788955, 9057589, 9366835, 9629739, 9802562, 9856797, 9804522, 9670531, 9502245, 9464511, 9551834, 9882983, 10521492, 11479592, 12855977, 14623628, 16776414, 19275053, 21973709, 24695159, 27489546, 30520052, 33828696, 37264191, 40697366, 44046628, 46957210, 48912743, 49509786, 48742199, 46899983, 44300730, 41166640, 37579922, 33849532, 30256320, 27064201, 24449609, 22357179, 20677023, 19355255]
9473A9355255j038475p65436l69969M2492M17784P38706J006311J238066J455855
9464B2080589J772923K065331K164539J815647J106188M67825K81674Q18118K135446
9455C4708280L749117N519033P023963P694157O886821M519274J065211k590754
9447F8575102n427235o846097o840087n647385m060571k690765j856906j670586
9439C3535470j921127k136485k201642k142363j991006j835951j652327j401455
9431A8253114j078280p44312l08521J44115N45203R24045J281605J550468J746525
9422B2313962J969089K184687K338668K237215J820989J297550J080935J260925
9414C6504020J669258J803918J419112O67168l57984j400407k352749l085729
$$ y = [19355255, 18316780, 17551344, 17181375, 17223867, 17641651, 18380357, 19386668, 20624734, 22080589, 23853512, 25918843, 28083382, 29899029, 31005217, 31473042, 31754716, 32572834, 34708280, 38457397, 43976430, 51000393, 58694550, 65581371, 70100645, 71165856, 68575102, 63147867, 56301770, 49461683, 43814298, 39753727, 37062962, 35206056, 33535470, 31614343, 29477858, 27276216, 25133853, 23142847, 21306896, 19654569, 18253114, 17174834, 16430522, 16122001, 16266116, 16811319, 17735364, 19016969, 20567437, 22313962, 24283051, 26467738, 28806406, 31043621, 32864610, 34162160, 35243095, 36504020, 38173278, 39977196, 41396308, 42063476, 41705492, 40305085, 37952336, 34866607]
9406C4866607l355817l297900l023237k827303k800130k610797k242301j790564
9398A2918558j343496r66076o70818m34211k63389j84526j34409j31779r3378
9389H696476j49413k35240k56604k88013k63899j71133Q195K21528M32641P06426
9379H700964J144316J553500J838065J925247J573987P31559l99718j453890k110490
9370A3503540k272838k003637j589278j225936r24793o98200n37782m32090l30278
9361C488708l07364k80988k23420k07037k14701j82107j38686j22406j28492j08165
9351A575342p2679n5880p9819n9466o2935j5118k4501r7699m3957J7504q588p0260
9339A001944o1733J2386j9192p1003k3155j239n665K0038j0584o283J4595J8662
$$ y = [34866607, 31510790, 28212890, 25189653, 22362350, 19562220, 16951423, 14709122, 12918558, 11575062, 10608986, 9938168, 9503957, 9240568, 9056042, 8921633, 8789854, 8696476, 8547063, 8311823, 8055219, 7767206, 7503307, 7332174, 7340369, 7561897, 7994538, 8700964, 9845280, 11398780, 13236845, 15162092, 16736079, 17467638, 17067920, 15614030, 13503540, 11230702, 9227065, 7637787, 6411851, 5487058, 4788858, 4251076, 3818986, 3488708, 3181344, 2900356, 2676936, 2469899, 2255198, 2073091, 1934405, 1811999, 1683507, 1575342, 1502663, 1446783, 1366964, 1307498, 1244563, 1229445, 1204944, 1107245, 1063288, 1080792, 1072204, 1001944, 940211, 952597, 933405, 862402, 839247, 838008, 832343, 852381, 841797, 835514, 850109, 868771]
9327H68771n3526n5271l6119j9814N137j5491R4J8083l7261m0987k5350j7780
9315E90486L4977L8525J2329n9566k8977k7104j1326k9762j5832R679q109l6111
9303D69209M476R374o229m1779J9580L4635k8009k6976l4759j8893R92P236l1398
9290C57459n551k8471j7914J7936N9656P986l5200J0555l659l4216k906j4146
9278C11529L6212K5317j3242p949k7304l7346q953l532o835m466m626p072J866
9265B53599k0093p560l907o343k5668m3692K4530J4923q65N120Q426J169l5440
9252A64199l3832M1009J5712R726n600l9557l1566l24O717j7514l4067Q019K5075
9239A07997K8040Q449j1895L6352L2713j1978j1860j4606j3804j6500j2412J5865
$$ y = [868771, 815245, 759974, 723855, 704041, 709178, 693687, 693781, 711864, 674603, 633616, 608266, 590486, 625463, 663988, 676317, 616751, 587774, 560670, 549344, 519582, 503750, 513429, 505320, 469209, 473685, 483059, 476830, 435051, 454631, 489266, 461257, 434281, 399522, 380629, 381621, 388857, 357459, 351908, 323437, 305523, 323459, 383115, 391101, 355901, 366456, 362797, 328581, 325675, 311529, 347741, 373058, 359816, 351867, 324563, 287217, 278264, 274732, 267897, 263431, 258805, 251733, 253599, 233506, 225946, 222039, 215696, 190028, 146336, 170866, 185789, 184924, 190044, 198470, 199639, 164199, 130367, 171376, 187088, 196814, 191214, 151657, 120091, 119767, 126484, 108970, 74903, 82922, 107997, 136037, 144486, 132591, 168943, 201656, 189678, 177818, 163212, 149408, 132908, 120496, 136361]
9227A36361l2170j5826l5680j3121L8688M3747r141k084k0748j5671M557J7118
9215I6030K7354K5602O081K899o431P927l5035n0155r094q862j4360J3795q214
9202D7537k1274l1864J4345J2259q087n266K5962J5313J7124J8270l2538k0740
9190C1041J725m530O337l1653j593L8074j4026k0296r071J6598M351R027M0145
9177F6129l3445Q973r734k957j1927j725K3976N779j5081p327k5799L3191r43
9164B9110L8867J4804n147P714k0922m8161k2292j74m491N697k7300L0575m467
9151f187j0500R048p682J4229M0098P202M9604J4730l3772l4624J5329J4139k5784
9138D5830k2555l968l3769J1436O4687J2385j1038k330M8694J7002M680l357K1917
$$ y = [136361, 104191, 88365, 52685, 39564, 78252, 121999, 112858, 110774, 90026, 74355, 78912, 96030, 123384, 148986, 155067, 157966, 151535, 159462, 124427, 74272, 65178, 56316, 41956, 55751, 47537, 26263, -5601, 8744, 21003, 12916, 7650, 33612, 48925, 66049, 84319, 51781, 31041, 32766, 28236, 34573, 2920, 1327, 39401, 25375, 5079, -3992, 12606, 16957, 25984, 66129, 32684, 41657, 31923, 28966, 17039, 15314, 39290, 45069, 29988, 22661, -3138, 30053, 29110, 67977, 82781, 77634, 85348, 64426, 16265, -6027, -6201, -10692, -4995, -32295, -1720, -6187, -16687, -7639, -15321, -1092, 39006, 46208, 95812, 110542, 76770, 42146, 57475, 71614, 45830, 23275, 19307, -14462, -3026, 61661, 74046, 63008, 60678, 109372, 126374, 131054, 127697, 149614]
9125A49614J9796p621m2462m3397j0471P320K7311K526J3555o405k3289j0694
9113G5783p379R775R812O758l5336j4975j700l9285q11L4194j7008J9562L1288
9100G0678J316j780N9476L0556j3269Q91J7151N8396K6357R081K5719K4258J4453
9087C23283k9857m7321k296o905j8763j960r602k7015j4943K0289j8478J8586
9075A85018J3995k5089j229p313k7417J0859L037J2909j0379m5767L281M8J3366
9062A25319K4240J2241K0919l5414l30O9816K7209J834J8552N7658L1507J9526
9050C73077J8103K085l9022k8792k5232n7859l4271R222k4169l2370L3488j1139
9038A83121l596j5199m5822J2122L310n8095j7156o718K8022L4346J0847K7466
$$ y = [149614, 169410, 161789, 119327, 75930, 65459, 72779, 100090, 102616, 116171, 109766, 86477, 75783, 68404, 78179, 87991, 94749, 59413, 44438, 42738, 3453, 2642, 36836, 19828, 39390, 70678, 71994, 70214, 129690, 160246, 146977, 147868, 165019, 223415, 249772, 258853, 284572, 308830, 323283, 293426, 246105, 243809, 236904, 218141, 216181, 206579, 179564, 164621, 184910, 166432, 185018, 199013, 173924, 172695, 165382, 137965, 148824, 151861, 164770, 154391, 108624, 111905, 111953, 125319, 149559, 161800, 182719, 147305, 146975, 216791, 244000, 245834, 264386, 322044, 353551, 373077, 391180, 393265, 354243, 325451, 300219, 242360, 208089, 217311, 193142, 160772, 194260, 183121, 179525, 164326, 118504, 130626, 133936, 75841, 58685, 51967, 79989, 114335, 125182, 152648]
9026A52648K783J901m1486O91j7729O538M3655N2942N2051J1461r023l145j9180
9013B34107j4404J6476J3941l9735p475K6127j8823j5791k7796l5974k4519k9832
9001G6302j3906J0445J8433j2983j3660J2948j1498l836J2317J0496M5316K7247
8989A57621k4539j3193p711l7010j8199J4033J5529J080j8833J5360N271k2475
8977F6934K6427K8287J5125j7495m6368M486K0595J5725J820l5010j4900k2267
8965D3359R195K8959o658m5572k6573J1848o109N044o175J7919J1007K307K777
8952D1328J32n203o05K7181R131K1318J4107k3449k6432L4780j7741k6295R491
8939E7743J0244K6378M524J0024j023k5139R821L4284K9371p7205k5534j462N131
$$ y = [152648, 155431, 157332, 115846, 116537, 98808, 105346, 149001, 201943, 253994, 265455, 256432, 253287, 234107, 219703, 236179, 250120, 210385, 202910, 229037, 210214, 194423, 166627, 130653, 106134, 76302, 62396, 72841, 91274, 78291, 64631, 77579, 66081, 62245, 74562, 85058, 130374, 157621, 133082, 119889, 112178, 75168, 56969, 71002, 86531, 87611, 68778, 84138, 89409, 66934, 93361, 121648, 136773, 119278, 72910, 77396, 97991, 113716, 115536, 80526, 65626, 43359, 52554, 81513, 74855, 29283, 2710, 14558, 8449, 13493, 7318, 25237, 36244, 38551, 41328, 41460, 36257, 35652, 62833, 71964, 93282, 107389, 83940, 57508, 92288, 74547, 48252, 57743, 67987, 94365, 98889, 108913, 107890, 82751, 92572, 126856, 156227, 79022, 53488, 52026, 57157]
8926E7157k9226k8904j2494K7811j1619P410Q985K4182K7853L0844O271l3443
8914G4827k8031K2701k8134K3911J6664R773P43K1939L1407j5521k6809O636N426
8901A15532j4075m0876j3475K9807K8374o6644o795L8356M3601J518K3067r119
8889A29271l6580j4565K12K4349M4043N402o052l8164k8655k0688k5055n81k4669
8876H268l9753O604L0827J5313n989j5380O7160J7910k1476k3384k4098K2253
8864C8255N0526J4512n5955K0666J1427l6111J2934L6531L6306m4075p186L7230
8852A15060M067j4152K4879r827L198J4958M045M851q242o816J4671j5310J8577
8839A49959l886q941j3655p075K2507o943j9803J5O435l3935K4749k642j3439
$$ y = [57157, 27931, -973, -13467, 14344, 2725, 10135, 19120, 43302, 71155, 101999, 108270, 74827, 46796, 69497, 41363, 65274, 81938, 91711, 92454, 114393, 145800, 130279, 103470, 110106, 115532, 101457, 60581, 47106, 76913, 105287, 38643, 31848, 70204, 113805, 115323, 138390, 129271, 92691, 78126, 78338, 102687, 146730, 152132, 146080, 107916, 79261, 58573, 33518, 32937, 8268, -31485, -24881, 5946, 21259, 15270, -110, 67050, 84960, 63484, 40100, 16002, 38255, 88781, 103293, 47338, 68004, 79431, 43320, 56254, 92785, 129091, 85016, 77830, 115060, 119127, 104975, 129854, 120027, 123225, 138183, 142228, 147079, 138837, 132021, 146692, 131382, 149959, 146073, 137132, 123477, 116402, 138909, 131966, 112163, 112178, 118613, 84678, 109427, 106785, 93346]
8826I3346J817q466j6145m7904J8260R968K0062k547j054M7536M7664k1772k8383
8813A12382N3541Q043m1184l899P619O954m1118K0323m303J2084K0289N7388L3756
8800B41875K3067j7148l4685J8287L0390J6962j4913m3582j3918J9103L655o506
8788B22587N981k752m3766k6779K0768j2462p241j3405n4182q285m0482K6120
8776F6102L7124r107k4081m875k4132o557J314N7825j223L6024k683l4788P986
8763I8929J4608P477j8336K6741q280l3650M760L0872K3738j2109M8077L0913
8751B13740k6665J4082K3231L5895O5202J8199n9473k6718k2454m3918q870l8894
8739A43357k5929k0255j7790j8927K3651J6150L3075Q494l8618k3089p848l5611
$$ y = [93346, 95163, 86697, 70552, 22648, 40908, 50876, 70938, 68391, 67337, 114873, 162537, 140765, 112382, 165923, 173966, 132782, 128883, 136502, 143456, 102338, 122661, 118358, 130442, 150731, 208119, 241875, 264942, 247794, 213109, 231396, 261786, 278748, 263835, 220253, 206335, 225438, 229093, 222587, 228568, 225816, 182050, 155271, 176039, 163577, 156336, 142931, 88749, 80464, 39982, 66102, 103226, 94119, 70038, 65163, 41031, 34474, 35788, 93613, 92390, 128414, 125731, 90943, 98929, 113537, 121014, 102678, 129419, 121139, 87489, 92249, 123121, 146859, 134750, 182827, 213740, 187075, 201157, 224388, 260283, 325485, 343684, 284211, 257493, 235039, 191121, 182251, 143357, 117428, 97173, 79383, 60456, 84107, 100257, 133332, 141826, 103208, 80119, 72271, 36660]
8727C6660l2325p622L2094M5617L3541k4702L1419M2706L5177m3749l2603K6154
8715A42367K0363o128j9975p043j8143k196J0256L3564N081n259l2500k1546L2308
8702A31149M8745o687j5128n8722N32J3555k469j902k1508j7304J2817K5463k4473
8689H4068n2220j2719K5472K9307K375l9673n225J6279L7033k7690k5628k9078
8677B301m828J4728R77n097k921M337K2588J2145l9299J9810L9225J6683J6651
8664I7300n7000k6458o710J0060M9167Q2681J3240j8170J5207j6405l0219l150
8652A09543K1694M4648m848l3379J2114L8963N0170o736Q481J9544q375m0240
8640B11579k5117l8037j9162J4597j1519l5656n005L9580j2169k0966j0053m9898
$$ y = [36660, 4335, -3287, 28807, 74424, 107965, 83263, 114682, 157388, 192565, 148816, 116213, 142367, 162730, 156602, 136627, 129584, 111441, 109245, 119501, 153065, 158146, 152887, 120387, 98841, 131149, 179894, 173207, 158079, 99357, 99889, 113444, 110975, 109073, 87565, 70261, 83078, 108541, 84068, 31848, 19129, 44601, 73908, 76283, 36610, 31385, 47664, 84697, 57007, 31379, 2301, -2527, 12201, 13178, 8081, 5160, 9497, 32085, 44230, 4931, 24741, 63966, 80649, 97300, 40300, 13842, 7132, 17192, 66359, 149040, 162280, 144110, 159317, 142912, 112693, 109543, 131237, 175885, 171037, 137658, 149772, 188735, 238905, 232169, 240650, 260194, 251819, 211579, 186462, 148425, 129263, 143860, 132341, 96685, 91680, 131260, 119091, 98125, 88072, 38174]
8628C8174k2022J7658L1244j8762k0466R63M6670j1292j6482K7208l1621j0431
8616C0841J2338M8719L9006J3368k2618K9150l252l5895r240j0070j3629Q885
8604H7603j476l767Q198k0302m123P791J3101K6685m292l3673N5909L1807J932
8591A65393K0956k0664j7799L0428M3685K6949J3436j4112J6986k192m6932l8112
8579A78022p8271m5422J8118m0640p401l8786j301K2723J7205K2829M9774K1731
8567A18581m1053r669j4421l7101o115J03J1159j8320q296J3688K4355L4114m635
8554F2390m918k3209j1416K7997l388K5775K2934J747k4776j2787R067R463L3479
8541A12358L0679k1707l194p891n1518j4285J5245p207k6720L4646M8209k5632
$$ y = [38174, 16152, 33810, 65054, 46292, 25826, 26789, 73459, 62167, 45685, 72893, 41272, 30841, 43179, 91898, 130904, 144272, 121654, 150804, 147552, 111657, 102417, 92347, 78718, 87603, 86127, 82360, 90558, 70256, 66133, 73924, 87025, 113710, 109418, 75745, 131654, 163461, 165393, 186349, 165685, 147886, 178314, 221999, 248948, 262384, 248272, 265258, 263066, 216134, 178022, 99751, 54329, 72447, 31807, 24406, -14380, -15681, 7042, 24247, 47076, 96850, 118581, 77528, 67859, 53438, 16337, 10222, 10325, 21484, 3164, -5132, 8556, 32911, 67025, 62390, 57472, 34263, 22847, 50844, 47456, 73231, 96165, 97912, 73136, 60349, 69416, 78879, 112358, 143037, 121330, 118136, 110245, 58727, 44442, 59687, 52480, 25760, 60406, 108615, 82983]
8529H2983l8346p553j4306O904O692K0454n694K6472O8703J9683j172k7051l0302
8516A07467m25p072J9526J2258k3063m7247m1056J8898L5488j307l1568k1928
8504A9971R175K4434o077M943j1377j3595M372Q998j5266J9528N4795K517Q740
8491A11158J4494j8532M884K121Q204n4842k7850l8179n0450k6240l517K5951
8479e2798M8038N9205M844O224j3887k3271m2697J796J7644P961j334j034j1466
8466g75k800p711J3293P579q385J3286M378p314P103k6580O874P427j4165J1284
8452C494j7031j3477O8018K3507J8368q503K7801P973K4885l3652l0480k0940
8440D9963K7497n612R713q485k1042j0836j0657l444J0025K9138j2396J8452K0449
$$ y = [82983, 44637, 37084, 22778, 29682, 36374, 56828, 51134, 77606, 146309, 165992, 164820, 137769, 107467, 107042, 99970, 119496, 131754, 108691, 61444, 20388, 39286, 74774, 73467, 41899, 19971, 29146, 53580, 47503, 52446, 41069, 27474, 31846, 40844, 25578, 45106, 99901, 102418, 111158, 125652, 107120, 112004, 114125, 122329, 67487, 39637, 1458, -48992, -75232, -78749, -52798, -4760, 54445, 59289, 65513, 51626, 28355, -14342, -12546, 5098, 13059, 11725, 10691, -775, -3575, -11286, 2007, 9586, 1201, 14487, 18865, 11551, 18654, -7926, -1052, 6375, -7790, 3494, -13537, -27014, 41004, 64511, 82879, 74376, 102177, 110150, 135035, 101383, 70903, 49963, 77460, 71848, 81561, 73076, 52034, 41198, 30541, 27097, 37122, 66260, 53864, 72316, 92765]
8427I2765j031j5056j4426K230M963o1555j3293M9118J3077M592l5075L044L14
8414B9667J0229j1517J1593L3311J5000J7867k8984k1506j5133j3977J3398n6373
8402a6425k7618j1671O411O6513L9158m7712n2303k1401J8372L9030K9710j3171
8390H893j604K5317J1103j1851l4845k1887J0949L1458N761j3191J8555J5360
8378D4018N113R495R779n0213m8049K3260J3316k9673k2237J3970L323P824J2928
8365g146p318j580q861K0017j1321j2135K2762L2258j7924j2392j1067J5424L0070
8352C0787K0200J6500L4739j3115J0611L1567k0431l5301j6032j664n4716j8395
8340a5250N172Q530N886K7214K8586k6334j0539K7686j0161L3674K4933q291N001
$$ y = [92765, 91734, 76678, 62252, 64482, 69445, 7890, -5403, 43715, 56792, 61384, 26309, 29353, 29667, 39896, 28379, 39972, 73283, 88283, 106150, 77166, 55660, 40527, 26550, 39948, -16425, -44043, -55714, -49303, 17210, 56368, 8656, -43647, -65048, -46676, -7646, 22064, 8893, 7289, 32606, 43709, 31858, -2987, -24874, -13925, 17533, 23294, 10103, 28658, 44018, 49131, 58626, 68405, 18192, -29857, -6597, 6719, -22954, -45191, -31221, -27898, -20074, -7146, -14464, -16044, -24905, -4888, -16209, -28344, -5582, 26676, 8752, -3640, -14707, 717, 30787, 50987, 67487, 102226, 89111, 99722, 131289, 110858, 75557, 59525, 57861, 3145, -15250, -10078, -1548, 4338, 31552, 60138, 33804, 23265, 50951, 40790, 74464, 99397, 91106, 96107]
8327I6107j6425j1405k6081m897J0303P833l7273J0028K9608L8969j8107l692
8315G4968j0205j1617j7378K206l878Q13N965K213k057m0219l1386J7931K5248
8302A2604K9189J6057O197j4057j6648k3931k8403N718o837M191L9676r833l8276
8289b4353L9308K6668m5611o281l1444o008l718j6534K3038L0720j7208j5754
8277d7177J9415K5681K0426N4981J0107j1606K129n597k5592k7107J8795k1645
8265A2810j321M8467L6836Q663k9003k8081J1576j9701k5918L0601k6569K1724
8253D0084J5085r909J5018j8638j1104l2218K8372J480L7345M7525L63m6359k9204
8240C7840M40L5825K7886M0060K8444M8313j3578l3965J4418R315k2445j5956
$$ y = [96107, 79682, 68277, 42196, 37299, 47602, 55435, 18162, 28190, 57798, 96767, 78660, 74968, 64763, 53146, 35768, 37974, 34096, 34909, 40874, 43087, 41030, 811, -30575, -12644, 12604, 41793, 57850, 64047, 49990, 33342, 9411, -18992, -13274, -20111, -15920, 23756, 13923, -24353, 14955, 41623, -3988, -10269, -41713, -47721, -51439, -67973, -44935, -14215, -31423, -47177, -27762, -2081, 18345, 73326, 83433, 71827, 73956, 68359, 42767, 15660, 34455, 12810, 11489, 59956, 96792, 105455, 76452, 48371, 59947, 40246, 14328, 44929, 18360, 40084, 55169, 45260, 60278, 41640, 30536, -1682, 26690, 28170, 65515, 113040, 113403, 67044, 37840, 38280, 74105, 101991, 142051, 170495, 218808, 205230, 171265, 185683, 194998, 172553, 156597]
8228A56597j348j6587n429k8112j8989l7966n3157p226m5506P734O1551r184N53
8215B931J2076K241M448n422K9810l369k8265r419M1618N697l152l653j0034k7097
8201H410K2092j1232j0613l644K4657J9495m350l8148j8810L7952M2577O0963
8189A29349K8535m766j5681n3672p4089K829J0746J6405J8310M252p816j6675
8177C7727L930L62n375q762J1921K9106k3155n884j6311Q795k8105L5015K4316
8164F3580K639o536n8713j6300L713j898K3453J4216K9477m850K0210M073J5471
8151H8535l0137l1957k3289P699L8649l465l5329L2588J3935l3623N352N530M2420
8138G6908o426l7567j4043L7242J6200k823K202K9559O2055J6292l6476l607N3160
$$ y = [156597, 155249, 138662, 133233, 105121, 86132, 48166, -4991, -12217, -57723, -49989, 11562, 2378, 2931, 15007, 17248, 21696, 16274, 46084, 42715, 14450, 5031, 46649, 52346, 49194, 45541, 35507, 8410, 30502, 19270, 8657, 5013, 29670, 49165, 44815, 6667, -12143, 25809, 68386, 129349, 157884, 153118, 137437, 83765, 9676, 12505, 23251, 39656, 57966, 62218, 54402, 37727, 41657, 42019, 36644, 27882, 39803, 68909, 45754, 39870, 23559, 32354, 4249, 39264, 63580, 66219, 59683, 970, -15330, -11617, -13515, 9938, 24154, 53631, 48781, 68991, 73064, 88535, 58398, 26441, 3152, 10851, 49500, 46035, 10706, 43294, 57229, 23606, 28958, 34488, 76908, 70482, 32915, 18872, 56114, 72314, 69491, 71693, 101252, 163307, 179599, 143123, 139516, 192676]
8125A92676r731m1447Q176O29m0176k1165r587k1333J259k5777j6294l5416k258
8112b0444Q150L231J7113K6955j0593J2310l416k7646L0312J732j2015J9470O7519
8099A12678J8615j2355o2038j3987K5715R326K2221M0100J2009j9505n7129l457
8087G2193r391J3289N971J0179l2442m4601l6245Q362N8364O1001o501o7527J7067
8074D9719M0464L0496m4560j6401J0685K8723j2924k9162k9186L0692K7615L408
8062H9569l9757J90j123K0622K0614J515O160k1608K569N1715K5364r313R044
8049A55561p075K7575n357n912K5780N0798j2188k6274k9897k1904k7684L144
8037A26567J6662R307j3589Q650J3846l120P137k9514j3541o85J2887J1244J5046
$$ y = [192676, 182945, 141498, 149674, 150303, 110127, 88962, 79375, 58042, 59301, 33524, 17230, -18186, -20444, -12294, -9063, 8050, 35005, 24412, 36722, 33306, 5660, 35972, 37704, 25689, 45159, 112678, 131293, 118938, 56900, 42913, 68628, 77954, 100175, 140275, 152284, 132779, 75650, 72193, 62802, 76091, 82062, 92241, 59799, 15198, -21047, -12685, 45679, 106680, 100179, 32652, 49719, 90183, 120679, 76119, 59718, 70403, 99126, 86202, 57040, 27854, 58546, 86161, 89569, 49812, 50002, 48879, 69501, 90115, 91630, 97790, 76182, 78751, 130466, 155830, 146517, 155561, 148486, 176061, 170704, 164792, 190572, 241370, 229182, 202908, 173011, 151107, 123423, 126567, 143229, 152536, 138947, 147597, 161443, 158323, 165460, 135946, 122405, 121720, 134607, 145851, 160897]
8024A60897K0770j6690m721J8040k1088l0766l609P501k6836k1611k4466Q57N7145
8011A15423P6134L9220j1809n958K6545L6620l893k7961o803J617l4122p968J3125
7998B10170J2233J5572K0986p584k5613k2965l53M8019n049K705j4585j9773j760
7985B12003k2934m7057k4221l901J5866P351l6907l479J5173Q994j9573j3226
7973H8089j6920k8577J2944J3388j9150L3374j5977Q809J3240l0511K9860J4031
7961A02600J2170P097J9168l3747k108M7161L3892K0805L027L540n87K7153J589
7948B41760l236k7505l2686m0870J6119k828j6945K2489j0984l8324K2940j4255
7936A15675M1026k125q124j538r864m8191q105m2525J8540M4706M7326K1759J5061
$$ y = [160897, 181667, 164977, 160256, 178296, 157208, 126442, 122833, 130334, 103498, 81887, 57421, 58278, 115423, 191557, 230777, 218968, 213010, 239555, 276175, 272282, 244321, 237518, 239135, 205013, 197045, 210170, 222403, 237975, 258961, 251377, 225764, 202799, 202446, 250465, 245416, 248121, 233536, 213763, 212003, 189069, 142012, 117791, 113890, 129756, 137107, 100200, 96721, 111894, 120888, 101315, 88089, 71169, 42592, 55536, 68924, 49774, 83148, 67171, 75980, 89220, 58709, 88569, 102600, 114770, 121867, 141035, 107288, 105180, 152341, 186233, 207038, 210065, 213605, 213018, 240171, 241760, 238524, 211019, 178333, 137463, 153582, 150754, 133809, 156298, 145314, 106990, 129930, 115675, 156701, 154576, 146452, 144914, 135050, 86859, 78754, 36229, 54769, 99475, 146801, 168560, 183621]
7923A83621J3852n7774q244k3781k4333R750L030j0811K9804J1367j1624J6568
7911A31425j7506K6736J6386p344j5188K7579N7584K2701K2294N1750N5015j173
7899C70259j1989M6637R0773J06317R2761R8462K7942k2501m3036j15857j41916
7888D97852j15622p2428p7583m6401K0009j1106k3593n1412j0154M2288p295j2553
7876A32002n069J0782k8317m7758k6785M1005O0365k165r800J797J5449J0911
7864A52417j1992L2013J5060L692l8711k7170J0807K4412K6645M1188R0700L2022
7852C51083Q1669J78960K08458K13895K14927J21068m7347j28140j91361j75213
7842H27999j89731j44482j02928p5083k5383n1219k7534J5160m500j5104m1285
$$ y = [183621, 197473, 139699, 131455, 107674, 83341, 93091, 96121, 85310, 115114, 126481, 114857, 131425, 113919, 140655, 157041, 149697, 134509, 162088, 219672, 242373, 264667, 316417, 371432, 370259, 358270, 404907, 495680, 601997, 694758, 793220, 821162, 798661, 755625, 639768, 497852, 382230, 309802, 232219, 185818, 205827, 194721, 171128, 119716, 109562, 151850, 144555, 132002, 126933, 137715, 109398, 61640, 34855, 75860, 136225, 134060, 124260, 126057, 141506, 152417, 140425, 172438, 187498, 191190, 152479, 125309, 136116, 160528, 187173, 228361, 319061, 351083, 432752, 611712, 820170, 1034065, 1248992, 1370060, 1322713, 1194573, 1003212, 827999, 638268, 493786, 390858, 315775, 290392, 239173, 211639, 226799, 222299, 207195, 165910]
7831A65910o3704m8087J5739J0554m012o626j9509j4151J3099K6535j2154j5543
7819D8051J3576l382l1934j6302j0112o257j5948r830N9215P6588K450k738M6228
7806A49605L5705M3574L4948P4057Q2713J06609O1908l8400o0284p1684p5084
7795C43667q2139o2010l1430p2608k9624O197k2003l330j1280k71k9333k0206
7783a4370J5583j7309N4506K1457l9366k5187M4392j900p949k0685j9259J2478
7771B391K5072l036p720j2350K5786J119k6083K707j1598k1006K5306k7974J6375
7758a1011M853K4014J8623k1135m3407Q530J3597j2061j5954N725Q309N767J6276
7745B126L1977R339l0310J0495j0101o823J7883J2300j1274n796r113l6568j8581
$$ y = [165910, 102206, 54119, 69858, 80412, 76400, 69774, 50265, 36114, 49213, 75748, 63594, 48051, 61627, 58245, 26311, 10009, -103, -6360, -22308, -32138, 27077, 103665, 106115, 103377, 149605, 185310, 228884, 263832, 337889, 420602, 527211, 589119, 550719, 490435, 418751, 343667, 261528, 199518, 168088, 95480, 65856, 72053, 50050, 46720, 35440, 35169, 5836, -14370, 1213, -16096, 38410, 59867, 20501, -4686, 39706, 37806, 29857, 9172, -10087, 2391, 27463, 24427, 16707, 4357, 30143, 31262, 5179, 7886, -3712, -24718, 588, -27386, -11011, -6158, 17856, 36479, 15344, -28063, -19533, -5936, -17997, -33951, -28226, -19917, -14150, 2126, 34103, 43442, 13132, 23627, 13526, 6703, 24586, 36886, 25612, 19816, 10703, -25865, -44446]
7732d4446J4654J1527J648j2049L8397j4740J4198j0301k724P66K9473J6262m2096
7719E69l7920L3737J5427m0367j9327O6336L6603l6153j9306J9203K5854m8968
7707d312r475l8999J601K688k7658j3411j0335j0947K5913K5729K6339j7256j8836
7694f8959r539K7493N501n66L3405J1357q963j995J6275J3908p610J6792q556
7681A8543j3018J3716L930j851n058J1659J8658K495l1189j9419j725K1526l0643
7668a2376o5917L7464O8876J4678k8521n139L959l655q759J923O576J844k5051
7655a4098m6158k5577L9605K6343q439q121j3135N3L5131M6223R454k2870j3029
7642E382n81k3433k4082r077J2984J4214m809J0872J9829j6893K4633j0335k2709
$$ y = [-44446, -29792, -18265, -16617, -28666, 9731, -5009, 9189, -1112, -3836, -3070, 26403, 42665, 569, -37351, -3614, 11813, -28554, -47881, 18455, 55058, 18905, -401, 18802, 44656, -4312, -13787, -52786, -51185, -48497, -76155, -89566, -99901, -110848, -84935, -59206, -32867, -50123, -68959, -78498, -51005, -45504, -46070, -12665, -1308, -10271, -12266, 4009, 17917, 10307, 27099, 18543, 5525, 19241, 23171, 21320, 16262, 27921, 46579, 49074, 17885, -1534, -3259, 18267, -12376, -78293, -40829, 28047, 42725, 14204, 9065, 13024, 9369, 610, 2533, 9109, 10953, -14098, -60256, -85833, -46228, -19885, -28324, -36445, -49580, -49527, -14396, 31827, 41281, 18411, 5382, 4801, -18632, -42714, -51791, -38807, -24593, -29402, -18530, 1299, -15594, 9039, -1296, -24005]
7629b4005K5258J316j168M9486m561n3795l801Q16j0026M678k191j3436J1096
7616b0333K0369M6558j1169m2619J183j2924k5881J0344J8586m9037j240l596
7604f9759O1738q356n469j6543l5154r130K1933M2009R100j6878k0084m705K3687
7591b7611m548J4614J2618k0123K393o43J6235J4946P807k5750o157K225l3468
7578d7462k7517K285l2418O386M5213K4985J144J1186L875K7402q231m4557p641
7565d5350l2205l1932K8497J1638o737K2937N0590M1640j9455m1179N064K932
7553a3560j7797j0814N2637J2472K3412r935o012q001j5239j8851K1462k4770
7541a4996m7816M433L4775j1368j9776N0647r655J2011P471k3129r123k0509m220
$$ y = [-24005, 1253, 2569, 1401, 50887, 46326, -7469, -11270, -10454, -20480, -15802, -17993, -31429, -20333, 36, 46594, 35425, -7194, -6011, -18935, -44816, -34472, -15886, -64923, -66163, -69759, -8021, -16377, -21846, -38389, -73543, -82673, -60740, -18731, -9631, -26509, -46593, -51298, -27611, -32159, -17545, -4927, -25050, -22657, -23300, -7065, 7881, 15688, -10062, -16219, -13994, -47462, -74979, -72694, -105112, -98726, -53513, -28528, -27384, -16198, -12323, 15079, 6848, -37709, -45350, -77555, -109487, -80990, -69352, -76089, -53152, -2562, 39078, 19623, -21556, -16492, -13560, -31357, -42171, 10466, 22938, 46350, 36415, 30403, 22402, 7163, -11688, 9774, -14996, -62812, -58379, -23604, -34972, -54748, -4101, -13756, -1745, 5726, -17403, -26526, -47035, -51255]
7528e1255J370j2504Rj3628N5588j5487J3763K1391K2173l8087l006j4818l319
7515c7810K6824K5507k657j200n7614N952J3961k9875l5121L1039N4791L2258
7503B6055l2677l8706J2951m542O106M682P53j690j6173l673K6671M8039j0050
7490A7746l0928J0702l027k1212k3375M7785j430l3729L15J6617J3505K923j6115
7477b0223M919J6835P809k3676j128L0435J6763k5486j0743J3270L8363M4356
7465I1494O440o4820o8999q432L4858q730j9572L117J8407K928j4237L7130L1015
7452D0599j5177l8486m9778K4306M3601K9357K633j9612K600K6195l3685j843
7440A0710R412j4834q471m988M21j3082j6699j7822J4732k0892O672K3832P382
$$ y = [-51255, -49885, -62389, -62380, -76008, -20420, -35907, -22144, -753, 21420, -16667, -19673, -34491, -37810, -10986, 14521, 11864, 10664, -46950, -40998, -27037, -56912, -92033, -60994, -6203, 26055, -6622, -45328, -32377, -36919, -30813, -26131, -25378, -27068, -43241, -46914, -20243, 27796, 17746, -13182, -2480, -5507, -26719, -50094, -2309, -3739, -37468, -37153, -20536, -7031, -4108, -20223, -15304, 1531, 9340, -14336, -15464, 14971, 31734, 6248, -4495, 8775, 47138, 91494, 97934, 33114, -35885, -44317, -9459, -18189, -37761, -34644, -16237, -13309, -27546, 9584, 40599, 25422, -13064, -62842, -38536, 5065, 34422, 37055, 17443, 20043, 46238, 12553, 10710, 20122, 5288, -3183, -8171, -7750, -20832, -37531, -55353, -40621, -61513, -54841, -31009, -23627]
7427b3627j0302o649j0514N1300L738n0623k9995R284L6857M4676n614q283J7767
7414A8015q332o560J3010N51p158L063j7964m0647k8992K7820J6007j8484J659
7401d8012J8086J4178l1732j0748m5541k6136M9069k4364j8223K7945O888J2472
7389g6118L1103K7186j11j3325O29n857j303j2439r939K7785J0653J9425k217
7376d528n0278j4714j0952j8460J9347P3415L8214m4454l3328O504k2616R506
7364e2344K02j3175j3936j3115M8147J9430K7199J33r977l3871k7126n428r055
7351h2916J7809J8175K3987n185J4262k087J8015m153k7845J0565j7055k0210
7339e6638M792K231J0630J0545M0549k2219k1406L575k7939K3807P530P118Q815
$$ y = [-23627, -33929, -40578, -51092, 208, 3946, -46677, -76672, -67388, -30531, 14145, 8531, 248, 18015, 9683, 3123, 16133, 16684, 9526, 12589, -5375, -46022, -75014, -47194, -31187, -49671, -48012, -29926, -15748, -47480, -58228, -103769, -129905, -80836, -105200, -123423, -95478, -88590, -76118, -45015, -17829, -17940, -31265, -30636, -36493, -37796, -50235, -60174, -32389, -21736, -2311, -4528, -54806, -69520, -80472, -98932, -79585, -6170, 32044, -12410, -45738, -39234, -61850, -52344, -52142, -65317, -79253, -92368, -44221, -24791, 2408, 2541, -7436, -41307, -68433, -73861, -82916, -65107, -46932, -22945, -28130, -13868, -15955, 2060, -2093, -29938, -19373, -36428, -56638, -51846, -49615, -38985, -28440, 12109, -10110, -31516, -27941, -55880, -32073, -24543, -17425, -8610]
7326h610m0132o495J4103R639K9481L2115R46k1654m630L5728J2707j4601k3204
7313A5393l2769n0117j883K4173n680N816k669K6740K3087k4042j3904m286m808
7300d4949K7487K8931n657k1086k1595j5361L1568L0293n501j911j065j9391r625
7287b7862J7107j2629Q349J795N528K5966l0427L784j7219k1693J6604M0668k9860
7274a9889J1220j7682r094j4827R050L3256k8001p936K7929M723k050o076L4992
7261A5615j9357l2132K4227j4929j76J6279J9222K4418J974k5973j9332p50o792
7248a7706j0965J501k6840k3264J8094M3426L8547j6334k7127k4151O386o040
7236d4473k5251K9973L6055J5976j3412j9405K4674k1052m7511p810K2740K4235
$$ y = [-8610, -48742, -55237, -41134, -31495, -2014, 30101, 31047, 9393, 4763, 40491, 53198, 38597, 15393, -17376, -67493, -69376, -45203, -50883, -45067, -47736, -20996, 2091, -21951, -35855, -40141, -44949, -17462, 11469, 5812, -15274, -36869, -52230, -20662, 9631, 4130, 2219, 1154, -18237, -27862, -10755, -23384, -15035, -13240, -7712, 18254, -12173, -8389, -25608, -47301, -30697, 9971, -19889, -8669, -26351, -35445, -50272, -41222, -7966, -35967, -43903, -15974, -11251, -13301, -19377, 15615, -3742, -35874, -11647, -26576, -26752, -10473, 8749, 33167, 35141, 9168, -10164, -10914, -17706, -28671, -27170, -54010, -77274, -59180, -15754, 22793, 6459, -20668, -44819, -38433, -44473, -69724, -39751, -3696, 12280, -1132, -20537, 4137, -16915, -64426, -72236, -49496, -25261]
7224b5261m4921j4353K2523J1421j8478L0496L485j3941k9025j1723J7863L0349
7212d1565j3868j5041K672K0521J1639j3183J180n412j335j0870L888M5480M2191
7199B6297J8027j4486j544p4267j5041J5314K7482J314k7391J4966J7032j1531
7187b3828l1551N293K3723n338J563j8882J1218J5491j0291j6355m243j7118J2044
7174e8274Q614J7479j704R486Q925o362k0934R972J4451o484P318m0975L0089
7161b8399M8148n782k9172k477l0703J3778M1481j7128k1578j1721j0454K933
7149e1074L0964k3368l1440K075L2539J0447L908j7929J1525M4033L286r335j5588
7136i957K0200R201k536j3568j8340j7738m0L480k962K4733R521q322L6168J5915
$$ y = [-25261, -70182, -84535, -62012, -50591, -69069, -38573, -35088, -49029, -78054, -89777, -71914, -41565, -55433, -70474, -67802, -47281, -35642, -48825, -47645, -53057, -54392, -65262, -61374, -15894, 26297, 44324, 29838, 28294, -45973, -61014, -45700, -18218, -16904, -44295, -29329, -12297, -23828, -55379, -50086, -26363, -31701, -30138, -49020, -37802, -22311, -32602, -48957, -53200, -70318, -58274, -49660, -32181, -33885, -24399, -15474, -21836, -42770, -32798, -18347, -24831, -17513, -58488, -28399, 19749, 13967, -15205, -17682, -48385, -34607, 6874, -10254, -31832, -43553, -54007, -51074, -20110, -43478, -74918, -72843, -40304, -29857, -25949, -43878, -32353, 11680, 14966, 5631, -9957, 10243, 19444, 16908, 3340, -15000, -32738, -32778, -29298, -32260, -7527, 1994, -6328, 29840, 45755]
7122D5755k6000j4225m7168l5684K2023M108K0797n429N418K5599P29m9450L6826
7109a6701N8625l357m5625n7434R268K9850O065n271J6078J5767m085j6864p414
7096b1098o626J6729J1611j5816l4855r675K1708J4127M88K9664P7372j7167j7879
7083D8583j612k5685m867k3287l6139j8392Q954K5626M6112m169m9894J2222L0684
7070H136K699K9639K322r127J2352k1214o4853p0900J0538K7874O597J7007o330
7057e5260l474l2005j711L7586p946K5696K3868J761l674L2383m0396l7952l4227
7044i5351p402M3931L2409N693J0604j034J6369J8197n1912R750O4481k5742m3279
7031b3286n2769k0819P065K6624k830k062K9710M9321M2958j4372p339j0993k286
$$ y = [45755, 19755, 5530, -41638, -77322, -55299, -51191, -30394, -35823, -30405, -4806, -4077, -53527, -16701, 41924, 38567, -7058, -64492, -55224, -25374, -19309, -24580, -8502, 7265, 3180, -13684, -21098, -27724, -10995, 616, -15200, -50055, -59730, -38022, -23895, -23407, 6257, 83629, 66462, 48583, 46971, 21286, 16419, -6868, -43007, -61399, -52445, -26819, 19293, 15124, -34770, -22548, 8136, 10835, 40474, 42796, 33669, 46021, 24807, -40046, -110946, -100408, -72534, -65937, -48930, -55260, -58734, -90739, -92450, -54864, -62810, -37114, -13246, -11485, -15159, 17224, -23172, -61124, -95351, -102753, -58822, -26413, -20720, -10116, -11150, 5219, 23416, -28496, -18746, 45735, 19993, -23286, -76055, -96874, -89809, -63185, -66015, -68077, -38367, 10954, 53912, 39540, 32201, 21208, 18922]
7018A8922j9308n0454k4483M5526k9588j9494L5049o130J8723j954j702N885N110
7005b3898P473m749n2701K51J7406J9502J2969n992j4724M1979k5934r736j6568
6992e4722k9302p13P363N19J9223J3001q768K1017K8J6931R502L061j0198m2827
6978e5885j3419k4274k1M2956L3293Q218k7740l7562n960J2118p370j5985J2904
6965g8727M0303K9253k0000k1066j3130K7858L8614K0514k1729k8832L0352N038
6953H448j5837L232O342j1464j6500m5424J9263K5943j3185j6045M4693N7901
6941D7367K6735j5096m1537l8470j4011j8503O2019J5914K0310K1905j6891m4341
6929E401m0527k0201M6722J0763J9151r433n086M357j1313Q776K4320M1790j6681
$$ y = [18922, -386, -50840, -75323, -29797, -59385, -78879, -43830, -49960, -31237, -33191, -34893, -29008, -23898, -16425, -21174, -73875, -73624, -56218, -36716, -23747, -29739, -44463, -2484, -28418, -38154, -54722, -84024, -84737, -77374, -76855, -57632, -44631, -53399, -32382, -32354, -15423, -5921, -2860, -13058, -55885, -69304, -93578, -93599, -50643, -17350, -9132, -36872, -74434, -80394, -68276, -75646, -91631, -78727, -38424, -9171, -29171, -50237, -63367, -35509, 3105, 23619, 1890, -26942, 3410, 8448, -7389, -4157, 2185, -9279, -25779, -71203, -51940, -25997, -39182, -55227, -10534, 47367, 74102, 59006, 17469, -21001, -35012, -53515, 8504, 24418, 44728, 66633, 49742, 5401, -35126, -55327, -8605, 2158, 21309, 11876, 6790, 11147, -166, 8610, 32930, 74720, 58039]
6916E8039l2998l5481M1133j7884k7347o353K1066k4355j4663m416m111L4618
6904a2752J5112j7120m9903j0586L1469N1200J3443j3230n4395o717K5220R498
6892a8761J5885N1481k3581l1276K7937J4888K0676o061m4609K288M563r288J1930
6879A6072J7408L307L1929k2238l4049m6969J0967N530j1255J4317L130Q838j5420
6866a8433j4704L3563J4483j2307l1949K625k602k451M036j6039n634p621M623
6853e2410K7158K8070j6363K6030M3000J0690n0686l4030J6157J4346R091n9212
6841c8159j8982q168K0594Q427M5287K4960l0534k5394L6335N315N262K075l4193
6828g175k6347J2462n8145K2632K2230k7647p454N4557J6884l9147K1180K2917
$$ y = [58039, 25041, -10440, 30693, 12809, -14538, -20891, 175, -24180, -38843, -43259, -47370, -12752, 2360, -14760, -64663, -75249, -43780, 7420, 20863, 7633, -46762, -53479, -28259, -18761, -2876, 48605, 25024, -6252, 21685, 36573, 57249, 51188, 6579, 8867, 13430, 4142, 16072, 33480, 36787, 68716, 46478, 12429, -34540, -23573, -18043, -29298, -14981, -11851, -3013, -18433, -33137, 426, 14909, 2602, -29347, -26722, -29324, -31775, -27739, -43778, -49412, -57033, -52410, -25252, 2818, -13545, 12485, 55485, 66175, 15489, -18541, -2384, 11962, 21053, -38159, -57141, -65309, -44715, -36288, 8999, 33959, 3425, -21969, 14366, 19681, 24943, 27018, -7175, -33522, -21060, -79205, -56573, -34343, -61990, -69444, -14887, 1997, -37150, -15970, 6947]
6816F947p998Q708j9799l1799J6405K5146q470O571k6809k7482j9011K5971J4537
6803c7083k4035J5627M1055K8768K4747k6152m0070k0589r693L547K4730k298
6791b1446k5480N8239M6388j0237j6078m3597p584J9457k8679p041k345J1319
6779b7084L0681q513j3837m374k4655m9407j8682J99M4776K9924J0867J0358M191
6766a5556l8988N4240K0372k5535o3015n4085O331M5057J2290J2798O232j8528
6754e8387M666j4727j9030J331j964J932Q711Q974K4962Q233K4723J9107o687
6741A844j9045j2427j4099j2351K2886J4559N957J6647L878J5019m2350m431N355
6728a8558J9841L0397N976J4471m7755K5146L0307J3976j4163j0721j3557j9215
$$ y = [6947, -1051, 7657, -12142, -43941, -27536, -2390, -10860, -4289, -31098, -58580, -77591, -51620, -37083, -61118, -45491, -4436, 24332, 49079, 22927, -17143, -37732, -47425, -43878, -19148, -21446, -46926, 11313, 57701, 47464, 31386, -12211, -19795, -338, -29017, -36058, -38403, -27084, 3597, -4916, -18753, -23127, -47782, -97189, -115871, -115672, -70896, -40972, -30105, -19747, -15556, -54544, -304, 20068, -5467, -68482, -122567, -116236, -71179, -58889, -46091, -39859, -58387, -53721, -68448, -87478, -86147, -88111, -86179, -77468, -68494, -43532, -35299, -10576, 8531, 1844, -17201, -29628, -43727, -56078, -33192, -18633, -12676, 3971, 7849, 22868, -19482, -23913, -18558, 1283, 31680, 37656, 52127, 4372, 29518, 59825, 73801, 59638, 48917, 35360, 16145]
6716A6145l6426j0127J8494K504q186m536K8111k1377J823k2561O677M035O837
6703a8587K25k3523K5678K4454j2152J2363j6623l9662j6574J007K6807Q877K5857
6690a853j3848l763Q514j2574k7532L4360K7605K8979J1514K2815O766m5428o1495
6677b5940J7888J8850k2612m372Q000k9095j3127Q836L5740J0683K3973j0185
6665A8639l5122j2795j4600J9815k3230l4561N9082J9022K6918J7693k3591n545
6653A1725j4300J8248K5355m3046m750J0323l8559O846J4300l227j0297J3468
6641a3914L1961j6506j7788k6542j1812J5012K7021O807k2939P668J2758n790
6629a4064J0904k5662n553k0440J179J3259M743k8414K4011N076l1702K250N0669
$$ y = [16145, -20281, -30408, -11914, -9410, -17596, -22132, 5979, -15398, -13575, -36136, -29459, -25424, -18587, -18362, -41885, -16207, 8247, -3905, 8458, -8165, -47827, -64401, -63394, -36587, -27710, -1853, -15701, -19464, -10950, -23524, -51056, -16696, 10909, 39888, 51402, 74217, 80983, 35555, -25940, -8052, 10798, -11814, -16186, -8186, -37281, -50408, -41572, -5832, 4851, 28824, 18639, -16483, -29278, -43878, -24063, -47293, -81854, -22772, -3750, 23168, 40861, 17270, 11725, -2575, 15673, 41028, -2018, -6768, 3555, -35004, -28158, -13858, -17085, -27382, -13914, 18047, 1541, -16247, -42789, -54601, -39589, -12568, -5761, -28700, -21032, -8274, -14064, -3160, -28822, -34375, -54815, -53636, -40377, -35634, -64048, -40037, -34961, -66663, -64413, -13744]
6616a3744K1647l0612l5606J7741j5666k2115K7491N7157M975l058J718q727J1103
6603A2304K0068K3891k6191l1370j8094J81l128Q989j6515j5855L7128P095j1609
6590a3106k7298J5490M0606q861q775j7425j1926k3297l543M3962L829M242O507
6577D05l7040p852n257K2867n4818M10M0702L0295J732j4166Q646J3729K116P478
6563I247Q06j1158J8942J4548l3100j2821J054m5887m3313N5623K8997l526n226
6550b5814j2186k0319J5281o478j7190q266n711K6863L0453K3922L6382J2758
6538D9695m5822j1398Q280n603r069J5997J7449k1384j7673J7361l0798k2346
6526e5311k7112L8353O2213j0531k267K4403n940p352l3040o256L2529k3878j8594
$$ y = [-13744, 7903, -22709, -58315, -40574, -56240, -78355, -50864, 6293, 11268, 8210, 9928, 1201, 12304, 32372, 56263, 30072, -1298, -19392, -19211, -22339, -13350, -29865, -45720, -8592, -1497, -13106, -40404, -24914, 15692, 6831, -1944, -19369, -31295, -54592, -58135, -14173, -10344, -6102, 405, -36635, -44487, -49744, -26877, -81695, -81285, -40583, -10288, -8556, -22722, -14076, -347, 1769, 9247, 10053, -1105, 17837, 32385, -715, -13536, -12482, -58369, -101682, -46059, -17062, -20588, -25814, -38000, -58319, -43038, -49516, -66706, -74972, -80683, -53820, -23367, 555, 36937, 49695, 3873, -7525, 755, -4848, -13917, 2080, 19529, -1855, -19528, -2167, -32965, -55311, -82423, -44070, 18143, 7612, 5345, 29748, 23808, 16456, -16584, -22840, 9689, -14189, -32783]
6513c2783l5225Q84K6896M097N445J5867j4624k747j0013o486L3295J1588r527
6500a3333j604M6002j5024o538O581l0991j7079q90O945J4406L2439j9589k7756
6487b6431j5302J7710J9827L394N1977k1242l0507K0043J6364J7428j8930m2069
6475g738k8662L0823L5286O531k1932K0547k7713N508l60j7140r424J6749l1962
6462b9487J4958K9258l6466l613K0784J4304l0249k5929R28K0420j1957L3785
6450c264K7313N859j844j7736r566j3645K676r782J0862J4837O090n401k037l6047
6436c1685k101M1149L6335J0638p31m3391m1348q455R016k4600J9668J1984K1930
6423a591p074J261j3250j6484L3635n05j4722k7846K821N4769M972j9581r879
$$ y = [-32783, -68008, -67124, -40228, -36131, -30686, -14819, -29443, -32190, -42203, -48689, -15394, -3806, -13333, -14937, 31065, 16041, 9503, 16084, -14907, -31986, -32876, -25931, -11525, 20914, 1325, -26431, -41733, -24023, -4196, -802, 51175, 29933, -574, 19469, 35833, 53261, 34331, -7738, -36400, -5577, 29709, 36240, 14308, 34855, 7142, 12650, 12290, -4850, -14274, 2475, -29487, -14529, 14729, -21737, -25350, -4566, 9738, -20511, -46440, -45512, -25092, -37049, -3264, 24049, 29908, 28064, 10328, 762, -12883, -10207, -19989, -9127, 5710, 11800, 6399, 4362, -31685, -33786, 7363, 43698, 54336, 53605, 10214, -31134, -39589, -30573, -55173, -35505, -23521, -1591, -8665, -7404, -20654, -37138, -3503, -4008, -18730, -46576, -43755, 11014, 15986, -3595, -13474]
6410a3474k0210J4616J6076j8114l1668j5731L5469N5531o278j1645L2193M0846
6398G7611l4737m4967j7851R199o736j7568K2373N830j9315K8388l7491k3685
6386e8949J9231J2013j1639K5143L458l007J1971L4K686j3343l6681K0101P1171
6373D2189m794m6996j164K015M295K310R014J1136l5261n2161k5223L6942L5880
6360b1818O502K33l0957m3665R520l1704L0709K9519J8714M0663j7442m5195J3509
6347d1412K0129j0107j8722O393L4401k1450j0766K6231j2646k970J6108J2854
6335a957Q099n248q1L9478K8330M37k5014m5869k2061J5735r318k8782j7072L9477
6321b3846o14M5715M7783r946l0799J6505K5749o795J6709j203j7269m1652J3695
$$ y = [-13474, -33684, -19068, -2992, -21106, -52774, -68505, -33036, 22495, 16217, 4572, 36765, 77611, 42874, -2093, -19944, -10745, -17481, -35049, -12676, -6846, -26161, 2227, -35264, -58949, -39718, -27705, -39344, -14201, -10743, -13750, -1779, -1745, 941, -12402, -49083, -28982, 42189, 37395, -9601, -10765, -8750, -4455, -2145, 6869, 18005, -17256, -69417, -94640, -57698, -21818, -15316, -15083, -46040, -89705, -80185, -111889, -81180, -51661, -32947, 7716, -9726, -54921, -41412, -21283, -31390, -50112, -43719, -9318, -30768, -41534, -15303, -27949, -30919, -14811, -1957, 6142, 894, 813, 40291, 68621, 69058, 44044, -1825, -23886, -8151, -17469, -46251, -63323, -23846, -24460, 21255, 69038, 59092, 28293, 44798, 70547, 63752, 80461, 79258, 61989, 20337, 34032]
6308C4032J345k0971j2702l46j4257J6529J8222k1306O644j8154J0742K2156J5133
6295C7067J6971j3331m1527k2574K2894K3340L110j7110l4868J787j8877j8602
6283f1720M069L54Q645j7608m07K6012k4968r892N321L0612M4833R829J4521J118
6269C0719J0004m9639k0313K4205L095K5914o088r043o2804l8216M4802J9523
6257b7841j4883K1036j7868J0148K9350p474N789N3223m984j3530J5453j7299
6245C1120m3171k307K5600k4270m9142n038M4926L4521j4586j8916k2776j1924
6233e5963K225R841P704J7741n449L4487P395k5764m2038l2703L2991L8638J8196
6220G301q501k6409M1692J6455l7970K0843r241k5416j6048K0166k5450J4767
$$ y = [34032, 35377, 14406, 1704, 1358, -12899, 3630, 21852, 546, 7190, -10964, -222, 21934, 37067, 54038, 40707, -820, -23394, -500, 22840, 25950, 8840, -26028, -24241, -43118, -61720, -57651, -57297, -48652, -66260, -66667, -40655, -65623, -75515, -70194, -39582, 5251, 15080, 29601, 30719, 40723, -8916, -29229, -5024, -1929, 23985, 17897, 8854, -53950, -92166, -47364, -27841, -42724, -21688, -39556, -29408, -58, -7532, -1743, 51480, 46496, 32966, 48419, 31120, -12051, -14358, 11242, -13028, -62170, -67208, -22282, 12239, -2347, -21263, -44039, -55963, -53738, -43897, -36193, -18452, -23901, 10586, 17981, -7783, -49821, -82524, -49533, -10895, 7301, -1200, -27609, 14083, 30538, -7432, 13411, 4170, -21246, -37294, -17128, -42578, -27811]
6208b7811k4430J6788K1272j0400J3779M2141M000o327l2772J6040j0628O900
6196H552q276m70J3965k0822k158K3919j955p41o837j477K173n779J3662J0480
6182B4236m3675j9836p813J3967J1481k1919l566K5574M7585R05J8926J4850j1597
6169D9118k8719o4930k8887k3236L4228L5843k4054J3353M589l154r960J8751
6157b7058L730L767l1958j4048M240k5467M231K5556K7957k674m4413J1924P0020
6144E807M4668r542J3024K00k1712k0376K7928j1592m6000m5935L1878N5776q170
6131A5954n920j150j9166l9885q934M5527K1517P474l1424k9335k566j4122J760
6118f0270K2093K5338j5004k6046M877J2027J7236J5321M5144P487Q419m636n0547
$$ y = [-27811, -52241, -35453, -14181, -24581, -10802, 31339, 35339, 29012, -3760, 12280, 1652, 8552, 276, -194, 13771, -7051, -9209, 14710, 12755, 12014, 5177, 3700, 5873, 94, 13756, 24236, -19439, -39275, -47088, -33121, -21640, -43559, -47125, -21551, 26034, 26939, 45865, 60715, 49118, 20399, -44531, -73418, -96654, -62426, -26583, -50637, -37284, -32695, -35849, -45809, -27058, -23328, -19561, -51519, -65567, -61327, -86794, -82563, -57007, -29050, -31724, -76137, -64213, 5807, 50475, 40933, 53957, 54157, 32445, 12069, 39997, 28405, -17595, -63530, -31652, 24124, 15954, 10034, 8884, -10282, -50167, -59101, -13574, 7943, 15417, -16007, -45342, -47908, -62030, -60270, -38177, -12839, -27843, -53889, -49012, -36985, -19749, -4428, 40716, 48203, 56622, 51986, 1439]
6105A439m3934N644K8411K0419l1046k703k7324J0401n969j1514M128k1899K0794
6092e3153n072j2097K5316L3201K4592l40j7216o2248p114M735L1972J4459N84
6079b2381K3449k4826k5118k1704m098k938L0992M7383O5147j3805k3793L644
6067C1952O150M666n3714j8427J0487K7904m430j2170k7529Q899L318j5057l439
6054d1390j3477K1581j9209n7553N908R2566J4218r289j769L525J1059O443J3487
6041B6100l4587m6316j1649L1551J6719r93J2343O544n27L151M9233J3921j0452
6028E5038l766n139j7855l839j0027k9604l993J3917l948k357P208R696K1470
6015B6801J4365m73p654r406j2556k2658j7030r521J1914K8715K7068P167m8361
$$ y = [1439, -42495, -36851, -8440, 11979, -19067, -21770, -49094, -38693, -44662, -56176, -52048, -73947, -53153, -58225, -70322, -45006, -11805, 12787, 12447, -4769, -67017, -74131, -69396, -37424, -22965, -22381, 1068, -23758, -48876, -70580, -74678, -77616, -46624, 759, 65906, 52101, 28308, 31952, 38102, 42768, -10946, -29373, -18886, 9018, 4588, -7582, -35111, -26212, -22894, -37951, -41390, -54867, -33286, -52495, -110048, -104140, -11574, 2644, -6645, -8414, -4889, 6170, 12613, 26100, -8487, -54803, -66452, -34901, -18182, -19175, -6832, -288, -815, 2336, 51569, 65490, 55038, 51272, 46133, 28278, 24439, 14412, -15192, -19185, -5268, -9216, -11573, -4365, 5331, 26801, 41166, 40693, 33039, 23633, 11077, -11581, -28611, -38132, -26218, 2497, 29565, 36732, -11629]
6002a1629j2598k250j7220J1187L0210j3269j5275J450l153J5559O966j6946j0807
5989c7775j7379j2579Q0909K0831m6777J2415j2428j1752J7163l422N716j1532
5977a6610o724m347q060L920q865k6988k779j596J985J5644M2989J4189J5960
5964A8718K2764l4140n9626j649J0340l612J2112K415r320J007L482Q306q198
5951c7401j2312M001P648j3718J7607O950J0456k2852l6105N883j261P778K6655
5938c6671R09L0761L7j0298J5434n815J3467m641o294j507p756O581R055l590
5924c28r030j7961k6594p77J7277J5863J6920l44k1593K856L942L3531J6320L22
5910C0404o115l0627M71L2590j3797k4287m304J2986j5617J3683K2156k545k8994
$$ y = [-11629, -24227, -26477, -43697, -32510, -2300, -15569, -30844, -29394, -32547, -16988, -10022, -26968, -37775, -55154, -67733, 13176, 34007, -12770, -355, -12783, -24535, -7372, -10794, -5078, -16610, -23334, -27681, -35741, -31821, -40686, -67674, -70453, -72049, -70064, -54420, -11431, 2758, 18718, 41482, 7342, -52284, -53933, -43593, -47205, -35093, -32678, -41998, -40991, -37509, -29203, -37401, -49713, -45712, -38064, -51782, -34175, -27225, -16769, -39621, -75726, -69843, -71104, -63326, -36671, -35762, -5001, -4964, -15262, 172, -5643, 7824, 3183, -3111, -4618, -12374, -5793, 3262, -328, -9358, -27319, -53913, -54690, -37413, -21550, -4630, -4974, -26567, -23711, -19769, 13762, 30082, 30404, 24289, -6338, -5867, 26723, 12926, -11361, -15665, -2679, -18296, -4613, 17543, 14998, -13996]
5897a3996j6895M4453K3084L596k5400m6341Q04j3698J2783K6186j0975k4071
5885d0470J442o174M3890L2641J6571k9674J3879K7692j7855k4173n480Q577M2105
5872F2971l4574l3895L352J8403m384m8100j8982K3944M066L1285k524L407k3334
5859a8365L91k805j5765k2621L910j4013j2674M5242p800k8702l030N0837l8276
5846f3671j3186J1363J626o514o559L7598K0739J1041k3171k9729j0730j9037
5834i0230n400l5011M3561L3682J9441N982J0311k1773j8816K1656L2403K8343
5822B4149K1023j5511k0939L0020l5737l4064k7380P968R527L06j2131L8813K4320
5809A0364J7029J4182k6129o50j3176j8319l1314Q625O818J0750p552J0096k143
$$ y = [-13996, -30891, 13562, 36646, 40242, 14842, -31499, -30695, -44393, -31610, -5424, -16399, -40470, -39028, -45202, -1312, 31329, 47900, 18226, 32105, 59797, 41942, 17769, 12289, 20866, 62971, 28397, -5498, -2146, 16257, 11873, -36227, -55209, -31265, -27199, 4086, 1562, 4969, -18365, -17974, -20779, -36544, -59165, -55255, -69268, -81942, -36700, -44500, -73202, -76232, -25395, -63671, -76857, -65494, -63868, -70382, -76941, -39343, -18604, -7563, -30734, -60463, -71193, -90230, -95630, -130641, -87080, -53398, -33957, -27975, -17664, -39437, -58253, -36597, -4194, 24149, 45172, 29661, 8722, 38742, 3005, -31059, -58439, -50471, -40944, -40638, -52769, -13956, 10364, 27393, 41575, 15446, 14796, 1620, -16699, -48013, -39388, -32570, -21820, -29372, -19276, -21419]
5796b1419k0284j6705k9190J4886M6830N2583P118j8971k3176k3985k9389j9038
5784h0740J2866J9256K665j6538j555L484M1074L3700J8297o674O669o75k9633
5771B196J0347L599L1024j172l7585L5952l1834j9484Q563j1735m0605l0758L443
5758g8049N227J8456J3242J2627l83J4346m5592K5691K076l0475p703K1821l2389
5745h1105k310L6665L3316J0011l7469P138J2882K735j6671K8778L2495l3121
5733f656O209j7944J0300J6563l8621M316J7596r316O369L055J602J7259K171
5720A2903k0158r356m0050Q31J9099J2797K8338J7332L3742J5885j1071j8704
5708D1588m4703j2485r909j8100K4197N7056n537l486K0640k6611j6395N908n816
$$ y = [-21419, -41703, -58408, -87598, -72712, -25882, 26701, 33819, 14848, -8328, -32313, -61702, -80740, -67874, -48618, -45953, -62491, -64046, -60562, -19488, 14212, 32509, 25835, 32504, 31829, 2196, 12543, 16142, 47166, 45994, 8409, 44361, 12527, -6957, 1606, -10129, -50734, -81492, -78049, -72822, -54366, -41124, -28497, -28880, -14534, -60126, -34435, -32359, -62834, -70537, -48716, -81105, -83415, -46750, -13434, -3423, -40892, -33754, -20872, -18137, -34808, -6030, 26465, -6656, -447, -18391, -8091, 8472, -30149, -25833, -8237, -17553, -11184, -8129, -6527, 10732, 12903, -7255, -16611, -56661, -55830, -36731, -23934, 4404, 21736, 55478, 71363, 60292, 41588, -3115, -15600, -25509, -43609, -19412, 37644, 32107, 28621, 49261, 22650, 6255, 12163, 6347]
5695F347k0104L5050P65l5765j044m428j1241J8437J2347k7445k3374R665Q857
5682c1933K9316J5718o721j9344k6393K6124l369j4543L1449j2491j9196j277
5670c2660n440J9728M1213k4789j9722k5288L4861M397j7119j177J7621l4275
5658d2650K6326M689K4028P589l663k1115k348L7214j8258l5514m1176j1317J5780
5645f0415N07j0660J3393J8772K1855j3102m4111k2141J1745L7458j1482K902
5633e5279L1222L4931j1698R484o988O607L170k0147l1241r420N018K8714L7799
5620B2172p358m829K2682O684k362k4291m2309l7398J8787L0753L3321j7522k5509
5607b7179k4851N02k0731j5203K9337O7160J4074k0748j5385K2632K0238M780
$$ y = [6347, -13757, 21293, 22058, -13707, -14751, -19179, -30420, -11983, 364, -27081, -50455, -40790, -31933, -2617, 13101, 6380, -12964, -39357, -13233, -16602, -31145, 304, -12187, -31383, -32660, -38100, -18372, 22841, -1948, -21670, -46958, -12097, -7700, -24819, -25996, -8375, -42650, -16324, -11635, 12393, 19982, 16319, -4796, -7144, 30070, 11812, -23702, -64878, -76195, -60415, -59908, -70568, -57175, -38403, -16548, -29650, -73761, -95902, -84157, -46699, -58181, -55279, -24057, 10874, -824, 8660, 1672, 8279, 11449, -8698, -39939, -49359, -44341, -15627, 22172, 14814, 9985, 32667, 39351, 36989, 12698, -29611, -67009, -48222, -17469, 15852, -1670, -27179, -52030, -51528, -72259, -87462, -58125, 9035, 23109, 2361, -13024, 9608, 29846, 34626]
5595C4626L0385m109k7351k6990J045k2298q895m923L4712J3352k5068K0234j0419
5582D301k2212k9835N048L511o286j1195K8157L4454N38l2164J014N3986k2163
5569G154K093K7194l8237J3608K4539O519P603M420k8376n0394j9032m156l0373
5556g7438K1461O3570m331j3390j892j0248J0389m4425J0487P918J7392J3408
5544g099l0820K5676J6363j3231l5009J3362J0044K437O672J3736m0J2650R340
5531B4081m0717P077j1829k3044J0480K2351J2040j7725k0154P4851J8126k8119
5519B7418n5569L43r991K4075k3468l4987N408J9632O0007O7101n3723k8099L0652
5506B8799L4032k0999j8465L991q460l246k580k3694R363O992J0388K6666k0478
$$ y = [34626, 65011, 60902, 33551, 6561, 7606, -14692, -23587, -28510, 6202, 19554, -5514, 14720, 4301, -17911, -47746, -42698, -39187, -45473, -56668, -28511, 5943, 6481, -25683, -24669, 29317, 7154, 9247, 36441, -1796, 11812, 36351, 42870, 50473, 54893, 26517, -23877, -42909, -47065, -77438, -55977, 7593, 3262, -10128, -12020, -22268, -11879, -56304, -45817, -37899, -20507, -7099, -37919, -12243, 4120, -9111, -44120, -30758, -20714, -18277, -11605, 2131, 2091, 14741, 24081, -16636, -9559, -21388, -44432, -33952, -11601, 439, -17286, -37440, 37411, 55537, 27418, -28151, -27808, -37799, -13724, -37192, -72179, -66771, -47139, 12868, 79969, 26246, -1853, 28799, 62831, 41832, 23367, 27358, 18898, 15652, 13072, -10622, -1259, 5733, 16121, 42787, 22309]
5493B2309k1114l792J0238O160j8671R24k5831j0584L6391L812j7774n680k6780
5480e0392K168m93K4311K987k2801K7090K8907J1233Q800k1593N835J9473P195
5467D2720p653J0602j300m355j989k5730j8325J2762l980m4127l263K9887L2655
5454A7904N8382J2817j4420j01J4548k9316j6568m250j8234m9914m1462N905j1038
5441g5747K0939L7194K9516r341m9172j2283L4406L6136l074m1406p819K7407
5429a3244q609m5796j8403L4743O330q099K7955L0532M263l5629j0927N8450L579
5416B5145l5590K7367k9089j4489J9071r312J274j1648k4664p194K2523J1539
5404b5067J4975N67K2805O816j8236K126L9716N410l853j4909k3171l33J3481
$$ y = [22309, 1195, -2597, 7641, 13801, -4870, -3946, -29777, -40361, -3970, -158, -17932, -23612, -50392, -48224, -48717, -24406, -21419, -44220, -17130, 11777, 23010, 31810, 10217, 16052, 35525, 42720, 35067, 45669, 44369, 40014, 38025, 12295, -6030, 6732, 2752, -41375, -44638, -14751, 17904, 76286, 89103, 74683, 74582, 89130, 59814, 43246, 38996, 20762, -29152, -70614, -64709, -75747, -54808, -17614, 11902, 2561, -46611, -58894, -24488, 11648, 8574, -32832, -40651, -13244, -21853, -67649, -86052, -51309, -44979, -53078, -25123, 5409, 9672, -25957, -36884, 21566, 25145, -10445, 16922, -12167, -26656, -7585, -16897, -15623, -27271, -51935, -59129, -36606, -25067, -10092, -9525, 13280, 20096, 1860, 3986, 43702, 49112, 45259, 30350, 7179, 6846, 20327]
5391B0327k2264l1362j2861L1679L4298L068J1662k981k6921m706j2959Q047l701
5378h674k7730j1653J9410l946m3222j4830L9769J9789m177N838m901k1670k4126
5365h0123j441M5685L3818Q685l1277J8404K0025m0667k0531J6443K3376L1232
5353B3629J8746K692k010J664j5689l8497l5650j5374K2375O7308J9607k7226
5341B1575n474l5375k2443r079k146L3341l6653k9610L6307K0010J0315M2592
5329B3360J767k2239l0154k006k140k7828J4376Q143L2372M0441j9013l042m65
5316A3572k4754l6497K8193K3612L15k0498p141j8356J580N6493L1798k3677k8486
5303c846l1774j4972R25k5396J4902L7406o626K77J9291K0050Q248j2800k5689
$$ y = [20327, -1937, -33299, -46160, -14481, 19817, 22885, 34547, 31566, 4645, -61, -13020, -4973, -8674, -36404, -48057, -28647, -32593, -75815, -90645, -50876, -31087, -35264, -29426, -34327, -55997, -80123, -81564, -35879, -2061, 6624, -24653, -6249, 13776, -26891, -47422, -30979, -7603, 23629, 42375, 45067, 43057, 44721, 29032, -9465, -45115, -60489, -38114, 29194, 48801, 21575, 16101, -19274, -41717, -50796, -52942, -19601, -56254, -85864, -49557, -29547, -19232, 23360, 25127, 2888, -27266, -29272, -31412, -59240, -44864, -36721, -4349, 36092, 17079, 14037, 13572, -11182, -47679, -19486, 4126, 4441, -16057, -23198, -41554, -39974, 16519, 48317, 24640, -3846, -35620, -50592, -49667, -75063, -60161, -22755, -29381, -29104, -9813, 10237, 18485, 5685, -20004]
5290b0004j8162J9895j022M0479k7423K0520L0243J507J999l0744l3692L0411
5278A4007J9412K5044m430j5747j3292J5464J650m3857k672J4702j0922k1545
5266b2186J3849M0602J8871n497L6810j8492j5230l285l2809j0078j8870k0695
5254c7010K8326K7232j9160L2144q091J228l766P667L138j9211N920J6916k3737
5241A1596j8041P19m1723j9957J1657P2049M1219j7010k9540n061n4837j0123
5229e9052k4537j0368O2022J0853p456J514K0146j5850k3339j837K6825M2906
5217B1827r297P308J4167K358m4947n541L1590L3955L461l0384j0302J373L201
5204A8769k709k9549K8972J7992l6723k5761L7468K4617r188n0753m721P1515
$$ y = [-20004, -38166, -18271, -19293, 21186, -6237, 14283, 44526, 46033, 48032, 17288, -16404, 14007, 33419, 58463, 54033, 38286, 24994, 40458, 42108, -1749, -4421, 10281, -641, -22186, -8337, 32265, 51136, 45639, 82449, 63957, 48727, 45442, 12633, 2555, -16315, -37010, -8684, 18548, -612, 31532, 23441, 24669, 20903, 28570, 31708, 12497, 18417, 35333, 11596, -6445, -5726, -47449, -67406, -55749, 16300, 57519, 40509, 10969, 5908, -48929, -59052, -83589, -93957, -31935, -21082, -28538, -27024, -6878, -22728, -46067, -47904, -21079, 21827, 12530, 19838, 34005, 36363, -8584, -14125, 17465, 51420, 54881, 24497, 14195, 15568, 18769, 16060, -13489, 15483, 33475, -3248, -29009, 8459, 33076, 23888, -26865, -31586, 39929]
5192C9929J9388l1459o375R260l4564P77M382j3835R030K0676k5432k3748J0752
5179b1219J8579K1027K8525N217k0217L244n4127p921R314L054K2362K3071k849
5166B8060k7853o4158J0211M6399M3780k2344q557k8886J655J6342j1971p624
5154b4946J4024Q718J7263n853l089k6077k3839j54N211n302o780R7N0851M9147
5140D9271j9691m9709m5965J9458L1601K1880m182m058k1835l0905n205r528N431
5127f3437L93L0483K1231J9909j4588J0815M417n8941n1957r579M3069J0788L499
5114e3898K9503P008q274k6268J8140L0199J8662l872j2164K8389K1999l6218
5102A3206j1850k1615l201K354k8985N7282K4714J44l605j9031J5490j4407K4017
$$ y = [39929, 59317, 27858, 21483, 30743, -3821, -3044, 1338, -12497, -3467, 17209, -8223, -31971, -21219, -2640, 18387, 46912, 52129, 31912, 35156, -18971, -26892, -17578, -14524, 7838, 30909, 28060, 207, -63951, -53740, -7341, 36439, 14095, 5538, -23348, -21693, -5351, -17322, -24946, -10922, -2204, 15059, 9206, 6117, -19960, -43799, -43953, -38742, -44044, -50824, -50727, 124, 49271, 29580, -20129, -66094, -46636, -15035, 6845, 2663, -1395, -23230, -54135, -59340, -68868, -63437, -63044, -32561, -11330, 8579, -6009, 4806, 9223, -49718, -101675, -111254, -68185, -57397, -53898, -24395, -17387, -25661, -51929, -33789, -3590, 15072, 11200, -964, 27425, 49424, 13206, 1356, -20259, -23460, -21106, -50091, 7191, 31905, 32049, 28444, 9413, 24903, 10496, 34513]
5089C4513j0033j6050K0162K5031k2029M837j8463m006q978l835O13J3973M109
5076A9844J613K0057k0474n2774k0864J7473J5990K2656O289j0894j5052K297
5064a3839K5422J2359k2940k7987j4777J2136k0206R00L5764K2194L8838l042
5052D4822m1606J5170j9538l3779J3698K1676K0578j6835m1397j4530J6866J4030
5040b0845K4582q043k7707J2958O4478J3504q4521r1994K2923M680R126L0937
5028d9922P436J8835K7267r362K1288k019m070Q08O288k4929j666K2372j2454
5015a28n978k6659J8590N5958J1093k9212k5920K892L5539J7597l7006K725O8585
5002H8076J0342l7525O838l6590j2848j5006l7252K9770J871j2131l7839n507
$$ y = [34513, 24480, 8430, 28592, 53623, 31594, 36431, 17968, 13962, 4984, 1149, 1762, 15735, 19844, 21457, 41514, 21040, -31734, -52598, -35125, -19135, 3521, 9810, -1084, -16136, -13839, 11583, 23942, 1002, -26985, -41762, -29626, -49832, -48932, -13168, 9026, 47864, 44822, 3216, 18386, -1152, -34931, -21233, 443, 21021, 4186, -37211, -51741, -34875, -20845, 3737, -4306, -32013, -19055, 45423, 58927, -25594, -117588, -94665, -89985, -80859, -49922, -42486, -23651, 3616, -5746, 15542, 13523, 9453, 10261, 16549, -8380, -10046, 12326, -128, -6106, -32765, -14175, 41783, 52876, 23664, -2256, 636, 36175, 53772, 16766, 19491, 88076, 98418, 60893, 67731, 31141, 18293, 3287, -33965, -4195, -2324, -14455, -52294, -57801]
4990e7801J7665K6323k3415J905J6986j002l5393P777Q530P508j2840O81N5571
4977A2495L5656L281k5977k1206K0912j1546l7273NL8213J9661k2243n0879P202
4964c1699N6053R240r070l3944j3781O162J7775K0529J104L5042p256l4838j6333
4951a016K6316j8542k5931j9793K6742M0839L127K4047k9228p6162l2076K441
4939g9236N437L5583J3417K5089K5083k069M694J4522j1214l0188j5688K5778
4927A1208L4776R964L673m2857l8596l138M6178N528j3617J7754J882p850k3093
4914A812Q514K650j7378k0424J2086k3929r16J5105J1117k9584p675N1135K8088
4901C0601r709j6713k0199j9375O110J6531L66L4401N56j5841m3738k3055O5532
$$ y = [-57801, -40136, -13813, -37228, -35323, -18337, -19339, -54732, -46955, -38425, -30917, -43757, -43076, 12495, 48151, 51432, 25455, 4249, 25161, 13615, -23658, -23653, 14560, 34221, 11978, -38901, -31699, 24354, 33594, 24524, -9420, -23201, -17039, 736, 21265, 22369, 57411, 50155, 15317, -1016, 25300, 6758, -19173, -38966, -12224, 28615, 31742, 55789, 26561, -49601, -81677, -79236, -73799, -38216, -24799, 290, 25373, 23304, 27998, 42520, 31306, 1118, -14570, 11208, 45984, 55948, 59621, 16764, -21832, -24970, 21208, 26736, 13119, 30873, 32755, 24905, 1812, 10326, 12976, -4402, -24826, -12740, -36669, -37585, -22480, -11363, -40947, -48622, 2513, 30601, 20892, 4179, -16020, -35395, -29285, -12754, -12388, 22013, 22569, 6728, -37010, -60065, 5467]
4888E467k385m1856l8993O873K3610K757N7028J1287l4463l1505O340J634M555
4875b9651J7486k625j5897J0300J6940J3613j4885l3006k0953L255n101K5605
4863c4919K4453J2520k2984K1156l4202k3391M418J5705J0118J1970J4633m759
4851e282k7742J632m226o725j2598j6844L3426j4759K8848L0596O259N488j4075
4838C998J4097p297k1947J2498p939l6330J0110K9675q645P952k1844j7349k863
4825d5884k6245j7080J0807K6644J9748M479q151k921J0138r823n1409k0764M6459
4812f4002N9473j6093k0600J1368j7136J181L2890L5728k9273j0776K035o076
4800b1281K2445N802j0691j0057P097k2K7251r789k0646l8144j2057K6299J7055
$$ y = [5467, 3082, -38774, -77767, -70894, -47284, -44527, 12501, 23788, -10675, -42180, -35840, -34206, -29651, -12165, -14790, -30687, -20387, -3447, 10166, -4719, -37725, -58678, -55423, -60524, -34919, -10466, 2054, -20930, 226, -33976, -57367, -52949, -37244, -27126, -15156, -523, -5282, -33024, -31392, -35618, -42343, -54941, -71785, -38359, -53118, -24270, 6326, 12585, 18073, 3998, 18095, 10798, -11149, 1349, -6590, -42920, -32810, -3135, -11780, -3828, -25672, -43021, -45884, -72129, -89209, -78402, -51758, -32010, -27531, -35682, -38603, -28465, -38288, -89697, -110461, -64002, -4529, -20622, -41222, -29854, -46990, -45809, -12919, 22809, -6464, -17240, -15205, -21281, 1164, 6966, -3725, -13782, -6685, -6707, 20544, 10755, -9891, -48035, -60092, -33793, -16738]
4787a6738r525p696J2433j354p322K6892L977k4496m849K180M9812K9076j8781
4774C3609L4093K7678m3128j9870m2942k8914l7093k2003L0214M8170P359K946
4762i881r295Q551j8861j501L1257j0181N479K8210M5383q109m8240j2917O813
4749F708K1509J4484l4037k6656K0072k016L0895p946k3547o581r766O750k1859
4736c1990K415k602k6392n836J2815M9655M0138j4704j4899R324N911L5058J1753
4723G0646J6440m3690k0405k6638m429K1901K3751j9218n3975J2483M093J2625
4711f416L9569J7487q188R5k0178j1377k5296l1680j1295K2030L8297j2388K0703
4698A1363K0035L0619l5370k2837m7869O212L9816n626J333p895l843j4497J5597
$$ y = [-16738, -26263, -33959, -21526, -22880, -30202, -3310, 667, -23829, -28678, -26498, 23314, 52390, 33609, 67702, 95380, 52252, 32382, -10560, -39474, -76567, -98570, -68356, -20186, -12827, -9881, -19176, -10625, -29486, -30987, 270, -9911, -4432, 23778, 69161, 61052, 12812, -105, 6708, 28217, 42701, 8664, -17992, 2080, 64, 30959, 23013, -534, -7115, -16881, -10131, -31990, -29575, -32177, -58569, -64405, -51590, -1935, 38203, 23499, 8600, 17924, 23835, 58893, 70646, 87086, 43396, 22991, -3647, -8076, 13825, 37576, 18358, -35617, -23134, -19041, -6416, 33153, 50640, 42452, 42547, 22369, 10992, -14304, -45984, -57279, -35249, 3048, -9340, 11363, 31398, 62017, 26647, 3810, -44059, -37847, 1969, -3657, -2324, -10219, -14062, -28559, -12962]
4685a2962Q718K5884N862J722k9518k4379l7512j9218K4788J3175j9259P459L5453
4672a9787K0996n854l8599p667K9908o232J6581L6826P00k7729j6235O116l5537
4659d6513q548J1302j5949j2772K9370K0621J973K464j0089n283q643J2839Q025
4646b1203J566M167j1829R039J2831j1311l8898j0372K4361L0243J7190n3411
4634d7627p903J7703K0612N026l0760J8606L1989K9512k590l7057J3602J8609
4622B9722o499k0837k2892k4128J5068j0354k6150p041M081L69N0559N0424L3103
4609F5425j7323l8895q214J0573r255l3313q819K8568M8085j0010k1749n962M6071
4596D5182k4121j3806k7566j142k1388K58Q312k4J9405O443N049J9771j568l87
$$ y = [-12962, -4244, 21640, 27502, 29224, -294, -24673, -62185, -81403, -56615, -43440, -62699, -55240, -19787, 1209, -4645, -43244, -50911, -21003, -27235, -10654, 26172, 26872, -857, -17092, -10976, -46513, -55061, -43759, -59708, -72480, -43110, -22489, -20516, -18052, -28141, -33424, -42067, -29228, -21203, -19637, -15470, -27299, -18260, -5429, -16740, -55638, -66010, -41649, -11406, 5784, -47627, -55530, -37827, -17215, -12189, -42949, -24343, 7646, 37158, 34568, -2489, 11113, 29722, 23223, 2386, -20506, -44634, -29566, -39920, -66070, -73111, -69030, -68661, -18102, 32322, 65425, 48102, 9207, 993, 11566, 2311, -31002, -39821, -11253, 36832, 26822, 5073, -889, 45182, 21061, 7255, -20311, -21453, -42841, -42583, -34271, -34295, -14890, -8447, -3398, 16373, 14805, 14418]
4582A4418J3288K069j4814l8772R12M4716j5561j5239K5689J2341K972J1313m7545
4569d213r215L4760j9394j5631J9482j0341Q413J055k4387K361j4577K714N1108
4556B2135M5474n0313n1584J828K4559P419p444j1756J286m3521J8512O1632j1502
4543F725j1918k4635r128J8888K1204P767k7740K0807p449k6850l4298q071J1475
$$ y = [14418, 27706, 29775, 14961, -23811, -22899, 21817, 6256, -8983, 16706, 29047, 32019, 43332, -4213, -13428, 21332, 1938, -13693, 5789, -4552, 3861, 4916, -19471, -17110, -31687, -28973, 22135, 67609, 17296, -34288, -32460, -7901, -482, -7926, -19682, -18396, -61917, -43405, 18227, 6725, -5193, -29828, -38956, -20068, 1136, 8903, -18837, 1970, -5479, -32329, -66627, -74698, -63223]
$$ [...]
##END NTUPLES=NMR SPECTRUM
##END=
