##TITLE=Analysis number 324282
Compound Code cc 56609
Book Reference 508/22
Project Code adrs
Chemist Name antons
##JCAMPDX= 6.0         $$ Bruker NMR JCAMP-DX V2.0
##DATA TYPE= NMR SPECTRUM
##DATA CLASS= NTUPLES
##ORIGIN= Bruker BioSpin GmbH
##OWNER= nmr
$$ XWIN-NMR		Version 3.5
$$ Thu Nov 16 12:37:51 2006 GMT Standard Time (UT+0h)  MAYBRIDGE\nmr@NMR_250MHZ
##.OBSERVE FREQUENCY= 250.131544655141
##.OBSERVE NUCLEUS= ^1H
##.ACQUISITION MODE= SIMULTANEOUS (DQD)
##.ACQUISITION SCHEME= undefined
##.AVERAGES= 16
##.DIGITISER RES= 18
##SPECTROMETER/DATA SYSTEM= dpx250
##.PULSE SEQUENCE= zg30
##.SOLVENT NAME= CDCl3
##.SHIFT REFERENCE= (INTERNAL, CDCl3, 0, 16.522)
##AUDIT TRAIL= $$ (NUMBER, WHEN, WHO, WHERE, WHAT)
$$ ##TITLE= Audit trail, XWIN-NMR		Version 3.5
$$ ##JCAMPDX= 5.01
$$ ##ORIGIN= Bruker BioSpin GmbH
$$ ##OWNER= nmr
$$ C:\u/data/dgb/nmr/ADRS/510/pdata/1/auditp.txt
$$ ##AUDIT TRAIL=  $$ (NUMBER, WHEN, WHO, WHERE, WHAT)
(   1,<2006-11-16 12:37:20.47 +000>,<MAYBRIDGE\nmr>,<NMR_250MHZ>,
      <created by zg, POWCHK disabled, PULCHK disabled
       configuration hash MD5:
       49 4B E0 1D 92 C2 6B 37 9F E6 65 BC 52 41 86 1D
       data hash MD5: 64K
       5F 3E BB 97 CD 41 7D 86 49 5D 91 56 09 79 99 30>)
(   2,<2006-11-16 12:37:39.22 +000>,<MAYBRIDGE\nmr>,<NMR_250MHZ>,
      <Start of raw data processing
       ef LB = 0.3 FT_mod = 6 PKNL = 1 SI = 32K 
       data hash MD5: 32K
       62 F5 AD CD EE 4D 01 DA 30 3F AB A2 5D F0 D5 49>)
(   3,<2006-11-16 12:37:41.01 +000>,<MAYBRIDGE\nmr>,<NMR_250MHZ>,
      <apk 
       data hash MD5: 32K
       55 62 4B 7B C3 C7 7C 81 40 D2 FF 2C 8B DB A3 14>)
(   4,<2006-11-16 12:37:41.75 +000>,<MAYBRIDGE\nmr>,<NMR_250MHZ>,
      <abs ABSG = 5 
       data hash MD5: 32K
       DD 06 1C BE FB C3 F9 4B 5E 28 09 C5 FE 98 37 86>)
$$ ##END=
$$ 
$$ hash MD5
$$ 2A A9 E1 16 2C 96 CF DD 4B 50 E8 57 11 1D 4E 5B
##$RELAX= 
##$RELAX= 
##$RELAX= 
##$RELAX= 
##$RELAX= 
##$RELAX= 
##$RELAX= 
$$ Bruker specific parameters
$$ --------------------------
##$DU= <C:\u>
##$EXPNO= 510
##$NAME= <ADRS>
##$PROCNO= 1
##$TYPE= <nmr>
##$USER= <dgb>
##$AMP= (0..31)
100 100 100 100 100 100 100 100 100 100 100 100 100 100 100 100 100 100 
100 100 100 100 100 100 100 100 100 100 100 100 100 100 
##$AQSEQ= 0
##$AQ_mod= 3
##$AUNM= <au_zg>
##$AUTOPOS= <24 >
##$BF1= 250.13
##$BF2= 250.13
##$BF3= 250.13
##$BF4= 250.13
##$BF5= 500.13
##$BF6= 500.13
##$BF7= 500.13
##$BF8= 500.13
##$BYTORDA= 1
##$CFDGTYP= 0
##$CFRGTYP= 5
##$CHEMSTR= <none>
##$CNST= (0..31)
1 1 145 1 1 1 1 1 1 1 1 1 1 1 1 1 1 1 1 1 1 1 1 1 1 1 1 1 1 1 1 1 
##$CPDPRG= <>
##$CPDPRG1= <>
##$CPDPRG2= <>
##$CPDPRG3= <>
##$CPDPRG4= <mlev>
##$CPDPRG5= <mlev>
##$CPDPRG6= <mlev>
##$CPDPRG7= <mlev>
##$CPDPRG8= <mlev>
##$CPDPRGB= <>
##$CPDPRGT= <>
##$D= (0..31)
0 1 0 0 0 0 0 0 0 0.06 0 0 0 0 0 0 0.0002 0 0 0 0 0 0 0 0 0 0 0 0 0 0 
0 
##$DATE= 1163680637
##$DBL= (0..7)
120 120 120 120 120 120 120 120 
##$DBP= (0..7)
150 150 150 150 150 150 150 150 
##$DBP07= 0
##$DBPNAM0= <>
##$DBPNAM1= <>
$$ [...]
##$SUBNAM7= <"">
##$SUBNAM8= <"">
##$SUBNAM9= <"">
##$SW= 20.6930455092707
##$SWIBOX= (0..15)
0 0 3 0 0 0 0 0 0 0 0 0 0 0 0 0 
##$SW_h= 5175.983436853
##$TD= 65536
##$TD0= 1
##$TE= 683.16
##$TE2= 300
##$TE3= 300
##$TEG= 300
##$TL= (0..7)
0 120 120 120 120 120 120 120 
##$TP= (0..7)
150 150 150 150 150 150 150 150 
##$TP07= 0
##$TPNAME0= <>
##$TPNAME1= <>
##$TPNAME2= <>
##$TPNAME3= <>
##$TPNAME4= <>
##$TPNAME5= <>
##$TPNAME6= <>
##$TPNAME7= <>
##$TPOAL= (0..7)
0.5 0.5 0.5 0.5 0.5 0.5 0.5 0.5 
##$TPOFFS= (0..7)
0 0 0 0 0 0 0 0 
##$TUNHIN= 0
##$TUNHOUT= 0
##$TUNXOUT= 0
##$USERA1= <user>
##$USERA2= <user>
##$USERA3= <user>
##$USERA4= <user>
##$USERA5= <user>
##$V9= 5
##$VALIST= <valist>
##$VCLIST= <CCCCCCCCCCCCCCC>
##$VD= 0
##$VDLIST= <DDDDDDDDDDDDDDD>
##$VPLIST= <PPPPPPPPPPPPPPP>
##$VTLIST= <TTTTTTTTTTTTTTT>
##$WBST= 1024
##$WBSW= 4
##$XGAIN= (0..3)
0 0 0 0 
##$XL= 0
##$YL= 0
##$YMAX_a= 654507
##$YMIN_a= -527634
##$ZGOPTNS= <>
##$ZL1= 120
##$ZL2= 120
##$ZL3= 120
##$ZL4= 120
##$ABSF1= 16.522
##$ABSF2= -4.171173
##$ABSG= 5
##$ABSL= 3
##$ALPHA= 0
##$AQORDER= 0
##$ASSFAC= 0
##$ASSFACI= 0
##$ASSFACX= 0
##$ASSWID= 0
##$AUNMP= <proc_1d>
##$AZFE= 0.1
##$AZFW= 0.1
##$BCFW= 0
##$BC_mod= 0
##$BYTORDP= 0
##$COROFFS= 0
##$CY= 12.5
##$DATMOD= 1
##$DC= 0
##$DFILT= <>
##$DTYPP= 0
##$F1P= 14.0000005364418
##$F2P= -0.99999901652339
##$FCOR= 0.5
##$FTSIZE= 32768
##$FT_mod= 6
##$GAMMA= 0
##$GB= 0
##$INTBC= 1
##$INTSCL= 1
##$ISEN= 128
##$LB= 0.3
##$LEV0= 0
##$LPBIN= 0
##$MAXI= 10000
##$MC2= 0
##$MEAN= 0
##$ME_mod= 0
##$MI= 0
##$NCOEF= 0
##$NC_proc= -3
##$NLEV= 6
##$NOISF1= 0
##$NOISF2= 0
##$NSP= 0
##$NTH_PI= 0
##$NZP= 0
##$OFFSET= 16.522
##$PC= 1
##$PHC0= -47.04952
##$PHC1= 6.292605
##$PH_mod= 1
##$PKNL= yes
##$PPARMOD= 0
##$PSCAL= 4
##$PSIGN= 0
##$REVERSE= no
##$SF= 250.13
##$SI= 32768
##$SIGF1= 0
##$SIGF2= 0
##$SINO= 400
##$SIOLD= 32768
##$SREGLST= <1H.CDCl3>
##$SSB= 0
##$STSI= 32768
##$STSR= 0
##$SW_p= 5175.98343685301
##$SYMM= 0
##$S_DEV= 0
##$TDeff= 65536
##$TDoff= 0
##$TI= <Analysis number 999999
Compound Code 99
Book Reference 9
Project Code 9>
##$TILT= no
##$TM1= 0
##$TM2= 0
##$TOPLEV= 0
##$USERP1= <user>
##$USERP2= <user>
##$USERP3= <user>
##$USERP4= <user>
##$USERP5= <user>
##$WDW= 1
##$XDIM= 32768
##$YMAX_p= 421691298
##$YMIN_p= -68447
$$ End of Bruker specific parameters
$$ ---------------------------------
##NTUPLES= NMR SPECTRUM
##VAR_NAME=  FREQUENCY,     SPECTRUM/REAL,   SPECTRUM/IMAG
##SYMBOL=    X,             R,               I
##VAR_TYPE=  INDEPENDENT,   DEPENDENT,       DEPENDENT
##VAR_FORM=  AFFN,          ASDF,            ASDF
##VAR_DIM=   32768,         32768,           32768
##UNITS=     HZ,            ARBITRARY UNITS, ARBITRARY UNITS
##FACTOR=    0.157963299565203, 1,           1
##FIRST=     4132.6476996994, 0,             0
##LAST=      -1043.33573715361, 0,           0
##MIN=       -1043.33573715361, -68447,      0
##MAX=       4132.6476996994, 421691298,     0
$$ Real data points
##PAGE= N=1
##DATA TABLE= (X++(R..R)), XYDATA
$$ [...]
19845a778l008M131K802Q12J34o327M847J593n759l881K135N904l143k001J0151
19830F612m376p361k331L543L027n024J3034J4135k266j2705j4305n828J0836
19817c009r608J853P920r380j2409P143J0101m278n911J4436Q246Q029N25j052
19803A2606p000n940p943J686k12k75j6550M50M023q721K0837Q249p750k761N182
19788d119J7377J2498p943j9959L088k738p227l171Q70L522J8680M093j503j7300
19774c832r376q78K2262J0817j4310r425K13m28Q457N133R982L068j337j2877
19760G469j5045N857J1744N861q570j1322j0851j138Q86j133m073j2474m481R540
19746b7730M544p590O281J5074J181q459j4327K305M568j326L29N16J3244j300
$$ y = [-1778, -4786, -655, 2147, 2959, 3093, -3234, 1613, 3206, -2553, -6434, -4299, 1605, -1538, -3539, 6612, 2236, -5125, -7456, -3913, -886, -5910, 7124, 21259, 18993, 6288, -8017, -13845, -3009, -12617, -10764, -2844, -12224, -24633, -17490, -7389, -11667, -17578, -3142, 5104, 13133, 13658, 12606, 5606, -334, -8277, -6591, -6803, -7078, -23628, -23178, -19155, -27876, -7039, 1210, -6540, -9301, -4119, 13258, 25756, 17813, -2146, 942, -1796, -9023, -12194, -11324, -7802, 10878, 14971, 13468, -3832, -13208, -14086, 8176, 18993, 4683, -4742, -4529, -4957, 3500, 8633, 18615, 21683, 20346, 7469, -7576, -1719, 10025, 15886, 7316, -4006, -14857, -15995, -15109, -16242, -20315, -32789, -37270, -27730, -23186, -30776, -24495, -9421, -8240, -16699, -31026, -28721, -24153, -25479, -25150, -24634, -11390, -12690]
19732a2690P89K146J0693J1281m871j1583j0114J0376J1971q944m054j2313R771
19719g542k149K264r950J494R546M576L621J593J1343j125p987K234j0666j3268
19705a6016l520J1047N436K280m354r625j3736m214n838J0111J4109L045j45N240
19691f180J3099M535j5002m913n82M854L532K545N588j144n23K189r426l10n175
19676f913q523N507K2675J0767j0566o082k144k38M183L864Q085J420l186P284
19662B6133k513J866r638M85n100K888o949j7147l088l386L94r502j7518p31J8232
19647b5574P067P823j343O871n23N466m583n698J2043J6289P837k1318j632J0045
19633A2770n819P857p077m54j05l952M934J77j1346L942p37m159O040J0691N283
$$ y = [-12690, -11901, -9755, 938, 12219, 7348, -4235, -14349, -3973, 7998, -946, -5000, -17313, -7542, -9691, -7427, -17377, -15883, -6337, -1761, 1860, 3453, 14796, 13671, 5684, 7918, -2748, -16016, -19536, -8489, -3053, -773, -5127, -14752, -28488, -32702, -38540, -28429, -14320, -11275, -11420, -6180, 6919, 11454, -3548, -8461, -9043, -4189, -657, 1888, 7476, 6332, 5809, 7998, -1428, -1738, -6913, -15436, -9929, 12746, 23513, 12947, 6865, 4721, 4483, 8666, 12530, 20615, 22035, 18849, 26133, 23620, 25486, 15848, 16333, 11233, 14121, 7172, -9975, -13063, -16449, -16055, -25557, -43075, -43806, -25574, -18507, -10684, -12027, -5156, -5679, -213, -4796, -10494, 1549, 17838, 25675, 4357, 2725, 12770, 6951, 14808, 7731, 7277, 7172, 3220, 8154, 8331, -3015, 927, 190, -3969, 2071, 12762, 18045]
19618A8045n27Q7j102j3970r758N066J928l540J1175P768j0248J822o906n987
19604f147j0083k47r879k893J5782L495q494J5293K967p747J3256l545O445K23
19590H426o745m079N74k422n104r804o844q85K464Q634J3991J2549K805j7508
19576c948j5597o317R542P161K432J725j1242P537K4432J978q152k4605m951o24
19562b0629L702Q910J0856k05p747O326R360L76l620j1083J0814J0796n345j3892
19548a381J828j2011j626o242L676J971J807K5J2168l642j7040O186R603Q758
19534D080Q836N719P817j5651q929p87q076j197Q673J0779m223m207J7532M595
19520B4961j3297l273j588l217O66j64J3612r853q280J432m62J2603j785J0599
$$ y = [18045, 17518, 17605, 16503, 2533, -7225, -2159, -231, -3771, 7404, 15172, 4924, 6746, -160, -6147, -16230, -16477, -26356, -29249, -13467, -9972, -18466, -3173, -206, -7953, 5303, 1758, 8203, 8426, 1681, -2398, -1824, -4246, -9350, -19154, -25998, -26883, -24419, -15785, -1794, 10755, 13560, -3948, -19545, -25862, -16320, -9159, -6727, -5002, -16244, -8707, 15725, 17703, 9551, -15054, -20005, -20629, -16927, -8017, 2839, 2634, -5113, 1213, 10573, 10949, 7329, -3754, 7060, 17856, 12511, -1381, 447, -11564, -13190, -19432, -15756, -13785, -11978, -11953, 215, -3427, -20467, -14281, -4678, 4080, 12916, 18635, 26452, 10801, 1872, 1085, -6991, -8188, 485, 11264, 7041, 2834, 20366, 24961, 11664, 8391, 6803, 3586, 4252, 4088, 17700, 7847, -433, 999, 537, 13140, 11355, 21954]
19506B1954l530j6550j448R215r533k644J3859J002k975N409M322o095K023j1368
19492C641k2481M246L730j5121j5456J0832J0869O648J1239Q316j959P384N147
19479A7035k1167j1756J844l494R825j243K634J1735n331m079L434J195K192j331
19465A493O575j0M294O798j745m864j2422j3032n705o511K824K480J5183N402
19451G60K368j4417j5464K977J1196J5564Q496l272N426K260j2240K946R53J25
19437G678Q980j4876M195P861Q202J4619N715j1855p895j2406j2660l914J3134
19424F778n24j193N339j945j125m56L684R57o433k758o463R450N012O001k072
19409A4252J2375j925j1754j3208O744L051r105j1139q2J4807K290L285P739q251
$$ y = [21954, 18424, 1874, 426, 9641, 108, -2536, 11323, 12325, 9350, 14759, 19081, 12986, 15009, 3641, -18840, -14594, -10864, -25985, -41441, -30609, -19740, -13092, -1853, 6463, 4504, 11888, 17035, -4132, -15888, -14044, -17538, -7713, -8956, -6322, 5413, 82, -3997, -563, 632, 2824, 1493, 8068, 8058, 12352, 19150, 17405, 12541, 119, -12913, -18618, -25129, -22305, -19825, -4642, 760, 3128, -11289, -26753, -23776, -12580, 2984, 11480, 8208, 13634, 15894, 3654, 6600, 7553, 7678, 16658, 1782, 5977, 13838, 22040, 36659, 42374, 30519, 22624, 10218, -2442, -6356, 6778, 6254, 5061, 10400, 8455, 7330, 6874, 10558, 11515, 5082, 2324, -4139, 5311, 10323, 16324, 14252, 26627, 24702, 12948, -260, 6484, 9535, 430, -10709, -10791, 4016, 6306, 9591, 17330, 9079]
19395I079m410p13J0809Q882k5563j5422P088J2463J7024o860j2026L979q585
19382d255j681k71J735n274P574R556p496n277Q462M919P721j686m841K881N542
19367A7609O66r563L097r85n99J1420k284o380j6667j91k422n27j0691j1967J7513
19352a1971J1819j3539L15m410P403K2230k491O227l588P97j8047m784K840Q438
19338A239k9n982k521R715j439k0157O612J0294J3792J0609K728K928j7613j341
19324H835M619N775o786q489J2638j555J1479L261k5909j5681J7199m13J047P034
19310A3054K729q176j7104J7140J3923K805q750j6105L714k481k34N588L498j966
19296G635P44J1773K906j23p916m755Q692j2758j3668R740J1550M719Q801j834
$$ y = [9079, 4669, 3956, 14765, 23647, -1916, -17338, -10250, 2213, 19237, 12377, 351, 4330, -4255, -5936, -6207, -4472, -9746, -2172, 7384, -112, -5389, 3073, 7992, 15713, 14027, 9186, 12067, 17609, 18275, 8712, 11809, 10824, 10225, 21645, 19361, 12981, -3686, -3877, -6299, -6826, -17517, -29484, -11971, -152, -13691, -13376, -17786, -10383, 11847, 9356, 15583, 11995, 12792, -5255, -10039, -7199, 1239, 1210, -4772, -7293, 2422, 983, -19174, -12562, -2268, 11524, 22133, 24861, 27789, 10176, 8835, 13454, 19229, 12443, 3954, 16592, 15037, 26516, 29777, 3868, -11813, 5386, 4973, 6020, 13054, 15783, 7607, -9497, 7643, 21566, 24371, 15621, -484, 3230, 749, 515, 6103, 9601, 7635, 8379, 20152, 23058, 22935, 15019, 10264, 18956, 6198, -7470, 2270, 13820, 18539, 27340, 25506]
19282B5506n086j963l460K961j0382J1993o567j0439j0702r355J6381P400N520
19269A1807l00k931r395l457n055R95J335k828j426P739l281N610J3936M242P789
19254B4780K255l211n862o707n294m677j1524J080Q108K2638J4845m186j7328
19241A4917l095J0281K182j502o962P296J5092q723j4668o073k539Q145p015m040
19227C296M885r440K557q197m432O879m958O165K2653P232j111l699l426k595
19213A5809J240K92o88l116p107J1071M44N026k720j5239j9085k321J0557R992
19199D155j0266p655J1297L725N09J351K526j3384p083m282J7271J3003P813l343
19185A5637Q589n418j5764r199K664J4063J5374K618k522N815o657j2710Q588
$$ y = [25506, 20420, 18457, 14997, 17958, 7576, 19569, 13002, 2563, -8139, -17494, -1113, 6287, 11807, 11507, 8576, -819, -4276, -9331, -8336, -7001, -9829, -11255, -3516, -6797, -1187, 12749, 16991, 24780, 27035, 23824, 17962, 11255, 5961, 1284, -10240, -9160, -1052, 21586, 36431, 32245, 14917, 11822, 22103, 24285, 22783, 15821, 23117, 38209, 29486, 14818, 8745, 6206, 14351, 7336, 3296, 8181, -1259, 1298, -6899, -11331, -4452, -9410, -3245, 19408, 26640, 25529, 21830, 18404, 15809, 17049, 17341, 16653, 13537, 6430, 17501, 17945, 22971, 20251, 5012, -14073, -16394, -5837, 4155, -6111, -13766, -2469, 1256, 1765, 3116, 5642, -7742, -14825, -19107, -1836, 11167, 18980, 15637, 24226, 18808, 3044, -6155, -3491, 10572, 25946, 28564, 26042, 31857, 25200, 12490, 21078]
19172B1078N398J682k822j2337j5697r336q84N03Q422Q592P03K875M725l255Q400
19157A8047L978j36m915j347J1106J758l20L425j41j1936p167j924K194J2218
19143B4840r252j0116P89P983N454k017n776M150Q402j1858j4228J281k494p14
19129c556Q86l430n792k570R214O687M691m978j042J3555n374l791j073j76l247
19114DP106P715q927p793R685R539m19o479p509l307Q920N092N184J3550J589
19099C3950l326M58q661J3761M170K438r045L674J935m907m906q44M84l859o7
19084B5255R703o675q702p807k250J205n453J9430j3402j3757N082J7521P205
19071B7355O902K526j0526q992o924M246L435r92M220R398j670q082j029M790
$$ y = [21078, 26476, 28158, 25336, 12999, -2698, -12034, -12918, -12415, -3993, 4599, 5302, 8177, 12902, 9647, 18047, 22025, 21889, 16974, 15627, 26733, 28491, 28171, 31596, 31455, 19519, 12352, 10428, 12622, 24840, 15588, 5472, 6261, 14244, 19698, 17681, 11905, 16055, 24457, 12599, -1629, -348, -2842, -3556, -2670, -6100, -11892, -14462, -5248, 1439, 6130, 1152, 110, 13665, 8291, 4500, 3427, 3251, 4, 7110, 14825, 5898, -1895, 7790, 17329, 16910, 10431, 2922, -385, 8535, 13627, 18811, 32361, 33950, 30624, 31082, 22421, 36182, 40352, 42790, 33745, 37419, 39354, 34447, 29541, 28697, 29181, 25322, 25255, 34958, 28283, 19581, 11774, 9524, 10729, 5276, 24706, 11304, -2453, 2629, 20150, 27355, 34257, 36783, 26257, 17265, 10341, 14587, 18022, 17030, 21250, 30648, 28978, 20896, 19867, 24657]
19057B4657q706Q028K764r508r152J948R29K627n711N792R278L435J5812j4191
19043B8002m962J140p297m977L405P110L565m37p576j240O123K036n277n095l12
19028A4208k3669q678K627R312K1461K952r806k096Q402O326l490N106N607j280
19014B6982n550q429L039j6687M863P853K176q288Q027j278o010L028l215m246
19000B265P060O906j989j1126K784j199j1734k971K2901J5084J162j1132j2379
18987E632o007q456R538N048q608J0450J3319l460j970N97l767K928Q103m866
18973A8481k891l117n625N579K88j5094l877o793J3909M239P026j2946N609J0341
18959A5129J0942l479p889O089j038L012R570k0032q175m206N156p862M822J5744
$$ y = [24657, 15951, 23979, 26743, 17235, 8083, 10031, 10960, 13587, 7876, 13668, 22946, 26381, 42193, 28002, 23040, 24180, 16883, 11906, 15311, 22421, 25986, 25549, 17973, 16733, 22856, 24892, 19615, 14520, 14208, -9461, -18139, -15512, -6200, 15261, 18213, 8407, 6311, 14713, 21039, 17549, 22655, 28262, 26982, 21432, 13003, 16042, -645, 4218, 12071, 14247, 5959, 13986, 12708, 6698, 9726, 6511, 2265, 9325, 16231, 14242, 3116, 5900, 4701, -7033, -10004, 12897, 27981, 29143, 18011, 5632, -375, -8831, 707, 5755, -2853, 7597, 20916, 17456, 15486, 16083, 12316, 15244, 23347, 18481, 15590, 12473, 6848, 12427, 12715, -2379, -6256, -13049, 860, 5099, 12125, -821, 4788, 15129, 26071, 22592, 14703, 20792, 19754, 22766, 32336, 12304, 4129, -77, 5079, -2783, 2039, 17783]
18945A7783J157j3444J3268m318p030Q36P673J403M82J662j2825l964m622N552
18931C613J1529k906n908M34j17j2846K396K205Q995J0315L482m348l72J1333
18917B7805l941n589o396n198j182j09O332N833k079J097l094Q810J3310K142
18903C7741J1521L301k3216j8696o55K932k331J265O417J943N08n057J0174J9893
18889D5740J811j198k733j1506k574O265j380N336p936K922k395q819p382O279
18875B2430n303q822l928K842l077J328K2078Q249k964K494r528q302N940j787
18861B1650j263r912k356n04M631j272O597P188l708m093j965m842R491J8397
18847C8039j7644K9J5205k666N987j0691j4649j2632K501N059J0410J8007J0480
$$ y = [17783, 18940, 5496, 18764, 14446, 7416, 8252, 15925, 17328, 17810, 19472, 6647, 2683, -1939, 3613, 15142, 12236, 6328, 6762, 6645, -6201, -3805, -1600, 7395, 17710, 21192, 16844, 16472, 27805, 23864, 18275, 11879, 6681, 5499, 5390, 11722, 17555, 15476, 16573, 13479, 22289, 35599, 37741, 49262, 52563, 29347, 10651, 9996, 12928, 10597, 11862, 18279, 20222, 20730, 15673, 25847, 45740, 47551, 46353, 43620, 32114, 29540, 35805, 34425, 39761, 31825, 34747, 32352, 23533, 16151, 22430, 17127, 8305, 4377, 7219, 4142, 5470, 27548, 35797, 32833, 35327, 25799, 17497, 23437, 21650, 20387, 10475, 8119, 7615, 12246, 10974, 17571, 24759, 21051, 16958, 14993, 10151, 19642, 38039, 20395, 20424, 35629, 32963, 38950, 28259, 13610, 978, 3479, 8538, 18948, 36955, 47435]
18834D7435J161o492o948L920J4576N63p253j1363j0629O23l121q12l069J315
18820A9906m416p014K547J5799J3217j1602j374Q71j140p73m083j0902K965R823
18806B3824N319k796j1305j5258l865M129k578l172Q668J625j5488M341J6603
18793A0047M175N760P412k838j637r18O46n912N273j0519J34J1030Q460M034N745
18778D0892M866n539O631J0935k226n217J150K8175K9754J1008Q659J996o572
18765A24512l0424k1442j8733M062r305L198J8891P381j1107j0684o769j1863
18753C7717l924j378k2k982q973O654J0470m460R84J7874L004j4789K654n291
18739C7538M147o129j2677R913L441l437j4037j1132J9970L065r128o724J0842
$$ y = [47435, 48596, 42104, 35156, 39076, 53652, 54215, 46962, 35599, 24970, 25593, 22472, 21660, 18591, 19906, 15490, 8476, 11023, 26822, 40039, 28437, 27063, 27934, 26794, 26021, 21938, 11036, 14001, 23824, 29143, 26347, 15042, -216, -4081, 48, -2530, -5702, 2966, 4591, -10897, -6556, 10047, 14222, 19982, 27394, 24556, 22919, 22001, 22647, 16735, 22008, 11489, 11623, 22653, 31113, 35147, 40892, 45758, 40219, 46850, 57785, 55559, 50342, 51492, 79667, 109421, 120429, 129088, 131084, 124512, 94088, 72646, 53913, 57975, 48670, 51868, 70759, 78140, 67033, 56349, 49580, 37717, 33793, 32415, 32393, 29411, 20438, 27092, 37562, 33102, 34086, 51960, 54964, 40175, 42829, 37538, 41685, 35556, 22879, 32792, 36233, 32796, 18759, 7627, 27597, 30662, 21534, 14810, 25652]
18726B5652J1781K0041p50r395j1560m45r494Q94O186k713L516P250l873j3848
18712B3242o808R135O75o189p42J768R285k63L322J4657O096M653j308J790j6255
18697D3058L941P256l112n931K0839J5520J5135N738R338k274l191K5919L8960
18684A71196N0040R1600J37113J65560K03381J98198J11424J6475l6340j73073
18674I35574j92680j73508j71262j22609o3128l2704k9833j1282J4813q801l9274
18663A05306j1825J0185J1930j1616o479l328k069K292J5154J8112J1841R041
18651A48544J7000M530K7411O7709J29475J64719J91977J98551J81668R6296J5170
18640A243050r6809k05201k02059j93729j60060j12994p3981l8822l5801r362
$$ y = [25652, 37433, 57474, 56724, 47329, 35769, 35324, 25830, 26724, 32910, 30197, 33713, 40963, 37090, 23242, 16434, 25569, 26244, 20055, 19313, 21081, 30366, 30103, 33425, 48082, 54178, 58831, 57523, 59313, 43058, 46999, 54255, 51143, 45212, 66051, 81571, 96706, 102444, 111782, 109508, 106317, 132236, 171196, 221236, 312836, 449949, 615509, 818890, 1017088, 1128512, 1144987, 1108647, 935574, 742894, 569386, 398124, 275515, 212387, 179683, 149850, 138568, 153381, 144580, 105306, 93481, 103666, 115596, 103980, 97501, 94173, 92104, 94396, 109550, 127662, 139503, 148544, 165544, 170074, 197485, 265194, 394669, 559388, 751365, 949916, 1131584, 1227880, 1243050, 1146241, 941040, 738981, 545252, 385192, 272198, 198217, 159395, 123594, 114232]
18630A14232j3701n391j0644o133M463M033J0258L377j7068j8255R999n39r356
18617F5275j41J9297r017o025J134j3970R464q283m982P456j586J4842k48j1100
18603F2116j0319l152L471P773J1780J0596M917l212K639P813p273r282k269Q799
18589H4397O975o155r414L138q256p201p397m992J0709r84k2231J102M084M708
18575D8483j1315J0821J8000Q103r862r26O51P300n85j4252J796k763J2714R796
18561G7961j0470J425n765O020j34p2j13J483q59k360O875J1308m534j1813J497
18546G0449o779p907K605L502m26j2199j0949L176l754L201M878j984N302N813
18532E4928l631j0126j510j2634j0579Q061j451p410J1063K1544P494o938m996
$$ y = [114232, 100531, 95140, 84496, 78363, 82826, 86859, 97117, 100494, 83426, 65171, 75170, 74631, 65275, 65134, 84431, 75414, 69389, 70523, 56553, 66017, 57734, 52752, 60208, 58622, 73464, 73216, 62116, 51797, 48645, 52116, 59889, 71669, 82265, 87182, 83970, 86609, 94422, 87149, 77867, 75598, 84397, 91372, 85217, 75803, 78941, 70685, 63484, 56087, 51095, 61804, 60820, 38589, 39691, 43775, 48483, 37168, 47989, 65989, 74092, 64230, 63304, 63955, 71255, 70670, 56418, 58214, 55451, 68165, 77961, 67491, 68916, 63151, 69171, 69037, 68965, 68852, 70335, 69476, 67116, 73991, 85299, 80765, 68952, 70449, 63670, 55763, 58368, 61870, 61444, 49245, 38296, 41472, 37718, 40919, 45797, 43813, 49115, 54928, 51297, 41171, 39661, 27027, 16448, 24509, 23058, 15648, 26711, 48255, 55749, 48811, 43815]
18519D3815N183J6n370M32J1378J4516R401m068k666J344k96j456n081L653k767
18504F8034j756n448j1284j755J7254k503j9573m882J1871L64J5534n250q447
18491E2159l583Q930j39l603M48m913j358j389K296J5327j8419P103L4021J399
18477H8279j1682k1680k6587j0045K722K1918K1043R539r661j5066L718J746j0082
18464D4162R152L433l048L135O605L360j0220l205K353M575M911M969r790k7895
18450C2497P31P852j164J6910J9444l165J7440J230l623M98j8790j1856M9k4728
18436C3325J411Q622J5115K7334P241j785K849m270J2630k768m812P47r744j3949
18422G1946k409J1261L635O074O533J108l168N706p888j2957J937J389k238j0705
$$ y = [43815, 48998, 49014, 43644, 44076, 55454, 69970, 79371, 75303, 72637, 73981, 73685, 72229, 67148, 70801, 68034, 66278, 60830, 49546, 47791, 65045, 62542, 42969, 38087, 49958, 50322, 65856, 60606, 52159, 48576, 57506, 57367, 53764, 54212, 49299, 47941, 46552, 48848, 64175, 45756, 52859, 86880, 88279, 76597, 54917, 28330, 18285, 21007, 42925, 63968, 73507, 63846, 48780, 52498, 54244, 44162, 53314, 56747, 53699, 56834, 63439, 66799, 56579, 53374, 55727, 60302, 65213, 70182, 60392, 32497, 33228, 41080, 39916, 56826, 76270, 73105, 90545, 91775, 88152, 88650, 69860, 58004, 58053, 33325, 34736, 43358, 58473, 85807, 93048, 91263, 94112, 89842, 102472, 99704, 94892, 95639, 85895, 71946, 69537, 80798, 84433, 90507, 97040, 98148, 94980, 100686, 92798, 79841, 81778, 83167, 80929, 70224]
18408G0224q596n053N249M702n350q491M303K2796M970k743J0763r68j2316K20
18394G9710M413P193J0148l896M591K565J302R773L927k185L41m058p915L9j1837
18379I4111j0834K35K550L972l793k683l576p631J1876J5271Q323j1911M383K1051
18365A21344J7576M264r450j7058p409m380j5057j5215k759J0533K0214J1675
18353A14278k755N918J7238J8051J5767J6334P242L129r531P125L3026K7602K5523
18340B78947L0255J0729J7585K495l3915l3009k8538k0144k3961r266q87j4879
18328A75412j3240J837N339O301n623m496R376O502Q094j748l1743j4323P521
18315A49209J7282j494O244M398J7285P513K0243L5919M4062L3646L5259J8431
$$ y = [70224, 61628, 56575, 61824, 66526, 61176, 52685, 56988, 79784, 84754, 82011, 92774, 91806, 79490, 79710, 84123, 91316, 101464, 97568, 102159, 104724, 106026, 115799, 119726, 117541, 117882, 113824, 105909, 105948, 94111, 83277, 83512, 86062, 90034, 86241, 83558, 79982, 72351, 84227, 99498, 107821, 95910, 100293, 121344, 138920, 143184, 133734, 116676, 109267, 104887, 89830, 74615, 71856, 82389, 102603, 114278, 111523, 117441, 134679, 152730, 168497, 184831, 192073, 195202, 185671, 192796, 225822, 253424, 278947, 309202, 319931, 337516, 340011, 306096, 273087, 244549, 224405, 200444, 191178, 190291, 175412, 162172, 164009, 169348, 175649, 170026, 165530, 174906, 181408, 189502, 187754, 156011, 141688, 149209, 166491, 164997, 171241, 175639, 192924, 200437, 220680, 256599, 300661, 334307, 369566, 387997]
18303C87997R812Q920j1347m3515m0872l1000l1003k8545j5442j9817k0508o911
18291A57769j0281q239L206R902P337J3851J1841K2521K1758R991L053J0439r807
18278B43341j5237k4876j4856j1689j2899k1913j7693j9918j8467j0921M062J4602
18266I3536J8437J4907J2951J5690L5408K0280r018k2810k827K048r560L444J3786
18253A86272R771R60J1887J6845M131R086J3119J7863K4009K3170P721Q281k1917
18240C11198j5335q808Q665R875j3848O28N3326J10055J40181J51719J43968J02298
18228I93922O2401k5125j33596j48774j39916j09100p4431k9905j4700j0493M129
18217C74412Q066J4636K6331L3285K3581K5030L8594N143N272l504J2391L1218
$$ y = [387997, 397809, 406729, 395382, 351867, 310995, 279995, 248992, 220447, 205005, 185188, 164680, 157769, 147488, 139249, 142455, 152357, 159694, 173545, 185386, 207907, 229665, 239656, 242709, 253148, 243341, 228104, 203228, 188372, 176683, 163784, 141871, 124178, 104260, 85793, 74872, 78934, 93536, 111973, 126880, 139831, 155521, 190929, 211209, 202191, 179381, 176554, 178602, 169042, 172486, 186272, 196043, 197003, 208890, 225735, 229866, 238952, 252071, 269934, 293943, 317113, 324834, 333115, 311198, 295863, 287055, 295720, 305595, 291747, 292375, 345701, 455756, 595937, 747656, 891624, 993922, 1056323, 1031198, 897602, 748828, 608912, 499812, 425381, 395476, 380776, 370283, 374412, 382478, 397114, 423445, 456730, 480311, 505341, 543935, 549078, 554350, 550846, 563237, 594455]
18205E94455K2271K4761J3312L3069P2031J27273K41436L94590N82748P52383
18195B858329Q71381Q69057N70296K02117j50431p29504r09039q37564p11440
18186B033202m31323k44929j09422l8124J4187Q7568K00501L37296N24989O60744
18176C034689P70245Q05463N17771J59204j53508p09976q15582p03066n36630
18167B368610j89071J51442M14506N99697P03843O30665L12302N4034l82584p71212
18157C892232p13231o83154m79851k70599j44467p7879o449M7923J53627L28694
18147B046846N30984P14897Q53300R36607P57023L33779J608n97275r83481q86458
18137C707830q56283n75949l19753j81758j07994m7481q251q884j0479L564K0634
$$ y = [594455, 616726, 641487, 654799, 687868, 759899, 887172, 1128608, 1523198, 2105946, 2858329, 3729710, 4598767, 5169063, 5371180, 5220749, 4491245, 3582206, 2744642, 2033202, 1601879, 1356950, 1247528, 1209404, 1223591, 1311159, 1511660, 1848956, 2373945, 3034689, 3804934, 4610397, 5128168, 5287372, 5133864, 4423888, 3608306, 2905240, 2368610, 2179539, 2330981, 2745487, 3345184, 4049027, 4679692, 4991994, 5046028, 4663444, 3892232, 3179001, 2495847, 2015996, 1745397, 1600930, 1523051, 1516602, 1564525, 1718152, 2046846, 2577830, 3292727, 4146027, 5082634, 5839657, 6173436, 6175044, 5577769, 4594288, 3707830, 2851547, 2275598, 1955845, 1774087, 1666093, 1618612, 1610361, 1601477, 1590998, 1594562, 1615196]
18126A615196K9152M9268P1158Q8453R8108J33385J68385K56711L28977M13538
18116C252331O13716R25260J563761K726019M075411M691789L217436K117655
18108B3183378K467191k323524p254871m856861k381568j114899n13451j37183
18100G068212J72958M19930O93347J042089J494638K157405L387863N633383R693001
18091C1762826J5785453K2625454K7873826L2580293L3345667J8870278O366335
18084A89210132k664457k9993402l4336389l0197842k9862676j9606559j0745293
18077C1803514o051703l688288k409452j738477j347856j175748r87210q92785
18069A3511995q88581o25799l69236j51415J74133M89732O67872R54288J292501
$$ y = [1615196, 1644348, 1693616, 1764774, 1853227, 1951335, 2084720, 2253105, 2509816, 2838793, 3252331, 3866047, 4791307, 6355068, 9081087, 13156498, 17848287, 21065723, 23183378, 25650569, 23327045, 16072174, 11215313, 8833745, 7718846, 7205395, 7068212, 7241170, 7661100, 8354447, 9396536, 10891174, 13048579, 16436442, 22069825, 31762826, 47548279, 70173733, 98047559, 130627852, 163973519, 182843797, 189210132, 186545675, 156552273, 122215884, 92018042, 62155366, 42548807, 31803514, 25751811, 22063523, 19654071, 17915594, 16567738, 15391990, 14404780, 13511995, 12623414, 11997615, 11628379, 11476964, 11651097, 12140829, 12808701, 13762989, 15055490]
18060A5055490J708885K589198M287672P455976J3119427K1012868K8980330L4646077
18052A28855923M0115163L6382637J6102543N732909j1572771m1430349l8502812
18045A35683243l7062996l3252836k0409633j1469605o799352m389489l046389
18038A9252943k241429j825225j538594j282414j187871j012704p93364o16668
18030H754674m17872k09581j54578j59205r6158j89172l28811l43653l17796l12129
18020F225719j84214q8456q3293R0126J88135J03475K22700L06734M21709M94530
18010G697165o493l10530m9527k8877N7771M1638k08671o7156j54961n62646m01469
17999F006244j63778P4071R9832k35183k51112m5502J85734K60072j75868l22211
$$ y = [15055490, 16764375, 19353573, 23641245, 31097221, 44216648, 65229516, 94209846, 128855923, 168971086, 205353723, 221456266, 227189175, 215616404, 174186055, 135683243, 98620247, 65367411, 44957778, 33488173, 26688821, 22299332, 19252943, 17011514, 15186289, 13647695, 12365281, 11177410, 10164706, 9371342, 8754674, 8336802, 8127221, 7972643, 7813438, 7717280, 7528108, 7199297, 6855644, 6537848, 6225719, 6041505, 5953049, 5869756, 5959882, 6148017, 6251492, 6474192, 6780926, 7202635, 7697165, 7690672, 7380142, 7330615, 7301738, 7359509, 7401147, 7192476, 7125320, 6970359, 6407713, 6006244, 5842466, 5916537, 6016369, 5781186, 5530074, 5484572, 5670306, 5930378, 5754510, 5432299]
17989E432299p7581o0722L4105k2265k61613j64012l59000o62137m66413k71952
17979C120709j51100j56467l68881l91211k59854j76178j21949p9318o4185n5211
17969A296355n9864o4392m8010k9337k3253j5467j3659K496m498l74j4922j0679
17957A014396r342l9019o7111n9901n7595m2785j8565Q081L8743K6597J1164O842
17945H11505R572r021k8671m3868m6431m8576m1167l9597k3242j715k4455j0130
17933E04204K726R926K661j2261j2397J0928K9914K7755J9656J1463K634l338
17921E93871o320k7264n1408l5865k2856j6987N115K3381L1240K7031J6474j3338
17909E23074J0564J7954j7919l0383j1038j4249r400o059r293m2637l9202k7084
$$ y = [5432299, 5354718, 5293996, 5328101, 5305836, 5044223, 4880211, 4521211, 3859074, 3392661, 3120709, 2969609, 2813142, 2444261, 2053050, 1793196, 1617018, 1495069, 1415751, 1351566, 1296355, 1236491, 1172099, 1124089, 1094752, 1071499, 1056032, 1042373, 1044869, 1040371, 1039997, 1025075, 1014396, 1005054, 966035, 898924, 839023, 781428, 738643, 720078, 728159, 766902, 793499, 804663, 811505, 821077, 812056, 783385, 739517, 693086, 644510, 603343, 563746, 540504, 538789, 514334, 504204, 506930, 516856, 519517, 507256, 494859, 505787, 535701, 563456, 583112, 594575, 597209, 593871, 587551, 560287, 508879, 473014, 450158, 433171, 438286, 461667, 492907, 519938, 536412, 523074, 533638, 551592, 533673, 503290, 492252, 478003, 468603, 462544, 453251, 410614, 371412, 344328]
17897C44328n0554l2467k9642j3830J822o79J1419P406J2606p361K1573L2559
17885B97180J0596J209j1145j842p713l2795m2879m6215l0863k8245j3556p66
17873I2966N767L0640N2775M8126L8048K1429J8869K664j157k3980k4439l3094
17861B28614m3613k3971k0051j0421L402P818K4877R320J9126K3845K4715J8196
17849B61857J2710j836j2545j0353r150j4468k3004j9666k4883n343J6455K1271
17837A91045M2798J9935K9838M7624K1798m068J9330K5100J6588J0004L5603L8503
17825D94098N2436Q4341J56088K59643L62267N49243P04326Q41861R26071P18454
17815E148828L34567J82082k94083m89851k28763j08249K23785L63535J33914
$$ y = [344328, 293774, 261307, 231665, 217835, 219657, 218978, 230397, 237803, 250409, 243048, 264621, 297180, 307776, 308985, 297840, 295998, 288285, 255490, 212611, 166396, 135533, 107288, 93732, 92966, 98733, 129373, 182148, 230274, 268322, 289751, 308620, 311284, 310127, 286147, 261708, 228614, 185001, 161030, 140979, 130558, 133960, 141778, 166655, 175975, 195101, 218946, 243661, 261857, 274567, 272731, 260186, 249833, 240683, 226215, 203211, 183545, 158662, 153319, 169774, 191045, 233843, 253778, 283616, 331240, 353038, 348970, 368300, 393400, 409988, 419992, 455595, 494098, 546534, 630875, 786963, 1046606, 1408873, 1958116, 2662442, 3504303, 4430374, 5148828, 5483395, 5665477, 5371394, 4881543, 4652780, 4544531, 4768316, 5131851, 5265765]
17806E265765j1157l82899q55043p54005p33486n84117l18823j88406j02258l7126
17796A298445m3789l8382O46L7325P0450J43815K33667L72845N18839O39936P15880
17785C949677O55188L70996K06433p0342m30195k56625j74818K2550K64548J31008
17775D668420m3714k25580o83841p25446o48914n98455l78196k09091j33551p5916
17765I45716l9687l8896l1185j9632p383k0148j7417q298q044p813M095N414O053
17752G62775j3223k052J0203J7799J7784K4019L0010M3363N0406L0112L2602L6760
17740A040558N6940Q1270J34219J81682K00562K12223K13758J42830O9697k2058
17730B311681j68168j60828j22579q1726k7914M4022M8591M8487Q9286R2629J33673
$$ y = [5265765, 5254608, 4871709, 4016666, 3262661, 2529175, 1945058, 1626235, 1437829, 1335571, 1298445, 1254656, 1216274, 1216920, 1254245, 1324695, 1468510, 1702177, 2075022, 2593861, 3233797, 3949677, 4604865, 4975861, 5182294, 5111952, 4681757, 4425132, 4250314, 4272864, 4537412, 4668420, 4624706, 4399126, 3715285, 2989839, 2340925, 1742470, 1364274, 1155183, 1021632, 945716, 906029, 867133, 835948, 816316, 808933, 788785, 771368, 763070, 755026, 747213, 751308, 756722, 762775, 749552, 747500, 757703, 775502, 793286, 817305, 847315, 890678, 941084, 971196, 1003798, 1040558, 1097498, 1178768, 1312987, 1494669, 1695231, 1907454, 2121212, 2264042, 2333739, 2311681, 2143513, 1982685, 1860106, 1778380, 1750466, 1794488, 1843079, 1891566, 1980852, 2073481, 2207154]
17719B207154J44114J67506K11536K61715L37651M30213N08672O01147O31467
17710E501175O07611O18894N35392M64391N41949O45183P58840J206442J863982
17701A2743859K851030M593814P749001J3249346K1083765K9818846L5868435
17694A27958096M0559635L7765230J8798290N306547j3676349m2395975m0096919
17687A34218555l9233392l2019208j8794133j0753137o584691m349111l028378
17680A9456505k031653j343412q08618l89611j51237m2883L7779q6347k07953
17671A4432570k26821j92250q528J96935O37509J194573K149767L845027O955384
17662B8984166J2240190J9338969K6442428L1101319L4750999K8260324J1306970
$$ y = [2207154, 2351268, 2518774, 2730310, 2992025, 3329676, 3759889, 4268561, 4869708, 5501175, 6108786, 6727680, 7263072, 7727463, 8269412, 8914595, 9673435, 10879877, 12743859, 15594889, 20188703, 27937704, 41187050, 62270815, 92089661, 127958096, 168517731, 206282961, 225081251, 230387798, 216711449, 174315474, 134218555, 94985163, 62965955, 44171822, 33418685, 26833994, 22484883, 19456505, 17424852, 16081440, 15272822, 14883211, 14731974, 14689091, 14726870, 14640523, 14432570, 14205749, 14013499, 14004971, 14201906, 14839415, 16033988, 18183755, 22028782, 28984166, 41224356, 60563325, 87005753, 118107072, 152858071, 181118395, 192425365]
17655A92425365K129628j9659112l7259922l2656146l2698116k3592351j3532645
17648C5156701q064285n151354l578851k560049j837844j354692r94134p13249
17640A0902243o20522n09504m75289o49547o36792p20497p64797o32140n40010
17631E353145m35389l36942k82976k29572k13388j67892j51366j08634p1611p7183
17621C278192l1082L4705M3618P6420R1401N0195l2015q1785k25420k88658k44776
17610B670795k43822k02202j37629r7973r4210q6317q1727n3431l6291n8477n6727
17599A521989n1352n4991n1893m9851o0776n0741m2758l5317l9352m1109m9802
17588I94047l7825l9726l5618k0191j6116p002j613j673j2082j5203j6913j9852
$$ y = [192425365, 194554993, 174895881, 137635959, 104979813, 72281697, 48689346, 35156701, 27092416, 21941062, 18362211, 15802162, 13964318, 12609626, 11615492, 10902243, 10281721, 9772217, 9296928, 8647381, 8010589, 7290092, 6525295, 5893155, 5353145, 4917756, 4580814, 4297838, 4068266, 3854878, 3686986, 3535620, 3426986, 3355375, 3278192, 3247110, 3281815, 3325433, 3401853, 3493254, 3543449, 3511434, 3429649, 3204229, 2915571, 2670795, 2426973, 2224771, 2087142, 1989169, 1894959, 1808642, 1726915, 1673484, 1637193, 1578716, 1521989, 1470637, 1415646, 1363753, 1313902, 1253126, 1202385, 1159627, 1124310, 1084958, 1043849, 994047, 956222, 916496, 880878, 860687, 844571, 837569, 835956, 834283, 822201, 806998, 790085, 770233]
17576G70233j914j9775k9458o958q715J2119L167J4140k665r474K3262R259j1879
17563G41342k6421n1944n7052o2680n0298m4128k2061l189j1611P953j6294j5506
17551C88111j9806q933P981j1071j8349J013q592j2801q418J6574J1619K2922
17539C60250K8817J4020n541j481j8794k6867o485J463Q961K6879M503N918j122
17526C90521l0099m6232k8461k2839O600P240l095r77q099K3852L6679K6594K1580
17513C73264K58k6200j1203j3878j5362k103o660j4180l2341m7672n1289l9926
17501A12708m5532k3698j2229k534J3800J2783N849K9579M5821K5816L4473M6223
17489B43059O4988J16142J63691K00079K21509K33826J58480N1849j7309j86492
$$ y = [770233, 768319, 748544, 719086, 712128, 703413, 715532, 718699, 732839, 730174, 720700, 743962, 753221, 741342, 714921, 662977, 605925, 543245, 492947, 448819, 426758, 423569, 411958, 419911, 403617, 388111, 368305, 359372, 367353, 356282, 337933, 338946, 330354, 317553, 309135, 325709, 337328, 360250, 389067, 403087, 397546, 396065, 377271, 350404, 343919, 345382, 354343, 381222, 385725, 391643, 390521, 360422, 314190, 285729, 262890, 269490, 276730, 273635, 272658, 264559, 288411, 325090, 351684, 373264, 373522, 347322, 336119, 322241, 306879, 304776, 298116, 283936, 251595, 203923, 152634, 112708, 67176, 43478, 31249, 28715, 42515, 55298, 61147, 90726, 136547, 162363, 196836, 243059, 308047, 424189, 587880, 787959, 1009468, 1243294, 1401774, 1453623, 1436314, 1249822]
17479A249822k47616k14279k04012j34950o8980l5171k2099k0703l7811m8182
17469B16019l3665l7664n6431j4663m681j7706j6157j667Q440J0356M42J1498
17457F4121J7946K590N083L1216M9885Q3365J20934J51733J75256J57062Q2635
17446I41826L5258n138j31265j49237j37305j11690q8022r4674n8639l7890l5610
17435A27614p367k0655j8401p66k031n692j4283j0023P516k506j3162Q511N485
17422E4240j9796j4144j4405N347J398k428o16K586j085r23M422j819k169j696
17408H912J054P302K381r451Q950K09Q809L252K535r514k5484o293p82Q896K928
17393C704r421r596p648K334J0829J669m98N577J3529p649j3359j1952J0987J4055
$$ y = [1249822, 1002206, 787927, 583915, 448965, 379985, 344814, 322715, 302012, 264201, 216019, 182354, 144690, 88259, 73596, 68915, 51209, 35052, 33385, 41825, 52181, 52623, 64121, 82067, 84657, 89740, 120956, 170841, 254206, 375140, 526873, 702129, 859191, 941826, 977084, 971946, 840681, 691444, 554139, 442449, 354427, 259753, 201114, 163224, 127614, 120247, 99592, 81191, 80425, 78394, 72702, 58419, 48396, 55912, 53406, 40244, 48755, 54240, 34444, 20300, 5895, 11242, 12640, 10212, 9596, 12182, 11097, 10174, 14596, 12777, 10608, 8912, 9966, 17268, 19649, 10198, 19148, 19357, 28166, 31418, 33953, 24439, -1045, -7338, -8120, 776, 3704, -5717, -15313, -22961, -20627, -9798, -8129, -8627, -3050, 10479, 2830, -10529, -22481, -11494, 2561]
17379B561k2436q211J5189p756p503R468k241r801n433J21M72k821J4663K2925
17365h03l632j9124j1484M176j1290j0117j3997Q503O659r564j265o509P69J5571
17351e2107J9125Q596m720J523l726j338Q281N077J813j2124m451J4219Q262K0887
17337I317K225R274j2357j2888k983N994O538j8319k4234R420R83q829l589j1855
17323e1303J4709o16J3316r58j2702n985R074O840P002j3711l471Q74k040J3436
17309b5535r442l20o123r230o590J374K7070J4400M108J7970O409p765j4801J2422
17295C947p420l1667o028O079O669l835P574K1136J2189j1567j333K45P632L985
17281G606r634o63j719j2777O05Q226J2456J448j0893k957M223j5698n697j382
$$ y = [2561, -19875, -28086, -12897, -20653, -28156, -18688, -20929, -30730, -36163, -36042, -35570, -38391, -23728, -803, -4435, -23559, -35043, -30867, -42157, -52274, -66271, -57768, -51109, -60673, -61938, -68447, -67678, -52107, -32982, -24386, -29106, -27583, -31309, -32647, -24366, -19289, -17476, -29600, -34051, -19832, -11570, 9317, 11542, 20816, 8459, -4429, -7412, -1418, 5120, -13199, -37433, -28013, -27030, -35859, -39448, -51303, -36594, -37210, -23894, -24852, -37554, -43539, -34465, -27625, -20623, -34334, -37805, -36931, -38971, -25535, -34977, -35297, -41420, -50650, -57240, -55866, -28796, -14396, -10288, 7682, 14091, 6326, -8475, 3947, -3473, -35140, -41168, -35089, -28420, -32255, -24681, -3545, 8644, -2923, -4256, -4011, 3621, 7606, -2028, -2691, -4410, -17187, -16582, -8356, 4100, 5548, -5345, -8302, -4079, -19777, -25474, -26856]
17267b6856j568J7520J5677M62M015m553l313M198n6n444M605J909K0842K8748
17253E6186J7607o193K383Q526P447L885n139j4107j4059j8737p92J1004o000
17240D2011j2924k2450o146j942l593L953k509K053l629o291J4794Q503Q694J8290
17226C8814J6932K455n16j3171r48l056r059q703o662j5261q939J0498k733n971
17212f320K98K4215M252m289n348k9406P192Q903M012N252j0110j1234j1702j2656
17198c6941Q040P274O680Q68m368r503K528K348K549O866J5434J4187J29r810
17184F281j918P711k023k392q090o988J2973J8507L348K524K3335k77j7128k513
17170C3350q13m115j7439O218J4397L221O45P60O120K0772K0251K8517Q0337J14306
$$ y = [-26856, -28424, -10904, 4773, 5235, 9250, 4697, 1384, 5582, 5526, 82, 4687, 6596, 27438, 56186, 73793, 67600, 69983, 78509, 85956, 89841, 84702, 70595, 56536, 37799, 37007, 48011, 42011, 29087, 6637, 491, -1451, -5044, -1091, -3600, -1547, -5176, -11467, 3327, 11830, 20524, 38814, 55746, 58201, 57685, 44514, 43566, 40510, 31451, 22748, 16086, 825, -8114, 2384, -349, -6320, -6022, 18193, 22445, 18156, 12808, -16598, -9406, -503, 3509, 8761, -1349, -12583, -24285, -36941, -28901, -21627, -14947, -14079, -18447, -27950, -25422, -23074, -20525, -13659, 1775, 15962, 16091, 6281, 4363, 12074, 10051, 7659, -431, -7419, 5554, 24061, 27409, 29933, 53268, 52991, 35863, 33350, 32537, 28422, 10983, 17201, 31598, 34819, 35464, 36224, 42344, 63116, 83367, 111884, 192221, 306527]
17156C06527J42835J75946J94447K01623J21853K7214o0468k11709k18750k04885
17146D74633j57677q4638o2073l5565k5769k9823j7471j3759R154J133k145M255
17134F0255Q481o381j3317L338L812J6053M938j631j681k024N441M5903P5037
17121A98224R6294J60613J93425K00742J66240P6873J4051r6868k08546k03567
17111E97481j88650j36355p6587n5383l6208j7784j9671j8131j3179j4592r623
17100A1318R996Q790J979j9748m773j973M618l500l012k955j4314j2245j650J985
17086b5484Q879K0814J4145M89r174J774J545R068j789r03K220o202j3223j0905
17072h746n472L333J042j039J0215n662j3764p718J0273J2082o385m143O191j3325
$$ y = [306527, 449362, 625308, 819755, 1021378, 1143231, 1170445, 1109977, 898268, 679518, 474633, 316956, 232318, 170245, 134680, 108911, 79088, 61617, 47858, 57012, 58145, 56000, 60255, 68736, 62355, 49038, 52376, 56188, 72241, 77179, 75548, 73867, 71843, 77284, 123187, 198224, 294518, 455131, 648556, 849298, 1015538, 1092411, 1106462, 1009594, 801048, 597481, 408831, 272476, 195889, 140506, 104298, 86514, 66843, 48712, 35533, 20941, 11318, 21314, 30104, 32083, 12335, 7562, 5589, 10207, 6707, 3695, 740, -13574, -25819, -27469, -25484, -16605, 4209, 18354, 18843, 9669, 11443, 12988, 22056, 20267, 19364, 21584, 15382, 2159, -8746, -14218, -10885, -9843, -10882, -667, -6329, -20093, -27811, -17538, -5456, -11841, -15984, -9793, -23118]
17058b3118o556M372L342Q943N520m140J0610p528j3574j0823J434J4953m235
17045b0800O619R297J2197n579m715j69q892q308m478J283J0236J0833j08r453
17031a2037Q64J1302l072q652m467j0916n688p714N170m35K2898N329j2469o04
17017b0491J713q116j572P954Q687n723j5192M485O512o718o611n694J0620M873
17003b5273K923K836O888J756k03l083l158q126q392L242J5248j1794j3959N944
16989c5151J154k121l231J1879J3082K103k724J286J285j0577k357M839R341q45
16975a2037p471n420O282m824J529P506k900n298R882M108L730J0k0918k673K612
16960b5882R141K65l549j1507J090J2135J62Q976J290l285L222o057j484n034
$$ y = [-23118, -29674, -25302, -21960, -13017, -7497, -11637, -1027, -8555, -22129, -32952, -31518, -16565, -20800, -14181, -4884, 7313, 1734, -2981, -3150, -12042, -20350, -24828, -23545, -13309, -2476, -2584, -12037, -11173, 129, -2943, -11595, -16062, -26978, -32666, -40380, -35210, -35645, -12747, -7418, -19887, -20491, -18778, -26894, -28466, -20512, -11825, -17548, -32740, -28255, -21743, -28461, -35072, -40766, -30146, -25273, -22350, -19514, -12626, -10870, -11073, -14156, -17314, -25440, -33832, -30590, -15342, -27136, -41095, -35151, -33997, -36118, -39349, -27470, -14388, -12285, -15009, -13723, -12438, -23015, -25372, -20533, -11192, -12037, -19508, -24928, -18646, -23470, -21941, -14435, -17335, -22633, -12751, -8643, -4913, -4903, -25821, -28494, -25882, -16741, -16476, -20025, -31532, -30442, -18307, -18145, -9169, -7879, -11164, -7942, -13999, -15483, -20517]
16946b0517J911P04J573l365O583m9R459j4514j4522K548M349n551j0965j963
16932d4319P066K0925O464n432Q168j510n802o321q466K770p298j0610l255R557
16918c8063P106J0060Q5Q944J0322M169l913K426r439q971o006K906q71r477j9481
16903e0203J0823J0464n325N42P304R010K781r979j1341j4645k455R277J3548
16890c0199J2093R800j248R811O107j3294j7383o248k99p755k048J1907J7107
16877a1649l53K29m159o874j572j104O984O080P541R499O859p470j0107j72P341
16862A073j527m716J55l887n204J2916J249l784k525q584m515p184l43o734J1862
16847b1748Q667R253L972L019r105p193j1665q223J344N017J8251Q457M707j4965
$$ y = [-20517, -18606, -17902, -16329, -19694, -13111, -13160, -3701, -18215, -32737, -30189, -25840, -31391, -42356, -44319, -37253, -16328, -9864, -15296, -7128, -8638, -14440, -20761, -29227, -26457, -33755, -44365, -47620, -38063, -30957, -20897, -20812, -11868, -1546, 2623, -1290, 1136, -8303, -17274, -23280, -20374, -21245, -30722, -50203, -39380, -28916, -34241, -33699, -26395, -17385, -14604, -24583, -35924, -50569, -53024, -43747, -30199, -18106, -8306, -9554, 257, 6364, -6930, -24313, -30561, -30860, -38615, -40663, -28756, -11649, -12002, -11773, -15932, -22806, -24378, -25482, -18498, -12418, -4877, 4622, 11481, 4011, -6096, -6268, 1073, -454, -5170, -5015, -8902, -14106, -1190, 59, -3725, -6250, -14834, -19349, -26533, -26876, -33610, -21748, -13081, -3828, 144, 3163, -5942, -13135, -24800, -33023, -31679, -26662, -8411, 46, 4753, -10212]
16833a0212o655l017J1981L446j9258j2708O164N947J2N246M9M633o787j312m538
16818b7009r161P601O15J158J7950J7712N171j2870q64n648j3532j107k232n829
16804b8045L504R267M606q755m704r816j3228m320J8256J3508k155l137R40l03
16790b4382P39J754j252J3378P868n786n980p28Q20j8785j619J6151N958K3696
16776A1832K236j1220j4840j515J1201L521k133N024L329j4577j5102n288j977
16763b9509N346r390M511J4863O165J3865p426n147M227O747m652j3201p337L206
16749a7732J1228J6472n311p227m134q413j3525j047R41j4048j0276Q590N413
16736c9069o343K3523J8873j3312n201j0071K356J4852j879r270M176J0873o273
$$ y = [-10212, -16867, -19884, -7903, -4457, -23715, -36423, -30259, -24312, -24300, -19054, -19005, -14372, -21159, -22471, -27009, -36170, -28569, -27954, -26796, -8846, 8866, 14037, 1167, 303, -5345, -18877, -19984, -22216, -28045, -24541, -15274, -10668, -19423, -24127, -33943, -47171, -51491, -33235, -19727, -21882, -25019, -24079, -24382, -23643, -21889, -23141, -9763, -1895, -7681, -13661, -14389, -13569, -32354, -33973, -17822, -11864, 11832, 14068, 2848, -11992, -13507, -2306, 1215, -918, 4106, 7435, -7142, -22244, -27532, -29509, -24163, -33553, -29042, -14179, -8014, 5851, -1575, -6722, -2495, 4252, -400, -13601, -20938, -17732, -6504, 9968, 4657, -2570, -6704, -15117, -28642, -29689, -28748, -42796, -53072, -44482, -39069, -45412, -21889, -3016, -16328, -21529, -31600, -29244, -14392, -16271, -25541, -21365, -10492, -16765]
16723a6765j242O825J2780K999j0698n909J3070L331o538O855j2432K350n642
16710a1016o805R724q912o276j8311n968N901N077M174M115k06K707J9838O172
16696B14N478R022n484j7997j2150j726J2011j704j184o419r4p303r532J3595
16682b3273J1831Q72R73p107j388L788M535L091j0425r731L205J372o134P948
16668b0443R224N125l107K911J0140p682j3474o970O294K1287P351k891j4743
16655f978N070m916j0178p734J0658J383j2424J199J7091k50k1593p138J1741
16642b4069J5764M682q204j0056o23J3684J687j0289n829O223M610P847r28J0379
16628D878j1923j4789J3L937J0384M039r798l830J2977N41N474q68o371l080o18
$$ y = [-16765, -18007, -11182, 1598, 4597, -6101, -12010, 1060, 4391, -2147, 4708, -7724, -5374, -11016, -17821, -8097, -17009, -23285, -41596, -47564, -41663, -36586, -32412, -28297, -28503, -25796, -5958, 214, 5692, 14714, 9230, -8767, -20917, -22643, -10632, -12336, -13520, -19939, -20033, -27336, -36868, -23273, -11442, -10570, -9597, -16704, -18092, -14304, -9769, -6678, -17103, -26834, -23629, -22257, -28391, -20443, -11219, -6094, -9201, -6290, 3850, -3832, -17306, -24276, -17982, 3305, 10656, 7765, -6978, -1908, -6824, -17002, -24736, -14078, -12695, -25119, -23920, -6829, -7079, -28672, -35810, -24069, -8305, -3623, -11827, -21883, -22506, -8822, -7135, -17424, -23253, -17030, -12420, -4573, -5501, 4878, -7045, -21834, -21821, -17884, -7500, -3461, -13259, -17089, -4112, -3571, 1903, 1035, -5336, -8416, -9034]
16613i034k7385K614J2553J0650N227O695k976n779r301l364o149k757k625J924
16599b9707P584l210J5520l057r704J642J0229N643m815P178o903j0301j021L952
16585a6970L679j5004J4055J6965l487r738k3175J655J0770J3453n801J230l132
16572a5500j894M432L687R77J3402M002k0966m213o857O708J9294O406l517R27
16558F888q957j0734k322M359Q229o699J0945j55q230j1284l695l684J3843J2079
16544E83j1359m68P458r216j3897p63o623J0407J4142J2473p944j1981n341J2417
16530a0112l27n724N517M458M935R925j06k0166r013j4111q770j2503Q326M578
16516d3093R826J5192L710j0327j0143K772P924J6991n063J74J0594J10j187j86
$$ y = [-9034, -36419, -33805, -21252, -10602, -5375, 1320, -1656, -7435, -16736, -20100, -26249, -29006, -31631, -29707, -22123, -25333, -9813, -12870, -22574, -20932, -10703, -5060, -9875, -2697, -9600, -19901, -20922, -16970, -13291, -28295, -14240, 2725, -762, -10500, -33675, -32020, -21250, -7797, -13598, -12368, -15500, -17394, -12962, -9275, -8298, 5104, 9106, -11860, -16073, -22930, -16222, 3072, 9478, 5961, 6888, -2069, -12803, -15125, -10766, -2537, -9236, 1709, 1554, -6676, -17960, -21655, -25339, -11496, 583, -10776, -11244, -3786, -13002, -26899, -27662, -34285, -23878, -9736, 2737, -5207, -17188, -22529, -10112, -10439, -16163, -10646, -6188, -1253, 8672, 8566, -11600, -20613, -34724, -43494, -55997, -47671, -43093, -33267, -18075, -14365, -24692, -34835, -32063, -24139, -7148, -12211, -12037, -1443, -1333, -2520, -2706]
16502b706o50l203m195J0454o934p59q106k992O015N468n243K549Q193J4416j3511
16487a204q306n224K576J0103k624j0932j2693l810N643J2350j82r348o37R667
16473a4621Q196l170m578k005j0785p784q7J2989R353O232l139j568j4119j3146
16459c8232l867k707P112O513o188j053n876J2098K6021O165K454j457o758L542
16445b233K191j4101o419L896J549l574J149j799q867M817J6713M409l531j6494
16431b2294J663R186N223j882o763m832N953J413j0840j992k615Q591R353j2502
16417b2338n762j1003n485Q716R088J7726L199j2541j0461J3039J8915P12j5741
16404a1936l856K746n944K135J3401J0658M119j3452j5929p282J0542J7517L922
$$ y = [-2706, -3356, -6559, -10754, -300, -7234, -7993, -16099, -19091, -13076, -7608, -12851, -10302, -2109, 12307, -1204, -9510, -14734, -12158, -2055, -4679, -15611, -28304, -32114, -26471, -14121, -14303, -23651, -24288, -14621, -6425, -9595, -14173, -16178, -26963, -34747, -34834, -21845, -12492, -6260, -9399, -10967, -25086, -38232, -42099, -44806, -37694, -31181, -37369, -38422, -44298, -32200, -6179, -14, 2440, 983, -5775, -2233, -42, -14143, -20562, -16666, -15117, -18691, -17542, -19341, -28208, -23391, -6678, -2269, -5800, -22294, -20631, -11445, -6222, -8104, -14867, -19699, -13746, -12333, -23173, -25165, -27780, -19189, -9836, -22338, -28100, -39103, -44588, -35872, -26784, -9058, -5859, -18400, -28861, -15822, 3093, 3805, -11936, -15792, -13046, -18990, -16855, -3454, 7204, 11323, -2129, -18058, -25340, -14798, 2719, 6641]
16391F641Q41M659O12k0491j3899K175P398q619r765j127K0434J8801j805o633
16377g78k996Q608L269m403n683j0604p059J0366J451l667l912k347k554m932
16363b5241L275P560N135q06Q537R500o540k3653o723q107m123n690J3184J8213
16349a5479J515K550J0095P952m844o415l893j510l811O36J5973l392M459J967
16335E803K210j1092j6623m033j045m629n88J0318J9579J3761p560j3063j758
16322h720J514m648j2458L295L111J3100M397J2818J7739o719n736j0931R618
16309A6380P671m855l411l503k12o841P023r189j2639k006J280o225q821N201
16295b0147l198K877O073P444J608M301r13m806j92P683N008o734k1198m061J4991
$$ y = [6641, 7482, 12141, 12753, -7738, -21637, -19462, -12064, -20683, -30448, -31575, -11141, 7660, 5855, -778, -3774, 4834, 8103, 3700, -1983, -12587, -19646, -9280, -7829, -11496, -15408, -17755, -20309, -25241, -21966, -14406, -9271, -10077, -1540, 7960, 1420, -22233, -28956, -37063, -41186, -46876, -33692, -15479, -13964, -11414, -1319, 6633, 1789, -4626, -8519, -10029, -13840, -13204, 2769, -623, 3836, 5803, 8013, -3079, -19702, -23735, -24780, -29409, -29997, -19679, -100, 13661, 6101, -6962, -8720, -7206, -11854, -24312, -21017, -17906, -4806, -409, 12409, 30148, 23429, 17693, 6762, 16380, 24051, 19196, 15785, 12282, 12070, 5229, 12252, 3063, -9576, -11582, -10302, -16527, -25348, -20147, -23345, -20468, -14395, -6951, -5343, -1042, -1955, -6761, -6953, 730, 5738, -996, -22194, -26255, -11264]
16280a1264J3512P403j0812j003j100k924J114j3533o689K576k851n434q45Q800
16266b3050J6250p576M229O031q918j1589L378k442K552R524J2511J3828M785
16253A9513l347j7770j1120Q412R63l639o263l256J719p251k345k155J2542J5915
16239A918l369L376j527k124p813k093p242q559K213N733j2448L671l4J09K4671
16224c518J6025n138p560p474K20j048r796j688K597O586j2042J3203K7N442o027
16209a0191j3165Q48K105k853K416j8911M551J0188J7115J0156K035l800L505
16196C999j638j1221p614o82M507M483N788P193j994q802l949N372j972o41p803
16181a4974l326J6342J4606r230j6906p863j58K1721M900j6603j2788n809L968
$$ y = [-11264, 2248, 9651, -1161, -2164, -3264, -6188, -5074, -18607, -25296, -22720, -25571, -31005, -31850, -23050, -6800, -14376, -10147, -4116, -13034, -24623, -21245, -23687, -21135, -11611, 900, 14728, 19513, 16166, -1604, -12724, -4312, -3349, -6988, -13251, -16507, -14788, -22039, -24384, -26539, -13997, 1918, -1451, 1925, 398, -1726, -9539, -11632, -18874, -27433, -25220, -19487, -31935, -28264, -28298, -28189, -3518, 12507, 7369, -191, -7665, -7445, -8493, -18289, -19977, -17380, -10794, -22836, -9633, -9606, -4164, -10191, -23356, -22508, -20403, -23256, -20840, -39751, -35200, -25012, -7897, 2259, 4294, 494, 3999, 2361, -8860, -16474, -17156, -12649, -8166, -2378, 4815, 2821, -5981, -9930, -4558, -6530, -7171, -14974, -18300, -1958, 12648, 3418, -13488, -21351, -21509, 212, 5112, -11491, -24279, -30088, -26120]
16168b6120J4461L568r442m081Q569P333Q200j787m297nq525r99N131r51L154
16153e791k135p106j1286Q379P407n334p571J480K0542R329j0040j4632j2421
16140b9179K952R413J0295M754j674M80P102j1335q395n71l100m259N951K379
16126a5187J029j086p116j206J914L438J3338l90J760m063p902j0496j441K901
16112b4507M209l330J347k330l036O24O548l429j210R84r072L156J6524k660Q527
16097g655K6255j5168j6627L159j4980J104P536O536J0799K458M064r866j0095
16084a2480N100N019j3234k25N36m955N258Q488r099k046J154O66J027k652J4053
16069c390O407j2708j3822K020J6477J2310m402k1507j2099J995l510M871R671
$$ y = [-26120, -11659, -8091, -17533, -21614, -13045, -5712, 2488, 701, -3596, -3601, -12126, -13125, -7994, -8945, -5791, -7926, -15032, -26318, -17939, -10532, -15866, -23437, -21957, -1415, 7914, -2126, -16758, -29179, -26227, -16814, -6519, -1765, -3439, -2959, 4143, -7192, -15587, -16158, -19258, -23517, -17566, -15187, -14158, -15244, -22360, -23566, -21652, -18214, -4876, -5266, -3506, -7569, -15471, -25967, -27408, -24507, -20298, -23628, -22281, -24611, -27647, -27023, -20475, -23904, -25114, -24130, -33202, -30046, -13522, -16182, -7655, 18600, 3432, -13195, -10036, -25016, -23912, -16376, -9840, 959, 3417, 7481, -2385, -12480, -7380, -2361, -15595, -15820, -15284, -20239, -14981, -6493, -15592, -17638, -16484, -15818, -14791, -17443, -3390, 3017, -9691, -23513, -21493, -5016, 7294, 2892, -18615, -30714, -28719, -32229, -27358, -17687]
16056a7687J207O857k892m433L698P043n155R131j1520l320o359n496J4405J1233
16042c288q683j1307o639J1032Q917N742K01J019N13j6617O751K980j0994k639
16028b3012N650R012O755m354O835l872J934n592q085p995O477J2368J157j1122
16014a3844k452n73p389j6644P205K887M310J1854O997M206N780o709j5414K766
16000a7020P863P9L633k835k946r909m234j2713N890J2361O750O548M143o276
15986h666j7984M36J1885Q048j892J2916p576j5833j0611j4668M192J3285J5498
15973a0970R280L37j2439M997J3523L664j4565m114o402J55j979J3966J4569m092
15959E930j3338j9404q32J056j344l548n84O867N157k317l17M2j14J4420P307
$$ y = [-17687, -16480, -9623, -12515, -16948, -13250, -6207, -11362, -2231, -13751, -17071, -23430, -28926, -14521, -3288, -11971, -23278, -29917, -18885, -9968, -4226, -4025, -3006, -2493, -19110, -12359, -9379, -20373, -23012, -17362, -8350, -1595, -5949, 886, -2986, -1052, -6644, -14729, -22724, -16247, -3879, -2722, -13844, -16296, -16869, -24258, -40902, -33697, -30810, -26500, -14646, -7649, -3443, 2337, -4372, -19786, -17020, -9157, -9078, -5445, -8280, -11226, -21135, -25369, -38082, -32192, -19831, -13081, -6533, -2390, -8666, -26650, -26214, -14329, -6281, -8173, 4743, -2833, -18666, -29277, -43945, -39753, -26468, -10970, -1690, -1353, -13792, -8795, 4728, 8392, -6173, -10287, -16689, -16534, -18513, -4547, 10022, 5930, -7408, -26812, -27644, -26588, -27932, -31480, -32064, -25197, -20040, -22357, -22674, -22632, -22746, -8326, -1019]
15944a019q773k215R730l770j9597k199J8667J5341n649j4218q337n66K964L106
15930a6535R949J3021J663r45L463J422j6004N007O084k74K459q650r065l204
15916a1609p625O769K015j399J807p161N610Q655j500k986j4077j5080J4455O355
15902a5771N356p56J621n07R868J4876P188o795q993l489p64m251J423K478o432
15887d948l815m634R688N805l816k0587j2659Q591K7220L275j2176o304j2043
15874b6403K273O662j2606k821J5499o057K225K2674M097k1355q390k951l069
15861c0222P707m705O796J6933J1368q477o809q619j535n584J0497J0273j3501
15848a5878k543k64N01n20M857P164k929k810l373N576j806j428P115M082j0296
$$ y = [-1019, -9792, -12007, -2277, -6047, -25644, -27843, -9176, 6165, 516, -13702, -22039, -22605, -19641, -16535, -6586, 6435, 8098, 7153, 10616, 12038, -3966, 1041, 7125, 6851, 9310, 660, -8405, -11609, -19234, -12465, -10450, -11849, -10042, -17203, -11593, -2938, -4438, -7424, -21501, -36581, -22126, -15771, -10415, -11171, -9550, -10057, -189, 14687, 21875, 15080, 6087, 2598, 1834, -2417, -994, 1484, -4948, -8763, -13397, -3709, 2096, -1720, -22307, -34966, -26375, 845, 4120, -8056, -14360, -26403, -24130, -17468, -30074, -32895, -17396, -23453, -21228, 1446, 5543, -15812, -24202, -27153, -30222, -22515, -27220, -20424, -3491, 7877, -600, -7409, -16028, -17563, -23147, -12650, -2377, -15878, -18421, -18685, -18184, -18704, -13847, -6683, -9612, -12422, -15795, -10219, -12025, -13453, -6338, -2256, -12552]
15833a2552j1214M87Q223J2926n326r074O386K127j6033j6459P632J158J356N890
15819b4473Q722R10o856j398M861J972K708l486J33J0449n500m321j865j4848
15805c2992L71J000N524m71L347L334N629O740o727q206K221R117k357l138J3958
15790b650J1979O438p849m790K1711j2276j9068J465J538O82m339m011n405j0652
15776b7227j2779j0390J2426K3264K4326J427L069j1913k3414j7807R100K2495
15764g423Q962q853m694n25Q27q463m316L38r772O086J3909J3029j5269L178J9318
15749F332m088J915Q06J2513O408j1131j2394k3280j1046M998L740M643K197j3127
15735c1514J1270J1543k130j1106j0320J7563l146q836J0669J2527J315p830l73
$$ y = [-12552, -23766, -23279, -15056, -2130, -7456, -16530, -10144, -8017, -24050, -40509, -32877, -31719, -30363, -24473, -15751, -14841, -21697, -23095, -18234, -16262, -13554, -17040, -16907, -6458, -11958, -16279, -18144, -32992, -32621, -31621, -26097, -26568, -23221, -19887, -14258, -7518, -14245, -22451, -20230, -11113, -13470, -16608, -2650, 9329, 15767, 7918, 3128, 24839, 12563, -6505, -5040, -3502, -2820, -7159, -11170, -16575, -27227, -40006, -50396, -37970, -14706, 9620, 11047, 14116, 2203, -21211, -39018, -29918, -7423, 1539, -7314, -12008, -12533, -11706, -20169, -24485, -24147, -33919, -27833, -13924, -895, -16164, -12986, 6332, 2244, 4159, 4965, 17478, 23886, 12755, 361, -22919, -33965, -28967, -25227, -20584, -18387, -31514, -20244, -8701, -10831, -21937, -32257, -14694, -17840, -26676, -16007, -3480, -2165, -9995, -10368]
15722a0368L808K319q127M560j8237m935J6201K987M345R223N004j8344j1471
15709b3035K167J2404J7678M033j1681q258L98n480K747J5200M534j4549j6513
15696b0355O27J528J7283J0906o781q656j9055j0035P478O140P230m27J999l553
15682a5671k809P115R830r39Q003o24o425k812J074j6489p109M420r288M572M799
15667b2353P343J8219j295j8042j0362R214J0402L072j433n433J362k258O272
15654e292O047q049O217N820O030M28j0655o922M112J0444r273n731M144Q11o912
15639h781M422n025p055R92J583j967N662O194j0764j461M166L365L258j2581
15625a7992P062K266q869j2596J431J5993J3770n816k433l964m97L871j0968r435
$$ y = [-10368, -6560, -4241, -12368, -7808, -26045, -30980, -14779, -11792, -7447, 1776, 6780, -11564, -23035, -20868, -8464, 9214, 13247, 1566, -6692, -6294, -11774, -9027, 6173, 10707, -3842, -20355, -19728, -18200, -917, 9989, 3208, -5448, -24503, -34538, -27060, -20920, -13690, -14117, -12118, -15671, -18480, -11365, -1535, -2474, 5529, 4905, -1520, -4332, -3258, -19747, -26856, -22436, -31724, -27152, -22353, -15010, 3209, 1914, -16128, -26490, -17276, -6874, -3802, -5235, -10668, -9306, -11564, -5292, 755, -7294, -1077, 4743, 10773, 11201, 546, -6376, -2264, 8180, -1093, -6824, -2680, -1869, -8781, -4359, -9384, -16439, -15447, -13864, -15831, -10169, -3975, -14739, -16200, -12034, -8669, -5411, -17992, -10930, -8664, -17533, -30129, -28698, -12705, 1065, -4751, -7184, -11148, -11645, -7774, -18742, -28177]
15611b8177J6461J8740O256L598m969q596j3617k2816l155Q384P902r024j1782
15598d0795j6093o853R138J7731J6867J1940M311M688N483N929n802R37q996m143
15584e658o127O359j960M603L655J276J717K710k877p093K618O243j5418m763
15570a4715l245K353j0405M085N492J178j5517J5790J2761N169k160m237L120
15557c31M123o63r602j0434p602N951J2540J682j1396J405K8539J8944j972k1394
15543I790j0485R672J1454q606j6432k558P56M782R853r053M765o018n483N51
15529g012O404j7107K446J1313j0582L344o258Q6N722K73J1485j1304q697J70
15515a9717O820M926l608Q022O889n977J821j2903k726o281p099K461N910J7203
$$ y = [-28177, -11716, 7024, 13280, 16878, 11909, 3313, -10304, -33120, -36275, -27891, -19989, -29013, -40795, -56888, -63741, -54603, -36872, -20005, -8065, -3754, 934, 6417, 12346, 6544, 7481, -1515, -5658, -11785, -5426, -7386, -2783, 872, 2148, 3865, 6575, 3698, -3395, -777, 5466, -9952, -14715, -17960, -15607, -26012, -21927, -16435, -15257, -30774, -14984, -2223, 2946, 786, -3451, -331, 3792, 3129, -6473, -16907, -24509, -18558, -6018, -4336, -15732, -14327, 14212, 33156, 31184, 9790, -695, 8977, 20431, 11825, -4607, -7165, -6409, -1627, 8226, -827, 3938, -2080, -7563, -7012, -608, -17715, -15269, -3956, -14538, -11194, -17452, -17366, -11644, -11371, 114, -11190, -19887, -19717, -12897, -7971, -11579, -3557, 3332, -2645, -824, -13727, -16453, -22734, -29833, -27372, -21462, -4259]
15501d259L142K782j1564O628K494j0416P337N915k448p001j2457q412q033K0161
15487a6131J213l111K350K485k230j497R495p59j1870j4204J178r33o562J1868
15473b8708J7505l52K398M611l88m050q420N469j610J624k635k908M456J088N541
15458f379r669k726J1620Q499J4170J418l242K845N810n908j5208q620Q928O108
15444G646n454r428p772J197J752O263L997R84J140k4918J588L611j329j346N420
15429a6649J1332J9671l048Q358j7432j4843j6279R974J4047K842p78o045j5654
15416b4504o971J3119J2923J7904N005m179O643l595m877k1335M46M385j864l649
15402a0549J1143p993k832O459J0049j244k581L169l628r004M640J0609Q285M540
$$ y = [-4259, -1117, 1665, -9899, -3271, -777, -11193, -3856, 2059, -389, -7390, -19847, -28259, -36292, -16131, -14918, -18029, -15679, -13194, -15424, -16921, -7426, -8185, -20055, -34259, -33081, -34014, -40576, -28708, -11203, -11555, -9157, -4546, -4934, -8984, -17404, -11935, -13545, -11921, -14556, -17464, -13008, -11920, -6379, -16048, -18774, -7154, 1345, 15515, 16933, 13691, 16536, 22346, 16438, 1230, -7390, 1538, 7646, 2192, -7236, -15008, -13811, -12059, -5796, -1799, -815, 325, -24593, -23005, -19394, -20723, -22069, -16649, -5317, 14354, 11306, 19664, 2232, -12611, -28890, -18916, -4869, -2027, -2805, -8850, -24504, -31475, -18356, -5433, 12471, 17476, 13297, 19940, 16345, 11468, -9867, -9421, -5036, -6900, -10549, 594, -7399, -10231, -3772, 6277, 5033, 2452, 5621, 1993, -7011, -2371, 8238, 16523, 21063]
15388B1063R24j5009o258j103O769M817p397j187r769j4376M748Q633Q307R601
15374I763O520k063m256j4569p051L571o964j716J4272K5371M680j7914j2474
15361b830p712m331j965M443J7745m847p261j4165r199j2547J2314J2453N748
15348a2154Q878N540p982m737M721J3598O273j7262j0176k356K666M583j612J2360
15334B340N204l121n78R463n787j4796J329K354j4441J3393K277N794n48k625
15320B58L355J8834M256l869k1188r716J3011L334N51M602p272R145N062Q363
15306B8726n117p406n429j928K006k489j2576n510m598J7947J5593q43q987r5
15292I294k821k210l021j5018o746N800J8328Q775k685m374r10j1468N03R23n515
$$ y = [21063, 21987, 6978, 720, -383, 6386, 11203, 3806, 2619, -7150, -21526, -16778, -8145, 162, 9763, 16283, 14220, 9964, -4605, -11656, -8085, -15049, -16765, -2493, 22878, 27558, 9644, -2830, -10542, -14873, -16838, -12395, 5350, 503, -6758, -20923, -30122, -42669, -30355, -17902, -12154, -3276, 2264, -5718, -10455, -5734, 7864, 14137, -3125, -13301, -15657, -12991, -8408, -10020, 2340, 7544, 4423, 3845, 13308, 7521, -7275, -5946, -3592, -18033, -4640, -2363, 3431, 2883, 258, 3613, 22447, 26703, 22834, 1646, -8070, 4941, 8275, 8826, 13428, 6156, 15301, 20363, 28726, 23609, 16203, 10774, 8846, 10852, 8363, -4213, -9723, -14321, 3626, 19219, 18376, 9389, 9294, 6473, 4263, 1242, -13776, -20522, -14722, 3606, 12381, 9696, 5322, 4412, -7056, -6553, -5630, -11145]
15277a1145R249J1145J226j8034J512Q584O162K573q116j3164J251P373n606j5518
15263b2508r376L339J5187j347j6767J145j0685m741J3326J3353L684r666o093
15250c1149r15J7735J2758J281J607J264K785O25n907r633l305Q641P557P925
15236A1269M314L664m181j3179k001L831m010n295j0999j6799J836J8164K407
15223a0979L775l5P108j298j1593M434J615j4048k172M8N725J3047L928p190q541
15208a6176J0006k645M158J2130R721k588o933K081J626P73k643P155l383j6976
15194c694j2157J40N28J2175M490P96L890K195p606M516m459L182l865q333n921
15179a4123p161R283k772r792J4619J0144J739j998m943m733n244k42N669J6666
$$ y = [-11145, -1896, 9249, 10475, -7559, -6047, 2537, 8699, 11272, 3156, -10008, -8757, -1384, -6990, -22508, -31884, -28545, -13358, -14705, -31472, -30327, -41012, -45753, -32427, -19074, -15390, -25056, -31149, -32064, -14329, -1571, -290, 1317, 2581, 5366, 5991, 84, -9549, -12854, -4213, 3344, 11269, 15583, 19247, 15066, 1887, -114, 3717, -293, -5588, -16587, -33386, -31550, -13386, -10979, -7204, -7239, -131, -1429, -13022, -8588, -6973, -21021, -23193, -23145, -17420, -4373, -445, -7635, -16176, -6170, -8815, -4657, 7473, 17194, 14606, 7673, 9754, 11380, 12153, 9510, 16665, 13282, -3694, -15851, -15711, -15183, -3008, 1482, 2278, 6168, 8363, 757, 5273, 814, 3996, 131, -8202, -14123, -21284, -12001, -14773, -24565, -9946, 198, 1937, -61, -5004, -9737, -14981, -15223, -9554, 7112]
15165G112J0328K221j0293n800P761q14O65m545r665j091q17o147k703N921J3986
15150F119o298m301J799m86J4880J659j7004n173L889J3628J2401n824M98l088
15136A2699q733l323m591m305M311O992j421o431j5266J2420Q154l630k926J1270
15122E220J3488o518L899j287N084k2603q760q489j523J4835J3341k989L843j0234
15108b693j135j855k0969K504J2395n172J209m579J4728L535j12P089N23j0913
15094e445j1215J5563R242j228n572n061J157M709j625l560j064m524p403J8848
15080B822Q727j4374m507O213O326o934n827m445M908M592p254Q122P330P033
15066A2732P492o814o913Q150m002j8483K864q93j531J1972l102j6230J1288J3847
$$ y = [7112, 17440, 19661, 9368, 3568, 11329, 10515, 11180, 6635, -3030, -4121, -4938, -11085, -13788, -7867, 6119, -179, -4480, -2681, -3167, 11713, 13372, -3632, -8805, -4916, 8712, 21113, 15289, 15787, 12699, 3966, 643, -3948, -8253, -3942, 3050, 1629, -4802, -20068, -7648, 506, -3124, -6050, 5220, 18708, 12190, 16089, 14802, 19886, -2717, -11477, -19966, -21489, -6654, 6687, 3698, 7541, -2693, -3828, -5683, -26652, -24148, -11753, -16925, -15716, -20295, -5567, -2032, -2144, 4945, 5468, -5445, -16660, -1097, 8145, 6917, 1345, -3716, -2559, 2150, 525, -3035, -4099, -8623, -16026, 2822, 11549, -2825, -7332, -1119, 5207, -1727, -7554, -11999, -7091, -2499, -9753, -1631, 5699, 12732, 20224, 13410, 6497, 14647, 10645, -7838, -4974, -5867, -7398, 4574, 1472, -14758, -3470, 10377]
15052A0377J4539j2574l358l160q860j930O447Q486p419n255P341J0824r152K163
15038H469q887j7420q900L368L1078Q756k7991n034R268j331J488J5352P425J667
15024A7308r68j2641j2139M73k002j805K182q565P349j068J4956n89m375N054
15010C170R171P031n52j3647n961M635M587l445n72j2012p128O390j372q659J1297
14995g067Q835K093j781J5326M910j4538j2289p245O241N039m026R8J865r48j2679
14980a6166j5381J1190K3633m415j89n663j112j1195J505K186K803P766Q838p878
14966d078l670j587L505M599K211O282n254q813o168J626L408r68M762M920K950
14951C725k412k589P04r343o572K0911J7463m853l695J4298M314r558j0883k499
$$ y = [10377, 24916, 12342, 8984, 5824, -3036, -4966, 1481, 9967, 2548, -2707, 4634, 15458, 6306, 8469, -418, -17838, -26738, -23370, 7708, 16464, -11527, -16561, -7293, -8624, -7136, 8216, 15641, 17308, 16340, 3699, -8440, -7967, -9969, -11774, -9592, -18157, -10808, -11876, 3080, 2491, -1884, 3170, 12341, 19372, 18820, 5173, -788, 3847, 8434, 4989, 4417, -7595, -14723, -8333, -9705, -18364, -7067, 1768, 3861, 2080, 17406, 22316, 7778, -4511, -11756, -5515, -476, -4502, -4404, -2539, -3487, -16166, -31547, -20357, 3276, -1139, -1328, -6991, -8103, -19298, -17793, -15607, -12804, -5038, 3800, -4078, -7748, -9335, -5830, -1231, 980, 7262, 2008, -6805, -12973, -11347, -7939, -8907, -4145, 775, 3725, 1313, -1276, -572, -9915, -16487, 4424, 21887, 17034, 13339, 27637, 31951, 22393, 11510, 9011]
14937I011Q086m376l708l77m185N730N250n194K697k997j0707o594O410m807M800
14922i61n89l761J3021N366j4294Q490J7778n394j1117k199Q582k410r442O976
14908A0046j335j0655p602J0545M114n172j2720o963J0808J0354o252r733J4390
14895a75P963k0O046J0072o521j0886L482j577L044p42j6747n941l344M412K260
14880h674M929r71l133j408m887J7190J0552m403r833j1881o00J2440O553k085
14866C789n35J5388k62m378K556q463o944K510k635L592L438L657K827K802r821
14851G521n68O106K392j2793j4764r208Q766R596O678J614K840q81o982L898r066
14836d851O336J5099p755L760K0275L36j7161j2912N968J9089Q385j1129j4245
$$ y = [9011, 17097, 12721, 9013, 8636, 4451, 10181, 15431, 10237, 12934, 9937, -770, -7364, -954, -5761, -961, -1550, -5311, 7710, 13076, -1218, 7272, 25050, 19656, 8539, 6340, 14922, 12512, 3070, 10046, 8711, -1944, -9546, 999, 5113, -59, -12779, -19742, -8934, 1420, -4832, -14565, -175, 7788, 7768, 13814, 23886, 17365, 6479, 9961, 8384, 11428, 10686, -6061, -12002, -15346, -10934, -8674, -3745, -4716, -7849, -9257, -14144, 3046, 13598, 9195, -638, -12519, -13119, -679, 5874, 3789, 3254, 18642, 18380, 14002, 16558, 8095, 1151, 3661, 1026, 4618, 8056, 11713, 14540, 17342, 7521, 6953, 13059, 15451, 2658, -12106, -21314, -12548, -2952, 3726, 5340, 8180, 7299, 317, 4215, -4851, 1485, 16584, 8829, 12589, 32864, 33200, 16039, 3127, 9095, 28184, 36569, 25440, 11195]
14823A1195O656l481n928M846J0999m993m366M149R627j1713m205m491J089k509
14809F875r319P407n098R72O322J1523J9506J7797j7441j0696J438n521o227J0825
14795B8363J1341Q653J522p675r867n986M590l686j4417j6033p996R315K463r659
14781i072Q195K464j4132o554J3677N759n952m42o499J9815M563j2001k178J6697
14767A4340L141l150L558k809j704j3341q887O978l87r511R044J0117q555j2495
14753a3661L173J4139R132k965m600j2941J816N723J0925j388j0170N709J666
14740F558m890l553N139o110L36r086p478J36J4272J532J93l835p336P292J7513
14725A0683K0893N099o893j5340q878p92r722n367k29J1527J6158L418P438N808
$$ y = [11195, 17851, 14370, 8442, 13288, 24287, 19294, 14928, 19077, 28704, 16991, 12786, 8295, 9384, 6875, -2444, 4963, -135, 837, 7159, 18682, 38188, 55985, 38544, 27848, 29286, 23765, 17538, 28363, 39704, 48357, 49879, 42204, 32337, 26351, 30941, 27255, 12838, -3195, -11191, -1876, 587, -9072, -877, 1587, -12545, -19099, -5422, 337, -5615, -6057, -12556, 7259, 11822, -179, -2357, 14340, 17481, 14331, 17889, 15080, 13376, 35, -8852, -1874, -2261, -11772, -2728, 7389, -1166, -13661, -10488, 3651, 12783, 9818, 5218, -7723, -5907, -184, 10741, 9353, -817, 4892, 6558, 1668, -1885, 3254, -2856, -2520, -11606, -19084, -18948, -4676, -3144, -2951, -6786, -14122, -6830, 10683, 31576, 36675, 29782, 14442, 5564, 4772, -4950, -10317, -10546, 981, 17139, 20557, 27995, 33803]
14711C3803q479l908n443o310J3095Q883j029p447p351Q895n093o894Q156n09
14697B0369m151n509R064j496j77r533j420j395L766J0361L798j4143J4077J3464
14683C7075q629r378J040j4397j1905N490J5085R130j4995o510K859K102N037
14670A2004m016m235r126n284K022L607O221J8433J2087J477k388j2525M13j625
14656A7065n80J287J47k149J1947J1753J3731J0006j5588M063j7692k0344J0839
14643B4485J5517l978K518K82l465N626Q690M446P19j5521J307l397k3998m797
14629H434Q683N665L638K115Q052o476m030J3895l202l189n565J1269K1050M667
14615F5006j021j1462o955N098J040p996n9J518n055m245k864L3507J0142j0751
$$ y = [33803, 25324, 21416, 15973, 9663, 22758, 31641, 30612, 23165, 15814, 24709, 19616, 12722, 20878, 20369, 16218, 10709, 19773, 18277, 18100, 8567, 7147, 5752, 9518, 19879, 23677, 9534, 23611, 37075, 28446, 19068, 20108, 5711, -6194, -704, 14381, 23511, 8516, 2006, 4865, 6967, 12004, 7988, 3753, -5373, -10657, -8635, -5028, 1193, 19626, 31713, 33190, 30802, 18277, 18690, 17065, 16485, 17772, 17919, 15770, 27717, 39470, 53201, 63207, 47619, 51682, 33990, 13646, 24485, 40002, 36024, 38542, 38824, 35359, 40985, 49675, 54121, 54840, 39319, 40626, 37229, 13231, 8434, 17117, 22782, 26420, 28535, 36587, 30111, 26081, 39976, 36774, 33585, 28020, 39289, 60339, 65006, 63985, 52523, 45568, 50666, 51706, 43710, 43651, 45169, 40114, 35869, 33005, 66512, 76654, 65903]
14601F5903j1550J595j677J6068n179k300j031J2792K9041J0567J6520J0069J1440
14588A52258L0708R9211J26250J54415K03697K04711J49703P4089l1737j39063
14578A024242k04881k19620j69351j14080q6691m6483k1806k7148j6240j6894
14568A01048j2569j3233o868o370j744M414N166q659j0277n055J825O74q413n143
14554C4796K015L278k481o318M465m628J671N224J355k754q325k955l482K978
14540B4839Q849N181K286M667Q10O268L82j6598j4660r635N43P450R977P787o599
14525C1547K172M715J796l648l147P098q348o391Q411J2851P635j122n093q085
14511D0391j1629l632o481O578n24k694R424J1830Q07k59j816j167l313R188J0071
$$ y = [65903, 54353, 55948, 54271, 70339, 65160, 62860, 61829, 74621, 103662, 114229, 130749, 140818, 152258, 182966, 282177, 408427, 562842, 766539, 971250, 1120953, 1195042, 1163305, 1024242, 819361, 599741, 430390, 316310, 229619, 183136, 161330, 134182, 117942, 101048, 88479, 75246, 68378, 62008, 60264, 64678, 69844, 61185, 50908, 45853, 47678, 48352, 39939, 34796, 36811, 40089, 37608, 31290, 35755, 31127, 32798, 38022, 39377, 36623, 28298, 25343, 21861, 24839, 33688, 38869, 41155, 45822, 46632, 52900, 53282, 36684, 22024, 12389, 12932, 20382, 30359, 38146, 31547, 33719, 38434, 40230, 36582, 33435, 40533, 32185, 25794, 34205, 47056, 54691, 53569, 48476, 40391, 28762, 25130, 18649, 25227, 24703, 22009, 31433, 43263, 44070, 43811, 41995, 40828, 37515, 46703, 56774]
14496E6774r977l357M033j1987p686k78K35n20O204l153q457J326P060L814J006
14481C5037J266k509q503j9594Q886P052P288l265j290j742Q40N479K329P237
14467C8511J36Q517q201M695L926l292O996j233j1127o350j017K909K306R51m494
14452C3233J9236R497j3873j5003n303j3030n060P069J0959P420o181J6467R728
14439E5159R29L993J653Q037K079r606j4129j7211K214p408q714K839O742J5992
14425D2569Q205j017K718J1425p442R174m128M171m016J967J3555L71M503J4274
14411I6329L3188K4302J4612M410j1824O78r5o085j9241j0796j6866j0598M183
14398A02197o050j9429q605K286q70L266j2961r89O354r159l814J628J823j92
$$ y = [56774, 46797, 43440, 47473, 35486, 27800, 27522, 27757, 27237, 33441, 30288, 21831, 23157, 30217, 34031, 35037, 36303, 33794, 25291, 5697, 14583, 21635, 28923, 25658, 24368, 22626, 23466, 28945, 31274, 38511, 38647, 47164, 38963, 43658, 47584, 44292, 51288, 50055, 38928, 32578, 31561, 34470, 36776, 37727, 33233, 52469, 61966, 48093, 33090, 27787, 14757, 9697, 16766, 27725, 35145, 28964, 45431, 55159, 56088, 60081, 61734, 69771, 71850, 62244, 48115, 30904, 33118, 25710, 16996, 19835, 26577, 42569, 50774, 49757, 52475, 63900, 56458, 65632, 61504, 65675, 61659, 63626, 77181, 77552, 82055, 96329, 129517, 153819, 168431, 172841, 161017, 161695, 161600, 155515, 136274, 125478, 108612, 98014, 102197, 96147, 76718, 68113, 70399, 69529, 72795, 59834, 58845, 65199, 56040, 52226, 53854, 55677, 55485]
14384E5485o07K278J1266L071j3669j5814J5301J3451o664j0884K554p829p644
14371D0295J645R157Q025n131O045j610l532k545M543P872J04n831j507K572R571
14356F9673N032Q446J1212P996r149p720j1399m982M770J275o517J3879J7321
14343I9837M928p746r721L506N135J937J78j679k777j883l708K517J1570J6995
14329A19089J4910J5303N700j1173J305J5183J5654O299J8788J6673J2578L4654
14317B64963K9756J9061K8182M6967N1247M7674N3769P8547Q7752Q0903Q9487
14306H78308J24696J50023J85486J88591K11877K10195K05004J62552R9729K3147
14296B439608o7649j34129j89602k15156k02314k09455j84504j52101j23126j12530
$$ y = [55485, 54878, 57156, 68422, 71493, 57824, 42010, 57311, 70762, 64098, 53214, 55768, 47939, 40295, 41940, 51097, 59122, 53991, 60036, 58426, 54894, 52349, 56892, 64764, 64868, 59037, 57530, 60102, 69673, 74705, 83151, 94363, 102359, 93210, 85490, 74091, 69109, 73879, 75154, 68637, 82516, 99837, 104765, 97019, 87298, 90804, 95939, 97876, 98054, 96375, 93598, 91715, 88007, 90524, 102094, 119089, 133999, 149302, 155002, 143829, 145134, 160317, 175971, 182270, 201058, 217731, 230309, 264963, 294719, 313780, 341962, 388929, 440176, 487850, 541619, 620166, 707918, 788821, 878308, 1003004, 1153027, 1338513, 1527104, 1738981, 1949176, 2154180, 2316732, 2416461, 2439608, 2371959, 2237830, 2048228, 1833072, 1630758, 1421303, 1236799, 1084698, 961572, 849042]
14286H49042r2659o7142o8551m9686n6118l8758l5752l5303k6483k4442k3594
14275C30554n218k2933j7048j5732j1413j6704j5650n393r238j7725m814n129
14263A83557k0040j0698j2289p970M145L883O726L019n300M696o889k0488l703
14250A18649p251K038L161J41j9485j4539j201K537J2594J4268K5167K374j790
14237A36663J0061P032j5617j9812k1673k6762L618L777l349n941K2258R747M808
14224A04810J4865L906P34J0015K696o905p452K932N483J8708R345l491Q625J2142
14210A76413j2127J90J1289j8677o205o886R474j101k879j104K523n801m013n636
14196A35460r287k460l532N329p433m186M923l347k437N316K2644J3111q307r804
$$ y = [849042, 756383, 689241, 620690, 571004, 514886, 476128, 440376, 405073, 378590, 354148, 330554, 325336, 302403, 285355, 269623, 258210, 241506, 225856, 220463, 211225, 193500, 188686, 183557, 163517, 152819, 140530, 132560, 136705, 140588, 147314, 150333, 145033, 149729, 142840, 122352, 118649, 111398, 113436, 116597, 116738, 97253, 82714, 81513, 84050, 96644, 110912, 136079, 138453, 136663, 146724, 153756, 138139, 118327, 96654, 69892, 73510, 77287, 73938, 67997, 90255, 100002, 104810, 119675, 123581, 124315, 134330, 137026, 130121, 122669, 125601, 131084, 149792, 159137, 155646, 164271, 176413, 164286, 164476, 175765, 157088, 150883, 143997, 153471, 152370, 149491, 148387, 150910, 145109, 141096, 135460, 126173, 123713, 120181, 125510, 118077, 113891, 118814, 115467, 113030, 118346, 140990, 154101, 145794, 135990]
14182A35990P112n402K30O164K1350J5786J0554P47l816n534n637r436R46p089
14168A61965O391M820j5065j5049R420K2794R486L148o751j4239N315o635n386
14155A60214K463k402j1473L859L172J5710j925j3268O373K6199R981J0518K788
14142B12209n354q427j6051O040l014r054J784J0407J3791P138J293O297J128
14129B18187j3115r884Q210k904N426J2910n063Q222J3737J5569O536L487J971
14116B63289k93O087p183k279J2603J2599J1367Q194K6200K5076K5197L1150M1097
14103D53104K9980M1002N0831K7626L0106L7674K6414L447j4004k7870l4365l6892
14091E87053l2729l1992l3332k9605k3008q054j7067q968j2938p556n001j0948
$$ y = [135990, 143102, 137700, 137930, 144094, 165444, 181230, 191784, 192531, 188715, 183181, 177544, 168108, 169054, 161965, 168356, 173176, 158111, 143062, 152482, 175276, 184762, 187910, 181159, 166920, 172235, 165600, 160214, 162677, 160275, 148802, 152661, 155833, 171543, 169618, 156350, 162723, 188922, 198903, 209421, 212209, 206855, 198428, 182377, 188417, 185403, 176349, 178133, 188540, 202331, 209469, 210762, 217059, 218187, 205072, 195188, 203398, 200494, 205920, 218830, 213767, 221989, 235726, 251295, 257831, 261318, 263289, 262996, 269083, 261900, 259621, 272224, 284823, 296190, 304384, 330584, 355660, 380857, 412007, 453104, 483084, 524086, 574917, 602543, 632649, 670323, 696737, 700184, 686180, 658310, 623945, 587053, 554324, 522332, 489000, 459395, 436387, 428333, 411266, 402298, 389360, 381804, 376803, 365855]
14079C65855R280j9117r609j1054j9174o644k0801j0583o187l839O615n876q022
14066B60844j3969J2341J8719o477n654J830P224L882j5311J1829J7915J1700
14054C04873j697J928k298k28J1003K3551J8919J3235J9857N49J0469K3015J5206
14041D38382J3195J3572L192r398j2366k6061j9220l60k3000m7309l4651l1824
14029B64152l6593k2796j9634M016K3703K0252J7506L4738K3844J2013J3801K6766
14017C61768J9177K7100L5313K7701K4032L3326L4818K7574N1696L7466N0374
14006G30345M0944J7128K1961N547Q914J7001K6607J6583L192M68O267J1908j613
13993I05252M672J8940K8698J9524L1177M3106M8643N6589K7357O4039Q7668P0720
$$ y = [365855, 375135, 356018, 346409, 335355, 316181, 309537, 288736, 278153, 271966, 268127, 274742, 268866, 260844, 246875, 259216, 277935, 271458, 265804, 267634, 274858, 278740, 263429, 275258, 293173, 304873, 303176, 305104, 302806, 302578, 313581, 337132, 356051, 369286, 389143, 389692, 400161, 423176, 438382, 451577, 465149, 468341, 458943, 446577, 420516, 401296, 400936, 377936, 330627, 295976, 264152, 227559, 204763, 185129, 189145, 212848, 233100, 250606, 285344, 309188, 321201, 335002, 361768, 380945, 408045, 443358, 471059, 495091, 528417, 563235, 590809, 642505, 679971, 730345, 771289, 788417, 810378, 815925, 824839, 841840, 868447, 885030, 888222, 888690, 894957, 906865, 905252, 909924, 928864, 957562, 977086, 1008263, 1051369, 1100012, 1156601, 1183958, 1247997, 1335665, 1406385]
13981A406385Q8413J25634J29184J37403J51856J70373K03405K37195K73436K88473
13971C211757L26500L92200M91300N85831P37490R27225J152346J395511J592425
13962A0812585J713723J723978J596898J341949R66368N63012J46101k67166o64265
13953A7933183j030961j356556j580721j691716j658298j501915j260430r99146
13945F853440q02221o24796m86700l95538l41648k64190k46198k18235j75624
13936C298290j56724j35610j00898o5747n3726n7904l4905m4723l2988k586J3922
13925B626401j751J4660J7115K0399L2697M4937K7139K5664N7414P4957P1381
13914C011013O8753P7284O4029P9388Q7017R1852J00143J20089J25976J37869
$$ y = [1406385, 1494798, 1620432, 1749616, 1887019, 2038875, 2209248, 2412653, 2649848, 2923284, 3211757, 3538257, 3930457, 4421757, 5007588, 5745078, 6672303, 7824649, 9220160, 10812585, 12526308, 14250286, 15847184, 17189133, 18155501, 18718513, 18864614, 18597448, 17933183, 16902222, 15545666, 13964945, 12273229, 10614931, 9113016, 7852586, 6853440, 6051219, 5426423, 4939723, 4544185, 4202537, 3938347, 3692149, 3473914, 3298290, 3141566, 3005956, 2905058, 2839311, 2785585, 2727681, 2692776, 2648053, 2615065, 2612479, 2626401, 2624650, 2639310, 2656425, 2676824, 2709521, 2754458, 2781597, 2807261, 2864675, 2939632, 3011013, 3079766, 3157050, 3221079, 3300467, 3387484, 3479336, 3579479, 3699568, 3825544, 3963413]
13904C963413J39633J42419J60045J63976J75220J85872K08765K23190K29863
13895E592396K41284K45694K54786K56309K86047K97655L09959L31774L71118
13886H187022M07267M58755M89506N22784N79492O38509O97879P48490Q15451
13877A3545155Q93546R63417J058952J162542J263658J418283J565902J752197
13869B3623652J967692K225971K507195K820215L165753L573762M028440M537821
13861D8450501N149760N866072O739294P813832R172097J0907819J3089567J5871842
13853A23060784J9318751K3432632K8063669L2781147L6805652L9141406L8764648
13846C41368689L4837766K7046746J5870228K567869j1091638k3233539l2226352
$$ y = [3963413, 4103046, 4245465, 4405510, 4569486, 4744706, 4930578, 5139343, 5362533, 5592396, 5833680, 6079374, 6334160, 6590469, 6876516, 7174171, 7484130, 7815904, 8187022, 8594289, 9053044, 9542550, 10065334, 10644826, 11283335, 11981214, 12729704, 13545155, 14438701, 15402118, 16461070, 17623612, 18887270, 20305553, 21871455, 23623652, 25591344, 27817315, 30324510, 33144725, 36310478, 39884240, 43912680, 48450501, 53600261, 59466333, 66205627, 74019459, 83191556, 94099375, 107188942, 123060784, 142379535, 165812167, 193875836, 226656983, 263462635, 302604041, 341368689, 376206455, 403253201, 419123429, 421691298, 410599660, 387366121, 355139769]
13839C55139769l7259662l8409080l6467198l2633378k8051946k3553548j9596657
13832A39168300j6274941j3623479j1508351r834495q506784p442665o560730
13825F5416855n796962n146661m582573m093781l647328l252946k892354k586038
13817C3418212k308092k060263j837847j660928j467761j305878j197556j087216
13809B0492671r97317r11680q27941p76765p24318o80756o33337n78772n43415
13800A3818370n25150m82432m64182m43876m21307m21041m15631l97542l84664
13791I862545l87779l70137l62366l54844l40983l03483l04966k82247k46965
13782F908775k40263k37098k36798k15136k17604k00244j90601j80876j86240
$$ y = [355139769, 317880107, 279471027, 243003829, 210370451, 182318505, 158764957, 139168300, 122893359, 109269880, 97761529, 87927034, 79420250, 71977585, 65416855, 59619893, 54473232, 49890659, 45796878, 42149550, 38896604, 36004250, 33418212, 31110120, 29049857, 27212010, 25551082, 24083321, 22777443, 21579887, 20492671, 19495354, 18583674, 17755733, 16978968, 16254650, 15573894, 14940557, 14361785, 13818370, 13293220, 12810788, 12346606, 11902730, 11481423, 11060382, 10644751, 10247209, 9862545, 9474766, 9104629, 8742263, 8387419, 8046436, 7742953, 7437987, 7155740, 6908775, 6668512, 6431414, 6194616, 5979480, 5761876, 5561632, 5371031, 5190155, 5003915]
13773E003915j62926j67597j62479j42668j37807j37156j35459j16431j19489
13764C721903j19974j18169j11310j15371r6384j00241q4415p8116q6081j04008
13754B707834q9183p9510p5263p3576o1065n3320p3683q5594o6820o0477n2649
13743A936694l7637n2980m3885m1839m1856j9032l9942o1635l2755j2509k5276
13732A527348k1125k5249k7559j3210j682n171l612L055J2256P997J0039L904
13720A466991J0677J3128J1938J7216o148l1772m4089m7408n4295n0870n3574
13709A231794n2401o0893o2766m0512k3512l8894m9564k7176l1532l0517o275
13698H07752j8073k9144n332K607q721j5704j7830j0812m2289m5949k1981j8424
$$ y = [5003915, 4840989, 4673392, 4510913, 4368245, 4230438, 4093282, 3957823, 3841392, 3721903, 3601929, 3483760, 3372450, 3257079, 3160695, 3060454, 2976039, 2897923, 2811842, 2707834, 2618651, 2539141, 2463878, 2390302, 2329237, 2275917, 2202234, 2116640, 2049820, 1989343, 1936694, 1899057, 1846077, 1802192, 1760353, 1718497, 1699465, 1659523, 1597888, 1565133, 1552624, 1527348, 1506223, 1480974, 1453415, 1440205, 1438523, 1433352, 1429740, 1432795, 1445051, 1453048, 1463087, 1466991, 1477668, 1490796, 1502734, 1519950, 1513802, 1482030, 1437941, 1390533, 1336238, 1285368, 1231794, 1179393, 1118500, 1055734, 1015222, 991710, 952816, 903252, 876076, 844544, 814027, 807752, 789679, 760535, 755203, 757810, 749089, 733385, 715555, 704743, 662454, 616505, 594524, 576100]
13686E76100j8880j4208j8367n301n692m628R3N249l542K416p981R306O928J162
13672E22655j4329p650J3941R964K217j056L35J6302J3122J8585m10k5040j0976
13659E37660k0846j9774j6685j4106k1281l965j7021j7998k1095l7316n0940n2495
13647B44138l7854j6006p028l110n571Kn35P933J8029k143k88q764j2992q059
13633A67752n75J7246K0515J4964L2345K3587J6128L5864J7845N492J6869k5537
13621C42495k8753j1524j370L4036O5337P4882Q7503M7654R161l6147q8663r0400
13609D04211r4480r2516o3644m1888j7324o74O1R265Q887m073m940j2137p613
13596H3135p853n542p540n858J279K007O898N284q934r408R952R5l749l756J561
$$ y = [576100, 557220, 543012, 524645, 519344, 513652, 509024, 509117, 514366, 510824, 513240, 505259, 514565, 521493, 522655, 508326, 500676, 514617, 524581, 526798, 525742, 526077, 542379, 555501, 574086, 573676, 548636, 537660, 516814, 497040, 480355, 466249, 444968, 441003, 423982, 405984, 384889, 347573, 296633, 244138, 206284, 190278, 183250, 180140, 174569, 174571, 174036, 181969, 199998, 197855, 197567, 188803, 175811, 167752, 167177, 184423, 204938, 219902, 252247, 275834, 291962, 327826, 345671, 351163, 368032, 342495, 313742, 302218, 300848, 334884, 400221, 475103, 562606, 610260, 619421, 583274, 494611, 404211, 309731, 217215, 153571, 111683, 94359, 93685, 93746, 103011, 111898, 107825, 102885, 90748, 83135, 75282, 69740, 62200, 56342, 57621, 59628, 66526, 71810, 62876, 53468, 63420, 63515, 59766, 56010, 57571]
13581E7571o352j1164N384R411o507j1601j0696M665M884K129l550k751o571k4188
13567F64l648J863l933J2843j006M38k993q367j653n216k368j2004k662j2234
13553d0276j0717J0950Q84M6J0880j9558j214L567q87K336k308j305l81J4969
13539c3014K3490P649K623k488K0441K9804j818O421j883j5404J29k629n413j1206
13525A6702j329M336j443M613j671O390j094o209K008R021l433r183j810p156
13511I742j190J1337n248J5185J4042J0347J1583J5489J1127Q299N477L847j21
13498A09916k533o694o272l469o393j0451k004r58j4577J1014j69j599n588m046
13484E6177j4620k735q201j3774j5672j9130k6705Q819J3177j3361j3840J850
$$ y = [57571, 51219, 40055, 45439, 54850, 48343, 36742, 26046, 30711, 35595, 37724, 34174, 31423, 24852, 664, -2984, -1121, -5054, 7789, 6783, 7221, 4228, -4139, -5792, -11008, -13376, -25380, -28042, -40276, -50993, -40043, -39159, -39113, -28233, -47791, -49005, -45438, -46325, -43989, -46297, -47602, -47983, -33014, -9524, -1875, 748, -1740, 18701, 48505, 46687, 53108, 51225, 35821, 35950, 33321, 27908, 16702, 15373, 19709, 18266, 22879, 21208, 27598, 26504, 20295, 22303, 31324, 27891, 18708, 16898, 9742, 8552, 19889, 14641, 29826, 43868, 54215, 65798, 81287, 92414, 100713, 106190, 110037, 109916, 107383, 100689, 94417, 90948, 84555, 74104, 72100, 71142, 56565, 67579, 67410, 65811, 60223, 56177, 41557, 38822, 30621, 16847, 1175, -17955, -44660, -35841, -22664, -36025, -49865, -48015]
13472d8015K0732J4772L228N732l794o924m334l271P04J0682J3207j235l528L461
13458A417R13k888Q662J6672J4765P688M942M342P406N330n029q508j9056m807
13444C1849r237j0469n369n439J3230J4836Q7k612n276J0658K985M490N752k42
13430D5243n663Q078r25o058N444M298p157p156o856J1836J7209p224j1200Q042
13416D7911q961O176J0353J4186J7635J5839L469l106J7275K0478K5650J6292
13404A83197J6780N145k44J4310L7785L9524L5796M0566L0255O6067O8604P8333
13392F16118J11100J12750J47038J77711J88544J96685K11759J97833J54499R6597
13382B210634L9345m5340j36064j82025k07452j98296j82150j63192j51204j39902
$$ y = [-48015, -27283, -12511, -9283, -3551, -7345, -14269, -18603, -21874, -21170, -10488, 2719, 1484, -2044, 1417, 2330, -558, 8104, 24776, 39541, 47229, 52171, 56513, 63919, 69249, 64220, 55712, 36656, 31849, 22612, 12143, 6774, 1335, 14565, 29401, 29488, 26876, 21600, 32258, 35243, 39733, 45485, 45243, 39580, 47658, 46733, 40675, 46119, 50417, 43260, 36104, 29248, 41084, 58293, 51069, 39869, 47911, 38950, 45126, 55479, 69665, 87300, 103139, 106608, 103502, 120777, 141255, 166905, 183197, 199977, 205122, 204878, 219188, 256973, 296497, 332293, 372859, 403114, 469181, 537785, 616118, 727218, 839968, 987006, 1164717, 1353261, 1549946, 1761705, 1959538, 2114037, 2210634, 2249979, 2204639, 2068575, 1886550, 1679098, 1480802, 1298652, 1135460, 984256, 844354]
13372H44354j11306q0676o9870m2533n9068o5030l9790l1880k8855j5908j9257
13361B80181l1651l0922j1137m38k3617r178J647j0989j7801j7961r674q161j1141
13348I9158J190P94j1580j6930o408M518m556p145K459r094n671p282Q269j034
13334D6688N918J2215l339o558l150k827o450P957m746l0067m325J1736P907J3896
13320D4855R659j8550j5427j1422o161K3175N404j2710j0195p447K28M933n589
13307G53j0520K136J4235K195r854J3342N491q151j1701j2055K304n627J356J5322
13293g74J5677Q55p184o864J591l466l047l205j2381l086Q981o600P379L680n564
13278a4008O896K116J3560k934o103j657J7487k482n797L159K321q997j2568l066
$$ y = [844354, 733048, 652372, 582502, 539969, 480901, 415871, 376081, 344201, 315346, 299438, 280181, 248530, 217608, 206471, 206033, 182416, 173238, 174885, 163896, 146095, 128134, 118460, 110299, 99158, 100348, 101142, 89562, 72632, 66224, 70742, 66186, 59041, 61500, 52406, 46735, 39453, 47722, 46688, 52606, 64821, 61482, 54924, 51774, 48947, 42497, 50454, 45708, 15641, 11316, 23052, 30959, 44855, 54514, 35964, 20537, 9115, 2954, 26129, 31533, 18823, 8628, 1181, 1409, 6342, 753, -9767, -7631, 6604, 8799, -1055, 12287, 17778, 9627, -2074, -14129, -11825, -17452, -16096, -774, 14903, 15758, 8574, 1710, 3301, -165, -3212, -6417, -18798, -21884, -12903, -19503, -12124, -8444, -14008, -7112, -4996, 8564, 5630, -473, -2130, 15357, 12875, 7078, 10237, 12558, 3561, -9007, -12073]
13264a2073l586L096J4843O797p256m675O029r52r841k778J0650J0214j1686n822
13250g040r32j99M980n424J2226N674J2214J891j330o951j6444q806n86J0153
13236e74J2664q215P881r42p723j5164j5228K55J467J8038N289j770J768m028
13222f282p176m355m056J3151Q346k737n535j8091p410J1079M745q256j559J6181
13208a1955N482p352k6487k103R222J8448J7265L85m799j5094p449J2581L806
13195h050p30j593j0246L38J849j435L418k030k710J0875k993n262Q324K584K854
13180d807L386n605Q196R796j4556j5377J990J3350J269j2021o673Q389J2731
13167F8L227j5172j2319J017q663J2240J2833L034n744j1347L564O118J205p237
$$ y = [-12073, -15659, -12563, 2280, 9077, 1821, -2854, 3175, 2223, -7618, -10396, 254, 10468, -1218, -7040, -7972, -8171, -3191, -8615, 3611, 9285, 21499, 23390, 22060, 15109, -1335, -10141, -10727, -574, 12090, 3875, 11756, 10814, 3091, -12073, -27301, -27046, -25579, -7541, -2252, -4022, -2254, -6282, -13458, -17813, -21869, -8718, -372, -3109, -8644, -26735, -34145, -23066, -18321, -26577, -28136, -11955, -6473, -13825, -40312, -42415, -33193, -14745, 2520, 2905, -1894, -16988, -24437, -11856, -8050, -8780, -10373, -20619, -20281, -18432, -19867, -16449, -18479, -21189, -10314, -13307, -18569, -10245, -7661, -4807, -1421, -7026, 1170, 10966, -3590, -18967, -16977, -3627, -2358, -14379, -21052, -12663, 68, 3295, -11877, -24196, -23179, -31842, -19602, -6769, -3735, -9479, -20826, -17262, -11144, -9939, -17176]
13153a7176j554Q285j634l051r71n454j972k974M430n323m206k7J2583K106K865
13138a4073J3372N62j0450M265Q31o512k006K546O241k217j2774J417J3600J6240
13124A1042q087j801j493L012j2499j6046J0557N475p157J0456P13p017k233M883
13110a0195k541k56O655R547Q685k23Q050j2559r826k2487n135M791j384J4406
13096a2472Q243j0849m59L199m922o334l716J088J3120L965L192m489O805J290
13082b339R663P214M894q464p673p535m831P551L33j5221N376J0862O985j583
13068E232j655N388q556N112j509l268m706k0947k0446n63J2878J5088J1815P73
13054e364p13J5638K856k031j2708n167M472q073j1107K159J2190j1460m313J117
$$ y = [-17176, -18730, -10445, -12079, -15130, -16101, -21555, -23527, -26501, -22071, -27394, -31600, -31627, -19044, -16938, -14073, -701, -139, -10589, -6324, -5493, -12005, -14011, -11465, -5224, -7441, -20215, -18798, -5198, 11042, 2955, 1154, -339, 2673, -9826, -25872, -15315, -9840, -16997, -6541, -5828, -12845, -15078, -10195, -12736, -12992, -6337, 3210, 11895, 11672, 19722, 7163, -2663, -25150, -30285, -25494, -26878, -12472, -4229, -15078, -15537, -12338, -17260, -23594, -27310, -26222, -13102, -9137, -5945, -10434, -3629, -2339, 7324, 14538, 19432, 10968, 3295, -4240, -9071, -1520, -1187, -16408, -11032, -170, 6815, 5232, 3577, 8965, 409, 5521, 4012, 744, -3962, -24909, -45355, -45918, -33040, -17952, -6137, -5364, -6077, 9561, 12417, 10386, -2322, -7489, -3017, -11090, -22197, -20038, -7848, -19308, -23621, -22504]
13040b2504K578M255J150P083N731R779M149p384q417M49p630M129L898m385o039
13025a3158n055M701p006j1274J0115Q260K0385k044k6q847K062Q273l751q659
13011f024j1673J2075J5355n548p264k809p502j4438L672m957K477L489K163J4549
12997f435N072k13L637J5020J3241J173k3892j0974Q955P096m260j4303N908j665
12983a640q191K4145J0446k466j7566p603j9423k91J3931N785L94N641Jr787n945
12968a2569N523Q463q93l071L408K783q632p149R657O249K638j0545M121M039
12954D022n878N73M607j0054O084J2340J232P937k989j1141R185j0887k4174n870
12940b5013j896J0810J2391j2008j435P515m071J957J0342Q067p248l898j811
$$ y = [-22504, -19926, -15671, -14521, -7438, -1707, 8072, 12221, 4837, -3580, -3131, -10761, -6632, -2734, -7119, -13158, -18213, -13512, -20518, -31792, -21677, -13417, 6968, 4924, 4898, -3949, -1887, 6386, 2635, -6024, -17697, -5622, 9733, 4185, -3079, -5888, -13390, -27828, -24156, -29113, -26636, -23147, -20984, -6435, -1363, -1576, 2061, 17081, 30322, 31495, 7603, -3371, 5584, 12680, 8420, -5883, 25, -1640, -9831, 14314, 24760, 22294, 4728, -2875, -22298, -22589, -8658, -2873, -2479, 3162, 3163, -6624, -12569, -7046, 1417, 524, -2547, 861, 3644, -4988, -12137, -2480, 3769, 6407, -4138, -17, 4022, -1856, -1283, 3324, -6730, -646, 11694, 12926, 20863, 17874, 6733, 15918, 5031, -19143, -25013, -26909, -16099, -3708, -15716, -17151, -9636, -13707, -11750, -1408, 6659, -589, -4487, -6298]
12927f298J6110O830j4271j3137R108n371J842J0019O424r279n016R925O182J4
12913A3082P559K650O818P252J731j8313q24M707p685k5107L283M156J169o266
12899e788J1150l944j3315P248J2449j0489j1685L907K18l229l42p487k0440m839
12885d6586R614p047O599J318O199L263K836J21M904K418j2142J3772J0928p815
12871a1618o747n678O760N82j0223P19J4398lJ3134N893o681j497K646K458l241
12856I02K766M99q284m96Q030k124k56N637l217k259k194M240n157j7350J609
12841a7654O676j1549j1174O377R040J031o42j7405L946J927K559J6155M766J544
12827d403J2071N91j1591L966k237l478j3454j16P88p636o614J358k560Q648K1352
$$ y = [-6298, 9812, 16642, 2371, -10766, -1658, -7029, -5187, 4832, 11256, 1977, -3039, 6886, 13068, 13082, 20641, 23291, 30109, 37361, 39092, 20779, 19955, 24662, 16977, -8130, -4847, -691, 478, -5788, 5362, 1418, -11897, -4649, 7800, -2689, -14374, -10467, -10249, -13478, -13820, -21307, -41747, -46586, -36972, -44019, -37420, -36102, -29903, -26640, -23804, -23683, -18779, -16361, -28503, -14731, -3803, -11618, -18365, -24043, -17283, -16701, -26924, -26205, -11807, -11810, 1324, 7217, 536, -961, 1685, 4143, 902, 3668, 4167, -4117, -4613, 3417, 1293, 1037, 6674, 3457, 1198, -996, 3244, -1913, -19263, -17654, -10978, -22527, -33701, -27324, -18284, -17253, -17895, -35300, -31354, -29427, -26868, -10713, -5947, -4403, 7668, 8259, -3332, 634, -1603, -5081, -18535, -18651, -17863, -25499, -32113, -30755, -33315, -24667, -3315]
12812c315o87J858M778l781r326o212O016K0295n30q664k406r486p447P086K969
12797h852J1197q745j1516N549J0912o795n839r785p458Q065J5931K0249L765
12784A6678q388j1622j5117n884K0907k561j1369j2755q508k986J2581J7497j351
12771a2878mj515J061l878K105J984J086j227O17m23R858j747m652j89L673j3379
12755a9508j5737l591J0273M755j8448j0761J6648J4328l939P158Q793J108L334
12742e587o500j0424o62l390J018J0876J2053j2330k521m306N560N48K659O376
12728f630Q199n516m930p747n725k509l112j584O491J0163M432j5274J0719N149
12714g874O488J5425O822n60q157m330j4017n171N771n766O629K881o075m820
$$ y = [-3315, -4002, -2144, 2634, -1147, -10473, -16685, -10669, 9626, 9096, 432, -1974, -11460, -18907, -11821, -8852, 2345, -6400, -17916, -12367, -1455, -8250, -14089, -23874, -31332, -23267, -7336, 12913, 16678, 8290, -3332, -18449, -24333, -3426, -5987, -17356, -30111, -38619, -41605, -29024, -11527, -12878, -12882, -14397, -13336, -17214, -15109, -13125, -12039, -13266, -12649, -13072, -3214, -4961, -9613, -9802, -6129, -19508, -35245, -38836, -28563, -23808, -42256, -53017, -36369, -22041, -25980, -18822, -10029, -8921, -5587, -12087, -22511, -23173, -26563, -25545, -14669, -2616, -14946, -17467, -21773, -16213, -15665, -13006, -6630, 1569, -3947, -8877, -16624, -22349, -24858, -27970, -29554, -23063, -12900, -8468, -23742, -13023, -7874, -1386, 14039, 20861, 20301, 12144, 7814, -6203, -11374, -5603, -11369, -4740, -1859, -7934, -12754]
12700a2754k344P268J9257j527k251n75p709k175o224L927J3304N427p073l373
12686C178n237n750j4497K446J7581O491O898q112K317Q207k3348J652o80j0465
12672a9319k091J9941N588j0317p351k671P782J3433O083r481j4092o256j0468
12659b9219M793K800N48l260P151Q411q766n404k774j731J4370Q010n757K639
12645h189j2836m08J1012J1284j5067k0873k370J0318J7333J1243j4713l161O622
12632i805Q814j1521o205l380J7282j3318j049J1743J0747j3700q729J924J099
12619a6098Q447J4820M662j3582J0039M221j6270l479J3547J6727Jm773r908k2913
12605a4559m672J5584J1418q634j2529K764R267J3594m151p520J6153j5893n122
$$ y = [-12754, -15098, -7830, 11427, 9900, 7649, 7074, -635, -2810, -9034, -5107, 8197, 13624, 6551, 3178, -2059, -7809, -22306, -19860, -2279, 4212, 11110, 2998, 5315, 13522, -9826, -8174, -8854, -19319, -21410, -1469, 4119, -6198, -13549, -16220, -8438, 4995, 11078, 1597, -12495, -18751, -29219, -24426, -21626, -21078, -24338, -17187, -8776, -17542, -22946, -25720, -27451, -13081, -5071, -10828, -8189, -21025, -21433, -10421, 863, -14204, -35077, -37447, -27129, -9796, 1447, -13266, -16427, -9805, -991, -12512, -18717, -22097, -4815, -18133, -19182, -7439, 3308, -10392, -19121, -17197, -16098, -7651, 7169, 11831, -1751, 8288, 12509, -3761, -7240, 6307, 23034, 23035, 18262, 8354, -14559, -19231, -3647, 7771, -863, -13392, -10628, -1361, 12233, 8082, 562, 16715, 822, -4300]
12592d300M055q521K533k23M950j0154K627k302Q353J6085k587j8554r94r479
12578a8511N003P371K370K152K580N325M018J4j554m11J0818N963L890q172o229
12563A4627l073j0904o568L062r78P665o869p636l474J598m55q207R474q885l824
12548b4447O101J6644K1592J7j4606j1764P729R286j9695N163n319j0892j4117
12535c4308n768N365J2215O968o836p956J0479J5262J2405N634N867O46j0034
12522I939J805j976q829o278l458j3524R09J1994J6701J756j0604K044P775J3414
12508B1668j1622j1216Q830J6314N112N673J255j4468j4397n350j0973J2536J360
12495D722J7899r646k1081O890P925m091M605l351N937m852j407n436q818J2805
$$ y = [-4300, -245, -8766, -6233, -6456, -1506, -11660, -9033, -11335, -2982, 13103, 10516, -8038, -9032, -18511, -13508, -6137, -3767, -1615, 965, 6290, 10308, 10322, 8768, 8357, 19175, 25138, 29028, 20856, 14627, 11554, 650, -5918, -2856, -3834, 3831, -3038, -10674, -14148, -12550, -13005, -21212, -11738, -20623, -24447, -18346, -1702, 19890, 19907, 5301, -6463, 1266, 10552, -9143, -3980, -9299, -20191, -34308, -40076, -34711, -22496, -15528, -22364, -30320, -19841, -4579, 7826, 13460, 19327, 19973, 9939, 11744, 9768, 939, -5339, -8797, -22321, -21412, -9418, 7283, 9039, -1565, 479, 8254, 21668, 10046, -1170, 7660, 23974, 29086, 34759, 36014, 21546, 7149, 1799, -9174, 3362, 4722, 22621, 12975, -8106, -1216, 6709, 2618, 7223, 3872, 9809, 4957, 3550, -1886, -10704, 2101]
12481B101J2523K101l892n797n638q036n953n406O116Q806O007O224J3860M043
12467B7059J312P577N65j6112j567k883J042m16j1916n082l901R356N294J1514
12453B1842N803J033M391n314l123j5417r446O075n645m166N256O282P809N259
12439B0639l618m821M2J0370J374j1807j353j836Q601R898J1881j570O760O306
12425E0866r814o091p010j3220m415O597k631j367J6939M11j2530k3297j3925
12412a9487P352p364o872J558J7139K054n681l606M157L002o6k91J475M825P083
12397E278J0331O301l437o937n206K0231J3403j6059q30m666q355q658k422n385
12383f411n640l86J5689Q449M438J020l263K474o13M035k887q165p690n393r35
$$ y = [2101, 14624, 16725, 12833, 7036, 1398, -6638, -12591, -17997, -11881, -3075, 2932, 9156, 23016, 27059, 28371, 35948, 36513, 20401, 18834, 15951, 16993, 16577, 4661, -421, -4322, 5034, 10328, 21842, 27645, 28678, 33069, 27755, 24632, 9215, -231, 5844, 199, -3967, 1289, 7571, 15380, 20639, 17021, 12200, 12242, 22612, 23986, 12179, 10826, 8990, 17591, 27489, 39370, 37800, 44560, 50866, 41052, 34961, 27951, 14731, 10316, 16913, 14282, 12915, 29854, 30265, 17735, -5562, -19487, -12135, -19499, -26371, -24813, -7674, -5620, -11301, -14907, -10750, -7748, -7814, -8105, -6630, -1805, 5278, 15609, 21910, 18473, 11536, 6330, 26561, 39964, 23905, 23075, 18409, 10054, 1396, -1026, -6411, -12051, -12437, 3252, 11701, 16139, 17159, 13896, 16370, 15757, 19792, 16905, 8740, 1050, -4343, -5278]
12368e278R116q277J3342K728n589K041o743m258J1662J6337M855M292j1150M491
12354B7569L709R09r552j6503r990J0678J0499k85n002j192q27R893n331R507
12340B4082J2713N203K1539J7581J621r538j3898p798l461j2687J831j488n218
12327C0482j0061l256K3719P365r628Q599q704m470Q157m517o000P096J8995K3253
12313H1030J1759Q550k847n045J2775M834j7383j2451N221J0010R942j4137p502
12300H4756o361j2130L820L6770K9522K2836J7318J5165K879q366k0697l2820
12288A32692k2485l1433r544O538l289M538m930N582O172K246K1365K2408K9518
12275A59378J0928j835M251M841r579o605j4853j9819r384j0593N969Q911q055
$$ y = [-5278, 3838, -4439, 8903, 11631, 6042, 8083, 1340, -2918, 8744, 25081, 29936, 34228, 23078, 27569, 31278, 32187, 22635, 6132, -3858, 6820, 17319, 17034, 12032, 10840, 10013, 19906, 14575, 24082, 36795, 41998, 63537, 81118, 82739, 73201, 59303, 51505, 48044, 35357, 37188, 35700, 30482, 20421, 17165, 40884, 48249, 38621, 47220, 38516, 34046, 42203, 37686, 31686, 38782, 57777, 81030, 92789, 101339, 98492, 93447, 106222, 111056, 93673, 81222, 86443, 96453, 106395, 92258, 84756, 78395, 66265, 70085, 106855, 136377, 159213, 176531, 191696, 194575, 186209, 165512, 132692, 110207, 78774, 69230, 75768, 72479, 77017, 72087, 77669, 83841, 86087, 107452, 129860, 159378, 170306, 168471, 172722, 177563, 167984, 161379, 146526, 126707, 117323, 106730, 112699, 121610, 113555]
12262A13555k540j1386J130j1281j8454K218l58J2676O829J7011K5302O957j1330
12249A30329L34q535k3636o647p100N778k121j4867n225L249m8M347R279o295
12235G8842n339j183n632n84O08k1600j8142n470mJ249k23j3717j0689J726J5203
12220A5045Q933j4746j1834p479o25j007q367J2305J4555J132M093n426p674N147
12206D052l728P46q85m035N074J371K847P914Q191j099J576q257j5520m503R738
12191C482P896N532R063l741l866k843j3345n563q897p838P065J1434L120k9m994
12176c524P540M827j851O102M082o770J3122K3284J0526r640J4299J0475P310
12163G9782P237j9461l78l512r578j1870o732J894Q896k169o685q679L368l585
$$ y = [113555, 111015, 99629, 100759, 89478, 71024, 73242, 72884, 85560, 92389, 109400, 134702, 141659, 130329, 130663, 122128, 98492, 91845, 84745, 90523, 88402, 73535, 68310, 71559, 71511, 75858, 85137, 78842, 73503, 72320, 66688, 66104, 66712, 45112, 26970, 21500, 21496, 22745, 22522, 8805, -1884, -158, 15045, 23978, 9232, -2602, -10081, -10706, -11713, -20080, -7775, 6780, 7912, 12005, 6579, -1095, 4052, 324, 1070, 185, -3850, 1224, 2595, 5442, 13356, 21547, 20448, 22024, 13767, -1753, -6256, 3482, 11378, 16910, 25973, 22232, 18366, 15523, 2178, -3385, -12282, -20120, -13055, -1621, 1499, 1470, -3524, 4016, 8843, 6992, 13094, 17176, 10406, 23528, 46812, 57338, 47698, 61997, 72472, 79782, 87019, 67558, 67180, 63668, 54090, 42220, 35488, 37382, 46278, 44109, 37424, 28745, 32113, 28528]
12149B8528J0521Q575p81j6951j5918M466k556l76J2152R886j1158j4607N785
12136A7566Q574J140K2781K0998K618n797K480p613j5794o025p58j96p917k628
12122B9429j8674j5340j967j251K1497K0616R38l87O275O034J3370K1611L2084
12109A14235N416J0782J1148m751k9955k7860j6878j8765j7777K651o970l203
12097A8073L786n705J827J1155J0577m173j8871j0541M829r70O72N046M210J4290
12083C4205O31n919M955J4446j36O401L970l775R812K2812K8026M1191L2630N0593
12069B39842L9809M0164L9573K2291J1432j1655l7246l5894l2681k2687k9975
12058B22973m0306l2827j9562j8256o893r952l604l331j644N110R202j2325j1640
$$ y = [28528, 39049, 47624, 46843, 29892, 13974, 18440, 15884, 15508, 27660, 37546, 26388, 11781, 17566, 26140, 27280, 50061, 71059, 73677, 67880, 70360, 62747, 46953, 40928, 40170, 39974, 32057, 29429, 10755, -4585, -6552, -7803, 13694, 34310, 35248, 34861, 41136, 47170, 60540, 82151, 114235, 119651, 130433, 141581, 136830, 106875, 79015, 62137, 43372, 25595, 28246, 21276, 18073, 21859, 16154, 17981, 29136, 39713, 35540, 16669, 6128, 10957, 9987, 10659, 15705, 19915, 34205, 34836, 28917, 33872, 48318, 48182, 54583, 58553, 54778, 64590, 87402, 115428, 156619, 189249, 239842, 279651, 319815, 359388, 381679, 393111, 381456, 344210, 308316, 275635, 252948, 222973, 182667, 149840, 130278, 112022, 105129, 95177, 91573, 88242, 86598, 91708, 100910, 88585, 76945]
12045G6945N755L660J5561J0115k66n297n656J8635J9020L4084L8061K6416Q254
12032B45287j397j8j2325p642r275k155K7443K9934L3244L6854M1414J7694J063
12019D00121j8956j8631m9087n2988n1272m4892l3593k0497p746j1585m799j0378
12007G5697r007j1276n0R000M961R68J4213K8699P672J504m199n516j9135k2168
11993G1363j6653L643j036j1902j4198N040J216K439j4107N391J6563J0777R223
11980F7759L4834M2177K0694J06n589j6165k4744k4642k3492k8051j3079j3801
11968A6007J694O90p596M136n994q749K31J398P928o534j1419N932M385j95N182
11953G096m481q580j319j5569r286P921K3720J1513J535q752J394M943j3453j1498
$$ y = [76945, 82700, 86360, 101921, 112036, 111770, 106473, 100817, 119452, 138472, 172556, 210617, 237033, 245287, 243890, 243872, 231547, 223905, 214630, 212475, 239918, 269852, 303096, 339950, 381364, 399058, 400121, 381165, 362534, 313447, 260459, 209187, 164295, 130702, 110205, 102459, 90874, 86075, 75697, 66690, 55414, 55364, 64364, 69325, 70293, 84506, 113205, 120877, 122381, 118182, 112666, 93531, 71363, 54710, 58353, 57317, 45415, 31217, 36257, 37473, 39912, 25805, 31196, 47759, 58536, 67759, 102593, 144770, 165464, 165570, 159981, 143816, 119072, 94430, 70938, 42887, 29808, 16007, 17701, 18391, 10795, 14931, 8937, 188, 419, 1817, 9745, 3211, -8208, -2276, 2109, 1914, 7096, 2615, -5965, -7284, -22853, -32139, -24218, -498, 11015, 12550, 3798, 5192, 10135, -3318, -14816]
11939a4816R901Q381K843O519P462q731q402j2195l335k887J725N58J1723M119
11925B865l747L867L129K0163j7708j6131m289J5715On695k021K975J530J316
11911A975k441J476m031O231j175N684K330l524M999J3399j172K734R07j0464
11897A6928j3490o127Q145q328k5545n267J1269j332q866O282J2385N731k074
11884a0289P03q989L934J2420K1698j544j3588j0473k873k013J1855P249j551
11871F539j3268j1250Q357m714q383J1302K736m578M378N351p555M11o406M897
11857a2183R318J948r00J2811q087o094r738k093N562L817M656l173m377J286
11843g247o403m709N748R378l15J4348j1230j703Q127P829J5528J302m86p111
$$ y = [-14816, -4915, 3466, 6309, 12828, 20290, 11559, 3157, -9038, -12373, -15260, -13535, -12977, -1254, 2865, -882, 2985, 6114, 26277, 8569, -7562, -11851, 3864, 3870, -1825, -3846, -871, 659, 1975, -466, 1010, -3021, 3210, 2035, 7719, 10049, 6525, 11524, 24923, 23751, 26485, 27392, 16928, 3438, -2689, 5456, -2872, -28417, -33684, -22415, -23747, -32613, -26331, -13946, -8215, -10289, -9586, -18575, -14641, -2221, 19477, 17933, 4345, -6128, -9001, -11014, 841, 8090, 6539, -6729, -17979, -9622, -14336, -22719, -11417, -8681, -13259, -8881, -3530, -11085, -10674, -17080, -12183, -2865, -917, -1817, 10994, 2907, -3187, -12925, -15018, -9456, -5639, -983, -4156, -8533, -7247, -13650, -18359, -12611, -3233, -3548, 10800, -430, -2133, 5994, 13823, 29351, 30653, 30167, 23056]
11829B3056J27o067N402j3627q950k120J282j295K120R215M068n516j0400M735
11815B030J6334p057r560j3929o803J2065Q135o878j2451r840n440P174n708j802
11801c3730M96J1276O796P137r966K74R845q632R982l188m248J295M71N961O374
11786A43j1537J048R883L154N744M404O59j101J775k4070L809J5431j068k88K914
11771A0900r730q396N891n301M212Q103k948n819M79J3046M675m911o889j189
11757B123r394J661P734r283j3168L957P009L442M197J0654j4476j0190L090J176
11743a1468P074J4086p32J767o431P6p737r878j370P936n276Q529J9434N259j7240
11728D029r093K309k46k228M310J297O085q468o157K496J5Q205q192l238P346
$$ y = [23056, 23183, 17116, 22518, 8891, -59, -2179, -897, -2192, -72, 9143, 13211, 7695, -2705, 2030, 18364, 11307, 1747, -12182, -18985, -6920, 1215, -5663, -18114, -27954, -33394, -26220, -31928, -33730, -33234, -21958, -15162, -8025, -17991, -17717, -7872, -16504, -6522, -9710, -13958, -12663, -12192, -6231, 143, -11394, -10346, -463, 2691, 8435, 12839, 13498, 12397, 14172, -9898, -6089, 9342, 8274, 7986, 10900, 1170, -7226, -1335, -6636, -2424, 5679, 2731, -3088, -2609, 10437, 15112, 10201, 3312, 2123, -7271, -5610, 2124, -7159, -20327, -16370, -9361, -5919, -1722, 8932, -5544, -15734, -12644, -11468, -4394, 9692, 8960, 10727, 4296, 4372, -3365, -13243, -14613, -6677, -11953, -3424, 16010, 21269, 4029, -5064, -2755, -3001, -5229, -919, 378, 6463, -2005, -8162, -5666, -5651, 2554, -5638, -8876, -1530]
11713a530l208o358O732Q586p95j6840K107n367m374J1768J7360J6556n821j4544
11699D272j0673j163O631J2895j6114o910R628Q405n261k1267p519P244Q468r7
11685a1461J1565o065m948L445Q946l793J211P286J0065j972k967j2530k59o859
11671h336o315J6614J8212k493j355k8699n20P170l415k62O536P529J2156K610
11657A9432n129q886j1677n134J4543M394j492L171L374K487j1506Q124P305j2853
11643F153j0266k001l77K548k302K762K657r289r506N08J5370Q785J838L028N049
11628A4957l404j3872k0193J677K0092P908p19O239j7254n736J3511O980P931
11615A8117J690l477k0595L091J4923m15q178M071N101K908K259m414m35j53Q323
$$ y = [-1530, -4738, -11096, -4364, 4222, 3427, -13413, -11306, -16673, -21047, -9279, 8081, 24637, 18816, 4272, -6401, -7564, -933, 11962, -4152, -11062, -1434, 6971, 1710, -19557, -27076, -19832, -11364, -11461, 104, -5961, -10909, -7464, 1482, -2311, -1100, 6186, 16251, 14279, 11312, -1218, -1477, -8336, -14651, 1963, 20175, 17682, 16327, -12372, -12892, -5722, -9137, -9399, -2863, 4666, 16822, 19432, 14303, 5417, -6260, -11394, 3149, 7543, 6051, 9222, 12596, 15083, 3577, 11701, 19006, 6153, -4113, -6114, -6491, -3943, -6245, -3483, -826, -10115, -19621, -19113, -3743, 5042, 6880, 9908, 14957, 11553, -2319, -22512, -20835, -743, 7165, 6446, 12685, -4569, -10305, 3206, 10186, 18117, 19807, 16330, -4265, -1174, 13749, 13334, 5156, 9227, 14328, 17236, 19495, 15081, 14646, 14493, 22816]
11600B2816n551r001O354J005p467M56J0544J3023J1304j0957N38q095o467p316
11586A1186j2438L915J9164R965o456k942j2025j6892N63J4742J943P098N00q916
11572I407l942m867j3057n909J3077Q587j989L797M431j3332l820k894l625N358
11558h778J0752O620j2704p981P030Q964J1363n168j7191j0130Q75K0851K390
11545F893J586J650q370N234N15k330j0632P745P026P657J3785L558j8055j7654
11531a392q566N121N588P059m322R04L789K002l173p323k999J874J0002K035o032
11516D567K296J451K844o171J737P623M347q798R220l088n993Q196Q25l824J0263
11501B5495k447p70n592p77r901o805J1455n632q189J3352L885K878q896o714
$$ y = [22816, 17265, 8264, 14618, 15623, 8156, 8612, 19156, 32179, 43483, 32526, 33064, 24969, 18502, 11186, -1252, 2663, 21827, 31792, 25336, 22394, 10369, -6523, -5960, 8782, 10725, 17823, 18323, 9407, 5465, 598, -12459, -18368, -5291, 3296, 1307, 5104, 9535, -3797, -7617, -10511, -14136, -8778, 1974, 8594, -4110, -12091, -5061, 3903, 15266, 10098, -7093, -17223, -16348, 4503, 6893, 8479, 10129, 1759, 6993, 7508, 5178, -5454, 2291, 9317, 16974, 30759, 34317, 16262, -1392, -9958, -4837, 751, 7810, 3488, 4392, 8181, 10183, 7010, -313, -3312, -1438, 8564, 10599, 4567, 6863, 8314, 11158, 4987, 6724, 14347, 18694, 9896, 19116, 16028, 10035, 18231, 19056, 15232, 25495, 23048, 22278, 16686, 15909, 6008, -797, 10658, 5026, -3163, 10189, 14074, 16952, 8056, 1342]
11487A342p890n621P127P144M831J711j2454N199K304M205o871k0402nJ4732K594
11472b054R35N504j377K778j51o659n61N116n599m76O54j970K945k320n719o390
11456a5344k071L905J5065k354o007Q056Q976q936j2592J3103J974k675L039m703
11442e64k715m857r949P597j985O555O114L942k373n643j426J0872J0162j6053
11428c23k244n542p392j751k109J1526J1716J0626J826j3842p329q327J991n193
11414a6367Q103R630J4609M91l639j280K29O545J3756p707j356p59Q77K381K428
11399B7941m683j6539o548M175M184L427q873p92P877P779L10J2063L557j0499
11385B3379m014J5346L690j073n324p30r132l708k129M344r587o201n834J0611
$$ y = [1342, -6548, -12169, -5042, 2102, 6933, 8644, -3810, 1389, 3693, 7898, 1027, -19375, -19380, -4648, -2054, -1119, 4385, 3008, 5786, 5635, -1024, -1585, 3531, -2068, -2544, -1890, -3860, -915, -3235, -8954, -15344, -17415, -13510, 1555, -799, -6806, 1250, 10226, 1290, -11302, 1801, 3775, 1100, 4139, -564, -3279, -8136, -18085, -10488, -12473, -5918, 196, 4138, 1765, -3878, -5304, 5568, 15730, -323, -2567, -8109, -15501, -17252, -19361, -7835, 3881, 14507, 16333, 2491, -4838, -13165, -11174, -16367, -8264, 1366, 15975, 16466, 12827, 11547, 11776, 18321, 32077, 24370, 23014, 22255, 23132, 25513, 27941, 23258, 6719, 171, 4346, 8530, 11957, 3084, 2292, 10169, 17948, 18258, 30321, 33878, 23379, 19365, 34711, 38401, 37328, 32004, 31274, 22142, 18434, 16305, 20649, 11062, 4861, -973, 9638]
11371I638J4733P27Q672N907J1672j2731j1795J507N788n454j6863p77L809J648
11357A6481j1426l924J1528M340J0160J507r850j0041J025P148k181J096P552
11344B3415n916k2430k528J0105J1276j7755j6716L964O661J8296M852O827R451
11331B9502j5975Q728L919r533k678p657p918o230M096k253l539j526J8909J5098
11317B2943P648o558L568j1010O446M876P926j1711j5256P438J0648Q45j5839
11304A1964j1183J1884R476j5733j8179Q599J8193P035M452J0172M029q807j4515
11291A7387L681J205L173J907o269L113J624P784k643k4050J0035J1753j383L751
11277C1068n001o0r283R713J762o132L613p096j7180O344J0858k106j118l406
$$ y = [9638, 24371, 25098, 33770, 39677, 51349, 38618, 26823, 28330, 34118, 28664, 11801, 11024, 14833, 16481, 5055, 1131, 12659, 16999, 27159, 28666, 18816, 8775, 9800, 16948, 14767, 15863, 23415, 17499, -4931, -7459, 2646, 13922, -3833, -20549, -16585, -9924, 8372, 13224, 20051, 29502, 13527, 22255, 26174, 16641, 13963, 6306, -1612, -7842, -3746, -5999, -9538, -11064, 7845, 22943, 30591, 24033, 27601, 16591, 23037, 27913, 35839, 24128, 8872, 16310, 26958, 27803, 11964, 781, 12665, 22141, 6408, -11771, -3172, 15021, 22056, 26508, 36680, 40709, 31902, 17387, 21068, 22273, 25446, 27353, 21084, 24197, 25821, 33605, 30962, 6912, 16947, 28700, 27317, 31068, 26067, 26007, 16724, 26437, 28199, 22067, 25680, 18584, 1404, 7748, 18606, 16500, 15382, 11976]
11263A1976n448k279n572Q923J3252N476L097o744m547r577K948p112r261j4980
11249a9848P543J5931J0934N989j2179J682n76j545p013j7809j728K0282J9951
11236B1614J6005K7292l979M782J4167l36j2191r79j8465j903k648j0518k859
11223B9982k808L898P730J729r587q844m793k636j766M74k515K944J91j0035J1418
11208A5382J4142O22Q721j111J2429N363M280j0534j5636P938M911J73N31n902
11194D1309l482q392p914J133n680P385j750J5812K710j3388j3884q19N047J3383
11180C1470N106L864j1757j5355N776m94O764q810n578K956j272j8321K8M670
11166i53m508k067N913J0475j2875M860m25J2463K9139J1235k2451j6433L341
$$ y = [11976, 6528, 4249, -1323, 7600, 20852, 26328, 29425, 22681, 18134, 8557, 11505, 4393, -4868, -19848, -12305, 3626, 14560, 20549, 8370, 10052, 9476, 7931, 918, -16891, -18619, 1663, 21614, 37619, 64911, 60932, 65714, 79881, 79545, 67354, 66375, 47910, 46007, 43359, 32841, 29982, 27174, 31072, 38802, 40531, 30944, 22100, 17307, 14671, 12905, 13379, 10864, 13808, 13999, 3964, 15382, 29524, 30146, 38867, 37756, 50185, 55548, 59828, 49294, 33658, 41596, 46507, 46680, 47211, 41309, 37827, 29435, 21521, 22654, 16974, 24359, 22609, 38421, 41131, 27743, 13859, 13040, 18087, 31470, 36576, 40440, 28683, 13328, 19104, 18610, 25374, 16564, 10986, 13942, 12670, -5651, -5623, -953, -5461, -7528, -1615, 8860, -4015, 845, 420, 12883, 42022, 53257, 30806, 14373, 17714]
11153A7714J3900O265J2350j0270p631o579p141J228J0142k282r132J1120k97
11140B9387M315l361q867M473J1450L846n3p573l32r313p698N894J3115N549j0462
11125C0370p849p749n096Q873J5598J642J699j1862p056k372l633J6064J1103
11112C9732r189R170m53K31l986k880J818l673l690P144J4488R90K370J260m534
11097D8798J28O424J0970n933J1242M518k923J167n377n92L86j5677r826L526
11083D6831J2662j030k97r867j502o473J147m801l810j087l553k017M907M98q900
11068B2708K656R747q959o982J2901J1128r207k0785j157J2189P602l950m654
11055B3237J4403J0894m916p361K922j581j4605m470K534M006L651J4573J2802
$$ y = [17714, 31614, 37879, 50229, 39959, 32328, 25749, 18608, 19836, 29978, 27696, 18564, 29684, 29387, 33702, 30341, 21474, 25947, 37397, 41243, 41190, 33617, 33285, 23972, 16274, 22168, 35283, 40832, 30370, 22521, 14772, 9676, 18549, 34147, 35789, 37488, 25626, 18570, 16198, 12565, 28629, 39732, 30543, 39713, 39260, 39491, 35505, 32625, 34443, 30770, 27080, 34224, 48712, 49702, 52072, 53332, 48798, 48926, 55350, 66320, 60387, 71629, 76147, 73224, 74391, 69014, 68422, 68808, 53131, 43305, 46831, 59493, 58463, 58166, 48299, 46797, 40324, 41471, 36670, 32860, 31773, 28220, 26203, 31110, 31608, 22708, 25364, 35111, 26152, 19170, 32071, 43199, 33992, 13207, 12050, 24239, 31841, 27891, 23237, 37640, 48534, 43618, 36257, 39179, 37598, 22993, 18523, 21057, 25063, 28714, 43287, 56089]
11042E6089M90m726o696o680J4231R088k478k916j2657q222P836J9386M806l405
11028F4146j113R535K512o7m400r245j0787J153O650R630N970J051j1062l523
11014F0450J6972j4730j4311K0679J2651j2512p213J118j576Q50p256J0450M784
11001G0356N226p350j5503J4908Q711N294L747j2644k2051j5588l494K973Q775
10988D3360R046J9651k660l639q564J71R457K065j3919l816N492K17M211m15j2440
10973D8217j9078O733R816P064n19m915J1208M925j789j1400j5771J092K912N975
10959D4470J0375O921r229M200L384K989P700R798N28J638j6213J947q906P33
10945F0335K37J9529J855K646n23l112j0026J5278M751K507m578K270m832J0633
$$ y = [56089, 56579, 51853, 45157, 38477, 52708, 61796, 59318, 56402, 43745, 35523, 43359, 62745, 67551, 64146, 63033, 72568, 75080, 75013, 70613, 61368, 50581, 51734, 58384, 68014, 73984, 75035, 63973, 60450, 77422, 62692, 48381, 69060, 81711, 69199, 61986, 63104, 61528, 62378, 55122, 65572, 70356, 75582, 68232, 52729, 67637, 76348, 81642, 85389, 72745, 50694, 35106, 31612, 34585, 43360, 52406, 72057, 69397, 65758, 57194, 57365, 66822, 68887, 54968, 51152, 56644, 56861, 61072, 60657, 48217, 29139, 35872, 45688, 52752, 52233, 47318, 58526, 63451, 61662, 50262, 34491, 35583, 38495, 44470, 54845, 61766, 52537, 56737, 60121, 63110, 70810, 80608, 81136, 82774, 66561, 68508, 59602, 60335, 60572, 80101, 81956, 84602, 84079, 80967, 70941, 86219, 90970, 93477, 88899, 91169, 86337, 96970]
10931I6970J0444j1046j434p78o477m483Q712Q706j0208P578K722r090m708l252
10917H3656o494m161k458K065J201P584K098K883r723m601O594J8442k188j3040
10903H1858n15j404J1844q859r337Q439j257J2420n659M903O489J1979L392J049
10889A15342O817K658j169p1L737R48K654q5o896r310m517J152p702J1040J0772
10874A25370N672j0211k027k793k579M096J0656N652L095p890J0903L756J427
10861A45127J2475J0856j7122o960Q010O423L93M790J783o785R709J5093Q27q453
10847A76166m963j3947M664j49Q763J2617R432r502r97J1011K3489r297m580l410
10833A99297L27Q346K0441Q9j2541J4314N399J5330K0621j7801l744J3839o776
$$ y = [96970, 107414, 96368, 94934, 94156, 87679, 83196, 91908, 100614, 90406, 97984, 100706, 91616, 86908, 83656, 77162, 73001, 70543, 72608, 73809, 81393, 83491, 86374, 76651, 72050, 78644, 97086, 94898, 81858, 81343, 79939, 91783, 82924, 73587, 82026, 80769, 93189, 87530, 92433, 98922, 110901, 114293, 115342, 122159, 124817, 123648, 123577, 127314, 128262, 130916, 130831, 123935, 114625, 110108, 111260, 103558, 114598, 125370, 131042, 120831, 118804, 116011, 113432, 117528, 128184, 133836, 136931, 129041, 139944, 143700, 145127, 157602, 168458, 151336, 144376, 152386, 158809, 159202, 163992, 165775, 158990, 168699, 183792, 184619, 176166, 171203, 157256, 161920, 161771, 170534, 183151, 192583, 183081, 182084, 193095, 216584, 207287, 202707, 199297, 199624, 207970, 228411, 228500, 215959, 230273, 235672, 251002, 271623, 253822, 250078, 263917, 257141]
10820B57141J90J3878J5333K0036M514p850k380l307j659J2297K3284o77Q499
10807C39299q011j5234j058J451j3353J135Q753j759j4057l211J0227R010l589
10794C09603m564j0326j5535r549Q01P546K419O309j6500K926J1927K681J4320
10781C02058R584N283L084q174q115J111k30j201j319O076J4272N295J3533j463
10767C39794k5019j681L2736O34k3918j1393J0376R409M262l423K944R519k637
10754C41603N656R857M344K672n889m279N715o983M552L834m390K1577J7498N195
10740D00962j5382O589J2549L11O45j2172O578J8212O165J2825R496J2372Q168
10727D67318J6795J7121J352j6594J9796J6188J4109J2006J7994M879r04P383
$$ y = [257141, 257331, 271209, 286542, 306578, 311092, 303242, 300862, 297555, 295896, 308193, 331477, 330800, 339299, 331288, 316054, 314996, 316447, 303094, 304229, 312982, 311223, 297166, 293955, 304182, 313192, 309603, 305039, 294713, 279178, 269629, 270430, 277976, 280395, 286704, 270204, 273130, 285057, 287738, 302058, 311642, 316925, 320009, 311835, 303720, 304831, 304601, 303400, 302081, 308157, 322429, 327724, 341257, 339794, 314775, 313094, 345830, 346464, 322546, 311153, 321529, 330938, 335200, 331777, 334721, 344240, 341603, 347259, 357116, 361460, 364132, 358243, 353964, 359679, 352696, 357248, 361082, 356692, 378269, 395767, 400962, 385580, 392169, 404718, 405029, 405674, 393502, 400080, 418292, 424457, 437282, 446778, 459150, 467318, 484113, 501234, 502586, 485992, 505788, 521976, 536085, 548091, 566085, 570964, 570060, 577443]
10715E77443J1179J0924R059R962K7302J7796R934K0019J4942J7184K2540J9504
10703G67788P894N438J4408K2702J6812K3425R000J6340J8426K3409K7875J4470
10691I67987J1106J7053L4585K2161N685L5376J8727Q396L6949K0233K0014R778
10679A208050K4086L3321K9573L8662L4061J7737J4425L0580L0109K6827L0171
10668A517602M1114L4967K6211L5525L0269M5023L8809L1959M0202L7170N4187
10657A933038M5381N0217N7210N1224M6281M3389M6730O3193O8569O5540P1176
10646B541948O1292P5575O9952O8187P6062R0480Q6798Q1493P9897R8439J13226
10635C443349R7221J10578J09571J23690J37475J33192J32891J39237J47697J60994
$$ y = [577443, 588622, 599546, 608605, 618567, 645869, 663665, 673599, 693618, 708560, 725744, 748284, 767788, 775682, 781120, 795528, 818230, 835042, 858467, 867467, 883807, 902233, 925642, 953517, 967987, 979093, 996146, 1030731, 1052892, 1058577, 1093953, 1112680, 1121076, 1158025, 1178258, 1198272, 1208050, 1232136, 1265457, 1295030, 1333692, 1367753, 1385490, 1399915, 1430495, 1460604, 1487431, 1517602, 1558716, 1593683, 1619894, 1655419, 1685688, 1730711, 1769520, 1801479, 1841681, 1878851, 1933038, 1978419, 2028636, 2085846, 2137070, 2183351, 2226740, 2273470, 2336663, 2405232, 2470772, 2541948, 2603240, 2678815, 2748767, 2816954, 2893016, 2983496, 3070294, 3151787, 3231684, 3330123, 3443349, 3540570, 3651148, 3760719, 3884409, 4021884, 4155076, 4287967, 4427204, 4574901, 4735895]
10625D735895J71040J71254J64944J79010J94526J98533K03132K11359K31835
10616F461528K44035K70263K90540K83075K86397L11988L35114L48304L63467
10607I194711L72018M19522M29506M39732M84298N04233N33931N48357O00565
10598A3526873O32758O69669P26679P60944Q17572Q70175R29525R98396J052040
10589B0984631J109946J179809J269408J367936J457490J561804J669335J777108
10581C2377467J902309K029787K159516K283049K412055K570033K690898K822720
10573E1247834K943977L059490L111239L152536L174989L134547L055455K910338
10565G5790405K691426K397621K053525J657409J216079P32975K23572k69891
$$ y = [4735895, 4906935, 5078189, 5243133, 5422143, 5616669, 5815202, 6018334, 6229693, 6461528, 6705563, 6975826, 7266366, 7549441, 7835838, 8147826, 8482940, 8831244, 9194711, 9566729, 9986251, 10415757, 10855489, 11339787, 11844020, 12377951, 12926308, 13526873, 14159631, 14829300, 15555979, 16316923, 17134495, 18004670, 18934195, 19932591, 20984631, 22094577, 23274386, 24543794, 25911730, 27369220, 28931024, 30600359, 32377467, 34279776, 36309563, 38469079, 40752128, 43164183, 45734216, 48425114, 51247834, 54191811, 57251301, 60362540, 63515076, 66690065, 69824612, 72880067, 75790405, 78481831, 80879452, 82932977, 84590386, 85806465, 86539440, 86763012, 86493121]
10557H6493121p72226j232294j637742k018517k310204k545715k715998k872321
10549G0388104k948008k972423k934847k873456k813276k738567k643347k507629
10541D7956551k386760k286458k171878k022719j919385j809709j718728j606660
10533C2034254j511398j416823j328571j251920j163483j091937j037998r88153
10525B2243971r27670q86940q37059p70035p36850o96205o60416o20096n97827
10516A5510873n67620n36745m97927m89254m68062m46846m29684m01426l78042
10507A1295267l71377l44671l19827l13684l01313k95392k96955k79977k54215
10498H517856k46098k29318k15698k25617k27848k10611j90402j69292j70932
$$ y = [86493121, 85720895, 84488601, 82850859, 80832342, 78522138, 75976423, 73260425, 70388104, 67440096, 64467673, 61532826, 58659370, 55846094, 53107527, 50464180, 47956551, 45569791, 43283333, 41111455, 39088736, 37169351, 35359642, 33640914, 32034254, 30522856, 29106033, 27777462, 26525542, 25362059, 24270122, 23232124, 22243971, 21316301, 20429361, 19592302, 18822267, 18085417, 17389212, 16728796, 16108700, 15510873, 14943253, 14406508, 13908581, 13419327, 12951265, 12504419, 12074735, 11673309, 11295267, 10923890, 10579219, 10259392, 9945708, 9644395, 9349003, 9052048, 8772071, 8517856, 8271758, 8042440, 7826742, 7601125, 7373277, 7162666, 6972264, 6802972, 6632040]
10489F632040j83322j75628j65118j54558j40584j47937j42426j41007j26479
10480E254981j19807j10688j10364j15600j14430j19596j09907r5437r3173j01508
10470D164471j09024r0953q5205p1580p9278r1676p3966o7058p2726p9970n6731
10459C286304n0470n8885n4392m5896m1164o1798n9466m1287m8616m6227n0557
10448B727546m3516n5375m3700m0068m7042l5367k3894l4379l6587k0621l3229
10437B313768m6892n0657k6228j5710l1768m1678l7344k9333m1649l9547l5036
10426A917926j6706j7071l6284k1117l0263l1240m0174l2636k2059j6320k2917
10415A631139j1057j7460j7790l1411m2037k2641k4045j6599k3567j4066k6135
$$ y = [6632040, 6448718, 6273090, 6107972, 5953414, 5812830, 5664893, 5522467, 5381460, 5254981, 5135174, 5024486, 4914122, 4798522, 4684092, 4564496, 4454589, 4359152, 4265979, 4164471, 4055447, 3964494, 3879289, 3807709, 3728431, 3636755, 3562789, 3495731, 3423005, 3343035, 3286304, 3235834, 3176949, 3122557, 3076661, 3035497, 2973699, 2914233, 2872946, 2824330, 2778103, 2727546, 2684030, 2628655, 2584955, 2544887, 2497845, 2462478, 2438584, 2404205, 2367618, 2346997, 2313768, 2266876, 2216219, 2189991, 2174281, 2142513, 2100835, 2063491, 2034158, 1992509, 1952962, 1917926, 1901220, 1884149, 1847865, 1826748, 1796485, 1765245, 1725071, 1692435, 1670376, 1654056, 1631139, 1620082, 1602622, 1584832, 1553421, 1511384, 1488743, 1464698, 1448099, 1424532, 1410466, 1384331]
10404A384331k3982j2927j6993q574j8150j6423p814j4890j4496j7441k3202j8692
10392A190747j8086j3220j7174k6397k185Q211j1056m396K731j1568k9183k8800
10380A039624K793j3462j4325j2944k0196j2749k6324k0691j4794k1300j5459
10369H70173r115j832o83j2120k8377L172m656p594j3223j0864j3056j5749j0614
10356G45462l043k711j8609p772p580j1851k7774j4746L786L67j0291j6327j0342
10343F18569J698j6348J079J6897j071o716o282j1475k2661j1985J116l892n951
10330E52978Q85o330j8095l649P21J483l189j5367j2918O78N231j0396j2071m815
10316D75146l958q20r46j6981k3185K945K853J8518r211j5682j0042Q377p56j0542
$$ y = [1384331, 1360349, 1347422, 1330429, 1321855, 1303705, 1287282, 1279468, 1264578, 1250082, 1232641, 1209439, 1190747, 1172661, 1159441, 1142267, 1115870, 1113685, 1121896, 1110840, 1106444, 1109175, 1097607, 1068424, 1039624, 1042417, 1028955, 1014630, 1001686, 981490, 968741, 942417, 921726, 906932, 885632, 870173, 861058, 859226, 858543, 846423, 818046, 821218, 816562, 808968, 795745, 784881, 771825, 756076, 745462, 742419, 739708, 721099, 713327, 705747, 693896, 666122, 651376, 655162, 655529, 645238, 628911, 618569, 620267, 603919, 604998, 621895, 620824, 614108, 607826, 596351, 573690, 561705, 562821, 558929, 552978, 553863, 547533, 529438, 525789, 526510, 527993, 524804, 509437, 496519, 497197, 502428, 492032, 479961, 475146, 471188, 470368, 469422, 452441, 429256, 432201, 435054, 453572, 444361, 428679, 418637, 427014, 426258, 415716]
10302D15716j1091o745P611Q47l536j4003j4951j716m451N263O45P076j2199j4484
10288C53982n217Q216R311j7068j6925j0662q793L434J3450j056o809j700m899
10275C15264M273j1870l546q127R151M649q814j517J736l323o831j386O597n611
10261B90645M834l192q816j8237O177N489l924M123j2351o052J6871O437r541
10248B72463Q925p921j1812k115o857N000p852K28J0743R459L170O8J6592R576
10234B99667K867J0259Q918m869n890K3717J4675J00R741Q010L32P703J8618L0465
10220D24313N1554Q4940J29453K10561K49948K87369L32208L99368L23514J59836
10210B653064J03574J14106l2208l09072l75003k74338k50168l30202l12305k21459
$$ y = [415716, 404625, 397880, 405491, 406338, 402802, 388799, 373848, 372132, 367681, 372944, 373589, 380665, 368466, 353982, 348765, 356981, 366292, 349224, 332299, 321637, 312844, 316278, 329728, 328672, 321863, 320163, 315264, 319537, 307667, 304121, 295994, 305145, 309794, 300980, 299463, 301199, 297876, 291045, 289659, 296256, 290645, 295479, 292287, 283471, 265234, 271411, 276900, 272976, 277099, 264748, 258696, 275567, 282004, 272463, 281388, 273467, 261655, 259540, 252683, 257683, 249831, 250059, 260802, 270261, 273431, 273499, 290091, 299667, 302534, 312793, 321711, 316842, 310952, 334669, 349344, 349444, 359185, 367195, 367527, 375230, 393848, 424313, 475867, 560807, 690260, 900821, 1150769, 1438138, 1770346, 2169714, 2493228, 2653064, 2756638, 2870744, 2838536, 2529464, 2154461, 1880123, 1629955, 1299753, 987448, 765989]
10200G65989j24271q1668m8641n0290l6397l7449k3341j3287o675o462j7487j0171
10188C09850j9684j8544j1477j6106j199q057M471q16j5768O516J1895n208k720
10175B33153k139n30j8477l523M45J0250P219l455j031j2960j3223m114k748J661
10161A90528M280J5911j288q665k49L94k37J9229J1539k2661j6563K36L196r7
10147A95553j0192R91P26M666k945P306n450K419j9781p00J5399J195l27j4399
10133A74461q610j0443q903N427J0808m579q077J579J2142Q66m565j2267j3396
10120A34443q79J1860O343n754l901N124R041J4301N796l603j6138J0295m317
10107A62611j1977L656p458N394m65l378M261M771n262m995R075J2121j2489L256
$$ y = [765989, 641718, 560050, 511409, 461119, 424722, 387273, 363932, 350645, 343970, 337508, 320021, 309850, 290166, 271622, 260145, 244039, 242840, 234783, 239254, 238438, 222670, 229186, 241081, 235873, 233153, 231014, 230484, 212007, 208484, 208929, 219179, 226398, 222943, 221912, 208952, 195729, 191615, 188867, 190528, 194808, 210719, 209431, 200766, 200517, 200911, 200674, 219903, 231442, 208781, 192218, 192454, 195650, 195553, 185361, 186352, 187078, 191744, 188799, 196105, 190655, 193074, 173293, 172593, 187992, 189187, 188860, 174461, 165851, 155408, 146505, 151932, 162740, 158161, 150084, 151663, 163805, 164671, 160106, 147839, 134443, 133564, 145424, 151767, 146013, 142112, 147236, 156277, 170578, 176374, 172771, 156633, 166928, 162611, 150634, 154290, 146832, 152226, 151761, 148383, 152644, 157415, 152153, 147158, 156233, 168354, 155865, 159121]
10093A59121J150j0909K217j2868j3777l32J2409M734J88Q414J1341M288J2145
10080A78121O052J6800J2994K84m674m439J41N347n546L64m46j5554j6503j5595
10066A57346r969N815J1307j6909j2449o960M335J5113R50o625p979P048P559
10053A48582K224K452L5O015J567M32j3923o926M675P032K4j0486J927M746m790
10038A43586J1439J0938L994j2144j3939R44n251o214J7610J0742o455j3153n941
10025A36156J0594L484j0705N938J5220m282k003L034N128J2135l924o240o511
10012A58024m265J629J48l819p701J753O741J2324M991j6467o245N70J1158J3732
9998A72573j8022j2301Q924J2606J539q153k090K864q944j1611o101j797K5388
$$ y = [159121, 160271, 149362, 151579, 138711, 124934, 124602, 137011, 141745, 141933, 150347, 161688, 165976, 178121, 184173, 200973, 213967, 214251, 209577, 205138, 205279, 210626, 205080, 205444, 204998, 189444, 172941, 157346, 147377, 153192, 164499, 147590, 135141, 128181, 132516, 147629, 148579, 141954, 133975, 141023, 148582, 150806, 153258, 153293, 159308, 160875, 161307, 147384, 140458, 145133, 152165, 152189, 141703, 143630, 148376, 143586, 155025, 165963, 169957, 157813, 143874, 144818, 139567, 133353, 150963, 161705, 155250, 142097, 136156, 146750, 150234, 139529, 145467, 160687, 156405, 154402, 157436, 162564, 174699, 170775, 164535, 158024, 153759, 155388, 155536, 151717, 144016, 145769, 152510, 164834, 169825, 153358, 147113, 147683, 158841, 172573, 154551, 142250, 151174, 163780, 165319, 157166, 155076, 157940, 148996, 137385, 131284, 129487, 154875]
9985A54875M097o317j11P091J4540l037j2259k784r26j0148N903K306q097J290
9971A46423J3277j833o16k883J0028m296j524l958l468N022R509P64K940j0396
9957A58989j1161L232j0369R816R870r736n853M535J634J3737J1505j9536K335
9944A58998J1516P406j119j2183q147j1233J992N588o388p329o381R14L423J3927
9930A50984j0674l365J2569J3844q153q207P735P338q55n241L809o240j0343O58
9916A43859n352j843L057Q729K337J026l818k945N767q59N205J0861k268j4106
9902A49650j9852J969J4367J8014j1366q481q062r498P44J4779M970l48m86K279
9888A48679k048N989J036n665M047J1104j2662k0793M699O392k082Q213J2698
$$ y = [154875, 158972, 152655, 152544, 159635, 174175, 171138, 158879, 156095, 155169, 145021, 150924, 153230, 145133, 146423, 159700, 157867, 157251, 154368, 164396, 160100, 158576, 154618, 151150, 156172, 165681, 166445, 169385, 158989, 147828, 151060, 140691, 150507, 160377, 150641, 144788, 149323, 150957, 164694, 176199, 156663, 158998, 170514, 177920, 176801, 164618, 156471, 145238, 147230, 152818, 146430, 139101, 132720, 133634, 137057, 150984, 140310, 136945, 149514, 163358, 155205, 146998, 154733, 162071, 161216, 155975, 159784, 153544, 143201, 143859, 138507, 136664, 139721, 148450, 150787, 151813, 147995, 145050, 150817, 149958, 155163, 166024, 163756, 149650, 129798, 131767, 146134, 164148, 152782, 144301, 136239, 126741, 127485, 142264, 147234, 146886, 146400, 148679, 146631, 152620, 153656, 147991, 152038, 163142, 150480, 129687, 134386, 140778, 138696, 146909, 159607]
9875A59607j2220j1418P91R660j456J609O686L695M115o992q820j0771m106K890
9861A33270J580j451P659J783m533K726J0928J41R840j441j2994o431k984p585
9847A30508Q59N935R881L150N68J240q909k0461j458J0040L15K532N209J4480
9833A53889L588L36j3833q695O27N264J4992j710L029j304j0124j0861j5633n070
9819A14495j826R220p39l495M474J6731R333J814J219p237M462j188J985j6054
9805A33194n670P862N105j0700j2643p629J779N707L244N878j216k832r292L124
9791A15911P608J684l339J364O707k440j2553o727m741R270L287j1552k3J161
9777A05617K507j543Q79M789q731q722J3751K724n014o40k39O744n798j076P176
$$ y = [159607, 147387, 135969, 136760, 146420, 144964, 146573, 153259, 156954, 161069, 154077, 145257, 134486, 130380, 133270, 134850, 133399, 141058, 142841, 138308, 141034, 151962, 152103, 161943, 160502, 147508, 141077, 138093, 130508, 131367, 137302, 147183, 150333, 150901, 152141, 143232, 122771, 121313, 131353, 131668, 134200, 139409, 153889, 157477, 157813, 143980, 135285, 135912, 141176, 156168, 154458, 157487, 156183, 146059, 135198, 119565, 114495, 112669, 121889, 121150, 117655, 122129, 138860, 148193, 150007, 151226, 143989, 148451, 147263, 149248, 133194, 127524, 135386, 140491, 129791, 117148, 109519, 111298, 117005, 120249, 126127, 124911, 122079, 112787, 115911, 123519, 125203, 121864, 123228, 129935, 127495, 114942, 108215, 103474, 112744, 116031, 104479, 104456, 105617, 108124, 106581, 107460, 112249, 103518, 94796, 108547, 111271, 106257, 105617, 105378, 112122, 106324, 105248, 112424]
9762A12424j9870j0769p313j5791P275R921R773m355m184K001J9714j1339j6862
9749G0625k30J1687j0426k425P55O329R379p336o415o943m68M915Q72P15l248
9734F7786J93k367j6608J043P813J789Q46K5425J7938o958j3821j0674J8764l061
9720H8108p949J357K435J2095r61r653j9478k894J1649R382P922M437m80k368
9706I3602j9294J071P349j2182k4614o185J2202M211J344l770P635k014j1090
9693D8265J2178l934p421J142K692J1385m161m327n68J131J5227k311j5485k384
9679E1429j39j1362r71j285j4670K878J2682R367P040K652R451M784k889j8496
9665E0471J3847P000N47r638m325M701q302N665m709j2621N809m581n471Q57J9335
$$ y = [112424, 92554, 81785, 74472, 58681, 65956, 75877, 85650, 81295, 77111, 79112, 98826, 87487, 70625, 70395, 82082, 71656, 69231, 69986, 76315, 85694, 78358, 71943, 65000, 64532, 69447, 70319, 71034, 67786, 67979, 65612, 49004, 50047, 57860, 59649, 60495, 85920, 103858, 96900, 83079, 72405, 91169, 88108, 80159, 81516, 83951, 96046, 95085, 85432, 65954, 63060, 74709, 84091, 92013, 96450, 95970, 93602, 74308, 75379, 82728, 70546, 45932, 39747, 51949, 56160, 57504, 53734, 61369, 59355, 48265, 60443, 56509, 49088, 50230, 52922, 64307, 60146, 55819, 55251, 56382, 71609, 69298, 53813, 51429, 51290, 39928, 38957, 37672, 23002, 25880, 38562, 47929, 54969, 57621, 67072, 71856, 68967, 50471, 64318, 71318, 71865, 62227, 57902, 62603, 54301, 59966, 55257, 42636, 48445, 43864, 38393, 39250, 58585]
9650E8585L252r32Q763j0336j1700J0741P548K050o523J145Q613P569J214p618
9636G2371k608M059m523p686j2004R70j99r544k023J3640M084m13Q096j4730k811
9621D6679l520q172Q843L53p751l767j0610N340L71J440K088r30l632L624l799
9606B6557k63J7208J3156l642j8052j0381J5896J6563l882p627j0073M53p380
9593B8533J5060p131o513l161J6676J1404j2587j6847J708j181l416O256K871
9580C1672q548N059J2285K102M437K427o214j0095o924N846K548l114P004j288
9566C7197n539k69Q625J2050Q567j5879q156p251j6573J624J1856p451N65J697
9552B1063O71p478N397J1635J0682q466j3617r537q275J718J715O665K734m099
$$ y = [58585, 61837, 60905, 69668, 59332, 47632, 58373, 65921, 67971, 61448, 62593, 71206, 78775, 79989, 72371, 69763, 73822, 69299, 61613, 49609, 50579, 50380, 40836, 38813, 52453, 56537, 56124, 64220, 49490, 46679, 43159, 34987, 43830, 44183, 36432, 32665, 22055, 27395, 27766, 29206, 31294, 30364, 26732, 30356, 26557, 26294, 43502, 56658, 53016, 34964, 24583, 40479, 57042, 53160, 45533, 35460, 35913, 28533, 43593, 36462, 29949, 26788, 43464, 54868, 42281, 25434, 27142, 25961, 22545, 28801, 31672, 23124, 28183, 40468, 42570, 47007, 49434, 43220, 33125, 26201, 32047, 34595, 31481, 38485, 37197, 31658, 31389, 40014, 52064, 60631, 44752, 36596, 29345, 12772, 14396, 26252, 18801, 19366, 21063, 21734, 14256, 19653, 31288, 41970, 33504, 19887, 10350, 2075, 3793, 5508, 12173, 14907, 10808]
9538A0808l700m593L49L84J0168Q066L078R639j378O970J2730r648p623m927j4600
9523A5723J1492m698k569p290J0310N598n067P004J4615k841k1080r189O876R950
9509B8834L431O632O620J145J475m650j0903j2634o88J1023j126m514o883k375
9495A5387N203k15O903M262L180r12O374R183k780k934j5415O16n949j1729l72
9480A0802M864P768J5183K524j7340r479o295l503Q169L163N03Q113j0639r949
9466C884R866J7330n386o235Q2J609L401p135p14J8688M226K619Q97K976r593
9451C6515l571j3359j0572q834L646j362K294l121K420J1641R5j8580J768J5440
9437A4420J2445k2326j963J0545l442J430q97p305N262M35n269j2425N403Q367
$$ y = [10808, 7108, 2515, 2864, 3248, 13416, 21482, 24560, 34199, 32821, 39791, 52521, 42873, 35250, 30323, 15723, 27215, 22517, 19948, 12658, 22968, 28566, 23499, 30503, 45118, 42277, 21197, 12008, 18884, 28834, 32265, 38897, 45517, 46662, 48137, 43487, 32584, 19950, 19262, 30285, 29159, 24645, 17762, 15387, 20590, 20375, 27278, 31540, 34720, 33808, 40182, 49365, 46585, 43651, 28236, 28852, 22903, 11174, 10802, 15666, 23434, 38617, 41141, 23801, 14322, 8027, 4524, 12693, 15856, 16359, 24472, 13833, 3884, 13750, 31080, 25694, 19459, 19541, 21150, 24551, 17416, 16702, 35390, 39616, 42235, 43132, 46108, 36515, 32944, 19585, 9013, 179, 3825, 2463, 4757, 1636, 4056, 15697, 15792, -2788, -1020, 14420, 26865, 4539, 2576, 13121, 9679, 11109, 10212, 2907, 8169, 8604, 3335, -9090, -3687, 4680]
9423D680n645m744N992j233M427N77j7374P208J4104Q638m228l52K925N553P823
9408B8351l546N634m093j4168j0342o090j2740j393R798R908R764j857n21L981
9394A2686l431q977j5321J0508J5497J7794J504l976n856L844l373j2792J373
9381I480O473p485m888J0967J2849p475q685k085Q912j5391j4329J77R805P777
9367F102L105Q393K846K529j0873n818j814j2592L149L969n635J325l448N878
9353b884J6066J8919l113r194l996K406R798N713q663j3164O220j154q263j2232
9339c541R105m01n837o493Q913N642N734k436j2300q586m082O962Q897N346n799
9324A124K0771J1989O737L805K151L114p888j6709n658m136k147L74j010M752
$$ y = [4680, -965, -5709, 283, -950, 3477, 4054, -13320, -6112, 7992, 16630, 12402, 12050, 14975, 20528, 28351, 24805, 30439, 26346, 12178, 1836, -4254, -16994, -18387, -8589, 1319, 11083, 9226, 8705, 12686, 9255, 278, -15043, -4535, 10962, 28756, 30260, 26284, 20428, 24272, 20899, 8107, 9480, 15953, 8468, 3580, 14547, 27396, 19921, 11236, 9151, 18063, 2672, -11657, -11480, -1675, 6102, 9207, 17600, 20446, 22975, 12102, 6284, 4470, -8122, -4973, -1004, -6639, -5314, -8762, -2884, 13182, 32101, 28988, 19794, 15798, 18204, 28002, 33715, 25052, 11888, 18108, 16954, 8691, -3541, 5564, 5163, -674, -7167, 1746, 7388, 13122, 10686, -1614, -10200, -14282, -7320, 1577, 6923, 1124, 21895, 33884, 40621, 44426, 46577, 49691, 41803, 25094, 19436, 15300, 13153, 13527, 12517, 17269]
9310A7269o64m747M860j2257M674J3479J733N942L205j0737J877O392P932l893
9296C5065m58l023o744N95r736N961J2548q675Q554O784q690q833j589p469J1101
9281B5391J2634q72O554O651k071o615Q848P728O617J2062j362n099r826N932
9267F6572n338k2544l542K795J857K78j2998k489J868K840J4251J1391J4206N741
9253G4888O63k236r073j0700r328o925l289l57j8276J303K823o947j4366J3821
9239A2001L6238N05n794j2568J3095J0443o81N303P769q210l290O879R829J9025
9225I0544J0480L169j252l038n860o334P579J0621K3166K0139J9259J542L950
9212A73965j1544q762J6021J0686O01J0236j4422j0827p275k8195j4768q033J3734
$$ y = [17269, 16605, 11858, 16718, 4461, 9135, 22614, 24347, 30289, 33494, 22757, 24634, 31026, 38958, 35065, 34607, 31584, 24840, 25435, 15699, 21660, 34208, 25533, 34087, 40871, 32181, 23348, 21759, 14290, 25391, 38025, 37153, 43707, 50358, 48287, 41672, 50520, 58248, 64865, 76927, 75565, 70466, 60640, 66572, 61234, 38690, 35148, 37943, 39800, 40078, 27080, 24591, 26459, 29299, 43550, 54941, 69147, 74888, 75551, 73315, 64242, 53542, 44214, 37289, 34000, 33643, 15367, 16670, 19493, 12546, -1820, 12001, 48239, 48744, 42950, 30382, 43477, 53920, 53239, 58542, 66311, 58101, 54811, 61690, 71519, 90544, 101024, 104193, 102941, 99903, 94043, 87709, 95288, 105909, 129075, 149214, 168473, 170015, 173965, 162421, 153659, 169680, 180366, 180967, 191203, 176781, 165954, 158679, 130484, 115716, 107683, 121417]
9199A21417J1378R282L890K1874n830n456K949K0712K0493O275j4473r413R669
9186A92767J4459k1976j5197j0733j205J1492J2654L19o328J530J3187J5998M865
9173B11832J1492p046q890n271j9888k1286n725l596j9343j5473o835n27m353
9160A05091k778O447k371N12K205j6209q047o616j1128J690J0251Q875L15J047
9146H9284L677K039P288R089Q77R675P200Q15M868j0368l5o709J210j0592J3680
9131A21998j341k235k469Q13p125j9739l476n654J945j1321l966R669Q051k1767
9117F3383m512m835j1761J595N1J0214J630J3354K329m342o815M336O405J9013
9103I0045M883R097P449J7549J4132J5695l309q267p82O317k396L671p447p976
$$ y = [121417, 132795, 142077, 145967, 167841, 162011, 156555, 159504, 180216, 200709, 206984, 192511, 183098, 192767, 207226, 185250, 170053, 159320, 158115, 169607, 182261, 182580, 176252, 177782, 190969, 206967, 211832, 223324, 216278, 207388, 202117, 182229, 160943, 155218, 151622, 132279, 116806, 109971, 109444, 105091, 102313, 108760, 106389, 106901, 109106, 92897, 84850, 78234, 67106, 68796, 79047, 87922, 88237, 89284, 92961, 95000, 102288, 111377, 112254, 121929, 129129, 129944, 134812, 124444, 124409, 117700, 118910, 108318, 121998, 120657, 118422, 115953, 116766, 109641, 89902, 86426, 80772, 82717, 71396, 67430, 77099, 85150, 63383, 58871, 54036, 42275, 43870, 43921, 54135, 55765, 69119, 71448, 67106, 60291, 64627, 71032, 90045, 94928, 104025, 111474, 129023, 143155, 158850, 155541, 147274, 146492, 152809, 150413, 154084, 146637, 138661]
9089A38661L097J473k169k0040n495n023j8867p344j037p682K40r784K601Q522
9075G7153r217m026J2598M545p444k1027j221o074Q84J38M248o728P604J2142
9061F3575M931J2640J9511K104J8817J2723Q400Q101M173n37O100J8200K4464
9048B03202J3195r346k1256n291j0608n702p473L546j2668o806k0598j599o92
9035A17904J335q409j3606j0199p135J239o12q709j0247j1335q360K344R049p05
9021E2554Q384K971J0601J1789L366j594P428P604P517O616J755J110N212K299
9007A27612M90K0101K2299J9704J7684N834q530j4075l5698j7784n791K354o38
8994A33562k1615k0365j0609q333Q466K1676N378r497r539j6195j3740o310n480
$$ y = [138661, 141758, 143231, 141062, 121022, 115527, 110504, 91637, 84293, 83256, 75574, 75814, 66030, 68631, 77153, 67936, 63910, 76508, 81053, 73609, 52582, 51361, 45287, 46171, 46309, 50557, 43829, 51433, 63575, 68506, 81146, 100657, 102761, 121578, 134301, 142701, 150802, 154975, 154438, 160538, 178738, 203202, 216397, 207051, 185795, 180504, 169896, 164194, 156721, 160267, 147599, 140793, 120195, 118596, 117904, 119239, 110830, 97224, 87025, 79890, 81129, 80517, 71808, 61561, 50226, 41866, 44210, 53259, 52554, 60938, 63909, 74510, 86299, 89665, 88071, 95499, 103103, 110620, 117236, 118991, 120101, 125313, 127612, 128102, 148203, 170502, 190206, 207890, 213724, 205194, 191119, 155421, 137637, 131846, 134200, 133562, 111947, 91582, 80973, 72640, 81106, 102782, 108160, 98663, 89124, 72929, 59189, 52879, 47399]
8981D7399l267r493j3305o838Q978M036J6800J5727N442J76m057J1458K634L085
8967G8775p430J8302J4143J1212J1365k473j2400l915n815P14M22m601m261j3372
8953H0666j1103k631o620k228n65o970J268J4959M599n634l554N871j7010p909
8939D3139J3634P313k441j1263M705K794p200O301J9049R756K729P03j907j724
8925H5588R364O667m519p114J434N017N529L88M268R30K7210M697J0053K038j028
8910A50522n293J3655J7224j644J0326J4161R772K8366L7730K7010K5645L6152
8898C63626M6172M8319N8208N8076Q9254R3925R6451J05516J33051J30567J28435
8887A351600J77567K41359K91869M64114P62654J312736K198306L258349L951768
$$ y = [47399, 44132, 34639, 21334, 14496, 23474, 27510, 44310, 60037, 65479, 65655, 61598, 73056, 75690, 78775, 71345, 89647, 103790, 115002, 126367, 123894, 111494, 107579, 101764, 102478, 102900, 98299, 94038, 80666, 69563, 66932, 60312, 58084, 57519, 50549, 51817, 66776, 71375, 65741, 62187, 68058, 51048, 43139, 56773, 64086, 61645, 50382, 55087, 57881, 50681, 56982, 76031, 85787, 88516, 89219, 87312, 85588, 94952, 101619, 97100, 89986, 91420, 96437, 101966, 102354, 106622, 107552, 134762, 139459, 149512, 151550, 150522, 145229, 158884, 176108, 174464, 184790, 198951, 208723, 237089, 274819, 301829, 327474, 363626, 409798, 458117, 516325, 574401, 663655, 757580, 854031, 959547, 1092598, 1223165, 1351600, 1529167, 1770526, 2062395, 2526509, 3289163, 4601899, 6800205, 10058554, 14010322]
8878A4010322L565284K508251J626608o63889m363290n219350l704277k244704
8870E514955j362303q62826n64358l78970k69017k00340j65989j39954j43608
8861A427590j54010j36616j22414r3799q6608p7883o5893n7096n4162m2950l3871
8850E02288k3238k8871k4705k7199q939J616p027o275k3954j9948r242j0907j2071
8837C01528q38l210j692k0483j0705j3747r053j4093j9086r298m505r190q537
8824A77091l588J7429J2191j1130j992R740J352k001J1335L575K6546K0488r176
8811B51860o399N661j5061j6428j3659P200k1303k6898n14o75N095J8692J468
8798A89039j1453q575J0471N932J134n692j4927m802Q29j5260j6451L486P173
$$ y = [14010322, 17575606, 20083857, 21710465, 21046576, 16683286, 11463936, 7759659, 5514955, 4152652, 3289826, 2725468, 2346498, 2077481, 1877141, 1711152, 1571198, 1427590, 1273580, 1136964, 1014550, 920751, 834143, 756260, 690367, 633271, 579109, 536159, 502288, 479050, 450179, 425474, 398275, 389336, 390952, 383925, 377650, 353696, 333748, 324506, 313599, 301528, 300690, 297480, 295788, 275305, 264600, 250853, 241800, 227707, 208621, 199323, 194818, 185628, 177091, 173503, 190932, 203123, 191993, 190001, 199741, 201093, 199092, 210427, 214002, 240548, 261036, 251860, 245461, 251122, 236061, 219633, 205974, 213174, 191871, 164973, 164459, 163784, 168879, 187571, 189039, 177586, 169011, 179482, 185414, 186548, 180856, 165929, 161127, 161956, 146696, 130245, 133731, 140904]
8785A40904J6628n733j0487j0731k6962j2702R14J4515J0225R952J6654Q266J8267
8772A69710q605J2228K3335L090j556M17J6341K2415n182j3640j3124J1042O485
8759B22956j0026n685j2516r018N469Q543J5095j000o016k820j0434m939k2151
8746A67458N07n603p535j922J507o88k5620q512O806l964m778m17J324Q280J688
8731A28531o132J4016L599N054M256J366P05L628N440P887Q071J2542M170L381
8717A96514J338O970O444j987j6531j2351n474j1573j581J130n773L27j3025L907
8703A48335J327P346j20q479n019l175j4971n532l112n814q70r889o849M788l42
8688I7624n138j6568j4300O993R778K7758O952j2730m800K894Q544o337J0928
$$ y = [140904, 157532, 151799, 141312, 130581, 103619, 90917, 91831, 106346, 116571, 126523, 143177, 151443, 169710, 161105, 173333, 196668, 199758, 198202, 198619, 214960, 237375, 232193, 218553, 205429, 216471, 222956, 212930, 207245, 194729, 185711, 191180, 199723, 214818, 213818, 207802, 204982, 194548, 189609, 167458, 167965, 162362, 154827, 152905, 154412, 153724, 128104, 119592, 126398, 122434, 117656, 117239, 118563, 126843, 128531, 122399, 136415, 140014, 145068, 149324, 150690, 151395, 155023, 160463, 168350, 176421, 188963, 193133, 196514, 197852, 204822, 211266, 209279, 192748, 180397, 174923, 163350, 161769, 162899, 157126, 157453, 144428, 148335, 149662, 157008, 156888, 148409, 143390, 140215, 125244, 119712, 116600, 110786, 109916, 100027, 93178, 97966, 97624, 92486, 75918, 61618, 68611, 78389, 106147, 113099, 100369, 95569, 98463, 107007, 100670, 111598]
8675A11598J1378m115J2730J1812K049r625j4325L479M682J170l819p554K39J4320
8661A34019O427J236o570k1671p308p408j298l2333K533P161p578o353q32J7627
8647G7652Q944j23l741o201Q7J8011k471J1102J1526M191O113L282M531O198J7546
8632A56647J4107J0910m338j1240l927N510P750K5408K1975M286j3346m246j1479
8619A98017p575N880j676k935j0947o021j0681L47J2859J5223J90L77K929n135
8605A90852Q291J4048p94q326N805j2349j0989j4387j6276k9741j5235r018k955
8592I8926m178n842J505o530j2564r201m47q178k527k723q245r995n531O610Q359
8577C9439N210J3850m889j7206l038o29O129O729J896j3293m000n131O33m887
$$ y = [111598, 122976, 118861, 131591, 143403, 145452, 135827, 121502, 124981, 129663, 130833, 127014, 119460, 119699, 134019, 140446, 141682, 135112, 113441, 106133, 98725, 97427, 65094, 67627, 74788, 67210, 60857, 60025, 77652, 86596, 86473, 82732, 76531, 76618, 94629, 92158, 103260, 114786, 118977, 125090, 128372, 132903, 139101, 156647, 170754, 181664, 177326, 166086, 162159, 167669, 175419, 200827, 222802, 227088, 213742, 209496, 198017, 190442, 196322, 194646, 191711, 180764, 174743, 164062, 164409, 177268, 192491, 192681, 193058, 195987, 190852, 199143, 213191, 212397, 204071, 209876, 197527, 186538, 172151, 155875, 126134, 110899, 101881, 98926, 94748, 88906, 90411, 83881, 71317, 62116, 61669, 53491, 50964, 48241, 39996, 30001, 24470, 31080, 39439, 44649, 58499, 53610, 36404, 33366, 32737, 38866, 45595, 47491, 34198, 30198, 25067, 25700, 20813]
8563B0813n026O02L09n790L69J1659P364J599j29m147q23Q657J6048J0946l075
8548E9376j1351j0844m391l581o164q307p85J1800p988r32J664N226j584j4236
8534G903K315l185J0174J8046Q733R146M580O946K867N863L1366O2494P2099M7190
8520B86537K7278K6745l9491r4813o3171k9206j5682j2531n735j5638j4308O800
8508E6785k949N93j3634k844m820P762J598P156J4064l032r557M456l68n946J2955
8493F2219K211k1605j119L417J0010N188N493K3558N0711N6728N9986N3534M3203
8480C53534K8669m8586p5736l8173l7008k8173j3048j7961k3995j1878J609o476
8468H2778k1041k2001k459J3038l095j6034J772m019n166p875m154o544p513m791
$$ y = [20813, 15787, 16389, 16698, 10908, 11277, 22936, 30300, 31899, 31770, 27623, 26800, 35457, 51505, 62451, 59376, 48025, 37181, 32790, 29209, 23045, 14738, 13953, 25753, 17765, 16833, 18497, 23723, 22139, 7903, 10218, 7033, 17207, 35253, 43986, 53132, 57712, 64658, 67525, 73388, 104754, 167248, 239347, 286537, 313815, 340560, 301069, 206256, 143085, 113879, 98197, 85666, 79931, 64293, 49985, 56785, 53836, 54429, 40795, 37951, 33131, 40893, 42491, 49647, 63711, 60679, 51122, 55578, 55210, 49264, 62219, 64430, 42825, 41706, 45123, 55133, 60321, 65814, 89372, 140083, 196811, 256797, 310331, 353534, 382203, 333617, 257881, 219708, 182700, 154527, 141479, 123518, 99523, 87645, 89254, 82778, 61737, 39736, 37277, 50315, 47220, 31186, 32958, 28939, 23773, 15898, 11744, 5200, -2313, -7104]
8454g104O566K991J3002l610J932N485J4p046L02R508L248j4212r539L620M048
8439I205o175q26J8503J2223q717j0408J0042q111r526n511o38M301k507J3989
8425A5844p087j5450J3541J5505J0406l182j776J445j7258p935q765q623M888
8412h447m406k142N871l829Q503P287p194M266J8584J6137P558m768r501P921
8398C5840N56j7107o251M617j7909k3728J2317J2227J095P621k47p113j9338K221
8384a5199J1845J8702L240J496m940j537Q743k438J43j0458q313J241n102P388
8370D811K048m588o747m576L276N940p546q328M44M295J538N83R946p854n946
8355a2704o404j279K085P577k35J337j723l017R901R927n022m46J5807M91j1766
$$ y = [-7104, -538, 2453, 15455, 11845, 13777, 19262, 19276, 12230, 12532, 22040, 25288, 11076, 1537, 5157, 9205, 3030, 2204, 20707, 32930, 24213, 13805, 23847, 15736, 6210, 699, 61, 4362, 1855, 15844, 8757, -6693, 6848, 22353, 32759, 29577, 27801, 29246, 11988, 4053, -4712, -13335, -8447, -12853, -14995, -9124, -12953, -4450, 2837, -4357, -91, 18493, 34630, 42188, 37420, 27919, 35840, 36396, 19289, 13038, 17655, -254, -23982, -11665, 562, 1657, 9278, 9031, 1918, -17420, -15199, -3354, 15348, 18588, 20084, 15144, 13607, 22350, 19912, 20055, 9597, 1284, 2525, -2577, 4811, 6859, 2271, -4476, -9052, -5776, 164, -7382, -15710, -15266, -10971, -9433, -8850, 1096, -6758, -12704, -19108, -20387, -18302, -10725, -10960, -9623, -11346, -14363, -4462, 5465, 443, -3, 15804, 16295, 4529]
8340D529j861O901p236j7322O184m416o328o512Q516R198J7312P375L357m635
8326A5062l350R981J8898r500K115P38r332j214o451l845j3348k692Q735Q737
8312A4534r508k4973J2208L949m534P211R952o413n315O512K336P890P344P549
8298B8742N56j0990j9102N734J4456o98j0339n732O077N135K728p452j6828L425
8284d288L062J989j47j5998j7386R200K827L448Q96j1088J578J9796L753Q195
8270E837N869j1056k1782L011r654N371J2350J002P114M321L479r361l454n343
8256a2296j021k368K681Q487r28n900O376K0420p556j0380m722K260Q680k671
8242A062j301J0491m62j1797o184o712R79q591n933p335o51K1354J3017o521n52
$$ y = [4529, 2668, 9569, 2333, -14989, -8805, -13221, -19549, -26061, -17545, -8347, 8965, 16340, 19697, 15062, 11712, 21693, 40591, 31091, 33206, 33944, 24612, 23398, 16947, 13102, -246, -2938, 5797, 14534, 5026, -19947, -7739, -3790, -8324, -1113, 8839, 2426, -2889, 3623, 5959, 13849, 21193, 28742, 29298, 18308, -794, 4940, 19396, 18698, 8359, 2627, 8704, 13839, 16567, 9115, -7713, -4288, -1226, 763, 616, -15382, -32768, -23568, -20741, -17293, -16397, -27485, -25907, -6111, -2358, 5837, 11706, 650, -21132, -18121, -27775, -22404, -10054, -9052, -1938, 2383, 5862, -3499, -6953, -12296, -13317, -15685, -13004, -4517, -5445, -11345, -4969, 15451, 7895, -2485, -7207, -4947, 3733, 1062, -239, 10252, 9790, -2007, -8191, -14903, -13924, -22515, -28448, -35783, -36434, -15080, -2063, -8584, -9136]
8227i136Q865P342k910o765K1050p435M559k703q202j4910P660O271r260m856
8213a0430J2606K2112J3758j5230l288j5900n598k902n245q628j320P725n259
8200a7599Q387K7390N359j1235q986o633q626J827r947l038l159Q900J2498q599
8186a3461j2K296J168M037N182o091L408J6523N643J140N107K463j5148j7978
8172e723k250j3612q363l681p81L889O345J573L161J4265j667N801Q508Q98o560
8157A803L569l904o068r447K984L632o699J435M889N349o192l105P420l441P156
8142f19R050L681N661o152j1660p763N383J1870K858N17p424k693K736R460L155
8127A8060R39K516J3166Q928o676j8746N997P170q373K806O347O951K1135K3372
$$ y = [-9136, -271, 7071, 4161, -2604, 18446, 11011, 15570, 12867, 4665, -10245, -2585, 3686, -5574, -10430, 2176, 24288, 38046, 22816, 19528, 3628, -1970, -4872, -10117, -18745, -20065, -12340, -17599, -9212, 18178, 23537, 12302, 3316, -3317, -11943, -10116, -20063, -23101, -26260, -17360, -4862, -13461, -13473, -11177, -10009, -5972, -790, -6881, -3473, 13050, 18693, 19833, 24940, 27403, 12255, -5723, -7973, -21585, -29948, -33629, -34410, -30521, -24176, -22603, -19442, -5177, -6844, -1043, 7465, 8363, 1803, 5372, 1468, -4600, -14047, -11063, -7431, -14130, -12695, -7806, -2457, -8649, -11754, -4334, -7775, -619, 8431, 12112, 17773, 11621, -39, -7802, -2419, 9451, 12309, 12826, 5402, 2709, 5445, 14905, 18060, 18999, 21515, 34681, 43609, 36933, 18187, 24184, 31354, 22981, 25787, 32134, 39085, 60220, 83592]
8113H3592J8677L0119L0823J9825R094q982j2908j8736j5389k58K354M551K0010
8100A62772L8303M9825L7068K3661J4004J8270N576r745o995j4896k1982j9977
8088B75884l6913m3890k6900k2640k2670j5416j3187l8598n011J9845l925p485
8076E9094L193J0314J2966J9063p330j458J0530K1343M4626M0065M7043M6103
8064C05552L6568K1088J0357m0753m1192k7627j9512r200J3732M1069O9886J01374
8052D61342Q1575P3563N6696K1037K425N813j2622k6673j7172m9128q3985q6340
8040D26531q1392o2081m7551k6589k5264M32K9648L130P785M272n395k3593k8259
8027A71674r411q540q157M641J1007Q847j030J2557j618J0814J5213Q438k3867
$$ y = [83592, 102269, 132388, 163211, 183036, 192130, 183148, 170240, 151504, 136115, 135857, 138211, 142762, 162772, 201075, 250900, 287968, 311629, 325633, 343903, 349479, 339734, 332739, 317843, 295861, 275884, 238971, 195081, 168181, 145541, 122871, 107455, 94268, 55670, 50659, 70504, 66579, 59094, 62287, 72601, 85567, 104630, 97300, 95842, 106372, 127715, 172341, 212406, 259449, 305552, 342120, 363208, 373565, 332812, 291620, 263993, 244481, 235281, 249013, 290082, 359968, 461342, 542917, 616480, 673176, 694213, 696638, 702451, 689829, 663156, 645984, 596856, 512871, 426531, 345139, 283058, 235507, 208918, 183654, 184086, 213734, 216864, 224649, 228921, 223526, 199933, 171674, 162263, 153723, 145566, 150207, 161214, 170061, 169031, 181588, 179970, 190784, 205997, 214435, 190568]
8014A90568j3869O673n297J1493J5290K1368K7165K3575K2747K3062L5546K1304
8002C79625P96O260O039j989j8626k9012m5901n4806k9999k3084k0704j7692l537
7989A47370m899q882j0704k0927j3910k949q748m191J124K235p644l723o213r821
7975D8118J6057J1434j5244m472J2478l944r93Q688K046O70O093K601o313o13
7961G6606m250q920L117J6674N985q979q70n274j5899q78j1535l15J5693R87j3936
7946D8206k1158r037P912k211r749j6862J801J2715J7460O572j6034N496p482
7933A7629p933m103L528Q067N129K768p557j0008J5288j736l689k166l969j0061
7919A187L525O480N818N878j6731K024J4737Q714p462j2621k842l709J3309L548
$$ y = [190568, 176699, 183372, 178075, 189568, 204858, 226226, 253391, 276966, 299713, 322775, 358321, 379625, 380421, 386681, 392720, 390731, 372105, 343093, 297192, 242386, 212387, 189303, 168599, 150907, 147370, 142471, 133589, 122885, 101958, 88048, 85099, 76351, 72160, 73284, 75519, 67875, 64152, 57939, 48118, 64175, 75609, 60365, 55893, 68371, 64427, 63434, 72122, 74168, 74838, 80931, 83532, 77219, 76606, 72356, 63436, 66553, 83227, 89212, 80233, 79363, 74089, 58190, 57312, 45777, 45462, 61155, 62142, 48206, 27048, 18011, 25923, 23712, 13963, -2899, -1098, 11617, 29077, 35649, 19615, 25111, 17629, 9696, 5593, 9121, 17188, 22317, 25085, 17528, 7520, 22808, 21072, 17383, 15217, 11248, 1187, 4712, 11192, 17010, 22888, 6157, 8181, 22918, 31632, 24170, 11549, 8707, 4998, 18307, 21855]
7905B1855o905p086K882Q065J587m800k1596k500L315p10L611N508O482P197P177
7890B4082k448p855n628O63k007O031k472j0790m466L58L460J1000k438JR354
7875A6845N072j1498j320j3359j0705k101J198R467o889q158n497R525J7540j272
7861a152J879K049J126L487k719j628q433J277l550j1432K879J5522R970m663
7847D612k187o340p895P74o130O451J6848M793K314j0455j1304j2785Q735l186
7833a5755J321J88M902r81N986m962q865L576J1511O505r860m501k357k203j2065
7818b7560l012j2650o280J1280J1528J5021J2551p26j2850j5810n128J2271J2703
7805h662l129j5868J865K0716Q019K174j0926j2673J6198J8551n344r822j3316
$$ y = [21855, 14950, 7864, 10746, 18811, 20398, 15598, -5998, -8498, -5183, -5893, -2282, 3226, 9708, 16905, 24082, 21634, 13779, 8151, 8814, 6807, 12838, 10366, -424, -4890, -4532, -1072, 9928, 7490, 7491, 16845, 21917, 10419, 9099, -4260, -14965, -17066, -15868, -6401, -13290, -21448, -26945, -17420, 120, -1152, 727, 2776, 3902, 7389, 4670, 3042, -5391, -4114, -7664, -19096, -16217, -695, 9275, 4612, 2425, -3915, -11810, -11036, -17166, -10715, 6133, 10926, 13240, 2785, -8519, -21304, -12569, -15755, -14434, -14246, -9344, -10325, -4339, -9301, -18166, -14590, -3079, 3426, -6434, -10935, -13292, -15495, -27560, -30572, -43222, -49502, -38222, -26694, -11673, 878, 152, -12698, -28508, -33636, -21365, -8662, -11791, -27659, -25794, -5078, 2941, 5115, -5811, -18484, -2286, 16265, 10921, 1099, -12217]
7792a2217j60J1513P588M902o987n194j4767k5j849m052P250p307L67J3405L578
7777c955k692l20J2481j842k0881J201P352o703n570K754R296J3423P81j2681
7763g356k711k588o57N455L697k205M490j7659r071J2038q673M913J4620n019
7749a0726L638j1152j582J3379N523n582r404K890L440p82O49k506l119O947N845
7734b542k50o432L678R682k085l032o628r242m120M747J884J1235J2132O208n526
7719I709j512M540K032o033q63O841k595M860j2500o814j4941j645K0338J5661
7705A7078J184k2895l055j639J6253o190p0L722j89K858L583j822p175k067k113
7690b537j1277n276K546M738R502Q67J541K991j565L114q33o871Q264P843r102
$$ y = [-12217, -12377, -864, 6724, 11626, 4639, -555, -15322, -15347, -17196, -21248, -13998, -21305, -20938, -7533, -3955, -6647, -6967, 5514, 3672, -17209, -16008, -8656, -15359, -20929, -18175, -8879, 4544, 5325, -7356, -10067, -12655, -13312, -7857, -4160, -6365, -1875, -19534, -28605, -16567, -25240, -20327, -5707, -10726, -7088, -18240, -19822, -6443, -920, -6502, -15906, -13016, -9576, -10358, -9709, -12215, -15334, -8387, -2542, -2792, -9224, -5546, 4136, 2051, -981, -7609, -16851, -20971, -16224, -14340, -3105, 9027, 15235, 9709, 8197, 12737, 14769, 8736, 7873, 14714, 12119, 16979, 4479, -2335, -17276, -18921, 1417, 17078, 18262, -4633, -7688, -9327, 6926, 736, 666, 4388, 4199, 7057, 10640, 8818, 1643, -424, -2537, -13814, -19090, -16544, -11806, -2304, -1437, 104, 3095, 1530, 4644, 3811, -3060, 5204, 13047, 3945]
7675C945j5472n302Q158j0149j0419J714L043M081J4270o046J3K864j2064k076
$$ y = [3945, -11527, -16829, -8671, -18820, -29239, -27525, -24482, -20401, -6131, -12177, -12164, -9300, -21364, -23440]
$$ [...]
##END NTUPLES=NMR SPECTRUM
##END=
