##TITLE=Analysis number 324492
Compound Code cc 56642
Book Reference 508/24
Project Code adrs
Chemist Name antons
##JCAMPDX= 6.0         $$ Bruker NMR JCAMP-DX V2.0
##DATA TYPE= NMR SPECTRUM
##DATA CLASS= NTUPLES
##ORIGIN= Bruker BioSpin GmbH
##OWNER= nmr
$$ XWIN-NMR		Version 3.5
$$ Thu Nov 23 11:10:00 2006 GMT Standard Time (UT+0h)  MAYBRIDGE\nmr@NMR_250MHZ
##.OBSERVE FREQUENCY= 250.131544655141
##.OBSERVE NUCLEUS= ^1H
##.ACQUISITION MODE= SIMULTANEOUS (DQD)
##.ACQUISITION SCHEME= undefined
##.AVERAGES= 16
##.DIGITISER RES= 18
##SPECTROMETER/DATA SYSTEM= dpx250
##.PULSE SEQUENCE= zg30
##.SOLVENT NAME= DMSO
##.SHIFT REFERENCE= (INTERNAL, DMSO, 0, 16.5077)
##AUDIT TRAIL= $$ (NUMBER, WHEN, WHO, WHERE, WHAT)
$$ ##TITLE= Audit trail, XWIN-NMR		Version 3.5
$$ ##JCAMPDX= 5.01
$$ ##ORIGIN= Bruker BioSpin GmbH
$$ ##OWNER= nmr
$$ C:\u/data/dgb/nmr/ADRS/870/pdata/1/auditp.txt
$$ ##AUDIT TRAIL=  $$ (NUMBER, WHEN, WHO, WHERE, WHAT)
(   1,<2006-11-23 11:09:33.19 +000>,<MAYBRIDGE\nmr>,<NMR_250MHZ>,
      <created by zg, POWCHK disabled, PULCHK disabled
       configuration hash MD5:
       49 4B E0 1D 92 C2 6B 37 9F E6 65 BC 52 41 86 1D
       data hash MD5: 64K
       2B 8F 2D 5A 94 3B B0 7D A3 5D C3 79 1F C1 17 82>)
(   2,<2006-11-23 11:09:49.66 +000>,<MAYBRIDGE\nmr>,<NMR_250MHZ>,
      <Start of raw data processing
       ef LB = 0.3 FT_mod = 6 PKNL = 1 SI = 32K 
       data hash MD5: 32K
       16 55 D1 83 53 5A D9 31 66 CE B6 BE 06 E1 0D 82>)
(   3,<2006-11-23 11:09:51.56 +000>,<MAYBRIDGE\nmr>,<NMR_250MHZ>,
      <apk 
       data hash MD5: 32K
       7A 98 AD 4A E6 CC 27 88 16 FE 02 B3 E7 96 99 CB>)
(   4,<2006-11-23 11:09:52.31 +000>,<MAYBRIDGE\nmr>,<NMR_250MHZ>,
      <abs ABSG = 5 
       data hash MD5: 32K
       70 21 F5 42 57 30 19 D8 FB 92 7C 39 5E CD 04 B0>)
$$ ##END=
$$ 
$$ hash MD5
$$ E8 4F 02 56 F1 D1 DA B5 FC 5E 8A DB 31 6A 9E 7C
##$RELAX= 
##$RELAX= 
##$RELAX= 
##$RELAX= 
##$RELAX= 
##$RELAX= 
##$RELAX= 
$$ Bruker specific parameters
$$ --------------------------
##$DU= <C:\u>
##$EXPNO= 870
##$NAME= <ADRS>
##$PROCNO= 1
##$TYPE= <nmr>
##$USER= <dgb>
##$AMP= (0..31)
100 100 100 100 100 100 100 100 100 100 100 100 100 100 100 100 100 100 
100 100 100 100 100 100 100 100 100 100 100 100 100 100 
##$AQSEQ= 0
##$AQ_mod= 3
##$AUNM= <au_zg>
##$AUTOPOS= <48 >
##$BF1= 250.13
##$BF2= 250.13
##$BF3= 250.13
##$BF4= 250.13
##$BF5= 500.13
##$BF6= 500.13
##$BF7= 500.13
##$BF8= 500.13
##$BYTORDA= 1
##$CFDGTYP= 0
##$CFRGTYP= 5
##$CHEMSTR= <none>
##$CNST= (0..31)
1 1 145 1 1 1 1 1 1 1 1 1 1 1 1 1 1 1 1 1 1 1 1 1 1 1 1 1 1 1 1 1 
##$CPDPRG= <>
##$CPDPRG1= <>
##$CPDPRG2= <>
##$CPDPRG3= <>
##$CPDPRG4= <mlev>
##$CPDPRG5= <mlev>
##$CPDPRG6= <mlev>
##$CPDPRG7= <mlev>
##$CPDPRG8= <mlev>
##$CPDPRGB= <>
##$CPDPRGT= <>
##$D= (0..31)
0 1 0 0 0 0 0 0 0 0.06 0 0 0 0 0 0 0.0002 0 0 0 0 0 0 0 0 0 0 0 0 0 0 
0 
##$DATE= 1164280172
##$DBL= (0..7)
120 120 120 120 120 120 120 120 
##$DBP= (0..7)
150 150 150 150 150 150 150 150 
##$DBP07= 0
##$DBPNAM0= <>
##$DBPNAM1= <>
$$ [...]
##$SUBNAM7= <"">
##$SUBNAM8= <"">
##$SUBNAM9= <"">
##$SW= 20.6930455092707
##$SWIBOX= (0..15)
0 0 3 0 0 0 0 0 0 0 0 0 0 0 0 0 
##$SW_h= 5175.983436853
##$TD= 65536
##$TD0= 1
##$TE= 683.16
##$TE2= 300
##$TE3= 300
##$TEG= 300
##$TL= (0..7)
0 120 120 120 120 120 120 120 
##$TP= (0..7)
150 150 150 150 150 150 150 150 
##$TP07= 0
##$TPNAME0= <>
##$TPNAME1= <>
##$TPNAME2= <>
##$TPNAME3= <>
##$TPNAME4= <>
##$TPNAME5= <>
##$TPNAME6= <>
##$TPNAME7= <>
##$TPOAL= (0..7)
0.5 0.5 0.5 0.5 0.5 0.5 0.5 0.5 
##$TPOFFS= (0..7)
0 0 0 0 0 0 0 0 
##$TUNHIN= 0
##$TUNHOUT= 0
##$TUNXOUT= 0
##$USERA1= <user>
##$USERA2= <user>
##$USERA3= <user>
##$USERA4= <user>
##$USERA5= <user>
##$V9= 5
##$VALIST= <valist>
##$VCLIST= <CCCCCCCCCCCCCCC>
##$VD= 0
##$VDLIST= <DDDDDDDDDDDDDDD>
##$VPLIST= <PPPPPPPPPPPPPPP>
##$VTLIST= <TTTTTTTTTTTTTTT>
##$WBST= 1024
##$WBSW= 4
##$XGAIN= (0..3)
0 0 0 0 
##$XL= 0
##$YL= 0
##$YMAX_a= 696617
##$YMIN_a= -739374
##$ZGOPTNS= <>
##$ZL1= 120
##$ZL2= 120
##$ZL3= 120
##$ZL4= 120
##$ABSF1= 16.50766
##$ABSF2= -4.185513
##$ABSG= 5
##$ABSL= 3
##$ALPHA= 0
##$AQORDER= 0
##$ASSFAC= 0
##$ASSFACI= 0
##$ASSFACX= 0
##$ASSWID= 0
##$AUNMP= <proc_1d>
##$AZFE= 0.1
##$AZFW= 0.1
##$BCFW= 0
##$BC_mod= 0
##$BYTORDP= 0
##$COROFFS= 0
##$CY= 12.5
##$DATMOD= 1
##$DC= 0
##$DFILT= <>
##$DTYPP= 0
##$F1P= 14.0000005364418
##$F2P= -0.99999901652339
##$FCOR= 0.5
##$FTSIZE= 32768
##$FT_mod= 6
##$GAMMA= 0
##$GB= 0
##$INTBC= 1
##$INTSCL= 1
##$ISEN= 128
##$LB= 0.3
##$LEV0= 0
##$LPBIN= 0
##$MAXI= 10000
##$MC2= 0
##$MEAN= 0
##$ME_mod= 0
##$MI= 0
##$NCOEF= 0
##$NC_proc= -3
##$NLEV= 6
##$NOISF1= 0
##$NOISF2= 0
##$NSP= 0
##$NTH_PI= 0
##$NZP= 0
##$OFFSET= 16.50766
##$PC= 1
##$PHC0= -49.47828
##$PHC1= 5.442042
##$PH_mod= 1
##$PKNL= yes
##$PPARMOD= 0
##$PSCAL= 4
##$PSIGN= 0
##$REVERSE= no
##$SF= 250.130003586809
##$SI= 32768
##$SIGF1= 0
##$SIGF2= 0
##$SINO= 400
##$SIOLD= 32768
##$SREGLST= <1H.DMSO>
##$SSB= 0
##$STSI= 32768
##$STSR= 0
##$SW_p= 5175.98343685301
##$SYMM= 0
##$S_DEV= 0
##$TDeff= 65536
##$TDoff= 0
##$TI= <Analysis number 999999
Compound Code 99
Book Reference 9
Project Code 9>
##$TILT= no
##$TM1= 0
##$TM2= 0
##$TOPLEV= 0
##$USERP1= <user>
##$USERP2= <user>
##$USERP3= <user>
##$USERP4= <user>
##$USERP5= <user>
##$WDW= 1
##$XDIM= 32768
##$YMAX_p= 512907617
##$YMIN_p= -59987
$$ End of Bruker specific parameters
$$ ---------------------------------
##NTUPLES= NMR SPECTRUM
##VAR_NAME=  FREQUENCY,     SPECTRUM/REAL,   SPECTRUM/IMAG
##SYMBOL=    X,             R,               I
##VAR_TYPE=  INDEPENDENT,   DEPENDENT,       DEPENDENT
##VAR_FORM=  AFFN,          ASDF,            ASDF
##VAR_DIM=   32768,         32768,           32768
##UNITS=     HZ,            ARBITRARY UNITS, ARBITRARY UNITS
##FACTOR=    0.157963299565203, 1,           1
##FIRST=     4129.06103302574, 0,            0
##LAST=      -1046.92240382727, 0,           0
##MIN=       -1046.92240382727, -59987,      0
##MAX=       4129.06103302574, 512907617,    0
$$ Real data points
##PAGE= N=1
##DATA TABLE= (X++(R..R)), XYDATA
$$ [...]
18931 95589 100560 108558 141857 170754 218834 258914 302460 365221 422851 482302 535289 562384
18919 562384 557126 530962 526454 517300 487784 431714 383640 330376 283008 242872 217148 193744
18907 193744 177109 160010 142898 143511 148700 150067 155031 152579 153116 157167 148462 146088 145513 143390
18893 143390 162400 216003 264960 304782 359466 419367 475322 531401 611094 678554 699528
18882 699528 683268 671269 638535 607432 567467 509598 423519 349990 298312 253498 220625
18871 220625 197854 183101 185430 182405 163942 165354 155618 137143 145804 145662 137060 140428 139326
18858 139326 133858 130022 129144 124257 121394 111947 117597 129512 123867 117309 126882 141544 136636 125455
18844 125455 126334 135105 140909 128680 127038 129996 134400 138616 138550 128986 118276 110619 117567 123655
18830 123655 124396 128784 132049 119866 108994 115212 132845 132564 114766 102515 101250 97967 103111
18817 103111 95386 98895 99206 84790 90858 107553 107142 113021 124883 136873 126020 125774 143085
18804 143085 144909 153617 163198 165529 167325 159325 135278 132259 128817 118606 117563 124992 119968 107127
18790 107127 99744 105914 118853 126295 112685 98437 98371 99044 103162 116907 116961 109400 114001 120382
18776 120382 109421 83938 90648 91937 105268 115877 127982 136377 129219 112188 117213 126574 126782
18763 126782 132630 125186 123341 118410 115293 111398 126156 135973 147152 148433 136457 120347 125875
18750 125875 136451 153827 148257 129732 120402 129627 131017 131383 112978 116341 126037 136604 132513
18737 132513 120965 122872 132320 147527 150679 147605 138922 147815 160866 161826 165104 164578 164107 171805
18723 171805 183502 191795 190527 200732 205347 214377 233673 236195 239328 233820 227261 237805 247520
18710 247520 250176 259179 281588 289563 279241 266913 275662 279037 282383 297836 302086 304854 308664
18697 308664 288315 291053 315297 333747 347238 360302 369081 385354 396852 400262 394548 391248
18685 391248 387812 369984 365003 375423 373016 371768 384277 396600 407096 414486 408329 408435 416980
18672 416980 409923 392415 394819 406691 414877 419360 434914 440039 432243 442669 451144 473605 498458
18659 498458 502191 509952 517395 533881 544289 552612 569872 583574 593399 592684 600877 613482 637251
18646 637251 655944 673669 693969 720624 740631 779349 802739 811561 834331 874819 913188 957884
18634 957884 996319 1021544 1046079 1078685 1128789 1194295 1251564 1304902 1357533 1415911 1464598
18623 1464598 1526101 1598757 1680575 1773199 1877775 1977345 2098925 2213743 2341137 2493588
18613 2493588 2665230 2835544 2992470 3172737 3379292 3601191 3836170 4100496 4363090
18604 4363090 4662721 4987961 5346512 5732063 6166596 6679065 7273198 7977018 8808005
18595 8808005 9804800 11020485 12498314 14313114 16553686 19256907 22430173 26008311
18587 26008311 29833982 33666318 37222044 40265236 42568672 43885804 43982829 42684078
18579 42684078 40065321 36480765 32408367 28350393 24670281 21527264 18979742 16960657
18571 16960657 15383032 14181887 13270550 12597018 12139532 11834363 11682618 11679519 11802168
18562 11802168 12074387 12521545 13151895 13980984 15072947 16486338 18306712 20595526 23386969
18553 23386969 26680101 30393575 34317192 38164907 41621700 44492423 46529629 47428412
18545 47428412 46916927 44893857 41546381 37261925 32594080 28071163 24016175 20560577
18537 20560577 17722472 15444893 13614960 12147633 10985997 10042899 9254979 8587255
18529 8587255 8003610 7482618 6996599 6533613 6103502 5704041 5351196 5046807 4770349
18520 4770349 4526312 4305494 4094981 3874487 3669153 3501450 3334998 3165882 3031128
18511 3031128 2920404 2809792 2693496 2599818 2543766 2466982 2386064 2334811 2293931 2258177 2231625
18500 2231625 2229940 2218924 2218519 2242635 2288139 2312789 2326709 2319830 2289432 2246085 2185441 2082993
18488 2082993 1984904 1908192 1826905 1761185 1702746 1657819 1636802 1610436 1587477 1587685 1576068 1562457
18476 1562457 1545848 1536463 1525227 1521870 1538199 1535241 1530478 1526740 1545688 1583080 1619134 1642387
18464 1642387 1651421 1661904 1682254 1696346 1706617 1715203 1732524 1746728 1755813 1775654 1812723 1843842
18452 1843842 1868430 1894129 1905489 1931296 1982999 2039544 2086984 2149808 2217768 2292386 2360362
18441 2360362 2423217 2472195 2521268 2582490 2645247 2723563 2822867 2929925 3045866 3162853 3297922
18430 3297922 3439218 3571959 3712882 3847346 3994717 4162119 4329157 4542920 4767709
18421 4767709 5012581 5287172 5584652 5903168 6232651 6575212 6941652 7319670 7710991
18412 7710991 8118140 8524289 8926488 9325439 9689115 10003570 10296150 10545734 10763944
18403 10763944 10947733 11072688 11126408 11143566 11147277 11095341 11012206 10903175 10785996 10673441
18393 10673441 10580806 10504185 10439324 10400559 10404885 10438991 10508820 10607006 10744046 10935321 11168250
18382 11168250 11448140 11773715 12156060 12593723 13065905 13576125 14130875 14741977 15378505
18373 15378505 16033900 16706060 17361380 17976154 18554725 19084912 19513992 19837430 20042342
18364 20042342 20127277 20071619 19893829 19601807 19211907 18726063 18169004 17570859 16948733 16320272
18354 16320272 15700152 15097809 14530196 13993399 13496752 13035463 12627394 12280675 11983547
18345 11983547 11732471 11523599 11346051 11206327 11116848 11085153 11083386 11110432 11174243 11282353
18335 11282353 11386127 11479305 11610092 11726425 11834969 11948316 12007816 12017829 11996676 11931436
18325 11931436 11808849 11621678 11393295 11123871 10804661 10456033 10066157 9673675 9267938
18316 9267938 8847129 8443276 8059577 7698522 7344915 6998688 6668144 6358126 6051068
18307 6051068 5760577 5497484 5247363 5024432 4807055 4616484 4429872 4268027 4101828
18298 4101828 3927602 3768242 3638631 3513739 3395894 3288550 3186276 3075162 2986729 2895320
18288 2895320 2803781 2737014 2670189 2598088 2532245 2476896 2412780 2355431 2314429 2264963 2207260
18277 2207260 2155591 2113373 2055018 2012801 1971836 1928681 1873004 1836556 1799298 1761271 1726857
18266 1726857 1683107 1638364 1596551 1564796 1525110 1496922 1486789 1467490 1449564 1418080 1372592
18255 1372592 1323313 1310229 1311116 1290538 1267808 1246811 1226311 1220647 1207321 1192036 1188846 1175753
18243 1175753 1170213 1171600 1164041 1157717 1134992 1102120 1083837 1076330 1067069 1055927 1026364 1011192
18231 1011192 993323 972520 975942 963099 945885 933057 898050 871738 847830 839483 846881 818476
18219 818476 804170 796066 796309 795628 785543 764128 759933 753841 741330 714261 694507 677136 677191
18206 677191 682038 681382 683053 675712 663999 653397 653051 646243 656315 657826 635390 615618 603645
18193 603645 590700 584206 575901 568541 568531 559766 551196 535753 540873 541584 529140 525862 523859 518811
18179 518811 522397 532576 522819 493687 490656 493605 488622 486116 481565 487629 492885 490490 491843 493589
18165 493589 503654 521611 533284 542916 531596 526470 549260 561919 578756 592141 608684 617557
18153 617557 620610 619818 621741 624907 600617 572793 545568 517867 493234 486014 486912 483887 463788
18140 463788 458433 452417 433837 424421 419288 409632 408494 409916 412410 409584 405534 403079 408519 415615
18126 415615 422348 414408 427739 440586 456151 493832 523596 531652 536569 535286 551278 557419 557427
18113 557427 553646 543481 531263 517308 502233 495564 488917 477013 479440 470853 462319 464182 471286
18100 471286 479700 497677 517127 528771 542681 557982 571461 579608 605245 607335 595623 593513
18088 593513 590199 589896 595626 601527 590577 589319 588573 593765 573286 558443 549686 533571 524527 525393
18074 525393 526831 535572 536896 536464 533386 541763 550232 564170 579223 592304 584768 581344 589044 586562
18060 586562 574420 560790 542440 541664 565460 577961 573088 565026 559466 556369 548169 531140 537317
18047 537317 526130 517662 517476 529996 529067 516329 512466 513763 512795 509676 489230 472868 463665 461701
18033 461701 438187 434517 420765 392972 387497 380174 369480 360844 347491 337294 340340 330968 317258
18020 317258 310752 306103 302369 293596 286436 282705 285572 289167 296900 302470 308071 300844 301332 307510
18006 307510 306834 306006 296212 286541 279842 284925 297622 301940 299413 300314 301645 297999 318747 325512
17992 325512 319860 313229 311083 317791 318956 324533 335005 335803 331485 349749 360324 373075 392657
17979 392657 426433 455215 471190 482861 503480 517413 516275 517951 519201 501895 491979 493092
17967 493092 478617 466524 452233 435130 420700 413169 403285 396021 406771 410417 403817 399557 407762
17954 407762 419564 427172 418180 405882 407062 411321 423207 460273 479785 476722 486583 509280 543982
17941 543982 566445 582648 585596 574100 580836 573004 573880 563941 550368 531351 504462 489270 478612
17928 478612 466639 471528 464033 452753 458469 462538 448292 440123 450410 458957 440144 435092 442759
17915 442759 456501 477017 486740 488924 478279 477552 479806 486789 502900 505571 504933 498686 505390 524123
17901 524123 540670 552693 565067 556476 568781 579629 577185 575894 576442 575275 592442 628253 649925
17888 649925 669471 706559 727990 746573 764561 786974 789444 776026 772030 768895 781345 786466
17876 786466 782454 781327 791756 802352 812138 815943 835905 859258 881835 891602 885381 891905 913137
17863 913137 930572 934680 954900 966398 982054 995609 1001548 1017168 1031329 1048867 1069566 1089098
17851 1089098 1097829 1115195 1130121 1156500 1177922 1187608 1202071 1226481 1235365 1236651 1255360 1285120
17839 1285120 1324617 1348252 1365321 1382632 1421950 1467929 1508982 1540974 1576268 1587107 1613803
17828 1613803 1649476 1701629 1731118 1725815 1714333 1717740 1713833 1717298 1720116 1736502 1763167 1783881
17816 1783881 1795668 1787442 1775973 1778488 1770777 1759631 1747508 1744555 1766426 1779467 1791931 1806678
17804 1806678 1808641 1809306 1813343 1806959 1793693 1769156 1747219 1731963 1745622 1743690 1724294 1703579
17792 1703579 1702245 1717968 1720795 1707760 1703420 1705240 1696536 1698053 1712858 1731361 1748521 1759707
17780 1759707 1773985 1804571 1855954 1905659 1957506 2021224 2100199 2217330 2356187 2503155 2651948
17769 2651948 2813257 2974361 3116197 3222203 3285174 3317361 3274626 3167400 2999058 2809772
17759 2809772 2627295 2455310 2300518 2168942 2043624 1940289 1863915 1821837 1782091 1762991
17749 1762991 1744090 1729523 1709164 1672798 1636075 1599311 1559456 1507573 1458984 1415241 1369236
17738 1369236 1334054 1293735 1249062 1197756 1140725 1096651 1072229 1052057 1021556 997178 979763
17727 979763 962710 956053 966609 961580 969349 983021 988863 991916 992485 1006400 1012750 1007937 1004317
17714 1004317 998996 1013587 1018263 1012855 1006866 991670 973609 969132 965289 940610 918533 882966
17702 882966 859966 850882 835519 815700 815120 809091 817472 824168 840856 845200 829956 823175 842833
17689 842833 855388 863280 890704 925371 945416 960797 982431 1006949 1033110 1059158 1081395 1096917
17677 1096917 1122222 1143636 1164996 1219387 1258088 1296129 1349786 1418721 1480324 1531375 1594983
17666 1594983 1662557 1734810 1815913 1922240 2017813 2122194 2227244 2325561 2409596 2494239 2585060
17655 2585060 2692788 2797081 2899764 3003483 3112874 3223031 3356982 3513790 3683005
17646 3683005 3851240 4032420 4240345 4482459 4756379 5048712 5380696 5734490 6110347
17637 6110347 6543344 7025965 7555674 8149756 8833532 9614771 10529129 11609421 12857518
17628 12857518 14345406 16145882 18282623 20792561 23695656 26932546 30373441 33843642
17620 33843642 37107620 39904516 42045809 43364012 43618233 42693630 40615532 37641213
17612 37641213 34127011 30458491 26965950 23853191 21196513 19001483 17242442 15866035
17604 15866035 14778031 13943407 13325076 12900285 12649402 12549676 12575579 12734242 13034027
17595 13034027 13482229 14130945 14996543 16122020 17554743 19331937 21481993 24000729
17587 24000729 26830638 29844884 32859959 35630601 37941495 39622668 40474334 40316752
17579 40316752 39038486 36720476 33609233 30066323 26465576 23069750 20050075 17439845
17571 17439845 15235575 13401920 11892222 10633317 9561476 8662799 7893767 7223749
17563 7223749 6643672 6160102 5731767 5341929 5001240 4682849 4387534 4120281 3878949
17554 3878949 3669704 3483586 3302894 3133121 2979844 2856374 2737868 2637455 2552280 2464557
17544 2464557 2399924 2321922 2229717 2156794 2093562 2011984 1934797 1867155 1803822 1748291 1684756
17533 1684756 1614730 1543079 1463843 1414599 1369504 1328306 1276319 1235429 1195606 1159680 1116872
17522 1116872 1081610 1044940 1000791 986744 979244 958888 934340 903600 863764 837862 807441
17511 807441 782693 778797 765538 748672 735556 731122 704754 682492 674739 662130 659352 653791
17499 653791 617503 588626 573340 562364 550661 531689 524053 518062 503729 491601 472472 464952
17487 464952 460778 462498 463364 457252 444874 438554 419254 407889 391663 384304 393858 395887 393770
17474 393770 387129 383641 369540 367446 362438 357844 357809 358617 356313 345592 336657 316197 305917 317286
17460 317286 320243 333355 335963 320199 313563 310420 304031 294599 272879 259754 245440 245560 247989
17447 247989 240276 236145 238219 234888 223221 214058 196213 195484 194310 187347 188392 185983 192252 187639
17433 187639 190581 191791 191097 195253 203109 203173 214744 208666 186945 171325 159278 164160 160761 153144
17419 153144 160745 156304 144603 149899 139467 137339 135538 123203 113287 112148 126581 126958 125937
17406 125937 110311 114592 115954 113478 111922 109988 109350 117474 116407 107948 110032 117034 115815 116210
17392 116210 109497 111879 108928 111072 98548 107156 101981 97836 113401 123072 113770 103656 102461
17379 102461 115599 102028 93433 85554 85892 91420 95323 90609 99994 105879 103983 89291 78886
17366 78886 81867 74881 84204 81717 89088 105327 106825 92303 93539 98610 95429 92807 103160 95180
17352 95180 100651 104662 98988 106259 107038 116278 128728 141100 145941 133530 129749 144482 158685
17339 158685 156617 143061 132601 126241 125802 118437 111970 116270 121609 109172 91698 92503 108801
17326 108801 122735 130484 132150 137584 148092 134794 134064 125480 131453 124855 119615 137903 133623
17313 133623 123084 110018 93403 101519 100915 95500 101910 104448 86432 75047 75673 73878 79295
17300 79295 76624 82383 87348 76299 64830 75524 88780 89626 97100 93711 86194 81236 75015 63890
17286 63890 50455 42716 44903 52454 66295 82446 88838 73414 58945 56965 59542 55681 65854
17273 65854 68069 64547 66412 75935 60564 50811 45385 45878 65567 58106 42093 48869 58550 56253
17259 56253 50906 58956 54845 53313 44020 47751 49303 53857 65154 70409 64631 51984 46384 59917
17245 59917 62574 81000 85421 80977 56792 43548 44311 41868 41969 35037 45563 43956 52136 47781
17231 47781 34936 45440 51097 43045 44318 49133 56427 64510 49603 36810 30541 29995 32281 50044
17217 50044 52640 42657 32750 37178 28163 28379 31991 31492 35594 48624 51497 44714 54959 70871
17203 70871 68389 71849 49458 23322 18396 15882 25503 26597 22711 12530 15051 18500 24757 29663
17189 29663 40486 40388 41866 23024 16640 42560 49913 44776 44573 46633 40995 42591 42280 38531 33645
17174 33645 33278 20511 12318 23073 31172 38222 35772 25792 17522 27700 32003 25109 36680 41015
17160 41015 40060 32076 47691 62581 42657 31365 38000 47779 47797 27681 20424 22312 30678 53147
17146 53147 54987 48726 45544 45353 49832 52350 41918 44781 53641 40915 39179 46031 34306 55771
17132 55771 46542 45728 58371 53346 44485 42013 25557 13172 28257 36451 38843 34691 34409 28232
17118 28232 34936 39471 37047 49328 64935 61491 51573 34792 43780 58265 65099 59999 56163
17105 56163 42997 45020 56989 63676 69074 57418 56526 71990 67579 74815 76483 78736 83743 89784
17091 89784 82787 80424 85241 93677 102098 116911 114218 112841 123298 125147 156631 185803 206520
17078 206520 219591 226293 237053 243081 248016 252142 244261 228055 206995 180288 150154 146265 136353
17065 136353 121204 109963 105418 90966 74596 79061 93694 86796 93486 106841 103552 98816 97161
17052 97161 98237 111811 132761 124275 124264 147179 179807 177422 178888 204325 222896 229088 240070
17039 240070 234247 233564 230768 211093 188004 166062 160590 139269 122789 108984 102409 88931 82967
17026 82967 73312 64170 59293 58914 59985 60613 58791 48140 37206 44732 52270 54604 67153 65032
17012 65032 61819 63994 64348 65538 50484 46341 41346 37985 35327 28793 11044 15936 25440 31617
16998 31617 28434 27797 27416 31305 30982 30552 11704 9456 13444 24760 19864 23614 20754 16202 21489
16983 21489 27645 28952 16403 17570 27887 28916 35054 29677 31064 33050 29439 35559 37248 28581
16969 28581 31530 39812 49076 52376 42030 36736 37650 40108 38100 37140 39936 36264 24960 24869 44079
16954 44079 57503 62826 71386 70050 43096 37102 34097 46207 50190 39063 35112 41970 46376
16941 46376 52951 50713 46474 52510 54896 51296 41062 36633 32791 35387 37223 42540 38268 26865
16927 26865 22483 33122 38832 30495 39788 37723 43456 52743 44071 39839 44178 41504 50299 68859
16913 68859 74405 72957 70055 71295 62241 53577 66500 77884 74514 53710 40228 33294 21079
16900 21079 20649 32767 33097 23317 15401 15049 28408 34862 30716 28366 24664 25161 31348 24704 29010
16885 29010 44026 62434 74362 78524 68022 73482 68398 70209 60434 63753 80028 94202 93527
16872 93527 96823 102782 107871 112821 113572 129787 136438 146450 162208 173153 201340 208138 211104
16859 211104 226761 224992 221816 216564 217807 211975 206459 204319 187157 178345 169348 164876 162167 157884
16845 157884 150356 145151 146406 140670 143271 147601 146465 151237 153929 159946 169812 178732 196635 199167
16831 199167 206516 214935 247698 267934 277175 306813 329158 330746 354784 386930 411024 412531
16819 412531 408351 398324 384271 369331 355870 340786 325975 302531 277771 252927 231495 212021
16807 212021 188626 160951 159816 161409 161064 146352 143560 147652 152824 147630 153379 157328 162146 162472
16793 162472 156632 149733 139627 159592 171512 185764 198356 196478 194537 208271 219817 226045
16781 226045 214019 204117 197914 194430 185258 167073 148758 137875 136215 123315 109202 90486
16769 90486 88307 93050 86646 68854 66478 74398 70160 62480 56541 57483 50230 36103 41835 61584
16755 61584 61342 58320 47409 41712 44091 40494 28679 28458 29605 29217 47097 47049 24125 4984
16741 4984 20769 26998 21549 27014 35006 23935 17751 22966 23093 33694 25017 7512 4155 8112
16727 8112 11988 21716 21506 23639 21613 19699 8747 2094 11510 13031 12951 32180 37895 31059 26001
16712 26001 9004 2526 12770 19295 13753 13594 11940 8556 15398 22630 20655 10089 4143 15202
16698 15202 15609 17730 27031 18863 3713 4518 14740 27151 15930 2060 -1842 -4831 14014
16685 14014 34502 43615 27268 20368 11933 -1222 -8507 -6859 -2274 10531 23089 22420 4129
16672 4129 -15170 -17824 -8215 -3201 9141 11441 19088 15843 22378 31518 28809 20073 7627 6482
16658 6482 3965 -18852 -18496 -7417 292 509 679 8386 2737 6779 13904 15444 20067 18533 9570
16643 9570 6201 8371 6041 -5499 -1686 9728 6045 12811 11300 14577 19351 11844 1730 -4588
16629 -4588 -5370 536 9907 11410 14296 19983 15343 13658 12098 8153 2712 -4626 -5190 1486 7544
16614 7544 -3914 -9123 -10677 -22554 -24172 -9435 5352 2334 -4680 -3883 -1961 -314 -5907 2908
16600 2908 15651 11474 15225 22073 12184 10735 -3171 -22181 -9199 -5224 -2774 4612 5744 11701
16586 11701 10913 13754 15578 7451 515 -3241 -4235 -8674 8416 17076 18416 9091 1409 6044 7250
16571 7250 -1328 741 -5184 -7163 1637 12499 20929 25822 26182 28975 17132 14756 19511 15385
16557 15385 4586 -7351 -13268 -10701 -4768 -5121 -3722 -2208 5629 16381 22136 11019 -628
16544 -628 -14634 -14920 -31840 -19644 -433 8162 281 -10741 -15121 -5561 4260 15101 21024 -9423
16530 -9423 -12500 808 8451 6553 -2038 2184 15368 48 -31907 -44177 -31296 -18275 -19735
16517 -19735 -23013 -13284 -3643 -5228 -7187 -15582 -9610 2595 3675 408 8471 22623 21772 21876
16503 21876 25878 22177 4789 -4745 10529 36263 35627 25320 15923 4641 -6441 -8451 -10298
16490 -10298 -7710 -2706 -11322 -11033 -11089 2207 -150 3761 11516 -24 -2872 4919 4454 6508 14804
16475 14804 8403 -2429 -12069 -14865 -12627 -4228 5084 14389 11557 -4993 -15277 -22874 -9965
16462 -9965 3638 2112 8342 1593 1696 3088 14150 10842 2584 -5530 3651 -850 -10119 -6390
16448 -6390 -7431 -11013 -6376 -17223 -13001 -5067 -980 10473 -395 -14930 5270 23450 28752
16435 28752 17552 3390 -1952 -6261 6889 11475 7699 7501 9570 12135 14914 8552 -2131 -2549
16421 -2549 10524 13035 7793 3639 -2835 2077 3797 -3437 -5160 7838 1761 -549 1293 9885
16407 9885 16684 13173 2455 -1086 -17149 -15832 -1122 22310 22034 11257 17542 20091 16868 10684
16393 10684 12446 6056 -4329 -5288 6441 17189 18051 20363 6663 12991 12520 22761 36484 33731
16379 33731 26953 27576 23238 20105 15395 26913 28997 23231 21550 27530 16216 14362 30079 18470
16365 18470 6095 -1667 4335 21606 17801 11974 17037 17333 13570 9857 1718 1997 9005 27792
16351 27792 24288 14513 6568 10036 13860 8482 8195 18322 15865 18548 17802 27538 22289 -267
16337 -267 -5526 6106 19654 17726 11318 10317 2249 8265 15373 23501 22673 15882 9416 5606 779
16322 779 -1994 1080 8085 4703 -1951 9092 -9916 -20549 -15216 -10981 -9021 -6360 -6217 -5693 -9870
16307 -9870 9051 9225 -4485 -12492 -13845 -6910 1475 -1807 -544 -264 -5801 -15063 -15238 -10130 -9664
16292 -9664 -19458 -13180 -18990 -35025 -37641 -20197 1508 10579 16984 24005 26416 24864 10162 9703
16278 9703 9354 1485 -2145 8573 14457 6667 -10501 -19742 -18023 -21545 -28686 -26250 -1627 6988
16264 6988 1235 -3690 -3744 -3222 877 -4307 -7176 1083 7737 9005 5556 -1981 1736 -7883 -14797
16249 -14797 -17343 7831 19984 7612 3472 690 -1955 -2699 10170 8481 -259 -12141 -10723
16236 -10723 -8007 -4769 3869 6240 -6092 -16096 -12729 -8452 -8638 -4313 -1175 1816 1140 -3691
16222 -3691 -4861 2686 -10860 -17459 -11150 4319 1776 337 -3132 -18562 -10310 -8914 6496 6768
16208 6768 -10634 -22577 -29736 -19705 -24222 -21769 -23879 -27094 -30230 -31707 -16184 -5588 5501
16195 5501 2662 -5908 -14717 -33770 -32442 -20841 -4382 2216 -13514 -23957 -27992 -27002 -25606 -16314
16181 -16314 -17622 -11996 -7152 -4839 -17127 -22589 -21249 -17095 -12852 -10338 -17658 -33764 -24406 -54
16167 -54 -168 -11903 -19834 -15248 -21509 -28375 -19285 -12377 -27305 -36312 -20639 -7970 -6287 -15987
16153 -15987 -11747 -1044 -1633 -16299 -39571 -40161 -30599 -28682 -18274 -2536 3956 -984 3555 -8939
16139 -8939 -24231 -11155 1979 104 -2852 10686 23077 21252 12378 1165 -5127 -6160 -6453
16126 -6453 -9739 -19985 -19347 -10840 338 -1677 -11779 -20434 -25241 -24710 -18205 -23548 -25912 -16199
16112 -16199 -13061 -15433 -23582 -24650 -19895 -23879 -19602 -15656 -19988 -14849 -22306 -20174 -28461 -37546
16098 -37546 -20117 3797 1727 6307 9960 6354 -7457 -14574 -26271 -24387 -16183 -17865 -5388
16085 -5388 4429 -3409 -21886 -9796 2479 7429 14555 5930 -11651 -6739 -13209 -5825 710 -847
16071 -847 -3612 2655 283 -7527 -29141 -32141 -23527 -29255 -28341 -23459 -20081 -14211 -7690 -1416 -5304
16056 -5304 -9260 -1425 -10854 -7198 1266 3354 3117 -4963 -6060 -11868 -21523 -28431 -12842 -12746 -13746
16041 -13746 -14092 -11915 -16401 -19406 -10943 -905 10290 9110 13510 10493 9878 14917 16333 12844
16027 12844 6471 629 -3547 -2296 -5465 -9071 -13734 -8878 -23217 -34939 -42419 -36025 -25708 -8494
16013 -8494 4488 -2595 1941 -2925 -6090 2887 -429 -17451 -24795 -43021 -38112 -23717 -14854 -17170
15999 -17170 -19022 -12675 -17836 -16030 -14372 -18054 -25954 -27867 -18676 -21941 -22323 -26893 -25689 -22750 -20791
15984 -20791 -19876 -13402 -17511 -15545 -19178 -19948 -21859 -21194 -19194 -21328 -15442 -14484 -27473 -31331 -26261
15969 -26261 -16119 -13120 -3207 5451 13883 825 -12790 -23110 -31296 -34313 -21598 -16605 -13569
15956 -13569 2800 575 -18761 -29041 -34404 -33013 -30286 -22748 -35688 -31930 -21071 -10178 -11177
15943 -11177 -16059 -11237 -9902 -15548 -16060 -16095 -12652 -13659 -20072 -24403 -22133 -33111 -22374 -21511 -24052
15928 -24052 -20880 -13894 -20402 -13819 -15585 -5504 4774 3294 -5216 -7173 -8739 -13736 -20336 -33542
15914 -33542 -24858 -19446 -16394 -18572 -21234 -20109 -34043 -22159 -22313 -21891 -20891 -33435 -27501 -19368
15900 -19368 -6003 -15673 -14978 -7626 -4557 -14499 -15185 -10670 -11944 -19290 -23210 -20772 -4308 7917
15886 7917 -1970 306 -9736 -17738 -29345 -27047 -28057 -30488 -29429 -25302 -8520 -7068 -9003 -17808
15872 -17808 -23766 -24762 -24088 -26903 -37923 -52433 -55734 -38238 -33748 -17257 -9180 -16458 -28029 -33736
15858 -33736 -33975 -31138 -46091 -31207 -27518 -31860 -37315 -46723 -39057 -30502 -35605 -39713 -46575 -45004
15844 -45004 -38221 -20654 -1776 -2323 -4011 8460 4981 -7961 -3241 -6361 -21168 -33492 -11245
15831 -11245 -4579 -13661 -17214 -11976 -12643 -22956 -32234 -31715 -43995 -48301 -44897 -59987 -48714 -35546
15817 -35546 -33692 -46896 -42092 -29999 -16987 -18863 -18406 -11384 -1497 -5660 -6423 530 -5083 -521
15803 -521 8405 1944 1421 10043 3731 -16496 -7211 -2319 -8088 -14150 -16247 -21829 -10045 -8680 -4726
15788 -4726 -10747 -11861 -20286 -27774 -31173 -24073 -31843 -35112 -28630 -28608 -13113 -7408 -7583 -2625 -6955
15773 -6955 5214 10692 -3928 -15433 -6604 -2876 -14067 -9213 -6841 -4076 -5802 -13431 -9810 -4213
15759 -4213 -12371 -17286 -21632 -27919 -30233 -18712 -5018 783 -9434 -29366 -41531 -25888 -30586
15746 -30586 -38595 -26559 -17723 -9167 -9320 -13391 -14637 -2911 -6145 -23463 -21171 -8735 -28328
15733 -28328 -42553 -48315 -43214 -28593 -18654 -22320 -20056 -21476 -38592 -39441 -22657 -13487 -543
15720 -543 -1548 -21025 -29908 -28579 -30305 -37958 -38720 -18844 -6702 -8846 -14713 -31029 -39109 -31697
15706 -31697 -26870 -39331 -37354 -29171 -34958 -34088 -33335 -26249 -14933 -16623 -19726 -7098 9583 2813
15692 2813 -150 -21564 -22190 -19624 -16159 -24288 -24250 -10637 -3598 -12187 -9409 -11422 -7689 6350 -1240
15677 -1240 -11819 -11002 -24246 -20887 -13411 -3680 -5622 1447 -14229 -11871 -12213 -4428 -2649 -13372
15663 -13372 -27152 -13306 2293 -1923 -2448 11650 14057 4966 -7240 -12748 -11449 -10492 -17861 -19789
15649 -19789 -24771 -32943 -47172 -45631 -20341 -16386 -27975 -16421 -22390 -27736 -39485 -48330 -50851
15636 -50851 -44908 -29629 -20181 -15039 -9807 -8106 -11219 -8288 -24337 -42196 -44407 -41874 -31182
15623 -31182 -28038 -27311 -18892 -24455 -21211 -7255 11987 8124 928 -7836 -13105 -14869 -12400 -6268
15609 -6268 -5023 -12270 -32876 -51105 -53278 -48892 -49029 -36710 -32114 -25415 -10838 -14474 -16466 -3543
15595 -3543 -1976 -13687 -20831 -25322 -31116 -40858 -39468 -32251 -29984 -33642 -38224 -28189 -23026 -6864
15581 -6864 -7617 -15262 -23000 -32006 -24812 -18814 -24458 -36464 -26501 -18112 -29658 -28624 -14370 -12106
15567 -12106 -19094 -25963 -24285 -26667 -30917 -25033 -11100 -7890 -18692 -7461 -2322 -15388 -33040
15554 -33040 -28765 -25551 -27577 -32203 -18114 -121 -3019 -12885 -25678 -20444 -11287 1452 -5042
15541 -5042 -20530 -36452 -46800 -50312 -50384 -43348 -32299 -36325 -31100 -24728 -16775 -12826 -11786 -14993
15527 -14993 -23314 -31010 -36919 -40253 -27794 -15924 -17411 -19169 -17085 -13341 -3477 -12223 -9788 -12797
15513 -12797 -19941 -21793 -35987 -29625 -22134 -21986 -21183 -7385 -590 -5426 -5218 -1942 -9218 -18304 -23666
15498 -23666 -18070 -8102 -5253 -20866 -28039 -25066 -22357 -11267 1602 5743 -4880 -13663 -493
15485 -493 6542 4696 -4177 -10051 -9786 -22380 -32469 -27563 -21398 -11754 -10104 -18308 -14785 -7611 -18938
15470 -18938 -25256 -13643 -2084 -3874 -5652 -11510 -15631 -19608 -28263 -27803 -22785 -21300 -30330 -34273
15456 -34273 -31167 -26171 -15875 -14525 -11156 -28076 -42893 -52495 -50159 -50210 -54974 -56350 -43955 -25240
15442 -25240 -34381 -38111 -26649 -9441 -2078 -13856 -11671 -11363 -11359 -15158 -17746 -10710 -2313 2256 -663
15427 -663 -12734 -24379 -39262 -47289 -32138 -16771 -22772 -18722 -1315 16046 4527 -1959 -5440
15414 -5440 -19202 -3853 1702 -2700 261 -5926 -4455 -7479 -16915 -11041 240 -13553 -33766
15401 -33766 -32829 -20092 -17312 -26192 -32262 -29528 -24077 -18064 -6364 -1865 -2302 -11155 -9177 -6761
15387 -6761 -12955 -28294 -25654 -21504 -12007 -18966 -14732 -8586 -8408 -11923 -25773 -39764 -41798 -37554
15373 -37554 -25757 -21254 -7824 -1907 -5481 -9309 -7292 745 -1052 -17587 -32231 -26927 -26852 -33147
15359 -33147 -29016 -15258 -16157 -24883 -13764 -16248 -20385 -28351 -35283 -40116 -29905 -13131 -15614 -29201
15345 -29201 -32576 -30238 -40277 -47209 -33501 -24767 -28690 -36030 -36268 -32224 -40419 -46772 -32730 -30768
15331 -30768 -41451 -41149 -25293 -15165 -6376 -8533 -21674 -9698 943 7664 47 -3477 -21889
15318 -21889 -25082 -26169 -39780 -32396 -22311 -17915 -8759 3966 511 -1884 -6306 -2431 -1736 -7844
15304 -7844 -11961 -11039 -9923 -17686 -11854 -6569 3025 6361 4973 -3341 -14972 -16509 -20110 -25322 -27278
15289 -27278 -12072 -24898 -26865 -31763 -34548 -35128 -31060 -37653 -27687 -27935 -20748 -15405 -20144 -25122
15275 -25122 -22963 -32332 -29813 -19543 -7248 -8978 -2409 -4793 -5996 -14152 -24753 -19842 -11587 -3765
15261 -3765 -19222 -35211 -58051 -57766 -44085 -25633 -20089 -36156 -30924 -32237 -26069 -22008 -18131
15248 -18131 -23405 -19209 1392 13119 14052 7533 -6311 -28481 -41622 -34361 -30827 -27785 -30501
15235 -30501 -33893 -24170 -6400 7348 2963 -8530 -10925 -19485 -20927 -7662 -7037 -24120 -23723 -18810
15221 -18810 -27045 -23361 -30869 -34124 -24532 -29192 -31942 -33099 -31740 -13477 8565 13888 18251 5001
15207 5001 -3745 -4486 2181 2657 -11156 -18283 -13930 -8210 -3471 -6682 -5313 -17315 -9355 -4053 4532
15192 4532 -12750 -33927 -26750 -36164 -48587 -54964 -45714 -40300 -31032 -4249 3901 2045 -8323
15179 -8323 -29226 -32658 -33965 -37361 -35101 -35132 -22660 -24861 -20887 -11647 -11497 -12365 -14812 -27887 -27644
15164 -27644 -18772 -14472 -24317 -31401 -18664 -18621 -23486 -29769 -28268 -22377 -26631 -26710 -39887 -32780 -28179
15149 -28179 -15537 -10770 -10214 -20385 -27961 -15090 -645 -2657 6695 -1828 -4366 -1208 -12429
15136 -12429 -26841 -35668 -33693 -26993 -36559 -40904 -38876 -31811 -31447 -20226 -10716 -9860 -12704 -13479 -13331
15121 -13331 -10340 -4607 -937 11607 9159 -3899 -15950 -21986 -14997 3094 -6171 -19814 -28763
15108 -28763 -22555 -4416 -8678 -10745 -15622 -20894 -13486 -1467 5025 -12705 -21669 -24775 -32761 -23375
15094 -23375 -18799 -13930 -16237 -8901 -13324 -25953 -22145 -21275 -21063 -23870 -25352 -31305 -28148 -13757
15080 -13757 -43 5210 4295 231 -5977 -4691 -8686 -3182 -3927 -18076 -17210 -24091 -27468 -23924 -32360
15065 -32360 -32764 -31694 -32683 -34539 -28929 -12715 -12755 -11031 -17087 -20105 -11533 -12199 -15824 -23059 -21930
15050 -21930 -23820 -18562 -2752 6596 14432 16659 11047 -5521 -10216 -6980 -8806 -6754 -3366 426
15036 426 -12452 -24445 -18049 -8969 -14331 -19325 -21446 -18471 -17910 -15571 -18402 -20359 -22585 -23519 -23144
15021 -23144 -19255 -7443 -5472 -15012 -25872 -20828 -20147 -26035 1530 17379 6411 6159 -843 5415
15007 5415 22214 22201 6818 1500 4363 8513 26713 35987 38845 51057 48778 52045 46602 36906
14993 36906 26940 21512 28027 20201 20441 9464 -3806 -11970 -6903 1325 35 -6770 -14976 -13014
14979 -13014 -5838 1498 12920 14708 4212 -7837 -11773 -5500 -3149 -13938 -13431 -4622 2570 4488
14965 4488 13136 34647 60639 70998 78251 80700 89291 115327 115296 104305 91890 73866 52540
14952 52540 22079 11566 11203 9397 5902 16785 11437 5804 9560 5851 326 -2810 -5940 -4529
14938 -4529 8540 11817 11446 12396 -9018 -17438 -22157 -1841 -4352 -17655 -5433 16157 30306
14925 30306 42106 36386 31418 31874 34270 30940 28690 24348 25995 14224 484 -1823 -5774 -16392
14911 -16392 -14417 -23209 -24394 -16621 -11071 -8031 2809 5336 -5214 -7379 1229 -14740 -19776 -18170
14897 -18170 -31011 -26006 -15719 -12748 -7558 -14449 -22173 -17544 -10479 -9403 -14837 -9927 -9636 -15838
14883 -15838 -20295 33 -4984 -20183 -25676 -25154 -19575 -25288 -14683 -10687 -15090 -18056 -20172 -26847
14869 -26847 -26916 -19154 -11058 -12143 -16875 -11188 -22444 -23957 -12158 1230 -10107 -24472 -26164 -24932
14855 -24932 -30673 -37610 -43919 -24823 -9097 -369 6677 -3805 -10642 -20991 -21757 -39995 -54987
14842 -54987 -31948 -21816 -27537 -35809 -30767 -19995 -18729 -26572 -37968 -47167 -36788 -29293 -32553
14829 -32553 -39688 -40937 -30856 -17823 -6123 -11950 -11549 -25029 -29546 -11898 -986 -14312 -14007
14816 -14007 -8978 -26469 -33613 -29254 -23201 -22495 -17253 -22938 -24821 -21517 -35987 -32005 -28509 -27861
14802 -27861 -35510 -49277 -42183 -28506 -39075 -34137 -22660 -15984 -20036 -23684 -14963 -24353 -38121
14789 -38121 -42288 -33915 -34906 -35704 -39778 -36675 -26178 -36098 -34800 -24837 -24493 -26833 -32561 -23579 -17025
14774 -17025 -8469 -8820 -15276 -11451 3118 -362 -21461 -17043 -12228 -15805 -14079 -27472 -24321 -17635
14760 -17635 -15056 -7181 -4729 -8810 -6353 -2082 6039 3721 -11087 -36953 -34728 -27151 -31655 -35969
14746 -35969 -40316 -31371 -48701 -52788 -37195 -27525 -17805 -17930 -19501 -17644 -11630 -17956 -9074 695
14732 695 -3405 -12057 -12860 -16109 -9351 -3476 -11435 -29930 -32752 -29949 -17467 -9644 -5691 -13202 -16392
14717 -16392 -6732 -13871 -22700 -19537 -1652 -13152 -23406 -20081 -29842 -19016 -10443 -11371 -4369 2586
14703 2586 3007 -4590 -7381 -2563 -5318 -12420 -21472 -23923 -20771 -25737 -35562 -44414 -37707 -25999 -12916
14688 -12916 -76 -6547 -15048 -22970 -30525 -19656 -28802 -33703 -28614 -18374 -11123 -16900 -22667 -23812
14674 -23812 -22918 -22589 -25080 -37805 -46510 -47786 -31415 -17181 -32086 -44202 -36045 -26632 -30590 -26182
14660 -26182 -25807 -29851 -24792 -21960 -22108 -22052 -17189 -15408 -19321 -18294 -27349 -31843 -31966 -28898 -41867
14645 -41867 -46421 -16992 -4513 7081 -2914 -19849 -31821 -20113 -26224 -19730 -18593 -13275 -22939
14632 -22939 -21627 -21185 -25479 -25524 -28734 -17284 -9501 -4895 -5422 -9322 -13621 -34532 -28466 -20511 -29164
14617 -29164 -34976 -42345 -44892 -34107 -26732 -27693 -23054 -17389 -12711 -2324 -5706 -12772 -27651 -32044
14603 -32044 -14577 -16610 -19595 -24908 -32957 -18353 -6933 -7965 -9892 -14712 -5312 -15768 -23542
14590 -23542 -33829 -32865 -23117 -21097 -21750 -19007 -16212 -31153 -29174 -36087 -26577 -9458 2462 -12734
14576 -12734 -13746 -13812 -26334 -26889 -18796 -22809 -36522 -38960 -38068 -36091 -33660 -34829 -39194 -38981 -36975
14561 -36975 -36081 -27746 -24395 -14950 -600 1765 -1794 -4956 -8501 -10819 -17043 -28940 -35165 -39353
14547 -39353 -44193 -32647 -21862 -23599 -26747 -14943 -8140 -9663 -6520 -15005 -27807 -34212 -31581
14534 -31581 -29881 -24017 -12444 -1603 -3248 -13900 -11662 -12215 -11267 -971 3308 -2281 -12305 4529
14520 4529 5081 -14281 -11526 6900 3651 6169 14524 36063 30634 12877 11392 13857 11114 12087
14506 12087 15007 6219 -715 -8504 -11070 -10527 -12185 -20047 -27326 -33214 -39949 -28230 -19689 -19718 -7619
14491 -7619 -13923 -31165 -29592 -15946 -7777 818 -8870 -20647 -28146 -21331 -31746 -42138 -39277
14478 -39277 -33864 -30564 -23350 -15329 -22719 -25253 -17506 -2306 1008 5000 -879 -12583 -17872 -8204
14464 -8204 16696 22196 -2526 -19676 -11951 -9761 -12722 -21617 -8473 2992 4563 -218 1399
14451 1399 -5331 -21976 -31116 -13337 -4755 -7468 -18594 -17675 -20539 -25426 -19555 -17665 -22817 -22045
14437 -22045 -16858 -12364 -19526 -36812 -26816 -6143 -5801 -10679 -5717 -5863 -20860 -39248 -36996 -31734
14423 -31734 -35767 -24588 -22763 -18448 -18348 -18847 -21176 -31614 -37836 -26865 -24139 -26017 -16465 -9188
14409 -9188 -3107 -2004 -18936 -25678 -34453 -39904 -33755 -31514 -34909 -33512 -30567 -30001 -32159 -18059
14395 -18059 -4620 -13196 -27308 -22353 -9559 -1973 -6730 -5450 -1834 3785 400 -10749 -8687
14382 -8687 8197 -1010 -13173 -13702 -12345 -17133 -19536 -19275 -23878 -27920 -19553 -14692 -16981 -19564 -10939
14367 -10939 -20256 -32003 -30820 -42256 -41662 -27023 -19043 -17648 -30540 -17077 -16709 -20616 -24532 -31575
14353 -31575 -17841 -9372 -9046 -12392 -14008 -16651 -24626 -20609 -9724 -3848 -2545 -581 -16088 -32642
14339 -32642 -31431 -34940 -23187 -24237 -32048 -27701 -22964 -38813 -30397 -20533 -28117 -28902 -39540 -53398
14325 -53398 -44763 -49146 -53437 -34469 -24117 -34969 -39132 -36010 -14315 -12816 -18027 -11849 -24230
14312 -24230 -30004 -26563 -24846 -15443 -13829 -17188 -13219 -30316 -33818 -18741 -1453 147 -2763 -8593
14298 -8593 -28726 -25690 -24529 -14509 -24976 -37338 -38765 -38097 -37920 -45428 -49094 -49784 -34098 -19470
14284 -19470 -19504 -32081 -37656 -40483 -26399 -19321 -23553 -15444 -15484 -17771 -19063 -19143 -15138 -1523 -4175
14269 -4175 -11480 -29549 -38837 -24633 -9577 -8283 -16818 -21156 -16515 -8649 -16946 -17418 -14458 -9502
14255 -9502 -10393 -8326 -17004 -26056 -32336 -36384 -34676 -30745 -24674 -17229 -16560 -17435 -23351 -19072 -19572 -22192
14239 -22192 -28136 -25160 -21048 -12924 -9137 -6921 -17217 -16375 -17648 -11230 -1754 6369 -9480 -24477
14225 -24477 -34477 -36290 -32620 -30659 -29092 -25462 -17266 -25406 -21869 -13142 -17486 -23748 -22599 -26947
14211 -26947 -33966 -32465 -24857 -9882 -3893 -10163 2061 4271 -15119 -34625 -42524 -33868 -13683
14198 -13683 -12541 -10101 -11544 -13646 -34081 -32738 -35744 -29995 -27125 -23921 -17955 -11935 -13600 -11731
14184 -11731 -23087 -12776 -891 -182 -3447 -925 -10375 -11053 1168 16112 12433 4148 -7506
14171 -7506 -18754 -24277 -38205 -46746 -31522 -22030 1119 -5007 -26483 -42138 -47049 -32468 -19382
14158 -19382 -19772 -9179 -16863 -29577 -23462 -13387 2163 14702 10695 -3600 -16342 -18350 -29591
14145 -29591 -25292 -14343 -23821 -24506 -22198 -23242 -21385 -24154 -9711 -14866 -22883 -38124 -35683 -14777
14131 -14777 -23172 -29262 -27023 -22551 -13265 -13508 -28224 -27114 -19927 -11741 -7461 -15227 -25447 -45213
14117 -45213 -31907 -26912 -28074 -36424 -50364 -45566 -33172 -41097 -39343 -27009 -24701 -35577 -39082
14104 -39082 -22132 -8811 -24072 -28291 -26004 -10176 -15787 -22196 -29747 -22167 -13980 -20183 -19535 -2604
14090 -2604 8863 -6449 -12623 -831 9463 -2022 -12305 -11301 -8105 -3203 -5724 -10777 -11371
14077 -11371 -10572 -18764 -9131 -18535 -30592 -11220 9431 19694 22427 19508 11083 -11648 -15720
14064 -15720 -22483 -26731 -28107 -27883 -19782 -22045 -18832 -13461 -8202 -5658 -11402 -16458 -2968 3069
14050 3069 2881 -6412 -17476 -22814 -13081 -8772 -12794 -9791 -14060 -12496 -14667 -21943 -27601 -29380 -24117
14035 -24117 -16207 -36938 -39890 -18029 -17007 -13724 -14216 -2203 7538 11049 17980 8051 -1036 -11043
14021 -11043 -8540 179 -7610 -15597 -17756 -17121 -19081 -21323 -13882 7846 16801 13411 3090 3270
14007 3270 1696 -3777 -10977 -21268 -22209 -6545 1473 4893 -7314 -27586 -16475 -8288 -8583 -16563
13993 -16563 -17487 -6667 -2419 -17860 -21471 -23481 -19955 -11301 -16939 -24738 -14011 -14483 -19479 -18289
13979 -18289 -8501 -17796 -15844 -13527 -20664 -18916 -18968 -4777 10776 4871 -12523 -9132 -13466 -6086
13965 -6086 -13864 -8396 -146 -4425 -7280 -12404 685 2435 -1237 -7487 -7754 -12004 -16871 -23962 -21760
13950 -21760 -13446 -14764 -11557 -10868 -7372 -6719 -22573 -23777 -17572 -21065 -26620 -11067 2725 9427
13936 9427 8695 1329 -4541 6135 7767 7553 25 -6688 -9977 -5053 131 1493 -13739 -15126 -2599
13921 -2599 -954 6174 9884 9371 -1106 -8032 1695 18998 19978 18274 8708 7916 -512 -12001 -23508
13906 -23508 -22757 -14226 -14909 -8614 -8259 4844 -1411 -14558 -8015 2202 -1353 -7353 -7251 -12131 -3303
13891 -3303 -2784 -9691 -14022 -10818 -14990 -23998 -20035 3437 6675 -1245 -3542 463 -4198 -5619 -3686
13876 -3686 -9126 -13983 -9607 -649 -14450 -26870 -15710 -3400 1981 -9016 -20449 -23368 -9124
13863 -9124 -2212 -11341 -12569 -13742 -10492 7723 22837 20070 1863 -9304 -7935 -5402 -7853 3243
13849 3243 6492 5303 -3293 -4631 -3437 8529 2094 9012 18048 7160 4336 20972 9253 -9545
13835 -9545 -6203 -3719 -6313 -10875 -14898 -13003 -21185 -13852 1550 -4428 6543 11406 -2740 -8563
13821 -8563 11515 8673 4319 6766 4035 1656 -17065 -19185 -20873 -31689 -14569 -22181 -15584 -11121
13807 -11121 -3854 -10097 -14283 -19406 -24531 -25572 -4473 -4977 -13162 -31570 -31838 -22068 -14274 -2308
13793 -2308 2466 -6376 -9758 -3520 -4815 -8040 -7681 -4102 -11892 -22372 -27274 -18313 -12771 -14811 -18688
13778 -18688 -10090 -441 -6697 -22741 -25657 -17738 -14611 -19750 -12162 -7635 -19323 -18803 -10836 -2697
13764 -2697 -3725 1955 4329 10924 13851 15754 6559 -6058 -8351 -13001 -12422 -424 -6641 474
13750 474 905 6194 19781 8383 6488 -220 -1571 -3052 -8286 2157 6942 4457 1651 -9645
13736 -9645 -18660 -7381 -4242 -3741 -3706 1606 -6056 -7465 -2420 10649 14520 12462 9276 -2687 -15047
13721 -15047 -11429 -7288 816 4103 7196 3069 -1704 -4267 -772 12239 11772 703 -3950 -3375
13707 -3375 4218 1116 -3467 -12056 -12510 -6975 -17623 -14240 -18053 -21562 -8492 2254 2423 7590
13693 7590 -2603 -1826 464 -4937 3232 15877 8522 -52 -12380 -748 15710 16262 13177 13267
13679 13267 21221 15561 6033 4499 5372 856 -1952 3913 7306 2225 -4841 -5194 2773 16186 22999
13664 22999 22362 16202 8502 15187 15399 18649 24480 17638 6451 2580 17338 19536 10007 2042
13650 2042 14744 15019 8400 7299 6765 20064 26748 24031 11002 11063 14634 13277 9728 15579 8702
13635 8702 15652 21148 7763 -1627 6317 15835 24712 9425 9254 7579 -3293 -5179 -8287 -13461
13621 -13461 -12382 -10028 -3429 -16227 -8335 -11126 -14542 1666 5685 -3281 -12274 9147 16175 10252
13607 10252 11300 20521 31503 24113 14661 26725 30269 26763 34076 37367 35711 24923 22934 41271
13593 41271 54269 67996 76715 74604 88499 106248 130546 161907 179728 195459 224614 243216
13581 243216 256513 258914 251821 240532 217403 191999 162277 138252 113546 92429 82194 76780
13569 76780 58988 57974 66811 62551 64816 68790 58135 55984 34684 29177 48181 57371 55245
13556 55245 55910 63294 68716 79859 105701 123552 153408 176954 190104 207360 223373 230146 236111
13543 236111 234067 223241 202714 176751 151177 129591 107900 107415 95021 83919 83222 90285 75210
13530 75210 61521 60481 66005 54144 60702 67909 61401 50356 44414 51531 46820 46349 47825 51026
13516 51026 65235 72460 64143 50926 41709 60719 77050 72594 69305 57171 46951 49136 42751
13503 42751 42614 55043 56826 50994 54387 58429 50608 48719 60114 68143 68988 62945 60722 72461
13489 72461 84820 90766 80124 70448 80944 81160 87949 98765 111947 109743 115691 103629 117678
13476 117678 131716 145767 164213 167717 178369 193838 203202 222870 236141 244202 272382 290275
13464 290275 302095 308933 328118 333055 337231 332288 316868 298431 291123 292187 304953 301860 300696
13451 300696 292574 276887 256860 232358 214757 217810 218957 213222 210112 207414 205961 200266 199392
13438 199392 222052 236216 234049 239151 254190 271385 281917 292689 304211 317579 330938 341032
13426 341032 362189 378884 389223 405492 412410 404058 399969 398463 392192 394179 381531 351175 340613
13413 340613 330776 314619 306663 279092 240744 216419 211504 214656 223492 222909 206585 192641 186967
13400 186967 179142 172866 162919 163759 163682 157679 144224 142975 135942 148639 148602 147816 161498 167368 151890
13385 151890 143664 137732 138319 129449 113627 104930 97470 101780 98708 101091 109808 105687 110599 123423
13371 123423 116313 118438 115725 108622 100358 93340 102985 99939 90949 81682 85930 95821 89855 106415
13357 106415 119968 120764 101072 80798 86803 77330 79314 75035 68454 68592 81978 87240 87524 87029
13343 87029 72947 66951 91717 106782 100253 93795 95653 97753 90642 76925 70422 63994 69813
13330 69813 83175 99150 102286 92207 87543 77187 77736 81402 75339 76365 84390 84977 91330 101170
13316 101170 101321 104815 113794 132442 143681 140189 146715 167235 177202 188215 192410 189401 200383
13303 200383 218217 223588 227395 264134 289839 300375 315051 346448 398885 460490 535449 624962
13291 624962 701277 770022 846872 906146 939867 924991 839938 735333 630371 519637 443597
13280 443597 393975 355633 337000 328816 308683 295272 293458 291128 278423 268112 265265 260068
13268 260068 251664 247301 245644 246212 255034 257575 255886 238307 232581 229926 220719 208871 210981 227839
13254 227839 235812 229532 229149 230973 219963 218585 211845 202062 213392 227969 235559 242897 231592
13241 231592 213660 207989 218641 221385 213516 194739 186259 179901 189249 201924 204828 205288 210356
13228 210356 216061 207606 192690 198765 187635 189930 205610 214307 217206 205968 190915 182494 184245
13215 184245 196520 207469 221047 228129 225789 215241 205353 210715 209707 223537 241933 259309
13203 259309 268050 267416 273902 279565 285544 288256 301509 311351 331612 343429 336170 337527 353925
13190 353925 371431 385680 393882 413912 441214 475603 518810 545490 584331 625915 679683 763565
13178 763565 857685 963436 1074885 1185107 1274532 1349069 1418847 1468919 1494214 1482604 1460278
13167 1460278 1400836 1328265 1266101 1200113 1138973 1093945 1059498 1042172 1042899 1066767 1080445 1086763
13155 1086763 1090663 1082119 1069199 1056348 1056905 1035748 1029472 1038603 1037430 1042557 1063671 1083950 1106512
13142 1106512 1158687 1232896 1308119 1408444 1495714 1570709 1640369 1697802 1729968 1727283 1707226
13131 1707226 1682110 1615397 1528337 1434722 1350917 1289843 1243566 1216805 1183324 1147366 1144189
13120 1144189 1161615 1176122 1176630 1182775 1186164 1187102 1179324 1185376 1188056 1161649 1142000 1142693 1129807
13107 1129807 1106935 1109715 1101396 1090553 1090025 1086163 1105472 1122814 1130607 1138019 1142931 1153718 1169486
13094 1169486 1188054 1192380 1198375 1208389 1220950 1236686 1255267 1272142 1308105 1357867 1389387 1422236
13082 1422236 1465465 1497921 1546761 1604715 1664782 1734877 1807825 1878891 1947185 2015524 2091329
13071 2091329 2162826 2272459 2403912 2524892 2640857 2768525 2909907 3056560 3220332 3377527
13061 3377527 3559517 3774610 3991883 4211649 4438282 4685188 4964707 5266903 5597697
13052 5597697 5967806 6385810 6840346 7342869 7915371 8548883 9252284 10034205 10926000
13043 10926000 11932952 13080853 14364496 15838318 17521060 19449615 21645876 24154766
13035 24154766 27015601 30235095 33780963 37621657 41631583 45668967 49594553 53217924
13027 53217924 56300822 58651902 60134166 60635886 60154366 58771569 56620309 53903283
13019 53903283 50841633 47674697 44556413 41598180 38902134 36520234 34455434 32704269
13011 32704269 31245009 30047196 29077929 28323821 27797547 27494508 27392347 27495139 27823252
13002 27823252 28383146 29183805 30258599 31642191 33350013 35415261 37841595 40639152
12994 40639152 43759986 47121816 50625412 54089023 57338058 60188372 62410278 63845109
12986 63845109 64354487 63911757 62548980 60368768 57555431 54311209 50841122 47344623
12978 47344623 43955064 40767834 37840090 35186408 32776154 30624802 28683396 26912186
12970 26912186 25287047 23800243 22442018 21189667 20041150 18983104 18005894 17109130
12962 17109130 16278252 15516829 14816991 14192649 13606705 13074024 12574977 12099689 11667882
12953 11667882 11278325 10919759 10575469 10252363 9954327 9672176 9443365 9221325 9008243
12944 9008243 8836221 8670535 8511174 8343794 8206425 8086537 7944762 7787794 7621069
12935 7621069 7466313 7286980 7088142 6870276 6644458 6420175 6188827 5968665 5751752
12926 5751752 5542368 5358340 5177073 4997312 4812208 4633734 4456782 4297780 4152256
12917 4152256 4019682 3881821 3738541 3612167 3497215 3382085 3278042 3160074 3046994
12908 3046994 2947308 2857887 2769944 2689203 2610001 2524134 2437397 2354934 2290414 2213361 2134797
12897 2134797 2074063 2024846 1980477 1922406 1861427 1812747 1766684 1705905 1647813 1616276 1582687
12886 1582687 1530082 1483155 1440592 1400394 1361505 1317138 1291521 1259958 1225358 1189263 1158324
12875 1158324 1143209 1114467 1099423 1078193 1047962 1016212 999542 982098 951528 928796 899106
12864 899106 875969 861479 858882 843169 813343 792855 771718 753982 726175 708869 688802 666087
12852 666087 649797 637978 621521 609557 600048 588851 579200 554301 551574 539880 518950 504917
12840 504917 490737 489436 496930 477279 467415 464509 454375 438016 426390 419035 424914 430049 425427
12827 425427 414594 400888 386905 387460 370755 365648 365301 358802 347673 340947 337549 331601 314759
12814 314759 301609 301641 302053 287503 283925 286053 259690 246538 230945 240795 248812 241243 227178
12801 227178 227338 220388 209678 212627 212064 218400 211261 217507 213596 207736 203392 185979 198738 215583
12787 215583 222451 224822 214554 197706 188442 188835 201721 202449 181539 183859 177458 185979 190122 193097
12773 193097 187464 167212 176495 170544 168426 165334 148544 156071 161405 151471 140853 138825 144278
12760 144278 146490 149257 149195 142764 148263 146394 141281 144757 152755 140774 135189 129848 125299 124150
12746 124150 121056 126694 128290 119127 124976 115565 124511 128140 131447 129717 135019 127807 125587 118975
12732 118975 116742 123052 129719 132668 128549 125221 124849 122752 120474 119380 107783 103906 103317 106331
12718 106331 107636 104342 100282 92752 95789 103194 99360 89907 84174 74241 62858 49633 51347 67691
12704 67691 87927 93162 95531 103234 96406 91238 96372 104300 98198 103986 112657 104256 108125 111105
12690 111105 101472 97982 103683 107305 95440 75668 72522 63668 57254 49172 42160 53470 68354
12677 68354 70392 68671 71098 83064 87787 95808 97552 88988 83213 83406 70031 85093 89102 74877
12663 74877 58917 39071 41185 61047 76588 73030 59344 41607 49545 45201 48062 57740 58922
12650 58922 62004 64083 41304 34787 34045 39371 47203 42961 56813 58943 59494 60480 68598 84487
12636 84487 81715 73045 58405 51384 48996 56100 53681 40943 40271 53211 58049 56626 59263 85654
12622 85654 89341 78766 80243 65300 53122 48834 47364 58190 64985 63733 62917 78599 76295
12609 76295 71249 70745 62921 77060 101331 113753 97716 86215 111495 136947 139485 137358 131246
12596 131246 144584 155306 174931 192182 206087 211828 218618 240691 263789 292301 308511 320895
12584 320895 320629 318005 324503 323174 304809 290162 280846 274113 260667 250613 242777 222889 214393
12571 214393 208786 210748 208129 198359 194351 194122 178672 172970 173668 183368 199890 210730 210921 220538
12557 220538 229234 225810 228169 245522 259089 263724 278610 312807 327430 320501 322806 335802 347361
12544 347361 340484 337509 345158 342758 325483 310154 297078 289222 271856 249291 237993 241385 226695
12531 226695 211108 199175 192231 182122 174481 166360 158259 132563 111190 119039 143459 147909 125853
12518 125853 134764 135968 129937 128360 129268 113940 106637 101604 96094 91629 95981 88293 69324 66625
12504 66625 62825 76574 86758 81746 95253 98544 86183 83348 82942 77826 75945 70631 64412 70148
12490 70148 67847 74952 85783 74595 69263 63773 63384 63273 56000 53507 60705 50714 41514 45977
12476 45977 53732 46757 50763 58173 51569 31776 33187 53301 57561 44289 33550 30404 37454
12463 37454 35600 24737 22669 36910 39886 45250 52305 47031 24733 20966 27672 28617 34175 33560
12449 33560 33778 32770 39907 38506 26259 15723 19930 27592 26613 24190 31736 48799 47641 39980
12435 39980 41678 37671 31492 32764 34713 30211 21779 12933 4670 8228 16534 25511 29140 29563 21356
12420 21356 14474 18389 15167 14682 14175 -4710 -7290 9032 22759 20709 21218 13989 12669 2361
12406 2361 2025 11385 17089 17885 27969 19631 10264 13922 22149 31227 32444 11889 1793 -4277
12392 -4277 -4656 7828 20658 35321 22264 17034 34474 36876 22607 19662 30533 32880 30600
12379 30600 22453 15804 17715 42437 46152 32747 24095 25460 15568 9984 11297 14947 17501 13384
12365 13384 18685 26930 32479 37608 42430 26950 21501 11080 387 -1553 -3824 -12926 1607
12352 1607 24633 30427 36785 32062 13901 184 -2174 -705 10804 14498 9667 1042 -13045
12339 -13045 -2137 7686 11480 10477 26031 37102 35563 23160 6706 9141 13706 19853 25077
12326 25077 35114 35603 22397 31616 48366 44375 33511 28151 35526 38593 26557 13044 6096
12313 6096 12895 20263 17669 24401 39872 31795 19487 11282 -459 -6854 -19664 -28610 -32640 -25095
12299 -25095 -23233 -16646 1639 4599 593 7004 12459 14731 15123 16582 15316 -17 -10123 -1343
12285 -1343 20339 27658 17199 13319 31085 23058 7348 6333 27762 29535 20193 10997 8875
12272 8875 -7417 -10986 -5262 4007 9261 16374 19402 15831 2406 -3463 593 16500 14737 5182
12258 5182 7119 1741 -6094 -1434 5481 11007 2266 2821 3403 9146 29044 18366 3606 4311 -216
12243 -216 -5929 -5908 7360 18390 8091 -19639 -15539 -5905 295 893 -7919 -1366 2834 2030 3015
12228 3015 199 6320 866 692 16476 6382 21918 36213 43542 55732 56848 47327 37666 23827
12214 23827 13957 14274 14633 12975 16480 30282 39134 46313 45548 41197 39430 41812 42861 39228 51967
12199 51967 73975 85111 96316 88683 90462 106436 111963 110208 101055 96734 94019 86767 56521
12186 56521 38792 46779 61168 54932 43823 47940 45852 33653 26240 34152 37722 25291 19823
12173 19823 11208 13507 20419 21026 13574 19817 23463 31969 34533 50197 58666 56899 53013 55588
12159 55588 58571 56795 45591 43255 37949 36029 40301 39451 35450 27457 6735 15659 34420 34210
12145 34210 36523 30985 34602 34962 31449 40186 36897 24695 24678 34196 31654 30018 38737 53839 60949
12130 60949 63813 58081 52369 59332 66150 51232 34963 34046 33486 28530 31532 53805 77217 83799
12116 83799 88030 85595 78184 82798 107341 103032 70723 54714 49926 54284 53604 56677 65183 63259
12102 63259 57306 63619 87065 105588 94822 91415 95741 109685 122859 134333 130581 131564 136047
12089 136047 133750 145578 157456 163566 162304 156238 147531 129668 135434 145768 126835 107716 107649
12076 107649 113683 133160 148769 165098 182035 195406 210258 213191 221802 222580 209351 198125
12064 198125 193066 188363 180288 161729 144917 139553 132309 127507 147164 149777 143997 131901 140186
12051 140186 145716 155247 166909 158132 160472 164698 177211 161030 152630 150704 142640 143797 156197
12038 156197 167818 166515 181093 189886 198084 195738 195686 201413 202227 213385 229229 248686 268190
12025 268190 276254 268882 273314 281182 303840 319685 320763 323345 328155 336768 334463 354219 367173
12012 367173 380923 391956 405580 404498 404242 415648 424956 433865 433887 447512 470474 493113 501308
11999 501308 523244 548505 585092 608578 636218 665705 691984 719891 753511 773362 801792
11988 801792 836911 871531 922244 974225 1019054 1069090 1130643 1201397 1270362 1327023 1388326
11977 1388326 1458842 1535442 1624774 1712213 1799314 1888337 1993968 2116249 2266794 2437232
11967 2437232 2616940 2810905 3039609 3310295 3602682 3928750 4295164 4721694 5207539
11958 5207539 5766790 6432273 7231575 8223393 9447670 11005436 13014706 15657905 19261941
11949 19261941 24294801 31401201 41160801 53240187 65392444 74850598 82127726 90116925
11941 90116925 98661300 103373321 99904536 88483822 72436286 56582251 44069574
11934 44069574 35022533 28524586 23725158 20085315 17254361 15016812 13230246 11778909
11926 11778909 10576281 9568238 8720350 7986517 7366471 6826140 6343600 5917850 5535638
11917 5535638 5191489 4886164 4610047 4361548 4161087 3975081 3812617 3662713 3510083
11908 3510083 3375184 3262187 3150066 3049957 2953731 2856027 2769401 2669033 2558301 2454917
11898 2454917 2339321 2222288 2115577 2007791 1912312 1829904 1755067 1681161 1621783 1563856
11888 1563856 1518395 1462586 1402856 1353471 1312129 1268581 1236873 1212151 1185308 1144770 1103625
11877 1103625 1064207 1027887 987777 938715 909137 898423 869539 865533 847840 830369 813822
11866 813822 776812 727582 708957 700317 686476 664153 646456 626546 609308 587871 567250 541080
11854 541080 516767 514653 510425 508222 502183 496217 487576 471075 450738 431867 430357 443342 425119
11841 425119 404652 397526 405239 400829 397631 387652 368641 360416 363662 343311 316368 313334 313695
11828 313695 291552 296126 304017 309522 308694 304510 319029 323126 290703 284657 264803 244040 225420
11815 225420 214693 229400 245326 271319 280915 261974 224467 212935 225791 219296 210305 191083
11803 191083 173719 167827 162109 155422 148868 142625 141996 147939 142812 134864 139025 138551 135181 123155
11789 123155 117544 129312 135383 133084 133600 137703 144915 139039 141082 154529 146591 141531 135613 124068
11775 124068 129264 116305 111091 101735 86513 81270 72397 61315 62803 68972 63915 58029 53075
11762 53075 52582 55287 59363 59771 49729 51007 65252 76178 69658 58237 56272 66150 60056 49787
11748 49787 30246 40764 53398 46228 47731 46747 38862 41917 41551 30153 37625 39310 29556 40154
11734 40154 31626 42100 41980 49731 57964 57192 53855 48589 41996 32446 27725 12627 2183 13415
11720 13415 29099 32645 19914 9422 12175 16518 16855 21687 24455 21826 13185 14172 11407 10821
11706 10821 13539 12420 12584 11869 7068 21471 27667 36493 58507 61738 51009 42893 42134 36103
11692 36103 30221 41867 37022 34447 41321 51417 51638 40894 24072 19046 29896 48426 57991
11679 57991 43297 40592 41497 43944 33349 35592 47344 45302 39833 31189 34581 43425 42188 48379
11665 48379 41038 35195 35163 31148 30051 31507 34727 33649 38150 34940 21523 26225 33714 42494 33831
11650 33831 34379 44944 49032 40356 40905 34320 35018 44555 44250 39662 36328 42412 48210 43823 33713
11635 33713 40975 56584 70817 73087 70580 67651 72780 82856 65619 54786 53845 62386 61054
11622 61054 60850 73284 70913 63268 59974 42793 39044 42507 56030 51568 39435 24936 18969
11609 18969 20565 29142 28456 17758 4322 11371 23057 27732 22369 13256 5878 -8235 5897
11596 5897 15545 12967 17985 21921 32655 40157 43120 53928 57552 57125 59028 57113 51102 60118
11582 60118 56178 56249 73826 77940 80291 81093 72676 55681 50845 47526 50456 52071 59882 49407
11568 49407 38060 27440 32857 24455 27980 20863 10627 14827 889 2332 3769 2702 7197
11555 7197 -1725 3814 3628 -156 4708 159 -117 3034 9790 19909 30920 37386 38568 30589 27598
11540 27598 31626 37227 39120 54570 58216 55195 55769 54488 50720 58819 77745 85939 82557 61403
11526 61403 56304 49303 31718 25164 2838 -12657 -1278 13992 25674 26971 16722 -673
11514 -673 -1071 3111 9051 6816 2147 -2840 10282 11569 23991 20969 15482 10029 11941 30361
11500 30361 32746 26653 37793 36945 28714 24546 25200 24245 29877 42681 46258 40505 37733 39012 43065
11485 43065 58752 57808 63530 50859 38326 31935 21912 29988 50759 38372 33525 28621 31621
11472 31621 38186 27596 31570 26698 12368 22873 24852 18762 21303 18700 24525 31208 24261 19426
11458 19426 24632 29426 34301 35263 28098 19069 10444 4034 1918 15765 12518 16123 46445 45947
11444 45947 39646 41883 53475 67078 67583 53186 36404 29829 35904 37678 39114 45159 41628 35750
11430 35750 35566 30138 30130 37271 28422 7179 -6182 -20057 -24325 -26396 -16920 -25003 -18300 -13897 -6242
11415 -6242 -7777 -6322 -10528 -16494 -18198 -24755 -24258 -28225 -18404 -13806 -20760 -18584 -6453 -8424 -12507
11400 -12507 -5216 -4080 -2186 -6257 -9331 -3828 -5344 -16454 -30833 -15003 2028 1596 20393
11387 20393 25465 20105 3597 -9524 -18018 -23316 -21200 -20112 -18164 -6007 2285 3718 3192 7446
11373 7446 20990 25922 11081 3049 -8113 -2700 -3379 -12439 -14575 -11437 -15626 -25993 -21630 -3227
11359 -3227 -5058 -10460 -12766 -13186 -24613 -19637 -13100 -16141 -15030 -3241 -2728 -591 -823 -2973 -23170
11344 -23170 -35241 -16915 -12052 -8294 -14410 -20215 -12848 -8953 -4886 -3826 -4698 -21818 -18668 -14355
11330 -14355 -16244 -15583 -3115 -8038 1455 -113 -1223 534 -16099 -23257 -24885 -27045 -27215 -29568
11316 -29568 -35181 -40593 -27971 -20695 -15972 -17162 -15262 -10813 7225 23606 22461 10505 -3198
11303 -3198 -1922 2166 -5219 -10820 -5029 3742 5249 -9429 -23014 -13256 -662 8286 8371 1869
11289 1869 -1820 -3282 -5732 4570 7600 21444 30002 19544 7561 -761 -6330 5900 -732
11276 -732 2829 -8504 -3908 1142 2245 8664 16644 13841 3825 8156 11579 17938 6094 -4003
11262 -4003 3631 13729 5296 2743 7363 7205 5834 2035 -8037 -9847 -7340 -10450 -8155 1612
11248 1612 1878 -7316 -23074 -29252 -23322 -21603 -32902 -24593 -14099 -17302 -6726 4298 -727 -5856
11234 -5856 -525 1431 -9666 -5542 -3726 -4135 -11566 -21914 -20653 -21120 -18514 -15728 -17725 -25577 -22507
11219 -22507 -22315 -22376 -26416 -26672 -38910 -31419 -16916 -20643 -18608 -16296 -11932 -20471 -26118 -27293 -18623
11204 -18623 -21682 -29294 -22246 -7705 -16901 -24537 -17688 -18304 -25103 -20084 -9651 -2762 -12936 -16559
11190 -16559 -19692 -13423 -12981 -29856 -20337 -6540 -14485 -21214 -13317 -12103 -20842 -19929 -8746 -6152
11176 -6152 -8471 -26525 -26059 -15303 -16940 -16469 -2552 -781 -12044 -16444 -8038 -5955 -4321 6383
11162 6383 1766 -6667 -7472 1338 8306 7292 1034 -6444 -11397 -23043 -33917 -23036 -21104 -25725
11148 -25725 -20381 -25249 -26440 -34873 -13190 378 -2397 -7197 1757 -3077 -20262 -15983 -10096 -16591
11134 -16591 -20571 -20408 -15800 -5184 -2007 15681 13388 -2475 -7947 -19158 -33360 -26680 -13458
11121 -13458 5744 2336 -22903 -34927 -28758 -17633 -19258 -27396 -27082 -9643 13132 6041 -3403
11108 -3403 -12141 -13096 -8051 -12915 -20736 -6511 -5851 -14537 -14204 -25355 -27402 -19655 -12181 4544 -3704
11093 -3704 2067 -4202 -12004 -19040 -23428 -24916 -18736 -20162 -31842 -25021 -26186 -15128 3229 -2719
11079 -2719 -16684 -19593 -22399 -11183 -10776 -14663 -14636 -8538 -6401 -14112 -25900 -15356 -11904 -8522
11065 -8522 -12096 -12949 -12439 -8894 -6647 -11339 -6846 -7292 -11046 2504 11191 12687 9743 22904 35069
11050 35069 24998 21000 22900 30438 38530 33561 40244 34571 19287 15977 31156 42080 52894
11037 52894 53005 62186 77690 86585 88589 82732 92863 92289 82901 88605 108187 110609 115107 118603
11023 118603 123252 105507 83104 75519 59251 53762 58176 72674 92807 97752 89090 91529 84854
11010 84854 89062 87483 73470 62475 58270 65030 62029 57673 51361 55990 49499 53447 57876 57093
10996 57093 53985 45512 35567 34316 31277 24020 20399 19230 35881 32360 20353 9595 533 1605
10982 1605 8895 3776 986 2177 -3844 -739 -2444 2831 10096 -91 5038 17086 20868 18717
10968 18717 1463 1827 -2067 4509 2333 -7111 -23538 -25046 -8307 -4234 -14744 -14608 -8709 -14384
10954 -14384 -13271 -11128 -17329 -15959 -19304 -30641 -28367 -24985 -24295 -13747 3418 13583 8303 -2403
10940 -2403 -5517 3178 -1196 2629 12481 8125 3647 129 -4729 -14750 -15107 -23485 -19025 -17877 -12688
10925 -12688 -18558 -15736 -14747 -21169 -29156 -11924 -15595 -20094 -22067 -24326 -18270 1371 -1471 -3471
10911 -3471 -14520 -23253 -34140 -43872 -30808 -25553 -34327 -20572 -7082 17 -356 7127 9448 1088
10897 1088 529 -4675 -4928 -786 356 -6083 -9719 -9354 -4888 -7748 -23579 -15684 -9036 -18828 -19232
10882 -19232 -10906 -869 2835 7953 10214 9266 15092 3891 -2164 -13821 1186 -9416 -19917
10869 -19917 -8758 -13500 1085 2488 2289 5391 -5863 -7331 -9151 -12179 -1678 5090 -2441 649
10855 649 4680 9684 16465 11709 4341 12342 18829 11017 -4582 -8959 -6128 -8562 -6950 593 8408
10840 8408 13399 15338 7048 1141 4150 3113 4787 7569 -3541 -27196 -39849 -28515 -23895 -22274
10826 -22274 -5457 2287 10047 17323 13589 12795 -4349 -15172 -11185 6341 12080 -12482 -30025
10813 -30025 -39349 -41818 -29175 -21046 -8654 1909 -2012 -20010 -24834 -12863 -3654 -6636 -8706
10800 -8706 -3977 -6594 -11980 -18539 -25492 -22242 -8241 -4404 11732 13027 10631 7695 33 508
10786 508 -923 -95 -14606 -12054 -1435 1413 -6980 -2026 9410 7683 19797 21431 7441 -5454
10772 -5454 1713 7022 3212 -3393 -4565 6396 5328 6528 2753 2639 9576 7575 5150 11517 20601
10757 20601 10864 6363 8030 7517 6590 9829 15652 28875 32525 20546 16399 15996 25938 24412 27429
10742 27429 30436 31076 22935 17486 3163 -2003 -12929 3028 10508 19622 20671 18320 17336 15377
10728 15377 23037 31130 26575 20243 25889 43584 35565 28260 23884 14915 7446 4882 9874 24497
10714 24497 31110 45761 39880 27004 33338 48256 55790 52178 35990 30967 36752 45014 43554
10701 43554 30364 34149 42995 47570 54428 51434 42910 40150 42960 36714 33585 50754 62168 69366
10687 69366 68471 73604 82767 92357 80935 75752 67815 74974 74632 71092 71378 78598 92200 105933
10673 105933 114160 121613 119735 119065 109446 108754 119949 130405 133572 146935 168004 165166 169833 180959
10659 180959 190087 202538 209492 224798 239555 258760 266010 271666 260399 279792 308302 324222
10647 324222 340875 363342 381985 398712 427127 452084 479592 525810 583035 638301 695069
10636 695069 744961 797173 873969 946930 1023610 1115415 1228667 1351656 1523173 1727309 1978884
10625 1978884 2300654 2692128 3170726 3713223 4250208 4788668 5316277 5821233 6285730
10616 6285730 6684385 7001593 7280870 7600684 8053155 8671771 9406670 10186081 10959060
10607 10959060 11731135 12458684 13052674 13409833 13493353 13402005 13365010 13544408 13990787 14651493
10597 14651493 15363080 16043963 16673514 17207025 17470150 17307550 16685417 15796271 14892886
10588 14892886 14179808 13750996 13559111 13488141 13469459 13458632 13397178 13154015 12619701 11803748
10578 11803748 10830532 9872515 9060967 8460278 8019211 7682847 7414286 7173208 6902916
10569 6902916 6550652 6080508 5502201 4860865 4240195 3687149 3216419 2828260 2519571
10560 2519571 2258742 2033804 1861113 1716102 1600713 1501300 1414726 1332929 1251623 1170456
10550 1170456 1105122 1046298 990014 938636 892933 852220 831609 798985 759152 723683 698129
10539 698129 678236 642410 620786 603187 595588 575499 555594 533882 528231 517507 502982 479231
10527 479231 453269 431676 413786 387844 372113 373256 367016 360475 353951 353191 342744 337431 331576
10514 331576 308284 294136 273697 270916 267955 268213 246624 249532 250028 234179 225125 224781 224513 206769
10500 206769 189571 181647 182878 179742 171261 171991 179473 177599 160561 150404 155899 143936 138081
10487 138081 134461 119897 115110 123528 128285 118492 103757 106091 107639 113389 128359 134596 133189
10474 133189 128695 123695 105472 101591 106119 106327 97577 83373 85794 89588 85232 90395 79542 79925
10460 79925 86533 77900 49328 35952 45951 50686 53706 64186 73120 59319 50926 67117 78824
10447 78824 70355 52952 50022 37420 20067 24339 35915 33093 38633 48094 45105 43282 42452 34230
10433 34230 34898 31166 33464 39242 43830 50676 59130 51317 31169 16671 9322 22580 30202 27864
10419 27864 31932 39648 22042 1015 2887 11581 16145 28339 25106 20813 23030 17795 10661 14740
10405 14740 26280 29882 34554 30771 22282 15826 16580 30978 30835 21508 9383 5370 16116 16190
10391 16190 13334 5800 1678 2798 1121 -2212 6357 6622 2975 -15280 -18990 -13581 16981 34443
10377 34443 20267 2706 -4749 2781 -9008 -3357 -4749 -15333 -12775 -7806 -7505 -4146 -5243 -4642
10363 -4642 -2271 233 -12594 -14453 -19188 -21192 -23404 -23765 -17363 -11673 -16577 -16932 -25247 -27980 -26316
10348 -26316 -32035 -47073 -45699 -37746 -18983 -9654 -3001 -5302 -17087 -26538 -24413 -42288 -35255
10335 -35255 -27266 -38606 -38979 -28572 -26073 -23947 -25213 -28384 -15474 -647 2588 -4347 -22373
10322 -22373 -21245 -13703 -15575 -24844 -28476 -9031 1351 -1771 3613 2932 -3874 -13976 -14551 -10181
10308 -10181 -12569 -5052 4135 -5549 -7124 6295 -12261 -16363 -7926 -5606 -4796 -3402 18331 27345
10294 27345 6868 -3636 -793 -14127 -12214 26 -3988 -6909 -11797 -10158 763 -4542 -3484
10281 -3484 -15730 -19129 -11844 -9236 -7276 -16969 -25864 -11102 5195 7600 -176 1718 7413 14861
10267 14861 11750 6920 -14767 -24913 -10434 -7280 -16772 -12740 -10611 -2109 7084 -3272 -16513
10254 -16513 409 5725 2459 -7111 -9671 -12554 -18377 -17045 -12974 4884 12768 16174 -2132 -17054
10240 -17054 -18472 -16173 -10379 8128 7377 -1101 -7964 -5973 -16585 -28654 -24380 -13883 -9061 1006
10226 1006 10067 15925 6252 -3663 -15402 -11383 -6140 3004 5064 -11112 -11264 -832 6273 -3141
10212 -3141 -6304 -4403 7885 2845 -8769 -19155 -9346 5173 2815 688 -10570 -1848 -1878 -10709
10198 -10709 -9426 -13113 -11297 7140 9532 13914 16579 16637 -85 -8666 -5310 -12512 -11607 -4994 -923
10183 -923 183 12045 15787 25961 28908 26678 24163 29623 36899 34891 45155 43500 33292 33544
10169 33544 47532 53455 62618 72777 68412 65565 67480 66487 69661 59243 68637 86487 93418 81558
10155 81558 80227 80776 66013 37309 34287 51674 69372 73468 59647 69813 62555 62574 65135 61383
10141 61383 53427 48507 56655 62678 43064 30741 42547 55631 59152 47265 49161 48808 42370
10128 42370 31954 18918 10934 3670 -5022 -17227 -7036 9548 3375 3572 -12073 -6438 1640
10115 1640 -3647 -4054 11387 21726 17789 10988 26598 28846 23333 18872 15282 16514 17106 15426
10101 15426 5267 -10822 -23481 -17118 -10872 -13192 5320 1672 -589 21252 22699 13025 -5223
10088 -5223 -11341 2589 9494 7945 4889 9652 2748 2027 7195 6581 6350 10739 16931 10270 -7106
10073 -7106 -21369 -17061 -16276 -22435 -30297 -18274 -8215 -11645 -3839 -7691 -7701 2182 -2612 -21805
10059 -21805 -17671 -22232 -12980 -16137 -11199 -5020 -4135 -4953 -49 8341 4304 -3384 -10989 -21044 -26923
10044 -26923 -29663 -29643 -21175 -18706 -6262 5647 15207 11180 3519 -690 3083 15769 17908 -438
10030 -438 -8383 -7828 -9054 -3595 -2006 -12403 -9737 -3033 4482 -2282 -4071 2136 4268 1274 1190
10015 1190 3249 11544 -326 -5107 -10864 -16134 -15463 -15368 1694 16898 17436 9775 -608 -642 6157
10000 6157 13740 20128 8382 297 765 6640 11353 17466 38429 50946 51612 57236 80908 89897
9986 89897 116500 169542 237202 286317 309190 338234 354845 357750 349495 333398 271351 209212
9974 209212 170607 134006 95181 74359 52412 43266 37933 46844 47071 42056 40233 33913 22425
9961 22425 13416 15690 23360 14103 10338 6513 -3583 -1382 10357 6902 5938 -6250 -4028 -11184
9947 -11184 -8976 -2310 11075 13622 5433 -3781 -7121 -23703 -2433 1274 -11 9670 7030 10717
9933 10717 16437 17142 11272 9373 1267 -995 17650 23183 17219 17021 22706 16537 6682 13216 15933
9918 15933 10879 15921 20422 26867 30315 43202 42248 35586 33924 28633 12350 8096 7395 6233 13165
9903 13165 20457 11218 5035 -3908 -8886 1827 5697 17247 9283 8205 10040 15713 20376 12846
9889 12846 9484 14643 13679 12039 4514 -1292 -4819 -4071 -7996 -14377 -12659 -14353 -13459 -18387 -13593
9874 -13593 -7375 4272 17547 20326 7617 -17435 -25345 -4118 6815 412 2171 7496 5503
9861 5503 -2130 -11036 -11382 -4625 3267 4509 1247 -2449 1666 8851 3539 -13376 -21288 -23249 -19664
9846 -19664 -1092 5314 -19696 -32462 -36993 -28313 -26097 -23979 -20078 -17488 -17594 -23479 -20459 -4420
9832 -4420 -13591 -23176 -7330 2475 -6824 -57 -597 -3398 -4289 6106 4907 -12980 -20935 -12086 849
9817 849 -183 126 -5648 -1802 -3346 20 17105 11226 19433 12599 -8845 -8569 -20778 -32504 -35298
9802 -35298 -30200 -26907 -16735 -7837 -9179 -9116 -4357 -19847 -30605 -21808 -25920 -18538 -16122 -17807
9788 -17807 -5491 6040 -3052 -12934 -14288 -16835 -16175 4393 19779 5813 1715 18008 19313
9775 19313 22195 18333 5819 -1064 -5869 -8549 -17651 -21521 -8759 -15620 -20239 -19948 -20818 -15639 -15109
9760 -15109 -13605 -6082 930 -6550 -4470 -8448 -11472 -8603 -1949 6657 12675 20595 11395 12658 9450
9745 9450 4922 8203 -1920 -22963 -21625 -26169 -21723 -22401 -23719 -19420 -7315 -7128 -14606 -21338 265
9730 265 10676 2792 -8393 -13304 -9589 -22388 -23617 -17976 -13510 -16104 -11094 -4484 -12609 -23922
9716 -23922 -15794 -2002 -6474 -2774 -1152 -6631 314 7438 18839 13296 -9323 -14125 -19156 -15155
9702 -15155 848 -15116 -24225 -18185 -15053 -811 8067 -5295 -9454 6769 9801 11160 12825
9689 12825 -1814 -10506 -173 8573 -3745 -8296 841 12002 23143 20745 12127 14994 13329
9676 13329 13805 29590 36996 42889 29062 14872 15292 -5871 -6948 29 -7125 -4286 -9014 -11436
9662 -11436 -194 -2119 -3358 960 12395 12039 12089 2892 6363 6489 -6439 2422 4995 -7579 -1483
9647 -1483 13876 7013 7837 10250 16498 16131 10650 4127 7786 14781 3924 4018 13825 5961 1681
9632 1681 2522 7604 10314 14047 19890 12130 7120 5173 3461 15076 7901 -2034 -4100 -9506 -4616
9617 -4616 -2395 1310 -11843 -24293 -27670 -14628 -2996 10570 10850 5081 3261 -192 37 857
9603 857 -9406 -6870 -6499 -6510 -3583 4650 26302 22029 20437 20116 24828 25630 26267 23958 22733 27010
9587 27010 23198 34960 45855 43838 49140 39186 28596 14501 3476 10053 17336 -3199 -15290
9574 -15290 -24238 -29227 -20828 -17564 -2605 8553 15470 25929 34573 32779 23543 25192 38158 37480
9560 37480 36229 33007 14314 274 -4057 5043 9054 5165 -7431 -11672 7069 6804 -9053 -15792
9546 -15792 -16162 -12157 8870 20660 17407 11537 14764 17005 27934 25662 19183 8355 17542 33047
9532 33047 28700 8168 1736 3173 12815 3411 2679 17674 10534 3312 -2213 -12694 -9602 -4381
9518 -4381 3888 6695 4526 -933 -2907 -1923 -12643 -2254 10309 4791 682 3073 1471 13001
9504 13001 31352 30478 25910 44924 43602 27190 29503 30176 24585 18811 23121 18306 8472 3432
9490 3432 6376 9020 5741 1174 3659 11927 2735 4502 2373 10938 18997 30025 31522 25957 24675
9475 24675 18222 16928 31504 43455 33042 19611 12110 10961 1892 -4346 -2209 9472 21162
9462 21162 22712 19294 33255 37212 36305 27755 38688 47712 29237 23896 16259 10971 11043 23087
9448 23087 32172 32117 32177 33470 38645 28975 25705 38982 40423 35002 36643 32830 39373 43754 56725
9433 56725 61612 52972 50255 41132 44440 50750 47164 50888 52786 46130 42929 44723 50574 44665 43981
9418 43981 44163 41316 32334 30885 38635 51266 49820 41325 34458 38772 49964 58572 54362 42778
9404 42778 30298 25238 22971 27140 56918 64162 59485 47443 29195 20799 33793 48041 46579
9391 46579 61795 54703 46388 47761 33971 43504 49309 52722 61357 68585 63884 46565 47883 47064
9377 47064 54734 55219 55977 70592 55801 59082 74154 83869 77803 72062 83674 92497 101544 102313
9363 102313 111634 115849 142197 164117 171691 195315 213259 219990 222074 209093 208328 209215 196667
9350 196667 182956 166353 154408 146832 130632 129112 126076 108686 110054 113337 109536 102442 108894
9337 108894 115022 118142 130597 123929 114248 108899 116020 119593 124049 124389 114180 113478 120713 115938
9323 115938 107033 107730 101432 103419 102884 89991 74012 78695 83667 83376 92630 88124 76259 67177
9309 67177 76461 77562 82575 97130 102924 102485 94553 82731 74439 86199 100985 101461 112565 109886
9295 109886 90903 91036 106574 124613 132878 137491 133494 141486 144319 158763 175532 173901 173865 172471
9281 172471 171687 172379 171899 159578 159580 167529 181985 193817 196797 197221 196602 194131 199269 209092 225056
9266 225056 228984 243026 261954 260045 267545 279653 308184 315303 341378 371341 372952 380996 383517
9253 383517 385228 402212 435090 477474 518416 555231 583745 624220 664184 717271 787900 868107
9241 868107 946090 1038188 1125943 1223806 1341180 1470836 1603716 1750900 1886456 2024114
9231 2024114 2178308 2297133 2408430 2508601 2578062 2630530 2632800 2594096 2534198 2464216 2366149
9220 2366149 2273609 2164337 2031034 1903344 1796542 1680386 1567291 1468919 1383971 1308956
9210 1308956 1236403 1163829 1093346 1037609 996182 959016 913073 872045 840228 811242 778551
9199 778551 754203 727776 703625 674707 640930 635919 622974 599834 576116 555123 555090 551257 535538
9186 535538 533150 525562 512928 501281 486146 491568 499657 500903 500571 494644 476459 472089 467168 460004
9172 460004 458160 445761 453532 451192 430443 427215 426279 429687 426841 422721 429481 422408 403861 392304
9158 392304 398667 399640 397484 409027 415998 420145 426230 417858 391430 397985 403047 400661 411235 408672
9144 408672 389907 383321 383144 389377 380738 364734 342606 336076 337681 334482 346384 356701 350320
9131 350320 341541 355566 366794 363703 361194 369192 364608 368462 370542 376662 381150 377753 372523 378491
9117 378491 381288 379915 390302 413714 424437 428920 432168 440831 454209 458287 461718 478842 495040
9104 495040 516739 522863 534315 564489 560741 558924 565660 578465 594542 615038 647163 675945
9092 675945 697491 732419 767898 794001 823971 855033 898266 933700 955481 979963 1005191 1013340
9080 1013340 1002367 993230 984340 951884 920669 880430 858080 861574 842983 820352 796794 769532
9068 769532 754911 753625 745930 759287 755824 744463 743259 743018 749723 746071 759984 774041 783688
9055 783688 782740 770675 769011 773180 787985 806577 812012 818225 829685 841777 857149 862658 847618
9042 847618 849876 848601 841247 862678 871197 864897 857198 862286 881932 894243 898031 906070 920351
9029 920351 933158 938082 955405 979437 994272 1002307 996630 999635 1020453 1041096 1051874 1061136 1062550
9016 1062550 1094755 1118954 1128328 1164175 1180218 1199928 1229838 1249231 1277991 1313427 1357696 1389451
9004 1389451 1427920 1443579 1459335 1481798 1502412 1523020 1545029 1569845 1591451 1597606 1615640 1649272
8992 1649272 1683668 1727616 1767665 1819692 1865080 1928248 1998052 2060751 2130723 2210537 2298385
8981 2298385 2400797 2502827 2618498 2768865 2921535 3093896 3275066 3482500 3722220 4005128
8971 4005128 4318119 4693836 5127685 5607731 6161236 6853046 7702638 8763128 10145982
8962 10145982 12060961 14770027 18528839 23315001 28327444 32256474 35202412 38350169
8954 38350169 41589907 43230641 41628912 37063670 30827711 24683931 19839318 16367079
8946 16367079 13918481 12124037 10768785 9733978 8913103 8250477 7718728 7266692 6857938
8937 6857938 6510876 6190684 5903537 5680167 5497232 5335382 5215978 5117263 5022709 4954115
8927 4954115 4896263 4858598 4833910 4819332 4813282 4818453 4830340 4847973 4885611 4925810 4954687 4996499
8915 4996499 5065829 5134926 5210584 5298712 5400174 5490620 5597233 5714923 5845646 5989407
8905 5989407 6127951 6265852 6417752 6576696 6740746 6919940 7106048 7305958 7514608 7720446
8895 7720446 7946065 8179991 8427983 8700611 8970656 9259623 9562066 9894393 10260570 10637191
8885 10637191 11040652 11494261 11987229 12492972 13003496 13546037 14111724 14718105 15343760
8876 15343760 15981205 16652233 17385377 18170116 19008640 19925593 20922157 21981070 23111095
8867 23111095 24323881 25662897 27104624 28653064 30333914 32179392 34196014 36409902
8859 36409902 38835015 41492983 44431629 47697292 51337466 55382092 59884802 64921915
8851 64921915 70539106 76809134 83850525 91770790 100695379 110745373 122118946 135063917
8843 135063917 149824354 166693370 185991655 208027971 233057040 261185572 292266958
8836 292266958 325776439 360742600 395782326 429237786 459276961 484120040 502190057
8829 502190057 512117886 512907617 504358509 487183862 463082100 434323266 403248923 371804293
8821 371804293 341383606 312856077 286657509 262973133 241765161 222855161 205986322
8814 205986322 190919268 177426639 165314426 154412161 144574459 135709088 127685193
8807 127685193 120406506 113805676 107840829 102434210 97530618 93074685 88997360 85262025
8799 85262025 81816722 78641011 75701281 72973438 70400492 67939719 65601850 63415778
8791 63415778 61416413 59580509 57872742 56275358 54794699 53416636 52154115 50981177
8783 50981177 49859535 48804249 47803070 46869738 45990805 45186965 44405532 43668076 42984890
8774 42984890 42323953 41710388 41147425 40608510 40090040 39600589 39129446 38674691 38228107
8765 38228107 37780970 37348132 36927491 36528726 36139817 35764858 35392533 35015914 34624110
8756 34624110 34239473 33850337 33446216 33023957 32613740 32208241 31780229 31323133 30857614
8747 30857614 30390031 29893769 29384067 28857372 28310931 27763596 27210696 26660856 26085528
8738 26085528 25487550 24884765 24286738 23686150 23066775 22455338 21874853 21283374 20707694
8729 20707694 20125204 19533787 18960608 18388093 17829152 17280002 16764695 16268109 15775706
8720 15775706 15283133 14800191 14345166 13916324 13498060 13064255 12654781 12285209 11926160
8711 11926160 11569140 11210506 10863890 10537644 10224196 9914090 9629090 9349344 9074633
8702 9074633 8805879 8562879 8330804 8099830 7874648 7648787 7424077 7203134 6993499 6796770
8692 6796770 6611818 6421930 6237767 6078487 5915357 5751215 5587058 5433730 5292180 5157251
8682 5157251 5035501 4918049 4802247 4691233 4585588 4473341 4374284 4277307 4184173 4097071
8672 4097071 4007667 3925836 3831654 3751497 3672593 3592678 3512934 3439316 3357605 3287055 3227483
8661 3227483 3149920 3057957 2976265 2899377 2818844 2751843 2683077 2625802 2572089 2506568 2463891
8650 2463891 2428702 2386010 2354413 2313740 2272000 2239860 2202346 2171127 2133737 2105851 2075319
8639 2075319 2044982 2011553 1982851 1940444 1899949 1866746 1843839 1830089 1820615 1785170 1748575 1727863
8627 1727863 1715299 1712529 1734219 1747302 1736942 1728743 1715383 1710615 1705181 1682460 1647308 1622375
8615 1622375 1578791 1535752 1496260 1456174 1418087 1378706 1351537 1345736 1321083 1285767 1250202 1234682
8603 1234682 1231867 1221096 1192910 1178623 1172341 1172032 1150662 1139383 1125134 1112664 1114025 1110919 1102862
8590 1102862 1083480 1083676 1095109 1076743 1062586 1070353 1056200 1047714 1038997 1037397 1044542 1059451 1055874
8577 1055874 1038152 1022681 999533 978412 964612 958751 949654 933413 926219 899664 894036 892584
8565 892584 876067 865894 850078 832052 821377 810248 817119 832521 837302 847766 842881 845741
8553 845741 858068 871091 885809 895088 911670 918236 903235 877090 851504 851019 837248 801209
8541 801209 780292 769341 750966 722386 711831 704748 723191 720914 702179 699367 687203 690888
8529 690888 693116 682144 669930 672596 694602 702065 693565 686521 696169 695038 687179 689861 681697 669838
8515 669838 667468 663697 654833 636287 617747 612088 602131 580808 569735 566331 564940 570653 581872
8502 581872 578867 578950 562462 556311 553859 543417 550313 542265 530995 525638 533618 530966 528295 532673
8488 532673 534125 520029 518497 515431 515625 496983 490626 504608 507164 508942 498249 500985 525461
8475 525461 533886 523319 512237 508482 510654 526262 528321 532530 530330 533538 544627 560014 577644
8462 577644 589831 599730 619303 631753 639108 644769 648449 661910 681234 706883 719460 734627
8450 734627 762504 794941 827055 861299 893995 945632 1000651 1062296 1139353 1209618 1290407 1386025
8438 1386025 1489612 1606370 1728066 1853449 2004391 2155876 2297882 2435819 2559177 2681291
8428 2681291 2781919 2845967 2876051 2882266 2864959 2823876 2771819 2670936 2553221 2444601 2338821
8417 2338821 2234933 2130614 2039779 1948573 1873056 1809866 1765973 1729812 1706606 1684146 1686765
8406 1686765 1712802 1770798 1858035 1978492 2167742 2472238 2952802 3702928 4675257 5578357
8396 5578357 6149176 6617764 7296521 7982622 8151721 7553120 6406790 5077056 3958339
8387 3958339 3168940 2642661 2279781 2017900 1828025 1675597 1541592 1438724 1343731 1271508
8377 1271508 1191285 1122195 1062662 992016 954633 928317 892468 860820 847035 831885 817565
8366 817565 806044 791311 777390 754279 740768 732588 709570 703282 680515 670772 674230 681806 678080
8353 678080 670671 662562 649919 632757 616154 627397 631270 611665 598456 589797 586493 586476 598903
8340 598903 599355 599915 597495 593333 579024 567528 564632 571995 573147 552749 545277 542028 521009 515649
8326 515649 511785 508916 498597 496427 494820 476951 481694 478276 468609 460222 462528 456583 461827 464432
8312 464432 456909 452475 461329 451013 461486 471480 473137 468379 466064 459557 433874 424185 425194 424963
8298 424963 431067 442517 433968 424145 420685 436546 452127 445434 453451 468940 458623 452580 463232
8285 463232 450516 433356 426827 413233 398035 394487 388031 378137 379994 378615 394783 390066 394728
8272 394728 401927 392908 407554 400574 390427 394698 399807 390346 389752 388388 364558 359082 361097 346652
8258 346652 345682 355698 354327 347786 354565 359424 359584 359337 357190 354246 344310 349111 349681 333759 344531
8243 344531 350542 351903 345180 331824 318920 309957 306855 311114 308958 305991 300397 287175 293972 304839
8229 304839 306699 313142 312059 302650 277992 254052 244931 243360 237979 226137 221868 224568 235132
8216 235132 232801 224683 226099 224497 227230 225858 220790 211298 197317 205875 207778 213675 219794 206278
8202 206278 208417 209155 219248 235051 245288 250006 247855 236883 229908 234222 240623 225928 220133
8189 220133 226847 228174 213185 198348 188291 180226 170740 169686 178337 187678 186184 191631 200961 202477
8175 202477 190747 179218 165740 173404 186919 188115 189623 181177 162956 158518 170139 178325 182229
8162 182229 180138 181865 176652 182924 197228 188231 194256 202647 198336 187315 177231 169256 177056 197096
8148 197096 206788 202156 203924 192694 180404 174029 183565 176887 174695 184772 199914 190501 187882
8135 187882 197804 199785 188886 174681 163999 149464 138066 144252 148169 142575 138873 143786 157480
8122 157480 164961 168417 169216 180959 184064 173649 172565 181393 183033 178527 176522 173359 171342 152996
8108 152996 156787 153862 141515 140124 151560 158327 165614 160933 145808 142023 131951 123630 122008
8095 122008 121530 113054 107186 109686 126528 134639 139415 129548 120828 121349 134809 137266 125999 109515
8081 109515 121121 120949 103121 97085 97897 86428 92049 110582 116320 98826 98035 88640 101097 123874
8067 123874 126587 124697 113018 105750 95761 96795 91385 94353 112588 109664 112001 112407 115230 105305
8053 105305 97591 99428 101650 106383 99708 88149 75923 69222 80829 85738 76536 85508 82968 102410
8039 102410 115919 98529 91665 98931 101858 106413 91095 89347 104754 111156 114422 106421 116651
8026 116651 120896 115646 110467 113667 120895 124055 132788 136171 135491 124291 119746 119480 113653 116296 108901
8011 108901 113349 101755 111864 113555 115808 115519 100708 91908 106901 129415 132234 142269 147304
7998 147304 144079 146892 157833 164735 149375 141821 142832 140254 134567 127793 111766 118711 112826 105109
7984 105109 117519 115480 117209 116629 112368 113612 138269 145686 129092 128890 136710 125746 132067 152159
7970 152159 154630 139718 153882 173285 161844 152135 138609 128044 133026 143275 152923 157691 154556
7957 154556 151826 164636 166626 157884 147176 145694 150434 145068 142379 145363 150482 142261 131652 131129
7943 131129 125474 113522 118880 124202 121716 114506 117199 126065 115433 106354 110580 100668 96146 99432
7929 99432 102074 100756 110983 115304 113264 112494 114616 117490 123787 127187 122980 130197 155798 165457
7915 165457 187943 194532 187543 196866 194376 181591 171302 168608 159948 159716 161831 154834 149084 144989
7901 144989 146237 149988 138580 131884 135219 131853 113226 89381 83306 80652 82626 79027 78159 82465
7887 82465 83832 75737 72252 72399 78706 79933 81798 80433 78581 73438 77899 79559 68084 68671 83505
7872 83505 85736 90670 86960 94313 104117 104600 102803 108016 103805 99496 92528 97917 99582 94773 90838
7857 90838 94062 88449 69756 69766 77647 76618 86613 90720 75457 80081 77314 80491 86063 93176 97890
7842 97890 89539 73553 60681 49956 57679 68184 83829 72701 63180 82650 92903 82189
7830 82189 59486 45604 66831 72891 57963 58202 66407 76705 78899 77182 75394 68874 76675 80928
7816 80928 79807 83204 91365 91997 95319 90438 87286 66415 46889 49282 63440 71811 68858 68618
7802 68618 65552 62588 59110 71757 74050 66501 66581 69488 59638 54963 49004 50454 44124 49214 57978
7787 57978 54375 51751 46633 45270 47300 39743 43432 53900 66639 60834 57533 56966 54995 50937
7773 50937 42547 49937 53606 57899 51092 35753 33252 47974 53789 54707 61030 68784 61040 56722
7759 56722 58053 46635 41031 31108 25998 29494 30797 40623 37707 46241 51818 49182 61616 53834
7745 53834 36924 36511 39640 44697 33417 27613 26499 24480 30355 23062 19778 29638 40618 35127
7731 35127 47653 45686 40955 43190 46384 52405 38372 38061 43573 32867 36249 35954 32649 33148 36439
7716 36439 47783 44485 22058 13326 19506 15735 20064 14708 33207 38351 30991 37877 41711 28857
7702 28857 42396 37635 42014 42209 29901 22874 13897 18242 36388 53633 42012 35323 36941 42209
7688 42209 34061 32289 31031 39748 36629 25579 22148 28770 33399 37853 46831 42876 39939 41318
7674 41318 35562 36277 47948 39878 43840 39149 39282 42322 32061 23906 30344 23295 32489 47131
7660 47131 35327 31073 32340 28432 23720 15583 -12365 -14002 -2436 16803 12590 25845 42944
7647 42944 37255 26224 16439 10589 17094 25372 23299 20223 19746 17509 29156 34663 40033 26545
7633 26545 25763 35257 48752 49932 40388 27657 14969 14947 9308 16354 12272 12036 21296 25090 32021
7618 32021 31876 34186 31230 30541 36826 24760 11977 25664 37900 16791 4382 -2456 3026 -8200
7604 -8200 9646 16683 15876 11120 13903 19732 14496 20316 18093 5413 15966 25578 25388 15178
7590 15178 20187 28001 27384 25790 21345 14175 11113 13583 24804 37746 44529 49500 48625 46577 41222
7575 41222 38140 37960 39360 31604 30082 26779 23220 32668 31144 28652 21337 7755 17743 16643 29506
7560 29506 36799 20356 20111 26526 35783 35617 28483 21126 19981 20101 22248 12708 4348 16404 32210
7545 32210 29904 30155 37350 21231 25258 38729 34937 38739 26710 15320 16753 20154 11276 18762
7531 18762 21984 20215 20843 14722 19969 36960 45491 36736 30790 26364 21278 10091 496 1689
7517 1689 2415 10157 19691 15547 12935 14377 12410 14055 15910 21552 17904 3483 1934 13256 15865
7502 15865 18160 19673 25358 29888 28428 23219 22331 30680 29623 26928 29725 30621 33376 26398 18652
7487 18652 9360 16430 17871 22181 21475 26621 25303 28817 21829 13155 6840 3043 9371 25965 37185
7472 37185 24139 15189 15381 10865 25160 33670 21473 16934 16403 16150 11562 11171 14707 16890 14863
7457 14863 9530 9949 15515 12703 10964 18883 25139 21699 27281 31679 23285 21227 16699 25627 8584
7442 8584 4452 11298 17907 24756 20207 9612 1608 -2902 -12422 -13011 -1766 9456 16305 14660
7428 14660 13362 1876 349 2020 2213 -1966 1097 -4015 -4873 2933 23019 27850 9292 14829
7414 14829 19958 11183 2868 3678 10889 29394 48903 43366 31818 14952 11759 15346 21414 23837
7400 23837 31318 27029 4870 1759 6926 1535 8055 11941 1477 1111 2159 11719 24703 32239
7386 32239 20475 6678 4605 -3186 -15075 -10576 532 8569 12592 5777 11489 12963 23058
7373 23058 40598 38076 30429 35346 30425 30023 28811 28775 27603 22227 9286 8049 20867 30424 30971
7358 30971 27465 20415 24133 24480 10441 1416 2368 11266 11915 8466 -4037 -4652 -6701 -3669 3954
7343 3954 5615 3183 7067 13951 23459 25946 30817 29292 40662 30939 13139 2341 2670 7442
7329 7442 7055 4428 15639 18443 1181 5082 10501 17366 18119 31234 31374 20096 26778 30723 34464
7314 34464 44925 41131 24619 25580 23213 21196 22489 24707 22441 17848 15176 30296 28510 31486
7300 31486 36320 24340 7041 1864 7342 9870 21540 29779 34045 31940 26185 30242 31101 25562
7286 25562 10681 1332 4667 8034 18031 29992 22659 23002 9677 12264 4625 -8486 -2064 8876
7272 8876 6856 7846 18703 24063 29530 33390 26256 11295 1299 887 -2712 -5191 -2577 17233 13484
7257 13484 16630 20358 2838 -4990 7553 23375 27785 23037 6549 8951 10419 10673 10364 2991
7243 2991 -8 14507 29441 29930 6420 5164 5773 2045 9735 14914 16946 15570 24895 21361 16802
7228 16802 26661 23516 16457 10068 19373 17104 26759 43416 45963 30678 16928 13626 17607 30531
7214 30531 32765 22875 18136 18952 2459 -4669 -850 -10288 -9985 6179 13608 16429 23747 33157 35685
7199 35685 40232 32802 29361 31076 22117 9203 2269 13469 26572 19804 9600 -2827 -7465
7186 -7465 -6904 -5851 1316 10704 7588 6994 18631 25685 20802 18915 13985 17816 21898 26580 28664
7171 28664 26013 24474 16563 12009 12850 15446 6538 909 -3178 -3393 5278 14312 22219 17973 9967
7156 9967 8460 -7204 -1199 20529 25681 26381 27803 29843 16755 6407 5320 166 3166 10750
7142 10750 10927 7547 -4087 -5967 -5462 -1194 8485 29961 31154 25736 14590 17588 14187 6380
7128 6380 17231 30903 17635 7502 7057 1438 -4790 -3239 -13 6516 6937 12853 14450 2756
7114 2756 -13131 -19029 -3782 5545 -1741 -8708 -20778 -26420 -17429 -4576 2313 19492 27425 29438
7100 29438 21124 9187 9132 2915 -5484 -12390 6149 17550 -1497 -11677 2806 7450 1284 -116
7086 -116 15412 25120 23551 10555 1345 2846 -734 -13013 -11579 -11349 -3120 781 -3622 1273 -10183
7071 -10183 -4030 6789 1317 -9066 -10965 -17313 -21378 -16835 3915 13979 7811 6170 10711 2278
7057 2278 -14219 -14719 -13914 -7616 2306 6062 15779 18804 18851 15678 6046 6794 -1554 -4467 -4032 -1477
7041 -1477 -8446 8297 20173 16018 -4371 -5295 -3308 -6888 11965 19766 13175 11497 6266 -4003
7027 -4003 -8451 4983 7436 8951 -734 -6461 9564 26830 31756 3999 5610 20491 36319
7014 36319 32135 21918 21569 24950 20003 16868 21700 21862 18198 12682 7590 -1420 -1192 99 -3508
6999 -3508 5116 3408 17174 31622 17613 21208 36597 30975 16768 20846 16915 13567 20826 15764
6985 15764 -4750 705 12739 16610 5843 8171 24695 17993 14144 14613 13574 6743 9928 15402
6971 15402 19997 -7405 -23687 -14490 2990 9846 23841 31394 26567 20659 16618 4888 -11892
6958 -11892 -16692 -15532 -4621 -6238 -10770 -9002 3862 13899 14031 13334 7608 -6736 9849 24932
6944 24932 17326 28881 22724 16859 16633 15410 2175 -7551 -9929 -7090 -1032 1529 9238 16256
6930 16256 13871 11378 4447 3082 -1506 3480 -828 8161 9102 19600 27593 23142 18376 9915 -1934
6915 -1934 682 3128 858 6835 3893 310 -11122 -4603 5165 9940 7692 -6540 -2598 -4808
6901 -4808 1577 27 4928 1095 -11724 -10671 20736 27339 11725 -183 -2781 4088 9840 18196
6887 18196 21849 14850 4528 3847 4780 -5527 -17248 -11276 -7119 -6030 -5739 -3125 -7986 -7083 48
6872 48 10199 12062 4571 -12038 -12313 -18512 -20107 -19347 -8002 896 6370 4452 -6420 110 10478
6857 10478 7805 14801 15280 4306 10619 12264 4265 10137 7527 1805 10081 8595 13292 6854 -3131
6842 -3131 -7648 9721 17303 22050 11259 548 -6784 -5234 1664 9647 17885 12712 8747 3513
6828 3513 -1671 -3774 -118 -7969 -4178 -3468 4707 6253 4899 9185 12465 9949 19356 13256 -1808
6813 -1808 -11188 -6240 1800 9170 8931 14254 -6567 -18758 -4822 -3936 -9750 5893 12228 19522
6799 19522 3628 3917 11411 12861 7500 -2459 -7245 -9063 -3695 -5118 -14779 -20653 -2312 -7549
6785 -7549 -8623 -1747 -4482 -8990 -12737 -438 19099 15706 11395 5679 7330 215 -18541 -14110
6771 -14110 -486 24989 17576 6085 -5770 -10865 -7391 -11013 -15439 -19870 -8023 6865 12061
6758 12061 -223 -7737 916 17627 12974 13894 17041 1191 -911 3991 -674 1355 23419 28232
6744 28232 23297 22084 13972 7211 -2381 9031 9421 4941 85 3532 4945 6244 10253 13903 15804
6729 15804 12002 5300 13758 22755 23654 28234 36027 34993 41081 36232 34630 35853 30979 19754 22591
6714 22591 19385 32732 45421 31052 23543 16108 16439 8557 12137 20454 19089 18950 10086 7843
6700 7843 13846 12014 14345 22027 21698 17703 11702 20465 34025 37792 23155 20600 15440 9294 13076
6685 13076 4921 2572 7533 15720 8236 10530 28703 34472 37494 40251 38471 31794 23939 16849
6671 16849 18221 21188 28439 27809 27989 40631 46293 37758 18229 14929 37288 48972 53418 40654
6657 40654 41009 57264 71208 68925 78110 91829 91218 103600 115394 116839 125577 124053 109520 105778
6643 105778 127943 155622 188692 242531 286554 336376 418805 540502 736706 1001322 1302811
6632 1302811 1494142 1583421 1763137 2023506 2188429 2103859 1814529 1406121 1038945 788999
6622 788999 624021 498890 403366 349998 308548 280823 251426 224452 199677 170257 165872
6611 165872 168510 169099 163478 156410 156514 144870 123715 103964 93579 86958 82743 70409 64739 62524
6597 62524 63939 67008 73080 70006 67705 61296 51668 58968 65818 64868 58028 52580 46351 37945 47190
6582 47190 60020 55448 53569 57016 49277 38629 42032 41046 37777 38095 34296 37274 35445 45208 48887
6567 48887 52936 52841 53899 61449 72705 90712 88735 63828 58556 77177 72522 75776 88684 87041
6553 87041 84365 81723 83667 89900 96338 112792 116923 115098 102676 97148 90538 72204 73218 64026
6539 64026 55619 50864 51098 49782 46356 42560 39694 38518 25599 22290 32317 48104 51852 50350
6525 50350 57016 56806 52522 49298 48509 52839 48904 43887 33059 20015 17366 20060 31966 30610
6511 30610 10586 5412 9714 27948 35777 28167 25654 24876 26206 27581 23448 28003 20758 12668
6497 12668 11186 11624 -3156 1509 9391 4139 5938 11021 29830 36872 28016 11671 5014 15807
6483 15807 7462 -2928 -6360 7380 11269 14353 7344 -2466 -6316 -1163 -5189 -5409 1577 8394
6469 8394 12929 9690 -9474 -17970 -1352 4587 10804 1437 2290 5383 3159 -14678 -8522 8342
6455 8342 23497 28391 20576 5216 -4710 -9712 -11854 -7074 8805 14756 12979 13996 -2164 -2930
6441 -2930 8681 27459 23819 9586 11913 7762 -2900 -6169 -2486 -1311 4963 6779 14960 13593
6427 13593 7514 7224 -3373 -12864 -12358 1849 15983 22098 15366 20927 18916 4607 -1550 -6311
6413 -6311 -6823 -725 5962 8600 22300 25993 6752 -10774 -6676 1747 3952 5748 9357 9743 7537
6398 7537 7811 13417 13061 23905 28538 18574 8003 2526 13819 19770 9188 14218 4061 -10698
6384 -10698 -12516 14854 23057 17223 9350 16963 31986 25415 16546 16294 5680 4472 -6160 -14285
6370 -14285 -6221 -3952 5124 1546 -7129 -5435 -4237 -5924 -6872 -2697 -2429 8314 12939 -6231 -4673
6355 -4673 1921 -1367 -2663 -4732 -2963 -17371 -12160 1537 -2487 -8137 -5777 9397 5420 -514
6341 -514 7213 9099 6012 16483 8956 4327 487 -9030 -3673 1300 11183 8534 13308 16976 6396
6326 6396 -2018 -6212 -7322 -8310 -8482 -2905 2658 2827 1147 -7104 -4626 1819 5445 -5844 -1379
6311 -1379 3247 6253 -2317 -10522 4137 3792 -2716 -70 -15568 -18911 8696 9429 4285 898 5625
6296 5625 11605 -4096 -21109 -19018 -2204 -4479 2397 5692 7785 16284 4644 220 11853 16105
6282 16105 928 30 4101 9470 10374 2561 -5698 -4292 -6763 -8469 -20911 -34607 -31990 -23093
6268 -23093 -8293 -6060 -10782 6507 20136 7864 6064 7497 9671 6665 17916 24005 18280
6255 18280 8516 7501 756 -5127 -7745 7941 22758 22334 23254 929 -14696 -10884 -17096 -17996
6241 -17996 -13294 -14935 -22539 -8459 11770 12595 15737 21688 21936 14232 -3728 -12098 -1944 150
6227 150 -436 3277 11141 11065 18394 11411 8584 5050 1237 -4932 -9598 -4440 -11454 -20278 -10277 -18913
6211 -18913 -6024 8012 5170 202 -3218 5191 3291 8490 9133 1148 -3033 -8291 5819 4299
6197 4299 672 -3800 -9293 -6118 -6120 -12802 -10800 -18280 -7991 -1662 -612 3899 9285 13262 22024
6182 22024 20860 22851 17672 21259 20304 10720 12901 15858 8662 5912 -5444 -10865 -4954 -521 7540
6167 7540 8384 4583 -1009 -65 3186 12632 6149 -10282 -12941 -17195 -34620 -25893 -6610 -3754 8485
6152 8485 11153 22034 29715 17483 7286 4161 21209 20578 24712 23622 19849 20079 24213 16824
6138 16824 3371 -11228 -19353 -11310 -11205 -9922 -5756 2394 4255 -14961 -25279 -21755 -22229 -13216
6124 -13216 -2605 -8479 -20641 -19040 -11840 -2553 -779 2670 694 -2229 -1403 -1180 5476 1704 6512
6109 6512 8176 -5347 -8202 -1646 -2861 -9489 -11744 -18744 -16588 -15917 -24570 -30220 -15149 -20505 -14935
6094 -14935 -577 15195 5030 -8482 -10326 -10077 -15584 -4660 6100 11043 17012 7089 -6688
6081 -6688 -6889 2951 3913 2736 -5726 922 -5978 -5499 -14602 -11362 -2992 10835 14103 3607 6255
6066 6255 14364 4294 -1531 4336 12911 -3113 -16745 -18089 -4074 10249 25821 15307 8028
6053 8028 8314 19840 7162 -6808 -12269 -20367 -14735 -11864 -8781 -23502 -25664 -2022 -11948 -16863
6039 -16863 -14495 -22025 -19229 -9697 5801 4714 -8585 1202 17501 13223 11583 13291 8575 10107
6025 10107 -1755 -1972 -431 10902 9139 -2711 806 8570 10850 9933 7182 3555 -2724 -9662
6011 -9662 -19186 -17569 -1477 1411 1640 -1014 9446 28025 24620 11109 5430 2189 8372 17267
5997 17267 18291 2038 -224 12866 18061 10532 -1294 -2680 297 1306 -3014 -14029 -25927
5984 -25927 -16263 -10229 -11701 -6028 1587 -5522 -5134 -12666 -5019 5279 11474 13739 8310 1566 -3708
5969 -3708 -4018 -14094 -20598 -23970 -15774 -27579 -42511 -27360 -21628 -30428 -24530 -18553 -12568 -7811
5955 -7811 -8504 -8049 -1377 -2715 -2866 -5864 -404 -8825 -14764 -24508 -24937 -12939 -7628 -1063 -2922 -11251
5939 -11251 -6644 -1543 -10079 -961 7681 4090 -7483 -5299 -12772 -7219 -6298 -9315 -14201 -20504 -10669
5924 -10669 -4984 -10655 -13469 -16762 -16616 -25898 -33441 -28882 -11785 -2556 -914 -5538 5008 14950
5910 14950 6523 -1372 -17494 -33371 -32442 -18823 -10879 -10466 -14291 -2289 18297 -5038 -21452
5897 -21452 -25893 -10952 -12026 -6368 -1883 2817 -4771 -1595 3819 8690 752 -648 3569 451
5883 451 13385 16584 3778 4284 -1166 -37 -451 7689 8068 4149 2956 -970 216 7895 -773
5868 -773 -8708 -14733 -11147 -3638 -9299 4330 4099 -1868 -2797 -15485 -29012 -30946 -21164 -20557 -19520
5853 -19520 -15148 -11054 -3317 9504 16100 16825 18502 17178 23317 13925 4019 3442 -3251 -11537 -10878
5838 -10878 1498 684 -9632 -10260 -20640 -10434 -330 -1913 -8110 3694 2718 9463 14331 -3311
5824 -3311 -3345 -9069 -4673 -6837 -14664 -28432 -29979 -15114 -4875 -1220 -2695 -7064 -6876 -14736 -20728
5809 -20728 -458 762 -1540 -16674 -21972 -20605 -11128 -14079 -14911 -18404 -13280 -14910 -4778 -10773
5795 -10773 -15404 -14142 -21551 -12129 -16282 -5312 12052 7192 -5380 -7147 -8380 -9512 -8194 -12867
5781 -12867 -14583 -1529 -1899 -7011 -12165 -20358 -28604 -38007 -29576 -21823 -7906 -9475 2683 9373
5767 9373 39 -21440 -35065 -18445 -5019 -3374 1906 3864 877 6823 865 -7586 -718 -1074
5753 -1074 -7788 -10499 -5767 -9337 -4859 3143 -11287 -9846 -6931 -5718 -3184 -1593 -3920 -6118 -8444
5738 -8444 -822 -1672 -4491 -12464 -15000 -32434 -42118 -35805 -21809 -33552 -45604 -39791 -24677 -15853
5724 -15853 2916 6326 13837 26815 25064 22683 21522 21212 15160 16152 6476 -3694 1436 20529
5710 20529 6931 -10130 -18631 -18680 -29495 -22463 -14193 -16118 -17144 -6388 1248 -685 -1875 7987
5696 7987 7558 11739 4058 3963 -2204 -1106 4508 -6626 -4490 9400 -520 -13043 -5628 -8368 -17708
5681 -17708 -22038 -24027 -24276 -27133 -18214 -21000 -13453 -4053 -10313 -11911 -12399 8481 19678 20322 4261
5666 4261 847 -7910 -16766 4627 3188 6983 16490 -960 -10660 -20768 -22362 -15071 -12725 -978
5652 -978 12145 22544 9995 1247 -841 -501 2708 -4460 -17480 -7336 -13481 -14150 -18291 -24491
5638 -24491 -30823 -40071 -36441 -25097 -23560 -10412 -1615 1044 -6473 -1642 -447 -505 -4834 4623 9271
5623 9271 -3300 -17580 -10416 -1612 4498 752 6423 -8534 -19504 -19132 -17474 -18317 118 19625
5609 19625 28226 12306 -2608 -909 7467 2264 -2141 -12551 -16329 -14460 -10833 -3360 -6040 -311
5595 -311 1543 -2099 -6326 -14489 -10636 288 2492 -4975 -7967 -8455 -11665 -16724 -20079 -11444 1
5580 1 -75 -1476 -2138 -9501 -17982 -12790 -3566 6415 10139 3532 1620 -2018 8029 10861 10620 13828
5564 13828 5379 3752 -429 -9891 -13893 -6252 5748 5991 -5316 -15770 -14985 -21664 -17075 -16671 -10696
5549 -10696 610 -62 -1618 -23557 -36867 -38208 -34956 -30806 -22587 -24208 -24701 -20043 -2332 -113
5535 -113 2244 9359 8020 7856 329 14655 12460 11449 8954 3986 -1910 -3212 2583 -6738 -20438
5520 -20438 -23529 -26546 -20518 -5074 -4354 -12127 -8781 1247 -1870 -2509 -17071 -24670 -19512 -10024
5506 -10024 -10939 10081 27566 23378 10683 8920 -8968 -13793 -12332 -4532 6705 2870 -7304
5493 -7304 -12808 -14233 -432 -9886 -13105 -13151 6647 28068 15212 10479 10110 -1519 -20675 -21285
5479 -21285 -22107 -15377 -9269 -12904 -18294 -6058 -2137 -4353 -17407 -35663 -36455 -18740 -13681 -13129
5465 -13129 -19917 -20737 -4338 1879 5152 2005 6027 5256 2594 9799 3210 -1277 -8124 -13938 -16581
5450 -16581 -8274 7763 -11402 -22566 -16208 -8776 260 7350 14200 19159 27542 31110 18351 12068
5436 12068 -1725 1978 -6697 1888 6277 3643 13270 5643 3735 4476 8319 15028 -1467 -5576
5422 -5576 -14391 -22291 -21557 -19356 -23079 -23779 -16357 -3215 -8152 -10813 -18657 -15843 -14684 -9624 -1410
5407 -1410 -5983 -13214 -12184 -7697 -11210 -9888 -2149 4974 1333 -11944 -20132 -13800 4452 -5167
5393 -5167 -1550 1641 409 5786 3056 -11582 -16511 -4932 -497 -7218 -16613 -13274 -7586 -7427 -7342
5378 -7342 -12032 -18318 -21544 -24548 -25938 -25647 -12265 -19237 -14234 -23547 -22108 -15181 -8189 -17221 -23012
5363 -23012 -10599 7256 13602 3444 -9967 -4433 2100 -1550 -14113 -23270 -23359 -21354 -20170 -11608
5349 -11608 -6829 -9628 -14480 -15791 -14209 -2402 4254 -4901 3768 -5583 -10953 -7197 2170 6130
5335 6130 4819 -10769 -20266 -14879 2198 10061 16534 6366 -1750 1699 -8121 -9485 -3837 -9598
5321 -9598 -4878 4669 6786 10139 13857 14545 3055 647 -625 -3998 -13153 -8325 -7631 -13772 -15632
5306 -15632 -20524 -19571 -27205 -17966 -10270 -9092 -10735 -17480 -12636 -8460 -16486 -27235 -39517 -33417
5292 -33417 -11629 -694 2336 1312 7463 16278 6689 -2622 -11630 -12155 -9307 -5275 -5935 -2758 4838
5277 4838 5379 4143 4669 -4445 -19416 -35491 -18509 2407 9128 19178 28598 20438 11451 -2006
5263 -2006 -14421 -26474 -22082 -27059 -23623 -8452 2055 -4773 -25908 -18638 -12289 -4667 2990 6858
5249 6858 8703 3750 2682 15299 6476 -9612 -22687 -24756 -30009 -33918 -19792 -16187 -27741 -18701
5235 -18701 -1817 -693 2507 8061 19627 10323 -15351 -24790 -23973 -14172 3174 -9102 -24078
5222 -24078 -13618 -8510 -12784 -6666 -5611 -7944 -5310 -3794 -10977 1072 15337 8244 -2401 2055
5208 2055 3605 -4008 -4423 11724 2767 -1898 -6011 -19746 -1509 3326 11382 1640 -827 -13175
5194 -13175 -22065 -21357 -13785 -10576 4613 15122 11810 9069 -1812 10507 23858 22020 15173 -1420
5180 -1420 -15511 -7504 -2307 11358 2069 8054 -914 -6102 -17662 -22760 -41288 -31546 -29110 -28650
5166 -28650 -18502 -11343 -11346 836 2795 -7743 -7869 -14956 -7417 -5326 5962 21977 15375 5641
5152 5641 8600 -3547 -1474 4983 5674 9353 8114 13391 11376 8041 -2618 -5538 -6962 9526
5138 9526 15831 -211 -6488 -7179 -3617 436 1760 12221 9285 13409 11163 6534 6817 -3747 -6408
5123 -6408 -11073 -22506 -26300 -22954 -7569 -7310 -17347 -20811 -24939 -26235 -11890 -16150 -24998 -8975
5109 -8975 -5473 5399 7185 -5297 -6273 -17011 -18415 -8398 -14490 -15709 -29001 -33932 -23894 -27999
5095 -27999 -34605 -40328 -37865 -35451 -34149 -31175 -16391 -18125 -11976 -9424 -9155 -3836 -1082 -15693
5081 -15693 -3827 7372 11976 12061 10082 18026 15771 7545 9927 3429 -2339 -4292 -7234 3468
5067 3468 -886 -13667 -16829 -8934 -12089 -7252 -14765 -31170 -31540 -30825 -19474 -14909 -23432 -17010 -16696
5052 -16696 -22754 -18208 -1559 195 -4426 -15243 -20919 -12565 -20632 -34142 -26700 -23103 -34907 -28351
5038 -28351 -33029 -34079 -33530 -23288 -2739 2959 7214 242 -2973 -6872 -2031 301 3475 1572
5024 1572 -10557 -25237 -45786 -44960 -30736 -18717 -12368 -12480 -12250 -1649 4689 277 2019 4231
5010 4231 -5910 -8925 -9586 -2616 11401 11362 14770 6977 -6465 -4961 -12467 -9892 -2021 3460 11781
4995 11781 14518 6859 -12264 -2627 3011 4958 13440 9700 14645 7945 3412 -2808 -6888 -404
4981 -404 13047 -4620 -5348 1703 9482 15123 9726 73 6711 6488 10155 7050 -8668 -10468 -10901
4966 -10901 -7427 -6260 -17150 -20500 -17909 -10599 -12729 -16618 -24004 -28668 -38560 -30031 -10078 3392
4952 3392 2611 -8612 -5948 -7951 -8481 4911 14573 14781 9093 -2618 -1246 5844 8866 7568 3479
4937 3479 2248 5392 -8429 -12526 -5133 -15235 -13398 -7117 -6021 1627 -5286 1265 831 -12924
4923 -12924 -11273 -2606 -11553 -9089 -8442 -6122 -5299 6893 7310 10292 6871 -3294 -4189 1637 -2200
4908 -2200 -20673 -31386 -22332 -11093 -5781 9456 10308 8675 1657 9899 5493 -7302 -3966 -3577
4894 -3577 5197 10735 -1880 -15029 -19570 -19269 -16326 -6613 -1644 9199 1451 -99 12692 11853
4880 11853 -6391 -14847 -10770 -16101 -21469 -26680 -24948 -24267 -35536 -37601 -34621 -40581 -27831 -13448
4866 -13448 -9860 -12966 -2645 1673 -1285 -3468 387 5765 7302 313 -2363 2506 -865 -4114
4852 -4114 -591 -3135 -18396 -29491 -21631 -22803 -26721 -16483 -28419 -35279 -28944 -13797 4855
4839 4855 3404 -1860 -10713 -12737 -7806 -11238 -12654 -11177 -6592 1800 2504 -10206 -10320 -13700 -3008
4824 -3008 510 1506 -11556 -22178 -22557 -18236 -15272 -9813 -4466 5955 6780 19256 31765 30664
4810 30664 28075 17052 12150 5628 10034 15222 8378 -1024 -1243 -3893 -4427 4726 9004 4534 -2783
4795 -2783 -6348 -10087 -7485 -9150 -10628 -7047 -3197 8045 6528 -3392 -16861 -31991 -29851 -29988
4781 -29988 -23965 -15462 -9789 -15876 -11876 1545 -4274 -6045 -22148 -23159 943 6667 -3770 -9976
4767 -9976 -29136 -27902 -36551 -42660 -31521 -18401 -22795 -34930 -39019 -38118 -42348 -27376 -18140 -15950
4753 -15950 -8277 -2768 343 -4225 -14656 -11946 -4424 -5844 1841 14441 25910 22968 2125 1651
4739 1651 -4878 7817 21243 22079 25811 11224 7144 -11111 4656 4536 -15607 -21000 -10514 -11532
4725 -11532 -6975 11359 13601 96 3421 6695 -4535 -12981 -4528 -5349 1328 -2807 -4640 -10426
4711 -10426 -13695 -4326 6000 -6865 -13096 -22629 -31109 -17844 -4654 -232 5099 2363 -15359
4698 -15359 -13693 -14267 -6379 -10344 -26047 -25277 -22773 -17463 -3493 -3518 -1241 402 -9771 -1882 8739
4683 8739 3868 -17745 -25778 -27475 -24242 -9922 -8263 -6801 -9149 4299 7228 6618 -1246 8976
4669 8976 8769 9356 -6262 12391 24124 11623 779 115 -1343 -9714 -22660 -18837 -11477 -8485
4655 -8485 -18197 -20866 -25063 -35829 -28811 -31183 -25202 -26326 -34761 -28142 -29780 -12398 -12979 -24224
4641 -24224 -16503 -10611 -3352 2809 -4680 -7414 -7918 -19053 -15653 614 -4236 -9353 1893 6652
4627 6652 11178 4134 -1007 -8224 -25684 -23951 -18558 -19065 -13963 -18120 -26507 -33965 -26857 -11264 -10035
4612 -10035 -17499 -23352 -24472 -27343 -25424 -10657 6061 -2141 -21357 -25067 -14913 -2746 3127
4599 3127 6909 2723 -22120 -27515 -16271 -2608 6886 -10872 -7312 -883 10123 14013 457
4586 457 -2463 -3114 -12499 156 9209 -3870 -20034 -25951 -19289 -13156 -15706 -12179 -15114 -15260 -11297
4571 -11297 2845 3992 287 -12693 -12255 -18373 -25287 -23608 -22244 -11161 -3224 6223 6607 15317
4557 15317 12821 5150 -973 -4871 2810 -1948 716 1937 4115 -1903 -8494 -26083 -43142 -41761
4543 -41761 -30858 -19502 -17788 -12370 -12351 -138 6476 -5853 -4183 -3029 -812 -1913 -2108 -5866
4529 -5866 -9401 -12985 -4358 -10779 -21663 -17563 -13529 -11072 -10645 -9230 -14582 -21441 -13086 -1559 -1171
4514 -1171 1877 -11117 -21095 -14686 -3669 6900 -424 -3325 -2676 -10775 -10271 860 6096 9773
4500 9773 16465 14342 -5119 -4419 5323 5648 7164 22738 17848 2446 -3027 -9115 -4669 -9556 -16959
4485 -16959 -11361 -3582 552 -5616 -17156 -24698 -25020 -3657 2370 2566 -3572 -1970 -5253 -10900 -2131
4470 -2131 2241 -5808 -20861 -14736 -6303 -15033 -8900 7825 3854 -6834 -6244 2235 -1974 -18683
4456 -18683 -20746 -22650 -28102 -14160 1726 -2275 -19602 -28145 -17595 -18237 -16402 -8593 -19121 -28401
4442 -28401 -30184 -29605 -25098 -20198 -22324 -18568 -25717 -23577 -17017 -17082 -16360 -22978 -14758 -8411 -8783 -12920
4426 -12920 -17129 -12939 -5160 -13168 -9257 1769 -8695 -12848 -23812 -31355 -24861 -20859 -26564 -23144
4412 -23144 -11762 -19921 -26837 -29652 -19618 -14704 -15181 -11716 -2339 762 8103 17895 13954 9810
4398 9810 5403 -1308 -2490 -13118 -1357 -9494 -20705 -11387 4228 1370 -10675 -8610 -5995 -17013
4384 -17013 -18040 -9167 -2533 -2324 2970 5985 -6379 -9727 -17803 -10910 -8632 -19822 -28309 -13827
4370 -13827 -14084 -14686 -18887 -12455 -6508 -16911 -25741 -26859 -23466 -22821 -22493 -16304 -12432 -9605 -10903
4355 -10903 -13131 -10879 -4183 3932 3741 -2478 -6323 6713 1855 6524 10558 -3751 -13969 -10288
4341 -10288 -1739 948 3281 273 6625 10524 12204 -3749 -4806 -10563 -19518 -27232 -42813 -39695
4327 -39695 -31236 -32018 -27274 -25890 -26184 -21736 -15556 -14632 -14735 -20054 -14313 -5484 -6871 -3170 -2841 -13125
4311 -13125 -7499 -5194 -16461 -22472 -16186 -14840 -23847 -21342 -7289 -10867 -16190 -18285 -14603 -10541
4297 -10541 -30058 -27594 -10104 -993 -2295 3856 8641 732 -7843 2592 2786 1827 6097 4538
4283 4538 3891 7715 7363 -16759 -19172 -13077 -4051 2286 -5782 -20871 -17522 -11013 -11155 -8198 -10595
4268 -10595 -5781 -11030 -4254 1981 4604 6582 7202 7699 7751 1533 -10446 2147 3756 -9517 -19165
4253 -19165 -29269 -42514 -29685 -16820 -12629 -6781 -11939 -19318 -24094 -10449 2791 17795 15540
4240 15540 7637 4124 -14945 -29937 -19147 -17164 4204 5302 176 -9170 -26954 -20172 -14508
4227 -14508 -8524 -9285 -10079 -4788 -18277 -19521 -12119 -10526 -729 13067 4666 10024 5328 -8738
4213 -8738 -10631 -12930 -12907 -22269 -24075 -11176 -5705 -5072 -2936 -10903 -15490 -18630 -36413 -29385 -13255
4198 -13255 -7811 -2276 -11716 3787 13518 -731 -3976 -1773 967 452 -844 5973 -11491 -13460
4184 -13460 -10214 -18673 -28624 -33168 -16859 -3733 7237 5572 -5800 3078 4112 -64 -12929
4171 -12929 -27628 -26090 -17853 -24100 -19167 -10268 -8251 -16863 -28220 -24978 -11524 -8090 -13701 -15269
4157 -15269 -22852 -15377 -11250 -2856 -14523 -17493 -15967 -4510 -3769 -2835 11262 7980 -2996 -6562
4143 -6562 -12461 -14980 -5500 2659 -9579 -14867 -6924 -1320 -8806 -19252 -12586 -18874 -1870 24974
4129 24974 24417 1405 -10148 -2783 3134 -7308 -10520 -3326 932 -1793 5088 -3598 -5132 -2706
4115 -2706 9694 13785 7138 -1375 -2554 -9321 -8693 -567 4696 10468 583 -5905 -16037 -14914 -8391
4100 -8391 -5779 -2851 4358 -3062 -17192 -30170 -28847 -18834 -8906 -7963 -20342 -16308 -12801 -6489
4086 -6489 7634 8803 -8627 -8414 -11315 -5990 -9254 -4860 -620 -15369 -27234 -25389 -25406 -39537
4072 -39537 -33869 -17645 -18168 -18336 -20201 -19308 -136 19266 5226 2553 4531 7817 7618 -809 -1308
4057 -1308 -12887 -4633 5666 10513 8190 7776 1498 -3854 -4962 -6490 -10855 -3397 12123 8106
4043 8106 -823 4186 -3275 -10912 -14548 -12278 -9750 -3433 -1033 1235 17256 14361 1985 -1050
4029 -1050 9557 10912 330 -8751 -16624 -5917 4934 -4248 -20095 -23853 -12636 8775 -3286
4016 -3286 -19423 -19094 -4644 3708 5116 10304 4643 -2906 -3076 -10071 -13871 -26740 -27714 -22994 -15609
4001 -15609 -6245 2553 -2308 -369 -820 -1756 263 4730 5214 12138 3149 274 2588 2499 -995 -2633
3985 -2633 1530 5732 -2504 -18992 -33806 -34193 -19969 -17721 -14212 -6084 -5038 -20569 -24186 -29706
3971 -29706 -31585 -34180 -27078 -16955 -17841 -24717 -36038 -21222 -8862 -13452 -12502 -9419 -17241 -17907
3957 -17907 -14905 -32762 -41612 -39432 -33605 -14621 -10656 7 1798 201 -3533 -10680 -6586 4865
3943 4865 -13904 -24115 -20399 -18972 -8491 -6194 9260 11948 3794 3508 15068 12936 -4887 -25845
3929 -25845 -20305 -7066 -942 9577 8411 -5439 -7969 -1904 -2514 -668 17944 17710 933 -21960
3915 -21960 -35028 -29475 -15977 12173 13602 -2591 -4071 13563 10027 -870 -2014 -14253 -26348
3902 -26348 -26860 -19608 -5677 -16207 -14042 1698 3120 6018 -11845 -12848 -32934 -37618 -23335
3889 -23335 -14001 -20504 -22110 -15194 -17523 -12921 -26947 -26595 -20209 -8084 5730 5895 -11979 -21427
3875 -21427 -25839 -19130 -28092 -28818 -30683 -27352 -27282 -24702 -14333 -22218 -16136 -6721 -6759 -8578 -16445 -15406
3859 -15406 -12808 -5262 3447 9750 15230 4687 4922 1924 575 2868 2695 -10165 -33403 -26520
3845 -26520 -14964 -23852 -32140 -30130 -20473 -18462 -24316 -17406 -25507 -11470 6945 9616 3347 -17794
3831 -17794 -34859 -24405 -4520 -6620 -11584 -9692 -3566 -2962 -10487 -16892 -14723 -21958 -20045 -2522
3817 -2522 -14374 -22533 -20944 -5932 1310 -6558 -15234 -7567 -4697 756 -5929 -8487 4861 5946
3803 5946 -1693 -10755 -18187 -20308 -22160 -20773 -26742 -19511 -13581 -15163 -4838 -15301 -13356 -6949
3789 -6949 -2529 -1554 -4138 7429 11260 541 1522 -1481 -17390 -10194 -9560 -7857 4486 13849 20271
3774 20271 9653 5884 -9281 -14546 -3909 2410 -5639 -15447 -17092 -27335 -20283 -8372 -12494
3761 -12494 -10809 1456 15769 12961 -1650 -1311 -15232 7043 17160 17464 9688 2893 10154 11106
3747 11106 6672 8087 7785 19429 29512 26894 23384 16037 4226 -4428 -10931 -15111 -15907 -4796
3733 -4796 8924 18598 17693 8010 7782 710 -5895 -8915 -12745 7319 11671 4737 -5393 -2920 4886
3718 4886 -5194 -15340 -10523 -3168 1355 3359 3873 -9293 -8299 -14774 -17704 -22629 -6514 12194
3704 12194 -9494 -14569 -11218 -11979 -13954 -18988 -11160 -827 8765 4853 -13953 -11219 -14811 -19237
3690 -19237 -8818 -11850 -11396 -4304 -5970 -19318 -16056 -8681 -8206 -2827 263 1947 -4181 -15810
3676 -15810 -15471 -9635 -15655 -17020 -12636 -4218 -5260 -9189 -26625 -29679 -25495 -21444 -21688 -15753 -9923
3661 -9923 3324 5880 5127 6245 4476 -21191 -25522 -24104 -17877 -10247 -18144 -7740 -2321 -3411
3647 -3411 -9964 -4385 -96 -504 -7008 -10381 -457 7041 6759 -3426 -11526 878 -8297 -22443 -33258
3632 -33258 -43868 -35731 -17030 -11486 3211 1588 5807 8368 10971 -1339 2093 -12477 -19347
3619 -19347 -20275 -23262 -8981 -2116 -8383 -12283 -21004 -33710 -26227 -15247 2028 11042 2609 -3938
3605 -3938 -10920 -13027 -5019 2272 -13241 -22881 -18200 -12894 -23613 -21979 -24082 -25965 -14303 -10338
3591 -10338 -3664 55 -3748 7354 5991 2598 1917 1313 -6577 -12685 -7785 -2785 10348 17420 32977
3576 32977 33912 22128 4105 -10404 -20039 -28236 -24836 -12539 -5355 -1740 -6116 -14085 -19806 -20967
3562 -20967 -19100 -15624 -26090 -24984 -9300 -3288 -21797 -35171 -36591 -19258 -18094 -21221 -19834
3549 -19834 -9143 -6331 11916 17747 688 -13904 414 7118 -10033 -14505 -7029 -10130 -24454
3536 -24454 -20284 -4415 -14515 -27353 -20797 -7539 -13485 -2751 4240 9977 13619 10912 8521
3523 8521 13292 17229 6598 -1156 -3737 -17811 -6826 -6730 -7042 -8656 -7713 -7822 -2219 7806 12514
3508 12514 13372 15967 6467 -10066 -9978 4529 26870 28476 22341 4010 -2962 1490 -1909 -10207
3494 -10207 -11757 5765 4297 -8147 -14751 -18752 -10493 -20210 -26406 -18392 -6262 4889 -377 -15346
3480 -15346 -8643 -6872 6867 17362 13402 -2183 -8619 -12713 -8509 7428 -2684 -5117 -5718 -15165
3466 -15165 -18767 -23876 -7317 6468 4838 17146 21146 20892 20064 15261 16292 15057 1514 -7863
3452 -7863 -9594 71 -1233 -14835 -9548 -9529 -9059 656 -337 -16151 -30130 -29952 -27838 -17834 -10271
3437 -10271 -12847 -17467 -17041 -22647 -20912 -14085 -19085 -17057 -30752 -28781 -14608 -5519 -7643 -13636
3423 -13636 -15282 -17053 -25145 -31551 -18482 -10996 -20282 -31030 -37946 -32570 -25940 -10067 -2229 -11380
3409 -11380 -2702 6597 9769 8167 7830 1413 -6673 -14481 -18779 -16855 -22248 -19491 -13913 -5649 -9507
3394 -9507 5752 9713 -1722 -16084 -11461 -4323 -529 -8046 -4561 3629 2330 8694 3972 -11563
3380 -11563 -12674 -11053 -2104 7326 -4893 -2661 6356 17914 8135 -3837 5840 5653 14737 23049
3366 23049 22880 20636 10147 6383 3575 -4240 -80 -5225 3 -17345 -30740 -35433 -27811 -12932
3352 -12932 -18939 -26956 -26195 -17862 -4739 9394 14001 11414 1614 -4869 -7635 3270 24402 25502
3338 25502 13809 5595 3608 6401 2575 -3714 -15035 -21752 -17698 -13470 -20003 -18167 -5449 -14581
3324 -14581 -23136 -24705 -26545 -22609 -14121 -23374 -21507 -14893 -4679 -11356 -28832 -15040 2184 9668
3310 9668 14024 8094 16722 27558 25581 17132 15571 14464 -3254 -17866 -6532 -12682 -16751 -12234
3296 -12234 -13489 -11237 -8235 -11448 -13447 -13810 -19275 -18200 -2612 6437 -3688 -6699 58 277 4235
3281 4235 16190 24426 15422 11224 10312 7446 10418 19109 17404 -1879 -9169 -16387 -20576 -13884 -12053
3266 -12053 -11603 -19421 -13228 4356 -4306 -10799 -19476 -16464 -6265 2097 -10805 -26631 -12026 -3890
3252 -3890 -5849 -15149 -15455 -14815 -11647 6866 14623 17799 12158 109 -14895 -18844 -20743 -30785
3238 -30785 -23218 -11955 3119 8644 9680 4490 -710 -5870 -7892 -15882 -5046 8188 2314 -7680
3224 -7680 -16773 -21213 -19605 -18887 -7232 3953 8419 3997 -688 -11114 -9155 -2601 9614 4961
3210 4961 8558 2796 -5596 -14583 -15728 -7849 -2287 2863 1639 15021 13952 24307 11396 -1769
3196 -1769 -4963 -5613 -4329 -18733 -11163 -14760 -376 3871 1451 6534 9094 360 568 -2814 -734
3181 -734 -5163 -6664 -12425 3944 24002 29423 24783 966 -1338 11936 14081 13788 756 -14445
3167 -14445 -12564 -10739 -8170 -406 -1466 -11551 -12893 -1209 698 88 -2730 1080 9848 10612 4415
3152 4415 8519 14474 9339 -7432 -7174 -3314 -12854 -14282 -16871 -24224 -26908 -12893 1868 2395 5708
3137 5708 19700 24474 7025 882 -5793 -2557 6544 18844 20314 11722 8804 16202 7559 -3957
3123 -3957 -2938 -9822 -9823 -11018 -13764 -15791 -1046 12546 20924 6512 10943 23680 12891 -637
3109 -637 10291 -532 -13941 -3951 5219 710 3612 -3812 -10545 -17086 -7625 -4152 4838 7394
3095 7394 10465 11127 351 -3762 -2796 -3174 -6380 -13947 -25055 -29387 -23755 -24757 -20446 -10629 -1264
3080 -1264 4135 -4730 -24206 -37598 -31962 -14050 7031 9936 2483 -1750 -16664 -27800 -22260
3067 -22260 -14309 -13647 -500 -386 4365 5503 -5192 -14831 -8717 -1023 -1037 2020 19685 22953 22762
3052 22762 14926 -6956 -22963 -29591 -23709 -6764 1547 2354 7995 12348 6204 2490 -2616 6212
3038 6212 8867 1115 1789 -1424 -6543 -13328 -12082 -19581 -25693 -33295 -31767 -19319 -14153 -9369 -2472
3023 -2472 2060 -3860 -17548 -20027 -12065 -5303 -12507 -10006 -3924 -17966 -19332 -21769 -14227 331
3009 331 8846 6596 -11249 -11990 5574 7886 3212 1936 -8517 -34228 -42107 -40962 -25282 -27456
2995 -27456 -23813 -12878 -2387 1907 5573 5284 354 -5683 -6659 -9204 1362 3954 -1159 -22042
2981 -22042 -24827 -8594 -8701 -5852 -5824 -7912 -14024 -27564 -21726 -502 2097 2605 -18227 -37424
2967 -37424 -27207 -22720 -21078 -9895 -10882 -18969 -18655 -2416 3346 -7114 -11857 -15734 -13447 -1633
2953 -1633 14978 22648 8316 7404 -4398 -12320 -4744 4666 3091 -5160 4256 6137 2725 -1243
2939 -1243 2383 6256 348 3173 -9283 -22580 -20131 -12278 -4695 -12178 -15374 -18008 -6344 -477
2925 -477 -15787 1040 14513 2712 8450 26303 30853 15059 7182 11720 4370 -611 5315 7785
2911 7785 -6417 -15814 -28421 -34907 -41591 -35060 -27921 -10079 -7742 -6003 -8383 -8591 -15787 -27673
2897 -27673 -24176 -7190 -12752 -14248 2392 -1727 2051 -11786 -19625 -2624 -6473 -5472 -6401 -13679
2883 -13679 -264 7014 3422 -8891 -27117 -18588 -4233 -2673 -20595 -27375 -26318 -15727 -6787
2870 -6787 72 -2141 -3634 7605 -2558 -590 -4486 -14450 -24496 -26964 -25225 -14913 -6845 -15356
2856 -15356 -4810 3548 -7673 -10726 -17739 -26737 -26261 -18910 5048 13226 9024 6298 10455 6073
2842 6073 6217 935 -11069 -20890 -31825 -11529 -8733 -8375 7786 -3161 -9019 -6496 15648 24187
2828 24187 16477 13025 13460 2584 -13550 -20500 -10602 -7416 -6033 -1545 3840 -5508 -4340 -5123 -7593
2813 -7593 -6927 -9321 -8887 -9140 -22798 -18356 -19108 -23876 -10788 271 5428 16987 16902 18013 17625 20091
2797 20091 16372 -168 7203 18580 16116 8063 8605 10448 9517 -8444 -10439 6853 16160 19562
2783 19562 10867 -5686 -4811 -9943 -14782 -8643 -14544 -14834 4692 24464 26674 14992 7429 3293
2769 3293 -12756 -7392 -4080 -7475 -3994 -5242 12365 33826 33915 20576 10419 9793 -470 -8080
2755 -8080 -4819 -1982 10379 5426 -9394 -2300 7997 9257 14377 18679 22869 -322 -7823 -20876
2741 -20876 -25064 -17190 -3608 2202 942 -9955 -6642 993 1833 -6604 -24679 -20543 -10359 -18088
2727 -18088 -13054 -7193 4416 2793 897 10480 13336 19203 15877 17796 9513 9115 12020 9240 10832
2712 10832 22776 21651 835 -11278 -5579 -4854 -4640 -9061 2353 23978 25244 25753 32169 25175
2698 25175 26233 22408 10151 -3266 -12088 -12752 -9080 1093 4822 4694 -6908 -19671 -16658 368
2684 368 4064 13623 20221 16638 7818 -2934 -14372 -4318 12491 7421 -3359 -3220 -4051 -274
2670 -274 1519 -1117 4659 3314 -4174 4811 6625 3318 6440 12407 5222 138 4285 1285 8881
2655 8881 5780 -627 -2733 4135 8052 8359 10279 7328 11545 16455 -1864 -21674 -16497 -11213 -7979
2640 -7979 1348 3114 2575 -826 5673 16921 6738 -6392 -20082 -30135 -33682 -34339 -28764 -32161
2626 -32161 -28472 -18005 -8740 -4378 -7035 197 9677 16182 9786 14552 4285 -13515 -15854 792
2612 792 -3923 -16998 -5493 -1766 -2594 -6203 -15607 -21221 -33646 -33755 -23464 -14993 -12787 -11862 -3671
2597 -3671 -599 -1741 458 17529 21018 24646 29008 21099 3000 -12632 -1205 9420 5204 2783
2583 2783 7441 23033 31295 16321 -2163 -9465 1577 16290 9497 -8451 -14192 -16646 -12528
2570 -12528 -6497 -5863 -1349 -3975 -11696 -19381 -13354 -22980 -38087 -39544 -26700 -21848 -13202 -5064
2556 -5064 -6648 -14105 -1191 9684 8570 14858 13155 -6150 -21075 -14526 -1335 2809 -4312 -12339
2542 -12339 -8405 -6344 -12340 -9718 -26896 -35401 -31318 -28073 -27275 -28601 -14899 -9376 1334 10360
2528 10360 25814 24050 11903 -5621 -6025 -1919 2647 10702 20066 20742 18089 12258 1829 -1674
2514 -1674 -5968 104 8585 4846 14065 14141 7259 3634 9536 5611 3364 -10475 -12091 -10242 -7169
2499 -7169 -10109 -9390 -4385 -11890 -21225 -15279 -16216 -16884 -15466 -18339 -18889 -14536 4069 15120 6995
2484 6995 6222 8388 11624 14688 3339 -7125 1422 10615 18195 16764 9724 -500 4294 14414
2470 14414 14327 5744 -317 428 1513 2282 -16812 -16099 -8659 -5743 2449 12739 10958 -7811 -7381
2455 -7381 -9524 -20311 -12933 -4787 -10259 -15246 -6631 -4910 -10990 -25098 -35169 -40886 -39513 -36116
2441 -36116 -27661 -12968 -873 -2637 2362 -431 -2585 4845 -1339 -10745 -14144 -18136 -5016 -10455
2427 -10455 6144 8179 -2724 -12053 -4797 1444 -6702 2001 -1922 -12092 -15595 -4351 17005
2414 17005 24837 19057 22216 19445 8877 8944 21896 22706 5820 17125 13275 12718 11388 8105 2111
2399 2111 2104 2807 9098 14418 22100 26123 16936 15467 4288 -6061 -4102 4953 8997 10394 3520
2384 3520 4377 13239 14910 20111 28724 28440 11929 15195 16611 5251 12776 22644 13548 8351 5725
2369 5725 2133 -13772 -17060 -23691 -21325 -17037 -13400 -6871 -1429 -9292 -10848 -8715 3347 4526
2355 4526 11639 11494 6440 10223 7426 10436 6199 4027 7471 6272 16431 19246 3589 -7149
2341 -7149 -16760 -12802 -15026 -17798 -20346 -27687 -14366 9321 7354 -11146 -27670 -22845 -6695 -2776
2327 -2776 -15077 -4026 -1090 640 8785 11534 6149 3677 3066 13626 15506 17816 5485 3422
2313 3422 12558 15934 -2246 8290 25619 34954 30088 20800 8210 -9759 2479 8245 -11062
2300 -11062 -16697 -14944 -5863 -6517 -890 -3684 -2962 -8743 -13610 -6384 2810 6211 13648 5646 -4357
2285 -4357 -8097 -6791 -12573 -9532 3524 -899 -3499 2144 8039 17115 8809 6782 1257 -4246 3644
2270 3644 15897 13723 -3099 -4237 980 7491 12017 43 4549 -933 -23041 -22164 -3858 855
2256 855 5682 5080 502 10337 14814 20420 14296 -11933 -17194 -21702 -10374 883 -5155 -9330 -2653
2241 -2653 3878 -5125 -9864 -7413 -4798 -5068 -15485 -18417 -10987 1038 6294 9711 7873 7458 3260
2226 3260 -2095 5490 9490 6992 7148 10752 14937 4257 -224 -1611 4387 2628 -7979 -5065 -516
2211 -516 -13203 -10539 -13035 214 17059 20781 20467 18099 6888 -9491 -16005 -4121 123 -4251
2197 -4251 -228 -4711 -13656 1077 11318 26660 5703 -5290 -11590 -19732 -3543 8445 25221
2184 25221 20484 8855 6358 1306 -3153 -13908 -13370 -2440 -7204 -14619 -15429 -6586 9082 13392
2170 13392 -3566 -15400 -11444 -8069 -1733 -452 -2646 -8267 377 8061 14158 8871 2473 -4600
2156 -4600 1599 5815 12027 17176 14333 2064 -14990 -16827 -420 14701 24938 39364 39928 30487
2142 30487 18258 3131 -2735 3842 13777 19865 23813 16193 10929 12628 11729 7022 10327 10710 -974
2127 -974 6273 618 -4348 -7764 -132 594 -4145 -10082 -2034 3064 -2841 -3695 2405 18420 12185
2112 12185 7368 11180 13418 17947 17288 10627 16377 7010 18066 23821 15366 11983 17362 5775
2098 5775 5001 16129 15449 8410 15269 10674 -1465 -9695 -13498 -15276 1125 15107 12241 -1093
2084 -1093 10222 665 -6613 10348 21747 21699 15906 11306 7960 -743 5842 7323 9655 6205 -14274
2069 -14274 -18788 -5980 2841 10382 28147 43476 33003 24047 10473 9414 26484 21790 17873
2056 17873 5864 7438 3997 -1267 -19403 -24246 -11643 12235 21297 32233 28984 28246 13619
2043 13619 -2791 -4868 -8035 -6886 -4847 730 9333 8848 -1011 -10790 -11432 -7455 -1479 9772 13977
2028 13977 1097 408 4948 18863 23731 14949 5127 6351 -3887 -14778 -11010 -15838 -16924 -10877
2014 -10877 -6720 1663 4034 -9477 -5804 -10523 2433 13901 -403 1612 -1015 5349 -1512 -17391
2000 -17391 -10173 -13893 -6193 -968 -5655 2088 -949 -3331 6454 16140 26045 16938 -1279 -3242
1986 -3242 -5752 -10538 -7979 -11252 -14473 -21889 -19777 -23782 -16720 -6337 3019 3653 -3218 -9629 -1791
1971 -1791 -5307 -16655 -7009 100 -5681 -13269 -19281 -14930 -19540 -2036 4721 11160 23541 7205
1957 7205 -6103 -518 -3231 5835 1247 4620 418 5540 30286 33690 32133 24118 12980 221
1943 221 -958 -1080 1664 9245 15193 3886 -12775 -17334 -7135 -7410 -9950 -3648 3487 6920 14918
1928 14918 13274 16512 30409 32650 27557 25388 14463 7452 5281 15527 17688 -335 -3869 7052
1914 7052 12981 10778 13412 18745 14764 2364 1698 8761 10035 13727 1098 5675 18722 -10266
1900 -10266 -23234 -3423 10500 3490 6944 7943 5898 3870 15354 15888 -2153 -13389 -19859 -4085
1886 -4085 13936 13641 9967 8024 5531 757 -4471 -9145 -7522 6012 5854 3091 -8423 -17547 -16149
1871 -16149 531 14075 9418 4986 1402 652 -2756 2047 -2179 -6155 -3056 8795 15468 11169
1857 11169 -1412 -4078 -2088 -2477 -8997 -11388 2976 20592 19029 5594 2031 6549 7143 609
1843 609 1160 -3171 -13104 -20746 -23822 -16875 -14437 -22325 -12457 -8207 -5101 -5564 1800 -3903 -5050 -11550
1827 -11550 -18580 -11830 -7707 -1627 12912 21257 30777 19725 28246 28578 40144 32597 11682 2664
1813 2664 -6007 -8880 1609 9514 3800 -1705 6836 4465 -2020 -10990 -18551 -1429 9785 6115
1799 6115 6206 -2652 -13482 -10366 -10263 -18516 -144 5687 10016 322 -1534 -1581 -11053 -10280 -318 7996
1783 7996 11664 8931 1458 -11216 -12224 -8613 -10313 1671 10075 13016 13512 33700 32685 24900
1769 24900 21667 22037 9415 2986 2395 5498 3915 -8352 -8323 -143 1125 -695 14902 19570 18171
1754 18171 -1977 -9781 -10174 3213 15458 6295 -382 -10112 350 -4208 -2900 -4851 -1968 -4292
1740 -4292 5287 19980 15265 -4838 -8609 1990 15346 21900 20785 19479 20026 22460 17663 9343
1726 9343 13584 19881 21486 20761 19109 15496 18344 3561 -284 7052 -4730 -104 9393 16663 13488
1711 13488 24015 28955 24139 11867 -1478 -2886 -5346 -1978 7560 5806 -15598 -18009 -22584 -17181
1697 -17181 -17162 -6272 -4471 -6046 -6391 5149 -2306 -7574 -4459 -2734 752 -4854 -26571 -11360
1683 -11360 528 7080 6963 18762 3863 -19421 -11875 -11764 -8718 -15506 -18554 -11443 -13851 -11593
1669 -11593 -6036 -3374 11454 12684 18690 35265 39248 36184 15142 11531 9486 7361 9433 14895
1655 14895 12441 5577 795 7825 11705 11177 16306 17731 4114 -9865 -5476 -449 -11256 -16584
1641 -16584 -5582 -4352 -5957 -11144 -8483 2559 7219 8251 -604 -21109 -22900 -19447 -13333 -15416
1627 -15416 -4851 9589 12789 13753 -1584 -11033 -7664 1459 8277 13315 19865 14110 8660 -4509
1613 -4509 -18432 -10772 3466 18992 25750 32960 35730 30083 20240 10617 2918 -4798 -3095 4822
1599 4822 13210 28086 17932 15328 19061 6525 1900 -4047 -1836 8245 13341 7649 -3902 -11699
1585 -11699 1550 20077 15729 11859 13459 16615 15921 22918 37595 37939 27579 11771 15001 14170
1571 14170 5166 83 -1772 -9702 -9491 -3261 -10528 -16218 -23295 -10520 -3287 400 13121 9446
1557 9446 4574 -2733 6433 15199 16860 27816 30238 22158 24244 21920 3352 -17650 -18285 -8234
1543 -8234 4949 11643 10565 19477 4094 -19014 -17378 -3355 21605 19840 11559 1079 -945
1530 -945 684 -1067 -7068 6775 13457 8039 14051 14302 16288 14737 1211 -3088 1576 11309 -1527
1515 -1527 -15863 -16210 -15361 -6773 3934 6680 2829 7652 -2339 -20758 -24034 -20204 -8222 9668
1501 9668 21449 30482 21190 6531 5347 -2719 -12391 -25754 -18402 -14924 9998 11249 21817 14291
1487 14291 8740 9079 285 -2823 10116 25514 30572 26456 12902 15573 19062 13246 -6177 -22555
1473 -22555 -29089 -7503 18205 18888 12329 17935 26433 16596 12213 8742 6235 5871 4026 9276 13695
1458 13695 12514 15952 7064 -4108 843 -4520 -7371 -5990 1323 -514 184 7729 13517 15812 7717
1443 7717 22 -12848 -16418 -20766 -21795 -13709 6422 9324 6490 3708 15323 35403 42303 23667
1429 23667 10599 15237 24415 27228 13329 -10437 -2717 3878 13725 26787 24800 14624 -4731
1416 -4731 -4799 -1925 -6216 -15800 -13085 -10027 -8437 -7608 -15099 -4291 1393 -760 475 6743 5464
1401 5464 13060 21020 7985 -6737 -2026 2595 4328 -5151 2568 13168 8908 10371 12690 9911
1387 9911 -31 1607 7875 10542 -147 805 4951 -7065 -5911 -12396 -4455 -523 3685 3088 -3086
1372 -3086 -1838 458 -5546 -11122 787 -185 -16595 -23227 -14629 2453 4562 6760 22493 19751
1358 19751 4930 -4380 -8104 2172 7622 17270 28577 28795 12965 11050 4675 -2357 -9106 -4352
1344 -4352 2700 3675 619 -8417 -21865 -10808 -5253 -18764 -13400 -3671 -8237 -2836 -6386 -10642
1330 -10642 -16652 -10137 215 4556 7017 5516 6137 -1987 4539 15661 22757 21348 27281 29875
1316 29875 37115 47157 55328 38124 15623 7367 -9579 -22493 -22007 -4404 938 -9976 -6217
1303 -6217 -3994 4545 13700 12514 19817 15594 5184 11215 13698 19109 20891 2955 2707 6189 10732
1288 10732 5086 -7748 -4446 -2934 5521 11338 12083 1128 -13678 -5854 -4266 745 10144 12666
1274 12666 18378 33564 34165 16483 15321 20947 13744 581 -15633 -15595 -6405 10226 9748 11721
1260 11721 7841 750 -3932 6410 3863 10566 2421 7162 417 -11109 -11952 -14692 -12189 1009
1246 1009 9128 11580 11020 15713 21091 12344 3140 -9320 -14747 -13236 -405 15070 4495 -2914
1232 -2914 908 8710 18233 12789 1366 -6216 -2475 732 8687 25025 22034 15676 16876 12629
1218 12629 11253 13706 11751 12125 18600 11830 -9242 -21794 -12877 4253 5946 -12895 -15114 -10934
1204 -10934 -8186 7465 9154 4304 6406 7755 10353 7562 10268 9680 4994 5723 12192 10609 2709
1189 2709 5164 2374 3780 2546 -3646 -1463 13176 18453 16837 12841 13258 10251 12257 10720 17020
1174 17020 14500 12382 5345 -7635 -19201 -8173 2788 10837 18184 28934 21862 -2698 -5830
1161 -5830 5285 9033 5650 -1648 880 3803 9174 15610 9649 5530 10923 10911 -11348 -16122 -10024
1146 -10024 -317 7219 2814 7493 413 -3422 2398 14356 20092 10307 4447 3819 -4254 -6483 -414
1131 -414 12272 16700 17206 11242 12274 9654 -4315 -10437 -2903 -594 13039 10147 -689 -11354
1117 -11354 -9915 970 14621 12190 10907 8860 5012 -5891 -13105 -16657 -3197 10203 15389
1104 15389 17615 14242 8279 4555 10577 8594 -448 11833 14008 19653 11198 12173 15531 9936 5515
1089 5515 24822 25245 13053 9721 11493 13926 10390 555 -11645 -10357 2360 26010 25039 16460
1075 16460 9763 12915 5391 -11907 -14009 -18834 373 4840 8422 12713 14405 2814 -11620 -12553
1061 -12553 792 -876 -4302 -7999 -9427 -12374 -20180 -12695 1092 12345 9260 -1796 -11324 -19443
1047 -19443 -16257 -7572 7209 12894 10329 10655 57 1801 21064 28916 9815 8736 7429 11671
1033 11671 16436 11507 14785 20289 18606 11907 7292 19323 20830 18079 18989 16185 10416 13309 18509
1018 18509 8234 -8956 -12400 6250 11256 21209 26882 23279 26107 6309 8505 29658 37400
1005 37400 16213 3032 11958 9538 -7562 3505 18640 21426 15535 24175 29301 34880 37274
992 37274 27767 13559 20677 13029 14620 16603 21049 24823 28808 16652 1431 117 -21717 -10045
978 -10045 9608 8239 6156 7828 10309 10668 18213 14749 20771 26926 18811 17997 11029 1456 6645
963 6645 11902 10780 14121 11789 -1023 9071 24121 22901 23198 16364 11026 19702 23371 36084
949 36084 47965 44335 38657 33089 31950 13691 4677 352 -17370 -14766 -5904 -3996 -21000 -12604
935 -12604 -10760 -14802 -618 9091 14020 9180 8722 4798 -5506 -3521 -6270 -5480 -11505 -12335 -3607
920 -3607 8599 10564 10153 -1229 -1104 -5834 -6407 337 6884 -4622 124 23513 25454 9831 3121
905 3121 -661 982 -1473 -4654 -11075 -18024 -20318 -16529 -15957 -2933 -9119 2915 7651 19073 22507
890 22507 21134 17161 14688 8054 8037 15000 16335 3962 -9669 -9302 -7132 -3944 14775 25181 14629
875 14629 14183 14491 24044 11453 4312 7743 536 15349 20680 25927 23718 25526 23235 25006 17486
860 17486 -680 -949 473 -5772 -5121 -12348 -15906 -14329 8011 11872 1988 -1145 2021 8178 7595
845 7595 3186 11405 13723 13886 15086 6519 13043 34142 30317 22748 23867 14659 -1161 -19698 -23428
830 -23428 -9405 -825 689 3107 17279 21309 8225 6423 11675 10472 -2325 -10983 -4734 2471
816 2471 10626 20405 25302 25724 29196 10299 6121 7177 7631 6587 4922 5331 -121 -3767 -74 16748
800 16748 10908 -5140 -1363 9795 8211 9436 11465 11138 9701 7967 9852 19114 11575 -3352
786 -3352 -12345 -18820 -17521 6509 22480 16688 4930 3633 3189 1930 -9602 3918 4406 2003
772 2003 10069 9312 9623 22115 10823 8364 3036 -603 7027 2218 2999 4225 12658 12849 26886
757 26886 20368 22678 30035 20448 15623 -1478 -851 1389 -7918 -9734 -7783 3865 3691 5207 7061
742 7061 11335 8475 15157 7774 4886 31 3507 -13874 -11834 -7302 -5524 660 3938 4109 -1452
727 -1452 -5632 -420 -8251 -1455 1641 -8827 3244 5626 2589 -2286 -3527 18953 12446 -1920
713 -1920 6327 5382 11675 18241 18638 6853 646 3104 -2135 1947 6261 6584 9818 21920 29286
698 29286 22518 25058 28824 4400 -4147 -12253 -8279 -2328 5241 -5408 -3736 8711 9560 -2895
684 -2895 -3480 -356 11316 14937 1662 9167 10559 15303 17402 18072 16012 23214 25877 19769 21444
669 21444 7450 -9748 -4451 1051 4313 4288 4424 1974 -1507 -3441 -16320 -17166 -11573 -7464 998
654 998 12726 22092 23077 31680 20687 16830 19242 19988 23650 20320 5854 11337 10363 12795 22189
639 22189 8902 -2799 -2826 6771 14115 6362 4129 7839 7110 -931 11365 17395 16539 17084 17570 19669
623 19669 25241 21285 13896 11219 14093 12673 14690 -5262 -16971 -2776 4568 21975 15449 5969
609 5969 -305 -7778 -9613 -6369 4460 3547 9790 15701 17787 22340 23498 9287 3109 348 -7900
594 -7900 -2695 -4824 -742 9682 20241 16467 14122 19790 21162 14472 5381 8407 14051 27602
580 27602 25339 4733 12979 12762 -1287 -11192 1226 7434 4233 12356 6748 1128 -3152 -1206
566 -1206 15412 20920 19432 15205 8208 14158 34388 26130 11195 12445 3061 3125 -4680 -6175 -2333
551 -2333 2424 4684 5339 5371 8998 -5837 -15918 -11867 -4591 13962 16147 7581 4826 -5929 -14182
536 -14182 -8688 1692 -4373 -7319 2393 26094 22465 6174 5143 14878 7575 9352 4014 11457
522 11457 18954 26143 23271 15921 22613 24034 28975 41679 23015 3577 -2655 -5677 -749 -4278
508 -4278 9445 16459 24938 30046 21920 10579 14565 9061 -3954 -8647 2909 8249 27849 26479
494 26479 14875 22525 20576 29592 22836 13107 6904 -601 842 -1653 -4628 3882 14535 13477
480 13477 -2545 -11890 -18100 -11066 -13233 -7644 -7090 -9599 1567 128 -1640 6645 188 -2717 -1582
465 -1582 4557 11933 18423 8429 -2371 -479 -11036 -6812 8255 8258 2147 11891 14959 13748 7376
450 7376 8270 8876 -10210 -7003 6211 23558 27156 27776 19846 6812 6522 21686 11518 283
436 283 -18245 -11550 854 4342 5054 2196 -4061 -5768 -7781 -7531 -3289 -2015 -3683 -3077 1574 9845
420 9845 18338 19098 8525 -8323 -15016 -1568 15010 9383 -1192 2152 -2221 -12278 -7643 -10886
406 -10886 3740 7869 11249 11649 2686 3923 12923 26251 34253 29740 26138 21434 12341 1772
392 1772 -10916 5315 15557 11924 9662 5859 11999 20135 31405 40105 34091 33049 25097 17210
378 17210 12624 10496 10491 8219 8361 10273 7272 -237 -5205 1363 -1250 -5722 -5276 -10530 -16043 8601
362 8601 26269 28225 20487 8458 17403 14266 6082 5930 7756 7186 -836 4259 4774 6489 12703
347 12703 13916 807 -4882 -10529 -114 1040 5068 19467 14004 11415 22498 27059 23095 14651
333 14651 20971 16367 15260 27771 32153 18515 15170 27063 27231 6706 -11319 -13283 -15519 -4412
319 -4412 6961 21137 29247 25298 16580 9274 6076 9238 6945 9497 7349 10479 15672 11706 18414
304 18414 30218 18241 14967 15838 5262 7834 10045 3169 2858 3275 4886 9189 13582 9737 4267
289 4267 699 3485 6611 363 7602 5075 -3700 2058 16836 20041 27148 28740 19941 6521 -1990
274 -1990 -727 9059 15081 18880 33622 28814 10104 11241 6118 8794 18888 13893 1244 -10471
260 -10471 -13533 -3357 8824 20197 23106 18864 16335 15503 11883 5979 6001 8493 7195 -6107 -14740
245 -14740 -1823 -6777 -3534 11419 22458 9586 -842 -411 7286 8692 1872 -4200 4998 13162
231 13162 11558 11081 22601 21695 6912 2867 4664 13523 16149 20609 22735 15059 12300 12363 -2256
216 -2256 -9560 120 3263 9084 10806 12514 15754 22953 13102 1480 4493 18144 12090 6672 4960
201 4960 8276 21950 16917 17328 16274 14795 10672 13134 5628 -2550 725 11424 16058 7917 4168
186 4168 10100 13192 12223 15816 5417 -9122 -10386 -7494 -1177 5413 -7874 -6999 1756 -2526 -6115
171 -6115 -4373 -15900 -2677 11742 22487 17996 11171 10483 20413 22181 19396 21618 8997 3949
157 3949 10661 12329 12273 17053 25884 25279 23628 29491 31848 23258 22707 24576 20906 22581 26342 25744
141 25744 24960 27476 26949 17176 8835 12140 -856 -3749 5898 -3338 -7809 4824 19419 20258 9825
126 9825 1100 -1722 6980 5447 35 -412 2204 2808 -2248 2025 2809 -991 7556 14110 16431 13545
110 13545 8195 4682 11995 16181 17860 25023 16801 11508 -2948 -9706 -7772 -3900 -3959 4820 2823
95 2823 3545 12187 8032 7762 -3746 -6062 7343 15644 13147 5424 6449 11192 8674 6889 11947
80 11947 17559 14872 15547 17610 18154 20342 19046 27336 16175 11955 10767 12776 1910 -3346 4398
65 4398 12996 16848 7826 3638 13146 17425 14283 9718 12419 14586 15571 23361 19601 11612 2368 -1658
49 -1658 -2821 -10233 -9232 -5708 -1116 -7790 -11223 931 15468 12681 2718 4505 11154 18975 17724
34 17724 16381 16113 12654 9572 13310 11226 6283 10948 20203 17877 10734 19188 18070 14900 21098
19 21098 25207 20294 16368 13276 536 -6717 2012 10178 19821 12553 15422 10840 18511 9064 8767
4 8767 13476 17615 9829 4304
0 4304
$$ Imaginary data points
##PAGE= N=2
##DATA TABLE= (X++(I..I)), XYDATA
32767 72377 70135 59323 65531 67349 74033 82200 80794 83934 84673 93017 92878 86222 81810 81978 78162
32752 78162 79927 84016 87076 85798 85166 90974 103400 109486 109410 114990 109198 112030 111842 119986 107528
32737 107528 102514 115215 128168 128179 118831 122502 122514 123818 131902 135981 136386 144669 157887 157300 160833
32722 160833 162400 158103 144826 141490 139137 134822 133473 134913 140210 149030 151502 153495 154597 153784
32708 153784 148930 142679 147881 157001 167784 171549 182840 171443 169254 169168 155797 156832 171589
32695 171589 172720 179130 174975 172380 180719 179125 186686 190220 189669 189550 193729 188341 196021 205627 201640
32680 201640 188875 192368 204806 203410 206940 204484 201903 202987 195638 195577 210339 206532 208157 208222
32666 208222 200283 210143 223049 227710 221897 209559 203004 204952 216922 215256 213995 210064 221870
32653 221870 235252 243314 242614 233454 242642 245342 251459 245189 249237 252948 251135 244804 243428 251810
32639 251810 249846 243846 241981 237506 246243 263037 254951 250808 254561 255423 265088 268782 269181 270446
32625 270446 273023 267181 263270 265365 270364 276962 279884 286485 278009 273540 266455 257883 250318 256095
32611 256095 258701 267165 278464 279179 269783 261631 266647 267979 275419 290199 297485 295518 298200 290777
32597 290777 290719 299112 307147 305489 300201 294132 302091 298120 295390 297853 290074 294206 309901 312999
32583 312999 307869 315604 325005 323178 320998 330254 328217 320311 325000 320613 304907 315100 330098
32570 330098 343643 339163 330638 319173 314307 316499 331375 333228 335165 327181 325153 325010 331981 347195
32556 347195 353080 352745 359490 362178 354087 346246 356604 354191 348101 348744 354776 362061 365735 363695
32542 363695 359509 353041 345788 335638 338918 355351 371402 379521 375933 364194 354677 351142 356207
32529 356207 360376 358586 352811 351634 356915 364893 359896 351547 377913 387640 376552 360666 347321
32516 347321 355870 370149 377754 380987 384033 381289 375490 371138 364765 369716 383059 393785 392213
32503 392213 388937 397964 397526 388396 388789 375984 372682 379175 385108 395576 404393 404388 411525 414007 420544
32488 420544 407788 402729 418446 422046 425093 416643 410608 409318 409780 416670 413744 417147 408003 420553
32474 420553 418046 414843 415476 407171 412783 428905 431530 415926 408291 413412 428049 439385 444159
32461 444159 443953 433564 422176 423799 437679 436505 439377 439606 419438 414305 428009 442191 450064
32448 450064 457310 464624 464978 454687 443116 444236 448021 443828 438597 425641 427978 427414 434684 441176
32434 441176 437865 431592 424758 422343 422464 420197 418343 415773 421889 432992 445992 440704 428349 427491
32420 427491 433542 435802 431632 428767 435223 439527 434887 440687 444386 441794 442333 443084 449240 445508 429083
32405 429083 429719 441011 454141 462442 455778 453527 444772 439740 446585 450374 450429 460288 466008 476545
32391 476545 469393 471183 473886 471391 464421 473021 468103 464802 455159 443832 448606 466650 475647 470167
32377 470167 462650 455635 464932 461537 455710 451719 454113 463927 478537 467473 453544 456991 456332 453743
32363 453743 448855 464719 477804 479737 480555 491322 491527 481275 468690 475304 480721 481697 480861 469990
32349 469990 472081 476678 470944 475241 485229 475592 474300 483166 487976 497289 492762 482131 485857 486494
32335 486494 480412 473522 471929 471217 466212 469643 467336 467636 473760 475669 478082 470641 463181 475216
32321 475216 487010 481835 479874 487568 488659 481389 478870 491824 495330 495704 498646 496751 496680 497416 499754
32306 499754 501454 507939 512573 525440 527207 516295 502960 495111 498979 504312 507154 509461 514322
32293 514322 495936 490963 501786 497975 499500 498643 492702 486405 493702 493067 491965 486334 491176 502321
32279 502321 492744 484008 483844 486093 485516 492410 493097 503517 512339 500758 494396 488989 494839 509929
32265 509929 513313 508747 514863 519852 520350 525323 529383 519678 522519 522383 514165 508765 512168 532699
32251 532699 523335 506374 494632 502109 501743 502174 494961 511228 519678 506898 504465 508477 516200 519522
32237 519522 516670 513627 504226 498242 508017 512526 520502 523877 517452 509174 505697 506736 505056 505440
32223 505440 505069 504912 501614 499257 513182 511932 495617 493531 491104 481082 482744 491755 497505 494468
32209 494468 491185 509968 510223 513747 523797 525204 531358 540606 537266 525358 518928 514640 509162 522174
32195 522174 537825 536685 521414 513049 507822 504557 506541 509164 515965 507881 517454 521565 514166 510956
32181 510956 523372 526596 520619 503925 516544 519517 512710 514841 524421 526072 522809 524743 533026
32168 533026 524450 512102 509239 500680 514410 514683 522710 535958 540501 529120 514142 511650 510579
32155 510579 512190 510776 506020 512949 517580 525428 521117 510223 503239 514889 513444 521290 527314 516249
32141 516249 519941 525260 529183 530640 529131 526189 525712 520000 524038 523007 511158 508641 515473 520181
32127 520181 520654 529864 526345 514220 498202 486314 489550 489170 496268 494349 505885 513402 523920
32114 523920 527312 520977 507154 486282 478526 483238 492683 505343 526628 525907 509499 521246 521329
32101 521329 518966 519137 525663 539277 543812 539093 533867 519790 506579 502376 511839 507042 501126 505766
32087 505766 507804 517149 540143 540292 526928 510337 492044 484610 495950 515958 529216 525493 520558
32074 520558 508242 511427 512607 515150 526096 537319 535245 530341 526729 519539 518896 536954 527736
32061 527736 512586 521949 513969 501848 498758 509190 522218 511161 503829 506834 522985 524306 534888
32048 534888 533681 523163 526974 537470 534966 528330 535941 518955 508811 494747 507570 521169
32036 521169 509734 510551 524216 530510 530005 529323 527402 530074 530916 526679 533881 544118 529477 517412
32022 517412 531997 541501 529855 509050 508082 510305 522693 539963 555262 540546 515402 517334
32010 517334 530995 545777 533130 525379 535320 541834 533489 517301 516386 528572 542068 533596 529177
31997 529177 530195 530502 534265 529712 530814 530777 539103 537393 529253 525530 527584 520624 517553 515948 515726
31982 515726 525858 523537 509975 499508 503777 516810 515121 520468 536612 534072 526465 520070 528073
31969 528073 531681 528132 519077 506307 512136 522981 527800 538822 539214 532535 530822 526081 525178 530336
31955 530336 526791 506287 502081 526658 538990 547520 540375 524664 531265 530874 521965 511346 526083
31942 526083 535510 536545 541562 541346 543079 538641 524126 515885 535373 533466 523664 513895 519304 512223
31928 512223 518674 519212 508912 507328 519300 528313 523801 524901 525379 513904 502588 529530 534700
31915 534700 536358 542335 540323 552224 552925 544128 518445 519885 530792 542123 547764 558514 545953
31902 545953 529245 536584 536538 538681 545799 541625 544253 541972 547216 545092 537242 541147 533470 528239
31888 528239 528642 530780 529802 533908 538498 536358 529946 521879 509087 497939 501136 519443 535644 537433
31874 537433 528426 513135 513441 532867 548563 555439 547515 534749 543566 547044 551564 554623 542296
31861 542296 540077 539482 532712 525724 533944 527771 527685 535139 539654 540610 538938 555295 558436 547643 546436
31846 546436 544105 544390 539346 533330 532030 533608 534077 532264 524822 513492 516513 527868 529920 531577
31832 531577 532662 526839 520652 521538 526677 525438 534733 531174 530323 522140 512793 503704 514611 530951
31818 530951 543907 535362 538298 543122 547769 546786 545792 547720 549389 552244 553879 557305 555587 540372
31804 540372 529195 527945 520740 509791 519832 526427 527893 530869 541068 544873 535479 536358 542133
31791 542133 540125 535355 533075 529009 524547 526371 539342 544960 553919 544114 538120 539050 537386 535865
31777 535865 550329 559144 561179 553566 544970 545862 544025 532347 537870 545833 543743 544341 547998 535238
31763 535238 525430 534731 529023 534273 523176 519576 526879 526555 515135 513635 515240 508308 514523 520536
31749 520536 532632 535978 536798 533016 542644 531000 518622 506281 523700 520841 520941 530008 533163
31736 533163 524617 522508 526246 528309 523769 521215 528988 545569 544040 532293 530371 534038 518727
31723 518727 514252 529394 535904 528956 537715 544051 540054 510005 501909 512855 515265 515148 517149 525285
31709 525285 529090 532097 527031 525454 535285 540705 527469 522149 528827 538678 552109 540505 540902 540454
31695 540454 541464 524118 516007 526903 536638 545282 543483 533475 535658 550556 554098 551208 542697
31682 542697 545629 525160 522937 533594 528907 526675 523230 513374 509072 511732 525581 529833 536752
31669 536752 544174 546769 553116 548773 553664 568112 554199 536684 533279 529762 525411 519476 523632
31656 523632 531099 534613 525583 530794 531599 535466 552168 559653 557152 543634 544435 539895 533842 525775
31642 525775 541071 538539 540463 547763 546240 537760 543888 540872 531235 533055 533725 542622 555950 546083
31628 546083 524608 517040 520695 535387 549168 533778 527513 539267 540920 535250 540393 541536 553221
31615 553221 555046 558045 548917 537536 539625 532380 530948 534717 534305 528111 526112 527536 538639 549626
31601 549626 546049 546712 552841 537626 515135 538408 534838 522859 524687 529270 530243 528572 529065 525535
31587 525535 528526 531543 539730 532825 519473 528107 546603 543321 533958 539687 541211 538924 548394 545694
31573 545694 535618 535970 538573 542370 540471 535469 544646 541994 547091 550366 560549 566841 564181 552735
31559 552735 526717 532996 543666 534454 541025 549960 541965 540307 551035 539476 518873 515664 519478
31546 519478 524535 532689 541274 549775 555245 556298 559732 553707 532350 518362 521020 530316 537802 540640
31532 540640 546195 551529 551342 548693 539194 532074 541925 554228 549321 553077 556034 552366 551323 547739
31518 547739 534986 534953 544681 549292 562331 556180 539352 533830 538345 530492 534971 528253 519164 515704
31504 515704 518245 521450 532975 540530 538974 538221 545579 550741 547654 537818 537973 538430 544771 534253
31490 534253 531565 542106 560713 569538 563602 557587 563181 562567 545554 528547 530585 530942 527955 520984
31476 520984 522761 529592 538884 526306 523358 532048 552409 551444 542366 525652 529111 522743 520462 526387
31462 526387 536592 545618 553521 560865 560407 559252 551186 546078 549871 555424 560830 546286 541763 537289
31448 537289 536570 528564 529639 526041 520830 538450 557827 554228 551535 556655 546981 532461 523040 522948
31434 522948 526424 541010 547367 548812 550557 529706 519958 529965 535424 534959 534444 545319 545095 544446
31420 544446 543747 539694 549862 549752 548844 541355 549976 547879 554627 569715 570007 558738 548316 550888
31406 550888 553422 556672 559729 553531 547126 531994 539832 536994 539927 545938 545761 539695 544106 542188
31392 542188 547067 549442 543396 540439 546108 557626 554271 544155 541320 547782 563088 567882 565204
31379 565204 554276 545583 541149 533051 544747 551359 543521 550967 558038 555165 547278 544452 534014
31366 534014 532697 530789 529754 547074 548119 544266 538988 534827 548305 555385 556902 555851 549637 536779
31352 536779 527512 523867 535497 553572 550054 548010 541053 547925 552503 538364 538967 550479 552581
31339 552581 548967 559474 558735 547564 552611 553041 546332 530472 531066 535257 532844 536687 530045 531577
31325 531577 536440 534305 528948 541907 546712 551673 553176 545739 537715 541936 550789 552081 552764 546322
31311 546322 530618 528340 547679 560061 557932 561919 555791 553625 537048 527214 524477 531534 537905
31298 537905 548857 558903 553976 546286 540391 553736 560602 549830 537915 534519 536893 526508 527244
31285 527244 532078 534344 537957 547423 554618 552776 541640 540595 536891 542818 534564 530029 529318 532518
31271 532518 548322 558307 548708 543432 548874 548364 552963 552723 553038 553747 557647 554629 553700 550127 549653
31256 549653 559447 570534 563649 545137 544377 549232 541290 541641 540823 526288 525872 551389 568787 565174
31242 565174 560913 547051 544162 558657 570842 575288 577021 577085 556521 545637 563107 567819 567333
31229 567333 552988 547203 558462 558739 557234 558703 554321 547140 556467 563488 578834 572795 558151
31216 558151 551140 554424 543408 537661 535906 530724 532127 537147 535703 536521 546543 555216 575186 581294
31202 581294 557776 550457 552976 554705 551163 548569 555201 577073 568241 569279 560808 553659 563782
31189 563782 567916 567036 573231 574860 569254 563868 565353 570419 564692 570306 552395 544568 545562 542145
31175 542145 549201 566451 569475 571654 567608 567169 576989 585728 567706 557081 559210 547979 535604
31162 535604 540855 532528 529553 541230 560649 563491 568018 562027 567700 578274 587932 591002 582146
31149 582146 561470 550503 552748 548590 551016 538498 525200 522538 527395 528665 526796 536583 545024
31136 545024 547044 548266 554533 577550 577166 561401 566148 569247 565290 557210 560568 557684 565120 574636
31122 574636 571900 548646 535403 537829 547209 556613 548962 543746 547541 547447 550571 547599 547015 529395
31108 529395 527234 528528 536356 557021 566417 553679 552372 548449 541643 550796 556131 554170 547413 543379
31094 543379 545618 544762 533339 542750 560881 562503 540655 539191 530009 529472 531579 535689 528567 524705
31080 524705 531387 524518 522294 524326 540158 553531 560912 556467 550875 553353 554086 550082 545095 545035
31066 545035 552881 549688 551101 564416 565749 555398 547403 531780 528687 542513 560840 568026 573761
31053 573761 565587 563933 546635 548542 559020 556565 545311 540744 544271 555621 557060 550071 557353
31040 557353 564458 570019 570731 560502 556789 562019 572414 572690 567312 561070 553178 557513 543678 544055
31026 544055 542424 542304 536560 532015 524765 527802 539582 546238 542605 545515 549077 546529 560898 575742
31012 575742 584259 572487 558842 550631 544724 548376 555952 564217 565820 563987 567205 571622 574263 579496
30998 579496 574348 559127 555699 562197 577174 572644 562164 549001 533519 536591 550849 562315
30986 562315 546998 545557 562154 565831 561083 557844 562978 571328 562872 551136 553495 558877 560399
30973 560399 555546 547056 544146 557631 563581 575898 564012 561625 573489 575984 573563 563041 550078
30960 550078 553683 572514 580039 581188 577927 561065 551245 545911 550377 560945 573172 575951 574911
30947 574911 577514 582182 571567 560499 549403 548249 544167 546724 569541 570775 561331 560125 557969
30934 557969 548134 546953 558028 568098 572078 565803 559553 571826 571759 561534 560923 553990 553467 560293
30920 560293 559253 549138 535068 540939 547567 555463 552903 541675 542329 555288 571795 569513 556868
30907 556868 545599 544639 549435 556001 551658 554801 560743 558394 560652 561572 551394 556174 562560 566011
30893 566011 571982 576212 581565 571401 570676 570373 561074 557224 546696 543062 550778 544716 559196 559244
30879 559244 553242 557197 566913 563927 550691 546077 543255 568190 585599 578850 569790 557325 563043
30866 563043 565730 569411 576914 578752 576108 568381 566426 572697 568662 563946 568362 556164 550905 552813
30852 552813 550775 536287 539728 551041 554404 560831 568434 573000 576163 570642 564063 574788 574049 569221
30838 569221 568965 556813 565424 567109 579918 577941 568901 561104 576481 583338 580661 573249 579639 566271
30824 566271 558757 554485 550123 550802 558738 566085 558049 553477 557622 551956 545965 552302 562538 567098
30810 567098 562488 550848 546499 547232 552087 565566 566439 569040 568801 572168 581721 588386 585974 585909 588453
30795 588453 590125 576052 570625 574240 572693 558213 545380 549945 561734 557744 556984 557205 564405 566262
30781 566262 560440 553541 553300 549027 543793 554858 568813 568769 569388 557698 560698 566915 546871 550015
$$ [...]
##END NTUPLES=NMR SPECTRUM
##END=
