##TITLE=Analysis number 324590
Compound Code cc 57116
Book Reference 451/183/7
Project Code adrs
Chemist Name evam
##JCAMPDX= 6.0         $$ Bruker NMR JCAMP-DX V2.0
##DATA TYPE= NMR SPECTRUM
##DATA CLASS= NTUPLES
##ORIGIN= Bruker BioSpin GmbH
##OWNER= nmr
$$ XWIN-NMR		Version 3.5
$$ Mon Nov 27 12:01:46 2006 GMT Standard Time (UT+0h)  MAYBRIDGE\nmr@NMR_250MHZ
##.OBSERVE FREQUENCY= 250.131544655141
##.OBSERVE NUCLEUS= ^1H
##.ACQUISITION MODE= SIMULTANEOUS (DQD)
##.ACQUISITION SCHEME= undefined
##.AVERAGES= 16
##.DIGITISER RES= 18
##SPECTROMETER/DATA SYSTEM= dpx250
##.PULSE SEQUENCE= zg30
##.SOLVENT NAME= CDCl3
##.SHIFT REFERENCE= (INTERNAL, CDCl3, 0, 16.522)
##AUDIT TRAIL= $$ (NUMBER, WHEN, WHO, WHERE, WHAT)
$$ ##TITLE= Audit trail, XWIN-NMR		Version 3.5
$$ ##JCAMPDX= 5.01
$$ ##ORIGIN= Bruker BioSpin GmbH
$$ ##OWNER= nmr
$$ C:\u/data/dgb/nmr/ADRS/1160/pdata/1/auditp.txt
$$ ##AUDIT TRAIL=  $$ (NUMBER, WHEN, WHO, WHERE, WHAT)
(   1,<2006-11-27 12:01:21.01 +000>,<MAYBRIDGE\nmr>,<NMR_250MHZ>,
      <created by zg, POWCHK disabled, PULCHK disabled
       configuration hash MD5:
       49 4B E0 1D 92 C2 6B 37 9F E6 65 BC 52 41 86 1D
       data hash MD5: 64K
       F0 9D 12 9F 84 EC 78 F5 C2 3C A3 0E E4 32 E7 30>)
(   2,<2006-11-27 12:01:35.58 +000>,<MAYBRIDGE\nmr>,<NMR_250MHZ>,
      <Start of raw data processing
       ef LB = 0.3 FT_mod = 6 PKNL = 1 SI = 32K 
       data hash MD5: 32K
       9A 59 A6 15 A7 43 BB D4 D9 5E BF 6D 6B 55 3B 80>)
(   3,<2006-11-27 12:01:37.81 +000>,<MAYBRIDGE\nmr>,<NMR_250MHZ>,
      <apk 
       data hash MD5: 32K
       CC 2A C0 35 0B 7E 3E C2 21 0A 67 A0 6E A4 CA BE>)
(   4,<2006-11-27 12:01:38.56 +000>,<MAYBRIDGE\nmr>,<NMR_250MHZ>,
      <abs ABSG = 5 
       data hash MD5: 32K
       A0 CA F6 BC 31 5F 0E 2A 22 E7 A2 90 BD 3B 5E DF>)
$$ ##END=
$$ 
$$ hash MD5
$$ 3A 6C 16 6F E7 75 3D AF 1B 4F 84 78 37 9B 43 0F
##$RELAX= 
##$RELAX= 
##$RELAX= 
##$RELAX= 
##$RELAX= 
##$RELAX= 
##$RELAX= 
$$ Bruker specific parameters
$$ --------------------------
##$DU= <C:\u>
##$EXPNO= 1160
##$NAME= <ADRS>
##$PROCNO= 1
##$TYPE= <nmr>
##$USER= <dgb>
##$AMP= (0..31)
100 100 100 100 100 100 100 100 100 100 100 100 100 100 100 100 100 100 
100 100 100 100 100 100 100 100 100 100 100 100 100 100 
##$AQSEQ= 0
##$AQ_mod= 3
##$AUNM= <au_zg>
##$AUTOPOS= <49 >
##$BF1= 250.13
##$BF2= 250.13
##$BF3= 250.13
##$BF4= 250.13
##$BF5= 500.13
##$BF6= 500.13
##$BF7= 500.13
##$BF8= 500.13
##$BYTORDA= 1
##$CFDGTYP= 0
##$CFRGTYP= 5
##$CHEMSTR= <none>
##$CNST= (0..31)
1 1 145 1 1 1 1 1 1 1 1 1 1 1 1 1 1 1 1 1 1 1 1 1 1 1 1 1 1 1 1 1 
##$CPDPRG= <>
##$CPDPRG1= <>
##$CPDPRG2= <>
##$CPDPRG3= <>
##$CPDPRG4= <mlev>
##$CPDPRG5= <mlev>
##$CPDPRG6= <mlev>
##$CPDPRG7= <mlev>
##$CPDPRG8= <mlev>
##$CPDPRGB= <>
##$CPDPRGT= <>
##$D= (0..31)
0 1 0 0 0 0 0 0 0 0.06 0 0 0 0 0 0 0.0002 0 0 0 0 0 0 0 0 0 0 0 0 0 0 
0 
##$DATE= 1164628879
##$DBL= (0..7)
120 120 120 120 120 120 120 120 
##$DBP= (0..7)
150 150 150 150 150 150 150 150 
##$DBP07= 0
##$DBPNAM0= <>
##$DBPNAM1= <>
$$ [...]
##$SUBNAM7= <"">
##$SUBNAM8= <"">
##$SUBNAM9= <"">
##$SW= 20.6930455092707
##$SWIBOX= (0..15)
0 0 3 0 0 0 0 0 0 0 0 0 0 0 0 0 
##$SW_h= 5175.983436853
##$TD= 65536
##$TD0= 1
##$TE= 294.16
##$TE2= 300
##$TE3= 300
##$TEG= 300
##$TL= (0..7)
0 120 120 120 120 120 120 120 
##$TP= (0..7)
150 150 150 150 150 150 150 150 
##$TP07= 0
##$TPNAME0= <>
##$TPNAME1= <>
##$TPNAME2= <>
##$TPNAME3= <>
##$TPNAME4= <>
##$TPNAME5= <>
##$TPNAME6= <>
##$TPNAME7= <>
##$TPOAL= (0..7)
0.5 0.5 0.5 0.5 0.5 0.5 0.5 0.5 
##$TPOFFS= (0..7)
0 0 0 0 0 0 0 0 
##$TUNHIN= 0
##$TUNHOUT= 0
##$TUNXOUT= 0
##$USERA1= <user>
##$USERA2= <user>
##$USERA3= <user>
##$USERA4= <user>
##$USERA5= <user>
##$V9= 5
##$VALIST= <valist>
##$VCLIST= <CCCCCCCCCCCCCCC>
##$VD= 0
##$VDLIST= <DDDDDDDDDDDDDDD>
##$VPLIST= <PPPPPPPPPPPPPPP>
##$VTLIST= <TTTTTTTTTTTTTTT>
##$WBST= 1024
##$WBSW= 4
##$XGAIN= (0..3)
0 0 0 0 
##$XL= 0
##$YL= 0
##$YMAX_a= 476779
##$YMIN_a= -556928
##$ZGOPTNS= <>
##$ZL1= 120
##$ZL2= 120
##$ZL3= 120
##$ZL4= 120
##$ABSF1= 16.522
##$ABSF2= -4.171173
##$ABSG= 5
##$ABSL= 3
##$ALPHA= 0
##$AQORDER= 0
##$ASSFAC= 0
##$ASSFACI= 0
##$ASSFACX= 0
##$ASSWID= 0
##$AUNMP= <proc_1d>
##$AZFE= 0.1
##$AZFW= 0.1
##$BCFW= 0
##$BC_mod= 0
##$BYTORDP= 0
##$COROFFS= 0
##$CY= 12.5
##$DATMOD= 1
##$DC= 0
##$DFILT= <>
##$DTYPP= 0
##$F1P= 14.0000005364418
##$F2P= -0.99999901652339
##$FCOR= 0.5
##$FTSIZE= 32768
##$FT_mod= 6
##$GAMMA= 0
##$GB= 0
##$INTBC= 1
##$INTSCL= 1
##$ISEN= 128
##$LB= 0.3
##$LEV0= 0
##$LPBIN= 0
##$MAXI= 10000
##$MC2= 0
##$MEAN= 0
##$ME_mod= 0
##$MI= 0
##$NCOEF= 0
##$NC_proc= -4
##$NLEV= 6
##$NOISF1= 0
##$NOISF2= 0
##$NSP= 0
##$NTH_PI= 0
##$NZP= 0
##$OFFSET= 16.522
##$PC= 1
##$PHC0= 222.2006
##$PHC1= 7.113237
##$PH_mod= 1
##$PKNL= yes
##$PPARMOD= 0
##$PSCAL= 4
##$PSIGN= 0
##$REVERSE= no
##$SF= 250.13
##$SI= 32768
##$SIGF1= 0
##$SIGF2= 0
##$SINO= 400
##$SIOLD= 32768
##$SREGLST= <1H.CDCl3>
##$SSB= 0
##$STSI= 32768
##$STSR= 0
##$SW_p= 5175.98343685301
##$SYMM= 0
##$S_DEV= 0
##$TDeff= 65536
##$TDoff= 0
##$TI= <Analysis number 999999
Compound Code 99
Book Reference 9
Project Code 9>
##$TILT= no
##$TM1= 0
##$TM2= 0
##$TOPLEV= 0
##$USERP1= <user>
##$USERP2= <user>
##$USERP3= <user>
##$USERP4= <user>
##$USERP5= <user>
##$WDW= 1
##$XDIM= 32768
##$YMAX_p= 340271609
##$YMIN_p= -201957
$$ End of Bruker specific parameters
$$ ---------------------------------
##NTUPLES= NMR SPECTRUM
##VAR_NAME=  FREQUENCY,     SPECTRUM/REAL,   SPECTRUM/IMAG
##SYMBOL=    X,             R,               I
##VAR_TYPE=  INDEPENDENT,   DEPENDENT,       DEPENDENT
##VAR_FORM=  AFFN,          ASDF,            ASDF
##VAR_DIM=   32768,         32768,           32768
##UNITS=     HZ,            ARBITRARY UNITS, ARBITRARY UNITS
##FACTOR=    0.157963299565203, 1,           1
##FIRST=     4132.6476996994, 0,             0
##LAST=      -1043.33573715361, 0,           0
##MIN=       -1043.33573715361, -201957,     0
##MAX=       4132.6476996994, 340271609,     0
$$ Real data points
##PAGE= N=1
##DATA TABLE= (X++(R..R)), XYDATA
$$ [...]
23650d9597M4380L1226m6182M4653N5131J5297K8105l809j9639j1908n5193l5392
23638b928J1372J06611N6240l1731p8810n8715K5396M8145j4568k7488J4326K4269
23626G2119K5259q396J3730J0233J8669m5521n9569k5656Q334j6301m1588Q9617
23614D0930Q1109k2027m7543k6997K0995M0347j3782k7335J3728l8405l2873O219
23602e634M19l2539l4871M4189r187l2702K6816n708k2688j3906J3548J7837J2593
23589d1833O0115R944O472J4282l3546K8351N3056m1492l9651K1425n5755n8194
23577g6826J9372N8337M2629M0500p203l1682m3614j1629L9533o06m5237J4783
23565a643j5294K7924k3785O966L5162O1672m669k9134O39k5163j5468J3491K6340
$$ plain form
23650 -49597 -5217 26009 -20173 24480 79611 94908 123013 119204 99565 87657 32464 -2928
23638 -2928 8444 115055 171295 139564 60754 2039 27435 75580 61012 33524 47850 72119
23626 72119 97378 88982 102712 112945 131614 86093 26524 868 9202 -7099 -48687 40930
23614 40930 122039 100012 52469 25472 46467 86814 73032 45697 59425 21020 -11853 -5634
23602 -5634 -5215 -37754 -72625 -28436 -37623 -70325 -43509 -49217 -71905 -85811 -72263 -54426 -41833
23589 -41833 18282 28226 34698 48980 15434 43785 96841 55349 15698 37123 -18632 -76826
23577 -76826 -57454 883 43512 84012 76809 45127 1513 -10116 29417 28811 -16426 -1643
23565 -1643 -16937 10987 -12798 -5832 29330 91002 86333 57199 57838 32675 17207 30698 57038
23552E7038m7876k8472O120J2681j2382M155K3259m4040K5737j8343K157K3319
23540C353J7899K5091J0498k8070J0369M1526J9029L1346l4708n8257L5814l6573
23528C7317k1574J4770Q296L9893k5363n7464m0464K6920o2756o6504J3956M5170
23516h7803K3499K8506j0128K1854j4340j0648K4386j4865k5704n588K6873M1368
23504b590R011j412J2801o374o825P568m9987k5463P5738K6026o5257j4803j9435
23491f1002K3096L9078J7641k5796K2418O5455K6040j1261k5154j2929K2313l8276
23479D1623M515m4117j8301j5643n6531l433M0708J5938K7581L9919K1677j8712
23467C5224j0506q716j9949M174R97j367j4056R309L6682k2753k91L6227O064
$$ plain form
23552 57038 9162 -19310 -13190 -509 -12891 -8736 14523 -29517 -3780 -22123 -19966 3353
23540 3353 21252 46343 56841 28771 39140 80666 99695 131041 96333 38076 73890 37317
23528 37317 15743 30513 38809 78702 53339 -4125 -44589 -17669 -80425 -146929 -132973 -87803
23516 -87803 -64304 -35798 -45926 -24072 -38412 -49060 -24674 -39539 -65243 -70831 -43958 -2590
23504 -2590 6421 5009 17810 11436 4611 12179 -37808 -63271 12467 38493 -26764 -41567 -61002
23491 -61002 -37906 1172 18813 -6983 15435 80890 106930 95669 70515 57586 79899 41623
23479 41623 46138 2021 -16280 -31923 -88454 -91887 -51179 -35241 -7660 32259 53936 35224
23467 35224 24718 16002 -3947 227 1224 -143 -14199 -4890 31792 9039 8748 44975 51039
23454E1039m7789J112J145l5519j8177J5792O261K0471m456J153L2526N377n3237
23441b4302q1776l4126M8435P7783k4541L5812K5395J2256J6817M142m0513K9095
23429D4477Q650j1916L0571k4825l1890o529j1625K4223j5567J7535L1340K1703
23417G6147j5655l5036l6133l019j3736N3783J7458k8178l8628M463l3630k4617
23405g6781L64K858N1027l9806P097J6433P257p3855L9096M0886P416l356p064
23392b8428l6790l1153J0618N2303P6511n3575o6294O866K9565J770O1792M8926
23380G2111P102k7187M6509m7230o0466j8409J0050l613L999j640M3930K8830
23368E3986K1883o5828j9982J6213P027O883K3801n3090q081P4326J2734l228
$$ plain form
23454 51039 3250 4362 5507 -30012 -48189 -32397 -26136 -5665 -10121 -8968 23558 28935 -24302
23441 -24302 -106078 -140204 -91769 -13986 -38527 -2715 22680 34936 51753 55895 15382 44477
23429 44477 53127 41211 71782 46957 15067 8538 -3087 21136 5569 23104 54444 76147
23417 76147 60492 25456 -10677 -13696 -27432 26351 43809 15631 -22997 -18534 -52164 -76781
23405 -76781 -76417 -73559 -22532 -62338 -55241 -38808 -31551 -105406 -66310 -25424 -18008 -21364 -28428
23392 -28428 -65218 -96371 -85753 -33450 43061 -10514 -76808 -69942 -40377 -38607 23185 72111
23380 72111 79213 52026 98535 51305 -9161 -27570 -17520 -21133 -17134 -18774 25156 53986
23368 53986 75869 10041 -9941 6272 13299 20182 43983 -9107 -17188 57138 69872 66644
23356F6644n4094l0810j3400J866L513O0300N635J8965R233j8255P056k8345p0222
23343d1914n4491N5949K6120K0644O7222Q268k0390j0064n3584j9678p93j6010
23331c8721J5959J860m2216m2019M888k4866m636N4367L3860J2971j7627l5288
23319h1468k2770l0309j6285L5741N2816M281n567k1972M2013M328n3848q013
23307a01053l1530L9758J6669J5404M7816q834j4642K5065J4496J3956P025L7001
23295F1131j9514k7035k8646k4433n710K258N3158K6087j7874K3295j4445k850
23283B5422k521j3515P846j0710K0520M1946J6007m9411j1638q100j9783J6708
23271A2771Q766k7641o7259j6698K4805K8183p225q675j9481J7099M7000k1609
$$ plain form
23356 66644 12550 -18260 -31660 -29794 -26281 34019 39654 58619 67852 49597 56653 28308 -41914
23343 -41914 -96405 -40456 -14336 6308 73530 81798 61408 51344 -2240 -21918 -22711 -38721
23331 -38721 -22762 -20902 -63118 -105137 -100249 -125115 -129751 -75384 -41524 -28553 -46180 -81468
23319 -81468 -104238 -134547 -150832 -115091 -62275 -57994 -63561 -85533 -43520 -39192 -93040 -101053
23307 -101053 -132583 -92825 -76156 -60752 -12936 -21770 -36412 -11347 3149 17105 24130 61131
23295 61131 41617 14582 -14064 -38497 -44207 -41949 11209 37296 19422 42717 28272 25422
23283 25422 22901 9386 17232 6522 27042 68988 84995 35584 23946 15846 -3937 12771
23271 12771 21537 -6104 -73363 -90061 -65256 -37073 -44298 -52973 -72454 -55355 -8355 -29964
23259b9964P991q5K3710K6931K9829j9388M696J3104m1330J829J1641L799l4074
23246a311k8135j9231J1624j5247n6869M2156j7213L1027N0747J4263k376m716
23234D719L7302J8046Q202K6375j8368m6729o1363K3933L4234n2830R687K9161
23222A2369j9320J1329J919L2679n252j9236m9919k0089j7408n663K0173L1269
23210b7149O7728M4611K7605j4486l1429m007J1763l3031k0310j8192K7722j5863
23198A4962k6118J4943J0387j0301l587J1825j2240N888m5546j9699N6878n0918
23186e3526p1961L0035P8595P9899m0440K1895o8900l1789L5636N2462m8586o715
23174b3395J7683O0556l646n1381j6251l643J4939l3613K5364j5958L3361m372
$$ plain form
23259 -29964 -21973 -22058 1652 28583 58412 39024 43720 56824 15494 17323 28964 32763 -1311
23246 -1311 -29446 -48677 -37053 -52300 -109169 -67013 -84226 -53199 -2452 11811 9435 4719
23234 4719 42021 60067 68269 94644 76276 29547 -31816 -7883 26351 -26479 -16792 12369
23222 12369 -6951 4378 6297 38976 33724 14488 -35431 -55520 -72928 -78591 -58418 -27149
23210 -27149 40579 85190 112795 98309 66880 62873 74636 41605 21295 3103 30825 14962
23198 14962 -11156 3787 14174 3873 286 12111 -129 5759 -39787 -59486 -2608 -53526
23186 -53526 -125487 -95452 -16857 63042 22602 44497 -24403 -56192 -20556 31906 -16680 -23395
23174 -23395 -5712 54844 51198 -183 -16434 -20077 -5138 -38751 -13387 -29345 4016 -356
23162c56K4215K7651m4950J2611m0217l1646l3058L8633K5194J09L7743k6580
23150a0651o8218J6659j4742K9002J8686m0506l7028J0421N5995M3585L6241K220
23138D1664O799M0259k6249l0485l6435l127k425J990K300k9261L0089L7906j8558
23125A4467p083K6690J6515J8787l5280k4815O637K1335j1776k2693L0483k2478
23113A0789K8809J8360j1920K3543Q437J8827Q445j2882K43l3375k6382j2296
23101B0598j9899l1985k4070N4945L017O290O077l4085J1456M4211j2875n5606
23089c1926k3376N325J5917r002k7089l2028K5920J7796O0020M6449j943n0378
23077d315j7809J2405l1704r969k632K7436N7141p592j8630m028l825k7728k6212
$$ plain form
23162 -356 23859 51510 6560 19171 -21046 -52692 -85750 -47117 -21923 -21814 15929 -10651
23150 -10651 -78869 -62210 -76952 -47950 -29264 -69770 -106798 -96377 -40382 3203 39444 41664
23138 41664 48463 88722 62473 31988 -4447 -7574 -9999 -8009 -5709 -34970 -4881 33025 14467
23125 14467 7384 34074 50589 69376 34096 9281 15918 37253 25477 2784 33267 10789
23113 10789 39598 57958 46038 69581 78018 96845 105290 92408 92651 59276 32894 20598
23101 20598 699 -31286 -55356 -411 2606 8896 14973 -19112 -7656 36555 23680 -31926
23089 -31926 -55302 -49977 -34060 -43062 -70151 -102179 -76259 -58463 1557 48006 46063 -4315
23077 -4315 -22124 -9719 -41423 -51392 -54024 -26588 30553 22961 4331 303 -3522 -31250 -57462
23064e7462K1101N4572M1440m8270k6969J7781K4312L0847j257L585o893j4063
23052C8724L410n287l756J8295J8312k0408l4979o5023j440k76r064Q1185Q3n3749
23038c3973k3107J2945K6953k0200L8651j1429n0910p638j8782o292J6209J8742
23026e8831J472J8725K6103l4280J3657r733J5184k588k6117k2478J8984J7041
23014d2861j412P284M1766R43n2341r743Q311K8501M097n0239M5006M269m4439
23001f0858j6403J8029O113J1909L0401K460J639L2466J4042m9977N1577J6798
22989E8196j4394J867m6504k0524k5429O450J4418J7310k7795J64j7552L2149
22977b1644P560j0629J2102J1420M0029J2087m2857k6241K5884N340n0462l2412
$$ plain form
23064 -57462 -36361 18211 59651 11381 -15588 2193 26505 57352 56095 59680 52787 38724
23052 38724 42134 36847 33091 51386 69698 49290 14311 -50712 -52152 -52428 -61492 19693 19776 -33973
23038 -33973 -57080 -44135 -17182 -37382 1269 -10160 -61070 -68708 -87490 -93782 -77573 -58831
23026 -58831 -57359 -38634 -12531 -46811 -33154 -42887 -27703 -30291 -56408 -78886 -59902 -42861
23014 -42861 -44273 -36989 4777 5720 -46621 -56364 -48053 -19552 -15455 -65694 -20688 -16419 -60858
23001 -60858 -77261 -59232 -53119 -41210 -10809 -8349 -6710 25756 39798 -10179 41398 58196
22989 58196 43802 45669 -835 -21359 -46788 -40338 -25920 -8610 -36405 -36241 -53793 -21644
22977 -21644 -14084 -24713 -12611 -1191 38838 50925 8068 -18173 7711 13051 -37411 -69823
22965f9823M6170L2062k7117n5706L7835M098k1600L9683m936n6887p170Q300
22953g5091O688l1202N9177N2402k0949n0382J3091r346M5455N3529o6186J3737
22941i077N50M0748M944l1438j3386J189m3442l4147K6031J5664L6602j7153Q444
22928a4471J9405k3952O9433j2941k9541L917J126L0218L7199j1080r234L3531
22916I3610k9988l1823n0259J4634J0780M6087k1837k7709j9441k6619M8515k4128
22904a8178m905J5232k0645M836k4403K8647J2238N3144J0120j5911o1778n808
22892b7411M5077J9013j4251n7446k2090N5918p237m9951L6011K2869j00081l3468
22880a33047N5749N4995o1393q4364O2056P9416K7704j191l4255m2124j346k1297
$$ plain form
22965 -69823 -23653 8409 -18708 -74414 -36579 -32481 -54081 -14398 -19334 -76221 -83391 -75091
22953 -75091 -68403 -99605 -40428 11974 -8975 -59357 -46266 -55612 -10157 43372 -22814 -9077
22941 -9077 -8527 32221 37165 5727 -7659 -6470 -49912 -84059 -58028 -42364 -5762 -22915 -14471
22928 -14471 4934 -19018 50415 37474 7933 11850 12976 43194 80393 69313 60079 93610
22916 93610 63622 31799 -18460 -3826 6954 53041 31204 3495 -15946 -42565 5950 -18178
22904 -18178 -23083 -7851 -28496 -23660 -48063 -19416 -7178 45966 56086 40175 -21603 -27411
22892 -27411 17666 36679 22428 -35018 -57108 -1190 -8427 -58378 -22367 502 -99579 -133047
22880 -133047 -77298 -22303 -83696 -168060 -106004 -26588 1116 -75 -34330 -76454 -77800 -99097
22868i9097l0551J7034N0472N8222l2304k2855P981K3408O5073J4908k0356p6352
22856d4417q520L4395K2530j0317m6150J9960M5563K8919j1511k4780k0776k4717
22844c9821j2228J6793L5388j0302j9029j498j7133j8610J2504l598k0289M0997
22832c6826j536j4704O703j1282k4564O6447j1438m7393K7867K1565l0950j1281
22820f7392k1260M066J7154j3430K0022K8770K4958P249j0104j0579l9787m1121
22808a01454M9260M3646K0760l3442J0508j9893O044J6133o225k3944K4827l9850
22796e3630M786J0313L2359k187L4718J2094k5070p008Q395l372k668n3810j3462
22783e8542l1819M7727J9840j5020j4271L5088k1823J5250J6072j8841m0969q766
$$ plain form
22868 -99097 -129648 -112614 -62142 -3920 -36224 -59079 -51098 -27690 37383 52291 31935 -44417
22856 -44417 -52937 -18542 3988 -6329 -52479 -32519 13044 41963 30452 5672 -15104 -39821
22844 -39821 -52049 -35256 132 -10170 -29199 -30697 -47830 -66440 -53936 -57534 -77823 -36826
22832 -36826 -38362 -53066 -46363 -57645 -82209 -15762 -27200 -74593 -46726 -25161 -56111 -67392
22820 -67392 -88652 -84586 -67432 -80862 -60840 -32070 -7112 137 -9967 -20546 -60333 -101454
22808 -101454 -52194 -8548 12212 -21230 -10722 -30615 -24571 -8438 -14663 -38607 -13780 -53630
22796 -53630 -48844 -38531 -6172 -8359 26359 38453 13383 6375 14770 11398 8730 -45080 -58542
22783 -58542 -90361 -42634 -22794 -37814 -52085 -16997 -38820 -23570 -7498 -26339 -67308 -76074
22771g6074M95j0421K2088J329k956l720J3274J1699J6323K035K3720j9365k488
22758b4061Q414p158r53L5661J0755J2570L0850P825k1463j895o694J0590K6322
22745H0763j046j6431k7305k1722n154J1273Q017L5981j3109m4113o1017K2743
22733c1120P362J0416L3876L4096J9994n2898K2424K0080n6542m7611M4993R314
22721A4384j4322j576M6622l068p583k0642J8579M4252L1660m9661K2314k4131
22709E6828n8340J9169K7194k8518o9716P653L210K2113J9820j8546K7626k210
22697F283k7927o3323p544O247k2803j7611j7530J7510Q3846L5983k3378K3859
22685f388K8151k2900L0430R65n1111j6257M7899l8053m568P825k4735q961P965
$$ plain form
22771 -76074 -75579 -86000 -63912 -62583 -65539 -69259 -55985 -44286 -27963 -25928 -2208 -21573 -24061
22758 -24061 -15647 -22805 -23758 11903 22658 35228 66078 73903 52440 50545 43851 54441 80763
22745 80763 79717 63286 35981 14259 9105 20378 28395 64376 51267 7154 -53863 -31120
22733 -31120 -23758 -13342 20534 54630 74624 21726 44150 64230 7688 -39923 5070 14384
22721 14384 62 -1514 45108 42040 34457 13815 32394 76646 108306 58645 80959 56828
22709 56828 -1512 17657 44851 16333 -53383 -45730 -42520 -20407 -587 -19133 8493 6283
22697 6283 -21644 -84967 -92511 -86264 -109067 -126678 -144208 -126698 -42852 -6869 -30247 -6388
22685 -6388 21763 -1137 29293 30258 -20853 -37110 10789 -27264 -31832 -24007 -48742 -57703 -49738
22672d9738j192L7705M197j0426M8217j9328k081N1381K1531k7565j1114j7686
22660B3901l8617m226L2751L7096n1142o3198L4441M5670K1989L4494j0580m8661
22648A3918k5348J1915j5254j1341K2973j8117l8545l1887P887N5928O8120j3169
22636B7080l7924J2265k7103J3199l436L3866J7665l6165j1471k3674K6723O1446
22624E2471J6568n244m6938j4993j3624k2397j2975J0734K8813k4467l8058M0604
22612b9506L0890N309J5473L0997k3099m1563L999r859J6270J3906r345o2131
22600e8659M1343M1764K2141k721k4535j5826Q490Q355J0262r039K1595R598J0333
22587F3101M3007k7048n2061l6376K598m0237K012M6220M8385L3714k5133k6677
$$ plain form
22672 -49738 -50930 -13225 -9028 -19454 28763 9435 7354 58735 80266 52701 41587 23901
22660 23901 -14716 -18942 13809 50905 -237 -63435 -28994 16676 38665 73159 62579 13918
22648 13918 -11430 485 -14769 -26110 -3137 -21254 -59799 -91686 -83799 -27871 40249 27080
22636 27080 -10844 1421 -25682 -12483 -15919 17947 35612 -553 -12024 -35698 -8975 52471
22624 52471 69039 63795 16857 1864 -11760 -34157 -47132 -36398 -7585 -32052 -70110 -29506
22612 -29506 1384 6693 22166 53163 30064 -11499 -7500 -17359 -1089 12817 3472 -58659
22600 -58659 -17316 24448 46589 43868 19333 3507 11997 20352 30614 21575 43170 52768 63101
22587 63101 106108 79060 26999 -9377 -6779 -47016 -45004 1216 49601 83315 58182 31505
22575C1505l8584l6513r959K1806K3346K0098m8005j6650M075K0544L9691L0909
22563D2263J8366m5199m0361m3652n0216P2601N3351j7569l5492m370N3714j4767
22551a1331l1378J030j5580k3627k51M7393L8378J8082n134L7968L487r370J9481
22538F9148Q794j3954m9617o0797L1382k1097j8347J2852o422J3097J6506L4662
22526A6207O298P057o1054l213N667l0686L6278l5441k3713N7568K0559j2693
22514a7166p1173m9954J0029N6946O1556J6874l405m9339m282P263o7477l8908
22502a49036O3397O9287K9996J903m7822m6823j2983K7211k0189K9301p289M4815
22490a8232K7082k2714K4521J8298j1548p6221l3829K9523O2175J1907J1372L1510
$$ plain form
22575 31505 -7079 -43592 -53551 -31745 -8399 11699 -36306 -52956 -48881 -28337 11354 42263
22563 42263 60629 15430 -24931 -68583 -118799 -46198 7153 -10416 -45908 -50278 3436 -11331
22551 -11331 -42709 -41679 -57259 -80886 -81137 -33744 4634 22716 17582 55550 59037 49667 69148
22538 69148 77942 63988 14371 -46426 -15044 -36141 -54488 -41636 -48058 -34961 -18455 16207
22526 16207 22505 29562 -31492 -34705 -29038 -59724 -23446 -58887 -82600 -25032 -4473 -17166
22514 -17166 -88339 -138293 -128264 -71318 -9762 7112 3707 -45632 -49914 -42651 -110128 -149036
22502 -149036 -85639 -16352 13644 15547 -32275 -79098 -92081 -64870 -85059 -55758 -63047 -18232
22490 -18232 8850 -13864 10657 28955 17407 -58814 -92643 -63120 -945 10962 22334 53844
22478E3844j6179m6021J4215J5687n6516l7824k7754N2029N0550j5822k7672J7579
22466b3884j4876n0274J4011M9293k5951r022K6982N542J2539l7999J8130M6967
22454A1458l7047r0271n2725J3617M7609M1431k1887p621k3964K9054J12178j1975
22442I857o5546R0710J1623l6953j7331n3016L0508Q0951l3984M4250K4919q2859
22430C129j7613k602L2073J9473k6222j3512k003j8546n112O1247L9286o4296
22418E302p4006L754n0M4573P6656N7686k0317m6337l3500l984K2811N5787l7287
22405E1088K928M5637K8482N3118L628J5965O2531K8049j8531N8363J24088J57010
22393F12356K29132M12635P82659J448672K509525L054645J708431P7489j253363
$$ plain form
22478 53844 37665 -8356 5859 21546 -34970 -72794 -100548 -48519 2031 -13791 -41463 -23884
22466 -23884 -38760 -89034 -75023 -25730 -51681 -60703 -33721 -28179 -15640 -53639 -35509 11458
22454 11458 -25589 -115860 -168585 -154968 -107359 -65928 -87815 -95436 -119400 -90346 21832 9857
22442 9857 -55689 35021 46644 9691 -7640 -60656 -30148 50803 16819 61069 85988 3129
22430 3129 -14484 -17086 14987 34460 8238 -5274 -7277 -25823 -30935 30312 69598 5302
22418 5302 -68704 -64950 -65000 -20427 56229 113915 93598 47261 13761 9777 32588 88375 51088
22405 51088 54016 99653 128135 181253 184881 200846 263377 291426 272895 331258 455346 612356
22393 612356 841488 1254123 2036782 3485454 5994979 9049624 10758055 10835544 9582181
22384I582181k817845k706668j520793p40878m51182k84781j96207j26696j60122
22375E77009j67891j24695l0816J8494l9047q5547k1584J4738l5685n780L059
22364A02255K0611o579n4942j5389j7651K1429j9185J8455K7263j6576o8408j8996
22352b7713k175l5805J7474L2979j5527n107L6038j3693Q384k7733j6325l21P94
22339d8730N3234K9243K3039K651J1791L5882Q447j2041K1189q2801m4645p148
22327i889n510L0730O564m9071L0413L0772j4571k3781J5133l8722m9867o7965
22315a45764k1843L022M2832P0447O9764M8992M085J5295j3891J6439J0145l1746
22303F7777m5676j7737n4118L0126M7716N0495n4389m2134j6881K9799k619m5510
$$ plain form
22384 9582181 6764336 4057668 2536875 1795997 1344815 1060034 863827 737131 577009
22375 577009 409118 284423 253607 272101 233054 147507 125923 140661 104976 99196 102255
22364 102255 122866 116287 61345 45956 28305 49734 30549 49004 76267 59691 -8717 -27713
22352 -27713 -29888 -65693 -48219 -15240 -30767 -35874 164 -13529 -5145 -32878 -49203 -49524 -48730
22339 -48730 4504 33747 56786 59437 71228 107110 115557 103516 124705 41904 -2741 -9889
22327 -9889 -15399 15331 21895 -27176 3237 34009 19438 -4343 10790 -27932 -77799 -145764
22315 -145764 -167607 -164585 -121753 -51306 18458 67450 71535 86830 72939 89378 99523 67777
22303 67777 22101 4364 -49754 -19628 28088 78583 24194 -17940 -34821 -5022 -7641 -53151
22291e3151k2967M306M7893L1666K8311L8174n929l7548k9451J2338j8040K917
22279a481k2116n8169M2831N6397l4177r958n574l1593M106j3223k227Q626l9014
22266a05572j0573k0257L1174p206O46K8561N1999m0288M5395N4280J8589r014
22254C7734k7893j2544l551k2906k7632j7989M3616O3659L0113l2103K6461L7015
22242I3980j6986j73j931j5356R902m9204N651M1728K3116L4770k4894l0318o1166
22229I119q3446k2628M2039M3313M0151K5980k3017l0872k7539M1582j8339j5571
22217a9228k0706l7503q738N0471k6123Q063K5873N08j6691j8794j8514o9041
22205a50423O727O9355K7973L4491j5877m4259M3442N3601j9145p3454n3073j3709
$$ plain form
22291 -53151 -76118 -71812 -23919 7747 36058 74232 68303 30755 1304 13642 -4398 -1481
22279 -1481 -23597 -81766 -38935 17462 -16715 -26673 -32247 -63840 -59734 -72957 -75184 -66558 -105572
22266 -105572 -116145 -136402 -105228 -112434 -111788 -83227 -31228 -71516 -26121 28159 46748 37734
22254 37734 9841 -2703 -6254 -29160 -56792 -74781 -31165 32494 62607 30504 56965 93980
22242 93980 76994 76821 74890 59534 69436 20232 25883 67611 90727 125497 100603 70285 9119
22229 9119 -74327 -96955 -54916 -11603 28548 54528 31511 639 -26900 14682 -3657 -19228
22217 -19228 -39934 -77437 -86175 -35704 -61827 -53764 -27891 -27383 -44074 -62868 -81382 -150423
22205 -150423 -143696 -74341 -46368 -11877 -27754 -72013 -28571 25030 5885 -67569 -120642 -134351
22193a34351J3416K7261J3125K9837K0132L455p631l1435n4803j6627P0290J20906
22181E3575Q882m3912K724K1056K0593o320o259m821l7939l2059n2829j5810K4248
22168f8871N034k4782m652L0344J9563M5721J0023j7890O154j5063K063L1422
22156A9066J7458J8783r0500l6200L1750N2925P695m4662j1562O4063J9117R166
22144E7099l317N5870N055l7638l8019q961n1242m6659L0816m110k5484K2730
22132d3860O8062O144L180O074J5431j2710p8149N576M7974j5768j7158J1049
22120d155K4021l3918n5409J2356L8584L3027j09237l9357M3387L3880J2688M1804
22108b329J2038r954l3356L1267K0687J8828j5170l3785j9036J4935J8438k0207
$$ plain form
22193 -134351 -120935 -93674 -80549 -50712 -30580 -27125 -34756 -66191 -120994 -137621 -67331 53575
22181 53575 62457 18545 21269 42325 62918 56598 50339 45518 7579 -24480 -77309 -93119 -68871
22168 -68871 -63837 -88619 -93271 -62927 -43364 2357 12380 -5510 644 -14419 -12356 19066
22156 19066 36524 55307 -35193 -71393 -39643 13282 20977 -23685 -35247 28816 47933 57099
22144 57099 53782 109652 114707 77069 39050 30089 -21153 -67812 -36996 -41106 -66590 -43860
22132 -43860 24202 30346 33526 39600 55031 42321 -35828 -30252 17722 1954 -15204 -4155
22120 -4155 19866 -14052 -69461 -57105 -18521 14506 -94731 -134088 -90701 -56821 -44133 -2329
22108 -2329 9709 -245 -33601 -2334 18353 37181 22011 -11774 -30810 -15875 2563 -17644
22096a7644o123K5037K8490K0654l763k7106p7629J0533N3702J3481j0671M7756
22084E6717O6852l6580j04916k8041j8821q291K828K1851N4788m2818l4958K2137
22072d9252m6101L0942N8415Q63j0447j7824r558J0536m505K1241l2699r285L0018
22059b7656K9933M084K4889J7501l6632M3243M3849m4481l1623J108R020M4156
22047G7391J749k1403M1848q298l8442Q376J4896k0417p5670l7355R634O0940
22035A3249k3677m1440K09K5352M2448R695o0760k390K0457j8929N045L010P057
22022b0674k3948l0759j1953M8516O1359p042l3629J3639j6162n4197L7053L4325
22010c472k5885m6373L1897j8842j5003J4251l4372L3954k286m5727N8817N9726
$$ plain form
22096 -17644 -23767 1270 29760 50414 46651 19545 -58084 -47551 6151 19632 8961 56717
22084 56717 123569 86989 -17927 -45968 -64789 -73080 -70252 -48401 6387 -36431 -71389 -49252
22072 -49252 -95353 -64411 -5996 -5133 -15580 -33404 -42962 -32426 -36931 -15690 -48389 -57674 -27656
22059 -27656 2277 6361 31250 48751 12119 55362 99211 54730 23107 24215 33235 77391
22047 77391 79140 57737 99585 91287 52845 61221 76117 55700 -19970 -57325 -47691 13249
22035 13249 -10428 -51868 -51659 -26307 16141 25836 -34924 -37314 -16857 -35786 -30741 -27731 -20674
22022 -20674 -44622 -75381 -87334 -38818 22541 15499 -18130 -4491 -20653 -74850 -37797 -3472
22010 -3472 -29357 -75730 -43833 -62675 -77678 -63427 -97799 -63845 -66131 -111858 -53041 6685
21998F685k7009M865P6617j3352o3415k0862K3250j5691P911l4558M4216J6389
21986E046m8198L4292K0769Q12J4551o347m2139j9613J0578n8009j5511O5174
21974c8595J17245J6157l433m2506l6846j6190m7880j4886j6503J4135M891j4622
21962g9033j849N9623N3433L4578n686k1587j9852K438k5769j1392q479P388J5799
21949c88j6935R544j166N959k9002r2976K0888J2601m94M1580q54n413R458m112
21935e1310j6183o1344l0594L2834Q8576L5315m3832j7827J6954J2322J9469L296
21923a2324L716M3071k8421k8636m0780l5134l3313N1855L6030L2820K0227L5628
21911D4739J4111K227K241k4794p6347K8970K3221q358k8139O22k1775j7550K8014
$$ plain form
21998 6685 -20324 -15459 61158 47806 -15609 -36471 -13221 -28912 -21001 -55559 -11343 5046
21986 5046 -43152 -8860 11909 12721 27272 20925 -21214 -40827 -30249 -88258 -103769 -38595
21974 -38595 78650 94807 91374 48868 12022 -4168 -52048 -66934 -83437 -69302 -64411 -79033
21962 -79033 -80882 -21259 32174 66752 61066 39479 19627 22065 -3704 -15096 -23575 -16187 -388
21949 -388 -17323 -7779 -8945 -2986 -31988 -124964 -104076 -91475 -91969 -50389 -51243 -56656 -47198 -51310
21935 -51310 -67493 -128837 -159431 -126597 -38021 -2706 -46538 -64365 -47411 -35089 -15620 -12324
21923 -12324 -8608 34463 6042 -22594 -63374 -98508 -131821 -79966 -43936 -11116 9111 44739
21911 44739 58850 61077 63318 38524 -37823 -8853 14368 6010 -22129 -21507 -43282 -60832 -32818
21898c2818j9730l0336N9862J1382j3622m1493L6980M8836P036l1457P967M417
21886G024r901j3736J2156K875l2931N3747m6375o8519K1067N2758J3731l0628
21874c8732J1820p17k802K308L5028j5647k8237k4433K7828J8143k7065j0820
21862e3326Q918k5236o362L6559L2447Q7127J0452n2807r6983m202K7805M873
21850c0735L6890n8869q735M0870j6845m896M8367K9291j0164J0737J1808n7397
21838i678J5829r840J8516l4037j8496l7681L1487O8346L49J7845P4069l838n1079
21825F1792o7019j9031N3600K4024l4794K620l5439q4626k8011Q123j9109N3938
21813h3932M9834L7828k2001K8118K1800l1162n2127o609l956J9156L7318J1661
$$ plain form
21898 -32818 -52548 -82884 -23022 -11640 -25262 -66755 -29775 19061 26097 -5360 2607 7024
21886 7024 -2877 -16613 -4457 -1582 -34513 19234 -27141 -95660 -74593 -21835 -8104 -38732
21874 -38732 -26912 -27629 -30431 -28123 6905 -8742 -36979 -61412 -33584 -15441 -42506 -53326
21862 -53326 -44408 -69644 -76006 -39447 -7000 80127 90579 37772 -59211 -63413 -35608 -30735
21850 -30735 6155 -52714 -61449 -20579 -37424 -42320 6047 35338 25174 35911 47719 -9678
21838 -9678 6151 -3689 14827 -19210 -37706 -75387 -43900 24446 24795 42640 116709 112871 61792
21825 61792 -5227 -24258 29342 53366 18572 21192 -14247 -98873 -126884 -118761 -137870 -83932
21813 -83932 -34098 3730 -18271 9847 31647 485 -51642 -58251 -62207 -43051 -5733 5928
21801E928m5176j2057L5946M3782k059l1850J5121K6205p4655Q504q766K3233
21789a5844J7738n6389j9453J3811M5764J1167K0554J457k7903k832n7346q4884
21777a54160Q502M8068L4817n7766j2633M7489J3724L7083Q671q108L4276O5862
21765F5825L3513l4052o0610m3340K5667P478k3085l5634L2065J9674O578K6030
21753B0109l4524n2550l476K8971j3361P9658N452l8433j6609l286j1820N5432
21741A5563k7738n8285j2567M3770K2811K8000K0116K340j8405k781j1535p409
21729f120k3896j7800k833K2537j3782L5361R238j5400N2824p17M0010q405m3100
21716B7917L372O2743n9976p6920L226M415L4019K994l1203o5510J8033K6161
$$ plain form
21801 5928 -39248 -51305 -15359 28423 26364 -5486 9635 35840 -38815 -30311 -39077 -15844
21789 -15844 1894 -54495 -73948 -60137 -14373 -3206 17348 18805 -9098 -11930 -69276 -154160
21777 -154160 -145658 -97590 -62773 -120539 -133172 -85683 -71959 -34876 -26205 -34313 -37 65825
21765 65825 99338 65286 4676 -38664 -12997 -5519 -28604 -64238 -32173 -12499 -5921 20109
21753 20109 -14415 -66965 -70441 -41470 -54831 24827 30279 -8154 -24763 -28049 -39869 15563
21741 15563 -12175 -70460 -83027 -39257 -16446 11554 31670 34010 15605 12824 1289 -6120
21729 -6120 -30016 -47816 -50649 -28112 -41894 -6533 2705 -12695 40129 39412 79422 71017 27917
21716 27917 31289 94032 34056 -42864 -39638 -35223 -1204 1790 -29413 -94923 -76890 -50729
21704e0729N8029m4457k4736r413K9508l4692L5414L6243j2177l3055m975k9331
21692h4371J3767O9592L4515j4232n1685J6665J4074K948N4814M0138o4998l7399
21680f172l3345j0504q776L7742r980n358k14K1660M2149L547l9860k9113m3740
21667h1964k1076O3940N7117j2212l4158K4714J13j104P883O4257p979k9885j9305
21654A0341K5130J6532R110k4136o947L7810k7539n8322m8265R175L9138J2616
21642e357K3934k5362L4587j4725m5465K9512Q60k8556j3918K8751J913J4403
21630E77N4846M6653J8284l500K2899k3023m8458M8324k3870j4294M189J5186
21618I7813M464j9766j1762m9906m7497j0534j136n0150L5232O5133j4380r5850
$$ plain form
21704 -50729 7300 -37157 -61893 -71306 -41798 -76490 -41076 -4833 -17010 -50065 -55040 -84371
21692 -84371 -70604 -1012 33503 19271 -32414 -15749 -1675 1273 56087 96225 31227 -6172
21680 -6172 -39517 -50021 -58797 -21055 -31035 -36393 -36607 -14947 27202 30749 -9111 -38224 -81964
21667 -81964 -103040 -39100 18017 5805 -28353 -3639 -3526 -4630 3253 67510 59531 29646 10341
21654 10341 35471 52003 61113 36977 30030 67840 40301 -18021 -66286 -57111 -17973 -5357
21642 -5357 18577 -6785 27802 13077 -32388 -2876 -2016 -30572 -44490 -15739 -13826 577
21630 577 55423 102076 120360 116860 139759 116736 68278 116602 92732 78438 82627 97813
21618 97813 102277 82511 70749 20843 -26654 -37188 -38324 -88474 -53242 11891 -2489 -98339
21606i8339o2246K1260K3151o339l4293L8793p031l3442j7327r789J7391J06441
21594f1770M1145k3277K9336j9420m5554M154P3182L4860J7091j3447r5967n4253
21582a13920j6143L0336M5621Q965M7829k6713j3024K0472L881L7320k6717m3419
21570d5512M1819J8942L7499n884K7779J88m222j7806j1568o8883k0937j510l423
21557e3518J7134L5807K4999O0144o4902k9426R1533J3234j9971Q564k8944k7705
21545B6949M2755j1112K3280k2556l6320p0615l9244M1227M2521J0188l1291l9681
21533f3899p451J0996L3516M0279m0580m4561k54J9821N8978Q0968n037k4276
21521E8500j0143p9635l1788p203l4827n8047m636M9633K7304M1083K1349l0339
$$ plain form
21606 -98339 -160585 -139325 -116174 -122513 -156806 -118013 -125044 -158486 -175813 -185602 -168211 -61770
21594 -61770 -20625 -43902 -14566 -33986 -79540 -75386 -2204 32656 49747 36300 -59667 -113920
21582 -113920 -130063 -99727 -54106 -45141 2688 -24025 -37049 -16577 -12696 24624 -2093 -45512
21570 -45512 -3693 15249 52748 46864 74643 74831 70609 52803 41235 -27648 -48585 -50095 -53518
21557 -53518 -36384 -577 24422 84566 19664 -9762 81771 95005 75034 83598 54654 26949
21545 26949 69704 58592 81872 59316 22996 -47619 -86863 -45636 -3115 7073 -24218 -63899
21533 -63899 -71350 -60354 -26838 13441 -27139 -71700 -71954 -52133 6845 87813 82776 58500
21521 58500 48357 -31278 -63066 -70269 -105096 -163143 -167779 -118146 -90842 -49759 -28410 -58749
21509e8749l2850l6861P0070Q321k3850J3685k9259N356J6864o071R847M487L528
21496e5482J3068L7993n425j8593L1634Q7972l973k8725r817k4972l081M1702
21484F2301r300j3676k0660j376l350l5667n4195J42k970K2645j0408k8381N1116
21471d3779j7511k8361L4961M745K989L9106k233l7464L5169N0505k0217j4656
21459C254M9419o645J5137l4875l7109o373K0798J9564J4586l6917P550K6970
21447C5359l1624k3068l8923K1978L3769K1365L5701n9988j0877m8254l4267O7577
21435c1252N3601K172n075o6269J6396J3672K3492K0526j4363J2826R817o042
21423B9501p8729J0234O7111L9156k6394o9370j4384R779L814j3380L3215L26
$$ plain form
21509 -58749 -91599 -128460 -58390 -50069 -73919 -60234 -89493 -84137 -67273 -73344 -63497 -59010 -55482
21496 -55482 -42414 -4421 -9846 -28439 3195 91167 87194 58469 48652 23680 20599 62301
21484 62301 53001 39325 18665 17289 13939 -21728 -75923 -75781 -78751 -56106 -66514 -94895 -43779
21471 -43779 -61290 -89651 -54690 -49945 -46956 -7850 -10083 -47547 -12378 38127 17910 3254
21459 3254 52673 46028 61165 26290 -10819 -17192 3606 23170 37756 839 8389 35359
21447 35359 3735 -19333 -58256 -36278 -2509 18856 54557 -5431 -16308 -64562 -98829 -31252
21435 -31252 22349 24521 19446 -46823 -30427 -16755 6737 27263 12900 25726 35543 29501
21423 29501 -49228 -38994 28117 67273 40879 -28491 -42875 -33096 -29282 -42662 -9447 -9121
21411i121k9513J5382o702p33M1934M3176j305m9104l9692o559j9655K9330j3093
21398d5655q925j1525N157M3111M2960K5782o7235l0228K8818P425l7670k0271
21386f8256M1122N1682M2941n5781L8906P673l9481j2067N5512J7097o5093p1855
21374e7600n1721J1632Q0261Q579M023N2927J7485l4906m8517n5536k7518N0090
21362e0801L3756J3328l5750K9424O5887N5208l0381o1955j4291j9104K0251n3959
21350d8387o26K6637k43k955J2318K7106J711l7048n479M2458O4844n3800q1051
21337e4515j2131K0538J9524N8617l5902m8775L1312L8380l4634o9733k6584M3575
21325g0328J3338m0267J8222K0719J6428p360K2292K5182J989p030N0087K3861
$$ plain form
21411 -9121 -38634 -23252 -29954 -30687 11247 54423 53118 4014 -35678 -42237 -61892 -32562 -45655
21398 -45655 -54580 -66105 -60948 -17837 25123 50905 -16330 -46558 -17740 -10315 -47985 -68256
21386 -68256 -27134 24548 67489 11708 50614 58287 18806 6739 62251 79348 14255 -57600
21374 -57600 -109321 -97689 -17428 -8849 -4826 48101 65586 30680 -17837 -73373 -100891 -50801
21362 -50801 -17045 -3717 -39467 -10043 55844 111052 80671 18716 4425 -14679 5572 -48387
21350 -48387 -49013 -22376 -22619 -25574 -13256 13850 15561 -21487 -26966 15492 80336 26536 -54515
21337 -54515 -66646 -46108 -26584 32033 -3869 -52644 -21332 17048 -17586 -87319 -113903 -70328
21325 -70328 -56990 -97257 -79035 -58316 -41888 -49248 -26956 -1774 215 -6815 43272 67133
21313F7133m0261k8136M3901K7160j8485k6271p786R217j8899p853L429k6439
21301b3290q289k9248J695R318Q684m6359N4900L0205K3221K1504j0063m2151
21289i873o1943k7476L7829M1087L8654O897j7604j5422k3833J5970k499P271
21277a0942O2679L438L3806k5710n5592k7230l6087j9242k616J1470j7188J2608
21265g0606j854N1536J3532o814l2879L4783N9607J6653q844m0260M1943j7754
21253C9043n5811q282j897J3441j2820K7097J5950q7353K8200L0560j0800K3784
21241A112J7453o452K0717r5N2296j9609k7231j5201k3522p769K6981q584p7213
21228f7117l3386L2156M6167K4654o1998m7222N9646L1060Q502n3470m1323J5941
$$ plain form
21313 67133 26872 -1264 42637 69797 51312 25041 17255 26472 7573 -280 3149 -23290
21301 -23290 -31579 -60827 -59132 -49814 -41130 -87489 -32589 -2384 20837 42341 32278 -9873
21289 -9873 -71816 -99292 -61463 -20376 18278 25175 7571 -7851 -31684 -15714 -18213 -10942
21277 -10942 51737 55175 88981 63271 7679 -19551 -55638 -74880 -77496 -66026 -83214 -70606
21265 -70606 -72460 -20924 -7392 -14206 -47085 -12302 47305 63958 55114 14854 56797 39043
21253 39043 -16768 -25050 -26947 -13506 -26326 771 16721 -70632 -42432 -11872 -22672 1112
21241 1112 18565 12113 32830 32735 85031 65422 38191 22990 -532 -8301 18680 10096 -67117
21228 -67117 -100503 -68347 -22180 2474 -59524 -106746 -47100 -16040 -7538 -61008 -102331 -86390
21216h6390P0521r495j0817K7150P3312K7422l7841j6385j6694J0281k3358O10
21204H316n0424K3570M9958l3981J3714n1627m5252n488j5957L570M4899O4480
21192E778j8817m7114m3118k9555n303M2205O4467L7296q753j8136K0297j5008
21180a5761m3290M5148k8663j0405l6079m86O5320Q4814j5927k8820J4820k4414
21168F257m4395L3231L8833L4541l2305M118M883k1689l961J3495L351p876m8336
21155a9853K6158L848l2464p8699k9265m848k5511L2481M4904L6682K4143M2414
21143A9990R284j8141j5395Q288k3500j993l1935O7862K3115K1395r167l9006
21131A0797k2485P139J9738P65j6095j4229j3993k0293O430K1916N7652K4823
$$ plain form
21216 -86390 -15869 -25364 -36181 -9031 64281 91703 53862 37477 20783 31064 7706 8316
21204 8316 -42108 -18538 31420 -2561 11153 -40474 -85726 -91214 -107171 -103601 -58702 5778
21192 5778 -13039 -60153 -103271 -132826 -138129 -95924 -31457 5839 -2914 -21050 -753 -15761
21180 -15761 -59051 -13903 -42566 -52971 -89050 -89536 -24216 60598 44671 15851 30671 6257
21168 6257 -38138 -4907 33926 68467 36162 40280 45163 23474 19513 33008 36359 28483 -19853
21155 -19853 6305 10153 -22311 -101010 -130275 -135123 -160634 -128153 -83249 -46567 -22424 19990
21143 19990 29274 11133 -4262 4026 -19474 -21467 -53402 14460 37575 58970 49803 10797
21131 10797 -11688 -4549 15189 15954 -141 -14370 -28363 -48656 -42226 -20310 37342 62165
21119F2165l4795L8534j148o9719j01082J2778Q1575J1468K1597O500k8904J3623
21107A2592J1958n5661j5834r481L6328L1244L4625L4910k2290j5265Q618k5955
21095B5789J8453l057m2191n1688j149M5554L63j2579M1104J2107N2568J4833
21083A00107n7073l8481k4167J2792N291n4418J3245k8293o926J8958J3703N3074
21071G812O0450m8243o2111O713p719j8821J3405L9755K2929J3051m5206j6978
21059c4963M5654L0442n1693l5974J2081j3983l5816J5059M8512M7031L9759k5651
21047D0458n8134l2665L313K926j9123J247K6845J2126j8509L1306L720k0283
21035b6773L7874J2301j3503j3773o5430l7710N0564P3475N6009p327l7333k4575
$$ plain form
21119 62165 27370 65904 64756 -4963 -106045 -93267 -11692 -224 21373 27873 -1031 12592
21107 12592 24550 -31111 -46945 -56426 -20098 11146 45771 80681 58391 43126 51744 25789
21095 25789 44242 41185 -1006 -52694 -53843 -8289 -7926 -20505 20599 32706 85274 100107
21083 100107 43034 4553 -19614 -6822 -1531 -55949 -42704 -70997 -77923 -58965 -45262 7812
21071 7812 68262 20019 -42092 -35379 -43098 -61919 -48514 -8759 14170 27221 -17985 -34963
21059 -34963 10691 41133 -10560 -46534 -34453 -48436 -84252 -69193 -20681 26350 66109 40458
21047 40458 -17676 -50341 -47028 -44102 -63225 -61978 -35133 -23007 -41516 -10210 -6490 -26773
21035 -26773 11101 23402 9899 -3874 -69304 -107014 -56450 17025 73034 65707 28374 3799
21023C799n757M0467l1238j1556J2560J2086J7044n1084P401M5578k8856K5081
21011C5525J1517q1002n5527M4379J1877J903J8160N2652N4212l7730o6009r582
20999a9625m068O249K7177O331j2442j4284k7898l2336l6518r128m682N896K8310
20986h7018K6525N4012R544n4857K3742M6947L5874q1783m2960L5165O4362j5310
20974A4243j4046k7898J1546k9081j0183p943l2907J5206O5790j2920l5246J8996
20962d4443k0130j1539J9659L1043O2974N898k0085m6879m8340N1435M7124m6927
20950b0210l8035O837l134J4657K8876J9892K1375n4528J472o3970J9237K3648
20938d3883P471N765K3919l37J1996l7149j2993O4182K0011M8128L4717l6668
$$ plain form
21023 3799 -1958 38509 7271 -4285 8275 20361 37405 -13679 -6278 39300 10444 35525
21011 35525 47042 -33960 -89487 -45108 -33231 -31328 -13168 39484 93696 55966 -10043 -19625
20999 -19625 -23693 -17444 9733 16064 3622 -10662 -38560 -70896 -107414 -116542 -121224 -115328 -87018
20986 -87018 -60493 -6481 3063 -51794 -28052 18895 54769 -27014 -69974 -34809 29553 14243
20974 14243 197 -27701 -16155 -45236 -55419 -63362 -96269 -81063 -15273 -28193 -63439 -44443
20962 -44443 -64573 -76112 -56453 -25410 37564 43462 23377 -23502 -71842 -20407 26717 -20210
20950 -20210 -58245 -51408 -54542 -39885 -11009 8883 30258 -24270 -22798 -86768 -67531 -43883
20938 -43883 -36412 -30647 -6728 -7065 4931 -32218 -45211 18971 38982 87110 121827 85159
20926H5159k7758k6619J093l8009k5500p26J3598L9086P487K8912j9274r1109
20914e3660o373Q967J4119K453K9503j2170j0020j6984L317R958l7288M2225K4350
20901a603K815q874k8175J7144j336k1175J8278R367P530j303N7829r922r6172
20888e5597j14J3108P4830K9401N977N131p3461j8464J8066M3336l5997l5165
20876b8949l7790l4283R364Q6339O9738j8065n1594j0865N9137l811m5696k5101
20864c1576M093Q4238K4031o912m813p5065n9118K5982M4151K0016Q089o681q217
20851A8218k1119N715k1905k2234K8186m3542l1997K4755m6517o765K1857L0336
20839f5012J09223O832n9388j5299J1426L2002j8956M863Q067r434p274r673l265
$$ plain form
20926 85159 57401 30782 31875 -6134 -31634 -32360 -18762 20324 27811 56723 37449 -53660
20914 -53660 -60033 -51066 -36947 -34494 -4991 -17161 -27181 -44165 -40848 -30890 -68178 -25953 -1603
20901 -1603 1212 -7662 -35837 -18693 -20029 -41204 -22926 -13559 -6029 -7332 50497 40575 -55597
20888 -55597 -55711 -42603 32227 61628 67605 72736 -725 -19189 -1123 42213 6216 -28949
20876 -28949 -66739 -101022 -91658 -5319 64419 46354 -5240 -16105 43032 39221 -6475 -31576
20864 -31576 -27483 56755 80786 73874 69061 -6004 -65122 -39140 5011 25027 33116 26435 18218
20851 18218 -2901 2814 -19091 -41325 -13139 -56681 -88678 -63923 -110440 -117205 -95348 -65012
20839 -65012 44211 51043 -8345 -23644 -12218 19784 828 5691 13758 4324 -2950 -12623 -15888
20826a5888J946j4900k0288J5926M6822l499j9401O696L5158L6957m3249o259
20814B0021k9772n4521j4723J3180k512M1040P400L1571N3532k9302n1380o883
20802b2349J7853k0560k1400j608K5552P3520J9252k0312q0928k7627Q277J3266
20790c7064L1469J5600q16l0264m2328L6472M4732J5991l7211r00L7131M3830
20778G6642j0210O35j5145m1571l1934l776k1887j6781n571K474K568M0758l534
20765b7332n2762K0715k0508L4375k7137m112L9414P8591M3095J2596K8757n8978
20753F6714k8249M200j9256m6041l2617J5435J7694M3391r866k7174l0501k7726
20741g3996j4298n94M2389j5033M731K2907l4584J4926n74m4145K6958M713n1743
$$ plain form
20826 -15888 -13942 -28842 -49130 -33204 13618 10119 -9282 -2586 32572 69529 26280 20021
20814 20021 -9751 -64272 -78995 -65815 -68327 -27287 -19887 11684 65216 35914 -15466 -22349
20802 -22349 -4496 -25056 -46456 -48064 -22512 51008 70260 49948 -30980 -58607 -50330 -37064
20790 -37064 -5595 10005 9189 -21075 -63403 -26931 17801 33792 -3419 -4319 32812 76642
20778 76642 66432 67067 51922 10351 -21583 -25359 -47246 -64027 -69598 -67124 -64556 -23798 -27332
20765 -27332 -80094 -59379 -79887 -45512 -72649 -76761 -37347 41244 84339 96935 125692 66714
20753 66714 38465 42665 23409 -22632 -55249 -39814 -22120 21271 11405 -15769 -46270 -73996
20741 -73996 -88294 -88888 -46499 -61532 -56801 -33894 -68478 -53552 -54126 -98271 -71313 -66600 -118343
20728a18343n530K5404P372j113O8042M0768l4402K5040K9379k8500J0596k134
20716A6579L4262j0463n6249J061N8418l0823J0420m438Q300n91J6506k447j7679
20703B2856J7332k6363k8379O0929M1363l6192j1210M9594m3933q3085L2210Q8779
20691H3901l4527k6231K2843j5879l6267n009q829m9552p579o574K7346j3334
20679f9691N744J7194K1816j9769J1464K0763M9207m5994o9910j3158M4714K6801
20667b0819J9163K305r403q315O627o1938j0577N6924j9180p76M128O753M1634
20654F526J3790j3778k3315m0502K3781J8899J1080k9352N280R240L111l6074
20642e1314L6634M9208L0328l7548o469q100k7197m0808J4615O3044J3230j0442
$$ plain form
20728 -118343 -123873 -98469 -91097 -92210 -24168 16600 -17802 7238 36617 8117 18713 16579
20716 16579 50841 40378 -15871 -14810 43608 12785 23205 18767 27067 26476 42982 40535 22856
20703 22856 40188 13825 -14554 46375 87738 51546 40336 89930 45997 -37088 -4878 83901
20691 83901 49374 23143 45986 30107 -6160 -11169 -19998 -69550 -77129 -83703 -56357 -69691
20679 -69691 -63947 -46753 -24937 -44706 -33242 -12479 36728 -9266 -79176 -92334 -47620 -20819
20667 -20819 -1656 649 -8754 -17069 -10442 -72380 -82957 -26033 -45213 -45989 -41861 -35108 6526
20654 6526 20316 6538 -16777 -57279 -33498 -14599 -3519 -32871 -27591 -18351 -15240 -51314
20642 -51314 -14680 34528 64856 27308 20839 12739 -14458 -55266 -40651 22393 35623 25181
20630B5181R35j3035l1986l9289n246N6529Q910j4260N448k1739m639m8891m0576
20617a22658N882J9484l374j7085K6682N4565L1797k6744k003N252q198Q395L8194
20604A0189M5303l1955k5270M6325j5613k6376r343J2405k8719o2747M1368M6534
20592B101k1559L80K5855m18o2942l3645K0286K6742L8861j9052L9227l6904R398
20579a1670K8606K6508j1200k8474K2965j7396j6001k4557l1843N374p697M5923
20567a9462K4958k0787m691K8337N0571J767p1052o148k345J373K9967M8266K3121
20554H3875j9931n0699j4433o400p3624k8170J2170J6054O7660j5434O041r431
20542c2322k7087k1105R524K9435P921l503l0078j5297K3552M1231N0787J7279
$$ plain form
20630 25181 26116 13081 -18905 -58194 -63440 -6911 1999 -12261 -6813 -28552 -33191 -82082 -122658
20617 -122658 -116776 -97292 -100666 -117751 -91069 -36504 -4707 -31451 -33454 -28202 -36400 -28005 10189
20604 10189 55492 23537 -1733 44592 28979 2603 -6740 5665 -23054 -85801 -44433 2101
20592 2101 -19458 -19078 6777 6359 -56583 -90228 -69942 -43200 -4339 -23391 15836 -21068 -11670
20579 -11670 16936 43444 32244 3770 26735 9339 -6662 -31219 -63062 -57688 -65385 -19462
20567 -19462 5496 -15291 -19982 8355 58926 60693 -10359 -16507 -18852 -17479 12488 60754 83875
20554 83875 63944 13245 -1188 -7588 -81212 -109382 -97212 -81158 -13498 -28932 -22891 -32322
20542 -32322 -59409 -80514 -70990 -41555 -33634 -37137 -67215 -82512 -58960 -17729 33058 50337
20530E0337N930L0379j4571R457o4746j3194n6692Q035N2449q007J1051L067j7819
20517d324j3272K1096J8169L0795K7448k4677j9608K252P575k9541j0306k3718
20505a8111j7560K3689K6181k6019Q928M2078j9086j6783J286l3421m9086l1207
20493a09111L2912K0540K6344R2885K2463m5765J429l8573o0128j1185K0679j8561
20481f6071K8376M5845J9077k8010p1560M6284K3852k331N977K8774q096k9249
20469g132j8824J3866L2151K5309P86j8993J774k6593J8032J2081k0099n268N707
20456A2797m8049l4894J9561J3518J9601j312M3338l0257j0888K707J6396L685
20444F203Q505M8957P652j6891O087J7172q1966n8308j0732j3299Q3398L7612
$$ plain form
20530 50337 56267 86646 72075 81532 16786 3592 -53100 -45065 7384 -623 10428 13495 -4324
20517 -4324 -17596 3500 21669 52464 79912 55235 35627 37879 45454 15913 5607 -18111
20505 -18111 -35671 -11982 14199 -11820 -2892 39186 20100 3317 4603 -28818 -77904 -109111
20493 -109111 -76199 -55659 -29315 63570 86033 40268 41697 3124 -57004 -68189 -47510 -66071
20481 -66071 -37695 8150 27227 -783 -72343 -26059 -2207 -4538 1439 30213 22117 -7132
20469 -7132 -25956 -12090 20061 45370 46156 27163 28937 2344 20376 32457 12358 7090 12797
20456 12797 -35252 -70146 -50585 -37067 -17466 -18778 24560 -5697 -16585 -13878 2518 6203
20444 6203 14708 63665 71317 54426 60513 77685 -4281 -62589 -73321 -86620 -3222 34390
20432C4390J8005K0898L5370N4646n2017m1820Q002l8682n2291m3929J2996J9720
20420b4712j3653j1654J5521O6434m0108k8133k1230O6029n214L8960K538k6840
20408A7938k6303k7121J2169r536m6311J9031J4586k7854L2729K5195J2330P605
20396D458L503J3698J9545k7965K125R382K2928j8977q1505k4345N7727L9157
20384A9731N9442k0327k9740l4025j5631k0503L1838m7696j9051N5675j8748l0655
20372f9690Q391K1265M5622K6191L7525k1802J0740J1338j8393k3479n8565n5203
20360h6060L5745K5687m798j4026k4809Q637L6541L9411m8889m752K5305J9906
20348G898M5379m5314l3531L9538l53L4904N033o8632j6109N955o070Q565j9670
$$ plain form
20432 34390 52395 73293 108663 163309 111292 69472 77474 38792 -13499 -57428 -44432 -24712
20420 -24712 -38365 -50019 -34498 31936 -8172 -36305 -57535 8494 3280 42240 44778 17938
20408 17938 -8365 -35486 -23317 -32853 -79164 -60133 -45547 -73401 -40672 -15477 -3147 4458
20396 4458 7961 21659 41204 13239 15364 24746 47674 28697 -52808 -77153 -19426 19731
20384 19731 79173 58846 29106 -4919 -20550 -41053 -9215 -56911 -75962 -20287 -39035 -69690
20372 -69690 -61299 -40034 5588 31779 69304 47502 58242 69580 51187 27708 -30857 -86060
20360 -86060 -50315 -24628 -29426 -43452 -68261 -59624 -23083 16328 -32561 -37313 -12008 7898
20348 7898 53277 7963 -25568 13970 13617 48521 53554 -15078 -31187 -25232 -31302 -22737 -42407
20335d2407j5806N4200N9665k3137j951L2286m9639p6058k094K3905J8210N08
20323b2318K7071K5700L5659n2995j2289n861n4459K6914L1856J1701j5135k1992
20311b6148l1506p902O0146N5174N4127J6580n3481m1265j7894J4041k8246K5887
20299A9513L5237l9889k6882N7242N1844m0914K1326m14q075j4222k3692j9865
20287A1209R881m2583o5185K9592Q6468Q029j1897k4248l9575j1415K9630K8949
20275H855J0212J8295K0613J1235l4125K2539N8405l0025m4555j4530j7625K0582
20263B9876J4087l2404J1655O5927J7685K6918o3056q1844k2447K6789K0979j132
20251A3033J2695o2006m2823K808J2892k641J5317M6011r176j1221Q03l7147K0483
$$ plain form
20335 -42407 -58213 -4013 55652 32515 30564 62850 13211 -62847 -64941 -41036 -22826 -22318
20323 -22318 4753 30453 66112 13117 828 -5033 -59492 -32578 -722 10979 -4156 -26148
20311 -26148 -57654 -65556 -5410 49764 103891 120471 66990 25725 7831 21872 -6374 19513
20299 19513 54750 14861 -12021 45221 97065 56151 77477 77063 68988 54766 31074 11209
20287 11209 21090 -21493 -86678 -57086 29382 37411 25514 1266 -38309 -49724 -20094 8855
20275 8855 19067 37362 57975 69210 35085 57624 116029 86004 41449 26919 9294 29876
20263 29876 43963 11559 23214 89141 106826 133744 70688 -11156 -33603 -6814 14165 13033
20251 13033 25728 -36278 -79101 -76293 -63401 -66042 -50725 -4714 -13890 -25111 -24308 -61455 -40972
20238d0972O3874L3057k4643j3320K1189P2189K5780l7454l3947k4825J6279Q641
20226F5848l6892j9831L7149O52m8109L2060K2731J2960K5079k5622k732L6488
20214I9781N600j5931k8398q4107l0229m98O8509K9156k0525M6389M1063N401
20202A16211n6226j7312k2251j3823J0025M523l4708j5761K8022k891k4172J3874
20190a4489j3595n640O62J1171m079K0792L0115j5471n5437j5737L0947Q8218
20178E7457k376j2602O406J3938j8259k3904k12K1236J8175p2178n0569K0169
20166d2719L2525K3123K813N185K6589K2088J895m8010j3338j107l0649L7819
20154A6214M7589l4704o3854k6792L0294O3329J8701K6805M428k7976o001n2068
$$ plain form
20238 -40972 22902 55959 31316 17996 39185 111374 137154 99700 65753 40928 57207 65848
20226 65848 28956 9125 46274 46926 -1183 30877 53608 66568 91647 66025 63293 99781
20214 99781 105381 89450 61052 -23055 -53284 -53782 14727 43883 23358 69747 110810 116211
20202 116211 59985 42673 20422 6599 16624 21147 -13561 -29322 -1300 -4191 -28363 -14489
20190 -14489 -28084 -33724 -33062 -21891 -25970 -5178 24937 9466 -45971 -61708 -30761 57457
20178 57457 55081 42479 48885 62823 44564 20660 20448 41684 59859 -12319 -62888 -42719
20166 -42719 -10194 12929 15742 20927 47516 69604 71499 23489 10151 9044 -21605 16214
20154 16214 63803 29099 -34755 -61547 -31253 32076 50777 77582 82010 54034 48033 -4035
20142d035J2320J6167J9154k0052q3767k7958K8433j9040l3820J3227L8542M9406
20130a1423R697J2469q580l0260N956o937m9301M8267l1479L3336M4555L4179
20118E0479N0240l8416n6832n5909j2574L3760L3260K550O465m0418K9580M865
20106G050j0593J8625J1220K3257k8078m9451p403M1447k9487m3628J1902K242
20094e2897O803K4889K877L5979k0003k0563J1041M3345J6698k06j2863j5076
20082B0024j9761j4924k4377l0963J3773k6043J2668N731J3514J2116J9393K3452
20070D603J4977j280K577m2148J9001k9991l3768Q773l460J9382K0134O2751L3241
20057G4792M2652j9213N39p8739j2815J4737n3066J0141M2910j1714n7067L8480
$$ plain form
20142 -4035 8285 24452 43606 23554 -60213 -88171 -59738 -78778 -112598 -99371 -60829 -11423
20130 -11423 -1726 10743 2163 -28097 -22141 -29078 -78379 -30112 -61591 -28255 16300 50479
20118 50479 100719 62303 5471 -50438 -63012 -29252 4008 6558 13023 -27395 2185 7050
20106 7050 -3543 15082 26302 49559 21481 -27970 -35373 6074 -23413 -67041 -55139 -52897
20094 -52897 -46094 -21205 -18328 17651 -2352 -22915 -11874 31471 48169 47963 35100 20024
20082 20024 263 -14661 -39038 -70001 -56228 -82271 -69603 -63872 -50358 -38242 -18849 4603
20070 4603 19580 18300 20877 -21271 -2270 -32261 -66029 -57256 -60716 -41334 -21200 41551 74792
20057 74792 117444 98231 98770 20031 7216 21953 -31113 -20972 21938 10224 -46843 -8363
20045h363O4342K2617l5180L6847K231p3598m2735J4789l1030L8696K0397k8306
20033a9293J800K8640R625N7714J6855j4565j9188j0584o9027J2482N1966N777
20021E2202k0582J2396o193M509l230R177l8415J7134K4831l127k3736L2863L4141
20008I1970J0774o4663j0584j1583n8277L7468J2212k1812k3097M4877J4706j5302
19996F689m9192r503k3415M5505P22j6294R765P668J3813k465o373J8334N3826
19983D9080j7080o8448o404M6428K732J2469N5271L4325J7959p298l9804m4051
19971C5179j6461K9261k0971p5243J828L7778J6856K688J4712k1965q309M5680
19959D1033k7550k320J5960O739j1089l6663l3969R0929O3550j9914N585L2739
$$ plain form
20045 -8363 55979 78596 43416 80263 82494 8896 -33839 -19050 -50080 -11384 9013 -19293
20033 -19293 -17493 11147 20772 78486 95341 80776 61588 51004 -18023 -5541 46425 52202
20021 52202 31620 44016 37823 42332 39102 48279 9864 26998 51829 48702 24966 57829 91970
20008 91970 102744 38081 27497 15914 -42363 -4895 7317 -14495 -37592 7285 21991 6689
19996 6689 -42503 -52006 -75421 -29916 -29194 -45488 -35723 -28055 -14242 -16707 -23080 -4746 49080
19983 49080 32000 -36448 -42852 3576 6308 18777 74048 108373 126332 119034 79230 35179
19971 35179 18718 47979 27008 -48235 -46407 -8629 8227 10915 25627 3662 -4647 41033
19959 41033 13483 11163 27123 33862 22773 -13890 -47859 43070 106620 86706 92291 125030
19947A25030M6701J4994j9606j2914m9426l2308k8523n1002O285k7867j8727k93
19935d7656J2058j9068L032p1L9598J9796K924m1199J587J4258P928k1579P847
19922b0545K7243K5321L1404p2561K2036L0287M1952k9804j9654m6490k1063m900
19910c6774K8387N1124o247l2402K1852j4679r543J7887n7627m9029O9679M5846
19898B8474k7081j5098R519k8610L7762k39K6219n785k4121k2319L4546j2215
19886A052l181O484j9074m4482K0461J4668j7471M2403L8294l5071K9553L2479
19874F6115q912o5530k1320M9352K5642j5616P1440K380m6070M0008O770p311
19862I6948j5769j5752n4789o274K3007K3893L1716N6560j3308k8772p2205r624
$$ plain form
19947 125030 171731 186725 167119 154205 104779 72471 43948 -7054 -769 -28636 -47363 -47656
19935 -47656 -35598 -54666 -51634 -51705 -12107 7689 10613 -30586 -28999 -14741 -6813 -28392 -20545
19922 -20545 6698 32019 63423 -9138 12898 43185 85137 55333 35679 -10811 -31874 -36774
19910 -36774 -8387 42737 36490 4088 25940 11261 1718 19605 -38022 -87051 -17372 28474
19898 28474 1393 -13705 -4186 -32796 4966 4727 30946 25161 1040 -21279 13267 1052
19886 1052 -2129 4355 -14719 -59201 -38740 -24072 -41543 860 39154 4083 33636 66115
19874 66115 57203 -8327 -29647 19705 45347 29731 101171 103551 57481 97489 104259 96948
19862 96948 81179 65427 10638 4364 27371 51264 82980 139540 126232 97460 25255 15631
19850A5631J3069L6524O8981L8088m6551J5761l3258n4801o383p6476n998N2009
19838A6596M2631q119P976M762j2295m8051J4148L2288p1888J2435J0294l869
19826c092j6866N1813k8309K5218L1489j3447j0582K3295k8314l3131l782J7903
19814A2195M9888L8739j4461m6191k2314L9588K4164k0485q268k3999n910l3613
19802a0667l5574K5156J8382k8041m031o03L1941K7765J5458K576l5573j2497
19790e708k0376K3677J2144L3915M0928J9392J4216m1460n7806j0596Q180o08
19778A5898K4535N3998Q4332k2122o8667j3450j9037R132J493k8775l4154M7909
19766E1092M6307k7199j8673k3788l4275L8048m1797J6708m290j8989l0720N6420
$$ plain form
19850 15631 28700 65224 134205 172293 125742 141503 108245 53444 47061 -29415 -35413 16596
19838 16596 59227 51108 59084 63846 51551 3500 17648 49936 -21952 -9517 777 -3092
19826 -3092 -19958 31855 3546 28764 60253 46806 36224 59519 31205 -1926 -5708 12195
19814 12195 62083 100822 86361 40170 17856 57444 81608 61123 52855 28856 22946 -10667
19802 -10667 -46241 -21085 -2703 -30744 -34775 -35378 -3437 24328 39786 42362 6789 -5708
19790 -5708 -26084 -2407 9737 43652 84580 103972 118188 76728 18922 8326 16506 15898
19778 15898 40433 94431 178763 156641 87974 74524 55487 64619 66112 37337 3183 51092
19766 51092 97399 70200 51527 27739 -6536 31512 -10285 6423 2133 -16856 -47576 8844
19754H844R1833l675k2526K6407n1166l5536J5154j5478j9155J1387J4962O0961
19742H2012k5817l7489N2878q357k2934r24o0689n0506J8320R3875K602m9130
19730f159L5172N898l5168j091M0065J5710R411M7174J3354l795J0251J6130O608
19717A53560q2756o6342j510J9953K1682l2734k8769N243J3389K1910O6184K3548
19705A13358j9098l4359n7995k8813J0670J4258l1567K0710L7206n0645m9265
19694g5540k77L4376Q5919K8489n1234m704K7817L4371j2072q039k103j222L0074
19681H5855J3331n2234k457o3423k4539j8683L3137N1293L1257J8585l6891n3295
19669a8064k1409j497o906N7029K2254j9336J0904m4875M8748K4690l2134J8839
$$ plain form
19754 8844 100677 97002 74476 100883 49717 14181 29335 13857 -5298 6089 21051 82012
19742 82012 56195 18706 71584 63227 40293 39369 -21320 -71826 -53506 40369 42971 -6159
19730 -6159 29013 34911 -257 -1348 38717 54427 63838 111012 124366 120571 130822 146952 153560
19717 153560 70804 4462 2952 22905 44587 11853 -16916 -11673 1716 23626 89810 113358
19705 113358 94260 59901 1906 -26907 -16237 -1979 -33546 -12836 24370 -26275 -75540
19694 -75540 -75817 -41441 44478 72967 21733 17029 44846 79217 67145 59106 57003 55781 85855
19681 85855 99186 46952 44495 -18928 -43467 -62150 -29013 22280 53537 72122 35231 -18064
19669 -18064 -39473 -40970 -47876 9153 31407 12071 22975 -21900 26848 51538 19404 38243
19657C8243J2191O245J6114j4879j7348K4595O5429j901l1391K1337j8771m2739
19645E7125M96m50m085P972J5424N501L9427j7948l0932k6807m1825l7344l0052
19632f3498P4482J20559L9616l3180j5679R339q172L3692k5287l5133n1617k158
19620D2964J5762K0417L7661j9309m1777j0224r662j9497p607m4798K339Q0123
19608D6392M828j390k5370M673K2262m066l2075K21J2573J5412R249J5572N9325
19595A27606m5278n6870k4163J071m3417N7778J9735k1267N283M2407m3637p2984
19583e3736J1908J6436n8244m1332O9253N7296n584N2084o3347l5139M9327J1465
19571A0387m6458p495L3733J2770L4576m188l6014o3681N8007O3430p287l1208
$$ plain form
19657 38243 50434 56679 72793 57914 40566 65161 130590 128689 97298 118635 99864 57125
19645 57125 57621 57171 53086 61058 76482 81983 121410 103462 72530 45723 3898 -33446 -63498
19632 -63498 10984 131543 171159 137979 122300 131639 123467 157159 131872 96739 45122 42964
19620 42964 58726 79143 116804 97495 55718 45494 35832 16335 8728 -36070 -33731 46392
19608 46392 51220 49830 24460 29133 51395 47329 15254 15475 28048 43460 52709 68281 127606
19595 127606 82328 25458 1295 2366 -41051 16727 36462 15195 20478 62885 19248 -53736
19583 -53736 -41828 -25392 -83636 -124968 -55715 1581 -4003 48081 -15266 -50405 -1078 10387
19571 10387 -36071 -43566 -9833 2937 37513 33325 -2689 -66370 -8363 55067 47780 16572
19559A6572L3110k0968j8601l4828j0719j4792j3380K2012L896j0074M5811K4138
19547B2177J0878L9666J7515o77o6906o310n380l94n295n0188p7692k396M0066
19534h4936P3959L0954j1791p275n637P760N0620M0829o3962j14621j1359M4142
19522e1317J4260M0353J8504L2169K8080r446p6301j1112L0591J1252j3022O351
19510B0362l0960p3811L4233O3142l836k7367j7738M1515K7754k4661l1134N9136
19498C6635M6160M7074P454j8969m6792L263n495J6304n679Q872k7604j8855P378
19485D9746j596k4819k1726m3888N2119M6100j6310l8583j7258l98K2133M8257
19473E3777N916k8903l5517J6635K4092J2886m1849n5544L8533M6432n905m7505
$$ plain form
19559 16572 49682 28714 10113 -24715 -35434 -50226 -63606 -41594 -37698 -47772 -1961 22177
19547 22177 33055 72721 90236 89559 22653 16343 10963 10569 5274 -44914 -122606 -125002 -84936
19534 -84936 -10977 19977 8186 911 -4726 3034 53654 94483 30521 -84100 -95459 -51317
19522 -51317 -37057 3296 21800 53969 82049 72603 -3698 -14810 15781 27033 14011 20362
19510 20362 -10598 -84409 -50176 12966 9130 -18237 -35975 5540 33294 8633 -22501 36635
19498 36635 82795 129869 137323 118354 71562 74825 69330 85634 79955 88827 61223 42368 49746
19485 49746 48150 23331 1605 -42283 9836 55936 39626 1043 -16215 -16613 5520 53777
19473 53777 59693 30790 -4727 11908 36000 48886 7037 -48507 -9974 36458 30553 -16952
19461a6952K5060N8261K822N481K4337K440m2000J3427M1979n5958m0182J5197
19449C3912L7376O3399l8415j9873P6771J6990m7790j07758n0175N6424M4856
19438F5717l878m7243K9508J7875J7032l4916j9818j7259M1131L2186k3576J1491
19426F8250J5719l0705j1791k5435R192J5613L7775J5038k317n3647L0373J4059
19414H2124N165m3685r210l5205K9920J7685J2110l1720l3451p808N4359R389
19402D9673o0830N362k8471l77K8985L7311L7121J851n6628k380j2508K0548j2779
19389F878J025p736L7373J130L0569J1805m00k7684N1845O3080L7320P812L4490
19376B47507k1665r3522o7110L9224K8081J583m9960m1616l5387K2929k6361j734
$$ plain form
19461 -16952 8108 66369 69191 74672 99009 101449 59449 72876 114855 58897 18715 33912
19449 33912 71288 134687 96272 76399 153170 170160 122370 14612 -35563 20861 65717
19438 65717 61839 14596 44104 61979 79011 44095 24277 7018 48149 80335 56759 68250
19426 68250 83969 53264 41473 16038 25230 40843 78618 93656 91339 37692 68065 82124
19414 82124 87289 43604 34394 -811 29109 46794 58904 27184 -6267 -14075 40284 49673
19402 49673 -11157 -5795 -34266 -34643 -5658 31653 68774 70625 13997 11617 -891 19657 6878
19389 6878 7903 167 37540 38670 69239 81044 80644 52960 104805 167885 205205 213017 247507
19376 247507 225842 132320 65210 104434 132515 134098 84138 42522 7135 30064 3703 1969
19364A969M2814k5862l1771J2925K9327J1471m551j14097n7641N5060Q6225N8125
19352F3994m6221j1376J898L4893k233L8403M5932l090l0733l5563k5679o90L9743
19339F9278P6032m935l6840k8985k9104J6978N0494J7159k1869K7643m8344l4239
19327E3268K5863o335l8842k1649K3679J2702j934L3097j4273l1469J0767J9994
19315F4868K3450L4681R370k0246M036j7597o4238n8156L1473R594K1381k3143
19303A5473l1965N426J7391M2949J4475J8235n986m4148o395l2417q045O0164
19291D5157L731n860M2267l51k1203n614o883L6429P027j2040O78l5185O0177
19278A08330p804j775q986j57L7043J7984l4815l3493K065k39O151K9563K6603
$$ plain form
19364 1969 44783 18921 -12850 75 29402 40873 36322 -77775 -135416 -80356 5869 63994
19352 63994 17773 6397 8295 43188 40955 79358 125290 122200 91467 55904 30225 29535 69278
19339 69278 145310 140375 103535 74550 45446 62424 112918 130077 108208 135851 87507 53268
19327 53268 79131 72796 33954 12305 35984 48686 46752 79849 65576 34107 44874 64868
19315 64868 88318 122999 132369 112123 116159 98562 34324 -23832 7641 17235 38616 15473
19303 15473 -16492 -11066 6325 49274 63749 81984 75998 31850 25455 -6962 -15007 45157
19291 45157 48888 43028 85295 84944 63741 58127 51244 87673 94700 82660 83338 48153 108330
19278 108330 100526 98751 89765 89608 126651 144635 109820 76327 78392 78153 84304 113867 140470
19265A40470m4969m9994M477L0428R062q132L852k5282M7014L9125j6193l4783
19253I5075k1730k2494L726n9585k8120j0676N6411N2609O922J266J3157l521
19241H3040M7430M1266k7560j02604l7543j4085k0731n419O7488M2333R512J1136
19229I4263K016N315M3761M2966n9819p3944k2711j3694L3794N5044N8591N77
19217A66159o1881j6204n2566k1587k2517J637K5648m0996l8556k6745L0608L1704
19205b5296J9497J6007q082P5599J1999J7709l1997n0233O5656L9694m769k4352
19193A01432K6187l5528k6615m464J8875L8460m8649J096J1877j0412M0794j4470
19181I8583k5626R461J7333k3547J413o8205m5743L3980O2512M4101K7468j801
$$ plain form
19265 140470 95501 45507 49984 80412 89474 81342 85194 59912 106926 146051 129858 95075
19253 95075 73345 50851 54577 -5008 -33128 -43804 12607 65216 72138 73404 86561 83040
19241 83040 130470 171736 144176 41572 4029 -10056 -30787 -36206 31282 73615 83127 94263
19229 94263 96279 101594 145355 188321 128502 54558 31847 18153 51947 106991 165582 166159
19217 166159 104278 88074 35508 13921 -8596 -6959 18689 -22307 -60863 -87608 -57000 -25296
19205 -25296 -5799 10208 2126 77725 89724 107433 75436 25203 90859 130553 125784 101432
19193 101432 127619 92091 65476 61012 79887 118347 69698 70794 82671 72259 113053 98583
19181 98583 72957 82418 99751 76204 77617 9412 -36331 -2351 60161 104262 131730 129929
19169A29929k9418l6621m0369L0392L3143K9920k9476q0350K1676L8730m4420
19158B3136l3083k2679L0116L0226K2469k0689k3769O82j1740O322J3502J2346
19146B6839L6064j8440k9858J1027o439l7999M732P4866N4370J3892j6988J593
19134A13659k7107m9363n224N6206M86M8612m7680k0700K6914o9089L905J5037
19122D5656k283m5509k2869L8226J5776J3245r941l0705K8533M9864J3860n6889
19110C6964n0231J9264k0512k3751J3628M0183J5759O2080n463m2670j1005l8733
19098d487l0011L32M9477N9795L0577P5571o185R775k5845m7917l805l5789k3963
19085D7525k0744L4055l0267l94L0602Q2341J4748n4855o0642K4163M2878m9784
$$ plain form
19169 129929 100511 63890 23521 53913 87056 116976 87500 7150 28826 67556 23136
19158 23136 -9947 -32626 -2510 27716 50185 29496 5727 6409 -5331 991 14493 26839
19146 26839 62903 44463 14605 25632 19193 -18806 -14074 60792 115162 129054 112066 113659
19134 113659 86552 37189 31965 88171 88657 137269 89589 68889 95803 26714 30619 45656
19122 45656 43373 -2136 -25005 13221 28997 42242 32301 1596 30129 79993 93853 36964
19110 36964 -13267 5997 -14515 -38266 -24638 15545 31304 93384 87921 45251 34246 -4487
19098 -4487 -34498 -34166 15311 75106 105683 181254 175069 184844 158999 111082 107277 71488 47525
19085 47525 26781 60836 30569 30175 60777 143118 157866 103011 42369 66532 109410 59626
19073E9626m0495M7371N0900L9021N411m5808n1174n1022K2813Q075O9999L3805
19061A48522j7860o4574l4324j121J3868J5159J03100O0543o6993q6080l9713
19050C0527R0919L3990m0479j2179k9009n644m5563M422n4261l1428O1158K9389
19038C1842J300m4633m0662Q6196N3397L5390n389m1834l8093M635L2224k6721
19026D7652M4042p703j6253k3129L0555N0000J8683N676l7415q22J9185R159N5269
19013A94899K948k6327r522l6360N221N879K5470m6937N7731K4771j5099n6650
19001A26024l4185L38o9451J1078P5653L5811l1660n2052j2442o670N1099R351
18989A02894l4565N690N990p6203l0015K4611J2757J8683j0608Q307O5544M1784
$$ plain form
19073 59626 19131 66502 117402 156423 161834 116026 64852 13830 36643 44718 114717 148522
19061 148522 130662 66088 31764 30643 44511 59670 162770 223313 156320 70240 30527
19050 30527 121446 155436 114957 102778 73769 68125 22562 26984 -27277 -58705 2453 31842
19038 31842 33142 -11491 -52153 34043 87440 122830 117441 75607 37514 42149 74373 47652
19026 47652 91694 83991 67738 44609 75164 125164 143847 149523 112108 111286 130471 139630 194899
19013 194899 197847 171520 161998 125638 130859 136738 162208 115271 173002 197773 182674 126024
19001 126024 91839 92177 22726 33804 109457 145268 113608 61556 49114 42444 93543 102894
18989 102894 68329 74019 80009 3806 -26209 -1598 11159 29842 19234 27541 93085 134869
18977A34869k3404l3412j5870K9690K623O844K8987n604K4335j2331J1680K1846
18965A70253k2839o251l2584K6647N4525K6986K6016P1359J2128m360m625p4261
18953B42994k1115l738k5568N760O3696O7458k2124p9907q5761n2870L9670k5125
18941A03370J0222k7075j2641P2050K3130K0623l3690j2220m4946k5541L5127
18930A08409P9962J06959Q9965O5892p7885j01735m5541J0283k080M8138M4192
18919C26559L9293o780p4961j6636k6441n1172k6079l5787j9735j1821N6540O7869
18907B20849O8487K5463k9405l6888k6132J0532O3551N1320M5682O4375P26m1405
18895D17155m1129K6512k0680n9592L1180q610j9873Q3885J80866O4550p9450
$$ plain form
18977 134869 111465 78053 62183 91873 94496 101340 130327 124723 149058 136727 148407 170253
18965 170253 147414 141163 108579 135226 189751 216737 242753 314112 326240 321880 317255 242994
18953 242994 221879 218141 192573 198333 262029 329487 307363 227456 141695 88825 128495 103370
18941 103370 113592 86517 73876 145926 169056 189679 155989 143769 98823 73282 108409
18930 108409 188371 295330 385295 451187 373302 271567 226026 236309 234229 282367 326559
18919 326559 365852 359072 284111 267475 241034 189862 163783 127996 108261 96440 152980 220849
18907 220849 289336 314799 285394 248506 222374 232906 296457 347777 393459 457834 458560 417155
18895 417155 376026 402538 381858 322266 353446 344836 324963 408848 589714 654264 574814
18884E74814j81997k7501J06486J07187J36524J67824J7477p6686r1202p4260
18874F58666M4959Q3786J11839N893j75191k29587j26635o5534n4441K1057K442
18863B77254J9449L1529k7603p873N9750M3436N8333N9311M312J3466q684L8603
18851E61283O9345M4048q8454n0060m165K4201M0842N7153J86584J98970J16990
18840A156737m263j31135j39740j45791n8731J527l30N1979J58282J66194L1892
18829A086621l4712j39926p0732N4780J05458R822q331n2540j57864q4214L7052
18818G45414M0950m8170o1483n2862n5403n0063k4118M5446M8057O2188M8403
18807F98359k1356o0789n9786r3650m5930m5660m5833M3691J30547Q2213J08176
$$ plain form
18884 574814 392817 365316 471802 578989 715513 883337 900814 824128 732926 658666
18874 658666 703625 787411 899250 905143 729952 500365 373730 308196 253755 274812 277254
18863 277254 296703 328232 300629 292756 352506 395942 454275 513586 517898 531364 522680 561283
18851 561283 630628 674676 586222 536162 531997 556198 597040 654193 840777 1039747 1156737
18840 1156737 1152474 1021339 881599 735808 677077 678604 678274 730253 888535 1054729 1086621
18829 1086621 1051909 911983 841251 896031 1001489 1011311 1002980 950440 792576 708362 745414
18818 745414 786364 738194 676711 623849 568446 518383 494265 539711 587768 649956 698359
18807 698359 677003 616214 556428 462778 416848 371188 325355 369046 499593 581806 689982
18796F89982J04507K0331o1728m8922n9349o0892L4027J01167R571l6450O9047
18785G61291N7703M1016j17548j11889l4304K9475P7375J13366J12697M641n5969
18774H77854o2677N4860N0023Q7601K34766J92856J12000L7814k60368k36384
18764A088345j48875p0675J8144N4111r6730j60636j10282r1509q8373q0825q1561
18753B31134j2268n437k5397J5897J479L9748K4606J4141J0415J278l5309n7031
18741B03256m0930j0188N915l6283M0920O5004N3422M075l1317j3868o213j1413
18729B22380j8289P7944J10880P8532N920J5702l0966j20796o4342J3287M0005
18718C30257L4411L8819O5397M4627L7770k7524m2676q1886m9641j1630Q807l5470
$$ plain form
18796 689982 794489 814820 753092 704170 644821 583929 617956 719123 728694 692244 761291
18785 761291 818994 860010 742462 630573 596269 625744 703119 816485 929182 933823 877854
18774 877854 815177 870037 920060 1007661 1242427 1435283 1547283 1585097 1324729 1088345
18764 1088345 939470 868795 886939 941050 844320 683684 573402 481893 393520 312695 231134
18753 231134 218866 213429 188032 203929 205408 245156 269762 283903 294318 295596 260287 203256
18741 203256 162326 152138 158053 121770 162690 227694 281116 285191 253874 240006 233793 222380
18729 222380 204091 282035 392915 471447 477367 493069 462103 341307 276965 290252 330257
18718 330257 364668 403487 468884 513511 551281 523757 481081 399195 349554 337924 346731 311261
18706C11261J0862J914l9048J5229N0903O660o1638k4722k9425J4263l7094J1199
18694B30364L9014J9429K53571M03274L06081Q308k19090j80505r6797J31250
18684H94899L12217M47958N45944K13425k69129n61543l84900l8990N0684J25987
18674A336552K50037K79631j36853m06022l90891k57732j56840k2839J8702P615
18664E21360K6234L863l6901l1559n5419p1547n1351L5798K292k569K9971R295
18652C79467M8155P0440j4606J5271K2978N3154J28216K54578L87724O04885M49706
18641B399968k11685m86930l13625N5509L56899O65533R79593P75519P0461p34790
18631C556452j039450o51852k14593Q8026L06719N02153K96938l84438n96357
$$ plain form
18706 311261 322123 324037 284989 300218 351121 357781 296143 271421 241996 256259 219165 230364
18694 230364 269378 288807 542378 945652 1251733 1260041 1040951 860446 763649 894899
18684 894899 1207116 1655074 2201018 2414443 2145314 1583771 1198871 1159881 1210565 1336552
18674 1336552 1586589 1866220 1729367 1323345 932454 674722 517882 495043 513745 521360
18664 521360 547594 551457 514556 482997 427578 356031 304680 340478 342770 340201 370172 379467
18652 379467 427622 498062 483456 498727 521705 574859 703075 957653 1345377 1950262 2399968
18641 2399968 2188283 1701353 1387728 1443237 1800136 2465669 3445262 4220781 4291242 3556452
18631 3556452 2517002 1865150 1650557 1738583 2045302 2547455 2844393 2459955 1863598
18622A863598l50249j27523p0377j16562j31412j82237q0731o6966p0629l8589
18612F28323O2004K8607J6263M2000o5968l7965K020N110j2989o5731m2199j9116
18600E40359q593k0803K2718M5970O5151O0079j2192j3961n8771j4026J1367J7454
18588F34752O1984m2913j7619M8633p27p0034R077L5260j2679j00594r2674j9884
18576D32582N3249R6346J57542J59739N8388K2305r431J2021P098N777J0518N9201
18564A065335j8018R005J03340J35067J68167O1486M6291O3272L4853L69m1261
18553A627906o7460p2982n460J53084K07933K49468M56319O55814O55456M50811
18543D310889K14792k55333m32311m73820o46244n93608m30689k55003j51714
$$ plain form
18622 1863598 1513349 1385826 1315449 1198887 1067475 885238 804507 737541 666912 628323
18612 628323 690327 718934 735197 777197 711229 673264 675284 680394 667405 601674 559475 540359
18600 540359 531766 510963 533681 579651 644802 704881 692689 678728 619957 605931 617298 634752
18588 634752 696736 653823 636204 684837 684110 614076 623153 658413 645734 545140 452466 432582
18576 432582 485831 582177 739719 899458 957846 980151 970720 982741 989839 995616 1006134 1065335
18564 1065335 1047317 1056322 1159662 1294729 1462896 1524382 1570673 1633945 1668798 1669167 1627906
18553 1627906 1560446 1487464 1482004 1635088 1843021 2092489 2548808 3204622 3860078 4310889
18543 4310889 4525681 4270348 3838037 3364217 2717973 2124365 1693676 1438673 1286959
18534A286959j19912n5777K5285k7352j01881k0648l2078m4131q7430o5683p3700
18523F83652j4246l1979m4717j4892J1609M3812l3149l4245j2187j9023Q0900
18512F15535Q6547k9715L2842j3219k3826K4735N7932J35711J59452J64615Q0253
18501A290862L2398J97082L86945N17279O34908Q02808O69402K02881R5928l9751
18491D790742n29316n21872n10291o15605m91226k75732k49076k20914k13195
18482A163515j43062L636l0206n5281n7520m891k3781m2187k9322J380K037K0269
18470H04587k2759L1653O6282N0202J4733L8818K439j7601J942L3925l1689M2472
18458A015004L3676K4134l360M9182R1756J00562J41253K09358L00560N91067
$$ plain form
18534 1286959 1167047 1111270 1136555 1109203 1007322 986674 954596 910465 823035 757352 683652
18523 683652 669406 637427 592710 577818 589427 633239 600090 565845 553658 534635 615535
18512 615535 702082 672367 705209 691990 668164 692899 750831 886542 1045994 1210609 1290862
18501 1290862 1323260 1520342 1907287 2424566 3059474 3862282 4531684 4734565 4830493 4790742
18491 4790742 4261426 3739554 3229263 2613658 2122432 1846700 1597624 1376710 1163515
18482 1163515 1020453 1024089 993883 938602 881082 876191 852410 810223 780901 782281 784318 804587
18470 804587 781828 813481 879763 929965 944698 983516 985955 968354 970296 1004221 972532 1015004
18458 1015004 1048680 1072814 1069454 1118636 1210392 1310954 1452207 1661565 1962125 2553192
18448B553192O89861O34903O02452P53456M14122n6764q2715m40141q64295o34696
18438C569375j15447J60360L99068K90253R3312K61081L48720L94607Q23250J566493
18428G791072J968670Q96323j023704j285451q16502j35140Q90329K016295L681438
18419A3983330O138024R002134R904496l46189j0040178p134221j651782K669568
18411B2525182O130874O361039k278240r134451o861594l388743j071193Q08196
18403A3091070K597192L571378J105461k841853l082776j778645o31261M67029
18395A2497595J628374L256835N793934R938484J5629399J9089976J0021016J606582
18387G9462195M519123N859639k118923j2948722q346555n905138j0977663q286824
$$ plain form
18448 2553192 3243053 3877956 4480408 5233864 5647986 5591222 5508507 5068366 4204071 3569375
18438 3569375 3453928 3614288 4013356 4303609 4396921 4658002 5006722 5401329 6224579 7791072
18428 7791072 9759742 10656065 9632361 8346910 7530408 7395268 8285597 10301892 13983330
18419 13983330 20121354 29123488 39027984 38681795 28641617 21507396 19855614 22525182
18411 22525182 28656056 35017095 32738855 23604404 16742810 13354067 12282874 13091070
18403 13091070 15688262 19259640 20365101 17523248 14440472 12661827 12030566 12497595
18395 12497595 14125969 17382804 23176738 33115222 48744621 67834597 77855613 79462195
18387 79462195 83981318 89840957 87722034 74773312 66426757 60521619 49543956 41257132
18379D1257132k474922j163401j197290K534611Q080356J2356233R415974L904310
18371G2713003J0521197J8220756J3719497m688547k4279814j7121140j127512
18364F7957440J2249869J8841645J0061341o420953k3110200k1121364j0405125
18357D8052653l281760j626785m178897m000730j427413M8769J246043M062358
18349C8894238Q023130J0794159O096106j991311J273359J2845859K7166662L6533244
18341A39635446K7123568J3872683k388050j3283752q345706L542214M749362
18334A64905765j5227993j5376814l644165M078942k085376j2027720j3758140
18327A06864499j8550171j3711750l60135J3513734K4560552J5315478j6329573
$$ plain form
18379 41257132 38782210 37618809 36421519 38956130 47036486 59392719 68808693 72713003
18371 72713003 83234200 101454956 115174453 110485906 86206092 69084952 67957440
18364 67957440 80207309 99048954 109110295 102689342 79579142 58457778 48052653
18357 48052653 44770893 43144108 38965211 34964481 33537068 33585837 34831880 38894238
18349 38894238 46917368 57711527 63807633 61816322 63089681 75935540 103102202 139635446
18341 139635446 166759014 180631697 178243647 164959895 156614189 160156403 164905765
18334 164905765 149677772 134300958 130656793 134735735 132650359 120622639 106864499
18327 106864499 88314328 74602578 74242443 87756177 112316729 127632207 111302634
18320A11302634k0761769r190285j804220R339535K3356867K7141092o188855
18313A33194999l7744845k9899985j4913344o783174k958194m82512K033785M924984
18305D7371714M884984j368142m276639M74889P494372J3832660J4702042K249265
18297H5365145r517226m853606P623149K1619149L3904978K5477426k896350j0399128
18289A46323537Q948954K9833211K6899949J6269162K2822812K7462797N598413
18282B84158835m4320444p3121684n3041101k7180071j1022946J022755J2683305
18275H9178649K4287354K6124782o303441l2997549k4687720j6537413j3889144
18268D5175518r189371o057943m853730l445943k185938j555909j221752p52160
$$ plain form
18320 111302634 90540865 81350580 79546360 88885895 112242762 139383854 133194999
18313 133194999 95450154 65550169 50636825 43853651 40895457 40412945 42446730 47371714
18305 47371714 52256698 50888556 46611917 47086806 54581178 68413838 83115880 85365145
18297 85365145 75847919 70994313 78617462 100236611 134141589 159619015 156722665 146323537
18289 146323537 155272491 185105702 212005651 228274813 251097625 278560422 284158835
18282 284158835 239838391 166716707 113675606 86495535 75472589 76495344 89178649
18275 89178649 113466003 139590785 133287344 100289795 75602075 59064662 45175518
18268 45175518 35986147 29928204 25074474 21628531 19442593 17886684 16664932 15912772
18260A5912772l30750k19770j70064L22245O46501J97553k81543n77007r89716
18251A4510221q79377k54074N42691K078175M831702Q643866J2471647P557160
18243D9502011q933914j2065309o280808j959543J138052M982438J0408684J6956073
18235E3747684J8791660k154436k2310334j7399387q325928l216486p8695K731495
18227B1785573N717684P473811M02876r902223r038114m966432k523050j209763
18219G740362o59915o45244n46607m45153m01742k86185k33190k78750j63583
18210D079993j50858j82708k0645J65089K42262K32542J70251K06234J53162r6680
18200D798642l50064m12405m85677l96529r345K90492M01771J65741m66703o23042
$$ plain form
18260 15912772 15582022 15362252 15192188 15514433 16160934 16358487 16076944 15499937 14510221
18251 14510221 13630844 13376770 13919461 15997636 20829338 29473204 41944851 49502011
18243 49502011 40568097 28502788 22221980 20262437 21400489 26382927 36791611 53747684
18235 53747684 72539344 70384908 48074574 30675187 22349259 19132773 19054078 21785573
18227 21785573 27503257 34977068 35379944 25477721 16439607 11473175 8950125 7740362
18219 7740362 7080447 6435203 5888596 5443443 5041701 4755516 4522326 4243576 4079993
18210 4079993 3929135 3746427 3725782 3890871 4133133 4365675 4535926 4742160 4895322 4798642
18200 4798642 4448578 4036173 3550496 3153967 3144622 3435114 3836885 4002626 3535923 2912881
18190B912881l49991o133K26858N09793O64359P2640n86247n06069j91789J88929
18180B935231M59680N62234K75833k979m67209o48964m71062j26442J62467M02095
18170C080884N50447K74469k40650k23591Q1277J82946j45084l88465l05838k18121
18160B648274j85986j22657k7008Q3119J56496J93400J34919L8570J6836q9095
18150B846868k75813k53576j56916n518J00642L17622M04363M02349O1625l87071
18140C054575l51976j59666m7767J43881L46320L56750j4757l96155k39259j9665
18130B672281J42454K89419M02005N49032L53698n9353j06346R711K84900N31376
18120E069177O60552Q71633Q08270O25878J099972K131552L721873O975670J3848910
$$ plain form
18190 2912881 2562890 2556757 2783615 3293408 3957767 4030407 3444160 2938091 2746302 2935231
18180 2935231 3394911 3957145 4232978 4229999 3762790 3113826 2642764 2516322 2678789 3080884
18170 3080884 3631331 3905800 3665150 3441559 3522836 3705782 3560698 3172233 2866395 2648274
18160 2648274 2462288 2339631 2312623 2395742 2552238 2745638 2880557 2919127 2935963 2846868
18150 2846868 2571055 2317479 2160563 2155045 2255687 2573309 2977672 3380021 3441646 3054575
18140 3054575 2702599 2542933 2495166 2639047 2985367 3342117 3327360 2931205 2691946 2672281
18130 2672281 2814735 3104154 3506159 4055191 4408889 4349536 4243190 4252901 4537801 5069177
18120 5069177 5729729 6601362 7409632 8035510 9135482 11267034 14988907 21964577 35813487
18111C5813487K5411314M1149006M5935690j1794965n2070723l1928863j0671669
18104D1843277J161307R266252J3761999M856255j3231193j6492708r895965m389650
18096B6879574p09993K772513O964481J2066229J4516691N107410q430382o320780
18088E2845743N538348J7982822K5961894J2876171j7991044k5701978j3410599
18081E8101357l19534J0331686J6582505J2719378J2064677J4169391k414094
18074A21235366j5548436m220905R674792p15435k4610988k4307644j2481564
18067D9025186k899076M071649Q877519N322058r917323j5167285r921306n291343
18059B4100079k949775j441327k92669O84662J115011J18545o24098n5552J367905
$$ plain form
18111 35813487 61224801 102373807 148309497 136514532 84443809 52514946 41843277
18104 41843277 43004584 52270836 66032835 70889090 57657897 41165189 31269224 26879574
18096 26879574 26169581 28942094 35906575 47972804 62489495 67596905 59166523 52845743
18088 52845743 58384091 76366913 102328807 115204978 97213934 71511956 58101357
18081 58101357 57781823 68113509 84696014 97415392 109480069 123649460 121235366
18074 121235366 105686930 101466025 111140817 110425382 85814394 61506750 49025186
18067 49025186 46126110 50197759 59075278 64397336 54480013 39312728 29391422 24100079
18059 24100079 21150304 19708977 19416308 20100970 21215981 21334526 20710428 20654876 22022781
18050B2022781K953148M797810P960983J3610210K1587323K7447012J6841911
18043A17221178o890966q392326J3301984M1963841O7637132O0306134P172311
18036B92319288l1678503l4288246m0934631l2352451k761303L1131601O3061811
18029B44497566P1832743K3941300m1988361n5536725l4879524k0839900j9106044
18022A67921055j4122071r412429j4145918j9820439k3637151j8671103q845372
18015E9266572j002743L000227l87319q740389j1582098r582724o265468l832211
18007B0873847k488735j897581j708637j550636j204322r47749p06308n08894
17999I860985n23151n46748o23445m44193l49457l04248j62732J49482M60505
$$ plain form
18050 22022781 24975929 29773739 37734722 51344932 72932255 100379267 117221178
18043 117221178 110330212 101937886 115239870 157203711 224840843 285146977 292319288
18036 292319288 260640785 226352539 185417908 153065457 150304154 181435755 244497566
18029 244497566 316330309 340271609 298283248 242746523 207866999 187027099 167921055
18022 167921055 153798984 144386555 130240637 110420198 86783047 68111944 59266572
18015 59266572 58263829 61264056 60876737 52136348 40554250 30971526 24706058 20873847
18007 20873847 18385112 16487531 14778894 13228258 12023936 11076187 10369879 9860985
17999 9860985 9337834 8791086 8167641 7723448 7373991 7069743 6907011 7056493 7516998
17990G516998Q87997J535609K718323M773848P059606N972677k239711n576396
17982B2648951k311457J864424O643827J1579716J2361738j454753j3974233j0806995
17974B6551218m185043M84725L598685M939684J07661p258100p237043m634802
17966A2366985k971599j945111j225484p03159l11288j71540l71870m46054n11050
17957C709830m54372k94702j89529p8240N4936K6449m6797q6739j84363j75130
17947B281343r8648m6969O7398P1021l9373k38390k54443r3449M675N9514J87927
17936A900606K12577M6137l5286J39859P0814j28783j29587n8391L1880J01089
17926B150915K34462J32594k71327l77151k82781j03629L2167R1779J37865q6777
$$ plain form
17990 7516998 8404995 9940604 12658927 17432775 24492381 30465058 28225347 22648951
17982 22648951 20337494 22201918 28845745 40425461 52787199 51332446 37358213 26551218
17974 26551218 22366175 22850900 26449585 31389269 31496930 24238830 17001787 12366985
17966 12366985 9395386 7450275 6224791 5521632 5210344 5038804 4666934 4220880 3709830
17957 3709830 3255458 2960756 2771227 2692987 2747923 2774372 2727575 2640836 2456473 2281343
17947 2281343 2182695 2135726 2203124 2274145 2234772 1996382 1741939 1648490 1653165 1712679 1900606
17936 1900606 2113183 2159320 2124034 2263893 2334707 2205924 2076337 2017946 2049826 2150915
17926 2150915 2385377 2517971 2246644 1869493 1586712 1483083 1515250 1607029 1744894 1658117
17916A658117k35089k01274q8339m2255j525J224l0759o3127q49L4829K5171J5198
17904A071322M5915J74902N5013N8379O1543m3830r1302K207J06934J10841R2536
17893A644460O4618J4356P3503J12616o049j11854n9873M466Q2829L8568j00884
17882A756756j35701j21719n6802J0878O7178J04919J74381J60583k8144k04420
17872A727909k78590k08031o5964Q7626J78906J57208J5367l9998o2191l4447
17862A477795j14563r1958L8920J79493Q8397K1031Q9023J51105J85297J16607
17852B141147N2956m8907m2319K8523K702m9454n8664O086N1179M9846O1278j68643
17840B025730j76929O349J38690K36090K68802J20827r6197n8318o6805o4525
$$ plain form
17916 1658117 1423028 1221754 1133415 1091160 1089635 1090859 1060100 996973 996124 1030953 1056124 1071322
17904 1071322 1117237 1292139 1347152 1405531 1467074 1423244 1331942 1334149 1441083 1551924 1644460
17893 1644460 1709078 1723434 1796937 1909553 1903504 1791650 1731777 1736243 1819072 1857640 1756756
17882 1756756 1621055 1499336 1442534 1453412 1520590 1625509 1799890 1960473 1932329 1727909
17872 1727909 1449319 1241288 1175324 1262950 1441856 1599064 1614431 1574433 1512242 1477795
17862 1477795 1363232 1271274 1310194 1489687 1578084 1599115 1688138 1839243 2024540 2141147
17852 2141147 2194103 2145196 2102877 2131400 2134102 2084648 2025984 2032070 2083249 2133095 2194373 2025730
17840 2025730 1848801 1855150 1993840 2229930 2498732 2619559 2523362 2465044 2398239 2333714
17830B333714J00650J51240K00664l3742k24321k96870k23400j11762o75J09155
17820B004653K09534L07368K93350K71024K07745N2726l1478M1756L35204M82810
17810D174692N51373M84521L57917J76465J55456L84746N90517Q93749J422065
17801I191501K324583L502146N360680P691396Q411822M979318M56942k073896
17793C9844492l765340j909938K709994P575530J4349432K4922041L4423150L7038568
17785A55187929K3237003j7652888l9072405k3749658J78748K3031571M4973725
17778A66134025N1876640J5172979l0139436l4476678k0447864j8794208k7432758
17771A01892700k7492137j8869163j0460039m814927m43882L799348P485338P789407
$$ plain form
17830 2333714 2434364 2585604 2786268 2752526 2528205 2231335 2007935 1896173 1895498 2004653
17820 2004653 2214187 2521555 2814905 3085929 3293674 3346400 3314922 3356678 3691882 4174692
17810 4174692 4726065 5210586 5568503 5744968 5900424 6285170 6875687 7769436 9191501
17801 9191501 11516084 15018230 20378910 28070306 36482128 41461446 41918388 39844492
17793 39844492 36079152 34169214 36879208 44454738 58804170 83726211 118149361 155187929
17785 155187929 178424932 160772044 121699639 97949981 98128729 121160300 166134025
17778 166134025 218010665 233183644 203044208 168567530 148119666 129325458 101892700
17771 101892700 74400563 55531400 45071361 40256434 39812552 43611900 51097238 58886645
17763E8886645k28625j0949220j2599824q402801m549293k037207q17830m12397
17755A8889448o94764j184554j088925n18884K25858P28306R27825J286288K064956
17746B0635554L914932P537040J1952831J3524523O490508k085343K65903R749120
17738G1985068J6562692J0145695p049117j4670148o199884R138670K5868487
17731A05781463L8619717K4835228j0296678j8128957j0283470l006457P163120
17724A34683966J3976197N967868k4196044l7660216k5030167j2900348j0137381
17717D4703875r817654p264928m651337l085016k166958j500412j068240m07357
17709A4741973M88579J753018K650836J436855k212869m159953l171557j635861
$$ plain form
17763 58886645 58658020 47708800 35108976 26706175 22156882 20119675 19301845 18889448
17755 18889448 18194684 17010130 15921205 15402321 15628179 16356485 17284310 18570598 20635554
17746 20635554 24550486 32087526 44040357 57564880 64055388 61970045 62235948 71985068
17738 71985068 88547760 98693455 91644338 76974190 70774306 79912976 105781463
17731 105781463 144401180 169236408 158939730 140810773 130527303 127520846 134683966
17724 134683966 148660163 154628031 130431987 92771771 67741604 54841256 44703875
17717 44703875 34886221 27621293 22969956 19884940 17717982 16217570 15149330 14741973
17709 14741973 15230552 16983570 19634406 21071261 18858392 14698439 11526882 9891021
17701I891021o80087m57493p59574j071349r29408n92950l37555j84544l37845
17692D540216n99137n44217m18810k86216k75996k17595j79276j01811L31p3952
17682A843537j57167r7499m6737j6283Q3795Q572m0677j36228j59894r4732r1369
17671A095318j0941L1295J751k9474m257L9751K55l4164K6757O369M653O2414
17659A189727P9051L3372M399k145P4919O1586P8577R970j550j6090k2303q9645
17647A399868j09985q7000r3135j20416j34723q2267K3075M0488J8723N4510l141
17636I05997K6318k7657l7502o1340l9481J4115K8145n597J251N7424n7401j02492
17624G01780k0364Q419l7876n5249l0266k4240P324j7179j4663O1542O2478k7520
$$ plain form
17701 9891021 9210934 8753441 7993867 6922518 5993110 5400160 5062605 4878061 4540216
17692 4540216 3941079 3396862 2978052 2691836 2415840 2198245 2018969 1917158 1917489 1843537
17682 1843537 1686370 1588871 1542134 1525851 1609646 1618218 1577541 1441313 1281419 1186687 1095318
17671 1095318 1084377 1115672 1117423 1087949 1083692 1123443 1123698 1089534 1116291 1122660 1127313 1189727
17659 1189727 1268778 1302150 1306549 1304404 1379323 1440909 1519486 1529456 1527906 1511816 1489513 1399868
17647 1399868 1289883 1202883 1109748 989332 854609 772342 795417 835905 854628 909138 905997
17636 905997 932315 904658 867156 805816 766335 780450 808595 802998 804249 861673 804272 701780
17624 701780 681416 689835 651959 596710 566444 542204 549528 532349 517686 579228 641706 614186
17612F14186o141J6843J28290N2700O9999J41413J53245O8870n5751n1733o793
17601A125128q753k1161L5270M4656k2050n7456l1147r7274l6036p6089q6504
17590G68584l0862j6681j7362L4637L0353P3652P4649O3568J9151r195l0128j7147
17578I43219p4848q0068m8988l6389k2641J3711N037k4375m3451l7501L4804J08970
17566G37480P3605r333j03964j6339l9305P4116R6663N1955J4567k1375n9350
17555G98720j62987l8521J2471O1832l997m389k7839k1870l3877k0098n9446k1034
17543D78965m2996l406M1909m0692q2057m8093J6247q861r533M8233R7065R3012
17531E39793L5485k6985j29758j16060J2953P2094L5224M2099J19909J09542O5772
$$ plain form
17612 614186 608045 624888 753178 805878 875877 1017290 1170535 1239405 1183654 1131921 1125128
17601 1125128 1116375 1095214 1130484 1175140 1153090 1095634 1064487 967213 931177 855088 768584
17590 768584 737722 721041 703679 738316 768669 842321 916970 980538 999689 990494 960366 943219
17578 943219 868371 788303 739315 702926 680285 693996 699033 674658 631207 593706 628510 737480
17566 737480 811085 801752 697788 681449 642144 716260 812923 864878 879445 858070 798720
17555 798720 635733 597212 609683 671515 667518 663129 635290 613420 579543 559445 499999 478965
17543 478965 435969 432563 474472 433780 351723 303630 319877 311016 301483 349716 446781 539793
17531 539793 575278 548293 418535 302475 315428 387522 422746 464845 584754 694296 760068
17520G60068j2281M8947J05213R6902J60337J58197J66616o022j84023k26132
17510A067822m6748J75277K03122J04922N1103r580r7944j40361r0586m7976l3031
17499A136020q2371n5011j36617j66751j65339m2225Q4304J14954J2942q6758
17489F13148m3166m1988j01558j55807n5459J2143L9116J2293P657J8483j8026
17478B86836p047m72J2847N0791q139N5464P4191o693q7414l5367J00909J2516
17466D48422N078j0276p8876n8736k9532l512K6287N1954k1833k6416J5652R2928
17454D11140J44060M8011r8752p2749j4515M7532N1373R3626R1801Q4402R5979
17443H81908J76563m4698l10295k45002j15772k6495o1260l6461n9533q782L6613
$$ plain form
17520 760068 747787 796734 901947 998849 1159186 1317383 1483999 1477977 1293954 1067822
17510 1067822 1021074 1196351 1399473 1504395 1555498 1545918 1447974 1307613 1217027 1169051 1136020
17499 1136020 1053649 998638 862021 695270 529931 487706 572010 686964 699906 613148
17489 613148 569982 527994 426436 270629 215170 227313 266429 278722 286379 304862 286836
17478 286836 279789 279317 292164 342955 334816 390280 464471 457778 370364 334997 435906 448422
17466 448422 453500 443224 364348 305612 276080 272568 298855 350809 328976 302560 318212 411140
17454 411140 555200 603211 504459 431710 417195 464727 516100 609726 701527 785929 881908
17443 881908 1058471 1013773 703478 458476 342704 316209 254949 218488 158955 150173 186786
17432A86786k5675n8063k8303M3476Q1862N2719J3498n729p463l5028j99N089
17420B22970j5770j0007r782m7307k5353p6051l2329J7111l058j2118j2394N8440
17408E4352K9991n5217n0960J6792M4527Q516j3892J1482j0021n6844L6074m199
17396A0601p9378J3030Q2033L1681k1965k6679P1676Q566j0595l6738K645p9549
17384c4672j7596j8169L3920R2250j4854k9619q358j505J3057j1575j5847O9963
17372E6995j5645j4677L470K8850r007O424K4454N0806n9335p9650n98k3105K2740
17359h278M8831l0374k7626L6056K1081k7064k6820j9890J2190j7178J605J8469
17347a8998K936j110k1997k246J6879j6157l9024M9432N0987L1408k3366l3450
$$ plain form
17432 186786 161111 103048 74745 118221 200083 252802 266300 260571 253108 218080 217881 222970
17420 222970 207200 197193 187411 140104 114751 38700 6371 23482 20424 8306 -4088 54352
17408 54352 84343 29126 -21834 -5042 39485 48001 34109 45591 35570 -21274 14800 10601
17396 10601 -68777 -55747 26286 57967 36002 9323 80999 89565 78970 42232 44877 -34672
17384 -34672 -52268 -70437 -36517 55733 40879 11260 2902 1397 14454 2879 -12968 56995
17372 56995 41350 26673 30143 58993 49986 56410 80864 131670 72335 -7315 -7913 -31018 -8278
17359 -8278 40553 10179 -17447 18609 39690 12626 -14194 -34084 -21894 -39072 -37467 -18998
17347 -18998 -16062 -17172 -39169 -41415 -24536 -40693 -79717 -30285 20702 52110 28744 -4706
17335d706o3781R536J6558l4431Q9075O9304m9948r0444k5646P2326Q1320l7351
17323C1812q3039m5053k9661M4114O2489m5745n3341k3417R7621R2698k7308l0652
17311i482r224J6605j5652L320J1540q6852k8499L5446j2127L3410K7788j741
17299c5468P985M3043L375K2593J59m215k2442n992M6121K9785J239J3619K3642
17286A23444K8662k7012J1884R0672J52735Q5394M2791Q9703M4235q973K1680
17275F55215j3101k3074O659j60644p1640M532O8998O8662J1924Q166L6776P9274
17263F71747m4298j10026l7862j0425q001L1755p7571j01234j12181o6816P261
17252A42349M9106m001k2368L428j3070q0624k8239N1485L7735N4308O9071L3043
$$ plain form
17335 -4706 -68487 -58951 -42393 -76824 12251 81555 31607 -58837 -84483 -12157 69163 31812
17323 31812 -51227 -96280 -125941 -81827 -19338 -65083 -118424 -141841 -44220 48478 21170 -9482
17311 -9482 -18706 -2101 -17753 -14433 -2893 -89745 -118244 -82798 -94925 -61515 -33727 -35468
17299 -35468 -27483 15560 18935 41528 41687 37472 15030 9038 55159 84944 86183 99802 123444
17286 123444 152106 125094 136978 227650 380385 465779 508570 598273 642508 633535 655215
17275 655215 642114 619040 625699 465055 393415 397947 466945 535607 547531 555697 592473 671747
17263 671747 627449 517423 479561 469136 461135 492890 415319 314085 201904 135088 142349
17252 142349 191455 187454 165086 168514 155444 74820 46581 98066 135801 190109 259180 292223
17240B92223j4841o2387r0768n3734K3849O4971K2316O357O4879N9285Q5871K5930
17228D23951P5258J60684L6515K090j00982j01019m4677J06168P4577k5501j14675
17217D92389j40599j05208k2781L8052J00635J73744J46989k286j35812j51008
17207C94115j06184l1572J5019M2419Q7015O2361j8501k6729q3070r6114r0167
17196A48592m1234n7604m5577J1774N4610n5869l6766K2207O4303M2194m0142
17185F6488j7114k9009K758l8751j1776J5250j4137q2323r375R9003Q3183L6199
17173A00396o2293o3253l3378K3568M4804J917p0515l4462l421k515J3001n499
17161i1650J5519J2883l9764P5928N7406k4729J429J0950J0204L3589k251k6557
$$ plain form
17240 292223 277382 214995 124227 70493 94342 159313 181629 187986 252865 312150 398021 423951
17228 423951 499209 659893 696408 698498 597516 496497 451820 557988 632565 607064 492389
17217 492389 351790 246582 223801 261853 362488 536232 683221 680935 545123 394115
17207 394115 287931 256359 271378 313797 400812 463173 444672 417943 334873 238759 148592
17196 148592 107358 49754 4177 15951 70561 14692 -22074 133 64436 106630 66488
17185 66488 49374 20365 23123 -15628 -27404 -12154 -26291 -108614 -117989 -18986 64197 100396
17173 100396 38103 -25150 -58528 -34960 9844 11761 -58754 -93216 -96637 -99152 -86151 -91650
17161 -91650 -76131 -63248 -103012 -27084 30322 5593 7022 17972 28176 61765 59514 32957
17149C2957j2158R497j3732L160P023o8295j1365J4941L7937l9254L4193N6422
17137E1326l0146o1256n4552p869K9930o706L1407j6920K3428N4874j529K196
17125A4183N5866J9726k4814o2358J9371j7786m7856L3366L1660K3798j4170l6050
17113e064r033l76J2666L308n270k3140m0919l6308K4707p667m2317N907M4216
17100g9290O5688q411M350L7968K2462q0220k2513O6510L8058J4821j113n7207
17088A103l2130J0002J4934N476J7155L3733r033o0618n4426r032M071M1269M4025
17075F529J6464j658l6138j6164j6529k3883M9802Q4453o072Q151L0596l1697
17063F3854k063k4699k8606m2329N0916P2670p864o5488m8637l4548R782M6922
$$ plain form
17149 32957 20799 30296 16564 19724 26747 -41548 -52913 -37972 -35 -39289 -5096 51326
17137 51326 21180 -40076 -94628 -102497 -72567 -79273 -47866 -64786 -41358 13516 11987 14183
17125 14183 70049 89775 64961 2603 21974 4188 -43668 -10302 21358 45156 30986 -5064
17113 -5064 -14097 -14473 -1807 1501 -3769 -26909 -67828 -104136 -79429 -87096 -129413 -123506 -79290
17100 -79290 -13602 -22013 -17663 20305 42767 -37453 -59966 6544 44602 59423 58310 1103
17088 1103 -31027 -21025 -6091 -615 16540 50273 41240 -19378 -73804 -82836 -78765 -37496 6529
17075 6529 22993 21335 -14803 -30967 -47496 -71379 -21577 62876 56804 64955 95551 63854
17063 63854 61791 37092 8486 -33843 17073 89743 81879 16391 -32246 -66794 -57012 -10090
17051a0090J5588j0907J9621l445J390M2132L6051k1222l9420L444k6362l2754
17039b5974K1272J9780q880p697l6297J5018r528m1925j721j0842o477Q5891l1017
17026c8397l0115N0112K8006j0299n4144m6633k9959M3840L2485P371k7556j2194
17014h7483L6321M4515J6723q4363o5382J1082K5533J998N1598k644J7198M0921
17002F017L0087j4067M832J9428p365j9800j6073j3433K8863n6929l6428N7078
16990a7790k2812n1993j2508j3832j0974K6498N150J972L8501J8061j5241o5883
16978a20851k0370M8525N4259O4544q251l2868K0491J2481j6560J7215K3330q520
16966C3425j6049m7017m6921K115M7373r078J7338R7453l6832p2741l5852K3536
$$ plain form
17051 -10090 5498 -5409 14212 10767 12157 54289 90340 69118 29698 33142 6780 -25974
17039 -25974 -4702 15078 6198 -1499 -37796 -22778 -32306 -74231 -75952 -86794 -93271 -7380 -38397
17026 -38397 -68512 -18400 9606 -693 -54837 -101470 -131429 -87589 -55104 -47733 -75289 -87483
17014 -87483 -51162 -6647 10076 -74287 -139669 -128587 -103054 -101056 -49458 -52102 -34904 6017
17002 6017 36104 22037 26869 46297 38932 19132 3059 -10374 18489 -38440 -74868 -17790
16990 -17790 -40602 -92595 -105103 -118935 -129909 -103411 -98261 -96289 -57788 -39727 -54968 -120851
16978 -120851 -141221 -92696 -38437 26107 17856 -15012 5479 17960 1400 18615 41945 33425
16966 33425 17376 -29641 -76562 -74447 -27074 -36152 -18814 78639 41807 -30934 -66786 -43250
16954d3250J5457l9163j5178M6662m1631m4423k3571L6941k0867j6187M094K4294
16942a16822J1904Q127J5736L8196m547o2991j4342N1398N7568L4801J7464j1737
16930B4755m929j1935K0184K128n1091m5834j1870J2474M6156L9823J2215J8281
16918E0357m142J4168m7764l6584K6808j9074j1285P883k8920K2574K7327j0517
16906i169N2520r54k8414l0076j382k1895m4790j8884J7969M1388k7900J9680
16894e1907K5073J9216K0509p175p3898p0721j3896k2886Q7139O3602m1481O7466
16882A041L2200J1914Q744n5359j1150L6992N2655o0887n4373j1022k8020J5697
16870f1568O5785k0340O861L4491k0132k8352k4125L0310P7619m9905k6302L7920
$$ plain form
16954 -43250 -27793 -66956 -82134 -35472 -77103 -121526 -145097 -108156 -129023 -145210 -141116 -116822
16942 -116822 -104918 -96791 -81055 -42859 -47406 -110397 -124739 -73341 -15773 19028 36492 24755
16930 24755 19826 7891 28075 30203 -20888 -66722 -78592 -66118 -19962 19861 32076 50357
16918 50357 46215 60383 12619 -23965 2843 -16231 -27516 -19633 -48553 -25979 1348 -9169
16906 -9169 43351 42397 13983 -16093 -17475 -39370 -84160 -103044 -85075 -43687 -71587 -51907
16894 -51907 -26834 -7618 12891 5716 -68182 -138903 -152799 -175685 -88546 -24944 -66425 1041
16882 1041 33241 45155 53899 -1460 -12610 24382 77037 16150 -38223 -49245 -77265 -61568
16870 -61568 4217 -16123 -9262 25229 5097 -23255 -47380 -17070 60549 10644 -15658 22262
16858B2262r978o998M7771m4240m4812j7720n651m0J8379j7196O6253j4870m7807
16845e4647J4548M2485M4285k642K2706k2887p820o0361j0923K3659k2017l177
16833c6791K4442M3550P181k6834m3791m3968j5897M3483K3113K3665K666k7218
16821b6399K6366j8019p206j582j244m2657k1891l307N7171K0214m0596O2036
16809B886N2013R439K59o596n6034m1708L4094O7484K2260p364o7552j946k326
16796D909L4664p981k2886j5852R368o6330k0334k4977N361K5703K7045J386k5047
16783g4971m1336k8007K559L5020J8999J2485J1080J5390N800L7340p584j7693
16771c0918K8428j0845j1655j3063N8829K4085O492m444o0813m8560m4657K7902
$$ plain form
16858 22262 12284 5286 53057 8817 -35995 -53715 -59366 -59406 -41027 -58223 8030 -6840 -54647
16845 -54647 -40099 2386 46671 44029 66735 43848 36028 -24333 -35256 -11597 -33614 -36791
16833 -36791 -12349 31201 38382 11548 -32243 -76211 -92108 -48625 -25512 -1847 819 -26399
16821 -26399 -33 -18052 -25258 -26840 -28084 -70741 -92632 -95939 -38768 -18554 -59150 2886
16809 2886 54899 64338 64597 58001 1967 -39741 -5647 61837 84097 76733 9181 7235 4909
16796 4909 39573 31592 8706 -7146 2222 -64108 -84442 -109419 -104058 -78355 -51310 -49924 -74971
16783 -74971 -116307 -144314 -141755 -106735 -87736 -75251 -64171 -48781 -42981 -5641 -13225 -30918
16771 -30918 -2490 -13335 -24990 -38053 20776 44861 51353 46909 -13904 -62464 -107121 -79219
16759g9219P1913M7812k1133J8039q081l1438n82L3860J091q999o9705n5048n966
16746a07456R552J6012M2886J1281J5413L6476p105n9562k4733M0359n770k0976
16734e3623L6751M8267p0074n4017L1253J9517N3327J17j3879j7939l2970K7282
16722b5988Q6651K340n5744L6840J884j3862N4183Q762n4600j3744j2575J181
16710A5328K5646j7977j6051Q314l1165l2240r070N788m555J4769j2222n602K812
16697e6225R197j5127j3999K5014J0821j7086J0351P230J6066r977o279j9291
16685e9305J8902M1169l6193j9093m2142P159k7620K2625N7646P1386K9189n2710
16673A1013L3987K1768j6715R820K630J0945p953j2317K7816P722r6045q3944
$$ plain form
16759 -79219 -7306 40506 19373 37412 29331 -2107 -2689 31171 32262 23263 -46442 -101490 -107456
16746 -107456 -97904 -81892 -39006 -27725 -12312 24164 17059 -42503 -67236 -26877 -32647 -53623
16734 -53623 -16872 31395 -38679 -92696 -61443 -41926 11401 11518 -2361 -20300 -53270 -25988
16722 -25988 60663 63003 7259 44099 45983 32121 86304 95066 40466 26722 14147 15328
16710 15328 40974 22997 6946 15260 -15905 -48145 -57215 -51427 -55982 -41213 -53435 -59037 -56225
16697 -56225 -47028 -62155 -76154 -51140 -40319 -57405 -47054 -39824 -23758 -33735 -40014 -59305
16685 -59305 -40403 766 -35427 -54520 -96662 -89503 -117123 -94498 -36852 34534 63723 11013
16673 11013 45000 66768 50053 59873 62503 73448 65495 53178 80994 88716 -7329 -91273
16661i1273j4246M1123P5770O4781o0548k7620K020l6542J4873m7n042K813L2281
16648a657k9414j4207n308j7700k309k96j170j1509N87l537K4031M5438K6785
16635I734l3878j069J7276Q406r8228P763J5023N990j1458J2951Q532M0828N8593
16622D0463n5265j2518j1154l145l414L1287L1434K210k0494l927L5279j5147
16610A5609n4619l204k2937L0782L7503K6013J7558l7602K5709n0414j2610K4034
16598d178L0683O906r027k5168l466j6204L5521L3674J3471r512N782R618q7596
16585a9496j1941K3890R848J105J3641j0543r359J2473o996N467j5512K670p829
16572a2582J3370j7148k5096J4731N8411O020k7088J9773n003n760k6249p609
$$ plain form
16661 -91273 -105519 -64396 11374 76155 15607 -12013 -9993 -46535 -31662 -31709 -36751 -33938 -1657
16648 -1657 -31071 -45278 -50586 -68286 -70595 -70891 -72061 -83570 -82983 -86520 -62489 -17051 9734
16635 9734 -24144 -25213 -7937 469 -97759 -89996 -74973 -68983 -80441 -67490 -58958 -18130 40463
16622 40463 -14802 -27320 -38474 -41619 -45033 -13746 17688 19898 -596 -4523 30756 15609
16610 15609 -39010 -42214 -65151 -34369 3134 29147 46705 9103 34812 -15602 -28212 -4178
16598 -4178 26505 33411 24384 -784 -4250 -20454 15067 48741 62212 52700 58482 68100 -19496
16585 -19496 -31437 -7547 2301 3406 17047 6504 -2855 9618 2622 8089 -7423 -4753 -12582
16572 -12582 788 -16360 -41456 -26725 31686 37706 10618 30391 25388 19628 -6621 -14230
16560a4230J5140j6796j1428J3515N7174K0072K4431j8602j8185j0982m8623j5420
16548b3934p47j9064J7417j5021J2197l0437L4504M3806j2806l0994l8750j4317
16536g8146j8360K1886k3257l5548K6360P3415N6038n117L9008J5266j06499k8835
16524f3789L146J2960K4946K4090K7190q650j8268k1728m837N5522K7208m1129
16512A6661o3437N6783O0629n5168j1316M9140j8486j1072p981l7566j7585J5894
16500b3504P7218L3355m8793l096k4715n0526k0924K2220K0866K1747O85j7248
16488a2715m3500o500L6955M5943k3127J1685L7070k1665j0064j9806j0141N5958
16476D0093J149l7619P068n416j1312o9205p214k5914k310O7249k5290m965J543
$$ plain form
16560 -14230 910 -15886 -27314 -13799 43375 63447 87878 69276 51091 40109 -8514 -23934
16548 -23934 -24681 -43745 -26328 -41349 -29152 -59589 -25085 18721 5915 -25079 -63829 -78146
16536 -78146 -96506 -74620 -97877 -133425 -107065 -33650 22388 17271 56279 71545 -34954 -63789
16524 -63789 -60643 -47683 -22737 1353 28543 19893 1625 -20103 -24940 30582 57790 16661
16512 16661 -46776 10007 70636 15468 4152 53292 34806 23734 15753 -21813 -39398 -23504
16500 -23504 53714 87069 38276 35180 10465 -40061 -60985 -38765 -17899 3848 4533 -12715
16488 -12715 -56215 -62715 -25760 20183 -2944 8741 45811 24146 14082 -5724 -15865 40093
16476 40093 41242 3623 10691 5275 -6037 -75242 -82456 -108370 -110680 -43431 -68721 -73686 -72143
16463g2143L5162K8763K417l2220k5405k3015M3149N7600K0505m5457k0009L458
16451b7195Q3641Q911q077K3448k5728J878l1104l7337J217P661K1199L688k0264
16438A938k0080O714K9381K388l2467J6306O147j7378J225k1191P28n400m2309
16425g3998L5555J2604K8681M1966L1872k2234k9162P866j2929J3634k1929m2824
16413c0898K3352J4716n2233k9005r269J1265K8105R1562P311M3686L8375m9471
16401H7496m4843l9481k1900Q0953j976j7423m9581p4045m891N6185M9582j7747
16389B329k0483J9783r794o699L7853l2221Q825J6054n4975l0550N173n4321j1115
16376a30141N7962N4738K5678R079j8052o3556p336M2482M8666J027J6243r06
$$ plain form
16463 -72143 -36981 -8218 -5801 -38021 -63426 -86441 -43292 14308 34813 -10644 -30653 -27195
16451 -27195 56446 65357 57280 80728 55000 56878 25774 -11563 -10346 -2685 18514 22202 1938
16438 1938 -18142 -11428 17953 20341 -12126 4180 10327 -7051 -5826 -27017 -26289 -31689 -73998
16425 -73998 -38443 -25839 2842 44808 76680 54446 25284 33150 20221 33855 11926 -30898
16413 -30898 -7546 7170 -45063 -74068 -83337 -72072 -43967 47595 54906 98592 136967 87496
16401 87496 42653 3172 -18728 62225 60249 42826 -6755 -80800 -85691 -29506 20076 2329
16389 2329 -18154 1629 -8165 -14864 22989 -9232 -407 15647 -39328 -69878 -64705 -119026 -130141
16376 -130141 -72179 -17441 8237 17316 -736 -64292 -71628 -29146 19520 20547 36790 35884
16364C5884n592L6199P745m8671o0881M1494K9256j5601r962j6616j075l6900
16352d4720l0377o426l0512M2062K186J83O8384j6230j8006K67K659L5699N521
16339A0690l0732J3231K2777l9093k6215j5975j2575K1839J2177L7345l397l3027
16327d2955L3040M7701O3621k0164p9597j143L7216n96k9953m4173K7089J2448
16315B534k8562l6714P536Q865m8199L5810r572k1610M5992M435l2642M1788j6961
16302d7300o659L5467m0138q583m500L0850L5188L8087l4562p5595m9744M562
16290a22927K7391L4733L3124N957P5376O0027l6616q7494n4544J0304j7694M4659
16278b7704j728K2876M26O127J1890m7617k733o648K4700Q4366J4183o374M862
$$ plain form
16364 35884 30292 66491 74236 25565 -35316 6178 35434 19833 9871 -6745 -7820 -44720
16352 -44720 -75097 -81523 -112035 -69973 -67787 -67604 780 -15450 -33456 -33189 -30530 5169 10690
16339 10690 -20042 -6811 15966 -23127 -49342 -65317 -77892 -56053 -43876 -6531 -9928 -42955
16327 -42955 -9915 37786 101407 81243 1646 503 37719 37123 7170 -37003 -9914 2534
16315 2534 -26028 -62742 -55206 -46341 -94540 -58730 -68302 -89912 -43920 -39485 -72127 -30339 -47300
16302 -47300 -53959 -18492 -58630 -67213 -71713 -40863 -5675 32412 -2150 -77745 -127489 -122927
16290 -122927 -95536 -60803 -27679 -21722 53654 113681 77065 -10429 -64973 -54669 -72363 -27704
16278 -27704 -29432 -6556 -6130 -3 11887 -35730 -38463 -45111 -20411 63955 78138 71764 76626
16265G6626l3086l9657l500O8121j5696m0653l0365M730M0577J119R737l0175
16253G778J1607N566n210k2786k5160l4798K180O519o4099l9274O4049O4705J6350
16240a2573j4727K742k950n4038j5544r838Q09r54J4894O259l6337L1604N0881
16227c9772N6390P637j2623J0121j1785K6651j1384l2815r926J8318J5581j5962
16215D31j8443k1207K7641j1792l8668P089l1062l7419K8001M3015O0105R761
16203A7452m1393K0352O1720N4342l0847l0001j10k3664k7526l7850l1058K5767
16191d2816P874K2255N660K5999j2776J7459q1426j2158M5965k8463L3654J589
16179a7184j9231L638J8987q869o7O5666J8708K6355J2866o9951n714K2059o648
$$ plain form
16265 76626 43540 3883 383 68504 52808 12155 -18210 -13480 27097 28216 37953 7778
16253 7778 19385 24951 19741 -3045 -28205 -63003 -60823 -54304 -118403 -157677 -93628 -28923 -12573
16240 -12573 -27300 -24558 -27508 -81546 -97090 -106928 -106119 -107073 -92179 -85920 -122257 -90653 -39772
16227 -39772 16618 24255 11632 21753 9968 36619 25235 -7580 -17506 812 16393 431
16215 431 -18012 -39219 -11578 -23370 -62038 -54949 -86011 -123430 -95429 -52414 7691 17452
16203 17452 -23941 -3589 58131 112473 81626 51625 51515 27851 325 -37525 -68583 -42816
16191 -42816 -34942 -12687 -7027 18972 6196 23655 -57771 -69929 -23964 -52427 -18773 -17184
16179 -17184 -36415 -32777 -13790 -22659 -22726 42940 61648 88003 100869 30918 25204 47263 40615
16166D0615k4456k3738K6149q104J9058o187M015o655L3093k3288n6389l4439
16154f0326k6327J6197q352m98O9782K0950N882k8914J1984K1871K2812n7981
16142a2920j04545k2253Q6220L7227L5053N937L5226j5550L657k6674j7731Q368
16130A2015L0712P32J1819m8571j206l0541l160J9137M2126j6696M229N8289K6118
16117A05003m3940J0773j1639o922n8591j10749K4050NP0596M9896n233l9584
16105a6335J6103N9526L1778l2414p1135l4294j0827P748K7010R7432l0501m9393
16093e302N666M793L372j075J8585K2920m8285l7199M7026p595j5359M1341L291
16080C2179j8459M687L4917k1934r4680m5615O0021K0794r649J968k4217K0659
$$ plain form
16166 40615 16159 -7579 18570 10466 29524 23337 27352 20697 53790 30502 -25887 -60326
16154 -60326 -86653 -70456 -78808 -79306 -9524 11426 17308 -11606 378 22249 45061 -12920
16142 -12920 -117465 -139718 -53498 -16271 18782 24719 59945 44395 48052 21378 3647 12015
16130 12015 42727 43459 55278 6707 5501 -25040 -28200 -9063 33063 16367 20596 78885 105003
16117 105003 61063 71836 60197 53275 -5316 -116065 -92015 -92010 -21414 28482 23249 -16335
16105 -16335 -232 59294 91072 58658 -12477 -46771 -57598 -49850 -22840 74592 44091 -5302
16093 -5302 364 5157 8529 7454 26039 48959 674 -36525 10501 2906 -12453 28888 32179
16080 32179 13720 18407 53324 31390 -63290 -108905 -48884 -28090 -37739 -35771 -59988 -39329
16068c9329J7081l3297N778o054j3743K8523N6847K0420k1555m3980J3684O6175
16056E0550l3971j4056j5935M0541K6595m3621p2468m7116J7783R8744o573j7244
16044a6771k2337K344J5219J5391j7772j2329k0305N213L5380J4968O268L5373
16032D0642j949m5773J4557P431J2468J03073L1868l8096j22145k5248M3923O0664
16020H1415J0834o5113m0577P039m221p450N456N79k58j2149L8223K9696n9234
16007a5760Q776q324q329n209K2180N0431j9903o321K7811l387j0630j4235J4753
15994C1853j4306l1892n9866q721l0971J9779K9635J6040L9447j7328j7956k5504
15982f9790L4675M3006M871l766J2770l30m8054m4372J8993M8963j3956n6037
$$ plain form
16068 -39329 -22248 -55545 -49767 -55821 -69564 -41041 15806 36226 14671 -29309 -15625 50550
16056 50550 16579 2523 -13412 27129 53724 10103 -62365 -109481 -91698 7046 473 -16771
16044 -16771 -39108 -36764 -21545 -6154 -23926 -36255 -56560 -51347 -15967 -999 5269 40642
16032 40642 38693 -7080 7477 14908 27376 130449 162317 124221 2076 -23172 20751 81415
16020 81415 92249 27136 -13441 -6402 -10623 -18073 -12617 -12038 -12296 -24445 13778 43474 -15760
16007 -15760 -6984 -15308 -23637 -28846 -6666 43765 23862 17541 45352 41965 31335 17100 31853
15994 31853 17547 -14345 -74211 -82932 -113903 -94124 -64489 -48449 -9002 -26330 -44286 -69790
15982 -69790 -35115 7891 12762 8996 21766 21436 -26618 -70990 -51997 -3034 -16990 -73027
15970g3027k0422o646L4715K7931L4410K8950j8349l4526k4403Q3825M3131j1953
15958F3636j7750k8471K4915j6266N713K936r854o0661o3170P643L261M4594K9518
15945a3956O7313Q911l2171k3073J6174j6976k8147k8308K2224N5820k1811K0753
15933B6753l431l5267j093k3462L283n295k702P0663K5189m6357l3638M5599J6618
15920C6860l67j5172k3194J2226j0852k943k0880l249j2871J1839J4102K550L7089
15907B5138K3007o334k6305L7227N430k6454J4885J56j2585R93J1896p0438K035
15894b1349K4837J5893l0319m1997k0140J0895L5379N4430J7700q261k6884K4753
15882C4937N85j8392n4435l6455L5264L8124K4016o2837k2908J0568K0010j6520
$$ plain form
15970 -73027 -93449 -100095 -65380 -37449 -3039 25911 7562 -26964 -51367 32458 75589 63636
15958 63636 45886 17415 42330 26064 31777 34713 24859 -35802 -98972 -91329 -88068 -43474 -13956
15945 -13956 53357 62268 30097 7024 23198 6222 -21925 -50233 -28009 27811 6000 26753
15933 26753 23322 -11945 -13038 -36500 -33217 -38512 -41214 29449 54638 8281 -25357 20242 36860
15920 36860 36493 21321 -1873 10353 -499 -3442 -24322 -27571 -40442 -28603 -14501 -11951 25138
15907 25138 48145 41811 15506 52733 58163 31709 46594 46750 34165 35158 47054 -23384 -21349
15894 -21349 3488 19381 -10938 -52935 -73075 -62180 -26801 27629 45329 37068 10184 34937
15882 34937 35522 17130 -37305 -73760 -38496 -372 23644 -39193 -62101 -51533 -31523 -48043
15870d8043l7196M0649M3776k1251J8528k4961n9020K4253k4741j7771L6287m873
15858g4363k3024N2047N8745j198m2974J2531K79l4807m169J9861J9313K5305
15846G546j4887j7031k9656P492N24j56N1078j7388l8365K2888o9133q1068J6003
15833a62153J6698L9781O9047j2817j4485j1786j2894j2214k5452l074K9742L3435
15821f6172N1607j8376L59P5034m643k1903P871j6899r892M58K4436J9083k999
15808C7964j4564m322k206J3786l3018k2634J1579N4816K1315K3246m1716l8838
15796E408m9160k9779P6010O3086m4237p7753L792M6165N1538K7652l7462j9038
15784A6222J9117K5093J0211N5047L8306K374o513j05842m0142P746O8016K8987
$$ plain form
15870 -48043 -85239 -44590 -814 -22065 -3537 -28498 -87518 -63265 -88006 -105777 -69490 -74363
15858 -74363 -97387 -45340 13405 12207 -30767 -18236 -17957 -52764 -56933 -37072 -17759 7546
15846 7546 -7341 -24372 -54028 -46536 -46012 -46168 4910 -12478 -50843 -27955 -97088 -178156 -162153
15833 -162153 -145455 -105674 -36627 -49444 -63929 -75715 -88609 -100823 -126275 -129349 -99607 -66172
15821 -66172 -14565 -32941 -32582 42452 37809 15906 23777 6878 -3014 -2556 21880 40963 37964
15808 37964 23400 19078 16872 30658 -2360 -24994 -13415 41401 62716 85962 44246 5408
15796 5408 -43752 -73531 2479 65565 21328 -56425 -52633 -6468 45070 72722 35260 16222
15784 16222 35339 60432 70643 125690 163996 166370 159857 54015 13873 21619 89635 118622
15772A18622k7144j2029M410k6310q932q347P281l8150L3521j2639j3426K0542
15760C7399K3635k874q7923k9521n189K4865l03K6040j5461N0539M598n2631k7121
15747e3947k343K8157J0398o378L4413J4508n0742m522L376R242Q853K490m1929
15734d8424j7609P3910J6144o889n6991K1088l8256l1147J4470J2643j5270j6262
15722i2593O4975Q8352M578J6285j3577j3508p797m3911m6196l5725M066P244
15710f7807K7310N418J9563J0284J0378n6209n2005N2118K8304n215q510K324
15698c4047K9534L761k8311J460J0488L7154J0994n538k8249m0308j5330l0428
15686h8820M4286Q4311n8867l3264J0038p4476j1738L3750K2895k7822L0461O5769
$$ plain form
15772 118622 91478 79449 83859 57549 48617 40270 47551 9401 42922 30283 16857 37399
15760 37399 61034 58160 -29763 -59284 -64473 -39608 -39911 -13871 -29332 21207 25805 -26826 -53947
15747 -53947 -56290 -28133 -17735 -24113 10300 24808 -25934 -30456 -27080 -17838 -8985 -6495 -48424
15734 -48424 -66033 7877 24021 17132 -39859 -18771 -57027 -88174 -73704 -61061 -76331 -92593
15722 -92593 -27618 60734 65312 81597 68020 54512 46715 2804 -43392 -79117 -75051 -67807
15710 -67807 -40497 -35079 -15516 -5232 5146 -51063 -103068 -50950 -22646 -27861 -36371 -34047
15698 -34047 -4513 -752 -29063 -27603 -17115 20039 31033 25495 -2754 -43062 -58392 -88820
15686 -88820 -44534 39777 -19090 -52354 -42316 -116792 -128530 -94780 -71885 -99707 -69246 -3477
15674c477J1852l862l127P356J6626k745J5014k8916j2158j6353k7208l8141K9622
15661e5517R0485N9772k6634l7111J3629k4304L7511p752m2068o2658J0605K2125
15649b1917J7236M5710j94J9189P485o3964k6315j8902M6049Q681n0450l3963
15637g1355j8097q010l0949M4477L8301j0469O1192L916l2966L5529M313o576
15625I306m649J8410j8760m6132Q930M419K7236L6838N3088K2628l7450q695J7206
15612H2375m6330O683K7323J3533l4069n0798j1726J3994K9477k0993m8261j5177
15600e3969L2151K3713k4947J5278n191L8406R457l6868p347Q744l6657l6734
15588g3964j3546O5828m2912n1331J4768O2071J9629R340m6647j3569J6905L4833
$$ plain form
15674 -3477 8375 4513 1386 8742 25368 22623 37637 8721 -3437 -19790 -46998 -85139 -55517
15661 -55517 34968 94740 68106 30995 44624 20320 57831 50079 8011 -54647 -44042 -21917
15649 -21917 -4681 41029 40835 60024 67509 3545 -22770 -41672 4377 13058 -37392 -71355
15637 -71355 -89452 -97462 -128411 -83934 -45633 -56102 5090 9006 -23960 11569 15882 9306
15625 9306 4657 23067 4307 -41825 -32895 -28476 -1240 35598 88686 111314 73864 65169 82375
15612 82375 36045 42728 70051 83584 49515 -1283 -13009 985 30462 9469 -38792 -53969
15600 -53969 -21818 1895 -23052 -7774 -12965 25441 34898 -1970 -9317 -573 -37230 -73964
15588 -73964 -87510 -21682 -64594 -115925 -101157 -39086 -19457 -10117 -56764 -70333 -53428 -18595
15576a8595j1620j4574R817N187m0599J8263N5859M605k598k399k603k5018j1895
15563c6170j6750l6102J8335K4526O925k9795m8086L495K8589q722M6062k2710
15551g0403k5613N0214J00978K3020m6319l367k5105J0640J1805k3671J4625K866
15539A9670o6337j9509L8049J1674J2151m932K1946o395r772L0129K4479j8675
15527C2478k4659r802o476N862K9350L3291K3034M291K6727K7747k3675K5029
15515A43197J3266k7811j7533r0553k6316o1600n556L4440N522L1557P0356J9022
15503H7991q5709p3238k2318K4581P2219K3286q144m4824p006n2877J3988O3665
15491h386M3512M879r903n5505n6328J4443j58J9396J8212L3771J6343J9000p5985
$$ plain form
15576 -18595 -30215 -44789 -34972 -29785 -70384 -52121 3738 8343 5745 3346 743 -24275 -36170
15563 -36170 -52920 -89022 -70687 -46161 -39236 -69031 -117117 -113622 -85033 -93755 -47693 -70403
15551 -70403 -96016 -45802 55176 78196 31877 28510 3405 14045 25850 2179 16804 19670
15539 19670 -46667 -66176 -28127 -16453 -4302 -9234 12712 6317 -3455 26674 51153 32478
15527 32478 7819 -1983 -8459 -2597 26753 60044 83078 87369 114096 141843 118168 143197
15515 143197 156463 128652 111119 20566 -5750 -67350 -72906 -38466 -32944 -1387 68969 87991
15503 87991 2282 -70956 -93274 -68693 3526 26812 18668 -26156 -33162 -86039 -72051 -8386
15491 -8386 35126 40005 30102 -25403 -81731 -67288 -67446 -48050 -29838 3933 20276 39276 -36709
15478c6709r1864N5261Q0226j133k1093L0354l1217K719K2242j8957k8217k4365
15466f2753M7665J4832J7200L9229J544N852J5457j0546K384j012n2719l1977
15454a4844n764j05229p2997l123L2873P507O9580K5162M232J7056M3724L971
15442B148k168j3008m4959K8785p627P75n912l0790K4863Q0628L9341l9047l4536
15429a507k6917n5860l1617l600M1476J3454L660L5345j6534M4828J6242j7477
15417A493N76K0859m170k4231K2927M2231K6645j2166J7134P418q6557q1977l7912
15404a07730J2610q128L2852L6833j0486j4259L0402J1989K552j5226k2433n291
15392e6315l726L7062K8577J0070l8918J9269L3541K1703Q124M093j7606p2137
$$ plain form
15478 -36709 -128573 -73312 6914 5781 -15312 15042 -16175 -13456 8786 -10171 -38388 -62753
15466 -62753 -15088 -256 16944 56173 57717 63569 79026 68480 70864 69852 17133 -14844
15454 -14844 -20608 -125837 -198834 -201957 -169084 -161577 -91997 -66835 -62603 -45547 -1823 2148
15442 2148 -20 -13028 -57987 -29202 -36829 -36054 -41966 -72756 -47893 32735 72076 33029 -1507
15429 -1507 -28424 -84284 -115901 -119501 -78025 -64571 -60911 -25566 -42100 2728 18970 1493
15417 1493 2069 22928 18758 -5473 17454 59685 86330 74164 91298 98716 12159 -69818 -107730
15404 -107730 -95120 -103248 -70396 -33563 -44049 -58308 -27906 -15917 -13365 -28591 -51024 -56315
15392 -56315 -60041 -22979 5598 15668 -23250 -3981 29560 51263 59387 63480 45874 -26263
15380b6263j03224q255L5984P0521j950l4926l0984j5137Q0056J3945k6030J9106
15368b7157K4094j3694J7534J7931L9074M4409j0815L0825k065m0671o6484K4494
15356C7475K0344K3562l9875n6237N7947K7046J3198M0804m5844r0045K8544N2667
15344F9586m2759L816m9215l4029K9524L491K291k9778l1770L1596J6668N5043
15332B4464J7250j7677j2674m2408k591M0235P571k9874k5355J0392M4671J1345
15320B5349L846k9205j2989M4442J3641m430m3502J7707j2388J44m6636L8160
15308e861K0755M1151o448j7805j8493M1713Q70l0503J3557K4633k2998p8032
15296c7461J3764N5381P386j2267n7876n264O610J9313M6405j7942J6753j4509
$$ plain form
15380 -26263 -129487 -137742 -101758 -31237 -33187 -68113 -99097 -114234 -34178 -20233 -46263 -27157
15368 -27157 -3063 -16757 777 18708 57782 102191 91376 122201 120136 79465 12981 37475
15356 37475 57819 81381 41506 -14731 43216 70262 83460 124264 78420 -11625 16919 69586
15344 69586 26827 30643 -18572 -52601 -23077 -19586 -17295 -47073 -78843 -47247 -30579 24464
15332 24464 41714 24037 11363 -31045 -33636 6599 14170 -15704 -41059 -30667 14004 25349
15320 25349 29195 -10 -12999 31443 45084 40654 -2848 14859 2471 2615 -44021 -5861
15308 -5861 14894 56045 49597 31792 13299 55012 55882 25379 38936 63569 40571 -37461
15296 -37461 -23697 31684 39070 26803 -31073 -36337 -29727 -10414 35991 18049 34802 20293
15284B0293j1169n666K1864J252M1046K8270p4844r6734o5411P7587M1690l2912
15272e4734k6331O380K4975M4338j5613M8650M9149J6634m5121P736J2687k7830
15260D0920l1306n229N2913L1001m392Q748j5202J8624l1116M61Q3665m730p3603
15247G0754r7776j43L6451K8462k1220l8823r703Q045O4140M1108j894j963k2269
15234E5169K4906n602K0047o9583l7994j4849j0497J1298J1257L1532j3333O4979
15222F7330N0569l1698l3548l2206J0846l4474P103M0778J6486P885m2101p4011
15210d7041K0993M2066l9525J9204O5563J5705n2583m7469j6320J1825L6943K8715
15198C8076L2729k2008k8628j9060Q362m06k4266N8487K865M395L124m6825j865
$$ plain form
15284 20293 9124 3458 25322 26574 67620 95890 21046 -75688 -141099 -63512 -21822 -54734
15272 -54734 -81065 -74685 -49710 -5372 -20985 27665 76814 93448 48327 56063 68750 40920
15260 40920 9614 4385 57298 88299 83907 92655 77453 96077 64961 65422 149087 144357 70754
15247 70754 -27022 -27165 9286 37748 16528 -22295 -31998 -23953 40187 81295 79401 77438 55169
15234 55169 80075 74473 94520 24937 -13057 -27906 -38403 -27105 -15848 15684 2351 67330
15222 67330 117899 86201 52653 20447 31293 -3181 3922 44700 61186 69071 26970 -47041
15210 -47041 -26048 16018 -23507 -4303 61260 76965 24382 -23087 -39407 -27582 9361 38076
15198 38076 70805 48797 20169 1109 9471 9065 -15201 43286 46151 50546 53670 6845 4980
15185D980j7377k1009J1420K1702K4516J9000J3985r484l6833p3039L3740N4282
15173B5883k5253K2734O074n3569M7773Q5388K8974k5425r6664j3022L6466K8717
15161F8076p4139m0836K0157L6668k1872k7340M1470M96M9687L1764k0414m6093
15149A7624r8957J9151K4353k7422N598L8153O18m4411q874K175O2137O0753O955
15136E7853m6080m9536k4788k3338P0203n3143N45M5440O3675k4895l281L3499
15124D6154k4490j5949K826L316O611K6353l5048L1966j2115m6061R299j8862
15112b6000K521N7272K2166k0251m3089l7179K4725P5539p60p1119l5725j5292
15100f7192M6757P816J8617L9303k9015r878K7619O0351K7498j0789j4381l3424
$$ plain form
15185 4980 -12397 -33406 -21986 -284 24232 43232 57217 47733 10900 -62139 -28399 25883
15173 25883 630 23364 29438 -24131 23642 109030 138004 112579 15915 2893 39359 68076
15161 68076 -6063 -46899 -26742 9926 -11946 -39286 2184 2680 52367 84131 63717 17624
15149 17624 -81333 -62182 -37829 -65251 -59653 -21500 -20882 -65293 -74167 -71992 -9855 50898 57853
15136 57853 11773 -37763 -62551 -85889 -15686 -68829 -68284 -22844 40831 15936 12655 46154
15124 46154 21664 5715 8541 11857 18468 44821 9773 41739 29624 -16437 -7138 -26000
15112 -26000 -23479 33793 55959 35708 -7381 -44560 -19835 55704 54944 -16175 -51900 -67192
15100 -67192 -20435 -12619 5998 45301 16286 6408 34027 94378 121876 111087 96706 63282
15088F3282n5894j2774k2313K4664K7453j3434L678n6248M8282Q0922l5981m3162
15076H475j2862o660P8828L999l5408m8127n9047K6683R952L9965K2592L1556
15064E9946L2447J3363J8354j8913p0879K4135K306m0292j1670r602K9579J339
15052C0113R135j6460q767N8256j4246n3555k0096j927k0556J593K3981J0223
15040b306l2036j3274N0262j9584M6481O7917k0382q8966l0141K4427J8304m0792
15028d0090k5253K8514j9419k7537L7024L2357M7719k8145p2518K2134m1951K1095
15016f6070L8415L5309L33P400l0409n8379K202N4758J4249k1220K3560O624K0309
15003B7081m5016L565R411j1950n2458K6110O9511p606k6612l0203n955J8768
$$ plain form
15088 63282 7388 -5386 -27699 -3035 24418 10984 14662 -41586 6696 87618 51637 8475
15076 8475 -4387 -11047 67781 71780 36372 -11755 -70802 -44119 -34167 5798 28390 59946
15064 59946 92393 105756 124110 105197 34318 58453 60759 20467 8797 -805 28774 30113
15052 30113 39248 22788 14021 72277 58031 4476 -15620 -17547 -38103 -36510 -12529 -2306
15040 -2306 -34342 -47616 2646 -16938 29543 97460 77078 -11888 -42029 -17602 702 -40090
15028 -40090 -65343 -36829 -56248 -83785 -46761 -14404 33315 5170 -67348 -45214 -87165 -66070
15016 -66070 -27655 7654 7987 15387 -15022 -73401 -71199 -16441 -2192 -23412 148 6772 27081
15003 27081 -17935 -14370 -4959 -16909 -69367 -43257 26254 18648 -7964 -38167 -44122 -25354
14991b5354L494K1190m672j24L1204O3938J3235j978l4169n7291J8274M5811k2293
14978E1265Q764k3272p530k0972J1331k313k1239j7507J784L1240J0051q629k253
14965A0720J8734k1724k7014k1238O3818j4012K6657M1241n0882l3891p519K4652
14953I542q417J2347L6602l2249l3125L1832J8884M2490l4567j6204m5008k3960
14941d1833O7188k370j5318j6909Q237K5086o3832k1872k758L7786K7967L7444
14929C8816K7863R07J7050j9441o1830m0448l7180Q955L4859M4974n235m5180
14917c5890o092K9799j0994j9848J9851l463J4063J0264L7087j9719l7470L286
14905a9126N3366M1012k1016j6565k4250J7383L9563l847m7392K3990J00695j1838
$$ plain form
14991 -25354 -21860 -670 -5342 -5466 25738 89676 102911 100933 66764 9473 27747 73558 51265
14978 51265 60029 36757 29227 8255 19586 17273 -3966 -21473 -19689 11551 21602 12973 10720
14965 10720 29454 7730 -19284 -40522 23296 9284 35941 77182 26300 -7591 -15110 9542
14953 9542 1125 13472 50074 17825 -15300 16532 35416 77906 43339 27135 -17873 -41833
14941 -41833 25355 22985 7667 -9242 -1005 24081 -39751 -61623 -64381 -26595 1372 38816
14929 38816 66679 67586 84636 65195 3365 -37083 -74263 -65308 -30449 14525 9290 -35890
14917 -35890 -41982 -12183 -23177 -43025 -23174 -26637 -12574 -2310 34777 15058 -22412 -19126
14905 -19126 34240 75252 54236 37671 13421 30804 70367 66520 19128 43118 143813 131975
14893A31975k7997J2046R889p2845m3598k1697q245M6932j0154j6536M385m5640
14881d1485M5698J3033N268Q5972J5014o8599j0360P4700K680k2052j6280k1589
14869F2000l0689M7863j8081k8446K127r071J5166K604k4162m2513M6543l2272
14857h931J0825K1392M0759J3334K6728N4966Q49j3707k4076l386o2655J1429
14845F7527J534O728N115k7487j4339L529j670k4017m5614n3291K2780Q2684J602
14832B5081r2019J6538M6632n2268J6588N126j4311j8765K9938P1783K1717l8474
14820A7566l6405J9087K3200j5612O7081O0122K795n4572o4016q393N018k0448
14808d577q806N806K3213M7063L0352k1041n4995j1297k1228J5232O865J7660
$$ plain form
14893 131975 103978 116024 125913 53068 9470 -12227 -20472 26460 16306 -230 4155 -41485
14881 -41485 4213 17246 22514 108486 123500 54901 44541 119241 121921 99869 83589 62000
14869 62000 31311 79174 61093 32647 34774 25703 40869 43473 19311 -23202 23341 -8931
14857 -8931 1894 23286 64045 77379 104107 159073 159922 146215 122139 118753 56098 67527
14845 67527 69061 75789 80904 53417 39078 42607 40937 16920 -28694 -81985 -59205 23479 25081
14832 25081 -66938 -50400 -3768 -56036 -39448 -34322 -48633 -67398 -37460 34323 56040 17566
14820 17566 -18839 248 23448 7836 74917 135039 137834 83262 19246 10853 15871 -4577
14808 -4577 -13383 -7577 15636 62699 93051 72010 17015 5718 -15510 -278 6587 24247
14796B4247N2288J7047j624j9043k4279N3584o5863q4838L0588M0618L3747K702
14784E9174k1623j5410K0770j0060j248N743j5072k4591p831J8761L6173L672
14772D8458n5137l1326L4358N8580k4764q739l8766k1930K0217K4558k2257o721
14760b3469k6382M6427P5650o9124k1698j5673l0858M428K6353L313K6795O2967
14748E8729j7224M159j7470p499j8360j7770n4588j1864N3139L4657r265j928
14736e284j8232j8997J4474J7694o076P800K5589K579j9100r048j5933k1610j3241
14723e9385L035k6593L0264P8478N2966m4489j7682k0515o387N514o552K0412
14711I066k2388m4562n548L2462J5809N054k4381k8142K154K7102r028N0059J3887
$$ plain form
14796 24247 76535 93582 91958 72915 48636 102220 36357 -48481 -17893 22725 56472 59174
14784 59174 37551 22141 42911 32851 31603 37346 22274 -2317 -10148 8613 44786 48458
14772 48458 -6679 -38005 -3647 54933 30169 21430 -17336 -39266 -19049 5509 -16748 -23469
14760 -23469 -49851 -3424 72226 3102 -18596 -34269 -65127 -60699 -34346 -31033 -4238 58729
14748 58729 41505 45664 28194 20695 2335 -15435 -70023 -81887 -28748 5909 -3356 -5284
14736 -5284 -23516 -42513 -28039 -10345 -16421 -8621 16968 19547 447 -8601 -24534 -46144 -59385
14723 -59385 -56350 -82943 -52679 25799 78765 34276 16594 -3921 -10308 -4794 -11346 9066
14711 9066 -13322 -57884 -63432 -30970 -15161 -10107 -34488 -62630 -60476 -33374 -42402 7657 21544
14698B1544J2089M4940M9908l6315l9981l6332K0871P7267j2278n3090j949L8310
14686H4984o741j0443m6128l1566O603K6419k0832o0283M452J4345N1254N5948
14674F8012K1542m2347J0645k6862K39N4327j1609N4510J6880K1745R44O2806
14662B30832J04283L2002O2660J58594K16112K50651M80337O01630O23789O90562
14652C451452O46841M40927K02075P203k34769l94036n08605n88754o51113n35810
14642A835411l59261l35304k62792j52541r4179j81982r1160m8727n8786M3782
14632B94461R095n505k2662p5083o0401j5412k494n7273l0339K2271n442m4823
14620F393o029O522j2368L954L800M1243M626n7791L9815O0290m3889m4833k3219
$$ plain form
14698 21544 33633 78573 128481 92166 52185 15853 36724 113991 101713 48623 46674 84984
14686 84984 78243 67800 21672 -9894 -3291 23128 2296 -57987 -53535 -39190 12064 68012
14674 68012 89554 47207 57852 30990 31229 85556 73947 128457 145337 167082 168026 230832
14662 230832 335115 367117 429777 588371 804483 1055134 1535471 2137101 2760890 3451452
14652 3451452 4098293 4539220 4741295 4748498 4513729 4119693 3611088 3022334 2371221 1835411
14642 1835411 1476150 1140846 878054 725513 631334 449352 358192 309465 250679 294461
14632 294461 303556 298051 275389 200306 139905 124493 121999 64726 34387 56658 51216 6393
14620 6393 364 6886 -5482 -1528 2272 43515 48141 -9650 30165 90455 46566 1733 -21486
14607b1486o735j2055j5555K2344j0068j6835M4162l0569j5001K3903o656p69
14595d5320L5489M5303l6960p069K4579p432j8737l3596J5795L4000L1247M0008
14583G7307j3893j8947Q207l5937j2467L7353k6791j3648N0272O7786L891L5031
14571A58164m5199K0620L8027k1355m1877p8376n6633K224j7698K9412J0911L1021
14559B9241j9288j515K5148m1968P205M5106K1031m871l1958M476K8565J2790
14547G3962k428m581m9819n8598k8955n6060K1371O0717L7780l9167j8638N8827
14535e589M2565K8969m9585j9812j1347l0971L5107j2898L7853J692n4547N479
14523c3084K6396K4061m0600l8457K5497K5494O477J2168J6709K7299k8546q0113
$$ plain form
14607 -21486 -28221 -40276 -55831 -33487 -43555 -60390 -16228 -46797 -61798 -37895 -44551 -45320
14595 -45320 -9831 35472 -1488 -8557 16022 8590 -10147 -43743 -27948 6052 37299 77307
14583 77307 63414 44467 52674 16737 4270 41623 14832 1184 51456 119242 123133 158164
14571 158164 112965 133585 171612 150257 108380 30004 -26629 -24405 -42103 -12691 -1780 29241
14559 29241 9953 8438 33586 -8382 -1177 43929 64960 60089 28131 32607 61172 73962
14547 73962 71534 66953 17134 -41464 -70419 -126479 -105108 -44391 -6611 -45778 -64416 -5589
14535 -5589 36976 65945 16360 -3452 -14799 -45770 -10663 -23561 14292 15984 -38563 -33084
14523 -33084 -6688 17373 -23227 -61684 -36187 -10693 -4216 7952 24661 51960 23414 -56699
14511e6699j0176K943K9804Q1344j7348n9457J7676n078L2911l9004l7939K225
14499e8798P59K979M2671p078o5493K3225R000N2404M4888M8600j1574m6589m331
14486C0663j0485l5668K1308L4080l3011J4038k8078j4735N558r161l0210j2050
14474f7751N3726K6827k3993l9474K784P114j0296R379k4049P991J6868M0776
14462i8M3763l4812l1879n606P919L0340O708k6289K1100M3270N639k3173J33
14449C7015P115l0789n896J2129j6130k147L1710m1062o6733p8182J14710J20468
14437H2208k9295l9544m3444l3146M0611J0870l294L1028P1443p386k8314o609
14425D5128m5199l6577K2940L568k5551L9225j7504k2041m307K4900J0278m0048
$$ plain form
14511 -56699 -66875 -63932 -34128 47216 29868 -29589 -11913 -16991 15920 -23084 -61023 -58798
14499 -58798 -58039 -55060 -12389 -19467 -84960 -61735 -52735 -331 44557 93157 81583 34994 30663
14486 30663 20178 -15490 5818 39898 6887 20925 -7153 -21888 -16330 -25491 -55701 -67751
14474 -67751 -14025 12802 -11191 -50665 -47881 -40767 -51063 -41684 -65733 -57742 -40874 -98
14462 -98 43665 8853 -23026 -28632 -20713 9627 16335 -9954 11146 54416 60055 36882 37015
14449 37015 44130 13341 7445 19574 3444 1297 33007 -8055 -74788 -152970 -38260 82208
14437 82208 52913 13369 -30075 -63221 -22610 -11740 -15034 15994 87437 80051 51737 45128
14425 45128 -71 -36648 -13708 -10140 -35691 3534 -13970 -36011 -40318 -15418 -5140 -45188
14413d5188n7386L1888K7504j5240m1883J332N0430K9917J7531J3896j8137K7438
14401B2102j7840J4656K2698K5413l9406k0358m5379j3674N7129N838k6622o0687
14389g6130o470K0274J8305l8381k9846L3069N0219Q1311l7800n9196r659k356
14377e6660J495N3491M9363k7634j6614m0781J3572Q4084j2411P946L2017O1006
14365A48874K1646k2851m8425l6485k0511n85j8376k9934q0044k5632j3847L6233
14353h9937M5910K6542M1167k596n8243J6711J2643j3470j6238N0703N4960k28
14341F7924K0886j8407m6875k9550q497j8152m7789M095L5521M7114l2095K4528
14329a297O3101l0801j7356R656q304k2594L712L4769P4769R941l9719K1459k2507
$$ plain form
14413 -45188 -102574 -70686 -43182 -58422 -100305 -98973 -48543 -18626 -1095 12801 -5336 22102
14401 22102 4262 18918 41616 67029 27623 7265 -38114 -51788 5341 11179 -15443 -76130
14389 -76130 -82600 -62326 -44021 -82402 -112248 -79179 -28960 52351 14551 -44645 -54304 -56660
14377 -56660 -55165 -1674 47689 20055 3441 -37340 -23768 60316 47905 55851 87868 148874
14365 148874 170520 147669 99244 62759 42248 41663 23287 -6647 -86691 -112323 -126170 -89937
14353 -89937 -44027 -17485 23682 21086 -37157 -20446 -7803 -21273 -37511 13192 68152 67924
14341 67924 88810 70403 23528 -6022 -14519 -32671 -80460 -76365 -40844 6270 -25825 -1297
14329 -1297 61804 31003 13647 23303 14999 -7595 -3883 30886 105655 115596 75877 97336 74829
14316G4829o1199n1438N625j4410J2908N5101L789N758l4930q47N1764k3573o2002
14303c8625n018p306m4320M3862O9563M6293k2176j8632j8825k0579L1308R006
14291B4551j19107m3278L5471M2919N5584N1434L0688p2484k0038P0139j3757
14280D2122k6501m2847n1251O668O4297J4294k7949J9653Q222j0320J1734J2897
14268B1019J8511k3835N476Q037p159k212J784J1621p0034l3646K8828K1731L4542
14255A4663L4372l372m2359j0863N0458K4103o7977o0067j5891l046J4041M307
14243f1631J5364O3649L0670j8340l3923j6488q32K2541K4062M8941O7268j501
14231A39780n1889q3828l82N5567j0755j4306O3887J7386j522J6790n3810p1207
$$ plain form
14316 74829 13630 -37808 -32183 -46593 -33685 21416 25205 30963 -3967 -4814 46950 23377 -38625
14303 -38625 -43643 -50949 -95269 -51407 18156 64449 42273 23641 4816 -15763 15545 24551
14291 24551 -94556 -137834 -102363 -59444 -3860 47574 78262 5778 -14260 55879 42122
14280 42122 15621 -27226 -78477 -71809 -7512 6782 -21167 -1514 6708 -3612 8122 21019
14268 21019 39530 15695 21171 29208 22049 19837 21621 33242 -36792 -70438 -41610 -19879 14663
14255 14663 49035 45663 3304 -7559 42899 67002 -975 -61042 -76933 -79979 -65938 -61631
14243 -61631 -46267 17382 48052 29712 -4211 -20699 -21531 1010 25072 74013 141281 139780
14231 139780 87891 4063 3681 59248 48493 34187 98074 115460 113938 130728 76918 5711
14219E711n4465J8769J9117O3937L2360j03808l8769l851M2378q819l2130O5974
14207F404k2284n7842j5316J9037N1823K885J0440K9565L4814L3390j0688m1151
14195D1077j8068l6323L011k3866j162K9524L9064k9198j288l0256l4176K3117
14183c8544O7839j0978j9366K6289J5216K1831R281L0463k4315j9117m247Q7350
14171A41702K5848o7002l3704q195l4477J774K7147l3211k6701P972l313L8756
14159C6596k8079J781N4939L8908m4422n2156l6519m3076N064K2680l6348J5807
14147f4825N805N6083L572j6204K2920K6483j12k5268m3589o336L337L1110K2552
14134A5528l5363o1802K5076P5632J5032L2065J8429n3152m459L1855o2481M9685
$$ plain form
14219 5711 -48754 -29985 -10868 53069 85429 -18379 -57148 -60999 -18621 -27440 -59570 6404
14207 6404 -15880 -73722 -89038 -70001 -18178 -15293 -4853 24712 59526 92916 82228 41077
14195 41077 23009 -13314 -10303 -34169 -35331 -5807 33257 4059 2771 -27485 -61661 -38544
14183 -38544 29295 18317 -1049 25240 40456 62287 71568 102031 77716 58599 54352 141702
14171 141702 167550 100548 66844 58649 24172 25946 53093 19882 -6819 1153 -2160 36596
14159 36596 8517 10298 65237 104145 59723 7567 -28952 -72028 -66964 -44284 -80632 -64825
14147 -64825 -59020 -2937 635 -15569 7351 33834 33722 8454 -35135 -41471 -38134 -7024 15528
14134 15528 -19835 -81637 -56561 19071 34103 66168 84597 31445 26986 58841 -3640 46045
14122D6045O3535k5611l7264k8650J155L5493P2495R983o8590m4029j1926P1926
14110H4562L1731k9146N6019M234p8565l7166J1830K8706L7967o5643l4553j9451
14098i475j7199o018J8404N969K0376L0528n423m4335L9090k7334k1948J2458
14086d907L231Q738O588j4059O8207K3116r3131m7069L4060N3097J7362l4487
14074B0746m8849l576K9945K3616J5555l7385J994l1052l4856JM2127M4109J9415
14061D1790j9644k9144k7071k9906K3741J7541k5319m9001J2711R3034R90n6189
14049d6467k5709O5580j574k5845M2441J4778n2492m6080K5187J7231k7426n364
14037f5740N5977p933l5339r555M0098N6543m797K2599R912j4229M892o5339M276
$$ plain form
14122 46045 109580 83969 46705 18055 19210 54703 127198 137181 68591 24562 12636 84562
14110 84562 116293 87147 143166 147400 68835 31669 43499 72205 110172 44529 9976 -9475
14098 -9475 -26674 -32692 -14288 -8319 12057 42585 37162 -7173 31917 4583 -17365 -4907
14086 -4907 -1676 7062 13650 -409 67798 90914 -2217 -49286 -15226 37871 55233 20746
14074 20746 -28103 -31679 -1734 21882 37437 52 2046 -29006 -63862 -63861 -21734 22375 41790
14061 41790 22146 -6998 -34069 -63975 -40234 -22693 -48012 -97013 -84302 8732 9722 -46467
14049 -46467 -72176 -6596 -8170 -34015 8426 23204 -29288 -75368 -50181 -32950 -60376 -65740
14037 -65740 -9763 -17696 -53035 -62590 -22492 34051 29254 51853 61765 47536 52428 -12911 -8635
14024h635P084j3698M524l9660K0428K6940n34n2329m2222O3960O9190M06L625
14011C9079K2246K6350j426L3839J2418n3289n0547k7499k7342j113L7484J7083
13999B7283j4340m2042O294J0337K8777p992q055k143m0133J3049K4828N112k3305
13986b2330q949Q135N7004l760o3491L3314j731R44j3066o5593k6354N7704L8278
13973i895R806k8709j2569j2472O47m257J3147M6750j7131O095O631l5901m370
13960d2228J7759k8339L780k2921j5028M8384K9265J2465j0316j9818J0658J3632
13948b707m739n03P085k5919o4761l8259N5297L4878j7720M3576J9522K2963j4227
13935A4486m5598M1213j6746k9638j2829k2356m539L8222J9222K0332L890k980
$$ plain form
14024 -8635 -1551 -15249 -10725 -50385 -29957 -3017 -3551 -55880 -98102 -34142 35048 35454 39079
14011 39079 61325 87675 86249 120088 132506 79217 28670 1171 -26171 -27284 10200 27283
13999 27283 12943 -29099 -22805 -12468 16309 8317 262 -1881 -42014 -28965 -4137 975 -22330
13986 -22330 -31279 -23144 33860 30100 -33391 -77 -1808 -864 -13930 -79523 -105877 -48173 -9895
13973 -9895 -89 -28798 -41367 -53839 -53192 -57449 -44302 2448 -14683 -8588 -1957 -37858 -42228
13960 -42228 -24469 -52808 -49028 -71949 -86977 -38593 -9328 3137 -7179 -26997 -16339 -2707
13948 -2707 -7446 -7949 -864 -26783 -91544 -129803 -74506 -39628 -57348 -13772 5750 28713 14486
13935 14486 -31112 10101 -6645 -36283 -49112 -71468 -76007 -37785 -18563 1769 5659 2679
13923B679j6067j7021l855j3917K5771P595l225O031p730O984L3093L0988j7826
13910C3500J3321j407J2470P209L0755j7095n2520p1113j214J1841o35K3127P3898
13897F2137R267l310k9300p043n4858L1104N0126j7498k7713j552o6997j7173
13885g2810J2569k7308l5347L4475J8344J0826K3112P014K0278J7855N168p47
13873A3429L5559K3470J5535Q756m7252l1594M4344J363j8588K9999k9001P1506
13861A17526O1817k1012o818K8068l7188n2781l9380l2985l0542K3938O125l338
13849A3430n8162j6088J7213K2915M3288m926j944P62j4954K0551p047N862l0334
13836i434K2837M0212o4293q2542K8713L5290M690l1664R756L1471L6225l1732
$$ plain form
13923 2679 -13388 -30409 -34264 -48181 -22410 -14815 -18040 -12009 -19739 -12755 20338 51326 33500
13910 33500 46821 45414 57884 65093 95848 78753 26233 -44880 -46094 -34253 -34888 -11761 62137
13897 62137 71404 68094 38794 31751 -23107 7997 58123 40625 12912 11360 -55637 -72810
13885 -72810 -60241 -87549 -122896 -88421 -70077 -59251 -36139 -29125 -8847 9008 14176 13429
13873 13429 48988 72458 87993 96749 49497 17903 62247 63610 45022 75021 46020 117526
13861 117526 179343 158331 151513 179581 142393 89612 50232 17247 -13295 10643 16768 13430
13849 13430 -44732 -60820 -43607 -20692 22596 17670 15726 16488 1534 22085 15038 20900 -9434
13836 -9434 13403 53615 -10678 -93220 -64507 -29217 -24527 -56191 -46435 -14964 21261 -10471
13824a0471m915k4637O201K2848K5361K2007K3463J452K0049J3223J9156m6961
13812F6776n6338p543K6480N5348M085Q036k8318J088K8387J9175l7063m0435
13800C9678M908l9608n1178j653K7200L3881M574q288k8579J0342J8439l4824
13788b5108J070K3121L8393M6619L5135J3188l8975o7278J9154j0385m3720m4323
13776e3109J8062J0827l1186L1752L3633M5228j9805j6138o4647k3549m1065n4347
13764a64344k1511Q3724J17940N8001J299l9801O0579m0229o0110l2766K6812
13753a0406K102K5282r317m1395k1084L5892L4396K4606m5113k7205l0859k0017
13741h3118L2754Q217J900L7313J16792p7136P483K4716j6272n3178j3162M3062
$$ plain form
13824 -10471 -15386 -40023 -33822 -10974 14387 36394 59857 61309 81358 94581 113737 66776
13812 66776 10438 2895 29375 84723 88808 96844 68526 69614 98001 117176 80113 39678
13800 39678 44586 4978 -46200 -47853 -20653 13228 17802 9514 -19065 -8723 9716 -25108
13788 -25108 -24038 -917 37476 84095 119230 132418 93443 26165 45319 34934 -8786 -53109
13776 -53109 -35047 -24220 -55406 -23654 9979 55207 35402 19264 -45383 -68932 -109997 -164344
13764 -164344 -185855 -102131 15809 73810 75109 35308 95887 55658 -4452 -37218 -10406
13753 -10406 -8304 16978 7661 -33734 -54818 -18926 15470 40076 -5037 -32242 -63101 -83118
13741 -83118 -50364 -42147 -40247 -2934 113858 36722 44205 68921 52649 -529 -13691 29371
13729B9371P4057j8402l9576L085J4931m7756n2331J5354L7451M1269M8920k2921
13717H3452J4778k1203n0117m2270m2724O1767L4958K6216m2011K5171Q307n5076
13705A248l6168O017l4679K8568r667n8723J5259O7496L1118L1028J491j0134
13693C2854p809J7936l6814k0407k5689n3860J7914M7805K8130q27P1696K8557
13681I9486k5690j7387K0735J3194L4392Q4279Q5206O0249M2251K1643n6264j44519
13669B17575j02742j2301j1944j1306M0223L5885M4061K5895m8440J7441Q3195
13658B77542K4988k1261m0086r2667K789L3574k180K0925P9228M6435L9202P2387
13646D40876L089j4177m1962j6770o4998l6690n1316K7483m1340L9788R9441K8050
$$ plain form
13729 29371 103428 85026 45450 48535 63466 15710 -36621 -21267 16184 57453 106373 83452
13717 83452 98230 77027 26910 -15360 -58084 3683 38641 64857 22846 48017 56324 1248
13705 1248 -34920 -28903 -63582 -35014 -44681 -103404 -88145 -20649 10469 41497 42988 32854
13693 32854 25045 42981 6167 -14240 -39929 -93789 -75875 -28070 60 -767 70929 99486
13681 99486 73796 56409 77144 90338 124730 209009 294215 354464 396715 418358 362094 217575
13669 217575 114833 102532 90588 79282 119505 155390 199451 225346 176906 194347 277542
13658 277542 302530 281269 241183 148516 151305 184879 182699 203624 282852 329287 368489 440876
13646 440876 443965 429788 387826 371056 306058 269368 218052 245535 204195 243983 343424 371474
13634C71474j8450n1926l3610Q090M467j814l9170k0931O131L9620o736k2771
13622B34374j2422m8171Q997Q9640P32j3191O6477L5637N6865N2470j5644o1456
13610C94308j09976q9988k0590l9135l6713m5079j7302n216J595L4750N1456P3796
13598A91906M3258l3068n2884o1801J3540l0641p560Q446J1457j2835Q266l0726
13586D7358k2033K159n8750Q609P7145L8361n6872j8122j9804L0443K7976k5652
13574C0818j4289l8897N681J1804k3639K1440L1121k5051p305o2795l827N2476
13562b2463j8004k6665L5947L0427M3469M995j5757l533k7849l9896J4104L5212
13550I987K7341K6040o281k8491m9488j5279J7184j0559K878O753J0010l4472
$$ plain form
13634 371474 353024 301098 267488 275578 280045 278231 239061 218130 224261 263881 257145 234374
13622 234374 221952 173781 182778 272418 273150 259959 326436 362073 418938 471408 455764 394308
13610 394308 284332 194344 173754 134619 97906 52827 35525 30309 31904 66654 118110 191906
13598 191906 235164 202096 149212 87411 100951 70310 62750 71196 82653 69818 78084 47358
13586 47358 25325 27484 -31266 -22657 54488 92849 35977 17855 -1949 28494 56470 30818
13574 30818 16529 -22368 -16687 -4883 -28522 -7082 24039 -1012 -8317 -71112 -74939 -22463
13562 -22463 -40467 -67132 -31185 -758 42711 47706 31949 28416 567 -39329 -25225 9987
13550 9987 37328 63368 57087 28596 -20892 -36171 -18987 -29546 -26668 -19915 -9905 -44377
13538d4377k8105K6951M0139j2042r39J451M2014K1201j2827O4208N4875o7478
13526H5071p597r1585q3897J6053M4353K7670o7829l4098M4730L4431N118L176
13514b4404q257L767m957k6663L3888O9952L6963m3479k4920k749J3080K2029
13502D4250L835L9502Q821l5520K1773r86L2954j2066k5459o8525l0489N4096
13490C2186J3752j9993k5011L6615N4748M402n2352J3708O5780Q2165R3722K26484
13478E26206L29223M45526L09817k42967m93928l40603j22392j05458j11509q7800
13468A06115o3581k3799O2406L6367n901K9837J6748k1018p9091k3922K3035j8000
13456C9196L6066l1082l5740R923l3239j4092K323L2315j8528j899K546k3400
$$ plain form
13538 -44377 -72482 -45531 -5392 -17434 -18373 -16922 25092 46293 33466 97674 152549 85071
13526 85071 77474 -14111 -98008 -81955 -37602 -9932 -77761 -111859 -67129 -32698 -27580 -24404
13514 -24404 -32661 -28894 -33851 -60514 -26626 43326 80289 36810 11890 9141 22221 44250
13502 44250 48085 87587 96408 60888 82661 81675 114629 102563 77104 8579 -21910 32186
13490 32186 45938 25945 934 37549 92297 96699 44347 58055 123835 206000 299722 526206
13478 526206 855429 1300955 1610772 1367805 873877 533274 410882 305424 193915 106115
13468 106115 42534 18735 81141 117508 111607 141444 158192 137174 58083 34161 57196 39196
13456 39196 75262 44180 8440 18363 -14876 -28968 -26645 5670 -12858 -14757 -12211 -35611
13444c5611J5624m8316J4112j4968M0675J3234l2983K306M133l202K1903K0400
13432b693N095j1700o290L8428j1410K652j8542m736Q385K930N836l0590m8045
13419g0680J0239K7737K3735j3393L0208O010L366K2871l7362n8393j8393O544
13407f7511J2123j0461N9118K5359J3806o8128o740O109K4718j8764m5227L7715
13395c7883M7354L3781K054K2538R6084K5587m6784k556p498M5896L0678p5252
13383A33999m1863K6784l8980p8253Q142M2416L14P3351r928j0313j9616j3162
13371G2891K1252r335L2448K4086K619q378R44K4314K0629K514k7073n085L9099
13358A90925n672N235M9121M581k6142o9617n8696l3325P787M7658O8130L3453
$$ plain form
13444 -35611 -19987 -68303 -54191 -69159 -28484 -15250 -48233 -45927 -41794 -44996 -23093 -2693
13432 -2693 2402 -9298 -15588 22840 11430 14082 -4460 -9196 -811 2119 7955 -22635 -70680
13419 -70680 -60441 -32704 -8969 -22362 7846 13856 17222 40093 2731 -55662 -74055 -67511
13407 -67511 -55388 -65849 -6731 18628 32434 -35694 -42434 -36325 -11607 -30371 -75598 -37883
13395 -37883 9471 43252 45306 67844 163928 189515 142731 140175 132677 178573 209251 133999
13383 133999 92136 118920 79940 1687 9829 52245 52559 125910 115982 105669 86053 72891
13371 72891 94143 84808 117256 141342 143961 135583 136527 160841 181470 183984 156911 151826 190925
13358 190925 185253 190488 239609 244190 218048 148431 89735 56410 64197 111855 179985 213438
13346B13438r4118o5261J6587K4647K3593j5039p420j3267k0449L6198l8719r2260
13334c2070J7639M6650L027k7500J0434J02430L2400P58J4432L0867J4666m4126
13322A69607P535n5244m6502P657j2373o096m0935R432k4902j0435k3832K2216
13310c872R2419K5732o5157p5802J7561P0816O3973k0220p5353K6059J8341l4856
13298C9641q977j8372L0547J9636J2874K3647j268j2030m247o397N056L4205L7872
13285A52187k5768K2478j5016l8558J4777J08541J41154R9166M3110K8400m3301
13274D87170j20099q7151n9518o3607l4603j9401k154N8185Q1679Q430k5031o0209
13262A63691p1460K1885R0556O5579L3789N9457L9565K4348p2480j04841k4642
$$ plain form
13346 213438 119320 54059 70646 95293 118886 103847 96427 83160 62711 98909 60190 -32070
13334 -32070 -14431 32219 35246 7746 18180 120610 153010 153768 168200 199067 213733 169607
13322 169607 177142 121898 75396 83053 70680 64584 23649 33081 8179 -2256 -26088 -3872
13310 -3872 88547 114279 49122 -26680 -9119 61697 125670 105450 30097 56156 74497 39641
13298 39641 30664 12292 42839 62475 75349 98996 97728 85698 81451 75054 80110 114315 152187
13285 152187 126419 148897 133881 95323 110100 218641 359795 458961 502071 530471 487170
13274 487170 367071 279920 220402 156795 122192 102791 100637 158822 240501 248931 223900 163691
13262 163691 92231 114116 204672 270251 304040 363497 403062 427410 354930 250089 225447
13251B25447M2278P7675L0729N7652K1244J6114j3933m2803k2133m9322m477p3029
13239B65442p9345n920l3466K2113J4517L9551l595l3641J4472k9940j0209M2708
13227B02687P6991r337m7111P2122L8342k3425J2111K1270M181K3233k232l1921
13215C36911m3333r0927k6435j5449l5624N2156L8144o649r455m0705Q355M4156
13203B11145l0110l9303j0219M6415K1536p248p500O681j3796N028Q32m4357p0397
13190F8707j2412O1294N466m6734j5731j5314J427j0613M1329K2683Q7727M5086
13178B32915o5308o158M6247J5377m0473L6324J5130m5011l5361m3587j043m9531
13166E9521M3224N5064O6152m9601n0065J988j7113l7819n6341J5861L397q365
$$ plain form
13251 225447 267725 345400 376129 433781 455025 471139 457206 414403 392270 342948 338471 265442
13239 265442 186097 180177 146711 168824 183341 222892 219297 185656 200128 170188 159979 202687
13227 202687 279678 270341 223230 295352 333694 310269 322380 343650 347831 371064 368832 336911
13215 336911 293578 202651 176216 160767 125143 177299 215443 208794 199339 158634 166989 211145
13203 211145 181035 141732 131513 177928 199464 192216 184716 191397 177601 182629 183461 139104 68707
13190 68707 56295 117589 123055 76321 60590 45276 46703 36090 77419 100102 187829 232915
13178 232915 167607 161449 207696 223073 182600 218924 234054 189043 153682 110095 109052 59521
13166 59521 102745 157809 223961 174360 124295 126283 109170 71351 15010 30871 34268 25903
13154B5903K5983m018l7256K2332M5479M219L5071j6287J3580M3840L6273L7952
13142B33071n535l082n9013q1880p3040M517M3257K186l2785O8693L0152q668
13130A17873k7046j277j116l1050j4270N721k515P039L0531n919n0894K8033L8687
13117I3797P963m2100m987j7453k5742k5630L1950Q0935j3828n012o6639O7205
13105H0459N2935k7178o1557M953N6434L3725l5232K3030m916l9129k4729m2985
13093A5810k0173j7519P937K6985L9356k7164J4747P6476J2167j0860o5054o3820
13081a1112l2433l670N5672Q4221o649l3657m072L8820l1302l9792k6553k2183
13069c2710J0319L7507L5805k3469O680j145J1172l0107q205L5627k92l6621L36
$$ plain form
13154 25903 51886 47868 10612 32944 78423 82642 117713 101426 115006 158846 195119 233071
13142 233071 227536 224454 165441 83561 10521 15038 58295 60481 27696 96389 126541 117873
13130 117873 90827 89550 88434 57384 43114 48835 46320 53359 83890 77971 27077 55110 93797
13117 93797 101760 59660 54673 37220 11478 -14152 17798 98733 84905 79893 13254 80459
13105 80459 133394 106216 44659 49612 106046 139771 104539 127569 122653 83524 58795 15810
13093 15810 -4363 -21882 -13945 13040 52396 25232 39979 116455 128622 117762 52708 -11112
13081 -11112 -43545 -47215 8457 92678 86029 52372 48300 87120 55818 16026 -10527 -32710
13069 -32710 -22391 15116 50921 27452 34132 32987 44159 14052 5847 41474 41182 4561 4897
13056D897o4825j195J15889P6329n6144m805L668k7464l8319j9926O8409J7147
13044G3661j677l6274J1398j7481M865K0748j9429m6184N342J5141j0835j342
13032b067M8058n1461j1292K4871M9859J7482n9154k9479j0028j3433K5065J8688
13020G109J3036j3961j2771m8173K4009J2138l3199K5598j1714o5177j0206N636
13008a07675N3714M4284J0971j7103L1747N197P513m135M063n962M173q463j6173
12995B151K8716M6917K4168m8129j3211k4167L6307K2126K131K5663q233l0815
12983F3624p6116m5626O1940M8473O826K5576j4668j7283l9973j3957N689J4923
12971A9428J9791Q513k2571k3217m423l434m5171M184L2002J1250o861P583M5381
$$ plain form
13056 4897 -59928 -61123 54766 131095 74951 70146 73814 46350 8031 -11895 56514 73661
13044 73661 71984 35710 47108 29627 34492 55240 35811 -10373 -5031 10110 -725 -2067
13032 -2067 45991 -5470 -16762 8109 57968 75450 16296 -13183 -23211 -36644 -11579 7109
13020 7109 20145 6184 -6587 -54760 -30751 -18613 -51812 -26214 -37928 -103105 -113311 -107675
13008 -107675 -53961 -9677 1294 -15809 15938 21135 28648 24513 28576 22614 26787 18324 2151
12995 2151 30867 77784 101952 53823 40612 16445 52752 74878 77009 102672 94439 63624
12983 63624 -12492 -58118 3822 52295 59121 84697 70029 52746 12773 -1184 4505 19428
12971 19428 39219 47732 25161 1944 -2479 -5913 -51084 -46900 -14898 -3648 -10509 -2926 42455
12958D2455j6005k4396M954P753l3252k9083K434Q837j019q64K1751k5131p289
12945d8855K5024l7100o1361N4179L9473j8672L1463K7099k5843l4647r51L3950
12933a6241K4173k5407l2716p026M0111N0394p064k9294J503J7643K0587k9242
12921G421m5254K2591N0175m449K6431l2408l9935j6755K1811J9450j043P20l0508
12908b1753j5757n220M3100O9359N1124o99q6985n3855K1988M8555j3984N377
12896D1250j6218J2077N148j7113N6097R873q0869j1408K5121N323n3747l1192
12884e5658n3930L8268P4448J7314l8114n0305m602K2842K3757R655O064p31m25
12871a1417M4527J6213J4185N5930j6087n9965j6831M439J2070m4560k5296N134
$$ plain form
12958 42455 26450 2054 7008 14761 -18491 -47574 -45140 -36303 -37322 -38186 -16435 -41566 -48855
12945 -48855 -23831 -60931 -122292 -68113 -28640 -47312 -15849 11250 -14593 -49240 -50191 -16241
12933 -16241 7932 -17475 -50191 -57217 -17106 33288 26224 -3070 -1567 16076 36663 7421
12921 7421 -37833 -15242 34933 30484 56915 24507 -15428 -32183 -10372 9078 8035 8755 -21753
12908 -21753 -37510 -42730 370 69729 120853 120154 33169 -20686 1302 49857 35873 41250
12896 41250 25032 37109 42257 25144 81241 91114 10245 -1163 23958 29281 -24466 -55658
12884 -55658 -109588 -71320 3128 20442 -17672 -67977 -72579 -49737 -25980 -16325 -10261 -10992 -11417
12871 -11417 33110 49323 63508 119438 103351 43386 26555 30994 43064 -1496 -26792 -21658
12859b1658N9009O4576j6022K392J5515K7245j5367l9770k7272K8944L1246L078
12847A11916P938J3567m5647j5831L410l013j2963p1981j9398j913l4418N5080
12835a3253N6562m227n6400l4632J4326N749J5214O34k2386J4884N4286P744P4876
12822A13377m877n7279l9236l400j8794K75J8401m010N682O7991m383l1907k6035
12809A5805k2191K8689O6281K5464k5308L2121k4310q5152k4244N0188L1489J0345
12797G9177N198K2730K1961K9646O057j8888l8850k0240J2642L9303n0629p7652
12785A0455J4943P8715O1916J0551m313O4683K1431o1342m3413L190k3409o470
12773A26937M9381j0897K1999k8538K5029O9847k572q2718n4166M9836O806l6960
$$ plain form
12859 -21658 37351 101927 85905 88297 103812 131057 115690 75920 48648 77592 108838 111916
12847 111916 119854 133421 87774 71943 75353 72340 59377 -12604 -32002 -33915 -68333 -13253
12835 -13253 43309 39082 -17318 -51950 -37624 -31875 -16661 -16027 -38413 -23529 30757 38501 113377
12822 113377 108500 51221 11985 8585 -10209 -9934 8467 4457 10139 78130 73747 41840 15805
12809 15805 -6386 22303 88584 114048 88740 120861 96551 11399 -12845 37343 68832 79177
12797 79177 84375 107105 129066 158712 164769 145881 107031 86791 99433 138736 88107 10455
12785 10455 25398 104113 166029 176580 172267 236950 258381 197039 153626 156816 133407 126937
12773 126937 176318 165421 187420 158882 183911 253758 251186 168468 114302 164138 170944 133984
12761A33984M574n1026n0927J6298j4955l4773m0944M5400M4502j0801K4250L5337
12749A00919K0978m3240k8229J6490K7515k8627n4085R767M4900L4793J6620M3792
12737A61593L8344l644l4031O696J799K2876j4007r6110n333J6509L81j0020l4800
12724E0253j6621l1834J0305j6904l1699O2690M3781l8108K545k1064k4415l7607
12712d8678J9070K7660L5487N3030q708R463O7297k0997n5805n2115L6803O296
12700F8803k0725p5489K0411k8571j0467M7252N6940q379j3392j8196L8907J0448
12688F7542l6376k4849O1164l6549o3676J0339K4718K1539j3965l7905J4096P0522
12676E6600m6355m2801J4558K8251j8259n6414p157L8302L5959k2877L9276M8260
$$ plain form
12761 133984 138558 87532 36605 52903 37948 3175 -37769 7631 52133 41332 65582 100919
12749 100919 121897 78657 50428 66918 94433 65806 11721 21488 66388 101181 117801 161593
12737 161593 199937 196293 162262 168958 170757 193633 179626 83516 78183 94692 95073 85053 50253
12724 50253 33632 1798 12103 -4801 -36500 26190 69971 31863 34408 13344 -11071 -48678
12712 -48678 -29608 -1948 33539 86569 77861 87324 154621 133624 77819 25704 62507 68803
12700 68803 48078 -27411 -7000 -35571 -46038 1214 58154 49775 36383 18187 57094 67542
12688 67542 31166 6317 67481 30932 -32744 -22405 2313 23852 9887 -28018 -13922 56600
12676 56600 10245 -32556 -17998 10253 -8006 -64420 -71577 -33275 2684 -20193 19083 67343
12664F7343k030j4066m4509J3421K121K3185M5704K6180j7894l9167n0362r45
12652H981j3974K2591N9948L555K692k9091p446n6142m9450K6171J8695P949J1166
12639E645j7367L5073J06310R7911N2177l4286q3973n8766o3444n410m4772o3237
12627g4139K9293o151j8615L933p234O241M2785O3043L6240l2666o4417k6093
12615d7780R3923P642m3218k8955L8286L4462o31J7768K1566M633K4969Q2706
12603B05371J3229j2113l4119k2593k50O3388K6094p1538l7539K2204J4397j7790
12591A48741P64j7301q9716k5600J9157M6284o1634L027j3924q3261L7384O6121
12579C0042L3481J8592L1523O4367O2994m6769j06155m3961L5045L2966m0118
$$ plain form
12664 67343 65313 51247 6738 20159 22280 45465 91169 117349 99455 60288 9926 8981
12652 8981 -4993 17598 77546 81101 83793 54702 47256 -8886 -58336 -32165 -13470 -5521 5645
12639 5645 -11722 23351 129661 227572 279749 245463 161490 102724 39280 33870 -10902 -74139
12627 -74139 -44846 -50997 -69612 -65679 -72913 -66672 -23887 39156 75396 42730 -21687 -47780
12615 -47780 46143 53785 10567 -18388 19898 54360 53729 71497 93063 97696 122665 205371
12603 205371 218600 206487 172368 149775 149525 212913 239007 167469 129930 152134 166531 148741
12591 148741 149505 132204 42488 16888 36045 82329 20695 23722 9798 -73463 -36079 30042
12579 30042 63523 82115 113638 178005 240999 194230 88075 44114 79159 112125 72007
12568G2007l1255k1853O180J4370K3204j3858n3072k0350j6918M6448J2093j4740
12556B256k0921m516P6039O807n8325n4024j474L8417M0970k3830r371j2555q123
12543b8650j7982j8971Q0437M6090P693n6631p4852k0122M8822Q4872k9442Q253
12531B9517K1409m712k6600q244L6496K4040K2953l7163N0514j2131M378K4850
12519A25307m2795n0223R632m8310J50L6413k5808q7349K2022O9274L2860k5254
12507A5919q336k3484o2065K5014N1622m226j7477K2291L0508j83n3373o464M8270
12494A8016k2896k7262J037J8454Q774M3197M4157M2574J886m7284p0712j1926
12482a985K7141l2833J3703k2447j2784N05K3055p316q530K0028J1425j0191J5719
$$ plain form
12568 72007 40752 18899 25079 39449 62653 48795 -4277 -24627 -41545 4903 16996 2256
12556 2256 -18665 -23181 52858 59665 1340 -52684 -54158 -15741 25229 1399 -7972 -20527 -28650
12543 -28650 -46632 -65603 14834 60924 68617 11986 -62866 -82988 -34166 50706 21264 29517
12531 29517 50926 46214 19614 11370 47866 71906 94859 57696 108210 96079 100457 125307
12519 125307 82512 32289 41921 -6389 -6239 30174 4366 -82983 -60961 8313 41173 15919
12507 15919 7583 -15901 -77966 -52952 -1330 -5556 -23033 -742 29766 29583 -23790 -30254 18016
12494 18016 -4880 -32142 -31105 -12651 -3877 39320 83477 126051 127937 80653 9941 -1985
12482 -1985 25156 -7677 6026 -16421 -29205 -28700 -5645 -12961 -21491 -1463 9962 -229 15490
12469A5490N0806L9183N321m597L2678o723n0716j7643N2182N2249j7125q2090
12457F9015q3176L149J5701K758j7163K0560k844M1696j6796k1242R027J9793
12445D0478N3124k7469M6115j1796k6657q107k3520k1750k283j3060P9440j1759
12433G2756k2507N151K7188M0401m9838L1367J7611l6403m5533m3720M6654J4200
12421E7327j7506n1491L8668M8562K1403O092l0723j2964k3465j1521L3084j6704
12409D0762J8000l4341L6524k0791k531J0502J7232m7124o0371n988J1836Q1015
12397D4725J7203m1377L5867K8804m3833K4023p468R062n6996J7928M4605l1348
12385D1195n3134l1706N6589M1820J700k3938M5450M4506L1755l1401l6210l5708
$$ plain form
12469 15490 66296 105479 110800 106203 138881 132158 81442 63799 115981 168230 151105 69015
12457 69015 -14161 -11012 4689 7447 -9716 10844 8000 49696 32900 11658 20685 40478
12445 40478 93602 66133 112248 100452 73795 65688 42168 20418 18135 5075 84515 72756
12433 72756 50249 55400 82588 122989 73151 104518 122129 85726 40193 -3527 43127 57327
12421 57327 39821 -11670 26998 75560 96963 103055 72332 59368 35903 24382 57466 40762
12409 40762 58762 24421 60945 40154 37623 48125 65357 18233 -42138 -48126 -36290 44725
12397 44725 61928 20551 56418 85222 41389 65412 57944 67006 10010 27938 72543 41195
12385 41195 -11939 -43645 12944 54764 56464 32526 77976 122482 154237 122836 86626 50918
12373E0918O44k1387m5229O310l3094n1361p503j1347P2117N5668j899j153o707
12360E977j1369l6205l5259k8529m3306Q368N7854K8032L1910P077n6826j6040
12348h8316l246P8601K485L2655m6748R742N0801o198J1245m3058j6212K6553
12336H304N1209k8289j8937n4828j1793j5599N6984K3133j727R07k0563j1481
12324b2680K4753N2806j2703l5455J5875m0252J235J0373J0756n2652k7680k1508
$$ plain form
12373 50918 51562 30175 -15054 -8744 -41838 -93199 -100702 -112049 -39932 15736 13837 12684 5977
12360 5977 -5392 -41597 -76856 -105385 -148691 -140323 -82469 -54437 -22527 -15450 -72276 -88316
12348 -88316 -91562 -12961 -10476 22179 -24569 -14827 35974 29776 41021 -2037 -18249 8304
12336 8304 59513 31224 12287 -42541 -54334 -69933 -12949 10184 8457 9364 -11199 -22680
12324 -22680 2073 54879 42176 6721 22596 -17656 -16421 -6048 4708 -47944 -75624 -97132
$$ [...]
##END NTUPLES=NMR SPECTRUM
##END=
