##TITLE=Analysis number 324292
Compound Code cc 57801
Book Reference 449/156
Project Code adrs
Chemist Name davee
##JCAMPDX= 6.0         $$ Bruker NMR JCAMP-DX V2.0
##DATA TYPE= NMR SPECTRUM
##DATA CLASS= NTUPLES
##ORIGIN= Bruker BioSpin GmbH
##OWNER= nmr
$$ XWIN-NMR		Version 3.5
$$ Fri Nov 17 11:44:10 2006 GMT Standard Time (UT+0h)  MAYBRIDGE\nmr@NMR_250MHZ
##.OBSERVE FREQUENCY= 250.131544655141
##.OBSERVE NUCLEUS= ^1H
##.ACQUISITION MODE= SIMULTANEOUS (DQD)
##.ACQUISITION SCHEME= undefined
##.AVERAGES= 16
##.DIGITISER RES= 18
##SPECTROMETER/DATA SYSTEM= dpx250
##.PULSE SEQUENCE= zg30
##.SOLVENT NAME= DMSO
##.SHIFT REFERENCE= (INTERNAL, DMSO, 0, 16.522)
##AUDIT TRAIL= $$ (NUMBER, WHEN, WHO, WHERE, WHAT)
$$ ##TITLE= Audit trail, XWIN-NMR		Version 3.5
$$ ##JCAMPDX= 5.01
$$ ##ORIGIN= Bruker BioSpin GmbH
$$ ##OWNER= nmr
$$ C:\u/data/dgb/nmr/ADRS/550/pdata/1/auditp.txt
$$ ##AUDIT TRAIL=  $$ (NUMBER, WHEN, WHO, WHERE, WHAT)
(   1,<2006-11-17 11:43:00.65 +000>,<MAYBRIDGE\nmr>,<NMR_250MHZ>,
      <created by zg, POWCHK disabled, PULCHK disabled
       configuration hash MD5:
       49 4B E0 1D 92 C2 6B 37 9F E6 65 BC 52 41 86 1D
       data hash MD5: 64K
       46 F1 BC 9D EA 3F 01 57 60 47 67 68 8B 6C 80 CE>)
(   2,<2006-11-17 11:43:36.63 +000>,<MAYBRIDGE\nmr>,<NMR_250MHZ>,
      <Start of raw data processing
       ef LB = 0.3 FT_mod = 6 PKNL = 1 SI = 32K 
       data hash MD5: 32K
       5C 94 D6 16 4B 60 2A 22 C5 5C 2B 2B D5 7E 62 62>)
(   3,<2006-11-17 11:43:46.93 +000>,<MAYBRIDGE\nmr>,<NMR_250MHZ>,
      <apk 
       data hash MD5: 32K
       B2 DF 16 E3 25 83 E9 60 84 43 8D 7B A0 EC 3D 3B>)
(   4,<2006-11-17 11:43:48.45 +000>,<MAYBRIDGE\nmr>,<NMR_250MHZ>,
      <abs ABSG = 5 
       data hash MD5: 32K
       F5 9C A0 56 93 5D 40 58 F5 1D AC FC F9 C2 D7 22>)
$$ ##END=
$$ 
$$ hash MD5
$$ B4 83 E3 60 BB 84 BD 9D 4E 05 61 23 A3 48 80 EC
##$RELAX= 
##$RELAX= 
##$RELAX= 
##$RELAX= 
##$RELAX= 
##$RELAX= 
##$RELAX= 
$$ Bruker specific parameters
$$ --------------------------
##$DU= <C:\u>
##$EXPNO= 550
##$NAME= <ADRS>
##$PROCNO= 1
##$TYPE= <nmr>
##$USER= <dgb>
##$AMP= (0..31)
100 100 100 100 100 100 100 100 100 100 100 100 100 100 100 100 100 100 
100 100 100 100 100 100 100 100 100 100 100 100 100 100 
##$AQSEQ= 0
##$AQ_mod= 3
##$AUNM= <au_zg>
##$AUTOPOS= <23 >
##$BF1= 250.13
##$BF2= 250.13
##$BF3= 250.13
##$BF4= 250.13
##$BF5= 500.13
##$BF6= 500.13
##$BF7= 500.13
##$BF8= 500.13
##$BYTORDA= 1
##$CFDGTYP= 0
##$CFRGTYP= 5
##$CHEMSTR= <none>
##$CNST= (0..31)
1 1 145 1 1 1 1 1 1 1 1 1 1 1 1 1 1 1 1 1 1 1 1 1 1 1 1 1 1 1 1 1 
##$CPDPRG= <>
##$CPDPRG1= <>
##$CPDPRG2= <>
##$CPDPRG3= <>
##$CPDPRG4= <mlev>
##$CPDPRG5= <mlev>
##$CPDPRG6= <mlev>
##$CPDPRG7= <mlev>
##$CPDPRG8= <mlev>
##$CPDPRGB= <>
##$CPDPRGT= <>
##$D= (0..31)
0 1 0 0 0 0 0 0 0 0.06 0 0 0 0 0 0 0.0002 0 0 0 0 0 0 0 0 0 0 0 0 0 0 
0 
##$DATE= 1163763777
##$DBL= (0..7)
120 120 120 120 120 120 120 120 
##$DBP= (0..7)
150 150 150 150 150 150 150 150 
##$DBP07= 0
##$DBPNAM0= <>
##$DBPNAM1= <>
$$ [...]
##$SUBNAM7= <"">
##$SUBNAM8= <"">
##$SUBNAM9= <"">
##$SW= 20.6930455092707
##$SWIBOX= (0..15)
0 0 3 0 0 0 0 0 0 0 0 0 0 0 0 0 
##$SW_h= 5175.983436853
##$TD= 65536
##$TD0= 1
##$TE= 683.16
##$TE2= 300
##$TE3= 300
##$TEG= 300
##$TL= (0..7)
0 120 120 120 120 120 120 120 
##$TP= (0..7)
150 150 150 150 150 150 150 150 
##$TP07= 0
##$TPNAME0= <>
##$TPNAME1= <>
##$TPNAME2= <>
##$TPNAME3= <>
##$TPNAME4= <>
##$TPNAME5= <>
##$TPNAME6= <>
##$TPNAME7= <>
##$TPOAL= (0..7)
0.5 0.5 0.5 0.5 0.5 0.5 0.5 0.5 
##$TPOFFS= (0..7)
0 0 0 0 0 0 0 0 
##$TUNHIN= 0
##$TUNHOUT= 0
##$TUNXOUT= 0
##$USERA1= <user>
##$USERA2= <user>
##$USERA3= <user>
##$USERA4= <user>
##$USERA5= <user>
##$V9= 5
##$VALIST= <valist>
##$VCLIST= <CCCCCCCCCCCCCCC>
##$VD= 0
##$VDLIST= <DDDDDDDDDDDDDDD>
##$VPLIST= <PPPPPPPPPPPPPPP>
##$VTLIST= <TTTTTTTTTTTTTTT>
##$WBST= 1024
##$WBSW= 4
##$XGAIN= (0..3)
0 0 0 0 
##$XL= 0
##$YL= 0
##$YMAX_a= 367886
##$YMIN_a= -330929
##$ZGOPTNS= <>
##$ZL1= 120
##$ZL2= 120
##$ZL3= 120
##$ZL4= 120
##$ABSF1= 16.522
##$ABSF2= -4.171173
##$ABSG= 5
##$ABSL= 3
##$ALPHA= 0
##$AQORDER= 0
##$ASSFAC= 0
##$ASSFACI= 0
##$ASSFACX= 0
##$ASSWID= 0
##$AUNMP= <proc_1d>
##$AZFE= 0.1
##$AZFW= 0.1
##$BCFW= 0
##$BC_mod= 0
##$BYTORDP= 0
##$COROFFS= 0
##$CY= 12.5
##$DATMOD= 1
##$DC= 0
##$DFILT= <>
##$DTYPP= 0
##$F1P= 14.0000005364418
##$F2P= -0.99999901652339
##$FCOR= 0.5
##$FTSIZE= 32768
##$FT_mod= 6
##$GAMMA= 0
##$GB= 0
##$INTBC= 1
##$INTSCL= 1
##$ISEN= 128
##$LB= 0.3
##$LEV0= 0
##$LPBIN= 0
##$MAXI= 10000
##$MC2= 0
##$MEAN= 0
##$ME_mod= 0
##$MI= 0
##$NCOEF= 0
##$NC_proc= -5
##$NLEV= 6
##$NOISF1= 0
##$NOISF2= 0
##$NSP= 0
##$NTH_PI= 0
##$NZP= 0
##$OFFSET= 16.522
##$PC= 1
##$PHC0= -54.46716
##$PHC1= 5.150489
##$PH_mod= 1
##$PKNL= yes
##$PPARMOD= 0
##$PSCAL= 4
##$PSIGN= 0
##$REVERSE= no
##$SF= 250.13
##$SI= 32768
##$SIGF1= 0
##$SIGF2= 0
##$SINO= 400
##$SIOLD= 32768
##$SREGLST= <1H.DMSO>
##$SSB= 0
##$STSI= 32768
##$STSR= 0
##$SW_p= 5175.98343685301
##$SYMM= 0
##$S_DEV= 0
##$TDeff= 65536
##$TDoff= 0
##$TI= <Analysis number 999999
Compound Code 99
Book Reference 9
Project Code 9>
##$TILT= no
##$TM1= 0
##$TM2= 0
##$TOPLEV= 0
##$USERP1= <user>
##$USERP2= <user>
##$USERP3= <user>
##$USERP4= <user>
##$USERP5= <user>
##$WDW= 1
##$XDIM= 32768
##$YMAX_p= 279437284
##$YMIN_p= -548892
$$ End of Bruker specific parameters
$$ ---------------------------------
##NTUPLES= NMR SPECTRUM
##VAR_NAME=  FREQUENCY,     SPECTRUM/REAL,   SPECTRUM/IMAG
##SYMBOL=    X,             R,               I
##VAR_TYPE=  INDEPENDENT,   DEPENDENT,       DEPENDENT
##VAR_FORM=  AFFN,          ASDF,            ASDF
##VAR_DIM=   32768,         32768,           32768
##UNITS=     HZ,            ARBITRARY UNITS, ARBITRARY UNITS
##FACTOR=    0.157963299565203, 1,           1
##FIRST=     4132.6476996994, 0,             0
##LAST=      -1043.33573715361, 0,           0
##MIN=       -1043.33573715361, -548892,     0
##MAX=       4132.6476996994, 279437284,     0
$$ Real data points
##PAGE= N=1
##DATA TABLE= (X++(R..R)), XYDATA
$$ [...]
16739a97838J79017j81818l8514K0264J27093j8637K0496j72359j22268K6425
16729c58139M3637R0557K10541L1923j69904j7701J68845J90520k2218n1218N590
16718A22433l7526j4150j6887j33661k1354J0515p5835q034K4436j1509j6280
16707a77852J7530K1668P6846J46074N1879l3053K8791k6732q4879k08047J301
16696a86474k8267j91298Q7009J82759N6630P6267O8768o5319q2192j03311l2252
16685b17680J13883j23427k5106k8453O6806J56097J89042K9443l4569R1089J87270
16674D04395r6571j37467L2674l8679N393j885n6227j20668J8927K5178k2201
16663A2869j26110p1620j02781J13149K66734J22250p3895j57384O9965Q1591
$$ plain form
16739 -197838 -18821 -200639 -239153 -218889 -91796 -110433 -89937 -262296 -384564 -358139
16729 -358139 -314502 -223945 -13404 18519 -151385 -169086 -241 190279 168061 116843 122433
16718 122433 84907 70757 53870 -79791 -101145 -90630 -166465 -174499 -150063 -161572 -177852
16707 -177852 -160322 -138654 -61808 84266 136145 103092 131883 105151 20272 -187775 -186474
16696 -186474 -214741 -406039 -319030 -136271 -79641 -3374 65394 75 -82117 -185428 -217680
16685 -217680 -103797 -227224 -252330 -280783 -213977 -57880 131162 160605 126036 217125 404395
16674 404395 307824 170357 203031 164352 169745 167860 111633 -9035 9892 35070 12869
16663 12869 -113241 -184861 -287642 -174493 92241 214491 140596 -16788 53177 134768
16653A34768q9923O5229j06673r0175L4783J43569n4425r4556L8743k4940p3762
16642a17362n7491Q9639J4355R5646J27108L9685j40947j69057r8432J4303N2005
16631a50548j7410n7581P0045J27745L166o8843M4856m1249J1883L4663J5449
16620b7824m9792l6572o5706K5703q6496N8199l2748L5540L4202O58l4071j16844
16608b95751R3747K01389P7668q9668k6016M4548j03295p2099j18493n8816J49533
16597a97253o9451o6557P8104J03852O3852k6155O335q3160k0930j9728n9249
16586b90340R5996J57953K1132L8972p4365j23316n2896R3350J21937p520n6300
16575g5397J25701l7985j06415K78N7542j3656j1127j0592m3125P9206k9480K5752
$$ plain form
16653 134768 44845 110074 3401 -86774 -51991 91578 37153 -57403 -18660 -43600 -117362
16642 -117362 -174853 -85214 -70859 24787 151895 191580 50633 -118424 -216856 -202553 -150548
16631 -150548 -167958 -225539 -155494 -27749 -24583 -93426 -48570 -89819 -77936 -43273 -27824
16620 -27824 -77616 -114188 -179894 -154191 -240687 -182488 -215236 -179696 -145494 -144836 -178907 -295751
16608 -295751 -202004 -615 77053 -12615 -38631 5917 -97378 -169477 -287970 -346786 -197253
16597 -197253 -266704 -333261 -255157 -151305 -87453 -113608 -107273 -190433 -211363 -231091 -290340
16586 -290340 -194344 -36391 -15259 23713 -50652 -173968 -226864 -133514 -11577 -19097 -75397
16575 -75397 50304 12319 -94096 -93818 -36276 -49932 -61059 -71651 -114776 -35570 -65050 -39298
16563c9298J51811N527r9699j03925n7244q3790O6929L8177q271j7503J13130
16552c4156O2428j4928J32689m0853j17065m198k1223J00571Q4951J24171O872
16541B79259j0748l9000j30238k3758j07372j20415R1625L3006n4734j06686L3903
16530a55158K42177J43212l5275p9807k66567j03112J89133J24272k8007j6465
16520A4403l2161l5500L5276Q0200k3667j74991q7915J13246P357k8889O1808
16509g0833l5889k1420P1351L7394j2675j8408R632J3397o4353q8820P5033R6012
16497i579Q5304k7747r951P3519j442p5493L8447N7110r2700j57066L1312p1885
16485a60171Q1824R3271L5925n8892q2021J37465N5800L2436O6132m6189k6806
$$ plain form
16563 -39298 112513 118040 18341 -85584 -142828 -226618 -159689 -121512 -129783 -147286 -34156
16552 -34156 28272 13344 146033 105180 -11885 -16083 -37306 63265 148216 272387 279259
16541 279259 268511 229511 99273 75515 -31857 -152272 -60647 -27641 -82375 -189061 -155158
16530 -155158 87019 230231 194956 115149 -151418 -254530 -65397 58875 30868 14403
16520 14403 -17758 -53258 -17982 62218 38551 -136440 -224355 -111109 -103752 -132641 -70833
16509 -70833 -106722 -128142 -56791 -19397 -32072 -50480 -40848 -27451 -91804 -180624 -105591 -9579
16497 -9579 75725 47978 38027 111546 110104 34611 73058 130168 37468 -119598 -88286 -160171
16485 -160171 -78347 14924 50849 -8043 -90064 47401 103201 135637 201769 155580 128774
16474A28774k6955P2197n5731l222m3356J2312J3011K8780r7015P683j5535j0566
16462A0377p8883l0102J69839J45482p342r2156m2696j68638j41341J13720J21602
16451a38j5622L9256N8555P5986j0822j39316P7179J7334k3835r5112r9952r0346
16439b06833J40975N9574k7506j1526r933M5500Q5001N5009R4495L4111r7887
16428A60980j27030k6028n0016R370P493m6360j2140p4371m8090J07195L6046
16417f2951p0086k14939K2878K97J4306J97500J44497k9188r0248m1325O2551
16406f6708N4754K1925L0262m9931m9733q3535O3431N1900m8157Q2336k5090r8269
16394a16815q1905o0026R115K08785J77066p8556j26842m5302Q8296M3034j81882
$$ plain form
16474 128774 101819 174016 118285 115063 71707 84019 97030 125810 28795 36478 20943 10377
16462 10377 -68506 -98608 71231 216713 209371 117215 74519 -94119 -235460 -121740 -138
16451 -138 -15760 23496 82051 158037 147215 7899 85078 102412 78577 -16535 -116487 -206833
16439 -206833 -65858 -6284 -33790 -45316 -55249 -9749 75252 130261 224756 258867 160980
16428 160980 33950 7922 -42094 -32724 -25231 -71591 -83731 -158102 -206192 -98997 -62951
16417 -62951 -133037 -347976 -325098 -324801 -310495 -112995 31502 2314 -87934 -129259 -66708
16406 -66708 -11954 9971 40233 -9698 -59431 -142966 -79535 -27635 -75792 6544 -18546 -116815
16394 -116815 -198720 -258746 -249631 -40846 136220 57664 -69178 -114480 -26184 16850 -165032
16383a65032R8924k4078n7074R3369J51487j77440M951K17497J1592L2982m2629
16372A44549j01039j62481m4390j0928M3684r417P9408J26363o2023p7170j89322
16361b62766m8534R9653P2577J29802J86128J4290j32973l738O6065l0305M9710
16350A39909q0757j91864m978P8460K7656q6838l860M7469p094n1040K1193k9784
16338a41528l099j9714j7537o655J2528O2430o6417p832j4660R4787J99639K4449
16326A16391l121l6582O0178j22486r971Q6937L0086j48911L4761k881N4738J86182
16314B45321m4609p5000j10957j15638J22411n5852j19168q9903J57301J00315
16304A4221n1223L2136k9673k476M8428K1770J6080o4877m7951r4005O8461O9116
$$ plain form
16383 -165032 -66108 -90186 -147260 -53891 97596 -79844 -74893 142604 154196 187178 144549
16372 144549 43510 -118971 -163361 -174289 -130605 -140022 -60614 65749 3726 -73444 -262766
16361 -262766 -311300 -211647 -139070 -9268 176860 191150 58177 54439 120504 90199 139909
16350 139909 59152 -132712 -137690 -59230 -31574 -118412 -122272 -74803 -81897 -132937 -111744 -141528
16338 -141528 -144627 -164341 -181878 -188533 -176005 -113575 -179992 -187824 -202484 -107697 91942 116391
16326 116391 113270 76688 136866 14380 4409 91346 121432 -27479 7282 4401 59139 245321
16314 245321 200712 125712 14755 -100883 21528 -34324 -153492 -243395 -86094 14221
16304 14221 -37002 -4866 -34539 -37015 11413 33183 49263 -15614 -63565 -157570 -89109 -19993
16292a9993O7887p2210l0516J22430m2570J485K4346j7387j7487k08231k9361
16281b21607r6143j12889J16970O8139O458N1745n4927L7633P7277M7848Q8081
16270H585l3106n8292j0991l1773q7780N2076K5574j9020N1010J23538P1342k43690
16258a52527j7885J07907M5068n6137j44198M4535J1694L4861n5944j19445O7734
16247b34337K28557l4594R991j01771j23356p4034J7690J68070J30386j9252p5507
16236a08157P2L9166j25579k6249J58190J49552J4307O4815r9186o6089R978n2711
16224d1891l1215L6871k8018L7025J13437N2667j13434j34653j17662l9392J64105
16213a02160P9883Q9935p335l7693p5565o853N5794m1563p4483r2319L1846J51926
$$ plain form
16292 -19993 47894 -24316 -54832 67598 25028 26513 50859 33472 15985 -192246 -221607
16281 -221607 -317750 -430639 -313669 -245530 -239072 -187327 -242254 -204621 -127344 -79496 8585
16270 8585 -24521 -82813 -93804 -125577 -213357 -161281 -135707 -154727 -103717 19821 91163 -152527
16258 -152527 -170412 -62505 -17437 -73574 -217772 -173237 -161543 -126682 -182626 -302071 -234337
16247 -234337 -5780 -40374 -30383 -132154 -255510 -329544 -311854 -143784 -13398 -32650 -108157
16236 -108157 -108085 -68919 -194498 -220747 -62557 86995 101302 166117 66931 842 10820 -41891
16224 -41891 -73106 -36235 -64253 -27228 86209 138876 25442 -109211 -226873 -266265 -102160
16213 -102160 -22277 67658 60323 22630 -52935 -59788 -3994 -45557 -120040 -212359 -180513 -28587
16201b8587K1833o334j38096j05412m388O4617J7378K4532J9952m1077J17310
16190e8272p3171r2885N3087R9383J75306R9608p1438j60137k5023l3355k122
16179h9019J37266L532n9114j2722K0218P6276M3549j13235R476k435q8386l711
16167g8305J04337P5308%j28528r9669O3731J05490L96k75r1051o6158m7029P9196
16154h2557J86277r247j50268j76239K0294J15971l7112j38591n1315l3901J79452
16143a77236J20548N1828J8154K14017j7131K6896j03929r1939o843m4185k809
16132a2629P000P5946J01246n7455p3257k9573n1603j10165Q8208J29033K3914
16121I0665M5330p5608N834m6999M1833m9689n0835P1367j75916j3326l4679O2273
$$ plain form
16201 -28587 -6754 -13088 -151184 -256596 -260984 -196367 -178989 -154457 -134505 -175582 -58272
16190 -58272 -131443 -224328 -171241 -71858 103448 203056 131618 -28519 -53542 -86897 -89019
16179 -89019 48247 51779 -7335 -20057 161 76437 119986 6751 16227 13792 -74594 -78305
16167 -78305 26032 101340 101340 -27188 -126857 -63126 42364 42760 42485 -48566 -114724 -161753 -82557
16154 -82557 103720 94473 -55795 -232034 -211740 -95769 -132881 -271472 -322787 -356688 -177236
16143 -177236 -56688 -4860 13294 227311 210180 237076 133147 41208 34365 -9820 -12629
16132 -12629 -5629 70317 171563 114108 40851 11278 -40325 -150490 -62282 66751 90665
16121 90665 135995 60387 66221 19222 61055 11366 -39469 31898 -144018 -157344 -192023 -129750
16109a29750J23549k3857j0098O2524j8008q5189J2342j1063l8116P6648k8938
16098f9956M7224j65975m6959J42007L0943k4338N178n1928M1700L7126m0467
16087i5445Q5374L9110J2023j04744j00701J14984M2540j21766J65479J74205
16077B11059P2860l4561o5489p9067m8650K8224N3643j14052j54395q2899J60225
16066e3102K4271j62345M6106K277R0967N5991j02173M7020Q5664j34737L444
16055i6617P8973l0308J9214J23439n9925r9055j2943j11337j57249K0873l9898
16044c64833Q6064J19711O1572P8986J65209J30498m5563j9417l9491o0517j17389
16033e170n9979Q7303K1874j08272k1948j054J63331O0365j53370k2498l8844
$$ plain form
16109 -129750 -6201 -30058 -40156 22368 4360 -80829 -68487 -79550 -117666 -41018 -69956
16098 -69956 -22732 -188707 -235666 -93659 -62716 -87054 -81876 -133804 -92104 -54978 -95445
16087 -95445 -10071 29039 41062 -63682 -164383 -49399 -6859 -128625 36854 211059
16077 211059 283919 249358 183869 104802 56152 84376 138019 23967 -130428 -213327 -53102
16066 -53102 -28831 -191176 -145070 -142793 -51826 4165 -98008 -50988 34676 -100061 -96617
16055 -96617 -17644 -47952 -28738 94701 34776 -64279 -77222 -188559 -345808 -324935 -364833
16044 -364833 -278769 -159058 -97486 -18500 146709 277207 231644 212227 172736 112219 -5170
16033 -5170 -65149 22154 44028 -64244 -86192 -87246 76085 136450 -16920 -39418 -78262
16022g8262j08089r8122J08105L8974J45860Q0482M8174J4927n7238o5500K6938
16011E6249K3660r334j09035j39262p8874J55689M8779R9096N5253J54879J7791
16000B74891j64020L2726L1430j87345k15503P7802Q3632N0361N1488O4275n0331
15989D9406m3738j27506j79887o3316J44100N4277P9679K355j3722J4393K4456
15978e9503J00878j9571n1118J00981P8520m9925o5236m3030M7449l7920j82072
15967a80547r4719J28920R7087L1659J7825r5419p803L6682j0521M6987L2112
15956B263J1610k6689l5646Q8105N6688m6238M6305O3983o0962j10877L8407k1934
15944E015p3239k6986r378J4371J63057j46456M1961R3404l3224j60339R8418
$$ plain form
16022 -78262 -186351 -284473 -176368 -137394 8466 88948 137122 152049 94811 29311 56249
16011 56249 79909 70575 -38460 -177722 -256596 -100907 -52128 46968 102221 257100 274891
16000 274891 110871 143597 175027 -12318 -227821 -150019 -66387 -16026 35462 99737 49406
15989 49406 5668 -121838 -301725 -365041 -220941 -166664 -86985 -84630 -98352 -83959 -59503
15978 -59503 41375 21804 -29314 71667 150187 100262 35026 -8004 39445 1525 -180547
15967 -180547 -275266 -146346 -49259 -17600 225 -95194 -102997 -66315 -76836 -29849 2263
15956 2263 13873 -12816 -48462 39643 96331 50093 96398 160381 99419 -11458 26949 5015
15944 5015 -68224 -95210 -104588 -90217 72840 -73616 -31655 61749 28525 -131814 -33396
15933c3396k0181o287N9866n6787J4280P170j80799j32143j5474O2400J09866
15922a91485Q6323p6853o7684J17405P7833J11971R1703j14496j60527J22985
15912b825J14148r9502o4216M3735Q9353n2192r4549J12606K8125o7036N6380
15901F4027q2552j63544J3957j4680m2327K1372J01739J42034J8542r9516j36384
15890a77332J08309q0151p1979q0218P2161K05480j6614J21751o4857j33697n9445
15879a76592O5592J74935o8330m855Q443o5721o3796o2628N6372J30012O9615
15868F3047K1838k42512N4034j1240R6422m1918n2899K2838k5613j30768K2884
15857b23887M0219M6557O6787n0766q2315L8484O6375K2470p9996r951P2885J31345
$$ plain form
15933 -33396 -53577 -59864 2 -56785 -42505 -35335 -216134 -348277 -363751 -301351 -191485
15922 -191485 -105162 -182015 -249699 -132294 -54461 57510 149213 34717 -125810 -2825
15912 -2825 111323 11821 -52395 -8660 80693 28501 -66048 46558 74683 7647 64027
15901 64027 -18525 -182069 -168112 -182792 -225119 -203747 -102008 40026 58568 -40948 -177332
15890 -177332 -69023 -149174 -221153 -301371 -229210 -23730 -40344 81407 16550 -117147 -176592
15879 -176592 -111000 63935 -4395 -9250 -807 -66528 -130324 -192952 -136580 -6568 63047
15868 63047 84885 -157627 -103593 -114833 -18411 -60329 -113228 -90390 -116003 -246771 -223887
15857 -223887 -183668 -137111 -70324 -121090 -203405 -164921 -98546 -76076 -156072 -166023 -93138 38207
15845C8207Q6252p1141J2817M5639J2551J12231P9983l8779j34891j66345q466
15834c1942J01558j37646o7180Q1031L2573L5627j07028J3869j6625n1083J01298
15823d5548O8095o4189l8628J1099k1116M9817J74394M5914K3738M7867j10556
15812A40887K7902m1527m5644k6232r0511L8237P8022k8875r5370j00759o2147
15801b06017O4976N040M2577k206R6851J7977O238n4628l9192o5195O6274l5130
15789a02435j59315l3854j3216R549J84375K22329m9476p1179j60920j14293J7609
15778b70826J33302O3087j17941J5570O5252K686j26623n2328J21901J9178J2609
15767a34133P2285J29518O5379n8671j48880K3619J74881R9784j30905j77422
$$ plain form
15845 38207 124459 53318 66135 111774 124325 236556 316539 277760 142869 -23476 -31942
15834 -31942 69616 -68030 -135210 -54179 -21606 14021 -93007 -79138 -95763 -146846 -45548
15823 -45548 22547 -41642 -80270 -69171 -90287 -40470 133924 179838 203576 251443 140887
15812 140887 168789 127262 81618 55386 -35125 3112 81134 52259 -43111 -143870 -206017
15801 -206017 -141041 -136001 -93424 -95630 1221 19198 25436 -29192 -68384 -133579 -67305 -102435
15789 -102435 -261750 -295604 -308820 -299271 -114896 107433 57957 -13222 -174142 -288435 -270826
15778 -270826 -137524 -74437 -192378 -176808 -111556 -108870 -235493 -287821 -165920 -146742 -134133
15767 -134133 -61848 67670 133049 74378 -74502 -50883 123998 223782 92877 -84545
15757h4545J4825o3814L9523J29327Q7309n4251q1783j04793K9405j00177l4072
15746b23046J6226j5126O7053l0579o743N8640L1392p248L7514k0482j090N1903
15734d1586q453j25394j30769K5013J16409m1709J35772O5055o2593l6600Q718
15723i6137J29154J93819M6345k43107j84090o1964L6440r4286M8559n0228O9389
15712b06106J32845p468l1131j5102L5123J54148m1268j04100Q1191J68915n4593
15701A12454M8634Q5185q335r9867k9912p2406K5694P3463j36543M499j41225
15690a38359o7058O1304L5564j94336m242P2298O9586n5187j21323n5238M3302
15679c53689J37123K18478J05536O7108K4245j2946k2765j03478q3804Q379o0372
$$ plain form
15757 -84545 -69720 -133534 -94011 35316 122625 68374 -13409 -118202 -88797 -188974 -223046
15746 -223046 -206820 -221946 -154893 -185472 -192215 -133575 -102183 -109431 -71917 -92399 -93489 -41586
15734 -41586 -50039 -175433 -306202 -281189 -164780 -206489 -70717 -5662 -68255 -104855 -96137
15723 -96137 33017 226836 273181 30074 -154016 -215980 -179540 -273826 -225267 -275495 -206106
15712 -206106 -73261 -80729 -111860 -126962 -91839 62309 21041 -83059 -1868 167047 112454
15701 112454 161088 246273 237938 138071 108159 35753 61447 134910 -1633 2866 -138359
15690 -138359 -205417 -144113 -108549 -302885 -307127 -234829 -165243 -220430 -341753 -396991 -353689
15679 -353689 -216566 1912 107448 174556 198801 185855 163090 59612 -24192 -15813 -76185
15668g6185M5567K877J70443M5504J6385j30169j15453O5311J9499o3987j58678
15657a78886o2215K3826N0263O8332j4156N3632M9812p7764M3172Q7607j1333
15646C2290j30535o6557J15394O9812j8834Q2179m1835M7503J8885r6131q1169
15635f8998R945J01241m4309p3829Q1332P5240N342m5901j81521n7652J6554J2363
15623a70193J94266J29138o746o3891k9285P9728O8481j0913l7607j1760p2925
15612F8293l8215L0317p744J9486M0193m0009q7713K2148Q630j20208j34588j29078
15600c68488J88158J82926Q763O533K5150l3573j42814r0535O9779J36399k5911
15589d3613O3005O0976j0516N5884j07108j34320o5372J07971J04477O2682K3496
$$ plain form
15668 -76185 -30618 -27741 142702 188206 204591 74422 -41031 24280 43779 -20208 -178886
15657 -178886 -241101 -217275 -167012 -98680 -112836 -59204 -9392 -87156 -43984 43623 32290
15646 32290 -98245 -164802 -49408 20404 1570 83749 41914 89417 108302 12171 -68998
15635 -68998 -59053 42188 -2121 -75950 5382 80622 85964 40063 -141458 -199110 -182556 -170193
15623 -170193 24073 153211 146465 82574 53289 133017 201498 190585 152978 141218 68293
15612 68293 30078 60395 52651 72137 112330 72321 -15392 6756 15386 -104822 -239410 -368488
15600 -368488 -180330 2596 11359 17892 43042 9469 -133345 -223880 -154101 -17702 -43613
15589 -43613 19392 80368 69852 125736 18628 -115692 -181064 -73093 31384 94066 117562
15578A17562m4705L9724k06255n0318J54585j63645k37079O795O1632J04658k4206
15567b41252K1858J06732M8209k3222O8940l6145r8594M6070L3133o4608M1635
15556i7244k3020n5672J2203n905k5317O4079J15523l543l6857p1794n201j1639
15544a44387K042J63742J44431L157k46952o0597J41587o3807o993m5958j71610
15533b85345K5072o048J01580J09518J22045N5188k3770m8339J6074K7153O5190
15522A58318M4918j88536j32744N5729P2097j66805m5595J99156K21150j47116
15512G0572k49205Q599M6849J19305P3425J22924J6617r6038j87973j38416J1354
15501b01987R123J14262J16338j23524o9574J955j2714P9923m0718j8464J16639
$$ plain form
15578 117562 72857 112581 -93674 -143992 10593 -153052 -390131 -383336 -321704 -217046 -241252
15567 -241252 -219394 -112662 -64453 -87675 -18735 -54880 -153474 -107404 -74271 -138879 -97244
15556 -97244 -120264 -175936 -163733 -169638 -194955 -130876 -15353 -18896 -55753 -127547 -132748 -144387
15544 -144387 -142345 21397 165828 168985 -77967 -138564 3023 -60784 -67777 -113735 -285345
15533 -285345 -260273 -266321 -164741 -55223 66822 122010 98240 49901 65975 93128 158318
15522 158318 203236 14700 -118044 -62315 9782 -157023 -202618 -3462 217688 70572
15512 70572 -178633 -170034 -123185 -3880 69545 192469 209086 113048 -74925 -213341 -201987
15501 -201987 -192864 -78602 37736 -85788 -155362 -153407 -166121 -86198 -126916 -145380 -28741
15490b8741K2063j59451j58433l6548Q9411P4779l9252J74022Q2296o101j8276
15479d231N0879J0803J23262J09490l5813j08138j1015J81219p5845j65624m6033
15468B8954l1555P9589l0942r0634M9926J24965l6809j66867j09148K53582J32840
15457B03901j7982J8060p8236j40409j79341J7770N5582M4048M7128L7746p8582
15446g0315L2063o0256l1966L9600Q3093k9012m5325l5369M0082l9099k0649j36670
15434b73823K816J62321N7351j66915q7872M2905L8746K4841J57448P5373k342
15423C0849J58716R259p4598l4653p9791k2826M3629J04427J9925q6192j13755
15412d5010m9488J63183R7478M5139k8343M3344K7517r0020p3401k3545m2639
$$ plain form
15490 -28741 -6678 -166129 -324562 -361110 -271699 -196920 -236172 -62150 20146 14045 -4231
15479 -4231 46648 57451 180713 290203 254390 146252 135237 316456 240611 74987 28954
15468 28954 -2601 76988 46046 -44588 5338 130303 93494 -73373 -182521 71061 203901
15457 203901 185919 203979 125743 -14666 -194007 -176237 -120655 -76607 -29479 8267 -70315
15446 -70315 -38252 -98508 -130474 -90874 -7781 -36793 -82118 -117487 -77405 -116504 -137153 -273823
15434 -273823 -271007 -108686 -51335 -218250 -306122 -263217 -224471 -199630 -42182 33191 30849
15423 30849 189565 198824 124226 89573 9782 -13044 30585 135012 154937 68745 -45010
15412 -45010 -94498 68685 166163 211302 182959 226303 253820 163800 90399 66854 24215
15401B4215o0728J42425k0961R1201q7457p6521k1228l4955M870K3725l0880l6968
15389h3262q5471m9276K7674M7927R5342J07824q9354j5192J12754R2206K2941
15378A84113m6911o3572j1446J8028m8353Q2939K5937r4391m8706k12528K769
15367b12121J65636J92691P9251M0948L8197j70458K7420o625j00426k02926n9786
15356b08199p4494M5391P2097M0530J41214l3030J02644O6301J20422P425j18365
15345A61936j09011j39614k5530M3598K0839N3088n0703l397Q7606j17010m9192
15334a27390L8958n897J52016J64440j33221j91569j19125L2888J04132P8294
15324f474N0068N2184o0008j27766N2451J30419K13330N6699m8206j41785j6593
$$ plain form
15401 24215 -36513 105912 84951 176152 88695 12174 -9054 -44009 -39139 -15414 -46294 -83262
15389 -83262 -168733 -218009 -190335 -142408 -47066 60758 -28596 -43788 68966 161172 184113
15378 184113 137202 73630 62184 80212 31859 114798 140735 46344 -2362 -214890 -212121
15367 -212121 -46485 146206 225457 266405 304602 134144 161564 154939 54513 -148413 -208199
15356 -208199 -282693 -237302 -165205 -124675 16539 -16491 86153 152454 272876 280301 161936
15345 161936 52925 -86689 -112219 -68621 -47782 5306 -45397 -48794 38812 -78198 -127390
15334 -127390 -88432 -94329 57687 222127 88906 -102663 -221788 -188900 -84768 -6474
15324 -6474 43594 95778 35770 -91996 -39545 90874 304204 360903 312697 170912 154319
15313A54319O9731N5936l7854o0199l7344o8635J8827k9628K6883P0640r5047
15302F7629l7498L2989o6140n4434J5450J0617j0670L680Q6056O9207r9650j3588
15290C648k4010m365J60829J51043j60942K3585j506j04099m690k2211M0812j04423
15278d6329n5558q4099n0549k6859J40443J54858j27195n4601O7037M9529r250
15267d2573P0776R4651M4694l9536q5029N8285O2147j05845o6760O4803Q4727
15256A40340L4796m4303q9394J40344N1919j39852o281n074j76469k09650m4798
15245c48422R2694P3523N1232K6552j5886r891J36099M1350j52542k882q14O5355
15233d3632O1225J4661j2070J3532q4681j41122M4985J67402J50560q4602p0038
$$ plain form
15313 154319 224050 279986 242132 181933 144589 75954 94781 65153 92036 162676 67629
15302 67629 30131 63120 -3020 -57454 -42004 -31387 -42057 -38377 47679 116886 17236 3648
15290 3648 -20362 -24727 136102 287145 126203 149788 148282 44183 39493 17282 58094 -46329
15278 -46329 -101887 -185986 -236535 -263394 -122951 31907 -95288 -149889 -82852 -33323 -42573
15267 -42573 28203 122854 167548 128012 42983 101268 163415 57570 -9190 55613 140340
15256 140340 175136 130833 41439 181783 233702 93850 87569 82495 -93974 -303624 -348422
15245 -348422 -255728 -182205 -130973 -104421 -120307 -130198 5901 47251 -105291 -108173 -108987 -43632
15233 -43632 17593 32254 20184 33716 -50965 -192087 -147102 20300 170860 86258 16220
15222A6220j16296Q4144j11110n0936J57448P9235K8861l7851m2369O7002J2814
15211H7162K42R5314p4304k26805n0698o2287J26639L6976N5227J47148J0056
15200A44670m0120L3631j2535j03001j49871K0751K29729M1799J0071L2858J8821
15189B26803l284P183n2099J24359q2436j60550k4307n5266l474o6918j04871
15178a94860N2910J73374O6900j07947r2210j07212O7893k7027J09638R1063R1652
15167A24174J13510M5166j57190j89028L6978J06212j07524M9126J07841N775
15157A35040j74521O660M6177J00175l909j64640j12698j4891K16485J84443K2165
15146B40486j21629n3756k0495L0120j96010M5306m3603o9583J06180R1600J4970
$$ plain form
15222 16220 -100076 -15932 -127042 -177978 -20530 58705 87566 49715 7346 74348 87162
15211 87162 87404 182718 108414 -118391 -169089 -231376 -104737 -67761 -12534 134614 144670
15200 144670 104550 138181 125646 22645 -127226 -106475 123254 165053 175124 207982 226803
15189 226803 223519 230702 178603 302962 220526 59976 35669 -19597 -23071 -89989 -194860
15178 -194860 -141950 31424 98324 -9623 -101833 -209045 -141152 -168179 -58541 32522 124174
15167 124174 237684 282850 125660 -63368 -26390 79822 -27702 21424 129265 135040
15157 135040 -39481 -32821 13356 113531 109622 -55018 -167716 -182607 33878 218321 240486
15146 240486 118857 65101 44606 74726 -121284 -75978 -119581 -189164 -82984 8616 23586
15135B3586L9672r5489O8241j6055n3301j39912Q6388O3700k5121J40645k4061
15124F8293J8566N9515N907m686k01207o4004L0584m7336k9489r5928O8042O4303
15112a27440j3934P8597K8273J20913O4119p5183k5395j17281N8747K10455K6764
15101B28635L5921J05010j10426j81837o2406p5940J09521J34681L0972o9591
15091A44540j6487j814p8544m8478P1334K2325L3364O35M0105L1931k0327j1563
15079A67021j4493r8118j20636Q3265R2028l5270k0187l5623R6508o6216J07349
15068A55628L3886q6328r3787L2281J40775O6427n0603j34616J0024O2995m3364
15057I3318k5864K0729q6932m4924k9265l0075J49684q661n1647J26341K2631
$$ plain form
15135 23586 63258 -32231 36010 19955 -33346 -173258 -86870 -23170 -48291 92354 68293
15124 68293 86859 146374 152281 147595 -53612 -117616 -87032 -134368 -163857 -259785 -191743 -127440
15112 -127440 -141374 -62777 -34504 86409 150528 75345 49950 -67331 -8584 201871 228635
15101 228635 264556 369566 259140 77303 14897 -61043 48478 183159 214131 144540
15091 144540 128053 126239 47695 -783 70551 92876 126240 126875 166980 198911 178584 167021
15079 167021 152528 54410 -66226 17039 109067 73797 53610 17987 114495 48279 155628
15068 155628 189514 103186 9399 41680 182455 248882 198279 63663 73687 136682 93318
15057 93318 67454 88183 1251 -43673 -72938 -103013 46671 38010 -13637 112704 135335
15046A35335n7006J48862q3623o1399M6034m4290M5376K3473j115r6866O7312
15035A22093J07381o2413j55233L8290K19176j9512q1667j17134r2096j0700J7078
15024c4737l0092m7103J95044J39429l6901N1374n5517R0814j5234J3184j74367
15013I5894k0018J66241O4475k1101p8406l2192m3682p1873J6050J01694l1198
15002A45884p2780j7947q2188j6826M7576J22878m2296k8360m188k3854N526j645
14990C1780o6859N5227o3321Q7991k1901m5679m3935J36263L6701j1718l0467
14979F4082L045q5456J01776R6968L5642k4839k8198j66727q3528J07955N0975
14968G1695R1855n4929l2745p0401o7265Q7195K3024J15398j54742o80p4951r2034
$$ plain form
15046 135335 78329 227191 143568 82169 128203 83913 129289 152762 151647 54781 122093
15035 122093 229474 167061 11828 50118 269294 249782 168115 50981 -41115 -51815 -34737
15024 -34737 -64829 -111932 83112 222541 185640 237014 181497 272311 257077 270261 95894
15013 95894 75876 242117 306592 285491 207085 174893 131211 59338 75388 177082 145884
15002 145884 73104 55157 -27031 -43857 3719 126597 84301 55941 51753 27899 33425 31780
14990 31780 -35079 20148 -43173 44818 22917 -22762 -66697 69566 106267 94549 64082
14979 64082 67127 -18329 83447 180415 216057 191218 163020 -3707 -87235 20720 71695
14968 71695 163550 108621 75876 5475 -61790 25405 48429 163827 9085 8405 -66546 -158580
14956a58580K4932J56485m4795n9474m3554M0883p0949m7825M7968Q3848O6108
14945d953M5504j5397j10259O299J4267J15943R2367O976j63032j57665J10882
14934e9068n760r9264J99026Q0959J0986m801n8790J48034n3379j82452l725o2200
14922i0434P3908N4811j07905P9230N6832Q0368q213P622L6082R4001Q4088r1941
14910B68449k48626j97230j01512j0667N9130J42323L5058J07221O559J0292o3898
14899G099j4107M9105J65460j46777m1290J21099O824j2876p2824j7914j8731
14888B5068n7721R3141P5198J4775J2181R028N8837n9157r0240p6725o964J62960
14876A60381J21003o7360m3516p8707l7833p7292j59244l698J04982K3456k040
$$ plain form
14956 -158580 -133648 22837 -21958 -81432 -124986 -84103 -155052 -202877 -154909 -71061 -4953
14945 -4953 40551 25154 -85105 -78806 -64539 51404 143771 150747 -12285 -169950 -59068
14934 -59068 -64828 -164092 34934 115893 126879 122078 63288 211322 157943 -24509 -28234 -90434
14922 -90434 -16526 38285 -69620 9610 66442 146810 138597 146219 182301 276302 360390 268449
14910 268449 19823 -177407 -278919 -289586 -230456 -88133 -53075 54146 60705 70997 7099
14899 7099 -7008 42097 207557 60780 19490 140589 147413 134537 61713 43799 25068
14888 25068 -32653 60488 135686 150461 162642 171670 230507 171350 81110 4385 -2579 160381
14876 160381 281384 214024 170508 91801 53968 -23324 -182568 -186266 -81284 -57828 -59868
14865e9868r219P9712R6162J5009R3739N1100l6143l9348q7082n2472Q6712K9263
14853A67565p6199L0910L6372m5233r5954J14396R3214j15781Q317q6059J4364
14842D5912Q8128k35k5100j6335k0964L6438j4267L9445O7451l8101q7736m369
14830G0267k08650J0845J66849P4236J78418r0195r6664q03O0811j31482q5883
14819e2251l3947J23095K9622M7412o4462k3344M1337K0968o1506o4022J1619
14808b5479J1733n2235j62207J3636j4930K4126K0791J97932J2277j36193j0352
14797a20901j399n2046K8057K4825K20327O9694p8086j53375m846j50545j18259
14786c36554J04056J54913N6069O4272K1122Q0788k136p4007j49711j38922j34099
$$ plain form
14865 -59868 -69087 10625 106787 121796 215535 266635 230492 191144 104062 51590 138302 167565
14853 167565 91366 122276 158648 113415 17461 131857 225071 109290 117607 31548 45912
14842 45912 134040 133805 108705 92370 71406 107844 93577 133022 200473 162372 74636 70267
14830 70267 -138383 -127538 39311 113547 291965 201770 105106 104303 165114 33632 -52251
14819 -52251 -86198 36897 66519 113931 49469 26125 67462 88430 26924 -37098 -25479
14808 -25479 -13746 -65981 -228188 -214552 -229482 -205356 -184565 13367 25644 -110549 -120901
14797 -120901 -122300 -174346 -146289 -121464 98863 168557 90471 -62904 -67750 -218295 -336554
14786 -336554 -232498 -77585 -21516 42756 63878 144666 142530 68523 -81188 -220110 -354209
14775c54209P6221Q2792J24657L0859L6731k7979o7151P7184O5175n4818P8787
14764F8249n2658j38668o2081J07577K6155q6258J3887O7864M4422j66780J6081
14753a62210M3598j6063N2129M7347k5184J1539k1387K9839k550K8619R5163L7636
14741A18476j22642j49791j01655N1965P8981J32039J32391J05292l0527N7356
14731B71885J8660j56986M8180M8773K4612j0571n3034r5075n8161r105J60099
14720A89277J77841k88126j45744L1151M1437k6119n4309M9403J13639J50096
14710B38546k8494m7594l7990j52403P1735O3078p3243n7323J04256R293j77978
14699h8117m2134N9463J13433J478k1947P9414J8407N0528j58468j0094r726q4411
$$ plain form
14775 -354209 -277988 -195196 -70539 -39680 -2949 -30928 -98079 -20895 44280 -10538 68249
14764 68249 15591 -123077 -185158 -77581 -51426 -137684 -123797 -55933 -11511 -178291 -162210
14753 -162210 -118612 -134675 -82546 -35199 -60383 -48844 -70231 -40392 -42942 -14323 80840 118476
14741 118476 -4166 -153957 -255612 -203647 -124666 7373 139764 245056 214529 271885
14731 271885 290545 133559 181739 230512 255124 244553 191519 96444 38283 29178 189277
14720 189277 367118 78992 -66752 -35601 5836 -20283 -74592 -25189 88450 238546
14710 238546 210052 162458 124468 -27935 43800 106878 33635 -23688 80568 89861 -88117
14699 -88117 -130251 -70788 42645 44123 22176 101590 119997 170525 12057 1963 -7763 -92174
14687i2174Q2964K28438N0886K5667p1281j12492j15624k7691J20532J12542m4025
14676A57742q0024O269K893m9785n2726K24877m470j51356N3295m5990j29292
14665f8567K17730j15736n8953j49587M5M1981K38124J62233n4096r5475o7690
14654E0009l21k675J22386M3278J6567J7513j28724j43456J14396J26904q7748
14643A28129m4696p2303M5029J9682n7192l7399J7280K6463J786R6067o9289N0694
14631A04251R2367n7096j79829Q4716k0936l0871Q2924N4520K2697L3282R0235
14620B76260l9096j14136p8376j8845m254j3182J04584O6488J19983j9718j15182
14609A64526l9976K1676L0582j60330m7278K6533r1931j16182m9202p5719M0502
$$ plain form
14687 -92174 -9210 219228 270114 295781 224500 112008 -3616 -31307 89225 201767 157742
14676 157742 77718 83987 86880 37095 -15631 209246 204776 53420 106715 60725 -68567
14665 -68567 149163 33427 -25526 -175113 -175068 -133087 105037 267270 213174 117699 50009
14654 50009 49688 47013 169399 212677 229244 246757 118033 -25423 88973 215877 128129
14643 128129 83433 11130 56159 75841 18649 -18750 -1470 24993 26779 122846 53557 104251
14631 104251 196618 139522 -40307 44409 23473 -7398 75526 130046 152743 186025 276260
14620 276260 237164 123028 44652 25807 21553 8371 112955 179443 299426 279708 164526
14609 164526 124550 146226 176808 16478 -30800 -4267 -96198 -212380 -261582 -337301 -296799
14598b96799K07414J11433J59159P2555j39841m6488O7161l0110j09595O2241
14588E7130N4144L3622r1288n9888J11868P5005q6537r7226j22944m8304R7526
14577g6892R3915l0668j5996n2448k09943m4716O6453R6653K9089K5230L1960
14566h7363k423m7943O3875k9103p3474K2391q4857q3880J00107K5407J18337
14555g8926k7963N854J56863P4537M4954R4523L197R640j8532L6511j2557j76538
14543A11563j54174R463N5722m4596n2782M9207j1043k5329L7807m0874l5156
14532a00192n285N1825P5178J14359J04523L4639J044k42L0460j3849j04227j23545
14520F4688J073N4106o8144p6202J04658J9673M2001j9646J1497l8874m5312N8788
$$ plain form
14598 -296799 -89385 22048 181207 253762 113921 67433 134594 104484 -5111 57130
14588 57130 111274 144896 53608 -6280 105588 180593 94056 -3170 -126114 -174418 -76892
14577 -76892 17023 -13645 -29641 -82089 -292032 -336748 -270295 -173642 -144553 -119323 -87363
14566 -87363 -89786 -137729 -73854 -102957 -176431 -154040 -238897 -322777 -222670 -197263 -78926
14555 -78926 -106889 -101035 55828 130365 175319 269842 273039 282679 264147 300658 288101 111563
14543 111563 -42611 -33148 22574 -22022 -74804 -25597 -36640 -61969 -24162 -65036 -100192
14532 -100192 -105477 -53652 21526 135885 240408 275047 276091 275849 306309 292460 188233 64688
14520 64688 65761 119867 51723 -24479 80179 99852 141853 122207 133704 94830 49518 108306
14508A08306p66j57387m0873j9439j0163o1615l7654O5466J53998Q6648Q1408
14497A67929K1651k8542N66l3722n7806R9284j9423J27045p468j84878o9255K6198
14485D1579n9918m9414L5326k2899O2831n9780n7955N5613l9758n457J1585k9653
14473a17900J13982J8170q9665n3701K5228P6044j46541Q154J39078N6057Q1247
14462A10153M1522j47741n0134J06109M12q0296J61850P6710m3565p7070J15885
14451B13835N9306j3724m9247o7954j48111R9680M1566r718m622k5506j73316
14440g7811m0772K7372R8345L6977O2816K7882p7302o3208m7075K8768R236J3450
14428a322K2482K2715J7349m9325n0581p174J491L1417p6532l5562J25580R7682
$$ plain form
14508 108306 107540 -49847 -90720 -110159 -120322 -181937 -219591 -154125 -127 86521 167929
14497 167929 189580 161038 161604 127882 70076 169360 149937 276982 269514 84636 15381 41579
14485 41579 -18339 -67753 -32427 -55326 7505 -52275 -110230 -54617 -94375 -99832 -88247 -117900
14473 -117900 -3918 14252 -75413 -129114 -103886 -27842 -174383 -166229 -27151 28906 110153
14462 110153 151675 3934 -46200 59909 60321 -19975 141875 218585 175020 97950 213835
14451 213835 273141 259417 210170 142216 -5895 93785 135351 125633 121011 95505 -77811
14440 -77811 -118583 -91211 7134 44111 106927 134809 57507 -5701 -52776 -24008 -14772 -1322
14428 -1322 21160 43875 61224 11899 -38682 -45856 -44365 -12948 -89480 -125042 538 98220
14416I8220k5772R1571M3651L0248n0273M3244m0574k14320J5440J67409P7906
14405B36750J10300L4154l3205m9240r5392K0095r0683n2242n4719R1099p0708
14394D6209m8774K47280q6550j97034K87l6240J1150J76715Q2986J878o9155r9865
14382B8887L8252n9230N3898k1086j6080m1608P3824O7841j7810j03755m1591
14371c8458J9863k1752m2524J09562J35787j05841n1018p0700q8288o5953Q0106
14360a39216P282J27564J66961o0595j6797m8467k7525Q6618j7245l2459K5886
14349G2007n1776M2519J81672L5017j09030L9912J10988j5593j20572j78189j65108
14338a58153J82985N1209j14315J12291J42018j4852m3754j27940p193j8389O431
$$ plain form
14416 98220 72448 164019 207670 237918 187645 230889 190315 -24005 -8565 158844 236750
14405 236750 347050 381204 347999 298759 203367 223462 132779 80537 25818 116917 46209
14394 46209 -2565 244715 158165 -38869 -38582 -74822 -63672 113043 196029 197907 128752 28887
14382 28887 67139 7909 61807 40721 24641 -16967 56857 124698 106888 3133 -38458
14371 -38458 -18595 -40347 -82871 26691 162478 56637 5619 -65081 -153369 -219322 -139216
14360 -139216 -131934 -4370 162591 101996 85199 36732 9207 95825 78580 46121 72007
14349 72007 20231 62750 244422 279439 170409 210321 321309 305716 185144 6955 -158153
14338 -158153 24832 76041 -38274 74017 216035 201183 157429 29489 22296 3907 10338
14327A0338O6434J53673L156o403o7252j48851J1324j18451k4322L0978J47263
14316E7887J13017o0064L0722j70056J3469j1012n5618o7093Q2551P1218P8269
14305H3290K7175K0893Q792j03969K4294k0593o816N4679q8918J0568P2467L2943
14293A14805l0742j294p3176o5476j1749J44247o5764N4215R2046k2753q9798
14282D4561P0985M0259m886m0621m66N0417O1864j62724p0436j62278p6173J58802
14270i0696j5637J9598k8841l2221P3364J41111n2482k2925K4185J05108r5315
14259B5249j71347n0355P037J52526k6816N6223J05066j6727L2457Q1382J7429
14248B12124j28606o4982n6721O3847P3741N8364p6259p3313m3466j48939O5335
$$ plain form
14327 10338 76772 230445 233601 227198 159946 11095 22419 -96032 -120354 -89376 57887
14316 57887 170904 110840 141562 -28494 -15025 -26037 -81655 -148748 -66197 5021 83290
14305 83290 110465 131358 140150 36181 60475 39882 33066 87745 -1173 9395 81862 114805
14293 114805 84063 82769 9593 -55883 -67632 76615 10851 65066 157112 134359 44561
14282 44561 115546 155805 150919 110298 109832 160249 222113 59389 -11047 -173325 -249498 -90696
14270 -90696 -106333 -86735 -115576 -147797 -74433 66678 14196 -8729 15456 120564 25249
14259 25249 -146098 -196453 -189416 -36890 -63706 -7483 97583 80856 113313 194695 212124
14248 212124 83518 18536 -38185 25662 99403 157767 81508 8195 -35271 -184210 -118875
14237a18875J07954j0619J4297N2183J7316M5482j7969n7506q5593P4246P2240
14226I3156P5032M8916j3812m7991m2514J45616l6079q3861q3370k6887O6963
14215I5169n6591j5074p2331R5089R3708j4617q7083L968k9223o618J45429J0186
14203A62012k20953m3288J15703n5379l2606O3481L6989K4254j8531L3332o8056
14192c042l8138N3493L3174q7672j35124N3542R1839O5357l7214J07121j6919
14181H6417k4071m4350j3001M6574L0395j5896K0754r8162j68879P2932J27113
14170A9826J70588R119o6827Q3429K9323j63095n4426l6233j3558O3541j8109
14159B3578l0683J3182O6307J46365O378j54321k3722J42822J62656N7996k6847
$$ plain form
14237 -118875 -10921 -21540 -7243 44940 62256 107738 89769 32263 -53330 20916 93156
14226 93156 168188 217104 203292 155301 112787 258403 222324 138463 55093 28206 95169
14215 95169 38578 23504 -48827 46262 139970 125353 38270 42238 13015 6397 151826 162012
14203 162012 -58941 -102229 13474 -41905 -74511 -11030 25959 50213 31682 65014 -3042
14192 -3042 -41180 12313 45487 -42185 -177309 -123767 -31928 33429 -3785 103336 86417
14181 86417 62346 17996 4995 51569 81964 66068 86822 -11340 -180219 -107287 19826
14170 19826 190414 199533 132706 216135 245458 82363 27937 -8296 -21854 41687 23578
14159 23578 -7105 6077 72384 218749 225127 70806 47084 189906 352562 410558 383711
14148C83711L5794r2624j67658r7862M2421M0231J5479J7046k4764K4729n8427
14137A18076J08276n8350l1774J3601O4139j2506k682j0883J436k3764l4985J1291
14125A41875M3737K0823p1293j1788k9157J6442N6508O8363j56730j91176m6071
14114a58467Q9082N7383P9940L5394N843m4239n3m1796K9475K6051r135n781J34857
14101A98554p6965m5980J0123n9552j50885k9611K57520J01755j48748j13742
14091e7531J13531P4306o6680m715J01436n8362j82237j362l3022J8564K8512
14080f7560j0021j2161J3523l2502N190N8877j2673J0198L1366O35J21837L0645
14068A37354M8878N846j27769n2853k1596J63493J63414L1268k9090l3442j04103
$$ plain form
14148 383711 419505 326881 159223 61361 103782 144013 159492 176538 151774 176503 118076
14137 118076 226352 168002 136228 149829 213968 201462 198780 187897 189333 165569 130584 141875
14125 141875 185612 206435 135142 123354 94197 110639 167147 235510 78780 -112396 -158467
14114 -158467 -69385 -12002 67938 103332 109175 64936 64883 23087 52562 78613 69478 63697 198554
14101 198554 121589 75609 85732 26180 -124705 -154316 103204 204959 56211 -57531
14091 -57531 56000 130306 63626 58911 160347 101985 -80252 -81614 -114636 -96072 -67560
14080 -67560 -77581 -89742 -76219 -108721 -103531 -44654 -57327 -47129 -15763 -15128 106709 137354
14068 137354 186232 192078 64309 11456 -10140 153353 316767 348035 318945 285503 181400
14057A81400r4966r6590K9360J51576K3876j26106j9569J1103O5015N7771N6354
14046B39224N3831n0733J9247L699j41188j89774m5016J42101N7853R308O4084
14035A62636O3448n1201m9821m2155l850o3636k351j14229N9164p1161N0464J02404
14023C9712R145Q8317K1784o538J10938p595j46194j46328n6769J5283R7683n4619
14011c5181M5327R9759P5377P673j63888p3677M3188J42897j2411j54224j41851
14000a67011P6172J57026P5115m0346q3889O2308P5840P1774N227N6560J46558
13989D35334j18171q5546P2346o1197j9873m797m7922j1489J7959j7472J0647
13978A69819J70739l368J0527j12741m0494o5503j11842M1993k0550j05520j3282
$$ plain form
14057 181400 86434 -10156 19204 170780 194656 68550 48981 60084 125099 182870 239224
14046 239224 293055 242322 261569 265268 124080 -65694 -110710 31391 89244 98552 162636
14035 162636 226084 174883 125062 82907 79057 15421 13070 -101159 -41995 -113156 -62692 39712
14023 39712 48857 137174 158958 152420 263358 255763 109569 -36759 -93528 -78245 19438 -35181
14011 -35181 10146 109905 185282 192955 29067 -44610 -1422 141475 129064 -25160 -167011
14000 -167011 -90839 66187 141302 100956 17067 79375 155215 226989 232216 288776 435334
13989 435334 317163 231617 303963 242766 222893 218096 170174 158685 176644 159172 169819
13978 169819 340558 337190 347717 234976 194482 128979 17137 59130 38580 -66940 -80222
13967h0222J03797N741k6097q5660O527J23968L7365N4309N4525L2034q0691M5826
13955A91422j3897j06759j79777P4842J50777J54131P0745J329o9088j18465k1532
13944A33728m1778o3817p806J5202P9209Q3245N3647n0264m6368N7880k284m3152
13932A67442l7443m6101k2124j1918R9525k6754p2401K3748M912k1480O5395M72
13920A23273J1162O648o8593p7366L9160J13956J57715P6480j07214r1768o483
13909A76970j3966j48857J0892m0121o7613J09616J11597Q2162p9654K0001n1084
13898A09943M3586k8363m0739J4831R9748j13927j9228O1094l7844j33242j1387
13887e5528j9517O1594J21977J09317J02928J27035K928j3883j70930j45786M701
$$ plain form
13967 -80222 23575 29316 3219 -82441 -75914 48054 85419 139728 194253 226287 145596 191422
13955 191422 177525 70766 -109011 -34169 116608 270739 341484 342813 273725 155260 133728
13944 133728 91950 28133 20327 35529 114738 197983 251630 201366 154998 212878 210594 167442
13932 167442 129999 83898 61774 49856 149381 122627 50226 73974 78886 57406 122801 123273
13920 123273 134435 141083 72490 -4876 34284 148240 305955 382435 275221 183453 176970
13909 176970 163004 14147 25039 -15082 -82695 26921 138518 220680 141026 161027 109943
13898 109943 153529 125166 84427 99258 199006 85079 65851 126945 89101 -44141 -55528
13887 -55528 -75045 -13451 108526 217843 320771 447806 450734 436851 265921 120135 124836
13876A24836j1484j3110n4671J09911J45439k9157r9495r6481J5452n531j5339
13865G0370J04130k0203j11605j09452J28110L9565J00575q292l411k6283O8469
13854B31973J6934j02504l4517o125N7076L4599R5777o8833o3978K4898j65832
13843A9468q4259J35J29206O0374o9649o5256O948O4580J23440P1803K6854j67400
13831A16244o0927R2580J36037q1714j2370o3215p5205O8577J2262O344m551m709
13819A29353m3152k1584o26j21648o4878J10266J02615J86940o3301m4595j13069
13808E6321j15098m9975J1022R6057M2242J2755q6374N1709j4692p9504l6722
13797a12259J2237L1928M0043k7167N0160j960K28621J72180P1609q9008j87679
$$ plain form
13876 124836 113352 100242 45571 155482 300921 271764 172269 75788 91240 85709 70370
13865 70370 174500 154297 42692 -66760 61350 100915 201490 193198 189787 163504 231973
13854 231973 248907 146403 111886 105761 162837 197436 293213 224380 160402 185300 19468
13843 19468 -64791 -64656 64550 124924 55275 -9981 -3033 61547 184987 256790 283644 116244
13831 116244 55317 147897 283934 202220 189850 126635 51430 120007 132269 138613 134062 129353
13819 129353 86201 64617 63991 -57657 -122535 -12269 90346 277286 213985 169390 56321
13808 56321 -58777 -108752 -97730 -1673 40569 53324 -33050 18659 3967 -75537 -112259
13797 -112259 -100022 -68094 -28051 -55218 -5058 -7018 221603 393783 465392 376384 188705
13786A88705J6635J19478J30474J3504l4325j83050O6526J35686P8532o4914n5008
13775D12243q4103P3921j56420l794J12480o849j0146O914p1920j17127M1407
13764A96606n6965j35388r4496l2106J04229J08220K6354N2499p2864l6687l0644
13753B8758j31349j95085m441K18794J55734R6278p3298m468J68814J37197p8567
13742C18367n1176m9817k26514n6007p3215k2859P8007J19227J38623M7804n1280
13731A71160M014m1942O8602p2630q9532K1336O8601N447N690m0509k3237j329
13719G5671m7061O2485O6122o6487L3728L7815L489R2265J34935o1190k24269
13708A07503r4798P3139J21637R5990j63979j65118m4750M1686J31307K0615r2779
$$ plain form
13786 188705 205340 324818 455292 468796 434471 251421 317947 453633 532165 467251 412243
13775 412243 328140 402061 245641 241847 354327 347478 337332 344246 272326 155199 196606
13764 196606 139641 4253 -90243 -122349 -18120 90100 116454 168953 96089 59402 28758
13753 28758 -102591 -297676 -302117 -83323 72411 168689 95391 90923 259737 396934 318367
13742 318367 267191 217374 -9140 -65147 -138362 -161221 -83214 36013 174636 222440 171160
13731 171160 175174 133232 201834 129204 39672 61008 129609 135056 140746 100237 77000 75671
13719 75671 28610 91095 157217 90730 124458 162273 165762 258027 392962 331772 107503
13708 107503 12705 85844 207481 303471 139492 -25626 -70376 -28690 102617 123232 30453
13697C0453M6260M9980m3611m3819m0790j4153Q9984L2763k059R9979r896J5174
13685B10265k0171Q5199l2080m671J56052q08j28281o7205m4799p8622N4060m4607
13673H4332J32421P4058o8373p8761l6568o1341l8452M5928J9260n2403L0772
13662E0873J46686P2184r3924M8032R6121Q5472n1185j65549j80630m8115N7068
13651A7033l6539r2530m684J52653Q9467J46099J03513K6653O9306m8546K9034
13640D51459k4585j57483k38850P7547Q274j49915l0567J13183K3320J02024N7631
13629B32038p1879o177j87244M5247n3810n8305M7055Q5408o5654R2243p0615
13618a1693l171J03038L036r7008j1074K2957J37427P3221R0173n3476j40292
$$ plain form
13697 30453 76713 126693 83082 39263 -1527 -15680 74304 107067 105008 204987 195091 210265
13685 210265 190094 275293 243213 238542 394594 393786 265505 198300 153501 74879 128939 84332
13673 84332 216753 290811 222438 143677 107109 45768 7316 53244 72504 20101 50873
13662 50873 197559 269743 175819 223851 319972 405444 354259 188710 8080 -40035 17033
13651 17033 -19506 -112036 -116720 35933 125400 271499 375012 401665 470971 422425 451459
13640 451459 426874 269391 30541 108088 116362 -33553 -64120 49063 72383 174407 232038
13629 232038 160159 153982 -33262 11985 -41825 -100130 -53075 32333 -33321 58922 -11693
13618 -11693 -14864 88174 91210 -5798 -16872 6085 143512 216733 306906 253430 113138
13607A13138j22997j07527O3652J77077L135J38L5590J8848M3722P8585j3334
13596B90027q1901q2103M8804P7894L3483p8011P3621m2032J31148p6932n8127
13585B35871r4689N0257k977K9960J7873m0907q6250n940M2980m4867J32490K5290
13573B59091k05079N2926J06251K6841o8540n9539L9297J32104K9763j38370q9804
13562H4941Q7408O2596K6935M9485j7508l4668p9588o9211R825Q0414K7763O1452
13550B89844m0229j2237l9841L0251J28998l6205n7895R3346L6019J4531j6565
13539C90017L0297l6210j22510l2289J29701j9745j3797l1324l4874l2300n0972
13528A75994P8536R8675N1028P953k264q6524j77015l4734Q9078j9962j5231M5668
$$ plain form
13607 113138 -9859 -117386 -53734 123343 126478 126616 162206 181054 224776 303361 290027
13596 290027 208126 126023 174827 252721 286204 208193 281814 239782 370930 293998 235871
13585 235871 141182 191439 188462 218422 236295 195388 109138 103198 146178 101311 233801 259091
13573 259091 54012 106938 213189 240030 171490 111951 151248 283352 313115 174745 84941
13562 84941 172349 234945 261880 311365 293857 259189 179601 110390 120215 200629 228392 289844
13550 289844 249615 237378 197537 227788 356786 320581 262686 356032 392051 406582 390017
13539 390017 420314 384104 261594 229305 359006 339261 325464 294140 259266 226966 175994
13528 175994 254530 353205 404233 412186 409922 323398 146383 111649 200727 180765 165534 211202
13516B11202L0734j42892p5847j7842J02727r2095m8000J29136Q613p1176o4630
13505c0070K4702L135K3162L12O950J05288O1025q5916O5037N8862j13035J23428
13493B42880m7086l2848J6824L2342P8332N2825M7550L2563n1853j55783j9912
13482A95834j50875k7216l675N9965M4209l8024m988k4330o3512L1062J54281
13471A72731O4747q412L9201N8861M4019M8099J1980j23272j39660J01479J10233
13460C80006j2153p5056l1272j03101r6542J04691K6572n6732k5972j47404N2475
13449A5512J09420K1262J25047P0000M652m8684k0205p2671j0440O6337k7295
13438B32935k953R7629L4990o15m5225l5694r7499j25656k6543J76170J20028
$$ plain form
13516 211202 241936 99044 23197 5355 108082 15987 -32013 97123 105736 34560 -30070
13505 -30070 -5368 -2233 20929 21241 28191 133479 194504 108588 173625 232487 119452 242880
13493 242880 195794 162946 179770 212112 290444 343269 390819 423382 371529 215746 195834
13482 195834 44959 17743 14068 74033 118242 80218 75230 50900 -12612 18450 172731
13471 172731 237478 229066 268267 327128 371147 419246 431226 307954 168294 269773 380006
13460 380006 367853 292797 261525 158424 61882 166573 193145 136413 110441 -36963 15512
13449 15512 124932 146194 271241 341241 345893 297209 277004 204333 193893 260230 232935
13438 232935 229982 327611 362601 361986 316761 281067 183568 57912 31369 207539 327567
13427C27567j16186q1555J15824J68250N7920l3823J2276K4392j29691l6433o8921
13416B39620j26383N9965J01720K14914m145n6836j18349j04107J4129P2587n6473
13405B36642O3077l8224j6067J7119J11441O5337O5279j35342j92062J2363Q5636
13394B75199j19448q4283P3070P4726J2190o0011R1500q0540J3726n2801o5936
13383G7392K4182K81705P919Q6933M6181j30918p0023L4138J78333K7274K0266
13372E83382J0902q1604j68258j51931k6881K24354o7400o3094o6626L1801J6523
13361B41168J0680J64319P6954K2605q9482j19198M733o7457m1174Q1668J22303
13350D07119M7824j82176l6228j8443m7128l3016O1853J9358j6578O3450P1905
$$ plain form
13427 327567 211381 129826 245650 413900 471820 437997 450273 474665 344974 308541 239620
13416 239620 113237 173202 274922 489836 485691 428855 310506 206399 220528 293115 236642
13405 236642 299719 261495 245428 262547 373988 439325 504604 369262 177200 189563 275199
13394 275199 155751 71468 144538 219264 231454 171443 262943 182403 196129 143328 77392
13383 77392 101574 383279 391198 478131 524312 393394 323371 357509 535842 563116 583382
13372 583382 594284 512680 344422 192491 165610 389964 322564 259470 192844 224645 241168
13361 241168 251848 416167 493121 515726 426244 307046 311779 244322 203148 284816 407119
13350 407119 454943 272767 236539 218096 170968 137952 199805 219163 202585 266035 337940
13339C37940m2622r1553N9683m0869Q945j7342n5761J00797l327m697r2929O1219
13327B19484J630K7808r197j17443l6796Q1663R1505l3619j0620M5978N775p8336
13315A87832J9966P3139k4752o2296j02880M5170k133J4597L6810k0338J6389
13304A81504M1996m6785J84208K666l0588l8280r6398q3342m0115R876J04456
13293A89198l6904J2810j0751j4326M5614J99501J54262o2740j71892q5985Q4366
13282C03153J13627R1657q6156j83474R3973P9450p9676j55778j14828K9103Q5081
13271A76132J81931q3643j65709j11630L3767Q6153K2009l8299K7346j16402N4118
13260F5773P4633J85073l6901q2510l4243L3396r5135j24210L0775O7272J23689
$$ plain form
13339 337940 295318 203765 263448 222579 231524 214182 158421 259218 255891 251194 158265 219484
13327 219484 221114 248922 239725 122282 85486 167149 258654 225035 214415 260393 266168 187832
13315 187832 207798 280937 256185 193889 91009 136179 134046 148643 185453 165115 181504
13304 181504 223500 176715 360923 363589 333001 294721 198323 114981 74866 84742 189198
13293 189198 152294 165104 154353 140027 185641 385142 539404 476664 304772 218787 303153
13282 303153 416780 508437 422281 238807 332780 412230 332554 176776 61948 91051 176132
13271 176132 358063 274420 108711 -2919 30848 117001 139010 100711 128057 11655 65773
13260 65773 140406 325479 288578 206068 171825 205221 110086 -14124 16651 83923 207612
13249B07612K7176J1571J46781L2698n9300M1921j15813j33131J25372J61063
13239D45950N4693K6016j1182J13980n4973k94975j25427M3390L8921N9102k3823
13228B71672o8842O7297R1267L6002L1562O1598p3064j91779j03058j8335J9233
13217A23553J99878m4584l1249N724J47116P4610j08946j83063J58425K809m0126
13206C04147K830J33535J18879p1701p2005o4371m9355o7262O6310p399k6048
13195B67560j1992q4871J62475J13069M5086J3041j85600l3125J12267K3959p0589
13184C51280j35658o2693N2443J7972L6740J3216P1423J34604J2812J03606j21059
13173D74686j15425m3784j752P968N2380P3271Q7319p3266n8755k9865R0049J0883
$$ plain form
13249 207612 234788 246359 393140 425838 366538 408459 292646 159515 284887 445950
13239 445950 500643 526659 515477 629457 574484 279509 154082 197472 236393 295495 271672
13228 271672 202830 270127 361394 397396 428958 490556 417492 225713 122655 104320 123553
13217 123553 323431 278847 247598 253322 400438 475048 366102 183039 341464 344273 304147
13206 304147 306977 440512 559391 487690 415685 351314 301959 234697 301007 293608 267560
13195 267560 255568 170697 333172 446241 491327 504368 318768 285643 397910 421869 351280
13184 351280 215622 152929 205372 223344 260084 273300 344723 479327 492139 595745 474686
13173 474686 359261 315477 313725 321693 374073 447344 534663 461397 402642 372777 462826 473709
13161D73709r4438m870P3534r0211n0642N6343o2572Q9498J28611k1055M4088
13150E41995k1584r2112j20825J2329q2272k1484K6705Q3050O9117j10394J28052
13139D12577P8614r9923j21655J7093n0671K7026J93722J3880o3259j65256J28387
13128C70535J18342n5608j30435J38600k0884p9649K60375k0995j14976J72079
13118F37384j08718j01360K6718l3107j22447l2209Q2050q9850q6763P8802j0834
13107B39666n0888N0442o0052J23585K07994l881l7099n0479M5866O5845O6006
13096E97005K6253K1765L1416r8872K6277P6719L3982o8537J1629o3481p1085
13085E23071j42927N6997J1130K2205J56092J03273j78816k7392l7872k9186P3839
$$ plain form
13161 473709 379271 374401 447935 357724 307082 363425 300853 390351 518962 497907 541995
13150 541995 520411 428299 307474 319803 237531 216047 242752 325802 394919 284525 412577
13139 412577 491191 391268 269613 286706 236035 263061 456783 470663 407404 242148 370535
13128 370535 488877 433269 302834 441434 420550 340901 601276 580281 465305 637384
13118 637384 528666 427306 454024 420917 298470 266261 348311 258461 171698 250500 239666
13107 239666 188778 239220 179168 302753 510747 506866 469767 419288 465154 530999 597005
13096 597005 623258 645023 676439 577567 603844 680563 714545 646008 657637 594156 523071
13085 523071 380144 437141 448271 470476 626568 729841 551025 523633 485761 456575 530414
13074E30414J8256N3818M4607m9149M1500N3555j56548o8627p441N9902J06371
13063F26658O0095N2917k8624j38206j14147j3229N4557K74603L0570j40138j49076
13052E15980J37335J36117p3547L0628R2020m9462J6182o279l6774J8212j56183
13041F24229L0612J1032O2618J01818J06064N3609J7065k1605J23857P8136O5587
13030A253022p7423O1227K02637J5543j01246N2787J29539J7039r8884j52929
13020A301312P0312J58910n517J06318P819r3644p5953J294J3238N4497l0905
13009A507681k204P7764P7569l4365l8903K8779Q5005R2714o1608j1552N3429
12998A774309M2356k2728J20002J34347m3823j01790o7618l4649j55881o7163
$$ plain form
13074 530414 548670 602488 647095 597946 639446 693001 536453 467826 460385 520287 626658
13063 626658 686753 739670 711046 572840 458693 445464 500021 774624 805194 665056 515980
13052 515980 653315 789432 715885 746513 838533 789071 805253 798974 762200 780412 624229
13041 624229 654841 665873 728491 830309 936373 989982 1007047 985442 1109299 1187435 1253022
13030 1253022 1175599 1236826 1439463 1455006 1353760 1406547 1536086 1553125 1454241 1301312
13020 1301312 1371624 1530534 1525017 1631335 1639154 1545510 1469557 1470851 1484089 1538586 1507681
13009 1507681 1505477 1583241 1660810 1626445 1587542 1616321 1701326 1794040 1732432 1720880 1774309
12998 1774309 1816665 1793937 1913939 2048286 2004463 1902673 1835055 1800406 1644525 1577362
12988A577362K01624m0532o5410J040J6359K2090L2185N3831l3035j26285r5354
12977A543875j29990j31821P0354J65561J8908J16366k0339K7965K0079j25219
12967A555739q3525J12877M893P0446J02761M980o6665o5252L2934j07646j46276
12956A415266j14284j10024j69338n6637J38035k4770J07353n6047k36526o7194
12946H25834N1350l3270j5894j1548m5021k4681p772p4548M8319L7478L3348J15565
12934H99160q8167q1663J07443j0962Q3319p5872j04168p081K8958p236k7873
12923G15858J00350Q7526o4060J5673Q1707j2234j17476K341P8577Q441M0710
12912I37413O7054O43m8215q3028q0657K3538k5208J642J524p5412N9252O759
$$ plain form
12988 1577362 1778986 1738454 1673044 1674084 1690443 1712533 1744718 1798549 1765514 1639229 1543875
12977 1543875 1413885 1282064 1352418 1517979 1536887 1653253 1632914 1660879 1680958 1555739
12967 1555739 1472214 1585091 1589984 1660430 1763191 1768171 1701506 1636254 1669188 1561542 1415266
12956 1415266 1300982 1190958 1021620 964983 1103018 1078248 1185601 1129554 893028 825834
12946 825834 877184 843914 828020 816472 771451 746770 738998 664450 712769 750247 783595 899160
12934 899160 810993 729330 836773 825811 909130 833258 729090 722009 750967 743731 715858
12923 715858 816208 903734 839674 855347 937054 924820 807344 809685 888262 896703 937413
12912 937413 1004467 1005110 956895 873867 793210 816748 791540 793182 794706 719294 778546 785305
12900G85305j2964q3302l9412J76059J76344k02542j85522l523L0876R9541N8279
12889G99139J3910O7061l0916J38024Q1081m2108p7158J11578j61656l4108l8095
12878H26752q8863J11350j0946J20772P3541j16042j25652l6848J09010J7099
12868H80173q3302j20844q3610K8703J61662J49275p245j61359j70881K8567M6304
12857F67443K2403o6044l2697P9883J10290L9098J1479R8238j8961K0536R7919
12846A029587L972K2647P7003O678j00975j44175n0223L849K24668L3927P0354
12835A177312n901o3361j10083l8836l6772O0835l0315N3209J1130J26997J06782
12824A250997j3551J15116J3103k40528n2296R7044L7715j42257r7748M0302O0123
$$ plain form
12900 785305 772341 689039 649627 825686 1002030 799488 613966 610443 641319 740860 799139
12889 799139 813049 880110 849194 987218 1068299 1026191 949033 1060611 898955 864847 826752
12878 826752 737889 849239 838293 959065 1032606 916564 790912 754064 863074 880173
12868 880173 796871 676027 592417 621120 782782 932057 924812 763453 592572 621139 667443
12857 667443 689846 623802 591105 670988 781278 820376 831855 930093 911132 931668 1029587
12846 1029587 1033559 1056206 1133209 1139887 1038912 894737 844514 848363 1073031 1106958 1177312
12835 1177312 1171411 1108050 997967 959131 922359 983194 952879 1006088 1017218 1144215 1250997
12824 1250997 1237446 1352562 1365665 1125137 1072841 1169885 1207600 1065343 967595 1007897 1068020
12813A068020R0438P425J26378m4175J5354Q295R431J50360J02247r3900l3346
12802A406527j23141M3334O7220N1931p0289k55336j08837J62756N1615J41523
12792A367303J2295j25114M6077O409K6264R2041J44518J9908m5057j65249j53846
12781A225549m7815k8987p5138K47069M7049j40360J0224l1022J718J04532O4933
12770A377752J05173N575j02812O0184o513O2714J0870N2854l5740k03222o8172
12759A258663K5884M0569R0482P8378n4096j33741j66398l103P3183J24148O3262
12748A397231k5172k8056j27874k2456N4559J65483J33488k8172Q1156R8694K0071
12737A718952p4038j1046j4142j7446j71594P0225r7164O6200J24503L3593O5716
$$ plain form
12813 1068020 1158458 1165883 1292261 1248086 1263440 1271735 1281166 1431526 1533773 1439873 1406527
12802 1406527 1283386 1326720 1393940 1445871 1375582 1120246 1011409 1174165 1225780 1367303
12792 1367303 1379598 1254484 1300561 1306970 1333234 1425275 1569793 1589701 1544644 1379395 1225549
12781 1225549 1177734 1148747 1073609 1320678 1367727 1227367 1237591 1206569 1208287 1312819 1377752
12770 1377752 1482925 1488500 1385688 1445872 1439359 1502073 1512943 1565797 1530057 1326835 1258663
12759 1258663 1284547 1325116 1415598 1493976 1439880 1306139 1139741 1136638 1209821 1333969 1397231
12748 1397231 1372059 1344003 1216129 1193673 1248232 1413715 1547203 1519031 1600187 1698881 1718952
12737 1718952 1644914 1633868 1619726 1602280 1430686 1500911 1403747 1469947 1594450 1628043 1693759
12726A693759k5813j29491l5629Q4239J62557J45150K1856Q169L3933m4699j00299
12715A813732J1105O4142J55953M4447P167N0392J91813J16499J15012K37735
12705B807997O5336j4654L1373q7718k5595k2842P0062j4451j41259J34791K19222
12694C022262K33694J28209j67685K2390M7389n0053o4296k38942j57337R045
12684B784676J671J23107L2219M2168j15257n7566J15214R5139O2496Q7688J02764
12673C274319o1380K2852J71151K36731K3595P038o6556j4250J18111N7854J8916
12662C788381p5184k225J24002Q1012m8309r1377k0265K09193J62705P9818n0240
12651D157511J22919R8938R0510Q1164k0235L9220J16243N5576j3296M1313L3003
$$ plain form
12726 1693759 1667946 1538455 1502826 1587065 1749622 1894772 1916628 1924797 1958730 1914031 1813732
12715 1813732 1824837 1888979 2044932 2089379 2096546 2146938 2338751 2455250 2570262 2807997
12705 2807997 2873333 2858679 2890052 2802334 2776739 2753897 2823959 2809508 2668249 2803040 3022262
12694 3022262 3255956 3384165 3216480 3238870 3286259 3236206 3171910 2932968 2775631 2784676
12684 2784676 2786347 2909454 2941673 2983841 2868584 2811018 2926232 3021371 3083867 3171555 3274319
12673 3274319 3212939 3235791 3406942 3643673 3667268 3674306 3607750 3593500 3711611 3769465 3788381
12662 3788381 3713197 3710972 3834974 3915986 3867677 3776300 3756035 3965228 4127933 4207751 4157511
12651 4157511 4280430 4379368 4469878 4551042 4530807 4570027 4686270 4741846 4728550 4769863 4802866
12640D802866R6117K34874J70534R8224J16218J25744J02551p6779l4524J38631
12630E774456K13160J57337O2245J55897K62371J30587J96646J35913J18632L1494
12620G238738J79067K47323K57093L84054K48177L81987M03462L17520M07553
12611A0064974L93794M61383M45591L58669L59031L90947N18472O79973P18227
12602A4391061O90435O83920Q12640J062322J099714J136845J301419J335897
12594B2514253J784863J833719K185369K517218K812290L035244L447288M077512
12586D4207756M772908N565620O645599P781894R315826J0950720J2722145J4388768
12578A16351236J5999204J7124627J7203279J5840023J3257870R303320M740980
$$ plain form
12640 4802866 4898983 5133857 5304391 5402615 5518833 5644577 5747128 5670349 5635825 5774456
12630 5774456 5987616 6144953 6207198 6363095 6625466 6756053 6952699 7088612 7207244 7238738
12620 7238738 7417805 7665128 7922221 8306275 8554452 8936439 9339901 9657421 10064974
12611 10064974 10458768 10920151 11365742 11724411 12083442 12474389 12992861 13672834 14391061
12602 14391061 15081496 15765416 16578056 17640378 18740092 19876937 21178356 22514253
12594 22514253 24299116 26132835 28318204 30835422 33647712 36682956 40130244 44207756
12586 44207756 48980664 54546284 61191883 68973777 78289603 89240323 101962468 116351236
12578 116351236 132350440 149475067 166678346 182518369 195776239 205079559 209820539
12571B09820539k44483m971797q063922r599410r611806q306106o282937l695404
12563A59044674j205642J114085L239133M815536O219632P290780P887363Q222122
12555A96627683Q406552Q546406Q121741Q012691P693924P217037O936986O796359
12547B58359379O173671N300838L843893J586865q35334l259522n463878o767543
12539B58938369p253750o691832n968355n164009m395727m062151m149096m572611
12531B16680838n265950n720254n955204n866293n489676m724927l506866k279468
12523A77872200n87358J990961M586513P151824R388133J0686053J0697446R513751
12515B31299523O475909J837077l690532r353704j4420888j8034810j9636156
$$ plain form
12571 209820539 209576056 204604259 196540337 186940927 177329121 169023015 162740078 159044674
12563 159044674 157839032 158953117 162192250 167007786 173227418 180518198 188405561 196627683
12555 196627683 205034235 213580641 221702382 229715073 237408997 244626034 251563020 258359379
12547 258359379 264533050 269833888 273677781 275264646 274429312 271169790 265705912 258938369
12539 258938369 251684619 244992787 239024432 233860423 229464696 225402545 221253449 216680838
12531 216680838 211414888 205694634 199739430 193873137 188383461 183658534 180151668 177872200
12523 177872200 177284842 179275803 183862316 191014140 200402273 211088326 221785772 231299523
12515 231299523 237775432 239612509 235921977 226568273 212147385 194112575 174476419
12508A74476419j9667959j8436961j6546587j4383515j2225072j0362813q705460
12501G4148052p381546o479154n575680m725614m030272l408236l172402k868249
12493C6506899k414094k272576j979188j844976j568183j462215j300934j322762
12485B2341971j089238r98312r70570q49767p79229p27593p62774o41398o52476
12476A4870614o74272n30791l10589l36054n89349m06000m86835m61339m21768
12467A0653617l93749m81118k71662k29026k52006l58740l43898j86276k54069
12458G883073l29277k45493k08586k04458k80798q8200k10260l07755j40102L0055
12448E898199j58942j18213j23791j78323j79703m0041J5297k05950j65874k24766
$$ plain form
12508 174476419 154808460 136371499 119824912 105441397 93216325 82853512 74148052
12501 74148052 66766506 60287352 54711672 49986058 45955786 42547550 39375148 36506899
12493 36506899 34092805 31820229 29841041 27996065 26427882 24965667 23664733 22341971
12485 22341971 21252733 20254421 19283851 18434084 17654855 16927262 16164488 15523090 14870614
12476 14870614 14196342 13665551 13354962 13018908 12429559 12023559 11536724 11075385 10653617
12467 10653617 10259868 9778750 9507088 9278062 9026056 8667316 8323418 8137142 7883073
12458 7883073 7553796 7308303 7099717 6895259 6614461 6526261 6316001 6008246 5868144 5898199
12448 5898199 5739257 5621044 5497253 5318930 5139227 5099186 5114483 4908533 4742659 4517893
12438D517893j12836m9325m5350j65167j34382j29386r6729j06573q9310L0605
12428C619440k8348n3681j06676M9798M1829k5949o5619j57932j7934k33511O9699
12417C091116J62971m5044j26127m5797j28812P113j14464o6059J58843n9243
12407B834497q9150n8192q6823n6839j18268j4012J44317J19360R5609N4953j3404
12396B812048K0020P1554Q6566N1749o6575j40593j73645o705n4966n8286j65028
12385B376139q7602j6004j95677n5858r8523j34511K6201m0519j18439O6695Q2198
12374A804100k2508J9013p5362j4543n958q3779M1221o7730j66621m4778J1693
12363A394748J02102M6755N7250N5646O5591L8106j88835j00558M1734M0482K6931
$$ plain form
12438 4517893 4405057 4355732 4310382 4145215 4010833 3881447 3784718 3678145 3588835 3619440
12428 3619440 3591092 3537411 3430735 3480533 3522362 3496413 3430794 3272862 3254928 3021417 3091116
12417 3091116 3254087 3209043 3082916 3037119 2908307 2915420 2800956 2734897 2893740 2834497
12407 2834497 2745347 2687155 2600332 2543493 2425225 2411213 2555530 2674890 2770499 2825452 2812048
12396 2812048 2832068 2903622 2990188 3041937 2975362 2834769 2661124 2654419 2599453 2541167 2376139
12385 2376139 2288537 2272533 2076856 2020998 1922475 1787964 1814165 1773646 1655207 1721902 1804100
12374 1804100 1781592 1800605 1725243 1710700 1704742 1620963 1662184 1594454 1427833 1383055 1394748
12363 1394748 1496850 1543605 1600855 1656501 1722092 1760198 1571363 1470805 1512539 1553021 1579952
12352A579952K2499j2483r2257j03368m5174p9242l6662N1629j29165P0580m4405
12341A181904J23485L6627q1693q3161o9172M1434M4892l0375P4341O7845j43660
12330A162467p4933r19l27Q9650K7820L3222r529L3788k4844M1901K5244j1955
12318A291585J4489L3268j47576q531R7925O6959j251j30072k39316j21786O1197
12307I16891M2878l9626M3088J36204o9057j79687O0482M1083O1608J92539p1645
12296A134758j78937o9480n741o2329P4402K15361J20330n5329J8325o2004o0411
12285A068945N362J30418n6643j23551r3541l8437p9235k1240O8031O0864l1392
12274H89581K0896Q1659M7811O4294j40343Q125J07866R4097j33104l6753J07382
$$ plain form
12352 1579952 1602451 1589968 1497711 1394343 1349169 1269927 1233265 1284894 1155729 1226309 1181904
12341 1181904 1305389 1342016 1260323 1177162 1107990 1149424 1194316 1163941 1238282 1306127 1162467
12330 1162467 1087534 1086615 1086288 1175938 1203758 1236980 1227451 1261239 1236395 1278296 1303540 1291585
12318 1291585 1306074 1339342 1191766 1183235 1281160 1348119 1346868 1216796 977480 855694 916891
12307 916891 959769 920143 963231 1099435 1030378 850691 911173 952256 1013864 1206403 1134758
12296 1134758 955821 886341 880600 818271 892673 1108034 1228364 1173035 1191360 1129356 1068945
12285 1068945 1074307 1204725 1148082 1024531 930990 892553 813318 792078 860109 920973 889581
12274 889581 910477 992136 1039947 1104241 963898 972023 1079889 1173986 1040882 1004129 1111511
12263A111511M1834j7418n5148K5637Q6662q8004K7512J04650o4833j08998j67574
12252H95831p9464q047O3711N4360J06239Q9817R1450P166M245Q6263j70319K5196
12240A166448J30364L8384l078j68596o4260l3579K00114R0638j71117o8146J7229
12229A134401O2245n1860j17947j48608q5534l9061K6929l3704R521P2768J03220
12218I32370J24550Q1407Q0655M022J5466L6950N032l4686Q2466K8326M1220j961
12206A395817n7313j23964m093K989R7410Q4215N5499l4177r5817p1501l216R3957
12194A339806r8571k9579J6866j03891O2956Q4348M7041J2909m7697L7408m0234
12183A281362P5993J69432N1370P286K146j11762q5142J06058K01990K7590r0579
$$ plain form
12263 1111511 1153345 1135927 1080779 1106416 1193078 1105074 1132586 1237236 1172403 1063405 895831
12252 895831 816367 808320 872031 926391 1032630 1122447 1213897 1221063 1225308 1311571 1141252 1166448
12240 1166448 1296812 1335196 1332118 1163522 1099262 1065683 1265797 1356435 1185318 1117172 1134401
12229 1134401 1196646 1144786 1026839 878231 792697 753636 780565 746861 756382 829150 932370
12218 932370 1056920 1138327 1218982 1223004 1238470 1275420 1280452 1245766 1328232 1356558 1397778 1395817
12206 1395817 1338504 1214540 1210447 1213436 1310846 1395061 1450560 1416383 1320566 1249065 1245849 1339806
12194 1339806 1241235 1211656 1228522 1124631 1187587 1271935 1318976 1331885 1284188 1321596 1281362
12183 1281362 1357355 1526787 1578157 1585443 1587589 1475827 1390685 1496743 1698733 1726323 1635744
12172A635744r9282j8758N7874J65915M4304j16782q4554j39403j1452J8252J05476
12161A557334k3856P6736j19517K3298J03426J89782J99716R5657n8433q1210
12151A962933p7541j40679m9164R2486K1171J9411M4091j167m5429j7542J47982
12140A956552L9360l416k9965o256K160K9650J11797M7951r845p2586q25O7975
12128B132552P3028N6282O7061j0868J66206J45318O7428q33J51658J18054K76386
12117C242272Q1881n2337J3055j20962r2359k1722n4739J9096P229J55826K7167
12106C204407k0846P5883K44283R7016Q3387k575k9661J33014J68429l543j28966
12095C820828p147J26512K68854Q7962m3593R9041J15341Q2087j26130l9649N0086
$$ plain form
12172 1635744 1536462 1517704 1575578 1741493 1785797 1669015 1584461 1445058 1433606 1451858 1557334
12161 1557334 1533478 1610214 1490697 1513995 1617421 1807203 2006919 2102576 2044143 1962933
12151 1962933 1885392 1744713 1695549 1788035 1809206 1828617 1872708 1871541 1826112 1808570 1956552
12140 1956552 1995912 1992496 1962531 1956275 1958435 1988085 2099882 2147833 2137988 2065402 2064577 2132552
12128 2132552 2205580 2261862 2328923 2318055 2484261 2629579 2697007 2696174 2847832 2965886 3242272
12117 3242272 3324153 3271816 3284871 3163909 3071550 3049828 2995089 3014185 3021414 3177240 3204407
12106 3204407 3183561 3259444 3503727 3600743 3684130 3681555 3651894 3784908 3953337 3949794 3820828
12095 3820828 3813681 3940193 4209047 4297009 4253416 4352457 4467798 4549885 4423755 4384106 4434192
12084D434192J95783N8093q2771R479P4525l1163K4072J45750R7077q6850r0025
12073D748162r7979K2250J41385j2219J6264N163N1813m8478J2019K397J04820
12062D945597Q7587J67727J62009P9074O8265J183J8677q1098M4140Q5167k5619
12051E552709j9186M1335L3312m6057q4864j47153K1976J80881J27286J4087M1643
12040E715969Q9237J56241J66887O367R3419R874P2079K04062P8758M7944J52521
12029F793358K36114K43453K5189Q7939K37143L15183J15046O1755l8521N5696
12019H132355J86155L16632O1201P3769K17741J65037J27609R0973J19256o359
12009I484369P8385J87194R4376J18892M5671K69984L57699J07378J57860O9060
$$ plain form
12084 4434192 4629975 4688068 4605297 4614776 4689301 4658138 4682210 4827960 4925037 4838187 4748162
12073 4748162 4650183 4672433 4813818 4801599 4817863 4823026 4874839 4826361 4838380 4840777 4945597
12062 4945597 5033184 5200911 5362920 5441994 5510259 5511442 5530119 5449021 5493161 5578328 5552709
12051 5552709 5533523 5574858 5608170 5562113 5477249 5330096 5352072 5532953 5660239 5674326 5715969
12040 5715969 5805206 5961447 6128334 6134701 6228120 6237994 6310073 6514135 6592893 6640837 6793358
12029 6793358 7029472 7272925 7298114 7386053 7623196 7938379 8053425 8115180 8076659 8132355
12019 8132355 8318510 8635142 8696343 8770112 8987853 9152890 9280499 9371472 9490728 9484369
12009 9484369 9562754 9749948 9844324 9963216 10008887 10278871 10636570 10743948 10901808 10970868
11999A0970868K01359M34636L18733L29349L04609J89531K05145J29562P5763
11990A3159555J63460L65837K63379J53676K93603K91474J62388J67549K44571
11981A5265492K16567J41017J75563L91332L50006K64337M48714L97686K54068
11972A7904782J37974J64980L30551L00464M79070M14187M13352K89233M82112
11963B0916705K96834L59163L50185J92962L31251L32165K96705L75034L82193
11954B3833197M21374M91667K11493L01902L08348L35365M70519M51584L89216
11945B7214665K56084P4675J55714K14917N9602L57780K88220L98424K21014J07562
11935B9348657J67064J45874J68136J70103p4208l3703r268k5029o0374J02136
$$ plain form
11999 10970868 11172227 11606863 11925596 12254945 12559554 12749085 12954230 13083792 13159555
11990 13159555 13323015 13688852 13952231 14105907 14399510 14690984 14853372 15020921 15265492
11981 15265492 15482059 15623076 15798639 16189971 16539977 16804314 17253028 17650714 17904782
11972 17904782 18042756 18207736 18538287 18838751 19317821 19732008 20145360 20434593 20916705
11963 20916705 21213539 21572702 21922887 22115849 22447100 22779265 23075970 23451004 23833197
11954 23833197 24254571 24746238 24957731 25259633 25567981 25903346 26373865 26825449 27214665
11945 27214665 27470749 27545424 27701138 27916055 27975657 28333437 28621657 29020081 29241095 29348657
11935 29348657 29515721 29661595 29829731 29999834 29925626 29891923 29882655 29857626 29797252 29899388
11925B9899388k3825n9459j55397k27165k39007k97772j84745j30427j63076l01246
11915B8117269k70212m04611m21587l65127j93287l18239l46311l67951l62959
11906B5066985l65858k45787l54780m39670l01443k52608l98175l87325m57190
11897B1864149l51168l53272m61197l87143l06143l32314k89868m28075l69176
11888A8585793l60535l20488l52314k78097m12671l34414l80651j35179j21906
11879A5889538l84518k78763l72205l24945k61655J37299k81142l80945k91692
11870A3450972k93054l44872l06355j73354k04455k14648l08941k16666k06326
11861A1182301j80618r2680m7135q5602k57984j92980j79009j71329j57556j40575
$$ plain form
11925 29899388 29875563 29816104 29660707 29433542 29194535 28896763 28712018 28581591 28418515 28117269
11915 28117269 27847057 27442446 27020859 26655732 26462445 26144206 25797895 25429944 25066985
11906 25066985 24701127 24455340 24100560 23660890 23359447 23106839 22708664 22321339 21864149
11897 21864149 21512981 21159709 20698512 20311369 20005226 19672912 19383044 18954969 18585793
11888 18585793 18225258 17904770 17552456 17274359 16861688 16527274 16146623 16011444 15889538
11879 15889538 15505020 15226257 14854052 14529107 14267452 14404751 14123609 13742664 13450972
11870 13450972 13157918 12813046 12506691 12333337 12128882 11914234 11605293 11388627 11182301
11861 11182301 11001683 10909003 10861868 10776266 10518282 10325302 10146293 9974964 9817408 9676833
11851I676833j66911k66544k12094Q5591o4873j42143k43055j03684k29080j59957
11841H174083M0067J995j29174k53051n6332j08311j00575n9744q6893j75743
11831G246322k34597q7657r8928k3888q1079O4051K8654q175k6474j43397j60990
11820F473842j17866k19401p8685O5240n026k02571j91541m3788Q2254p6635j26894
11809E558929j41670j53408j01931k493O1475j4778M552j44796j28689j30319
11799D806872p9895j65735j02407J474n9360L7829P6010N778l7416m1238r6024
11788D345888p822l175L3575L7063r5691o0822k2161j28154q2978j24346l2330
11777C859047P1307R8020J7437J856k0634j35986k49257j03920M7765J34024p6522
$$ plain form
11851 9676833 9509922 9243378 9031284 9116875 9052002 8909859 8666804 8563120 8334040 8174083
11841 8174083 8214150 8216145 8086971 7833920 7777588 7669277 7568702 7508958 7422065 7246322
11831 7246322 7011725 6924068 6825140 6801252 6720173 6784224 6812878 6804703 6778229 6634832 6473842
11820 6473842 6355976 6136575 6057890 6123130 6118104 5915533 5723992 5680204 5762458 5685823 5558929
11809 5558929 5417259 5263851 5161920 5159427 5220902 5206124 5210676 5065880 4937191 4806872
11799 4806872 4726977 4561242 4458835 4460309 4400949 4438778 4514788 4520566 4483150 4441912 4345888
11788 4345888 4338066 4334891 4368466 4405529 4309838 4249016 4226855 4098701 4015723 3891377 3859047
11777 3859047 3930354 4028374 4045811 4047667 4027033 3891047 3641790 3537870 3585635 3719659 3643137
11766C643137j5168N4563N7276J07691K5697q1989p1374j06311k8579J1734k9468
11755C567209P711l9296j85634j8971k2269P7464O2879K737l9626j265Q777n319
11743C414397N1665r8567p6993J25117n747Q1233l761o989l8980O6971K5948j41814
11731C392480j25073k9111J51894J49294J24313M8480M9109q7126K17837P4581
11721C966678j30162k9742M6417N7870K5432J05233N2087M1567J59209L9369m2404
11710D291554L0083k6651k5379n3447j46044J06786q9157j78995j39141M977M8814
11699C823400J83740P5986p9565j0493J82725R4116j36743K1010R575P3576j412
11688D235915Q5863R9926k3311j0684O3643M9723J18523L6864j6019R183J4213
$$ plain form
11766 3643137 3627969 3682532 3739808 3847499 3873196 3791207 3719833 3613522 3584943 3596677 3567209
11755 3567209 3574920 3535624 3349990 3331019 3308750 3386214 3449093 3451830 3412204 3410939 3419716 3414397
11743 3414397 3466062 3367495 3290502 3415619 3409872 3491105 3487344 3480355 3441375 3508346 3534294 3392480
11731 3392480 3267407 3238296 3390190 3539484 3663797 3712277 3761386 3674260 3892097 3966678
11721 3966678 3836516 3806774 3853191 3911061 3936493 4041726 4093813 4135380 4294589 4333958 4291554
11710 4291554 4321637 4294986 4269607 4216160 4070116 4176902 4087745 3908750 3769609 3774586 3823400
11699 3823400 4007140 4083126 4003561 3993068 4175793 4269909 4133166 4154176 4163751 4237327 4235915
11688 4235915 4321778 4421704 4398393 4387709 4451352 4501075 4619598 4656462 4640443 4649626 4663839
11677D663839J3719j2441k9120L3960p7061r3884M4216J78515Q1551P4702J25353
11666E003349L3170J3092N459J39588K50589K38527N6164L6486J11372J09623
11656E997419P8299J19521J71927k9732K62471J36917q136M3632j1723J22509
11646F883104K66791J68574J20127J95039J10573P8698J81297K31979K61343K25210
11636H722735L69461M19852L14816K91704K73188N10475N06241M42104L75818
11627A2226394N17325N70270M65328N03431O97282Q22422P59403Q10968J003090
11618A8375913J124619J106188J231159J298073J540680J739110J959649K264756
11610C0640147K650852L062480L420525L954507M422543N232429O120344P226185
$$ plain form
11677 4663839 4677558 4665117 4635997 4669957 4592896 4499012 4543228 4721743 4803294 4877996 5003349
11666 5003349 5036519 5049611 5055070 5194658 5445247 5683774 5739938 5776424 5887796 5997419
11656 5997419 6075718 6195239 6367166 6337434 6599905 6736822 6728686 6772318 6760595 6883104
11646 6883104 7149895 7318469 7438596 7633635 7744208 7822906 8004203 8236182 8497525 8722735
11636 8722735 9092196 9512048 9826864 10118568 10391756 10902231 11408472 11850576 12226394
11627 12226394 12743719 13313989 13779317 14282748 14980030 15802452 16561855 17372823 18375913
11618 18375913 19500532 20606720 21837879 23135952 24676632 26415742 28375391 30640147
11610 30640147 33290999 36353479 39774004 43728511 48151054 53383483 59503827 66730012
11602F6730012Q639142J0127987J1710503J3515026J5470382J6921109J7902542
11595A61016703J8175380J7068206J4685629J1107467O446037J303664l562837
11588B26240249p237789r399764r995353r360871p772181n261041k857151m41852
11580A73914247J451521L269448M388520M714662N046899M953131M988201M670356
11572B07396985M574832M671546M892695N355790N975786P032777Q072785Q645948
11564B56619144Q532104P316635M996317J973084j216105m209262o407768p932889
11556B59671260q446477q128726p799467p322483o967349p045415o976309o973820
11548B00011214o934609o749960o347016n738667n107410l923943j926126O0823
$$ plain form
11602 66730012 75369154 85497141 97207644 110722670 126193052 143114161 161016703
11595 161016703 179192083 196260289 210945918 222053385 228499422 229803086 226240249
11588 226240249 219002460 209602696 199607343 190246472 182474291 177213250 174356099 173914247
11580 173914247 175365768 178635216 183023736 187738398 192785297 197738428 202726629 207396985
11572 207396985 211971817 216643363 221536058 226891848 232867634 239900411 247973196 256619144
11564 256619144 265151248 272467883 277464200 279437284 278221179 274011917 267604149 259671260
11556 259671260 251224783 243096057 235296590 227974107 221006758 213961343 206985034 200011214
11548 200011214 193076605 186326645 179979629 174240962 169133552 165209609 163283483 163344306
11540A63344306K001482M494309O336541P648489Q261161P972153O033894L016556
11532B09108891p67042n176988r363566j3057882j5461638j6264396j6112810
11525A32904569j5215616j3682683j1882020j0151304q721497p411734o343534
11518E9496181n452574m676307m037152l505839l216168k992550k373802k085831
11510C1155958j947377j834365j644008j427502j292587j198177j071466r70810
11502A9769666q49854q51398q07443q38711o22532o04412o33279m44833o10182
11493A3507022o05481n70545m27235m48497l60837l49278l26057l96487m17488
11484I605117j86329l74752l56287k92919j20334j88202k75467k59692j80399
$$ plain form
11540 163344306 165345788 169840097 176176638 183825127 192086288 200058441 206092335 209108891
11532 209108891 208341849 203164861 193801295 180743413 165281775 149017379 132904569
11525 132904569 117688953 104006270 92124250 81972946 73251449 65839715 59496181
11518 59496181 54043607 49367300 45330148 41824309 38608141 35615591 33241789 31155958
11510 31155958 29208581 27374216 25730208 24302706 23010119 21811942 20740476 19769666
11502 19769666 18919812 18068414 17260971 16422260 15799728 15195316 14562037 14117204 13507022
11493 13507022 12901541 12330996 11903761 11455264 11094427 10745149 10419092 10022605 9605117
11484 9605117 9418788 9044036 8687749 8394830 8274496 8086294 7810827 7551135 7370736
11475G370736k12785k72524j89351j37395j71334k17982k74084k00685j80883
11466E513713j50911j58228j85457j01688K9994p4978j20694j31478J1921r4625
11456D537569k8205j10010j80791k90193r2433p8226o6746j209p5218K1600M168
11445C640306k28422j45102K7810L8589p6171j89200j06978n1044j19239j38519
11435B652030k8465L1572R3559L233j115J909m4963o1547j27913k79568o5838
11424B172894p234J30336J11376L2162l9151o5061q8100n6939p041J54200L6233
11413B373675J3942R3504L1027k4143m8268k37258k34844N2511O7597j65067r2128
11402A830548n0561o1397j67696o4245L5617l3193p08L0180N4288j32746j50046
$$ plain form
11475 7370736 7157951 6885427 6696076 6558681 6387347 6169365 5895281 5694596 5513713
11466 5513713 5362802 5204574 5019117 4917429 4947423 4872445 4751751 4620273 4632194 4537569
11456 4537569 4509364 4399354 4218563 3928370 3835937 3757711 3690965 3689756 3614538 3636138 3640306
11445 3640306 3411884 3266782 3294592 3333181 3257010 3067810 2960832 2909788 2790549 2652030
11435 2652030 2623565 2655137 2748696 2751929 2750814 2752723 2707760 2646213 2518300 2238732 2172894
11424 2172894 2165660 2295996 2407372 2439534 2400383 2335322 2247222 2190283 2183242 2337442 2373675
11413 2373675 2387617 2481121 2512148 2488005 2439737 2202479 1967635 2020146 2087743 1922676 1830548
11402 1830548 1779987 1718590 1550894 1486649 1522266 1489073 1488365 1518545 1572833 1440087 1290041
11391A290041j19102O7335j4333N2777N8831Q8236J02342o634j86590j81629m4766
11380A106508J1340L898o5129n4480M4419k20710j98721P6622J62147P4516l8021
11369I02389m5012r985o8229m7068L0374L6425o0862k0724p5227J10903Q2606
11358H35590j5618j90969j82388M9943J94428N7022J15955K5190j80009k05171
11348E03973M6841J02300J78733O0873o9276L943J4089j26858J5145l2576o0782
11337F36405l0566k4606R6247q0126p1831J48838j0620L351m0689J8621L0217
11326F75241K7424k1730n8487m8925q3988k0183k0916l8724P3658M4933j83458
11315C44845r9630Q4003L0692j08226L5244O7391Q649r3198P1923J35470Q389
$$ plain form
11391 1290041 1170939 1238274 1223941 1276718 1335549 1423785 1526127 1519493 1332903 1151274 1106508
11380 1106508 1117848 1121746 1056617 1002137 1046556 825846 627125 703747 865894 940410 902389
11369 902389 857377 847392 779163 732095 762469 798894 738032 717308 642081 752984 835590
11358 835590 819972 629003 446615 496558 690986 748008 863963 889153 709144 503973
11348 503973 550814 653114 831847 892720 823444 827387 841476 714618 729763 697187 636405
11337 636405 605839 581233 677480 597354 525523 674361 663741 667092 626403 645024 675241
11326 675241 702665 680935 622448 573523 489535 469352 448436 409712 483370 528303 344845
11315 344845 245215 329218 359910 251684 286928 354319 362968 269770 341693 477163 485552
11304D85552l0162j26615j08309O1500Q8196J1487L9173p4163q0719R1622J37735
11293D95297O6180p5463j39050n3310K4339M6231l7806p8752L8498P8471M9925
11282D14560P0557n2813o5150j36045o9412p289k2521M3550P8382R1437L1298
11271C76554l2803N4444J14564N4875j2917n4902j32133p2874R5788M9321j32645
11260C07272k95948Q9037K08953J08135n2808j36946O3041J63997j04586p4134
11250B76013p5984O5900L0628J47196l5284R5469Q0108m7915J41845J18161J05411
11239I01548O086j59901K6308Q615M7737J53489Q1618K24771K52606J55318K78742
11228A976937J51662L22879N59732N89097R29379J228269J392290J532236J388724
$$ plain form
11304 485552 455390 328775 220466 281966 370162 381649 420822 346659 265940 357562 495297
11293 495297 561477 486014 346964 293654 317993 364224 326418 247666 286164 364635 414560
11282 414560 485117 432304 367154 231109 161697 154408 131887 175437 253819 345256 376554
11271 376554 343751 398195 512759 567634 554717 499815 367682 294808 390596 439917 307272
11260 307272 11324 100361 309314 417449 364641 227695 290736 454733 350147 276013
11250 276013 200029 265929 296557 443753 408469 503938 584046 536131 677976 796137 901548
11239 901548 907634 747733 774041 782656 830393 983882 1065500 1290271 1542877 1698195 1976937
11228 1976937 2128599 2451478 3011210 3600307 4529686 5757955 7150245 8682481 10071205
11219A0071205J130070N53441r6832q69027j318315j227751j094611n37614l8890
11210F571676M56203Q85094J174664J294404J060744M87933n10746j169199j452112
11201H798661j881617j914424j364283q17685n10784l14418l29489k37045k7818
11192A401098q7174j41104l8029r0426o5594r62q517q0722J7065j08556j20656
11181F76423O5570M6406l3218j60129j8113j02111J6728L1317J07560J8326j1785
11170F36974K1452k3733n4061j09056P081J67835p8065N089J70846J30978p3011
11159H02329J07138j7309J73580P1610J7111R7141K43030J01764j19074j25369
11149A351951r7394l2353o6030n2120j2789J11221R8305q979k23543R5201J59837
$$ plain form
11219 10071205 11201275 11754716 11657884 10788857 9470542 8242791 7148180 6610566 6571676
11210 6571676 7027879 7912973 9087637 10382041 11442785 11930718 11419972 10250773 8798661
11201 8798661 6917044 5002620 3638337 2820652 2309868 1995450 1665961 1428916 1401098
11192 1401098 1313924 1172820 1134791 1044365 978771 977809 969292 888570 905635 797079 676423
11181 676423 741993 788399 755181 595052 576939 474828 491556 522873 630433 648759 636974
11170 636974 658426 634693 580632 471576 478657 646492 568427 573516 744362 875340 802329
11159 802329 909467 892158 1065738 1137348 1154459 1251600 1494630 1596394 1477320 1351951
11149 1351951 1254557 1222204 1156174 1104054 1091265 1202486 1300791 1291812 1068269 1163470 1323307
11138A323307L6793N7919L15l1421J50858k8027p9544m4930p2802Q084N868N5754
11126A382174J57382J36355N4325n4396J19930m4867m3220m6797o6576q4381p1767
11115A438162n3917k7295M6269J4937j22912j67848k3149N07N7656N9014o6415
11104A155009K7438M5848M1785j32577j98964o2134J25184J67435J3709j87076
11094I95657o2750N9047j5619j07023N9096k1150R0169j46108k60898q6783p8008
11083D25630L6698K1400k9860L5272J16211q2216p4298j11792M2123K03899l3937
11072E49130j20906k1367N1413L809J2451r6885j29941J3915J66436J8714r3762
11061C53007O6009n0815o451l470l1500o0467J21515Q7924j9435j24713q3331
$$ plain form
11138 1323307 1360100 1418019 1418334 1386913 1537771 1509744 1430200 1385270 1312468 1320552 1326420 1382174
11126 1382174 1539556 1675911 1730236 1675840 1795770 1750903 1707683 1660886 1594310 1509929 1438162
11115 1438162 1384245 1356950 1403219 1418156 1295244 1127396 1104247 1104754 1162410 1221424 1155009
11104 1155009 1182447 1228295 1270080 1137503 938539 876405 1001589 1169024 1182733 995657
11094 995657 932907 991954 976335 869312 928408 907258 997427 851319 590421 503638 425630
11083 425630 462328 483728 453868 489140 605351 523135 448837 337045 379168 583067 549130
11072 549130 428224 406857 458270 462079 474530 377645 247704 261619 428055 446769 353007
11061 353007 419016 368201 361750 358280 326780 266313 387828 475752 456317 331604 248273
11050B48273J02867O1918m3651Q044K10048L2178P943n0185k0644R9287L921Q6562
11038G46561Q8948J38098J13954J07193l4773m6346j35794m892P514k5780P4111
11027A028794J43679J59953J10146M7100o8141n9230l7600j4261j35533k86307
11017H88600j11104J32827N8193r5546M7233K23239J14123r8462j39599j90652
11007H28852q0978J3895r9442j3683r194j6848R214K9855M0834j73957L47M0758
10995E69653p9146q2453q9309J36575l6191j7129l0833m6661r3932n1470p1873
10984A07231O4406P8660N3108k3839k4804O1362K6539J59247J34930j62762Q37
10973D74915Q8918N6932j16459m7478j5598L8301K82033J50407J35710R55J64317
$$ plain form
11050 248273 351140 413058 369407 377451 587499 619677 627620 577435 556791 656078 659999 746561
11038 746561 835509 973607 1087561 1194754 1159981 1113635 977841 972949 980463 954683 1028794
11027 1028794 1172473 1332426 1442572 1489672 1421531 1362301 1324701 1310440 1174907 888600
11017 888600 777496 910323 968516 872970 920203 1143442 1257565 1159103 1019504 828852
11007 828852 747874 761769 662327 648644 639450 622602 631816 661671 702505 528548 528895 569653
10995 569653 490507 408054 318745 455320 419129 402000 371167 324506 230574 179104 107231
10984 107231 171637 250297 303405 279566 254762 316124 342663 501910 636840 474078 474915
10973 474915 563833 620765 504306 456828 441230 479531 761564 911971 1047681 1048636 1212953
10962A212953K00247L68306O74496R23553J093948J252763J332327J065733J110924
10953I235250M06883m78243n96594o22816j059641j621806j502028j054502o97867
10944B008636l52847l40636j54004j54927j96317j11782J2215m94J5427k15563
10934E09708k6683J9778L6464m499p4065O310K7191P810j01395k5566Q9295L3558
10922D97906L3225q5271P3446q4515j46523k4963J80531O0956j16042P5270K3201
10911D87221j320p7329o7977L2399k2204n813K1289L4796j5805j26227K5152N5159
10899C39341j676O0488k805k0373L8309j6847p9079j20668j23222j29798P5398
10888A9068J74085O9083J578k978m2780M2959n6364j7140j46792l9686J20867
$$ plain form
10962 1212953 1413200 1781506 2456002 3379555 4473503 5726266 7058593 8124326 9235250
10953 9235250 9642133 9163890 8567296 7944480 6884839 5263033 3761005 2706503 2008636
10944 2008636 1655789 1315153 1161149 1006222 809905 698123 710338 709844 725271 509708
10934 509708 483025 502803 539267 534768 460703 467013 494204 502014 400619 375053 464348 497906
10922 497906 531131 445860 519306 434791 288268 263305 443836 504792 388750 464020 487221
10911 487221 485901 408572 340595 372994 350790 344977 366266 401062 385257 259030 284182 339341
10899 339341 337665 398153 395348 374975 413284 396437 317358 196690 73468 -56330 19068
10888 19068 193153 262236 263814 260836 218056 261015 204651 187511 40719 1033 121900
10877A21900J89590Q1932j0514r5523R356m0476j10363J3229J05727Q4546M7614
10866C97018q8017r5154j0452j5682J5921j2607J01710J32756j27501p309L1414
10855C22097j04333M2279J50125n4049L5176J49159k2124k454l7737j21039k4540
10844C32560J23839r9477J6015m4293o05K1501Q4078p219J0341j6612m0580J9020
10832C98568N007N1932j6642O1896j27046j40163n5689M0415R1341l9627O5452
10821C35444L6624K4780j23575o9786l5494J45434N6739P0962k5131K4171j56328
10810B83840j00539j7040L9878P283p2228r1543M3623J10290J22609J32511j04101
10799C54583j16278r5168o4021Q1717O0122J7126L6528J08626R8136j18753o0886
$$ plain form
10877 121900 311490 393422 382908 287385 296741 256265 145902 159131 264858 349404 397018
10866 397018 309001 213847 203395 187713 203634 191027 292737 425493 297992 290683 322097
10855 322097 217764 260043 410168 356119 391295 540454 518330 515876 478139 357100 332560
10844 332560 456399 356922 372937 328644 328039 349540 433618 426399 436740 420128 379548 398568
10832 398568 403575 455507 438865 500761 373715 233552 177863 218278 309619 269992 335444
10821 335444 372068 396848 273273 203487 167993 313427 370166 441128 415997 440168 283840
10810 283840 183301 166261 206139 213422 141194 49651 93274 203564 326173 458684 354583
10799 354583 238305 143137 79116 160833 220955 238081 274609 383235 481371 362618 301732
10788C01732j16922j11415l2442J04184J0110J68897J30293Q1836P1362r1126
10778E16509j10273N9277l1046j85125M8301J29919m2265M7337Q2407m5886k7117
10767D42038L9435Q9664K710p6173o270j7745j07296n3470O986M3676n2557o5828
10755B45170J21588O8795J26292k2517j22373n7963N8884O3802J6400k0233m8496
10744D29349o2312N3427J24058J16622m5059j5430r9584m7572J11550R5574O7380
10733G28003P9954J03407n5365p7464j94778R7391J09723o241L9567j06124l5751
10722F82322k6159J78637r2005n9673R9780J56232L0007o918L6685R1912J47996
10711A238816n7897j62714p3195o0074p987Q7907O7525l540n2249J25105Q6394
$$ plain form
10788 301732 184810 73395 40953 145137 155247 324144 454437 536273 607635 516509
10778 516509 406236 465513 434467 249342 297643 427562 385297 432634 515041 469155 442038
10767 442038 481473 571137 573847 497674 491404 473659 366363 312893 319879 363555 310998 245170
10755 245170 366758 435553 561845 539328 416955 358992 417876 481678 498078 477845 429349
10744 429349 367037 420464 544522 661144 616085 600655 501071 453499 565049 660623 728003
10733 728003 807957 911364 855999 778535 583757 681148 790871 784630 824197 718073 682322
10722 682322 656163 834800 742795 683122 782902 939134 969141 962223 998908 1090820 1238816
10711 1238816 1180919 1018205 945010 884936 876949 964856 1032381 1028841 976592 1101697 1188091
10700A188091k6435J37628p3977k1864j42610N6598R7387j11806o1321J94470
10690A236161L0681l7658l9156j56436L9273J36365Q3501J5985q323o6470j78
10679A233745K45325K19659K8948L2872l7985l879J0190j5032j49845k35643J05963
10668A434318J50523J54659J08167l6894O9221M423J55311O7044O2521J15766
10658B285059K7809L4003O5524K13714K27544N3108M6841K6050K55947K26921
10648C462520j31244m0721K16744K37529L26975K50136K57968L08059M56430N26884
10638E871280N71894O47463P87156O98091P92871O62322P60357O75583P72889
10629A2239906J008524J381655J843584K386388L271909M161929N203181O607406
$$ plain form
10700 1188091 1161656 1299284 1225307 1203443 1060833 1117431 1214818 1103012 1041691 1236161
10690 1236161 1266842 1229184 1190028 1033592 1072865 1209230 1292731 1308716 1300393 1233923 1233745
10679 1233745 1479070 1698729 1727677 1760549 1722564 1718685 1728875 1713843 1563998 1328355 1434318
10668 1434318 1584841 1739500 1847667 1810773 1879994 1884417 2039728 2106772 2169293 2285059
10658 2285059 2312868 2346871 2412395 2626109 2853653 2906761 2953602 2979652 3235599 3462520
10648 3462520 3331276 3290555 3507299 3744828 4071803 4321939 4579907 4887966 5344396 5871280
10638 5871280 6443174 7090637 7877793 8575884 9368755 10031077 10791434 11467017 12239906
10629 12239906 13248430 14630085 16473669 18860057 22131966 26293895 31497076 38104482
10621C8104482P646077Q167503Q046838P285393O134995M097479J607677J79889
10613H1270333K03431K094828N323223R137019J2444095J4409430J4372614J2361782
10605A51616755Q542955K863481l529597p697916p288528l078733K911900Q984473
10597A53324790J4206817J6829796J5897259J1991909N497159l495864j3206005
10590B01045861j9318585j8668031j3627483o852702p16918L863646O177815N942450
10582A57846053L197007j402366p654381j3854127j6973488j5699034j1837140
10575I3622524p554042l758857j366139k59017l23340j464061l460196o043776
10567F9393096q313093r303883q954533p270238n584473m328607l316232k579640
$$ plain form
10621 38104482 45750559 53918062 61964900 69250293 75385288 79482767 81090444 81270333
10613 81270333 81473764 83568592 88891815 98028834 110472929 124882359 139254973 151616755
10605 151616755 160159710 163023191 159493594 151795678 144507150 141428417 144340317 153324790
10597 153324790 167531607 184361403 200258662 212250571 217747730 214251866 201045861
10590 201045861 181727276 163059245 149431762 142579060 141862142 145725788 151903603 157846053
10582 157846053 161043060 159640694 151986313 138132186 121158698 105459664 93622524
10575 93622524 86068482 82309625 80943486 80684469 80361129 78897068 75436872 69393096
10567 69393096 61080003 51776120 42821587 35551349 29966876 25638269 22322037 19742397
10559A9742397k177768j695262j265625r76428r92036r19020q28902o48476q30530
10550I408350o32062m74874m76024m25149l09449k35599l85879k62972k26121
10541E980221j64527k11093k77687k17200p3835r9160l13314l56804k49200r6149
10531C921252l476j07120j63054k5664k75172k51736p1117j45195r0602p8862
10521B709254k10306k34331k05020N3834P6746j11030j45810j06727k7237j5188
10511A784185p5984j28959q1202k0101J43524Q6840j98379j29955J3719p5590
10501A318098l3315k6249m1754j10343j02629o8631j23501K7665K203J31599r1197
10490H81946q4841p9045j20274L6724k2064o0469J42638J5003K5541Q9166K275
$$ plain form
10559 19742397 17564629 15869367 14603742 13627314 12635278 11716258 10887356 10238880 9408350
10550 9408350 8776288 8301414 7825390 7400241 7090792 6855193 6469314 6206342 5980221
10541 5980221 5815694 5604601 5326914 5109714 5035879 4936719 4623405 4266601 4017401 3921252
10531 3921252 3917776 3810656 3647602 3621938 3346766 3095030 3023913 2878718 2788116 2709254
10521 2709254 2498948 2264617 2059597 2113431 2190177 2079147 1933337 1826610 1799373 1784185
10511 1784185 1708201 1579242 1498040 1477939 1621463 1708303 1509924 1379969 1393688 1318098
10501 1318098 1284783 1258534 1216780 1106437 1003808 935177 811676 839341 841544 973143 881946
10490 881946 797105 718060 597786 634510 612446 551977 694615 709618 735159 824325 826600
10479H26600m159J345r3629j93007j0185J1743J0519n9958M7022J60456l2518
10468F64229q8609J1059k961j01487j7794P8202q8449J8910J00530K5382j3563
10457E85449r8449l9903K6009j4233P0596K6421p1019j00929q41j0865l1972J4658
10445C54922R094L6353M9073j30723Q6108r8263j22227j90543j15606j1304L1790
10434a01326N8312J16968O5646L2792p9782L2401n0194p8124j26470r0034r250
10423b29061J43200J01219j06594L8924O8572J01557R1730L8966q3156q7587p004
10412G0766J1441J1148K3507N478m6460m6362q6102R571m9009J25694m8433j8448
10400c7209R5376l4347r4563k2962L773N490O036k8454J7901L6526J03579J64447
$$ plain form
10479 826600 822441 823786 730157 537150 526965 538708 549227 489269 536291 696747 664229
10468 664229 575620 586679 583718 482231 464437 542639 454190 473100 573630 599012 585449
10457 585449 487000 447097 473106 458873 529469 555890 484871 383942 383101 372236 340264 354922
10445 354922 364016 400369 449442 318719 404827 306564 184337 -6206 -121812 -133116 -101326
10434 -101326 -43014 73954 139600 172392 92610 125011 74817 -3307 -129777 -219811 -229061
10423 -229061 -85861 15358 -91236 -52312 16260 117817 209547 248513 165357 77770 70766
10412 70766 82207 93355 116862 122340 75880 29518 -56584 -47013 -96022 29672 -18761 -37209
10400 -37209 58167 23820 -70743 -93705 -89932 -84442 -78406 -106860 -88959 -52433 51146 215593
10388B15593O2709j04913K4206o3424j13003Q1554K341j45509q8500j00662J6997
10377b12611R5561J67516k4870q4156r3092p6517N0451J30633k8557r1368J15151
10366e1859j05733K8961N2151J7589J03416J31474P7429q3207k137L3399q648
10355A92835m6331j19173Q7460j01497j15304O0718Q8307Q6161r2722j04926k2710
10344h7182j0275J2319o7919J18392O4263N1920n4999j39118m3879J65030N9284
10333F7836k0342j09153N4066J00582l0225r7875p3740q6263l5184r9936n5675
10322c85909Q3067k6590j31135l9565P4082J49240Q7207J04307Q3119n0735P7656
10311B4744o7713k44076K2946P3887J22371M7167j06314j40702m6493R8173J50412
$$ plain form
10388 215593 278302 173389 197595 134171 21168 102722 105063 -40446 -128946 -229608 -212611
10377 -212611 -117050 50466 25596 -58560 -151652 -228169 -177718 -47085 -75642 -167010 -51859
10366 -51859 -157592 -128631 -76480 -58891 44525 175999 253428 170221 168084 201483 192835
10355 192835 146504 27331 114791 13294 -102010 -41292 47015 133176 40454 -64472 -87182
10344 -87182 -97457 -85138 -153057 -34665 29598 81518 26519 -112599 -156478 8552 67836
10333 67836 47494 -61659 -7593 92989 62764 -35111 -108851 -195114 -230298 -330234 -385909
10322 -385909 -302842 -329432 -460567 -500132 -426050 -276810 -189603 -85296 -2177 -52912 24744
10311 24744 -42969 -287045 -264099 -190212 -67841 -20674 -126988 -267690 -314183 -216010 -65598
10300f5598K2600R0310m7756m9954k4194l2625q5074m7477q6298J70531J50871
10289d664j2520R448q9048r8551j06363J3623J0613M3380J0934J88897j54058
10278a88309j56082K5679r1779n7680O4198J37853R8358Q2062r9475j80267m1136
10267d06578r62L6561J13401J73159M7273j38031l4797l482o0883O87j26294r3370
10255d93316R9707O902M3473N3328K7994K6659l0406R5726r5255l2499k0228j02948
10243d20863P2362J08876J9951j00666j0403N9883J50909R6983K32q9663j62661
10232b75060j97691j1919J27508J16992o5058N876N7299J19764M5203j08898L8176
10221a47808m6387p5691L2415J71320k2311j77929M9298J15365Q0601N383j05810
$$ plain form
10300 -65598 -42998 47312 -444 -50398 -74592 -107217 -192291 -239768 -326066 -155535 -4664
10289 -4664 -17184 -7736 -96784 -195335 -301698 -288075 -277462 -234082 -223148 -34251 -188309
10278 -188309 -344391 -318712 -410491 -468171 -403973 -266120 -167762 -85700 -185175 -365442 -406578
10267 -406578 -407540 -370979 -257578 -84419 -37146 -175177 -209974 -213456 -274339 -273652 -399946 -493316
10255 -493316 -393609 -386707 -343234 -289906 -261912 -235253 -265659 -169933 -265188 -297687 -317915 -420863
10243 -420863 -348501 -239625 -219674 -320340 -330743 -270860 -119951 -22968 -22736 -112399 -275060
10232 -275060 -472751 -484670 -357162 -240170 -305228 -299352 -242053 -122289 -77086 -185984 -147808
10221 -147808 -194195 -269886 -237471 -66151 -88462 -266391 -217093 -101728 -21127 -15744 -121554
10210a21554j22391N338J13092J22685k5428r8423j42667o4421J42246O4758p895
10199a34660N0583N6958n7500N085j30285j09095J11805R0946J38789J9557l0035
10188A2148P431R8975k0781J30419N6230L497m5603q3587R8241J08675K46789
10177F12434P6224j24051n1422R7480K0457Q1474r003n3967J25328J26707L356
10166I05017j73393r3411j58493m0533J66604K17320J27081L9010N3444o5844
10156I76802M7576J72229p520k02348j48536l8623m7793P977O7564j2132j33819
10145F81377n7116J29521L4738j59206p5931N3782K9934j37212m4799K4011o1028
10134D18071j0972J44273N6979l3905r7065k30686j34241n1859j01053m7648K9471
$$ plain form
10210 -121554 -243945 -238607 -125515 -2830 -28258 -126681 -269348 -333769 -191523 -126765 -134660
10199 -134660 -84077 -27119 -84619 -79534 -209819 -318914 -207109 -116163 22626 42183 12148
10188 12148 19579 118554 97773 228192 284422 287919 242316 158729 256970 365645 612434
10177 612434 688658 564607 513185 610665 631122 712596 703593 649626 774954 901661 905017
10166 905017 731624 638213 479720 439187 605791 823111 950192 989202 1042646 976802
10156 976802 1024378 1196607 1189087 986739 838203 799580 751787 759764 827328 815196 681377
10145 681377 624261 753782 788520 629314 553383 607165 637099 499887 455088 479099 418071
10134 418071 407099 551372 608351 574446 477381 246695 112454 60595 -40458 -88106 -58635
10123e8635P003Q7883J00451R1006N976r7718n6616J65328L3097o8439o7190j0057
10111A32089n494J34374K4275j06035k06165k20203l6635J17366J72042J45647
10101A51261N9220k7534q858j05600j10294j20727k2702Q2083K966M4797Q3695
10090B8307j32694k431N3375j48471r5826Q9103R5670j1864k4623P3632N1516
10079b4306N3816J06807m5353P4979j35056k40616J21131k2529O1760O9358q0562
10068f0571n4996p7642J8737P5354q6606o8223Q6654M0668q4201M0112j3709M2560
10056a41863K5580K2525M5052M2597q3013K9214r970J462J7980j94550n7299N8151
10044b44134k3233m4662O1246q240R3396Q0019P333J4893L3396l2826P9475N0449
$$ plain form
10123 -58635 -51632 36251 136702 227708 233684 135966 79350 244678 277775 209336 142146 132089
10111 132089 126595 260969 285244 179209 -26956 -247159 -283794 -166428 5614 151261
10101 151261 210481 182947 174089 68489 -41805 -162532 -185234 -103151 -100185 -55388 28307
10090 28307 -104387 -106818 -53443 -201914 -297740 -208637 -112967 -124831 -149454 -75822 -24306
10079 -24306 29510 136317 90964 165943 30887 -209729 -88598 -111127 -49367 19991 -60571
10068 -60571 -115567 -193209 -174472 -99118 -185724 -253947 -167293 -126625 -210826 -170714 -184423 -141863
10056 -141863 -116283 -93758 -48706 -6109 -89122 -59908 -69878 -68416 -50436 -244986 -302285 -244134
10044 -244134 -267367 -312029 -250783 -259023 -165627 -85608 -78275 -63382 -29986 -62812 16663 67112
10032F7112l6470J4388j63017q5164J28322N2899l7565j09325j43370m7868J72437
10021a87621J27219J19251P3751r639R149n1991q0942r7905n5591k8481J63314
10010a9486l2903j23807R880j06834j28586j2538J36972M6727o2573K0342M1244
9999b31562R8012J57896L4116p4833R2871K49370k2569j83242k1027P1079R425
9988A79536K184P8552q1307r6609M3783l2862m3096l5733L9361K1471m3447k2783
9976I050L992p8403K857N3906J1679m5662l9898l0244j403j7494J86796Q7877
9964A43053l4703j28144j10044m3552k2587k083J65472J35437N5654L5536q2923
9953A11116j10620J4353K1331N0220M4676M888j10362k1077p5032l1432M1607
$$ plain form
10032 67112 30642 45030 -117987 -203151 -74829 -21930 -59495 -168820 -312190 -360058 -187621
10021 -187621 -60402 58849 132600 122961 132110 80119 -823 -98728 -154319 -182800 -19486
10010 -19486 -52389 -176196 -166316 -273150 -401736 -414274 -277302 -230575 -293148 -272806 -231562
9999 -231562 -133550 24346 58462 -16371 76500 325870 303301 120059 99032 170111 179536
9988 179536 181720 260272 178965 82356 126139 93277 50181 14448 53809 75280 31833 9050
9976 9050 13042 -65361 -62504 -8598 3081 -42581 -82479 -112723 -114126 -131620 55176 143053
9964 143053 108350 -19794 -129838 -173390 -195977 -198060 -32588 102849 158503 194039 111116
9953 111116 496 14849 36180 86400 131076 135964 25602 4525 -70507 -101939 -60332
9942f0332r87m930K2372J8558n3529j02185N9755P4064Q675J10596j2886m1330
9930A7841O4140M1671l8984N9580m9131j77784q3183k718o8801Q853R5115N6195
9918g7206L0569m1525o3468L8278L1804J39255p1494k9881J003o6158r508L9290
9906g9041l5512K537J37057o4022n903p3278l2945O1463n0166p0874P6010O3848
9894g0826N4037L7840L7321J45904K9982q3073j45517k059R261O6582R175j14049
9882b5422M8641O3634m1020K9324j33947l9955L9099L1544o9497O7913P266l4256
9870e6676j56092k06535K5595J48081J14991M5038M4697r1480j05719J2683j8587
9859b44004Q9574p3617n360L0739n8849J09512Q6619J05601O5477j36743p1265
$$ plain form
9942 -60332 -61319 -66249 -43877 -25319 -78848 -181033 -121278 -47214 -38539 72057 59171 17841
9930 17841 81981 123652 84668 144248 95117 -82667 -165850 -168568 -237369 -228516 -133401 -77206
9918 -77206 -46637 -88162 -151630 -113352 -81548 57707 -13787 -43668 -42665 -108823 -118331 -79041
9906 -79041 -114553 -112016 25041 -38981 -44884 -118162 -151107 -89644 -139810 -210684 -134674 -70826
9894 -70826 -16789 21051 58372 204276 234258 151185 5668 3609 12870 79452 88627 -25422
9882 -25422 23219 86853 45833 75157 -58790 -98745 -59646 -28102 -97599 -29686 -22420 -56676
9870 -56676 -212768 -419303 -393708 -245627 -130636 -85598 -40901 -132381 -238100 -225417 -244004
9859 -244004 -154430 -228047 -233407 -202668 -261517 -152005 -65386 40215 105692 -31051 -102316
9848a02316n8638q3979p7339O8698J22109M1613m6673L0453J89896q6846r4953
9837i7975J65857K3661q4441m1534j66594j95471L0752L525M0859l6590J29635
9826b28316J87258K9877m0975l8536j32906j26875j3215n47J83085M6927j40004
9815b74227J8023J83578k9796l2621K17796n224j15028k3064j61059j11304J34420
9804a98506K26960j3918j54637L3330P9580N6855P5435M2070r2835j3012q3091
9793d1769j03442K9759n3697n7866q8925J5945R5603K32517M2350j22655m9456
9782a01636K7262J27090l9269l3209N6619O2730R355k08984l5453O6063j6701
9771h6133j48641j5100J4957O3893Q8765N5763j4076j5533M2841K7561m4439j2011
$$ plain form
9848 -102316 -160954 -244933 -322272 -253574 -131465 -89852 -136525 -106072 83824 -3022 -97975
9837 -97975 67882 91543 7102 -34432 -201026 -396497 -365745 -362220 -321361 -357951 -228316
9826 -228316 -41058 -11181 -52156 -90692 -223598 -350473 -363688 -364235 -181150 -134223 -274227
9815 -274227 -256204 -72626 -102422 -135043 82753 77529 -37499 -60563 -221622 -332926 -198506
9804 -198506 28454 14536 -140101 -106771 -27191 29664 105099 147169 54334 41322 -41769
9793 -41769 -145211 -115452 -169149 -227015 -315940 -299995 -204392 28125 70475 -52180 -101636
9782 -101636 -74374 52716 13447 -19762 36857 99587 108942 -100042 -135495 -69432 -86133
9771 -86133 -234774 -249874 -234917 -171024 -82259 -26496 -40572 -56105 -13264 14297 -30142 -42153
9759d2153O5817M4225q5383M1139o011m5080j0889N7174J5353m9107m7633O6007
9747C459J66104j33869j1870J9120J21846p9804J6624n5101r259l1625K091M6872
9735E4588j30670j7212K0839j4384j30612o831q429R0975R6414Q51K8329J27336
9723A11194j662p4233j72679j35093j2173K9076n136J94072J74964L2033j6014
9712A24349k3971o2922q477r7363p0994j16825j30879K542J16414K19597J91537
9701A43008k9547r7416j23393j59073M0454K8460J27436N1384J00383o7736Q3891
9690I7851p717K4793l9130k9184j4736J286k8910p8054K5382o5169j06857J22730
9678i7715J04035p9536r4984j2592J6799O2413l5087N799J33620k1812M5512j23
$$ plain form
9759 -42153 23664 67889 -17494 23645 17634 -27446 -38335 18839 34192 -14915 -62548 3459
9747 3459 169563 35694 23824 42944 164790 84986 101610 46509 37250 5625 7716 54588
9735 54588 -76082 -93294 -72455 -86839 -217451 -224282 -232711 -141736 -45322 -44471 -16142 111194
9723 111194 109532 35299 -137380 -272473 -284646 -255570 -260706 -66634 108330 140363 124349
9712 124349 100378 37456 28979 -68384 -139378 -256203 -387082 -384540 -268126 -48529 143008
9701 143008 113461 16045 -107348 -266421 -225967 -197507 -70071 -18687 81696 13960 97851
9690 97851 90134 114927 75797 46613 31877 33163 4253 -73801 -48419 -113588 -220445 -97715
9678 -97715 6320 -73216 -168200 -180792 -163993 -101580 -136667 -130868 2752 -19060 26452 26329
9666B6329J12280L2344K1678k7205J814r5868L9936m9429p8829M8034P1674m2983
9654E9775q2923K40515K03938r8405k46385r7006l1645O9229m8172j50097K046
9643a79130M9071K9086l9639q7236P6352L4170Q8623j26470l5240J60109J3767
9632a6537m8944j36528N3464M031p0007N7933M6342j0750Q3640J20020l9851L6511
9620G9324m2623l1004n5648l0403p4594q1353K04682J895O950j7812M7854N5176
9608F2444K8508j14688j3413J72074K6661M614j2705K2700l2529j81489j07594
9597a45417O5332N6790n0937J01753J33823j69421j81104J02084K235q476k2716
9586a16054O122P2240N4224p9307j04653Q957J34316J74033J26487j76205j25670
$$ plain form
9666 26329 138609 170953 192631 165426 167240 71372 111308 61879 -16950 31084 102758 59775
9654 59775 -23148 217367 421305 322900 76515 -20491 -52136 17093 -31079 -181176 -179130
9643 -179130 -130059 -100973 -140612 -227848 -151496 -117326 -28703 -155173 -190413 -30304 -16537
9632 -16537 -65481 -202009 -148545 -144514 -214521 -156588 -110246 -120996 -37356 82664 42813 79324
9620 79324 36701 5697 -49951 -80354 -154948 -236301 -31619 -29724 -22774 -40586 7268 62444
9608 62444 90952 -23736 -37149 134925 161586 166200 153495 176195 143666 -37823 -145417
9597 -145417 -80085 -23295 -74232 27521 161344 -8077 -189181 -87097 -84862 -93338 -116054
9586 -116054 -109932 -37692 16532 -62775 -167428 -158471 -24155 149878 276365 100160 -25510
9575b5510L9294l1538j2055M6586R6970m2592n3363k621l8815p4182R1818R4543
9563H8535j54411n4656J65815k2731P3551j02898K5165n1606L2280R518L3888
9552D2450N5528j3775n2729j39668j82649j9121j07738r7429P5993O7925J59432
9541b11781M9563L9233m5768k192R9178J03272q7823Q4674J48871p2665k42136
9530a37574p8644O1119N0892K8808L3965L0040o8068R105N7078K953L7549O5401
9518I2624k3077J7510J5096l8570n8828r9458J67308O0123L9166N6473m4874k07344
9506b3851L6023j1228k8265j0574J48013O4550m9638o7904j35067j0763j28966
9495b17670L0324k4229j5022J11205R1576K0961n0061k3340j69331m2386j5195
$$ plain form
9575 -25510 13784 -17754 -29809 16777 113747 71155 17792 15171 -23644 -97826 -6008 88535
9563 88535 -65876 -120532 45283 22552 96103 -6795 18370 -33236 -956 8562 42450
9552 42450 97978 84203 31474 -108194 -290843 -309964 -417702 -515131 -439138 -371213 -211781
9541 -211781 -162218 -122985 -168753 -170945 -71767 31505 -56318 28356 177227 104562 -137574
9530 -137574 -216218 -155099 -104207 -75399 -41434 -11394 -79462 -70357 -13279 -10326 27223 92624
9518 92624 69547 87057 102153 63583 4755 -94703 72605 132728 171894 228367 183493 -23851
9506 -23851 12172 944 -27321 -37895 110118 174668 125030 57126 -77941 -88704 -217670
9495 -217670 -187346 -211575 -226597 -115392 -23816 -2855 -52916 -76256 -245587 -287973 -303168
9484c03168M9489J9028j25336N3002J21917P1917q2754O8022n4516l7151j17280
9473c36830k4062J16368J29227J21601k7617o6992j0822m5615j2951J907J26079
9462b9707m1274O7012l9528m2228O9078N4345N6038j05309j38641q1106r4116
9451c25436R9515K33525K2760m3764j40381n8548K8654P6609q3606l3414o7597
9440b91683R2955K0010N7474J23114k4442j4711P7231Q1374J03882j6847k4479
9429A83878m9907L9723K2723j3952l2419q9422k1432O8018J2692K5642J407l036
9417A43915r9000k10889m1916K1597J27706L8941m606J02895K2996n4915o0193
9406a3469K4496n5843M0592k8349m4701M5480K8821L9661J51104L6502q4871j5629
$$ plain form
9484 -303168 -253679 -234651 -359987 -306985 -185068 -113151 -195905 -127883 -182399 -219550 -336830
9473 -336830 -360892 -244524 -115297 6304 -21313 -88305 -99127 -144742 -157693 -155786 -29707
9462 -29707 -70981 -3969 -43497 -85725 -16647 37698 93736 -11573 -150214 -231320 -325436
9451 -325436 -225921 7604 30364 -13400 -153781 -212329 -183675 -107066 -190672 -224086 -291683
9440 -291683 -198728 -178718 -121244 1870 -22572 -37283 39948 121322 225204 208357 183878
9429 183878 133971 173694 196417 182465 150046 60624 39192 107210 119902 145544 146951 143915
9417 143915 44915 -165974 -207890 -186293 -58587 -19646 -24252 78643 101639 46724 -13469
9406 -13469 11027 -44816 -4224 -32573 -77274 -31794 -2973 36688 187792 224294 139423 123794
9394A23794l2457K2469J0712m5174r1488l2699r5026n7764M1575O4922K9600q5535
9382a47071n7139l3799L2266k9637J68775J51255o5337j44207j31545m040k0088
9371b80567m8567J0976J1442k9820M5485L0718J24407J38458m5693j28789J71655
9360b95K6132j0664o8610k3889J25781p6953r3353L6778L1424K0080J1895j8913
9348d0587o0508R955j159j9232p4261J27399R3882m3175N3525q4612j7702m3694
9336a00169J0227R1974K27358P7908j14606o7538k6483p4715L4046o5596o3438
9325g1032O2164l8253j96219j21204O249K8898J5816K06897P9295o5487q122Q2883
9313a8115K5094o7160j39083L3861k9589M1363L7891K6686R022R0794P9152J9682
$$ plain form
9394 123794 91337 113806 124518 79344 -12144 -44843 -139869 -197633 -156058 -91136 -61536 -147071
9382 -147071 -204210 -238009 -205743 -235380 -66605 84650 19313 -124894 -256439 -260479 -280567
9371 -280567 -329134 -318158 -306716 -336536 -291051 -260333 -135926 2532 -43161 -171950 -295
9360 -295 25837 15173 -53437 -77326 48455 -28498 -121851 -85073 -53649 -33569 -21674 -40587
9348 -40587 -101095 -91140 -92299 -111531 -185792 -58393 35489 -7686 45839 -38773 -56475 -100169
9336 -100169 -89942 2032 229390 307298 192692 125154 98671 23956 58002 -7594 -71032
9325 -71032 -8868 -47121 -243340 -364544 -358295 -329397 -313581 -106684 -27389 -92876 -100998 -18115
9313 -18115 6979 -60181 -199264 -165403 -194992 -153629 -115738 -89052 -80030 10764 89916 109598
9301A09598l1706k5583O3443j33627j44495L7049J02759K407j15020k61894q1701
9290d78770J63288K03253q6506p5687l0015n4315k7057P4349M7490J21876J7025
9279a25069q3994o8242j5404O650j03685O7768J27177J12587M1042j9987J7918
9268d3239j2587q8974q4048k7382J7855M0685p3152P6097p6652N4844J83389J07023
9256G3859M3079m2962n6953l5592j66045j3938K1496J32997R1745J46093r2344
9245A01435j57494O004L2878k8199j9594J16745O4796j30693j21079r3585J00796
9234a27990M2303L2749J34982M4261n8860p9973N6391j29591P815Q0303J44560
9223A46950r0568r182l966j39405M3905m3743Q74q8845R6372Q3647M6872J675
$$ plain form
9301 109598 77892 52309 115752 -17875 -162370 -125321 -22562 -20155 -135175 -397069 -478770
9290 -478770 -315482 -112229 -198735 -274422 -304437 -358752 -385809 -311460 -263970 -142094 -125069
9279 -125069 -209063 -277305 -292709 -286059 -389744 -321976 -194799 -82212 -41170 -61157 -43239
9268 -43239 -55826 -144800 -228848 -256230 -238375 -197690 -270842 -194745 -271397 -216553 -33164 73859
9256 73859 116938 73976 17023 -18569 -184614 -198552 -177056 -44059 47686 193779 101435
9245 101435 -56059 -50055 -17177 -45376 -64970 51775 116571 -14122 -135201 -228786 -127990
9234 -127990 -85687 -52938 82044 126305 67445 -12528 43863 -85728 -77913 2390 146950
9223 146950 56382 47200 43234 -96171 -52266 -96009 -95135 -183980 -87608 -3961 42911 44586
9211D4586q6431j2009j25213O1871k3742J03553R6351J06702k9155j71809K5629
9200i667m2084Q9342M2724O2300J34880l952q0616j13125j5765o2509l8122q570
9188d5164M333J3541J5839R4249K1658P030P4362p294j04157O4809J26804n7759
9176B08251p7778K2109R7102P859o4612K6831p5368m1927j46195J41215N6297
9165A53784q1586L1551o966k04051P9675J49076j07243j07009j635m7280O1330
9154h0354J14948j36035J2417N3779O0495l6100m9871J4092l6125p2718o432J03909
9142e7995P6098j20854r7099O2980J5988L7095J55263k7074j09017L382k3398
9131h4631L6631m584J4678k76l5280j46312l0668J65569J07999q549J01384j49812
$$ plain form
9211 44586 -41845 -53854 -179067 -117196 -140938 -37385 58966 165668 136513 -35296 -9667
9200 -9667 -51751 37591 80315 142615 277495 273543 192927 79802 64037 1528 -36594 -45164
9188 -45164 -40831 -27290 -11451 82798 104456 111486 185848 178554 74397 139206 266010 208251
9176 208251 130473 152582 249684 257543 192931 219762 144394 102467 -43728 97487 153784
9165 153784 72198 103749 96783 -107268 -27593 121483 14240 -92769 -94404 -141684 -80354
9154 -80354 34594 -101441 -89024 -35245 25250 -10850 -60721 -46629 -82754 -155472 -161904 -57995
9142 -57995 18103 -102751 -199850 -136870 -120882 -83787 71476 44402 -64615 -61233 -84631
9131 -84631 -48000 -52584 -37906 -38182 -73462 -219774 -250442 -84873 23126 14577 115961 -33851
9119c3851j7806J3128k0140J81517P896k543O9183j1889R0845m7994j31225p2138
9107B4983p0526J4562m64l7339p873J1091r683N5867m7295m0748j9723K6473M566
9094i6109R4835m3019r0484k8949k6612J02144J38734O3882N7323r3579j51895
9083g3729L8156K5600j9896q680q1807P7914J79485J77822j47365j89581m8969
9072g1050J7214n7874K0696J06104N0490k7771P124Q3494j24361j18637N4240
9061f0331M2859P0282k1662j88131L9392L6971p5201j23808P7944l4314j2138
9050b48137J45965J8337R6658J02927j01636r8651R688J44389N1902q5874j58737
9039a23169o348J5094n6061l3610N8897o4091J11730R8500L9488q521P5854j976
$$ plain form
9119 -33851 -51657 -38529 -58669 122848 130744 128201 197384 185495 276340 228346 97121 24983
9107 24983 -45543 -30981 -31445 -68784 -76657 -65566 -75249 -19382 -66677 -107425 -127148 -100675 -96109
9094 -96109 -1274 -44293 -134777 -163726 -190338 -88194 50540 114422 171745 78166 -73729
9083 -73729 -35573 -9973 -29869 -38549 -120356 -42442 137043 314865 167500 -22081 -71050
9072 -71050 -53836 -111710 -91014 15090 65580 37809 44933 128427 4066 -114571 -60331
9061 -60331 -17472 52810 31148 -156983 -117591 -80620 -155821 -279629 -201685 -235999 -248137
9050 -248137 -102172 -83835 12823 115750 14114 -84537 -74849 69540 121442 35568 -123169
9039 -123169 -129517 -114423 -170484 -204094 -145197 -209288 -97558 942 40430 31909 107763 105787
9027A05787k01365r2440R4159P9388n2465K6713J17572l2322o8833j19326L2968
9016a10164j8687k9072O227l856J7651m4411p789j4773J3006L2034P3204L5397
9004e1233O7256j6417j81996j36113J26702P3515j9994q8133L4539J76974J8632
8993C732j12770j3781j46251J1485K15114J35442n6969l9920l4246L7646p275
8982g793K1229P8878K8025l8122j538l7746L0099o496j7877q1573r3691J85916
8970E9311J5078q8356N3581J2490n0692j5178O7576Q6508K0148n484j7610j04996
8958C2376o9290K19715J61310p7820m8497p9752o5532J5674j98460o8451K00412
8947B1685l3245O8407P9231o968o0904L5021K9675j57637p8138J05925M0448q486
$$ plain form
9027 105787 -95578 -188018 -93859 -14471 -66936 -40223 77349 45027 -23806 -143132 -110164
9016 -110164 -128851 -157923 -151696 -155552 -137901 -182312 -190101 -204874 -191868 -159834 -86630 -51233
9004 -51233 16023 -394 -182390 -318503 -191801 -118286 -138280 -226413 -191874 -14900 3732
8993 3732 -109038 -122819 -269070 -257585 -42471 92971 36002 -3918 -38164 -518 -7793
8982 -7793 13436 92314 120339 82217 80679 42933 73032 66536 48659 -32914 -126605 59311
8970 59311 74389 -13967 39614 52104 1412 -13766 53810 140318 160466 154982 137372 32376
8958 32376 -36914 182801 344111 266291 217794 138042 72510 88184 -110276 -178727 21685
8947 21685 -11560 56847 136078 129110 68206 103227 132902 -24735 -102873 3052 43500 35014
8935C5014j06221L5095m3422O0755r629q2539l6261o106P5294J44436n629j47035
8923h6248o4877l018P9184m01R0541L9721K6062M4454n8883j74197o519k6374
8911a40555n7565l8637j24461L0856K37511J33869j6092J01331J11832j5056J76005
8900C99038m9487l2792N5541n4047j24910n6414R6489K669j9292k7985o262j85212
8888b664l6751K5415j81Q7892o5283j03792j39824m9540P8287J33647L1960l0676
8876g1510J6207m7041j7221L4219J94793k2510j31780r813l4823j6918J0240Q9016
8864g141n2897J27J3436R8425k8413J48737J3015p8227j25703L0082j03879q8989
8852a81427M0178J06662J14159J04720Q7300q4539n0976j6898n1941j6307m1856
$$ plain form
8935 35014 -71207 -36112 -79534 -18779 -28408 -110947 -147208 -153314 -78020 66416 60787 -86248
8923 -86248 -151125 -154143 -74959 -75360 15181 54902 80964 125418 66535 -107662 -114181 -140555
8911 -140555 -198120 -236757 -361218 -330362 -92851 41018 24926 126257 238089 223033 399038
8900 399038 349551 316759 372300 318253 193343 136929 233418 236087 216795 188810 182548 -2664
8888 -2664 -39415 -14000 -14181 73711 8428 -95364 -235188 -284728 -206441 -72794 -40834 -71510
8876 -71510 -55303 -102344 -119565 -85346 109447 86937 -44843 -54656 -89479 -106397 -96157 -7141
8864 -7141 -60038 -59911 -46475 51950 23537 172274 185289 107062 -18641 11441 -92438 -181427
8852 -181427 -141249 -34587 79572 184292 271592 187053 136077 119179 67238 50931 9075
8841I075P7655N2916K2725j20233l2419L1623j07634j44099J04512k3326j0005
8830a39210m0080N9777L6033j27004j2876N9766P5487N3888n5583L2276Q5752
8819B8226M9802L066N6318p483J7429m7768j6457M7038j04073o9851q812K4565
8807b8000J31002N7625j97875p4494K2349M622K0179M6957Q4135O5218k8678j2867
8795I0173q3555o7873Q3436J25530k1423j48793Q1598M8073o3429J5389j31354
8784g2228k5940N0043l6751M2243j8916N0157K6638R3J050j33499o5506M7863
8772a34753J85232o773J06949R490k1386o0798m7356o7311j5504Q7410N1260k3898
8760F2562R608j50273j24165N4926J15477N0288N6040n8979p2746J04380j5773
$$ plain form
8841 9075 86730 139646 162371 42138 9719 41342 -66292 -210391 -105879 -129205 -139210
8830 -139210 -179290 -119513 -83480 -210484 -223360 -163594 -88107 -34219 -89802 -57526 28226
8819 28226 78028 81094 137412 129929 147358 99590 83133 130171 26098 -43753 -52565 -28000
8807 -28000 103002 160627 -37248 -111742 -89393 -84771 -64592 -17635 66500 131718 103040 90173
8795 90173 6618 -61255 22181 147711 126288 -22505 59093 107166 43737 59126 -72228
8784 -72228 -98168 -48125 -84876 -42633 -61549 -11392 15246 15339 16389 -117110 -182616 -134753
8772 -134753 50479 43706 150655 160145 138759 77961 30605 -36706 -52210 35200 86460 62562
8760 62562 72170 -78103 -202268 -147342 -31865 18423 74463 15484 -57262 47118 31345
8749C1345J2451r249n9726l9297r0904p7843q83L1316J07914k3647K9537Q814
8737h0172N4432l2739K2320J1900R7376O7182q4396r8044k6437m9691k0491K574
8725a36186j14354j77153k556J97090M1270P7010J05932R756l7609p479l681K9703
8713a8257p5839j53873j5423K1058N6348l8584l2845R804Q3538P818n775J52830
8701i200J35699j6343o4591k2423l5825M7587J04387l0584j20540j72249q2143
8690b66225K2617J19974K29713m400k17889p9196K9853K30229O9439q1066j09396
8679e6347j53126Q576J20130O8330Q3682J53943m9572j97389m087k7448P6289
8668B2981O7354P1782m4113k11613O5210P0930l7993j43394k9474J27086Q2526
$$ plain form
8749 31345 43796 34547 -25179 -64476 -155380 -233223 -234106 -202790 -94876 -118523 -88986 -80172
8737 -80172 -25740 -58479 -36159 -24259 73117 140299 55903 -42141 -68578 -118269 -138760 -136186
8725 -136186 -250540 -427693 -430249 -233159 -191889 -114879 -8947 809 -36800 -44279 -47960 -18257
8713 -18257 -94096 -247969 -263392 -242334 -185986 -224570 -257415 -247611 -164073 -156255 -162030 -9200
8701 -9200 126499 110156 45565 23142 -12683 34904 139291 108707 -11833 -184082 -266225
8690 -266225 -243608 -123634 106079 101679 -116210 -195406 -165553 64676 134115 53049 -56347
8679 -56347 -209473 -200897 -80767 -12437 71245 225188 175616 -21773 -25860 -53308 22981
8668 22981 90335 162117 118004 -93609 -28399 42531 4538 -138856 -168330 -41244 41282
8657D1282J40257q2218k51506M6221O7205j8139Q3392J53138k6271j65794L4199
8646B1766R6836L4515j63412j51606k3559o354k4259J22602K7317j6650l1982
8635a14786n3485J10612O0375O5096p7181Q7214m54P2342K8262p4860p1442j94574
8623a62881j16518J21182O1279R5531p7350o9236J41625J9177o8723m4013l0558
8612a30485J11980R8056O9885K4361k87449n4476J49447k2349r1034J8287J27633
8601A3856R5955m0564j61329k6913J6341R100K2988Q4638j7239J37146k0237l1123
8589H2619O1094k6797j22456J01301J34551Q0391J72285n7937k48963M3365l9006
8578A80447m4106M6392Q2633L9698K8255o0648j03204o2242p9817m2300L5991
$$ plain form
8657 41282 181539 99321 -152185 -105964 -38759 -56898 26494 179632 153361 -12433 21766
8646 21766 118602 153117 -10295 -161901 -185460 -191814 -216073 -93471 -66154 -82804 -114786
8635 -114786 -168271 -57659 2716 67812 -9369 77845 77391 149733 177995 103135 31693 -162881
8623 -162881 -279399 -158217 -96938 -1407 -78757 -147993 -6368 12809 -55914 -99927 -130485
8612 -130485 -18505 79551 149436 173797 -113652 -168128 -18681 -41030 -132064 -113777 13856
8601 13856 109811 69247 -92082 -118995 -102654 -93554 -70566 14072 -3167 133979 113742 82619
8589 82619 143713 116916 -5540 95761 230312 310703 482988 425051 176088 219453 180447
8578 180447 136341 182733 265366 305064 333319 272671 169467 107225 27408 -14892 21099
8567B1099K6742j89769l5828o4967L7029M8744r8924J16157J34042N6966j0056
8556D1235m947l4753L4078j3770R2973Q5681l1841j40192n1866J2910j39687J01443
8544d8736J75605o1427r7843k53695j65855J45016J11176N2760k3382N1819p449
8533a22011J12058Q6970J62393N8059k32614j81489j03215J44445O5076j08877
8523a19205j736N4673L6753l020j27797r4516O5249J54008L0543o0289K4460p8550
8511a19427R8324K6317q7007q137N7023Q7445o5524j80050j01803P4884N9913
8500a58042J3453L9650J11441J10511J05108r070O4564n6495j76520m4243o5205
8489f4848j83714J49600j8171k4641J75142K1440q6920p7167Q4123j1477j0449
$$ plain form
8567 21099 47841 -141928 -177756 -242723 -205694 -156950 -255874 -139717 -5675 51291 41235
8556 41235 36288 1535 35613 21843 114816 200497 168656 28464 -23402 -10492 -150179 -48736
8544 -48736 126869 65442 -32401 -286096 -451951 -306935 -195759 -142999 -166381 -114562 -122011
8533 -122011 -9953 77017 239410 297469 64855 -116634 -219849 -75404 -10328 -119205
8523 -119205 -120941 -66268 -29515 -32535 -160332 -254848 -189599 -35591 -5048 -65337 -40877 -119427
8511 -119427 -21103 5214 -81793 -89930 -32907 54538 -10986 -191036 -292839 -217955 -158042
8500 -158042 -144589 -104939 6502 117013 222121 213051 277615 221120 44600 357 -64848
8489 -64848 -248562 -98962 -117133 -141774 33368 54808 -32112 -109279 -25156 -36633 -47082
8478d7082O7686L1755N5834o5414j17j6238O6904J28438l9464O409L4037j04494
8466A18254j49774Q5686M3375l3504K6172L2403K08787J58360j99611j77960Q721
8455A20909j22568P3908R4465J9155r8394Q2350J01890n3209J2965j01585j55059
8444b5173q2454J5068N3514Q2878k4844K8968L9702L9943K4185r2361k9842P8706
8432A08290J15548q8568J34694R7454J3984L1693n3500q4034j51668r1789P5680
8421A07784Q9356l1289J7147l5610j07376k3927k3834K3567j1477p7684M0069
8410c3274P0193R1029k4864k6537l5436P3853r3578j03540j08360J29736Q9668
8399B8890m7529M9750o4303q9002K0365M8558M6541Q232j7151p8366r572J31578
$$ plain form
8478 -47082 20604 52359 108193 42779 42662 26424 93328 221766 182302 188711 222748 118254
8466 118254 -31520 54166 97541 64037 90209 122612 331399 489759 290148 112188 120909
8455 120909 -1659 72249 166714 185869 87475 169825 271715 218506 231471 129886 -25173
8444 -25173 -107627 -92559 -39045 43833 18989 47957 87659 127602 151787 59426 29584 108290
8432 108290 223838 135270 269964 367418 381402 413095 359595 275561 123893 32104 107784
8421 107784 197140 165851 182998 147388 40012 16085 -7749 15818 4341 -73343 -33274
8410 -33274 36919 127948 103084 76547 41111 114964 21386 -82154 -190514 -60778 28890
8399 28890 -18639 31111 -33192 -122194 -101829 -53271 -6730 1502 -15649 -94015 -103587 27991
8387B7991J14776k7009o3477k9347R0908L0492j23553K4672k9300j08850O5289
8376b7408M5349J8013p5333l1198j86678R6552J12627M2755q1062L4733R9993
8365D8343J17871p9959o2865J99713P300r3428j71046j09548L8799M4460J64877
8354A04517M5019o7631q6517J35383O8511p629K1072j20469n6379Q4985M2222
8343A63084m6877K0749o3816r2224r0008K3801M0421M0752J4994M3575j39128
8332h4677K8509O4048N2319M6106J24414j04603n6016K4992j48322m8277J17131
8321A5624R418l3838K1176Q4326o291j29110j99255L3766Q9806J23179k2001L9692
8309B6492j8622J9688j22312o2889K07794O0330l7770j19811J6880K02126R3900
$$ plain form
8387 27991 142767 115758 52281 22934 113842 144334 20781 45453 16153 -92697 -27408
8376 -27408 17941 35954 -39379 -70577 -257255 -160703 -48076 -5321 -86383 -51650 48343
8365 48343 166214 86255 23390 223103 230403 136975 -34071 -143619 -104820 -60360 104517
8354 104517 149536 81905 -4612 130771 199282 191653 212725 92256 35877 120862 163084
8343 163084 116207 136956 73140 -19084 -109092 -85291 -44870 -4118 10876 54451 -84677
8332 -84677 -56168 7880 60199 106305 230719 126116 70100 95092 -53230 -101507 15624
8321 15624 25042 -8796 12380 96706 90415 -38695 -237950 -204184 -114378 8801 -13200 26492
8309 26492 7870 27558 -94754 -157643 50151 110481 72711 -47100 -30220 171906 265806
8298B65806K8156Q6409j16380j50107j5814N488j20791P008L6962n3496r4672
8287a21431j8785J19492J6056j41823P1346K7135j01660m2602R9578J95293O4352
8276A66951k24814l7688L8561N6318M3219R8719J27202J39154n7406q1908j75923
8265I2385j27757n0129J26694n7910j05860Q5021Q38L4313n7366K9119K486k4219
8253e2385P637j57888j01035O1989K1100J26218n7857k0562J53010o2041j21208
8242b03022O8916M9948N4215M4213O5879o3356m0312j9833q9362L8103L7383Q904
8230d8324J315p4694N7673N4639j06157o137K6705J23725J13965M4156n0150m6776
8218H9940j04593k10388J32014J62442J51498q4573j52071n6568q4009O2482J32700
$$ plain form
8298 265806 293962 380371 263991 113884 98070 103558 -17233 -10225 26737 -26759 -121431
8287 -121431 -140216 -20724 -4668 -146491 -75145 -48010 -149670 -192272 -92694 102599 166951
8276 166951 -57863 -95551 -56990 -672 42547 141266 268468 407622 350216 268308 92385
8265 92385 -35372 -85501 41193 -16717 -122577 -37556 -36718 -2405 -59771 -30652 -28166 -52385
8253 -52385 -44748 -202636 -303671 -241682 -220582 -94364 -152221 -172783 -19773 -81814 -203022
8242 -203022 -134106 -84158 -29943 14270 80149 16793 -23519 -43352 -132714 -94611 -57228 -48324
8230 -48324 -47009 -121703 -64030 -9391 -115548 -121685 -94980 28745 142710 186866 136716 89940
8218 89940 -14653 -225041 -93027 69415 220913 136340 -15731 -72299 -156308 -93826 38874
8207C8874p404o5685q4378k4055m7897O6694K61300l9968J1629L6237j36943k3601
8195a5197n9320J6562M4302j1522N4120J20718l5842k21976n2450O9400P4580
8184a6625M6646M3261n9082o3023l5504j61586j01116R7264M9334J14502j0373
8173i6302P8717O426k526M5095j16890n772o018J4367O9437J4432k886n9761k225
8160f3906M4370n2116N7494J9458J6299j51375J7319O5461Q9063L6304p1723k4211
8148a7563L712m6328j17210k36689j34814J04174K02947J49997R8256P6258l5268
8137D7472N4231R1854n4759k14430J6162j5794m127O4218R0644Q9868j89933o9810
8125i4404J38131K3877L1360J31875j20546j98299J7962J20444j30362j58130
$$ plain form
8207 38874 31470 -34215 -118593 -142648 -190545 -123851 137449 97481 109110 145347 8404 -15197
8195 -15197 -74517 -57955 -13653 -25175 28945 149663 113821 -108155 -160605 -91205 -16625
8184 -16625 30021 73282 14200 -48823 -84327 -245913 -347029 -249765 -200431 -85929 -96302
8173 -96302 -17585 -11159 -13685 31410 -85480 -91252 -97270 -82903 -13466 966 -1920 -61681 -63906
8160 -63906 -19536 -71652 -14158 5300 21599 -129776 -112457 -46996 42067 78371 6648 -17563
8148 -17563 -13851 -60179 -177389 -414078 -548892 -444718 -241771 -91774 6482 82740 47472
8137 47472 101703 193557 138798 -75632 -59470 -75264 -79391 -15173 75471 165339 -24594 -94404
8125 -94404 43727 67604 98964 230839 110293 -88006 -70044 50400 -79962 -238092
8115b38092j8759O0489J01913L6386L0934O4711L1135j6158j0624k9838j24940
8104a12843l4990j18768j0180J49648J77157l571j55580j10712l0366R8399J86775
8093C4969M8576M6421k4912M9680p8936j04121r8976J19300M3303R6500j9694
8082A12110n2898L6970r0213K03L5164p2857L1072M3106j0052o795k4367K3964
8070B5407r3916o5844Q9128M8244p125k0386J3148j16639L55O1378N5572N153
8058e525O7515o5393l8953J79506J28964j25010k71958K937N5051K9189J05403
8047F1726r9775P404j8506O4464J4878m6504M5431r917j29259O9937R7546o3041
8035e616k8120l0772l6271O1072L1805J09828o7702R1728k696m7611p0926L0810
$$ plain form
8115 -238092 -256851 -196362 -94449 -58063 -27129 37582 68717 52559 41935 12097 -112843
8104 -112843 -147833 -266601 -276781 -127133 50024 46453 -109127 -219839 -250205 -151806 34969
8093 34969 83545 129966 105054 154734 75798 -28323 -127299 -7999 35304 131804 112110
8082 112110 59212 96182 5969 6172 41336 -31521 -449 42657 32605 25810 1443 25407
8070 25407 -68509 -134353 -45225 3019 -4106 -24492 -11344 -127983 -127628 -66250 -10678 -5525
8058 -5525 61990 -3403 -42356 137150 266114 141104 -130854 -127917 -72866 -43677 61726
8047 61726 -38049 -30645 -49151 15313 30191 -16313 29118 19201 -110058 -40121 57425 -5616
8035 -5616 -33736 -64508 -100779 -39707 -7902 101926 34224 125952 123256 75645 4719 35529
8023C5529K7366N919n7720k8629M6701j9039p5577L0534p4283k7197M9872J81116
8011I4592M1338j00573j57941l9713J2646J53637J65058M2665J4475j0956K0452
8000B35680m2684j58301N6885j7099L5140p1107j16143R6859N858j5467n5745
7989d6124p6416J5493J30145J28049N885m3832q059K1697l2202Q947n6313j9774
7977B7496O302o242j01434Q3921J17617P3387j08343k13576q8016P872Q2804J26476
7965H264J51590m6623o3131j56895J7063K11474j6804L175m1493M706n3697k4461
7953f832Q4412k0829l6980m9865N4206l5469j10011j3958M3755L523p0169j201
7941a59418M751L4837l8792R5231M1712M6624O1515L415l4049j02261o2341l0208
$$ plain form
8023 35529 62895 68814 11094 -17535 29166 10127 -65450 -34916 -109199 -136396 -86524 94592
8011 94592 135930 35357 -122584 -162297 -149651 3986 169044 211709 226184 215228 235680
8000 235680 192996 34695 91580 74481 109621 38514 -77629 19230 25088 9621 -46124
7989 -46124 -122540 -107047 23098 151147 157032 113200 105141 126838 94636 103583 47270 27496
7977 27496 33798 27556 -73878 10043 127660 201047 92704 -120872 -208888 -201016 -118212 8264
7965 8264 159854 113231 50100 -106795 -89732 121742 104938 108113 66620 71326 17629 -6832
7953 -6832 77580 56751 19771 -30094 24112 -11357 -121368 -135326 -91571 -88048 -158217 -159418
7941 -159418 -154667 -119830 -158622 -63391 -21679 24945 86460 89875 55826 -46435 -108776 -138984
7929a38984k214J49678Q3835o6662r1284j27561N90P2246Q1986j6255O0578j295
7917D658p5603M4326R6268m2495p1763J1066o8760L4857M8764Q6817O4023j23366
7905H792j16331l0813J81293q3325r7941l0806J44119P8968P7427r0534o6626
7894b5777J14322K8614k20950j15566J3742J19263o3773p886R8987l6512q3933
7883a79469j01876P2800p1492R2102N5993N6301P6671j33358n8352J54939R4075
7872E8334Q7773L308m2348n5475j838N0627n2735r2823O7396J69855k18553j00912
7860a27391k4571j8930J59942K31369n0126n0066o9998K0554l5014j90468K7286
7849a27413J11080l650M5855k6939L1809L8912k26685J3736J15340l345j4967
$$ plain form
7929 -138984 -141198 8480 92315 25653 -65631 -193192 -192602 -120356 -38370 -54625 5953 4658
7917 4658 -70945 -26619 69649 27154 -44609 -33543 -102303 -67446 -18682 68135 132158 8792
7905 8792 -107539 -138352 42941 -40384 -138325 -169131 -25012 53956 131383 40849 -25777
7894 -25777 88545 117159 -103791 -219357 -205615 -86352 -150125 -158011 -59024 -95536 -179469
7883 -179469 -281345 -208545 -280037 -187935 -131942 -75641 1030 -132328 -190680 -35741 58334
7872 58334 146107 149415 107067 51592 49754 100381 47646 -45177 22219 192074 -26479 -127391
7860 -127391 -151962 -170892 -10950 220419 170293 120227 50229 70783 35769 -154699 -127413
7849 -127413 -16333 -19983 25872 -1067 30742 69654 -157031 -143295 -27955 -31300 -46267
7838d6267k3001l3451K4566m6967p6265K08111O5412j0943n9161M635M2438k5647
7826B3460K585n0946m018J0055M5252q4347j24058M1685Q4437n0325M3260o3706
7814a26666N8439N6461K730n3714O0241n4844q6485R6955L966Q2788p696j27939
7802i5764l6782n1989J0002L1441m0647K4310Q68R4268J18393l7982M9619J00234
7790A65971N8698j4697p9072q6656j31100o9078K8366K4716r0049p1140O8802
7779a95239m1039O7035L3679j4448J2500R4840m8021o8101J06286N651j9691M0697
7767b5851q2882M3828j43668M7896J12591J3982J9173j77413p2353O1039J08203
7756i5455k8404K2916l3052R7038M7764p9450n3829j4205N5736q5801M8980R500
$$ plain form
7838 -46267 -69268 -102719 -78153 -125120 -201385 6726 72138 61195 2034 6669 49107 23460
7826 23460 26045 -24901 -28919 -18864 26388 -57959 -182017 -140332 -55895 -106220 -62960 -126666
7814 -126666 -68227 -11766 -9036 -62750 -2509 -57353 -143838 -46883 -42917 39871 32175 -95764
7802 -95764 -132546 -184535 -174533 -143092 -183739 -159429 -158561 -64293 54100 16118 65737 165971
7790 165971 224669 209972 130900 44244 -86856 -155934 -127568 -102852 -192901 -264041 -195239
7779 -195239 -236278 -169243 -135564 -150012 -137512 -42672 -90693 -158794 -52508 -46857 -66548 -25851
7767 -25851 -108733 -64905 -208573 -160677 -48086 -34104 -14931 -192344 -264697 -203658 -95455
7756 -95455 -123859 -100943 -133995 -36957 10807 -68643 -122472 -136677 -80941 -166742 -117762 -108262
7744a08262J26265l7793p6112O7212J21437M1324n3757j4425M3461l0137m0805
7733C8408N3120L2657k0382j52089l7428Q2237R7937j4667j1763n7362j0351j26478
7721a26161j00114J09229O7993o3614K4470Q2526K2055p2987L2406R1707K4338
7710I1848q3631J04142J02847J2146j47025j09811O6652j39596p6831k8479R684
7699a98054J28329N766L8043p4621o7048m7074J77701k2456j75289j54260J35931
7688b53032K99078M759N7796q616j56470J0491j48879o5704M6190K35454Q5163
7677A06230n0645j13844l3977P7964n1466q235m9038j01666P6069O3477Q2806
7666b325q1041k9859p618p4409K5072m6712J00675K02699R2472O2191k6462o4208
$$ plain form
7744 -108262 18003 -19790 -95902 -28690 92747 134071 80314 65889 109350 79213 38408
7733 38408 91528 124185 103803 -48286 -85714 -3477 94460 79793 68030 10668 317 -126161
7721 -126161 -226275 -117046 -49053 -112667 -88197 -5671 16384 -56603 -24197 67510 91848
7710 91848 8217 112359 215206 227352 80327 -29484 37168 -102428 -179259 -207738 -198054
7699 -198054 -69725 -63959 -25916 -100537 -167585 -214659 -36958 -59414 -234703 -388963 -253032
7688 -253032 46046 50805 108601 99985 -56485 -45994 -194873 -260577 -214387 21067 106230
7677 106230 55585 -58259 -92236 -14272 -65738 -73973 -123011 -224677 -148608 -85131 -2325
7666 -2325 -83366 -113225 -120843 -195252 -170180 -216892 -116217 86482 178954 241145 214683 150475
7654A50475j61624K1953m56N6098k6510q4448O8201J53262L0205P4939Q993l1591
7642B59497m7536j05280q2418l6045j30432n0887J9645R0192J71323j1305m4163
7631C2591p918q5474L6522R8213m8647p763P6050j71116j23222m612J33659P5773
7619D056J56287p0638j0454L469l3412j9257K02882L0341j67657k00946R826Q4192
7607a1311R132J29114R3559n7534q6350j17220L1830K23492P8456q3365k13809
7596d006q382j14010p7499K18508J3675j49902J8543J61435j6228j28701l0760
7585a17327O6075j13391N3142J70676m0584p4541N1628K6072l4102Q3316j71836
7574a00872o7405L0859p1857O8756R4666O9862O747p274J26015R6151p1865L2727
$$ plain form
7654 150475 -11149 10804 10348 66446 39936 -44512 23689 176951 207156 282095 291088 259497
7642 259497 211961 106681 24263 -11782 -142214 -193101 -173456 -83264 88059 76754 32591
7631 32591 24673 -60801 -24279 73934 25287 17524 93574 -77542 -200764 -205376 -71717 4056
7619 4056 160343 89705 79251 82720 49308 30051 232933 263274 95617 -105329 -95503 -11311
7607 -11311 -2179 126935 220494 162960 76610 -40610 -8780 214712 293168 209803 -4006
7596 -4006 -12388 -126398 -203897 14611 28286 -121616 -103073 58362 42134 -86567 -117327
7585 -117327 -51252 -164643 -111501 59175 18591 -55950 -4322 21750 -12352 70964 -100872
7574 -100872 -168277 -137418 -209275 -140519 -45853 24009 30756 23482 149497 245648 173783 206510
7562B06510J07j00744k0811O7760l5639k6950j68153m5192N5084J51017K3618
7551A06607k9782l2140r5354j09769k5766R1401J10398P6388j50390n7097J7986
7540i7518Q6918p2936l5427m8374j16252J96509K3842Q7302K7718j2727Q7060
7529A26115J52135N315k08726j65549M2615m1397Q650j393p697L6326M1970q4929
7517i6565k1521P4309P8117J15252O580j03742o3184R7986k917j46366P9982J78321
7505A96252K6008j11330q8903Q5325Q768j8105n8338j14393r5623O9380K40919
7494A39960J84028o0094j89315J7479R7574m2989o313K7259l6991m1036R1436
7483A80998m4437N730N2013j14943o3446M747N832N8956L3951n6690k13295k85
$$ plain form
7562 206510 206617 105873 85062 152822 117183 90233 -77920 -123112 -68028 82989 106607
7551 106607 76825 44685 -50669 -160438 -186204 -94803 15595 91983 -58407 -115504 -97518
7540 -97518 -10600 -83536 -118963 -167337 -283589 -87080 -63238 24064 51782 39055 126115
7529 126115 278250 283565 74839 -90710 -48095 -89492 -80842 -82235 -89932 -53606 -11636 -96565
7517 -96565 -118086 -43777 34340 149592 156172 52430 -10754 87232 84315 -62051 17931 196252
7505 196252 222260 110930 22027 107352 116120 98015 39677 -74716 -170339 -100959 139960
7494 139960 323988 263894 74579 92058 189632 146643 140330 167589 130598 89562 180998
7483 180998 136561 142291 194304 79361 15915 20662 26494 85450 119401 62711 -150584 -150869
7471a50869P2448J20056K9448J17656r2481n0854q3144P1335J73390R4391j24005
7460A77371j44093J7807r2838j13105m574P0877n2408M2381k5327M1109q5324
7449a68124M8823J62261J7247j61914J8886m1068K6531N8067p1026R8752M3006
7438C1441K6129j39730L9014J06379p4632k3433M7142Q3459p1071m5830l7507
7427e8639N9469J79357k0106o3225J14128j8365q6493j39746Q788k5529O7907
7416A7546Q3188r7858p9330P7414K0162j12669l5106Q7068P9585j06588j1365
7405g7953k4001p2387K7504L1778J07749p7859j42023Q4517O8844J31353K16146
7394B73668j7056j26230n5862n6611o0762K0153Q3727o503J39882K7811j58275
$$ plain form
7471 -150869 -78421 41635 71083 188739 96258 45404 -37740 33595 206985 301376 177371
7460 177371 33278 51085 -41753 -154858 -159432 -88555 -140963 -98582 -123909 -82800 -168124
7449 -168124 -119301 42960 60207 -101707 -82821 -123889 -97358 -39291 -110317 -11565 31441
7438 31441 57570 -82160 -43146 63233 -11399 -34832 12310 95769 24698 -21132 -58639
7427 -58639 830 180187 160081 96856 210984 192619 106126 -33620 -24832 -50361 17546
7416 17546 100734 2876 -76454 960 21122 -91547 -126653 -39585 40000 -66588 -77953
7405 -77953 -101954 -174341 -146837 -115059 -7310 -85169 -227192 -142675 -73831 57522 273668
7394 273668 256612 130382 74520 17909 -42853 -22700 61027 54524 194406 222217 63942
7383F3942j14300j28451J89978N8055k1955J025r8452j17219Q2083K3559n4290
7372a16025j7415M4087m3045J25737J55508k3678r2455q531L6447n5513j15634
7361a10517J85191L3565p8448m7645r2561L1477o2063p4146J32793J03378p0900
7350d9876K8513p5713J01589n4176R903k5618j14288Q0115O6875o2844m3974k104
7338a41598q0639J35694n2282n2675j14811K1529J18863M8694K3271P912R67J45836
7326F0761J73609Q628j02180R9880M1638j16182M1129q48j76657P3549J9030m9318
7314G3039J72099n1014j87580j080p401M154O4568L8150r159L3665M0094j09692
7302E9843j33520p2363J3915R8573L8397q2768j05707P2006J76872l1711j8706
$$ plain form
7383 63942 -50358 -178809 11169 69224 47269 48294 -50158 -167377 -85294 -61735 -116025
7372 -116025 -133440 -89353 -132398 -6661 148847 125169 32714 24183 60630 5117 -110517
7361 -110517 74674 108239 29791 -17854 -110415 -78938 -141001 -215147 -82354 21024 -49876
7350 -49876 -21363 -97076 4513 -49663 -39760 -65378 -179666 -99551 -32676 -95520 -139494 -141598
7338 -141598 -222237 -86543 -138825 -191500 -306311 -284782 -165919 -117225 -93954 -86042 -85075 60761
7326 60761 234370 242998 140818 240698 282336 166154 207283 206435 29778 103327 122357 73039
7314 73039 245138 194124 6544 5464 -1937 2217 66785 104935 95776 129441 169535 59843
7302 59843 -73677 -146040 -132125 -33552 4845 -77923 -183630 -111624 65248 33537 14831
7291A4831j7550p990K1026J07730r7474n9902l5095P259k2093j13653M784R541
7279a88586m2524R5446L3497J45890K3270k5211j59958p2445J6011l4368Q9068
7268a19910o221l3396K2028o019O4084J02738P4437N7422R5009q7975j10624q7972
7256c6399p9207q7534J7281L5704J8124J07964M8963J43191L076n1721j59035
7245c9593k4775J14041P5848j3127k1729o280K5108m2343m6786j29643m2621q0448
7233b32348P1648J10307J04694l2597j10922j16830J54106N2697o2904R0547J80765
7222B09163P0084k2067p1523m3642O510k6090n9337k1932J17961k5761J7571J04428
7210B55365N6736j69519j39063l1756P3100J52354J00447K7502o3649k26380j15197
$$ plain form
7291 14831 -2719 -10709 10317 118047 20573 -39329 -74424 -67165 -89258 -202911 -198127 -188586
7279 -188586 -231110 -135664 -102167 43723 66993 41782 -118176 -190621 -174610 -208978 -119910
7268 -119910 -126131 -159527 -137499 -143518 -79434 23304 97741 155163 250172 162197 51573 -36399
7256 -36399 -115606 -203140 -185859 -150155 -132031 -24067 24896 168087 171163 119442 -39593
7245 -39593 -64368 49673 125521 112394 90665 84385 109493 67150 20364 -109279 -151900 -232348
7233 -232348 -160700 -50393 54301 21704 -89218 -206048 -51942 755 -62149 28398 209163
7222 209163 279247 257180 185657 142015 148525 122435 63098 41166 159127 133366 150937 255365
7210 255365 312101 142582 3519 -28237 44863 197217 297664 325166 261517 35137 -80060
7199h0060k6735J07035j5293J17029m2354m8717j26511r8648M3109r5894r0896
7188c57935M4249P3234J01470O1867l3729P2574R5382k7564L9227J08376L1552
7177B08703r5950l9464R697R665P2453r1060j13669q1171L2207J77048J0466n9782
7165C9143K73j2436j9084k20216m5915L4055R199R3858N3891j6213n073l8366
7153a26884J4937l4787o1205m2617M8720M0696M0095J13207Q9204l2021k6216
7142B3129K254p2640K6558l6365o956M3296J10776k5431L2091p3434j28769J50759
7130D5268Q1001k9809N246q3574j26887r8222L8095J1554K4234J66905J05911
7119A39722p3658k30791p3494J20563J57211k4393j9782p5667R5435Q3496m1445
$$ plain form
7199 -80060 -106795 240 -15053 101976 59622 10905 -115606 -214254 -171145 -267039 -357935
7188 -357935 -313686 -240452 -138982 -77115 -110844 -38270 57112 29548 68775 177151 208703
7177 208703 112753 73289 82986 92651 165104 74044 -39625 -120796 -88589 88459 98925 39143
7165 39143 39416 26980 7896 -212320 -258235 -224180 -214981 -121123 -67232 -83445 -88518 -126884
7153 -126884 -111947 -146734 -207939 -250556 -201836 -161140 -121045 -7838 81366 49345 23129
7142 23129 25383 -47257 -20699 -57064 -64020 -20724 90052 64621 96712 23278 -105491 45268
7130 45268 126269 96460 101706 18132 -108755 -206977 -168882 -157328 -133094 33811 139722
7119 139722 66064 -164727 -238221 -117658 39553 15160 -4622 -80289 15146 98642 57197
7108E7197l7898j23731m1465o6125k2660Q5851K02530J26791J01418m5818j09667
7097A26423L7564r7647j45657O934M0464N0552q3321J36950J6087N6474p2003
7086G2820n4282L3038k7460M1805N2872r418p4659j11271j13027p1782j7947J41688
7074a37623R9497o2819j32983j06380R4644Q9434q8772K6388q253j1391j25524
7063c63782m1030K07709Q4192o571L1901N3538K1129r6145o0967n1715o1879M0573
7051b43047M1561k604N9171k2957J5132M0187N8731Q6736N3010j6643k9653J6748
7039E6372R877O9818m958j38288p0060L9790J15664P3468j80847l3367J72268
7028A09737k0560j68486o9405M715J03918Q6478j45465J9456J07969r2655K0675
$$ plain form
7108 57197 19299 -104432 -145897 -212022 -234682 -148831 53699 180490 281908 236090 126423
7097 126423 163987 66340 -79317 -72383 -31919 18633 -64688 72262 88349 144823 72820
7086 72820 18538 51576 24116 65921 118793 109375 34716 -76555 -189582 -261364 -279311 -137623
7074 -137623 -38126 -100945 -233928 -340308 -245664 -156230 -245002 -218614 -226867 -238258 -363782
7063 -363782 -404812 -197103 -112911 -119482 -87581 -34043 -12914 -109059 -170026 -221741 -283620 -243047
7051 -243047 -201486 -204090 -144919 -167876 -152744 -112557 -53826 32910 85920 69277 39624 56372
7039 56372 66249 136067 131109 -7179 -77239 -37449 78215 151683 -29164 -62531 109737
7028 109737 89177 -79309 -148714 -143999 -40081 46397 -99068 -79612 28357 -64298 -43623
7017d3623Q7610N9400J66842O886l7758j8197m0357j31576M3843J41074J26108
7006C60252r0877r4122k4217j17528o1581L1405J59197o8253L9325o9673j20865
6995e6937J02742j44186j22402J31990Q3810M8950j23771p7292l0844P8712j1740
6984a20968K04909O1879l3047k079k3459j19362n697l073N7750o8822p9749K3656
6972a08062j06720K9710n6253N6183J55002k374M291R8821j0876p7350m0401J07049
6960D9020L9051k964j11598K5351m3038j07876O3706K2115J13195P9546L5644
6949A62152J20831n2146q8610j30882J0981l6841o4135P8589n4370k9839N7034
6938b7236p329J8862J9672r1999l1553J60934J16455o6221n0054n1570j28471
$$ plain form
7017 -43623 43987 103387 270229 277115 239357 221160 180803 49227 93070 234144 360252
7006 360252 269375 175253 151036 33508 -28073 3332 162529 94276 133601 63928 -56937
6995 -56937 45805 -98381 -220783 -88793 -4983 43967 -79804 -157096 -187940 -109228 -120968
6984 -120968 83941 145820 112773 110694 87235 -32127 -37824 -40897 16853 -51969 -131718 -108062
6972 -108062 -214782 -185072 -241325 -185142 -30140 -32514 -28223 70598 59722 -17628 -58029 49020
6960 49020 88071 85107 -26491 -1140 -44178 -152054 -88348 -66233 46962 126508 162152
6949 162152 282983 230837 142227 11345 22326 -14515 -78650 -61 -54431 -84270 -27236
6938 -27236 -34565 -15703 3969 -88030 -119583 41351 157806 91585 41531 -10039 -138510
6927a38510q3377M2290J27648L4704l2119n4504O4974J9482N038J03886K2997
6916A12509l3793l7505j11251r8870O0682J55962L0710j01452j7711j28701l6589
6905b06009P3638R4213Q3907L0302m3054p0915l0368N3198l7474j10739n3007
6894b16308k5197L8287J54301k3461K1111J8574l8340M4039R2565n9774j17064
6883a11267J18877n9720r9364n4501O0738j542J01988J17342k2571j41851n4035
6872a45906J4847J29299o9619M5433o290N911L562O3749o6198j03637M9102J60722
6860H0975J9521n6676k6773l8036K3116L4754o1423J13362J7077l0004M0156p3982
6848D2067j0303N3184l4621j26708j0320P3836L5238J3912j51988o9126K7722
$$ plain form
6927 -138510 -221887 -179597 -51949 -17245 -49364 -103868 -38894 -19412 -14374 89512 112509
6916 112509 78716 41211 -70040 -168910 -108228 47734 78444 -23008 -40719 -169420 -206009
6905 -206009 -132371 -38158 45749 76051 32997 -37918 -68286 -15088 -52562 -163301 -216308
6894 -216308 -241505 -203218 -48917 -72378 -51267 -32693 -71033 -26994 65571 5797 -111267
6883 -111267 7610 -52110 -151474 -205975 -145237 -146779 -44791 72551 49980 -91871 -145906
6872 -145906 -131059 -1760 -71379 -25946 -32236 -26325 -22763 40986 -25212 -128849 -79747 80975
6860 80975 100496 43820 17047 -20989 2127 36881 -24542 88820 105897 75893 116049 42067
6848 42067 31764 84948 50327 -76381 -86701 -12865 22373 36285 -115703 -184829 -157107
6837a57107n4088R1411Q8596J786L0071J45631n9478p1192l2401M3025q442M708
6825B2520r6974m1278P8823K6163l956K8495L0870j18407j78588K7951J08260
6814a16121l1081O0944O1064J11163J08685j09269p3823l0852o8812P8460J9780
6803A0138r1128N1009K2504L4146L0332j5472L5192O766K5085j49333O3465K5208
6791D7912Q3222M6908J3383q8846j84312j01923K6216P0466j5508O2699P2286
6780C2503n0180p0683R375N1757k8788k924n1966O7813j1908N124j0950o798J02027
6767C4402L263K1065P8176J1171j26370j39539R2799m8420j31318J42949k4813
6756h6635o5165P2047j1642j5571q5528k5651J21193M370j9544J04356R35J1900
$$ plain form
6837 -157107 -211195 -119784 -31188 -29402 669 146300 86822 15630 -16771 26254 17812 22520
6825 22520 -74454 -115732 -36909 -10746 -14702 13793 44663 -73744 -252332 -224381 -116121
6814 -116121 -147202 -86258 -25194 85969 194654 85385 11562 -19290 -88102 -9642 10138
6803 10138 -80990 -29981 -7477 26669 57001 41529 76721 83487 108572 -40761 22704 47912
6791 47912 131134 178042 191425 102579 -81733 -183656 -157440 -86974 -102482 -39783 32503
6780 32503 -17677 -88360 -78985 -27228 -56016 -58940 -110906 -43093 -55001 -49877 -60827 -67625 34402
6767 34402 37665 58730 136906 148077 21707 -117832 -25033 -73453 -204771 -61822 -86635
6756 -86635 -151800 -79753 -91395 -106966 -192494 -218145 -96952 -92582 -112126 -7770 -6835 5065
6744E065n3020R3970o028q7262j6202N0449O6183K1470l048p0116N975q600p181
6731h345l4447j621J10653J66954J0921n2184J26440M1347l9064j38297o6395
6720A15962k3585p1114j21573j38089Q9937L0889o4224m1895J58907R4419k4443
6709E191o5871r685J93486J9236j60229J9313K09530j08259m7560m8073k1940
6698a4861M7496P5021M2052J24170J662j35262J29939J0683j47012L6085o4820
6687A05153o4275p7297j21106n7191L3993J68281K694N050l6581k6415j590k77126
6675c46410q570R3481J31670J34173M5255j38867p5425P9735Q4727Q2749k9110
6664E3408o1382L0281o0880j00371J50921O5594j77620O5132J11081R511K9704
$$ plain form
6744 5065 -47955 46015 39987 -47275 -63477 -13028 53155 74625 71577 1461 7436 -1164 -8345
6731 -8345 -42792 -44413 66240 233194 244115 191931 318371 359718 320654 182357 115962
6720 115962 92377 21263 -100310 -238399 -148462 -117573 -181797 -223692 -64785 29634 5191
6709 5191 -60680 -70365 123121 142357 -17872 1441 210971 102712 55152 7079 -14861
6698 -14861 32635 107656 149708 273878 275540 140278 270217 280900 133888 169973 105153
6687 105153 40878 -36419 -157525 -214716 -180723 -12442 -9748 -4698 -41279 -67694 -69284 -346410
6675 -346410 -354980 -261499 -129829 4344 49599 -89268 -164693 -84958 -231 82518 53408
6664 53408 -7974 22307 -38573 -138944 11977 77571 -100049 -34917 76164 85675 115379
6653A15379M594P8309j03708m5120m0644l445k1981P324K805q3191k9949J41011
6641B1384l240j04699q1240j64967l4578R2293M6947Q0752J56689R9046q1618
6630B6769q7294M5113k0920K8205J46896J31072j13438J474j61507q4909M4414
6619d4125O7590p7527k2166j4763J01227Q5987J5866r6675n8397M8365J08158
6608A13540L7726q0571k4296j9713P6319K9346o8701p6303k6553J69038j45921
6597a6089j23760M3803L9163K013k9656J5140O729m2672J3584M5500N5356j29656
6585a20545k3958J17759J77719p5381j57110j19864O2731J19447N5504J1879O2909
6574A11090l2781j28554K7067Q244N1945l7154j128j2842J46607n698k9272j2624
$$ plain form
6653 115379 119973 198282 94574 49454 8810 5365 -16616 -9292 -6487 -89678 -119627 21384
6641 21384 18144 -86555 -167795 -332762 -367340 -275047 -228100 -147348 9341 108387 26769
6630 26769 -60525 -15412 -36332 -8127 138769 269841 156403 157877 -3630 -88539 -44125
6619 -44125 23465 -54062 -76228 -90991 10236 96223 112089 15414 -42983 5382 113540
6608 113540 151266 70695 46399 26686 103005 132351 63650 -12653 -39206 129832 -16089
6597 -16089 -139849 -96046 -56883 -54870 -84526 -69386 -62657 -105329 -91745 -46245 9111 -120545
6585 -120545 -144503 -26744 150975 75594 -81516 -201380 -138649 -19202 36302 48181 111090
6574 111090 78309 -50245 -23178 -14934 37011 -143 -1271 -14113 132494 126796 97524 84900
6562H4900j1746n2679n4924J25235J14003j25893n1356J745J7521N4402N1708
6551A52916L8928j7571N7139Q9254L2991l7811l1712j960j36831p6399o9962o5308
6539f6326m0160L5979j30278Q4937O6101J26394k7092j18944o1413o5589O4953
6528a31438R3964L7857J58955m1119j30262j05093L696J40344P1599j8696l4194
6517D5613j8078Q1078m1196q6721O0280O852K9581j07941o6675J38709j01912
6506f0410R381K8395j14038J38373k7932n373m3484l1508Q9397P7645O8752L121
6494A32319j27152j39182l9442K4918P3994N1864J4161O9034K9723m8410J6662
6483E8489L06O8664K6080K7876q5223m3520N985r5038l1123P0857O469p345j64327
$$ plain form
6562 84900 73154 20475 -34449 90786 204789 78896 27540 29285 46806 101208 152916
6551 152916 191844 174273 231412 320666 353657 315846 284134 282174 145343 68944 -1018 -66326
6539 -66326 -106486 -70507 -200785 -115848 -49747 76647 49555 -69389 -130802 -196391 -131438
6528 -131438 -37474 383 159338 118219 -12043 -117136 -113440 26904 98503 79807 45613
6517 45613 27535 108613 67417 -19304 40976 47828 77409 -30532 -97207 41502 -60410
6506 -60410 -51029 -22634 -136672 1701 -26231 -31604 -75088 -106596 -17199 60446 129198 132319
6494 132319 5167 -134015 -173457 -148539 -74545 -22681 -8520 60514 90237 41827 58489
6483 58489 58795 127459 153539 181415 96192 52672 58657 -36381 -67504 3353 9822 2477 -161850
6470a61850J2625J02677R9532r8485o0216K1125P6539J04709r9864j25299l3987
6459a62494P8599J58567J01681k3294p2378q3632p3636L0335J12403P1857R1668
6448B29676n6039j05007r0850L6108r014j45737K6916j1749j7528J45342P3074
6437G5192j54359j0397J16467J45832j19300q9544j7776l7671o6425j6284J59909
6426a4356O852j9468J2423r1329N0342O7864k3548K9335N2473J42957m1284j79173
6414f912m7472n1351K7195J10713J9783J1037K6808N8983p0409l1591r5283k2834
6402g1333m4884L2441P4862j0925N0463k4599m7771o7609j33807J23095O7854
6391e2213p3184q647J40835J38433N1990R323j61293j49311N0946J00330K7387
$$ plain form
6470 -161850 -149225 -46548 52984 -45501 -105717 -84592 -8053 96656 -3208 -128507 -162494
6459 -162494 -83895 74672 176353 153059 80681 -2951 -76587 -46252 66151 138008 229676
6448 229676 173637 68630 -22220 13888 4874 -140863 -113947 -125696 -143224 2118 75192
6437 75192 -79167 -89564 26903 172735 53435 -36109 -53885 -91556 -157981 -174265 -14356
6426 -14356 -7504 -26972 -14549 -105878 -55536 12328 -11220 18115 70588 213545 172261 -6912
6414 -6912 -54384 -105735 -78540 32173 51956 62993 89801 148784 78375 46784 -48499 -71333
6402 -71333 -116217 -83776 -8914 -19839 30624 6025 -41746 -109355 -243162 -120067 -52213
6391 -52213 -125397 -134044 6791 145224 197214 206537 45244 -104067 -53121 47209 74596
6380G4596k9882j52027o6623p293M4195m9522P3094Q6017N5881n8708L070K2327
6368d875K9603k2435J15712j6092Q318L3713N9711M3458k7727j04441K9998n6673
6356H8270j2546J7830l1815l1895j30171k8927q9382r2551J65392J17609j5449
6345d3635N8983n090j09376l7104J6079j99042Q04P7423R5538K7361j4206J6537
6333a15728P690P9618K27817R7972j35189o3728j8895m8423O899k4685L892m074
6321A3166o8556p4742O8810N7547j6840N2315l194r17j29248p1899J21241K3434
6309b8883K233R250P0746K21306N0023p9012j40788k7014m789J00278O7127O767
6297B47244o880K7808n7794j68157N138n0567k5627O3501P7794j8034k2218n7959
$$ plain form
6380 74596 44714 -107313 -173936 -181229 -137034 -186556 -113462 -27445 28436 -30272 -27202 -4875
6368 -4875 24728 2293 118005 101913 110231 143944 203655 247113 219386 114945 144943 88270
6356 88270 75724 93554 61739 29844 -100327 -129254 -218636 -311187 -145795 -28186 -43635
6345 -43635 15348 10258 -99118 -136222 -120143 -319185 -318381 -240958 -145420 -118059 -132265 -115728
6333 -115728 -108038 -28420 199397 297369 162180 98452 79557 31134 38033 13348 17240 13166
6321 13166 -55390 -130132 -61322 -3775 -20615 31700 28506 27589 -101659 -173558 -52317 -28883
6309 -28883 -26650 -17400 53346 274652 324675 245663 104875 77861 73072 173350 240477 247244
6297 247244 240364 268172 210378 42221 47359 -3208 -28835 34666 112460 94426 72208 14249
6285A4249j15674O8654O9147r3002O0712j5725j12992l7778K2048O3519m5248
6274a22090r6765P9332O7749J1145j7008L0313N6450L9018N1869K0917M6127j05401
6262F1656o6257M1558k17633q3271J34643Q913O4543O6141M6833M5503j69842
6251f7213j25428P6838J04226M6873M182n7074j5073k7167q2540r3717R530J95871
6239c0692J00027o663M2660j04585j39394N2559N0944q7441K753R9099R3932M6027
$$ plain form
6285 14249 -101425 -32771 36376 -56626 4086 -11639 -124631 -162409 -140361 -76842 -122090
6274 -122090 -218855 -139523 -71774 -60629 -77637 -47324 9126 48144 100013 120930 167057 61656
6262 61656 -4601 36957 -180676 -263947 -129304 -120391 -55848 10293 57126 102629 -67213
6251 -67213 -192641 -115803 -11577 35296 39478 -17596 -32669 -59836 -142376 -236093 -226563 -30692
6239 -30692 69335 62672 105332 747 -138647 -86088 -35144 -122585 -119832 -20733 73199 119226
$$ [...]
##END NTUPLES=NMR SPECTRUM
##END=
