##TITLE=Analysis number 324113
Compound Code cc 57824
Book Reference 449/172
Project Code adrs
Chemist Name davee
##JCAMPDX= 6.0         $$ Bruker NMR JCAMP-DX V2.0
##DATA TYPE= NMR SPECTRUM
##DATA CLASS= NTUPLES
##ORIGIN= Bruker BioSpin GmbH
##OWNER= nmr
$$ XWIN-NMR		Version 3.5
$$ Tue Nov 14 13:59:20 2006 GMT Standard Time (UT+0h)  MAYBRIDGE\nmr@NMR_250MHZ
##.OBSERVE FREQUENCY= 250.131544655141
##.OBSERVE NUCLEUS= ^1H
##.ACQUISITION MODE= SIMULTANEOUS (DQD)
##.ACQUISITION SCHEME= undefined
##.AVERAGES= 16
##.DIGITISER RES= 18
##SPECTROMETER/DATA SYSTEM= dpx250
##.PULSE SEQUENCE= zg30
##.SOLVENT NAME= CDCl3
##.SHIFT REFERENCE= (INTERNAL, CDCl3, 0, 16.4414)
##AUDIT TRAIL= $$ (NUMBER, WHEN, WHO, WHERE, WHAT)
$$ ##TITLE= Audit trail, XWIN-NMR		Version 3.5
$$ ##JCAMPDX= 5.01
$$ ##ORIGIN= Bruker BioSpin GmbH
$$ ##OWNER= nmr
$$ C:\u/data/dgb/nmr/ADRS/340/pdata/1/auditp.txt
$$ ##AUDIT TRAIL=  $$ (NUMBER, WHEN, WHO, WHERE, WHAT)
(   1,<2006-11-14 13:58:52.42 +000>,<MAYBRIDGE\nmr>,<NMR_250MHZ>,
      <created by zg, POWCHK disabled, PULCHK disabled
       configuration hash MD5:
       49 4B E0 1D 92 C2 6B 37 9F E6 65 BC 52 41 86 1D
       data hash MD5: 64K
       AB E2 D4 E0 62 29 52 50 F1 06 9F A2 A6 13 22 27>)
(   2,<2006-11-14 13:59:11.17 +000>,<MAYBRIDGE\nmr>,<NMR_250MHZ>,
      <Start of raw data processing
       ef LB = 0.3 FT_mod = 6 PKNL = 1 SI = 32K 
       data hash MD5: 32K
       45 CF B4 C2 10 E7 79 53 21 45 F7 9F 3A FD 7F B1>)
(   3,<2006-11-14 13:59:13.01 +000>,<MAYBRIDGE\nmr>,<NMR_250MHZ>,
      <apk 
       data hash MD5: 32K
       F9 0C 64 3D 5C 69 47 D6 07 E9 4B 51 7C BB B0 AE>)
(   4,<2006-11-14 13:59:13.73 +000>,<MAYBRIDGE\nmr>,<NMR_250MHZ>,
      <abs ABSG = 5 
       data hash MD5: 32K
       E8 59 67 2A C2 B9 FE 25 6D 8F 05 15 1E ED 99 82>)
$$ ##END=
$$ 
$$ hash MD5
$$ 3B 79 7A F2 F5 9E F0 F5 15 0D 95 3C EF 07 86 73
##$RELAX= 
##$RELAX= 
##$RELAX= 
##$RELAX= 
##$RELAX= 
##$RELAX= 
##$RELAX= 
$$ Bruker specific parameters
$$ --------------------------
##$DU= <C:\u>
##$EXPNO= 340
##$NAME= <ADRS>
##$PROCNO= 1
##$TYPE= <nmr>
##$USER= <dgb>
##$AMP= (0..31)
100 100 100 100 100 100 100 100 100 100 100 100 100 100 100 100 100 100 
100 100 100 100 100 100 100 100 100 100 100 100 100 100 
##$AQSEQ= 0
##$AQ_mod= 3
##$AUNM= <au_zg>
##$AUTOPOS= <45 >
##$BF1= 250.13
##$BF2= 250.13
##$BF3= 250.13
##$BF4= 250.13
##$BF5= 500.13
##$BF6= 500.13
##$BF7= 500.13
##$BF8= 500.13
##$BYTORDA= 1
##$CFDGTYP= 0
##$CFRGTYP= 5
##$CHEMSTR= <none>
##$CNST= (0..31)
1 1 145 1 1 1 1 1 1 1 1 1 1 1 1 1 1 1 1 1 1 1 1 1 1 1 1 1 1 1 1 1 
##$CPDPRG= <>
##$CPDPRG1= <>
##$CPDPRG2= <>
##$CPDPRG3= <>
##$CPDPRG4= <mlev>
##$CPDPRG5= <mlev>
##$CPDPRG6= <mlev>
##$CPDPRG7= <mlev>
##$CPDPRG8= <mlev>
##$CPDPRGB= <>
##$CPDPRGT= <>
##$D= (0..31)
0 1 0 0 0 0 0 0 0 0.06 0 0 0 0 0 0 0.0002 0 0 0 0 0 0 0 0 0 0 0 0 0 0 
0 
##$DATE= 1163512729
##$DBL= (0..7)
120 120 120 120 120 120 120 120 
##$DBP= (0..7)
150 150 150 150 150 150 150 150 
##$DBP07= 0
##$DBPNAM0= <>
##$DBPNAM1= <>
$$ [...]
##$SUBNAM7= <"">
##$SUBNAM8= <"">
##$SUBNAM9= <"">
##$SW= 20.6930455092707
##$SWIBOX= (0..15)
0 0 3 0 0 0 0 0 0 0 0 0 0 0 0 0 
##$SW_h= 5175.983436853
##$TD= 65536
##$TD0= 1
##$TE= 683.16
##$TE2= 300
##$TE3= 300
##$TEG= 300
##$TL= (0..7)
0 120 120 120 120 120 120 120 
##$TP= (0..7)
150 150 150 150 150 150 150 150 
##$TP07= 0
##$TPNAME0= <>
##$TPNAME1= <>
##$TPNAME2= <>
##$TPNAME3= <>
##$TPNAME4= <>
##$TPNAME5= <>
##$TPNAME6= <>
##$TPNAME7= <>
##$TPOAL= (0..7)
0.5 0.5 0.5 0.5 0.5 0.5 0.5 0.5 
##$TPOFFS= (0..7)
0 0 0 0 0 0 0 0 
##$TUNHIN= 0
##$TUNHOUT= 0
##$TUNXOUT= 0
##$USERA1= <user>
##$USERA2= <user>
##$USERA3= <user>
##$USERA4= <user>
##$USERA5= <user>
##$V9= 5
##$VALIST= <valist>
##$VCLIST= <CCCCCCCCCCCCCCC>
##$VD= 0
##$VDLIST= <DDDDDDDDDDDDDDD>
##$VPLIST= <PPPPPPPPPPPPPPP>
##$VTLIST= <TTTTTTTTTTTTTTT>
##$WBST= 1024
##$WBSW= 4
##$XGAIN= (0..3)
0 0 0 0 
##$XL= 0
##$YL= 0
##$YMAX_a= 643610
##$YMIN_a= -636320
##$ZGOPTNS= <>
##$ZL1= 120
##$ZL2= 120
##$ZL3= 120
##$ZL4= 120
##$ABSF1= 16.44139
##$ABSF2= -4.251783
##$ABSG= 5
##$ABSL= 3
##$ALPHA= 0
##$AQORDER= 0
##$ASSFAC= 0
##$ASSFACI= 0
##$ASSFACX= 0
##$ASSWID= 0
##$AUNMP= <proc_1d>
##$AZFE= 0.1
##$AZFW= 0.1
##$BCFW= 0
##$BC_mod= 0
##$BYTORDP= 0
##$COROFFS= 0
##$CY= 12.5
##$DATMOD= 1
##$DC= 0
##$DFILT= <>
##$DTYPP= 0
##$F1P= 14.0000005364418
##$F2P= -0.99999901652339
##$FCOR= 0.5
##$FTSIZE= 32768
##$FT_mod= 6
##$GAMMA= 0
##$GB= 0
##$INTBC= 1
##$INTSCL= 1
##$ISEN= 128
##$LB= 0.3
##$LEV0= 0
##$LPBIN= 0
##$MAXI= 10000
##$MC2= 0
##$MEAN= 0
##$ME_mod= 0
##$MI= 0
##$NCOEF= 0
##$NC_proc= -3
##$NLEV= 6
##$NOISF1= 0
##$NOISF2= 0
##$NSP= 0
##$NTH_PI= 0
##$NZP= 0
##$OFFSET= 16.44139
##$PC= 1
##$PHC0= -50.54037
##$PHC1= 5.515834
##$PH_mod= 1
##$PKNL= yes
##$PPARMOD= 0
##$PSCAL= 4
##$PSIGN= 0
##$REVERSE= no
##$SF= 250.130020162885
##$SI= 32768
##$SIGF1= 0
##$SIGF2= 0
##$SINO= 400
##$SIOLD= 32768
##$SREGLST= <1H.CDCl3>
##$SSB= 0
##$STSI= 32768
##$STSR= 0
##$SW_p= 5175.98343685301
##$SYMM= 0
##$S_DEV= 0
##$TDeff= 65536
##$TDoff= 0
##$TI= <Analysis number 999999
Compound Code 99
Book Reference 9
Project Code 9>
##$TILT= no
##$TM1= 0
##$TM2= 0
##$TOPLEV= 0
##$USERP1= <user>
##$USERP2= <user>
##$USERP3= <user>
##$USERP4= <user>
##$USERP5= <user>
##$WDW= 1
##$XDIM= 32768
##$YMAX_p= 331776121
##$YMIN_p= -144611
$$ End of Bruker specific parameters
$$ ---------------------------------
##NTUPLES= NMR SPECTRUM
##VAR_NAME=  FREQUENCY,     SPECTRUM/REAL,   SPECTRUM/IMAG
##SYMBOL=    X,             R,               I
##VAR_TYPE=  INDEPENDENT,   DEPENDENT,       DEPENDENT
##VAR_FORM=  AFFN,          ASDF,            ASDF
##VAR_DIM=   32768,         32768,           32768
##UNITS=     HZ,            ARBITRARY UNITS, ARBITRARY UNITS
##FACTOR=    0.157963299565203, 1,           1
##FIRST=     4112.48498305232, 0,            0
##LAST=      -1063.49845380069, 0,           0
##MIN=       -1063.49845380069, -144611,     0
##MAX=       4112.48498305232, 331776121,    0
$$ Real data points
##PAGE= N=1
##DATA TABLE= (X++(R..R)), XYDATA
$$ [...]
20243d340J1010J3648J5322l218j4788J280n344q634K673L540M5j3360n512K329
20229e349J0902K3003K862j6355j6914m525j1273O9J523l178K898R90l516Q43
20215a8020J0513K754O324M049R535k947k514q656n527P196P591j182k6845M91
20201a7238j118k598O462o44P632O501k211K789n481J529Q422q955j3444O21j1127
20186b8860N520k649m057M977K4377L747j1892j1094l22J6662P069N204J447k147
20172G982J044j68j1713j1023m768R360Q632Q956r286j2284J0037J5276L277L270
20158A8592l065k497R491j3390j7046k319K588K674Q299P50J7427m37j1745L144
20144A2466J156j4011n464J4773J9187o84r600j5985r558K289J2186L248R392
$$ plain form
20243 -4340 6670 20318 35640 32422 17634 18914 13570 4936 7609 11149 11194 -2166 -7678 -5349
20229 -5349 5553 28556 31418 15063 -1851 -6376 -17649 -17580 -16057 -19235 -16337 -15347 -18863 -18020
20215 -18020 -7507 -4753 1571 5620 15155 12208 9694 1038 -4489 2707 10298 9116 -17729 -17238
20201 -17238 -18356 -20954 -14492 -15136 -7504 -1003 -3214 -425 -5906 -4377 4045 -4910 -18354 -17733 -28860
20186 -28860 -23340 -25989 -30046 -25069 -692 3055 -8837 -19931 -20253 -3591 3478 8682 10129 7982
20172 7982 9026 8858 -2855 -13878 -18646 -9286 -654 8302 -984 -13268 -3231 12045 15322 18592
20158 18592 15527 13030 22521 9131 -7915 -10234 -7646 -4972 3327 4077 21504 21067 9322 12466
20144 12466 13622 -389 -5853 8920 28107 27423 17823 1838 -7720 -5431 6755 10003 19395
20131A9395j0349j1269q859n498J999J5535M617O877k014q291l752r494Q703J0389
20117G989j0331j0554J776J1223k273M021J8394J3548j2489k1916j9326K802M186
20104a2950j104Q641J834L27n787L30M540n686K521O471J568j0542r34m043K469
20089a2345L841m400K480M829O173m18k944p869J3359J071m696j4056p153J1295
20075a0833R641o477L005Q220J7430L11o779j0558m915o203P483M197o355J2816
20061A0983N814j6972j3949K976J252k178n732O717q219m387J3271J1949R891
20048A1416K974p723q970l678N957P192n378p251o799N093j02k667Q980R401l824
20033D621P066q514j2288p222K3518J6032m022j1355R46p675l618l244L159J7621
$$ plain form
20131 19395 9046 -2223 -11082 -16580 -14581 954 5571 12448 10434 2143 -1609 -11103 -2400 7989
20117 7989 -2342 -12896 -11120 103 -2170 1851 20245 33793 21304 -612 -19938 -17136 -12950
20104 -12950 -14054 -5413 -3579 -3252 -9039 -8709 -4169 -9855 -7334 -863 705 -9837 -10771 -14814 -12345
20089 -12345 -8504 -12904 -10424 -5595 578 160 -2784 -10653 2706 3777 -919 -14975 -22128 -10833
20075 -10833 -1192 -7669 -4664 3556 20986 21297 14518 3960 -955 -7158 325 4522 -1833 10983
20061 10983 16797 -175 -14124 -11148 -9896 -12074 -17806 -11089 -19308 -23695 -10424 1525 11416
20048 11416 14390 6667 -2303 -5981 -24 7168 1790 -5461 -12260 -7167 -7269 -9936 -956 8445 4621
20033 4621 11687 3173 -9115 -16337 7181 23213 19191 7836 8782 1107 -2511 -5755 -2596 15025
20019A5025j0161j325r91j0169r969l102r190r46N556J3587O899r64l734k65L544
20004f205J394o203Q949m107J2225p088l844M814L542j3388K200J3773L296j2444
19990c086k707N485M760O361o76o27R146M517P87q265j2321o311J559J3590P495
19975A9707L117J533j577P925J834j2790m802J3482N095q773j701J778l509j2093
19961I226p024L836l078l407j178J6836j11k948j2799j2230m313P208L469M354
19947b159J0861L957p391n483K163l640Q605n07r329J626P208J909n617q085n655
19932a1537J0010J3240Q577p613q827k500n556P626N388L159j3631j356J1379
19919H359O24r072j5277o280N805J1158J1160L971j5754k245M94P137k072o713
$$ plain form
20019 15025 4864 3539 2548 -7621 -17590 -20692 -29882 -30828 -25272 -11685 -4786 -5750 -9484 -9749 -6205
20004 -6205 -4811 -11014 -2065 -6172 6053 -1035 -4879 -65 3477 -9911 -7711 6062 9358 -3086
19990 -3086 -5793 -308 4452 10813 10137 9510 18656 23173 23960 15695 3374 -2937 -1378 12212 19707
19975 19707 22824 24357 22780 30705 32539 19749 14947 28429 33524 24751 23050 24828 21319 9226
19961 9226 2202 6038 2960 -447 -1625 15211 15100 12152 -647 -12877 -17190 -9982 -6513 -2159
19947 -2159 8702 12659 5268 -215 1948 -1692 6913 6406 -2923 -1297 5911 7820 2203 -5882 -11537
19932 -11537 -1527 11713 20290 12677 3850 1350 -4206 3420 8808 11967 -1664 -3020 8359
19919 8359 8983 -89 -15366 -21646 -15841 -4683 6477 10448 -5306 -7551 -7057 80 -1992 -8705
19905h705p915n200O679o885p439Q957J0774o31K688k214N33P351O694j1072o670
19890a3055J5298j802p057Q021L776O528o513j4533k179J1676J5505r87j6164
19877a486P577J3372o304j872Q325J389J467m375j4228M069j194l409j0416m656
19863a1741J5114J648n180n000k458N854P091L403k408N137j565J771M71j0121
19849B016L220M513k562j7497j4379J9280J1774M780m70k467J831Q950j425o779
19835A0785r041n146n2j635k53M198n764J4916q384n468O173j436j509q261K965
19820g912o013K004J4774J5824M501r635j2448J161n831j1968L344r06J2244J950
19806A089Q50P779J069k759m013m396o912n793m289j4073J8165j580j2090O177
$$ plain form
19905 -8705 -16620 -21820 -15141 -22026 -29465 -20508 -9734 -10365 -7677 -9891 -9358 -2007 4687 -6385 -13055
19890 -13055 2243 441 -6616 1405 5181 11709 5196 -9337 -11516 160 15665 14678 -1486
19877 -1486 6091 19463 13159 11287 19612 21001 22468 18093 3865 7934 6740 3331 -7085 -11741
19863 -11741 3373 5021 -159 -5159 -7617 -1763 5328 8731 6323 11460 9895 11666 12137 2016
19849 2016 5236 9749 7187 -10310 -24689 -5409 6365 11145 10675 8208 10039 18989 17564 10785
19835 10785 1744 -3402 -3454 -5089 -5342 -1144 -6908 8008 -376 -5844 329 -1107 -2616 -10877 -7912
19820 -7912 -13925 -11921 2853 18677 23178 13543 1095 2256 -3575 -15543 -12199 -13105 -861 1089
19806 1089 1939 9718 10787 8028 4015 -381 -7293 -13086 -17375 -31448 -13283 -14863 -26953 -20776
19792b0776K0231J3236J577K649P793j07o938j579J0199p368j7479Q6J0007M38
19778A1969K606p79K280j4434k543J778N053M055j23k000l054o575m683o447J2010
19763h87L712K71K188K445k3344j5257R362N220P989N858J9595K252n266j1216
19749B922J2226N177j0114n609N924M400l760l077L917l438j610j3113l562r518
19735a9235k908J0211R177M752J4202J10n80N507p097j2801j6337L158P866k387
19721f362m373K872R880K5799Q862p166j240o802j1427p157j2600Q720K249k92
19707I63m117o840O781N549j088q359N280J4001l996l800m522j5246p647J9811
19693c230K0283l255k6009Q92J0120J0207N310J75J6029k032j4739j62j1956J0312
$$ plain form
19792 -20776 -545 12691 14268 16917 24710 24603 17665 16086 26285 18917 1438 1524 11531 11969
19778 11969 14575 13796 16076 1642 -901 877 5930 9985 9862 7862 4808 -1767 -6450 -12897 -887
19763 -887 2825 3096 5284 7729 -15615 -30872 -21510 -16290 -8301 -2443 17152 19404 14138 2922
19749 2922 15148 20325 10211 4602 10526 14926 11166 8089 12006 8568 6958 -6155 -9717 -19235
19735 -19235 -22143 -11932 -2755 1997 16199 16309 15729 21236 14139 1338 -14999 -11841 -3975 -6362
19721 -6362 -10735 -7863 2017 27816 36678 29512 28272 21470 10043 2886 -9714 -994 1255 963
19707 963 -3154 -9994 -3213 2336 1248 -7111 -1831 12170 8174 4374 -148 -15394 -23041 -3230
19693 -3230 17053 13798 -12211 -11319 -1199 9008 14318 14493 30522 28490 13751 13589 1633 11945
19679A1945J3319j1600j2947q502R910Q448O938l006j5750j1088M05L078P923
19666i27J6209K373j0972o179J3480J1945j5447q371P491L06J52j381L580m501
19652G758o480m556p560j9033N44Q471l540J6278J0810J359M818M634J0730j0242
19638A3991M358n074j4561Q721J6241J1115L091M146j2463j6696k7979k776K6574
19625H688J7635l72k505l332p826j0958L024J3803Q160k642j5403o745K377P430
19611A1334l137J12Q856o759L824p929O161P877k692M167J0462r554p413l940
19597A1369j000r849l63M159m408j4392j2256k602Q252J9251R927o708m467j5802
19583a8889J662q130R40N883M969J1486J8087j6206o41M023L554K691K44o944
$$ plain form
19679 11945 25264 13664 717 -7785 2125 10573 17511 14505 -1245 -12333 -11928 -8850 -927
19666 -927 15282 17655 6683 504 13984 25929 10482 2111 9602 9908 10060 8679 12259 7758
19652 7758 1278 -3278 -10838 -29871 -29327 -20856 -24396 -8118 2692 4051 8869 13503 24233 13991
19638 13991 18349 13275 -1286 7435 23676 34791 37882 42028 29565 12869 -15110 -17886 8688
19625 8688 26323 25951 23446 20114 12288 1330 4354 18157 26317 23675 8272 1527 3904 11334
19611 11334 8197 8309 17165 10406 14230 6301 12462 20339 17647 21814 32276 22722 15309 11369
19597 11369 10369 520 157 4316 -92 -14484 -26740 -29342 -21090 -1839 8088 1380 -3087 -18889
19583 -18889 -17227 -25357 -24417 -18534 -13565 -2079 16008 -198 -839 3184 6738 9429 9673 2729
19569B729J2599p96Q607K02j4189p713k4681j0684J6697J1274m983J6400J6478
19556B1940j102j0301j111n640k990O992Q562K113p396k172p146J2218J6416J046
19542C1429l104j0469R77P70k094o070l011o417J6571J5067N335m471p184j2227
19528A5102J4987m51n549k217J4740m531o867K955m207j2150J562M410j81n324
19514A2279m950m39m544n537J2940J3307j4912q408J423K525Q407P001J7525n
19500C6612j5234j1975m804M582L970l579P44L490N128O310Q571j0291j1721l192
19486H611o309l164n710J2429J3474m465O97l624K543J315O198j2668j7216q375
19472a6264J054M796J0707l862P107Q821K188Q5O425J1426j4592k2598n478J89
$$ plain form
19569 2729 15328 14532 23139 23341 9152 1439 -23242 -33926 -17229 -5955 -10938 5462 21940
19556 21940 20838 10537 9426 3786 796 7788 16350 18463 11067 8895 1749 13967 30383 31429
19542 31429 28325 17856 18833 19603 17509 11439 8428 2011 18582 33649 38984 34513 27329 15102
19528 15102 30089 29638 24089 21872 36612 32081 25214 28169 23962 11812 13374 17784 17603 12279
19514 12279 7329 6890 2346 -3191 9749 23056 8144 -264 1159 3684 12091 19092 36617 36612
19500 36612 21378 9403 4599 9181 13151 9572 10316 13806 18934 25244 33815 23524 11803 8611
19486 8611 2302 -862 -6572 5857 19331 14866 15563 11939 14482 15797 21995 9327 -7889 -16264
19472 -16264 -15210 -10414 293 -3569 3538 12359 14547 14632 21057 32483 17891 -4707 -10185 -9996
19458i996K3067L286p884m812L058Q262m742j1735Q882P726l365k201n04M07L784
19443A3233k675r719l181P928J4624N518p506l687J1553J4114n603j8367j5806
19430D26K032N901k865J2579J3053M83J074k0006p670n055O459L353k508L885
19416A1141j795k998n145J5887l30J0001p911K579O778Q057P188q130L783J2112
19402E1217J1185p533p161R962K1632K5335K6258J9413K3835K0915L2137L1166
19390B58361L2316K1421J2178J2756J8708J0098n895k4060p671J179n505j923
19378C21963l166Q595J6218L233K687m110o976m126j8413k3252j8015l9164l2291
19365B03183m334j9351l6792l3572k4457j0470k3509k2316k913P319r36N836q818
$$ plain form
19458 -9996 13071 16357 8473 3661 6719 14981 10239 -1496 7386 15112 11747 9546 9042 9449 13233
19443 13233 10558 839 -2342 5586 20210 25728 18222 14535 26088 40202 34599 16232 426
19430 426 2458 8359 5494 18073 31126 31609 32683 12677 5007 -48 6411 9764 7256 11141
19416 11141 9346 6348 1203 17090 16760 26761 18850 21429 28207 36264 43452 35322 39105 51217
19402 51217 62402 54869 47708 57670 79302 104637 130895 150308 174143 195058 227195 258361
19390 258361 290677 312098 324276 337032 355740 365838 359943 335883 328212 329391 323886 321963
19378 321963 318797 327392 343610 346843 349530 345420 338444 334318 315905 292653 274638 235474 203183
19365 203183 198849 179498 142706 109134 84677 74207 50698 28382 25469 32788 31852 37688 28870
19352B8870J550M631p749j3804k500l19R273Q129L447l917J025J417j728O163
19338C4488k0812q981Q339P796M785r715o754J633L565l05O254K76Q39P840o880
19323B2368o590N092L05P57l90Q947N938o653j8252p532l052N117J903J6p532
19308D42l871o096K0332K295J1581R079J5526j4894q849r973Q040N890J038o371
19294B4169n250r40J983J645J1906O420q372K00O309o933n602l720l061J4850
19280C3604K435o611J0064k637m196P41j0815k139J5485M503O682J5221n094j6539
19266D0704r787o643l83L553l35L925j527K524o091j0912P681J6669J1398K311
19252E3087J1351j8994j0548l826j1930r901M441N016J5209M275P343M347j3904
$$ plain form
19352 28870 30420 35051 27302 13498 10998 10679 19952 28081 31528 27611 28636 30053 28325 34488
19338 34488 13676 4695 13034 20830 25615 15900 9146 10779 14344 14039 20293 20569 21408 29248 22368
19323 22368 15778 20870 21175 21932 21542 30489 36427 29774 11522 3990 938 6055 7958 7974 442
19308 442 -3429 -9525 10807 13102 24683 33762 49288 34394 25545 15572 23612 29502 30540 24169
19294 24169 18919 17979 19962 21607 33513 39933 31561 31761 38070 31137 25535 21815 18754 33604
19280 33604 36039 29428 39492 36855 32659 33400 22585 20446 35931 40434 47116 62337 57243 40704
19266 40704 30917 24274 23891 27444 27109 31034 29507 32031 25940 15028 22709 39378 50776 53087
19252 53087 64438 45444 34896 31070 19140 9239 13680 18696 33905 38180 45523 49870 35966
19239C5966m07N291r406l432N303m406k851p564n65J2328P122K418n280n979n203
19224B3335R929m494L041m423p746O016L877N241Q746m838J422n333L679J831
19210D0283j926N178P489j1019j0047j1540l183O021J0436N261M500J1366k585
19197E0234j1618q437j9293q850j1826k015M98J3168k007J239P412J0132K002
19184B0639k563n026J8806m907j3042n251m45j2128n92N882o08L542N624J3149
19170B3080K71l110M118J1533o200l636l295k143N581m685J1890k987l14J5386
19156D5489J8247Q424j2949l592M98J130M726O036n058m385M189J5910P391O513
19142I2569r63R452J2091L615J2201L3056L4332J2501K002J1561K0234m006M870
$$ plain form
19239 35966 35559 40850 31444 28012 33315 28909 26058 18494 17929 30257 37379 39797 34517 28538 23335
19224 23335 33264 28770 31811 27388 19642 25658 29535 34776 43522 38684 40106 34773 38452 40283
19210 40283 38357 43535 51024 40005 29958 18418 15235 21256 31692 36953 41453 52819 50234
19197 50234 38616 30179 10886 2036 -9790 -11805 -11307 1861 -146 1093 8505 18637 20639
19184 20639 18076 13050 31856 26949 13907 8656 8211 -3917 -4509 1373 765 4307 9931 23080
19170 23080 23351 20241 24359 35892 29692 26056 22761 20618 26199 21514 33404 30417 30103 45489
19156 45489 63736 72160 59211 55619 56117 57247 61973 68009 62951 58566 62755 78665 86056 92569
19142 92569 91606 101058 113149 116764 128965 162021 196353 208854 210856 222417 242651 238645 243515
19129B43515J5037P388m630l611L971M99j2294j826K463n56J7019J1652N402k779
19115B81250r296j0793r036j9985j6798j3979k4002k0525k2802j4554M540R14
19103A24934n579j3847r515m534l321N640j4657q305N393J6655j4546j2955r873
19090E5490J2976J4390O758P678J645l124J5340J6604K6975J7905p006J2076K4938
19077B02645J1026j2192P338p615k877J3212K982j3607j5320N693L752R263J5340
19064B19640J4600m170o650n560n320j549j4736k3654j3537j2443j7333n135q494
19051A15659j6144q778n97k1321R77Q686J1016R305p664k31J0209m049P042J8135
19037A22245O713r718j5149j1559J1067M221O328K737M83J189j7989p289J0353
$$ plain form
19129 243515 258552 265940 261310 257699 261670 262169 249875 248049 250512 249956 266975 278627 284029 281250
19115 281250 271954 261161 252125 232140 215342 201363 177361 156836 134034 119480 124020 124934
19103 124934 119355 105508 95993 91459 88138 93778 79121 70816 76209 92864 78318 65363 55490
19090 55490 68466 82856 89614 97292 98937 95813 111153 127757 154732 172637 165631 177707 202645
19077 202645 213671 201479 208817 201202 198325 211537 214519 200912 185592 191285 195037 204300 219640
19064 219640 234240 230070 223420 217860 212540 210991 196255 172601 159064 146621 129288 124153 115659
19051 115659 99515 90737 90140 68819 69796 78482 89498 98803 91139 90908 101117 97068 104110 122245
19037 122245 128958 119240 104091 92532 103599 107820 114148 116885 117368 118557 100568 93279 103632
19024A03632J002L852J1163N885K215p254p325k576J7964O280n293O323P094R440
19010A52402p167j1515J1954M767j1704K930m430o760K663J8291J3049j232p14
18997A62534J46O109K626M325R620M743n342Q45j0029Q207M732r848J5467J0658
18983B04793j292n911j2814j851J816J4414o75P980q3l70K0154J4514o676N54
18969B34553p67J384k898J910j494j0808m591M577J4204Q082J1435K4533K1484
18956C01604o38n399o649R063J3102K263o699k675Q906M341L854P049N102J0632
18942C43856Q636J1706J15r62N217K3568R945J5851L4891L8635J4106R819j430
18929E13953K4716J9435M131J6059L2886L7422K9320M0304M9467N7019M4029M3468
$$ plain form
19024 103632 104634 108486 119649 125534 127749 120495 113170 110594 128558 134838 129545 135868 142962 152402
19010 152402 145235 133720 145674 150441 138737 141667 137237 130477 133140 151431 164480 163248 162534
18997 162534 162680 168789 171415 175740 185360 190103 184761 185606 175577 183784 188516 178668 194135 204793
18983 204793 203501 197590 184776 182925 184741 199155 198480 206460 206377 206007 226161 240675 233999 234553
18969 234553 233786 235170 232272 234182 232688 221880 217289 221866 236070 244152 255587 280120 301604
18956 301604 300966 295567 288918 297981 311083 313346 306647 303972 312878 317219 321073 328122 333224 343856
18942 343856 352492 364198 364313 363351 368568 392136 402081 417932 452823 491458 505564 515383 513953
18929 513953 538669 558104 562235 578294 611180 648602 677922 718226 767693 824712 868741 912209
18917I12209N6703Q5179P8570R0457J13630J18861J32793J55947J64913J70158
18907B079420J83280K06348K04165K20593K46920K61559L00263L29847M04889
18898D437284N17252O75630Q87485J196221J627864K143086K711818L337952M014653
18889B1549245M607753N018653N318004N348002N162091M444214L397776K624760
18881E7470498J410745M54044l42285q42299q92219j009028m64746K89612R85548
18872E7059870J596528J995604K085697J347749P00345k59878j600473k777949
18864F0147493m107984m817279n594657o054472n800211n398937m802214m123295
18856A9448444l392045k689795k092739j563756j168884r02575p05015n57373
$$ plain form
18917 912209 968912 1054091 1132661 1223118 1336748 1455609 1588402 1744349 1909262 2079420
18907 2079420 2262700 2469048 2673213 2893806 3140726 3402285 3702548 4032395 4437284
18898 4437284 4954536 5630166 6517651 7713872 9341736 11484822 14196640 17534592 21549245
18889 21549245 26156998 31175651 36493655 41841657 47003748 51447962 54845738 57470498
18881 57470498 58881243 59335287 58993002 58150703 57258484 56249456 55784710 56074322 57059870
18872 57059870 58656398 60652002 62737699 64085448 64785793 64525915 62925442 60147493
18864 60147493 56039509 51222230 45627573 39573101 33772890 28373953 23571739 19448444
18856 19448444 16056399 13366604 11273865 9710109 8541225 7638650 6933635 6376262
18848F376262m74027m15123l53102l14354l12526k84865k51039k45529k27847
18839C497850k07383j82619j88925j71147j53704j32302j22302j18964q9772p9796
18829B050936q3014o6578o1184o7057o6793o7262n8628m2085m1346k8904l0467
18818A437618n4215m1492l5007m3113l6556m1896n2110l5441l0768m1246l4124
18807I91650l4767n2128m9056k9488k5876j3050j3404j8418l8702k8231j9473
18796F69057l3566l2225j4501j3244k2097j8473j339K995k0271k5074k4178l139
18784D63945j4409k7346j1208p76o943j7058n384o430l045J115L848l844P263
18771C79728J7208J5236J3444K8246M178l2302m3967j9389j8273p691n023m945
$$ plain form
18848 6376262 5902235 5487112 5134010 4819656 4507130 4222265 3971226 3725697 3497850
18839 3497850 3290467 3107848 2918923 2747776 2594072 2461770 2339468 2220504 2130732 2050936
18829 2050936 1967922 1901344 1840160 1773103 1706310 1639048 1580420 1538335 1496989 1468085 1437618
18818 1437618 1383403 1341911 1306904 1263791 1227235 1185339 1133229 1097788 1067020 1025774 991650
18807 991650 956883 904755 855699 826211 800335 787285 773881 755463 716761 688530 669057
18796 669057 635491 603266 588765 575521 553424 534951 533612 536607 516336 491262 467084 463945
18784 463945 449536 422190 410982 410206 403263 386205 380821 374391 371346 372461 376309 372465 379728
18771 379728 396936 412172 425616 453862 458040 425738 381771 362382 344109 336418 331395 326450
18759C26450J12R942J2248P081J804o943j1645j3136L94M157K679Q000j2448p362
18745C21333j918L308k937p378k11p941j675j0952r961p627J160O592J0438r631
18731B82600k5175J0105m73k53R83l311j359m070j6285k0785r642J4923J1279
18718B38537o775j1844p899N124k131K124M292j345p746M379M436J3395J6133
18705B50680P069j2571q556J2739Q955J5244J2649P383k808Q881J0514N692L705
18692C19576K898L498M396J2733P173p419K915j2496N778N581k812k5892J34N384
18678C21447r39J1067J1992J1572P780J848j0724n512Q918R647J1598q076M042
18665C74660M202J2080J8529R282K0174J8268J7556J8561J0573L3171L7276K7128
$$ plain form
18759 326450 326562 336504 348752 355833 357637 350694 339049 325913 326307 330464 333143 341143 328695 321333
18745 321333 319415 322723 319786 312408 312197 304256 302581 291629 281668 274041 275201 281793 292231 282600
18731 282600 257425 267530 267057 266804 267787 264476 263117 259047 242762 221977 212335 227258 238537
18718 238537 231762 219918 212019 217143 215012 217136 221428 220083 212337 216716 221152 234547 250680
18705 250680 257749 245178 236622 249361 258316 273560 286209 293592 290784 299665 310179 315871 319576
18692 319576 322474 325972 330368 343101 350274 342855 345770 333274 339052 344633 341821 315929 316063 321447
18678 321447 320508 331575 343567 355139 362919 364767 354043 348531 357449 367096 378694 370618 374660
18665 374660 378862 390942 409471 418753 438927 457195 474751 493312 503885 537056 574332 601460
18653F01460K3206K2342K5250M0485N5367M7400M5024N6084P8792O7660O1804
18642A124874P5500O4505Q1526Q7312R4812R7277J15090J57040J73106K00252
18632B271294K65894L37653M58578O32979Q52152J152899J505181J902810K272791
18623A1652231K548361K725644K825114K945247K843608K384228J441487N64764
18615B9930684J81617j09105m95563j148726j380214j072001n57858r1786K01286
18606B5458334N71500R32315J001025O19275j36712n63149q53214j255580j939403
18597B3834391k599985k760865k620184k338392k071781j786627j457312j128383
18589G070862q34974n96570m05112k71374k07978j29184p0666K190M9742R9726
$$ plain form
18653 601460 624666 647008 672258 712743 768110 815510 860534 916618 995410 1063070 1124874
18642 1124874 1200374 1264879 1346405 1433717 1528529 1625806 1740896 1897936 2071042 2271294
18632 2271294 2537188 2874841 3333419 3966398 4818550 5971449 7476630 9379440 11652231
18623 11652231 14200592 16926236 19751350 22696597 25540205 27924433 29365920 29930684
18615 29930684 30112301 30003196 29507633 28358907 26978693 25906692 25348834 25257048 25458334
18606 25458334 26029834 26962149 27963174 28582449 28445737 27882588 27029374 25773794 23834391
18597 23834391 21234406 18473541 15853357 13514965 11443184 9656557 8199245 7070862
18589 7070862 6235888 5639318 5234206 4962832 4754854 4625670 4555004 4557194 4606936 4706662
18579D706662J84169K93142M16042N86880Q14991J143445J525285J979928K427546
18570A4078090K788321L054385L206362L365879L378108L015779K156416R94865
18562C6038205L91469L5153l37935j035809j614358j442841r40193l58507O4599
18553C0799783M78671R51878J185466R72237J78181n07783q88310j328286k019399
18544B9822438k993360l415873l377020l094839k774934k461635k086049j667671
18536G951057j252467r21792o79205n09072l89309l05396k35800k04639j79134
18527C274243j57267j27276r6399r3463r8949r1979r1627j02250j21364j14975
18517B178694j22574j38565j34977j17300j04227j04969r6260q3652n0573n0960
$$ plain form
18579 4706662 4890831 5183973 5600015 6186895 7001886 8145331 9670616 11650544 14078090
18570 14078090 16866411 19920796 23127158 26493037 29871145 32886924 35043340 36038205
18562 36038205 36429674 36464827 36126892 35091083 33476725 32033884 31093691 30735184 30799783
18553 30799783 31278454 32230332 33415798 34388035 34566216 34058433 33170123 31841837 29822438
18544 29822438 26829078 23413205 20036185 16941346 14166412 11704777 9618728 7951057
18536 7951057 6698590 5776798 5097593 4588521 4199212 3893816 3658016 3453377 3274243
18527 3274243 3116976 2989700 2893301 2799838 2700889 2608910 2517283 2415033 2293669 2178694
18517 2178694 2056120 1917555 1782578 1665278 1561051 1456082 1359822 1276170 1225597 1174637
18507A174637m8789l7346m2027m2889l9413m6902l8375l0421j8703k5817k2871
18496G81084j6659k5238j8166o626j9851k1473o799j7782q895j8792j3794j6433
18484E90576k182j9969o476k084O3Q40j6862j4788k719R448P385O805R97M573
18470E55607L616p951j1333Jj1592n634l4355j7233j9837j6286k7673l6700k8293
18457C42337k0302k1863j8925j1779j410n779n995j6997j8657m921j995L224j1612
18444B05326M249J1328L132M009J0349R594p928j946j590J96n118o319m317P040
18430B28005L47p896j0079j0135j3555J515M958Q966r506q47L495j1250j4747
18417A69271p514l387j2819l522P747P376j4311j0326k605l525j5998m33P435
$$ plain form
18507 1174637 1125848 1088502 1046475 1003586 964173 917271 878896 848475 829772 803955 781084
18496 781084 764425 739187 721021 714395 694544 673071 666272 648490 639595 620803 607009 590576
18484 590576 588394 568425 561949 559865 559928 560768 543906 529118 526399 535847 543232 550037 551034 555607
18470 555607 559223 551272 539939 539940 528348 522714 488359 471126 451289 435003 407330 370630 342337
18457 342337 322035 300172 281247 269468 268058 262279 256284 239287 220630 215709 213714 216938 205326
18444 205326 209575 220903 224035 228044 238393 247987 240059 238113 236523 236719 231601 225282 220965 228005
18430 228005 228352 220456 210377 200242 186687 188202 193160 202126 192620 191773 195268 184018 169271
18417 169271 161757 158370 145551 142029 149776 157152 142841 132515 129910 126385 110387 109954 117389
18404A17389J566M582J3050K134o163n209j3563j291J3061j999R296k564M845
18391A35134j1037j4350k727j3138P362J5983P512O727O651J7732J6998J0770
18379A83617J9761L898K1346L5023K5403L2566L6518L5907M352P4J1621J6924
18367D27010J8959n859k2276j7243O751R751j504o069j3463R19p982R79n056j4865
18353C70052r071k4483l7740k1074j2974j3032l9350k7337k0670j2822j8789k7379
18341A05331p978M57q866m243J468o312r207j6375j0749l227O554J2354J0401
18328F9608j700q201j1689K624J7879J3979j6199k812l041m797J000M25M018o366
18314E4728K009N108p67j418J0201P089O374j4789p632J7097N94k2549k3466J043
$$ plain form
18404 117389 118955 123537 136587 138721 132558 127349 113786 112495 125556 123557 132853 130289 135134
18391 135134 124097 109747 107020 93882 101244 117227 124739 131466 138117 155849 172847 183617
18379 183617 203378 207276 228622 263645 289048 321614 358132 394039 398391 398465 410086 427010
18367 427010 445969 440110 417834 400591 407342 417093 415589 409520 396057 396976 388994 389973 384917 370052
18353 370052 360981 336498 298758 277684 264710 251678 212328 184991 164321 151499 132710 105331
18341 105331 97353 97810 88944 84701 86169 79857 70650 54275 43526 40299 46853 59207 69608
18328 69608 67908 59707 48018 50642 68521 82500 66301 63489 60448 55651 56651 57076 61094 54728
18314 54728 56737 61845 61078 59660 69861 76950 83324 68535 60903 78000 78594 56045 32579 33622
18300C3622N024o281j2210Q403J0412k043O248J3558J7922J1295j7497j764J4768
18287H1457J2927o170O297N936M328j562M756m321J6553Q428n723o529n163m635
18273A06579j1305j1140q601j501K305N170K728q063j4352j4313L152r036M428
18260D6051P940M625L997J0381k726Q026Q182q131r546j3659N978N276j3846j1939
18246D0609O793R889Q665j2223K594J1380j274J788N801J3531Q745O456j501J1456
18232A12709O584m526M996R692K70j7005O80j958L130o517n646o627j8627k383
18218G4772Q766j9254j3509q327l641J71j3958Q930L840j148K203N884L483N23
18204D8735J4008J6701J1162q33R353r220j8167l363P910R71J2439J1232j7598
$$ plain form
18300 33622 38646 32365 20155 28558 38970 36927 43175 56733 74655 85950 68453 66689 81457
18287 81457 94384 88214 94511 100447 104775 103213 107969 103648 120201 128629 122906 116377 111214 106579
18273 106579 95274 84134 75533 74032 76337 81507 84235 76172 61820 47507 50659 41623 46051
18260 46051 53991 58616 62613 72994 70268 78294 86476 78345 68799 55140 61118 66394 52548 40609
18246 40609 47402 57291 65956 53733 56327 67707 66433 68221 74022 87553 96298 102754 101253 112709
18232 112709 119293 114767 119763 129455 129725 112720 113400 111442 114572 108055 102409 95782 77155 74772
18218 74772 83538 64284 50775 42448 38807 38978 25020 33950 37790 36642 38845 44729 48212 48735
18204 48735 62743 79444 90606 89773 99126 89906 71739 68376 76286 77257 89696 100928 83330
18191H3330q898J0999P784J114m434n98j281k063n825P324J093j3349j5583K0029
18177G9642J3806J101N916j288N885O727J5092M860k765k362j086j2709M3j767
18163A11095R705M425L269N903l725l173J8783J8599j31J8202R640q038j341L391
18149A86604J3519J989M726p374K813Q059Q867J4236j1577O860J7684P532q12
18136B53126J6844Q291J137K2469K4904K2438R484K5825L1134J9182L2042M3119
18124E09995N0774O3793N5573N4652J06754J50531J99254K89990M68337P67484
18114B717137J299721J953129K555525L164746M023488M212441N5595o440737
18106A3541045n173162k960394j686936r71494n79418l65269k59845j82327j17777
$$ plain form
18191 83330 74432 85431 93215 94329 89895 89297 88016 85953 80128 87452 88545 75196 59613 79642
18177 79642 93448 94549 100465 99177 105062 111789 126881 131741 128976 126614 125528 112819 112862 111095
18163 111095 120800 125225 128494 134397 130672 127499 146282 164881 164750 182952 192592 184554 183213 186604
18149 186604 200123 202112 206838 199464 202277 210336 219203 233439 221862 228722 246406 253938 253126
18136 253126 269970 278261 279398 301867 326771 349209 358693 384518 415652 434834 466876 509995
18124 509995 560769 624562 680135 734787 841541 992072 1191326 1481316 1949653 2717137
18114 2717137 4016858 5969987 8525512 11690258 15713746 19926187 19981782 13541045
18106 13541045 8367883 5407489 3720553 2749059 2169641 1804372 1544527 1362200 1244423
18097A244423q8109r0485q6956o6592m3860k4403k0284k6031k8497l2218k8488
18086G08500l8057k7293r682j730Q199M60K579j981p689m36J1676J5616o70Q294
18072F67786J3102K0940R877J3277K5543L6978M0284M5230M3681L7327M2032O6501
18060A062558Q2726Q0031J09270J13308J21750J46987J55538J51763J46331J40672
18050B310934J43361J35084J41202J52487J78984K22985K78996L79980N11192
18041D455205O68665R09390J243784J642222K174948K770949L404412M013667
18033B1283242M533871M941406N267412N413113N204707M541368L468844K252894
18025E6906857J061298j12659j272313k471589l606342m541183n157454n309409
$$ plain form
18097 1244423 1156314 1065829 978873 912281 868421 844018 823734 797703 769206 736988 708500
18086 708500 670443 643150 633468 631738 639937 640397 642976 640995 633306 632870 644546 660162 659492 667786
18072 667786 680888 701828 711705 724982 750525 787503 827787 873017 916698 954025 996057 1062558
18060 1062558 1145284 1225315 1334585 1447893 1569643 1716630 1872168 2023931 2170262 2310934
18050 2310934 2454295 2589379 2730581 2883068 3062052 3285037 3564033 3944013 4455205
18041 4455205 5123870 6033260 7277044 8919266 11094214 13865163 17269575 21283242
18033 21283242 25817113 30758519 36025931 41439044 46643751 51185119 54653963 56906857
18025 56906857 57968155 57855496 56583183 54111594 50505252 45964069 40806615 35497206
18017C5497206n060186m643638m190265l729288l211392k615892k020599j491642
18009H534304j101231q10037o05341m71473l55142k54358j93842j44803j21231
18000D476846j04300r9624n9806k8674k1023j2627K654K5374N3042J15419J66241
17989D513522K56607L81968N67837Q19939J139138J553364K039705K602538L149634
17980A7024252L630124M015007M317296M510722M473246M082290L284765K266451
17972D7604153J210409J82823p88062j771977k737955l589481m247753m534433
17964C1327724m423256m092716l694519l309065k895814k415708j903649j422788
17956G170209j048597p73347n72000m41435l51043k98961k33994j93564j70278
$$ plain form
18017 35497206 30437020 25793382 21603117 17873829 14662437 12046545 10025946 8534304
18009 8534304 7433073 6623036 6017695 5546222 5191080 4936722 4742880 4598077 4476846
18000 4476846 4372546 4272922 4213116 4184442 4163419 4150792 4153446 4178820 4231862 4347281 4513522
17989 4513522 4770129 5152097 5719934 6539873 7679011 9232375 11272080 13874618 17024252
17980 17024252 20654376 24669383 28986679 33497401 37970647 42052937 45337702 47604153
17972 47604153 48814562 48997385 48209323 46437346 43699391 40109910 35862157 31327724
17964 31327724 26904468 22811752 19117233 15808168 12912354 10496646 8592997 7170209
17956 7170209 6121612 5348265 4776265 4334830 3983787 3684826 3450832 3257268 3086990
17947C086990j70894j62142j53075j45276j19275j21800j22918j18109j18768
17938A854733j01625j06690r7848o5731o9736p1098p1897n9630n5479m7942k3187
17927A083870l6108l0793k7192l0566k7967k4897k7177k5380l5799k8775l1630
17916G57586k8518l3217j2383n545k5538j7954k2323k8574j9971j246N359k3366
17904E44310l004L366j1748r393j3840o105K71j880k1118j0829k8308k4183r531
17891D08008k075j5767j8719j8895m66j1292j6726j4848k3097j3889l798j1884
17879B56552k759m480j1741q375o537j3217l278p075J2439K645j5170k1053n915
17866A72036p435j4360Q109o909n176O391k684J545K369J0053m218q261N636R780
$$ plain form
17947 3086990 2916096 2753954 2600879 2455603 2336328 2214528 2091610 1973501 1854733
17938 1854733 1753108 1646418 1548570 1482839 1413103 1342005 1270108 1210478 1154999 1107057 1083870
17927 1083870 1047762 1016969 989777 959211 931244 906347 879170 853790 817991 789216 757586
17916 757586 729068 695851 683468 677923 652385 634431 612108 583534 563563 562317 567676 544310
17904 544310 541306 544672 532924 523531 509691 503586 503857 501977 480859 470030 441722 417539 408008
17891 408008 405933 390166 371447 352552 352086 340794 324068 309220 286123 272234 268436 256552
17879 256552 253793 249313 237572 229197 222660 209443 206165 199090 211529 214174 199004 177951 172036
17866 172036 164601 150241 158350 151441 146265 152656 149972 151517 153886 163939 159721 151460 157096 166876
17852A66876J3991L191K948o6l562K910P742L307J332r50J0374O936l544j77r040
17837B02268r322j2836n074j433p028j4338n472J0359j000j3442j5629k6r412
17824A17615K48k1842m137J5445M683J7423j2122j1684k811J1279q702j7030K861
17811I1226K308m418j3953l313Q603q165j0593q185O26J521J845p064m463q28
17797D5147m199r437J3844K4614n289q936m634J392O05J1544J3439R011J1241
17784I8342j3263m893m09K292k73p472m01m054j322r975l78Q183j1743J505K029
17769E8168K1879o626j6365j0806l109j3648N286J2560m17m334r84j3069m809
17756B3726M619k00P239p230n644M483J740J1530j077j8064j5845J968o467Q92
$$ plain form
17852 166876 180867 184058 187006 186940 183378 186288 194030 197337 198669 197719 208093 215029 211485 211308 202268
17837 202268 192946 180110 175036 173603 166575 152237 146765 157124 156124 142682 127053 127027 117615
17824 117615 117863 96021 91884 107329 112012 129435 117313 105629 102818 114097 105395 88365 91226
17811 91226 93534 89116 75163 71850 80453 72288 61695 53510 54136 55657 57502 50438 45975 45147
17797 45147 40948 31511 45355 69969 64680 55744 51110 52502 53107 64651 78090 87101 98342
17784 98342 85079 80186 79777 82069 81796 74324 73923 69869 68547 58572 58194 66377 54634 56139 58168
17769 58168 80047 73421 57056 46250 43141 29493 34779 47339 46922 42588 41604 28535 23726
17756 23726 28345 28145 35384 28154 22510 26993 28733 40263 39186 21122 5277 7245 778 1670
17742A670N860Q381J3376k650j0987l886J837J1384M318P066K564o327Q99L522
17728C7027j3917l670j048P675k34n787R478n170o931k713P042O362N746o389
17714B7471r55q930l15L25J734M047J3367q914j4513P112o004l230n771p982q974
17699a1532M751J7819J0106q611n190k783k749P875J8867l365L788l506r980j2579
17685B911p251N775P768M79Q912m507o312l274j7670Q16O391N374O993L746M944
17670A5095l892o817J803L271N567o649l519O802J1703m365j6397N009K3988p2
17656C1527l893L270j1202K690J7573q613n630j2711j0669n47M195J1782J60j720
17642A6212m192k701O105j825n566Q8k746l110m226P925l245o420q018M309R777
$$ plain form
17742 1670 7530 15911 29287 26637 15650 11764 13601 24985 29303 36369 38933 32606 33505 37027
17728 37027 23110 19440 18392 26067 25833 20046 29524 24354 17423 14710 21752 28114 33860 27471
17714 27471 26516 17586 17271 17596 19330 23377 36744 27830 13317 20429 14425 11195 5424 -2558 -11532
17699 -11532 -6781 11038 21144 12533 7343 4560 1811 9686 28553 25188 28976 25470 15490 2911
17685 2911 -4340 1435 9203 9682 18594 14087 7775 4501 -13169 -12353 -5962 -588 6405 10151 15095
17670 15095 11203 4386 6189 9460 15027 8378 4859 11661 23364 18999 2602 7611 31599 31527
17656 31527 27634 30904 19702 22392 39965 31352 25722 13011 2342 1795 5990 17772 17932 16212
17642 16212 12020 9319 15424 13599 8033 8121 5375 2265 -1961 5964 2719 -3701 -11719 -7410 2367
17627B367n571O220J2750Q22k471N702K093j1057j1961n088L56M421o014r177
17613a6608j328m656L381M519R570L80J5214m283k8143j1402J507J1068Q421m094
17599a6454l963Q34J951m076N311K0891Q787M977j061p42l806K861n163L089J219
17584A4655k5571j2707K554J4955l376r259R322J6408n412q317M469N931k611
17571A041J2751o739o593J4994J1131p543l315M481O33q91J5309K142K687M290
17557D4378n697m473J6715J695j3793k5134q677J0433N353l858o893J6672n566
17544B1155j4357j6453k329N409Q869j0111L152J2342M986O612M702P475N578
17531C7030l955p899r22L2789K4377K1687J9896J0175Q340J2966K8074L2578K8293
$$ plain form
17627 2367 -3204 3016 15766 16588 14117 19819 21912 10855 -1106 -6194 -5838 -1417 -7431 -16608
17613 -16608 -17936 -22592 -19211 -14692 -5122 -4742 10472 6189 -21954 -33356 -31849 -20781 -12360 -16454
17599 -16454 -20417 -19583 -17632 -21708 -16397 4494 13281 18258 17197 16455 12649 15510 10347 13436 14655
17584 14655 -10916 -23623 -21069 -6114 -9490 -18749 -9427 6981 1569 -6748 -2279 3652 1041
17571 1041 13792 7053 460 15454 26585 19042 15727 20208 20841 19950 35259 37401 40088 44378
17557 44378 38681 34208 50923 52618 38825 13691 5014 15447 20800 16942 10049 26721 21155
17544 21155 6798 -9655 -11984 -6575 2294 -7817 -4665 7677 12663 19275 23977 31452 37030
17531 37030 33075 25176 24254 57043 81420 103107 123003 133178 141518 154484 182558 215136 243429
17518B43429K0957J0706j060o353j560j6270k0937j1065j7392j5691k7501k4797
17506A32466k2741j0383j1037k5535n473j141P90o226m433m687N856j2099j3261
17493B2096n665M807M185p322j426o564j0778m32N424R744R671l35Q712O362J0859
17478D9338j0527J083q981J363O311L1505L6548K9445K637J6352L0950K8158L5081
17465B49263K107K098K6107J3682r009j7357j3835q831j5347k4976k6624k4680
17453A52598j5423k7397k1533q886k6890j6799K4391Q580Q557J9279J8202K518
17441A17197j6877m7785l1042j2514P835k544r780l658l59p677m219J6887N655
17428A1119o790p762N217n013M219J454m43N800Q128N291r255K533N13K201o696
$$ plain form
17518 243429 264386 275092 274032 267679 266119 249849 228912 217847 200455 184764 157263 132466
17506 132466 109725 99342 88305 62770 57297 56156 56946 50720 46287 41600 47456 35357 22096
17493 22096 16431 21238 25423 18101 16675 10111 -667 -1099 4325 14069 23740 23405 32117 38479 49338
17478 49338 38811 39894 30913 32276 38587 70092 106640 136085 138722 155074 186024 214182 249263
17465 249263 251370 253468 279575 293257 284248 266891 253056 244225 228878 203902 177278 152598
17453 152598 137175 109778 88245 79359 52469 35670 60061 68641 77198 96477 114679 117197
17441 117197 100320 52535 21493 8979 16814 14270 4490 832 473 -7204 -11423 5464 11119
17428 11119 4329 -3433 1784 -3229 990 2444 2001 7801 15929 21220 11965 14498 15011 17212 10516
17413A0516o81J4389j0587j3264O73Q968j440M37N147r81j2372n074R923J2541
17399A8195j5131R76R900r560j0545J197k85o267R353o184J970L343O207O181
17385I350p358p739r408O869L530O684J0669l49n591k848k693o499K408k119n630
17370a0724l057L894J0778m764K01j2432O062M034m451J6236J0495j5885J545
17357A932K3763Q229j3332j4020q191o323P616q217k8835m873J8675P044L124
17344a3408J222j1723R00Q958J314j7154n279R03r581J08J6017J2949Q456P616
17330A298P927o809r570K80k75p447R656N565r172j4638j3702P518m267K988M993
17315b5655R762n437L317n869J0562J1033j85k0390r410r051R410J1448k070J145
$$ plain form
17413 10516 9835 24224 13637 373 1046 10014 8574 9011 14158 13177 805 -4269 5654 18195
17399 18195 3064 4040 13940 4380 -6165 -4968 -5253 -11520 -2167 -8351 -6381 -3038 3169 9350
17385 9350 1992 -5747 -15155 -8286 -4756 1928 12597 12248 6657 3809 1116 -5383 -2975 -5094 -10724
17370 -10724 -13781 -9887 891 -3873 -3672 -16104 -10042 -6008 -10459 5777 16272 387 1932
17357 1932 25695 33924 20592 6572 -1619 -7942 -326 -8543 -37378 -42251 -23576 -16532 -13408
17344 -13408 -12186 -23909 -23009 -14051 -12737 -29891 -35170 -34267 -43848 -43740 -27723 -14774 -6318 1298
17330 1298 9225 2416 -7154 -6874 -7149 -14596 -4940 625 -8547 -23185 -36887 -29369 -33636 -30648 -25655
17315 -25655 -15893 -21330 -18013 -23882 -13320 -2287 -2472 -22862 -32272 -41323 -31913 -20465 -22535 -21390
17301b1390p79R521J1678l31m935P981p62o426k981n02J3158m64m036k058L326
17286A000j8264n732M317Q686p476J0734P53J204j1794j3927r028L989J4294l663
17272b4907j592L938j575R625J5587O547j2184k2921k497N821J923J1306P091
17259c838m84K174j717r060o163N406J0344L704l552r817K012M534J4304m651
17245C196N398J997j2601o995j1710N386j586o713k318O037M103K14P458J3271
17231E137j0889m982P89K290k94r670m684j259l030R80l530k475R402J0683R1
17216a1441m228j4489M851K899l770J442k323l264N961N031P729m469q013P22
17202b3362M001j564N768k48M564m637n200M843R325q873L239K349L625n955q046
$$ plain form
17301 -21390 -22169 -12648 -970 -1301 -6236 1745 983 -5443 -8424 -8926 4232 3768 -268 -2326 1000
17286 1000 -17264 -22996 -18679 -9993 -17469 -6735 -5982 -4778 -16572 -30499 -39527 -35538 -21244 -24907
17272 -24907 -26499 -22561 -24136 -14511 1076 7623 -4561 -27482 -29979 -24158 -22235 -10929 -3838
17259 -3838 -4322 -2148 -3865 -12925 -19088 -13682 -3338 366 -3186 -13003 -10991 -6457 7847 3196
17245 3196 8594 10591 -2010 -9005 -20715 -15329 -16915 -23628 -25946 -19909 -15806 -15592 -8134 5137
17231 5137 -5752 -10734 -9945 -7655 -7949 -17619 -22303 -23562 -26592 -25612 -29142 -31617 -22215 -11532 -11441
17216 -11441 -15669 -30158 -25307 -22408 -26178 -24736 -27059 -30323 -24362 -19331 -11602 -16071 -24084 -23362
17202 -23362 -19361 -20925 -15157 -15405 -10841 -15478 -20678 -15835 -6510 -15383 -12144 -9795 -6170 -12125 -20171
17187b0171l52K858P694k055j0435k051Q398J671K085r249r808N065m283J782
17173b8851J5887p143K253j385n478k481K1709J3039p341j3108m221m620M224
17160a7516O505k392L888k653o700k76Q960P025K57j010p638N479J1193p668q442
17145a0988P584p780j5096N833L778P175k3530n956R770K1015R687j842q543k610
17131a1503m620p330n404n02O087j954K538J075k727M476j5198o181O485J0486
17117b4272J3772N767j0192j7526N94J0140R999j340J3787P634r621m589N649
17104a98j029M619K883o922J5110K6737k702j8740q711m803r919o425K690j6461
17090b3871l921l750l791Q488n474M886J4426n46m420q900J590R193N216o189
$$ plain form
17187 -20171 -20523 -17665 -9971 -12026 -22461 -24512 -16114 -14443 -12358 -21607 -31415 -26350 -30633 -28851
17173 -28851 -12964 -20107 -17854 -19239 -24717 -27198 -5489 7550 209 -12899 -17120 -21740 -17516
17160 -17516 -11011 -13403 -9515 -12168 -18868 -19144 -10184 -3159 -2902 -3912 -11550 -6071 5122 -2546 -10988
17145 -10988 -3404 -11184 -26280 -20447 -16669 -9494 -33024 -38980 -29210 -8195 1492 -350 -8893 -11503
17131 -11503 -16123 -23453 -28857 -29359 -23272 -25226 -22688 -21613 -24340 -19864 -35062 -41243 -34758 -24272
17117 -24272 -10500 -4733 -14925 -32451 -31857 -21717 -11718 -13058 729 8363 -1258 -5847 -198
17104 -198 -1227 3392 6275 -647 14463 41200 38498 19758 11047 6244 -3675 -10100 -7410 -23871
17090 -23871 -27792 -31542 -35333 -26845 -32319 -27433 -13007 -13553 -17973 -26873 -25283 -16090 -10874 -17063
17076a7063J574N760j5184j2016O086o271Q20J492N893Q093m01K047j579Q134
17062a2615L186o517j1729j569l584J955K69J2950l627j0695j840K554K462l55
17048b9155J2795K357M015n475m962Q717j4272r257n063j063J1201J5180J099
17035a3883N957k697p210l132J099K656L061J76K346L457r289j3022m248j518
17021c6247J1624J530J6888J6902o306k1537j3690K1739j17j714J2051N385q615
17008b107j0345m178J61k021j0426N965P881q946p598J17o058L287M220M12K309
16993b7327l342R958Q592l876j0008M611o895j2678O639Q103k233l39M485o101
16979c0411K450M045r611l719M531j4426Q149J1879J5233j363m931K923N268K601
$$ plain form
17076 -17063 -15489 -9729 -24913 -36929 -30843 -37114 -36294 -34802 -28909 -20816 -21217 -19170 -20749 -12615
17062 -12615 -9429 -15946 -27675 -29244 -32828 -30873 -30604 -17654 -21281 -31976 -33816 -31262 -28800 -29155
17048 -29155 -16360 -14003 -9988 -15463 -20425 -11708 -25980 -35237 -40300 -41363 -30162 -14982 -13883
17035 -13883 -7926 -10623 -17833 -20965 -19866 -17210 -14149 -13973 -11627 -8170 -17459 -30481 -34729 -36247
17021 -36247 -24623 -23093 -6205 10697 4391 -17146 -30836 -9097 -9214 -10928 1123 6508 -2107
17008 -2107 -12452 -16630 -16469 -18490 -28916 -22951 -15070 -24016 -31614 -31497 -37555 -34268 -30048 -29636 -27327
16993 -27327 -30669 -20711 -12119 -15995 -26003 -21392 -28287 -40965 -34326 -26223 -28456 -28795 -24310 -30411
16979 -30411 -27961 -23916 -33527 -37246 -32715 -47141 -38992 -27113 -11880 -13243 -18174 -15251 -9983 -7382
16965g382j294P138j1286j2777n96j651j1206J2778J4351P921M145j3188q536
16952b1583P126l244n284P202R826L11j7561p955O916J0046J4952O680j7000l486
16938a3054k99j854J044n812J4671R955M335J4747j0644l0788q073J0562k232
16925a7442Q94J2190R53p117k789J0512l762j0624J671K884p674j1417O994l144
16911b7871K380r534k12O101J3891J433p396J947J9048K081j4081j4977j0509
16898c7699m535J3231J1094j400K349j0010N026m944O121n399J0876J4526N904
16885E140j704N818j1457l750p204n007n936p051J3157P208k658p718q54m417
16871b6433O703L353m05J2284J74o28o08m399j8586j1827K551M735O510j7075
$$ plain form
16965 -7382 -8676 -1538 -12824 -25601 -26197 -27848 -39054 -26276 -11925 -4004 141 -13047 -21583
16952 -21583 -14457 -17701 -22985 -15783 -5957 -5646 -23207 -31162 -24246 -14200 752 7432 -9568 -13054
16938 -13054 -13353 -15207 -14163 -19975 -5304 4651 8986 23733 13089 -17699 -25772 -15210 -17442
16925 -17442 -16548 -4358 -3405 -10522 -13311 -2799 -6561 -17185 -15514 -12630 -20304 -31721 -24727 -27871
16911 -27871 -25491 -35025 -35237 -29136 -15245 -13812 -21208 -19261 -213 1868 -12213 -27190 -37699
16898 -37699 -42234 -29003 -17909 -19309 -16960 -26970 -21944 -26888 -20767 -26166 -15290 -764 5140
16885 5140 3436 9254 -2203 -5953 -13157 -18164 -24100 -31151 -17994 -10786 -13444 -21162 -22016 -26433
16871 -26433 -19730 -16377 -16782 -4498 -4324 -4952 -5560 -9959 -28545 -40372 -37821 -33086 -26576 -43651
16857d3651n815P989J0611M701m504m315J8816L1640O927o856j0893k1111j1763
16844b8224m763M430J7703J3053J398r280m753q486j3041J0518J8352R410j4273
16831g956q171K027n032m471P267J878m01J560L094M32j3499l260L040R63l569
16816b6098L10l102l91P945J9821J3336j0564R458N992k556j7482j063P488r35
16802B159k824Q086j0181l631J7015J080k2887k0262k722K0460J6155m397J0517
16789H568N492j9704j0294P886J9380J1255O72j5424k1908j22J0602o88r401P348
16775f338J592r870q979j86k159R65J539J1669O784r494J4K032k461j1937k802
16760b9631Q574K970j3901l794J0091O580m794p540J566M867M707J6211M187P697
$$ plain form
16857 -43651 -49466 -41477 -30866 -26165 -30669 -34984 -16168 15472 22399 15543 4650 -16461 -28224
16844 -28224 -32987 -28557 -10854 2199 3597 -5683 -10436 -18922 -31963 -21445 -3093 6317 -7956
16831 -7956 -16127 -14100 -19132 -23603 -16336 -14458 -14859 -13299 -10205 -9773 -23272 -26532 -23492 -22529 -26098
16816 -26098 -25788 -28890 -29281 -21336 -1515 11821 1257 10715 16707 14151 -3331 -4394 3094 2159
16802 2159 -665 7421 -2760 -6391 10624 11704 -11183 -31445 -34167 -13707 2448 -1949 8568
16789 8568 14060 -5644 -15938 -8052 11328 22583 23255 7831 -14077 -14199 -3597 -4285 -13686 -6338
16775 -6338 -4746 -14616 -23595 -23781 -25940 -24975 -23436 -11767 -4983 -14477 -14463 -12431 -14892 -26829 -29631
16760 -29631 -21057 -18087 -31988 -35782 -25691 -19111 -23905 -31445 -29879 -25012 -20305 -4094 93 7790
16746G790P529J086J6641N340q221p676p688j0852K563l058j0639n729Q355K830
16732a729j1121n015K016Q780J4553q394j0021j641o94j4853Q94J1015O135k0623
16718c0698j6196O337J9287j241n143J6918Q511j2038k309P429P894Q00Q233N939
16704A3723j6560j0438j0598J0818J0415o38j6825K441J8420j856j6266j1539
16692b8903J18n941L093Q022k275L484J2402J8231L080q644N118j0617q862O012
16678e682O93l32J8727Q07k1620j1053O221k150J248m694J840Q388Q399j1612
16664a0820m945r553L31o537q688N029J121L974O063k339K700k73M40K2146M877
16649C526n074O162L19P86p345P830J8697p738r436N963k849j0020J375j0672
$$ plain form
16746 7790 15319 16405 33046 38386 30165 22489 14801 3949 6512 3454 -7185 -12914 -4559 -1729
16732 -1729 -12850 -17865 -15849 -7069 7484 -910 -10931 -12572 -13266 -28119 -27225 -16210 -10075 -30698
16718 -30698 -46894 -40557 -21270 -22511 -27654 -10736 -2225 -14263 -16572 -9143 -1249 -449 7784 13723
16704 13723 -2837 -13275 -23873 -13055 -2640 -3278 -20103 -17662 758 -1098 -17364 -28903
16692 -28903 -28785 -34726 -31633 -23611 -25886 -22402 -10000 8231 11311 2667 7785 -2832 -11694 -5682
16678 -5682 -4989 -5321 13406 14213 -7407 -18460 -12239 -14389 -13141 -17835 -15995 -7607 792 -10820
16664 -10820 -15765 -25318 -24987 -31524 -40212 -35183 -34062 -30088 -24025 -26364 -23664 -23937 -23497 -1351 3526
16649 3526 -1548 4614 4933 5719 -1626 6204 24901 17163 7727 13690 10841 821 2196 -8476
16635h476j5268J0085J2371K775O086K33K868o385J0281J2051n909j5887m025
16622H00q02p835k888R694j0272L208J2349o549n893L251J037P297N275k3361
16608a4689r234j251r791P892J1419J6976O933q004k618j784p04r346o642J0642
16594a0201o77l029K1659J4580k4807r058J453q836J926l385L081n321O691l96
16580a6320L80j0854J843l874J579j063K1661M547j8761k023n451j118L222L58
16566b5874L057K0199l69q915p31j633M629o931p381J5185J1563Q583q032n363
16552b013K815j152Q039K088o844j4411j5269J0770M737k527O822M21n213k906
16538a4643q198j2182m235J6201j055M139J0619J010q764j2564j2365J2296J8306
$$ plain form
16635 -8476 -23744 -13659 -1288 1487 7573 7806 10674 4289 14570 26621 20712 4825 800
16622 800 -2 -7837 -10725 -1031 -11303 -8095 4254 -2295 -8188 -4937 -3900 3397 8672 -14689
16608 -14689 -23923 -25174 -34965 -27073 -15654 1322 8255 251 -2367 -4151 -4855 -14201 -20843 -10201
16594 -10201 -10878 -13907 7752 22332 -2475 -11533 -10080 -18916 -16990 -20375 -17294 -22615 -15924 -16320
16580 -16320 -15940 -26794 -24951 -28825 -27246 -28309 -6648 -2101 -20862 -22885 -28336 -29454 -26232 -25874
16566 -25874 -22817 -2618 -2987 -11902 -12633 -14266 -9637 -16568 -23949 -8764 2799 11382 3350 -2013
16552 -2013 802 -350 7689 9777 2933 -11478 -26747 -15977 -11240 -13767 -6945 -6524 -11737 -14643
16538 -14643 -22841 -35023 -39258 -23057 -24112 -19973 -9354 -8344 -17108 -29672 -42037 -29741 -11435
16525a1435J442p594l887j57o124l733n439M82l717L531J1343P335j583l872P514
16510a5894r054n417j0139N872K2803J4289l720j61j3254J80N558j2221r733m048
16496c4939o594k712K3488J7442n719j122q276R020l65j0128k275o023O943O714
16482a4546J033N111N702o435p363o199J626M494l395j012J680l441j4012n960
16468d2717J1295J1824P273P51L718j468k930O660J205J1k02q58p303r212j1611
16453c3564J3931K1654L090j4823K271Q088J1662L833j486j1855j5743K892K752
16440g298r498j6211o125L271j6856L668K6517k90q281J6735j0812N953M947j1074
16426b5354p280m254O451R59j29l94N40m164L576N561N088m048J449P808J549
$$ plain form
16525 -11435 -9993 -17587 -21474 -21631 -27755 -31488 -36927 -36445 -40162 -36631 -25288 -17953 -19536 -23408 -15894
16510 -15894 -24948 -30365 -40504 -34632 -11829 2460 -1260 -1421 -14675 -14495 -8937 -21158 -30891 -34939
16496 -34939 -41533 -44245 -20757 -3315 -9034 -10156 -18432 -9412 -9777 -19905 -22180 -28203 -21260 -14546
16482 -14546 -13513 -8402 -2700 -9135 -16498 -22697 -21071 -16577 -19972 -20984 -19304 -22745 -36757 -42717
16468 -42717 -31422 -19598 -12325 -11574 -7856 -9324 -12254 -5594 -4389 -4378 -4580 -5438 -12741 -21953 -33564
16453 -33564 -19633 2021 5111 -9712 -7441 647 12309 16142 14656 2801 -12942 -10050 -7298
16440 -7298 -16796 -33007 -39132 -35861 -52717 -49049 -22532 -22822 -31103 -14368 -25180 -19227 -14280 -25354
16426 -25354 -32634 -36888 -30437 -29478 -29607 -30001 -29461 -33625 -30049 -24488 -19400 -23448 -21999 -14191 -12642
16411a2642J320m29K146K016j0438J1014r31j2830l879P904l175m325P901P685
16397h663j0299q602O633J896R96j4452k080P291R403o901R163J3958J2910L39
16383A1592j3852M594m15j6658Q833q923J300n261N374J625J2686P270Q210l901
16369A2474j0800j010r302p023J0003J3654k647j8742j1804J5291q994p835j4839
16356d1574K442J0135R245J1865m128l143J912n065M232k928K201j6217Q3M228
16342b6712J060J0024j147j628r296P083j165O269R867J2553p14j135M265j0310
16328i86q179O038p889k836j143N249P188n96q28n07J327m267j7351n136J5035
16313a4881J0619K844O090J491K648p818j8174l872J1558O229m008m719J137m186
$$ plain form
16411 -12642 -11322 -11751 -9605 -7589 -18027 -7013 -7944 -20774 -24653 -16749 -19924 -24249 -16348 -8663
16397 -8663 -18962 -27564 -20931 -19035 -18039 -32491 -34571 -27280 -17877 -24778 -15615 -1657 11253 11592
16383 11592 -2260 2334 1919 -14739 -5906 -14829 -13529 -18790 -13416 -11791 895 8165 16375 12474
16369 12474 1674 664 -8638 -15661 -5658 7996 5349 -13393 -25197 -9906 -18900 -26735 -41574
16356 -41574 -39132 -28997 -19752 -7887 -12015 -15158 -13246 -18311 -14079 -17007 -14806 -31023 -30940 -26712
16342 -26712 -25652 -15628 -16775 -18403 -27699 -20616 -21781 -15512 -5645 6908 6194 5059 9324 -986
16328 -986 -9165 -3127 -11016 -13852 -14995 -9746 -2558 -3154 -3982 -4489 -3162 -7429 -24780 -29916 -14881
16313 -14881 -4262 -1418 4672 6163 8811 993 -17181 -21053 -9495 -3266 -7274 -11993 -10856 -15042
16299a5042q872j0085l00j273J4509L96l245J77j1339J237J4257J4621K230j642
16285d371q03M580p88q659P519j278o53K917n483j1705o32P893l36j1792r159
16270c2750K682P605J3480M402L679l43j1102j1866J2722J3546K638k1659j895
16257a8861J9356n495j8490M434J1373j8019j0757o525o143J6026J427q237M617
16244c5294K632o102r90J0777M23N92j0982l375M829P54o150K926J3898J3135
16230a2927K409n436Q257r317j7696n464K113j743l178M018L718R658L082M912
16216a7594N407J0893m70p67L487L422J521j5411k3094j0168J07J3210O778K699
16202a9980M729O845k826j2847j0309J1027n628j065J4191J0636p326j5234q916
$$ plain form
16299 -15042 -23914 -33999 -34299 -35572 -21063 -20667 -23912 -23735 -35074 -33837 -19580 -4959 -2729 -4371
16285 -4371 -5174 -594 -1382 -10041 -2522 -3800 -4453 -1536 -7019 -18724 -19356 -11463 -11799 -23591 -32750
16270 -32750 -30068 -22463 -8983 -4581 -902 -1245 -12347 -24213 -11491 2055 4693 -16966 -18861
16257 -18861 495 -5000 -23490 -19056 -7683 -25702 -36459 -42984 -49127 -33101 -31674 -39911 -35294
16244 -35294 -32662 -38764 -39754 -28977 -28554 -27962 -38944 -42319 -37490 -36736 -42886 -39960 -26062 -12927
16230 -12927 -10518 -15954 -7697 -17014 -34710 -40174 -38061 -39804 -42982 -38964 -35246 -25588 -22506 -17594
16216 -17594 -12187 -1294 -1764 -2531 956 4378 5899 -9512 -32606 -42774 -42667 -29457 -22679 -19980
16202 -19980 -15251 -8406 -11232 -24079 -34388 -23361 -28989 -30054 -15863 -5227 -12553 -27787 -36703
16189c6703r12j366k944q66L63R75K627j290M226O379o447J9520J3855j367r681
16174a3631P276N700j097m52j839p44O501q411j4941O177L820l314O402N267j496
16159d782j1768k4297N843K2147Q037L756N419K701j0186j4762j5322J2928Q053
16146a2233j13M944M4l080j4789O77J1540p722P376j397J0062R424l47j8693j4282
16131b8589m210J0521J4659N438K628N75L162p774L657j634r735P403J2297o817
16117A581j7216q271n836J1875K0841p326j7784j3454M236J7512J4479m633j0974
16104a4970n218n704J459n490n560P251K873P495p080k788j845j0801Q93O374
16090c3111P606J5179Q630r263p496O90K095p411q533m90o445K3086P471J7099
$$ plain form
16189 -36703 -37615 -38981 -41925 -42791 -42428 -41453 -38826 -40116 -35890 -29511 -35958 -16438 -2583 -3950 -13631
16174 -13631 -6355 -655 -1752 -2204 -4043 -4787 1714 -6697 -21638 -15461 -11641 -14955 -8553 -3286 -4782
16159 -4782 -16550 -40847 -35004 -12857 -4820 -1064 4355 7056 -3130 -17892 -33214 -20286 -12233
16146 -12233 -12346 -7402 -7358 -10438 -25227 -24550 -13010 -20732 -13356 -14753 -4691 4733 4386 -14307 -28589
16131 -28589 -32799 -22278 -7619 -2181 447 1022 4184 -3590 67 -1567 -11302 -3899 8398 1581
16117 1581 -15635 -23906 -29742 -17867 2974 -4352 -22136 -35590 -31354 -13842 637 -3996 -14970
16104 -14970 -20188 -25892 -24433 -29923 -35483 -28232 -25359 -17864 -24944 -27732 -29577 -40378 -39485 -33111
16090 -33111 -25505 -10326 -1696 -10959 -18455 -17765 -15670 -23081 -31614 -32104 -38549 -15463 -7992 9107
16076I107j052j1051n056l683J620j2181j890J0181J0271Q604K58N522o112k0534
16062a5996j2829M336L166N766L815j456O617q0P09o001K358l12j0396J480j0501
16047b9324N191j749Q605N783P315O080K307O095m226o451K631O744n879k377
16033G45k72j827o880J544l036m534K405p458l670k30R316o634O410J1354J5401
16018A2634R90j3462p953j1687j0187L28L020P731J1037K869j120q068N406r28
16004i390K066l965J018R419l777K736J430n129o199j7108K51l604K656J8465
15990a1131K012j0633j3893J0692N154R73j3756K07Q029m632j2966j94J4838K0550
15976d750r33O214j3079p419j1659l739N532M055J4541K856J78j3089l930M202
$$ plain form
16076 9107 8055 -2996 -8052 -11735 -10115 -22296 -24186 -14005 -3734 4870 5128 10650 4538 -15996
16062 -15996 -28825 -24489 -21323 -15557 -11742 -13198 -6581 -6661 -5952 -11953 -9595 -9907 -20303 -18823 -29324
16047 -29324 -24133 -25882 -17277 -11494 -4179 1901 4208 10303 6077 -374 2257 9001 3122 745
16033 745 473 -1354 -8234 -6690 -9726 -14260 -11855 -19313 -22983 -23213 -13897 -20531 -14121 -2767 12634
16018 12634 13624 162 -7791 -19478 -29665 -29337 -26317 -18586 -7549 -4680 -5800 -13868 -8462 -9390
16004 -9390 -7324 -11289 -10271 -852 -4629 -1893 -463 -5592 -11791 -28899 -28648 -32252 -29596 -11131
15990 -11131 -9119 -19752 -33645 -22953 -17799 -16826 -30582 -30375 -22346 -26978 -39944 -40138 -25300 -4750
15976 -4750 -5683 531 -12548 -19967 -31626 -35365 -29833 -25778 -11237 -8381 -8203 -21292 -25222 -21020
15962b1020Q369Q729O472L120K262r137r690m254j6555k712P59l802J9990l487
15948b0956o022J8317M473l63P248m895j0785n275q498J3403J5860j045j2335
15935a0873n049K003O435J0788j5178j7892O818J1910J587L865q659j013j3785
15922b9043L20N093k741K984K615q754K36p131J186j6181K384J5750Q628m524
15908b9178J0192J409J838o229k0785n557N776J3791J048J1544J7172j329P776
15895G468l266n292q517j4367r098P199L186K981r389q04J689O997p840r421Q814
15880b9660J9403R165n573n716N545J1473l039K868j0587q479k564n372J717q330
15866b9149P947k240q060j254l072N025R015m224N881K719m429K01J5719R585
$$ plain form
15962 -21020 -12651 -3922 2550 5670 7932 -1205 -10895 -15149 -31704 -34416 -33657 -37459 -17469 -20956
15948 -20956 -26978 -8661 -4188 -4551 2697 -2198 -12983 -18258 -26756 -13353 2507 1462 -10873
15935 -10873 -15922 -13919 -7484 3304 -11874 -29766 -22948 -11038 -9451 -5586 -14245 -15258 -29043
15922 -29043 -28723 -23630 -26371 -23387 -20772 -29526 -29290 -36421 -35235 -51416 -49032 -33282 -24654 -29178
15908 -29178 -18986 -17577 -15739 -21968 -42753 -48310 -42534 -28743 -27695 -16151 1021 -308 7468
15895 7468 4202 -1090 -9607 -23974 -33072 -25873 -22687 -19706 -29095 -29899 -28210 -21213 -29053 -38474 -29660
15880 -29660 -10257 -1092 -6665 -12381 -6836 4637 1598 4466 -6121 -14600 -17164 -22536 -20819 -29149
15866 -29149 -21202 -23442 -31502 -32756 -35828 -30803 -21788 -26012 -20131 -17412 -21841 -21640 -5921 3664
15852C664j9919k792o251R780K0379m02j2038j1564J283L958P08k695L001o320
15838a9208j0035J0901R162o419j7880n983N242N67K997J9133m181K06L1o085
15824b1552P458J0703P328M717O294j1990j0230J604j0313L00O047p64Q142J1871
15810I615J482r351j3313R881J3812j147L005n024k0027l635m578l484Q108J087
15796a3569K42N362K338o57m054k924l390K196J125r205R252L86q081J5686J0572
15781E279o414j266j153L981o083M0k036j9121Q061O218k924l952J425l205R994
15766a1156q442j0094O196Q149J7004M070j4691j0158m29J2320O874p262j5439
15753b3058K557J0913j2M332o43j9358j1432L091N687l233l650l695l277Q96J3909
$$ plain form
15852 3664 -16255 -19047 -25298 -15518 4861 4459 -7579 -19143 -17860 -13902 -13194 -15889 -12888 -19208
15838 -19208 -29243 -18342 -9180 -15599 -33479 -39462 -34220 -33653 -30656 -11523 -15704 -15498 -15467 -21552
15824 -21552 -14094 -3391 3937 8654 14948 2958 -7272 -5668 -15981 -15681 -9634 -10398 -2256 9615
15810 9615 11097 1746 -11567 -1686 12126 10979 13984 8960 -11067 -14702 -19280 -22764 -14656 -13569
15796 -13569 -13327 -7965 -5627 -6284 -10338 -13262 -16652 -14456 -13331 -22536 -13284 -12898 -20979 -5293 5279
15781 5279 -1135 -2401 -3554 427 -5656 -5616 -7652 -26773 -18712 -12494 -15418 -19370 -17945 -21150 -11156
15766 -11156 -19598 -29692 -23496 -15347 1657 5727 -8964 -19122 -19551 -7231 -357 -7619 -23058
15753 -23058 -20501 -9588 -9600 -5268 -5911 -25269 -36701 -33610 -27923 -31156 -34806 -38501 -41778 -40882 -26973
15738b6973O712O767J5569r991j8301L634Q956Q607P382n200J287o993q788J5474
15724a858J1611K539j7384j1891L312O610k109R08J1295o335p249J5326R192N380
15710A9347r726j3012o141P614L649n597p880m334l145K678K095k311j0600j981
15696b9344J1501L963K140m5q739J1883J240j9213p869K1359J1654j488j1365
15683a4323q276L63j937p492O480J0217P237Q916n02j0803q777o200O548r95Q321
15668a1223M844l252O67l091j5878j1852N051K417L149q286J0139K0813K990k992
15654f504j4002k799n714k046J2044O655J41J7526J4720O880j0964j8598r075
15641a1736k131O681L72j967N154J1624p285M035n75m704p287K219Q109K856K129
$$ plain form
15738 -26973 -20261 -13494 2075 -7916 -26217 -22583 -13627 -5020 2362 -2838 -1551 -8544 -17332 -1858
15724 -1858 9753 12292 -5092 -16983 -13671 -7061 -9170 -8262 3033 -3302 -10551 4775 13967 19347
15710 19347 9621 -3391 -9532 -1918 1731 -3866 -11746 -16080 -19225 -16547 -14452 -16763 -27363 -29344
15696 -29344 -17843 -13880 -11740 -11785 -20524 -8641 -7401 -26614 -34483 -13124 -1470 -2958 -14323
15683 -14323 -22599 -22236 -24173 -31665 -25185 -14968 -7731 1185 683 -10120 -18897 -25097 -18549 -19544 -11223
15668 -11223 -6379 -9631 -8964 -12055 -27933 -39785 -34734 -32317 -29168 -37454 -27315 -6502 -3512 -6504
15654 -6504 -20506 -23305 -29019 -31065 -19021 -12366 -12225 5301 20021 26901 15937 -2661 -11736
15641 -11736 -13867 -7186 -6814 -8781 -3627 7997 712 4747 4172 -532 -7819 -5600 2509 5365 7494
15626G494K60k066J0016n717K894O548J2784k909p202l166j2329j2185k875j425
15612i878N942q652k041R680O024Q887M652p962j4345Q71o868p031N435j0649
15598b5935j237Q976J6705K348k798k195N261n650O277J1231j0882j1412k1142
15585c0453r623J5227o522j0396J197p85N63J8023J3502n817J331P700q727n14
15571a5294J1428j285J028L94p328j0417m470J4278Q192J0096J6769K29q593l697
15557A1330K966P576N72o192j4843j7135r457r370l664K1411j25n567q060K051
15543b8507Q997k31L766j645j1080K705J154Q736j480q502J9524O580L68R442
15529I827j183k858j8393j4289R588k017J169J3585j467j5003P249N106N206l932
$$ plain form
15626 7494 7754 5688 15704 9987 12881 19429 32213 29304 22102 18936 6607 -5578 -8453 -9878
15612 -9878 -3936 -12588 -14629 -4949 1075 9962 14614 6652 -7693 -6822 -13690 -20721 -15286 -25935
15598 -25935 -27172 -18196 -1491 857 -1941 -4136 1125 -4525 1752 12983 2101 -9311 -30453
15585 -30453 -40076 -24849 -31371 -41767 -40570 -41355 -40792 -22769 -9267 -15084 -13753 -6053 -14780 -15294
15571 -15294 -3866 -5151 -4123 -3729 -11057 -21474 -25944 -11666 -3474 6622 23391 23620 15027 11330
15557 11330 14296 21872 22444 16252 1409 -15726 -25183 -34553 -38217 -16806 -16931 -22498 -30558 -28507
15543 -28507 -19510 -19741 -15975 -17620 -28700 -25995 -24841 -16105 -17585 -26087 -6563 17 385 9827
15529 9827 8644 5786 -12607 -26896 -17308 -19325 -18156 -4571 -6038 -21041 -13792 -8686 -3480 -7412
15515g412p401Q67O776j5809K242L323M089l44n954m011J4696J3079L962K159
15501A0262R04j4906P948J1864m033q056j8635j8327r951j0633J0268J9631J0068
15488a3596Q579k467j3289K697M099N462m934p163K084Q8J40M096L318R220p225
15473h891j5373n31l564m011m899p615J5824J6169M797l734N692m441J285k558
15459a1850j248k61Q802k539j057P279J8P738M565J15M870J810r834j3338k0620
15444b5550J0474J1513p104j1458N323q031l655J287J4476J4569k866j250J1766
15431I494p502L475J1474m65j1712n555j6787R050n488J052j668P374R703J2266
15417A4711N951K433o505o703k832k011l056N081j224j5324r109J8769N030j5960
$$ plain form
15515 -7412 -14813 -13946 -7170 -22979 -20737 -17414 -13325 -13669 -19623 -23634 -8938 4141 8103 10262
15501 10262 11166 -3740 4208 16072 12039 3983 -14652 -32979 -42930 -53563 -43295 -23664 -13596
15488 -13596 -5017 -7484 -20773 -18076 -13977 -8515 -13449 -20612 -18528 -18440 -18300 -14204 -10886 -1666 -8891
15473 -8891 -24264 -24795 -28359 -32370 -37269 -44884 -29060 -12891 -8094 -11828 -6136 -10577 -9292 -11850
15459 -11850 -13098 -13359 -4557 -7096 -8153 -874 -856 6882 11447 11562 16432 18242 8408 -4930 -25550
15444 -25550 -15076 -3563 -10667 -22125 -16802 -24833 -28488 -27201 -12725 1844 -1022 -2272 9494
15431 9494 1992 5467 16941 16476 4764 -791 -17578 -8528 -14016 -12964 -14632 -7258 2445 14711
15417 14711 20662 23095 16590 9887 7055 5044 1988 7069 5845 -9479 -18588 181 5211 -10749
15403a0749r711j890n441O707Q140j0611P905J2629j0505j2166N852K2904j725
15390A339j347j2266p063n156J3516M228L201m407R515q385k290J329p06o403
15376a4895m808n499k48J2081J5705j1081o744k399l177o519j086p614J1334r85
15362b5935L981n935p006P055J7226K0510p51j2880J85o762L497K662q034o802
15348a8989J2675J9175J969k3984k831J5741K206m590j2339m966j630O077Q170
15335c316J1487n925j7155n203R695j5M579O172L089J0495O352M155k563j6485
15321E362K04n697l255j6156l307O298N108k012r795J2255N096Q647j905l116
15307b273j919Q773Q576j0296p525N560k954K911m356o099M280J1763N791j0584
$$ plain form
15403 -10749 -20460 -22350 -27791 -21084 -12944 -23555 -15650 -3021 -13526 -25692 -19840 3064 1339
15390 1339 -8 -12274 -19337 -24493 -10977 -6749 -3548 -7955 1560 -6825 -9115 -7786 -8492 -14895
15376 -14895 -19703 -25202 -25450 -13369 2336 -8745 -15489 -17888 -21065 -27584 -28670 -36284 -24950 -25935
15362 -25935 -21954 -27889 -34895 -27840 -10614 9896 9145 -3735 -3550 -10312 -6815 -4153 -12187 -18989
15348 -18989 -6314 12861 14830 -9154 -11985 3756 5962 1372 -10967 -15933 -17563 -11486 -3316
15335 -3316 8171 2246 -14909 -20112 -10417 -10432 -5853 319 3408 13903 20255 24410 21847 5362
15321 5362 5566 -131 -3386 -19542 -22849 -16551 -11443 -13455 -23250 -10995 -5899 2748 843 -2273
15307 -2273 -4192 4581 13157 2861 -4664 896 -2058 853 -3503 -9602 -5322 6441 12232 1648
15293A648n426j6303J2033J5280k230k516l193l591m16L79l777q82k195J2766
15279A577L071O357o977k0076n672J0310K5352N528j6168k3397J348M266K943
15266a1538O888R348J1240r231p312O78o034J0151M71J290k071l444r71M718p686
15251c503j4803j0724K875K301Q418J5274K640j2676p240j195j401l281Q145J2705
15237b465k942j695o852p04o800p645n9Q257M513l445K682j0368O819J3709K421
15222d574J0129J6533J6829q077p340r256k7527j444J8703n510j063l003j0451
15209a6051j1059k572N226J6187j739j5302m410P750J2885m405o093R578j396
15196a1401N649O874J0974m223j6503L408m905q627O237Q567j246P28J455Q883
$$ plain form
15293 1648 -3778 -20081 -8048 7232 5002 2486 -707 -4298 -4714 -4335 -8112 -8994 -11189 1577
15279 1577 4648 11005 4028 -16048 -21720 -11410 13942 19470 3302 -20095 -18747 -14481 -11538
15266 -11538 -4650 4698 15938 6707 -605 73 -5961 4190 4661 5951 3880 436 -535 4183 -3503
15251 -3503 -18306 -29030 -26155 -23854 -15436 -162 2478 -10198 -17438 -18633 -20034 -23315 -15170 -2465
15237 -2465 -5407 -7102 -13954 -14658 -21458 -29103 -29162 -20905 -16392 -19837 -17155 -27523 -20704 -6995 -4574
15222 -4574 5555 22088 38917 30840 23500 14244 -13283 -14727 3976 -1534 -2597 -5600 -16051
15209 -16051 -27110 -29682 -24456 -8269 -10008 -25310 -29720 -21970 -9085 -13490 -19583 -10005 -11401
15196 -11401 -5752 1122 12096 7873 -8630 -5222 -10127 -18754 -12517 -3950 -5196 -4468 -3013 5870
15182E870o026q621K304R807P039Q296O153R30j2554k776M172O645J1902J199
15168C4340k0798n552j909j2199k479L861M472P12l563q159Q534o561L030p960
15154a4231J605L202L305n492k873O366J4361j254q378L978o510n451O968P818
15140C414m624N123j5188k495k499m121J298R428M40j091n92R765L87p797o597
15125a5149Q120M060m522m412p896j2370J5358N392L605J6256n991k1082k413
15112b1044J6734K580M209J2858L45j0068J873O486J1284k303k9l353N666N249
15098C0487j6429J476j0035m234K2333m546k0289r153J0252K690J980p687k764
15085e919J098j086l090k737N265n915L331k282J649M015j0632Q1J6161M267j2870
$$ plain form
15182 5870 -156 -8777 -6473 3334 10373 18669 24822 25752 13198 10422 14594 21239 33141 34340
15168 34340 13542 7990 6081 -6118 -8597 -4736 -264 448 -3115 -11274 -2740 -9301 -6271 -14231
15154 -14231 -12626 -9424 -6119 -11611 -14484 -8118 6243 4989 -3389 589 -5921 -11372 -4404 3414
15140 3414 -1210 3913 -11275 -13770 -16269 -20390 -19092 -9664 -9224 -10315 -10907 -1142 -755 -8552 -15149
15125 -15149 -7029 -2969 -7491 -11903 -19799 -32169 -16811 -11419 -7814 8442 2451 -18631 -21044
15112 -21044 -4310 -1730 2479 15337 15682 5614 7487 13973 25257 22954 22925 19572 25238 30487
15098 30487 14058 15534 5499 1265 23598 19052 -1237 -10390 -138 2552 4532 -3155 -5919
15085 -5919 -4821 -5907 -8997 -11734 -6469 -12384 -9053 -11335 -9686 -5671 -16303 -16222 -61 4206 -8664
15070h664n625p704J0339Q604K915R980J435n127J15j2301j5578R746O303j2046
15056a7608l02J0781O83j4033K700J8631r76M199J04K850M54J669J977j7368q252
15041a4491Q073M818J1665L368O253k867K542J1998J0366j5783j5903r399j0772
15028a0132o314N819P126P424m215R308J0997r122j1629N672L799J3784o671l346
15014A2500J1518J5473R24j259J7111K839n874K2270J3706P86J0679N5584P8477
15001B34734J17104J61101K19721K80257L60776L32782j09439n66414l99997k22695
14991D07930j21688q3491o0685m0512l8844j2612P808n245j43o809o337K395P265
14978D9032q805K155L386q880r916j0842Q008O84j895Q536j0623j7092L277j1203
$$ plain form
15070 -8664 -14289 -21993 -11654 -3050 -135 9845 11280 6153 6268 -6033 -21611 -11865 -5562 -17608
15056 -17608 -17910 -7129 -6446 -20479 -17779 852 -124 4075 4179 7029 7483 9152 11129 -6239 -14491
15041 -14491 -6418 -1600 10065 13433 19686 16819 19361 31359 41725 25942 10039 640 -10132
15028 -10132 -16446 -10627 -3501 3923 -292 9016 20013 10891 -738 4934 8733 22517 15846 12500
15014 12500 24018 39491 40415 39156 56267 59106 53232 75502 89208 89994 100673 156257 234734
15001 234734 351838 512939 732660 1012917 1373693 1706475 1597036 1030622 630625 407930
14991 407930 286242 202751 142066 101554 62710 50098 57906 52661 52518 45709 39372 41767 49032
14978 49032 40227 42382 45768 36888 26972 16130 24138 24822 22927 31463 20840 3748 7025 -4178
14964d178j7446L406R184J5660J4201K011o144q885O357k317J0909l741n771r008
14950D238l119O194J1235q996o265o603j722q295r759J0136J9442O677k910m068
14936F185j0749l692J0181J1908l546j2018L501l265j856Q244n207o005j7168
14923b3487l88k01J093J837J331J8602M091j5m55r286q494j341J2814K0232N893
14908B2226j6708n404M757n374Q110J0123n148j1432j205J1378R92k8501r480
14895b5666J9179J1565k1168K748L775Q656m355K980J2752K192K891o640j051
14882G858K120K280R34Q098j3576l84J247J805j1249o41j4296Q544K2161J6390
14868C1291l12r301m143j4230k2j465Q567Q735P071j4831j8364j501J4083o482
$$ plain form
14964 -4178 -21624 -18218 -9034 6626 20827 22838 16694 7809 14166 11849 22758 19017 13246 4238
14950 4238 1119 7313 18548 9552 3287 -3316 -5038 -13333 -23092 -12956 6486 13163 10253 6185
14936 6185 -4564 -8256 1925 13833 10287 -1731 1770 -1495 -3351 4893 -314 -6319 -23487
14923 -23487 -23875 -24076 -22983 -21146 -19815 -1213 2878 2863 2408 -6878 -15372 -16713 -3899 16333 22226
14908 22226 5518 114 4871 -503 7607 17730 12582 1150 -55 11323 12315 -16186 -25666
14895 -25666 -6487 5078 -16090 -13342 -9567 -911 -5266 -2286 10466 12658 15549 8909 7858
14882 7858 9978 12258 13192 21290 7714 7330 8577 10382 -867 -1508 -15804 -7260 14901 31291
14868 31291 30979 21678 17535 3305 3283 1818 10385 19120 26191 11360 -7004 -8505 5578 -904
14854i04q175J8500M97l356P444R641j0497m183j1278m344J4899K568M631j0978
14840D465j3219j198K912K3203N005j5433j7899m731o86J780K418j555N940P301
14826a697M622k121l36L960j0525m096J1555J1507p659j5717k732J3157L789j986
14812A721p834j3762M533R493K491l233K991j369R953Q7m547M782n570K242n054
14797c076J812m946K570k226j1398j0097J4261J9784q96j0219k193k425K716J1266
14783D933m251J7933o235j3704k034J739l919J4O064N527l049J2012J646Q351
14769B5027M422R599j1956k0748j8624M01L33j747J3097M991J0644M481j1479
14756H441j744q956M152R686j1483k667J677P634n74L174k215o306p060L095O352
$$ plain form
14854 -904 -9079 9421 9918 6562 14006 23647 13150 8967 -2311 -6655 8244 10812 15443 4465
14840 4465 -8754 -9952 -7040 16163 21168 5735 -12164 -16895 -17581 -15801 -13383 -14938 -8998 -1697
14826 -1697 2925 804 468 4428 -6097 -10193 1362 12869 5210 -10507 -13239 -82 3707 1721
14812 1721 -6113 -19875 -15342 -5849 -3358 -6591 -3600 -4969 4984 5071 524 5306 -264 1978 -3076
14797 -3076 -1264 -6210 -3640 -5866 -17264 -27361 -13100 6684 5788 -4431 -6624 -9049 -6333 4933
14783 4933 682 18615 12380 -1324 -3358 -1619 -5538 -5524 540 6067 3018 15030 16676 25027
14769 25027 29449 39048 27092 6344 -12280 -11879 -11546 -13293 -196 4795 15439 19920 8441
14756 8441 6697 -2259 1893 11579 96 -2571 -894 6740 6166 9340 7125 819 -6241 -3146 3206
14741C206m244m786n44P000P78J1173R966j0182j6049o617M116J782J4985J5506
14727B6090J1531j182j4911j1851J0605Q151q824j2445l142p186j3639K427L705
14714a0671M043n153M332O35L180L763M120N548J758L900r737O51k471j208m32
14699B258R166J2110j963o614q331q119M042R743j1016L563J0013P647K954k656
14685B2797j4546O482J05K0343J5899j388k18j2011m966J170J40m36r216O110
14671C0265j557L11N868q136j450l972M612O655K241p561J3960L686o43p261m474
14656C2544Q937P804r46J2568L822m762O454n826J4984J2985O609r179p990N697
14642H3701O345j978J849j4030K25J5073L0006K0309K5574K8141L9086N8112Q9821
$$ plain form
14741 3206 -1038 -5824 -6368 632 1410 12583 22549 12367 -3682 -10299 -6183 -4401 10584 26090
14727 26090 37621 36439 21528 9677 20282 28433 19609 7164 4022 -3164 -16803 -14376 -10671
14714 -10671 -6628 -11781 -7449 -6814 -3634 129 4249 9797 11555 15455 5718 6369 3898 2690 2258
14699 2258 11424 23534 21571 14957 6626 -1493 2549 12292 1276 4839 14852 22499 25453 22797
14685 22797 8251 14733 14838 35181 51080 49692 49474 37463 32497 33667 33807 33371 24155 30265
14671 30265 28708 29019 34887 26751 25301 21329 25941 32596 34837 27276 41236 44922 44279 37018 32544
14656 32544 41481 49285 48339 60907 64729 59967 66421 60595 75579 88564 95173 85994 78004 83701
14642 83701 90046 88068 89917 75887 76112 91185 121191 141500 167074 195215 234301 292413 382234
14629C82234J23683J55929K09950K66380K57162K05133R9242j3764j04619k08673
14619A372657k55663k57318k20819j62483j04497o5220m5344l9060k7443k1204
14609A73606j9451n698r359Q17p982o596o776j1473o360J1692J0718j8125p126
14596I7887j387q223j3191q419m76M166J322j1447j0509M158J392M021O505p233
14582E8566q049l00o67K632L748k737K24L142O164M293O215k533k841l973m654
14567E9230K698j241j7175j0405O249J4102j440j503k493j5114j0930O50J553
14554B4181R867M527K288m37L586j0806q033n77L397P710M397q126J1081j3979
14540B9076p73o57j353j090k7337q065J6044J373P364j050J7929j606r133N397
$$ plain form
14629 382234 505917 661846 871796 1138176 1395338 1600471 1699713 1685949 1581330 1372657
14619 1372657 1116994 859676 638857 476374 371877 306657 261313 222253 194810 173606
14609 173606 154155 148457 139098 139915 131933 125337 118561 107088 100728 112420 123138 105013 97887
14596 97887 96500 88277 75086 66667 66191 70357 71679 60232 49723 53881 55273 59294 65799 58566
14582 58566 50517 50217 49550 52182 55930 53193 53417 56559 62723 67016 73231 70698 67857 63884 59230
14567 59230 61928 60687 43512 33107 39356 53458 52018 50515 48022 32908 21978 22628 24181
14554 24181 34048 38575 40863 40426 44012 33206 25173 24596 27993 35703 40100 31974 43055 29076
14540 29076 28303 27646 26293 25203 -2134 -10199 5845 7218 14582 13532 31461 29855 20722 26119
14526B6119J061O332O271J6975N78m127J0356K831O782P101j3k637N208M253m10
14511H6680R823J1310j8754j2338J4094q785o454O503j3836j493J1015j0246r455
14498E8064k336q860M413J4996l126r72m932o831o107n73M877L994q427j0184
14484C3996k697N248k943n799O338L991K298q265j0710q83P351J9263K3N859l755
14469D9315j3391j5226o861j0367R248M252j2652n408J1583n305k3082L152J1994
14456b748j865q005j3137m479n468K035m904P598J1177N06Q300J7365J0592L633
14442B0600J5381J3578j5128k930J2614O033j751o361J0929l573J0003P831l907
14429F3319k457k718K849j873M310j2053L879N396N812m073L7Q680N444J4393
$$ plain form
14526 26119 27180 33512 39783 56758 57336 53209 63565 66396 73178 80279 80266 77629 82837 87090 86680
14511 86680 96503 107813 89059 76721 90815 82030 75576 82079 68243 66750 77765 67519 58064
14498 58064 55728 46868 51281 66277 63151 62179 57247 50416 44309 43736 48613 52607 44180 33996
14484 33996 31299 36547 33604 27805 34143 38134 40432 32167 21457 20574 27925 47188 47211 53070 49315
14469 49315 35924 20698 13837 3470 12718 16970 4318 -1090 10493 5188 -17894 -14742 -2748
14456 -2748 -4613 -12618 -25755 -30234 -35702 -33667 -38571 -30973 -19796 -19290 -10990 6375 16967 20600
14442 20600 35981 49559 34431 31501 44115 50148 48397 42036 52965 49392 59395 67226 63319
14429 63319 60862 58144 60993 59120 63430 51377 55256 60652 66464 62391 62428 71108 76552 90945
14415I0945P896J4175q912r854O913o61p27K657J2721J1039J4722K7274M5399
14402B13587N7854N3659M6893N4995L2417K4081j1530l8455m5409n3402n9968
14391B74722n9165l7532j9593k3313j5877r121j58L46r760J264K184j957K171
14378A04211N954o184m425J088J061N088L539M964k983j1871P715Q854j1224j4078
14364I1709l668p834j721j1505K412K90j1294R426Q358m751P424L041o787j7264
14350E7836J3373K4916M21L9L848j2791j750n483Q792j0960j0402r107j2201k9966
14336A6565j7914k4001l0606l3434m0136j5085O039K1769L5573L2858K6899L8430
14324A6957M3515K5397Q306J4154J3747M302P88K5267J7655P95K133J047o681
$$ plain form
14415 90945 98841 113016 104104 94250 101163 100502 99775 102432 115153 126192 140914 168188 213587
14402 213587 271441 325100 371993 426988 459405 483486 471956 433501 388092 334690 274722
14391 274722 215557 178025 158432 135119 119242 110121 109963 110309 100549 101813 103997 102040 104211
14378 104211 110165 103981 99556 100644 101705 106793 110332 115296 112313 100442 108157 117011 105787 91709
14364 91709 88041 80207 78486 66981 69393 69683 58389 67815 76173 71422 78846 81887 75100 57836
14350 57836 71209 96125 96546 96585 100433 87642 85892 80409 89201 78241 67839 58732 46531 16565
14336 16565 -1349 -25350 -55956 -89390 -129526 -144611 -138572 -116803 -81230 -48372 -21473 16957
14324 16957 60472 85869 94175 108329 122076 126378 127166 152433 170088 170883 173016 174063 167382
14311A67382J4981N784P895J1283L730K385L210q55q343j5936o459N766l172j5149
14297A72502j4344k618J5415O930N162R436L866Q072N520M582M231J827K369q305
14283B14645j3888M228J0675K4614J6459N478m058J6870K5564L1031J9309K0794
14271C71721M4207N2390J1021J7467J4218j9896k2253j5721k3319j2571K3065
14260D40329J1304n253o602j1723j2980O000O349N044O922j2555M485J9169P161
14247D57650P773k805j3903j0924N729J3369K869M052J2522Q104J983k379n206
14234D78834K9862K9072L746j2843J29M967J1522p414Q891M681J4497p28m072
14221E61144J3747J2205J6560J5848J4940J0584J1098J3766L9227M3257L4511
$$ plain form
14311 167382 182363 188147 196042 207325 211055 213440 216650 215795 207452 191516 185057 190823 187651 172502
14297 172502 158158 155540 170955 177885 183047 192483 196349 204421 209941 214523 218754 220581 222950 214645
14283 214645 200757 204985 215660 240274 256733 262211 258153 275023 300587 331618 350927 371721
14271 371721 415928 468318 479339 496806 511024 491128 468875 453154 429835 417264 440329
14260 440329 451633 446380 439778 428055 415075 421075 427424 432468 439390 426835 431320 450489 457650
14247 457650 465423 462618 448715 437791 443520 456889 459758 463810 476332 484436 486419 484040 478834
14234 478834 508696 537768 541514 528671 528800 533767 545289 537875 546766 551447 565944 565216 561144
14221 561144 574891 587096 603656 619504 634444 645028 656126 669892 709119 752376 786887
14210G86887L6938K4415R333K2374M216l97J6274K4166K5932K6496L6195M2191
14198A055020N3175L9206L4718N4761N1968O9509P8483P6312N8326O5000R4445
14187A730923R9398J07060J19203J05613J19074J33032J17709J25502J29968J46149
14177B933631J61594J60826J83866K23229K59194K99615L66359M15668M70867
14168E474849N71115O61202P72280R09666J048977J177371J294717J444231J575445
14159A4929853J744063J982905K291744K737819L420937M599034O615837R906108
14151D8228300J4898946K1772946L0385576L9903172M7995002N0537325M4323447
14144B98044714K8711989N019418j9555824m0056801n1966118n2471558m4913612
$$ plain form
14210 786887 823825 848240 857573 879947 884163 883766 900040 924206 950138 976634 1012829 1055020
14198 1055020 1108195 1147401 1182119 1236880 1288848 1358357 1436840 1513152 1571478 1636478 1730923
14187 1730923 1830321 1937381 2056584 2162197 2281271 2414303 2532012 2657514 2787482 2933631
14177 2933631 3095225 3256051 3439917 3663146 3922340 4221955 4588314 5003982 5474849
14168 5474849 6045964 6707166 7479446 8389112 9438089 10615460 11910177 13354408 14929853
14159 14929853 16673916 18656821 20948565 23686384 27107321 31706355 38322192 48228300
14151 48228300 63127246 84900192 115285768 155188940 203183942 253721267 298044714
14144 298044714 326756703 331776121 312220297 272163496 220197378 167725820 122812208
14137A22812208l3239182k2267346j4377567r341672o288352m493453l465109
14130B9339527k889514k550528k325843k107732j890507j692950j521325j344967
14122A3016161j186206r95492q24819o80697n60798m83430m09411l73736l56015
14113G145557l42868l29106l15326k99940k93423k72129k20764k05236j92721
14104D674044j82877j74154j57961j43702j47519j52136j35936j13407j15763
14095C350589j18945j32037j08253q3456p2057q3435p9804p4174q3414r4904q1730
14084B338380p9953q7460j01001j12658j01257q3102n6980o1887m8881l8435k2690
14073A544076l4564l5249l3113l4460l4034l2092l6221m7759l6791n1169n2247
$$ plain form
14137 122812208 89573026 67305680 52928113 43586441 37298089 32804636 29339527
14130 29339527 26450013 23899485 21573642 19465910 17575403 15882453 14361128 13016161
14122 13016161 11829955 10834463 10009644 9328947 8768149 8284719 7875308 7501572 7145557
14113 7145557 6802689 6473583 6158257 5858317 5564894 5292765 5072001 4866765 4674044
14104 4674044 4491167 4317013 4159052 4015350 3867831 3715695 3579759 3466352 3350589
14095 3350589 3231644 3099607 2991354 2907898 2835841 2752406 2672602 2598428 2515014 2420110 2338380
14084 2338380 2258427 2170967 2069966 1957308 1856051 1772949 1715969 1654082 1605201 1566766 1544076
14073 1544076 1509512 1474263 1441150 1406690 1372656 1340564 1304343 1256584 1219793 1168624 1116377
14062A116377l5582m8390l5196k9617k6490k2385k5975k1916k2932j9108k8913
14051G99873k6915k3583j9789j4464k3859o777k4233k6599o887p568k6325k5446
14039E67428k6265j3540j20L462K1844M417m443q177r609J4474m111k9461q131
14026E07768J0761K9297R458K06K3282M3546L8226L9425L8676J9364k5804k4496
14014G09709k1456n0031o8835o5365n1146l6280l5872k6383j4391M884j0151j4725
14002C19958j5446r007r337j4184n242k699j0346q67m676J206j044j942p847p197
13988B31330j7720k3942j0537L105j0495o958j3246O153J5493j2406n809J1271
13976A66239n079n471q343m904j630p754M494J691Q806J100R437J694K065J8701
$$ plain form
14062 1116377 1080795 1032405 997209 967592 941102 918717 892742 870826 847894 828786 799873
14051 799873 772958 749375 729586 715122 691263 684486 660253 633654 626767 619199 592874 567428
14039 567428 541163 527623 527503 530965 552809 557226 552783 544606 534997 549471 545360 515899 507768
14026 507768 518529 547826 557284 557490 580772 624318 662544 701969 740645 760009 734205 709709
14014 709709 688253 638222 569387 504022 452876 416596 380724 354341 339950 344834 334683 319958
14002 319958 304512 295505 286168 271984 266742 264043 253697 252830 248154 249360 248316 246374 238527 231330
13988 231330 213610 189668 179131 182236 171741 164783 151537 157690 173183 160777 154968 166239
13976 166239 161160 155689 147346 142442 140812 133058 137552 139243 148049 149149 158586 160280 162345 181046
13962A81046K4939L5494L9357L0875K4733J5814R832p218k9630l8449m1642l7986
13950B07165k3483k4414j4971k093j1038j4836j3081n993j580L21P869j4791J663
13937I0738L344K471l607j2374P680J6950J951r051Q742M654j0028r823j1650
13924G9997J558R66p331o121k361k4997r290R740M602R343J3474k872j1710p942
13910D7056m507r558j0962Q513K701o569J2070J2960O630o416r706q29j317O38
13896D0704l908O076J0630N514N260n381k726M362m986q811M238J194o842O176
13882E1500O905n526M734q058q79P564j1712j5318J3977l206j2280K462O862q640
13868B8385k183J3180j497j1457R618Q888J436R624l663q228K636L709L289P566
$$ plain form
13962 181046 205985 241479 280836 311711 336444 352258 362090 354872 325242 286793 245151 207165
13950 207165 183682 159268 144297 142204 131166 116330 103249 97256 95676 95997 103866 89075 90738
13937 90738 94082 96553 92946 80572 88252 105202 107153 98102 106844 111498 101470 91647 79997
13924 79997 81555 82521 75190 69069 66708 41711 32421 42161 46763 56106 69580 66708 54998 47056
13910 47056 42549 32991 22029 30542 33243 26674 38744 51704 58334 51918 42212 41383 40066 40704
13896 40704 36796 42872 53502 59016 64276 58895 56169 60531 55545 46734 50972 52166 45324 51500
13882 51500 58405 52879 57613 49555 48676 56240 44528 29210 43187 39981 27701 30163 37025 28385
13868 28385 26202 39382 37885 26428 36046 44934 46370 55994 52331 44103 46739 50448 53737 61303
13854F1303L677K029R326j0983q823j3816r458n865r71K723J104J6903J5310J5108
13840G7567J3357R631J7506L012q030N984P133o499j8032j9210j5878m878o599
13827E5064n690J7886L696n059j2127M086j1922N66k298j4264j4853j5865k776
13814c556K2929l48p626J244O158Q340q624M24r09J3652j755j0637J752O504O011
13799C3559k803J4111q551j4083j833O295n651M742p50k2464M411J1804K374q048
13785A3113o698j001J0895m87Q77j9188n791N109O608l087q587p312o645L798
13771a8396M356O285Q768J9211j725O808m595o033L746L925m955n341P4q715r004
13756e591R385L015j8130L146K2284K753J7055n86J409j0397J243o09j0555l856
$$ plain form
13854 61303 64980 67009 76335 65352 56529 42713 33255 27390 26419 29142 30246 47149 62459 77567
13840 77567 90924 100555 118061 121073 113043 119027 126160 119661 101629 82419 66541 61663 55064
13827 55064 49374 67260 70956 65897 53770 57856 45934 46500 44202 29938 15085 -780 -3556
13814 -3556 19373 19025 11399 12643 18801 27141 18517 18941 18032 31684 29929 19292 21044 27548 33559
13799 33559 30756 44867 36316 22233 20400 26695 21044 25786 25036 2572 6983 18787 21161 13113
13785 13113 6415 5414 16309 15822 16699 -2489 -8280 -3171 3437 350 -8237 -15549 -22194 -18396
13771 -18396 -14040 -7755 1013 20224 18499 25307 20712 14679 18425 22350 17395 12054 12128 3413 -5591
13756 -5591 3794 6809 -11321 -8175 14109 16862 33917 33331 34740 24343 25586 24977 14422 10566
13742A0566o188o82O596Q770J0823n849n268J068O087R344R893k770j903j974
13728C8513j5263l56l653n218n83K958O602J5934J0555l283j0240O402r215j9808
13714A3345j0400M776N158m592P59L399J1622n285N443P560J721P57L218m523
13700C2958O74J1574k086j1718m105J561o84R169j0354q443N506J0435N629k425
13686C7691o572j32J4548J8471M460R953J2479k965k181N455O463O517N559J6382
13672A26128J3564K2135N945K111K2859M5473N9811O5373Q7182J19858J76454
13661G46893K22089K46015K48804J81534Q1079m7757j55032k28660k62408k42102
13651G90455j87452j42436j11470n6571l8575l3440l1447j9136j2658j8036q756
$$ plain form
13742 10566 4378 3696 10292 19062 29885 24036 18768 19836 25923 35267 45160 42390 40487 38513
13728 38513 23250 22894 19241 14023 13440 16398 23000 38934 49489 46206 35966 42368 33153 13345
13714 13345 2945 7721 12879 8287 9046 12445 24067 18782 24225 31785 33506 34263 37481 32958
13700 32958 33632 45206 43120 31402 27297 28858 28174 37343 26989 18546 24052 34487 40116 37691
13686 37691 31119 30987 45535 64006 68466 78419 90898 87933 85752 91207 97670 104187 109746 126128
13672 126128 139692 161827 167772 169883 192742 238215 298026 363399 450581 570439 746893
13661 746893 968982 1214997 1463801 1645335 1726414 1678657 1523625 1294965 1032557 790455
13651 790455 603003 460567 349097 292526 253951 220511 189064 169928 157270 139234 130478
13640A30478j0243j2613m591j4905k3681j0081j4179k45J65q983k20J5260M791
13627E0953r696l18P983j1889R473P792k781j3025M12m975j4688m084J609J0046
13613B6812K63M431m895L686J5298j5298p687J1856L125j4667o462R678l835M010
13599B6315Q152O874k965N986J387q18l125r353k0176l389K293k457p085M34J4961
13584A7034L53o453k847Q02J1038M588p103r01J151j093M386J9314p005r538R384
13569C3110L926J899p199j011L524N296J4914j407p71j232p732p42j1399l45Q614
13554C9445K280M65l347M250k71o033q850K9M698l140l739K600J1147P594j7009
13539C0119o711N516L637J015k0993R556J2842J177O454n987l913P183k626n673
$$ plain form
13640 130478 120235 107622 103031 88126 64445 54364 40185 39940 40105 31122 30902 46162 50953
13627 50953 41257 40939 48922 37033 46506 54298 51517 38492 38904 33929 19241 15157 16766 26812
13613 26812 27075 31506 26611 30297 45595 30297 22610 34466 37591 22924 16462 26140 22305 26315
13599 26315 34467 41341 38376 44362 45749 44931 41806 32453 12277 8888 11181 8724 1639 2073 17034
13584 17034 17387 10934 8087 8889 19927 24515 17412 16511 17662 16569 20955 40269 33264 23726 33110
13569 33110 37036 38935 31736 30725 34249 39545 54459 53052 52281 51049 43317 42575 31176 30831 39445
13554 39445 41725 42190 38843 43093 42822 36789 27939 27968 32666 29526 25787 28387 39534 47128 30119
13539 30119 23408 28924 32561 33576 12583 22139 34981 36158 42612 36625 32712 39895 37269 31596
13525C1596j0697k297J736J589Q213L531l413j3644K0354K1058l473N991R04j3300
13511D8148j3143P57L391M876o604k335L450m860M151m60O295J3786n179q525
13497D3748k223m361j0954J634J1016k401j527J668p119R34O02P113k101J308
13483C7337J3603j0097j145R764m549J4035n965j5074j4882M929K2494R909m545
13470E5814r723r820r597R559J3426P563j1994q069n03m67j978j0593R354P439
13456D0411J4505M064j0540l99l267l715r133q074k707n268O246J9444M329q733
13442C7163j2406o693o806L764R262j0942N930K237l244j275R745J0199J1729
13429D8663j0051j8791o884J0671R366J5934J291j760M52j1522j50L905M775L61
$$ plain form
13525 31596 20899 18602 20338 21927 30140 33671 30258 16614 36968 58026 54553 60544 61448 48148
13511 48148 35005 35762 39153 44029 37425 35090 38540 33680 37831 37371 43666 57452 52273 43748
13497 43748 41525 37164 26210 27844 38860 36459 34932 36600 29481 30415 31017 38130 36029 37337
13483 37337 50940 40843 39698 49462 44913 58948 52983 37909 23027 27956 50450 60359 55814
13470 55814 46091 36271 26674 36233 49659 57222 45228 37159 36656 36189 34211 23618 32972 40411
13456 40411 54916 58980 48440 48041 44774 41059 31926 23852 21145 15877 22123 41567 45896 37163
13442 37163 24757 18064 11258 15022 24284 13342 19272 21509 18265 16990 26735 36934 48663
13429 48663 38612 19821 12937 23608 32974 48908 50199 48439 48891 37369 37219 41124 45899 46260
13415D6260k614o97j179O145j1410J327O901J5985K266Q580P863o166j0568M375
13401F7068N168j173j3770J8994P482q190j0225j8028l961j694R893J5506n228
13388F1842j227O242p05j834k877J749o853l206L477O645P943m599o353q121p584
13373D4539O720k925N718l799n682J0960M036P398O704o599P072n33O425k437
13359G7597K849j1118j019n040k498R9N089J4964k982j2878j6597j5864l626J6501
13345D5477R315j674J01N730k589o291o03l035R794k373r099j607l5K46Q234r942
13329D1649k0109P06J2120O820l726n862j195j9883R831R823J1262J3806p247
13316D7995O76J263j1339L246J4100M627j3787J4379J6963n522j045O92o744j1464
$$ plain form
13415 46260 43646 42949 41770 47915 36505 37832 44733 60718 62984 71564 79427 73261 62693 67068
13401 67068 72236 71063 57293 76287 83769 75579 65354 47326 43365 41671 51564 67070 61842
13388 61842 60615 66857 66152 64318 61441 63190 56337 53131 56608 63253 71196 66597 60244 52123 44539
13373 44539 51259 48334 54052 50253 44571 55531 59567 66965 73669 67070 74142 73609 80034 77597
13359 77597 80446 69328 68309 63269 60771 60870 65959 80923 77941 65063 48466 32602 28976 45477
13345 45477 54792 53118 53219 58949 56360 50069 49466 46431 56225 53852 44753 43146 43111 43357 51591 41649
13329 41649 21540 22246 34366 41186 37460 31598 30403 10520 20351 30174 41436 55242 47995
13316 47995 48671 49934 38595 41841 55941 60568 46781 61160 78123 72601 71556 72248 65504 54040
13302E4040O2L644o94P150r964q11M523M775r75o89R7j3984K036P413J413r910
13286D8126N274J0187m432Q366Q702m290M29J3209j666j423o331J864O241J225
13272H5481j4742O548J4701n749j5311R57J2807J5471j2904R7l878k69K532O734
13258I2475O572J2118n267j693M565l180J1460J2848O954J2799L1628L7293L4258
13245B52830M0379M7928P0615R6501R5329J21384R5312L9323k9880q4747j02660
13234F42314r6712q0307n7145k5107k4023r784J166J0572K7025L7124K5117J4481
13222D64721L0259M4589L1945J8489N00p89M873J8220L9462O3968O6903L9075
13210H22215M1512K3001j6992n3660o1159m6857n7627l2221k4151k4090k1174
$$ plain form
13302 54040 54102 57746 57052 64202 54238 53427 57950 62725 61750 61061 61158 47174 49210 56623 58036 48126
13286 48126 53400 63587 59155 67521 76223 71933 72362 85571 83905 82482 76151 78015 84256 85481
13272 85481 70739 77287 91988 86239 70928 71885 84692 100163 87259 87356 83478 83209 85741 92475
13258 92475 99047 111165 105898 104205 108770 105590 117050 129898 136852 149651 181279 218572 252830
13245 252830 293209 341137 411752 508253 603582 724966 820278 859601 829721 744974 642314
13234 642314 545602 465295 408150 383043 359020 349236 350402 360974 387999 425123 450240 464721
13222 464721 494980 539569 571514 590003 590503 589714 594587 612807 652269 716237 783140 822215
13210 822215 863727 886728 869736 816076 754917 708060 650433 618212 594061 569971 548797
13199E48797Q277J2713j677q976j2803j3659k5041k8835k4491j1543j72M244K3249
13186D70083L6542N0314O6823Q3363Q2194O9760L5082k9670q4696j12114q2499
13175E85182q0005q3417o9809l4573m4741l7743j0039j3062l132l586p217q887
13163A88971j2923j1401j1738J2962Q552j7252k621m278n322j716o192Q851l568
13150A42325M20j0318j8769L348L702J1635j737j531M946l99j6061k054O602o36
13136A21473J171m443j80L224j1405J3075J3172J0274O641j016j8698k6952Q773
13123A15109J3114J3855q233j4547j2627L854J124p750J401K996j1100j057Q751
13110A04890P36p130J7364l270l004k144P062p446J525m511J7372r866j1412j5810
$$ plain form
13199 548797 557074 569787 568110 559134 546331 532672 507631 478796 454305 442762 442590 446834 470083
13186 470083 506625 556939 623762 707125 789319 859079 894161 864491 779795 667681 585182
13175 585182 505177 421760 351951 317378 272637 234894 224855 211793 208661 205075 197858 188971
13163 188971 176048 164647 152909 165871 174423 157171 154550 150272 144950 143234 137042 145893 142325
13150 142325 142745 132427 113658 117006 120708 132343 130606 129075 134021 133622 117561 115507 122109 121473
13136 121473 122644 118201 118021 121245 109840 122915 136087 146361 153002 151986 133288 106336 115109
13123 115109 128223 142078 133845 119298 106671 110525 111649 103899 105300 108296 97196 96139 104890
13110 104890 105626 98496 115860 112590 109586 107442 114504 107058 108583 104072 121444 111578 100166 84356
13096H4356j8361o075K1040J0892j3860Q582N647O153M665J1703J135j1530L111
13083A07458p67j5409J5308P2k6091j4639P618J2579O065J82L083J2464L728J782
13069A13433L026j027o038P788J853k342L132q337J660N640M801m15j388n480
13055A16306n611J5446k745j4323n454K3576K9397K0808J605J3237L2329K5399
13043B49970J2940J5309J2411Q649M053k6424m1440m0673k0364l432R232J6625
13031A96856P949O138J3712L46J1681K6467J1239J1760M190m563l550L333J2597
13018B98155O864J3491K2890J6911Q612P526Q14p163r409j1241j4571o685k5833
13005C00361k5939p568P978J4562l0o369l492o39J0257k210j5398r477n838k548
$$ plain form
13096 84356 65995 59920 80960 91852 77992 86574 92221 98374 103039 114742 115877 104347 107458
13083 107458 106691 91282 106590 106662 80571 65932 73550 86129 92194 92376 95459 107923 111651 113433
13069 113433 116459 115432 109394 117182 119035 116693 119825 111488 113148 118788 123589 123174 121786 116306
13055 116306 110695 126141 123396 109073 103619 127195 156592 177400 179005 192242 224571 249970
13043 249970 262910 278219 290630 299279 303332 276908 235468 194795 174431 170999 180231 196856
13031 196856 204805 210943 224655 225001 236682 263149 274388 286148 290338 285775 282225 285558 298155
13018 298155 305019 318510 341400 358311 366923 374449 375263 368100 358691 347450 332879 326194 300361
13005 300361 274422 266854 274832 289394 289364 282995 279503 278864 289121 286911 271513 262036 256198 253650
12991B53650J2897J2050J1990J1087J900K8507K6339J8635N583j4641j1102m6791
12979C10104l8829l2977m4177l5964k4275k0386j040P537K3959J0251l627K161
12967A52737L002R608J6163J2016P598k814m159n177J2334p433r765N200q395
12954A80915m159J0019Q145r749j2815j5176j1789J9054J3038j193m721N231J6312
12941A93112J8013J2679P477J7560J7805N702q414N027J4904K050j411J7221P038
12928C08763J8740K0902p223J069J0378N563p055j1973j1550K749L332J6125J4734
12915C64554J9662M6971O0797N3177M0896M1305M5981M7062N0424M0377K7372
12904H38578p059k7590l0564m0480l5745j6611o27n695l473q507K510M046L794
$$ plain form
12991 253650 266547 278597 290587 301674 303574 332081 358420 377055 382638 367997 356895 310104
12979 310104 271275 238298 194121 158157 133882 113496 112456 119993 143952 154203 150576 152737
12967 152737 155739 165347 181510 193526 201124 198310 194151 188974 201308 193875 184110 189310 180915
12954 180915 176756 186775 194920 185171 172356 157180 145391 164445 177483 176290 171569 176800 193112
12941 193112 211125 223804 231281 248841 266646 272348 263934 268961 283865 285915 284504 301725 308763
12928 308763 327503 348405 341182 342251 352629 358192 351137 339164 327614 330363 333695 349820 364554
12915 364554 384216 431187 491984 545161 586057 627362 673343 720405 770829 811206 838578
12904 838578 831519 803929 773365 732885 697140 680529 679902 674207 670734 662227 664737 668783 672577
12891F72577R746J6743J2567P04k626M410J0485J7265M465O351J383N064J5643
12878G74777J6417L936R445M672J0881J4461J2295Q880R364K3063J2231J1067
12866I11489J6273J0317P899O994J7869J4442J5528K8834L1604L6893K4021K0338
12854A142501L3085L3371K3307J5407r685p355O820J376J9952K5785L3662K5319
12842A343545K7667L7181M1724N0480N5489O0231N8400N5373N2146N0790N0694
12831A883720O4617P8934P9089J02061R8437Q2035Q5450R6909R9884J19204J18661
12820B909001J26548J44373J56907J82466J95478K21724K40527K63238L08985
12811D749247L44933M09288M70815N47820O15546P04722P89230Q90035J005573
$$ plain form
12891 672577 682323 699066 711633 712337 709711 714121 724606 741871 746336 752687 754070 759134 774777
12878 774777 791194 795130 804575 809247 820128 834589 846884 855764 865128 888191 900422 911489
12866 911489 927762 938079 945978 952972 970841 985283 1000811 1029645 1061249 1098142 1122163 1142501
12854 1142501 1175586 1208957 1232264 1247671 1237986 1230631 1237451 1238827 1258779 1284564 1318226 1343545
12842 1343545 1371212 1408393 1450117 1500597 1556086 1616317 1674717 1730090 1782236 1833026 1883720
12831 1883720 1948337 2027271 2106360 2208421 2306858 2388893 2474343 2571252 2671136 2790340 2909001
12820 2909001 3035549 3179922 3336829 3519295 3714773 3936497 4177024 4440262 4749247
12811 4749247 5094180 5503468 5974283 6522103 7137649 7842371 8631601 9521636 10527209
12802A0527209J136097J314443J578728J992850K593838L460689M661508O377597
12794C3642959Q643960J1426278J4528331J7450755J9471672J9755404J7036316
12787A41955675R462778l004026j4378680j9275098j8800960j5797854j1887948
12780F8273887p960610m414613j368383J200818L364863N129034O418754P054383
12772G7698133O772932N688399M061790K368367J384920J504696K386292L824148
12764A05689677N716997P909743R828600J0575807R498252O486495J592991m415933
12756A52882629r354602j1495630j1156173r505772p187199m601563k327970p89958
12748I6463762O295J96903k42571j386540l255389n211441o464838o694913n799708
$$ plain form
12802 10527209 11663306 12977749 14556477 16549327 19143165 22603854 27265362 33642959
12794 33642959 42286919 53713197 68241528 85692283 105163955 124919359 141955675
12787 141955675 151418453 148414427 134035747 114760649 95959689 80161835 68273887
12780 68273887 60313277 55898664 54530281 55731099 59095962 64224996 70643750 77698133
12772 77698133 84471065 90159464 94221254 96589621 97974541 99479237 101865529 105689677
12764 105689677 111406674 119316417 129145017 139720824 149219076 155705571 157298562 152882629
12756 152882629 143528027 132032397 120876224 111370452 104183253 99581690 97253720 96463762
12748 96463762 96470057 96666960 96424389 95037849 91782460 86571019 80106181 73411268 67611560
12739F7611560l895338j360306J565620M921756Q706290J2670291J6200562J8401695
12731A24822130J8259753J4906429P409966m228821j6495070k3188744k3150588
12724I8335055j9763117j5616401j1972901r083522o812601n049123l782217k906817
12716B3348356k287229j863589j575325j360915j241470j171037j054114r44655
12708A1850022q24581p19405o14825n42846m64309m01742l75878l63522l28863
12699G214051l11873l06967k84313k84658k64465k46368k29799k08248j81781
12690D895579j71050j62615j50764j58241j56394j49774j25327j16905j22046
12681C582463j36082j15335r5619r2068r2493r5703p9971p5164q3238p4964q0404
$$ plain form
12739 67611560 63716222 62355916 63921536 68843292 77549582 90219873 106420435 124822130
12731 124822130 143081883 157988312 165398278 161169457 144674387 121485643 98335055
12724 98335055 78571938 62955537 50982636 41899114 35086513 30037390 26255173 23348356
12716 23348356 21061127 19197538 17622213 16261298 15019828 13848791 12794677 11850022
12708 11850022 11025441 10306036 9691211 9148365 8684056 8282314 7906436 7542914 7214051
12699 7214051 6902178 6595211 6310898 6026240 5761775 5515407 5285608 5077360 4895579
12690 4895579 4724529 4561914 4411150 4252909 4096515 3946741 3821414 3704509 3582463
12681 3582463 3446381 3331046 3235427 3143359 3050866 2955163 2875192 2800028 2716790 2641826 2561422
12670B561422p5485r2674p1007p0339o9268o9556m7782k7311k5214l3256m2541
12659A936989n0686n7438n0112m4417m8142n9892l7983m5238l3835l6442l8279
12648A434525j8846k1796k9238l1380m5080l7125l5485j5374j6480l0784k2464
12637A130473o429J0231K159r087j6492k3816j9613k4863k7886j5720j4823j7285
12625I66849l1882j6933K853J0336R528P002J5246K3259J2747L2837L1054M4957
12613A107853M7437L7051J6264j9921n6459o3337n8564n0404l2086l2002j7842
12602H77990j9836l6656k6079l5521m4436m1878n0380m0685l1106k7369k0368
12591E03676k1257k3259j7858j4085P330O19J30Q857N327j9072r429j8178j1402
$$ plain form
12670 2561422 2485937 2393263 2322256 2251917 2182649 2113093 2065311 2038000 2012786 1979530 1936989
12659 1936989 1886303 1828865 1778753 1734336 1686194 1626302 1588319 1543081 1509246 1472804 1434525
12648 1434525 1415679 1393883 1364645 1333265 1288185 1251060 1215575 1200201 1183721 1152937 1130473
12637 1130473 1124044 1134275 1136434 1127347 1110855 1087039 1067426 1042563 1014677 998957 984134 966849
12625 966849 934967 918034 920887 931223 940751 947753 962999 986258 999005 1031842 1062896 1107853
12613 1107853 1155290 1192341 1208605 1188684 1132225 1068888 1010324 959920 927834 895832 877990
12602 877990 858154 821498 795419 759898 715462 673584 623204 582519 551413 524044 503676
12591 503676 482419 459160 441302 427217 434547 435166 435296 444153 449480 430408 420979 402801 391399
12578C91399k549K725J8491J1776M993l137p147j2461j9998k1138o294j7563k1643
12565C17454k841j8443o687k222n713j3000p309O934J1887l897l566j195n999
12552B65403n366m17k249j1588J3717J1101N134K475M720J9127J2690m410k3173
12539B87164j3269j9919j0985k2837k813j0905j8863j8513m017n658n339r093
12527A44953j072r464k195M195K811Q44k550j3835N033R503l20n680L185j0065
12513A25343j4486O164J1448Q698q68J16j2861j1992p594M006J6546k066n566
12500A16888N937q570k0697l230j044O866j536k319K346j022J399J4500j925R431
12486A17024N437j306N474N102r012p546J1972K434R950j048P335J6672J0787
$$ plain form
12578 391399 388850 391575 410066 421842 426835 423698 416551 404090 384092 362954 356660 339097 317454
12565 317454 314613 296170 289483 287261 281548 268548 261239 268173 280060 276163 272597 271402 265403
12552 265403 260037 259620 257371 245783 259500 270601 275735 278210 282930 302057 314747 310337 287164
12539 287164 273895 253976 242991 220154 217341 206436 187573 169060 165043 159385 154046 144953
12527 144953 143881 134417 132222 136417 139228 140072 137522 123687 128720 138223 137903 132223 135408 125343
12513 125343 110857 117021 128469 137167 136299 136415 123554 111562 103968 107974 124520 122454 116888
12500 116888 122825 114255 93558 90328 89284 96150 94614 92295 94641 93619 95018 109518 107593 117024
12486 117024 122461 121155 126629 131731 122719 115173 127145 129579 139529 138481 145816 162488 173275
12473A73275k7984l2407m506J6279q394r739n977R504J193j443n024j1298J670
12460I5149n363r02N003r492r62O808N837J4135k387m512j0348N636q952j1792
12446G7858j13N450M391J462J0416j7178j7324o898L993J3418J2753n335L818
12433H6711j0457r689J4245R451j6450k0935J2494M972K783N967l273k145O909
12420H0583m010L150K088r556q028j5177J441J92n492j285J953j3927q57J5100
12406D6175J8163L486k017j0774O443r523p311o836J4596J255J823Q42r64n467
12392D9891l063l721m451N250K13J43k234j8511m673K273K568K444M393m934L178
12377B8766O983j3678r432M88K203J957L16P816J0880L008m141R268J1863q921
$$ plain form
12473 173275 145291 112884 108378 124657 116263 106524 100547 110051 111244 109801 104777 93479 95149
12460 95149 89786 88884 93887 84395 83433 90241 96078 110213 107826 103314 92966 98602 89650 77858
12446 77858 77745 83195 87586 89048 99464 82286 64962 58064 62057 75475 88228 82893 86711
12433 86711 76254 66565 80810 90261 73811 52876 65370 70342 73125 79092 75819 73674 80583
12420 80583 76573 79723 81811 72255 64227 49050 50491 50683 45191 43906 45859 31932 31075 46175
12406 46175 64338 67824 65807 55033 61476 51953 44642 37806 52402 53657 55480 56322 55358 49891
12392 49891 46828 43107 38656 43906 44119 44262 42028 23517 18844 21117 23685 26129 30522 25588 28766
12377 28766 35749 22071 12639 13127 15330 17287 17603 25419 36299 39307 35166 44434 56297 47376
12363D7376j9847l86K124N891j0755q33K0605J3975O532K056o030Q301J1787J0445
12349I1241n090L529J0013N957n291k317N952J7275K1205Q226O452J7916L1376
12336B06444M5762L9039O1613R7766J02570R5082P8341L7150j9583o0130p0914
12325F13140q3267o6490m5161m0949k6814j0287J1757J3103J0922K3588K5374
12314D24916K9251K9406K6487J8237J3121J0184J0887J9864K7993N3433O6941
12303G30720N5421L4889K9690R698l9296q6990p0424m2483l3056k9528j4024P4
12291E44691K12l776J2460L310k2942j8086j5409j1114q663l5356k1743K050M442
12278D30076Q008K8936O3999P5296Q3372P5292Q0754M3632k1445p6829j07244
$$ plain form
12363 47376 27529 27143 29267 35158 24403 23570 44175 58150 64682 66738 60708 69009 80796 91241
12349 91241 86151 89680 99693 105650 100359 98042 103994 121269 142474 150700 157152 175068 206444
12336 206444 252206 291245 352858 450624 553194 648276 726617 763767 744184 684054 613140
12325 613140 529873 463383 418222 377273 350459 340172 351929 365032 375954 399542 424916
12314 424916 454167 483573 510060 528297 541418 551602 562489 582353 610346 663779 730720
12303 730720 786141 821030 850720 860418 821122 734132 663708 621225 588169 558641 544617 544691
12291 544691 544903 541127 553587 556897 533955 515869 500460 489346 480683 445327 423584 425634 430076
12278 430076 438084 467020 531019 606315 689687 764979 845733 889365 867920 791091 683847
12267F83847j37485j10855p1413n7530o0408m5038k3938q303k0692j2536j7598
12256A18051l728j399J145l749j2154m281n235r4q3j466N060k802q316k601n249
12241G3099Q712P00j0817k212l378j5568P546j7j2266n639J5630P089j6347j1009
12227C5523J037j413o620J2115j66j011K584J790K989N175j8563j7929Q363L251
12213B7125L120j415p369N806N636J0093J82n654m823r641j3765L688J2697j283
12199B4397n449k50J8846J317O006N943l236k108j36j7863q214L556P732J486
12185C2027l711Q514J7842J0244l66p192j0448j6358j1399n577n646L522N238
12172A6690Q415Q569j90J1784j0412j1512q188K4525J2080k5081L31K2667L153
$$ plain form
12267 683847 546362 435507 364094 306564 246156 201118 177180 168877 148185 135649 118051
12256 118051 114323 112924 114069 110320 98166 93885 88650 88556 88473 87007 92067 89265 80949 78348 73099
12241 73099 81811 82511 71694 69482 66104 50536 58082 58065 45799 40160 55790 62879 46532 35523
12227 35523 36560 35147 28527 40642 40476 39465 42049 43839 46828 52003 33440 15511 23874 27125
12213 27125 30245 28830 21461 27267 32903 42996 43178 37524 32701 23060 9295 12983 25680 24397
12199 24397 18948 18698 37544 38861 44867 50810 47574 45466 45330 27467 19253 22809 30541 32027
12185 32027 28316 36830 54672 64916 64550 57358 46910 30552 19153 13576 7930 11452 16690
12172 16690 25105 33674 33484 45268 34856 23344 15156 39681 51761 26680 27011 49678 52831
12159E2831j1157k471Q100j6455O190O456R70l452j945q499q26J4746k582j0893
12145C1013p27J2367n600j526J1354K067j0643j7436p431J2559J3042M860j3046
12132C0853l101m812p382L98N573J0144M040q625m214K69J992J5185M919j2518
12118C2721r642j2550J755l232j035K0968J2017q678n789j7254k907J0989M661
12105B2024p737P673L499J542N549J0566j0458j0816J504J8735R035M322j938
12092E3500j9601j3895q73o849J033J7685J2169J896n749l229K91n978o04m295
12078B5501M292J8114K972p958n793l75p511j3543k235J1076J763l787O623R267
12064C8406j1341p32p952m895N046O64r367R292O779o522l351l407R215M968n922
$$ plain form
12159 52831 41674 39203 47303 30848 37038 43494 44464 41012 39067 30568 29742 44488 41906 31013
12145 31013 30286 42653 37053 35527 46881 48948 38305 20869 13438 25997 39039 43899 30853
12132 30853 27752 22940 15558 15956 21529 31673 35713 27088 22874 23143 25135 40320 45239 32721
12118 32721 23079 10529 12284 9052 8017 28985 41002 32324 26535 9281 6374 17363 22024
12105 22024 14287 21960 25459 27001 32550 43116 32658 21842 23346 42081 51116 55438 53500
12092 53500 33899 20004 19131 12282 13315 31000 43169 45065 39316 36087 36378 30400 29796 25501
12078 25501 29793 47907 50879 42921 37128 36753 29242 15699 13464 24540 26303 22516 29139 38406
12064 38406 27065 26333 18381 13486 18532 19196 9829 19121 25900 19378 16027 12620 21835 26803 20881
12049B0881j2143l545O263o216j0215L553J2524Q401K352Q718J2505O166l387
12036D5857j922k263j1868Q501J953r341r502P385l861j3987Q377J0025J03j0066
12022A9391K190M835M221J6180O683j2087o608Q912m84o949J670N963J635q355
12008C7197l206O460R162j4616l56o101R278J0159q429q447K392N694k4817m614
11994I756J5247J1797p126o633L255l208j170k489R67M213L046j814J1391j3153
11980B4079M716M387n974l292L413Q143j783j2570j9293q476l390J9161J4726
11967B3847J9210M552o002j5752q819N079R280J0654N61p363j4290q965N776Q918
11953B6686M003m761j1769J2259J1925j0077l218J2268Q250K627k044j5291M21
$$ plain form
12049 20881 8738 5193 11456 5240 -4975 -1422 11102 19503 21855 30573 43078 49244 45857
12036 45857 43935 41672 29804 38305 40258 30917 21415 28800 24939 10952 19329 29354 29457 19391
12022 19391 21581 26416 30637 46817 53500 41413 34805 43717 43233 36284 37954 43917 45552 37197
12008 37197 33991 40451 49613 34997 34641 28540 37818 47977 39548 31101 33493 39187 14370 9756
11994 9756 25003 36800 29674 23041 26296 23088 21918 19429 20396 24609 27655 25841 37232 24079
11980 24079 28795 33182 27208 23916 27329 35472 33689 21119 1826 -6650 -10040 9121 23847
11967 23847 43057 47609 41607 25855 17036 22115 31395 42049 42610 35247 20957 11992 17768 26686
11953 26686 30689 25928 14159 26418 38343 28266 25048 37316 45566 48193 46149 30858 31279
11940C1279J2396O640M874j0706j4116k620M548O402P183p493M026L030K496P675
11926E5614N732o132m551K684J143r56p920l945j73l227R360J431l400J973J4979
11911F2612J8248M961j6744r371J933m318r132O944o5L214m855r80J547j5653
11897C8341L619M948K0520J014j1044J905l788m762o102J7939N697m060k199O439
11883F8467l429L496J0152L310q252r460j4896L115j710M078K047N820M325J4878
11869H1941l21n027r844n656O847O570k50L234K207k957n538N634j0394N046j727
11854F9765j0765q606R176J9218J4473n518J3012J1570Q282j5188j6338l266J2530
11841I8345O241K1869K1727J5694K6360K8736M2672P1699P7262P9903R3577J07253
$$ plain form
11940 31279 43675 50315 55189 44483 30367 27747 32295 38697 45880 38387 42413 45443 47939 55614
11926 55614 61346 55214 50663 53347 54490 53534 45614 41669 41496 38269 47629 49060 45660 47633 62612
11911 62612 80860 85821 69077 59706 61639 57321 48189 55133 55068 58282 53427 52447 53994 38341
11897 38341 41960 46908 67428 68442 57398 59303 55515 50753 44651 62590 68287 64227 62028 68467
11883 68467 65038 68534 78686 81996 73744 64284 49388 52503 50793 54871 56918 62738 67063 81941
11869 81941 81620 76593 66749 61093 67940 74510 74260 77494 79701 76744 71206 76840 66446 71492 69765
11854 69765 59000 50394 59570 78788 93261 87743 100755 112325 120607 105419 89081 85815 98345
11841 98345 104586 126455 148182 163876 190236 218972 261644 333343 410605 490508 584085 691338
11829F91338P3286M6468K5769k1573n4472o4828p9792o0631n1230l7068l1288
11818D35979o188K2718J5820J7357K5636J9041R242J6058J0993R283K94j0335
11806E65898J1623J1628K7631M0625M7597O9049O6742M1203K9453j1294k5880
11795H74275k6136n0268l8680l6272k2333k0188j4144j8249j3020q231k5761k7236
11783E73757m6673l3147l0444l3970J597J9248J1701K9840M1624O2066N9542P1067
11771G26208N9589L4518J576k8626m9897n6762q3224r0348o9332n8118m9425n1049
11759B85110k0820k433k0624j6574N2k1208o650l105r663l563j4994j8089j4196
11746A33243M978o695J0921K1279o456j1510p510M006J27q600j3416M250L179
$$ plain form
11829 691338 764624 811092 836861 815288 760816 695988 616196 555565 504335 467267 435979
11818 435979 429791 452509 468329 485686 511322 530363 539605 555663 566656 575939 576233 565898
11806 565898 577521 589149 616780 657405 705002 774051 840793 881996 911449 900155 874275
11795 874275 848139 797871 759191 722919 700586 680398 666254 648005 634985 626754 600993 573757
11783 573757 527084 493937 463493 429523 431120 450368 462069 491909 533533 595599 655141 726208
11771 726208 785797 820315 821891 793265 743368 686606 603382 513034 443702 385584 336159 285110
11759 285110 264290 261857 241233 224659 224711 203503 196853 193748 184085 180522 165528 147439 133243
11746 133243 138221 131526 142447 163726 157270 145760 138250 142256 142383 133783 120367 124617 127796
11733A27796k748k45M154j0699r833J4197l363J382p090O693j097p682L883J8666
11719A34014J1683J1069q242j8304k4702P231K790M12l1062j5649l304Q217P526
11706H1679J3284J0400j221j377o528m01J0952J3955k326o421k411q280p911j0835
11692H2559k907N908K715L735N209O837P75j0596j6874n537j149m405L462R017
11678G8749j2296j4678J5256P35M171R95Q122R785R335L403Q882J1274J6331L467
11664A43531j641o005J0766K9995J7402J7767L1003K5872K0386J3863j9680l7491
11652B45768l0355k1479q002j787q262n466o03N851P214J5554R869J3589K4064
11639B45955J8902M773j6773j9287J0826J1173J5725J5357J5247J9184K0095J2498
$$ plain form
11733 127796 125048 124803 128957 118258 108425 122622 119259 120641 113551 120244 119147 111465 115348 134014
11719 134014 145697 156766 148524 130220 105518 112749 115539 115951 84889 69240 65936 74153 81679
11706 81679 94963 105363 104142 102765 96237 95836 106788 120743 118417 111996 109585 101305 93394 82559
11692 82559 79652 85560 88275 92010 97219 104056 104831 94235 77361 71824 70675 66270 69732 78749
11678 78749 66453 51775 67031 67766 71937 72932 81054 90839 100174 103577 112459 123733 140064 143531
11664 143531 141890 135885 146651 176646 194048 211815 242818 268690 289076 302939 283259 245768
11652 245768 215413 193934 185932 184145 175883 170417 169814 175665 182879 198433 208302 221891 245955
11639 245955 264857 269630 252857 233570 244396 255569 271294 286651 301898 321082 341177 353675
11627C53675n515R773J818j0451k4874k0698j3653l074L56k0976p300j637L319
11614B60763J749n091j598n72j7698m763j2660j842J2973J1114J223J1780L1072
11601B86450M0717R934O372M007j418j5019l4474l8245n7765m5304k7579k0736
11589A06940j2900M599O500J9289J8147J970J6229R400O471j675r63O052j424
11576A78635P473k364n112Q942J1265R005p124r226L499m457N618j932k060j3876
11562A78286k4752j8978r375O009P224K5242J1562Q985P909K027Q400J745J8342
11549B22626R297P877J9377K1429J5684j875q16J3914J4792l071K217N707R727
11536C36885J570R962J8700Q9J3561K6255K8856L3487M4607M5677N7059O0270
$$ plain form
11627 353675 348160 357933 359751 349300 324426 303728 290075 287001 287357 266381 259081 257444 260763
11614 260763 262512 257421 255823 255251 237553 232790 220130 218288 231261 242375 243598 255378 286450
11601 286450 327167 337101 343473 347480 346062 331043 296569 258324 200559 155255 127676 106940
11589 106940 94040 98639 105139 124428 142575 144545 160774 170174 176645 174970 174007 180059 178635
11576 178635 186108 183744 178632 187574 198839 207844 200720 191494 194993 190536 196154 194222 192162 178286
11562 178286 153534 134556 125181 131190 138414 163656 175218 184203 192112 194139 202539 204284 222626
11549 222626 231923 239800 259177 280606 296290 294415 293599 307513 322305 319234 321451 327158 336885
11536 336885 338455 348417 367117 367206 380767 407022 435878 469365 513972 559649 616708 676978
11524F76978P5303O5082O0849M4231K8L607R75j9169l3953n5615n0241l1203l1768
11511G05104j9777N068j82R801M058L583j3628r016k413J7421j957p73K2589J0893
11497G30771J2892Q223K581L695K168Q522O582J5478J7993O900r75r887J7555
11484H22498J6640k997j0508J6129J8614K5653K0935J3542J5535K4746K2053K5359
11472A008199L1381K6827L8278L1869L5319K0131n260l37R167L560O306J302K5493
11459A232235M0889M4792L7340L2063L3479N1073O0259M7216O6152N7586N2830
11448A755914M8020M3630O2773P3460O6451P6153J07741J01551R3382J08991J12721
11437B650787J14110J25787J30902J37911J48996J61414J91195K18271K62491
$$ plain form
11524 676978 752281 817363 878212 922443 922471 926078 927053 907884 873931 818316 768075 736872 705104
11511 705104 685327 690395 690213 700014 704072 707655 694027 685011 682598 700019 698062 697289 719878 730771
11497 730771 743663 751886 754467 758162 760330 768852 775434 790912 808905 815805 814830 804943 822498
11484 822498 839138 836141 825633 841762 860376 886029 906964 920506 936041 960787 982840 1008199
11472 1008199 1039580 1066407 1104685 1136554 1171873 1192004 1186744 1186407 1195574 1199134 1205440 1206742 1232235
11459 1232235 1273124 1317916 1355256 1387319 1420798 1471871 1532130 1579346 1645498 1703084 1755914
11448 1755914 1803934 1847564 1910337 1983797 2050248 2126401 2234142 2335693 2429075 2538066 2650787
11437 2650787 2764897 2890684 3021586 3159497 3308493 3469907 3661102 3879373 4141864
11428D141864K87193L04374L37264L92933M52177N13304N71807O85787P95391
11419H482094R13172J067828J277920J513028J812604K238500K835690L704736
11411B3845572M986738O817699R276226J2327566J5636271J8678786K0824003
11404A12392861K1052801J7734533R460802k666010j3439072j8467987j8849308
11397A07218620j6895653j3681360r824464n882610k255507R40594L605208N595940
11389F8820768O755099O882209N902755M065572K098449N94355m95928j102588
11381I3520691o68721J071127L842479P365753J1089116J4017235J5085117J3399276
11373A58722073Q507688J070880o774247j2472735j4700355j3675383j0559195
$$ plain form
11428 4141864 4429057 4733431 5070695 5463628 5915805 6429109 7000916 7686703 8482094
11419 8482094 9395266 10463094 11741014 13254042 15066646 17305146 20140836 23845572
11411 23845572 28832310 35650009 44926235 57253801 72890072 91568858 112392861
11404 112392861 133445662 151180195 160640997 157974987 144535915 126067928 107218620
11397 107218620 90322967 76641607 66817143 60934533 58679026 59619620 63224828 68820768
11389 68820768 75575867 82458076 88360831 92426403 94524852 95119207 94623279 93520691
11381 93520691 92851970 93923097 97765576 105131329 116220445 130237680 145322797 158722073
11373 158722073 167229761 168300641 161526394 149053659 134353304 120677921 110118726
11366A10118726o782818l536306j414463m48978n35485j513577k862629m337069
11358H8687401n908289p070281p127824o014937m066153j622509J176135M292138
11350F2345681P629444J0967635J3902176J5841769J6148828J4116278R015692
11343A49967503M14381j0425249j9038088k1917581k0023058j6203493j2420689
11336E0353726r299617o855223n038251l730064k843076k257702j890656j647027
11328A6792110j469548j295072j115283r74540q49415p33042o37403n42115m77417
11319H698275m45712m04670l72786l29828k99034k96290k87801k63424k52948
11310E745782k29682k28495k12902j94501j89337j77458j66504j57461j53163
$$ plain form
11366 110118726 103335908 99799602 98385139 97936161 97400676 95887099 93024470 88687401
11358 88687401 82779112 75708831 68581007 62566070 58499917 56877408 58053543 62345681
11350 62345681 69975125 80942760 94844936 110686705 126835533 140951811 149967503
11343 149967503 150381884 139956635 120918547 99000966 78977908 62774415 50353726
11336 50353726 41054109 34198886 29160635 25430571 22587495 20329793 18439137 16792110
11328 16792110 15322562 14027490 12912207 11937667 11088252 10355210 9717807 9175692 8698275
11319 8698275 8252563 7847893 7475107 7145279 6846245 6549955 6262154 5998730 5745782
11310 5745782 5516100 5287605 5074703 4880202 4690865 4513407 4346903 4189442 4036279
11301D036279j41176j22510j11137j16656j19577j15191j15993r1282o9229p4104
11291B959424p6632o8595p3772o7873p1360q4559p7951q2259q8536q2642n6151
11280B129094n1970m7313m4118l1682l5707m0064l3110k7090m6642o7059o2685
11269A641654n4860n2886m9625m1885k0574k4170l2483l3775l3640j9939k2093
11258A255724j2713k7735l2342j6905j8270l5249q650m067l550q807j5095o209
11246A066132j9031j7943k3408k7367k3656k6603n0785l0573r301P360J5037R303
11234H69165J5577J0451N553L191P978P634J6636K3307J8257L15j5864k3157k6880
11221I12163m1061k2949j2828J0020k2931j7717k0758l4837m2795l1966k8647
$$ plain form
11301 4036279 3895103 3772593 3661456 3544800 3425223 3310032 3194039 3102757 3033528 2959424
11291 2959424 2882792 2814197 2740425 2672552 2601192 2516633 2438682 2356423 2267887 2185245 2129094
11280 2129094 2077124 2029811 1985693 1954011 1918304 1878240 1845130 1818040 1771398 1704339 1641654
11269 1641654 1586794 1533908 1484283 1442398 1421824 1397654 1365171 1331396 1297756 1277817 1255724
11258 1255724 1243011 1215276 1182934 1166029 1147759 1112510 1103860 1099793 1096243 1087436 1072341 1066132
11246 1066132 1047101 1029158 1005750 978383 954727 928124 877339 846766 837465 844825 859862 869165
11234 869165 884742 895193 900746 903937 911915 919549 936185 959492 977749 978064 962200 939043 912163
11221 912163 871102 848153 835325 845345 822414 804697 783939 749102 706307 674341 645694
11210F45694l9500l2544k0341l8805m2943k5665p25K060n470j1444Q932O757O348
11197D52354j1501j7220k5678j3385k728R215Q886J4036P049j775k827l33j7888
11184C98205k8225j4025K737j0449j7514R559J0243R185K5617N187j7818j6233
11172C56469q688M82j7439l1003k1066k0872k0993j3060J1783k03R640Q710N630
11159B59390N564P736R934J322o070j3110q619j2848k1045p599k1570j3853q086
11146A71146l550K333j2554o777q954K143j1637j497j96J580p219L7l84L267J0012
11131A37750m525k198k722n758j6147l466J3510Q864l936p541j3325q608Q307
11118A00205J1493P871j5166j6272J3308L840l286M644L999lj101k962M282r580
$$ plain form
11210 645694 606194 573650 553309 514504 471561 445896 445171 447231 441761 430317 439249 446006 452354
11197 452354 440853 423633 397955 384570 381842 391057 399943 413979 421028 419253 416426 416093 398205
11184 398205 369980 355955 358692 348243 330729 340288 350531 359716 385333 390520 372702 356469
11172 356469 347781 348263 330824 299821 278755 257883 236890 223830 235613 235410 245050 253760 259390
11159 259390 264954 272690 282624 283946 277876 264766 256147 243299 222254 214655 193085 179232 171146
11146 171146 167596 169929 157375 150598 141644 143787 132150 130653 130457 132037 124818 124855 124471 127738 137750
11131 137750 133225 131027 128305 122547 106400 102934 116444 125308 121372 113831 100506 91898 100205
11118 100205 111698 119569 104403 88131 101439 105279 101993 106637 110636 110633 109532 106570 110852 101272
11104A01272N33O847J7152j0566L084L311k392L80l664j658m62N472J0806J5373
11090A45488J7795Q102K1421Q788J5842L6158L7490Q6631J27061J67867J98279
11079H70922K15359J82739N4948j37786k47303k49845j86955j18420p7266l9148
11069B67245l0956k7098L426J417j7653k4168j6734l1598k137K458P094j011n464
11056A24821P72L268r181o000j5700n160q986o298l624m935j0793L547R078M276
11042G5085p507j264r667K413J8225K003J077j4484Q426N148O78q553j0930j2113
11028D8537j0995M791O826r652L576j391r771R703j15q376n1j324L765N429L90
11013D1342o960q884O451N086J0540m803j8123n622N004R321K2252o062p838l050
$$ plain form
11104 101272 101805 108652 125804 115238 118322 121633 119241 119621 115957 114299 113837 119309 130115 145488
11090 145488 163283 171385 192806 201594 217436 253594 291084 377715 504776 672643 870922
11079 870922 1086281 1269020 1323968 1186182 938879 689034 502079 383659 306393 267245
11069 267245 236289 209191 212617 214034 196381 172213 155479 123881 121744 124202 131296 130285 124821
11056 124821 125593 128861 119680 113680 97980 92820 83834 77536 73912 68977 58184 61731 70809 75085
11042 75085 67578 66314 56647 59060 77285 79288 80365 65881 74307 79455 80133 71580 60650 48537
11028 48537 37542 42333 49159 39507 43083 41692 31921 41624 41509 33133 33082 31758 35523 40952 41342
11013 41342 34382 25498 31949 37035 47575 42772 24649 19027 24031 33352 55604 49542 41704 38654
10999C8654m041j0162P542j0595l343K37L655j614J116P939P778J7354J2323R979
10985G6822J998P197Q727J2527J8151K0136L0348M9526N5938O2679Q2511J01211
10973E27771Q2455O6033N8165K7957l1709m5033o5414o0618p0325n5455l9540
10962C94287l2594k5797j4623J7862K1123L9543M1405K5638K5768Q595P142K527
10950E10876K478m50K1727K3733M1294N6641M6685O0734N0885K8473j1978m0821
10938G90277m8557m4792n0544l8571k7613k2485j4688j4247J345l527j0885j9854
10926D95859j9284l2200l4678m2983j6062j169o2J8324M5969N3744O1809O6553
10914E95820P2825P9709J9103j5886l8193p2371j05575q9414q0995p0190m4885
$$ plain form
10999 38654 34613 24451 31993 21398 18055 18292 21947 20333 21449 29388 37166 54520 66843 76822
10985 76822 78820 86017 94744 107271 125422 145558 175906 225432 281370 344049 426560 527771
10973 527771 610226 676259 734424 762381 730672 685639 620225 559607 489282 433827 394287
10962 394287 361693 335896 321273 339135 360258 399801 441206 466844 492612 501207 508349 510876
10950 510876 513354 512904 534631 558364 599658 656299 702984 763718 814603 843076 831098 790277
10938 790277 741720 696928 646384 607813 580200 557715 543027 528780 530125 526598 515713 495859
10926 495859 476575 444375 409697 366714 350652 349483 349421 367745 413714 467458 529267 595820
10914 595820 668645 748354 767457 751571 713378 641007 535432 446018 365023 294833 249948
10903B49948m4989l5734j5870j9772q541j0298j9671m46q738o37K935j0639j1051
10890F6497j5059m889J608O505l748J049M696Q090J672j1281o886j4018q210J4247
10876D0273P025R483r352p764M161M08p410q098m14n562M587N163m03J2902j3485
10861C1514j6039m485j580L304j1152O427m542o569j761L129J7106k356j4991
10848a995m772R13j548n160L957J2929Q656r337m489q069M096J8626l476l728
10834F603J747N593K696o436j1982m662N571J803J5611K794n274J2622K5707j43
10820E2250j6652k3446p473J1478l090M819K445n058j6760J67K0219l426j1994
10807C479j0066j2396L968N295r941Q199J4374l204J064l177j1123P20K2531K4015
$$ plain form
10903 249948 204959 169225 153355 133583 125042 114744 95073 94627 85889 85252 88187 77548 66497
10890 66497 51438 46549 48157 54662 50914 51963 56659 64749 66421 55140 48254 34236 26026 40273
10876 40273 47298 56781 47429 39665 43826 44234 36824 28726 28312 22750 27337 32500 32097 44999 31514
10861 31514 15475 10990 9410 12714 1562 7989 3447 -3122 -4883 -1754 15352 12996 -1995
10848 -1995 -6767 -5854 -7402 -12562 -8605 4324 12980 3643 -846 -8915 -4819 13807 10331 6603
10834 6603 8350 13943 16639 10203 -1779 -6441 -870 933 16544 19338 14064 26686 52393 52250
10820 52250 35598 12152 4679 16157 13067 17886 20331 15273 -1487 -1320 18899 15473 3479
10807 3479 -6587 -18983 -15015 -9720 -19661 -11462 2912 -292 772 -2405 -13528 -12808 9723 33738
10793C3738p130j5141j4686P797K273k623P906k2101J729r89J2785J629r104L628
10779b89Q435L50J0386m143J2384m428j2397q828J832P20l505k52j4302N519p361
10764a5879J1743Q209L747R338l336o607j752J5562o123q511Q586R317j0614l20
10750A3360J486q29j215Q785j4624k631K85l281o849n304P601N835j002O088p558
10735A47O249K279R356M934n459o53K826j8076j2483o136J0493L977m907l625
10721a1078j1192j2617N132N0J4835J2239K5226R426m970j0830o533o652p506
10708d470j2259o146o940Q72J6025N395k482P770l791J89J207Q544Q314j263q457
10693B508j0364K563J4550L148k3800n984J8503K676p078m742O48l518m692L007
$$ plain form
10793 33738 26608 11467 -3219 4578 6851 4228 12134 -9967 -8238 -9227 3558 5187 -3917 -289
10779 -289 8146 8496 18882 14739 27123 22695 10298 1470 3302 4022 517 265 -14037 -8518 -15879
10764 -15879 -4136 4073 7820 17158 13822 7215 5463 21025 14902 6391 14977 24294 13680 13360
10750 13360 14846 14017 12802 21587 6963 4332 4617 1336 -5513 -10817 -3216 2619 1617 7705 147
10735 147 6396 8675 18031 22965 17506 16853 19679 1603 -10880 -17016 -6523 -2546 -7453 -11078
10721 -11078 -22270 -34887 -29755 -29705 -14870 -2631 22595 32021 27051 16221 9688 3036 -4470
10708 -4470 -16729 -22875 -29815 -28943 -12918 -7523 -10005 -2235 -6026 -5837 -4630 3914 12228 10965 2508
10693 2508 -7856 -5293 9257 12405 -11395 -17379 1124 3800 -3278 -8020 -7372 -10890 -15582 -12575
10679a2575M635j0373Q543J0134q35k556J8219m286m954N196K682r212n431q31
10665a644J960M869L352P980j138j5870K188J3998Q651p47l616j4596r584l370
10651g567j561L140o33M418K379K78j0128J1756R195j4159M547J2241o680j767
10637E459j903m608q008Q792j90o781J0115J8834o965j895l438j0197O34M031
10623C880o903j1961n060J3062M246n57Q726N518P305q074n17l826L399Q322m379
10608A3181R482K758k563r446n763M1K025m113n700j1240P857J2510q817j8425
10594a8213Q607m921p361k274J2979J7385K151k196l851q173j2678J138J8412
10581A005R373j078k284p300m824j385k187K989M728P627j2730o371j049j4471
$$ plain form
10679 -12575 -7940 -18313 -9770 364 -471 -3027 15192 10906 5952 11148 13830 4618 -813 -1644
10665 -1644 316 5185 8537 16517 15379 -491 1697 15695 24346 23599 19983 5387 -4197 -7567
10651 -7567 -9128 -5988 -6621 -2203 176 454 -9674 2082 11277 -2882 1665 13906 7226 5459
10637 5459 3556 -1052 -9060 -268 -458 -7239 2876 21710 14745 12850 9412 -785 -151 3880
10623 3880 -3023 -14984 -20044 -6982 -2736 -3293 5433 10951 18256 10182 9665 5839 9238 17560 13181
10608 13181 22663 25421 22858 13412 7649 7690 9715 5602 -98 -11338 -3481 9029 212 -18213
10594 -18213 -9606 -14527 -21888 -24162 -11183 6202 8353 6157 2306 -5867 -18545 -17407 1005
10581 1005 10378 9300 7016 -284 -5108 -6493 -8680 -5691 -963 6664 -6066 -12437 -13486 -27957
10567b7957N643M939j32O164J033L254j0896p709R103J4675N837p428k334k525
10553h333M63l662j0110l671n751J2392J9938j2649j1328k334N962m922K421R913
10539a1671Q791J008o198o861N467k239L278K222J206M359Q699r562p805j0044
10525a9350J316N543L229j286k255L605J7399n069j746P348R876K2086L829j0883
10511C3642j4633k56n364j1879J0429r94Q19l790j6360l721L280K247P185l123
10497b518j1017N426O468J3866j341m174j659O486Q117j3500j5644n393R074L81
10483e428j0915R374Q18j3173r94J8202P448K480P087j5031j3323n133P733p7
10469a0932L252k56Q040m659m175M706J4603N621O05l804k0274O827J0322j2502
$$ plain form
10567 -27957 -22314 -17375 -17507 -11343 -10310 -7056 -17952 -25661 -16558 -1883 3954 -3474 -5808 -8333
10553 -8333 -7870 -11532 -21642 -25313 -31064 -18672 1266 -11383 -22711 -25045 -19083 -24005 -21584 -11671
10539 -11671 -2880 -1872 -8070 -14931 -9464 -11703 -8425 -6203 -4997 -638 8061 -1501 -9306 -19350
10525 -19350 -18034 -12491 -9262 -10548 -12803 -9198 8201 3132 1386 8734 18610 40696 44525 33642
10511 33642 19009 18753 13389 1510 11939 10945 11764 7974 -8386 -12107 -8827 -6580 605 -2518
10497 -2518 -13535 -8109 -1641 12225 10884 6710 5051 11537 19654 6154 -9490 -14883 -5809 -5428
10483 -5428 -16343 -6969 -6151 -19324 -20318 -2116 5332 7812 14899 -132 -13455 -18588 -10855 -10932
10469 -10932 -7680 -7936 104 -4555 -8730 -4024 10579 16200 16805 13001 -7273 -446 9876 -2626
10455b626o519k22o21l217r317l587P636P782r539o937l098J4516J3687l163q8
10440e313j3654m693J6211N354j7298k83J1294N976j6510P8J7226R636m311j1280
10426g567m653j048l979M106R639J2246k504j8061j2858R728J7941Q096L019J8895
10412C3000P521R063r803k4796k677L288J2975k044o332j009N406l664j0541j7256
10398f869M336J1128l131k1952O254J5576N999r227m068p286n860N640Q217J152
10384i1J009k081N466K521p894P595J5181l194l339q814O580M205j6234j6042
10370a5132p90N855O592J0601K842N416j5181K408k29q462j158O621q6J509o737
10355e931j6k463n595J7655J5217j356j2384r688L722K619r527O154Q046J3712
$$ plain form
10455 -2626 -9145 -9367 -9988 -13205 -22522 -26109 -18473 -10691 -20230 -27167 -30265 -15749 -2062 -5225 -5313
10440 -5313 -18967 -23660 -7449 -2095 -19393 -19676 -8382 -2406 -18916 -18838 -1612 8024 3713 -7567
10426 -7567 -12220 -13268 -17247 -13141 -3502 8744 6240 -11821 -24679 -14951 2990 11086 14105 33000
10412 33000 40521 49584 39781 14985 12308 15596 28571 26527 20195 19186 24592 20928 10387 -6869
10398 -6869 -2533 8595 5464 -16488 -10234 5342 11341 2114 -1954 -9240 -15100 -9460 -1243 -91
10384 -91 918 -1163 4303 6824 -1070 6525 21706 18512 15173 6359 12939 17144 910 -15132
10370 -15132 -15922 -10067 -3475 7126 9968 15384 203 2611 2382 -6080 -7238 -617 -703 806 -5931
10355 -5931 -5947 -8410 -14005 3650 18867 17511 5127 -4561 -839 1780 -7747 -1593 6453 20165
10341B0165k49j472O074j6177o118J27N470K818p991p417J0797l904j0283r388
10327a7548l452L8L655L181n150Q570K2746J2802m908j7723j3829L146J0025j399
10313A54j4969j174L408o045O138J7685L515O174L69n803j439j156M440q117p205
10298d025m161k541L790J817M086J7681k2071j2729r46k141m411Q247J2079q077
10284a3402j6160J7344R701j3888N206M941M615k416j3443r912L846J6608O955
10271er85m01N303q240M652J6104m35j169n645p053q645J5895M233p273j452j192
10255C692n536P09j3831p072J7433q709p152R073J2371N494N987p701j4316J5246
10241E688K661j4943q927j1321K827R762P146L995o792o651j68M790M998P851
$$ plain form
10341 20165 19916 18444 24518 8341 2223 2350 7820 10638 2647 -4770 6027 2123 -8160 -17548
10327 -17548 -21000 -20962 -17307 -14126 -19276 -10706 12040 24842 19934 2211 -11618 -8472 1553 154
10313 154 -14815 -15989 -12581 -18626 -12488 5197 8712 14886 15255 9452 8013 6857 11297 3180 -4025
10298 -4025 -8186 -10727 -6937 -5120 -1034 16647 -5424 -18153 -19099 -21240 -25651 -17404 -5325 -13402
10284 -13402 -29562 -12218 -2517 -16405 -11199 -6258 -1643 -4059 -17502 -27414 -23568 -6960 -5
10271 -5 -990 -1391 3912 -4328 324 16428 15993 14824 9179 2126 -6519 9376 13609 6336 4884 3692
10255 3692 -1844 -1135 -14966 -22038 -4605 -13314 -20466 -11393 978 6472 12459 4758 -9558 5688
10241 5688 8349 -6594 -15521 -26842 -24015 -14253 -7107 -3112 -9904 -16555 -16723 -11933 -6935 916
10227I16J958p308j0407Q372J3659P417Q40K405J1488n6p327m986P034n1q881
10212A5073l468M547k108L750M107l660n771j7830j5769l125l052Q790J0028J0402
10198A914M363J0075L136j0821p870R450m283L508j878o978l983k850N1J8484
10184A2318R081o643m618j0562o96J3416k90k1973l950L084r879n032R212J6634
10170A02K636r864Q94N360M908J028J6435k016q968q697P45J293M494m868O52
10155D134n882j0178O697m111j2347N715J2465R966R818j8761j4420q820M736
10142b0988J0127k306J9004M015o138K0167q764j4700j1432M281J722j947N044
10129a915L438O199K569L163k084r769k266j625r977k100J2293k80K92l607K661
$$ plain form
10227 916 2874 -4434 -14841 -6469 7190 14607 15447 17852 29340 29284 21957 16971 24005 23954 15073
10212 15073 11605 16152 14044 17794 21901 18241 12470 -5360 -21129 -24254 -27306 -18516 -8488 1914
10198 1914 6277 16352 19488 8667 797 10247 5964 9472 7594 616 -3367 -6217 -6166 12318
10184 12318 21399 14756 10138 -424 -1120 12296 12006 -9967 -13917 -10833 -20712 -25744 -16532 102
10170 102 2738 -7126 -6232 -872 4036 5064 21499 19483 10515 1818 2563 3856 8350 3482 4134
10155 4134 -1748 -11926 -5229 -9340 -21687 -15972 -3507 6459 16277 -2484 -16904 -25724 -20988
10142 -20988 -10861 -13167 5837 9852 3714 23881 15117 417 -11015 -6734 -5012 -6959 -1915
10129 -1915 1523 7722 10291 13454 11370 1601 -665 -2290 -12267 -14367 -2074 -2354 -2062 -5669 -3008
10114c008M63J8398R72j2165j3990J0724N250j1352m127l133o01k279K648N69
10100a1631N355p725L419J1692L125Q85r804N032l063p188K298J7923J904q86
10086A1336j115q915L31J0914N107M928Q403j5696q955p483J060J605K044J232
10072D796r28N237N5j2931l651o7J3100j889J792O897k151n20j180J204l48K712
10056A2128P18N965N033M363K6780K8397K4905M2232P4192Q7023R5025N9735r2152
10043C74344j56049r8909m9368l3358k3774k2997k975J0605Q521r108l098J659
10031d507N640K127K303J811R35P94k827r465l489j755p007r317J6280J4025P247
10016A2795n053L10R891p900k1178j0074j900J0995P543K2070O411K888l280k0560
$$ plain form
10114 -3008 -2545 15853 16825 4660 -9330 1394 6644 -4708 -8835 -11968 -12569 -14848 -12200 -11631
10100 -11631 -6276 -14001 -10582 1110 4235 5120 -4684 348 -2715 -9903 -7605 10318 12222 11336
10086 11336 10221 1306 1637 12551 17658 22586 30989 15293 6338 -1145 -85 1520 3564 4796
10072 4796 3868 9105 9160 -3771 -7422 -7489 5611 3722 5514 12411 10260 9740 8560 9764 9416 12128
10056 12128 12846 18811 23844 28207 54987 83384 108289 150521 224713 311736 406761 466496 374344
10043 374344 218295 119386 70018 36660 12886 -10111 -13086 -2481 6040 -3068 -6166 -4507
10031 -4507 1133 3260 5563 7374 8309 9103 6276 -3189 -6678 -8433 -15440 -24757 -8477 5548 12795
10016 12795 7742 8052 17943 10043 -11135 -21209 -23109 -12114 -4571 17499 23910 26798 23518 2958
10002B958j7045L483J7403Q71r314j4537O30J1927K008Q115P664K1051J5209j452
9988D8971m838p432N21m613k2733k4118l246N197N38J2828J9331n493o530j0496
9974b113l349L134l115K606J045K0177q942k2688l64L148P972M071l39J46l807
9959b418O869p41r179J0783N73k0384j6985m899M333L418Q053R603Q217L247M191
9944D681N519m55o498p701O679j442j2669m966j3464K871J0082J3035J3092j0470
9930a706J5565O084k0149j6481J377L968k967J471j0321j1063M755J6057R920
9917c490J4729k155n215j60N866l425q35J135p238r576P059J6119J8646j1301
9903B0159j3409Q229k182j2894q9j5636o366j586K372k611M075P43j492M365K309
$$ plain form
10002 2958 -14087 -10604 6799 7670 -1644 -16181 -15551 -3624 -1616 6499 14163 35214 50423 48971
9988 48971 44133 36701 37222 32609 9876 -14242 -17488 -12291 -11753 1075 20406 14913 8383 -2113
9974 -2113 -5462 -2328 -5443 -2837 -1792 18385 9443 -13245 -13609 -10461 -2489 1582 1243 1389 -2418
9959 -2418 4451 3710 -5469 5314 5887 -14497 -31482 -36381 -32048 -28630 -20577 -10974 -2757 490 4681
9944 4681 10200 9745 3247 -4454 2225 783 -11886 -16852 -30316 -27445 -17363 -4328 8764 -1706
9930 -1706 13859 19943 -206 -16687 -15310 -11342 -14309 -12838 -23159 -34222 -29467 -13410 -3490
9917 -3490 11239 9084 3869 3709 9575 6150 5315 6450 -788 -10364 -3305 12814 31460 20159
9903 20159 6750 14979 12797 -97 -186 -15822 -22188 -23774 -21402 -24013 -19938 -19195 -20687 -16322 -14013
9888a4013N377p426p408J2314n9o700m365J3198Q163j055j113l878j1048K654
9874a5359L851K683L410p27J3234n644j1915P660P30O989J3614j5163J058K772
9860G193k264o830K873R877J1670o340l649M306j2510m369N556J3486l746j682
9846A3571j1183j2313r237o782J3682J2396o708j7118j1886j6614J3156J4638
9834b4398k946k517r737J0934M854Q536J1310L467l98L403j345k699q488o367
9820a6391J1014Q368l564k910j1782m599L667J5996L379M784J774J267N436N695
9806B2134J2418n919r785j4592p213j422M983L728K080P2N244n673n756o275o061
9791a2037l514N002M64k954p36J494J0327L672r137J3262k658j2787P61K808o966
$$ plain form
9888 -14013 -8636 -16062 -23470 -11156 -11215 -17915 -22280 -9082 -919 -1974 -3087 -6965 -18013 -15359
9874 -15359 -11508 -8825 -5415 -6142 7092 1448 -10467 -2807 -2077 4912 18526 3363 4421 7193
9860 7193 4929 -1901 972 10849 22519 16179 12530 16836 4326 -43 5513 18999 15253 13571
9846 13571 2388 -9925 -19162 -25944 -12262 134 -6574 -23692 -35578 -52192 -39036 -24398
9834 -24398 -27344 -29861 -39598 -28664 -23810 -15274 -3964 -497 -895 2508 1163 -1536 -10024 -16391
9820 -16391 -5377 2991 -573 -3483 -15265 -19864 -16197 -201 3178 7962 9736 11003 16439 22134
9806 22134 34552 28633 18848 4256 -2957 -4379 604 4332 6412 6484 11728 6055 299 -5976 -12037
9791 -12037 -15551 -10549 -10085 -13039 -13775 -12281 -1954 1718 -7419 5843 3185 -9602 -8841 -6033 -12999
9776a2999k601P870J1221J4972L230j0038l673N277j233p598O98L722l861R401
9762A4388m49N576j2229q423j3871J1007L894J578n731J790k640Q603Q176M738
9748A6407J738k5988j191N400m869n044O758M820j2876K100j2848L430N852J2287
9734d024p92j164L144m077J01L271N032o896j3748O851J91j1458J6432M593L359
9719H15J4488k25j242l543L571j0927k596j5406Q2J0363J8044J8142P066k426
9705C6206q985q875j5733l676L199L204l633k1859k254J3603K403l732n061K006
9691a3187Q648K071k601k95k402m492J0117J0080J1723o700r090J3323M292j1393
9677A0094j2456M477O82N998J6543q666k0120n677J1370k76n542M351m853j2659
$$ plain form
9776 -12999 -15600 -7730 3491 18463 21693 11655 7982 13259 12026 4428 5126 8848 4987 14388
9762 14388 13939 19515 7286 -1137 -15008 -4001 -107 1471 -4260 -2470 -5110 3493 11669 16407
9748 16407 18145 -7843 -9034 -3634 -8503 -13547 -6789 -1969 -14845 -12745 -25593 -22163 -16311 -4024
9734 -4024 -4816 -5980 -2836 -6913 -6812 -3541 1491 -5405 -19153 -12302 -12111 -23569 -7137 -2544 815
9719 815 15303 15078 13836 10293 13864 2937 341 -15065 -14983 -4620 13424 31566 38632 36206
9705 36206 27221 18346 2613 -1063 2136 5340 1707 -20152 -22406 -8803 -6400 -10132 -15193 -13187
9691 -13187 -4539 -2468 -5069 -5364 -7766 -12258 -2141 7939 19662 12962 3872 17195 21487 10094
9677 10094 -2362 2115 2797 8795 25338 16672 -3448 -9125 2245 1969 -3573 778 -4075 -16734
9663a6734L469J0339j8662o532Q993M913J2250m164o309J3043J4912k0020l618
9650h120R472j5024p288J1191m298J1573J035M793L837j797M013N332J2095N735
9636C2549j0744q765r376J372J4322J2368M096j3631k0913j3824J5092J1934P442
9623B1922K196j5230j3792k515N096q576o289J0142M072O716M412n735N839M187
9609A2445n011m49l479l246J75J5226J024n597j2987N745M672K553Q592o000j2679
9594I84o960k914P355O3R902l258Oj1782J035L378j712K0496R018o998n164K140
9578A5589r496l652j333j875o588M929q339P153O872M424j457K182j771j3311
9564f673r350N078J2537R541k455j410j457P576M934j1616k156j5272m39J5052
$$ plain form
9663 -16734 -13265 -2926 -21588 -28120 -19127 -14214 -1964 -6128 -12437 606 15518 -4502 -8120
9650 -8120 1352 -13672 -20960 -9769 -14067 -2494 -1459 3334 7171 5374 9387 14719 26814 32549
9636 32549 21805 13040 3664 5036 19358 31726 35822 22191 1278 -12546 2546 14480 21922
9623 21922 24118 8888 -4904 -7419 -2323 -10899 -17188 -7046 -2974 3742 8154 2419 8258 12445
9609 12445 7434 6985 3506 260 435 15661 16685 11088 -1899 3846 8518 11071 19663 13663 984
9594 984 -5976 -8890 -1535 -1472 8430 5172 5178 -6604 -5569 -2191 -3903 16593 25611 18613 13449 15589
9578 15589 6093 2441 1108 -767 -7355 -2426 -10765 -3612 3260 7684 6227 8409 6638 -6673
9564 -6673 -16023 -10945 1592 11133 8678 7268 5811 13387 18321 6705 4549 -10723 -11162 3890
9550C890K0373l162j2303L914p718j2636N16o356K21J7441K350K489J3043L371
9536B5433j0145m827J3501J5045J6138j864k72l325J1984J0239j4952j6810l542
9523C6603j8557j9936n765k975k106J3325J0089l302p571K21M308O933N950J5517
9509C2734K532J187K479k634k295n580R607j069J1269k461r832j0956N81k56N31
9494B5837K069M190p545q521m59J0234J772M925l078j3890J77K572m963L477j077
9479A5720n615l382n408M723P369J0360L363q975q3J0385r566L990N943L954k920
9464B9858P063J635N76N315J328j0019j0668p692K222j21o72K469l925r153J1626
9449A9842m232J4022J402k6412j2691o55M437J7819R056M097k895r421o371J2392
$$ plain form
9550 3890 24263 21101 8798 12712 4994 -7642 -7126 -13482 -13261 4180 6530 9019 22062 25433
9536 25433 15288 10461 23962 39007 55145 53281 53009 49684 61668 71907 56955 40145 36603
9523 36603 18046 -1890 -7655 -10630 -12736 589 10678 7376 -195 26 4334 11267 17217 32734
9509 32734 35266 36453 38932 36298 34003 28423 38030 36961 48230 45769 35937 24981 25562 25306 25837
9494 25837 27906 32096 24551 16030 15571 25805 27577 32502 29424 15534 15711 18283 13320 16797 15720
9479 15720 10105 6723 1315 6038 13407 23767 27130 18155 18072 28457 18891 22881 28824 32778 29858
9464 29858 36921 38556 39132 44447 45775 35756 25088 17396 19618 19497 18825 21294 17369 8216 19842
9449 19842 15610 29632 31034 4622 -8069 -8724 -4287 13532 22588 26685 23790 14369 7998 20390
9435B0390J4196N678q030J172m607k048l062p32J3860J3340L106j55m413J4669
9421F3364m825j7592o195J3758N448p801j1964P641J5158L955J768k656j499Q777
9407F7337j9658l487J161o72K37o790R356J6969m493j040N360n363j429O074P311
9392G0873k504q560J417L498J699Q094n00j5579m749N380n649r769J2639K782
9378E9072L265J7273j03k376M948O228R605J0123q25j5472n679J591R952J2723
9364A10325m40l506R832j246j2547j275j0270K10N484l2L944j041L862J788N934
9349A11022K090j868P035Q698L526L071N527j0835J1813J9692j440l144K790J882
9335A59859j512q38n8K937M257J819J2602K198P385L767R179L623r608q866O071
$$ plain form
9435 20390 34586 40264 32234 33406 28799 26751 23689 22957 36817 50157 53263 53108 48695 63364
9421 63364 58539 40947 34752 48510 53958 46157 34193 41834 56992 60947 62715 60059 58560 67337
9407 67337 47679 44192 45353 44681 44918 38128 47484 64453 59960 58920 64280 58917 57488 63562 70873
9392 70873 68369 59809 61226 64724 66423 74517 74017 58438 53689 59069 53420 43651 56290 59072
9378 59072 62337 79610 79507 77131 82079 88307 97912 108035 107210 91738 86059 87650 97602 110325
9364 110325 109885 106379 116211 114965 102418 101143 90873 91083 96567 96535 100479 99438 103300 105088 111022
9349 111022 113112 111244 118279 126977 130503 133574 139101 128266 140079 159771 158331 155187 157977 159859
9335 159859 158347 157509 157451 160388 164645 166464 179066 181264 188649 192416 201595 205218 195610 186744 192815
9320A92815J9101J4087J6480J7436M912K557n024K18J9146K5132L693L024m638
9307C08939J754J0116n546O211J6994Q503Q191J7300J5004R197j3321n567Q143
9294C85918J5418K4320K9164M227p082l316N139J8320N676Q425J3097K0808J2281
9281E32395M0207L1333J9737J1713K8510L8806K4645J6385J9124J4876J5379J6602
9269H09712R642J4411K6742J9622L2054L1870L7490K0512K2830J9112K4282L2429
9257A100708L1647L1767K8285J6644J2897K4465J3455Q997J9503O030M511Q037
9245A306946m052L993J4709k37K539j2075j2645j6670N091n141j5675j4718j4951
9232A237114j7913k3205m0932k8024j9843l0052k4429k5873k0473k0430j8555
$$ plain form
9320 192815 211916 226003 242483 259919 264831 267388 262364 262582 281728 306860 310553 313577 308939
9307 308939 310693 320809 315263 321474 338468 346971 355162 372462 387466 396663 383342 377775 385918
9294 385918 401336 425656 454820 459047 451965 448649 453788 472108 477784 486209 499306 520114 532395
9281 532395 572602 603935 623672 635385 663895 702701 727346 743731 762855 777731 793110 809712
9269 809712 819354 833765 860507 880129 912183 944053 981543 1002055 1024885 1043997 1068279 1100708
9257 1100708 1132355 1164122 1192407 1209051 1221948 1246413 1259868 1268865 1288368 1294398 1298909 1306946
9245 1306946 1302894 1306887 1321596 1321359 1323898 1311823 1299178 1282508 1287599 1282458 1266783 1252065 1237114
9232 1237114 1219201 1195996 1155064 1127040 1107197 1077145 1052716 1026843 1006370 985940 967385
9221I67385j4542j6483k8794k9879k5177j4222k4963k7386k3991k3185l0818j1052
9209F96893j2742k3171j6761j9451j4823j1326j3441k1133j2304r861J6136j2213
9197E45803j9080j5787n725j79Q258R65k6506k5902k0071k0099j3593k2588j4912
9184C70584j1387j5690j4835j4426N813l789J0407J1345q728j3692j3918m326
9172B97358j6007j0189j3257j4677j664M040j94K793o993l911j7615j8148n065
9159A96471Q11K393m644j5144j3844R797J2036P556m704j0027j706m332J52J474
9145A76289k0662n443M40q998n73M603k512j069L130o681p272J786P377r163n787
9130A25465j2900j490J5213K419q347l01j496J473q309j139L317j1484q619Q764
$$ plain form
9221 967385 952843 936360 907566 877687 852510 838288 813325 785939 761948 738763 707945 696893
9209 696893 684151 660980 644219 624768 609945 598619 585178 564045 551741 541880 558016 545803
9197 545803 526723 510936 505211 505032 513290 514255 487749 461847 441776 421677 408084 385496 370584
9184 370584 359197 343507 328672 314246 320059 316270 326677 338022 329294 315602 301684 297358
9172 297358 281351 271162 257905 243228 241564 245604 245410 248203 241210 237299 219684 201536 196471
9159 196471 197282 199675 195031 179887 166043 175840 187876 195432 190728 180701 178995 174663 174815 176289
9145 176289 155627 150184 150624 141626 141053 145656 143144 142075 145205 138524 131252 133038 140415 131252 125465
9130 125465 112565 111075 126288 128707 120360 120059 118563 120036 111727 110588 113905 102421 93802 102566
9116A02566O936r731l765p23l289q298n868P865K891q488n357J640M993K772m193
9101G9951r465m317N00J8530O470j892q351j6533n999q550j58L161l84M089O797
9086F3849l619O930J464N994O35J265J4033n129M071k020k0404m931n71K014K819
9071F6400q766N44L544M801K933O087j8322j3244O601J4464M700N418j5412j7424
9057D2324k61J0697K948o026p356j300o756o197k129J4323j417l864R482M307
9043D8775n737q654m487Q544J7167P073M932j0363J276j2314n806n208p006M401
9029C2593j2124J218L013k953k055P975j165R459O727l871l238j049J4321M820
9015E3671k7020J996P175M038M966j1716n350K646J1291J4374m262k3488j6959
$$ plain form
9116 102566 109502 99771 96006 95283 91994 83696 77828 85693 88584 80096 74739 76379 81372 84144 79951
9101 79951 70486 66169 66669 85199 91669 89777 81426 64893 58894 50344 50186 53347 52963 57052 63849
9086 63849 60230 67160 68624 74618 75253 76518 90551 85422 89493 87473 67069 62138 61567 63581 66400
9071 66400 57634 58178 61722 66523 69456 75543 57221 43977 50578 65042 69742 75160 59748 42324
9057 42324 42063 52760 55708 49682 42326 41026 34270 28073 25944 40267 38850 34986 44468 48775
9043 48775 43038 34384 29897 38441 55608 62681 67613 57250 58526 46212 40406 35198 28192 32593
9029 32593 20469 21687 24700 21747 19692 27667 26502 35961 42688 38817 35579 34530 48851 53671
9015 53671 26651 28647 35822 39860 44826 33110 27760 30406 41697 56071 51809 28321 11362
9002A1362j1698M408N915j731j2546o681R412J6911J4809P292j86p606j0470j1540
8988G651O310J9727o783j745l171O992M94O355j866j4044R356Q810p837j607p883
8973B0759p474J913R176l197p092K474P465L994O571O123k005l488j187L10j314
8958C3028j0822N473J9418J0725j2745q366q224n084l835J618l255Q68Q11J537
8944B1147M07N987J4592K538K49j3400q270m613J07j035r056q450K517Q15J0764
8929A4299M728O342q408M431k334j18N274K313o160l548j1193m328O491j589k309
8914C891l824O717J1227Q443m534j150j027j0282M574J2549M991m713q968j0465
8900G429o957J133M543q621j0506j984P660N03M165l311J6473Q585j3051k815
$$ plain form
9002 11362 -336 4072 9987 8256 -4290 -10971 -1559 15352 30161 37453 37267 29661 19191 7651
8988 7651 13961 33688 26905 25160 21989 28981 29475 35830 33964 19920 29276 38086 30249 28642 20759
8973 20759 13285 15198 24374 21177 14085 16559 24024 28018 34589 40712 38707 35219 34032 34342 33028
8958 33028 22206 27679 47097 57822 45077 36711 28487 23403 19568 21186 17931 18799 19610 21147
8944 21147 21554 27541 42133 44671 44920 31520 23250 18637 18744 17709 8653 203 2720 3535 14299
8929 14299 19027 25369 16961 21392 19058 18940 24214 26527 20367 16819 5626 1298 7789 6200 3891
8914 3891 67 6784 18011 26454 21920 20770 19743 9461 14035 26584 31575 26862 17894 7429
8900 7429 472 1605 6148 -2473 -12979 -14963 -7303 -6800 -2635 -5946 10527 19112 6061 3246
8886C246J8648O305k9455O466J2791k959k987L407N663m829p475p088J310k49
8872B794N839l848m933j706r705m585J4044J1430J2692m038O012P802N321j518
8858C5601J1862j710k4085j1664n874n001K982L918O570M837K591L016j1014O569
8844A8598J1470k076p956L418j4509m040o233j997K650K779P551N034L914m59
8830A8144j4699j8586L172m923J9135M055k036J0944o091l069q67J6153P235j1871
8816A6696m113q013N777J1652j495P523N564o650r448k909j8822k486L584J3095
8802I955R175J595L101k222O605n5j8747r096P838K176O280P312l984j6573l28
8787C032J8731M710l472o696o708j2175n113m77j082l627J13J9603N882q152q82
$$ plain form
8886 3246 21894 28199 -1256 5210 18001 15042 12055 15462 21125 16296 8821 1733 3043 2794
8872 2794 8633 4785 -148 -1854 -11559 -16144 -2100 9330 22022 17984 23996 31798 37119 35601
8858 35601 47463 45753 21668 10004 4130 -871 2111 6029 12599 17436 20027 23043 12029 18598
8844 18598 30068 27992 20036 23454 8945 4905 -1328 -3325 -675 2104 9655 14689 18603 18144
8830 18144 3445 -15141 -11969 -16892 2243 6298 4262 15206 9115 6046 5179 21332 28567 16696
8816 16696 12583 4570 10347 21999 20504 28027 33591 26941 17493 14584 -4238 -6724 -3140 9955
8802 9955 19130 20725 23826 21604 28209 28154 9407 311 8149 10325 16605 23917 19933 3360 3032
8787 3032 21763 26473 23001 16305 9597 -2578 -7691 -8168 -9250 -12877 -12764 6839 12721 4569 3687
8772C687j9406K27J5327P649Q135R32m829L020j019R746J6740l795j1752m182
8758B0480j460j2306j781m042M826R379K432J807j3549j0137p107p56l305J1061
8744d458J3711q950l53j117P830R57n981k479l68q86J7301J4824n944K457N58
8729B7102J51J282N047o464J749J067j1414M115o299l473J737Q575M568Q580l563
8714C2760r299J826J241q395P558N239j240j9125j6188M120J5302J6693k527j2445
8700A5520o496j171N593J4207K7521j083j0417r651K71j1413N512J5695P014l717
8686D7385j0536J2284J1983M499J3857J7720J2494J1790J1229O899L003o616j8142
8673A17849j4510q507Q978L1600K6551M4701N6945P6269P2579Q65p2999q7703
$$ plain form
8772 3687 -15719 -15492 -165 7484 15619 16551 11722 14742 13723 23469 40209 36414 24662 20480
8758 20480 19020 6714 4933 891 5717 15096 17528 19335 5786 -4351 -11458 -12214 -15519 -4458
8744 -4458 9253 303 -50 -1167 6663 7620 1639 -840 -1208 -2094 15207 30031 24087 26544 27102
8729 27102 27253 28535 33582 27118 28867 29934 18520 22635 16336 12863 14600 23175 27743 36323 32760
8714 32760 23461 25287 26528 18133 25691 30930 29690 10565 -5623 -1503 13799 30492 27965 15520
8700 15520 9024 7853 13446 27653 55174 54091 43674 34023 34294 22881 28393 44088 51102 47385
8686 47385 36849 49133 61116 65615 79472 97192 109686 121476 132705 139604 142607 135991 117849
8673 117849 103339 94832 103810 135410 161961 206662 263607 339876 412455 413320 340321 252618
8661B52618n8137l6915l4506j8009r662J636L905j453j2851m923m040Q53J4857
8648I3373m630j6439r534O66q523K348P183P65k0749j0813Q544R231Q076o462
8634E3036j8856o207N975J0049M181m833r407j1564J159J2500J7454J1481n161
8621E9807j782m423m535j743J1725R499j0503j3419M342j340Q761O421n506o721
8607E0583K3260L853M522O86N437K684J802n555n117j28q518k0203L273J0065
8593F6644m80p243j3382r559q875j1822K1659Q436O748J731q597k0622l240n622
8579A5776k20L212m247m861p944J719L224P750O955j2563J651J1575J1526N024
8565C8577L433n251p779j4277m208J0235J743k045j5071k522j510k976J621M175
$$ plain form
8661 252618 194481 157566 123060 105051 95389 97025 100930 99477 86626 81703 77663 78516 93373
8648 93373 88743 72304 62770 63436 54913 57261 64444 65209 44460 33647 42191 51422 59498 53036
8634 53036 34180 27973 33948 43997 48178 43345 33938 22374 23533 36033 53487 64968 59807
8621 59807 58025 53602 49067 47324 59049 68548 58045 44626 48968 47628 56389 62810 57304 50583
8607 50583 73843 77696 82218 82904 88341 91025 92827 87272 82155 82027 73509 53306 56579 66644
8593 66644 66164 58921 45539 35980 27105 15283 36942 45378 52126 53857 45260 24638 21398 15776
8579 15776 15556 18768 14521 9660 1716 3435 6659 14409 21364 8801 10452 22027 33553 38577
8565 38577 42010 36759 28980 14703 10495 20730 22473 20428 5357 2835 1325 -1651 -30 4145
8551D145N063L246L954r146q749M097P210L856R243m623L099J1673Q549k325j2553
8536B6739n018l496L839L167j3702j4805L211k444N906K296q887j099J7298J2133
8522B5138L475P81j997q772o217p141K0600R764Q16J0847Q439P411n94J91p699
8507E5042k366o411q875k758k316L398p231q805O180L528o029R848q117m94N721
8492C0315l110k3887p481J1850Q531l010o921p371q76q380K79J6989m09J1041
8478A7560J3664L129j1607n692J2447l454Q236R787N7J2400k595j6380j879q166
8464B7507j975J4489Q375j0267j6439j2461k967M152M163j0512K591O468J418
8451A4542K0502k694l237r901n244N751R574L559q668M2K63n001m0j225k103Q048
$$ plain form
8551 4145 9208 12454 16408 7262 -1487 2610 9820 13676 22919 18296 21395 33068 41617 39292 26739
8536 26739 21721 18225 22064 25231 11529 -3276 -65 -2509 3397 5693 -3194 -4293 13005 25138
8522 25138 28613 29394 27397 18625 12408 5267 25867 35631 36447 47294 55733 63144 62550 62741 55042
8507 55042 52676 46265 37390 34632 32316 35714 28483 19678 25858 29386 23357 33205 25088 24594 30315
8492 30315 27205 3318 -4163 7687 16218 13208 6287 -1084 -1960 -10340 -10061 6928 6519 17560
8478 17560 31224 34353 22746 17054 29501 26047 34283 44070 44127 56527 53932 37552 35673 27507
8464 27507 25532 40021 48396 38129 21690 9229 6262 10414 14577 4065 6656 13124 14542
8451 14542 35044 32350 29113 19212 13968 19719 29293 32852 24184 24226 24489 19488 19448 18223 16120 24168
8435B4168O722j0138N358q000L964P627m203r288j31L57n753r036l25q293n073
8420a2044Q853n872J1268M909o826L997J865j573n83k845Q358M213o663P754L275
8405A8086r171k3K508l44j4810J0939J3641j4350n551j1332J0350J157l999j2251
8391a5150r655N96J4440J5957K01k221j520L306n091J768m140o236l859Q350Q158
8376D904q056R04J0794j1808j1063p984Q376p97J2543J9734L857j0584J638P00
8362A3158P139K758j1553j1896k323q86J243L337M386r405o375p12Q166J6404
8348A3441j036q21k687j2138j2928J1421j804P754Q03J338l329k87O276p95j3132
8333g924m68J3312P580J534m192n846M632N422l118n670q628P726L984M388N236
$$ plain form
8435 24168 30890 20752 26110 18110 22074 29701 25498 16210 16079 16436 10683 1647 1322 -6971 -12044
8420 -12044 -3191 -9063 2205 7114 288 4285 6150 4577 3994 1149 9507 13720 7057 14811 18086
8405 18086 8915 8892 11400 11056 -3754 7185 20826 6476 925 -10407 -57 1100 -2899 -15150
8391 -15150 -24805 -24209 -9769 6188 6389 4168 2648 5954 863 2631 -1509 -7745 -11604 -3254 4904
8376 4904 -3152 -2248 8546 -3262 -14325 -22309 -13933 -14730 -2187 17547 21404 10820 12458 13158
8362 13158 20297 23055 11502 -394 -2717 -3603 -2360 977 5363 -4042 -10417 -11129 -2963 13441
8348 13441 12405 11584 8897 -3241 -16169 -4748 -6552 1202 2005 3343 14 -273 6003 5208 -7924
8333 -7924 -8392 4920 12500 14034 9842 3996 8628 14050 10932 5262 -3366 4360 8344 12732 17968
8318A7968K938l692l486M419k3324m132O922J0958j7163n55j2948p701J1879J3133
8304d784J272J413m548N209L376m307k409Q854m45O004o63K576K729k434j3272
8289a429l188K452j2478J4550Q029k58o008k387R621l314j2940J372K0551P662
8275B2235K159p544j3840J124q561m730M402M432K849R338N773j165n768l61Q899
8260A9242Q429r30o130p700j0524L950j2399r509k050R990n05P854j33O454J644
8245G683J153n82N443P334j3048o823j1567j582Q877K043k782P280k555O129l676
8230C327j1456m833k1967J654Q208K390O648J2189r232r538P630L647k586J6566
8216B647N435m29k626j380n43m164L48k112N403j3883n334J4607p53k27q46L143
$$ plain form
8318 17968 20906 17214 13728 18147 -5177 -9309 -2387 8571 -8592 -9147 -22095 -29796 -17917 -4784
8304 -4784 -3512 -2099 -6647 -1438 1938 -2369 -4778 4076 3631 9635 8972 11548 14277 11843 -1429
8289 -1429 -4617 -2165 -14643 -93 7936 7678 1670 -717 8904 5590 -7350 -5978 14573 22235
8275 22235 24394 16850 3010 4134 -4427 -9157 -4755 -323 2526 11864 17637 16472 10704 10343 19242
8260 19242 27671 26741 20611 12911 2387 6337 -6062 -15571 -17621 -7631 -8136 -282 -415 6039 7683
8245 7683 8836 8254 13697 21031 7983 1160 -10407 -11989 -3112 -1069 -3851 3429 874 7003 3327
8230 3327 -8129 -12962 -34929 -33275 -25067 -22677 -16029 -3840 -13072 -22610 -14980 -11333 -13919 2647
8216 2647 8082 7653 5027 3647 3104 -1060 -712 -2824 2579 -11304 -16638 -2031 -2784 -3011 -3857 -714
8200g14R705J6060j4359r382O918L502m115l472j754j0257K830l86q223M941K761
8185e945O141p243m664O496r002J0525o020j0385N554J2533j0042j0580o188J6462
8171a2358L1238P418k963q720j1467N335m89J46j1339j0589j212Q250L776l368
8157f342J0269J0066r131K054K27j561q821j128O603n685n417m049m64L107P153
8142c119o655p261p12J3902r448o487qJ497N467O143J954j4167M768N523P008
8127a595p371p797N026L809L300O677k115p30P814J0684q189M250n19%K996j0185
8111F055j2815m804O137J5350J1675j1841k6379L033n407N975L1585J7514K418
8098C8496j4109j8992N515L3669M045k8450q147j16m221K36q995k076l888O96
$$ plain form
8200 -714 8991 25051 10692 1310 8228 11730 7615 4143 2389 -7868 -5038 -5424 -13647 -8706 -5945
8185 -5945 196 -7047 -11711 -5215 -14217 -3692 -9712 -20097 -14543 -2010 -12052 -22632 -28820 -12358
8171 -12358 18880 26298 23335 14615 3148 8483 7994 8140 -3199 -13788 -15000 -6750 -2974 -6342
8157 -6342 3927 13993 4862 6916 7143 5582 -3239 -4367 2236 -3449 -8866 -12915 -13379 -10272 -3119
8142 -3119 -9774 -17035 -17747 -3845 -13293 -19780 -19788 -18291 -12824 -6681 -4727 -18894 -14126 -8603 -1595
8127 -1595 -8966 -16763 -11737 -7928 -4628 2049 -66 -796 7018 17702 9513 13763 13244 13244 16240 6055
8111 6055 -6760 -11564 -5427 9923 21598 9757 -16622 -13589 -18996 -13021 18564 36078 38496
8098 38496 24387 5395 10910 44579 48624 20174 12027 11911 7690 7926 -1069 -3145 -7033 -6337
$$ [...]
##END NTUPLES=NMR SPECTRUM
##END=
