##TITLE=Analysis number 324650
Compound Code cc 57826
Book Reference 449/174
Project Code adrs
Chemist Name davee
##JCAMPDX= 6.0         $$ Bruker NMR JCAMP-DX V2.0
##DATA TYPE= NMR SPECTRUM
##DATA CLASS= NTUPLES
##ORIGIN= Bruker BioSpin GmbH
##OWNER= nmr
$$ XWIN-NMR		Version 3.5
$$ Wed Nov 29 10:07:32 2006 GMT Standard Time (UT+0h)  MAYBRIDGE\nmr@NMR_250MHZ
##.OBSERVE FREQUENCY= 250.131544655141
##.OBSERVE NUCLEUS= ^1H
##.ACQUISITION MODE= SIMULTANEOUS (DQD)
##.ACQUISITION SCHEME= undefined
##.AVERAGES= 16
##.DIGITISER RES= 18
##SPECTROMETER/DATA SYSTEM= dpx250
##.PULSE SEQUENCE= zg30
##.SOLVENT NAME= CDCl3
##.SHIFT REFERENCE= (INTERNAL, CDCl3, 0, 16.522)
##AUDIT TRAIL= $$ (NUMBER, WHEN, WHO, WHERE, WHAT)
$$ ##TITLE= Audit trail, XWIN-NMR		Version 3.5
$$ ##JCAMPDX= 5.01
$$ ##ORIGIN= Bruker BioSpin GmbH
$$ ##OWNER= nmr
$$ C:\u/data/dgb/nmr/ADRS/1390/pdata/1/auditp.txt
$$ ##AUDIT TRAIL=  $$ (NUMBER, WHEN, WHO, WHERE, WHAT)
(   1,<2006-11-29 10:06:45.93 +000>,<MAYBRIDGE\nmr>,<NMR_250MHZ>,
      <created by zg, POWCHK disabled, PULCHK disabled
       configuration hash MD5:
       49 4B E0 1D 92 C2 6B 37 9F E6 65 BC 52 41 86 1D
       data hash MD5: 64K
       E0 F7 82 9F A9 1D F3 AA EA DA F8 C4 1D 3E 45 4E>)
(   2,<2006-11-29 10:07:11.35 +000>,<MAYBRIDGE\nmr>,<NMR_250MHZ>,
      <Start of raw data processing
       ef LB = 0.3 FT_mod = 6 PKNL = 1 SI = 32K 
       data hash MD5: 32K
       F2 37 93 3F 0E F5 1F 93 F5 87 0C FA D0 63 F2 06>)
(   3,<2006-11-29 10:07:13.43 +000>,<MAYBRIDGE\nmr>,<NMR_250MHZ>,
      <apk 
       data hash MD5: 32K
       38 77 5B C8 E6 16 2A AA 48 4D 76 3F AC 5C 06 24>)
(   4,<2006-11-29 10:07:14.76 +000>,<MAYBRIDGE\nmr>,<NMR_250MHZ>,
      <abs ABSG = 5 
       data hash MD5: 32K
       71 1F 8D FA 10 A0 64 B4 FC 98 4E 03 2D 41 51 89>)
$$ ##END=
$$ 
$$ hash MD5
$$ 8E A0 71 95 86 AF 28 23 F0 0C F9 50 AB 37 B2 F0
##$RELAX= 
##$RELAX= 
##$RELAX= 
##$RELAX= 
##$RELAX= 
##$RELAX= 
##$RELAX= 
$$ Bruker specific parameters
$$ --------------------------
##$DU= <C:\u>
##$EXPNO= 1390
##$NAME= <ADRS>
##$PROCNO= 1
##$TYPE= <nmr>
##$USER= <dgb>
##$AMP= (0..31)
100 100 100 100 100 100 100 100 100 100 100 100 100 100 100 100 100 100 
100 100 100 100 100 100 100 100 100 100 100 100 100 100 
##$AQSEQ= 0
##$AQ_mod= 3
##$AUNM= <au_zg>
##$AUTOPOS= <4 >
##$BF1= 250.13
##$BF2= 250.13
##$BF3= 250.13
##$BF4= 250.13
##$BF5= 500.13
##$BF6= 500.13
##$BF7= 500.13
##$BF8= 500.13
##$BYTORDA= 1
##$CFDGTYP= 0
##$CFRGTYP= 5
##$CHEMSTR= <none>
##$CNST= (0..31)
1 1 145 1 1 1 1 1 1 1 1 1 1 1 1 1 1 1 1 1 1 1 1 1 1 1 1 1 1 1 1 1 
##$CPDPRG= <>
##$CPDPRG1= <>
##$CPDPRG2= <>
##$CPDPRG3= <>
##$CPDPRG4= <mlev>
##$CPDPRG5= <mlev>
##$CPDPRG6= <mlev>
##$CPDPRG7= <mlev>
##$CPDPRG8= <mlev>
##$CPDPRGB= <>
##$CPDPRGT= <>
##$D= (0..31)
0 1 0 0 0 0 0 0 0 0.06 0 0 0 0 0 0 0.0002 0 0 0 0 0 0 0 0 0 0 0 0 0 0 
0 
##$DATE= 1164794801
##$DBL= (0..7)
120 120 120 120 120 120 120 120 
##$DBP= (0..7)
150 150 150 150 150 150 150 150 
##$DBP07= 0
##$DBPNAM0= <>
##$DBPNAM1= <>
$$ [...]
##$SUBNAM7= <"">
##$SUBNAM8= <"">
##$SUBNAM9= <"">
##$SW= 20.6930455092707
##$SWIBOX= (0..15)
0 0 3 0 0 0 0 0 0 0 0 0 0 0 0 0 
##$SW_h= 5175.983436853
##$TD= 65536
##$TD0= 1
##$TE= 294.16
##$TE2= 300
##$TE3= 300
##$TEG= 300
##$TL= (0..7)
0 120 120 120 120 120 120 120 
##$TP= (0..7)
150 150 150 150 150 150 150 150 
##$TP07= 0
##$TPNAME0= <>
##$TPNAME1= <>
##$TPNAME2= <>
##$TPNAME3= <>
##$TPNAME4= <>
##$TPNAME5= <>
##$TPNAME6= <>
##$TPNAME7= <>
##$TPOAL= (0..7)
0.5 0.5 0.5 0.5 0.5 0.5 0.5 0.5 
##$TPOFFS= (0..7)
0 0 0 0 0 0 0 0 
##$TUNHIN= 0
##$TUNHOUT= 0
##$TUNXOUT= 0
##$USERA1= <user>
##$USERA2= <user>
##$USERA3= <user>
##$USERA4= <user>
##$USERA5= <user>
##$V9= 5
##$VALIST= <valist>
##$VCLIST= <CCCCCCCCCCCCCCC>
##$VD= 0
##$VDLIST= <DDDDDDDDDDDDDDD>
##$VPLIST= <PPPPPPPPPPPPPPP>
##$VTLIST= <TTTTTTTTTTTTTTT>
##$WBST= 1024
##$WBSW= 4
##$XGAIN= (0..3)
0 0 0 0 
##$XL= 0
##$YL= 0
##$YMAX_a= 340900
##$YMIN_a= -376666
##$ZGOPTNS= <>
##$ZL1= 120
##$ZL2= 120
##$ZL3= 120
##$ZL4= 120
##$ABSF1= 16.522
##$ABSF2= -4.171173
##$ABSG= 5
##$ABSL= 3
##$ALPHA= 0
##$AQORDER= 0
##$ASSFAC= 0
##$ASSFACI= 0
##$ASSFACX= 0
##$ASSWID= 0
##$AUNMP= <proc_1d>
##$AZFE= 0.1
##$AZFW= 0.1
##$BCFW= 0
##$BC_mod= 0
##$BYTORDP= 0
##$COROFFS= 0
##$CY= 12.5
##$DATMOD= 1
##$DC= 0
##$DFILT= <>
##$DTYPP= 0
##$F1P= 14.0000005364418
##$F2P= -0.99999901652339
##$FCOR= 0.5
##$FTSIZE= 32768
##$FT_mod= 6
##$GAMMA= 0
##$GB= 0
##$INTBC= 1
##$INTSCL= 1
##$ISEN= 128
##$LB= 0.3
##$LEV0= 0
##$LPBIN= 0
##$MAXI= 10000
##$MC2= 0
##$MEAN= 0
##$ME_mod= 0
##$MI= 0
##$NCOEF= 0
##$NC_proc= -5
##$NLEV= 6
##$NOISF1= 0
##$NOISF2= 0
##$NSP= 0
##$NTH_PI= 0
##$NZP= 0
##$OFFSET= 16.522
##$PC= 1
##$PHC0= 221.6368
##$PHC1= 9.161081
##$PH_mod= 1
##$PKNL= yes
##$PPARMOD= 0
##$PSCAL= 4
##$PSIGN= 0
##$REVERSE= no
##$SF= 250.13
##$SI= 32768
##$SIGF1= 0
##$SIGF2= 0
##$SINO= 400
##$SIOLD= 32768
##$SREGLST= <1H.CDCl3>
##$SSB= 0
##$STSI= 32768
##$STSR= 0
##$SW_p= 5175.98343685301
##$SYMM= 0
##$S_DEV= 0
##$TDeff= 65536
##$TDoff= 0
##$TI= <Analysis number 999999
Compound Code 99
Book Reference 9
Project Code 9>
##$TILT= no
##$TM1= 0
##$TM2= 0
##$TOPLEV= 0
##$USERP1= <user>
##$USERP2= <user>
##$USERP3= <user>
##$USERP4= <user>
##$USERP5= <user>
##$WDW= 1
##$XDIM= 32768
##$YMAX_p= 361619887
##$YMIN_p= -454165
$$ End of Bruker specific parameters
$$ ---------------------------------
##NTUPLES= NMR SPECTRUM
##VAR_NAME=  FREQUENCY,     SPECTRUM/REAL,   SPECTRUM/IMAG
##SYMBOL=    X,             R,               I
##VAR_TYPE=  INDEPENDENT,   DEPENDENT,       DEPENDENT
##VAR_FORM=  AFFN,          ASDF,            ASDF
##VAR_DIM=   32768,         32768,           32768
##UNITS=     HZ,            ARBITRARY UNITS, ARBITRARY UNITS
##FACTOR=    0.157963299565203, 1,           1
##FIRST=     4132.6476996994, 0,             0
##LAST=      -1043.33573715361, 0,           0
##MIN=       -1043.33573715361, -454165,     0
##MAX=       4132.6476996994, 361619887,     0
$$ Real data points
##PAGE= N=1
##DATA TABLE= (X++(R..R)), XYDATA
$$ [...]
$$ plain form
16970 -157430 -118946 -105447 -117352 -91528 -202835 -64744 52762 64062 -20936 -15838 -73409
16959 -73409 -170509 -68482 -115095 -138543 12906 218726 235149 98626 -22024 -58800 -183265
16948 -183265 -254708 -261413 -221711 -153160 -93055 -114889 -120045 -8788 -27764 -118752 -11005
16937 -11005 2283 -92184 -238171 -190369 12253 -6743 -27041 -61225 -113686 -145838 -55032
16926 -55032 127264 117311 12458 8104 33776 -46162 -48718 -93387 -108958 -74190 -95655 -95095
16914 -95095 -53308 -64746 -70146 -14528 30629 70833 48485 63875 42694 6715 -4586 -20583
16902 -20583 87122 144093 140135 -10049 -117247 -129207 -134665 -63082 -77868 -128262 -87720
16891 -87720 -82754 -94003 -1554 35307 41138 24473 58750 33170 -62629 -152100 -75732 62184
$$ packed form
16970a57430L8484J3499j1905K5824j11307J38091J17506J1300q4998N098n7571
16959g3409r7100J02027m6613k3448J51449K05820J6423j36523j20650l6776j24465
16948a83265p1443o705L9702O8551O0105k1834n156J11257j8976r0988J07747
16937a1005J3288r4467j45987M7802K02622j8996k0298l4184n2461l2152R0806
16926e5032J82296r953j04853m354K5672p9938k556m4669j5571L4768k1465N60
16914i5095M1787j1438n400N5618M5157M0204k2348J5390k1181l5979j1301j5997
16902b0583J07705N6971l958j50184j07198j1960n458P1583j4786n0394M0542
16891h7720M966j1249R2449L6861N831j6665L4277k5580r5799q9471P6368J37916
$$ plain form
16879 62184 127204 90610 57222 77361 90047 -3841 -127075 -190602 -160734 -198464 -262004
16868 -262004 -242724 -224597 -154955 -138527 -68250 78834 147165 6952 41606 -17017 -102560
16857 -102560 -73221 -130974 -191735 -121969 -95481 -93159 -87451 -137887 -144645 -157974 -216159 -139967
16845 -139967 -59103 -133392 26556 71352 -77438 -116344 -91283 -155053 -152201 -169705 -172162
16834 -172162 22957 64030 -52038 -135184 -216157 -123281 -20753 367 -29863 -71893 6178
16823 6178 27021 -34677 24299 48938 83439 52480 -126454 -142465 -91736 -165868 -105365 -30287
16811 -30287 -62623 -140156 -144654 -133903 -6203 82923 61699 1660 14175 -29489 55679 131472
16799 131472 117383 107455 53282 1226 -18991 -32808 -50578 -150982 -152999 -81251 1156 -61215
$$ packed form
16879F2184O5020l6594l3388K0139J2686r3888j23234o3527K9868l7730o3540
16868b62004J9280J8127O9642J6428P0277J47084O8331j40213L4654n8623q5543
16857a02560K9339n7753o0761O9766K6488K322N708n0436o758j3329n8185P6192
16845a39967Q0864p4289J59948M4796j48790l8906K5061o3770K852j7504k457
16834a72162J95119M1073j16068q3146q0973R2876J02528K1120l0230m2030P8071
16823F178K0843o1698N8976K4639L4501l0959j78934j6011N0729p4132O0503P5078
16811c0287l2336p7533m498J0751J27700Q9126k1224o0039J2515m3664Q5168P5793
16799A31472j4089r928n4173n2056k0217j3817j7770j00404k017P1748Q2407o2371
$$ plain form
16787 -61215 -105903 -130755 -83199 -146390 -86955 -94153 -161838 -97249 13956 30124 66562 31864
16775 31864 -79301 -79167 -25333 -25088 -119478 -119882 -183404 -150814 -178621 -140441 -136558 -134994 -172915
16762 -172915 -104665 220 105682 21989 -9951 -9374 13448 -9958 -62134 -53054 -59142 7414
16750 7414 82625 -2896 -85286 -205908 -179074 -61738 -57203 -28915 -88016 -53257 -72438 -10595
16738 -10595 14904 29128 45166 147908 118801 -22526 35984 112691 67386 -69339 -62004
16727 -62004 -121027 -79950 29878 68815 35818 -35207 2521 -39049 -51278 78712 95312
16716 95312 -46346 -146626 15256 -18089 43725 -6998 -55489 -8698 -59062 -91245 -139798
16705 -139798 -247792 -223013 -89654 -121618 -124301 -136803 -219297 -158749 -82095 -30610 -129685
$$ packed form
16787f1215m4688k4852M7556o3191N9435p198o7685O4589J11205J6168L6438l4698
16775C1864j11165J34N3834K45r4390m04o3522L2590k7807L8180L883J564l7921
16762a72915O8250J04885J05462q3693l1940N77K2822k3406n2176R080o088O6556
16750G414P5211q5521q2390j20622K6834J17336M535K8288n9101L4759j9181O1843
16738a0595K5499J4224J6038J02742k9107j41327N8510P6707m5305j36725P335
16727f2004n9023M1077J09828L8937l2997p1025L7728m1570j2229J29990J6600
16716I5312j41658j00280J61882l3345O1814n0723m8491M6791n0364l2183m8553
16705a39798j07994K4779J33359l1964k683j2502q2494O0548P6654N1485r9075
$$ plain form
16694 -129685 -237117 -234383 -170632 -148912 -63112 -118128 -253489 -288359 -162099 -133105 -115854
16683 -115854 -84189 -57554 -113306 -201319 -82064 51514 122097 83883 -63700 -80838 -32974
16672 -32974 -57859 34237 192391 142454 33890 -25400 -143529 -143612 -72666 -41621 33741 42949
16660 42949 65521 -17075 -63467 -157748 -247582 -160969 -67101 6550 -166311 -280071 -250066
16649 -250066 -142837 -80133 -170510 -209188 -202290 -309591 -273165 -251754 -98296 19874 -40741
16638 -40741 3820 55306 61039 40692 -16178 44031 -16758 -132333 -130816 37850 113941 135362
16626 135362 86023 42807 -112283 -84881 -93289 -221617 -345913 -345793 -216234 -84956 16804
16615 16804 -4780 -60000 -59954 -96935 -152556 -61044 74864 -56957 -86942 24641 -7121 20102
$$ packed form
16694a29685j07432K734O3751K1720Q5800n5016j35361l4870J26260K8994J7251
16683a15854L1665K6635n5752q8013J19255J33578P0583l8214j47583j7138M7864
16672c2974k4885R2096J58154m9937j08564n9290j18129q3P0946L1045P5362R208
16660D2949K2572q2596m6392r4281q9834Q6613R3868P3651j72861j13760L0005
16649b50066J07229O2704r0377l8678O898j07301L6426K1411J53458J18170o0615
16638d0741M4561N1486N733k0347n6870O0209o0789j15575J517J68666P6091K1421
16626A35362m9339m3216j55090K7402q408j28328j24296J20J29559J31278J01760
16615A6804k1584n5220M6l6981n5621R1512J35908j31821k9985J11583l1762K7223
$$ plain form
16603 20102 -75948 -186156 -218557 -97130 80681 102456 131517 183606 61727 -84856 -118191
16592 -118191 -102820 -66073 27234 -22026 -77978 -87945 -74248 -191387 -226774 -100165 -7586
16581 -7586 -51804 -87868 15298 18368 80423 26389 -55646 -51074 -52065 4357 41310 -101961
16569 -101961 -96113 13292 121694 93174 18028 -55032 21586 92209 74767 68326 -46293
16558 -46293 -139122 -4485 69335 -68689 -158326 -132450 -121640 -149363 -155287 -116901 -96931
16547 -96931 -147182 -88646 23351 57222 1881 17020 -14884 -85142 -260875 -270485 -181001
16536 -181001 -136939 -128955 -152376 -70906 -75596 -94792 -118468 -193938 -134336 -68266 -117172 -91825
16524 -91825 -60266 11779 32621 -1808 -31042 114947 118491 25320 -30386 -190266 -320394
$$ packed form
16603B0102r6050j10208l2401J21427J77811K1775K9061N2089j21879j46583l3335
16592a18191J5371L6747R3307m9260n5952r967J3697j17139l5387J26609R2579
16581g586m4218l6064J03166L070O2055n4034q2035M572r91N6422L6953j43271
16569a01961N848J09405J08402k8520p5146p3060P6618P0623j7442o441j14619
16558d6293r2829J34637P3820j38024q9637K5876J0810k7723n924L8386J9970
16547i6931n0251N8536J11997L3871n5341J5139l1904p0258j75733r610Q9484
16536a81001M4062P984k3421Q1470m690j9196k3676p5470N9602O6070m8906K5347
16524i1825L1559P2045K0842l4429k9234J45989L544r3171n5706j59880j30128
$$ plain form
16513 -320394 -181117 54742 37333 -93177 -226506 -191116 -40783 -44504 -140230 -108675 -137415
16502 -137415 -189764 -159653 -126103 -79056 -49544 33269 -97496 2958 160142 246118 173596
16491 173596 75993 40059 83382 85116 27331 40653 23883 -54253 -47390 -26655 -93026 -46379
16479 -46379 -5945 -49188 10270 27981 -25063 -130833 -67572 -45865 106301 186882 82800
16468 82800 46284 61272 106105 -21230 -118583 -143296 -213087 -169231 -71609 -53768 -53834 -75634
16456 -75634 -133616 -252831 -288020 -256907 -209025 -71568 31921 25419 57754 -11463 -108536
16445 -108536 16238 14375 -73281 -61301 -38868 -2275 63583 45895 80280 58832 42627
16434 42627 51848 26199 54391 81777 40279 -35430 -119309 -142726 -50459 -72724 -85611 -20091
$$ packed form
16513c20394J39277K35859j7409j30510j33329L5390J50333l721r5726L1555k8740
16502a37415n2349L0111L3550M7047K9512Q2813j30765J00454J57184Q5976p2522
16491A73596r7603l5934M3323J734n7785J3322j6770p8136O863K0735o6371M6647
16479d6379M0434m3243N9458J7711n3044j05770O3261K1707J52166Q0581j04082
16468H2800l6516J4988M4833j27335r7353k4713o9791M3856R7622J7841o6k1800
16456g5634n7982j19215l5189L1113M7882J37457J03489o502L2335o9217r7073
16445a08536J24774j863q7656J1980K2433L6593O5858j7688L4385k1448j6205
16434D2627R221k5649K8192K7386m1498p5709q3879k3417R2267k2265j2887O5520
$$ plain form
16422 -20091 -41705 -24638 -45112 -16033 49534 85119 72127 -100678 -172083 -45337 -62918
16411 -62918 -89116 -210045 -141472 -23939 62715 -93218 -125027 -29688 80904 53233 -59561
16400 -59561 -168335 -152638 -102510 -21690 -45851 -88333 -25832 -2565 65642 -5273 -13217 39202
16388 39202 62464 -78863 -171560 -142239 -90303 -29061 -35207 27209 152493 119349 119794 142027
16376 142027 91417 68909 60098 -27779 -78191 -89147 -35269 -45716 -150797 -92477 107738
16365 107738 146930 61482 130380 159443 20238 -71306 -90883 -45448 -27660 632 791 4877
16353 4877 33335 -55397 115838 60241 1945 -33528 -91373 -73162 -100893 -159768 -150415 -86671
16341 -86671 -86943 10950 75200 -24549 -62872 -44166 -54105 -18780 -62629 -67017 -55609 -40561
$$ packed form
16422b0091k1614J7067k0474K9079O5567L5585j2992j72805p1405J26746j7581
16411f2918k6198j20929O8573J17533Q6654j55933l1809R5339J10592k7671j12794
16400e9561j08774J5697N0128Q0820k4161m2482O2501K3267O8207p0915p944N2419
16388C9202K3262j41327r2697K9321N1936O1242o146O2416J25284l3144M45K2233
16376A42027n0610k2508q811q7877n0412j0956N3878j0447j05081N8320K00215
16365A07738L9192q5448O8898K9063j39205r1544j9577M5435J7788K8292J59M086
16353D877K8458q8732J71235n5597n8296l5473n7845J8211k7731n8875R353O3744
16341h6671k72R7893O4250r9749l8323J8706r939L5325m3849m388J1408J5048
$$ plain form
16329 -40561 78704 130457 -5975 29853 97792 144085 186496 262797 120662 -37744 -92056
16318 -92056 -41998 -14384 -21219 -38222 -49366 -33709 -109316 -160735 -214501 -178141 -145666 -96630
16306 -96630 -144767 -324466 -348286 -261310 -240187 -195054 -123908 -86848 -36627 -8909 13149
16295 13149 14746 13799 63069 132193 113128 66619 11724 123066 188249 179248 132539 20323
16283 20323 -22572 27172 -6431 -34678 -9130 61257 194137 137903 49519 -6953 -75009
16272 -75009 -60410 -36145 -15620 134417 102212 40333 -54610 -119734 -33716 -117432 -181063
16261 -181063 -26712 -128563 -106383 -35773 -37869 60175 -19752 -28810 -34803 -5451 -44536 -45407
16249 -45407 -3936 -49103 -112807 -207378 -131430 -73206 -81447 -29372 111550 196736 135379 103201
$$ packed form
16329d0561J19265N1753j36432L5828O7939M6293M2411P6301j42135j58406n4312
16318i2056N0058K7614o835j7003j1144J5657p5607n1419n3766L6360L2475M9036
16306i6630m8137j79699k3820Q6976K1123M5133P1146L7060N0221K7718K2058
16295A3149J597r47M9270O9124j9065m6509n4895J11342O5183r001m6709j12216
16283B0323m2895M9744l3603k8247K5548P0387J32880n6234q8384n6472o8056
16272g5009J4599K4265K0525J50037l2205o1879r4943o5124Q6018q3716o3631
16261a81063J54351j01851K2180P0610k096R8044p9927r058n993K9352l9085q71
16249d5407M1471m5167o3704r4571P5948N8224q241N2075J40922Q5186o1357l2178
$$ plain form
16237 103201 73638 60056 -7455 -672 -57195 -26329 -71800 -174101 -26818 -12147 5879
16226 5879 93225 69235 -13254 -154538 -191971 -112846 -81999 -41209 -60211 -102452 -127308 -178652
16214 -178652 -159064 -92314 -84055 -116512 -150301 -328604 -351752 -143548 97639 93103 34691
16203 34691 -14811 -12743 -73915 -47334 -44753 -25578 -31341 -20828 -29228 -41941 7083 -65018
16191 -65018 -163968 -226072 -145284 -158014 -136473 -94301 -87662 -89814 -109107 -127488 -49775 22425
16179 22425 133 -113832 -211383 -139640 -80556 -173615 -79159 -137494 -96587 28021 92072
16168 92072 133201 224974 186067 208281 261368 245449 109146 -51215 -158768 -137824 -138925
16157 -138925 27862 34856 -25055 -62568 -79522 -100638 -73514 -83438 -41866 -12905 -52881 -203186
$$ packed form
16237A03201k9563j3582o7511O783n6523L0866m5471j02301J47283J4671J8026
16226E879Q7346k3990q2489j41284l7433P9125L0847M0790j9002m2241k4856n1344
16214a78652J9588O6750Q259l2457l3789j78303k3148K08204K41187m536n8412
16203C4691m9502K068o1172K6581K581J9175n763J0513q400j2713M9024p2101
16191f5018r8950o2104Q0788j2730K1541M2172O639k152j9293j8381P7713P2200
16179B2425k2292j13965r7551P1743N9084r3059R4456n8335M0907J24608O4051
16168I2072M1129R1773l8907K2214N3087j5919j36303j60361j07553K0944j101
16157a38925J66787O994n9911l7513j6954k1116K7124r924M1572K8961l9976j50305
$$ plain form
16145 -203186 -143691 -21518 -60270 -91821 -47765 -93663 -85169 -89693 -121503 -142137 -22416
16134 -22416 28461 37707 -37612 -115085 -79749 -105049 -39512 -55593 -163345 -43099 39760
16123 39760 104469 -6369 -135120 -167233 -152140 -143049 -85690 -67772 -114236 -94666 -114841
16112 -114841 -142012 -145189 -130827 -58408 -98637 -135263 -275693 -243933 -113586 -4827 98823
16101 98823 35811 -9680 -21187 -10928 -1256 -45779 -24212 69067 131967 29092 -35944 -95018
16089 -95018 -228034 -220641 -180275 -115281 -3102 -12398 -109695 -183028 -134513 -102337 -94257 -204502
16077 -204502 -275484 -239481 -205787 -257433 -149140 -97798 -91062 -80789 -202894 -237765 -261888
16066 -261888 -317981 -289429 -140826 -88019 15233 -58367 -42673 -83612 -165700 -177890 -271188
$$ packed form
16145b03186N9495J22173l8752l1551M4056m5898Q494m524l1810k0634J19721
16134b2416N0877R246p5319p7473L5336k5300O5537j6081j07752J20246Q2859
16123C9760O4709j10838j28751l2113J5093R091N7359J7918m6464J9570k0175
16112a14841k7171l177J4362P2419m0229l6626j40430L1760J30347J08759J03650
16101I8823o3012m5491j1507J0259R672m4523K1567R3279O2900j02875o5036n9074
16089i5018j33016P393M0366O4994J12179r296r7297p3333M8515L2176Q080j10245
16077b04502p0982L6003L3694n1646J08293N1342O736J0273j22105l4871k4123
16066b61888n6093K8552J48603N2807J03252p3600J5694m0939q2088j2190r3298
$$ plain form
16055 -271188 -218739 -135495 -30068 -7381 -1899 54738 -4121 -116292 -112391 -75993 -32827
16044 -32827 34589 102408 46254 19755 23719 13769 -46687 -98902 -161884 -231759 -151225 14779
16032 14779 169581 225858 124513 100918 16129 -32025 51510 53542 -11928 -48147 108221
16021 108221 104901 38551 -127627 -158133 -77893 -103365 -144188 -70322 -30757 12485 -102339
16010 -102339 -230631 -104164 -65497 3238 -39715 24198 52258 135429 137664 33725 -77438
15999 -77438 -124168 -155743 -40631 -64002 -49111 39267 120830 -36437 -146856 -31208 15609
15988 15609 64949 85312 164257 215764 295037 266026 79334 154378 118215 123413 65272 -69107
15976 -69107 -165606 -129125 -13109 114213 52650 -44811 -72418 -22759 -33463 14593 -28872
$$ packed form
16055b71188N2449Q3244J05427K2687N482N6637n8859j12171L901L6398M3166
16044c2827O7416O7819n6154k6499L964r950o0456n2215o2982o9875Q0534J66004
16032A4779J54802N6277j01345k3595q4789m8154Q3535K032o5470l6219J56368
16021A08221l320o6350j66178l0506Q0240k5472m0823P3866L9565M3242j14824
16010a02339j28292J26467L8667O8735m2953O3913K8060Q3171K235j03939j11163
15999g7438m6730l1575J15112k3371J4891Q8378Q1563j57267j10419J15648M6817
15988A5609M9340K0363P8945N1507P9273k9011j86692P5044l6163N198n8141j34379
15976f9107r6499L6481J16016J27322o1563r7461k7607M9659j0704M8056m3465
$$ plain form
15965 -28872 -235274 -244591 -171963 -125344 -14163 99323 150998 100746 64433 -3024 18130
15954 18130 78314 56886 -13701 -92383 -110958 -70952 -3182 -37207 43285 42675 31556 142965
15942 142965 46935 -91105 -165994 -207193 -157066 -113901 -39387 -76686 -54914 18567 -29940
15931 -29940 -93432 -170061 -132722 -50295 -53508 -107480 -72667 -25941 -29008 -130914 -175836 -115120
15919 -115120 -93466 -65653 53455 53922 15833 65059 -52377 -99525 -44711 -148525 -162417
15908 -162417 -108432 -114058 -96342 14694 84805 81204 125446 309045 302317 271651 107618
15897 107618 -29715 -92959 -139500 -176099 -156636 -144647 -97019 -86290 -206605 -236648 -154528
15886 -154528 -34479 -48320 -125231 -117791 -92355 -221519 -150903 -104243 20831 43404 33189
$$ packed form
15965b8872k06402r317P2628M6619J11181J13486N1675n0252l6313o7457K1154
15954A8130O0184k1428p0587p8682j8575M0006O7770l4025Q0492o10j1119J11409
15942A42965r6030j38040p4889m1199N0127M3165P4514l7299K1772P3481m8507
15931b9940o3492p6629L7339Q2427l213n3972L4813M6726l067j01906m4922O0716
15919a15120K1654K7813J19108M67l8089M9226j17436m7148N4814j03814j3892
15908a62417N3985n626J7716J11036P0111l601M4242J83599o728l0666j64033
15897A07618j37333o3244m6541l6599J9463J1989M7628J0729j20315l0043Q2120
15886a54528J20049j3841p6911P440K5436j29164P0616M6660J25074K2573j0215
$$ plain form
15875 33189 -93376 -101407 13799 8818 53217 73394 -32258 -36852 -21332 69270 58876 -70092
15863 -70092 56244 -39696 -94534 8177 109722 109729 70359 106428 112466 66662 -34633 -77107
15851 -77107 -77531 -139792 -128728 -123835 -34117 9770 -102573 -127892 -60908 -127556 -85574 -72001
15839 -72001 -25535 25830 -3905 -1024 -48302 -117748 -118236 -118270 -199785 -142442 -62699 -11837 -9652
15826 -9652 -22952 -124824 -191046 -199051 -149549 -103312 -332776 -434516 -331483 -130761 -57179
15815 -57179 -37683 -44644 79600 165005 115425 44544 -143661 -221047 -208471 -185253 -20705
15804 -20705 159752 150786 45964 -108183 -226537 -213030 -98229 -101657 -151669 -153441 -36128
15793 -36128 78610 -45599 -119919 -65667 -75631 -67850 -112707 -35770 33474 -26313 37033 114866
$$ packed form
15875C3189j26565q031J15206m981M4399K0177j05652m594J5520R0602j0394j28968
15863g0092J26336r5940n4838J02711J01545Pl9370L6069O038m5804j01295m2474
15851g7107m24o2261J1064M893Q9718M3887j12343k5319O6984o6648M1982J3573
15839g2001M6466N1365k9735K881m7278o9446m88l4q1515N7343P9743N0862K185
15826i652j3300j01872o6222q005M9502M6237k29464j01740J03033K00722P3582
15815e7179J9496o961J24244Q5405m9580p0881j88205p7386J2576K3218J64548
15804b0705J80457q966j04822j54147j18354J3507J14801l428n0012j772J17313
15793c6128J14738j24209p4320N4252r964P781m4857P6937O9244n9787O3346P7833
$$ plain form
15781 114866 20222 -49949 37413 71795 -44677 -5963 -5778 -131249 -198793 -229704 -301131
15770 -301131 -225828 -69236 -62691 45976 88187 119446 62091 -7013 -14785 -37257 -146866
15759 -146866 -133678 -122323 -92310 -4476 88519 111782 -25834 -82497 -23717 -87880 -4913
15748 -4913 79113 57624 75848 -74011 -294753 -406150 -267179 -84453 10263 -36296 -27289
15737 -27289 38198 -46685 -72723 78898 -18233 -89054 -136923 -123004 -115289 -121452 -174486 -211989
15725 -211989 -338487 -303528 -186092 -117226 -125509 -166191 -135467 -154035 -205114 -287114 -213377
15714 -213377 -55380 43669 17214 -34286 -41357 -102962 -66789 -181591 -284607 -222343 -86005
15703 -86005 14746 -22220 -96877 67930 108860 146315 204927 209402 158239 33052 -42547
$$ packed form
15781A14866r4644p0171Q7362L4382j16472L8714J85j25471o7544l0911p1427
15770c01131P5303J56592O545J08667M2211L1259n7355o9104p772k2472j09609
15759a46866J3188J1355L0013Q7834R2995K3263j37616n6663N8780o4163Q2967
15748d913Q4026k1489J8224j49859k20742j11397J38971J82726R4716m6559R007
15737b7289O5487q4883k6038J51621r7131p0821m7869J3919P715o163n3034l7503
15725b11989j26498L4959J17436O8866q283m0682L0724j8568n1079q2000P3737
15714b13377J57997R9049k6455n1500p071o1605L6173j14802j03016O2264J36338
15703h6005J00751l6966p4657J64807M0930L7455N8612M475n1163j25187p5599
$$ plain form
15692 -42547 29457 -25377 -5003 12019 6964 -6938 48209 69515 64185 -54086 -53926 -57183
15680 -57183 -35886 -55852 -46406 57325 125222 91121 50628 -25247 -44432 53666 6510 -19036
15668 -19036 -15722 61810 125276 127332 77824 -10397 -166628 -124454 -159633 -167101 -173730 -164480
15656 -164480 -20459 -112733 -198338 -131404 -87716 -83413 -29405 152417 193928 118771 100207
15645 100207 -7422 -72141 -117816 -86940 71054 155254 110167 75908 96669 108756 118474
15634 118474 97012 16084 -65632 -59043 -103304 -17369 90543 55245 62484 60991 -12402 -56691
15622 -56691 -63994 -2399 -32774 -6805 79876 -9864 -158738 -187519 -169472 -18884 110391
15611 110391 -22771 -206132 -41901 45532 847 -14077 68167 97149 -92526 -154561 -193195
$$ packed form
15692d2547P2004n4834K0374J7022n055j3902N5147K1306n330j18271J60l257
15680e7183K1297j9966R446J03731O7897l4101m0493p5875j9185R8098m7156k5546
15668a9036L314P7532O3466K056m9508q8221j56231M2174l5179p468o629R250
15656a64480J44021r2274q5605O6934M3688M303N4008J81822M1511p5157j8564
15645A00207j07629o4719m5675L0876J57994Q4200m5087l4259K0761J2087R718
15634A18474k1462q0928q1716O589m4261Q5935J07912l5298P239j493p3393m4289
15622e6691p303O1595l0375K5969Q6681q9740j48874k8781J8047J50588J29275
15611A10391j33162j83361J64231Q7433m4685j4924Q2244K8982j89675o2035l8634
$$ plain form
15600 -193195 -168586 -129046 -77158 -62712 -55030 -19724 -55307 -72678 -73693 -88206 -79185 -77424
15588 -77424 -162823 -20198 28411 -61412 -63667 -66494 -184312 -171901 -19823 71335 17134
15577 17134 50671 112201 105772 29188 -29700 -64646 -112688 32940 52757 -70344 -80897
15566 -80897 -46346 26768 -41954 -69064 115962 223733 142981 -106507 -244445 -113293 -72950
15555 -72950 -84344 25132 60374 47494 -13773 -91904 -115719 -69908 48163 172767 -43186
15544 -43186 -167457 -169106 -165380 -61658 72361 19497 -132871 -200976 -102530 -63100 -84739
15533 -84739 2096 -78873 -147352 -102382 -78815 -113718 -46645 -42330 -7004 -17719 -73944 -100357
15521 -100357 -164451 -219877 -220809 -96101 78917 -34696 -3575 117436 19756 -32485 -143538
$$ packed form
15600a93195K4609L9540N1888J4446P682L5306l5583j7371j015j4513R021J761
15588g7424q5399J42625M8609q9823k255k827j17818J2411J52078R1158n4201
15577A7134L3537O1530o429p6584n8888l4946m8042J45628J9817j23101j0553
15566h0897L4551P3114o8722k7110J85026J07771q0752k49488j37938J31152M0343
15555g2950j1394J09476L5242j2880o1267p8131k3815M5811J18071J24604k15953
15544d3186j24271j649L726J03722J34019n2864j52368o8105R8446L9430k1639
15533h4739Q6835q0969o8479M4970K3567l4903O7073M315L5326j0715n6225k6413
15521a00357o4094n5426r32J24708J75018j13613L1121J21011r7680n2241j11053
$$ plain form
15510 -143538 -122829 -129455 -76177 -56461 -82176 -165485 -163395 -126034 -170515 -151037 -231012 -225214
15498 -225214 -202553 -256702 -185404 -144609 -205599 -85983 -22839 -149610 -154476 -86084 -32994
15487 -32994 -49012 -29135 -8356 -1450 -7764 -2767 -30583 -70753 -28159 72548 63898 140665
15475 140665 231118 132001 -102957 -177866 -195162 -231869 -251882 -275645 -114054 -29823 -32871
15464 -32871 2878 21658 -24132 -75768 -137128 -144634 -99442 -21962 -35550 -101647 33561 146811
15452 146811 180821 95714 143 -64983 -67142 -43689 -91136 -266878 -223110 -199497 -138035
15441 -138035 14825 116906 67058 -53311 -123182 -92776 -9547 -66646 -79896 -112003 -63407
15430 -63407 72048 155918 88820 76295 124405 119862 47463 -9282 -157885 -148701 -77866 -85697
$$ packed form
15510a43538K0709o626N3278J9716k5715q3309K090L7361m4481J9478p9975N798
15498b25214K2661n4149P1298M0795o0990J19616O3144j26771m866O8392N3090
15487c2994j6018J9877K0779O906o314M997k7816m0170M2594J00707q650P6767
15475A40665R0453r9117k34958p4909j7296l6707k0013k3763J61591Q4231l048
15464c2871L5749J8780m5790n1636o1360p506M5192P7480j3588o6097J35208J13250
15452A46811L4010q5107r5571o5126k159K3453m7447j75742M3768K3613O1462
15441a38035J52860J02081m9848j20369o9871L0406Q3229n7099j3250l2107M8596
15430f3407J35455Q3870o7098j2525M8110m543p2399n6745j48603R184P0835p831
$$ plain form
15418 -85697 7935 28685 -37419 -73731 -70814 -63212 32307 61360 111162 103313 56692 70195
15406 70195 100972 86033 4664 -45585 -5727 75920 21994 13285 -17613 12511 -48929 -53991
15394 -53991 -57509 -103236 -86267 -80327 -55783 -134665 -133432 -30619 12562 -57201 -60254 -72521
15382 -72521 -19239 44588 -48145 38573 60947 31316 12300 -133860 -206482 -231670 -121473
15371 -121473 -166068 -180904 -125902 -110407 16712 -99691 -245423 -246287 -244812 -282479 -266733
15360 -266733 -282991 -230000 -148201 -141307 -118819 -149187 -94844 -22637 24532 76811 53528 36632
15348 36632 14756 -30223 -26592 52258 49017 57240 61861 -112 -48043 69766 239896 212540
15336 212540 42087 -38732 35645 -20342 -123974 -160895 -233906 -218125 -153462 -125909 -86351
$$ packed form
15418h5697R3632K0750o6104l6312K917P602R5519K9053M9802p849m6621J3503
15406G0195L0777j4939q1369n0249L9858Q1647n3926q709l0898L0124o1440n062
15394e3991l518m5727J6969N940K4544p8882J233J02813M3181o9763l053j2267
15382g2521N3282O3827r2733Q6718K2374k9631j9016j46160p2622k5188J10197
15371a21473m4595j4836N5002J5495J27119j16403j45732q64J475l7667J5746
15360b66733j6258N2991Q1799O894K2488l0368N4343P2207M7169N2279k3283j6896
15348C6632k1876m4979L631P8850l241Q223M621o1973m7931J17809J70130k7356
15336B12540j70453q0819P4377n5987j03632l6921p3011J5781O4663K7553L9558
$$ plain form
15325 -86351 -61977 -63103 -44617 5306 9696 -56910 6461 77566 16139 95018 141442 64132
15313 64132 21146 39802 -74306 -171202 -96899 -32809 25545 -36252 -47737 -30488 93686
15302 93686 130069 53063 22861 57700 50533 171836 219001 223005 279797 200090 60763 19949
15290 19949 45677 -5669 -81881 -59870 -165266 -185584 -89617 -28528 -133 -91770 -43340
15279 -43340 8422 10118 145582 116401 36715 162138 206244 151587 22347 -103607 -126635
15268 -126635 -157847 -32712 78590 87364 51342 31147 -45764 -118839 -83984 -42658 -48441
15257 -48441 -131094 -59692 -2125 68233 47058 -92072 -73938 14073 -7649 -62509 36744
15246 36744 35943 77614 50909 156824 97178 -30063 -36802 19857 -5597 -48636 11560 113962
$$ packed form
15325h6351K4374j126J8486M9923M390o6606O3371P1105o1427P8879M6424p7310
15313F4132m2986J8656j14108r6896P4303O4090N8354o1797j1485J7249J24174
15302I3686L6383p7006l0202L4839p167J21303M7165M004N6792p9707j39327m0814
15290A9949K5728n1346p6212K2011j05396k0318R5967O1089K8395r1637M8430
15279d3340N1762J696J35464k9181p9686J25423M4106n4657j29240j25954k3028
15268a26635l1212J25135J11302Q774l6022k0195p6911p3075L4855M1326n783
15257d8441q2653P1402N7567P0358k1175j39130J8134Q8011k1722n4860R9253
15246C6744q01M1671k6705J05915n9646j27241o739N6659k5454m3039O0196J02402
$$ plain form
15234 113962 9130 -71391 -23499 -22634 37534 78605 115568 94933 -34592 46683 128348
15223 128348 117244 18819 -62296 -26412 -28901 -24507 -164741 -228705 -78061 35020 55122
15212 55122 -38250 -36513 -46941 -106372 -144719 -123925 -43884 -30635 -34591 12323 43834 41359
15200 41359 -22155 -44371 55843 111231 99715 161846 132946 75716 -3935 -87022 -106546
15189 -106546 -148530 -122506 -6956 698 -68741 -111091 -80170 -106514 -46159 14888 -79156
15178 -79156 -96022 -64115 36233 24278 -84054 -200501 -177348 -95426 -86735 -129970 -103969
15167 -103969 -160114 -125857 -128613 -137024 -79130 -77214 -76745 -130945 -178545 -37189 18500 -148768
15155 -148768 -233119 -129201 -57650 -51859 21365 10126 -41882 -125152 -139511 17556 -93
$$ packed form
15234A13962j04832q0521M7892Q65O0168M1071L6963k0635j29525Q1275Q1665
15223A28348j1104r8425q1115L5884k489M394j40234o3964J50644J13081K0102
15212E5122r3372J737j0428n9431l8347K0794Q0041J3249l956M6914L1511k475
15200D1359o3514k2216J00214N5388j1516O2131k8900n7230p9651q3087j9524
15189a06546m1984K6024J15550P654o9439m2350L0921k6344O0355O1047r4044
15178g9156j6866L1907J00348j1955j08332j16447K3153Q1922Q691m3235K6001
15167a03969n6145L4257k756q411N7894J916M69n4200m7600J41356N5689j67268
15155a48768q4351J03918P1551N791P3224j1239n2008q3270j4359J57067j7649
$$ plain form
15144 -93 4168 -65425 18075 166380 183940 122683 42145 -42521 -4625 12417 -7750 -4113
15132 -4113 -50243 -23970 -11431 7125 3751 129723 200064 116636 100960 109056 121537 142040
15120 142040 74064 -2093 90340 136360 113417 -31070 -717 70135 61017 164665 132317
15109 132317 80430 78248 70605 53568 76814 172996 154337 211964 132129 14165 -133569
15098 -133569 -45923 15997 -145939 -99414 -73963 -55377 -28193 -86519 -197084 -183039 -87147
15087 -87147 -92921 8561 20697 51047 31386 43321 6279 -57856 -80220 -107309 55674
15076 55674 61566 -94546 -124478 -8768 38684 31955 68066 15023 53102 -124107 -255056
15065 -255056 -267484 -194021 -146306 -135935 -82122 -80439 -85066 -71933 -83895 -109013 -102811 -135370
$$ packed form
15144i3M261o9593Q3500J48305J7560o1257q0538q4666L7896J7042k0167L637
15132d113m6130K6273J2539J8556l374J25972P0341q3428j5676Q096J2481K0503
15120A42040o7976p6157R2433M6020k2943j44487L0353P0852r118J03648l2348
15109A32317n1887k182p643j7037K3246R6182j8659N7627p9835j17964j47734
15098a33569Q7646O1920j61936M6525K5451J8586K7184n8326j10565J4045R5892
15087h7147n774J01482J2136L0350j9661J1935l7042o4135k2364k7089J62983
15076E5674N892j56112k9932J15710M7452o729L6111n3043L8079j77209j30949
15065b55056j2428P3463M7715J0371N3813J683m627J3133j1962k5118O202l2559
$$ plain form
15053 -135370 -216465 -174695 -6425 -2244 -45774 -144933 -170834 -250207 -190556 -90792 -87736 -33954
15041 -33954 -65756 -30879 -124103 -120984 -140984 -153579 -210439 -278292 -267828 -234195 -299497 -322577
15029 -322577 -300124 -158335 -35443 -60642 -91002 -85757 -8138 38309 66969 10008 -97233
15018 -97233 -204747 -157131 -91106 -122660 -52064 43442 173933 215235 236434 244589 139668
15007 139668 131884 187114 320297 354228 326121 327124 340572 213344 14159 -67530 -106656
14996 -106656 -27611 85622 -18926 -129988 -123724 -121340 -175623 -34228 -23149 87789 146226
14985 146226 71703 36746 40421 -43578 -61922 12475 -2312 -9254 -11819 84922 109532 147729
14973 147729 152200 21626 -123 -56322 -43961 -40166 -60173 -68174 59630 76427 93725 96263
$$ packed form
15053a35370q1095M1770J68270M181m3530r9159k5901p9373N9651R9764L056N3782
15041c3954l1802L4877r3224L119k0000j2595n6860o7853J0464L3633o5302k3080
15029c22577K2453J41789J22892k5199l0360N245P7619M6447K8660n6961j07241
15018i7233j07514M7616O6025l1554P0596R5506J30491M1302K1199Q155j04921
15007A39668p784N5230J33183L3931k8107J003J3448j27228j99185q1689l9126
14996a06656P9045J13233j04548j11062O264K384n4283J41395J1079J10938N8437
14985A46226p4523l4957L675q3999j8344P4397j4787o942k565R6741K4610L8197
14973A47729M471j30574k1749n6199J2361L795k0007q001J27804J6797J7298K538
$$ plain form
14961 96263 38599 1795 125148 307824 279016 148779 -38072 -86347 10471 15704 25728
14950 25728 56239 -11595 -103325 -98511 -117682 -116950 -40147 14388 -6517 -64613 -153597 -64187
14938 -64187 39670 111868 37695 5228 41949 52019 149310 161374 77783 -5130 -152269
14927 -152269 -289881 -126591 44898 78207 -34981 -98359 -190160 -155679 -159829 -221393 -201295
14916 -201295 -162441 -168648 36406 77496 51317 13747 -55291 -23431 -58073 -106755 -27967
14905 -27967 51096 87129 188288 146321 -109334 -171186 -141717 -112564 -18714 -21934 -65785
14894 -65785 -113227 -131806 -284579 -454165 -292715 -159500 -56055 13507 -91327 -117792
14884 -117792 -66945 -98071 -18989 -134852 -210176 -210018 -80156 -51016 -123919 15359 87156
$$ packed form
14961I6263n7664l6804J23353J82676k8808j30237j86851m8275R6818N233J0024
14950B5728L0511o7834r1730M814j9171P32P6803N4535k0905n8096q8984Q9410
14938f4187J03857P2198p4173l2467L6721J0070R7291J2064q3591q2913j47139
14927a52269j37612J63290J71489L3309j13188o3378r1801L4481m150o1564K0098
14916b01295L8854o207K05054M1090k6179l7570o9038L1860l4642m8682P8788
14905b7967P9063L6033J01159m1967k55655o1852K9469K9153R3850l220m3851
14894f5785m7442j8579j52773j69586J61450J33215J03445O9562j04834k6465
14884a17792N0847l1126P9082j15863p5324J58J29862K9140p2903J39278P1797
$$ plain form
14873 87156 54730 57874 95072 2131 -28118 69694 27469 43467 -22878 -29668 -16137 -94751
14861 -94751 -116654 -39369 21779 -8134 4940 -46889 -149787 -144390 -89784 -67706 2297 4880
14849 4880 -75709 -96720 -36798 -30252 -79189 -54134 -52830 22256 236792 138734 36893 8232
14837 8232 36170 160328 237883 160353 81650 17804 32674 87298 40381 -34429 -74396 -132812
14825 -132812 -151188 -141392 -134733 -87795 -94959 -164116 -237539 -256626 -117925 38723 9020 -36831
14813 -36831 -45773 -86722 -98884 -74292 -64425 -65555 -86180 -117055 -102886 -115820 -58463 -80004
14801 -80004 -54984 -67603 -106433 -66947 -120248 -82558 -137929 -40440 36218 60809 102488 89916
14789 89916 56641 61112 64508 13780 -112805 -100202 -47328 22831 120787 118589 154241 154686
$$ packed form
14873H7156l2426L144L7198r2941l0249R7812m2225J5998o6345o790J3531p8614
14861i4751k1903P7285O1148k9913J3074n1829j02898N397N4606K2078P0003K583
14849D880q0589k1011N9922O546m8937K5055J304P5086K14536r8058j01841k8661
14837H232K7938J24158P7555p7530p8703o3846J4870N4624m6917p4810l9967n8416
14825a32812j8376R796O659M6938p164o9157p3423j9087J38701J56648k9703m5851
14813c6831q942m0949j2162K4592R867j130k0625l0875J4169j2934N7357k1541
14801h0004K5020j2619l8830L9486n3301L7690n5371R7489P6658K4591M1679j2572
14789H9916l3275M471L396n0728j26585J2603N2874P0159R7956k198L5652M45
$$ plain form
14777 154686 77878 31826 36432 67591 82648 5824 -48262 -22352 31191 46154 27597 -85608
14765 -85608 -133485 -127630 -79283 -90021 -39121 -60139 -72030 -144782 -194515 -215822 -116318 -185036
14753 -185036 -142801 17198 43713 -68059 -145660 -46420 -11745 -95100 -76638 -26123 58417
14742 58417 108134 148002 7098 2321 56792 93647 112232 -45215 -134718 -60619 -166614
14731 -166614 -117914 -99515 -125062 -159431 -60947 12630 -50848 -67859 -61299 -99964 -98913 -19343
14719 -19343 27897 7214 -35297 45527 3765 -35013 32622 120056 67027 158637 53224
14708 53224 27485 62510 58168 -16622 -27637 -93825 -148323 -76766 -30443 39445 13919 25233
14696 25233 56502 138912 210759 181616 104282 62132 -23848 -66426 -18467 29453 -42396 -153740
$$ packed form
14777A54686p6808m6052M606L1159J5057p6824n4086K5910N3543J4963j8557j13205
14765h5608m7877N855M8347j0738N0900k1018j1891p2752m9733k1307R9504o8718
14753a85036M2235J59999K6515j11772p7601R9240L4675q3355J8462N0515Q4540
14742E8417M9717L9868j40904m777N4471L6855J8585j57447q9503P4099j05995
14731a66614M8700J8399k5547l4369R8484P3577o3478j7011O560l8665J051P9570
14719a9343M7240k0683m2511Q0824m1762l8778O7635Q7434n3029R1610j05413
14708E3224k5739L5025m342p4790j1015o6188n4498P1557M6323O9888k5526J1314
14696B5233L1269Q2410P1847k9143p7334m2150q5980m2578M7959M7920p1849j11344
$$ plain form
14684 -153740 -250709 -179462 -39917 -26776 48146 128172 40118 -36646 -176432 -249941 -294304
14673 -294304 -276845 -230630 -115555 3912 -39267 -39767 -79320 -19541 -63651 -135035 -87965
14662 -87965 -42156 -40053 -46522 -115418 -37408 22773 9717 -80780 -18400 -17270 -25294 56525
14650 56525 60354 -8702 -140184 -157872 -65492 -33297 56270 17980 -53633 -106185 17265
14639 17265 137037 218969 184417 138166 29703 -91298 -21571 -52032 -107890 -146468 -126396
14628 -126396 -139701 -141860 -104403 28223 -11330 -30587 74133 257977 259877 226389 76384
14617 76384 -64871 -76123 -165790 -146059 -64950 -29224 -61237 -48111 26115 10572 -101092
14606 -101092 2550 97591 39866 38457 48315 50346 27875 31423 134500 196349 125052 42292
$$ packed form
14684a53740r6969P1247J39545J3141P4922Q0026q8054p6764j39786p3509m4363
14673b94304J7459M6215J15075J19467m3179n00l9553N9779m4110p1384M7070
14662h7965M5809K103o469o8896P8010O0181j3056r0497O2380J130q024Q1819
14650E6525L829o9056j31482j7688R2380L2195Q9567l8290p1613n2552J23450
14639A7265J19772Q1932l4552m6251j08463j21001O9727l0461n5858l8578K0072
14628a26396j3305k159L7457J32626l9553j9257J04720J83844J900l3488j50005
14617G6384j41255j1252q9667J9731Q1109L5726l2013J3126P4226j5543j11664
14606a01092J03642R5041n7725j409R858K031k2471L548J03077O1849p1297q2760
$$ plain form
14594 42292 29263 60857 -71949 -160867 -74907 26926 633 -11347 -82761 -112169 -43063
14583 -43063 -85245 -127709 -198117 -262485 -203585 22436 77770 23434 -51234 37371 38912 -162027
14571 -162027 -279911 -229648 -193294 -64619 -131435 -188317 -53734 86524 26582 -109241
14561 -109241 -112573 -24346 10308 -43766 -28632 -13330 45794 26691 -18227 -110727 -146345 -37911
14549 -37911 76156 61953 65860 -10878 -89549 -21652 66906 92047 67045 -33504 -119717
14538 -119717 -163719 -108054 -74783 36511 65468 54569 -11443 -104788 -139519 -169708 -143851
14527 -143851 -115216 -183202 -216099 -215752 -168070 -87543 -58854 -45938 -121491 -180515 -127176 -89873
14515 -89873 13038 15450 -31977 -155330 -133692 -105279 -80895 -107395 -151903 -125882 -71152
$$ packed form
14594D2292j3029L1594j32806q8918Q5960J01833k6293j1980p1414k9408O9106
14583d3063m2182m2464p0408o4368N8900K26021N5334n4336p4668Q8605J541k00939
14571a62027j17884N0263L6354J28675o6816n6882J34583J40258n9942j35823
14561a09241l332Q8227L4654n4074J5134J5302N9124j9103m4918r2500l5618J08434
14549c7911J14067j4203L907p6738p8671O7897Q8558K5141k5002j00549q6213
14538a19717m4002N5665L3271J11294K8957j0899o6012r3345l4731l0189K5857
14527a43851K8635o7986l2897L47M7682Q0527K8689J2916p5553n9024N3339L7303
14515h9873J02911K412m7427j23353K1638K8413K4384k6500m4508K6021N4730
$$ plain form
14504 -71152 -103795 -163599 -117509 15109 105126 216608 225059 193189 225418 102902 119798
14493 119798 126371 90760 24007 -5338 -35223 -2270 -4818 -23762 -160976 -190484 -90101
14482 -90101 -97972 -68618 -181664 -130276 87876 106528 52667 62353 106530 12617 -11332 -25780
14470 -25780 46072 129075 150437 150732 9483 -146160 -181196 -185275 -75546 -54304 -1605 -79269
14458 -79269 -107278 -130710 -52758 20543 38446 91414 116843 158217 131373 110604 35099 93291
14446 93291 230431 212720 62768 -13974 -70016 25482 45161 7914 -71596 -105750 -145438
14435 -145438 -124416 -135202 -155778 -133428 -128882 -61923 -40827 50533 52837 -23187 -105624 -171345
14423 -171345 -158374 -199928 -237428 -74626 -107411 -162589 -33330 33726 61234 88643 85120
$$ packed form
14504g1152l2643n9804M6090J32618R0017J11482Q451l1870L2229j22516J6896
14493A19798O573l5611o6753k9345k9885L2953k548j8944j37214k9508J00383
14482i0101p871K9354j13046N1388K18152J8652n3861R686M4177r3913k3949j4448
14470b5780P1852Q3003K1362K95j41249j55643l5036m079J09729K1242N2699p7664
14458g9269k8009k3432P7952P3301J7903N2968K5429M1374k6844k0769p5505N8192
14446I3291J37140j7711j49952p6742n6042R5498J9679l7247p9510l4154l9688
14435a45438K1022j0786k0576K2350M546O6959K1096R1360K304p6024q2437o5721
14423a71345J2971m1554l7500J62802l2785n5178J29259O7056K7508K7409l523
$$ plain form
14412 85120 72263 60588 48903 193730 214848 195666 123393 88450 123212 117176 106846 111983
14400 111983 37299 70288 713 -32319 9054 -10491 -11857 -3420 -5930 119797 23882 -116079
14388 -116079 -183133 -85897 33036 49205 -73957 -146949 -90192 -95711 -94910 -98546 -83489 61211
14376 61211 81800 19842 -34222 -71525 -94795 -159154 -116105 4815 26351 -62919 -42188
14365 -42188 -145371 -200823 -60601 -90429 -145902 -356884 -387890 -329077 -259046 -189429 -66838
14354 -66838 -23587 42854 117811 67249 -5974 -103595 -146332 -73044 -35932 -121962 -138036 -140263
14342 -140263 -159763 -91629 -103561 -102084 -115916 -15396 18328 -46063 -105754 -203731 -192362
14331 -192362 -136700 -184420 -220359 -123004 -108891 -274953 -284374 -150823 -73900 -55140 20537
$$ packed form
14412H5120j2857j1675j1685J44827K1118j9182p2273l4943L4762o036j0330N137
14400A11983p4684L2989o9575l3032M1373j9545j366Q437k510J25727r5915j39961
14388a16079o7054R7236J18933J6169j23162p2992N6757n519Q01l636J5057J44700
14376F1211K0589o1958n4064l7303k3270o4359M3049J20920K1536q9270K0731
14365d2188j03183n5452J40222k9828n5473k10982l1006N8813P0031O9617J22591
14354f6838M3251O6441P4957n0562p3223r7621m2737P3288L7112q6030j6074k227
14342a40263j9500O8134j1932J477j3832J00520L3724o4391n9691r7977J1369
14331a92362N5662m7720l5939R7355J4113j66062r421J33551P6923J8760P5677
$$ plain form
14320 20537 40485 -45595 6766 47106 82640 -35719 -263178 -336749 -210443 -96297 4241
14309 4241 -48536 -108743 -109275 13809 83937 104649 140898 173796 194173 89388 -19374 -52460
14297 -52460 92092 157099 131679 69641 19094 67831 62198 -33777 68317 187620 202154
14286 202154 254227 258170 191243 132563 29494 104289 95394 143234 81603 69796 141702 190616
14274 190616 161599 199707 140182 5068 178392 212830 212138 191701 131186 22152 71453
14263 71453 156895 136683 134222 10880 -37461 -51765 -31738 61189 76957 129656 98695 90823
14251 90823 95273 109018 -10425 -58262 41316 217093 171028 105009 10323 -122770 -191764
14240 -191764 -97869 19367 76769 121237 120817 77933 -11870 -80388 -12251 42177 38005 4933
$$ packed form
14320B0537J9948q6080N2361M0340L5534j18359k27459p3571J26306J14146J00538
14309D241n2777o0207n32J23084P0128K0712L6249L2898K0377j04785j08762l3086
14297e2460J44552O5007k5420o2038n0547M8737n633r5975J02094J19303J4534
14286B02154N2073L943o6927n8680j03069P4795q895M7840o1631j1807P1906M8914
14274A90616k9017L8108n9525j35114J73324L4438o92k0437o0515j09034M9301
14263G1453Q5442k0212k461j23342m8341j4304K0027R2927J5768N2699l0961p872
14251I0823M450J3745j19443m7837R9578J75777m6065o6019r4686j33093o8994
14240a91764R3895J17236N7402M4468m20m2884q9803o8518O8137N4428m172l3072
$$ plain form
14228 4933 24446 7370 -109674 -174871 -137546 -63551 -82397 -99792 -80539 -87629 48802 51665
14216 51665 68790 -20748 -106262 -26604 -40612 -135631 -196995 -311895 -279109 -202458 -106224
14205 -106224 -82217 -56604 16723 1619 -25851 -28904 67910 77480 3229 -111359 -113326 -133852
14193 -133852 -118005 -65115 -86395 -22743 -3925 -75976 -64406 -14370 -134622 -256474 -89101
14182 -89101 12236 41717 -84576 -140767 -125233 -120091 -155206 -154270 -145553 -10747 168620 129569
14170 129569 -26387 -100327 -52282 66563 79616 -7042 -90200 -183821 -160997 -147904 16396
14159 16396 133288 128974 271949 116385 -76160 -92116 -104543 -227366 -68155 93152
14149 93152 56023 -141746 -175029 -29040 54177 -132149 -139391 -89080 -91688 2770 -91221
$$ packed form
14228D933J9513j7076j17044o5197L7325P3995j8846j7395J9253p090J36431K863
14216E1665J7125q9538q5514P9658j4008r5019o1364j14900L2786P6651R6234
14205a06224K4007K5613P3327j5104k7470l053R6814R570p4251j14588j967k0526
14193a33852J5847N2890k1280O3652J8818p2051J1570N0036j20252j21852J67373
14182h9101J01337K9481j26293n6191J5534N142l5115R36Q717J34806J79367l9051
14170A29569j55956p3940M8045J18845J3053q6658q3158r3621K2824J3093J64300
14159A6396J16892m314J42975j55564j92545j5956j2427j22823J59211J61307
14149I3152l7129j97769l3283J45989Q3217j86326p242N0311k608R4458r3991
$$ plain form
14138 -91221 -47553 -24740 5081 30458 44261 -19357 -83090 -66965 25779 20300 -34394 21035
14126 21035 28937 45575 -23067 -68054 -65065 -197785 -228983 -194640 -93504 -59447 -17196 45565
14114 45565 77300 93751 153866 141224 83744 85890 -26824 -10136 40086 -26123 -93538 -162050
14102 -162050 -213306 -179071 -220610 -103221 46011 103626 94524 74842 -14846 -36884 80709
14091 80709 99003 99412 151797 52325 -15740 62231 59107 32185 5578 -72418 -8399 13584
14079 13584 -90354 -185630 -169087 -23638 52398 88093 25825 -25252 -125123 -30613 -63644
14068 -63644 -110172 -184141 -212739 -104712 72598 182363 101369 38974 124190 102048 91624
14057 91624 17383 -69510 -64003 -52626 14926 48567 73948 23989 -62011 -51745 -60566 -98927
$$ packed form
14138i1221M3668K2813K9821K5377J3803o3618o3733J6125R2744n479n4694N5429
14126B1035P902J6638o8642m4987K989j32720l1198L4343J01136L4057M2251O2761
14114D5565L1735J6451O0115j2642n7480K146j12714J6688N0222o6209o7415o8512
14102a62050n1256L4235m1539J17389J49232N7615r102j9682q9688k2038J17593
14091H0709J8294M09N2385r9472o8065P7971l124k6922k6607p7996O4019K1983
14079A3584j03938r5276J6543J45449P6036L5695o2268n1077r9871R4510l3031
14068f3644m6528p3969k8598J08027J77310J09765q0994o2395Q5216k2142j0424
14057I1624p4241q6893N507J1377O7552L3641K5381m9959q6000J0266q821l8361
$$ plain form
14045 -98927 -237972 -176816 -126277 -160288 -89792 -100888 -187355 -88443 -22995 14313 -101994
14034 -101994 -73750 99365 35963 -15336 108191 253569 233296 103724 15783 86485 122675
14023 122675 87000 186266 119166 166375 177329 55113 -4499 -93757 34344 -47258 -11539
14012 -11539 81656 43986 -29349 48385 73740 98886 114255 -32883 -8921 270 -33013 -32668
14000 -32668 -2944 -41814 36404 45001 -48782 -121378 -187111 -239977 -300875 -167587 8113
13989 8113 -15546 -122090 -78355 23900 40902 3774 -30105 -109827 -112156 -79107 -121208 -163247
13977 -163247 -151163 -42030 47825 126809 175913 23723 -33278 20906 54654 125620 98319
13966 98319 71584 -6742 -32188 -91030 -123136 -153404 -87271 -87198 -113151 -70821 18140 96168
$$ packed form
14045i8927j39045O1156N0539l4011P0496j1096q6467R8912O5448L7308j16307
14034a01994K8244J73115o3402n1299J23527J45378k0273j29572q7941P0702L6190
14023A22675l5675R9266o7100M7209J0954j22216n9612q9258J28101q1602L5719
14012a1539R3195l7670p3335P7734K5355K5146J5369j47138K3962R191l3283L45
14000c2668K9724l8870P8218Q597r3783p2596o5733n2866o0898J33288J75700
13989H113k3659j06544M3735J02255J7002l7128l3879p9722k329L3049m2101m2039
13977a63247J2084J09133Q9855P8984M9104j52190n7001N4184L3748P0966k7301
13966I8319k6735p8326k5446n8842l2106l0268O6133P3k5953M2330Q8961P8028
$$ plain form
13954 96168 80746 -12231 29523 45967 42473 19569 20731 94030 44741 76594 -76633 -128148
13942 -128148 -85049 -102108 -144353 -119495 -70586 15354 29979 107764 166657 141938 91904
13931 91904 182570 76420 -82720 -111357 -96819 -36213 85588 73184 45683 84493 76684
13920 76684 -17632 12926 68906 -4591 9319 -8413 70375 211207 147824 48731 56804 68533
13908 68533 48921 46856 32175 -31830 -71018 -47482 -105200 -137233 -2081 69935 29760 12994
13896 12994 161307 101723 -33257 -38363 -46679 -19002 12309 19086 -33967 -22564 -56163 -50540
13884 -50540 -126347 -165015 -81186 -4461 -89677 -107632 -72795 -32201 -829 57316 -81710
13873 -81710 -97283 8712 89238 100653 -4800 -5790 -53662 -61047 -82451 -79202 72748 23743
$$ packed form
13954I6168j5422r2977M1754J6444l494k2904J162P3299m9289L1853j53227n1515
13942a28148M3099j7059m2245K4858M8909Q5940J4625P7785N8893k4719n0034
13931I1904R0666j06150j59140k8637J4538O0606J21801j2404k7501L8810p809
13920G6684r4316L0558N5980p3497J3910j7732P8788J40832o3383r9093Q073J1729
13908F8533j9612k065j4681o4005l9188K3536n7718l2033J35152P2016m0175j6766
13896A2994J48313n9584j34980n106q316K7677L1311O777n3053J1403l3599N623
13884e0540p5807l8668Q3829P6725q5216j7955L4837M0594L1372N8145j39026
13873h1710j5573J05995Q0526J1415j05453r90m7872p385k1404L249J51950m9005
$$ plain form
13861 23743 -18313 -70361 -50699 7472 -15267 79358 152070 -20524 -171476 -197093 -105862
13850 -105862 -32312 89677 -78928 -126432 -96953 -41627 -69993 22256 -52784 -82736 -154247
13839 -154247 -121372 -71620 31118 -18703 -94139 -21466 72712 40809 83568 170806 117508
13828 117508 18615 76628 40573 51699 67025 214000 228757 280806 213220 94643 83766
13817 83766 79832 7191 -64606 80529 151194 95959 110819 129693 94857 22765 53932 129841
13805 129841 74643 8744 144685 171676 40046 -61280 -98222 -12438 -5308 -32772 -2643
13794 -2643 -106232 -145336 -110195 -106442 -74501 9012 135855 80860 182916 195591 42543
13783 42543 51283 166093 231684 67885 11413 131751 155083 147746 22322 -138124 -112886
$$ packed form
13861B3743m2056n2048J9662N8171k2739R4625P2712j72594j50952k5617R1231
13850a05862P3550J21989j68605m7504K9479N5326k8366R2249p5040k9952p1511
13839a54247L2875M9752J02738m9821p5436P2673R4178l1903M2759Q7238n3298
13828A17508r8893N8013l6055J1126J5326J46975J4757N2049o7586j18577j0877
13817H3766l934p2641p1797J45135P0665n5235J4860J8874l4836p2092L1167P5909
13805A29841n5198o5899J35941K6991j31630j01326l6942Q5784P130k7464L0129
13794b643j03589l9104L5141L753L1941Q3513J26843n4995J02056J2675j53048
13783D2543Q740J14810O5591j63799n6472J20338K3332p337j25424j60446K5238
$$ plain form
13772 -112886 -66943 -38192 -95705 -46979 38284 6694 45123 70934 17901 79318 57066
13761 57066 36704 11210 25506 56346 118074 76334 51558 89233 94612 74295 45852 71504
13749 71504 52109 91597 137259 119531 107592 65663 -68522 -68266 -13065 -7976 -13384 -15300
13737 -15300 85783 165186 153362 90543 -4481 -72822 -185718 -199977 -69927 45599 73084
13726 73084 -58805 -242064 -285520 -133137 -54548 34526 65919 -1294 -60275 -33563 -22676
13715 -22676 78810 165594 114949 143815 166597 14714 -96616 -8777 107855 175823 178227
13704 178227 112483 -61209 -250248 -232753 -138367 48824 88001 -11101 -61498 -5352 -51420
13693 -51420 -98276 -50581 -25826 27875 919 -25219 -94183 -43345 -18257 -46471 42232 124490
$$ packed form
13772a12886M5943K8751n7513M8726Q5263l1590L8429K5811n3033O1417k2252
13761E7066k0362k5494J4296L0840O1728m1740k4776L7675N379k0317k8443K5652
13749G1504j9395L9488M5662j7728j1939m1929j34185K56N5201N089n408j916
13737a5300J01083P9403j1824o2819r5024o8341j12896j4259J30050J15526K7485
13726G3084j31889j83259m3456J52383P8589Q9074L1393o7213n8981K6712J0887
13715b2676J01486Q6784n0645K8866K2782j51883j11330Q7839J16632O7968K404
13704A78227o5744j73692j89039J7495R4386J87191L9177r9102n0397N6146m6068
13693e1420m6856M7695K4755N3701k6956k6138o8964N0838K5088k8214Q8703Q2258
$$ plain form
13681 124490 106838 78154 90273 113670 82209 33284 13998 28431 69273 20040 155168
13670 155168 74263 -9093 44207 144277 146093 151129 93215 15112 22275 122164 72456 52889
13658 52889 46809 45420 -70216 -56017 -61882 -10901 69278 99660 7307 -97624 -134830 -71115
13646 -71115 -12155 -42979 -41695 -45753 -49508 -73175 -11741 -119 -64302 -71281 -120250 -23259
13634 -23259 61091 10302 45820 108552 90033 14711 29950 23411 144069 140788 178937 222070
13622 222070 246734 169379 157592 186795 211602 122818 100048 84378 128525 173587 173491 206704
13610 206704 286620 525893 758983 756336 682321 529166 449623 273227 236922 238553 247317
13599 247317 345703 215017 150883 266518 249736 88643 -36964 19299 76896 188240
$$ packed form
13681A24490j7652k8684J2119K3397l1461m8925j9286J4433M0842m9233J35128
13670A55168q0905q3356N3300J00070J816N036n7914p8103P163R9889m9708j9567
13658E2889o080j389j15636J4199n865N0981Q0179L0382r2353j04931l7206O3715
13646g1115N8960l0824J284m058l755k3667O1434J1622o4183o979m8969R6991
13634b3259Q4350n0789L5518O2732j8519p5322J5239o539J20658l281L8149M3133
13622B22070K4664p7355j1787K9203K4807q8784k2770j5670M4147M5062r6L3213
13610B06704P9916K39273K33090k647p4015j53155p9543j76396l6305J631Q764
13599B47317R8386j30686o4134J15635j6782j61093j25607N6263N7597J11344
$$ plain form
13589 188240 128395 74765 283233 261978 98497 73996 37692 -62737 7179 77964 122807
13578 122807 217790 231572 250647 363756 373901 408837 413573 483229 670225 812019 924204
13567 924204 1119146 1413502 1727977 2277943 2942926 3252467 3029660 2179294 1451401 955600
13557 955600 670665 578056 547244 481406 410450 403201 461194 522077 517012 308240 189286
13546 189286 115092 182726 212870 156018 146234 246567 217908 289716 239471 315850 336872
13535 336872 302783 307737 196700 124493 157645 221999 197509 142876 247224 258021 432161
13524 432161 654762 759365 949482 1223998 1469209 1843792 2292973 2823368 2872868 2197693
13514 2197693 1419955 957257 762452 551906 410209 470232 474111 358917 237770 223166
$$ packed form
13589A88240n9845n3630K08468k1255j63481k4501l6304j00429O9916P0785M4843
13578A22807R4983J3782J9075J13109J0145L4936M736O9656J86996J41794J12185
13567I24204J94942K94356L14475N49966O64983L09541k22807q50366p27893m95801
13557I55600k84935r2609l0812o5838p0956p249N7993O0883n065k08772j18954
13546A89286p4194O7634L0144n6852r784J00333k8659P1808n0245P6379K1022
13535C36872l4089M954j11037p2207L3152O4354k4490n4633J04348J0797J74140
13524D32161K22601J04603J90117K74516K45211L74583M49181N30395M9500o75175
13514B197693p77738m62698j94805k10546j41697O0023L879j15194j21147j4604
$$ plain form
13504 223166 244913 131841 157230 209015 229424 171740 53768 70015 135747 53065 65659
13493 65659 113844 160337 75765 141007 262769 185524 103750 -6769 13503 48074 86867
13482 86867 75536 4919 -36951 35445 113209 269797 347670 490152 615099 830729 1081319
13471 1081319 1164562 1007388 754180 481017 288356 273333 220948 96424 41883 -27407
13461 -27407 -73857 -15500 39709 46745 591 -79098 -113764 -46128 33019 81199 83507 81538
13449 81538 -26463 -158825 -147323 -54771 15139 129536 143320 3947 -73316 -45394 -38736
13438 -38736 -24492 955 -51519 21744 205625 206215 284075 223699 90905 162674 229174 197394
13426 197394 131010 73996 147713 136486 63624 -16643 119215 223880 115752 116781 67196
$$ packed form
13504B23166K1747j13072K5389N1785K0409n7684j17972J6247O5732q2682J2594
13493F5659M8185M6493q4572O5242J21762p7245q1774j10519K0272L4571L8793
13482H6867j1331p0617m1870P2396P7764J56588P7873J42482J24947K15630K50590
13471A081319Q3243j57174k53208k73163j92661j5023n2385j24524n4541o9290
13461b7407m6450N8357N5209P036m6154p9689l4666O7636P9147M8180K308j969
13449H1538j08001j32362J1502R2552O9910J14397J3784j39373p7263K7922O658
13438c8736J4244K5447n2474P3263J83881N90P7860o0376j32794P1769O6500l1780
13426A97394o6384n7014P3717j1227p2862q0267J35858J04665j08128J029m9585
$$ plain form
13415 67196 47323 89836 125873 34485 106 154577 221917 115105 83017 116818 222661
13404 222661 165024 92958 87770 98230 106623 17591 84073 193051 128273 228590 325744
13393 325744 338988 142973 70897 239654 261801 274814 152025 65872 -133189 -240465
13383 -240465 -153992 -14507 88562 152983 159006 168907 254174 255984 134597 34848 32949 86186
13371 86186 38610 33387 9386 -39977 99760 199001 132244 142175 139782 156327 121184 102100
13359 102100 54968 21206 56991 32988 7789 -95447 -114384 -65490 16274 80921 110874
13348 110874 126287 76829 24490 29698 122412 128523 131567 5131 -32743 80291 73907 -38214
13336 -38214 -18470 -26934 -59892 -66739 4903 81815 12663 -115097 -121410 -83783 -13420 47989
$$ packed form
13415F7196j9873M2513L6037r1388l4379J54471O7340j06812l2088L3801J05843
13404B22661n7637p2066n188J0460Q393q9032O6482J08978o4778J00317R7154
13393C25744J3244j96015p2076J68757K2147J3013j22789q6153j99061j07276
13383b40465Q6473J39485J03069O4421O023R901Q5267J810j21387r9749j899N3237
13371H6186m7576n223k4001m9363J39737R9241o6757R931k393J6545l5143j9084
13359A02100m7132l3762L5785k4003k5199j03236j8937M8894Q1764O4647K9953
13348A10874J5413m9458n2339N208R2714O111L044j26436l7874J13034o384j12121
13336c8214J9744q464l2958o847P1642P6912o9152j27760o313L7627P0363O1409
$$ plain form
13324 47989 10107 -41077 -2079 -28929 19918 85758 53142 -19533 -28853 -36693 -42859 38278
13312 38278 73076 65816 -26895 19573 -31798 -76598 -55106 -444 13849 -8192 -68678 -36443
13300 -36443 46829 179156 202603 196590 186523 227905 98377 -12342 -40758 -59368 -79238
13289 -79238 -144716 -62252 123670 83006 -70186 -88087 -30415 102271 35189 -99898 -106470
13278 -106470 -46090 -21897 89917 72560 54421 71003 119225 134837 120217 94491 46076
13267 46076 32476 50558 261350 407899 151416 -156604 -266839 -203608 -134719 -49866 -48562
13256 -48562 872 136132 219728 218033 168094 179730 214205 164327 131001 104565 106231 68047
13244 68047 36874 30432 25093 37841 -18134 54836 131062 82846 54540 9485 -26952 -45953
$$ packed form
13324D7989l7882n1184L8998k6850M8847O5840l2616p2675r320p840o166Q1137
13312C8278L4798p260r2711M6468n1371m4800K1492N4662J4293k2041o0486L2235
13300c6443Q3272J32327K3447o013j0067M1382j29528j10719k8416j8610j9870
13289g9238o5478Q2464J85922m0664j53192j7901N7672J32686o7082j35087o572
13278a06470O0380K4193J11814j7357j8139J6582M8222J5612j4620k5726m8415
13267D6076j3600J8082K10792J46549k56483l08020j10235O3231O8889Q4853J304
13256d8562M9434J35260Q3596j695m9939J1636L4475m9878l3326k6436J666l8184
13244F8047l1173o442n339J2748n5975P2970P6226m8216k8306m5055l6437j9001
$$ plain form
13232 -45953 -100661 -120967 -39267 -12560 -17586 74287 25045 143203 257865 317011 329611
13221 329611 315891 417127 443065 248753 281176 386172 601232 618494 674063 900833
13211 900833 1061714 1203999 1352845 1616131 1628444 1588737 1536606 1406604 1233177 1083045
13201 1083045 954378 961183 784194 867781 1036282 1103049 1039686 1036494 1037459 1025052 1161617
13190 1161617 1305580 1341534 1323424 1391307 1520911 1530028 1395587 1324158 1341638 1476383 1551416
13179 1551416 1709523 1917418 1926737 1874043 1735824 1569980 1452604 1402864 1376727 1306526
13169 1306526 1214483 1236382 1118061 1053544 1101244 1024678 960159 966666 1007433 1148401 1133209
13158 1133209 914294 917123 1002685 1194091 1323800 1371462 1408554 1554304 1715116 1708587 1568870
$$ packed form
13232d5953n4708k0306Q1700K6707n026R1873m9242J18158J14662N9146J2600
13221C29611j3720J01236K5938j94312L2423J04996K15060J7262N5569K26770
13211I00833J60881J42285J48846K63286J2313l9707n2131j30002j73427j50132
13201A083045j28667O805j76989Q3587J68501O6767o3363l192R65j2407J36565
13190A161617J43963L5954j8110O7883J29604R117j34441p1429J7480J34745P5033
13179A551416J58107K07895R319n2694j38219j65844j17376m9740k6137p0201
13169A306526r2043K1899j18321o4517M7700p6566o4519O507M0767J40968j5192
13158A133209k18915K829Q5562J91406J29709M7662L7092J45750J60812o529j39717
$$ plain form
13147 1568870 1603777 1596288 1333056 954801 710505 647669 571541 399808 414035 415314 459655
13136 459655 465901 424317 393549 454268 352626 217686 212884 203203 91731 163648 268552
13125 268552 158336 -76096 -63839 87708 79799 25095 -16852 -17012 111625 152637 109186
13114 109186 149888 104902 84576 100496 37596 53366 127922 184051 281578 277557 174690
13103 174690 228811 168067 90001 78291 99963 51337 17628 9258 127012 183759 112852
13092 112852 114201 174247 181033 138348 146049 244321 305031 187147 156947 84388 4785 -47673
13080 -47673 -149634 -118078 -11846 161325 304398 276341 213341 171516 167309 241337 292333
13069 292333 258821 275037 223720 95960 89733 123751 101517 99145 205533 227530 120507
$$ packed form
13147A568870L4907p489k63232l78255k44296o2836p6128j71733J4227J279M4341
13136D59655O246m1584l0768O0719j01642j34940m802r681j11472P1917J04904
13125B68552j10216k34432J2257J51547p909n4704m1947j60J28637M1012m3451
13114A09186M0702m4986k0326J5920o2900J5770P4556N6129R7527m021j02867
13103A74690N4121o0744p8066j1710K1672m8626l3709q370J17754N6747p0907
13092A12852J349O0046O786m2685P701R8272O0710j17884l0200p2559p9603n2458
13080d7673j01961L1556J06232J73171J43073k8057o3000m1825m207P4028N0996
13069B92333l3512J6216n1317j27760o227L4018k2234k372J06388K1997j07023
$$ plain form
13058 120507 47979 126107 188246 215945 227973 247661 329362 225221 151331 259381 323755
13047 323755 291309 259360 261610 339700 365403 423355 411409 321451 313553 384892 407039 219055
13035 219055 84861 169447 208457 201092 173116 236253 267256 257435 378679 453742 264541
13024 264541 215455 260730 233446 155285 300284 329736 309480 358515 331404 418790 446482
13013 446482 519405 588687 513175 323945 223590 323778 376668 431537 515666 526679 409980
13002 409980 297609 386060 520320 655030 639889 574610 518884 573776 655850 677375 632085
12991 632085 676336 791388 857013 881415 1053875 1041853 897604 811969 892205 907539 959151
12980 959151 1088746 1177260 1124019 1131119 1140345 1190824 1114250 1215536 1449459 1617023 1799916
$$ packed form
13058A20507p2528P8128O2139K7699J2028J9688Q1701j04141p3890J08050O4374
13047C23755l2446l1949K250P8090K5703N7952j1946q9958p898P1339K2147j87984
13035B19055j34194Q4586L9010p365k7976O3137L1003r821J21244P5063j89201
13024B64541m9086M5275k7284p8161J44999K9452k0256M9035k7111Q7386K7692
13013D46482P2923O9282p5512j89230j00355J00188N2890N4869Q4129J1013j16699
13002D09980j12371Q8451J34260J34710j5141o5279n5726N4892Q2074K1525m5290
12991F32085M4251J15052O5625K4402J72460j2022j44249q5635Q0236J5334N1612
12980I59151J29595Q8514n3241P100R226N0479p6574J01286K33923J67564J82893
$$ plain form
12969 1799916 1800888 1796749 2025067 2196333 2376246 2593638 2788799 2991679 3295849 3719353
12959 3719353 4110851 4676417 5244380 5741195 6263607 6728960 6987817 6979828 6871409 6546344
12949 6546344 6103668 5753010 5330965 5007129 4774818 4672991 4655810 4589797 4697211 4822127
12939 4822127 5087126 5319741 5537637 5817473 6098040 6404362 6717722 7006104 7250081
12930 7250081 7553329 7833401 8047930 8019904 8113983 8171916 8109770 7953380 7828769 7834555
12920 7834555 7710537 7551585 7430397 7117808 6902411 6612477 6260543 6010673 5764812
12911 5764812 5519170 5445980 5389924 5254233 5062740 4925818 4956080 5057294 5259558 5253575
12901 5253575 5342892 5548571 5766420 5977400 6196549 6490556 6689526 6749669 6663715 6355704
$$ packed form
12969A799916R72m139K28318J71266J79913K17392J95161K02880L04170M23504
12959C719353L91498N65566N67963M96815N22412M65353K58857p989j08419l25065
12949F546344m42676l50658m22045l23836k32311j01827j7181o6013J07414J24916
12939D822127K64999K32615K17896K79836K80567L06322L13360K88382K43977
12930G250081L03248K80072K14529k8026R4079N7933o2146j56390j24611N786
12920G834555j24018j58952j21188l12589k15397k89934l51934k49870k45861
12911E764812k45642p3190n6056j35691j91493j36922L0262J01214K02264n983
12901E253575Q9317K05679K17849K10980K19149K94007J98970O0143q5954l08011
$$ plain form
12891 6355704 5905111 5471843 5055572 4628451 4308943 3962672 3542655 3198681 2922227
12882 2922227 2737261 2571980 2573543 2656088 2744393 2604099 2586064 2662478 2596247 2582801 2534268
12871 2534268 2438888 2344859 2257308 2095133 1933698 1822127 1848154 1798035 1793352 1747937 1676557
12860 1676557 1634412 1659961 1717781 1687718 1638116 1762174 1883692 1902490 1888003 1751658 1690578
12849 1690578 1695609 1817037 1883257 1874039 1927335 1883561 1838300 1900529 1997926 2016173 2022468 2043946
12837 2043946 2091588 2024696 1990551 1960304 2007235 2007300 2106347 2213511 2103247 2243921 2463104
12826 2463104 2518833 2463206 2372352 2195880 2340070 2492429 2579143 2844889 2966527 3039636
12816 3039636 3122458 3317051 3506328 3700645 3886208 3906830 4014223 4111771 4010777 3908109
$$ packed form
12891F355704m50593m33268m16271m27121l19508l46271m20017l43974k76454
12882B922227j84966j65281J563Q2545Q8305j40294j8035P6414o6231j3446m8533
12871B534268r5380r4029q7551j62175j61435j11571K6027n0119m683m5415p1380
12860A676557m2145K5549N7820l0063m9602J24058J21518J8798j4487j36345o1080
12849A690578N031J21428O6220r218N3296m3774m5261O2229R7397J8247O295K1478
12837B043946M7642o6892l4145l0247M6931O5R9047J07164j10264J40674K19183
12826B463104N5729n5627r0854j76472J44190J52359Q6714K65746J21638P3109
12816C039636Q2822J94593J89277J94317J85563K0622J07393R7548j00994j02668
$$ plain form
12806 3908109 3877402 3899215 3935116 4054607 4120862 4121369 4168552 4418931 4502600 4592965 4824205
12795 4824205 5081516 5229580 5426469 5777134 6192485 6569602 6844609 7159445 7586174
12786 7586174 8044608 8513365 9091187 9777320 10480452 11377747 12346644 13369345 14539299
12777 14539299 15788836 17333404 19098265 21186319 23624904 26431655 29839861 33914123
12769 33914123 38366740 43281967 48999164 55625992 62994860 71475302 81410291 93321702
12761 93321702 107951357 126300002 148795588 175840034 207003716 240576319 273106247
12754 273106247 299011933 311615590 306454009 285489814 255967242 225658649 199251551
12747 199251551 178955812 165230496 157532620 155081284 157401904 163738372 173307404 185137637
$$ packed form
12806C908109l0707K1813L5901J19491O6255N07M7183K50379Q3669R0365K31240
12795D824205K57311J48064J96889L50665M15351L77117K75007L14836M26729
12786G586174M58434M68757N77822O86133P03132Q97295R68897J022701J169954
12777A4539299J249537J544568J764861K088054K438585K806751L408206M074262
12769C3914123M452617M915227N717197O626828P368868Q480442R934989J1911411
12761I3321702J4629655J8348645K2495586K7044446L1163682L3572603L2529928
12754B73106247K5905686J2603657n161581k0964195k9522572l0308593k6407098
12747A99251551k0295739j3725316p697876k451336K320620O336468R569032J1830233
$$ plain form
12739 185137637 198218036 211215611 223299590 234149919 243748932 252136348 259588487
12732 259588487 266797184 274581971 283923359 295920625 310498628 326319424 340769321
12725 340769321 350219427 351919816 344317299 328641398 308639152 288320500 270622367
12718 270622367 257016860 247598168 241797860 238415380 236190000 233874692 230532730 225523906
12710 225523906 219054997 211633898 203368722 194509543 186306489 179841974 176800934 178055496
12702 178055496 184444634 196631058 214754562 238579674 266833666 296315375 321967094
12695 321967094 336868983 334767336 313311855 276728172 233746419 192137935 156173129
12688 156173129 126739721 103509884 85594225 71771827 60808988 52228463 45500283
$$ packed form
12739A85137637J3080399J2997575J2083979J0850329R599013Q387416P452139
12732B59588487P208697P784787R341388J1997266J4578003J5820796J4449897
12725C40769321R450106J700389p602517j5675901k0002246k0318652j7698133
12718B70622367j3605507r418692n800308l382480k225380k315308l341962n008824
12710B25523906o468909p421099q265176q859179q203054o464515l041040J254562
12702A78055496O389138J2186424J8123504K3825112K8253992K9481709K5651719
12695C21967094J4901889k101647k1455481l6583683m2981753m1608484l5964806
12688A56173129k9433408k3229837j7915659j3822398j0962839q580525o728180
$$ plain form
12681 45500283 40080788 35621917 31870290 28566634 25699396 23154675 20953134 18936523
12673 18936523 17152604 15700335 14532178 13411465 12421897 11526624 10800943 10169511 9587151
12664 9587151 9048084 8658708 8229959 7892932 7567746 7119327 6708793 6343467 6044999
12655 6044999 5774867 5460261 5271060 5097185 4775027 4473100 4290945 4055493 3941686
12646 3941686 3769997 3634405 3514073 3498987 3421305 3242612 3128232 3002666 2967488 2909444
12636 2909444 2886784 2809121 2693062 2607437 2482017 2441267 2360873 2297517 2368346 2224073 2075704
12625 2075704 2151603 2209236 2156299 2121705 2115196 1985458 1761292 1768859 1779846 1731440 1654629
12614 1654629 1647187 1593839 1573443 1553057 1550011 1589775 1422857 1319878 1327523 1335069 1384854 1303531
$$ packed form
12681D5500283n419495m458871l751627l303656k867238k544721k201541k016611
12673A8936523j783919j452269j168157j120713r89568q95273p25681o31432n82360
12664I587151n39067l89376m28749l37027l25186m48419m10534l65326k98468
12655F044999k70132l14606j89201j73875l22158l01927j82155k35452j13807
12646C941686j71689j35592j20332j5086p7682j78693j14380j25566l5178n8044
12636B909444k2660p7663j16059q5625j25420m0750q0394o3356P0829j44273j48369
12625B075704P5899N7633n2937l4594o509j29738k24166P567J0987m8406p6811
12614A654629p442n3348k0396k0386l046L9764j66918j02979P645P546M9785q1323
$$ plain form
12602 1303531 1310005 1312764 1338510 1304144 1362909 1394338 1395607 1418773 1457865 1489672 1431746 1460430
12590 1460430 1566862 1673554 1664634 1672368 1747815 1762004 1761424 1795974 1786730 1800763 1907090 2002581
12578 2002581 2152420 2141772 2237715 2200295 2097887 2047612 1923142 1793641 1752114 1673913
12568 1673913 1644166 1556182 1577180 1549817 1562538 1517523 1532883 1442004 1301230 1336468 1409981
12557 1409981 1447672 1540480 1658237 1596796 1610743 1554301 1518127 1483999 1408649 1364250 1347395
12546 1347395 1411948 1573364 1770382 1958543 1943291 1694952 1599417 1660327 1530801 1388756
12536 1388756 1234359 1212510 1169230 1092192 1073710 1180183 1119675 1114320 1056712 1087873 1143534
12525 1143534 1054471 989599 1011768 1070292 1094744 1220983 1362641 1281608 1290699 1332023 1320994
$$ packed form
12602A303531O474K759K5746l4366N8765L1429J269K3166L9092L1807n7926K8684
12590A460430J06432J06692q920P734P5447J4189n80L4550r244J4033J06327R5491
12578B002581J49839j0648R5943l7420j02408n0275j24470j29501m1527p8201
12568A673913k9747q7984K0998k7363J2721m5015J5360r0879j40774L5238P3513
12557A409981L7691R2808J17757o1441J3947n6442l6174l4128p5350m4399j6855
12546A347395O4553J61416J97018J88161j5252k48339r5535O0910j29526j42045
12536A388756j54397k1849m3280p7038j8482J06473o0508n355n7608L1161N5661
12525A143534q9063o4872K2169N8524K4452J26239J41658q1033R091M1324j1029
$$ plain form
12514 1320994 1327475 1524334 1702982 1840351 1789400 1675943 1684476 1648088 1583503 1465875 1436885
12503 1436885 1407239 1463473 1582458 1634761 1624433 1718821 1708697 1738257 1532580 1319766 1075403
12492 1075403 903930 840529 897291 859007 734722 633368 633995 688350 748079 922438 979484
12481 979484 922445 866440 903364 949023 1011987 1054267 988964 883945 884756 980091 1001643 1116169
12469 1116169 1208561 1342705 1428940 1551120 1572090 1336132 1220667 1046461 918864 855650
12459 855650 691993 720863 777635 888995 889766 827897 743073 775387 829659 710315 627027
12448 627027 622587 504987 453521 552553 714421 728611 632822 645269 672205 614114 563433
12437 563433 651825 556370 493261 503850 710254 676857 656441 620455 673484 768131 709932
$$ packed form
12514A320994O481J96859J78648J37369n0951j13457Q533l6388o4585j17628k8990
12503A436885k9646N6234J18985N2303j0328R4388j0124K9560k05677k12814k44363
12492A075403j71473o3401N6762l8284j24285j01354O27N4355N9729J74359N7046
12481I79484n7039n6005L6924M5659O2964M2280o5303j05019Q11R5335K1552J14526
12469A116169R2392J34144Q6235J22180K0970k35958j15465j74206j27597o3214
12459H55650j63657K8870N6772J11360P71o1869q4824L2314N4272j19344q3288
12448F27027m440j17600n1466R9032J61868J4190r5789J2447K6936n8091n0681
12437E63433Q8392r5455o3109J0589K06404l3397k0416l5986N3029R4647n8199
$$ plain form
12426 709932 637873 602252 656977 832321 890799 759435 623952 643140 689087 642731 614613
12415 614613 464062 319599 323609 365811 380877 424356 366138 326033 172372 182533 153188
12404 153188 207871 257229 208677 129027 126567 187485 209438 315117 370001 350893 332398
12393 332398 324880 435077 473020 336544 231269 295296 396113 432536 482429 650591 590977
12382 590977 438293 412795 363660 340552 226993 287866 240115 232632 183125 211252 232423
12371 232423 266559 287432 240527 263709 231210 251531 359703 400357 432372 317107 319065
12360 319065 216443 183694 199219 125411 240638 318099 383674 415625 393308 362872 367532
12349 367532 187400 174791 284487 389890 347339 253648 253396 187108 80960 70493 64538
$$ packed form
12426G09932p2059l5621N4725J75344N8478j31364j35483J9188M5947m6356k8118
12415F14613j50551j44463M010M2202J5066M3479n8218m0105j53661J0161k9345
12404A53188N4683M9358m8552p9650k460O0918K1953J05679N4884j9108j8495
12393C32398p518J10197L7943j36476j05275O4027J00817L6423M9893J68162n9614
12382E90977j52684k5498m9135k3108j13559O0873m7751p483m9507K8127K1171
12371B32423L4136K0873m6905K3182l2499K0321J08172M0654L2015j15265J958
12360C19065j02622l2749J5525p3808J15227P7461O5575L1951k2317l0436M660
12349C67532j80132j2609J09696J05403m2551r3691k52o6288j06148j0467n955
$$ plain form
12338 64538 -24872 13374 82624 172708 218596 230790 225563 205657 118082 44913 132842 119800
12326 119800 132692 137091 204738 211404 212839 304469 421188 490038 391884 191041 115505 162929
12314 162929 294498 330709 238864 167935 157385 303828 481524 495932 623007 696865 622907
12303 622907 506781 573436 614405 652132 807696 1099431 1176729 1193493 1271721 1343432 1444072
12292 1444072 1473029 1476003 1357875 1227066 1214901 1220049 1104528 921942 853448 902825 869979
12281 869979 971828 1054173 1095287 1172899 1372048 1496022 1641139 1605275 1632611 1720184 1696814
12270 1696814 1773082 1821858 1829786 1808546 1876197 2024464 1988855 1842413 1746322 1697347 1689604
12259 1689604 1521527 1445190 1389719 1494088 1434899 1412318 1472659 1508260 1457820 1435184 1385003
$$ packed form
12338F4538q9410L8246O9250R0084M5888J2194n227j9906q7575p3169Q7929j3042
12326A19800J2892M399O7647O666J435R1630J16719O8850r8154k00843p5536M7424
12314A62929J31569L6211r1845p0929j0550J46443J77696J4408J27075P3858p3958
12303F22907j16126O6655M0969L7727J55564K91735P7298J6764P8228P1711J00640
12292A444072K8957K974j18128j30809j2165N148j15521j82586o8494M9377l2846
12281H69979J01849Q2345M1114P7612J99149J23974J45117l5864K7336Q7573k3370
12270A696814P6268M8776P928k1240O7651J48267l5609j46442r6091m8975p743
12259A689604j68077p6337n5471J04369n9189k2581O0341L5601n0440k2636n0181
$$ plain form
12248 1385003 1352294 1260997 1090775 999204 1065758 1160599 1322947 1296911 1399373 1537986
12238 1537986 1641169 1755444 1795946 1843623 1953725 1839260 1637374 1488444 1295987 1157011
12228 1157011 1017139 916322 802699 657789 510340 472160 453387 406025 359390 389615
12218 389615 370960 360841 215017 154296 56530 132372 226477 229079 166951 164172 195202 266516
12206 266516 245110 260947 301304 338279 356540 469772 491804 359791 176943 88589 51188
12195 51188 8568 92623 231463 341616 246247 158727 167829 180891 210610 186762 194446 45991
12183 45991 34636 8289 36237 56277 191221 228031 120326 176919 228534 304240 286336
12172 286336 301849 288052 143800 218587 338610 367267 286310 223499 186017 152826 242954
$$ packed form
12248A385003l2709r1297j70222r1571O6554R4841J62348k6036J02462J38613
12238A537986J03183J14275M0502M7677J10102j14465k01886j48930j92457j38976
12228A157011j39872j00817j13623j44910j47449l8180j8773m7362m6635L0225
12218C89615j8655j0119j45824o0721r7766P5842R4105K602o2128k779L1030P1314
12206B66516k1406J5837M0357L6975J8261J13232K2032j32013j82848q8354l7401
12195E1188m2620Q4055J38840J10153r5369q7520R102J3062K9719k3848P684j48455
12183D5991j1355k6347K7948K0040J34944L6810j07705N6593N1615P5706j7904
12172B86336J5513j3797j44252P4787J20023K8657q0957o2811l7482l3191R0128
$$ plain form
12161 242954 331903 414313 384964 305981 366774 445514 556655 615014 685606 696915 608934
12150 608934 553845 513610 570465 586869 604983 692777 679534 692579 802136 929415 995443
12139 995443 1096966 1369009 1548660 1655510 1737958 1786447 1877902 1951429 1833899 1688474
12129 1688474 1560459 1418781 1355018 1346867 1333332 1312716 1346134 1436130 1487226 1474258 1431526
12118 1431526 1411803 1484942 1425506 1361709 1421389 1460486 1499350 1478248 1354036 1379620 1580391
12107 1580391 1643395 1617766 1719094 1892153 1968692 1980461 1848222 1687508 1505024 1418858
12097 1418858 1473377 1557006 1439663 1360654 1400690 1278241 1199807 1105120 1047889 1075049 1119737
12086 1119737 1171398 1090345 1039353 1100750 1093743 1110696 1187493 1190723 1233658 1304281 1413751
$$ packed form
12161B42954Q8949Q2410k9349p8983O0793P8740J11141N8359P0592J1309q7981
12150F08934n5089m0235N6855J6404J8114Q7794j3243J3045J09557J27279O6028
12139I95443J01523K72043J79651J06850Q2448M8489R1455P3527j17530j45425
12129A688474j28015j41678o3763q151j3535k0616L3418Q9996N1096j2968m2732
12118A431526j9723P3139n9436o3797N9680L9097L8864k1102j24212K5584K00771
12107A580391O3004k5629J01328J73059P6539J1769j32239j60714j82484q6166
12097A418858N4519Q3629j17343p9009M0036j22449p8434r4687n7231K7160M4688
12086A119737N1661q1053n0992O1397p007J6953P6797L230M2935P0623J09470
$$ plain form
12075 1413751 1479022 1380806 1287441 1270075 1259435 1074219 900293 775788 701344 655614 596307
12064 596307 487024 333147 334611 367383 371452 378952 392343 421038 321270 264263 346532 240601
12052 240601 266189 285060 288838 250563 255369 367577 426864 313346 197248 173100 169421
12041 169421 96984 -10222 -100468 -105638 -29800 50475 56465 99569 55827 105872 190068 236211
12029 236211 149311 214870 289311 198285 150065 110518 162213 191989 139190 254519 298487
12018 298487 345591 326291 218881 145061 51526 34202 191230 259861 238479 283493 188623
12007 188623 100107 163146 320061 381268 356747 334130 250714 336489 268058 213599 181832
11996 181832 146028 117134 -27485 -161551 -101407 -16682 96528 193020 123006 44295 64429
$$ packed form
12075A413751O5271r8216r3365j7366j0640j85216j73926j24505p4444m5730n9307
12064E96307j09283j53877J464L2772M069P500J3391K8695r9768n7007Q2269j05931
12052B40601K5588J8871L778l8275M806J12208N9287j13518j16098k4148l679
12041A69421p2437j07206r0246n170P5838Q0275N990M3104m3742N0045Q4196M6143
12029B36211q6900O5559P4441r1026m8220l9547N1695K9776n2799J15329M3968
12018B98487M7104j9300j07410p3820r3535j7324J57028O8631k1382M5014r4870
12007A88623q8516O3039J56915O1207k4521k2617q3416Q5775o8431n4459l1767
11996A81832l5804k8894j44619j34066O0144Q4725J13210R6492p0014p8711K0134
$$ plain form
11985 64429 170534 218702 131186 111270 85437 78166 109696 126861 251923 343647 477917
11974 477917 495236 476124 423160 418942 427889 470076 489748 474813 401158 362722 404543 258015
11962 258015 161610 289939 335699 348463 315150 287860 330041 332081 439616 385198 189071
11951 189071 227972 297288 255504 314266 312847 348358 375150 507227 569641 409804 471871
11940 471871 457040 388559 348131 303041 289570 445234 508698 421327 437237 381289 342333
11929 342333 369375 301505 252251 342533 450516 497689 484921 413498 403839 434233 434870 400848
11917 400848 444595 452533 408408 339206 303656 413153 474072 473397 399440 417042 359766 254460
11905 254460 309413 371858 293365 168431 53470 96818 267837 321480 241808 183746 142573
$$ packed form
11985F4429J06105M8168q7516j9916k5833p271L1530J7165J25062R1724J34270
11974D77917J7319j9112n2964m218Q947M2187J9672j4935p3655l8436M1821j46528
11962B58015r6405J28329M5760J2764l3313k7290M2181K040J07535n4418j96127
11951A89071L8901O9316m1784N8762j419L5511K6792J32077O2414j59837O2067
11940D71871j4831o8481m0428m5090j3471J55664O3464q7371J5910n5948l8956
11929C42333K7042o7870m9254R0282J07983M7173j2768p1423r659L0394O37l4022
11917D00848M3747P938m4125o9202l5550J09497O0919o75p3957J7602n7276j05306
11905B54460N4953O2445p8493j24934j14961M3348J71019N3643p9672n8062m1173
$$ plain form
11894 142573 122130 118147 149911 317227 481943 437685 377803 359493 335200 299232 258653
11883 258653 244597 222527 214496 286416 367629 318345 431953 393804 272624 333203 355758
11872 355758 310531 299411 297420 342343 364193 271457 117804 48215 120920 185901 311047
11861 311047 472781 535130 473957 438863 506483 558243 638615 686144 729884 625571 479411
11850 479411 445808 451348 470414 510278 538217 508713 551630 681859 738297 670890 684649
11839 684649 728747 790652 817858 777628 935367 1004259 982363 1080279 1206539 1406138 1714437
11828 1714437 1946287 2133878 2305971 2362453 2401294 2356375 2204689 1992339 1827249 1689434
11818 1689434 1612969 1595744 1450168 1431185 1427472 1351856 1355908 1409330 1487647 1428009 1374192
$$ packed form
11894A42573k0443l983L1764J67316J64716m4258n9882j8310k4293l5968m0579
11883B58653j4056k2070q031P1920Q1213m9284J13608l8149j21180O0579K2555
11872C55758m5227j1120j991M4923K1850r2736j53653o9589P2705O4981J25146
11861C11047J61734O2349o1173l5094O7620N1760Q0372M7529M3740j04313j46160
11850D79411l3603N540J9066L9864K7939k9504M2917J30229N6438o7407J3759
11839F84649M4098O1905K7206m0230J57739O8892k1896R7916J26260J99599L08299
11828A714437K31850J87591J72093N6482L8841m4919j51686k12350j65090j37815
11818A689434p6465j7225j45576j8983l713p5616M052N3422P8317n9638n3817
$$ plain form
11807 1374192 1442082 1364305 1431010 1476657 1512792 1492882 1551543 1602241 1718754 1854320 1860801
11796 1860801 1837740 1890849 1795180 1769574 1760640 1715260 1787630 2008868 2051609 2110655 2124058
11785 2124058 2091637 2077094 2104643 2145167 2114382 2272516 2346768 2342945 2299040 2270359 2244130
11774 2244130 2386572 2483170 2596148 2622669 2663066 2745515 2826376 2900995 2936833 3124683 3277402
11763 3277402 3352999 3434840 3597650 3606286 3561865 3621555 3643742 3772463 3886972 4023919 4246416
11752 4246416 4451765 4551307 4603202 4699219 4926979 5195161 5396392 5549914 5750714 6155403
11742 6155403 6594077 6936201 7169261 7633940 8316201 8863480 9433876 10068019 10853366
11733 10853366 11732272 12731394 13726565 14948662 16363345 17991714 19978830 22261217
$$ packed form
11807A374192O7890p7777O6705M5647L6135j9910N8661N0698J16513J35566O481
11796A860801k3061N3109r5669k5606q934m5380P2370K21238M2741N9046J3403
11785B124058l2421j4543K7549M0524l0785J58134P4252l823m3905k8681k6229
11774B244130J42442R6598J12978K6521M0397Q2449Q0861P4619L5838J87850J52719
11763C277402P5597Q1841J62810Q636m4421N9690K2187J28721J14509J36947K22497
11752D246416K05349R9542N1895R6017K27760K68182K01231J53522K00800M04689
11742F155403M38674L42124K33060M64679O82261N47279N70396O34143P85347
11733A0853366Q78906R99122R95171J222097J414683J628369J987116K282387
$$ plain form
11725 22261217 25024636 28268355 31843914 35982693 40743153 46043401 52297815 59585144
11717 59585144 67993588 77657884 89152019 103114409 120078028 140760963 165759760
11710 165759760 195046246 227986253 262363842 294311942 318388617 329600614 325485437
11703 325485437 307620433 281237306 252115502 224689919 202039246 185512052 175593345
11696 175593345 171651893 172897350 178619327 187227232 197055886 206918590 215714009 223216192
11688 223216192 229715714 235027377 238773877 241069922 243167385 246806343 253706124 265242184
11680 265242184 281860563 302472193 324693636 344639149 358137853 361619887 354081247
11673 354081247 337493217 315743408 293407057 273950519 259007400 248328329 240801278
$$ packed form
11725B2261217K763419L243719L575559M138779M760460N300248O254414P287329
11717E9585144Q408444R664296J1494135J3962390J6963619K0682935K4998797
11710A65759760K9286486L2940007L4377589L1948100K4076675J1211997m115177
11703C25485437j7865004k6383127k9121804k7425583k2650673j6527194r918707
11696A75593345l941452J245457N721977Q607905R828654R862704Q795419P502183
11688B23216192O499522N311663L746500K296045K097463L638958O899781J1536060
11680B65242184J6618379K0611630K2221443J9945513J3498704L482034p538640
11673C54081247j6588030k1749809k2336351j9456538j4943119j0679071p527051
$$ plain form
11666 240801278 234664516 228667117 221868341 214018497 205362131 196290918 186907195 177300207
11658 177300207 168466594 161907183 158858994 159909533 165562432 176003136 190976077 210047019
11650 210047019 231793080 254100649 273595019 286041937 287251422 275042645 250599664
11643 250599664 218455717 184060901 152057799 124731185 102464229 84794310 71008191
11636 71008191 60470098 52148401 45212355 39486630 34768471 30783064 27409059 24469503
11628 24469503 21951491 19887589 18108143 16693432 15390039 14203571 13301970 12521932
11620 12521932 11763869 11059064 10338055 9744942 9200832 8742297 8370155 7987725 7661684
11611 7661684 7288940 6947596 6807466 6622560 6391468 6090655 6011269 5912280 5813554 5598531
$$ packed form
11666B40801278o136762n997399o798776p849844q656366r071213r383723r606988
11658A77300207q833613o559411l048189J050539N652899J0440704J4972941J9070942
11650B10047019K1746061K2307569J9494370J2446918J209485j2208777k4442981
11643B50599664l2143947l4394816l2003102k7326614k2266956j7669919j3786119
11636G1008191j0538093q321697o936046n725725m718159l985407l374005k939556
11628B4469503k518012k063902j779446j414711j303393j186468r01601p80038
11620A2521932p58063p04805p21009n93113n44110m58535l72142l82430l26041
11611G661684l72744l41344j40130j84906k31092l00813p9386r8989r8726k15023
$$ plain form
11601 5598531 5579959 5654232 5585634 5527579 5413757 5381839 5471594 5738950 6060198 6245653
11591 6245653 6387219 6568251 6473505 6234176 6014513 5663296 5276945 4982997 4808689 4639938
11581 4639938 4609650 4628180 4761732 4881499 5045606 5147148 5315400 5600971 5836480 5928312
11571 5928312 5908336 6156607 6377239 6712654 6968200 7362061 7848828 8256482 8773418 9207872
11561 9207872 9531051 9817252 10011315 9978416 9733849 9455502 9110471 8689103 8346986 8085523
11551 8085523 7892530 7765843 7644786 7566849 7523042 7552759 7669462 7788025 7846413 8020939
11541 8020939 8129757 8350464 8646909 8917793 9371278 9771214 10082309 10445612 10828280
11532 10828280 11010680 11100197 11052909 10905296 10593940 10365533 10121799 9855267 9621732 9247198
$$ packed form
11601E598531j8572P4273o8598n8055j13822l1918Q9755K67356L21248J85455
11591F245653J41566J81032r4746k39329k19663l51217l86351k93948j74308j68751
11581D639938l0288J8530J33552J19767J64107J01542J68252K85571K35509R1832
11571E928312j9976K48271K20632L35415K55546L93861M86767M07654N16936M34454
11561I207872L23179K86201J94063l2899k44567k78347l45031m21368l42117k61463
11551H085523j92993j26687j21057p7937m3807K9717J16703J18563N8388J74526
11541H020939J08818K20707K96445K70884M53485L99936L11095L63303L82668
11532A0828280J82400Q9517m7288j47613l11356k28407k43734k66532k33535l74534
$$ plain form
11522 9247198 8958070 8759755 8545790 8126392 7773935 7626793 7261274 6769662 6400014
11513 6400014 6035180 5880802 5811023 5572154 5474922 5558355 5666996 5799622 5900412 6186040
11503 6186040 6583607 6785248 6923078 6878346 6829668 6690023 6361950 5911506 5461546 4985977
11493 4985977 4392973 3931860 3516087 3284991 3115287 2972217 2741298 2421637 2199679
11484 2199679 2015460 1874499 1805158 1756443 1794552 1768959 1734475 1608088 1642350 1652090 1574277
11473 1574277 1594919 1505054 1402369 1359898 1197306 1074525 1041114 1078458 981419 933083 824104
11462 824104 815212 863096 900609 952284 876488 741954 851457 967688 945166 957464 917421
11451 917421 856916 836558 843366 779419 778742 781050 842041 858684 773296 843111 1028335 1070029
$$ packed form
11522I247198k89128j98315k13965m19398l52457j47142l65519m91612l69648
11513F400014l64834j54378o9779k38869r7232Q3433J08641J32626J00790K85628
11503F186040L97567K01641J37830m4732m8678j39645l28073m50444m49960m75569
11493D985977n93004m61113m15773k31096j69704j43070k30919l19661k21958
11484B199679j84219j40961o9341m8715L8109k5593l4484j26387L4262R740p7813
11473A574277K0642q9865j02685m2471j62592j22781l3411L7344r7039m8336j08979
11462H24104q892M7884L7513N1675p5796j34534J09503J16231k2522J2298m0043
11451I17421o0505k0358O808o3947o77K308O0991J6643q5388O9815J85224M1694
$$ plain form
11439 1070029 1021155 918466 902768 933802 912293 883780 837092 803174 763387 874047 916415
11428 916415 894622 797421 777413 807103 776206 767134 760760 693954 681598 698004 697037 728532
11416 728532 789944 773723 682649 566535 508108 448306 453973 439620 604671 801542 790141
11405 790141 804478 751391 751600 864510 858709 776840 637108 618719 670413 710830 834406
11394 834406 751104 705099 693124 640893 682229 684423 704846 799127 972770 1120713 1320942
11383 1320942 1635832 2053809 2465197 2913264 3350218 3532324 3265829 2808286 2288814
11374 2288814 1830552 1411567 1094824 857022 831345 855392 706849 642208 681249 691431
11364 691431 666181 563590 552759 547588 510275 562372 481939 494079 541847 518344 588850
$$ packed form
11439A070029m8874j02689j5698L1034k1509k8513m6688l3918l9787J10660M2368
11428I16415k1793r7201k0008K9690l0897r072o374o6806j2356J6406r67L1495
11416G28532O1412j6221r1074j16114n8427n9802N667j4353J65051J96871j1401
11405G90141J4337n3087K09J12910n801q1869j39732j8389N1694M0417J23576
11394H34406q3302m6005j1975n2231M1336K194K0423R4281J73643J47943K00229
11383A320942L14890M17977M11388M48067M36954J82106k66495m57543n19472
11374B288814m58262m18985l16743k37802k5677K4047j48543o4641L9041J0182
11364F91431k5250j02591j0831n171l7313N2097q0433J2140M7768k3503P0506
$$ plain form
11353 588850 646024 611168 602111 630108 542184 387637 381275 478427 425925 390792 329414 405755
11341 405755 439595 406925 444301 444249 456555 487478 542949 470597 355247 340024 311981 416546
11329 416546 498556 580824 517819 363733 379300 403748 366059 326508 464826 454637 396133
11318 396133 397251 390442 455423 454172 391535 349104 352760 524352 686300 531081 445534 540136
11306 540136 480768 441847 415694 389549 354402 231102 103531 26108 112784 211153 359075
11295 359075 421835 389591 424313 498821 557597 546911 520446 512509 506259 511818 521116 488512
11283 488512 572072 660817 709765 696829 817029 930464 1062563 1133846 1270694 1409129
11273 1409129 1484150 1573183 1564577 1669754 1744213 1724190 1613571 1575552 1470105 1336726 1313103
$$ packed form
11353E88850N7174l4856r057K7997q7924j54547o362R7152n2502l5133o1378P6341
11341D05755L3840l2670L7376n2J2306L0923N5471p2352j15350j5223k8043J04565
11329D16546Q2010Q2268o3005j54086J5567K4448l7689l9551J38318j0189n8504
11318C96133J118o809O4981j251o2637m2431L656J71592J61948j55219q5547R4602
11306E40136n9368l8921k6153k6145l5147j23300j27571p7423Q6676R8369J47922
11295C59075O2760l2244L4722P4508N8776j0686k6465p937o250N559R298l2604
11283D88512Q3560Q8745M8948j2936J20200J13435J32099P1283J36848J38435
11273A409129P5021Q9033q606J05177P4459k0023j10619l8019j05447j33379k3623
$$ plain form
11262 1313103 1233337 1188699 1314178 1322591 1333241 1268114 1362415 1444857 1478308 1589453 1752543
11251 1752543 1790687 1784818 1813738 1775849 1795331 1748891 1618354 1693993 1788232 1808638 1853744
11240 1853744 1894422 1885351 1916672 1893266 1717094 1591350 1524396 1443246 1366989 1461528 1394050
11229 1394050 1242104 1110592 1067262 1092815 1055447 1173934 1062743 958858 925020 1066741
11219 1066741 1259666 1288189 1320051 1516925 1586831 1596578 1571018 1642246 1663276 1536646 1381501
11208 1381501 1322439 1175685 978654 850110 888773 795006 665605 552819 430920 393499
11198 393499 360665 308773 397441 397505 368184 433247 410727 406937 487093 568034 539252 471492
11186 471492 460695 376818 315182 293268 288601 290945 268192 240306 207214 139837 166517 250097
$$ packed form
11262A313103p9766m4638J25479Q413J0650o5127R4301Q2442L3451J11145J63090
11251A752543L8144n869K8920l7889J9482m6440j30537P5639R4239K0406M5106
11240A853744M0678r071L1321k3406j76172j25744o6954q1150p6257R4539o7478
11229A394050j51946j31512m3330K5553l7368J18487j11191j03885l3838J41721
11219A066741J92925K8523L1862J96874O9906R747k5560P1228K1030j26630j55145
11208A381501n9062j46754j97031j28544L8663r3767j29401j12786j21899l7421
11198C93499l2834n1892Q8668O4k9321O5063k2520l790Q0156Q0941k8782o7760
11186D71492j0797q3877o1636k1914m667K344k2753k7886l3092o7377K6680Q3580
$$ plain form
11174 250097 123522 48189 135157 133851 1308 27236 63507 76572 194219 311097 338261
11163 338261 343746 252662 167209 197236 152444 212227 221952 318922 271588 119269 84678 105142
11151 105142 49112 12712 41600 33551 89701 149450 155739 122859 179914 173172 112241 67600
11139 67600 -27395 -2646 53387 43885 95105 32686 6740 120125 174246 128330 262666
11128 262666 277251 208067 82242 107168 200007 216821 149233 117001 119773 25990 30686 115904
11116 115904 272632 222663 545 -32790 -12778 -19226 48938 105063 204934 194421 190397
11105 190397 169399 78403 133473 242934 317020 220394 148694 249310 317401 270070 227988
11094 227988 219045 147215 69164 223288 275631 255650 149688 126974 100946 169399 259022
$$ packed form
11174B50097j26575p5333Q6968j306j32543K5928L6271J3065J17647J16878K7164
11163C38261N485r1084q5453L0027m4792N9783R725R6970m7334j52319l4591K0464
11151A05142n6030l6400K8888q049N6150N9749O289l2880N7055o742o0931m4641
11139F7600r4995K4749N6033r502N1220o2419k5946J13385N4121m5916J34336
11128B62666J4585o9184j25825K4926R2839J6814o7588l2232K772r3783M696Q5218
11116A15904J56728m9969k22118l3335K0012o448O8164N6125R9871j0513m024
11105A90397k0998r0996N5070J09461P4086r6626p1700J00616O8091m7331m2082
11094B27988q943p1830p8051J54124N2343j9981j05962k2714k6028O8453Q9623
$$ plain form
11083 259022 260934 132216 14907 -10919 125166 191685 305897 205049 128952 123191 100507
11072 100507 178111 217943 303639 304877 110578 -97721 -166331 -172202 -112380 -63038 109793
11061 109793 185348 253560 356839 307188 203792 111453 208673 160853 264728 225692 250086
11050 250086 182227 128767 230841 319249 365572 367009 373902 377695 317499 307166 217514 -58785
11038 -58785 -53313 76200 101974 43398 -57946 -55738 104014 207323 196633 216007 270245
11027 270245 215274 256997 166574 38412 21516 -10992 12886 -27195 29488 129198 217831
11016 217831 281475 196084 150988 100111 158922 249430 209511 88655 77461 168526 140019
11005 140019 56921 -107698 -60204 44574 9134 -640 34493 46563 -243 912 21703
$$ packed form
11083B59022J912j28718j17309k5826J36085O6519J14212j00848p6097n761k2684
11072A00507P7604L9832Q5696J238j94299k08299o8610n871N9822M9342J72831
11061A09793P5555O8212J03279m9651j03396r2339R7220m7820J03875l9036K4394
11050B50086o7859n3460J02074Q8408M6323J437O893L793o0196j0333q9652k76299
11038e8785N472J29513K5774n8576j01344K208J59752J03309j0690J9374N4238
11027B70245n4971M1723r0423j28162j6896l2508K3878m0081N6683R9710Q8633
11016B17831O3644q5391m5096n0877N8811R0508l9919j20856j1194R1065k8507
11005A40019q3098j64619M7494J04778l5440r774L5133J2070m6806J155K0791
$$ plain form
10994 21703 106274 178681 247569 161869 42265 57738 199339 189804 104809 66329 104031
10983 104031 195288 213396 277331 358585 246704 312466 233234 153197 149962 348478 382730
10972 382730 328111 189247 63846 40763 120905 64093 -84642 -129000 -46176 173224 264058
10961 264058 123436 23502 63335 112786 71647 128961 249270 282737 166701 -783 -4381
10950 -4381 46623 7856 32051 95621 176924 56017 71490 154995 103398 18080 61797 126286
10938 126286 199233 234860 161276 79169 53245 29267 69290 66594 61880 165897 92508 54020
10926 54020 45333 165833 177665 91386 94969 157158 116657 148126 183102 215163 154958 172208
10914 172208 244349 209488 149187 190306 191232 145840 151664 147181 191247 259154 230931 196220
$$ packed form
10994B1703Q4571P2407O8888q5700j19604J5473J41601r535q4995l8480L7702
10983A04031R1257J8108O3935Q1254j11881O5762p9232q0037l235J98516L4252
10972C82730n4619j38864j25401k3083Q0142n6812j48735m4358Q2824K19400R0834
10961B64058j40622r9934L9833M9451m1139N7314J20309L3467j16036j67484l598
10950d381N1004l8767K4195O3570Q1303j20907J5473Q3505n1597q5318M3717O4489
10938A26286P2947L5627p3584q2107k5924k3978M0023k696m714J04017p3389l8488
10926E4020q687J20500J1832q6279L583O2189m0501L1469L4976L2061o0205J7250
10914A72208P2141l4861o0301M1119R26m5392N824m483M4066O7907k8223l4711
$$ plain form
10902 196220 131747 107430 60892 43236 78294 78393 182337 193711 132497 77060 139336 180540
10890 180540 173401 215589 218053 202241 222877 167629 144850 104603 28742 -18448 62902 118414
10878 118414 12756 -87036 -176126 -109060 51320 93959 16515 8381 54173 -2624 -78169
10867 -78169 -6340 -63892 -11430 189475 74828 -15836 20716 87071 202549 253635 273239
10856 273239 209952 41631 -97221 -237123 -281831 -212564 -240327 -181342 -149386 -93974 -49230
10845 -49230 -25528 -175284 -172048 -285268 -241803 -113949 21061 28938 112632 131803 172632
10834 172632 155287 90980 177177 276728 212870 171357 125363 12713 75519 140785 190694
10823 190694 178052 16751 -58139 -35759 -19900 -31609 -92341 -73024 -31820 -31203 -13952 46616
$$ packed form
10902A96220o4473k4317m6538j7656L5058R9J03944J1374o1214n5437O2276M1204
10890A80540p139M2188K464j5812K0636n5248k2779m0247p5861m7190Q1350N5512
10878A18414j05658r9792q9090O7066J60380M2639p7444q134M5792n6797p5545
10867g8169P1829n7552N2462K00905j14647r0664L6552O6355J15478N1086J9604
10856B73239o3287j68321j38852j39902m4708O9267k7763N8985L1956N5412M4744
10845d9230K3702j49756L236j13220M3465J27854J35010P877Q3694J9171M0829
10834A72632j7345o4307Q6197R9551o3858m1513m5994j12650O2806O5266M9909
10823A90694j2642j61301p4890K2380J5859j1709o0732J9317M1204O17J7251O0568
$$ plain form
10811 46616 116063 122148 56130 -39898 -127648 -157515 -146484 -146730 -31634 24400 -16198 -161563
10799 -161563 -140756 17439 -47781 -72781 -3119 84444 123392 138019 76840 -15867 89004
10788 89004 83691 95902 164782 115294 49906 -34042 -18619 -36263 87198 175298 127253 152946
10776 152946 121647 69575 9041 66415 103260 129800 175070 211493 286327 167942 52470
10765 52470 85947 57196 12810 -36826 31106 95641 5888 -39535 -26200 208988 362857
10754 362857 282023 199149 210595 122332 75690 182178 209744 205279 142855 96147 69627
10743 69627 -2930 -123085 -308233 -210315 -86613 52726 114427 121978 117097 132795 129256
10732 129256 119917 50930 -49912 -75440 11415 82178 39661 44400 137212 64295 -6149 -6966
$$ packed form
10811D6616O9447O085o6018r6028q7750k9867J1031k46J15096N6034m0598j45365
10799a61563K0807J58195o5220k5000O9662Q7563L8948J4627o1179r2707J04871
10788H9004n313J2211O8880m9488o5388q3948J5423j7644J23461Q8100m8045K5693
10776A52946l1299n2072o0534N7374L6845K6540M5270L6423P4834j18385j15472
10765E2470L3477k8751m4386m9636O7932O4535q9753m5423J3335K35188J53869
10754C62857q0834q2874J1446q8263m6642J06488K7566m465o2424m6708k6520
10743F9627p2557j20155j85148R7918J23702J39339O1701P551m881J5698l539
10732A29256r339o8987j00842k5528Q6855P0763m2517M739R2812p2917p0444q17
$$ plain form
10720 -6966 -52197 1201 85193 94556 56653 -36925 -70179 4543 -26898 -83440 46396 134606
10708 134606 88940 152039 129484 41364 16879 -95610 -40241 -98095 -71598 -81727 -114768
10697 -114768 -158969 -158345 -85645 -101069 -78001 -89021 -64631 8519 82812 82828 110266 74891
10685 74891 -68138 -62549 -107740 -87818 31981 44156 -15627 -108552 -122481 -87678 -90514 396
10673 396 -112615 -159670 16412 31458 85135 233032 179360 26830 129722 120100 67008
10662 67008 -14098 -45915 -44754 -22247 -158975 -145812 -83329 -31635 -37927 22414 123350 112668
10650 112668 53867 -105290 -23252 82775 133123 29932 -23691 25007 129257 137541 215321
10639 215321 246712 179148 49947 -27102 28418 12302 -11172 60879 144963 136915 149774
$$ packed form
10720f966m5231N3398Q3992R363l7903r3578l3254P4722l1441n6542J29836Q8210
10708A34606m5666O3099k2555q8120k4485j12489N5369n7854K6497j0129l3041
10697a14768m4201O24P2700j5424K3068j1020K4390P3150P4293J6K7438l5375
10685G4891j43029N589m5191J9922J19799J2175n9783r2925j3929L4803k836R0910
10673C96j13011m7055J76082J5046N3677J47897n3672j52530J02892r622n3092
10662F7008q1106l1817J161K2507j36728J3163O2483N1694o292O0341J00936j0682
10650A12668n8801j59157Q2038J06027N0348j03191n3623M8698J04250Q284P7780
10639B15321L1391o7564j29201p7049N5520j6116k3474P2051Q4084q048J2859
$$ plain form
10628 149774 166446 139546 104940 28102 105850 141047 186985 31528 47605 183380 189814
10617 189814 109723 69147 143867 104846 64362 38919 31466 120126 143151 157780 207180 124612
10605 124612 19134 -38279 33174 76942 18133 92486 252910 303665 302433 248115 218791
10594 218791 131283 16411 -47817 -69310 -60630 -64835 -17800 42640 49272 145193 116903 109188
10582 109188 28024 -114765 -166843 -208443 -75058 68345 119677 107726 12183 29351 18138
10571 18138 85400 38996 -32784 -94915 -13128 -46074 -64973 -80119 -22926 54361 115747 34520
10559 34520 57963 -47567 -21356 -4704 131487 141380 48536 75643 19695 25113 94997 147808
10547 147808 111376 93371 39626 -26208 -59768 -62561 36866 177972 212805 150670 63816
$$ packed form
10628A49774J6672k6900l4606p6838P7748L5197M5938j55457J6077J35775O434
10617A89814q0091m0576P4720l9021m0484k5443p453Q8660K3025J4629M9400q2568
10605A24612j05478n7413P1453M3768n8809P4353J60424N0755j232n4318k9324
10594B18791q7508j14872o4228k1493Q680m205M7035O0440O632R5921k8290p715
10582A09188q1164j42789n2078m1600J33385J43403N1332j1951r5543J7168j1213
10571A8138O7262m6404p1780o2131Q1787l2946j8899j5146N7193P7287O1386q1227
10559C4520K3443j05530K6211J6652J36191R893r2844K7107n5948N418O9884N2811
10547A47808l6432j8005n3745o5834l3560k793R9427J41106L4833o2135q6854
$$ plain form
10536 63816 76429 81509 122198 145070 110774 55246 58002 -5217 47525 131493 202152 157292
10524 157292 44810 11323 -57394 -153948 -84543 -125282 -223220 -116529 -105685 -101796 -129273
10513 -129273 -179767 -161300 -21936 -76123 -132410 -72737 -75649 -70651 -174272 -214103 -119981
10502 -119981 -152855 -175946 -49422 -6880 -35709 -89522 90803 74033 -57843 -116377 -33473
10491 -33473 -124313 -102853 -24781 -40248 5679 29364 42108 59533 29543 31475 105816 116816
10479 116816 34830 -107213 -45683 -16143 -133457 -242088 -281002 -232772 -60467 101297
10469 101297 77966 49560 105883 108805 84881 127016 259624 219864 152474 139462 172543
10458 172543 135878 166605 345004 398303 224413 86639 213553 183004 158573 309441
$$ packed form
10536F3816J2613N080M0689K2872l4296n5528K756o3219N2742Q3968P0659m4860
10524A57292j12482l3487o8717r6554O9405m0739r7938J06691J0844L889k7477
10513a29273n0494J8467J39364n4187n6287N9673k912M998j03621l9831R4122
10502a19981l2874k3091J26524M2542k8829n3813J80325j6770j31876n8534Q2904
10491c3473r0840K1460P8072j5467M5927K3685J2744J7425k9990J932P4341J1000
10479A16816q1986j42043O1530K9540j17314j08631l8914M8230J72305J61764
10469A01297k3331k8406N6323K922k3924M2135J32608l9760o7390j3012L3081
10458A72543l6665L0727J78399N3299j73890j37774J26914l0549k4431J50868
$$ plain form
10448 309441 356266 405703 359969 237673 110428 12098 -29518 57419 -3720 -48697 12290
10437 12290 86789 49613 -61094 -58070 -18809 -22866 -8645 -16345 7531 174891 174025 119700
10425 119700 69442 25492 -96338 -163547 -148803 -48218 -139223 -136610 -142706 -126125 -45510
10414 -45510 85120 64607 17501 -23301 97849 154580 105609 38508 -3234 83089 -59471
10403 -59471 -150427 -130034 -70320 -74275 -103427 -71151 -102523 -27398 15065 47207 -41723 -20087
10391 -20087 -2242 -44252 -5544 -42774 -20365 7173 29232 -12198 -33303 94106 222132
10380 222132 102348 -56539 4132 63483 12325 103483 111028 142511 162282 54230 -16227
10369 -16227 -31427 -130552 -156444 -125185 -127460 -59119 -137920 -146191 -79784 -62370 -87081 -50166
$$ packed form
10448C09441M6825M9437m5734j22296j27245r8330m1616Q6937o1139m4977O0987
10437A2290P4499l7176j10707L024L9261m057J4221p700K3876J67360q66n4325
10425A19700n0258m3950j21830o7209J4744J00585r1005K613o096J6581Q0615
10414d5510J30630k0513m7106m0802J21150N6731m8971o7101m1742Q6323j42560
10403e9471r0956K0393N9714l955k9152L2276l1372P5125M2463L2142q8930K1636
10391b0087J7845m2010L8708l7230K2409K7538K2059m1430k1105J27409J28026
10380B22132j19784j58887O0671N9351n1158R1158P545L1483J9771j08052p0457
10369a6227j5200r9125k5892L1259k275O8341p8801q271O6407J7414k4711L6915
$$ plain form
10357 -50166 -97914 -103375 9290 68216 58290 -35228 -46213 17118 68111 -93375 -107471 -79621
10345 -79621 -128715 -73313 -74584 -160976 -184653 -71309 34195 159204 219426 174749 75727
10334 75727 -89516 -128688 -34334 -40191 -65507 -35852 -48220 -73696 -140704 -40701 126044
10323 126044 84871 101561 116910 236610 218890 132999 63347 48188 58190 -29273 -27689
10312 -27689 -53838 -71360 -124706 -85658 -11084 -21847 -99126 -108912 3730 60175 46774 16786
10300 16786 45847 148577 166441 151218 193613 145082 -25751 -166503 -138791 -17814 124657
10289 124657 155107 97032 9033 -22692 -32888 -127469 -229374 -209549 -115646 -77021 28099
10278 28099 108679 31890 -46993 10338 109337 165328 122145 16622 -50771 1011 67567
$$ packed form
10357e0166m7748n461J12665N8926r926r3518j0985O3331N0993j61486j4096K7850
10345g9621m9094N5402j271q6392k3677J13344J05504J25009O0222m4677r9022
10334G5727j65243l9172R4354n857k5316K9655j2368k5476o7008J00003J66745
10323A26044m1173J6690J5349J19700j7720q5891o9652j5159J0002q7463J584
10312b7689k6149j7522n3346L9048P4574j0763p7279r786J12642N6445j3401k9988
10300A6786K9061J02730J7864j5223M2395m8531j70833j40752K7712J20977J42471
10289A24657L0450n8075q7999l1725j0196r4581j01905J9825R3903L8625J05120
10278B8099Q0580p6789p8883N7331R8999N5991m3183j05523o7393N1782O6556
$$ plain form
10267 67567 109408 131164 106258 26360 -54996 -131610 -138729 -28582 52377 100494 91440 63129
10255 63129 48930 41920 68943 138664 28168 -104456 -19763 68498 133609 152406 98935
10244 98935 90661 86922 137673 130046 32275 -42326 -151651 -252214 -151757 -80865 -89254 22541
10232 22541 2406 -62626 -55598 -33615 -92418 -139158 -138032 -172301 -144176 -121850 -183042 -211778
10220 -211778 -164198 -148382 -129947 -168597 -72116 -2963 -29131 -209758 -249081 -212576 -143203
10209 -143203 -172459 -232102 -163066 -48649 55092 132108 149216 9447 -73150 -99400 -108472
10198 -108472 -353 35628 5691 90330 103322 185761 145773 88644 94357 119943 160932
10187 160932 128738 110198 135489 60517 53523 59975 70 64748 9678 29350 85977 85429
$$ packed form
10267F7567M1841K1756k4906p9898q1356p6614p119J10147Q0959M8117r054k8311
10255F3129j4199p010K7023O9721j10496j32624Q4693Q8261O5111J8797n3471
10244I8935q274l739N0751p627r7771p4601j09325j00563J00457P0892q389J11795
10232B2541k0135o5032P028K1983n8803m6740J126l4269K8125K2326o1192k8736
10220b11778M7580J5816J8435l8650R6481O9153k6168j80627l9323L6505O9373
10209a43203k9256n9643O9036J14417J03741P7016J7108j39769q2597k6250r072
10198a08472J08119L5981k9937Q4639J2992Q2439l9988n7129N713K5586M0989
10187A60932l2194j8540K5291p4972o994O452n9905O4678n5070J9672N6627n48
$$ plain form
10175 85429 97768 1740 -104774 -168882 -117679 -146771 -118226 -64603 22889 -80907 -875
10164 -875 -28012 -146465 -140384 58633 317815 335161 231247 112513 24354 3955 -45914
10153 -45914 -119202 -165951 -128233 -4853 -52897 -188769 -39261 26081 -9146 -28006 1407
10142 1407 -50043 -163772 -237810 -179212 -83792 23990 173773 248163 199696 49677 -53597
10131 -53597 -143472 -305524 -212901 -40055 -30945 -79632 -111484 -114465 1234 115262 122620
10120 122620 227147 230182 78094 61979 128196 162029 82303 27735 -27102 -133485 -126678
10109 -126678 -11802 88105 42381 175367 286518 359459 335026 209354 168824 185347 79895
10098 79895 37716 90419 92467 102204 25411 -64788 -22845 16323 243272 230057 151103 95303
$$ packed form
10175H5429J2339r6028j06514o4108N1203k9092K8545N3623Q7492j03796Q0032
10164h75k7137j18453O081J99017K59182J7346j03914j18734q8159k0399m9869
10153d5914p3288m6749L7718J23380m8044j35872J49508O5342l5227j8860K9413
10142A407n1450j13729p4038N8598R5420J07782J49783P4390m8467j50019j03274
10131e3597q9875j62052R2623J72846R110m8687l1852k981J15699J14028P358
10120A22620J04527L035j52088j6115O6217L3833p9726n4568n4837j06383O807
10109a26678J14876R9907m5724J32986J11151P2941k4433j25672m0530J6523j05452
10098G9895m2179N2703K048R737p6793r0199M1943L9168K26949j3215p8954n5800
$$ plain form
10086 95303 207842 302714 303289 330743 347203 475295 492289 419705 415834 409111 426547 597851
10074 597851 689921 748046 1040581 1233321 1398678 1663540 1839760 2018748 2278559 2709667
10064 2709667 3199725 3664191 4259790 4896058 5504274 6615174 8201864 10821577 14731870
10055 14731870 20712565 28870206 39387375 51253995 47282768 29114179 16209943
10048 16209943 9783689 6516399 4849666 3823899 3072009 2575763 2212183 1952632 1547679
10039 1547679 1243234 1068298 950138 864354 796699 909271 833373 675149 454535 338214
10029 338214 231508 261326 347113 288125 203585 256602 191926 82348 23059 52559 190033
10018 190033 109430 40390 59898 111415 121915 175467 183642 251335 307150 249201 3232
$$ packed form
10086I5303J12539R4872N75K7454J6460J28092J6994p2584l871o723J7436J71304
10074E97851R2070N8125K92535J92740J65357K64862J76220J78988K59811M31108
10064B709667M90058M64466N95599O36268O08216J110900J586690K619713L910293
10055A4731870N980695Q157641J0517169J1866620l971227j8168589j2904236
10048A6209943o426254l267290j666733j025767p51890m96246l63580k59551m04953
10039A547679l04445j74936j18160q5784o7655J12572p5898j58224k20614j16321
10029C38214j06706K9818Q5787n8988q4540N3017o4676j09578n9289K9500J37474
10018A90033q0603o9040J9508N1517J0500N3552Q175O7693N5815n7949k45969
$$ plain form
10007 3232 -92442 -72160 115061 35144 -55787 -81243 -72062 114641 324560 325156 309670 287143
9995 287143 273869 99508 110038 122286 80278 -14702 34691 197719 222885 249091 147996
9984 147996 57180 -82495 -109259 -53448 24598 33538 -110136 -173651 -2118 25388 29700
9973 29700 -99222 -194459 -215492 -104423 -3373 12630 27936 44301 50728 62712 48967
9962 48967 -117102 -172117 -177066 -138341 -170124 -208208 -81249 104525 74471 -32862 -72159
9951 -72159 -24465 162395 244143 225547 219782 237331 292928 214258 141617 -24952 -16085 170238
9939 170238 119833 -34593 -121306 -54973 23234 44213 40490 16472 -60047 92975 113271
9928 113271 43453 19517 100404 -12291 96277 169237 227571 264378 190735 203897 248507
$$ packed form
10007C232r5674K0282J87221p9917r0931k5456R181J86703K09919N96j5486k2527
9995B87143j3274j74361J0530J2248m2008r4980M9393J63028K5166K6206j01095
9984A47996r0816j39675k6764N5811P8046Q940j43674o3515J71533K7506M312
9973B9700j28922r5237k1033J11069J01050J6003J5306J6365O427J1984j3745
9962D8967j66069n5015m949L8725l1783l8084J26959J85774l0054j07333l9297
9951g2159M7694J86860Q1748j8596n765J7549N5597p8670p2641j66569Q867J86323
9939A70238n0405j54426q6713O6333P8207K0979l723k4018p6519J53022K0296
9928A13271o9818k3936Q0887j12695J08568P2960N8334L6807p3643J3162M4610
$$ plain form
9917 248507 103713 34271 56896 96361 38428 56893 138192 190096 161128 164142 77361 63584
9905 63584 132581 4976 -171951 -134101 -75376 -104098 -157913 -144303 -70254 11217 -18358
9894 -18358 -133429 -58666 -81772 -12759 50996 7241 132906 193906 222518 130925 120488
9883 120488 -2661 -17903 202 -21726 10807 34392 9794 -2964 60489 132599 92475
9872 92475 -60482 -65224 13964 -106410 -136517 -34978 -40571 -164049 -158451 -107778 -93513 43658
9860 43658 -5940 63766 228748 186817 155364 109344 84177 104487 113520 112944 62949 17888
9848 17888 77360 123356 99151 4555 -106499 -119155 -160363 -116720 11399 32628 -49667
9837 -49667 -122429 -133719 34666 139843 198298 180695 54966 -8935 73705 128154 48161
$$ packed form
9917B48507j44794o9442K2625L9465n7933J8465Q1299N1904k8968L014q6781j3777
9905F3584O8997j27605j76927L7850N8725k8722n3815J3610P4049Q1471k9575
9894a8358j15071P4763k3106O9013O3755m3755J25665O1000K8612r1593j0437
9883A20488j23149j5242J8105k1928L2533K3585k4598j2758O3453P2110m0124
9872I2475j52957m742P9188j20374l0107J01539n593j23478N598N0673J4265J37171
9860D3658m9598O9706J64982m1931l1453m6020k5167K0310R033n76m9995m5061
9848A7888N9472M5996k4205r4596j11054j2656m1208M3643J28119K1229q2295
9837d9667p2762j1290J68385J05177N8455j7603j25729o3901Q2640N4449p9993
$$ plain form
9826 48161 -138155 -214857 -20307 71364 44017 -4455 135121 201774 231167 248544 318091
9815 318091 330776 203211 151302 98624 102027 43019 -59897 -214469 -212475 -22188 80233
9804 80233 57350 125786 177276 189912 118774 126131 89206 64721 200793 165025 118765 21173
9792 21173 -113199 -72849 -138492 -175957 -48153 -33423 -86209 -46975 -132481 -52958 -77948
9781 -77948 -35536 -95553 21694 60737 9467 -38489 -110972 -92309 67901 186434 187834
9770 187834 182855 89191 629 -51839 -136519 -10351 62054 86989 101217 113471 39570 58193
9758 58193 36155 169396 34389 -57681 2375 53640 102721 13313 -49871 -54353 -121241 -104303
9746 -104303 -88842 -171796 -44477 -35781 -94976 -112846 7550 79459 139421 119796 115723 100543
$$ packed form
9826D8161j86316p6702J94550R1671k7347m8472J39576O6653K9393J7377O9547
9815C18091J2685j27565n1909n2678L403n9008j02916j54572J994J90287J02421
9804H0233k2883O8436N1490J2636p1138P357l6925k4485J36072l5768m6260r7592
9792B1173j34372M0350o5643l7465J27804J4730n2786L9234q5506P9523k4990
9781g7948M2412o0017J17247L9043n1270m7956p2483J8663J60210J18533J400
9770A87834m979r3664q8562n2468q4680J26168P2405K4935J4228J2254p3901J8623
9758E8193k2038J33241j35007r2070O0056N1265M9081q9408o3184m482o6888J6938
9746a04303J5461q2954J27319Q696n9195j7870J20396P1909N9962j9625m073j5180
$$ plain form
9734 100543 88688 -22863 -73459 -152862 -69715 -7902 -22004 -66075 -72406 -156086 -50578
9723 -50578 -52007 -67417 -26450 -21748 -125799 -149227 -2546 125990 178538 116141 56225 8772
9711 8772 -73871 84412 65753 22140 -5752 -10518 58254 81532 3379 58448 90024 -30690
9699 -30690 -195033 -228719 -179483 -213445 -133512 -177658 -113297 -39236 122009 125545 -5589
9688 -5589 11611 49379 57603 14010 -101321 -155347 -199031 -224422 -116894 -78722 -3601 -49935
9676 -49935 -32500 -91045 -9914 100925 -11261 15612 1431 -20343 -134947 -65619 -73794
9665 -73794 -47762 -124677 -133622 -24090 135346 139733 7600 -53901 -69481 -89764 -197974
9654 -197974 -247105 -151476 -141519 -52156 -132061 -85306 142910 184864 178310 142532 166472 147768
$$ packed form
9734A00543j1855j11551n0596p9403Q3147O1813j4102m4071o331q3680J05508
9723e0578j429j5410M0967M702j04051k3428J46681J28536N2548o2397n9916m7453
9711H772q2643J58283j8659m3613k7892m766O8772K3278p8153N5069L1576j20714
9699c0690j64343l3686M9236l3962P9933m4146O4361P4061J61245L536j31134
9688e589J7200L7768Q224m3593j15331n4026m3684k5391J07528L8172P5121m6334
9676d9935J7435n8545Q1131J10839j12186K6873j4181k1774j14604O9328q175
9665g3794K6032p6915q945J09532J59436M387j32133o1501j5580k0283j08210
9654a97974m9131R5629R957Q9363p9905M6755K28216M1954o554l5778K3940j8704
$$ plain form
9642 147768 -44973 -41088 -31427 26143 -16403 -64410 -77637 -103893 -123521 -117612 -102407 -172699
9630 -172699 -151239 -103968 -136262 -170190 -95380 -150213 -69619 77709 68452 58446 25061 -689
9618 -689 99460 112630 142485 108894 36431 -1754 -62637 -11771 -8149 -150827 -170479 -173767
9606 -173767 -192985 -56299 -2642 70272 199093 173517 210131 193283 177827 156484 159293
9595 159293 269740 230654 38672 -143854 -208753 -213031 -138475 -58814 -11064 74911 4129
9584 4129 -62804 14157 -9238 -167968 -365388 -252427 -108635 -69809 -179978 -234858 -157393
9573 -157393 -95684 -35810 81614 17445 -15670 8373 -11264 8030 -26412 42910 24696
9562 24696 6732 3299 -94633 -176693 -115583 -71033 -18593 53981 79038 23063 -77438 -117618
$$ packed form
9642A47768j92741L885R661N7570m2546m8007j3227k6256j9628N909J5205p0292
9630a72699K1460M7271l2294l3928P4810n4833Q0594J47328r257j0006l3385k5750
9618f89J00149J3170K9855l3591p2463l8185o0883N0866L622j42678j9652l288
9606a73767j9218J36686N3657P2914J28821k5576L6614j6848j5456k1343K809
9595A59293J10447l9086j91982j82526o4899m278P4556P9661M7750Q5975p0782
9584D129o6933P6961k3395j58730j97420J12961J43792L8826j10169n4880P7465
9573a57393O1709N9874J17424o4169l3115K4043j9637J9294l4442O9322j8214
9562B4696j7964l433r7932q2060O1110M4550N2440P2574K5057n5975j00501m0180
$$ plain form
9550 -117618 -141493 -160297 -101966 -161037 -219689 -69600 35631 2133 27328 44562 77241
9539 77241 81207 48719 -95554 -115123 37737 21209 7851 24391 41331 -45237 -139205 -115646
9527 -115646 18755 110073 90511 106487 16918 -58121 -41042 -183117 -192743 -99133 27330
9516 27330 27389 37664 -3432 -92453 -195998 -169736 -106250 55065 63641 66900 50530 13914
9504 13914 -121307 -183805 -188949 -98708 -117575 -81793 25682 -29587 -48659 1502 31418 88287
9492 88287 105513 52848 -83466 -42953 142507 221015 212226 129597 125066 167854 297304 224755
9480 224755 115210 175119 248020 172942 145119 136254 123037 83099 96573 136260 88232 138212
9468 138212 201726 207614 197110 153449 139576 29542 106190 185596 199591 178193 79798 -75626
$$ packed form
9550a17618k3875j8804N8331n9071n8652J50089J05231l3498K5195J7234L2679
9539G7241L966l2488j44273j9569J52860j6528j3358J6540J6940q6568r3968K3559
9527a15646J34401R1318j9562J5976q9569p5039J7079j42075r626R3610J26463
9516B7330N9J0275m1096q9021j03545K6262O3486J61315Q576L259j6370l6616
9504A3914j35221o2498n144R0241j8867L5782J07475n5269j9072N0161K9916N6869
9492H8287J7226n2665j36314M0513J85460P8508q789q2629m531M2788J29450p2549
9480B24755j09545N9909P2901p5078k7823q865j3217l9938J3474L9687m8028M9980
9468A38212O3514N888j0504m3661j3873j10034P6648P9406J3995k1398r8395j55424
$$ plain form
9456 -75626 17809 -12614 7105 -838 -9042 -20199 57026 -601 -47775 -42096 -51958 18646 151188
9443 151188 137078 177321 92363 100528 26719 20933 16506 15939 9901 46622 70219 168748 177908
9430 177908 113547 31101 -70887 -176809 -151593 -16569 -5140 -28545 -105055 -136409 -34081
9419 -34081 -18763 73033 92137 116499 124898 165477 39468 -28286 6307 20497 57907 50501
9407 50501 -86219 -106706 -108774 45975 146023 100619 -13829 -32153 -45383 -114095 -37674
9396 -37674 67246 155596 129956 43499 34266 10814 -34391 18137 46026 -75915 -166486 -229542
9384 -229542 -168363 -88543 51847 -6955 -79627 -40293 26024 18749 -98361 -241942 -229246
9373 -229246 -168318 -139775 -88292 -44447 -202776 -122727 -70908 -18792 -30380 47587 68875
$$ packed form
9456g5626R3435l0423J9719p943q204j1157P7225n7627m7174N679r862P0604J32542
9443A51188j4110M0243q4958Q165p3809n786m427n67o038L6721K3597R8529R160
9430A77908o4361q2446j01988j05922K5216J35024J1429k3405p6510l1354J02328
9419c4081J5318R1796J9104K4362Q399M0579j26009o7754L4593J4190L7410p406
9407E0501j36720k0487k068J54749J00048m5404j14448j8324j3230o8712P6421
9396c7674J04920Q8350k5640q6457r233k3452m5205N2528K7889j21941r0571o3056
9384b29542O1179P9820J40390n8802p2672L9334O6317p275j17110j43581J2696
9373b29246O0928K8543N1483M3845j58329Q0049N1819N2116j1588P7967K1288
$$ plain form
9362 68875 30671 -14271 -96263 -52333 27266 69160 45141 109199 12972 -96332 -35401 -15494
9350 -15494 16760 32963 44648 7460 -9584 37886 111783 143623 146994 254972 352256 275952
9338 275952 132085 3479 -100677 -121991 -59460 -51253 -73072 -124660 -31722 40579 2780
9327 2780 80858 131138 54045 -61145 -85888 43311 133760 142049 210220 145038 23917 -93621
9315 -93621 -115943 -94276 -2011 38537 19583 -45159 11271 -20472 -13945 -59253 -38825 80958
9303 80958 74963 -20528 56175 50748 59794 41653 35632 54527 45089 -128593 -190743 -200549 -141846
9290 -141846 -26703 27847 108119 62109 -34225 -78582 -107554 -33292 139139 165852 203192
9279 203192 325947 306008 144695 22767 40226 9805 -26255 -7007 45908 41798 107870
$$ packed form
9362F8875l8204m4942q1992M3930P9599M1894k4019O4058r6227j09304O0931J9907
9350a5494L2254J6203J1685l7188j7044M7470P3897L1840L371J07978R7284p6304
9338B75952j43867j28606j04156k1314O2531Q207k1819n1588R2938P2301l7799
9327B780P8078N0280p7093j15190k4743J29199R0449Q289O8171o5182j21121j17538
9315i3621k2322K1667R2265M0548j8954o4742N6430l1743O527m5308K0428J19783
9303H0958n995r5491P6703n427R046j8141o021J8895r438j73682o2150r806N8703
9290a41846J15143N4550Q0272m6010r6334m4357k8972P4262J72431K6713L7340
9279B03192J22755j9939j61313j21928J7459l0421l6060J9248N2915m110O6072
$$ plain form
9268 107870 100687 165289 164883 211123 182162 14146 -13059 14856 69389 183518 174798 109192
9256 109192 91782 14918 116967 173396 95860 128039 27323 -91759 -122223 -42575 -94234
9245 -94234 -173653 -202022 -169625 -59177 -8199 26000 -28723 76462 115668 79536 -54438
9234 -54438 -67942 20782 -11068 -76638 -49361 -3721 82910 105988 -6587 78847 109802 19072
9222 19072 127369 61188 8116 6671 -34097 62625 116574 86644 13351 -7106 28164 108350
9210 108350 29944 67720 68724 75999 114343 60590 37910 98444 51096 3048 103989 107678
9198 107678 -8222 -109441 24585 155308 202046 307531 319089 245068 82053 45935
9188 45935 69767 59279 -2806 -55360 -135512 -114176 -117347 -42075 73375 -45135 28058 197084
$$ packed form
9268A07870p183O4602m06M6240k8961j68016k7205K7915N4533J14129q720o5606
9256A09192j7410p6864J02049N6429p7536L2179j00716j19082l0464P9648n1659
9245i4234p9419k8369L2397J10448N0978L4199n4723J05185L9206l6132j33974
9234e4438j3504Q8724l1850o5570K7277M5640Q6631K3078j12575Q5434L0955r0730
9222A9072J08297o6181n3072j445m0768R6722N3949k9930p3293k0457L5270Q0186
9210A08350p8406L7776J004P275L8344n3753k2680O0534m7348m8048J00941L689
9198A07678j15900j01219J34026J30723M6738J05485J1558p4021j63015l6118
9188D5935K3832j0488o2085n2554q0152K1336l171P5272J15450j18510P3193J69026
$$ plain form
9176 197084 155641 138751 156292 108840 88958 112876 95052 40432 -17925 40084 120680 204628
9164 204628 167786 95013 86117 33808 22972 144686 159815 153824 187227 252563 190873 46203
9152 46203 63372 175354 249093 284964 252057 259452 304710 280304 311281 306750 250989 375964
9140 375964 587569 648239 570067 595417 583494 432832 401641 475500 484488 660361 802647
9129 802647 940626 1039945 1107430 1175120 1208850 1326108 1545970 1861013 2333235 2666941
9119 2666941 2942619 3427440 4013134 4764313 5606137 6629035 7713972 8880829 10324856
9110 10324856 12339095 15190562 19131631 24796539 32762609 43230282 55777401 67923486
9102 67923486 70222868 56617781 38835752 25801512 17674484 12712108 9776343 7817893
$$ packed form
9176A97084m1443j6890J7541m7452j9882K3918j7824n4620n8357N8009Q0596Q3948
9164B04628l6842p2773q896n2309j0836J21714J5129n991L3403O5336o1690j44670
9152D6203J7169J11982P3739L5871l2907P395M5258k4406L0977m531n5761J24975
9140C75964K11605O0670p8172K5350j1923j50662l1191P3859Q988J75873J42286
9129H02647J37979R9319O7485O7690L3730J17258K19862L15043M72222L33706
9119B666941K75678M84821N85694P51179Q41824J022898J084937J166857J444027
9110A0324856K014239K851467L941069N664908P966070J0467673J2547119J2146085
9102F7923486K299382j3605087j7782029j3034240q127028m962376k935765j958450
$$ plain form
9094 7817893 6337980 5379434 4513852 3742381 3150513 2759045 2399948 2091381 1864444
9085 1864444 1709076 1499862 1390893 1438466 1300864 1014344 954183 979184 843996 698558
9075 698558 678871 651302 584322 562025 581423 624914 569218 535147 470844 491463 536065 461498
9063 461498 475143 484234 449958 450915 434113 342088 418243 423242 341010 301394 365321 304724
9051 304724 148108 159763 207206 175899 221228 215943 158103 202152 237840 186918 171122 133975
9039 133975 279420 262034 263293 167951 175597 134859 180703 111891 105820 146134 320506 227402
9027 227402 114521 118222 121243 213322 143234 105725 33909 -67973 -208080 -39926 116264
9016 116264 163348 195243 137489 50546 42464 53803 61654 53259 -86751 44020 33734 -43770
$$ packed form
9094G817893j479913r58546q65582p71471n91868l91468l59097l08567k26937
9085A864444j55368k09214j08969M7573j37602k86520o0161K5001j35188j45438
9075F98558j9687k7569o6980k2297J9398M3491n5696l4071o4303K0619M4602p4567
9063D61498J3645R091l4276R57j6802r2025P6155M999q2232l9616O3927o0597
9051C04724j56616J1655M7443l1307M5329n285n7840M4049L5688n0922j5796l7147
9039A33975J45445j7386J259r5342P646m0738M5844o8812o071M0314J74372r3104
9027B27402j12881L701L021R2079p0088l7509p1816j01882j40107J68154J56190
9016A16264M7084L1895n7754q6943q082J1339P851q395j40010J30771j0286p7504
$$ plain form
9004 -43770 45476 28733 114856 203295 17333 -62687 -51812 154068 307040 314747 191057
8993 191057 149290 93106 88535 65966 -44541 -167153 -116173 -101502 -12265 94984 101089
8982 101089 71906 42927 88348 62228 55112 146821 155186 93314 66741 148586 174590 153852
8970 153852 130866 34809 -7947 -2243 111164 150347 43996 49652 31602 68860 32711 -3857
8958 -3857 145952 251878 180092 195135 244990 237633 112873 44439 30891 25891 104159 197747
8946 197747 199953 48117 -67448 -91178 70279 27451 -130833 -171612 -75722 33421 60905
8935 60905 130166 133707 -10786 -63072 37748 172318 125957 97120 129736 178047 273871
8924 273871 175969 57628 209762 189040 100160 29048 -12808 49886 101615 162282 91479
$$ packed form
9004d3770Q9246j6743Q6123Q8439j85962q0020J0875K05880J52972P707j23690
8993A91057m1767n6184m571k2569j10507j22612N0980J4671Q9237J07249O105
8982A01089k9183k8979M5421k6120p116R1709Q365o1872k6573Q1845K6004k0738
8970A53852k2986r6057m2756N704J13407L9183j06351N656j8050L7258l6149l6568
8958c857J49809J05926p1786J5043M9855p357j24760o8434j3548n000P8268R3588
8946A97747K206j51836j15565k3730J61457m2828j58284m0779R5890J09143K7484
8935F0905O9261L541j44493n2286J00820J34570m6361k8837L2616M8311R5824
8924B73871r7902j18341J52134k0722q8880p1112m1856O2694N1729O0667p0803
$$ plain form
8913 91479 71923 163733 155524 -1926 -784 8572 2253 -61694 -23493 -29 -214287 -201567
8901 -201567 69344 211638 235123 236739 263711 411422 477666 372253 327899 367323 396707
8890 396707 656187 1001624 1540504 2041000 2595558 3156778 3171229 2599179 1892317 1250270
8880 1250270 836363 610491 426791 474170 487001 411748 324265 277486 182078 228718 256596
8869 256596 197557 209325 161895 131767 190475 109849 -50518 24792 154895 211515 250022
8858 250022 315702 362278 432765 489536 430399 476883 606351 678789 679645 689674 773652 981057
8846 981057 1304191 1759403 2200800 2807469 3592330 4805013 6076467 6414313 5130582
8837 5130582 3378721 2173089 1479334 1054789 721870 558229 556153 501776 450205 473790
$$ packed form
8913I1479j9556R1810q209j57450J142R356o319o3947L8201K3464k14258J2720
8901b01567K70911J42294K3485J616K6972J47711O6244j05413m4354L9424K9384
8890C96707K59480L45437N38880N00496N54558N61220J4451n72050p06862o42047
8880A250270m13907k25872j83700M7379J2831p5253q7483m6779r5408M6640K7878
8869B56596n9039J1768m7430l0128N8708q0626j60367P5310J30103N6620L8507
8858B50022O5680M6576P0487N6771n9137M6484J29468P2438Q56J0029Q3978K07405
8846I81057L23134M55212M41397O06669P84861J212683J271454L37846j283731
8837E130582j751861j205632o93755m24545l32919j63641k076n4377n1571K3585
$$ plain form
8827 473790 371425 336345 266634 82201 -52726 19563 206330 294776 181547 199904 242175
8816 242175 162154 202199 199028 194259 138731 243665 339370 451969 473738 448818 383486 372020
8804 372020 450258 489830 492287 627109 861161 1073614 1468163 1797047 2251540 2857843
8794 2857843 3198818 2707995 1884000 1361677 799335 486639 379970 269852 255246 197351
8784 197351 243085 280107 248164 276840 189596 76934 125646 125184 42944 -27859 24333 176810
8772 176810 239903 190910 124546 102540 173926 146107 33279 -12915 47601 154352 110329
8761 110329 25774 41185 114614 140293 -20054 34031 200519 315463 239117 205146 156750
8750 156750 177048 119382 85264 122896 276643 342016 210740 138881 156426 75695 168854
$$ packed form
8827D73790j02365l5080o9711j84433j34927P2289J86767Q8446j13229J8357M2271
8816B42175q0021M0045l171m769n5528J04934R5705J12599K1769k4920o5332j1466
8804C72020P8238L9572K457J34822K34052K12453L94549L28884M54493O06303
8794B857843L40975m90823q23995n22323n62342l12696j06669j10118j4606n7895
8784A97351M5734L7022l1943K8676q7244j12662M8712m62q2240p0803N2192J52477
8772A76810O3093m8993o6364k2006P1386k7819j12828m6194O0516J06751m4023
8761A10329q4555J5411P3429K5679j60347N4085J66488J14944p6346l3971m8396
8750A56750K0298n7666l4118L7632J53747O5373j31276p1859J7545q0731R3159
$$ plain form
8739 168854 154360 -99075 -348966 -402558 -212317 -12477 46538 22959 -6441 20106 16306
8728 16306 2005 42161 23131 -6530 87885 76595 44754 78462 157340 132545 176625 148120
8716 148120 129871 145394 105251 68934 42040 -63323 -56426 -24572 55301 128115 199720 221973
8704 221973 181811 123849 12421 -57264 35625 103551 164629 123658 112158 97163 160411
8693 160411 130625 -25554 -161752 -131038 -100575 22275 42528 124114 110204 190980 172821
8682 172821 60664 -79357 -23757 150186 186478 112102 112030 112229 53903 18468 -46769 30215
8670 30215 105806 132375 58352 87577 196586 198114 212803 124507 17642 11576 63513 8573
8658 8573 -47903 -34548 93203 202046 239946 224075 174278 82413 197862 245605 164242
$$ packed form
8739A68854j4494k53435k49891n3592J90241J99840N9015k3579k9400K6547l800
8728A6306j4301M0156j9030k9661R4415j1290l1841L3708P8878k4795M4080k8505
8716A48120j8249J5523m0143l6317k6894j05363O897L1854P9873P2814P1605K2253
8704B21973m0162n7962j11428o9685R2889O7926O1078m0971j1500j4995O3248
8693A60411k9786j56179j36198L0714L0463J22850K0253Q1586j3910Q0776j8159
8682A72821j12157j40021N5600J73943L6292p4376p2J99n8326l5435o5237P6984
8670C0215P5591K6569p4023K9225J09009J528J4689q8296j06865o066N1937n4940
8658H573n6476J3355J27751J08843L7900j5871m9797r1865J15449M7743q1363
$$ plain form
8647 164242 114061 113586 198309 216373 250834 302623 393186 375609 361452 335967 360978 475800
8635 475800 590750 533882 531830 625883 701751 617160 650243 979634 1510031 2113208 2923165
8624 2923165 3719694 4183869 3505136 2272886 1449382 1040940 758348 720776 544017 520435
8614 520435 408885 319028 329816 285625 270773 246876 273747 323886 445328 540822 476894
8603 476894 469241 434161 466572 477716 433610 558643 611829 641917 854400 982713 1041593
8592 1041593 1089621 1119981 1293999 1471731 1667622 1806407 1852602 2103929 2497903 3098703
8582 3098703 3959568 5115220 6677228 8324879 7848555 5425927 3409512 2330906 1710425
8573 1710425 1320830 1112952 1006582 993390 934072 848033 861696 758797 705060 816324
$$ packed form
8647A64242n0181m75Q4723J8064L4461N1789R0563j7577j4157k5485K5011J14822
8635D75800J14950n6868k052R4053P5868q4591L3083L29391N30397O03177Q09957
8624B923165P96529M64175o78733j232250q23504m08442k82592l7572j76759k3582
8614E20435j11550q9857J0788m4191j4852k3897K6871N0139J21442R5494o3928
8603D76894p653l5080L2411J1144m4106J25033N3186L0088K12483J28313N8880
8592A041593M8028L0360J74018J77732J95891J38785M6195K51327L93974O00800
8582C098703Q60865J155652J562008J647651m76324k422628k016415j078606o20481
8573A710425l89595k07878j06370j3192n9318q6039J3663j02899n3737J11264
$$ plain form
8563 816324 853902 892509 1021909 1074941 1162240 1100055 1121952 1168488 1261526 1169824 1118016
8552 1118016 1045637 856705 874069 791171 720563 714582 697127 644882 686164 669512 688714
8541 688714 792448 963177 1308315 1779978 2293561 2815161 3528961 3935019 3172475 2147670
8531 2147670 1522521 1250262 1120813 867025 645946 648708 634077 583389 600989 728739
8521 728739 706627 527387 441442 369472 425501 394285 327966 270232 275908 210893 144124 132003
8509 132003 161697 135495 86963 83835 150181 78567 91089 97728 158449 159798 135637 96172
8497 96172 -69880 -77096 -18521 23701 19993 34861 74086 27935 17386 100227 119143 156332
8485 156332 166327 102730 145529 75693 20541 -3393 33525 45713 19623 -64462 -38635 17852
$$ packed form
8563H16324L7578L8607J29400N3032Q7299o2185K1897M6536R3038r1702n1808
8552A118016p2379j88932J7364q2898p0608n981j7455n2245M1282j6652J9202
8541F88714J03734J70729L45138M71663N13583N21600P13800M06058p62544j024805
8531B147670o25149k72259j29449k53788k21079K762j4631n0688J7600J27750
8521G28739k2112j79240q5945p1970N6029l1216o6319n7734N676o5015o6769j2121
8509A32003K9694k6202m8532l128O6346p1614J2522O639O0721J349k4161l9465
8497I6172j66052p216N8575M2222l708J4868L9225m6151j0549Q2841J8916L7189
8485A56332R995o3597M2799o9836n5152k3934L6918J2188k6090q4085K5827N6487
$$ plain form
8473 17852 -89745 -62825 96993 82213 -10839 -48010 -40855 62916 72882 -14733 -123373
8462 -123373 9448 139649 119342 40898 -76270 -61391 59230 230264 274607 128432
8452 128432 91876 198253 87860 182014 178077 131380 80062 40513 -68249 -122521 -89689
8441 -89689 -119000 -92496 -98106 6128 6505 72176 88922 38245 -8954 -7648 56722 125636
8429 125636 106157 30404 56269 87336 25065 95034 43883 -43299 28259 46289 50134 3973
8417 3973 -63788 -130741 -132136 -131214 -55711 -58362 -73575 -137033 -62902 -120955 -166313 -161224 -107092
8404 -107092 -43287 25022 -22553 -62427 -53241 -53334 -34322 -37871 -64313 -102004 -59384 -53227 55061
8391 55061 9670 -148253 -184484 -95620 65213 87659 56628 23208 82538 154393 80208
$$ packed form
8473A7852j07597K6920J59818j4780r3052l7171P155J03771R966q7615j08640
8462a23373J32821J30201k0307p8444j17168J4879J20621J71034M4343j46175
8452A28432l6556J06377j10393R4154l937m6697n1318l9549j08762n4272L2832
8441h9689k9311K6504n610J04234L77O5671J6746n0677m7199J306O4370O8914
8429A25636j9479p5753K5865L1067o2271O9969n1151q7182P1558J8030L845m6161
8417C973o7761o6953j395R22P5503k651j5213o3458P4131n8053m5358N089N4132
8404a07092O3805O8309m7575l9874R186r3J9012l549k6442l7691M2620O157J08288
8391E5061m5391j57923l6231Q8864J60833K2446l1031l3420N9330P1855p4185
$$ plain form
8380 80208 -21245 -16413 61029 95094 82560 -2184 -105645 -62004 -2556 23324 -64062 -19822
8368 -19822 21423 64448 -122769 -188440 -51476 29948 -7709 -29993 -12100 -2786 122634
8357 122634 102730 139217 139869 -12298 -79827 -118066 -5103 1589 30520 31893 -78398 6636
8345 6636 63640 -311 93825 169859 187992 72891 -37287 -98012 -75874 9265 94763 82694
8333 82694 69177 51440 -35242 -238707 -421968 -391614 -314410 -145570 67844 83053 86697
8322 86697 -39648 -130748 -124554 -202951 -82952 -26685 11167 95734 165248 199455 27268
8311 27268 -51259 -1096 -1399 -77739 13725 17064 -38877 -137588 -221334 -181401 -176277 -203977 -196658
8298 -196658 -147682 -71749 -519 -53053 -60968 1775 -76156 -64240 100042 139466 83248 145986
$$ packed form
8380H0208j01453M832P7442L4065j2534q4744j03461M3641N9448K5880q7386M4240
8368a9822M1245M3025j87217o5671J36964Q1424l7657k2284J7893R314J25420
8357A22634j9904L6487O52j52167o7529l8239J12963O692K8931J373j10291Q5034
8345F636N7004o3951R4136P6034J8133j15101j10178o0725K2138Q5139Q5498j2069
8333H2694j3517j7737q6682k03465j83261L0354P7204J68840K13414J5209L644
8322H6697j26345r1100O194p8397J19999N6267L7852Q4567O9514L4207j72187
8311B7268p8527N0163l03p6340R1464L339n5941r8711q3746L9933N124k7700P319
8298a96658M8976P5933P1230n2534p915O2743p7931J1916J64282L9424n6218O2738
$$ plain form
8286 145986 90715 -120625 -63157 -9887 -23670 -113880 -144483 -1701 98438 101039 179737
8275 179737 194859 97591 63926 155163 182210 43160 49990 114976 83341 81813 -28532 -46885
8263 -46885 -71929 -20683 71574 142274 111568 140994 171478 216792 230035 252674 237773 194011
8251 194011 213672 170232 110321 100563 114445 123889 82521 1156 -115148 -143982 -115372 23326
8239 23326 37336 36299 24511 44807 77533 67141 116632 64453 62544 79685 -10066 -128359
8227 -128359 -116831 -122351 -128838 -117262 -117386 -73391 -94648 -142214 -141388 -52676 4635 -74712 -136234
8214 -136234 -54701 -31593 -118705 -168370 -190591 -134886 -227310 -236191 -127356 -117576 -102816 12033
8202 12033 117157 75765 -73438 -64985 -155652 -124300 -92608 -120255 -105939 -68367 -28396 32649
$$ packed form
8286A45986n5271k11340N7468N3270j3783r0210l0603J42782J00139K601P8698
8275A79737J5122r7268l3665R1237K7047j39050O830O4986l1635j528j10345j8353
8263d6885k5044N1246R2257P0700l0706K9426L0484M5314J3243K2639j4901m3762
8251A94011J9661m3440n9911r758J3882R444m1368q1365j16304k8834K8610J38698
8239B3326J4010j037j1788K0296L2726j0392M9491n2179j909J7141q9751j18293
8227a28359J1528n520o487J1576j24M3995k1257m7566Q26Q8712N7311p9347o1522
8214a36234Q1533K3108q7112m9665k2221N5705r2424q881J08835R780J4760J14849
8202A2033J05124m1392j49203Q453r0667L1352L1692k7647J4316L7572L9971O1045
$$ plain form
8190 32649 98149 129896 69660 43193 -141734 -112415 -135943 -118600 36351 77585 85851 56287
8178 56287 70518 178139 171444 -8978 -64265 7746 -55392 -98532 -172823 -101030 -121582 -183283
8166 -183283 -143169 -9610 44106 139212 106117 -31389 -242332 -163235 -33752 -47614 2076
8155 2076 119406 133073 177034 62528 -8810 -115903 -89354 -19565 18202 -90080 -135410
8144 -135410 -65390 -39299 -12212 -13825 -16724 120437 44242 -70782 -31006 -56351 -50984 -125253
8132 -125253 -163174 -83585 74917 -1358 -63051 9872 75902 35900 -85772 -92902 -44124
8121 -44124 15978 143272 67232 21707 115888 118475 92436 63812 84853 212104 251095 172278
8109 172278 57576 111650 153950 125341 132468 6908 9264 -38053 -45220 3392 -145418 -84524
$$ packed form
8190C2649O5500L1747o0236k6467j84927K9319k3528J7343J54951M1234Q266k9564
8178E6287J4231J07621o695j80422n5287P2011o3138m3140p4291P1793k0552o1701
8166a83283M0114J33559N3716R5106l3095j37506k10943P9097J29483j3862M9690
8155B076J17330J3667M3961j14506p1338j07093K6549O9789L7767j08282m5330
8144a35410P0020K6091K7087j613k899J37161p6195j15024L9776k5345N367p4269
8132a25253l7921P9589J58502p6275o1693P2923O6030m0002j21672p130M8778
8121d4124O0102J27294p6040m5525R4181K587k6039k8624K1041J27251L8991p8817
8109A72278j14702N4074M2300k8609P127j25560K356m7317p167M8612j48810O0894
$$ plain form
8097 -84524 17950 -29464 -109803 -98224 -95152 -78194 1075 -2209 -51927 -19514 102221 143315
8085 143315 146066 119616 11673 -118079 -103188 -54836 12881 -39861 -71542 1567 51892
8074 51892 162750 259260 260595 135102 63305 63990 50208 -52979 -130238 -113743 -92704 9313
8062 9313 56407 95659 -6290 1269 15646 36061 37225 32220 92855 81963 -5906 -96912
8050 -96912 -100970 133885 207664 140089 94230 170906 295634 246025 111227 -6279 -72126
8039 -72126 -136507 -23387 48280 -2959 -81775 -151648 -245372 -201083 -108218 -36388 -45089 -127295
8027 -127295 2832 109293 139694 101181 74239 127584 68210 -19506 -14408 2452 -14656
8016 -14656 -80855 -40459 -9413 16707 105056 119608 185272 159373 118524 280744 337891 241806
$$ packed form
8097h4524J02474m7414q0339J1579L072J6958P9269l284m9718L2413J21735M1094
8085A43315K751k6450j07943j29752J4891M8352O7717n2742l1681P3109N0325
8074E1892J10858R6510J335j25493p1797O85j3782j03187p7259J6495K1039J02017
8062I313M7094L9252j01949P559J4377K0415J164n005O0635j0892q7869r1006
8050i6912m058K34855P3779o7575m5859P6676J24728m9609j34798j17506o5847
8039g2126o4381J13120P1667n1239p8816o9873r3724M4289R2865P1830q701q2206
8027a27295J30127J06461L0401l8513k6942N3345n9374q7716N098J6860j7108
8016a4656o6199M0396L1046K6120Q8349J4552O5664k5899m0849J62220N7147r6085
$$ plain form
8004 241806 237956 193229 59690 11548 -61374 27403 126395 158043 35894 -45856 -99973
7993 -99973 -114036 6352 49618 -120574 -71240 2397 85965 90676 85880 110949 142889 118841
7981 118841 146745 134405 145496 167310 118929 128454 223170 225833 261084 238014 201953 134706
7969 134706 135141 119527 94221 54576 57082 4253 -121875 -219117 -180755 23807 80417 42858
7957 42858 41800 -2720 31034 123307 121010 171903 150832 16046 -14813 -8355 -23311 21200
7945 21200 -34660 -4617 -56469 -142641 -23323 -33892 -36026 21096 -9716 64798 151568 96626
7933 96626 143506 21180 -137850 -212858 -187269 -212922 -153771 -74339 -46319 13541 26020
7922 26020 -78966 -59790 -88715 -213198 -191861 -80877 61161 110429 36707 25067 73286
$$ packed form
8004B41806l850m4727j33539m8142p2922Q8777R8992L1648j22149q1750n4117
7993i9973j4063J20388M3266j70192M9334P3637Q3568M711m796K5069L1940k4048
7981A18841K7904j2340J1091K1814m8381R525R4716K663L5251k3070l6061o7247
7969A34706M35j5614k5306l9645K506n2829j26128r7242L8362K04562N6610l7559
7957D2858j058m4520L3754R2273k297N0893k1071j34786l0859O458j4956M4511
7945B1200n5860L0043n1852q6172J19318j0569k134N7122l0812P4514Q6770n4942
7933I6626M6880j22326j59030p5008K5589k5653N9151P9432K8020N9860J2479
7922B6020j04986J9176k8925j24483K1337J10984J42038M9268p3722j1640M8219
$$ plain form
7911 73286 71440 139264 199356 123779 70767 -4696 -147290 -182128 -225598 -104034 -143701 -104372
7899 -104372 1336 114119 159337 144961 20545 -15454 260512 358289 323602 303508 131918
7888 131918 32550 -43011 -73180 -52306 93638 170188 252690 227692 140456 61796 142852
7877 142852 214889 114152 74577 83614 42025 41917 100729 233801 185418 106400 120704 73257
7865 73257 -92383 -104438 68140 104261 49964 109857 79871 55333 15946 101137 151674
7854 151674 631 -18628 2525 -16000 -56325 -61480 -74150 8354 80416 72286 22736 77817
7842 77817 134855 124234 59451 -9231 97132 272019 205916 140439 24614 -40238 -63402
7831 -63402 -61418 -32424 30917 33556 -46318 -35488 -29972 -37811 -47634 -2809 -7783 -127418 -127492
$$ packed form
7911G3286j846O7824O0092p5577n3012p5463j42594l4838m3470J21564l9667L9329
7899a04372J05708J12783M5218j4376j24416l5999K75966R7777l4687k0094j71590
7888A31918r9368p5561l0169K0874J45944P6550Q2502k4998q7236p8660Q1056
7877A42852P2037j00737l9575R037m1589j08N8812J33072m8383p9018J4304m7447
7865G3257j65640j2055J72578L6121n4297N9893k9986k4538l9387Q5191N0537
7854A51674j51043j9259K1153j8525m0325n155j2670Q2504P2062q130m9550N5081
7842G7817N7038j0621o4783o8682J06363J74887o6103o5477j15825o4852k3164
7831f3402J984K8994O3341K639p9874J0830N516p839r823M4825m974j19635p4
$$ plain form
7818 -127492 -52892 -9805 85790 152721 113514 -31645 57552 44158 -68361 -44275 -64192
7807 -64192 -127297 -93632 -96661 -136240 -155082 -65041 -25949 -46010 -77244 -42659 -154268 -261300
7795 -261300 -264540 -171329 -10477 -7201 -58835 -96767 -124971 3704 60577 -7282 -81055 -4972
7783 -4972 -63067 -139472 -97633 -128060 -131815 -143065 -103942 -1468 -103188 -201109 -141018 -105625
7771 -105625 -98923 -93231 -138458 -148821 -84951 -14995 -134908 -147483 -112763 -9443 24195 -36363
7759 -36363 -64406 -142756 -169582 -170314 -103472 -136842 -116408 -27349 42010 30893 11029 18134
7747 18134 -96685 -21747 50282 68246 -58997 -68734 -68195 -38046 35508 102707 107688 78939
7735 78939 -7211 69143 65019 -59030 -60374 -80266 45963 169072 212231 67807 28141
$$ packed form
7818a27492P4600M3087R5595O6931l9207j45159Q9197j3394j12519K4086j9917
7807f4192o3105L3665l029l9579j8842R0041L9092k0061l1234L4585j11609j07032
7795b61300l240R3211J60852L276n1634l7932k8204J28675N6873o7859p3773P6083
7783d972n8095p6405M1839l0427l755j1250L9123J02474j01720r7921O0091L5393
7771a05625O702N692m5227j0363O3870O9956j19913j2575L4720J03320L3638o0558
7759c6363k8043p8350k6826p32O6842l3370K0434Q9059O9359j1117j9864P105
7747A8134j14819P4938P2029J7964j27243r737N39L0149P3554O7199M981k8749
7735G8939q6150P6354m124j24049j344j9892J26229J23109M3159j44424l9666
$$ plain form
7724 28141 -20939 -9801 -34015 -98054 -122463 -106130 -92566 47286 10298 -6684 -29866 -100458
7712 -100458 -221361 -248408 -121469 -158447 -254568 -122797 28336 73561 146547 56266 -71099
7701 -71099 -46291 -55657 -177821 -148418 -205074 -135939 -28033 -3475 -15074 -16406 78948 40545
7689 40545 -6786 51073 56070 -54064 4622 64373 68103 159275 166474 161942 112883 -8956
7677 -8956 -98856 -156246 -33009 -13253 -42004 -74076 -28528 -46703 -106282 -87809 -84460 -118894
7665 -118894 -207987 -324699 -358395 -193989 -85591 -159686 -260392 -79313 109908 110702 -7708
7654 -7708 30816 19968 -37640 -110809 -242250 -236115 -140931 -5073 95047 83182 50628 116945
7642 116945 121558 -9770 -80226 -74884 -183183 -50730 23400 33384 101709 73065 55700 39210
$$ packed form
7724B8141m9080J1138k4214o4039k4409J6333J3564J39852l6988j6982k3182p0592
7712a00458j20903k7047J26939l6978r6121J31771J51133M5225P2986r0281j27365
7701g1099K4808r366j22164K9403n6656O9135J07906K4558j1599j332R5354l8403
7689D0545m7331N7859M997j10134N8686N9751L730R1172P199m532m9059j21839
7677h956q9900n7390J23237J9756k8751l2072M5548j8175n9579J8473L349l4434
7665a18894q9093j16712l3696J64406J08398p4095j00706J81079J89221P94j18410
7654g708L8524j0848n7608p3169j31441O135R5184J35858J00120j1865l2554O6317
7642A16945M613j31328p0456N342j08299J32453P4130R984O8325k8644j7365j6490
$$ plain form
7630 39210 21158 -19958 -102686 -134966 31691 126872 242922 269279 185641 140342 19922
7619 19922 6976 122853 156244 175334 259142 271406 207896 144089 124548 109121 -88148
7608 -88148 -110355 -44856 59274 -17342 52929 130759 167661 164282 91644 39986 -72805 -54881
7596 -54881 11373 -144998 -198912 -122278 -26769 -63046 -143751 -122234 -127700 -110080 -77133 -187315
7584 -187315 -202009 -48425 -89822 -164957 -143416 -138437 -137564 -208386 -249829 -89764 47180 1473
7572 1473 -16688 -28101 62949 90236 126045 52119 5825 -40354 -103139 -111181 -37459 -107701
7560 -107701 -160940 -136786 -74642 -82365 -64932 -36235 1073 -1794 -27870 -30853 35794 -79919
7548 -79919 -159220 -185550 -119533 -121031 179 12394 -38686 37883 125873 1249 -39871 -66144
$$ packed form
7630C9210j8052m1116q2728l2280J66657R5181J16050K6357q3638m5299j20420
7619A9922j2946J15877L3391J9090Q3808J2264o3510o3807j9541j5427j97269
7608h8148k2207O5499J04130p6616P0271P7830L6902l379p2638n1658j12791J7924
7596e4881O6254j56371n3914P6634R5509l6277q0705K1517n466J7620L2947j10182
7584a87315j4694J53584m1397p5135K1541M979Q73p0822m1443J60065J36944m5707
7572A473j8161j1413R1050K7287L5809p3926m6294m6179o2785q042P3722p0242
7560a07701n3239K4154O2144p723J7433K8697L7308k867k6076k983O6647j15713
7548g9919p9301k6330O6017j498J21210J2215n1080P6569Q7990j24624m1120k6273
$$ plain form
7536 -66144 -69114 -150265 -168833 -201461 -217719 -301285 -224844 -118332 -51338 -91421 -178079 -197264
7524 -197264 -229792 -93304 -5984 -31483 24922 21781 -22816 -119574 -120204 25964 100210 115058
7512 115058 113315 125900 47021 20231 8541 39772 -13966 -85038 -48931 -50013 -63889 -37934
7500 -37934 45651 65437 -71286 -154970 -193389 -116153 -14892 -16694 -88966 -125389 -141695 -177944
7488 -177944 -180240 -165845 -174047 -76622 -6830 -21134 26903 32530 35698 38305 18796 81957 56706
7475 56706 -86690 -103206 5441 78906 86299 169717 218916 170922 126302 67858 -103926
7464 -103926 -163929 -111214 -20018 19114 60713 48419 71304 53159 35247 29210 9370 -2448
7452 -2448 -121191 -210784 -294507 -255477 -175258 -111357 -121561 -180588 -126597 -136731 -165719 -233846
$$ packed form
7536f6144k970q1151j8568l2628j6258q3566P6441J06512O6994m0083q6658j9185
7524a97264l2528J36488Q7320k5499N6405l141m4597r6758o30J46168P4246J4848
7512A15058j743J2585p8879k6790j1690L1231n3738p1072L6107j082j3876K5955
7500c7934Q3585J9786j36723q3684l8419P7236J01261j802p2272l6423j6306l6249
7488a77944k296J4395q202R7425O9792j4304M8037N627L168K607j9509O3161k5251
7475E6706j43396j6516J08647P3465P393Q3418M9199m7994m4620n8444j71784
7464a03926o0003N2715R1196L9132M1599j2294K2885j8145j7912o037j9840j1818
7452b448j18743q9593q3723L9030Q0219O3901j0204n9027N3991j0134k8988o8127
$$ plain form
7440 -233846 -166276 -73141 -27848 5116 -18974 12883 -18557 29860 -3786 -115468 -160531
7429 -160531 -137969 -173628 -121996 -14850 28420 70547 53848 13484 -974 -58981 -110154
7418 -110154 24582 31881 27171 12745 -57491 -45587 -54090 31079 61974 33179 -53301 -150303
7406 -150303 -96371 -28757 23095 59890 -127356 -159266 -140873 -161174 -20518 107489 49448
7395 49448 -89495 -139189 -3329 130980 188037 79695 -37735 -99335 -60543 -11603 99306
7384 99306 91537 76324 64114 61756 106840 192344 130138 -33463 -81925 -59970 -54623 -53580
7372 -53580 -46032 14214 -80488 -134067 -191091 -190538 -87040 -43195 -81646 36026 63139 70797
7360 70797 36653 34618 110634 72950 28743 85255 88924 -32257 -121332 -102531 -29150 -61996
$$ packed form
7440b33846O7570R3135M5293L2964k4090L1857l1440M8417l3646j11682m5063
7429a60531K2562l5659N1632J07146M3270M2127j6699m0364j4458n8007n1173
7418a10154J34736P299m710j4426p0236J1904q503Q5169L0895k8795q6480r7002
7406a50303N3932O7614N1852L6795j87246l1910J8393k0301J40656J28007n8041
7395D9448j38943m9694J35860J34309N7057j08342j17430o1600L8792M8940J10909
7384I9306p769j5213j2210k358M5084Q5504o2206j63601m8462K1955N347J043
7372e3580P548O0246r4702n3579n7024N53J03498M3845l8451J17672K7113P658
7360G0797l4144k035P6016l7684m4207N6512L669j21181q9075J8801P3381l2846
$$ plain form
7348 -61996 -47372 -21999 -27146 99420 96343 -8991 -111223 -259976 -297334 -190944 -113763
7337 -113763 -192265 -218578 -134875 -174737 -179397 -212319 -357402 -323592 -273201 -287103 -168016
7326 -168016 153338 257816 199447 163199 91699 53402 14165 31725 49722 -12290 -63145
7315 -63145 48794 29831 -19182 -37688 -59085 -159328 -15344 127046 88031 -46589 -81025
7304 -81025 -64222 -57666 -72469 -54602 -127639 -179058 -119903 -132768 -29839 -1705 -75660 30907
7292 30907 38628 -22470 -126374 -262302 -136214 -81591 -71355 33410 108835 -8861 -36714
7281 -36714 -62338 -32897 9672 -31426 -96494 -126047 -117205 -85457 74182 127866 120614 52770
7269 52770 44539 -119356 -128664 72367 129126 140648 120526 45079 -111914 11371 83672
$$ packed form
7348f1996J4624K5373n147J26566l077j05334j02232j48753l7358J06390P7181
7337a13763p8502k6313Q3703l9862m660l2922j45083L3810N0391j3902J19087
7326a68016L21354J04478n8369l6248p1500l8297l9237J7560J7997o2012n0855
7315f3145J11939j8963m9013j8506k1397j00243J43984J42390l9015j34620l4436
7304h1025J6803O556j4803J7867p3037n1419N9155j2865J02929K8134p3955J06567
7292C0907P721o1098j03904j35928J26088N4623J0236J04765P5425j17696k7853
7281c6714k5624K9441M2569m1098o5068k9553Q842L1748J59639N3684p252o7844
7269E2770q231j63895r308K01031N6759J1522k0122p5447j56993J23285P2301
$$ plain form
7258 83672 -12072 -192473 -128623 -61899 -8646 -153472 -169320 -96139 53785 62985 -75436
7247 -75436 -148258 -16425 99180 35365 107912 89832 76837 107835 46787 14640 -23033
7236 -23033 49537 12311 -24060 -82509 -34276 27363 11823 50701 -91243 -113679 -91379 52656
7224 52656 -23939 -39777 -55851 -130562 -31555 -5665 -62961 -58924 -84562 -40725 31114 132598
7212 132598 161505 155433 156702 251450 212274 96096 74695 -57747 -149973 -138801 56077
7201 56077 114566 33583 10982 -108269 -162752 -67145 -7151 -69478 -12808 -50113 66074
7190 66074 64564 -30614 -35579 49649 110276 -20445 -80567 -49544 -13508 -137011 -186515 -205263
7178 -205263 -217548 -193859 -107633 -102441 61886 196746 192565 102676 36067 -102006 -132973
$$ packed form
7258H3672r5744j80401O3850O6724N3253j44826j5848P3181J49924R200j38421
7247g5436p2822J31833J15605o3815P2547j8080j2995L0998o1048l2147l7673
7236b3033P2570l7226l6371n8449M8233O1639j5540L8878j41944k2436K2300J44035
7224E2656p6595j5838j6074p4711R9007K5890n7296M037k5638M3837P1839J01484
7212A32598K8907o072J269R4748l9176j16178k1401j32442r2226J1172J94878
7201E6077N8489q0983k2601j19251n4483R5607N9994o2327N6670l7305J16187
7190F6074j510r5178m965Q5228O0627j30721o0122L1023L6036j23503m9504j8748
7178b05263j2285K3689Q6226N192J64327J34860m181q9889o6609j38073l0967
$$ plain form
7167 -132973 12907 76559 82582 5929 -15386 7801 46556 -9900 8082 25533 -117166
7156 -117166 -216937 -193102 -170949 -113374 -129599 -89300 139634 191091 185477 122520 38973 -60870
7144 -60870 -82996 -127809 -26295 -58361 -32587 -94647 -87067 -12810 25330 6440 62790 133216
7132 133216 95266 39000 50632 45706 -24645 -22327 4799 34414 -72331 -192976 -120015 -24197
7120 -24197 54529 143124 106612 19859 118676 135159 -23568 -79295 52185 70693 42212
7109 42212 112960 100009 5571 -102884 -157829 -152705 -44947 15800 -95981 -110820 -12821
7098 -12821 -78058 -86747 -66227 -38756 -52856 -51620 37509 34645 -70762 -126426 -122116 -59953
7086 -59953 -59419 -38137 -147689 -111478 -67124 -123504 -161543 -236723 -123771 -164113 -27436 -7665
$$ packed form
7167a32973J45880O3652O023p6653k1315K3187L8755n6456J7982J7451j42699
7156a17166r9771K3835K2153N7575j6225M0299K28934N1457n614o2957q3547r9843
7144f0870k2126m4813J01514l2066K5774o2060P580P4257L8140j8890N6350P0426
7132A33216l7950n6266J1632m926p0351K318K7126K9615j06745j20645P2961R5818
7120b4197P8726Q8595l6512q6753R8817J6483j58727n5727J31480J8508k8481
7109D2212P0748j2951r4438j08455n4945N124J07758O0747j11781j4839R7999
7098a2821o5237q689K0520K7471j4100J236Q9129k864j05407n5664M310O2163
7086e9953N34K1282j09552L6211M4354n6380l8039p5180J12952m0342J36677J9771
$$ plain form
7074 -7665 -85444 -82968 -85477 -45202 180562 247243 174982 97840 -719 65101 54377 132760
7062 132760 160691 139835 56828 3736 -58190 -45488 -76726 -101413 17087 67511 179897
7051 179897 82962 -7713 11190 91157 81781 71575 -11360 37555 162427 185688 61701
7040 61701 26998 -68421 -128382 -83502 -29415 -52979 -91565 -85674 -104235 -94082 -96941 -106285
7028 -106285 -42924 -71525 -72013 52239 55972 -85170 -78665 10099 6407 13532 26773 91412
7016 91412 63003 48501 128438 206116 -9725 -105915 -132396 -95068 -19033 13715 -35864 -110664
7004 -110664 -124235 32026 66312 72126 92095 104940 -58427 26217 12385 -29869 -85303
6993 -85303 -95246 -112537 -135339 -5890 12017 -133362 -136204 -26992 18483 6461 -17759 -25446
$$ packed form
7074g665p7779K476k509M0275K25764O6681p2261p7142r8559O5820j0724P8383
7062A32760K7931k0856q3007n3092o1926J2702l1238k4687J18500N0424J12386
7051A79897r6935r0675J8903P9967r376j0206q2935M8915J24872K3261j23987
7040F1701l4703r5419n9961M4880N4087k3564l8586N891j8561J0153k859r344
7028a06285O3361k8601m88J24252L733j41142O505Q8764l692P125J3241O4639
7016I1412k8409j4502P9937P7678k15841r6190k6481L7328P6035L2748m9579p4800
7004a10664j3571J56261L4286N814J9969J2845j63367Q4644j3832m2254n5434
6993h5303r943j7291k2802J29449J7907j45379k842J09212M5475j2022k4220p687
$$ plain form
6981 -25446 19891 -84980 -79612 -30076 -43853 54465 167875 137916 98354 11980 -37324 116136
6969 116136 144327 127386 116343 135252 65564 31745 -31167 49217 20210 42501 105219 212303
6957 212303 212537 336931 296401 250598 148442 43954 -43631 33063 5154 -61709 -113690
6946 -113690 -32081 -13658 -83200 -91236 -63497 -109970 -25507 128339 66614 -144355 -84404
6935 -84404 -49085 -41909 -72397 -145127 -195624 -110848 -85917 -110382 -53505 -50299 -67461 -93316
6923 -93316 -115407 -58150 42964 39202 -178021 -306796 -317469 -212849 -128525 -103586 -146011
6912 -146011 -125610 104424 256320 261300 167781 130463 118523 71547 -38771 -16961 104870
6901 104870 86675 -93204 -117451 -126674 -193224 -190452 -114742 -181190 -147290 -36904 12675 62574
$$ packed form
6981b5446M5337j04871N368M9536j3777R8318J13410k9959l9562q6374m9304J53460
6969A16136K8191j6941j1043J8909o9688l3819o2912Q0384k9007K2291O2718J07084
6957B12303K34J24394m0530m5803j02156j04488q7585P6694k7909o6863n1981
6946a13690Q1609J8423o9542q036K7739m6473Q4463J53846o1725k10969N9951
6935h4404L5319P176l0488p2730n0497Q4776K4931k4465N6877L206j7162k5855
6923i3316k2091N7257J01114l762k17223j28775j0673J04620Q4324K4939m2425
6912a46011K0401K30034J51896M980r3519l7318j1940m6976j10318K1810J21831
6901A04870j8195j79879k4247r223o6550K772P5710o6448L3900J10386M9579M9899
$$ plain form
6889 62574 55478 59414 93777 43826 41872 9854 -58011 -70595 -14916 -98671 -73371 49173
6877 49173 93199 70036 41953 10053 -129961 -82577 36944 72985 70118 33695 15073 -8548
6865 -8548 -45308 -224377 -195271 -153282 -146617 -166656 50836 268442 303338 176419 45274
6854 45274 58232 -33479 -87450 -64958 -66537 133028 200789 -30401 -59968 11942 34999 59441
6842 59441 130614 156704 119244 68211 16303 49138 -427 82390 79828 -16521 -25543 -11115
6830 -11115 114422 172433 73381 38499 30950 40361 -121027 -146641 -104889 14574 64631 9700
6818 9700 -10043 -55280 -182772 -273393 -316185 -247932 -159662 -91251 -100412 -85506 -90347 30295
6806 30295 80157 102450 120298 49203 54498 111515 102497 -78883 -196559 -116196 -17810 34240
$$ packed form
6889F2574p096L936L4363m9951j954l2018o7865j2584N5679q3755K5300J22544
6877D9173M4026k3163k8083l1900j40014M7384J19521L6041k867l6423j8622k3621
6865h548l6760j79069K9106M1989O665k0039K17492K17606L4896j26919j31145
6854D5274J2958r1711n3971K2492j579J99565O7761k31190k9567P1910K3057K4442
6842E9441P1173K6090l7460n1033n1908L2835m9565Q2817k562r6349r022J4428
6830a1115J25537N8011r9052l4882p549R411j61388k5614M1752J19463N0057n4931
6818I700j9743m5237j27492r0621m2792O8253Q8270O8411r161J4906m841J20642
6806C0295M9862K2293J7848p1095N295N7017r018j81380j17676Q0363R8386N2050
$$ plain form
6794 34240 66187 56587 -14565 29070 58037 49892 -96780 -185270 -158519 -105187 -118799 -28209
6782 -28209 -68430 -164441 -149899 -179280 -210931 -308630 -213518 -56582 -121960 -145014 -2999
6771 -2999 28521 97848 209136 116667 31083 140134 46344 16868 16518 89576 2266 -36862
6759 -36862 602 -30223 -98469 -159825 -176675 -61999 -52280 -41357 62006 60417 -105578 -166936
6747 -166936 24571 -56485 -65796 6704 18695 83792 90210 82679 195709 201610 74791 -34631
6735 -34631 45580 47250 -164964 -153317 -86462 -48322 16096 37377 17161 71724 119457 111320
6723 111320 110468 43255 50561 64024 -23784 -89690 -110399 14634 57460 59172 94696 31804
6711 31804 -21292 -98610 -106310 -82683 36387 34151 -18659 -7610 -11885 -19434 -68564 -86131
$$ packed form
6794C4240L1947r600p1152M3635K8967q145j46672q8490K6751N3332j3612R0590
6782b8209m0221r6011J4542k9381l1651r7699R5112J56936o5378k3054J42015
6771b999L1520O9327J11288r2469q5584J09051r3790k9476l50P3058q7310l9128
6759c6862L7464l0825o8246o1356j6850J14676R719J0923J03363j589j65995o1358
6747a66936J91507q1056r311P2500J1991O5097O418p531J13030N901j26819j09422
6735c4631Q0211J670k12214J1647O6855L8140O4418K1281k0216N4563M7733q137
6723A11320q52o7213P306J3463q7808o5906k0709J25033M2826J712L5524o2892
6711C1804n3096p7318p700K3627J19070k236n2810J1049m275p549m9130j7567
$$ plain form
6699 -86131 -271086 -333033 -223765 -168580 -46111 -71678 -217451 -251701 -70042 -17930 -29679
6688 -29679 -15520 24187 -144901 -109150 -1088 134384 161022 171611 160654 96041 1074
6677 1074 -52857 -84531 -25194 94258 87140 -67824 -104764 -78818 -40845 20361 90311 127643
6665 127643 61932 6092 -105021 -101530 -102311 -68437 -10777 67549 91601 -132766 -176642 -43404
6653 -43404 -22153 -11617 -20015 -7974 -80642 -95476 -56675 -101145 -88862 -67414 -129770 -136251
6641 -136251 -149029 -70709 26255 46633 -9708 -38756 9969 67951 -13168 -52113 -24595 15479
6629 15479 71448 -27344 -54449 -33118 7259 -54161 -167256 -139832 -65584 53800 81652
6618 81652 115802 -2164 -42581 57505 -7680 -34482 -91240 17879 114048 133724 90037
$$ packed form
6699h6131j84955o1947J09268N5185J22469k5567j45773l4250J81659N2112j1749
6688b9679J4159L9707j69088L5751J08062J35472K6638J0589j0957o4613r4967
6677A074n3931l1674N9337J19452p118j54964l6940K5946L7973O1206O9950L7332
6665A27643o5711n5840j11113L491p81L3874N7660P8326K4052k24367m3876J33238
6653d3404K1251J0536q398J2041p2668j4834L8801m4470J2283K1448o2356o481
6641a36251j2778P8320R6964K0378n6341k9048M8725N7982q1119l8945K7518M0074
6629A5479N5969r8792k7105K1331M0377o1420j13095K7424P4248J19384K7852
6618H1652L4150j17966m0417J00086o5185k6802n6758J09119R6169J9676m3687
$$ plain form
6607 90037 81471 12452 -6389 -44376 -7159 79072 -37097 -85586 -17180 31658 46815 63957
6595 63957 57352 94183 133429 180570 214558 160496 32889 -13016 -9385 -20165 -53998 -122696
6583 -122696 -115345 -131782 -185612 -180761 -90856 72122 -35190 -30348 50072 50087 112127 94576
6571 94576 -48382 -153895 -100893 -81330 -31070 -12896 106616 222478 208073 125270 122572
6560 122572 73517 -146440 -44341 -21235 169389 179514 119683 289728 351856 342266 205469
6549 205469 -7981 -2604 115193 129354 140709 51249 -48017 -112565 -148931 -81335 -77526 -108910
6537 -108910 -94330 -144651 -52109 20434 -26758 -3985 -13092 39667 -44312 -141975 -237014 -189754
6525 -189754 -98533 13617 69583 -5759 -170012 -178622 -109893 28731 95142 129237 -8689
$$ packed form
6607I0037q566o9019j8841l7987L7217Q6231j16169m8489O8406M8838J5157J7142
6595F3957o605L6831L9246M7141L3988n4062j27607m5905L631j0780l3833o8698
6583a22696P351j6437n3830M851Q9905J62978j07312M842Q0420J5O2040j7551
6571I4576j42958j05513N3002J9563N0260J8174J19512J15862j4405q2803k698
6560A22572m9055k19957J02099K3106J90624J0125n9831J70045O2128r590j36797
6549B05469k13450N377J17797J4161J1355q9460r9266o4548l6366O7596L809l1384
6537a08910J4580n0321R2542P2543m7192K2773r107N2759q3979r7663r5039M7260
6525a89754R1221J12150N5966p5342j64253q610O8729J38624O6411L4095j37926
$$ plain form
6514 -8689 -172671 -60688 133755 183647 107925 105575 106385 61221 16501 -75166 -66689 -25031
6502 -25031 -120790 -113187 -145860 -189376 -143293 -12696 55603 60017 -35659 -24829 -5061 -67537
6490 -67537 -227160 -178241 -114572 2852 82474 79077 8581 -26565 7317 -24750 -23604 -141361
6478 -141361 -155298 -210876 -282293 -175868 48434 -26536 -136447 -162320 -155854 -55347 -81191
6467 -81191 -95639 -20861 87767 45662 92184 93693 84683 -76840 -72310 40844 29202 -84730
6455 -84730 -12443 13515 95347 139423 49803 36064 81732 10043 -3235 55485 56044 44995
6443 44995 23062 -90583 -101180 -43733 67034 -13928 -135425 -84258 -96838 -142318 -110222
6432 -110222 -38892 -16375 -61113 -117649 -71286 -14940 -15620 70446 95372 78408 45818 50293
$$ packed form
6514h689j63982J11983J94443M9892p5722k350Q10m5164m4720r1667Q477M1658
6502b5031r5759P603l2673m3516M6083J30597O8299M414r5676J0830J9768o2476
6490f7537j59623M8919O3669J17424P9622l397p0496l5146L3882l2067J146j17757
6478a41361j3937n5578p1417J06425K24302p4970j09911k5873O466J00507k5844
6467h1191j4448P4778J08628m2105M6522J509r010j61523M530J13154j1642j13932
6455h4730P2287K5958Q1832M4076q9620j3739M5668p1689j3278N8720N59j1049
6443D4995k1933j13645j0597N7447J10767q0962j21497N1167j2580m5480L2096
6432a10222P1330K2517m4738n6536M6363N6346o80Q6066K4926j6964l2590M475
$$ plain form
6420 50293 63457 -31611 65519 185993 141596 13685 32304 51345 40492 75768 86275
6409 86275 156068 135782 60787 53603 83395 81032 74322 -13391 -20504 -118111 -180495 -80544 -2729
6396 -2729 -40166 -150359 -185749 -102634 -34549 13764 44039 101089 169195 108095 26614 -132638
6384 -132638 -41587 -73907 -235057 -211658 -104297 -971 34200 55053 83051 102726 155793
6373 155793 34755 -14873 -83530 -185433 -117960 -38127 21040 28106 -55658 56802 171795
6362 171795 214560 94318 -12011 -118255 -166472 -153106 2 33270 28573 24172 -55971
6351 -55971 -124906 -172302 -100085 -111463 -173063 -130085 84070 119346 114289 26105 23365 -55904
6339 -55904 -13734 51857 -13165 -187672 -90951 3037 6615 -40807 32613 27144 -35805 137554
$$ packed form
6420E0293J3164r5068R7130J20474m4397j27911J8619J9041j0853L5276J0507
6409H6275O9793k0286p4995p184K9792k363o710q7713p113r7607o2384R9951P7815
6396b729l7437j10193l5390Q3115O8085M8313L0275N7050O8106o1100q1481j59252
6384a32638R1051l2320j61150K3399J07361J03326L5171K0853K7998J9675N3067
6373A55793j21038m9628o8657j01903O7473P9833N9167P066q3764J12460J14993
6362A71795M2765j20242j06329j06244m8217J3366J53108L3268m697m401q0143
6351e5971o8935m7396P2217j1378o1600M2978K14155L5276n057q8184k740p9269
6339e5904M2170O5591o5022j74507R6721R3988L578m7422P3420n469o2949J73359
$$ plain form
6327 137554 93946 -20455 5039 60205 -40350 -27590 -69427 -63746 -56672 -87100 -103862 -158894
6315 -158894 -178288 -9054 72705 56568 54498 26479 17135 32282 -27860 -34299 10236 -27911
6303 -27911 -137665 -146837 -34090 66179 75553 61965 22613 -1784 40531 -328 38914 34873
6291 34873 -34678 -107473 -66703 -94023 -172131 -116247 35756 151134 -43736 -140136 -153670
6280 -153670 -43199 -14770 -4775 100774 16155 -12623 -22068 -33547 -39649 -52324 70369 143913
6268 143913 37072 9654 107077 126960 -641 -154402 -124357 -9098 50258 57514 22108
6257 22108 117815 41651 -7673 39844 106032 69339 27117 -83863 -40891 -78131 -71741 -83723
$$ packed form
6327A37554m3608j14401K5494N5166j00555J2760m1837N681P074l0428j6762n5032
6315a58894j9394J69234Q1759j6137k070k8019r344J5147o0142o439M4535l8147
6303b7911j09754r172J12747J00269R374j3588l9352k4397M2315m0859L9242m041
6291C4873o9551p2795M0770k7320p8108N5884J52003J15378j94870r6400j3534
6280a53670J10471K8429R995J05549q4619k8778r445j1479o102j2675J22693P3544
6268A43913j06841k7418R7423J9883j27601j53761L0045J15259N9356P256l5406
6257B2108R5707p6164m9324M7517O6188l6693m2222j10980M2972l7240O390j1982
$$ [...]
##END NTUPLES=NMR SPECTRUM
##END=
