##TITLE=Analysis number 324067
Compound Code cc 57846
Book Reference 449/168
Project Code adrs
Chemist Name davee
##JCAMPDX= 6.0         $$ Bruker NMR JCAMP-DX V2.0
##DATA TYPE= NMR SPECTRUM
##DATA CLASS= NTUPLES
##ORIGIN= Bruker BioSpin GmbH
##OWNER= nmr
$$ XWIN-NMR		Version 3.5
$$ Tue Nov 14 13:51:38 2006 GMT Standard Time (UT+0h)  MAYBRIDGE\nmr@NMR_250MHZ
##.OBSERVE FREQUENCY= 250.131544655141
##.OBSERVE NUCLEUS= ^1H
##.ACQUISITION MODE= SIMULTANEOUS (DQD)
##.ACQUISITION SCHEME= undefined
##.AVERAGES= 16
##.DIGITISER RES= 18
##SPECTROMETER/DATA SYSTEM= dpx250
##.PULSE SEQUENCE= zg30
##.SOLVENT NAME= CDCl3
##.SHIFT REFERENCE= (INTERNAL, CDCl3, 0, 16.522)
##AUDIT TRAIL= $$ (NUMBER, WHEN, WHO, WHERE, WHAT)
$$ ##TITLE= Audit trail, XWIN-NMR		Version 3.5
$$ ##JCAMPDX= 5.01
$$ ##ORIGIN= Bruker BioSpin GmbH
$$ ##OWNER= nmr
$$ C:\u/data/dgb/nmr/ADRS/330/pdata/1/auditp.txt
$$ ##AUDIT TRAIL=  $$ (NUMBER, WHEN, WHO, WHERE, WHAT)
(   1,<2006-11-14 13:51:17.30 +000>,<MAYBRIDGE\nmr>,<NMR_250MHZ>,
      <created by zg, POWCHK disabled, PULCHK disabled
       configuration hash MD5:
       49 4B E0 1D 92 C2 6B 37 9F E6 65 BC 52 41 86 1D
       data hash MD5: 64K
       20 A4 65 1D 95 D1 2F 6A 50 BA AA F2 79 51 34 E7>)
(   2,<2006-11-14 13:51:29.51 +000>,<MAYBRIDGE\nmr>,<NMR_250MHZ>,
      <Start of raw data processing
       ef LB = 0.3 FT_mod = 6 PKNL = 1 SI = 32K 
       data hash MD5: 32K
       2E 1E 86 38 07 14 25 52 40 BC 3C FA 4C A5 E5 18>)
(   3,<2006-11-14 13:51:31.36 +000>,<MAYBRIDGE\nmr>,<NMR_250MHZ>,
      <apk 
       data hash MD5: 32K
       A1 0F BA 77 1C BA 9F 29 AD F5 6D 2A 24 DB 09 4C>)
(   4,<2006-11-14 13:51:32.09 +000>,<MAYBRIDGE\nmr>,<NMR_250MHZ>,
      <abs ABSG = 5 
       data hash MD5: 32K
       F4 3A 2D 5F A4 A9 53 F6 E3 2C F1 BC BE 87 E2 BB>)
$$ ##END=
$$ 
$$ hash MD5
$$ 51 42 84 21 A5 55 F7 E1 82 BF 07 03 78 C7 C2 A4
##$RELAX= 
##$RELAX= 
##$RELAX= 
##$RELAX= 
##$RELAX= 
##$RELAX= 
##$RELAX= 
$$ Bruker specific parameters
$$ --------------------------
##$DU= <C:\u>
##$EXPNO= 330
##$NAME= <ADRS>
##$PROCNO= 1
##$TYPE= <nmr>
##$USER= <dgb>
##$AMP= (0..31)
100 100 100 100 100 100 100 100 100 100 100 100 100 100 100 100 100 100 
100 100 100 100 100 100 100 100 100 100 100 100 100 100 
##$AQSEQ= 0
##$AQ_mod= 3
##$AUNM= <au_zg>
##$AUTOPOS= <44 >
##$BF1= 250.13
##$BF2= 250.13
##$BF3= 250.13
##$BF4= 250.13
##$BF5= 500.13
##$BF6= 500.13
##$BF7= 500.13
##$BF8= 500.13
##$BYTORDA= 1
##$CFDGTYP= 0
##$CFRGTYP= 5
##$CHEMSTR= <none>
##$CNST= (0..31)
1 1 145 1 1 1 1 1 1 1 1 1 1 1 1 1 1 1 1 1 1 1 1 1 1 1 1 1 1 1 1 1 
##$CPDPRG= <>
##$CPDPRG1= <>
##$CPDPRG2= <>
##$CPDPRG3= <>
##$CPDPRG4= <mlev>
##$CPDPRG5= <mlev>
##$CPDPRG6= <mlev>
##$CPDPRG7= <mlev>
##$CPDPRG8= <mlev>
##$CPDPRGB= <>
##$CPDPRGT= <>
##$D= (0..31)
0 1 0 0 0 0 0 0 0 0.06 0 0 0 0 0 0 0.0002 0 0 0 0 0 0 0 0 0 0 0 0 0 0 
0 
##$DATE= 1163512276
##$DBL= (0..7)
120 120 120 120 120 120 120 120 
##$DBP= (0..7)
150 150 150 150 150 150 150 150 
##$DBP07= 0
##$DBPNAM0= <>
##$DBPNAM1= <>
$$ [...]
##$SUBNAM7= <"">
##$SUBNAM8= <"">
##$SUBNAM9= <"">
##$SW= 20.6930455092707
##$SWIBOX= (0..15)
0 0 3 0 0 0 0 0 0 0 0 0 0 0 0 0 
##$SW_h= 5175.983436853
##$TD= 65536
##$TD0= 1
##$TE= 683.16
##$TE2= 300
##$TE3= 300
##$TEG= 300
##$TL= (0..7)
0 120 120 120 120 120 120 120 
##$TP= (0..7)
150 150 150 150 150 150 150 150 
##$TP07= 0
##$TPNAME0= <>
##$TPNAME1= <>
##$TPNAME2= <>
##$TPNAME3= <>
##$TPNAME4= <>
##$TPNAME5= <>
##$TPNAME6= <>
##$TPNAME7= <>
##$TPOAL= (0..7)
0.5 0.5 0.5 0.5 0.5 0.5 0.5 0.5 
##$TPOFFS= (0..7)
0 0 0 0 0 0 0 0 
##$TUNHIN= 0
##$TUNHOUT= 0
##$TUNXOUT= 0
##$USERA1= <user>
##$USERA2= <user>
##$USERA3= <user>
##$USERA4= <user>
##$USERA5= <user>
##$V9= 5
##$VALIST= <valist>
##$VCLIST= <CCCCCCCCCCCCCCC>
##$VD= 0
##$VDLIST= <DDDDDDDDDDDDDDD>
##$VPLIST= <PPPPPPPPPPPPPPP>
##$VTLIST= <TTTTTTTTTTTTTTT>
##$WBST= 1024
##$WBSW= 4
##$XGAIN= (0..3)
0 0 0 0 
##$XL= 0
##$YL= 0
##$YMAX_a= 503928
##$YMIN_a= -518115
##$ZGOPTNS= <>
##$ZL1= 120
##$ZL2= 120
##$ZL3= 120
##$ZL4= 120
##$ABSF1= 16.522
##$ABSF2= -4.171173
##$ABSG= 5
##$ABSL= 3
##$ALPHA= 0
##$AQORDER= 0
##$ASSFAC= 0
##$ASSFACI= 0
##$ASSFACX= 0
##$ASSWID= 0
##$AUNMP= <proc_1d>
##$AZFE= 0.1
##$AZFW= 0.1
##$BCFW= 0
##$BC_mod= 0
##$BYTORDP= 0
##$COROFFS= 0
##$CY= 12.5
##$DATMOD= 1
##$DC= 0
##$DFILT= <>
##$DTYPP= 0
##$F1P= 14.0000005364418
##$F2P= -0.99999901652339
##$FCOR= 0.5
##$FTSIZE= 32768
##$FT_mod= 6
##$GAMMA= 0
##$GB= 0
##$INTBC= 1
##$INTSCL= 1
##$ISEN= 128
##$LB= 0.3
##$LEV0= 0
##$LPBIN= 0
##$MAXI= 10000
##$MC2= 0
##$MEAN= 0
##$ME_mod= 0
##$MI= 0
##$NCOEF= 0
##$NC_proc= -3
##$NLEV= 6
##$NOISF1= 0
##$NOISF2= 0
##$NSP= 0
##$NTH_PI= 0
##$NZP= 0
##$OFFSET= 16.522
##$PC= 1
##$PHC0= -50.44169
##$PHC1= 5.104053
##$PH_mod= 1
##$PKNL= yes
##$PPARMOD= 0
##$PSCAL= 4
##$PSIGN= 0
##$REVERSE= no
##$SF= 250.13
##$SI= 32768
##$SIGF1= 0
##$SIGF2= 0
##$SINO= 400
##$SIOLD= 32768
##$SREGLST= <1H.CDCl3>
##$SSB= 0
##$STSI= 32768
##$STSR= 0
##$SW_p= 5175.98343685301
##$SYMM= 0
##$S_DEV= 0
##$TDeff= 65536
##$TDoff= 0
##$TI= <Analysis number 999999
Compound Code 99
Book Reference 9
Project Code 9>
##$TILT= no
##$TM1= 0
##$TM2= 0
##$TOPLEV= 0
##$USERP1= <user>
##$USERP2= <user>
##$USERP3= <user>
##$USERP4= <user>
##$USERP5= <user>
##$WDW= 1
##$XDIM= 32768
##$YMAX_p= 309750298
##$YMIN_p= -57537
$$ End of Bruker specific parameters
$$ ---------------------------------
##NTUPLES= NMR SPECTRUM
##VAR_NAME=  FREQUENCY,     SPECTRUM/REAL,   SPECTRUM/IMAG
##SYMBOL=    X,             R,               I
##VAR_TYPE=  INDEPENDENT,   DEPENDENT,       DEPENDENT
##VAR_FORM=  AFFN,          ASDF,            ASDF
##VAR_DIM=   32768,         32768,           32768
##UNITS=     HZ,            ARBITRARY UNITS, ARBITRARY UNITS
##FACTOR=    0.157963299565203, 1,           1
##FIRST=     4132.6476996994, 0,             0
##LAST=      -1043.33573715361, 0,           0
##MIN=       -1043.33573715361, -57537,      0
##MAX=       4132.6476996994, 309750298,     0
$$ Real data points
##PAGE= N=1
##DATA TABLE= (X++(R..R)), XYDATA
$$ [...]
$$ plain form
16532 6112 16700 10079 -23547 -38274 -36609 -28070 -25267 -12268 -6733 -5244 -8829 -11555 -5067 5736
16518 5736 -5613 -24917 -35738 -38238 -29900 -20229 -6853 1043 -6561 -6873 1783 -8553 -26055
16505 -26055 -38329 -36707 -20843 -14101 -16375 -9986 -8174 -3944 -12547 -8586 20787 26884 22937 25365
16491 25365 13166 10368 282 -522 -7678 -11979 -19950 -20301 -13892 -9851 -8711 -11951 -33389 -38094
16477 -38094 -27744 -21468 -17748 -20377 -20633 -11168 -10786 -16309 -22862 -19334 -25336 -26565 -19035 -15905 -15997
16462 -15997 -8592 -8755 -5002 11723 22386 18286 6106 6803 6544 1199 -3236 -5253 -578 -2149
16448 -2149 -8988 -19879 -35348 -33405 -15076 -7008 -6129 -3339 -16665 -12603 350 6391 20341
16435 20341 21112 3255 -15252 -19170 -5702 -790 -4512 -1721 -8589 -22070 -19149 -15884 -26658
$$ packed form
16532F112J0588o621l3626j4727J665Q539K803J2999N535J489l585k726O488J0803
16518E736j1349j9304j0821k500Q338R671J3376P896p604l12Q656j0336j7502
16505b6055j2274J622J5864O742k274O389J812M230q603L961K9373O097l947K428
16491B5365j2199k798j0086q04p156m301p971l51O409M041J140l240k1438m705
16477c8094J0350O276L720k629k56R465L82n523o553L528o002j229P530L130r2
16462a5997P405j63L753J6725J0663m100j2180O97k59n345m435k017M675j571
16448b149o839j0891j5469J943J8329Q068Q79K790j3326M062J2953O041J3950
16435B0341P71j7857j8507l918J3468M912l722K791o868j3481K921L265j0774
$$ plain form
16422 -26658 -25413 -24352 -11109 -5941 -9677 -12329 -6979 -3759 -11348 -12844 -5308 -9360 -18115 -5650
16408 -5650 -2547 -3047 -11947 -19260 -13818 1989 -10267 -12779 -526 1409 -790 -2989 855 1501
16394 1501 -3471 -2673 -14858 -16094 -26638 -19816 1174 4035 -2099 -10390 6400 5984 -6988 -19744
16380 -19744 -19383 -10388 -7361 -9867 3874 8414 19533 15959 -170 -5945 -10864 -19324 -24973 -30252
16366 -30252 -28920 -27182 -24439 -29765 -21270 -14931 -19095 -18116 -23470 -25199 -17924 -22510 -21789 -20970 -19144
16351 -19144 -10731 -15495 -15175 -17448 -17472 -21553 -17291 -21390 -27703 -21190 -13630 -13818 -3524 5959 13470
16336 13470 14255 22178 11230 2363 -1138 -454 6555 4864 9445 6641 2528 9557 15016 13010 -3571
16321 -3571 -17363 -11938 -16957 -29234 -45371 -38094 -21731 -18416 -12396 2274 15932 14340 10223
$$ packed form
16422b6658J245J061J3243N168l736k652N350L220p589j496P536m052q755J2465
16408e650L103n00q900p313N442J5807j2256k512J2253J935k199k199L844O46
16394A501m972P98j2185j236j0544O822K0990K861o134q291J6790m16j2972j2756
16380a9744L61Q995L027k506J3741M540J1119l574j6129n775m919q460n649n279
16366c0252J332J738K743n326Q495O339m164R79n354j729P275m586P21Q19J826
16351a9144Q413m764L20k273k4m081M262m099o313O513P560j88J0294R483P511
16336A3470P85P923j0948q867l501O84P009j691M581k804m113P029N459k006j6581
16321c571j3792N425n019j2277j6137P277J6363L315O020J4670J3658j592m117
$$ plain form
16308 10223 9892 11313 -273 -23371 -25801 -17808 -21167 -34578 -34424 -25576 -6269 -3461 -20122 -29803
16294 -29803 -19609 -17894 -8359 3007 14854 16096 11131 18508 14140 7715 1517 -14369 -14912 2406
16280 2406 8055 937 -1711 -80 5870 -4647 -18135 -11565 301 -5343 -28506 -20935 -10539
16267 -10539 -15168 -8029 2483 8490 5458 8887 16695 4761 -11512 -25846 -37363 -33553 -28022
16254 -28022 -34496 -30575 -22415 -17753 -25542 -29951 -28192 -21976 -21054 -28159 -30502 -21027 -11268 -6051 -6473
16239 -6473 -6411 15377 20533 8537 -3360 -3580 2962 9803 13378 9168 -6281 -9068 -1439 -7037
16225 -7037 -4877 -14799 -27234 -39328 -44457 -31608 -13025 6157 14817 5113 -4694 -9098 -20527
16212 -20527 -16225 -13402 -29655 -25192 -28755 -27402 -27976 -15558 -9033 -8048 -10780 -12761 -27325 -30637
$$ packed form
16308A0223l31J421j1586k3098k430P993l359j3411J54Q848J9307K808j6661r681
16294b9803J0194J715R535J1366J1847J242m965P377m368o425o198j5886n43J7318
16280B406N649p118k648J631N950j0517j3488O570J1866n644k3163P571J0396
16267a0539m629P139J0512O007l032L429P808j1934j6273j4334j1517L810N531
16254b8022o474L921Q160M662p789m409J759O216R22p105k343R475R759N217m22
16239f473O2K1788N156j1996j1897k20O542O841L575m210j5449k787P629n598
16225g037K160r922j2435j2094n129J2849J8583J9182Q660r704r807m404j1429
16212b0527M302K823j6253M463l563J353n74J2418O525R85k732j981j4564l312
$$ plain form
16198 -30637 -25072 -7301 2250 906 -8826 -17094 -13510 1583 460 -7969 -17123 -13312 -11153 -22330
16184 -22330 -30883 -24608 -20962 -15613 -7766 -16354 -14411 -9198 -5572 -10503 -20217 -17020 -1396 -3487
16170 -3487 -20409 -32981 -27702 -41044 -41079 -33542 -26171 -35283 -47526 -30779 -30266 -25536 -15207 -17305
16156 -17305 -18076 -24438 -28906 -22276 -14330 -10681 -23626 -15489 -3205 52 -9085 -8368 -4116 -18384
16142 -18384 -19711 -11015 -6627 -18771 -10293 -4880 -7832 -1528 383 1950 -3297 -8198 -1470 908
16128 908 -6517 993 -8146 -19566 -21910 -10796 -11291 -23194 -25637 -16405 -13206 -13188 -3587 -375 -2098
16113 -2098 -2173 -9960 -17312 -18751 -21240 -16267 -17331 -23397 -16012 -15292 -9473 -12883 -24063 -24475 -19764
16098 -19764 -14740 -7819 -6964 -8140 -7267 -19283 -30685 -19061 -3364 2847 3121 9 8578 12170
$$ packed form
16198c0637N565J7771R551j344r732q268L584J5093j123q429r154L811K159j1177
16184b2330q553O275L646N349P847q588J943N213L626m931r714L197J5624k091
16170c487j6922j2572N279j3342l5P537P371r112j2243J6747N13M730J0329k098
16156a7305p71o362m468O630P946L649j2945Q137J2284L257r137P17M252j4268
16142a8384j327Q696M388j2144Q478N413k952O304J911J567n247m901O728K378
16128I08p425P510r139j1420k344J1114m95j1903k443R232L199J8R601L212j723
16113b098p5p787p352j439k489M973j064o066P385P20N819l410j1180m12M711
16098a9764N024O921Q55j176Q73j2016j1402J1624J5697O211K74l112Q569L592
$$ plain form
16084 12170 9738 -2319 -12540 -1199 13142 18524 7995 -17002 -33095 -28714 -29879 -30975 -22111
16071 -22111 -7431 -7127 -14991 -4177 -6652 -10235 -11554 -28613 -26899 -19104 -19665 -28247 -23351 -16042
16057 -16042 -1764 -354 -1413 -4545 4520 12613 11149 1632 -9825 4503 22531 23099 12215
16044 12215 6749 5384 -3214 -3264 -10738 -17168 -29359 -32661 -18925 -10755 -6317 -8966 -13765 -16237
16030 -16237 -10087 -3561 -10894 -23677 -38639 -37574 -37280 -15297 -9617 -600 -2709 2425 789 -181
16016 -181 4681 12373 3747 -15506 -17571 -16582 -2206 6092 -6098 -10892 -8367 -383 -15565 -8861
16002 -8861 -17775 -12792 -13283 -25332 -31865 -20068 -1536 8723 9521 -2201 -10811 -7476 -2994 4239
15988 4239 -12473 -16857 -9844 -11094 -20340 -28672 -24083 -11339 -16860 -25293 -26669 -3014 21602 15394
$$ packed form
16084A2170k432j2057j0221J1341J4341N382j0529k4997j6093M381j165j096Q864
16071b2111J4680L04p864J0814k475l583j319j7059J714P795n61q582M896P309
16057a6042J4278J410j059l132R065Q093j464r517j1457J4328J8028N68j0884
16044A2215n466j365q598n0p474o430j2191l302J3736Q170M438k649m799k472
16030a6237O150O526p333j2783j4962J065K94K1983N680R017k109N134j636r70
16016a81M862P692q626j9253k065R89J4376Q298j2190m794K525P984j5182O704
16002h861q914M983m91j2049o533J1797J8532J0259P98j1722q610L335M482P233
15988D239j6712m384P013j250r246q332M589J2744n521q433j376K3655K4616o208
$$ plain form
15974 15394 -299 11854 14841 16753 -4082 -20096 -27629 -29076 -21383 -5829 552 2142 -5267
15961 -5267 -8953 -4512 -194 -12931 -13551 -11930 -13505 -25008 -40359 -33701 -21615 -24200 -22549 -16267
15947 -16267 -15503 -10126 -19330 -29675 -32333 -27512 -21138 -19693 -33998 -33699 -50030 -57537 -41747 -33547
15933 -33547 -18246 -4673 4409 1240 -10633 -333 16190 10735 2341 1614 1856 -9144 -8820 -3286
15919 -3286 -1253 -1964 -3692 -11159 -12219 440 7801 -6591 -32913 -37091 -29323 -21129 -14929 -11792
15905 -11792 -13141 -11882 -4072 12674 11238 911 -7386 -12750 -8250 -1426 -6949 -19650 -21035 -26879
15891 -26879 -23601 -15076 -11631 -21877 -31097 -20239 -6872 -13645 -18942 -25666 -44507 -35924 -105
15878 -105 12918 15053 2960 3332 2886 2537 -1818 -13796 -19131 -19203 -9298 -5582 5391 11034 -4525
$$ packed form
15974A5394j5693J2153K987J912k0835j6014p533j447P693J5554O381J590p409
15961e267l686M441M318j2737o20J621j575j1503j5351O658J2086k585J651O282
15947a6267P64N377r204j0345k658M821O374J445j4305K99j6331p507J5790Q200
15933c3547J5301J3573R082l169j1873J0300J6523n455q394p27K42j1000L24N534
15919c286K033p11j728p467j060J2659P361j4392k6322m178P768Q194O200L137
15905a1792j349J259P810J6746j436j0327q297n364M500O824n523j2701j385n844
15891b6879L278Q525L445j0246r220J0858J3367o773n297o724j8841Q583L5819
15878a05J3023K135j2093L72m46l49m355j1978n335p2R905L716J0973N643j5559
$$ plain form
15863 -4525 -9895 -11140 -8341 7894 25596 3635 -13564 -15797 -17342 -27016 -32990 -9299 3133
15850 3133 -6994 -28073 -31779 -13497 -9638 -20851 -23326 -14698 -4162 -23015 -29357 -36693 -35468
15837 -35468 -37994 -48735 -37811 -25452 -18445 -28206 -28075 -19824 -10020 -19581 -28109 -34517 -21798 -18215
15823 -18215 -20666 -14565 -15343 -17582 -20694 -17294 -16847 -9276 -4519 -11776 -17114 -22474 -24077 -14594 -779
15808 -779 -349 2659 4709 2214 1273 -5167 -4106 -10795 -21276 -10012 -18012 -14420 -2987 9964
15794 9964 6802 -3496 -6902 -21709 -14604 -886 -6963 -17665 -23422 -12321 -5075 -1341 -20626
15781 -20626 -23376 -19391 -10175 -10869 -15808 -24406 -22734 -17354 -9006 -6811 780 6883 2637 -10922
15767 -10922 -33537 -54751 -48485 -44437 -22385 -20482 -18426 -7216 -13623 -20836 -23520 -18757 -17269
$$ packed form
15863d525n370j245K799J6235J7702k1961j7199k233j545r674n974K3691J2432
15850C133j0127k1079l706J8282L859j1213k475Q628J0536j8853o342p336J225
15837c5468k526j0741J0924J2359P007r761J31Q251R804r561q528o408J2719L583
15823a8215k451O101p78k239l112L400M47P571M757p257n338n360j603R483J3815
15808g79M30L008K050k495r41o440J061o689j0481J1264q000L592J1433J2951
15794I964l162j0298l406j4807P105J3718o077j0702n757J1101P246L734j9285
15781b0626k750L985R216o94m939q598J672N380Q348K195P591O103m246j3559
15767a0922k2615k1214O266M048K2052J903K056J1210o407p213k684M763J488
$$ plain form
15754 -17269 -18715 -16599 -25797 -19159 -11388 -11220 -15854 -27937 -34102 -39250 -29773 -18727 -11719 -849
15740 -849 -12851 -30588 -23222 -7747 -14781 -26047 -14968 -15725 -22172 -14261 -26504 -25934 -43646 -44162
15726 -44162 -38380 -29985 -28225 -34409 -31581 -21362 -25496 -15955 -1831 8902 7898 10126 -3268
15713 -3268 -13037 -17359 -16379 -16341 -15242 -10511 -22066 -20006 -10996 -6117 -1674 -3931 -6890 -6593 -12303
15698 -12303 -5667 3977 10343 4752 -4700 -4131 4315 7760 -6654 -31978 -36036 -18877 -8638 -15952
15684 -15952 -28249 -31593 -43437 -29084 -15902 -16155 -10469 -6761 -9090 -7642 -11192 -12898 -13129 -16506
15670 -16506 -11834 -19642 -20684 -21992 -19652 -8252 2189 9845 -2825 2135 -4939 -23767 -24126 -16300
15656 -16300 -30548 -45003 -34191 -29170 -23572 -17486 -25143 -16160 -18631 -13642 -11261 -10860 -8055 -12891
$$ packed form
15754a7269j446K116r198O638P771J68m634j2083o165n148R477J1046P008J0870
15740h49j2002j7737P366J5475p034j1266J1079p57o447P911j2243N70j7712n16
15726d4162N782Q395J760o184K828J0219m134R541J4124J0733j004K228j3394
15713c268r769m322R80L8J099M731j1555K060R010M879M443k257k959K97n710
15698a2303O636R644O366n591r452N69Q446L445j4414k5324m058J7159J0239p314
15684a5952j2297l344j1844J4353J3182k53N686L708k329J448l550j706k31l377
15670a6506M672p808j042j308K340J1400J0441P656j2670M960p074j8828l59P826
15656a6300j4248j4455J0812N021N598O086p657Q983k471M989K381M01K805m836
$$ plain form
15642 -12891 -15057 -14255 -12076 -19762 -22085 -20855 -18089 -26980 -33983 -27268 -27938 -11683 -3824 -5942 -15825
15627 -15825 -27595 -34969 -22893 -11792 -2321 -10926 -18724 -14976 -20107 -27366 -28121 -18832 -14368 -17369
15613 -17369 -16900 -19929 -20204 -4892 -3863 -14203 -15543 -17474 -21786 -18324 -12292 -2406 -504 -6216
15599 -6216 -11446 3635 1165 -3130 -18746 -5788 -516 -4117 -3832 -10567 -18704 -26170 -14376 -8085
15585 -8085 2056 -4182 -14652 -8008 -8103 -17180 -21775 -13698 -5535 -12915 -14415 -7743 -27497 -38147
15571 -38147 -34218 -32553 -37432 -35309 -32447 -25022 -17467 -13627 -10749 -24224 -23605 -19029 -9510 4362
15557 4362 -4288 -13215 -21384 -19203 -8978 -14356 -8861 -19529 -17809 -26953 -41186 -36837 -21665 -18311
15543 -18311 -12888 -8310 -11406 -2688 -500 -15436 -15677 -4493 -13661 -22473 -29706 -18575 -13728 -9171
$$ packed form
15642a2891k166Q02K179p686k323J230K766q891p003O715o70J6255P859k118r883
15627a5825j1770p374J2076J1101R471q605p798L748n131p259p55R289M464l001
15613a7369M69l029k75J5312J029j0340j340j931m312L462O032R886J902n712
15599f216n230J5081k470m295j5616J2958N272l601K85o735q137p466J1794O291
15585h085J0141o238j0470O644r5r077m595Q077Q163p380j500O672j9754j0650
15571c8147L929J665m879K123K862P425P555L840K878j3475O19M576R519J3872
15557D362q650q927q169K181J0225n378N495j0668J720r144j4233M349J5172L354
15543a8311N423M578l096Q718K188j4936k41J1184r168q812p233J1131M847M557
$$ plain form
15529 -9171 -8492 -12041 -11265 -7796 -1059 -10064 -16031 -16819 -13807 -15790 712 8684 10581 5358 13130
15514 13130 13039 12026 12772 9813 -3654 496 -5779 -17336 -10311 -1884 -1872 -5232 -11440 -20702 -34886
15499 -34886 -38103 -33664 -37652 -29901 -19473 -20776 -20266 -16765 -21640 -11996 -15611 -23629 -21989 -34353
15485 -34353 -33976 -18517 -2604 8977 7140 -3805 -10469 -4559 -3698 -3469 -14805 -28676 -28917 -27606
15471 -27606 -20863 -27875 -35761 -28940 -24426 -18660 -13976 -7305 -12359 -20780 -17621 -6736 4246 2174
15457 2174 -12307 -10293 -12360 -13183 -28179 -50425 -39934 -29653 -25721 -30426 -20701 -13041 -11082 -7428
15443 -7428 -14326 -26551 -19705 -17994 -15152 -28816 -23369 -18519 -28011 -32777 -41922 -36528 -22183 -18923
15429 -18923 -10771 -5988 -1703 4365 -6416 -12634 -24278 -19031 -2117 -6585 -25697 -23436 -15147
$$ packed form
15529i171O79l549P76L469O737r005n967p88L012j983J6502P972J897n223P772
15514A3130r1j013P46k959j3467M150o275j1557P025Q427J2l360o208r262j4184
15499c4886l217M439l988P751J0428j303N10L501m875R644l615q018J640j2364
15485c4353L77J5459J5913J1581j837j0945o664N910Q61K29j1336j3871k41J311
15471b7606O743p012p886O821M514N766M684O671n054q421L159J0885J0982k072
15457B174j4481K014k067q23j4996k2246J0491J0281L932m705R725P660J959L654
15443g428o898j2225O846J711K842j3664N447M850r492m766r145N394J4345L260
15429a8923Q152M783M285O068j0781o218j1644N247J6914m468j9112K261Q289
$$ plain form
15416 -15147 -15684 -17504 -4301 12032 10150 -5121 -519 -391 -5806 -4274 3515 6454 2819 -4053
15402 -4053 1068 17137 16686 11202 25306 23140 18749 21463 6449 3919 -1702 -20871 -29209 -16528
15388 -16528 -15631 -19253 -19297 -1182 -6797 -23123 -18520 -10526 -14834 -16004 -20362 -27960 -35530 -27043 -17523
15373 -17523 -18664 -18832 -11863 -13068 -3616 -1042 -5365 10949 9694 -11923 -18279 -14059 -18328 -21414
15359 -21414 -15598 330 3076 -10389 -3398 10480 8752 13555 16740 11968 -4351 1476 2283 2867
15345 2867 3839 -598 -16486 -19351 -21760 -13492 -3190 -3430 -5226 -13495 -973 130 -2324 -3831
15331 -3831 -2299 -3821 3207 -6631 -17996 -13445 3426 4960 -14655 -18327 -12664 -12724 -15351 -6024
15317 -6024 -1070 -4538 -1829 -14547 -15083 -8774 -1347 -14113 -17892 -8496 119 3971 -7021 -9447
$$ packed form
15416a5147n37j820J3203J6333j882j5271M602J28n415J532P789K939l635o872
15402d053N121J6069m51n484J4104k166m391K714j5014k530n621j9169q338J2681
15388a6528Q97l622m4J8115n615j6326M603P994m308j170m358p598p570Q487R520
15373a7523j141j68O969j205R452K574m323J6314j255k1617o356M220m269l086
15359b1414N816J5928K746j3465O991J3878j728M803L185m772j6319N827Q07N84
15345B867R72m437j5888k865k409Q268J0302k40j796q269J2522J103k454j507
15331c831J532j522P028r838j1365M551J6871J534j9615l672N663o0k627R327
15317f024M954l468K709j2718n36O309P427j2766l779R396Q615L852j0992k426
$$ plain form
15303 -9447 -17309 -12478 -7440 4884 5335 2550 -8908 -15137 -17681 -7533 -13558 -29980 -12438 4444
15289 4444 -1267 -6252 -1019 -10524 -25173 -28017 -10394 -6553 1937 2434 -12831 -14185 -15525 -26687
15275 -26687 -36260 -32173 -22767 -24440 -11718 -8728 -8791 -7738 -3278 575 -7974 -15581 -25228 -32617 -23242
15260 -23242 3313 8657 2430 -7303 -27185 -22906 -32255 -31036 -13615 -2459 -16686 -19240 -15797
15247 -15797 -16947 -16863 -24811 -22842 -10387 -14319 -7863 7825 7696 -2938 -2545 1206 2337 359 -1148
15232 -1148 -3090 1711 -7401 -18691 -15831 -16001 -17895 -9741 -206 6443 1965 -2709 -2198 5893 -418
15217 -418 3806 4780 -7476 -4905 -2555 1383 -1934 -7773 -9805 -17599 -19210 -29296 -32443 -27210 -25808
15202 -25808 -32596 -27262 -22963 -21258 -20136 -34196 -30816 -22276 -13599 -17644 -27369 -19959 -9404 -15053
$$ packed form
15303i447p862M831N038J2324M51k785j1458o229k544J0148o025j6422J7542J6882
15289D444n711m985N233r505j4649k844J7623L841Q490M97j5265j354j340j1162
15275b6687r573M087R406j673J2722K990o3J053M460L853q549p607r647p389R375
15260b3242K6555N344o227r733j9882M279r349J219J7421J1156j4227k554L443
15247a5797j150Q4p948J969J2455l932O456J5688j29j0634L93L751J131j978j507
15232a148j942M801r112j1290K860j70j894Q154R535O649m478m674N11Q091o311
15217d18M224R74j2256K571K350L938l317n839k032p794j611j0086l147N233J402
15202b5808o788N334M299J705J122j4060L380Q540Q677m045r725P410J0555n649
$$ plain form
15188 -15053 -19304 -16240 -13930 -2833 1000 -3747 -5679 -2318 -7122 -16200 -32421 -35854 -23309 -33289
15174 -33289 -38000 -22414 -17219 -18545 -13201 -14367 -17476 -19380 -2593 6050 -1098 -12550 -17166 -22938
15160 -22938 -20820 -8315 -13698 -15713 -8124 -20147 -21817 -18702 -13405 -12144 -20752 -19894 -20946 -18371
15146 -18371 -23817 -30986 -31077 -30963 -10681 -5408 -15518 -4681 -13137 -19597 -9813 7808 13615 6696
15132 6696 1596 -4943 -1470 -15284 -22332 -25956 -26047 -30887 -24964 -6244 1709 -11604 -8256 -3293
15118 -3293 -5681 -5662 -11847 -6390 6175 -11932 -12358 -8233 -34110 -35020 -24788 -5479 15060 21675
15104 21675 19023 -2195 -7699 -4545 11298 14078 -517 -14102 -28972 -27093 -29256 -29503 -21391
15091 -21391 -16424 -32587 -26311 -22068 -13767 -10969 -2043 -9655 -8760 -15241 -18420 -11268 -27556 -38507
$$ packed form
15188a5053m251L064K310J1097L833m747j932L361m804r078j6221l433J2545r980
15174c3289m711J5586N195j326N344j166l109j904J6787Q643p148j1452m616n772
15160b2938K118J2505n383k015P589j2023j670L115N297J261q608Q58j052K575
15146a8371n446p169r1J14K0282N273j0110J0837q456o460R784J7621N807o919
15132F696n100o539L473j3814p048l624r1m840N923J8720P953j3313L348M963
15118c293k388J9o185N457J2565j8107m26M125k5877r10J0232J9309K0539O615
15104B1675k652k1218n504L154J5843K780j4595j3585j4870J879k163k47Q112
15091b1391M967j6163O276M243Q301K798Q926p612Q95o481l179P152j6288j0951
$$ plain form
15077 -38507 -21546 -20063 -10010 674 -26 -3762 -15114 -4165 -1251 -6430 -12692 -4181 -16072
15064 -16072 -13799 -10774 -12609 -16442 -15709 -13810 -6609 -6610 -3660 -6647 -10600 -10774 13901 20075 8242
15049 8242 3613 14383 9919 -3719 -417 -4905 -14836 -13109 -13036 -18956 -17022 -12609 -16257 -29766
15035 -29766 -34914 -28085 -19104 -12333 -8654 -6495 -13206 -19004 -9888 -3099 6971 5637 11369 9349
15021 9349 8819 7897 19004 21801 8099 2095 -3392 -4524 -3115 -7376 -24908 -23409 -19672 -23023
15007 -23023 -13898 -5212 -15478 -12653 5702 3911 -3165 -9985 -20040 -23285 -15258 -12898 -12002 -24029
14993 -24029 -19120 -26644 -13478 -13889 -15788 -30490 -29774 -18041 -37337 -45143 -38808 -46255 -53287 -54208
14979 -54208 -35814 -34053 -31990 -24357 -33913 -39778 -28377 -35447 -29999 -11412 2039 -7474 -1525
$$ packed form
15077c8507J6961J483J0053J0684p00l736j1352J0949K914n179o262Q511j1891
15064a6072K273L025j835l833P33J899P201jK950k987l953j74K4675O174j1833
15049H242m629J0770m464j3638L302m488r931J727P3n920J934M413l648j3509
15035b9766n148O829Q981O771L679K159o711n798R116O789J0070j334N732k020
15021I349n30r22J1107K797j3702o004n487j132J409m261j7532J499L737l351
15007b3023R125Q686j0266K825J8355j791p076o820j0055l245Q027K360Q96j2027
14993b4029M909p524J3166m11j899j4702P16J1733j9296p806O335p447p032r21
14979e4208J8394J761K063P633r556n865J1401p070N448J8587J3451r513N949
$$ plain form
14966 -1525 -3152 2353 1197 -347 3968 -8258 2294 64 -8921 -13398 -10531 -7387 1522 4320
14952 4320 -7502 -18800 -23221 -3274 2897 -32 779 -8845 -10254 -769 -1111 -8520 -8756 -11027 -11349
14937 -11349 -13357 -22226 -22296 -10294 -19352 -7839 -1999 -6091 -9620 -6288 -3878 3523 -3993 -7691
14923 -7691 -13989 -4346 4569 -8335 -29815 -32774 -36897 -27548 -13904 -6767 -1095 -2072 -11511 -13930
14909 -13930 -17116 -14652 -7970 -1315 15370 22152 13861 5766 -12170 -17962 -19648 -18591 -18903 -16461
14895 -16461 -5756 -8012 -8094 -4023 7611 2486 1052 -3006 -6898 -11163 -15743 -29434 -35396 -34492
14881 -34492 -26922 -24186 -18799 -30033 -32826 -18257 -9121 89 -2099 -2622 -20254 -18452 -7066 -15337
14867 -15337 -13179 2953 -2615 -4006 1913 -12708 -11660 -838 619 -10648 -10967 -18374 -9552 5173
$$ packed form
14966a525j627N505j156j544M315j2226J0552k230q985m477K867L144Q909K798
14952D320j1822j1298m421J9947O171k929Q11r624j409R485l42p409k36k271l22
14937a1349k008q869p0J2002r058J1513N840m092l529L332K410P401p516l698
14923g691o298R643Q915j2904k1480k959m123R349J3644P137N672r77r439k419
14909a3930l186K464O682O655J6685O782q291q095j7936n792j686J057l12K442
14895a6461J0705k256q2M071J1634n125j434m058l892m265m580j3691n962R04
14881c4492P570K736N387j1234k793J4569R136R210k188n23j7632J802J1386q271
14867a5337K158J6132n568j391N919j4621J048J0822J457j1267l19p407Q822J4725
$$ plain form
14853 5173 2451 -9398 -17871 -16475 1497 5885 3843 -1656 -8687 3914 4805 2392 -828 -20188
14839 -20188 -21010 -22466 -19964 -24507 -17949 -8753 -5772 -10149 -11349 -5785 19798 22683 4096 -937
14825 -937 -9231 -14904 -7809 -5331 54 4321 -6975 -16179 -3881 6566 16144 12717 4286 4422
14811 4422 4883 2711 5659 2444 -3698 -2723 -4064 1077 3684 5215 13088 6864 -17166 -24506 -35338
14796 -35338 -34625 -30078 -35296 -11513 -8525 -9229 -13898 -21407 -20923 -27239 -20064 -25324 -28883 -10825 -3039
14781 -3039 -4402 -2756 1834 -9705 -27307 -29011 -16365 2323 16494 18240 12047 -3400 -4562
14768 -4562 914 31 1817 17403 20290 14072 12015 15444 9369 -1360 4943 12402 13036 5096 10740
14753 10740 7641 14507 5775 14707 12671 2326 -9871 -6292 -5051 -497 2799 -9035 -12245 -8051
$$ packed form
14853E173k722j1849q473J396J7972M388k042n499p031J2601Q91k413l220j9360
14839b0188q22j456K502m543O558R196K981m377j200N564K5583K885j8587n033
14825i37q294n673P095K478N385M267j1296r204J2298J0447R578l427q431J36
14811D422M61k172K948l215o142R75j341N141K607J531P873o224k4030p340j0832
14796c5338P13M547n218K3783K988p04m669p509M84o316P175n260l559J8058P786
14781c039j363J646M590j1539j7602j704J2646J8688J4171J746o193j5447j162
14768d562N476q83J786J5586K887o218k057L429o075j0729O303P459O34p940N644
14753A0740l099O866q732Q932k036j0345j2197L579J241M554L296j1834l210M194
$$ plain form
14739 -8051 289 -14035 -25700 -9400 -2727 -4129 -11541 -23054 -14361 -1341 -2771 -13711 -19277
14726 -19277 944 -2847 -23632 -27398 -8680 -3100 -10757 -20179 -13634 551 11353 7737 -6656
14713 -6656 -5808 -9499 -18256 -18720 -10428 3170 3255 -13512 -13910 -16145 -8459 10060 3893 -5364 -14025
14698 -14025 3334 5607 5781 14038 12645 2868 -4507 16438 15036 -4566 7024 12148 6721 6585
14684 6585 8041 3045 -1012 -1899 408 -15319 -18423 -10062 -9824 -19580 -9195 -386 7280 5494 -9842
14669 -9842 -14184 -13107 -13944 -19506 -31666 -30923 -27787 -19831 -8799 -2911 8688 15446 8766 -2088
14655 -2088 -5871 13477 20877 22315 12245 5579 11209 20508 22544 6631 1372 1881 -5836 -12868
14641 -12868 -3816 -6518 -1240 2605 5952 16309 21990 7672 -13113 -23080 -27889 -37156 -34516 -34335
$$ packed form
14739h051Q340j4324j1665J6300O673j402p412j1513Q693J3020j430j0940n566
14726a9277K0221l791k0785l766J8718N580p657r422O545J4185J0802l616j4393
14713f656Q48l691q757m64Q292J3598Q5j6767l98k235P686J8519o167r257q661
14698a4025J7359K273J74Q257j393r777p375K0945j402j9602J1590N124n427j36
14684F585J456m996m057q87K307j5727l104Q361K38r756J0385Q809P666j786j5336
14669i842m342J077q37n562j2160P43L136P956J1032N888J1599O758o680j0854
14655b088l783J9348P400J438j0070o666N630R299K036j5913n259N09p717p032
14641a2868R052k702N278L845L347J0357N681j4318k0785r967m809r267K640J81
$$ plain form
14627 -34335 -25148 -23737 -11872 -15488 -26301 -17748 -11474 -8923 -4635 -12814 -12102 -11397 -14398 -13607 -15970
14612 -15970 -4068 7024 11494 12833 -928 -1509 -4848 -12145 -11991 -17451 -20615 -6420 1725 11059
14598 11059 2985 -4438 -9127 83 -1149 -3780 2192 1138 2775 9290 5485 -17800 -22746 -16495
14584 -16495 -428 4571 -1835 950 -1617 -8551 -6305 -12424 -15567 -12352 -16296 -26328 -17769 -540
14570 -540 596 7517 10215 915 -10603 -22299 -21898 -13117 -11091 -7486 -19010 -15856 -19471 -11392
14556 -11392 -7929 -9877 -12125 -235 -284 -8710 -6463 -2683 -6310 -3889 4752 2750 2922 -4782 1458
14541 1458 381 5803 -8189 -22042 -17758 -10975 -9167 -7237 -12346 -12749 1454 1065 -3760 -10193
14527 -10193 -3884 8231 5258 15888 31441 30602 13592 15291 18160 4517 -4559 -3012 5125
$$ packed form
14627c4335R187J411J1865l616j0813Q553O274K551M288q179P12P05l001P91k363
14612a5970J1902J1092M470J339j3761n81l339p297J54n460l164J4195Q145R334
14598A1059q074p423m689R210j232k631N972j054J637O515l805k3285m946O251
14584a6495J6067M999o406K785k567o934K246o119l143L215l944j0032Q559J7229
14570e40J136O921K698r300j1518j1696M01Q781K026L605j1524L154l615Q079
14556a1392L463j948k248J1890m9q426K247L780l627K421Q641k002J72p704O240
14541A458j077N422j3992j3853M284O783J808J930n109m03J4203l89m825o433
14527a0193O309J2115k973J0630J5553q39j7010J699K869j3643r076J547Q137
$$ plain form
14514 5125 -4417 -12826 -10983 -6411 -3857 10717 6277 -6868 -7102 -68 -7725 -12210 -6636 -10893
14500 -10893 -6264 -7636 -12266 526 -317 1051 -2456 -8250 -9616 -16564 -9657 -6956 1229 -9344
14486 -9344 -13332 -10348 -1616 971 -12193 -17280 -6251 4109 -1207 -2030 -8077 -11612 -7064 -1166
14472 -1166 -1050 -14690 -15852 -10666 -12148 -16550 -25428 -16703 -8819 -2951 -6489 -21881 -7413 -3226
14458 -3226 -7761 4169 15859 13508 -4956 -6321 -3623 -2661 -2670 5551 22187 15117 11265 -6181
14444 -6181 -24167 -18776 -9976 -16357 -12762 -16327 -14106 -9448 -14135 -10404 -4667 -1300 -7845 -7252 8713
14429 8713 5141 -12753 -24095 -28633 -20641 -17445 -20291 -19493 -31141 -28993 -20107 -5605 -317 1997
14415 1997 -505 16832 11030 -3179 -8504 -10973 -1689 -7272 -5861 -540 11934 4305 -4862 -6661
$$ packed form
14514E125r542q409J843M572K554J4574m440j3145k34P034p657m485N574m257
14500a0893M629j372m630J2792q43J368l507n794j366o948O907K701Q185j0573
14486i344l988K984Q732K587j3164n087J1029J0360n316q23o047l535M548N898
14472a166J16j3640j162N186j482m402q878Q725P884N868l538j5392J4468M187
14458c226m535J1930J1690k351j8464j365K698R62rQ221J6636p070l852j7446
14444f181j7986N391Q800o381L595l565K221M658m687L731N737L367o545N93J5965
14429H713l572j7894j1342m538P992L196k846P98j1648K148Q886J4502N288K314
14415A997k502J7337n802j4209n325k469R284n583J411N321J2474p629r167j799
$$ plain form
14401 -6661 -15141 -18119 -8815 -13252 -3168 8112 -3497 -13291 -9446 606 2367 3812 -4031 -15502
14387 -15502 -8781 8310 9855 11086 8102 -3695 -1298 -5412 -5207 -7789 -9481 -15815 -22094 -15035
14373 -15035 -6049 -6020 -3119 1138 -1374 -12040 -4718 -3024 -13607 -12135 -12816 -21277 -14338 -20826 -15169
14358 -15169 -3364 -6521 -10507 -23459 -23579 -21693 -17223 -14343 -9611 -1272 4301 8675 -12525 -19811
14344 -19811 -21344 -30837 -35994 -41962 -36740 -20958 1146 -1167 -7832 -13425 -11752 -5664 -6666 -16370
14330 -16370 -6485 -13108 -8909 -8869 -17472 -9073 -8783 -13702 -23892 -38131 -29289 -11698 -19229 -18520 -21526
14315 -21526 -15773 -14016 -9415 -4230 8857 17844 17880 16915 465 -3660 -499 -5436 -11089 -8358 -7423
14300 -7423 -7965 -19094 -20980 -15313 -11675 -10304 -7535 -6568 -18165 -27879 -21829 -28263 -15896 -7431
$$ packed form
14401f661q480k978R304m437J0084J1280j1609r794L845J0052J761J445p843j1471
14387a5502O721J7091J545J231k984j1797K397m114K05k582j692o334o279P059
14373a5035Q986K9K901M257k512j0666P322J694j0583J472o81q461O939o488N657
14358a5169J1805l157l986j2952j20J886M470K880M732Q339N573M374k1200p286
14344a9811j533r493n157n968N222J5782K2104k313o665n593J673O088j002r704
14330a6370R885o623M199M0q603Q399K90m919j0190j4239Q842J7591p531P09l006
14315b1526N753J757M601N185J3087Q987L6r65j6450m125L161m937n653K731R35
14300g423n42j1129j886N667L638J371K769R67j1597r714O050o434J2367Q465
$$ plain form
14286 -7431 3265 6120 -4375 -17790 -18620 -7202 -1062 -2199 -10960 -10358 6875 17665 10283 1242
14272 1242 -8339 -10269 -7391 -5397 -7720 5110 -5899 -22057 -31987 -33656 -30697 -14867 5596
14259 5596 5020 10029 17872 17976 13302 6718 1311 -6110 -2246 989 -925 -11909 -14442 4127 20674
14244 20674 20266 16965 10967 3593 -3173 -2810 -7034 -13930 -14885 -7542 7198 -2257 -8149 4928 16620
14229 16620 9434 -5 3465 -8481 585 7713 12027 8878 -11286 -8909 -3228 -874 5488 24473
14215 24473 12602 11912 20007 26807 28933 29518 27238 5680 -14153 -29523 -27716 -18924 -5600 -4006
14201 -4006 598 -328 -322 4368 3110 12831 10283 1986 456 -3217 2390 -653 -5660 -5412 -4230 -3361
14185 -3361 370 5239 15734 3504 -3157 14329 20373 16740 40228 48039 31995 18137 17231
$$ packed form
14286g431J0696K855j0495j3415q30J1418O140j137q761O02J7233J0790p382r041
14272A242r581j930K878J994k323J2830j1009j6158r930j669K959J5830K0463
14259E596n76N009P843J04m674o584n407p421L864L235j914j0984k533J8569J6547
14244B0674m08l301n998p374o766L63m224o896r55P343J4740r455n892J3077J1692
14229A6620p186r439L470j1946R066P128M314l149k0164K377N681K354O362J8985
14215B4473j1871o90Q095O800K126N85k280k1558j9833j5370J807Q792J3324J594
14201d006M604r26OM690j258R721k548q297j530l673N607l043n007K48J182Q69
14185c361L731M869J0495j2230o661J7486O044l633K3488P811j6044j3858r06
$$ plain form
14172 17231 13590 -29 -1694 -4249 -6732 -9081 -21583 -9657 -8263 -2893 2057 4432 -5428 -1641
14158 -1641 18176 22079 12457 -8092 -7000 2644 2947 9386 8496 -379 914 -5654 -5674 -10889 4334
14143 4334 5823 710 8087 -3352 -8059 -5434 -2808 -1394 -5745 -9652 -536 8848 2964 -2537
14129 -2537 3480 -3896 -2179 6881 8250 9868 3086 -13662 -5505 -3167 1329 -4621 -2577 1567
14115 1567 2717 -4999 -9480 -15328 -16380 -6684 7579 10009 10937 -1416 -12919 -11036 -488 2353
14101 2353 -1509 18162 26708 25702 19263 14916 7793 2484 1610 -1665 7312 9038 10853 13262 10109
14086 10109 14010 10493 8452 20873 21055 30498 36247 24454 -6244 -4208 -2368 -1288 7742 902
14072 902 -5711 -18010 -13873 -9623 -8874 -15248 -16397 -10253 -10623 -1501 1883 -4281 -14803 1702 11719
$$ packed form
14172A7231l641j3619j665k555k483k349j2502J1926J394N370M950K375r860L787
14158a641J9817L903r622k0549J092R644L03O439q90q875J293o568k0n215J5223
14143D334J489n113P377j1439m707K625K626J414m351l907R116R384n884n501
14129b537O017p376J717R060J369J618o782j6748Q157K338M496n950K044M144
14115A567J150p716m481n848j052R696J4263K430R28j2353j1503J883J0548K841
14101B353l862J9671Q546j006o439m347p123n309q74l275Q977J726J815K409l153
14086A0109L901l517k041J2421J82R443N749j1793l0698K036J840J080R030o840
14072I02o613j2299M137M250P49o374j149O144l70R122L384o164j0522J6505J0017
$$ plain form
14057 11719 20846 9502 7131 636 -11713 -11465 -15680 -6546 5421 8155 11793 10900 10363 17362
14043 17362 12677 7836 9122 21277 33065 29387 11540 -4084 -10538 -16440 -18206 -7196 1453
14030 1453 2837 7040 1439 3936 -1834 -9724 -8638 1938 -2273 -4640 -4159 -5716 -3248 -65 -1927
14015 -1927 -25555 -35850 -32727 -28260 -17042 -13615 -5735 -5273 -3053 1949 -8898 -33001 -30236 -20287
14001 -20287 4796 26045 12825 4905 5797 7387 -257 -10692 -6786 -8189 -2358 -3618 -5642 -5487
13987 -5487 -6360 -7341 -6776 -3880 -6777 -17646 -17195 -17692 -18903 -19725 -2877 -4030 -10020 -14919 -16847 -18224
13971 -18224 -2461 7752 -7897 -15486 -1354 11124 25016 21108 6281 1613 6827 -8297
13959 -8297 -8249 4026 4528 8216 20552 19162 17418 5726 11347 5857 2472 7104 2101 5256 6988
$$ packed form
14057A1719R127j1344k371o495j2349K48m215R134J1967K734L638q93n37O999
14043A7362m685m841J286J2155J1788l678j7847j5624o454n902j766J1010Q649
14030A453J384M203n601K497n770p890J086J0576m211k367M81j557K468L183j862
14015a927k3628j0295L123M467J1218L427P880M62K220N002j0847k4103K765R949
14001b0287K5083K1249j3220p920Q92J590p644j0435L906j403N831j260k024J55
13987e487q73r81N65K896k897j0869M51m97j211q22J6848j153n990m899j928j377
13971a8224J5763J0213j5649p589J4132J2478J3892l908j4827m668N214j5124
13959h297M8J2275N02L688J2336j390j744j1692N621n490l385M632n003L155J732
$$ plain form
13944 6988 13290 15239 22448 19098 7866 9607 15683 14781 10168 7720 7881 13713 2452 10801 12329
13929 12329 -5560 -4423 -456 -259 -1315 8118 19690 13983 5634 9097 28379 48269 41592 35937
13915 35937 24451 27932 25961 16376 5405 11627 14843 10666 8418 2325 8216 15761 1613 -2662
13901 -2662 1336 3539 -1130 -14120 4525 40350 35405 16737 12022 16524 15210 12545 17566 24456
13887 24456 18688 11699 12034 13054 24027 19304 16170 14610 16158 17641 4359 360 9355 3894
13873 3894 434 6189 8508 8811 2960 5285 9172 13328 4823 -10679 143 8590 9207 20308
13859 20308 22493 4990 12310 16093 10093 9065 2236 -2240 14148 15291 20811 25500 29992 41895
13845 41895 35696 22548 17272 23414 26703 20131 16339 10412 9562 17043 15542 9311 3337 -1549
$$ packed form
13944F988O302J949P209l350j1232J741O076r02m613k448J61N832j1261Q349J528
13929A2329j7889J137L967J97j056R433J1572n707q349L463J9282J9890o677n655
13915C5937j1486L481j971r585j0971O222L216m177k248o093N891P545j4148m275
13901b662L998K203m669j2990J8645L5825m945j8668m715M502j314k665N021O890
13887B4456n768o989L35J020J0973m723l134j560J548J483j3282l999Q995n461
13873C894l460N755K319L03n851K325L887M156q505j5502J0822Q447O17J1101
13859B0308K185j7503P320L783o000j028o829m476J6388J143N520M689M492J1903
13845D1895o199j3148n276O142L289o572l792n927q50P481j501o231n974m886
$$ plain form
13831 -1549 3795 27277 36199 22023 9768 10771 20346 22904 19813 18141 15870 19151 16572 3447
13817 3447 14500 24454 24181 21531 11182 1746 8418 18891 15034 10834 18230 18572 18555 22181 15460
13802 15460 1865 245 -8408 -20316 -11031 13392 19047 12545 14239 11985 4559 1082 5847 7722
13788 7722 10568 533 6418 12336 17579 34819 36754 21493 10890 -2054 3431 20672 27201
13775 27201 13988 -1906 -991 3314 8239 25653 31839 13694 25121 30821 21512 3165 2030
13762 2030 4165 -2374 -3458 4539 9039 7669 -3072 665 6351 6649 2096 10877 3711 5271 -8221
13747 -8221 -619 7636 5695 972 2388 5278 13353 11895 -16053 -18716 -11160 4036 12384 19537
13733 19537 17994 18471 3673 -14766 -10781 -2533 25444 35494 25556 14519 11188 10965 6308 10067
$$ packed form
13831a549N344K3482Q922j4176j2255J003R575K558l091j672k271L281k579j3125
13817C447J1053R954k73k650j0349r436O672J0473l857m200P396L42j7L626o721
13802A5460j3595j620q653j1908R285K4423N655o502J694k254p426l477M765J875
13788G722K846j0035N885N918N243J7240J935j5261j0603j2944N485J7241O529
13775B7201j3213j5894R15M305M925J7414O186j8145J1427N700r309j8347j135
13762B030K135o539j084P997M500j370j0741L737N686K98m553Q781p166J560j3492
13747h221P602Q255j941m723J416K890Q075j458k7948k663P556J5196Q348P153
13733A9537j543M77j4798j8439L985Q248K7977J0050r938j1037l331k23m657L759
$$ plain form
13719 10067 19018 18487 16110 10972 -3822 -1580 3057 6918 2663 5459 9326 8178 2292 40
13705 40 -212 14306 31454 30041 34169 21874 4266 8975 27150 38355 30356 24400 12146 10835
13691 10835 1774 8758 -6075 3802 16002 15794 16190 1712 -13957 -9188 -9733 -14514 -5259 -233
13677 -233 6875 11917 10986 12555 28980 34130 29812 26364 28447 29525 34815 31190 11300 2506 780
13662 780 3161 11352 6773 1430 -394 -11329 -9648 4811 10987 21485 22515 6716 6717 9463 2447
13647 2447 7398 12532 16212 25077 17479 12060 18282 17566 17858 21378 14901 1131 3369 13643 17872
13632 17872 21103 24260 18258 13469 12970 18157 11495 9293 8389 259 5944 20930 19343 1380
13618 1380 661 -3073 -5515 3526 8495 24511 21724 20334 18471 14007 8495 8462 6369 10449 18268
$$ packed form
13719A0067Q951n31k377n138j4794K242M637L861m255K796L867j148n886k252
13705D0k52J4518J7148j413M128j2295j7608M709J8175J1205p999n956j2254j311
13691A0835r061O984j4833R877J2200k08L96j4478j5669M769n45m781R255N026
13677b33P108N042r31J569J6425N150m318l448K083J078N290l625j9890q794j726
13662G80K381Q191m579n343j824j0935J681J4459O176J0498J030j5799JK746p016
13647B447M951N134L680Q865p598n419O222p16K92L520o477j3770K238J0274M229
13632A7872L231L157o002m789m99N187o662k202r04q130N685J4986j587j7963
13618A380p19l734k442R041M969J6016k787j390j863m464n512l3k093M080P819
$$ plain form
13603 18268 26861 36040 22551 12931 22108 4634 4993 12695 1541 17621 23509 27011 23781 20346
13589 20346 14547 15651 19493 4658 -13122 -13225 5457 19212 12117 6121 11233 15109 18745 25888
13575 25888 29028 28212 21479 28244 31287 22402 21115 12073 4492 14727 11520 1801 7836 9876
13561 9876 23307 35147 25425 24046 21336 23005 24125 23714 38479 41480 31696 35071 34678 24534
13547 24534 19839 24530 35345 28779 33601 36676 30933 32069 23287 25212 15246 21108 30462 31293
13533 31293 22174 37523 51287 54905 43688 27012 32123 18964 14826 27361 17176 4889
13521 4889 -2685 10729 15959 17229 20075 21502 17313 12399 1929 -6172 -3089 2969 18994 21856
13507 21856 3331 -4691 4064 9324 22859 44744 45409 43191 28318 16780 12648 16870 19273
$$ packed form
13603A8268Q593R179j3489r620R177j7474L59P702j1154J6080N888L502l230l435
13589B0346n799J104L842j4835j7780j03J8682J3755p095n996N112L876L636P143
13575B5888L140q16o733O765L043q885j287r042p581J0235l207r719O035K040
13561I876J3431J1840r722j379k710J669J120m11J4765L001r784L375l93j0144
13547B4534m695M691J0815o566M822L075n743J136q782J925r966N862R354Q31
13533C1293r119J5349J3764L618j1217j6676N111j3159m138J2535j0185j2287
13521D889p574J3414N230J270K846J427m189m914j0470q101L083O058J6025K862
13507B1856j8525q022Q755N260J3535K1885O65k218j4873j1538m132M222K403
$$ plain form
13494 19273 24402 25055 27169 18974 10935 8935 15496 15549 14630 18936 15196 2493 2049 13162 27435
13479 27435 23120 15661 25485 23062 22107 24909 19779 30789 45904 47019 36008 23446 29654 26330
13465 26330 27038 29336 26889 20774 36979 39859 40735 28304 12921 10982 11168 16685 17237 22914 34181
13450 34181 40689 38318 35898 36551 27500 20556 34615 49451 57147 51205 35957 29975 29177 51915
13436 51915 63620 61628 31923 22918 26289 31026 37088 31119 23962 20220 20428 7489 6928 13423
13422 13423 25509 30379 30672 26347 27609 27769 23772 22277 9219 7685 16761 34914 46765 39076
13408 39076 26312 16463 25881 18006 30952 37688 37814 15347 2543 -6636 -2638 11689 13761
13395 13761 17760 35447 31479 13252 15657 23598 31373 38177 47146 47573 37742 40246 37320 33519
$$ packed form
13494A9273N129O53K114q195q039k000O561N3r19M306l740j2703m44J1113J4273
13479B7435m315p459R824k423r55K802n130J1010J5115J115j1011j2562O208l324
13465B6330P08K298k447o115J6205K880Q76j2431j5383j939J86N517N52N677J1267
13450C4181O508k371k420O53r051o944J4059J4836P696n942j5248n982p98K2738
13436E1915J1705j992k9705r005L371M737O062n969p157l742K08j2939n61O495
13422A3423J2086M870K93m325J262J60l997j495j3058j534R076J8153J1851p689
13408C9076j2764r849R418p875J2946O736J26k2467j2804r179L998J4327K072
13395A3761L999J7687l968j8227K405P941P775O804Q969M27r831K504k926l801
$$ plain form
13381 33519 33490 40754 39591 39950 31020 29353 34313 31437 39579 41033 30501 35019 33176 23700 35531
13366 35531 53366 49583 23807 12747 19827 25679 47409 52370 41193 43850 45335 44610 37667
13353 37667 43415 44942 40609 37250 31698 24452 23295 33265 45636 45925 39532 37795 29312 33980
13339 33980 44865 47329 48247 52103 46578 46417 40597 41609 28490 4279 4653 3579 8783 16383
13325 16383 27915 45652 51061 44810 49674 50505 43740 43089 53495 73179 70207 67955 65944 49955
13311 49955 43750 37133 39101 41968 43972 56102 47155 36803 40493 23830 19959 42437 53526
13298 53526 45309 43113 50879 52319 50503 47461 53193 48112 46430 64022 76753 73014 51018 46338
13284 46338 44240 39145 39891 56053 65159 55668 48660 39496 34342 38201 38506 28282 37377 52242
$$ packed form
13381C3519k9P264j163L59q930j667M960k876Q142J454j0532M518j843r476J1831
13366C5531J7835l783k5776j1060P080N852K1730M961j1177K657J485p25o943
13353C7667N748J527m333l359n552p246j157R970J2371K89o393j737q483M668
13339C3980J0885K464R18L856n525j61n820J012j3119k4211L74j074N204P600
13325A6383J1532J7737N409o251M864Q31o765o51J0406J9684k972k252k011j5989
13311D9955o205o617J968K867K004J2130q947j0352L690j6663l871K2478J1089
13298E3526q217k196P766J440j816l042N732n081j682J7592J2731l739k1996m680
13284D6338k098n095P46J6162R106r491p008r164n154L859L05j0224R095J4865
$$ plain form
13270 52242 52146 56810 55481 42115 50783 47777 33054 25290 30172 42858 43574 57198 82950 83847
13256 83847 71507 71509 68395 63098 64755 67503 60107 62434 64029 60246 66525 68484 67190 77072 93914
13241 93914 100751 93256 79171 74245 72594 64108 59151 50779 53391 58387 68574 74269 81373 84514
13227 84514 88766 83219 83444 95037 101636 92061 85290 85801 110481 110867 88592 90473 110376 125704
13213 125704 138776 151141 168299 194516 215098 229647 259972 290445 338433 384578 428855
13202 428855 465575 505611 502064 463587 438567 397311 362734 335776 314185 290548 264095 260155
13190 260155 276063 297199 325651 337208 356048 367382 375615 373973 385035 398636 405856 425123
13178 425123 444502 469387 495653 517073 541487 552838 547343 543717 544175 530846 505308 475893
$$ packed form
13270E2242r6M664j329j3366Q668l006j4723p764M882J2686P16J3624K5752Q97
13256H3847j2340Kl114n297J657K748p396K327J595l783O279J959j294R882J6842
13241I3914O837p495j4085m926j651q486m957q372K612M996J0187N695P104L141
13227H4514M252n547K25J1593O599r575o771N11K4680L86k2275J881J9903J5328
13213A25704J3072J2365J7158K6217K0582J4549L0325L0473M7988M6145M4277
13202D28855L6720M0036l547l8477k5020m1256l4577k6958k1591k3637k6453l940
13190B60155J5908K1136K8452J1557J8840J1334Q233j642J1062J3601P220J9267
13178D25123J9379K4885K6266K1420K4414J1351n495l626M58j3329k5538k9415
$$ plain form
13166 475893 454132 446172 440509 422304 411664 402358 397369 395270 390208 370693 341784 341895 337038
13153 337038 327812 320631 325181 350362 382676 409049 439230 487697 517812 550156 561890 548502
13141 548502 527124 484368 431844 378914 324857 289797 262719 223784 195110 191018 190806 171347
13129 171347 169047 161043 152420 157109 159161 156853 157276 165130 152521 131069 125559 131198 139224 145137
13115 145137 138757 135157 128713 126433 111083 112424 124565 112939 119873 132985 123458 112164 118765
13102 118765 114442 124338 117284 115996 121830 129605 118413 104579 100447 106577 103568 92194 96275
13089 96275 104770 99008 98876 113084 137254 155412 148868 144023 149161 151154 156879 152427 154355 168551
13075 168551 187475 206306 231223 264387 289578 326540 392433 466214 548347 620066 716700
$$ packed form
13166D75893k1761p960n663j8205j0640r306m989k099n062j9515k8909J11m857
13153C37038r226p181M550K5181L2314K6373L0181M8467L0115L2344J1734j3388
13141E48502k1378m2756n2524n2930n4057l5060k7078l8935k8674m092k12j9459
13129A71347k300q004q623M689K052k308M23P854j2609k1452n510N639Q026N913
13115A45137o380l600o444k280j5350J341J2141j1626O934J3112r527j1294O601
13102A18765m323R896p054j288N834P775j1192j3834m132O130l009j1374M081
13089I6275Q495n762j32J4208K4170J8158o544m845N138J993N725m452J928J4196
13075A68551J8924J8831K4917L3164K5191L6962O5893P3781Q2133P1719R6634
$$ plain form
13064 716700 795419 844448 884316 895752 877411 822275 745656 679688 604222 528718 467842
13053 467842 403219 355590 316775 274740 248826 241112 230892 226454 208010 199028 199875 184092
13041 184092 166578 155984 161762 172241 170249 161735 161507 167563 162752 163580 179211 202029 198860
13028 198860 200942 195753 180688 181408 180789 185496 180732 181755 188583 182534 178743 189690 205634 208725
13014 208725 207039 196998 191702 193530 194068 200711 214326 231842 244419 253962 254747 252166 253647 260997
13000 260997 252502 263960 269486 264032 252375 236290 229937 226166 232372 240899 237721 232146 224792
12987 224792 242142 258120 262001 253731 257166 263870 263456 268081 273006 264314 254841 261820 289431 299675
12973 299675 283898 269775 273688 289334 285800 270393 257278 263789 278782 274279 258276 251453
$$ packed form
13064G16700P8719M9029L9868J1436j8341n5136p6619o5968p5466p5504o0876
13053D67842o4623m7629l8815m2035k5914p714j0220m438j8444q982Q47j5783
13041A84092j7514j0594N778J0479j992q514k28O056m811Q28J5631K2818l169
13028A98860K082n189j5065P20o19M707m764J023O828o049l791J0947J5944L091
13014B08725j686j0041n296J828N38O643J3615J7516J2577R543P85k581J481P350
13000B60997q495J1458N526n454j1657j6085o353l771O206Q527l178n575p354
12987B24792J7350J5978L881q270L435O704m14M625M925q692r473O979K7611J0244
12973B99675j5777j4123L913J5646l534j5407j3115O511J4993m503j6003o823
$$ plain form
12961 251453 264602 277544 270513 254313 244576 236251 247047 263211 273384 280322 290468 316921
12949 316921 347983 371892 397133 401398 398853 390726 386578 377352 353503 334366 338369 338719 332435
12936 332435 317299 312358 318229 319841 319993 321238 319267 326248 316230 313979 304349 297742 304482 319386
12922 319386 318454 322929 327341 333690 348945 364214 372414 374916 379917 380097 364579 356361 353780 366425
12908 366425 372617 375146 366744 367539 375979 377886 389040 399456 410234 427152 447210 454161 473034
12895 473034 490402 501085 502232 512080 523570 551247 561556 543085 522528 501204 486494 485519
12883 485519 460181 446584 466401 482011 490838 509022 532218 553322 577166 602205 607888 614402
12871 614402 635686 650018 653204 652021 650295 641519 621803 609242 611593 610382 597232 590734 581232
$$ packed form
12961B51453J3149J2942p031j6200r737q325J0796J6164J0173O938J0146K6453
12949C16921L1062K3909K5241M265k545q127m148r226k3849j9137M003L50o284
12936C32435j5136m941N871J612J52J245j971O981j0018k251r630o607O740J4904
12922C19386r32M475M412O349J5255J5269Q200K502N001J80j5518q218k581J2645
12908C66425O192K529q402P95Q440J907J1154J0416J0778J6918K0058O951J8873
12895D73034J7368J0683J147R848J1490K7677J0309j8471k0557k1324j4710r75
12883D85519k5338j3597J9817J5610Q827J8184K3196K1104K3844K5039N683O514
12871F14402K1284J4332L186j183j726q776j9716j2561K351j211j3150o498r502
$$ plain form
12858 581232 580398 581975 583447 582793 571450 580773 592303 594683 605628 619732 628904 632635 629615 631183
12844 631183 628162 632941 637556 647935 659842 676760 687172 693092 722365 742199 745574 773614
12832 773614 792008 789305 800578 812424 818416 834213 855358 878729 907141 931147 956100 970164
12820 970164 990628 1007650 1008523 1018776 1047311 1061824 1063869 1051822 1028502 1026802 1045938 1069626
12808 1069626 1085042 1101087 1116457 1123551 1123364 1133568 1173881 1209997 1247932 1283893 1317440 1348659
12796 1348659 1398752 1457638 1520122 1567937 1608055 1660450 1708108 1759874 1836825 1908946 1967405
12785 1967405 2051415 2145628 2243867 2354349 2461890 2580924 2726018 2880937 3034158 3207088
12775 3207088 3436719 3689626 3967852 4295211 4690144 5147999 5681578 6278327 6931887
$$ packed form
12858E81232q34J577J472o54j1343R323J1530K380J0945J4104R172L731l020J568
12844F31183l021M779M615J0379J1907J6918J0412N920K9273J9834L375K8040
12832G73614J8394k703J1273J1846N992J5797K1145K3371K8412K4006K4953J4064
12820I70164K0464J7022Q73J0253K8535J4513K045j2047k3320j700J9136K3688
12808A069626J5416J6045J5370P094j87J0204M0313L6116L7935L5961L3547L1219
12796A348659N0093N8886O2484M7815M0118N2395M7658N1766P6951P2121N8459
12785A967405Q4010R4213R8239J10482J07541J19034J45094J54919J53221J72930
12775C207088K29631K52907K78226L27359L94933M57855N33579N96749O53560
$$ plain form
12766 6931887 7700479 8603353 9680730 11000225 12665049 14828870 17672544 21398864
12758 21398864 26305611 32655841 40613498 50079096 60370167 70144631 77936617 82788541
12750 82788541 84175666 81770455 75871656 67801933 59354353 51904620 46122565 42221216
12742 42221216 40119602 39644418 40576023 42600002 45381288 48591590 51899961 55012257
12734 55012257 57711702 59977063 61912595 63734767 65762541 68320166 71674235 75868312
12726 75868312 80694150 85706490 90187713 93378512 94752562 94109584 91462786 87175298
12718 87175298 82017759 76884437 72381237 68805960 66250575 64599382 63576204 62841522
12710 62841522 62027265 60869563 59203467 56995831 54339974 51484195 48793781 46686617
$$ packed form
12766F931887P68592R02874J077377J319495J664824K163821K843674L726320
12758B1398864M906747O350230P957657R465598J0291071R774464P791986M851924
12750H2788541J387125k405211n898799q069723q447580p449733n782055l901349
12742D2221216k101614m75184R31605K023979K781286L210302L308371L112296
12734E5012257K699445K265361J935532J822172K027774K557625L354069M194077
12726G5868312M825838N012340M481223L190799J374050o42978k646798m287488
12718H7175298n157539n133322m503200l575277k555385j651193j023178p34682
12710F2841522q14257j157702j666096k207636k655857k855779k690414k107164
$$ plain form
12702 46686617 45589192 45910860 47962672 51985845 58019236 65815768 74644603 83179522
12694 83179522 89809749 93279299 93042168 88949320 81262779 71075869 60152140 50006377
12686 50006377 41419881 34517024 29095819 24890365 21639468 19130713 17189215 15644905
12678 15644905 14372022 13323014 12440834 11686762 11045021 10511335 10050933 9682734 9370825
12669 9370825 9125533 8945638 8831108 8766753 8788232 8884083 9095324 9378253 9758501 10269535
12659 10269535 10912549 11677239 12568189 13601826 14780892 16157490 17790139 19783572
12651 19783572 22345975 25754789 30412614 36869432 45654436 57100266 71176999 87428429
12643 87428429 104929453 122310615 137819111 149720897 156618891 157749023 152997255
$$ packed form
12702D6686617j097425L21668K051812M023173O033391P796532Q828835Q534919
12694H3179522O630227L469550k37131m092848p686541j0186910j0923729j0145763
12686E0006377q586496o902857n421205m205454l250897k508755j941498j544310
12678A5644905j272883j049008q82180p54072o41741n33686m60402l68199l11909
12669I370825k45292j79895j14530o4355K1479R5851K11241K82929L80248N11034
12659A0269535O43014P64690Q90950J033637J179066J376598J632649J993433
12651A9783572K562403L408814M657825O456818Q785004J1445830J4076733J6251430
12643H7428429J7501024J7381162J5508496J1901786O897994J130132m751768
$$ plain form
12636 152997255 142925514 128735991 112108738 94788986 78250059 63560654 51416980
12629 51416980 41974978 34928838 29742574 25871213 22871496 20456528 18437407 16679702
12621 16679702 15120254 13728868 12493301 11404239 10449562 9604952 8886882 8272415 7741982
12612 7741982 7279700 6871634 6491847 6155931 5854988 5563955 5303044 5059237 4819826
12603 4819826 4611323 4416592 4227007 4057752 3880100 3727921 3587408 3458100 3336408
12594 3336408 3235406 3128948 3016756 2914286 2823059 2727102 2639678 2552699 2469900 2385348
12584 2385348 2327772 2288276 2227124 2174346 2138825 2096662 2047669 2007003 1981133 1964890 1913673
12573 1913673 1842607 1774176 1704695 1632062 1565174 1486437 1435771 1396195 1347990 1301375 1258911
$$ packed form
12636A52997255j0071741j4189523j6627253j7319752j6538927j4689405j2143674
12629E1416980r442002p046140n186264l871361k999717k414968k019121j757705
12621A6679702j559448j391386j235567j089062r54677q44610p18070o14467n30433
12612G741982m62282m08066l79787l35916l00943k91033k60911k43807k39411
12603D819826k08503j94731j89585j69255j77652j52179j40513j29308j21692
12594C336408j01002j06458j12192j02470r1227r5957q7424q6979q2799q4552
12584B385348n7576l9496o1152n2778l5521m2163m8993m0666k5870j6243n1217
12573A913673p1066o8431o9481p2633o6888p8737n0666l9576m8205m6615m2464
$$ plain form
12562 1258911 1201086 1148892 1104808 1060293 1027772 1000760 974213 937167 903235 882616 856318
12551 856318 853028 834788 816652 807048 775183 746108 734952 706785 678481 666503 652231 620269
12539 620269 604112 590328 573876 547792 537977 524107 497853 489468 499030 490178 485902 482995 474112
12526 474112 473127 474333 483491 482460 476510 483939 489309 485354 484733 489006 493953 498914 508461 509102 509320
12511 509320 513159 501028 494782 484379 459879 445136 415459 379511 354693 332706 310816 312087
12499 312087 310527 311647 310729 304160 289022 283954 279004 266906 279050 279687 268774 262030 258125 254350
12485 254350 245795 246740 251672 244528 228301 220913 209544 198563 194832 182353 164445 154566 174439
12472 174439 184421 182343 189646 191466 190626 193267 210520 213171 205578 196400 184796 164299 153359
$$ packed form
12562A258911n7825n2194m4084m4515l2521k7012k6547l7046l3932k0619k6298
12551H56318l290j8240j8136r604l1865k9075j1156k8167k8304j1978j4272l1962
12539F20269j6157j3784j6452k6084r815j3870k6254q385R562q852m276k907q883
12526D74112r85J206R158j031n950P429N370l955o21M273M947M961R547O41K18
12511E09320L839j2131o246j0403k4500j4743k9677l5948k4818k1987k1890J271
12499C12087j560J120r18o569j5138n068m950j2098J2144O37j0913o744l905l775
12485B54350q555R45M932p144j6227p388j1369j0981l731j2479j7908r879J9873
12472A74439R982k078P303J820q40K641J7253K651p593r178j1604k0497j0940
$$ plain form
12459 153359 149728 144378 143224 143325 150728 140284 129524 122096 123225 117637 109077 107336 111591 98829
12445 98829 98007 96853 98233 96960 96308 84737 74215 76066 85056 93966 94225 104403 107643 101464
12431 101464 102840 111246 116019 108502 94965 90868 76337 68204 68217 66623 61094 69590 59976 63277
12417 63277 59135 66646 61223 74351 69385 55577 66175 80121 95074 85808 71115 66008 74691
12404 74691 81882 83544 87886 99791 92319 81557 74411 84269 90943 84911 82028 84443 82268 94370
12390 94370 100747 94715 105337 102153 97092 89213 99812 103789 95672 104743 104800 93372 93958 95526
12376 95526 97920 91475 74853 69496 81004 80676 75899 78298 72502 53853 52002 43174 25330 27463
12362 27463 49414 50080 46592 58462 45939 47120 39014 39905 49773 42736 43625 38722 16697 22200
$$ packed form
12459A53359l631n350j154J01P403j0444j0760p428J129n588q560j741M255j2762
12445I8829q22j154J380j273o52j1571j0522J851Q990Q910K59J0178L240o179
12431A01464J376Q406M773p517j3537m097j4531q133J3j594n529Q496r614L301
12417F3277m142P511n423J3128m966j3808J0598J3946J4953r266j4693n107Q683
12404G4691P191J662M342J1905p472j0762p146R858O674o032k883K415k175J2102
12390I4370O377o032J0622l184n061p879J0599L977q117R071N7j1428N86J568
12376I5526K394o445j6622n357J1508l28m777K399n796j8649j851q828j7844K133
12362B7463K1951O66l488J1870j2523J181q106Q91R868p037Q89m903k2025N503
$$ plain form
12348 22200 26798 21699 25606 21737 14373 10693 11027 19530 11010 7037 11570 14121 19920 20887 3368
12333 3368 -16542 -21836 -150 6905 -4929 2247 13639 23812 59423 64272 68854 76160 78887
12320 78887 91700 95680 97030 97048 89206 82871 73385 65066 54632 63568 83475 93848 115993 121947
12306 121947 130220 148288 154855 169058 182027 205414 243041 290522 336727 379853 410736 442764
12294 442764 469589 473373 465011 455889 418283 378894 337617 315915 295331 284640 275796 270360
12282 270360 289186 300865 313078 326826 343279 356590 365192 388939 395677 406805 434045 463770
12270 463770 500153 534760 564168 572425 592390 588232 564085 537842 513734 491909 455959 422802
12258 422802 395457 389191 384202 382781 375977 366972 368445 363811 358089 339364 329301 325438 313099
$$ packed form
12348B2200M598n099L907l869p364l680L34Q503q520l973M533K551N799R67j7519
12333C368j9910n294K1686P055j1834P176J1392J0173L5611M849M582P306K727
12320G8887J2813L980J350J8p842o335r486q319j0434Q936J9907J0373K2145N954
12306A21947Q273J8068O567J4203J2969K3387L7627M7481M6205M3126L0883L2028
12294D42764K6825L784q362r122l7606l9389m1277k1702k0584j0691q844n436
12282B70360J8826J1679J2213J3748J6453J3311Q602K3747O738J1128K7240K9725
12270D63770L6383L4607K9408Q257J9965m158k4147k6243k4108k1825l5950l3157
12258D22802k7345o266m989j421o804r005J473m634n722j8725j0063l863j2339
$$ plain form
12245 313099 321373 339526 345947 367788 384304 403579 454713 505696 542292 559817 562251 536666
12233 536666 514879 475578 416446 355068 316150 278284 246946 237290 229212 231505 218287 212758
12221 212758 223327 242632 263584 299318 358304 430915 479238 558738 643066 726787 786662
12210 786662 839584 869007 868833 826394 762763 689576 601902 508598 432054 363731 317723 291330
12198 291330 265167 231958 205779 200193 180205 162669 139636 114271 99432 92597 99620 107496
12186 107496 92210 67913 70702 80120 86623 93758 92891 89134 83358 74049 63219 54121 51927 52306
12172 52306 61836 62393 70807 70392 68072 58395 57656 58773 44936 49168 46226 43723 45971 33554 30959
12157 30959 32296 30219 18985 16399 21906 26265 43368 48408 58783 56622 34259 23297 40021
$$ packed form
12245C13099Q274J8153O421K1841J6516J9275N1134N0983L6596J7525K434k5585
12233E36666k1787l9301n9132o1378l8918l7866l1338r656q078K293j3218n529
12221B12758J0569J9305K0952L5734N8986P2611M8323P9500Q4328Q3721N9875
12210G86662N2922K9423j74m2439o3631p3187q7674r3304p6544o8323m6008k6393
12198B91330k6163l3209k6179n586j9988j7536k3033k5365j4839o835P023P876
12186A07496j5286k4297K789R418O503P135q67l757n776r309j0830r098k194L79
12172E2306R530N57Q414m15k320r677p39J117j3837M232k942k503K248j2417k595
12157C0959J337k077j1234k586N507M359J7103N040J0375k161k2363j0962J6724
$$ plain form
12144 40021 54354 52619 48070 37072 28925 20528 20855 33813 42105 54996 49964 30142 21183
12131 21183 28667 42347 49133 54310 52540 59908 63496 67291 66577 69515 74111 83054 78434 75276
12117 75276 69122 71581 77491 94707 110516 138693 156850 171526 191545 223503 266932 316959
12105 316959 375739 461156 550428 655582 787416 911214 1027222 1129759 1191609 1206593
12095 1206593 1175933 1110001 1010447 884496 769263 642458 529550 434790 361223 295005
12085 295005 255699 221481 191914 169182 139236 131733 123076 110971 110841 118462 109775 112240 114987
12072 114987 107905 96545 89439 73029 67188 82999 107714 110026 93348 86022 84019 72148 68408
12059 68408 73028 74082 63220 51188 56329 74068 73516 67382 45663 44775 51682 55885 52310 54378
$$ packed form
12144D0021J4333j735m549j0998q147q397L27J2958Q292J2891n032j9822q959
12131B1183P484J3680O786N177j770P368L588L795p14K938M596Q943m620l158
12117G5276o154K459N910J7216J5809K8177J8157J4676K0019L1958M3429N0027
12105C16959N8780Q5417Q9272J05154J31834J23798J16008J02537O1850J4984
12095A206593l0660o5932r9554j25951j15233j26805j12908r4760p3567o6218
12085B95005l9306l4218k9567k2732k9946p503q657j2105j30P621q687K465K747
12072A14987p082j1360p106j6410n841J5811K4715K312j6678p326k003j1871l740
12059F8408M620J054j0862j2032N141J7739n52o134k1719q88O907M203l575K068
$$ plain form
12045 54378 47286 45229 58297 62053 54432 56599 55705 47892 42079 49431 54848 43275 38448 39271
12031 39271 44961 45453 34903 25145 26237 32507 36936 45192 48946 44916 36303 39924 49271 59396
12017 59396 44935 40871 45195 45553 39655 26673 16000 13207 21325 40967 54195 51645 36973
12004 36973 44025 43287 38322 36833 50754 60127 61152 61341 55568 36863 16607 13207 22695 17616
11990 17616 25295 57970 62409 50892 44807 36672 29063 31677 24267 30814 36330 24937 16544 17414
11976 17414 11350 10689 16947 29295 13791 6204 16622 35901 35841 22695 8587 9863 26329
11963 26329 41793 41596 45465 37974 31571 34102 26402 14269 26757 37302 36556 32569 30800 37945
11949 37945 39473 37105 27972 22042 21063 24950 25049 37051 60187 59662 58488 54872 38927 39641 43668
$$ packed form
12045E4378p092k057J3068L756p621K167q94p813n813P352N417j1573m827Q23
12031C9271N690M92j0550r758J092O270M429Q256L754m030q613L621R347J0125
12017E9396j4461m064M324L58n898j2982j0673k793Q118J9642J3228k550j4672
12004C6973P052p38m965j489J3921R373J025J89n773j8705k0256l400R488n079
11990A7616P679L2675M439j1517o085q135p609K614p410O547N516j1393q393Q70
11976A7414o064o61O258J2348j5504p587J0418J9279o0j3146j4108J276J6466
11963B6329J5464j97L869p491o403K531p700j2133J2488J0545p46l987j769P145
11949C7945J528k368r133n930r79L887R9J2002K3136n25j174l616j5945P14M027
$$ plain form
11934 43668 57946 62863 55185 42476 49535 55208 54223 52117 48665 27247 19503 20521 16460 27078
11920 27078 41622 41094 38985 56599 63086 59213 56635 43374 39848 42460 38422 45887 55666 62243
11906 62243 46534 36582 39185 33264 32763 32672 33776 37280 39173 42968 37661 38767 43032 47196 43768
11891 43768 30483 34619 42415 55349 74647 83256 83343 69707 59256 53393 62719 56821 57313 49329
11877 49329 37703 35077 37053 32467 51635 56603 48145 39266 42590 33515 38678 61921 62869 59348
11863 59348 65849 65261 47228 62529 74496 78382 77372 65979 48140 45593 27271 28213 36352
11850 36352 35649 40192 55602 67661 69857 50428 40365 46837 33622 40262 45858 45432 45490 29379
11836 29379 34856 42565 42604 41832 52903 70424 78774 72749 65031 54429 51948 63925 72005 69966
$$ packed form
11934D3668J4278M917p678j2709P059N673r85k106l452k1418p744J018m061J0618
11920B7078J4544n28k109J7614O487l873k578j3261l526K612m038P465R779O577
11906F2243j5709r952K603n921n01r1J104L504J893L795n307J106M265M164l428
11891D3768j3285M136P796J2934J9298Q609Q7j3636j0451n863R326n898M92p984
11877D9329j1626k626J976m586J9168M968q458q879L324r075N163K3243R48l521
11863E9348O501n88j8033J5301J1967L886j010j1393j7839k547j8322R42Q139
11850C6352p03M543J5410J2059K196j9429j0063O472j3215O640N596m26N8j6111
11836B9379N477P709L9p72J1071J7521Q350o025p718j0602k481J1977Q080k039
$$ plain form
11822 69966 53268 59019 63346 63911 76945 81807 84341 85934 81889 61176 53254 67962 87533
11809 87533 87005 79245 78681 88461 83292 74143 81868 105700 113736 115763 128041 145245 155446 165075
11795 165075 178443 219345 242842 259170 285911 337940 382077 406997 430924 463495 496027
11784 496027 516266 532849 549043 568549 570622 533942 485732 438248 399364 383006 374554 374494
11772 374494 362186 373135 383117 395173 414182 424358 442946 456269 478169 491091 497163 507222
11760 507222 510417 518529 550268 592808 613885 616601 627729 622641 626273 630005 617715 610061 591311
11747 591311 564448 530741 520307 504392 481627 448171 430715 415203 413717 412629 386941 360830
11735 360830 336341 339271 350930 360033 386367 412792 461010 502509 521655 539991 558378 568097
$$ packed form
11822F9966j6698N751M327N65J3034M862K534J593m045k0713p922J4708J9571
11809H7533n28p760n64R780n169r149P725K3832Q036K027J2278J7204J0201R629
11795A65075J3368M0902K3497J6328K6741N2029M4137K4920K3927L2571L2532
11784D96027K0239J6583J6194J9506K073l6680m8210m7484l8884j6358q452o0
11772C74494j2308J0949R982J2056J9009J0176J8588J3323K1900J2922O072J0059
11760E07222L195Q112L1739M2540K1077K716J1128n088L632L732j2290p654j8750
11747E91311k6863l3707j0434j5915k2765l3456j7456j5512j486j088k5688k6111
11735C60830k4489K930J1659R103K6334K6425M8218M1499J9146J8336J8387R719
$$ plain form
11723 568097 554965 528322 492544 448332 397499 346630 299631 263097 239605 215461 199941
11712 199941 177098 148298 135218 132374 126494 124314 124013 114132 114554 114458 103439 99679 108054 112593
11698 112593 113430 121610 110796 101359 108919 109112 96071 86223 87705 84662 92825 94421 91742 87954
11684 87954 91885 101320 105884 96542 79631 59058 60102 58418 68213 76137 74179 78219 78912 75115
11670 75115 69959 82382 90988 89493 102684 115878 112971 109471 116386 102491 94772 86893 81424
11657 81424 80619 90861 92973 101683 109866 105842 101119 92881 94155 98609 105920 108080 90418 87647
11643 87647 93562 111360 121398 125193 119494 120562 122975 116749 119286 117414 125707 136113 126550 114794
11629 114794 120402 127622 129718 128391 134390 145577 153944 160707 169607 172018 175608 178745 168673 166428
$$ packed form
11723E68097j3132k6643l5778m4212n0833n0869m6999l6534k3492k4144j5520
11712A99941k2843k8800j3080k844n880k180l01r881M22r6j1019l760Q375M539
11698A12593Q37Q180j0814r437P560J93j3041r848J482l043Q163J596k679l788
11684H7954L931R435M564r342j6911k0573J044j684R795P924j958M040O93l797
11670G5115n156J2423Q606j495J3191J3194k907l500O915j3895p719p879n469
11657H1424q05J0242K112Q710Q183m024m723q238J274M454P311K160j7662k771
11643H7647N915J7798J0038L795n699J068K413o226K537j872Q293J0406r563j1756
11629A14794N608P220K096j327N999J1187Q367O763Q900K411L590L137j0072k245
$$ plain form
11615 166428 201685 213629 216958 215681 213304 228039 227144 229691 249351 261655 259902 241538 210613
11602 210613 198461 205230 216074 218056 222206 213769 199086 188277 214188 235997 235986 234644 243599
11589 243599 255586 252154 236154 216899 224758 234477 241355 251532 271799 277258 257997 257937 255877
11576 255877 249382 242776 230821 242538 236175 221687 214699 216777 205267 200664 188905 201815 212305
11563 212305 206289 208133 213314 242295 248759 242231 249195 253215 264814 276385 289351 293724 295718
11550 295718 289624 266552 247253 242288 240147 226378 217201 213399 201247 207101 206768 203633 206956
11537 206956 201425 207228 203849 199590 202569 220770 233289 235363 236012 230047 238331 253009 261523 267933
11523 267933 267226 265785 265366 270592 268659 251154 248489 240282 244913 246214 244060 237368 241639 249821
$$ packed form
11615A66428L5257J1944L329j277k377J4735q95K547J9660J2304j753j8364l0925
11602B10613j2152O769J0844J982M150q437j4683j0809K5911K1809j1j342Q955
11589B43599J1987l432j6000j9255P859R719O878J0177K0267N459j9261o0k060
11576B55877o495o606j1955J1717o363j4488o988K078j1510m603j1759J2910J0490
11563B12305o016J844N181K8981O464o528O964M020J1599J1571J2966M373J994
11550B95718o094k3072j9299m965k141j3769r177l802j2152N854l33l135L323
11537B06956n531N803l379m259K979J8201J2519K074O49n965Q284J4678Q514O410
11523B67933p07j441m19N226j933j7505k665q207M631J301k154o692M271Q182
$$ plain form
11509 249821 264060 274147 258202 252370 258747 265305 268795 272248 280089 287072 290547 293235 297619
11496 297619 296888 307641 313782 321069 319617 332101 346634 364307 370706 375666 380652 400069 434218
11483 434218 472674 503108 538246 558449 569760 591820 627551 650162 669813 669200 648580 614751
11471 614751 579687 553362 541378 544880 545871 526397 522530 522128 521373 510425 504608 521280 510440
11458 510440 513521 521385 525913 531222 525407 526668 529484 534701 540233 548390 560204 575299 584354 599331
11444 599331 599006 611306 628417 639122 647952 645215 654236 649666 647515 648457 657113 671945 695500
11431 695500 712980 739770 781184 805749 818270 828835 856140 886842 914330 932271 940082 940544
11419 940544 947049 977170 994085 1004872 1040034 1073304 1103025 1127814 1148043 1175874 1224129 1280065
$$ packed form
11509B49821J4239J0087j5945n832O377O558L490L453P841O983L475K688M384
11496B97619p31J0753O141P287j452J2484J4533J7673O399M960M986J9417L4149
11483D34218L8456L0434L5138K0203J1311K2060L5731K2611J9651o13k0620l3829
11471F14751l5064k6325j1984L502R91j9474l867m02p55j0948n817J6672j0840
11458E10440L081P864M528N309n815J261K816N217N532Q157J1814J5095R055J4977
11444E99331l25J2300J7111J0705Q830k737R021m570k151R42Q656J4832K3555
11431F95500J7480K6790M1414K4565J2521J0565K7305L0702K7488J7941P811M62
11419I40544O505L0121J6915J0787L5162L3270K9721K4789K0229K7831M8255N5936
$$ plain form
11407 1280065 1346783 1439723 1558023 1675051 1790286 1905443 2018846 2117967 2169673 2167394
11397 2167394 2151512 2131689 2117235 2113320 2141208 2203230 2277098 2374167 2488122 2624137 2779801
11386 2779801 2946150 3108370 3275292 3468790 3679225 3910962 4155617 4435791 4772164
11377 4772164 5197030 5695943 6278802 6953943 7724791 8633093 9693646 10940779 12487940
11368 12487940 14445825 16979644 20340361 24794081 30653377 38171025 47415352 57972786
11360 57972786 68786495 78408509 85557823 89427170 89471952 85558793 78456351 69783502
11352 69783502 61168872 53699630 47970650 44211218 42389577 42301192 43623847 45931481
11344 45931481 48818471 51872639 54721877 57036757 58671695 59679477 60256775 60736864
$$ packed form
11407A280065O6718R2940J18300J17028J15235J15157J13403R9121N1706k279
11397B167394j5882j9823j4454l915K7888O2022P3868R7069J13955J36015J55664
11386B779801J66349J62220J66922J93498K10435K31737K44655K80174L36373
11377D772164M24866M98913N82859O75141P70848R08302J060553J247133J547161
11368A2487940J957885K533819L360717M453720N859296P517648R244327J0557434
11360E7972786J0813709R622014P149314L869347M4782l913159p102442q672849
11352F9783502q614630p469242n728980l759432j821641q8385J322655K307634
11344D5931481K886990L054168K849238K314880J634938J007782N77298M80089
$$ plain form
11336 60736864 61518665 63109464 65945578 70260763 75958823 82492574 88926443 94215376
11328 94215376 97455166 98089969 96024219 91688542 85932583 79853451 74396054 70048091
11320 70048091 66904025 64738048 63159464 61750390 60133241 58051726 55438026 52417372
11312 52417372 49187916 46012713 43242153 41271683 40477153 41162733 43523990 47661011
11304 47661011 53510543 60766169 68738037 76253792 81962226 84790774 84218210 80187950
11296 80187950 73026227 63676405 53653780 44302092 36373501 30044823 25124693 21325283
11288 21325283 18407375 16142715 14358476 12900947 11672156 10613902 9691958 8912415
11280 8912415 8230844 7643285 7127405 6664585 6253622 5876875 5543929 5251873 4976812
$$ packed form
11336F0736864P81801J590799K836114M315185N698060O533751O433869N288933
11328I4215376L239790O34803k065750m335677n755959o079132n457397m347963
11320G0048091l144066k165977j578584j409074j617149k081515k613700l020654
11312E2417372l229456l175203k770560j970470p94530O85580K361257M137021
11304D7661011N849532P255626P971868P515755N708434K828548n72564m030260
11296H0187950p161723r349822j0022625r351688p928591o328678m920130l799410
11288B1325283k917908k264660j784239j457529j228791j058254r21944p79543
11280H912415o81571n87559n15880m62820m10963l76747l32946k92056k75061
$$ plain form
11271 4976812 4726108 4510867 4296673 4097607 3910061 3738248 3575710 3426470 3271550
11262 3271550 3122134 2985206 2865136 2762176 2651689 2543408 2448331 2369959 2301021 2236412
11252 2236412 2160117 2091141 2022014 1958317 1894226 1832315 1768581 1703161 1635701 1574153 1528516
11241 1528516 1504191 1468628 1435490 1388378 1358094 1336831 1309454 1279715 1264516 1241094 1208495
11230 1208495 1191240 1164863 1136987 1106521 1071507 1038399 1003567 958424 931244 904628 891061
11219 891061 872350 851003 854851 847453 844279 823264 801066 785729 778453 771471 746826 724359
11207 724359 710484 705893 701313 691803 675323 664945 654672 641203 623167 612983 599642 587678
11195 587678 583325 577236 563001 551210 542823 547513 539150 529633 540379 554843 559685 567910 590618
$$ packed form
11271D976812k50704k15241k14194j99066j87546j71813j62538j49240j54920
11262C271550j49416j36928j20070j02960j10487j08281r5077p8372o8938o4609
11252B236412p6295o8976o9127o3697o4091o1911o3734o5420o7460o1548m5637
11241A528516k4325l5563l3138m7112l0284k1263k7377k9739j5199k3422l2599
11230A208495j7255k6377k7876l0466l5014l3108l4832m5143k7180k6616j3567
11219H91061j8711k1347L848p398l174k1015k2198j5337p276o982k4645k2467
11207G24359j3875m591m580r510j6480j0378j0273j3469j8036j0184j3341j1964
11195E87678m353o089j4235j1791q387M690q363r517J0746J4464M842Q225K2708
$$ plain form
11182 590618 596834 581485 571973 568287 543578 514019 495269 485309 463763 446730 452402 433963
11170 433963 410755 388413 366240 356073 329913 315166 314226 310803 285857 261359 244162 244329
11158 244329 244897 235912 233458 232585 229909 223067 197950 185905 191145 191079 183049 169271 170982 167343
11144 167343 166277 165107 155454 148109 135688 135821 122800 111359 122378 128420 119921 94607 77396
11131 77396 90024 90206 107539 107588 112926 115916 116191 112437 104962 109581 120732 127098 123287 119039 108004
11116 108004 123817 128900 120465 111026 109756 118693 116161 104605 85184 76030 65839 60247 61745
11103 61745 69180 74553 73367 66750 59097 73924 72663 80009 79183 70176 65087 64779 68691 67247 74479
11088 74479 82801 83065 79727 70461 75438 76667 70144 65805 60418 66891 66683 64401 64944 64790 65255 66400
$$ packed form
11182E90618O216j5349r512l686k4709k9559j8750r960k1546j7033N672j8439
11170D33963k3208k2342k2173j0167k6160j4747r40l423k4946k4498j7197J67
11158B44329N68q985k454q73k676o842k5117j2045N240o6q030j3778J711l639
11144A67343j066j170r653p345j2421J33j3021j1441J1019O042q499k5314j7211
11131G7396J2628J82J7333M9N338K990K75l754p475M619J1151O366l811m248j1035
11116A08004J5813N083q435r439j270Q937k532j1556j9421r154j0191n592J498
11103F1745P435N373j186o617p653J4827j261P346q26r007n089l08L912j444P232
11088G4479Q322K64l338r266M977J229o523m339n387O473k08k282N43j54M65J145
$$ plain form
11072 66400 66086 74114 86836 84311 82955 72400 68730 67731 64988 73501 72698 66236 80671 103187
11058 103187 98508 100786 101602 91820 75654 67789 64811 54575 46268 44027 37333 49847 54941 62790
11044 62790 70261 64611 66718 67025 66779 66987 68942 54203 48497 54008 59099 66225 49428 31895
11030 31895 25419 25314 27417 37139 39670 37028 42660 42005 53419 65120 66164 65028 61171 53257
11016 53257 52886 58783 67620 81692 76771 67498 54820 52521 56538 67316 61141 60597 78451 85806
11002 85806 91685 82116 68640 75592 59452 50312 62054 86041 90963 83504 94554 102757 106332
10989 106332 110623 118421 129424 140068 145590 161336 167146 176037 185991 164949 171275 187199 198823
10976 198823 205027 214552 233888 257787 275554 324954 383123 459373 566244 722916 970516
$$ packed form
11072F6400l14Q028J2722k525j356j0555l670r99k743Q513q03o462J4435K2516
11058A03187m679K278Q16r782j6166p865k978j0236q307k241o694J2514N094P849
11044F2790P471n650K107L07k46K08J955j4739n706N511N091P126j6797j7533
11030C1895o476j05K103R722K531k642N632o55J1414J1701J044j136l857p914
11016E3257l71N897Q837J4072m921r273j2678k299M017J0778o175n44J7854P355
11002H5806N879r569j3476O952j6140r140J1742K3987M922p459J1050Q203L575
10989A06332M291P798J1003J0644N522J5746N810Q891R954k1042O326J5924J1624
10976A98823O204R525J9336K3899J7767M9400N8169P6250J06871J56672K47600
$$ plain form
10965 970516 1350675 1865562 2398271 2807194 3049958 3132616 3006599 2628083 2080392 1553574
10955 1553574 1152993 879654 718900 615122 540377 500370 475227 475501 483217 471038 493161
10944 493161 551201 611519 712715 878563 1093489 1339684 1571174 1755262 1845587 1851861
10934 1851861 1767272 1545377 1298234 1102871 970966 897635 847615 821785 782013 730404
10924 730404 685338 641133 593291 546515 499772 453734 421269 417825 413590 404117 378383 368473
10912 368473 387354 417490 429007 418746 407192 422090 438835 434812 437495 451462 465430 486836
10900 486836 522685 546663 564663 568740 559902 531473 513411 494503 476729 458385 445787 434976
10888 434976 409916 402585 400641 393486 375626 367231 353490 338398 319138 310079 303093 285245 272071
$$ packed form
10965I70516L80159N14887N32709M08923K42764Q2658j26017l78516n47691n26818
10955A553574m00581k73339j60754j03778p4745m0007k5143K74P716j2179K2123
10944D93161N8040O0318J01196J65848K14926K46195K31490J84088R0325O274
10934A851861q4589k21895k47143j95363j31905p3331n0020k5830l9772n1609
10924G30404m5066m4205m7842m6776m6743m6038l2465l444m235r473k5734r910
10912C68473J8881L0136J1517j0261j1554J4898J6745m023K683J3967J3968K1406
10900D86836L5849K3978J8000M077q838k8429j8062j8908j7774j8344j2598j0811
10888D34976k5060p331j944p155j7860q395j3741j5092j9260r059o986j7848j3174
$$ plain form
10875 272071 285614 301392 325379 365550 405454 425011 452741 467177 467611 457421 444435 395739
10863 395739 346320 296263 253640 223075 205408 197557 183743 154385 119558 119055 120195 115629
10851 115629 98984 87046 79912 82081 77244 82223 72908 71497 70689 69393 70934 69505 78133 74990
10837 74990 69284 69295 70335 74532 65097 70482 69938 70968 93846 124412 136557 136464 154991 178541
10823 178541 185828 185364 168780 149334 147354 142972 147946 146935 137513 131757 136307 151370 159687 166003
10809 166003 145794 124629 117781 123311 133239 126736 111387 113611 104915 114681 126175 132185 131035
10796 131035 118882 104556 108697 112746 122628 117088 106325 118426 124220 137236 140013 143092 152325
10783 152325 156384 160421 173054 183403 192789 191601 210919 246465 294759 338137 364594 366251
$$ packed form
10875B72071J3543J5778K3987M0171L9904J9557K7730J4436M34j0190j2986m8696
10863C95739m9419n0057m2623l0565j7667p851j3814k9358l4827n03J140m566
10851A15629j6645j1938p134K169m837M979r315j411q08j296J541j429Q628l143
10837G4990n706J1J040M197r435N385n44J030K2878L0566J2145r3J8527K3550
10823A78541P287m64j6584j9446j980m382M974j011r422n756M550J5063Q317O316
10809A66003k0209k1165o848N530R928o503j5349K224q696R766J1494O010j150
10796A31035j2153j4326M141M049R882n540j0763J2101N794J3016K777L079R233
10783A52325M059M037J2633J0349R386j188J9318L5546M8294M3378K6457J657
$$ plain form
10771 366251 373737 411214 444151 420446 374103 320896 267303 228288 201381 168095 143965 127362
10759 127362 116098 118168 119334 108476 97656 98858 112372 120561 131708 131571 143260 148240 148112
10746 148112 145597 137500 137389 136653 141834 162312 162700 157252 143743 126927 123360 111874 113597 116676
10732 116676 105439 99352 91183 86260 105802 119002 123805 141933 154249 161385 164407 170819 176553
10719 176553 194572 215546 218732 203722 200109 207041 216357 222474 212730 214195 215736 206923 182156
10706 182156 170437 172817 186937 195191 197625 199164 198292 195477 192501 184878 165408 136546 128754
10693 128754 145572 138618 139330 135064 149160 161236 158724 182283 215196 233043 233389 232401 239882
10680 239882 227955 215259 216607 221302 226180 223810 227652 214346 206960 217899 211716 204558 209141
$$ packed form
10771C66251P486L7477L2937k3705m6343n3207n3593l9015k6907l3286k4130j6603
10759A27362j1264K070J166j0858j0820J202J3514Q189J1147j37J1689M980j28
10746A48112k515q097j11p36N181K0478L88n448j3509j6816l567j1486J723L079
10732A16676j1237o087q169m923J9542J3200M803J8128J2316P136L022O412N734
10719A76553J8019K0974L186j5010l613O932R316O117r744J465J541q813k4767
10706A82156j1719K380J4120Q254K434J539q72k815k976p623j9470k8862p792
10693A28754J6818o954P12m266J4096J2076k512K3559L2913J7847L46r88P481
10680B39882j1927j2696J348M695M878k370L842j3306p386J0939o183p158M583
$$ plain form
10667 209141 202087 189900 191964 201474 198454 196910 214398 211598 216964 229152 241335 256348 275803
10654 275803 289858 307029 305566 313261 329621 331719 356381 375835 412847 471742 515944 573033
10642 573033 617187 614218 566305 501076 461742 440319 424402 401955 359781 333214 342160 355945
10630 355945 358225 355866 372276 380225 390927 390560 389219 397875 416254 437911 435432 425402 433880
10617 433880 452180 462049 467436 471444 472764 467388 457022 459564 458918 442757 434694 468545 483534
10604 483534 493556 504351 523314 538101 565588 585305 606979 641653 668820 681231 705746
10593 705746 717344 731577 744370 757124 778525 797934 804985 813411 833658 860107 893016 946824
10581 946824 995290 1058422 1103095 1143392 1170537 1200354 1234773 1241690 1250153 1255015 1251860 1267388
$$ packed form
10667B09141p054j2187K064R510l020j544J7488k800N366J2188J2183J5013J9455
10654B75803J4055J7171j463P695J6360K098K4662J9454L7012N8895M4202N7089
10642E73033M4154k969m7913o5229l9334k1423j5917k2447m2174k6567Q946J3785
10630C55945K280k359J6410P949J0702l67j341Q656J8379K1657k479j0030Q478
10617D33880J8300R869N387M008J320n376j0366K542o46j6161q063L3851J4989
10604D83534J0022J0795J8963J4787K7487J9717K1674L4674K7167J2411K4515
10593G05746J1598J4233J2793J2754K1401J9409P051Q426K0247K6449L2909N3808
10581I46824M8466O3132M4673M0297K7145K9817L4419O917Q463M862l155J5528
$$ plain form
10569 1267388 1294315 1350013 1403487 1453290 1516885 1603309 1706469 1814895 1934581 2064003
10559 2064003 2194317 2306300 2393966 2502853 2630627 2783430 2970939 3182856 3421876 3661192
10549 3661192 3908296 4149468 4390052 4629742 4876257 5159651 5511090 5939581 6484566
10540 6484566 7161432 7970122 8880425 9886662 10962777 12120731 13357803 14702853 16268198
10531 16268198 18243296 20834821 24264210 28888558 35195157 43976802 56536576 74923262
10523 74923262 102091974 140937689 190850371 242531597 281360231 302669639 309750298
10516 309750298 298438208 262114733 208553964 156480891 116288047 88162720 68973448
10509 68973448 55714586 46293330 39336916 33957245 29687200 26262623 23564091 21412417
$$ packed form
10569A267388K6927N5698N3474M9803O3595Q6424J03160J08426J19686J29422
10559B064003J30314J11983Q7666J08887J27774J52803J87509K11917K39020K39316
10549C661192K47104K41172K40584K39690K46515K83394L51439M28491N44985
10540F484566O76866Q08690R10303J006237J076115J157954J237072J345050J565345
10531A6268198J975098K591525L429389M624348O306599Q781645J2559774J8386686
10523G4923262K7168712L8845715M9912682N1681226L8828634K1309408P080659
10516C09750298j1312090l6323475n3560769n2073073m0192844k8125327j9189272
10509F8973448j3258862r421256o956414n379671m270045l424577k698532k151674
$$ plain form
10501 21412417 19635459 18128208 16811975 15629593 14501947 13388467 12331155 11386611
10493 11386611 10563282 9829392 9202745 8642192 8153550 7722897 7318666 6940239 6591847
10484 6591847 6271821 5966135 5676069 5394137 5129542 4875581 4647496 4439097 4234415
10475 4234415 4077925 3937166 3805908 3705418 3604733 3510173 3420073 3336199 3225554 3114614
10465 3114614 2999797 2887360 2758316 2624973 2483401 2357910 2230592 2123872 2030778 1957992
10455 1957992 1888908 1840401 1792379 1742496 1705129 1655802 1593500 1517199 1452970 1401360 1354167
10444 1354167 1303011 1245897 1205671 1197365 1170277 1131902 1102079 1096085 1083214 1075104 1059777 1036637
10432 1036637 1004996 991388 974223 938931 909363 894145 872969 846736 832171 804332 772176
$$ packed form
10501B1412417j776958j507251j316233j182382j127646j113480j057312r44544
10493A1386611q23329p33890o26647n60553m88642m30653m04231l78427l48392
10484F591847l20026l05686k90066k81932k64595k53961k28085k08399k04682
10475D234415j56490j40759j31258j00490j00685r4560r0100q3874j10645j10940
10465C114614j14817j12437j29044j33343j41572j25491j27318j06720r3094p2786
10455A957992o9084m8507m8022m9883l7367m9327o2302p6301o4229n1610m7193
10444A354167n1156n7114m0226q306k7088l8375k9823n994j2871q110j5327k3140
10432A036637l1641j3608j7165l5292k9568j5218k1176k6233j4565k7839l2156
$$ plain form
10421 772176 749241 732774 716283 692944 671319 660794 654038 660679 667251 665326 670001 664833 675426
10408 675426 685973 676062 653164 637938 623112 611923 609044 586545 555212 526376 519367 531699
10396 531699 543744 555985 577547 609061 642921 682913 721170 731587 670703 597146 537900
10385 537900 475529 419742 376556 342683 328823 328833 335330 326918 317445 314878 301625 291833 272764
10372 272764 259069 242047 244227 241817 220766 195030 184214 189034 194356 193437 181978 184177 179371
10359 179371 161758 143452 123670 114064 115623 117184 124949 124802 115369 114350 143050 159866 171717
10346 171717 183679 201106 213550 206053 185439 170809 159372 150295 136280 121241 107958 87056
10334 87056 75101 77681 84068 96352 90975 71637 60245 50489 46558 43307 38900 35175 42762
$$ packed form
10421G72176k2935j6467j6491k3339k1625j0525o756O641O572j925M675n168J0593
10408F75426J0547r911k2898j5226j4826j1189k879k2499l1333k8836p009J2332
10396E31699J2045J2241K1562L1514L3860L9992L8257J0417o0884p3557n9246
10385E37900o2371n5787m3186l3873j3860J0O497q412r473k567j3253r792j9069
10372B72764j3695j7022K180k410k1051k5736j0816M820N322r19j1459K199m806
10359A79371j7613j8306j9782r606J559J561P765j47r433j019K8700J6816J1851
10346A71717J1962J7427J2444p497k0614j4630j1437r077j4015j5039j3283k0902
10334H7056j1955K580O387J2284n377j9338j1392r756l931l251m407l725P587
$$ plain form
10321 42762 39836 25816 21964 27456 31826 46952 47314 48774 54109 64786 78085 92014 97608
10308 97608 103979 98999 108419 117610 96873 79475 91307 93877 95351 82342 61698 51294 31996
10295 31996 21258 36516 39596 37096 31073 20643 20346 22541 36544 42774 53215 58524 66399
10282 66399 73738 80148 79818 85080 98472 93719 82879 83185 79373 66751 65693 65855 58195 63393
10268 63393 72359 72475 70962 53018 56242 68985 61378 64343 65590 71575 65935 45614 28883 21223
10254 21223 24956 28922 10111 4249 2904 13333 5495 -1261 1240 1045 8974 10080 20468 21767
10240 21767 12569 11573 3894 1246 2027 12999 28787 24650 20496 10046 -3366 -9996 -9245 -11557
10226 -11557 -12878 -21632 -18875 -13589 -1046 8994 6280 956 -5388 -1983 -3208 -439 -8002 -20638
$$ packed form
10321D2762k926j4020l852N492M370J5126L62J460N335J0677J3299J3929N594
10308I7608O371m980R420R191k0737j7398J1832K570J474j3009k0644j0404j9298
10295C1996j0738J5258L080k500o023j0430k97K195J4003O230J0441N309P875
10282F6399P339O410l30N262J3392m753j0840L06l812j2622j058J62p660N198
10268F3393Q966J16j513j7944L224J2743p607K965J247N985n640k0321j6731p660
10254B1223L733L966j8811n862j345J0429p838o756K501j95P929J106J0388J299
10240B1767r198r96p679k648P81J0972J5788m137m154j0450j3412o630P51k312
10226a1557j321q754K757N286J2543J0040k714n324o344L405j225K769p563j2636
$$ plain form
10212 -20638 -27250 -34538 -39412 -26970 -23176 4221 35234 62409 78470 94848 106143 126812
10200 126812 115576 113637 113440 109409 111144 109296 108930 99728 101818 109602 117195 133358 143816 135468
10186 135468 132483 147660 167882 185670 212336 235171 263008 289396 312152 337852 380986 430998
10174 430998 482585 557311 673216 825590 1056752 1400488 1855509 2468797 3188030 3866498
10164 3866498 4366795 4638556 4640928 4334220 3740087 2993527 2291084 1756732 1364459 1066996
10154 1066996 868953 728929 621231 531943 461038 410892 378892 358112 345596 321812 304425
10143 304425 284232 262447 250311 224599 195557 168424 163208 160119 146583 148849 146381 130979
10131 130979 130143 140651 126237 109918 113926 109472 106418 101151 112833 118766 108125 100494 106254
$$ packed form
10212b0638o612p288m874J2442L794K7397L1013K7175J6061J6378J1295K0669
10200A26812j1236j939j97m031J735j848l66r202K090P784P593J6163J0458q348
10186A35468k985J5177K0222J7788K6666K2835K7837K6388K2756K5700M3134N0012
10174D30998N1587P4726J15905J52374K31162L43736M55021O13288P19233O78468
10164C866498N00297K71761K372l06708n94133p46560p02443n34352l92273k97463
10154A066996j98043j40024j07698q9288p0905n0146l2000k0780j2516k3784j7387
10143C04425k0193k1785j2136k5712k9042k7133n216l089j3536K266k468j5402
10131A30979q36J0508j4414j6319M008m454l054n267J1682N933j0641p631N760
$$ plain form
10118 106254 118235 119233 105628 97197 105889 126063 130572 124397 112787 121876 122126 132700 147003
10105 147003 159225 164404 182110 223259 280351 351980 465946 632705 844372 1088960 1331271
10094 1331271 1511563 1608924 1642216 1559932 1352412 1081378 822841 625489 488147 382472
10084 382472 311052 264700 233666 219944 202737 188304 177541 155117 132056 111126 101561 95698
10072 95698 85096 80194 76216 68655 60325 45479 31728 28660 43983 52789 58366 55500 53410
10059 53410 58452 54987 64407 64929 58343 66916 53872 38103 31013 25408 18410 15727 22593 28801
10045 28801 35384 46619 42697 46554 49786 42137 50210 57512 64232 59809 75451 61155 45881
10032 45881 41809 32794 16732 17917 26324 1619 -12283 -2528 10364 23450 30463 22952 26319
$$ packed form
10118A06254J1981R98j3605q431Q692K0174M509o175j1610R089K50J0574J4303
10105A47003J2222N179J7706M1149N7092P1629J13966J66759K11667K44588K42311
10094A331271J80292R7361L3292q2284k07520k71034k58537j97352j37342j05675
10084C82472p1420m6352l1034j3722j7207j4433j0763k2424k3061k0930r565n863
10072I5698j0602m902l978p561q330j4846j3751l068J5323Q806N577k866k090
10059E3410N042l465R420N22o586Q573j3044j5769p090n605o998k683O866O208
10045B8801O583J1235l922L857L232p649Q073P302O720m423J5642j4296j5274
10032D5881m072r015j6062J185Q407k4705j3902R755J2892J3086P013p511L367
$$ plain form
10019 26319 22756 18369 18267 20220 24299 32764 37181 36196 32388 27350 46292 43452 19731 16850
10005 16850 13464 19148 35980 37895 45346 49156 42887 41744 35413 28861 17398 23793 19880 19555
9991 19555 22698 25603 30854 37742 41119 25270 16731 22022 37895 40574 51662 70614 76479 87484
9977 87484 119934 139538 154611 159369 150991 132077 124110 119280 92408 73671 67898 69163 58290
9964 58290 51158 39613 49476 53448 63234 55945 49828 48980 31055 32040 35497 23919 11460 18941
9950 18941 15652 11376 16615 24840 11780 6399 6220 214 -5917 7107 4146 15213 29455 33646
9936 33646 40632 40449 48062 40574 25299 11877 -2379 -110 8999 14125 17935 18603 25729 19445
9922 19445 5369 10018 23668 39250 34195 29003 32480 35640 29487 11278 5853 14818 21359 15152
$$ packed form
10019B6319l563m387j02J953M079Q465M417r85l808n038J8942k840k3721k881
10005A6850l386N684J6832J915P451L810o269j143o331o552j1463O395l913l25
9991A9555L143K905N251O888L377j5849q539N291J5873K679J1088J8952N865J1005
9977H7484L2450J9604J5073M758q378j8914p967m830k6872j8737n773J265j0873
9964E8290p132j1545R863L972R786p289o117q48j7925R85L457j1578j2459P481
9950A8941l289m276N239Q225j3060n381j79o006o131J3024k961J1067J4242M191
9936C3646O986j83P613p488j5275j3422j4256K269R109N126L810O68P126o284
9922A9445j4076M649J3650J5582n055n192L477L160o153j8209n425Q965O541o207
$$ plain form
9908 15152 4285 -5170 -9115 -916 15660 16773 13442 22955 34681 23951 24838 26444 16444 11658
9894 11658 4148 3081 14139 13021 6750 1520 3522 10802 24818 27221 32125 34144 29169 25638
9880 25638 23639 13924 9348 4648 6062 14452 13555 5494 7709 11191 -1926 1058 19430 17803
9866 17803 7124 -4706 -3707 -5284 -10837 -8797 -15509 -2272 5209 723 8731 18557 15356 11973
9852 11973 24920 16489 9607 18106 18348 10222 1782 7317 15967 26968 26641 16431 7928 10522
9838 10522 7428 17743 19235 6871 11274 4980 8151 19867 16460 21454 22010 22902 13880 18294
9824 18294 20169 16102 3708 2204 -4655 3007 15454 -3169 -9290 -4333 -10555 -18196 -17875 -8637
9810 -8637 -3674 -8586 -1109 5349 7962 9436 3052 4364 6272 6497 123 -722 9223 842 -8483
$$ packed form
9908A5152j0867r455l945Q199J6576J113l331R513J1726j0730Q87J606j0000m786
9894A1658p510j067J1058j118o271n230K002P280J4016K403M904K019m975l531
9880B5638j999r715m576m700J414Q390q97q061K215L482j3117K984J8372j627
9866A7803j0679j1830R99j577n553K040o712J3237P481m486Q008R826l201l383
9852A1973J2947q431o882Q499K42q126q440N535Q650J1001l27j0210q503K594
9838A0522l094J0315J492j2364M403o294L171J1716l407M994N56Q92r022M414
9824A8294J875m067j2394j504o859P662J2447j8623o121M957o222p641L21R238
9810h637M963m912P477O458K613J474o384J312J908K25o374q45R945q381r325
$$ plain form
9795 -8483 1395 8878 13460 7442 4942 -7121 -7638 15311 22625 16457 13150 -3656 -14689 -7472
9781 -7472 -6487 -7535 10848 22974 37646 46983 42819 32669 29740 37710 36604 29054 16878 17206
9767 17206 15497 6510 7482 7312 11266 8706 2832 598 9264 10580 18640 13296 7948 1134 7320
9752 7320 24923 24144 18799 8396 4435 6790 22596 23126 31169 36751 43589 58009 64575 61266
9738 61266 67424 68162 69911 61720 48369 43213 25695 20500 20580 13916 16613 15696 7928 15709 24033
9723 24033 23848 37897 24633 21879 16682 11017 10765 13370 9414 11144 23298 30249 26229 28449
9709 28449 45056 49714 35820 33650 37639 35217 23957 11261 3484 3210 -5084 10582 16966 20703
9695 20703 24203 21059 28850 40901 36597 11257 3032 13180 8508 8680 15001 8627 9877 20927
$$ packed form
9795h483R878P483M582o018k500j2063n17K2949P314o168l307j6806j1033P217
9781g472R85j048J8383J2126J4672R337m164j0150k929P970j106p550j2176L28
9767A7206j709q987R72j70L954k560n874k234Q666J316Q060n344n348o814O186
9752G320J7603p79n345j0403l961K355J5806N30Q043N582O838J4420O566l309
9738F1266O158P38J749q191j3351n156j7518n195Q0o664K697r17p768P781Q324
9723B4033j85J4049j3264k754n197n665k52K605l956J730J2154O951m020K220
9709B8449J6607M658j3894k170L989k422j1260j2696p777k74q294J5666O384L737
9695B0703L500l144P791J2051m304k5340q225J0148m672J72O321o374J250J1050
$$ plain form
9681 20927 32283 29043 30069 38375 37611 22781 11319 10745 14795 14691 15753 19385 12042 9830 16342
9666 16342 37099 33110 19732 13201 1498 8505 8176 11846 25580 16319 20466 33184 35692 31762
9652 31762 24820 15767 6443 2076 21518 26404 22817 12648 10589 12588 12132 15534 35284 44626
9638 44626 47550 45380 35792 21375 23420 24481 33583 44199 41404 37191 26257 19680 21205 19956
9624 19956 12194 21514 20283 16430 21783 21288 25635 38666 44678 39716 20625 19363 24162 41960
9610 41960 44067 45857 38085 27118 9851 19569 27837 12993 14317 1870 -10170 -3684 2689
9597 2689 8212 13459 25076 26928 31143 39502 40686 50460 59406 49771 29122 29057 35670 42754 27520
9582 27520 23272 24757 33388 28685 22580 33369 25468 29442 42424 33368 25641 23617 33834 29987
$$ packed form
9681B0927J1356l240J026Q306p64j4830j1462n74M050j04J062L632p343k212O512
9666A6342K0757l989j3378o531j1703P007l29L670J3734r261M147J2718K508l930
9652C1762o942r053r324m367J9442M886l587j0169k059J999m56L402J9750R342
9638D4626K924k170r588j4417K045J061R102J0616k795m213j0934o577J525j249
9624A9956p762R320j231l853N353m95M347J3031O012m962j9091j262M799J7798
9610D1960K107J790p772j0967j7267R718Q268j4844J324j2447j2040O486O373
9597B689N523N247J1617J852M215Q359J184R774Q946r635k0649o5O613P084j5234
9582B7520m248J485Q631m703o105J0789p901L974J2982r056p727k024J0217l847
$$ plain form
9568 29987 23927 18584 12512 10286 -1725 13006 26818 36980 44488 55434 48244 49761 51389
9555 51389 42438 32979 38143 35559 27871 25955 19121 15786 24634 21420 26294 30185 14138 11650
9541 11650 14503 17264 30952 32178 31215 16442 13093 27580 35571 35560 25269 14956 19308 16600
9527 16600 22716 33611 35126 35333 49873 49366 35759 20592 19561 31131 34392 49000 57479 57660
9513 57660 49837 46868 51127 41677 48397 50111 44941 37947 33636 44284 39444 36791 50533 45606
9499 45606 37761 22327 34839 47284 53799 63779 60090 43476 37298 29173 29571 38374 35802 21959
9485 21959 16669 24036 44516 50256 45654 48249 51165 43935 47244 48463 41554 41315 46054 39562 33830
9470 33830 28998 26444 36771 39069 33601 29664 39173 42247 37177 51492 56721 56048 43405 39866
$$ packed form
9568B9987o060n343o072k226j2011J4731J3812J0162P508J0946p190J517J628
9555E1389q951r459N164k584p688j916o834l335Q848l214M874L891j6047k488
9541A1650K853K761J3688J226r63j4773l349J4487P991j1j0291j0313M352k708
9527A6600O116J0895J515K07J4540n07j3607j5167j031J1570L261J4608Q479J81
9513E7660p823k969M259r450O720J714n170o994m311J0648m840k653J3742m927
9499D5606p845j5434J2512J2445O515R980l689j6614o178q125L98Q803k572j3843
9485B1959n290P367K0480N740m602K595K916p230L309J219o909k39M739o492n732
9470C3830m832k554J0327K298n468l937R509L074n070J4315N229o73j2643l539
$$ plain form
9456 39866 47589 42539 52356 63948 66725 60386 60881 54084 45419 45531 46594 47269 47352 48126 41495 52482
9440 52482 56207 57836 47615 39924 41040 37525 33283 29990 37348 42631 40236 50542 57516 48116
9426 48116 43880 53993 51546 42189 36296 40594 42008 47828 48168 59089 69196 65069 56967 54281
9412 54281 61591 60121 60600 66445 64327 58566 58039 64674 64708 65781 66737 65871 61079 55744 50401 47462
9396 47462 49518 65187 59224 57709 52580 51352 68169 68001 63415 74517 86833 79163 72919 62692
9382 62692 61659 58009 36016 43208 44732 47888 60454 64087 56625 51841 44666 54472 57638 62201
9368 62201 63586 65703 72484 74082 65098 75658 90783 86034 69128 67509 53504 49565 55802 61703
9354 61703 65405 67166 78349 86429 87309 96858 100932 94028 86129 88551 90928 89984 87163 89076 88051
$$ packed form
9456C9866P723n050R817J1592K777o339M95o797q665J12J063O75Q3P74o631J0987
9440E2482L725J629j0221p691J116l515m242l293P358N283k395J0306O974r400
9426D8116m236J0113k447r357n893M298J414N820L40J0921J0107m127q102k686
9412E4281P310j470M79N845k118n761n27O635L4J073R56q66m792n335n343k939
9396D7462K056J5669n963j515n129j228J6817j68m586J1102J2316p670o244j0227
9382F2692j033l650k1993P192J524L156J2566L633p462m784p175R806L166M563
9368F2201J385K117O781J598q984J0560J5125m749j6906j619j4005l939O237N901
9354F1703L702J761J1183Q080Q80R549M074o904p899K422K377r44k821J913j025
$$ plain form
9339 88051 86501 91506 93147 84213 88087 101956 114118 107482 109775 111144 119328 116015 124636 122084
9325 122084 112989 103243 91228 89443 82565 94156 97592 94202 74774 66616 73545 73810 79728 75406
9311 75406 85016 91559 82877 95710 103103 106986 112632 92510 75650 82765 79125 83807 95998 90815
9297 90815 89362 97820 106230 110370 114419 106350 94954 94669 101033 110787 106974 92110 96705 114310
9283 114310 107035 103024 103218 115208 116179 107855 100071 100671 113795 120264 125131 130895 122605 115118 117016
9268 117016 133336 138086 133139 137382 135819 137768 132876 130411 135840 134634 114209 114534 123001 130954
9254 130954 131705 126441 133414 140023 144137 149830 151090 157676 163500 161216 164181 157132 153442 160463 159109
9239 159109 164051 164081 158200 161117 162135 161128 167986 176696 183920 177557 173686 171907 176562 177411 193378
$$ packed form
9339H8051j550N005J641q934L874J3869J2162o636K293J369Q184l313Q621k552
9325A22084r095r746j2015j785o878J1591L436l390j9428q158O929K65N918m322
9311G5406R610O543q682J2833P393L883N646k0122j6860P115l640M682J2191n183
9297I0815j453Q458Q410M140M049q069j1396k85O364R754l813j4864M595J7605
9283A14310p275m011J94J1990R71q324p784O00J3124O469M867N764q290p487J898
9268A17016J6320M750m947M243j563J949m892k465N429j206k0425L25Q467P953
9254A30954P51n264O973O609M114N693J260O586N824k284K965p049l690P021j354
9239A59109M942L0n881K917J018j007O858Q710P224o363l871j779M655Q49J5967
$$ plain form
9224 193378 199299 210617 217571 213702 211355 209814 196216 203217 202797 203193 206095 219244 225353 219807
9210 219807 213643 211777 221876 239732 252330 254466 274914 292479 321818 360967 406632 477133
9198 477133 542179 588731 622410 624497 620236 606415 615376 618916 623225 636848 620967 588673 523179
9185 523179 450383 388957 363078 357149 335143 326954 326157 316018 295635 313716 321011 317834 298874
9172 298874 288258 276085 284048 276264 264386 256010 261102 274489 290014 287490 292162 295312 291798
9159 291798 288808 294916 303113 309295 309873 303249 289496 297917 311751 310545 322931 325225 330468 339295
9145 339295 325800 336348 347674 346605 345543 341384 325702 321819 326098 338247 353017 349765 358292
9132 358292 364236 352610 361701 380476 380604 379764 378806 372617 387220 399283 401496 418615 413297 413392
$$ packed form
9224A93378N921J1318O954l869k347j541j3598P001m20L96K902J3149O109n546
9210B19807o164j866J0099J7856J2598K136K0448J7565K9339L9149M5665P0501
9198D77133O5046M6552L3679K087m261j3821Q961L540M309J3623j5881l2294o5494
9185E23179p2796o1426k5879n929k2006q189p97j0139k0383J8081P295l177j8960
9172B98874j0616j2173P963p784j1878q376N092J3387J5525k524M672L150l514
9159B91798k990O108Q197O182N78o624j3753Q421J3834j206J2386K294N243Q827
9145C39295j3495J0548J1326j069j062m159j5682l883M279J2149J4770l252Q527
9132C58292N944j1626R091J8775J28q40r58o189J4603J2063K213J7119n318R5
$$ plain form
9118 413392 414814 413943 426982 436816 438962 457851 472483 471051 460641 444751 452993 465447 460758
9105 460758 445273 449884 458880 450486 444248 466419 482496 484541 487215 490682 501812 502362 513823
9092 513823 536375 548003 551539 546310 543784 538166 551543 560624 580124 583870 597076 610490 618789
9079 618789 625989 626228 633199 644438 659772 680251 689415 695596 695785 691501 718601 743530 752754 745571
9065 745571 746210 768187 781832 788295 793441 806964 821799 830466 843577 859022 876389 902653 925043
9052 925043 924734 928183 943011 957692 951781 960877 990975 1029802 1037471 1043724 1067317 1078818 1088371
9039 1088371 1102086 1122779 1144833 1165755 1196005 1219489 1239815 1257150 1277192 1301746 1322073
9028 1322073 1344868 1371468 1408289 1451147 1483942 1518291 1541512 1570619 1600896 1638120 1668576
$$ packed form
9118D13392J422q71J3039R834K146J8889J4632j432j0410j5890Q242J2454m689
9105D60758j5485M611Q996q394o238K2171J6077K045K674L467J1130N50J1461
9092E13823K2552J1628L536n229k526n618J3377R081J9500L746J3206J3414Q299
9079F18789P200K39O971J1239J5334K0479R164O181J89m284K7100K4929R224p183
9065G45571O39K1977J3645O463N146J3523J4835Q667J3111J5445J7367K6264K2390
9052I25043l09L449J4828J4681n911R096L0098L8827P669O253K3593J1501R553
9039A088371J3715K0693K2054K0922L0250K3484K0326J7335K0042K4554K0327
9028A322073K2795K6600L6821M2858L2795L4349K3221K9107L0277L7224L0456
$$ plain form
9017 1668576 1702454 1729173 1765615 1809365 1840892 1880377 1924712 1970297 2011287 2063951 2110102
9006 2110102 2150815 2206913 2276431 2343491 2387251 2438088 2493996 2565372 2614658 2692276 2766585
8995 2766585 2841474 2918304 2998656 3066741 3143219 3237825 3327404 3415460 3514471 3624085 3733637
8984 3733637 3845146 3975104 4085808 4209304 4359417 4496372 4629808 4769872 4926884 5085428
8974 5085428 5245075 5414528 5592882 5752266 5927876 6109048 6300273 6509568 6715884 6935632
8964 6935632 7170363 7420053 7661988 7912684 8170343 8429102 8691077 8970298 9249031 9550214
8954 9550214 9858901 10150241 10444042 10761686 11081147 11392356 11704124 12015339 12322535 12627308
8944 12627308 12938944 13240150 13520552 13793510 14065737 14328676 14582345 14801610 15002231
$$ packed form
9017A668576L3878K6719L6442M3750L1527L9485M4335M5585M0990N2664M6151
9006B110102M0713N6098O9518O7060M3760N0837N5908P1376M9286P7618P4309
8995B766585P4889P6830Q0352O8085P6478R4606Q9579Q8056R9011J09614J09552
8984C733637J11509J29958J10704J23496J50113J36955J33436J40064J57012J58544
8974E085428J59647J69453J78354J59384J75610J81172J91225K09295K06316K19748
8964F935632K34731K49690K41935K50696K57659K58759K61975K79221K78733L01183
8954I550214L08687K91340K93801L17644L19461L11209L11768L11215L07196L04773
8944A2627308L11636L01206K80402K72958K72227K62939K53669K19265K00621
$$ plain form
8935 15002231 15192073 15345833 15470595 15567952 15640098 15687790 15678631 15634344 15578055 15481569 15335716
8924 15335716 15156970 14970220 14745357 14488131 14214708 13936728 13631246 13309316 12959864
8915 12959864 12598541 12233900 11881349 11536208 11174476 10816207 10466359 10120238 9788297
8906 9788297 9448146 9106870 8778615 8481454 8198289 7913537 7641139 7377490 7115894 6884942
8896 6884942 6651655 6415448 6195328 5991584 5791444 5587809 5394317 5227565 5066979 4901146
8886 4901146 4734133 4576576 4432734 4304297 4178224 4044523 3924204 3797969 3680446 3584399
8876 3584399 3501941 3386670 3271599 3181314 3110312 3048485 2967589 2889587 2809282 2729390 2658411
8865 2658411 2590620 2534060 2464216 2400121 2343659 2293181 2225086 2171783 2121707 2054515 1998217
$$ packed form
8935A5002231J89842J53760J24762R7357P2146M7692r159m4287n6289r6486j45853
8924A5335716j78746j86750k24863k57226k73423k77980l05482l21930l49452
8915A2959864l61323l64641l52551l45141l61732l58269l49848l46121l31941
8906I788297l40151l41276l28255k97161k83165k84752k72398k63649k61596k30952
8896F884942k33287k36207k20120k03744k00140k03635j93492j66752j60586j65833
8886D901146j67013j57557j43842j28437j26073j33701j20319j26235j17523r6047
8876C584399q2458j15271j15071r0285p1002o1827q0896p8002q0305p9892p0979
8865B658411o7791n6560o9844o4095n6462n0478o8095n3303n0076o7192n6298
$$ plain form
8854 1998217 1969107 1913878 1858803 1807749 1777150 1763518 1721125 1685635 1640395 1600150 1581471
8843 1581471 1569577 1545685 1505752 1457762 1425962 1403313 1363697 1347149 1322303 1290683 1255009
8832 1255009 1227155 1200901 1180794 1173937 1172846 1156528 1121289 1097565 1089939 1075504 1063551 1038770
8820 1038770 1018635 1005223 977239 956132 948371 944079 924205 912393 900951 880992 869108 849909
8808 849909 832930 820643 806073 796200 775922 765835 757114 751464 736144 735277 728525 713386 686637
8795 686637 670564 669058 666851 658783 643872 646639 632019 623778 624512 618658 608224 603105 583010
8782 583010 570783 565826 544692 536710 538886 528970 521972 522726 514252 493792 476768 476002 479497 484437
8768 484437 475350 452774 442884 456625 445541 432497 416677 412421 420818 428407 414371 398194 400128
$$ packed form
8854A998217k9110n5229n5075n1054l0599j3632m2393l5490m5240m0245j8679
8843A581471j1894k3892l9933m7990l1800k2649l9616j6548k4846l1620l5674
8832A255009k7854k6254k0107o857j091j6318l5239k3724p626j4435j1953k4781
8820A038770k0135j3412k7984k1107p761m292j9874j1812j1442j9959j1884j9199
8808H49909j6979j2287j4570r873k0278j0087q721n650j5320q67o752j5139k6749
8795F86637j6073j506k207q068j4911K767j4620q241P34n854j0434n119k0095
8782E83010j2227m957k1134p982K176r916o998P54q474k0460j7024p66L495M940
8768D84437r087k2576r890J3741j1084j3044j5820m256Q397P589j4036j6177J934
$$ plain form
8755 400128 409376 404721 384727 374421 378863 373431 375665 380275 369573 366344 356136 341592 336878
8742 336878 333509 333804 336860 329425 323599 323763 316077 299298 294504 284266 288740 289908 293806 284276
8728 284276 289694 287777 289483 287794 290361 299287 284096 288162 290595 288413 285740 274409 276663 262292
8714 262292 246553 244721 248656 251876 250956 248166 239115 228160 231479 224306 218770 206130 214751 225652
8700 225652 232391 230857 242897 231849 195823 180015 185060 190800 185143 169330 188159 205225 204088
8687 204088 191223 187457 181881 187686 182114 192075 202088 200165 200837 199891 201851 191213 176774 191768
8673 191768 208263 211073 199738 187055 170152 167216 168787 163963 169262 160944 160916 171517 180697 179740
8659 179740 167013 159500 158704 160287 162120 171559 164643 160599 161847 141720 131004 140512 149876 144936
$$ packed form
8755D00128R248m655j9994j0306M442n432K234M610j0702l229j0208j4544m714
8742C36878l369K95L056p435n826J64p686j6779m794j0238M474J168L898r530
8728B84276N418j917J706j689K567Q926j5191M066K433k182k673j1331K254j4371
8714B62292j5739j832L935L220r20k790r051j0955L319p173n536j2640Q621J0901
8700B25652O739j534J2040j1048l6026j5808N045N740n657j5813J8829J7066j137
8687B04088j2865l766n576N805n572R961J0013j923O72r46J960j0638j4439J4994
8673A91768J6495K810j1335j2683j6903k936J571m824N299q318k8J0601R180r57
8659A79740j2727p513p96J583J833R439o916m044J248k0127j0716R508R364m940
$$ plain form
8645 144936 134770 140302 139507 121853 129035 140347 150610 148646 151747 144351 130588 132722 129615
8632 129615 136710 148960 150398 151952 153555 143203 136065 133790 136731 137839 137643 130284 139646 158068
8618 158068 161950 161577 155980 162868 173625 169382 149321 136689 146360 161049 166604 165105 160523 161444
8604 161444 166388 175320 166986 156763 152219 152456 157886 160259 157420 181053 191639 188357 183169 200560
8590 200560 205993 195765 195497 181540 163336 147428 148735 141077 120856 117248 123179 140233 155060
8577 155060 152463 136803 116133 107250 103386 91222 90945 104211 114202 111241 101024 98746 91198
8564 91198 92327 109929 100072 104021 97087 99016 100064 98522 99274 98742 92876 87402 95836 98881 101948
8549 101948 104262 99287 107302 99616 98320 95321 91455 82807 79972 80074 80429 80519 84628 90644 89279
$$ packed form
8645A44936j0166N532p95j7654P182J1312J0263j964L101p396j3763K134l107
8632A29615P095J2250J438J554J603j0352p138k275K941J108j96p359R362J8422
8618A58068L882l73n597O888J0757m243k0061j2632R671J4689N555j499m582R21
8604A61444M944Q932q334j0223m544K37N430K373k839K3633J0586l282n188J7391
8590B00560N433j0228k68j3957j8204j5908J307p658k0221l608N931J7054J4827
8577A55060k597j5660k0670q883l864j2164k77J3266R991k961j0217k278p548
8564I1198J129J7602r857L949o934J929J048j542P52n32n866n474Q434L045L067
8549A01948K314m975Q015p686j296k999l866q648k835J02L55R0M109O016j365
$$ plain form
8534 89279 90454 85354 71919 72816 77473 92619 100940 90411 78938 77206 77547 86610 84272 67115
8520 67115 60610 71293 83172 81153 79802 76876 88118 97521 98524 86700 83812 74027 63086
8507 63086 46424 55402 61890 67353 62328 46815 38261 44643 53653 62248 49551 52450 57033 52653
8493 52653 58617 60086 53050 54767 55982 61775 70803 69485 72065 62253 66499 52790 59964 55229
8479 55229 35539 30284 41074 48946 37799 35755 44670 48251 53084 71566 78134 75331 62767
8466 62767 64465 58955 52372 49057 43020 37490 43367 35220 26087 34840 46988 38289 33020 37878
8452 37878 42344 37861 36608 37933 44170 37123 34886 51473 55757 49956 49437 52037 54157 52031 45510
8437 45510 49144 49059 40547 27325 31028 36604 42007 50850 44925 51469 44842 35073 28078 12805 9765
$$ packed form
8534H9279J175n100j3435Q97M657J5146Q321j0529j1473j732L41R063k338j7157
8520F7115o505J0683J1879k019j351k926J1242R403J003j1824k888r785j0941
8507F3086j6662Q978O488N463n025j5513q554O382R010Q595j2697K899M583m380
8493E2653N964J469p036J717J215N793R028j318K580r812M246j3709P174m735
8479E5229j9690n255J0790P872j1147k044Q915L581M833J8482O568k803j2564
8466F2767J698n510o583l315o037n530N877q147r133Q753J2148q699n269M858
8452C7878M466m483j253J325O237p047k237J6587M284n801n19K600K120k126o521
8437D5510L634q5q512j3222L703N576N403Q843n925O544o627r769o995j5273l040
$$ plain form
8422 9765 12202 20683 33832 37368 37070 32289 33042 33180 22949 23725 16522 9950 15437 20401 21670
8407 21670 13404 15141 31927 32369 28464 28523 23410 38220 65959 74266 74180 77239 78449 93876 92497
8392 92497 70625 54847 49360 41220 27128 18097 13793 15025 16146 14948 9411 -4083 -4507 -1127
8378 -1127 6754 17640 19942 8530 17624 19094 16092 4810 1571 -1246 1710 47 -3126 1773
8364 1773 10692 7426 19871 19677 17219 20144 18279 28755 30844 26246 22994 25427 16967 4527
8350 4527 11795 21883 15625 22998 35238 37981 43403 44420 28839 23442 28017 33066 30785 28318
8336 28318 24738 32515 31511 23682 34014 41200 40071 33746 22163 27868 30862 32504 36211 23092
8322 23092 8670 6896 16223 16107 27669 40987 52210 57336 60687 43639 37480 38871 28975 22013
$$ packed form
8422I765K437Q481J3149L536k98m781P53J38j0231P76p203o572N487M964J269
8407B1670q266J737J6786M42l905N9n113J4810K7739Q307q6L059J210J5427j379
8392I2497k1872j5778n487q140j4092r031m304J232J121j198n537j3494m24L380
8378a127P881J0886K302j1412R094J470l002j1282l239k817K956j663l173M899
8364A773Q919l266J2445j94k458K925j865J0476K089m598l252K433q460j2440
8350D527P268J0088o258P373J2240K743N422J017j5581n397M575N049k281k467
8336B8318l580P777j004p829J0332P186j129o325j1583N705K994J642L707j3119
8322B3092j4422j774R327j16J1562J3318J1223N126L351j7048o159J391r896o962
$$ plain form
8308 22013 28610 29231 29621 38633 52492 55042 48276 46625 59055 67191 67633 51210 42626 46479 39084
8293 39084 40107 30719 29795 48871 62721 84370 108637 124198 142490 159430 187343 192277 177082
8280 177082 159893 135523 103966 65160 44179 32899 29607 19125 26338 42706 52300 49845
8268 49845 50780 46731 35433 34654 43080 46949 54447 54290 63555 78119 67996 53576 45814 50541
8254 50541 51542 51346 60317 62869 45570 45837 67549 78421 104242 129296 140351 157091 168599
8241 168599 181715 190012 184859 153446 109135 84084 74580 59490 48421 45557 34025 22472
8229 22472 15738 10256 13880 16964 7736 -46 9801 20517 12918 1131 10321 8864 16384 27447
8215 27447 20190 15150 16280 15085 9195 2237 656 7156 9719 16180 4549 -6668 -3899 7220
$$ packed form
8308B2013O597O21L90R012J3859K550o766j651J2430Q136M42j6423q584L853p395
8293C9084J023r388r24J9076J3850K1649K4267J5561J8292J6940K7913M934j5195
8280A77082j7189k4370l1557l8806k0981j1280l292j0482P213J6368R594k455
8268D9845R35m049j1298p79Q426L869P498j57R265J4564j0123j4420p762M727
8254E0541J001j96Q971K552j7299K67K1712J0872K5821K5054J1055J6740J1508
8241A68599J3116Q297n153l1413m4311k5051r504j5090j1069k864j1532j1553
8229B2472o734n482L624L084r228p782R847J0716p599j1787R190j457P520J1063
8215B7447p257n040J130j195n890o958j581O500K563O461j1631j1217K769J1119
$$ plain form
8201 7220 24328 25295 16082 12615 17914 8319 10132 16682 8657 7253 -6432 -7538 2721 22451
8187 22451 24857 15721 -4987 -6368 10476 11036 14776 8186 12075 14487 10316 22882 22058 20555
8173 20555 10412 232 7779 16261 8733 -2057 -860 -3499 -2802 10034 6988 8749 6755 7517
8159 7517 6970 9424 14827 21005 13285 19844 24938 20917 12240 5960 -1287 -1530 7400 22196 23911
8144 23911 22421 19382 18691 17159 12784 17123 9073 -41 -11859 -9068 128 -3797 8058 6572
8130 6572 11575 16063 19689 21840 13839 29004 36464 38614 27302 21563 22556 37389 42828 39728
8116 39728 29866 17888 10034 29263 27073 8501 15080 14493 10720 -766 12775 22117 17583 10193
8102 10193 -1497 -249 8040 9292 12235 2981 5352 -5121 -6987 -9485 -5485 -14390 -16081 -4504
$$ packed form
8201G220J7108R67r213l467N299r595J813O550q025j404j3685j106J0259J9730
8187B2451K406r136k0708j381J6844N60L740o590L889K412m171J2566q24j503
8173B0555j0143j0180P547Q482p528j0790J197k639O97J2836l046J761j994P62
8159G517n47K454N403O178p720O559N094m021q677o280p247k43Q930J4796J715
8144B3911j490l039o91j532m375M339q050r114j1818K791R196l925J1855j486
8130F572N003M488L626K151q001J5165P460K150j1312n739R93J4833N439l100
8116C9728r862j1978p854J9229k190j8572O579n87l773j1486J3541R342m534p390
8102A0193j1690J248Q289J252K943r254K371j0473j866k498M000q905j691J1577
$$ plain form
8088 -4504 12236 23235 33687 32277 19436 18737 18375 21663 23261 31910 19978 7466 17961 30336
8074 30336 29817 43417 40556 54809 45084 42552 28464 29638 43948 43112 27115 20297 10160 4073
8060 4073 18284 29697 28122 23425 19167 24089 15182 22369 34950 40528 52073 58755 58505 53498
8046 53498 36593 24284 22889 31974 37963 34577 25028 9065 14172 24197 23387 28027 27203 26209
8032 26209 22777 17551 13936 28736 26246 876 3818 13066 15831 19567 26683 26968 18801 18838 37834
8017 37834 39164 43398 44600 38796 19184 16507 28882 21336 20116 36144 43719 30927 26002 26369
8003 26369 39061 44783 48976 60159 66685 62976 60620 65545 62057 48624 39442 34551 33899 38396
7989 38396 50925 57308 54731 46290 37049 30475 24929 28046 36656 25051 25772 28143 27541 16532
$$ packed form
8088d504J6740J0999J0452j410j2841o99l62L288J598Q649j1932j2512J0495J2375
8074C0336n19J3600k861J4253r725k532j4088J174J4310q36j5997o818j0137o087
8060D073J4211J1413j575m697m258M922q907P187J2581N578J1545O682k50n007
8046E3498j6905j2309j395R085N989l386r549j5963N107J0025q10M640q24r94
8032B6209l432n226l615J4800k490k5370K942R248K765L736P116K85q167L7J8996
8017C7834J330M234J202n804j9612k677J2375p546j220J6028P575j2792m925L67
8003B6369J2692N722M193J1183O526l709k356M925l488j3433r182m891o52M497
7989C8396J2529O383k577q441r241o574n546L117Q610j1605P21K371o02j1009
$$ plain form
7975 16532 16246 13512 16594 11530 -1390 4141 25642 47984 43155 45576 33273 23590 26886 34595
7961 34595 35967 37199 37582 33307 40378 51596 53154 55436 64307 57309 46239 55859 65472 72403
7947 72403 79013 69616 71116 72960 70228 58937 62006 65410 56808 35886 24397 21223 18799 6235
7933 6235 17551 18040 -920 1605 5615 3826 1991 12263 13158 13564 21774 25161 23476 17354 10770
7918 10770 24599 29182 26419 30653 20715 10737 10013 571 4091 2704 -794 10969 21037 22756
7904 22756 14789 11753 8787 3969 7067 11131 -493 -2492 1917 4829 16496 17928 10098 2548
7890 2548 -655 5788 10048 1666 -1844 -2874 5722 6443 12711 14484 5674 3578 15021 10534 13566
7875 13566 2103 -3874 -5424 15299 20040 7001 5694 8806 15971 8452 15675 12503 13267 7487
$$ packed form
7975A6532k86k734L082n064j2920N531K1501K2342m829K421j2303r683L296P709
7961C4595J372J232L83m275P071J1218J558K282Q871o998j1070R620R613O931
7947G2403O610r397J500J844k732j1291L069L404q602k0922j1489l174k424j2564
7933F235J1316M89j8960K525M010j789j835J0272Q95M06Q210L387j685o122o584
7918A0770J3829M583k763M234r938r978p24r442L520j387l498J1763J0068J719
7904B2756p967l036k966m818L098M064j1624j999M409K912J1667J432p830p550
7890B548l203O443M260q382l510j030Q596P21O268J773q810k096J1443m487L032
7875A3566j1463n977j550K0723M741j3039j307L112P165p519P223l172P64n780
$$ plain form
7861 7487 20638 25064 14293 10953 5286 11291 8567 1770 3439 1626 -3748 -9816 -15875 -15346 -8252
7846 -8252 -5442 -8956 -14251 -14563 -14626 -29247 -20859 -3204 6713 14371 19416 25714 8644 -3942 1560
7831 1560 187 -6147 -5202 -8345 -19176 -17805 -9294 -11690 -12608 -7296 -9827 -1575 8185 14128 4191
7816 4191 -6287 -12549 -12643 -10140 -12996 -653 17185 10793 7489 10183 1729 1187 5223 11186 21995
7801 21995 22812 8191 2132 -5302 -3547 4455 8043 10398 20445 14183 -2384 -12154 -13870 -3212
7787 -3212 -4993 -3970 -9844 -3227 9798 8654 20 -2348 9125 -4086 -9406 -10361 -14543 -3899
7773 -3899 -8889 -16593 -25367 -18489 -22635 -15564 -5440 -7536 -12489 -5943 -17314 -22153 -23831 -12557
7759 -12557 -3107 56 -6986 -23398 -11754 -3813 -4896 -3639 -13232 -17295 -15064 -13275 -301 6415
$$ packed form
7861G487J3151M426j0771l340n667O005k724o797J669j813n374o068o059N29P094
7846h252K810l514n295l12o3j4621Q388J7655R917P658N045O298j7070j2586N502
7831A560j373o334R45l143j0831J371Q511k396r18N312k531Q252R760N943r937
7816D191j0478o262r4K503k856J2343J7838o392l304K694q454n42M036N963J0809
7801B1995Q17j4621o059p434J755Q002L588K355J0047o262j6567r770j716J0658
7787c212j781J023n874O617J3025j144q634k368J1473j3211n320r55m182J0644
7773c899m990p704q774O878m146P071J0124k096m953O546j1371m839j678J1274
7759a2557R450L163p042j6412J1644P941j083J257r593m063K231J789J2974O716
$$ plain form
7745 6415 -20240 -18350 -11766 -2937 -900 71 -3588 -20867 -23134 -11115 -7555 10144 10262 -4830
7731 -4830 -7637 104 1497 5883 5438 18682 31872 17506 3078 3084 -2102 -282 10764 1422 -7396
7716 -7396 -5033 12128 14066 -107 2851 926 -5844 4189 10202 -6144 -15252 -24827 -17526 -4922
7702 -4922 -1406 -71 -9957 -16310 -20407 -29173 -33958 -26202 -16686 -11548 -9134 -14688 -25520 -33974 -35706
7687 -35706 -22927 -17387 -17861 -2930 14366 7565 1592 -6847 -20993 -20142 -10449 -309 -8661 -1721
7673 -1721 10469 11869 2001 226 605 -9658 -17514 -21539 -8077 -626 -1026 -12479 -13757 -19193
7659 -19193 -25059 -25017 -10878 -772 -6579 -4248 -6590 -15995 -21969 -14875 -7900 19621 22712 16841
7645 16841 14909 8023 -12457 -7767 -1760 6560 12676 2603 -3869 10309 7311 -4792 -10122 -8242
$$ packed form
7745F415k6655J890O584Q829K037R71l659j7279k267J2019L560J7699J18j5092
7731d830k807P741J393M386m45J3244J3190j4366j4428On186J820J1046r342q818
7716g396K363J7161J938j4173K958j925o770J0033O013j6346r108r575P301J2604
7702d922L516J335r886o353m097q766m785P756R516N138K414n554j0832q454j732
7687c5706J2779N540m74J4931J7296o801n973q439j4146Q51R693J0140q352O940
7673a721J2190J400r868j775L79j0263p856m025J3462P451m00j1453j278n436
7659a9193n866M2J4139J0106n807K331k342r405n974P094O975K7521L091n871
7645A6841j932o886k0480M690O007Q320O116j0073o472J4178k998j2103n330J880
$$ plain form
7631 -8242 -10085 -14723 -4027 1819 -17554 -11659 -12451 -518 8239 -3604 -7920 1928 -9465 -9706
7617 -9706 -9433 -3336 -6901 -7438 -9871 -2719 2741 -1720 -4959 5644 -261 -4855 4029 19125 41242
7602 41242 39862 20322 10348 7532 -7121 -10417 -10395 5023 297 6146 -5368 -5799 -7864 -16597
7588 -16597 -9956 -18034 -21532 -18269 -9664 -16942 -19538 -13272 185 11894 -5512 -18920 -22045 -20038
7574 -20038 -19244 -20787 -16631 -17503 -10065 6694 -589 -3840 942 869 8837 -3908 -12384 -15292 -24514
7559 -24514 -32121 -30625 -26037 -25771 -29363 -24241 -5978 -2567 -5805 -11200 2011 -1073 -2050 -9795 -11579
7544 -11579 -4636 304 6629 125 -5392 3793 -828 -1545 11630 19690 20550 12578 10216 16247 11972
7529 11972 3874 -7685 -24085 -21600 -6838 -6678 -8410 -9499 -10315 -4919 -18995 -6044 15176 24138
$$ packed form
7631h242j843m638J0696N846j9373N895p92J1933Q757j1843m316R848j1393k41
7617i706K73O097l565n37k433P152N460m461l239J0603n905m594Q884J5096K2117
7602D1242j380j9540r974k816j4653l296K2J5418m726N849j1514m31k065q733
7588a6597O641q078l498L263Q605p278k596O266J3457J1709j7406j3408l125K007
7574b0038P94j543M156q72P438J6759p283l251M782p3P968j2745q476k908r222
7559b4514p607J496M588K66l592N122J8263L411l238n395J3211l084r77p745j784
7544a1579O943M940O325o504n517R185m621p17J3175Q060Q60p972k362O031m275
7529A1972q098j1559j6400K485J4762J60j732j089q16N396j4076J2951K1220Q962
$$ plain form
7515 24138 16856 6198 9799 5716 -2455 -24 2496 -1378 3812 -2734 602 4333 2712 -12602
7501 -12602 -5125 -6189 -1894 145 -1943 6254 16427 2417 -2566 2800 413 5207 -1195 -6480
7487 -6480 1201 -4519 -9538 -3404 2868 -2372 -14348 -17486 -21553 -37152 -37615 -38385 -22608 -19575 -8796
7472 -8796 -9448 -24409 -28948 -31300 -20142 -15453 -14624 1006 2795 3707 5600 -2850 1287 -833 -12837
7457 -12837 -12732 -1244 4412 2302 -9030 -15556 -6962 2671 3000 -1200 -4728 -7954 -8241 -12036 -25155
7442 -25155 -26168 -30053 -25599 -18246 -18715 -7400 -12629 -23083 -19338 -14929 -16524 -31906 -35755 -28440
7428 -28440 -14988 -22649 -20424 -5832 -2040 1369 -4848 7778 6692 -2535 2155 -4776 -23540 -19884
7414 -19884 -472 11071 2899 5880 2392 -3957 -7786 -13647 -17191 -13594 2626 12481 4874 -6009
$$ packed form
7515B4138p282j0658L601m083q171K431K520l874N190o546L336L731j621j5314
7501a2602P477j064M295K039k088Q197J0173j4010m983N366k387M794o402n285
7487f480P681n720n019O134O272n240j1976l138m067j5599m63p70J5777L033J0779
7472h796o52j4961m539k352J1158M689Q29J5630J789R12J893q450M137k120j2004
7457a2837J05J1488N656k110j1332o526Q594R633L29m200l528l226k87l795j3119
7442b5155j013l885M454P353m69J1315n229j0454L745M409j595j5382l849P315
7428b8440J3452p661K225J4592L792L409o217J2626j086r227M690o931j8764L656
7414a9884J9412J1543q172K981l488o349l829n861l544L597J6220R855p607j0883
$$ plain form
7400 -6009 -22153 -28757 -35869 -42212 -29290 -9266 -10293 517 434 -1325 8741 20982 15820 -5971
7386 -5971 -12487 -1158 14608 10811 6995 10071 7716 11085 7472 -3508 -4544 -2662 503 -3310
7372 -3310 -4562 -13202 -20490 -25730 -16031 -9982 2426 13395 -2828 -17453 -11823 -1357 4110 10571
7358 10571 14759 12685 13175 6097 16854 24120 26214 12962 -4244 -968 5190 14764 6118 -1520
7344 -1520 -3974 3092 8314 -3284 -8733 -726 -869 12860 31893 33776 18224 3547 2766 2828 11548
7329 11548 448 -5674 -505 -7947 -549 3221 -4626 -5924 -17930 -21165 -13640 -12190 -11392 -3953
7315 -3953 -1919 -3346 -8804 -7258 -7377 -2385 -7037 3228 10075 8776 9346 3925 -3217 -3359 -1109
7300 -1109 -7916 -11664 -21052 -37042 -23413 -18242 -17843 -9491 -14456 -21323 -14609 -7907 -6589 -7311 -10845
$$ packed form
7400f009j6144o604p112o343J2922K0024j027J0810q3j759J0066J2241n162k1791
7386e971o516J1329J5766l797l816L076k355L369l613j0980j036J882L165l813
7372c310j252q640p288n240R699O049J2408J0969j6223j4625N630J0466N467O461
7358A0571M188k074M90p078J0757P266K094j3252j7206L276O158R574q646p638
7344a520k454P066N222j1598n449Q007j43J3729J9033J883j5552j4677p81O2Q720
7329A1548j1100o122N169p442P398L770p847j298j2006l235P525J450P98P439
7315c953K034j427n458J546j19M992m652J0265O847j299N70n421p142j42K250
7300a109o807l748r388j5990J3629N171L99Q352m965o867O714O702J318p22l534
$$ plain form
7285 -10845 -23533 -19472 -26949 -37861 -26980 -18781 -20168 -20936 -10302 -3530 -7899 -8704 -14323 -4521
7271 -4521 -7035 -1414 -3558 -4224 10347 7053 7353 -359 -4647 -13498 -14294 -14169 -12009 -13668 -12384 -11627
7255 -11627 -14683 -5356 8389 -6457 -10852 -1098 -15155 -20549 -34198 -40596 -27054 -18896 -16896
7242 -16896 -21102 -24058 -13435 11173 17109 13839 -2397 9624 18107 26188 25923 19679 13146 11200
7228 11200 1110 -3848 -13219 -15261 -17178 -14268 -14569 -19773 -13886 -7937 -9796 -16462 -21114 -9126
7214 -9126 -2868 -3087 91 3787 -8837 -12810 -16453 -6653 7708 15469 10477 -1097 -2008 -3743 -3286
7199 -3286 -5008 -2875 -13197 -20827 -20721 -6297 -2351 13364 29491 31948 24384 9228 15968 18429
7185 18429 6379 -5292 -2479 -5767 -19753 -21806 -10303 -3730 -5508 -10554 -11663 -9679 -13218 -11580
$$ packed form
7285a0845j2688M061p477j0912J0881Q199j387p68J0634O772m369q05n619R802
7271d521k514N621k144o66J4571l294L00p712m288q851p96J25K160j659J284P57
7255a1627l056R327J3745j4846m395R754j4057n394j3649o398J3542Q158K000
7242a6896m206k956J0623K4608N936l270j6236J2021Q483Q081k65o244o533j946
7228A1200j0090m958r371k042j917K910l01n204N887N949j859o666m652J1988
7214i126O258k19L178L696j2624l973l643R800J4361P761m992j1574r11j735M57
7199c286j722K133j0322p630J06J4424L946J5715J6127K457p564j5156O740K461
7185A8429j2050j1671K813l288j3986k053J1503O573j778n046j109J984l539J638
$$ plain form
7171 -11580 -10611 -12033 -8145 1901 -5019 -15071 -18904 -33715 -9118 383 -14322 -39006 -37343
7158 -37343 -20979 -14240 24 10741 17323 20632 25387 19605 9363 8702 10854 17498 18383 23993
7144 23993 17719 16552 6729 4860 -2723 -13312 -3658 -7766 -18061 -12162 -11285 -4423 -8657 -9635 -15018
7129 -15018 -14687 -6756 -3860 -12291 -30529 -31882 -33345 -29388 -16520 -26867 -36782 -38264 -39065 -51100
7115 -51100 -54964 -31606 -21298 -25200 -14757 -504 -11614 -9035 -9570 -3071 4649 -4430 -13515 -3125
7101 -3125 7457 363 -5403 -9489 -11287 -7951 -282 20561 20349 11829 -1385 -15056 -8628 -8332
7087 -8332 -5292 4942 5234 8193 3737 -1685 -5361 152 -6723 -1494 -5483 -21484 -21641 -15560 -11943
7072 -11943 -441 8502 10979 7253 -531 1525 5559 -12097 -9173 -3737 -5625 -12220 -20173 -18319
$$ packed form
7171a1580R69j422L888J0046o920j0052l833j4811K4597R501j4705k4684J663
7158c7343J6364O739J4264J0717O582L309M755n782j0242o61K152O644Q85N610
7144B3993o274j167r823j869p583j0589R654m108j0295N899Q77O862m234r78n383
7129a5018L31P931K896q431j8238j353j463L957J2868j0347r915j482q01j2035
7115e1100l864K3358J0308l902J0443J4253j1110K579n35O499P720r079r085J0390
7101c125J0582p094n766m086j798L336P669K0843k12q520j3214j3671O428K96
7087h332L040J0234K92K959m456n422l676N513o875N229l989j6001j57O081L617
7072a1943J1502Q943K477l726p784K056M034j7656K924N436j888o595p953J854
$$ plain form
7058 -18319 -1928 -3708 -19467 -10744 -7152 -10517 1395 8952 2927 -15390 -6129 12957 15535
7045 15535 4513 -4336 1917 3957 -13404 -17499 -18815 -6084 7810 481 -350 -8996 1372 10816
7031 10816 14146 10408 16416 21688 7380 -1743 -11215 -2153 13257 4435 -2466 -528 4696 5384
7017 5384 3420 -11559 -19290 -31276 -29650 -19282 -7319 1295 -6949 -14607 -14348 5370 4774 -8665
7003 -8665 -14213 -10596 -6206 -13980 -22041 -6848 6403 11353 3150 -12410 -5923 6416 -1560 -13006
6989 -13006 -3819 -7114 -16686 -7692 -8108 -3290 -325 -9774 -7969 -4382 -10957 -13833 -16466 -20791 -16158
6974 -16158 -23038 -20376 -5962 -4287 -1527 -1503 6817 8674 530 -2022 -62 -10338 -3745 4897 902
6959 902 -2275 -5536 -9147 -12307 -16945 -7769 -4681 -3612 -9076 -12756 -15274 -26277 -29445 -26232 -15487
$$ packed form
7058a8319J6391j780j5759Q723L592l365J1912P557o025j8317R261J9086K578
7045A5535j1022q849O253K040j7361m095j316J2731J3894p329q31q646J0368R444
7031A0816L330l738O008N272j4308r123r472R062J5410q822o901J938N224O88
7017E384j964j4979p731j1986J626J0368J1963Q614q244p658K59J9718n96j3439
7003h665n548L617M390p774q061J5193J3251M950q203j5560O487J2339p976j1446
6989a3006R187l295r572Q994m16M818K965r449J805L587o575k876k633m325M633
6974a6158o880K662J4414J675K760K4Q320J857q144k552J960j0276O593Q642l995
6959I02l177l261l611l160m638R176L088J069n464l680k518j1003l168L213J0745
$$ plain form
6944 -15487 -13340 -18128 -13264 -6916 -393 36 -8631 -20488 -16601 -23897 -44214 -36491 -28887 -28555 -17512
6929 -17512 -17904 -17416 -11992 -2470 -1675 -1149 -10197 -11641 -453 -7305 -10547 -17163 -15545 -13301 -13804 -17725
6913 -17725 -11618 -16618 -10278 -22068 -7242 4986 -841 842 -6615 -10473 -2734 -7463 -8319 -17669
6899 -17669 -7596 -8243 -574 -3897 -2723 3999 6115 -4771 -1538 -12887 -27969 -25182 -9792 -11087
6885 -11087 -13715 -20837 -27526 -15240 -12107 -17765 2751 7218 -9430 -14213 -12421 -11036 -10213 -14106
6871 -14106 -19401 -6662 5840 -9046 -8196 45 -3904 -5434 -3532 -13248 -12664 -4903 -5333 -7423 610
6856 610 4585 6230 7196 13274 14455 17828 9341 -13232 -26176 -13103 6485 -2062 -12533 -16621
6842 -16621 -34753 -44906 -35800 -32092 -37827 -36597 -23134 -29425 -24781 -9727 -233 -807 -5309 -17926
$$ packed form
6944a5487K147m788M864O348O523M29q667j1857L887p296k0317P723P604L32J1043
6929a7512l92M88N424R522P95N26r048j444J1188o852l242o616J618K244n03l921
6913a7725O107n000O340j1790J4826J2228n827J683p457l858P739m729q56r350
6899a7669J0073o47P669l323J174O722K116j0886L233j1349j5082K787J5390j295
6885a1087k628p122o689J2286L133n658K0516M467j6648m783J792J385Q23l893
6871a4106n295J2739J2502j4886Q50Q241l949j530J902r716N84P761m30k090Q033
6856F10L975J645R66O078J181L373q487k2573j2944J3073J9588q547j0471m088
6842a6621j8132j0153R106L708n735J230J3463o291M644J5054R494n74m502j2617
$$ plain form
6828 -17926 -7313 8272 -2050 -3212 9427 15897 8769 -1382 2975 14302 -71 -8163 -16869
6815 -16869 -20263 -9323 1866 13185 8266 5245 5565 4086 9697 9029 -2115 -23434 -15323 -8875
6801 -8875 -275 10224 12360 558 -325 94 5963 7300 -697 -14977 -18110 -4206 -3212 -8133 -13386
6786 -13386 -8026 -6176 -1193 11070 1963 -18418 -18637 -17624 -16975 -25367 -13687 -7204 -17532 -12815
6772 -12815 -15249 -19396 -27735 -27103 -16087 -20212 -13977 -13603 -14245 5893 4533 -1624 -6871 -13856 -9268
6757 -9268 -12418 -7399 -4965 7394 16961 165 -13475 -6514 -2410 -2779 3178 14870 12267 -7178
6743 -7178 -4739 -540 10779 12832 17402 16546 9613 19008 14298 3589 -2309 -1373 6019 2897 3733
6728 3733 1260 13072 12402 14444 11198 4568 4321 19208 44648 49630 42591 45322 25442 2993
$$ packed form
6828a7926J0613J5585j0322j162J2639O470p128j0151M357J1327j4373q092q706
6815a6869l394J0940J1189J1319m919l021L20j479N611o68j1144k1319Q111O448
6801h875Q600J0499K136j1802q83M19N869J337p997j4280l133J3904R94m921n253
6786a3386N360J850M983J2263r107k0381k19J013O49q392J1680O483j0328M717
6772a2815k434m147q339O32J1016m125O235L74o42K0138j360o157n247o985M588
6757i268l150N019K434J2359R567j6796j3640O961M104l69N957J1692k603j9445
6743g178K439M199J1319K053M570q56o933R395m710j0709n898R36P392l122Q36
6728C733k473J1812o70K042l246o630k47J4887K5440M982p039K731j9880k2449
$$ plain form
6714 2993 -1487 1017 5010 5001 6708 7218 7251 -5429 -14978 -15019 -17909 -15123 -12496 -25291 -23934 -15086
6698 -15086 -20656 -16773 -13777 -13002 -14886 -9351 -5647 -5605 -10476 -20940 -23651 -17753 -7116 9944 18363
6683 18363 15742 3690 -656 -2856 2217 13949 14857 7303 7574 4159 6945 6609 -3578 -13080 -16957
6668 -16957 -16987 -25831 -31454 -15378 -16531 -28553 -31352 -22417 -14385 -3836 -1320 -9331 -13445 -14284 -11779
6653 -11779 -1612 14060 -1308 -14124 -8676 -13 -3206 2719 -5988 -1698 -4593 11821 14447
6640 14447 6646 -5384 -5058 -8726 -7496 -9902 -6807 -11184 -26218 -29554 -30736 -31763 -34886 -27155
6626 -27155 -10892 -4660 5004 3119 -2098 -15783 -15719 -7563 -888 -3766 -8009 -10878 -13812 -17418 -31179
6611 -31179 -19688 -7210 -17772 -26814 -22081 -18255 -15648 -18899 -23464 -22176 -8187 2786 11631
$$ packed form
6714B993m480K504L993rJ707N10L3j2680r549m1k890K786K627j2795J357Q848
6698a5086n570L883K996P75j884N535L704M2m871j0464k711N898J0637J7060Q419
6683A8363k621j2052m346k200N073J1732R08p554K71l415K786l36j0187r502l877
6668a6957l0q844n623J6076j153j2022k799Q935Q032J0549K516q011m114q39K505
6653a1779J0167J5672j5368j2816N448Q663l193N925q707M290k895J6414K626
6640A4447p801j2030L26l668J230k406L095m377j5034l336j182j027l123P731
6626b7155J6263O232R664j885n217j3685O4Q156O675k878m243k869k934l606j3761
6611c1179J1491J2478j0562r042M733L826K607l251m565J288J3989J0973Q845
$$ plain form
6598 11631 6101 7855 5960 -14734 -20241 -5375 1009 16430 21754 15469 9897 13059 9935 4415
6584 4415 1039 9294 19235 20625 8710 -1297 -10559 -14384 -10436 -16224 -8999 -18323 -19681 -11440
6570 -11440 5168 -7607 -21976 -26354 -27398 -23833 -9629 -8511 -24702 -32054 -13971 -6580 -6980
6557 -6980 -8873 -11138 -27986 -29431 -20434 -15479 -7733 -600 -16841 -18660 -14271 -17993 -24067 -22616
6543 -22616 2834 6853 18368 15498 15854 7950 -8544 -14900 -24515 -37236 -43494 -15182 -1908
6530 -1908 -2235 -18003 -25201 -11918 -14680 -10356 -9585 4801 8077 -5826 -16633 -20470 -21392 -21059 -24554
6515 -24554 -4008 16564 6343 -6320 -11919 -13682 -5034 -207 8065 13625 10550 8172 -6914
6502 -6914 -11594 -6396 5496 2652 -6125 -21611 -13884 -22496 -21109 -5344 -13404 -19378 -14733 -11737
$$ packed form
6598A1631n530J754j895k0694n507J4866O384J5421N324o285n572L162l124n520
6584D415l376Q255R941J390j1915j0007r262l825L948n788P225r324j358Q241
6570a1440J6608j2775j4369m378j044L565J4204J118j6191p352J8083P391m00
6557f980j893k265j6848j445Q997M955P746P133j6241j819M389l722o074J451
6543b2616K5450M019J1515k870L56p904j6494o356r615j2721o258K8312J3274
6530a908l27j5768p198J3283k762M324P71J4386L276j3903j0807l837r22L33l495
6515b4554K0546K0572j0221j2663n599j763Q648M827Q272N560l075k378j5086
6502f914m680N198J1892k844q777j5486P727q612J387J5765q060n974M645K996
$$ plain form
6488 -11737 -14639 -21073 -20898 -12616 9103 -3494 -10490 -18093 -14203 -6162 2592 10309 7124 12391
6474 12391 15753 4404 -13423 -17450 3476 16682 7814 11542 11182 -1383 3952 -3547 -11939 -12774
6460 -12774 -18690 -22383 -15393 5416 -1056 -16086 -24730 -18665 1537 5722 2994 10648 20559 16744
6446 16744 -486 -2137 2378 -3054 -7884 -9858 -22027 -12443 -3868 3052 -16588 -21184 -19219 -9956
6432 -9956 -3852 -3211 -11051 -8984 -9950 -168 12498 5011 605 -2308 -7436 -1900 4764 3792 3115 -2817
6416 -2817 -3806 -9178 -17248 -9108 -15867 -21033 -14827 -15326 -21397 -20651 -29301 -23825 -15450 -17498 -14020 2973
6400 2973 11646 13494 2225 -1617 -329 -2668 6114 10872 14614 12869 8948 -4282 -17979 -23744
6386 -23744 -20895 -9876 -11713 -12967 -8096 -12482 44 -1605 -7800 -12159 -20912 -21563 -14258 -8297
$$ packed form
6488a1737k902o434J75Q282K1719j2597o996p603L890Q041Q754P717l185N267
6474A2391L362j1349j7827m027K0926J3206q868L728l60j2565N335p499q392q35
6460a2774n916l693O990K0809o472j5030q644O065K0202M185k728P654R911l815
6446A6744j7230j651M515n432m830j974j2169R584Q575O920j9640m596J965R263
6432i956O104O41p840K067r66R782J2666p487m406k913n128N536O664r72o77n932
6416b817r89n372q070Q140o759n166O206m99o071P46q650N476Q375k048L478J6993
6400B973Q673J848j1269l842J288k339Q782M758L742j745l921j3230j3697n765
6386b3744K849J1019j837j254M871m386J2526j649o195m359q753o51P305N961
$$ plain form
6372 -8297 5316 5519 -2025 -11866 -15914 -9098 3696 16127 11919 -2833 88 1033 2533 -690
6358 -690 -12153 -737 -5112 -9154 -7160 -23333 -24360 -14072 -8932 -11791 -22338 -24768 -36785 -21530
6344 -21530 -1819 2120 9442 16385 16939 16889 16344 1375 -4046 382 -44 5719 -2959 1523 -403
6329 -403 -11842 -1044 5668 7607 4536 -3251 10317 21996 8323 5588 14152 -1163 -17322
6316 -17322 -26751 -25254 -7728 65 1424 1508 -6830 -16637 -8351 3510 -4159 -13961 -18206 -18103 -19004
6301 -19004 -13823 -2486 12184 8309 -2860 5453 12434 6538 -6959 -9924 -6459 -3260 -5957 726
6287 726 -4060 -4923 -9683 -6437 -5182 -14643 -23849 -32498 -32074 -31777 -26936 -20905 -19125 -18598 -25719 -36638
6271 -36638 -41053 -36572 -23904 -7577 1690 -4958 -8047 -11781 -18860 -17064 -5834 -1351 -100 -5179
$$ packed form
6372h297J3613K03p544r841m048O816J2794J2431m208j4752K921R45J500l223
6358f90j1463J1416m375m042J994j6173j027J0288N140k859j0547k430j2017J5255
6344b1530J9711L939P322O943N54n0n45j4969n421M428m26N763q678M482j926
6329d03j1439J0798O712J939l071p787J3568J1679j3673k735Q564j5315j6159
6316a7322r429J497J7526P793J359Q4q338r807Q286J1861p669r802m245J03r01
6301a9004N181J1337J4670l875j1169Q313O981n896j3497k965L465L199k697O683
6287G26m786q63m760L246J255r461r206q649M24K97M841O031J780N27p121j0919
6271c6638m415M481J2668J6327R267o648l089l734p079J796J1230M483J251n079
$$ plain form
6257 -5179 2296 11114 4473 2951 1002 -11266 -2563 1376 -7198 3354 8235 6353 -4718 -3061
6243 -3061 413 -2756 -8168 3749 3835 -1099 1849 -5204 -11120 -7198 -819 -7373 2979 13153 17059
6228 17059 4255 2737 15754 23572 10530 10642 7004 1068 8050 10639 8908 3857 1721 10455
6214 10455 11760 5893 1505 -1512 -2805 -3521 -11213 -15752 -5311 -3300 -6073 -14756 -48339 -46443
6200 -46443 -33842 -14532 3147 210 -13677 -26320 -19164 -15968 -18805 -22288 -13295 -14182 -14035 -13241
6186 -13241 -25916 -34255 -26919 -19730 -7754 -5190 -6568 -11584 2543 6032 3195 9945 8540 21120
6172 21120 28092 25691 27000 18525 -8254 -27317 -15250 -5147 -1676 608 2669 2335 9906 14200
6158 14200 2273 -3406 3223 6299 -4761 -5661 -784 -661 -15763 -17123 -4126 2 7109 13162
$$ packed form
6257e179P475Q818o641j522j949j2268Q703L939q574J0552M881j882j1071J657
6243c061L474l169n412J1917Q6m934K948p053n916L922O379o554J0352J0174L906
6228A7059j2804j518J3017P818j3042J12l638n936O982K589j731n051k136Q734
6214A0455J305n867m388l017j293p16p692m539J0441K011k773q683l3583J896
6200d6443J2601J9310J7679k937j3887j2643P156L196k837l483Q993q87J47P94
6186a3241j2675q339P336P189J1976K564j378n016J4127L489k837O750j405J2580
6172B1120O972k401J309q475k6779j9063J2067J0103L471K284K061l34P571M294
6158A4200j1927n679O629L076j1060r00M877J23j5102j360J2997M128P107O053
$$ plain form
6144 13162 11129 7213 10352 1573 -8911 -4614 8965 17929 13408 -4160 -12468 -17720 -13672 -11763
6130 -11763 -3390 -3210 -17147 -17388 -4962 -5491 -3087 2874 3888 -5350 -15521 -15492 9950 21815 -1443
6115 -1443 -17958 -19789 -29694 -12094 -19583 -9241 852 -5364 138 1395 3788 -1510 -18181 -27360
6101 -27360 -14934 -8358 -22003 -22458 -16758 -18298 -24225 -25057 -18656 -19926 -22403 -17964 -7702 8763
6087 8763 3023 -7593 -11764 -16783 -15246 -23065 -36385 -40936 -43578 -32365 -7639 970 -6848 -16430
6073 -16430 -15033 -8835 8848 20052 -1759 -13240 -9114 -13647 -2495 -5415 -12303 -14626 -3826
6060 -3826 -825 8377 4001 -3882 -5980 -3678 -199 386 -8635 -4629 -7486 -6483 9813 6073 586
6045 586 1815 2094 4644 -589 -9151 -16797 -7027 -1421 -4924 -399 -1273 663 3153 -10076 -15356
$$ packed form
6144A3162k033l916L139q779j0484M297J3579Q964m521j7568q308n252M048J909
6130a1763Q373J80j3937k41J2426n29K404N961J014r238j0171K9K5442J1865k3258
6115a443j6515j831r905J7600p489J0342J0093o216N502J257K393n298j6671r179
6101b7360J2426O576j3645m55N700j540n927q32O401j270k477M439J0262J6465
6087H763n740j0616m171n019J537p819j3320m551k642J1213K4726Q609p818r582
6073a6430J397O198J7683J1204k1811j1481M126m533J1152k920o888k323J0800
6060c826L001R202m376p883k098K302L479N85r021M006k857J003J6296l740n487
6045E86J229K79K550n233q562p646R770N606l503M525q74J936K490j3229n280
$$ plain form
6030 -15356 -19069 -3043 -5576 -3516 4285 17061 22903 22905 17945 18184 14523 10104 6063 9455 6108
6015 6108 4140 -226 -12596 -23495 -22830 -29324 -31463 -22253 -17805 -3728 -219 -2628 -14644 -36214
6001 -36214 -21055 2626 -3022 1900 9271 16731 13893 9493 782 -4528 -16060 -31076 -36304 -8485
5987 -8485 -6377 -206 5858 3156 -10963 -11890 -12662 -16423 -17655 -9899 822 5424 654 2522 -18311
5972 -18311 -20536 -9906 -1502 -4970 -4679 -16390 -21809 -7682 1001 -6479 -4880 3077 5276 14038
5958 14038 6627 628 -436 270 6557 11182 6397 8410 3579 -11769 -15748 -12170 1466 1780 -4590
5943 -4590 4303 10420 19662 30907 20730 10781 -57 7019 7806 -3813 -7460 -509 8634 2783
5929 2783 -2013 -9377 -20267 -13973 689 5960 7276 3697 4306 12288 -10894 -14694 -14188 -19687 -9896
$$ packed form
6030a5356l713J6026k533K060P801J2776N842Km960K39l661m419m041L392l347
6015F108j968m366j2370j0899O65o494k139R210M448J4077L509k409j2016k1570
6001c6214J5159K3681n648M922P371P460k838m400q711n310j1532j5016n228K7819
5987h485K108O171O064k702j4119r27p72l761j232P756J0721M602m770J868k0833
5972a8311k225J0630Q404l468K91j1711n419J4127Q683p480J599P957K199Q762
5958A4038p411n999j064P06O287M625m785K013m831j5348l979L578J3636L14o370
5943d590Q893O117R242J1245j0177r949j0838P076P87j1619l647O951R143n851
5929B783m796p364j0890O294J4662N271J316l579O09P982k3182l800N06n499R791
$$ plain form
5914 -9896 6668 13550 14473 6967 -2669 -5453 -4059 -9558 -5169 -10486 -12039 -8327 -6840 -18419 -3580
5899 -3580 7655 9511 11448 1787 -3644 6202 13088 4313 -3904 -6187 -6376 -5730 -5241 -14709 -4612
5884 -4612 12660 11596 -3636 -10032 -13994 -22531 -20649 -26039 -30759 -35032 -31196 -35521 -22332 -20131
5870 -20131 -6295 8469 9024 7326 2360 6384 13886 -2114 -7573 -194 2306 5996 4998 -16946
5856 -16946 -21902 -21274 -19584 -7815 -12637 -24132 -29566 -33742 -15443 -21857 -39393 -40802 -24382 -5272
5842 -5272 10550 12782 1537 -4012 3855 5262 10846 3958 -4575 -2357 4989 16363 22909 12957
5828 12957 -2787 -7609 5578 1213 -8402 -8057 2742 2038 4140 3834 -5447 -6249 -3423 -10372 -20434
5813 -20434 -26294 -19613 -11895 154 16987 17619 5819 -9736 -19517 -10651 -9859 -471 -14856 -17476
$$ packed form
5914i896J6564O882R23p506r636k784J394n499M389n317j553L712J487j1579J4839
5899c580J1235J856J937r661n431R846O886q775q217k283j89O46M89r468J0097
5884d612J7272j064j5232o396l962q537J882n390m720m273L836m325J3189K201
5870b0131J3836J4764N55j698m966M024P502j6000n459P379K500L690r98k1944
5856a6946m956O28J690J1769m822j1495n434m176J8299o414j7536j409J6420J9110
5842e272J5822K232j1245n549P867J407N584o888q533K218P346J1374O546r952
5828A2957j5744m822J3187m365r615L45J0799p04K102l06r281q02K826o949j0062
5813b0434n860O681P718J2049J6833O32j1800j5555r781Q866P92R388j4385k620
$$ plain form
5799 -17476 -14248 -7763 -6630 -2215 3013 8732 -6595 -12688 -17000 -19278 -16821 -15751 -2447 8117
5785 8117 6183 8900 -8347 -15868 -38433 -29216 -13444 -14181 -551 11108 7843 -3525 -1732 -6086
5771 -6086 -7296 1601 -4919 -5010 -5217 -5332 -14860 -17862 -12277 -12687 -10034 -24353 -5128 9687 7258
5756 7258 -258 -3365 -3195 881 9055 0 -11773 -14974 -1137 1143 -11970 -17283 -21910 -25002
5742 -25002 -23193 -8922 -11368 -7516 1719 -2844 -3254 6453 20389 13738 -3819 -2455 -2235 -2204 -13584
5727 -13584 -4813 5203 -1129 -7242 1427 1828 5554 -722 -6783 -15794 -20983 -23078 -11393 10178
5713 10178 9192 -8187 -20114 -29182 -29120 -30043 -32022 -25020 -15346 -14827 -17668 -18190 -15313 -11440 -8148 -8975
5697 -8975 -860 9424 16836 29629 33693 15933 7415 6671 5385 -8015 -5214 4541 -6132 -13411
$$ packed form
5799a7476L228O485J133M415N228N719j5327o093m312k278K457J070J3304J0564
5785H117j934K717j7247p521k2565R217J5772p37J3630J1659l265j1368J793m354
5771f086j210Q897o520r1k07j15r528l002N585m10K653j4319J9225J4815k429
5756G258p516l107J70M076Q174r055j1773l201J3837K280j3113n313m627l092
5742b5002J809J4271k446L852R235m563m10R707J3936o651j7557J364K20L1j1380
5727a3584Q771J0016o332o113Q669M01L726o276o061r011n189k095J1685K1571
5713A0178r86j7379j1927r068O2r23j979P002R674N19k841n22K877L873L292q27
5697h975Q115J0284P412J2793M064j7760q518p44j286j3400K801R755j0673p279
$$ plain form
5683 -13411 -22525 -34478 -34149 -28321 -24559 -23951 -24719 -23460 -15906 -4756 -7147 -3451 6434 2572 3067
5668 3067 -2336 -1026 -5426 -7762 -14160 -11915 -12523 -12776 -3282 11835 16384 16631 -5001 -20603 -11822
5653 -11822 -6755 -19927 -25121 -22148 -11455 -5194 4302 3459 -3896 -7137 -7435 -3236 3753 -2669 -6891
5638 -6891 -1672 -5375 -5918 -6340 -5066 -11867 -15335 -12981 -8124 -5503 -11235 -11676 -341 451 -1968 -13252
5622 -13252 -16883 -442 5352 13222 12602 -534 -7418 -12388 -2295 -18003 -31905 -15858 10150
5609 10150 10507 150 -9617 1421 12467 11511 -3183 35 14707 15597 1488 -7471 -3446 -2588
5595 -2588 -1407 -9174 -8162 -12513 -9427 -953 3947 880 2719 1239 -6590 -10880 -24145 -30972 -39521
5580 -39521 -41303 -31397 -24232 -25162 -22346 -18398 -22328 -25707 -10004 -1479 -6448 -12355 -22411 -18649
$$ packed form
5683a3411r114j1953L29N828L762O08p68J259P554J1150k391L696R885l862M95
5668C067n403J310m400k336o398K245o08k53R494J5117M549K47k1632j5602Q781
5653a1822N067j3172n194K973J0693O261R496q43p355l241k98M199O989o422m222
5638f891N219l703n43m22J274o801l468K354M857K621n732m41J1335P92k419j1284
5622a3252l631J6441N794P870o20j3136o884m970J0093j5708j3902J6047K6008
5609A0150L57j0357r767J1038J1046r56j4694L218J4672Q90j4109q959M025Q58
5595b588J181p767J012m351L086Q474M900l067J839j480p829m290j3265o827q549
5580c9521j782R906P165r30K816L948l930l379J5703Q525m969n907j0056L762
$$ plain form
5566 -18649 -28746 -27073 -36263 -23465 -7347 50 -6017 -13977 -1610 360 3745 9362 3100 -14152
5552 -14152 -26264 -31538 -29397 -40726 -41433 -25491 -14289 8280 2089 -7760 -6477 -11878 -13508 -15876
5538 -15876 -18204 -10643 -3559 -3691 2434 -6166 -26629 -21947 -15456 -17128 -13216 -15002 -11065 -4914 -12514
5523 -12514 -18611 -24328 -22378 -24077 -20040 -9813 -10395 -7570 5059 6454 -1995 4134 10985 -1571
5509 -1571 -10334 -7643 -12590 -17143 -13314 -7324 -5712 -5580 -11901 -12649 -6095 -8427 -12961 -8817 -1479
5494 -1479 4085 -4006 -1472 4621 7921 4504 -8816 -13290 -3861 12252 16099 2065 -5891 -22643
5480 -22643 -37609 -18737 -3975 -4984 -6928 7756 5056 2391 3561 4951 4170 3235 -2581 -13050
5466 -13050 -13570 2544 20486 12933 7188 5655 14526 21015 19914 10627 10608 9437 1377 -7148 -5992
$$ packed form
5566a8649j0097J673r190J2798J6118P397o067p960J2367J970L385N617o262j7252
5552a4152j2112n274K141j1329p07J5942J1202K2569o191r849J283n401j630k368
5538a5876k328P561P084j32O125q600k0463M682O491j672L912j786L937O151p600
5523a2514o097n717J950j699M037J0227n82K825J2629J395q449O129O851j2556
5509a571q763K691m947m553L829N990J612J32o321p48O554k332m534M144P338
5494a479N564q091K534O093L300l417j3320m474R429J6113L847j4034p956j6752
5480b2643j4966J8872J4762j009j944J4684k700k665J170J390p81r35n816j0469
5466a3050n20J6114J7942p553n745j533Q871O489j101r287j9j171q060q525J156
$$ plain form
5451 -5992 -15495 -26355 -16382 -8549 -6184 -1273 -16970 -23472 -17335 -7218 -18493 -20244 -7168 1684
5437 1684 -1362 4045 -5349 -5727 5417 14734 9217 9449 3486 5061 13475 10838 -907 165 -3031
5422 -3031 -20553 -36209 -44185 -38536 -29055 -9731 -4476 2785 23032 25175 13417 7647 7913 5002
5408 5002 3924 -5852 -924 -1999 -2041 2788 -8956 -17957 -16394 -5854 356 -2337 -720 -2964 -8043
5393 -8043 -14423 -14346 -15222 -13661 6532 3827 -13687 -22292 -26407 -15504 -4205 -709 559 -2594 -10375
5378 -10375 -16820 -19803 -16530 -10291 -5235 9660 18860 17899 5980 4417 15603 4727 -11740 6839
5364 6839 6055 4436 5602 418 4315 -2558 -4047 2970 -3159 2832 14627 22537 18132 -5263 -7836
5349 -7836 2720 -1006 2185 5122 2163 -7899 -15046 -504 1489 -9933 -16287 -4009 -4289 -4948
$$ packed form
5451e992r503j0860R973P833K365M911j5697o502O137J0117j1275j751J3076Q852
5437A684l046N407r394l78J1144R317n517K32n963J575Q414k637j1745J072l196
5422c031j7522j5656p976N649R481J9324N255P261K0247K143j1758n770K66k911
5408E002j078r776M928j075m2M829j1744r001J563J0540O210k693J617k244n079
5393h043o380P7q76J561K0193k705j7514q605m115J0903J1299L496J268l153p781
5378a0375o445k983L273O239N056J4895R200r61j1919j563J1186j0876j6467J8579
5364F839p84j619J166n184L897o873j489P017o129N991J1795P910m405k3395k573
5349g836J0556l726L191K937k959j0062p147J4542J993j1422o354J2278k80o59
$$ plain form
5335 -4948 -4299 -13623 -5659 13194 3802 -6716 -15038 -14379 -10860 -16734 -26041 -25221 -23410 -19145 -13387
5320 -13387 -8099 -1625 -16964 -12555 -3274 -2458 1622 -5833 -13901 -2406 1576 -3155 -15499 -19421
5306 -19421 -11002 -4980 5839 8649 5461 -3210 -1589 8091 16893 10660 -2125 -19317 -18686 -14909
5292 -14909 -10620 -19010 -14739 226 -10556 -18247 -14337 -17059 -20307 -19709 -10076 -11713 -14689 -18466
5278 -18466 -14255 -17158 -11452 1986 14946 28783 31600 23493 2307 -3338 -1848 -8167 -15426 -4853
5264 -4853 629 -17946 -23909 -12212 -6634 -8301 -6117 -1247 -1859 3770 -4414 -13860 -2703 18184
5250 18184 5159 -12774 -11323 -8927 -97 -9378 -17917 -11519 -13 7059 11720 19748 11777 1121
5236 1121 4365 4970 832 -4990 -7055 3228 -230 -9556 -4507 1882 -5002 -431 -8269 -12838 -594
$$ packed form
5335d948O49r324P964J8853r392j0518q322O59L519n874r307Q20J811M265N758
5320a3387N288O474j5339M409R281Q16M080p455q068J1495L982m731j2344l922
5306a9421Q419O022J0819K810l188q671J621R680Q802o233j2785j7192O31L777
5292a4909M289q390M271J4965j0782p691L910k722l248N98R633j637k976l777
5278a8466M211k903N706J3438J2960J3837K817q107k1186n645J490o319p259J0573
5264d853N482j8575n963J1697N578j667K184M870o12N629q184r446J1157K0887
5250A8184j3025j7933J451K396Q830r281q539O398J1506P072M661Q028p971j0656
5236A121L244O05m138n822k065J0283l458r326N049O389o884M571p838m569J2244
$$ plain form
5221 -594 10154 11952 404 -3256 -3775 -12952 7301 19686 22644 19572 13018 5780 2744 5680
5207 5680 6659 -245 -11650 -19731 -20465 -2688 7425 3803 503 12423 15671 -1203 1685 11856
5193 11856 19419 13210 1440 -4231 -3712 58 3730 -8023 -14629 -14060 -13955 -7707 -1259 3026 -13117
5178 -13117 -13176 -6956 -17065 -36451 -32041 -30220 -25344 -18954 -13017 -19769 -22668 -18955 -13863 -6524 -880
5163 -880 9171 5464 8077 14283 15726 7767 -7922 -8292 -11963 -15215 -14850 -7095 -9581 -4957 -12690
5148 -12690 -12053 -2853 6888 7943 4165 -6159 -10059 1245 -428 -5545 -19569 -28550 -38840 -22349
5134 -22349 -10871 7453 10860 2159 -5009 -914 2183 4014 1753 -5671 -20783 -30622 -12654 1778
5120 1778 15469 12633 -7578 -22310 -15189 -10200 -15793 -11420 4050 1023 -3512 -11956 -23907 -14440
$$ packed form
5221e94J0748J798j1548l660n19r177K0253J2385K958l072o554p238l036K936
5207E680R79o904j1405q081p34J7777J0113l622l300J1920L248j6874K888J0171
5193A1856P563o209j1770n671N19L770L672j1753o606N69J05O248O448M285j6143
5178a3117n9O220j0109j9386M410J821M876O390N937o752k899L713N092P339N644
5163h80J0051l707K613O206J443p959j5689l70l671l252L65P755k486M624p733
5148a2690O37R200R741J055l778j0324l900J1304j673n117j4024q981j0290J6491
5134b2349J1478J8324L407q701p168M095L097J831k261p424j5112r839J7968J4432
5120A778J3691k836k0211j4732P121M989n593M373J5470l027m535q444j1951R467
$$ plain form
5106 -14440 -27823 -25657 -11133 1396 7865 3618 -3936 -238 -1297 1875 -795 -14932 -4574
5093 -4574 -6103 -14839 -17084 -9252 -372 -504 2086 13863 17064 24990 26192 16934 9430 -1041 -5952
5078 -5952 -8445 -13116 -16004 -26010 -17202 -19534 -23320 -14442 -3940 -10143 -11949 -9221 -20625 -23421
5064 -23421 -9956 -4712 -7834 -5191 -16612 -13991 4793 2815 9479 9914 7853 8798 1763 93
5050 93 -3069 -888 5437 2675 3774 14986 18582 15059 4160 4364 -3847 -5023 2974 8815 19195
5035 19195 4597 -11930 -18159 -18176 -14395 -9508 -9488 -3997 -3127 -3869 -6824 -5764 -5404 1439 2055 -1035
5019 -1035 2750 5504 1529 -7084 -3795 -2767 -10345 -3129 361 11993 11756 5891 5521 724 -13013
5004 -13013 -16787 8082 24871 8127 -9907 -21660 -18701 -23626 -22485 -11243 628 8357 12022
$$ packed form
5106a4440j3383K166J4524J2529O469m247p554L698j059L172k670j4137J0358
5093d574j529q736k245P832Q880j32K590J1777L201P926J202r258p504j0471m911
5078e952k493m671k888j0006Q808k332l786Q878J0502o203j806K728j1404k796
5064b3421J3465N244l122K643j1421K621J8784j978O664M35k061R45p035j670
5050I3l162K181O325k762J099J1212L596l523j0899K04q211j176P997N841J0380
5035A9195j4598j6527o229j7L781M887K0N491Q70p42k955J060L60O843O16l090
5019a035L785K754l975q613L289J028p578P216L490J1632k37n865l70m797j3737
5004a3013l774K4869J6789j6744j8034j1753K959m925J141J1242J1871P729L665
$$ plain form
4991 12022 4859 -9216 -5879 3395 17579 18779 9799 9820 2975 -18667 -17038 -12389 1332 -2765
4977 -2765 -6521 -5677 -5790 -8062 3753 3676 -1617 -1092 -17014 -16680 -14427 -18970 -21655 -17584 -27859 -18897
4961 -18897 -16440 -17630 -16880 -11622 -17596 -24726 -27698 -30764 -18080 -1949 -892 -6238 -8597 -16785
4947 -16785 -10024 1389 -3361 -1799 3298 -2042 -2680 2065 9918 2447 5570 11932 8581 -3950
4933 -3950 -4821 -6752 965 -339 -7402 -6982 -288 -290 3810 2216 -4669 -15824 -7122 -12166 -18737 -19530
4917 -19530 -7579 1458 6338 12046 6027 -4509 -7265 -3847 -4468 3099 6940 1068 -8396 -10270
4903 -10270 -8232 -6491 -1567 1790 7107 13095 7999 7079 10114 2281 2919 44 -5860 -20885 -26789
4888 -26789 -24947 -18739 948 8878 1537 -6103 -16235 -32065 -25606 -16569 -21665 -23258 -30023 -29676
$$ packed form
4991A2022p163j4075L337R274J4184J200q980K1o845k1642J629M649J3721m097
4977b765l756Q44j13k272J1815p7n293N25j5922L34K253m543k685M071j0275Q962
4961a8897K457j190P50N258n974p130k972l066J2684J6131J057n346k359q188
4947a6785O761J1413m750J562N097n340o38M745P853p471L123O362l351j2531
4933c950q71j931P717j304p063M20O694kM100j594o885j1155Q702n044o571p93
4917a9530J1951R037M880N708o019j0536k756L418o21P567L841n872r464j874
4903a0270K038J741M924L357N317N988n096r20L035p833O38k875n904j5025n904
4888b6789J842O208J9687P930p341p640j0132j5830O459R037n096j593o765L47
$$ plain form
4874 -29676 -37000 -27489 -16359 -16010 -16657 -11947 -10538 -13268 -16965 -14157 -13954 -17436 -9308 -4234 506
4859 506 -4586 3687 13354 10769 -1120 -2379 -2753 9644 17758 12282 23191 23792 19987 11296 -10607
4844 -10607 -11110 -2217 11336 12794 9384 11908 9121 -4210 -12035 -15309 -23497 -14655 -11405 -11812 -16360
4829 -16360 -7488 -3521 -9451 -16676 -22907 -21682 -24426 -10991 8471 15476 11497 -3466 -13746 -16983
4815 -16983 -8437 -15477 -17621 -16857 -504 -499 -11394 -15408 -17714 -14673 -16159 -18181 -18595 -16009 -17774
4800 -17774 -35240 -35906 -17407 -18247 -6915 1899 9898 6587 19800 17457 5392 -3298 -1382 -2585
4786 -2585 6871 5172 -6604 -9501 4103 18743 3167 -1973 11257 10455 14892 9891 -1755 7966
4772 7966 14074 11969 11847 10554 4965 -3728 -8947 -19883 -9444 -675 -8139 -17409 -25303 -18660 -22201
$$ packed form
4874b9676p324R511J1130L49o47M710J409k730l697K808K03l482Q128N074M740
4859E06n092Q273R667k585j1889j259l74J2397Q114n476J0909O01l805q691k1903
4844a0607n03Q893J3553J458l410K524k787j3331p825l274q188Q842L250m07m548
4829a6360Q872L967n930p225o231J225k744J3435J9462P005l979j4963j0280l237
4815a6983Q546p040k144P64J6353Nj0895m014k306L041j486k022m14K586j765
4800a7774j7466o66J8499q40J1332Q814P999l311J3213k343j2065q690J916j203
4786b585R456j699j1776k897J3604J4640j5576n140J3230q02M437n001j1646R721
4772G966O108k105j22j293n589q693n219j0936J0439Q769p464r270p894O643l541
$$ plain form
4757 -22201 -19313 -11704 -14409 -5997 -6507 -832 -1897 920 4165 -9859 -10709 1856 11378 18721 10820
4742 10820 5307 -640 -2544 10388 23125 13282 1998 5985 -341 -9074 -23958 -10170 17333
4729 17333 17136 5670 -9718 -14245 533 4130 7079 9104 17765 6411 2012 -683 582 -1486
4715 -1486 -13398 -1768 14238 16559 18416 3296 -4177 -9479 -6631 7215 13002 12252 9390 8348
4701 8348 7179 -1523 -14404 -16814 -17165 -13675 5788 14030 11198 4816 -1767 -4182 751 10963
4687 10963 16870 7290 4229 8884 5143 -1737 5206 5015 13321 6237 8367 8206 17153 22208 28138
4672 28138 18625 25241 14864 -8324 -22305 -18632 -12519 -2053 9242 15455 14449 12037 -6619
4659 -6619 -6620 9195 15832 12797 893 -284 -8247 -8069 -11266 -17155 -553 -1967 -14450 -11458 -10246
$$ packed form
4757b2201K888P609k705Q412n10N675j065K817L245j4024q50J2565R522P343p901
4742A0820n513n947j904J2932J2737r843j1284L987o326q733j4884J3788K7503
4729A7333j97j1466j5388m527J4778L597K949K025Q661j1354m399k695J265k068
4715a486j1912J1630J6006K321J857j5120p473n302K848J3846N787p50k862j042
4701H348j169q702j2881k410l51L490J9463Q242k832o382o583k415M933J0212
4687A0963N907r580l061M655l741o880O943j91Q306p084K130j61Q947N055N930
4672B8138r513O616j0377k3188j3981L673O113J0466J1295O213j006k412j8656
4659f619jJ5815O637l035j1904j177p963J78l197n889J6602j414j2483K992J212
$$ plain form
4644 -10246 2392 12999 11645 -770 -8724 -9419 2488 2562 63 -21029 -38366 -33413 -21525 -12940
4630 -12940 -14219 -13723 -5033 8058 4435 1174 -8036 -17510 -27968 -27251 -32698 -23312 -599 -5616
4616 -5616 -8992 -11856 -4424 -9427 -19265 -19367 -7735 6457 859 -3965 -13676 -14831 -9116 -21083
4602 -21083 -11552 4232 -4344 -2817 13075 16411 -3132 -4184 -13578 -12297 -13896 -23819 -30567 -20654
4588 -20654 -11217 -2649 5126 13647 794 5622 16934 3116 -1691 11192 7793 -1636 -11004 -7479
4574 -7479 -12140 -15749 -12991 -16010 -25085 -32522 -24640 -14297 -8574 -14374 -17434 -21388 -6732 -2635
4560 -2635 -10994 -20751 -14365 -11797 2063 -10 -6268 -9274 -8039 -4656 -1516 -8567 -5242 906 4029
4545 4029 5834 -10350 -11586 -16438 -21476 -21531 -21864 -16334 -11369 -2276 15930 12067 403 -4954 -9184
$$ packed form
4644a0246J2638J0607j354j2415p954o95J1907P4k499k1092j7337M953J1888Q585
4630a2940j279M96Q690J3091l623l261r210r474j0458P17n447R386K2713n017
4616e616l376k864P432n003r838j02J1632J4192n598m824r711j155N715j1967
4602b1083R531J5784q576J527J5892L336j9543j052r394J281j599r923o748R913
4588b0654R437Q568P775Q521j2853M828J1312j3818m807J2883l399r429r368L525
4574g479m661l609K758l019r075p437P882J0343N723n800l060l954J4656M097
4560b635q359r757O386K568J3860k073o258l006J235L383L140p051L325O148L123
4545D029J805j6184j236m852n038n5l33N530M965R093J8206l863j1664n357m230
$$ plain form
4530 -9184 -10510 -2266 1962 2268 -5775 -19740 -10049 -12888 -25376 -34031 -20845 -6994 -1748 -13468
4516 -13468 -21700 -11551 2166 6776 3817 1350 3178 4243 3879 -2739 -5624 -8877 -16269 -14577
4502 -14577 -15743 -9833 -9131 -976 10855 8096 -3349 1529 932 4973 12992 12274 7126 18828 17937
4487 17937 17024 19306 13445 8850 13057 29973 34255 27706 11004 10838 2962 10375 9328 -7269
4473 -7269 -10949 -6379 2471 -2404 -12325 -16328 -5411 -3257 -18082 -34444 -39859 -31738 -25664 -23843
4459 -23843 -4575 4995 6491 177 -9700 -7430 -1578 -5314 -8737 -16065 -11878 -10921 -1015 9904
4445 9904 -4870 -12157 -25790 -23005 -12219 -6448 -8977 -15299 -14549 1581 4637 6424 -75 -17873
4431 -17873 -13955 -11372 -14651 -11729 -18422 -13717 -3479 -81 -9666 -14789 -12827 -11907 -17320 -13762 -4122
$$ packed form
4530i184j326Q244M228L06q043j3965R691k839j2488q655J3186J3851N246j1720
4516a3468q232J0149J3717M610k959k467J828J065l64o618k885l253p392J692
4502a4577j166N910P02Q155J1831k759j1445M878n97M041Q019p18n148J1702q91
4487A7937r13K282n861m595M207J6916M282o549j6702j66p876P413j047j6597
4473g269l680M570Q850m875r921m003J0917K154j4825j6362n415Q121O074J821
4459b3843J9268R570J496o314r877K270N852l736l423p328M187R57R906J0919
4445I904j4774p287j3633K785J0786N771k529o322P50J6130L056J787o499j7798
4431a7873L918K583l279K922o693M705J0238L398r585n123J962R20n413L558R640
$$ plain form
4416 -4122 -8551 -16332 -16448 -1819 6378 -2743 -10709 -8128 -9424 -11722 2008 5495 -119 -6362 -6756
4401 -6756 -5669 -3474 -3245 -6892 -15242 -17888 -9773 4645 16002 13039 -807 11003 10848 -4845
4387 -4845 -657 -8621 -28358 -26794 -12973 -13144 -13258 -8969 2058 6638 11348 -4430 -25645 -19216
4373 -19216 -97 8324 -760 -8697 -13609 -4379 8612 1460 -11573 -9613 -18140 -14055 7049 9384
4359 9384 3517 5525 7084 -3510 -2980 -8662 -8049 -14545 -27014 -25821 -11753 -14282 -18487 -15071 2690
4344 2690 14048 653 -4316 6530 21707 20295 9660 7355 -15053 -22428 -17276 -19770 -11495
4331 -11495 -16348 -23824 -19358 -14855 -10137 4920 -5387 -4222 4491 6318 3765 -4125 -2403 746
4317 746 3010 3512 -430 -9045 -18778 -17666 1004 4515 -10074 -8717 -11203 -13223 -8363 -10427 -11067
$$ packed form
4416d122m429p781j16J4629Q197r121p966K581j296k298J3730L487n614o243l94
4401f756J087K195K29l647q350k646Q115J4418J1357k963j3846J1810j55j5693
4387d845M188p964j9737J564J3821j71j14M289J1027M580M710j5778k1215O429
4373a9216J9119Q421r084p937m912R230J2991p152j3033J960q527M085K1104K335
4359I384n867K008J559j0594N30n682O13o496j2469J193J4068k529m205L416J7761
4344B690J1358j3395m969J0846J5177j412j0635k305k2408p375N152k494Q275
4331a1495m853p476M466M503M718J5057j0307J165Q713J827k553p890J722L149
4317G46K264N02l942q615r733J112J8670L511j4589J357k486k020M860k064o40
$$ plain form
4302 -11067 -11669 -13428 -16236 -5495 -13918 -17761 -22037 -15049 -19561 -29768 -30956 -33618 -17792 -3222
4288 -3222 -5617 -13012 -7926 -766 -3458 -2010 -10461 -13468 -14335 -15503 1364 15277 21803 19872 18279
4273 18279 20560 2030 -22504 -24308 -4624 4662 -7797 -8610 -3290 2843 856 -3327 -6931 -2646
4259 -2646 -6554 -12758 -3257 1648 -671 -5863 -2536 8638 7748 -6579 -18182 759 13831 8113
4245 8113 967 -5317 -710 15050 15200 6511 -5023 -5449 1665 3236 -8160 -8168 -20769 -22362 -24295
4230 -24295 -19357 -5504 11816 16377 18284 17824 15607 576 -3966 -3602 -10350 -10345 -6760 301 4797
4215 4797 1186 -5367 962 4580 -13161 -26524 -27011 -22003 -4276 -18009 -30522 -35429 -29719 -12620
4201 -12620 1196 -2675 -10892 538 -4914 -3570 3285 7162 13605 7102 8225 11492 4539 -8043
$$ packed form
4302a1067o02j759k808J0741q423l843m276O988m512j0207j188k662J5826J4570
4288c222k395p395N086P160k692J448q451l007q67j168J6867J3913O526j931j593
4273A8279K281j8530k4534j804J9684R286j2459q13N320O133j987m183l604M285
4259b646l908o204R501M905k319n192L327J1174q90j4327j1603J8941J3072n718
4245H113p146o284M607J5760J50q689j1534m26P114J571j1396qj2601j593j933
4230b4295M938J3853J7320M561J907m60k217j5031m542L64o748NL585P061M496
4215D797l611o553O329L618j7741j3363m87N008J7727j3733j2513m907N710J7099
4201a2620J3816l871q217J1430n452J344O855L877O443o503J123L267o953j2582
$$ plain form
4187 -8043 -20556 -26759 -17040 -8993 -18749 -25164 -18958 -13673 -20687 -19256 -715 6882 -340 6393
4173 6393 5456 -5658 -2429 -13376 -23529 -16499 -15431 -4161 -3764 -7208 -2019 13694 5544 14213
4159 14213 16414 3716 -21870 -14168 3111 13239 7482 -4229 -4207 2570 16241 9958 4166 -3119
4145 -3119 9946 10354 5535 2886 12857 9412 -7663 -8066 -3575 -15326 -12588 -5895 -3368 5045 13212
4130 13212 791 -11277 -18528 -20114 -17358 -17770 -14506 -3085 -2359 124 -10235 -10760 -5988 -8368
$$ packed form
4187h043j2513o203R719Q047r756o415O206N285p014J431J8541P597p222O733
4173F393r37j1114L229j0947j0153P030J068J1270L97l444N189J5713q150Q669
4159A4213K201j2698k5586P702J7279J0128n757j1711K2O777J3671o283n792p285
4145c119J3065M08m819k649R971l445j7075m03M491j1751K738O693K527Q413Q167
4130A3212j2421j2068p251j586K756m12L264J1421P26K483j0359n25M772k380
$$ [...]
##END NTUPLES=NMR SPECTRUM
##END=
