##TITLE=Analysis number 323975
Compound Code cc 58904
Book Reference 494/80
Project Code adrs
Chemist Name craigr
##JCAMPDX= 6.0         $$ Bruker NMR JCAMP-DX V2.0
##DATA TYPE= NMR SPECTRUM
##DATA CLASS= NTUPLES
##ORIGIN= Bruker BioSpin GmbH
##OWNER= nmr
$$ XWIN-NMR		Version 3.5
$$ Fri Nov 10 13:11:06 2006 GMT Standard Time (UT+0h)  MAYBRIDGE\nmr@NMR_250MHZ
##.OBSERVE FREQUENCY= 250.131544655141
##.OBSERVE NUCLEUS= ^1H
##.ACQUISITION MODE= SIMULTANEOUS (DQD)
##.ACQUISITION SCHEME= undefined
##.AVERAGES= 16
##.DIGITISER RES= 18
##SPECTROMETER/DATA SYSTEM= dpx250
##.PULSE SEQUENCE= zg30
##.SOLVENT NAME= CDCl3
##.SHIFT REFERENCE= (INTERNAL, CDCl3, 0, 16.522)
##AUDIT TRAIL= $$ (NUMBER, WHEN, WHO, WHERE, WHAT)
$$ ##TITLE= Audit trail, XWIN-NMR		Version 3.5
$$ ##JCAMPDX= 5.01
$$ ##ORIGIN= Bruker BioSpin GmbH
$$ ##OWNER= nmr
$$ C:\u/data/dgb/nmr/ADRS/2630/pdata/1/auditp.txt
$$ ##AUDIT TRAIL=  $$ (NUMBER, WHEN, WHO, WHERE, WHAT)
(   1,<2006-11-10 13:10:45.08 +000>,<MAYBRIDGE\nmr>,<NMR_250MHZ>,
      <created by zg, POWCHK disabled, PULCHK disabled
       configuration hash MD5:
       49 4B E0 1D 92 C2 6B 37 9F E6 65 BC 52 41 86 1D
       data hash MD5: 64K
       9A 85 5E 3B 7A 00 13 E4 90 C0 A1 9C 96 E4 0A 73>)
(   2,<2006-11-10 13:10:58.01 +000>,<MAYBRIDGE\nmr>,<NMR_250MHZ>,
      <Start of raw data processing
       ef LB = 0.3 FT_mod = 6 PKNL = 1 SI = 32K 
       data hash MD5: 32K
       CF 91 53 D2 EF C4 EC F6 CC D7 81 41 6E 18 A5 21>)
(   3,<2006-11-10 13:10:59.76 +000>,<MAYBRIDGE\nmr>,<NMR_250MHZ>,
      <apk 
       data hash MD5: 32K
       2F 11 CA D8 6D DE F5 04 12 27 A1 99 9E F2 5A 0B>)
(   4,<2006-11-10 13:11:00.48 +000>,<MAYBRIDGE\nmr>,<NMR_250MHZ>,
      <abs ABSG = 5 
       data hash MD5: 32K
       D5 68 5A FE 29 73 28 D1 8B DA 2F 4F 08 5A C1 E5>)
$$ ##END=
$$ 
$$ hash MD5
$$ 41 19 32 01 C8 59 53 2E 99 67 01 C5 A0 3B 22 80
##$RELAX= 
##$RELAX= 
##$RELAX= 
##$RELAX= 
##$RELAX= 
##$RELAX= 
##$RELAX= 
$$ Bruker specific parameters
$$ --------------------------
##$DU= <C:\u>
##$EXPNO= 2630
##$NAME= <ADRS>
##$PROCNO= 1
##$TYPE= <nmr>
##$USER= <dgb>
##$AMP= (0..31)
100 100 100 100 100 100 100 100 100 100 100 100 100 100 100 100 100 100 
100 100 100 100 100 100 100 100 100 100 100 100 100 100 
##$AQSEQ= 0
##$AQ_mod= 3
##$AUNM= <au_zg>
##$AUTOPOS= <30 >
##$BF1= 250.13
##$BF2= 250.13
##$BF3= 250.13
##$BF4= 250.13
##$BF5= 500.13
##$BF6= 500.13
##$BF7= 500.13
##$BF8= 500.13
##$BYTORDA= 1
##$CFDGTYP= 0
##$CFRGTYP= 5
##$CHEMSTR= <none>
##$CNST= (0..31)
1 1 145 1 1 1 1 1 1 1 1 1 1 1 1 1 1 1 1 1 1 1 1 1 1 1 1 1 1 1 1 1 
##$CPDPRG= <>
##$CPDPRG1= <>
##$CPDPRG2= <>
##$CPDPRG3= <>
##$CPDPRG4= <mlev>
##$CPDPRG5= <mlev>
##$CPDPRG6= <mlev>
##$CPDPRG7= <mlev>
##$CPDPRG8= <mlev>
##$CPDPRGB= <>
##$CPDPRGT= <>
##$D= (0..31)
0 1 0 0 0 0 0 0 0 0.06 0 0 0 0 0 0 0.0002 0 0 0 0 0 0 0 0 0 0 0 0 0 0 
0 
##$DATE= 1163164244
##$DBL= (0..7)
120 120 120 120 120 120 120 120 
##$DBP= (0..7)
150 150 150 150 150 150 150 150 
##$DBP07= 0
##$DBPNAM0= <>
##$DBPNAM1= <>
$$ [...]
##$SUBNAM7= <"">
##$SUBNAM8= <"">
##$SUBNAM9= <"">
##$SW= 20.6930455092707
##$SWIBOX= (0..15)
0 0 3 0 0 0 0 0 0 0 0 0 0 0 0 0 
##$SW_h= 5175.983436853
##$TD= 65536
##$TD0= 1
##$TE= 683.16
##$TE2= 300
##$TE3= 300
##$TEG= 300
##$TL= (0..7)
0 120 120 120 120 120 120 120 
##$TP= (0..7)
150 150 150 150 150 150 150 150 
##$TP07= 0
##$TPNAME0= <>
##$TPNAME1= <>
##$TPNAME2= <>
##$TPNAME3= <>
##$TPNAME4= <>
##$TPNAME5= <>
##$TPNAME6= <>
##$TPNAME7= <>
##$TPOAL= (0..7)
0.5 0.5 0.5 0.5 0.5 0.5 0.5 0.5 
##$TPOFFS= (0..7)
0 0 0 0 0 0 0 0 
##$TUNHIN= 0
##$TUNHOUT= 0
##$TUNXOUT= 0
##$USERA1= <user>
##$USERA2= <user>
##$USERA3= <user>
##$USERA4= <user>
##$USERA5= <user>
##$V9= 5
##$VALIST= <valist>
##$VCLIST= <CCCCCCCCCCCCCCC>
##$VD= 0
##$VDLIST= <DDDDDDDDDDDDDDD>
##$VPLIST= <PPPPPPPPPPPPPPP>
##$VTLIST= <TTTTTTTTTTTTTTT>
##$WBST= 1024
##$WBSW= 4
##$XGAIN= (0..3)
0 0 0 0 
##$XL= 0
##$YL= 0
##$YMAX_a= 411062
##$YMIN_a= -458649
##$ZGOPTNS= <>
##$ZL1= 120
##$ZL2= 120
##$ZL3= 120
##$ZL4= 120
##$ABSF1= 16.522
##$ABSF2= -4.171173
##$ABSG= 5
##$ABSL= 3
##$ALPHA= 0
##$AQORDER= 0
##$ASSFAC= 0
##$ASSFACI= 0
##$ASSFACX= 0
##$ASSWID= 0
##$AUNMP= <proc_1d>
##$AZFE= 0.1
##$AZFW= 0.1
##$BCFW= 0
##$BC_mod= 0
##$BYTORDP= 0
##$COROFFS= 0
##$CY= 12.5
##$DATMOD= 1
##$DC= 0
##$DFILT= <>
##$DTYPP= 0
##$F1P= 14.0000005364418
##$F2P= -0.99999901652339
##$FCOR= 0.5
##$FTSIZE= 32768
##$FT_mod= 6
##$GAMMA= 0
##$GB= 0
##$INTBC= 1
##$INTSCL= 1
##$ISEN= 128
##$LB= 0.3
##$LEV0= 0
##$LPBIN= 0
##$MAXI= 10000
##$MC2= 0
##$MEAN= 0
##$ME_mod= 0
##$MI= 0
##$NCOEF= 0
##$NC_proc= -4
##$NLEV= 6
##$NOISF1= 0
##$NOISF2= 0
##$NSP= 0
##$NTH_PI= 0
##$NZP= 0
##$OFFSET= 16.522
##$PC= 1
##$PHC0= -47.60358
##$PHC1= 6.336243
##$PH_mod= 1
##$PKNL= yes
##$PPARMOD= 0
##$PSCAL= 4
##$PSIGN= 0
##$REVERSE= no
##$SF= 250.13
##$SI= 32768
##$SIGF1= 0
##$SIGF2= 0
##$SINO= 400
##$SIOLD= 32768
##$SREGLST= <1H.CDCl3>
##$SSB= 0
##$STSI= 32768
##$STSR= 0
##$SW_p= 5175.98343685301
##$SYMM= 0
##$S_DEV= 0
##$TDeff= 65536
##$TDoff= 0
##$TI= <Analysis number 999999
Compound Code 99
Book Reference 9
Project Code 9>
##$TILT= no
##$TM1= 0
##$TM2= 0
##$TOPLEV= 0
##$USERP1= <user>
##$USERP2= <user>
##$USERP3= <user>
##$USERP4= <user>
##$USERP5= <user>
##$WDW= 1
##$XDIM= 32768
##$YMAX_p= 560218623
##$YMIN_p= -178591
$$ End of Bruker specific parameters
$$ ---------------------------------
##NTUPLES= NMR SPECTRUM
##VAR_NAME=  FREQUENCY,     SPECTRUM/REAL,   SPECTRUM/IMAG
##SYMBOL=    X,             R,               I
##VAR_TYPE=  INDEPENDENT,   DEPENDENT,       DEPENDENT
##VAR_FORM=  AFFN,          ASDF,            ASDF
##VAR_DIM=   32768,         32768,           32768
##UNITS=     HZ,            ARBITRARY UNITS, ARBITRARY UNITS
##FACTOR=    0.157963299565203, 1,           1
##FIRST=     4132.6476996994, 0,             0
##LAST=      -1043.33573715361, 0,           0
##MIN=       -1043.33573715361, -178591,     0
##MAX=       4132.6476996994, 560218623,     0
$$ Real data points
##PAGE= N=1
##DATA TABLE= (X++(R..R)), XYDATA
$$ [...]
20239 -20283 -9121 -7344 -19383 -5941 -5486 -11298 -15661 -4715 13940 -4306 1707 -15891 -22138
20226 -22138 9297 24439 -4144 -20885 3609 16298 26870 33684 25574 3798 -17266 22533
20214 22533 73136 62515 24804 13937 5048 -14758 -5941 6694 13609 33484 8325 -5568
20202 -5568 20250 29532 -2504 -4706 -5103 -13806 -22510 -39240 -31608 -22206 -16714 -20225 -21711 -30292
20188 -30292 -26538 -36783 -39265 377 9672 18280 3538 -5464 -2635 -14172 -20367 389 -262
20175 -262 -8285 -13609 -8218 -21553 -1537 9041 4003 -36185 -34814 -11493 15199 -10222 -13668
20162 -13668 11054 45091 80816 80383 48035 30639 19599 22012 22531 24100 40251 31114 15183
20149 15183 -6688 -7912 -1519 -14742 6556 36892 73490 62469 41049 11478 -16763 -21170
20137 -21170 7484 13585 9303 -10131 -16410 -5044 7931 466 -40748 -42052 -9576 -2112 4709
20124 4709 -2338 757 28805 30001 10484 2826 2333 3553 -36340 -25015 -21773 -12657 14303 7994
20110 7994 -27817 -29511 -13976 -1190 -4552 -20706 3572 23032 20464 139 -2349 -4339 -9907
20097 -9907 -7345 -9424 -6107 11622 13352 25138 16438 11792 -1536 -3695 -9371 1907 33817
20084 33817 35529 35553 34816 24206 29621 36845 31361 15764 -14952 -23395 -15691 17119 37948 3112
20070 3112 -18570 -13111 -2884 12298 29708 25426 -12143 -3262 25636 -3145 -10607 -9300 -10078
20057 -10078 3372 -6112 -12802 -26095 -36853 -28624 -15183 -5542 -24265 -11220 -2494 15150 -6126
20044 -6126 -11841 -758 5360 20039 13862 -20416 -27607 -25094 -35003 -22429 5710 8115 1577
20031 1577 7275 7759 33466 45347 29502 14393 30697 19092 3432 -22702 -26770 -11425 -5313
20018 -5313 9090 2916 -23760 -34755 -23605 -6017 -25807 -58708 -71269 -57818 -14089 -4883
20006 -4883 21177 25905 23050 61658 86047 67113 47982 48083 14857 -23637 -22540 16278 34942
19993 34942 32623 23761 8965 -39508 -52324 -31526 -16275 -25376 -10719 5870 11920 14026 33234
19980 33234 16675 12635 -6747 -11608 -6420 21630 38103 38340 28313 30325 5612 11559 20588
19967 20588 27427 11134 5069 -30677 -30417 11807 53607 33059 18446 20186 11094 14313 -8708
19954 -8708 -1500 4123 9527 12891 33140 41965 35780 24069 20303 9249 22219 18516 28499 55597
19940 55597 42082 46716 47496 35525 45333 48710 49856 36926 33270 56238 76593 88912 70263
19927 70263 73443 51707 38773 43257 15355 12547 18305 511 1322 22108 30695 -5597 4559
19914 4559 23810 21714 23063 9185 -10534 -4238 -1795 -6155 -34947 -53644 -48114 -42686 -39229
19901 -39229 -24730 8663 37148 33763 23518 50009 50691 12410 6981 -810 13690 17897 -1916
19888 -1916 -6633 -8214 -3258 -3080 -50 -14173 -7857 -5354 -12675 -5456 16048 48320 75720 90141
19874 90141 69081 60018 50350 45701 49487 39956 14690 9685 5229 24610 28470 55496 65357
19861 65357 57950 54443 49168 68816 56905 38396 44511 54839 61106 38440 10555 597 -15499
19848 -15499 13893 31494 5022 29076 17344 549 2978 10908 -6234 -22047 -28616 -13228
19836 -13228 26595 39052 43153 58560 58589 52830 75223 118806 111502 113530 107281 101304 70547
19823 70547 45307 46503 39305 18731 13425 15887 27726 39287 18044 -22619 -7604 15132
19811 15132 24374 25762 30364 17096 -6622 -14074 12473 8651 -7389 -7340 13843 6168 13450 35885
19797 35885 42168 15840 -26678 -35345 -9558 3035 -15336 -25369 -33423 -38143 -16040 346
19785 346 19354 76057 85364 65296 32221 -5963 -10161 -705 20326 42081 50346 76990 96030
19772 96030 77598 62908 56045 52039 53771 39497 50145 47155 43695 29786 53760 76319 72988
19759 72988 110862 156338 169224 153031 198579 245275 269515 308121 365834 417227 470643 508663
19747 508663 546564 579950 599825 606951 614863 617454 615218 594137 569536 517296 463915 414946
19735 414946 327149 280234 236485 223076 230292 204687 178214 136020 137033 139117 125173 131598
19723 131598 128572 128905 101906 93630 112697 103874 102259 108468 91323 85522 70868 63716 69601
19710 69601 90334 86318 77621 61757 34622 44525 58816 7972 -15798 13616 14871 20070 24122
19697 24122 16328 5452 11679 40712 44782 25988 12498 16451 32392 58558 67619 35732 -2304
19684 -2304 -1569 -11926 6979 12901 23120 26467 43629 60473 73208 58758 38075 23138 49529
19671 49529 49239 46124 32949 10975 34397 52275 46348 32575 25261 8021 20898 51743 32021
19658 32021 9070 15507 5414 27211 56966 33530 20494 48983 46726 74627 71980 42528
19646 42528 24020 14058 7890 -16896 -15708 4910 -2478 7362 5206 15511 23017 18731 9942
19633 9942 29902 39729 51776 72756 55887 43273 51731 54563 35222 41124 29559 30261 37198
19620 37198 67170 73939 48561 38919 40217 33757 19701 22827 45036 49884 56741 62773 57557
19607 57557 59310 62141 100328 95217 82458 74863 75109 69881 47677 37981 40193 52967 32365
19594 32365 12929 12103 19989 34556 45735 54407 78168 100093 58517 53717 52989 23192 6476
19581 6476 25306 46491 58532 80885 98251 92366 46270 32374 40691 39674 26398 45374
19569 45374 64823 81623 103935 87625 65978 95794 127256 114150 102427 102439 88325 85435
19557 85435 67703 62277 59428 57303 48063 55191 49084 49901 43878 61338 56564 62455 71660 76368
19543 76368 63763 59278 47627 44189 65649 86633 73963 71917 79134 83134 92910 89587 80834
19530 80834 87902 94922 87301 61275 37528 50214 66502 62493 43297 27586 23407 47162 74325
19517 74325 69612 69744 94894 102756 97633 103188 115847 119929 105197 107147 112773 86027 99472
19504 99472 97139 100297 84317 66605 106861 127633 126494 102955 102571 130508 131506 125782 103415
19491 103415 113702 108279 138260 161666 202455 205451 180420 177810 203262 214370 209792 206983
19479 206983 212072 205844 185291 172418 170307 166063 169091 165757 168758 145279 139981 126506 122703
19466 122703 125385 132285 153866 142033 108346 93633 101061 98404 97745 94782 89885 99498 110391
19453 110391 121500 117915 128153 115127 114443 130805 135557 152223 139301 123619 149065 132579
19441 132579 115967 132341 136566 139846 157782 158719 162273 173691 186635 194701 214858 225643 242643
19428 242643 257603 255989 247071 245205 265874 274909 275552 278500 272243 256704 255072 261634 230739
19415 230739 215708 202646 176041 165390 170428 207732 243138 222099 218161 208843 208920 212435 244427
19402 244427 263644 257856 261137 236537 260139 310063 332056 337083 367330 404741 431203 469626
19390 469626 529275 583048 641582 708055 741295 769693 815431 832806 831668 830929 798531 760992
19378 760992 694612 626409 586752 525177 509446 504731 475409 469186 483428 457735 429380 404688
19366 404688 390901 372201 378188 400716 426159 441794 440073 418540 396063 393869 396683 384531
19354 384531 378997 372851 385250 356783 351958 359469 379343 401659 426968 475575 472607 490182
19342 490182 529100 608138 672243 700531 747169 809991 855607 913616 987056 1036788 1039561 1059793
19330 1059793 1067356 1049822 1037751 1033712 1011014 967419 932178 915865 894566 879037 849937 858862
19318 858862 826944 783792 764715 716153 682778 630808 577635 509382 485756 493009 468640 442299
19306 442299 464754 483984 489864 474769 463948 492925 532082 550392 539654 542779 533198 523007
19294 523007 535119 537899 517480 507114 517519 534225 562053 546220 526647 535942 519453 520178
19282 520178 529690 520455 530983 557575 549657 537605 555014 567771 573062 561218 549760 552040
19270 552040 559759 548953 598023 627324 625472 661557 689029 704146 724857 729607 736419 720888
19258 720888 719452 748635 760664 793377 834693 865423 847485 832554 878504 902338 926674 921260
19246 921260 964884 1016295 1056195 1095357 1125080 1143185 1157971 1177613 1182458 1231573 1285876 1335469
19234 1335469 1349517 1392591 1473650 1538671 1563789 1617662 1692369 1735545 1780524 1862771 1932250
19223 1932250 2020171 2110193 2222687 2333392 2429844 2525905 2635855 2750374 2883777 3004500
19213 3004500 3183763 3376041 3589476 3830504 4098677 4358350 4653114 4988931 5305162
19204 5305162 5650985 6053119 6422465 6810884 7217113 7653581 8102442 8572730 9086895
19195 9086895 9687217 10401003 11221635 12207378 13416086 14835264 16594305 18755492 21334351
19186 21334351 24488184 28315992 32945532 38391126 44763225 52070317 60171721 68971858
19178 68971858 78153447 87349689 96158635 104068468 110535220 115143807 117632523 117845887
19170 117845887 115729277 111392743 105168840 97489472 88795846 79575921 70326059 61480402
19162 61480402 53307958 46006266 39664636 34245788 29711428 25961443 22885853 20371389
19154 20371389 18293863 16556683 15097203 13883617 12859746 11984523 11232377 10619533
19146 10619533 10055561 9551686 9060164 8624494 8224133 7851868 7478856 7101426 6722065
19137 6722065 6342618 5979372 5631776 5309610 5011784 4710351 4468072 4235808 4006008
19128 4006008 3801503 3626142 3474340 3352136 3229824 3098095 2972853 2853577 2748528
19119 2748528 2645286 2572110 2498989 2396695 2273416 2161600 2068812 1988841 1912296 1833049
19109 1833049 1756379 1692628 1609844 1561320 1506795 1443579 1412921 1394269 1353043 1306811 1250945
19098 1250945 1228548 1188631 1152765 1130155 1111189 1083282 1039508 1020061 1004715 1005854 1021639
19087 1021639 1000630 966365 937824 908324 896233 915610 916721 916179 875291 836540 840150 844624
19075 844624 873399 859737 828173 829136 820832 812497 837161 841799 821513 805326 793505 768021
19063 768021 768376 758242 743741 733012 688574 642558 632315 632799 615597 585666 578207 579968 588893
19050 588893 580850 583448 593968 576399 582026 563637 533420 523685 533746 528146 508196 483768
19038 483768 478854 476909 500141 467338 443520 409319 372782 355375 325442 344842 326815 328380
19026 328380 347937 314351 271075 252860 241250 229555 239087 214756 222154 223214 215344 208028
19014 208028 203015 215118 230351 245100 229021 255197 274073 276478 280986 293639 295229 302809
19002 302809 318603 330277 349427 364084 381578 378133 344998 321314 302994 281202 262019 247405
18990 247405 237658 226615 217603 209739 208118 225376 235648 299817 326743 316661 278879 256009
18978 256009 274900 312294 327289 332617 354846 359082 375880 402332 430015 421437 401619 393003
18966 393003 437245 454000 461475 441004 406118 404767 425593 446773 482661 538695 582524 612099
18954 612099 629745 668398 710286 735811 757628 786944 815573 800108 777881 774843 726610 702659
18942 702659 678294 651837 636435 602617 596871 583926 584522 574853 571518 590026 566582 560949 569731
18929 569731 545751 528997 513170 499810 511392 503062 511497 494933 507832 521442 520397 547134
18917 547134 553259 531779 536788 525321 531288 530225 525250 529242 548602 583355 605023 592950 580784
18904 580784 578186 606017 629499 629032 635730 669081 684789 700256 701343 713159 750106 780261
18892 780261 791941 809963 804134 836615 874952 904625 917900 905731 907795 924547 951322 972195
18880 972195 1022619 1041086 1080487 1127176 1164762 1213501 1222592 1252945 1276517 1288736 1310116 1302861
18868 1302861 1307418 1334769 1410263 1480296 1525680 1566957 1621986 1707302 1813266 1912748 1995018
18857 1995018 2107344 2260696 2416374 2579262 2756393 2943407 3155918 3386644 3699448
18848 3699448 4050550 4378408 4672335 4981194 5288118 5565977 5851437 6096730 6337511
18839 6337511 6589443 6856209 7123307 7435375 7822410 8303896 8917784 9678980 10602559
18830 10602559 11694576 12996498 14615090 16631408 19105635 22143789 25901827 30564633
18822 30564633 36266524 43182412 51418754 60939077 71604452 83151182 95065225 106650636
18814 106650636 117126209 125640878 131463775 134049213 133135402 128759638 121359629 111588604
18806 111588604 100290417 88280358 76357292 65150234 55130200 46483173 39229913
18799 39229913 33276997 28452467 24589522 21480657 18935397 16873764 15183801 13760222
18791 13760222 12588524 11617394 10791078 10102625 9506129 9011066 8601367 8265337 7986100
18782 7986100 7687127 7405879 7186962 6993209 6764042 6507219 6251844 5982935 5680280
18773 5680280 5348765 5043679 4778186 4516360 4302249 4118201 3956957 3718256 3467810
18764 3467810 3244430 3119668 2991399 2860307 2725209 2608565 2498888 2412849 2315540 2214090
18754 2214090 2154038 2061534 1945238 1857854 1793541 1728684 1633899 1557572 1489991 1435444 1385110
18743 1385110 1377313 1319465 1231874 1203250 1171258 1146610 1086506 1044133 1032713 1007832 977539
18732 977539 953373 955575 930756 921635 912000 866423 837630 822703 812882 813851 787663 746304 716518
18719 716518 691820 682127 656442 633883 616035 597310 590011 594739 571771 544710 543877 543652 554423
18706 554423 539601 514484 468688 446603 435904 459596 472588 475941 481552 457204 436385 425542
18694 425542 422550 406937 409373 430736 442716 452437 461214 448186 452947 462583 490724 498799 508976
18681 508976 495888 448813 412385 387873 353421 358483 375391 357975 303597 238549 237241 249303
18669 249303 230623 240288 262403 258037 239211 196755 170314 148669 149885 168861 157809 138640
18657 138640 129081 129350 146670 134075 146863 132028 144140 160988 169251 179472 155513 132194
18645 132194 104618 90423 86811 73946 79840 108871 125724 137027 129964 143862 139612 123930
18633 123930 106788 90850 98530 105938 107375 116616 97493 94343 92892 89934 84195 65618 72822
18620 72822 80310 76679 56663 80784 112688 111375 125526 154942 188662 208618 207734 228852 225370
18607 225370 232729 268550 306314 332244 394699 440740 499053 546934 575992 597552 642622 662194
18595 662194 676666 685392 697067 682330 660224 641894 621712 577400 551126 497180 410948 361493
18583 361493 318165 291679 283113 274667 227259 205338 183967 143289 134032 126099 103192 97298
18571 97298 107161 130648 133536 140276 139627 167166 163728 132729 103865 86156 99864 116469 80761
18558 80761 53366 41907 27802 19046 36938 49314 40745 59159 55702 45972 38152 53598 63165
18545 63165 57176 68871 45677 17203 19214 24637 28301 40917 33665 33219 49325 46944 47246 48387
18531 48387 45870 34138 43932 49301 68331 68700 41679 30575 38129 42288 37423 19629 8244
18518 8244 2282 -2588 3785 17731 31705 29697 4186 25265 37591 13947 -27366 -76475 -72382
18505 -72382 -50068 -73112 -107752 -102815 -93373 -85922 -97283 -95128 -77755 -66781 -54008 -12505
18493 -12505 21672 34904 14652 17400 165 -3229 -3357 -14587 -5016 16387 8963 14847 21480
18480 21480 36973 27352 11217 6763 4056 24645 30540 8055 -1750 -29593 -39912 -1474 4098
18467 4098 5251 23128 984 16792 28281 51090 57287 54329 42337 -8658 6337 14446 14396
18454 14396 22445 37184 38502 10565 -20151 -38082 -19127 18467 11643 2556 14764 34525
18442 34525 20152 5147 -10917 -44591 -47985 -15137 2386 12774 -10165 -6157 9254 10898
18430 10898 25950 9716 1511 38944 34827 11449 30753 35201 19557 20032 41459 51823 32818
18417 32818 9979 -10794 -24927 -23002 -26383 -1873 10880 -11938 -17838 840 16370 1173
18405 1173 -14894 -27620 -36020 -20364 -3532 17614 -831 13108 27095 24276 21452 1235
18393 1235 -36350 -46908 -45039 -29329 -36347 -36088 -38184 -33968 -26678 -37697 -26077 -6875 6415
18380 6415 1799 -7435 -13489 -6 -6619 -22627 -6664 -1042 -6838 -10982 -10612 5219 29885 68626
18366 68626 68000 55468 37549 29861 70550 60309 46927 45893 44818 41463 52905 53555 58731
18353 58731 59923 70728 51771 5567 67 18021 19629 3946 18471 13661 16975 43977 21355
18340 21355 37227 79341 77837 54192 27392 -3551 -26269 -57383 -43402 -19976 -11684 -20342
18328 -20342 -9337 6847 32244 30612 28726 40043 47356 32057 19633 24158 13095 -5938
18316 -5938 -8379 8606 27142 51356 45575 42880 50362 54781 21156 3076 -1557 39620 53777
18303 53777 57507 42639 36767 3432 -27409 -13710 -2902 -18611 -10505 -5135 29013 37978 15504
18290 15504 10797 6420 20688 21126 33417 21664 12875 21996 32801 58178 71049 70166 69608 85064
18276 85064 58474 18662 3103 14746 19939 14633 32003 85688 106897 94500 71601 85754
18264 85754 94582 77185 37892 34002 58954 47291 28947 48681 66971 59509 49292 63994
18252 63994 77900 71203 56930 59644 86772 105364 108084 146470 179568 192010 214749 259403
18240 259403 286923 325242 439647 515750 563289 635009 686983 694940 699504 718210 728928 689537
18228 689537 625426 555682 499971 446743 421142 366520 289597 238759 192095 191608 211375 185265
18216 185265 148651 129159 107862 102100 100278 102889 104357 100824 96590 104475 122921 110202 82571
18203 82571 72608 69079 71792 82549 80641 65845 70868 67752 68248 37838 20520 21574 41209
18190 41209 58367 73598 83713 67735 61865 42573 35687 74412 95825 99630 101301 81682
18178 81682 86340 85548 63514 53978 39478 34242 25462 45115 53090 65953 64746 65550 75088 107652
18164 107652 101735 80779 92900 99738 88536 102026 129407 92280 48848 34246 55178 103148
18152 103148 128033 146247 148737 137751 116218 114830 162025 202794 201308 208660 230685 270705
18140 270705 307773 309243 276630 283829 329819 358230 362677 391408 423438 450703 490213 527777
18128 527777 578680 649096 757669 861010 982980 1151514 1359451 1640395 1977061 2478180
18118 2478180 3197913 4304505 5912682 8015632 10691841 14026006 18366109 24263770
18110 24263770 30235991 34950598 34242620 25643077 16912415 11048697 7677823 5714772
18102 5714772 4472159 3592611 2901965 2384728 2038567 1752950 1531385 1359849 1214545
18093 1214545 1101323 985586 903640 818505 756800 712239 663732 616657 581586 556928 519441
18082 519441 524038 506654 446313 405447 381836 366731 352710 347287 338109 299960 285827 281072
18070 281072 261677 244827 263967 256029 231422 216513 194891 173435 147469 161869 175657 162631
18058 162631 163900 160239 158491 129308 130215 110235 109126 146948 156711 139324 95071 102630 124024
18045 124024 113226 106026 113072 127456 130569 124298 131791 100138 81553 79164 78833 94031 79001
18032 79001 69207 65259 59090 33094 37792 30294 39186 32541 13234 29118 42286 23830 7461
18019 7461 25755 45520 45090 42989 33489 33107 14550 8058 45862 88981 85208 39543 -17717
18006 -17717 -27317 1737 13439 13734 14839 18820 29668 35128 24255 34762 56387 52934 66586
17993 66586 62736 58004 52274 55679 41285 42729 45263 43717 53245 59346 69223 50674 54359 49453
17979 49453 24593 9108 -14235 -22022 -27727 -21350 11825 23442 37754 45226 33806 32529 32898
17966 32898 9100 -16380 -33480 -45574 -27562 -28310 -20225 -15386 -27565 -3326 -6180 -29066 -42745
17953 -42745 -21278 -306 -13191 -3874 -11220 -7471 -5282 7819 27855 20069 36909 53855 36184
17940 36184 21210 32633 29695 447 -13866 -13342 21673 -3702 -50551 -36256 -16384 -5668
17928 -5668 -13298 -18092 -29682 -34229 -50278 -43661 -34238 4987 13231 15969 1451 4543 -8025
17915 -8025 -6839 -4455 397 29915 8081 -9286 -2226 -31895 -36820 -30229 -24734 -2357 18266
17902 18266 24070 23565 16970 10837 15165 -6521 -22365 -25087 -31170 -14234 -3330 2802 8267 -11733
17888 -11733 -29745 -42554 -41717 -6978 4717 -9986 13473 24463 31458 44009 37389 -12974
17876 -12974 -24984 -20187 -19773 14225 39443 21260 2691 -4995 -7186 -16419 -17714 -31670 -41270
17863 -41270 -32062 -24000 -15431 -35055 -46301 -23140 -23894 -16676 -8296 10669 10680 26859 -2534 3745
17849 3745 5205 8531 1746 -42612 -49128 -32077 -42664 -63639 -57102 -64226 -51481 -56502 -45997
17836 -45997 9493 24740 44444 37274 -224 -2007 -12525 -12200 13775 29626 14807 19263 29080
17823 29080 30129 6354 8208 25705 50360 5464 -35010 -31311 -6117 12628 46713 57543
17811 57543 60357 34472 12831 15309 -6068 -23284 5026 -6473 -24598 -35122 -29086 -31499
17799 -31499 -29097 -30407 -20838 -23294 -10223 8568 5325 -1111 -22999 -31624 -30183 -33981 -27716 -39420
17785 -39420 -9864 -7969 9783 10967 24929 15090 -2635 -2478 10235 43501 33644 17696 -10454
17772 -10454 -33219 -35267 -54909 -54680 -52318 -22478 -25051 -35679 -32962 -28635 -37601 -34060 -8036
17759 -8036 14159 3572 -421 5533 8397 -12443 -41740 -44188 -43568 -37145 -23900 -5407 2985
17746 2985 -18170 -20039 -381 21709 10432 14285 29899 9527 6589 5154 4151 1899 4998
17733 4998 28188 25029 26576 35255 20856 28625 32812 8971 13296 16243 -6110 -41970 -38162
17720 -38162 -19086 -18701 -33781 -32435 -25860 -15809 -17792 -26552 -49788 -48644 -25349 -22664 -28551
17707 -28551 -28165 -18683 -7269 -15188 -19316 -39981 -28435 -12903 798 -1575 15628 13988 -18350
17694 -18350 -13111 18885 39948 19958 -8143 -16687 -35196 -53353 -62251 -49961 -30396 -35385
17682 -35385 -20303 -6942 958 -13826 -26591 -38910 -40945 -16293 -12291 -21800 -2478 19298
17670 19298 -172 14058 43226 19731 -8398 -30514 -21190 -25972 -18229 9832 8662 -11068
17658 -11068 -15091 -13201 -850 -13460 -8404 24616 51000 47935 29481 -7386 -37453 -36040 -24091
17645 -24091 -36268 -7693 3136 -6410 -20187 -23484 -19922 -22646 -5085 9641 25162 30518 22786
17632 22786 -6031 -21617 -24278 -31262 -23348 -36709 -36197 -3527 16004 -2837 2653 1477 2565
17619 2565 8750 17696 10992 1029 15603 28 -26771 -13817 -11882 -37873 -40552 -9278 6544
17606 6544 -626 4053 13038 -3503 -30848 -18483 6639 27746 12148 11355 10400 13789 8262 17328
17592 17328 22986 6275 18677 17292 40575 60831 58371 56520 27414 16603 27555 30840 28814
17579 28814 16781 28761 32388 31646 28238 -1995 -26032 -16412 -20863 -12780 -5382 7423 34284
17566 34284 39380 45634 45499 39192 1160 -21486 -30371 -38470 -25365 -39883 -40138 -14615 -1838
17553 -1838 -22954 -38402 -264 15275 12157 -5078 -8132 -4520 12174 38144 32038 -2066 -33011
17540 -33011 -10043 4281 10263 9033 6544 21317 29629 19855 3235 -18928 141 -7622 -21045
17527 -21045 -9802 -8050 13482 11220 -17032 -23987 -9742 -10907 -11418 -3024 4232 -1511 -8892 -1411
17513 -1411 -26166 -20370 -13652 -20684 -16745 -797 -19488 -34214 -25780 -25458 -1553 11935 8347
17500 8347 -3001 -724 11524 9430 -16991 -40256 -19370 5829 23928 26600 -21049 -62418
17488 -62418 -32383 8819 9734 -19073 -17960 3103 1064 -5858 -31864 -20480 -1481 -8666 -2453
17475 -2453 13529 10763 3914 -26818 -32390 9067 38476 29128 13325 5433 1886 1173 22079
17462 22079 17885 -18087 -32906 -28488 -29520 -35874 -42387 -17559 -33841 -27872 -21678 -43095 -37397
17449 -37397 -40417 1831 22535 41654 83209 125446 125939 132355 138190 110428 72446 19682 -1059
17436 -1059 13343 29894 33245 5845 2969 1924 -1343 -2420 -23218 -18963 -19116 -32291 -35709 -28602
17422 -28602 -14734 -4648 -50847 -97816 -80394 -71895 -42305 -32106 -24855 -2869 -2953 8872 -21473
17409 -21473 -23316 -23203 -24075 -17981 -18023 -27862 -46481 -15954 -357 -18610 -9128 -531 9082 -10443
17395 -10443 -10949 -17241 -28685 -36729 -19284 -23791 -26370 -26541 -1294 -11377 -20255 -4915 22379
17382 22379 15658 13670 33959 31528 24805 8422 13986 21343 -14165 -11707 19504 -16143 -45770
17369 -45770 -56024 -57297 -52753 -58304 -49666 1780 12516 -24393 -33835 -27546 -23631 -35756 -40016
17356 -40016 -16937 -18808 -22027 -17228 -11529 -9145 -11035 -24751 -16283 -7043 -21690 -39960 -22953
17343 -22953 -5114 -15948 -38777 -41496 -55706 -43224 -33461 -32383 -31566 -38364 -26977 -10085 -16049
17330 -16049 -4505 -6948 -2360 -5685 -19448 -21726 -9955 -13881 -30828 -31924 -35274 -45093 -65420
17317 -65420 -55762 -68452 -56060 -44347 -31295 -21142 -32471 -64194 -44470 -5388 37686 57329
17305 57329 16772 -21263 -32699 -29013 -27985 1356 25906 -13837 -54983 -67763 -58682 -67602
17293 -67602 -58297 -41459 -43575 -83360 -60300 -46411 -30370 -16079 -47919 -65928 -51682 -27184
17281 -27184 -22389 -11572 12548 17921 -1610 -2763 4318 24113 1788 -31882 -38616 -14173 -12110
17268 -12110 -6456 34306 -3522 -16058 -5094 31316 42264 18722 -20966 -21801 -32796 -24034
17256 -24034 -22666 -16679 -29944 -27105 -6248 -16374 -26356 -18620 -13459 -7325 -11300 -13050 7799
17243 7799 22131 -5475 -10887 -21396 -20665 -29259 -45794 -58900 -65700 -56898 -7057 3825 -3916
17230 -3916 -16954 -10176 -12658 -12326 3226 -10727 -12612 -26488 -33035 -32186 -31294 -31778 -13757 -17835
17216 -17835 -7673 5407 -8614 -24997 -16283 -9646 -9587 8140 23250 -7403 -682 -10878 -37167
17203 -37167 -56541 -42452 -44347 -60098 -56066 -46230 -35042 -12708 -23096 -14815 3552 -14971
17191 -14971 -5467 14522 10947 4441 16809 23024 6661 -7570 9718 23475 13010 2682
17179 2682 9994 15604 -5638 -51040 -48292 -29857 -33801 -15904 -11465 -43655 -44510 -26846 14657
17166 14657 57086 48937 37245 29544 -9619 -35425 -11124 5338 -15911 -18874 -6908 -727
17154 -727 -13410 -33294 -35163 -70222 -80006 -74772 -40351 -45893 -41863 -39185 -37463 -29024 -37571 -54489
17140 -54489 -40814 -23929 -40038 -34437 -35214 -33993 -42003 -74414 -63031 -36732 -8299 -9992 -17030
17127 -17030 -42327 -44171 -24333 -26223 -18729 3424 4633 -852 -17224 -39356 -38523 -16893 -31816
17114 -31816 -57700 -26660 -5696 -13637 -11091 -13365 -27038 3971 23767 17301 1141 -2559 -21650
17101 -21650 -18727 -24533 -48804 -42152 -45688 -40726 -18664 -4111 4911 -8300 -60730 -59603 -23365
17088 -23365 -26577 -29616 -29122 -6181 14117 13033 -43548 -38962 -45067 -54248 -55345 -49032 -32583 -20123
17074 -20123 -21647 -38305 -32812 -32924 -33571 -29062 -35643 -41104 -28316 -32536 -27165 15884 7597 -35009
17060 -35009 -35651 -32661 -54559 -67830 -43410 -44929 -56345 -54645 -59541 -48279 -28860 -6975 -16962
17047 -16962 -36257 -28731 -13775 -30959 -35907 -16596 2354 894 400 11304 -5240 -23524 -19114
17034 -19114 3026 -1 286 -7228 -12980 -778 -16752 -25974 -11520 -27839 -20743 2362 -11456
17021 -11456 -5943 -28453 -39244 -53050 -75506 -85125 -81650 -73046 -60397 -48773 -48153 -59454 -57365
17008 -57365 -73744 -69668 -29315 2817 18043 -2581 -9043 -6918 2521 7728 17421 7151 -12621
16995 -12621 -22481 -14106 -23327 -4900 -5543 -20942 -38108 -38747 -31222 -43895 -53824 -74425 -63510
16982 -63510 -37140 -29573 -14410 3075 -12238 -8881 -15838 -29077 -25735 4641 1283 -25297 -23984
16969 -23984 -3959 25867 5881 -12830 -853 -13288 -27037 -23022 -31647 -11660 1854 -1848
16957 -1848 -16521 -36245 -42594 -33843 -29020 -26204 -19667 -17145 -18558 -23920 -28282 -15713 -10395 -19447
16943 -19447 -11447 -19594 -37933 -59967 -63750 -33364 -36644 -33611 -6545 7379 16124 -10507 -10507 13750
16929 13750 2706 12394 16402 -27703 -58005 -30749 -7488 14446 -274 -6240 -7861 -32207
16917 -32207 -22604 -2669 1148 -18780 -38683 -39496 -20804 -17023 -26399 -40484 -6137 14283 15867
16904 15867 -8780 -42249 -43129 -18721 -21637 -29287 -19318 -12023 -29680 -53828 -45131 -43473 -66690
16891 -66690 -62158 -33423 -2444 7713 3851 -1146 -8451 7559 21214 17177 13273 15165 45388
16878 45388 56365 11610 -32801 -45877 -45880 -49547 -44897 -13911 -13461 -38023 -56551 -41355 -12047
16865 -12047 -1133 -32359 -46823 -17196 -22547 -35766 -60292 -34201 -6269 910 -19365 -28103
16853 -28103 -38707 -49670 -55273 -40472 -18188 9381 25945 40667 58238 29732 4875 1838
16841 1838 601 -10557 -1056 4070 5651 32571 19904 9465 30069 2614 -27190 -17636 -7233
16828 -7233 -9977 -8819 -21717 -20179 -12559 7337 1287 -9295 -34702 -13822 -10312 -21291 -19594
16815 -19594 -1563 -14465 -41416 -53091 -59066 -43808 -32615 -48744 -53619 -35074 -6188 3290
16803 3290 6680 -6079 25202 22601 -1553 -11616 -17467 -27766 -33669 -56159 -71558 -50911 -30843
16790 -30843 -8344 -4519 -26390 -57366 -61002 -52720 -24123 -13623 -21615 -19079 -11760 -6407 3377
16777 3377 33983 39163 13505 -9862 -25605 -42016 -23849 -1090 -12929 -12661 4365 16043
16765 16043 21065 10959 14978 11791 -11462 -26661 -64288 -39305 -9805 9012 9717 9523 7830
16752 7830 8711 5906 13839 16671 44807 49211 53813 30805 12060 8159 3583 6903 -9858 -1582
16738 -1582 -33896 -45749 -36223 -37065 -40922 -53737 -29574 -9684 19347 4664 -19446 -29585 -1288
16725 -1288 34929 16581 196 -13343 -9442 588 2656 4920 5704 5938 -6994 -8129 -26029
16712 -26029 -14489 -36942 -60141 -48644 -22748 -11841 7618 -5883 -1836 -10471 -17870 -16151
16700 -16151 -9158 -6761 3188 -11668 -13491 -11665 -27700 -31763 -48884 -60394 -62874 -35552 -12606
16687 -12606 -4046 -10244 -22729 -24750 -11707 -17531 -14679 -31975 -24842 -35505 -68286 -77821 -39049
16674 -39049 -13058 -1564 -13929 -31333 -17953 8455 -14913 -11584 9823 -2775 -13417 -21344
16662 -21344 -9842 -26554 -43294 -63463 -29825 -21181 -21838 -25375 -15530 27874 40113 26199 20593
16649 20593 26190 -5563 -3481 -6912 -16620 -235 -13856 -59656 -32695 -14818 -19991 -11781 6482
16636 6482 39082 34740 -19213 -24799 -32277 -14491 -26942 -23584 -7368 -14755 -48832 -47049 -25154
16623 -25154 -18271 -20974 -44366 -21178 -19750 -27695 -33121 -60902 -57161 -56463 -33871 -7441 -17935
16610 -17935 -6738 -5116 -27333 -28302 -17262 -17900 -15403 -10680 -4249 -45947 -75277 -61141 -47910
16597 -47910 -13974 31793 25883 13776 7059 19639 16322 14804 -2727 -12854 -9077 -28177 -23378
16584 -23378 2931 -20807 -35583 -13819 7558 -3235 -14551 359 1760 1447 3084 -18936
16572 -18936 -38792 -41984 -26437 -12476 -13356 -29061 -50803 -50408 -33256 -33235 -39036 -3481 24758
16559 24758 19043 -9646 -19278 -35313 -19026 -16852 -29339 -17432 -12603 -8086 14617 38687 37172
16546 37172 25135 32882 37793 16082 5117 3596 -1956 12034 25371 25302 36691 32722 6698
16533 6698 -44956 -59976 -35860 -28272 -29150 -21734 -29962 -23143 6206 9918 15198 -23542 -58426
16520 -58426 -68569 -52343 -32586 -46993 -73126 -84211 -73071 -40943 -38119 -42759 -49144 -27694
16508 -27694 -31026 -40525 -7572 -5426 -6181 -14726 -1274 -5356 -36137 -50332 -25437 -27802 -49565
16495 -49565 -57326 -63814 -44494 -38328 -32805 -57582 -51948 -52463 -52094 -46563 -51376 -62106 -72399 -55009
16481 -55009 -54326 -49504 -38645 -27431 -30306 -30398 -41584 -37705 -36865 -36853 -38151 -16967 -4111 3777 17962
16466 17962 17719 3171 -15624 -45866 -46674 -52616 -55101 -56420 -45970 -41552 13752 25430 1811
16453 1811 -12310 -26398 -21853 -6401 -16018 -8241 -8976 -38680 -24178 -9328 -25788 -41756 -32694
16440 -32694 -22582 -25750 -44337 -41868 -9667 -15479 -25686 -31355 -18066 -16997 -17213 -35197 -21509
16427 -21509 -9935 13416 33138 -1382 -9281 -36652 -42047 -55365 -58882 -41419 -32625 -33610 -11657
16414 -11657 -337 -30858 -46457 -34347 -39167 -35411 -29774 -41260 -36699 1732 -24845 -37960
16402 -37960 -45619 -50150 -60559 -63337 -39624 -32853 -27569 -14398 -21754 -51421 -34667 -16462 -6297
16389 -6297 -13320 -52940 -63547 -29709 -36298 -55702 -71496 -45482 12845 11158 -163 -28437
16377 -28437 -31239 -31369 -17386 14019 -1317 -23996 -40489 -56253 -68104 -61625 -61255 -67537 -53218
16364 -53218 -80268 -79888 -47548 -25032 -39651 -103480 -117195 -88767 -62842 -35850 -31458 -42688
16352 -42688 -28524 -3874 10418 12494 -13789 -28751 -49186 -51800 -62674 -29809 -18103 -24285
16340 -24285 -31753 -50247 -66929 -54743 -40123 -19410 -1675 -10752 -8104 5133 -32950 -44564
16328 -44564 -63978 -51469 -24977 -33251 -34872 -65388 -50134 -40150 -44341 -50261 -44651 -28674 2010
16315 2010 8959 -6847 -13169 11219 -5728 -27659 -38307 -29073 -27208 -14875 -5209 -17538 -17626
16302 -17626 -5942 -1411 -16131 -25279 -8325 -2762 -9646 -16977 -13365 -12560 -25799 -28802 -29198 -17535
16288 -17535 19622 3626 -14236 -60683 -82475 -70627 -35671 -19309 -23950 -14254 -3509 -4093
16276 -4093 28946 7099 -33401 -43761 -27985 -29808 -45199 -24994 -1307 -6787 5169 7246
16264 7246 -34995 -37365 -15890 -9841 -28281 480 33912 -15553 -35730 -23162 -32809 -29109 -36690
16251 -36690 -22117 -2103 -12079 -22645 15012 33851 13167 -6684 -6204 20484 15524 5257
16239 5257 2720 -26361 -42074 -29348 9336 21550 12254 9130 -3871 -11681 3800 -8300 -5210
16226 -5210 -20800 -7305 -15854 -27176 -30613 -35538 -50159 -39242 -3177 -3975 5982 -15999 -38246
16213 -38246 -46197 -26826 -4122 -12358 -51611 -53617 -28795 -29482 -22426 -37445 -56422 -50104 -40205
16200 -40205 -36665 -11571 -32414 -47052 -27551 -6817 -5214 -14208 -34166 -62446 -85154 -68473
16188 -68473 -68300 -67290 -42062 -50417 -46780 -37102 -41827 -34849 -43513 -27838 -3948 1824 -45002 -47620
16174 -47620 -24688 -29146 -20223 -14340 -43418 -52890 -41523 -38723 -60795 -67798 -37323 -11791 -9288
16161 -9288 -27515 -55941 -28702 -16528 13418 39675 34424 25944 11265 7972 1955 -10427 -6670
16148 -6670 9637 31622 -8993 -57083 -71525 -35368 -3035 -6057 -33106 -51018 -67491 -63461
16136 -63461 -31324 -28244 -19579 -31076 -27443 -17012 -357 5522 13897 -3217 -66296 -82079 -49811
16123 -49811 -30129 -42638 -35791 -12516 -11644 -22652 -25557 -5234 2480 -18134 -335 16647 -114
16110 -114 -17865 -14796 -10515 -6521 -19734 -17148 -10962 -5630 -13305 -9447 -21134 -20616 -9218 7585
16096 7585 -6907 -9120 -7568 -4885 -30344 -21268 3659 -18214 -20762 -39420 -54144 -48016 738
16083 738 10053 4221 -51270 -64125 -55466 -31937 -46265 -50772 -62298 -39840 -48843 -42514 -35757
16070 -35757 -27358 -40566 -28536 -30940 -40652 -48845 -36647 -19951 -17136 -12941 -39276 -32684 -8806
16057 -8806 -22523 -44648 -49067 -58918 -36198 -32011 -52010 -57440 -42361 -8614 -4774 -24495 -16950
16044 -16950 -39603 -19321 -24108 -38297 -39199 -34950 -17914 -13910 -23204 -47383 -23242 -952 -12787
16031 -12787 -5215 -6508 -34248 -48880 -41318 -50392 -23337 3696 -8675 -18392 -19747 -33170 -42632
16018 -42632 -50924 -27105 -9966 6293 36565 30592 -2664 -17767 -41910 -33208 -38416 -41823 -25922
16005 -25922 -27593 -21607 -16184 27543 46107 31393 -4078 -6266 37604 37212 23591 -9879 -10897
15992 -10897 5720 19501 9108 -17027 -34828 -21171 -12020 -33565 -28491 -5919 1742 18096
15980 18096 -25698 -43487 -18350 -21821 -12207 -26854 -42149 -30720 -12824 -11830 -23299 -25219 -15336
15967 -15336 -26953 -38308 -55253 -35687 -5403 -6323 -19301 -12310 -8534 -28042 -18207 -10816 -5099
15954 -5099 -6614 -11702 -18853 -41664 -48586 -29972 -8495 5826 20393 -10573 -16028 -3727 5400
15941 5400 -20413 -32364 1419 15665 13445 4184 -14419 -22726 -25785 2112 -4469 -44602 -43984
15928 -43984 -29794 -21964 -2897 6061 -5224 -28725 -32464 3165 22598 9875 2622 -24444
15916 -24444 -58245 -82054 -67434 -29868 -29950 -49806 -56220 -17361 2439 -26775 -36240 -20376 10241
15903 10241 21741 -6758 -34832 -43288 -41591 -30669 -32704 -35714 -30284 -30276 -33334 -34390 -28161 -41616
15889 -41616 -35573 -12470 6350 -10536 -19743 -14934 -19553 -26533 -48506 -57884 -33235 -37656 -64716
15876 -64716 -72795 -77803 -93908 -69555 -46311 -42967 -21856 -36738 -71223 -80645 -57612 -41284
15864 -41284 -21324 -8360 -7346 -24680 -24023 -46092 -64823 -35642 -23816 -31586 -40947 -44577 -30729
15851 -30729 -10039 -30239 -48983 -19474 -14004 -25922 -31780 -42101 -46035 -33803 -42782 -66578
15839 -66578 -66610 -69257 -49424 -16899 -20040 -24120 10014 21079 24480 -2553 -33 23673 41005
15826 41005 29955 -3760 -30804 -27824 -40372 -6587 -5786 -27653 -49246 -63572 -48387 -67028
15814 -67028 -64099 -47523 -15445 -28663 -33194 -33688 -18417 -29151 -44639 -49401 -40997 -7292 -16036
15801 -16036 -27594 -16239 -33468 -21149 -11599 -40418 -38797 -8060 -3286 7420 -12967 -23715
15789 -23715 -14343 4967 -9515 -34551 -36103 -14079 -5517 -4983 -26260 -23947 6613 -17233 6723
15776 6723 5139 -15029 -15172 -46996 -74857 -55056 -60453 -62658 -44776 -20699 -7679 -44563 -48462
15763 -48462 -17754 2945 384 -25694 -63039 -66789 -67593 -53378 -35157 -40731 -27300 -21834 -39978
15750 -39978 -23288 -25118 -43410 -59561 -48149 -10719 -5211 4457 21446 23207 -21677 -28878 -3544
15737 -3544 -3616 5300 9127 35949 3541 -24942 -19921 -22620 -14572 -14335 -24699 -39266 -52304 -58985
15723 -58985 -44230 -37884 -19148 -6002 -3677 8928 21114 37397 10981 3748 21351 23263
15711 23263 16267 28543 48533 13370 -29569 -27086 -11173 -15322 -31584 -22 -10880 -29638
15699 -29638 -23123 -50567 -56810 -50904 -55917 -81141 -81266 -85735 -60522 -40976 -47027 -39196 -15431
15686 -15431 -4192 -741 -3101 22413 5394 -21707 -13816 -19733 -32212 -38489 -11918 -9007 -46305
15673 -46305 -21925 -31731 -59667 -24951 7191 -3080 5131 -8840 -11706 -6746 -16778 541
15661 541 -6286 1347 7515 -6622 -5814 16600 2573 -33710 -45223 -60378 -68757 -48139 -37335
15648 -37335 -43188 -59021 -45017 -43196 -50134 -60595 -48206 -39895 -51703 -55774 -46059 -38121 -36780
15635 -36780 -37419 -30995 -32856 -32953 -34779 -32072 -22859 -20988 -15421 -1753 1764 4926 -4153 -36188 -46425
15620 -46425 -39921 -36036 -50332 -43842 -27322 -15722 -9715 -19703 -30896 -17322 -25407 -31920 10752
15607 10752 19313 -1836 22273 24390 9384 4464 -1238 -18164 -12678 -3522 2191 -18691 -37531
15594 -37531 -11028 -8881 -32910 -35592 -23047 -2322 4576 -9066 7016 7898 -10944 6053 24801
15581 24801 -2085 -9510 -18064 -42993 -26618 -16220 513 -18240 -36862 -33576 -22733 -47006
15569 -47006 -45496 -26641 -44217 -53805 -60664 -43325 -24288 -44783 -57830 -43405 -39662 -20971
15557 -20971 -17627 -35580 -44267 -51303 -67695 -61691 -58442 -64442 -70240 -59682 -34693 -18454 -24897
15544 -24897 -38533 -54326 -60324 -72000 -49994 -46254 -51917 -68063 -57869 -48060 -23002 -815
15532 -815 18534 39919 869 -14347 8277 5180 -324 -1951 -1750 -10938 -17981 -27920 -29085 -34474
15518 -34474 -44867 -36456 -2084 -4405 -6637 4609 5235 -18915 -11190 4006 -13201 -41047 -45105
15505 -45105 -47686 -46487 -36200 -40485 -35591 -41442 -48278 -43799 -49763 -79221 -59086 -48652 -27634
15492 -27634 -12548 -18110 -26448 -7616 -6159 -9355 -14073 -17838 -9589 -28415 -35260 -17264 -23712
15479 -23712 -19871 -26326 10887 20881 10945 -6584 -28766 -51483 -53768 -55649 -43137 -55090 -44489
15466 -44489 -11683 -22278 -28361 -29348 -8318 -7162 -37619 -46866 -30690 -27459 -9033 13754 25706
15453 25706 5608 -18363 -53884 -50311 -42326 -29736 -7648 -1417 -16124 -27813 -9607 -19100
15441 -19100 -30982 -23929 -18223 -45623 -58305 -42126 -16784 -25706 -32158 -56915 -68109 -55855
15429 -55855 -23886 -4977 -22881 -35224 -31594 -26095 -23685 -23894 -20573 -25694 -33833 -55083 -62602
15416 -62602 -53269 -51570 -38141 -23939 -41079 -20266 14295 -5673 -26224 -19984 -32205 -61147
15404 -61147 -52089 -22501 16259 -7012 -28455 -31306 -40329 -51661 -11450 13248 36419 29313
15392 29313 -7365 -36133 -42028 -53696 -40920 -16398 6459 21475 17936 11879 24398 11184
15380 11184 -22305 -36989 -42683 -60994 -64679 -53072 -46208 -25171 -6990 -8058 9015 35834
15368 35834 31623 -10250 -21816 -13664 10418 -21091 -53289 -31732 20265 40103 10685 -20091
15356 -20091 -17817 -21066 -44538 -64527 -42670 -15294 -23464 -43490 -58396 -65604 -51774 -28119
15344 -28119 4473 18231 5620 -1553 -2281 15826 8631 19876 -762 -37120 -8721 -5254 -18311
15331 -18311 -15229 -26798 -25851 -32200 -61443 -54191 -19750 6190 -1641 -15675 -34458 -36998 -58505
15318 -58505 -64395 -65240 -44415 -20558 -37999 -45617 -37968 -48977 -65156 -70485 -46830 -40624 -25214
15305 -25214 -29621 -25152 10078 14250 9168 8319 -16471 -40869 -64017 -64441 -38944 -23439 -8538
15292 -8538 -8719 -24630 -20704 -1192 1588 -15175 -32855 -51550 -61634 -40467 -18743 -15459 -22199
15279 -22199 -11569 -13373 -29233 -60398 -43208 -38548 -36135 -19157 -18909 -26239 -45475 -47838 -45548
15266 -45548 -20722 -5709 -8429 -14550 -26346 -71425 -69638 -41107 -39459 -34942 -35644 -46361 -59842
15253 -59842 -66313 -71653 -49102 -56095 -60549 -23824 -5177 -18304 -35528 -28590 -47477 -37734 -26779
15240 -26779 -38761 -43212 -60555 -74999 -62177 -58308 -50847 -37320 -20019 -2700 -1195 2455 21994
15227 21994 36632 16057 -15708 -37261 -29406 -24747 -9310 -8931 -13089 39926 43869 6402 -18074
15214 -18074 -39516 -17692 -26023 -30449 -13048 -11208 -36426 -29226 -25239 -8350 9041 3210 -31165
15201 -31165 -72331 -72056 -30431 -11514 -6264 -12464 -26584 -19762 -2115 -12272 -19206 -16156 -20047
15188 -20047 -45933 -53013 -49617 -52299 -53683 -68932 -71626 -55223 -23598 -36285 -37587 -42164 -18761
15175 -18761 -4264 -33994 -50006 -38445 -13301 2336 -2322 -16976 -35970 -45308 -43451 -70107
15163 -70107 -75927 -75623 -68342 -69275 -71668 -72060 -79537 -77947 -48664 -39314 -53786 -26676 -20924 -37274
15149 -37274 -40527 -63524 -77852 -87370 -87679 -69341 -22490 13369 -5863 -33241 -58159 -41397
15137 -41397 -26014 -19006 -40253 -44013 -33869 -11719 10967 -1236 -29410 -19218 334 13250
15125 13250 22759 7162 -17813 -38043 -54737 -39446 3344 -4911 -3048 -17321 -12110 -36541
15113 -36541 -19639 -15190 -28028 -18973 -25665 -22582 -38479 -45012 -41397 -25067 -14841 -14995 -5102
15100 -5102 -13112 -33883 -34289 -6933 -5569 -10799 -9488 -15942 -16089 5458 13488 15570 19036 14729
15086 14729 -13692 -35833 -36380 -37294 -53147 -56697 -41556 -21104 -16794 3825 -7522 -13742 7883
15073 7883 8988 22081 17060 -12519 -15330 -19158 -8974 -13962 -12033 -11714 -21144 -12497 -21401 -52125
15059 -52125 -53871 -58329 -43206 -18583 -32696 -48505 -40439 -47563 -34281 -5678 -15581 -19728 1264
15046 1264 -5468 -5153 -6507 -29478 -29153 -39821 -36875 -19192 -29982 -45111 -46047 -47615 -50185 -35152
15032 -35152 -28280 -14781 -19852 -21985 -18125 -20911 -21771 -55028 -38257 -36039 -42489 -19255 -34889
15019 -34889 -37584 -33880 -30192 -35086 -37541 -42198 -55091 -35447 -18361 -25035 -22310 -9972 -2773
15006 -2773 8898 12638 12204 14363 -11275 -17571 -18259 -46909 -27792 -13504 -30902 -34800 -28622 -10145
14992 -10145 -9925 245 -25521 -15672 -8455 13180 -9225 -18541 -7795 1717 14219 -3426 -24003
14979 -24003 -20192 -14220 -2185 8681 12305 -28816 -32575 -27136 -42902 -81084 -75097 -53639 -48193
14966 -48193 -40834 -58374 -59139 -39153 -33357 -49523 -46909 -25012 -16732 -9673 -46973 -55036 -50800
14953 -50800 -46615 -54712 -49421 -29773 -24890 -50502 -20601 14494 4234 -19587 -38578 -27352
14941 -27352 -30811 -34929 542 18718 -661 -42143 -40248 -4226 -21648 -17129 -5756 -27576
14929 -27576 -22050 -6294 1309 9806 7007 -19662 5982 16839 9415 -24619 -38154 -27587 -17219
14916 -17219 -22553 -4465 -40594 -50468 -52206 -52620 -42226 -29191 -30195 -44573 -32109 -63769 -62980
14903 -62980 -25979 -23001 -7627 10624 5080 -4219 -12148 -18654 -13193 7512 165 -3568 -9984
14890 -9984 -15687 -20818 -27987 -43340 -50735 -59609 -53645 -52261 -44768 -30555 -14112 12981 -4471
14877 -4471 10516 10651 -10524 -20347 -31569 -24870 -38235 -27701 -22484 -33537 -62579 -100851 -93563
14864 -93563 -92350 -60393 -13252 -4759 -12538 -12455 -13965 -16006 -18483 -50358 -38837 -7909 -16272 -4854
14850 -4854 383 -7431 -2832 2667 8040 -2747 -28267 -36896 -55569 -65858 -38271 -24566 -32883
14837 -32883 -57715 -53191 -43033 -51194 -49316 -35102 2788 -3335 -6993 2456 4907 -11250 -30398
14824 -30398 -14442 -10921 -8917 -4177 -19827 -48657 -59921 -45360 -10114 6983 6818 -7160 -25933
14811 -25933 -42616 -47227 -39381 -4435 6798 10144 20350 43467 69815 55974 29866 27269
14799 27269 21611 21167 4424 -13302 -33783 -32782 -40826 -46976 -52096 -49918 -39289 -18419 -34104
14786 -34104 -45488 -38017 -29154 -20612 197 3787 2560 -10122 -35078 -30594 -11300 971 -2946
14773 -2946 1776 4242 -5219 -39261 -43346 2002 32088 74363 70842 82607 102521 99659 58195
14760 58195 32529 859 12955 26187 -17907 -44220 -29790 -34176 -61657 -69447 -37764 -42349
14748 -42349 -38966 -33250 -56716 -70382 -32141 -23369 -18991 -12351 -27152 -6160 8940 15100 21914
14735 21914 1121 -9120 2802 26763 9375 -11290 3677 25690 20638 -2639 -145 13558
14723 13558 -9518 -8348 -2860 -10223 -28346 -57877 -74558 -51798 -21616 -16336 -30576 -36461 -43809
14710 -43809 -43779 -27065 -8319 9632 8497 -13902 -16169 -3945 -1136 20100 -11990 -7102 29350
14697 29350 30320 11764 -8308 -19455 -4134 -17347 -25599 -48666 -46750 -36182 -16547 14229
14685 14229 18687 2969 6674 5134 -519 -1450 -21686 -42875 -10657 10584 -34499 -39267 -26457
14672 -26457 -23626 -3440 12201 -27460 -27908 -29275 -40212 5204 8934 3236 -16589 -30622 -31350
14659 -31350 -29991 -38573 -43567 -23642 -384 -24087 -53769 -40287 12732 27628 8092 15409
14647 15409 -14099 -14706 -7786 -23278 -26142 -35649 -28515 -20066 -16759 -20150 -60578 -61976 -41746 -42042
14633 -42042 -60869 -52878 -8397 -19526 -49013 -31686 -32787 -27767 -33997 -41830 -35119 -46767 -24672
14620 -24672 -18529 -16150 2436 -2617 -13142 -25641 -24238 -18526 -32535 -54145 -47179 -49489 -70478
14607 -70478 -66241 -45812 -21839 -36633 -19088 3765 10035 24880 29140 -6724 -8051 -20975
14595 -20975 -76807 -103948 -117037 -91408 -48581 -17351 -2105 7099 23097 8536 4621 -5238
14583 -5238 35170 36110 33597 18703 29754 29069 2054 -21194 -24391 -9937 -37895 -53814 -44334
14570 -44334 -44673 -19178 5747 -26282 -34418 -24295 -10098 2895 -27180 -66555 -64944 -17994
14558 -17994 14180 18160 -8660 -9903 13069 18482 8139 5697 26252 -885 -31334 -49305
14546 -49305 -36448 -27009 -14706 7888 -2101 15510 1677 -20323 -46308 -57522 -55033 -46750
14534 -46750 -43576 -48689 -42648 -47887 -50122 -54301 -34115 -26713 -46173 -32630 -39797 -33746 -10548
14521 -10548 -16403 -25236 -13060 -37362 -69029 -62044 -74104 -70978 -77447 -69165 -69167 -57366 -55014 -53906
14507 -53906 -33525 -32630 -37124 -28766 -25799 -66628 -71427 -54216 -42992 -32377 -14188 -31273 -43708
14494 -43708 -36720 -31463 -11629 -7764 -16315 -27276 -28187 -22766 -26966 -48220 -69760 -52159 -37733
14481 -37733 -14672 -19869 -31798 -23320 8526 17075 11087 -27305 -39392 -22981 -36427 -34112 -36497
14468 -36497 -17979 401 6110 20712 23787 5935 -14521 -4843 -3322 -40746 -48152 -57206 -57415
14455 -57415 -44137 -34679 -47487 -58054 -52206 -60362 -56239 -27359 -31749 -46480 -46651 -58021 -55651
14442 -55651 -55515 -15374 20080 19000 -4257 7145 28713 25176 18634 17903 2679 -2375 8409
14429 8409 -18616 -19331 -17241 -27444 -41726 -37683 -7121 10500 9619 -1478 4189 18911 21229
14416 21229 18881 14106 23561 22413 1194 1827 -14781 -38940 -52975 -41456 -15233 -20386 -31574
14403 -31574 -25211 -18984 -20522 -12098 29147 44102 4531 -1310 12197 23641 -6140 -25748 -9448
14390 -9448 -28514 -33720 -18312 -15794 -26551 -17922 -8905 3825 6115 13343 6493 -380 -5908 13244
14376 13244 34320 37895 34185 15739 3756 -26888 -7670 8713 23292 19944 -3040 -9090
14364 -9090 -31118 -31309 -18958 9839 -7667 -37351 -26910 -20300 -16240 -18249 -32819 -17797 -11427
14351 -11427 20322 19050 19631 17398 -4022 -49032 -52456 -20543 -25167 -24961 -15930 -25618 -15866 -26071
14337 -26071 -26058 -32331 -50459 -17728 -21076 -31960 -9935 -2496 -21986 -35673 -27755 -5842 19221
14324 19221 3645 -12558 957 11514 -16662 -11952 1204 5450 15612 9971 -23290 -18776
14312 -18776 -16998 -15804 -23572 -27110 -18823 -14520 -17236 -32134 -19583 -14745 -23902 -43288 -59825
14299 -59825 -69970 -62956 -58135 -75403 -68991 -47550 -18074 -11521 -31617 -29829 -12648 -9099 -14060
14286 -14060 4813 -4734 19325 26307 -9346 -40031 -54840 -32775 -34877 -39464 -45580 -33658 -11487
14273 -11487 -15233 -16223 -12054 -33859 -34893 -6577 6225 12786 14586 13149 17257 -5115 -5330 -21548
14259 -21548 -33372 -27461 -35556 -20584 -16145 -22285 -47822 -50244 -20678 -28801 -32446 441 4749
14246 4749 2027 11235 8477 23320 14141 30663 6693 -14102 -19999 -35527 -24935 -6986 16249
14233 16249 18889 8642 13232 22445 42792 25862 -8118 -31689 -49090 -26262 -976 -6440
14221 -6440 -22257 -4557 -16472 -44295 -46438 -33050 -9666 1868 16333 2947 10462 7649
14209 7649 8316 260 3422 -7304 -16716 -10846 17445 23894 29345 22013 6423 3984 23251 29897
14195 29897 36464 23583 -13483 -27801 -21438 -29258 -44961 -22669 -10105 -25850 -28816 -28293 10530
14182 10530 12946 -25627 -55653 -59476 -45480 -38791 -44938 2434 8526 13716 -3735 -6341 -35437
14169 -35437 -26439 -27094 -11378 -13149 7518 8298 3434 -20836 -18364 -21147 -9363 9425 16375 5791
14155 5791 9000 7678 -3161 -29864 -39443 -52599 -59197 -48519 -51925 -32313 -38251 -28810 -3439
14142 -3439 -12 -16154 -15527 -17053 -40005 -35216 29218 50238 48113 28539 5590 -16379 -33835
14129 -33835 -13720 -26162 -14108 -13210 -20338 -18230 -10647 -22204 -22415 -39883 -57208 -48970 -14273
14116 -14273 -9167 -22830 -37436 -28739 12084 8358 3681 -4872 -21680 -21308 -13309 2231 1199
14103 1199 8922 -10643 -31275 -46267 -22884 -20003 7816 24656 5098 -23202 -29429 -19697 -16970
14090 -16970 -1627 23062 -5047 -23402 11693 51776 57306 49612 40302 -2186 -18975 -397
14078 -397 -6680 -19062 5521 35304 27235 5934 -5749 -18237 -27745 -23368 -16997 6830 24361
14065 24361 54965 52398 14023 -14269 -20051 -3406 -5615 -10691 -9460 -43689 -42083 -7808 -2445
14052 -2445 19089 39592 37134 37359 -1868 -37094 -28723 -24163 13552 3371 -30593 -9252 -8145
14039 -8145 -9025 -2676 9029 4629 7225 4991 20147 4301 -8301 -652 10406 29677 15466
14026 15466 19927 30571 18268 -1321 21401 23342 38158 28999 17789 21366 18114 19759 9097
14013 9097 -19778 1428 24534 4490 -5926 17364 35190 31562 23442 -2412 454 17346
14001 17346 15024 20186 34796 22647 18549 14659 25339 47268 46646 48838 30483 29928 50795
13988 50795 71943 64374 55000 68588 54643 24776 -1468 9071 23521 366 -5915 14116
13976 14116 64034 90036 94330 119047 130324 176170 257807 282715 277208 235782 163064 108876
13964 108876 71980 58928 50268 37991 17232 1859 7848 39023 43298 12134 435 -16879
13952 -16879 -29444 -6629 -9645 -19148 -6061 30022 47584 32627 30606 28030 21617 7632 -3792
13939 -3792 -7629 -15582 -20193 -25539 -20235 6248 9536 18214 22260 7686 1792 -17443 -32347 -24736
13925 -24736 -65 -4897 -18435 -7631 15882 -11219 -8815 8417 -5307 -16897 -23773 -35233
13913 -35233 -36462 -21600 -12653 -848 11523 -1874 -10585 -11567 -6747 12991 15621 15739 38653
13900 38653 33650 16839 17750 26802 29629 41059 32752 46063 47895 33027 33784 30887 50735 74300
13886 74300 82561 69585 56475 30454 3852 -14637 -13529 -22395 -3607 -10174 -12921 14673 24086
13873 24086 9733 6565 23078 23274 19394 31345 46818 45516 29080 21266 26475 8143 -5860
13860 -5860 1038 -12898 -7927 755 810 9774 18023 25034 41322 50502 40675 42988 71453 61345
13846 61345 43124 37140 29890 20614 8948 -12721 -15907 -39131 -60280 -69435 -45353 -16626 -6820
13833 -6820 -4480 887 30221 14220 2385 12334 -4741 -13614 -14770 -16745 -10409 -33625 -16615
13820 -16615 20660 41987 31353 -486 3215 33341 30191 40754 81339 90707 61772 51919
13808 51919 45760 37656 13800 42518 81766 67940 62086 57635 49255 49592 38151 57896 39277
13795 39277 29723 59664 91505 102274 127272 117723 123824 148505 156337 148485 134022 154949 150663
13782 150663 148279 167735 148118 158939 195543 179268 173597 166324 157581 174408 200033 219933
13770 219933 237736 228611 228162 198965 165433 163350 169157 165043 143200 168573 219534 205706 186271
13757 186271 196053 232155 271989 268825 275281 320590 357539 381533 416362 389907 369269 375343
13745 375343 347706 302475 311754 347899 331340 301251 282383 269511 246343 228410 209122 174805
13733 174805 170702 175858 188062 202686 190756 174009 168623 173680 187098 193827 218658 221795 209556
13720 209556 199401 177496 170253 144854 141178 190749 204118 191622 129799 113740 150105 155150
13708 155150 126534 106482 96545 107899 94888 94043 105142 110173 128622 134291 133883 146222 168809
13695 168809 186992 172597 174264 190123 214192 207580 200458 202456 228705 248008 234585 233060
13683 233060 226429 213269 205644 195481 176569 171924 189857 208070 215618 243592 274969 256438
13671 256438 262151 284964 334724 354640 364416 372454 367378 358897 349884 360460 379807 415785 418714
13658 418714 402121 353855 335998 283795 268658 287509 288048 279973 257715 243653 251059 262810
13646 262810 265517 278091 257220 256987 265518 295476 308260 278642 286852 307884 306156 298361 292367
13633 292367 293071 298325 293178 279344 253693 252429 243149 238835 211447 208338 222889 225142 228106
13620 228106 226049 204817 209777 209106 218849 234361 236197 206708 191749 185630 174880 207681 240440
13607 240440 257335 266315 223941 203785 203360 199966 180024 186300 201420 193574 202052 222303 258987
13594 258987 274749 284996 276643 281891 268420 285244 315479 294295 276256 282636 312383 299611
13582 299611 313421 285906 259196 232879 230176 256937 261100 239771 248182 260541 281656 298084
13570 298084 297669 285898 271954 283206 286939 297853 321325 373971 407163 386029 371128 375885
13558 375885 346522 334753 325395 308471 288957 280392 289970 295326 288072 274367 264037 261246 289147
13545 289147 308898 359899 369509 362455 364599 369350 360561 372321 388065 393830 390032 368428 382849
13532 382849 382699 366857 406681 433764 446196 431603 396926 402108 393613 363652 329329 323276
13520 323276 327085 335343 341126 342435 312727 326911 318406 322850 323656 335791 344277 325788 339698
13507 339698 364173 367211 356068 354419 363365 367201 378944 385816 379338 397157 415193 416839 432399
13494 432399 426579 383901 402509 429844 426181 405913 413854 428648 435810 430072 426136 405163 390034
13481 390034 408800 419022 443437 442692 455618 444488 454230 434556 401239 410629 426844 422192
13469 422192 427453 446140 421188 424420 446076 439877 444131 451688 424831 400654 396745 408511 413385
13456 413385 416168 401530 357873 348055 348765 407063 407143 380659 364083 372504 379406 387375 386796 381523
13442 381523 356907 370735 395654 416723 419729 423495 420382 412472 452482 477004 473979 468598 440564
13429 440564 413673 423128 414531 401769 411074 412763 400410 403386 404445 388117 386761 407443 400617
13416 400617 392745 417359 469762 491032 498558 525689 552710 552099 535635 552488 592985 616531
13404 616531 607328 583960 568962 587651 598965 590666 574621 587545 625998 661579 663499 638777
13392 638777 642667 647321 695865 707549 744126 778242 803671 837770 880623 918535 961530 1001798
13380 1001798 1012856 1024313 1046684 1043652 1044109 1068396 1103488 1146610 1193083 1227512 1266889 1279996
13368 1279996 1317487 1400414 1488960 1576855 1702891 1809289 1906388 2014024 2152701 2293949
13358 2293949 2466538 2641138 2853234 3119181 3404500 3746852 4153965 4656012 5256622
13349 5256622 5981257 6858747 7926750 9216846 10812920 12723357 14989827 17505675
13341 17505675 20147056 22859525 25392842 27546540 29306717 30649730 31541520 32065179
13333 32065179 32260485 32130076 31611497 30659568 29272996 27536378 25609942 23725845 22142198
13324 22142198 20982947 20389350 20411932 21017260 22245598 24143835 26797004 30250321 34508742
13315 34508742 39478070 44901487 50439661 55659625 60177011 63714401 66047108 67058320
13307 67058320 66716795 65162975 62651053 59393297 55614632 51451822 46964485 42325511
13299 42325511 37772277 33629277 30057514 27158561 25052523 23720857 23060794 23043940
13291 23043940 23657680 24778979 26373143 28318197 30383317 32280072 33800487 34773404
13283 34773404 35223356 35141289 34669344 33978321 33149409 32211765 31101450 29743851 28086593
13274 28086593 26098463 23906295 21609291 19397578 17459370 15906603 14754929 14020956
13266 14020956 13642747 13653281 14054256 14816776 15952237 17482166 19348345 21536194 23929463
13257 23929463 26370678 28654336 30670138 32322909 33626347 34658759 35501731 36182230
13249 36182230 36654869 36860749 36644371 35945278 34673229 32904746 30830048 28669464 26718669
13240 26718669 25221715 24355219 24226970 24875020 26256343 28399823 31300615 34933370
13232 34933370 39225839 44074701 49256736 54386796 59262915 63624790 67318447 70232293
13224 70232293 72246883 73199344 72900791 71212432 68108040 63766557 58505018 52689336
13216 52689336 46703905 41003280 35933265 31710039 28459432 26189307 24784110 24071422
13208 24071422 23971315 24433778 25449751 26975856 28845763 30944289 33040123 34887239
13200 34887239 36264341 37106932 37419247 37260285 36709455 35824637 34586428 32923909 30786670
13191 30786670 28185809 25207535 22070054 19039190 16271263 13880595 11916052 10338926
13183 10338926 9075232 8088743 7283939 6612193 6047562 5568718 5137040 4770328 4449452
13174 4449452 4209165 4017662 3830792 3622847 3413825 3189057 2966492 2727555 2505664
13165 2505664 2349133 2238174 2139680 2027924 1936136 1851574 1759220 1656685 1586501 1543478
13155 1543478 1462584 1409525 1382693 1331213 1265172 1226342 1203715 1197173 1150304 1120874 1137062
13144 1137062 1167661 1157864 1115514 1077735 1059009 1016159 984527 957354 938706 933893 966887 990239
13132 990239 1025410 1091740 1163229 1284637 1379105 1492294 1577336 1561066 1437597 1290528 1112088
13121 1112088 981024 911645 852902 829972 804504 747141 725172 684703 643375 632544 607902
13110 607902 584663 550114 541660 551444 561119 563082 570186 551731 507478 501139 492596 512163 519147
13097 519147 527831 546635 561337 573142 576480 583009 577666 560606 578749 620614 692826 762321
13085 762321 837030 915448 1024144 1139476 1226032 1270997 1194901 1029118 851515 714513
13075 714513 603128 526887 458891 403905 401749 403490 376807 374431 348729 311143 269254 264143
13063 264143 257525 264423 256892 243224 244101 271304 275120 256757 242656 276906 278020 232873 218180
13050 218180 212087 205655 212769 226613 214724 179119 193072 202314 209139 238404 269336 312000
13038 312000 360808 370498 363733 383649 380033 341271 308301 236577 193947 159030 156132 147839
13026 147839 135932 135981 136007 132161 139357 124424 99701 86949 85447 79839 84040 68178 78598 110219
13012 110219 92824 89268 83656 96591 75651 52893 44880 41936 38989 18597 883 -7711 8075
12999 8075 12439 13444 52258 41240 36161 53171 25181 14511 26490 41466 41477 29293 34237
12986 34237 30898 37909 44563 51245 62015 50149 25996 18807 45450 62090 57831 36999 34326
12973 34326 38495 34936 25874 40212 36395 31186 44785 41669 52814 33234 9766 11322 16247
12960 16247 36298 16218 16484 37895 52278 70546 68116 51253 48227 43142 31789 14432 36216
12947 36216 52352 40419 36683 13291 10369 29759 16165 -4734 -15054 -39861 -39207 -31530 -23746
12934 -23746 -21640 -9244 -8589 -28601 -18480 -26558 -28583 11885 24035 8536 -1827 -23176 -32069
12921 -32069 2029 -2782 -23914 -4479 -5163 -15889 -13174 -23579 -36020 7623 61500 80120
12909 80120 77946 105598 129323 108494 104747 127916 157613 169363 195388 218435 261558 321773
12897 321773 379252 430864 482084 550449 610982 627707 641597 616871 577240 545606 512183
12886 512183 494589 464127 435204 422457 420171 430259 435655 393843 348170 337695 341514 360118
12874 360118 361326 344323 349351 365589 391527 442113 473683 507142 563054 607782 603167 634312
12862 634312 707084 761153 804328 862071 902025 954856 1021491 1061153 1085842 1079191 1043723 988266
12850 988266 944567 902517 850050 774261 718652 672460 599081 550758 528992 531582 495091 488523
12838 488523 495524 457291 406384 364102 370054 361165 319422 290856 296596 324487 330310 331569 301585
12825 301585 279443 277951 324513 365534 389213 426222 472800 497202 549359 597687 634972 689138
12813 689138 706300 672076 634859 609024 531325 479303 474814 445284 411580 387136 354051 332076
12801 332076 317660 303159 273288 265631 267891 256536 244716 208203 202370 197913 184744 199880
12789 199880 209419 223159 264450 287692 302459 324275 335232 355238 346057 345863 326614 339533
12777 339533 372349 382101 351069 339555 363658 355844 332220 288502 284552 249298 198197 154641
12765 154641 130598 141966 164428 191100 190137 212903 244200 259702 235917 204507 192184 187482
12753 187482 208062 238424 232735 234882 215941 221092 207239 190309 193536 209073 211298 194836
12741 194836 147678 103058 86944 59124 36010 40614 35193 49687 68899 92269 89057 82364
12729 82364 68740 53887 37888 10771 10115 48012 73378 80803 74636 80229 68272 69408 63686
12716 63686 44221 50494 54931 64539 68419 52954 53225 38910 38359 28963 6929 -5120 -3578 4885
12702 4885 -8230 -11159 -1612 25513 53195 44448 45403 31449 45629 62907 59776 43750 42202
12689 42202 68183 56966 34671 30346 25611 46440 72465 49566 17155 -1952 -1076 37356
12677 37356 24669 35194 52378 38406 38044 49758 38170 27744 25569 53764 58622 32177
12665 32177 22033 -1515 -30686 -9041 23955 37971 58039 48180 45308 53605 47853 56441 31557
12652 31557 35135 51439 49375 10625 -141 44307 60033 49678 55296 60454 44502 35850 71939
12639 71939 54966 27938 13221 31117 23106 25034 21898 24571 59411 58913 60731 57652 32168
12626 32168 11755 9403 20996 41229 27800 18077 11447 21137 6486 20131 33946 43056 43077
12613 43077 41182 37520 23376 13447 7803 24445 50143 52066 44314 34953 15415 11742 21214
12600 21214 17058 19809 33025 39421 60907 60308 72329 58014 46622 36036 42560 38682 61074
12587 61074 59570 55549 54479 24991 15705 10678 -1983 22469 20709 18122 45010 68739 65022
12574 65022 60135 74688 55871 7128 10972 46109 45292 11720 -6114 -17625 -32837 -42246 -34368
12561 -34368 -8771 4238 14431 22828 35779 44622 47874 55415 35283 4740 1927 26195 7486
12548 7486 28005 48342 52125 54749 64295 50036 34852 11053 26963 43916 49675 46157 53432
12535 53432 25320 10252 32720 41460 42101 23417 10062 5042 6647 11094 -16760 -41536 -26346
12522 -26346 -17331 -9475 -2696 7406 46758 45471 25545 25482 56170 41699 34238 52692 51754 74496
12508 74496 86500 95899 78130 55656 57918 47247 37539 39814 58476 53439 64626 74887 67683
12495 67683 48819 35084 38353 50754 62381 61374 52190 67910 88236 100749 77941 50787
12483 50787 55868 61634 73059 90633 53404 29148 38965 55844 57095 51730 56225 60544 30437
12470 30437 -7044 7718 15033 2726 15823 64648 66065 35238 43897 35388 47640 68933
12458 68933 95574 83265 14181 5160 6392 5151 17973 29651 29009 33530 30476 30194 35733 60524
12444 60524 62192 78117 70315 52685 31779 30029 16837 27344 17597 3585 12781 22732 23743
12431 23743 11316 13646 10211 37001 47067 27329 33452 13377 22718 60147 64386 51466 56165
12418 56165 54217 33033 25014 18572 21644 37040 44973 34594 18934 46600 68218 47250 28289
12405 28289 44067 28277 12679 2423 20625 16965 20437 16639 15591 42428 69862 42211
12393 42211 14589 -28963 -54484 -19460 9918 -3711 -25541 -5753 -2356 -14420 -16413 -17682
12381 -17682 -15199 12527 23778 27590 16653 38256 60700 52232 49687 63006 66699 35827 19810
12368 19810 41715 41830 17948 9504 23660 31849 25700 35923 56749 71500 77097 66089 51883
12355 51883 49769 19781 19625 16776 46260 57740 65541 68859 58212 45339 27349 32963 54033
12342 54033 61706 69442 64979 74517 79751 66120 74474 69663 43149 42947 50352 66495 60022 57355
12328 57355 75094 66975 77834 80370 70299 68535 73395 92066 87648 57524 48608 49787 53556
12315 53556 65092 56972 48788 43202 33094 42949 28029 39397 35645 35211 38826 35219 36772 77223
12301 77223 100310 81887 71817 37227 51053 31747 15815 23277 9639 3876 9844 2453
12289 2453 -831 -570 -13348 -28362 -3516 1807 25442 39656 8195 10640 25042 13010 21474
12276 21474 18702 -3388 -621 -22890 -8502 25284 14083 1424 4350 47911 75263 66108
12264 66108 47062 54557 57763 67352 72032 47667 44169 73471 78256 69754 76774 58532 63720
12251 63720 72026 81565 82035 62021 48302 43872 62055 77861 98546 75916 41753 51743 69727
12238 69727 71330 66385 63007 41056 40531 90148 115746 102756 89877 96460 89440 94932 100278
12225 100278 119632 99154 77392 77466 67218 64722 56004 48320 46909 47974 61760 81168 93472
12212 93472 101635 73833 65306 82381 82777 76167 36161 21073 14038 65639 80325 82167 116857
12199 116857 114967 106815 115405 110726 120929 104788 85760 76903 85278 90353 63506 57304 66584
12186 66584 84067 85332 61592 39257 32835 14684 21554 21474 36051 17246 19790 45273 80346
12173 80346 78846 46761 26175 20140 36775 52086 52761 63169 72544 72929 40424 18198 21007
12160 21007 41750 76206 103366 87900 66066 45968 43468 48572 49891 42284 51537 76332 61114
12147 61114 68177 69097 69624 56823 63762 41943 62274 49838 49087 50928 33175 42550 20603 15434
12133 15434 15434 36788 70703 93167 79140 73211 80695 74540 84109 66673 62697 73934 65877 41551
12119 41551 22359 33984 41981 43120 74620 83229 88302 78863 69252 69068 44451 36340 42251 60389
12105 60389 96593 102115 115906 97901 68462 22138 14579 47649 56736 83613 84999 74423
12093 74423 88593 94712 69204 55643 73991 41363 20664 36482 51438 51353 41976 58256 62452
12080 62452 75096 69037 56810 94963 91603 40040 13007 18666 38002 43007 58292 64099 51463
12067 51463 77690 97607 74309 57816 55286 74576 118701 113452 114385 87337 90475 110321 109989
12054 109989 94282 90739 93727 102136 115157 97366 88882 108884 117972 100226 87818 104187
12042 104187 103073 95437 101934 83467 71848 52663 39132 46184 35644 48280 50706 46717 57052
12029 57052 76685 73979 80893 76200 49724 62656 56337 74685 114265 111618 130582 164099 163676
12016 163676 182297 207967 226311 246293 280973 319476 335595 323524 306050 297034 241535 195662
12004 195662 171982 161634 168424 160960 181316 220034 235436 236037 260561 281868 336962 384007
11992 384007 415800 434308 463238 495076 517081 525983 507389 494424 461896 420520 350449 284152
11980 284152 244938 207632 204807 188611 161824 152103 133389 116417 111518 125237 141254 129303
11968 129303 93431 75110 101816 129027 109105 89637 98503 95000 135522 166132 172954 169967
11956 169967 165607 181199 161245 163853 202051 270447 316488 353895 393835 458804 571061 680750
11944 680750 804233 956111 1111891 1187169 1224878 1243064 1212987 1120503 921139 751154
11934 751154 631625 551507 531014 510697 481514 515747 592708 638643 674824 689635 657473
11923 657473 632121 612066 565115 531448 493936 428746 358487 351188 340456 319649 328372 361340
11911 361340 363483 364555 375079 420606 457710 456374 474345 507065 506594 499416 512066 538947 622525
11898 622525 713925 796788 881804 953932 1042186 1058615 992036 867328 722770 590289 499979
11887 499979 409580 342560 305718 256868 228877 230854 228750 252662 241796 243809 225500 202305
11875 202305 238041 249440 248329 218038 192365 215897 252272 253482 242925 257338 261212 254853
11863 254853 263293 315721 340606 383801 424443 452279 448552 450999 451376 456701 484350 505081 504679
11850 504679 547131 618629 682051 714037 730186 707703 698463 683405 644455 629533 612057 560991
11838 560991 532733 532207 524840 488064 447773 449064 446075 429286 420314 416675 417322 405060 387433
11825 387433 339605 314082 309871 301688 268279 259163 257479 261118 249096 247103 248444 261414 270738
11812 270738 253662 250342 270214 290232 353825 392904 406445 446131 522538 604434 699008 799357
11800 799357 883397 955265 993080 986217 921611 809827 666216 547775 447666 387090 389028
11789 389028 404679 398384 399524 400773 385225 359101 367310 395047 383532 320130 257108 229933
11777 229933 225665 238519 261641 246042 230389 249320 291812 323341 342085 366913 386834 401502
11765 401502 426671 462304 460401 452217 466862 497268 559827 626156 705782 796551 924273 1036531
11753 1036531 1077034 1057908 1028599 964833 851920 704889 580707 524096 486410 452569 436459
11742 436459 429434 424523 414417 361565 334021 342083 315769 264937 256385 269389 265197 253702
11730 253702 239358 252661 267767 272048 289626 285791 308887 298491 289483 296096 302975 286402
11718 286402 311288 316727 306587 329068 379947 406808 447150 469480 471800 469618 501020 537152
11706 537152 538576 512933 476827 426094 351043 311306 281512 272888 283006 279748 284390 292572
11694 292572 299275 315345 315222 344269 376206 374055 384113 394655 413895 427853 412900 403201
11682 403201 393419 384813 388007 404763 398549 392688 415591 408333 409428 433467 425024 465970 491423
11669 491423 499245 495098 484298 440894 419141 438190 447297 448073 458633 497985 494725 477006 466061
11656 466061 474578 467475 447971 480412 505911 483128 497109 509019 530911 552372 586602 574848
11644 574848 581241 617978 661550 650923 625963 652952 686063 697889 696544 733347 782475 772358
11632 772358 732979 742261 759444 766457 822127 896930 942622 992833 1038288 1069151 1114628 1150409
11620 1150409 1209650 1257052 1267775 1302239 1358887 1426302 1495450 1541564 1581179 1660151 1754194
11609 1754194 1880545 2011040 2137304 2301898 2501211 2724474 2950614 3243438 3587777
11600 3587777 3976479 4477408 5071393 5851645 6842890 8044536 9585891 11472819 13774985
11591 13774985 16546144 19777582 23453640 27692906 32463944 37567959 42458644 46206024
11583 46206024 47667255 46222494 42482311 37705530 32974317 28886588 25664794 23348680
11575 23348680 21951881 21492547 21976523 23316603 25453595 28374056 31985423 35983996
11567 35983996 40018206 43630194 46333451 47558375 46733223 43764735 39280443 34405756
11559 34405756 29896440 25998160 22555029 19429954 16694548 14378623 12442240 10862239
11551 10862239 9595394 8595374 7814789 7191734 6669438 6293193 6004128 5828923 5683392
11542 5683392 5581530 5539857 5544876 5584426 5673330 5819560 5977212 6120800 6294187 6540823
11532 6540823 6916755 7362433 7913200 8618358 9537691 10690942 12135538 13965753 16237188
11523 16237188 18986170 22246435 25977739 30145050 34720524 39558252 44363282 48614727
11515 48614727 51586358 52595761 51606560 49384766 46747893 44254276 42202557 40864192
11507 40864192 40658716 41881560 44524680 48629972 54098590 60800352 68311326 75755639
11499 75755639 81971320 85922723 87155550 85843085 82155986 76214781 68495763 60309054
11491 60309054 53010673 47373870 43542449 41325494 40447462 40642706 41730011 43330221
11483 43330221 45056225 46585509 47632257 47822515 46715995 44020947 39914140 35105824
11475 35105824 30356631 26177890 22587555 19531756 16966714 14869996 13153722 11730556
11467 11730556 10580929 9648959 8866343 8227449 7667247 7235939 6889675 6602441 6372143
11458 6372143 6180032 6006109 5862875 5722846 5605718 5565042 5583681 5669275 5809862 6004070
11448 6004070 6275767 6622897 7095558 7721186 8508540 9561318 10886500 12548818 14577492
11439 14577492 17058860 19946559 23226807 26782704 30516642 34378933 38308917 42006097
11431 42006097 44773112 45734846 44355176 41102169 36931340 32715393 28823352 25532320
11423 25532320 23077623 21568720 21043793 21437489 22715224 24824328 27648669 31141555
11415 31141555 35054969 39102439 42894118 45833872 47112595 45939483 42118145 36494238
11407 36494238 30582055 25409589 21230483 17939293 15329641 13185006 11360064 9785526
11399 9785526 8460554 7391328 6497956 5776806 5204410 4733348 4329229 4002541 3715585
11390 3715585 3486721 3267830 3061405 2868265 2727594 2599067 2480572 2377653 2289477 2175072
11380 2175072 2119204 2056691 1971488 1872208 1801300 1727714 1673181 1632572 1562805 1500280 1426588
11369 1426588 1355288 1314392 1315209 1289266 1214093 1150936 1094742 1042669 1024481 995229 928310 868912
11357 868912 850622 813388 793365 794943 808718 774140 749760 733407 696016 655477 636099 630457
11345 630457 592238 586764 595098 572110 559466 549795 529651 527522 522617 519039 542584 536134 504059
11332 504059 470780 480548 492951 483611 451790 465642 482382 464755 466063 476783 471586 504622
11320 504622 525187 495308 498026 538609 548369 523536 476520 419386 418532 416058 428896 460731
11308 460731 455542 439109 436930 432914 435391 425959 415309 398284 343916 325386 331888 305706 294573
11295 294573 276158 275906 278979 287725 293681 295006 287726 295480 295006 293854 294746 310769 295964 278314
11281 278314 265990 255468 267077 255837 250052 229600 236532 221325 233416 235162 191007 164846
11269 164846 154698 135220 151897 170060 179978 183048 198454 186467 158430 160826 135294 123648
11257 123648 117190 89725 96520 119200 133625 161240 178645 166315 160896 155961 145744 150113
11245 150113 152663 153815 155368 163620 178053 157098 148365 155885 137534 115351 116090 132267 143457
11232 143457 131383 112863 129152 138123 140224 141639 145016 170675 177630 176935 147196 135512 129470
11219 129470 143359 196623 180884 165538 134788 131788 139651 137098 153532 165749 148644 104818
11207 104818 93628 90616 106360 111737 140203 153828 143782 144387 146403 139936 150901 136525 130064
11194 130064 99929 106173 119778 120260 123093 113679 77620 82268 131774 127899 85857 87145 107409
11181 107409 126018 155389 141705 130515 134616 172147 177900 141859 137774 142924 146356 134351
11169 134351 130729 146981 156808 173772 167264 163443 159793 139122 144960 172833 219709 257842 235297
11156 235297 251434 287802 323939 347891 341773 380585 422141 413615 400704 368938 372493 380207
11144 380207 364423 318085 274108 275202 269570 292565 266711 244970 262823 302010 363048 413630
11132 413630 443166 462441 482434 488058 441477 373488 335594 326046 312101 290785 258796 235235
11120 235235 237877 226180 226375 245098 245722 274166 261254 260686 274098 252750 250252 255727 249863
11107 249863 271907 287071 254649 245026 223349 240191 252465 269930 240869 232314 244665 248426
11095 248426 215406 217594 240649 285180 315210 328134 345408 326449 329824 371407 402075 453901
11083 453901 496294 539769 562962 549642 542743 493030 455466 430973 446226 455542 469286 483958
11071 483958 496928 536220 562213 610471 662086 720822 758954 743395 748223 785613 803631 765478
11059 765478 737449 682607 621292 582197 570999 525739 493433 485178 489276 499188 513764 517049
11047 517049 501356 495930 504184 501753 476126 447657 422587 388627 372565 349799 345907 352733
11035 352733 336372 345493 353842 336786 310874 299393 296296 314823 336414 333846 335995 321771
11023 321771 318916 330085 336025 333211 322470 315057 338373 323371 312135 332705 313538 298698
11011 298698 277305 254042 264211 287586 320690 344445 334018 338344 363147 403125 438131 463079
10999 463079 521147 560098 598696 619986 609304 581727 540872 531176 514877 500767 476082 454962
10987 454962 447599 448346 451685 460435 457956 482207 492195 521048 515791 531151 537444 524460 493517
10974 493517 441706 432349 422982 413397 402678 370732 338680 341116 348252 344235 342683 342891 320339
10961 320339 311521 301775 259375 233007 237103 272101 293535 306080 300228 274319 240865 226604
10949 226604 246616 279660 286843 260792 211785 185333 162933 158992 158814 148411 169181 215652
10937 215652 246308 252433 239218 239113 250181 244104 250089 256065 268483 284273 299187 276743 266557
10924 266557 267398 251170 246469 243765 261110 252565 246517 245147 231452 232966 232354 221273 208053
10911 208053 204861 225328 269331 261761 252252 263318 273682 265129 289099 286640 288949 294217 298382
10898 298382 282172 277796 264796 242691 233626 211632 183995 183380 185532 184958 179231 183774 209742
10885 209742 220643 231516 200968 175169 191189 184438 182946 216091 250890 226876 186166 171926
10873 171926 192934 191334 184954 183843 208808 207663 166127 170466 170485 157804 172556 210196 243592
10860 243592 239186 251263 229505 227485 223259 224875 249362 245006 212086 207794 199121 199701 213962
10847 213962 217517 238016 211863 217244 232082 254631 286808 281961 280860 267590 254175 269482
10835 269482 265458 277326 301646 287746 298189 308587 286155 289350 290079 273883 285265 326114
10823 326114 341177 309157 307217 317622 313082 325673 340071 351949 337917 326439 333742 342459
10811 342459 345088 339285 331655 344376 355873 335822 339413 346095 329393 328523 327770 291279 251691
10798 251691 206100 203881 188486 205386 219781 223197 201320 190463 213424 242448 239891 244055
10786 244055 222652 248521 295869 301981 292882 283910 284596 270645 279274 276445 269038 288971 299208
10773 299208 304232 301841 292218 312793 337035 363435 367262 344159 341354 323364 310662 324400
10761 324400 332948 330846 339357 370088 372998 402468 400379 389016 390766 424693 437091 431080 449078
10748 449078 496767 517914 526631 590472 641848 662583 717646 763679 832170 972298 1150233
10737 1150233 1324864 1534974 1817822 2196502 2576521 2914280 3181076 3381383 3496250
10728 3496250 3457569 3255164 2952230 2611529 2278503 1931381 1618390 1374662 1219694 1130371
10718 1130371 1080412 1026469 994128 994697 1031238 1066528 1088051 1111813 1147267 1213341 1306309 1363931
10706 1363931 1464512 1578063 1732560 1932414 2219905 2605165 3058527 3634973 4297553
10697 4297553 5095418 5979366 6810965 7522948 8009344 8211185 8203218 8172545 8186958 8173444
10687 8173444 8062270 7792660 7248429 6538894 5832992 5272514 4867864 4654260 4623802 4716414
10677 4716414 4935818 5326485 5937349 6781238 7819608 9128635 10682430 12418439 14172054
10668 14172054 15634595 16604816 16999072 16963354 16764825 16592847 16417883 16070873 15306212
10659 15306212 14019257 12376860 10674134 9170159 7979353 7150989 6637154 6346214
10651 6346214 6210060 6218469 6434477 6813672 7326402 7985609 8806237 9730642 10698663 11568212
10641 11568212 12196338 12546274 12720368 12832822 13001349 13287610 13608448 13844121 13968106
10632 13968106 14101040 14421240 15119693 16200838 17522024 18793089 19658193 19907194 19733299
10623 19733299 19452207 19304844 19271855 19081885 18421294 17187365 15592752 13932864 12545313
10614 12545313 11547752 10971066 10756839 10897187 11415039 12313640 13561893 15249500 17425410
10605 17425410 20200398 23532621 27275077 31052454 34338509 36564486 37506031 37431421
10597 37431421 36914634 36487802 36140698 35437248 33794246 30940547 27185331 23166303 19508223
10588 19508223 16616349 14549981 13155779 12282945 11814657 11695594 11884626 12425653 13271641
10579 13271641 14416656 15845019 17515684 19265079 20860782 22012964 22565218 22535818
10571 22535818 22248429 22031793 21933562 21800276 21259742 20149426 18654403 17167562 16050506
10562 16050506 15394708 15141694 15092827 15035778 14806325 14416694 13993993 13680482 13524427 13298185
10552 13298185 12761996 11826441 10655633 9433592 8388612 7610031 7123836 6886978 6852815
10543 6852815 7006570 7362095 7999938 8856687 9988498 11461263 13265279 15316814 17415980
10534 17415980 19254669 20569156 21197851 21236729 21003228 20766495 20582952 20263334 19445019
10525 19445019 17967163 15896258 13570047 11413907 9657384 8376554 7521412 6952012
10517 6952012 6624310 6504207 6566397 6793313 7197351 7765372 8539047 9490065 10443081 11248044
10507 11248044 11837756 12094706 12040377 11823527 11599862 11404662 11139711 10676615 9884427
10498 9884427 8800283 7595386 6468028 5548737 4816918 4247230 3807263 3489665 3229202
10489 3229202 2996071 2802213 2631862 2479588 2344576 2254020 2138493 2031059 1908693 1805546
10479 1805546 1690879 1602575 1544054 1464725 1399391 1361380 1320650 1287671 1227193 1169987 1130858
10468 1130858 1135755 1109930 1069889 1060799 1087879 1102346 1156124 1257549 1336914 1391442 1467905
10457 1467905 1544342 1615981 1677049 1700739 1674951 1637594 1575625 1526503 1496508 1478582 1452916
10446 1452916 1454341 1463905 1506787 1560226 1619360 1566895 1444542 1377012 1337657 1322077 1310051
10435 1310051 1284548 1283435 1251356 1254396 1253108 1219658 1221602 1221713 1227824 1255929 1276750 1298280 1336553
10422 1336553 1345594 1362033 1403199 1429914 1443325 1445736 1449791 1475663 1477326 1487643 1524608 1570564
10410 1570564 1593861 1632407 1690210 1724806 1793733 1845371 1900570 1978019 2050350 2128307 2188504
10399 2188504 2251491 2323683 2423930 2552662 2681731 2835752 3028751 3272351 3542290 3865550
10389 3865550 4195725 4495408 4747882 4979512 5149531 5191440 5122729 5002248 4883512 4749249
10379 4749249 4603882 4489096 4413532 4414352 4498202 4651182 4839403 5050181 5287829 5560078
10369 5560078 5870586 6212579 6575573 6927866 7260687 7559941 7834740 8169459 8546067
10360 8546067 8972804 9486664 10114107 10905341 11859012 12943894 14195354 15665416 17326699
10351 17326699 19163406 21188155 23419035 25888084 28659100 31863643 35700398 40472957
10343 40472957 46541776 54447360 65040415 79328019 98547493 124031989 157235887
10336 157235887 199946360 253506375 316801574 385187617 450957988 504293535 541034292
10329 541034292 560218623 554714754 517622801 459211588 395393304 331302947 266731992
10322 266731992 207760742 160820638 126572946 102339448 85050151 72317668 62613533
10315 62613533 55050772 48974277 44020576 39897784 36399035 33387834 30759061 28352098
10307 28352098 26117729 24085451 22158978 20413137 18825340 17408212 16139079 15025929
10299 15025929 14080000 13271351 12501508 11806360 11214303 10661704 10151448 9648155 9142096
10290 9142096 8704738 8304023 7959186 7634444 7332391 7106215 6909882 6685655 6481421
10281 6481421 6260952 6030290 5805588 5607597 5391613 5155672 4930755 4723196 4544695
10272 4544695 4381198 4255519 4126688 3979600 3830094 3687549 3534581 3415022 3287011
10263 3287011 3176938 3111713 3022386 2943610 2870218 2796326 2719913 2655825 2627543 2614082 2572738
10252 2572738 2529808 2484241 2453032 2440908 2424350 2385336 2347830 2270986 2176150 2113719 2068788
10241 2068788 2037353 1977561 1925686 1915860 1878365 1831792 1820138 1809132 1799735 1801085 1756085 1714205
10229 1714205 1672794 1624865 1613192 1585962 1583116 1541437 1492672 1443909 1428842 1419393 1428535 1398220
10217 1398220 1385219 1399510 1400086 1364027 1342336 1306684 1283920 1301875 1311975 1360356 1451251 1532783
10205 1532783 1606503 1682623 1735191 1788153 1812876 1787928 1734109 1694973 1631922 1578611 1516347
10194 1516347 1461199 1411813 1355215 1274619 1245048 1200027 1146871 1108869 1091128 1072493 1013054
10183 1013054 973429 932566 883561 854733 824984 784709 723583 680511 660733 632153 622434
10172 622434 642528 645640 653114 678441 714495 735101 739537 747217 757530 767005 768277 795850 843137
10159 843137 858733 852745 867728 836506 800425 774166 728835 714921 744024 738003 719366 718473
10147 718473 700028 676422 650473 648559 651951 661570 667508 681567 705086 726190 757786 797826
10135 797826 788380 765683 756569 731388 719577 710387 719577 737163 751942 756785 755095 748307 711818
10122 711818 687592 685126 647329 624465 597235 606059 600866 595216 607561 616697 643644 661556
10110 661556 655428 660326 652549 657570 670046 677903 681597 650475 652452 676826 649870 650529 632298
10097 632298 628869 630008 616782 637250 653433 645928 656660 674490 664253 659814 661414 635473
10085 635473 624429 635032 638928 646001 633420 621538 605816 615035 632916 636078 679006 718650
10073 718650 720295 681162 625574 556381 499163 449909 442612 436009 403772 353851 322896 309400
10061 309400 342891 378854 375620 355704 350345 363842 384301 418454 433271 443238 441871 462242
10049 462242 500449 510872 513682 549783 580310 602850 654215 661434 604318 551618 500300 506926
10037 506926 518859 516550 506193 442320 451282 456140 439356 432120 437923 416245 428612 445834
10025 445834 447603 518687 642296 818669 992795 1134039 1046372 808806 605254 495002
10015 495002 432092 438398 458574 432868 408749 423478 458662 465712 449199 427915 449881 476150
10003 476150 494541 504705 508787 514066 494119 505715 544090 576282 593383 595503 590222 600664
9991 600664 610857 589886 586775 600234 611175 611656 620448 626050 600908 611823 620064 631133 668090
9978 668090 669689 651226 651661 665999 699254 699056 684886 685144 694194 699561 732809 753108 776998
9965 776998 828148 855598 874766 874296 856798 851285 902421 950914 988882 991172 943773 911221
9953 911221 897699 915585 902205 881520 866417 841374 854979 849302 870231 891373 910439 913773
9941 913773 919168 931746 981005 1058350 1111491 1142088 1216899 1341889 1491709 1652834 1841319
9930 1841319 2122546 2446076 2805686 3183952 3545867 3816960 4025316 4129162 4062833 3824857
9920 3824857 3486693 3141461 2811614 2522019 2278853 2072212 1943096 1848376 1744189 1669913
9910 1669913 1627537 1600789 1610425 1606962 1606087 1604984 1641569 1666249 1665387 1671369 1711885 1781639 1867805
9897 1867805 1936437 1992364 2034288 2097160 2172962 2266026 2409180 2546553 2676469 2816218 3025030
9886 3025030 3310891 3591930 3959735 4387471 4900391 5511775 6201439 6977853 7851043 8824142
9876 8824142 9877877 10999082 12120826 13222456 14229941 15045604 15617853 16066849 16423200
9867 16423200 16758994 17111780 17502065 17857888 18088823 18149308 17965883 17656617 17431915 17507030
9857 17507030 18032554 18971269 20359699 22115446 24122441 26284813 28491993 30792582
9849 30792582 33156178 35505998 37771853 39802644 41353206 42218045 42388613 41954338 41079807
9840 41079807 39952226 38809912 37676987 36628829 35614991 34502794 33268495 32045524
9832 32045524 31129547 30797567 31194149 32302387 33978810 36028608 38121773 39995566 41598075
9823 41598075 43038828 44402504 45747349 46837620 47148112 46397117 44837639 42975845
9815 42975845 40977706 38806225 36463768 34074620 31800863 29803910 28125482 26667855
9807 26667855 25370355 24271539 23452729 23013263 23003516 23378075 24032769 24795044 25466219
9798 25466219 26028003 26429664 26722459 27050495 27597674 28362745 29330281 30486209 31718872
9789 31718872 32815855 33451934 33483816 33054891 32445877 31988672 31881571 32011189 32239402
9780 32239402 32450459 32565745 32488268 32120197 31511590 30807490 30211796 29995953 30355354 31406952
9770 31406952 33060875 35188820 37558032 40073058 42746417 45638606 48742606 51884798
9762 51884798 54712044 56916340 58436991 59316798 59604323 59241900 58271403 56993039 55657366
9753 55657366 54349409 52935840 51216875 49123430 46801953 44576320 42812647 41877671
9745 41877671 41865899 42727236 44225954 45997426 47732355 49251857 50556982 51813431 53117336
9736 53117336 54454824 55610537 56374333 56539401 55823670 54112113 51448163 48106983 44619486
9727 44619486 41317651 38307614 35497500 32881506 30449547 28206844 26311667 24853338
9719 24853338 23911664 23472241 23453960 23666754 23896704 23961152 23732794 23211736 22521444 21864671
9709 21864671 21283161 20752938 20233836 19636128 18844156 17775542 16400186 14803575 13088526
9700 13088526 11506907 10113526 8941586 8019855 7274898 6668911 6162449 5675113 5287898
9691 5287898 4971013 4672874 4391737 4102074 3869144 3659780 3449746 3256350 3116138 2989774
9681 2989774 2870495 2759520 2686209 2640230 2562942 2492974 2419886 2349338 2282849 2226107 2174331
9670 2174331 2106092 2040876 1986321 1942786 1900191 1839631 1796794 1790722 1762215 1726251 1698864 1661239
9658 1661239 1619144 1616237 1609724 1594205 1574587 1565966 1561621 1534795 1499095 1462767 1438395 1431344
9646 1431344 1411604 1345582 1294349 1292371 1299124 1279583 1258921 1263656 1294582 1327482 1361807 1411707
9634 1411707 1398525 1403884 1389525 1351234 1304817 1263697 1267484 1279920 1271392 1256145 1237745 1225759
9622 1225759 1213443 1162882 1101328 1092839 1069775 1019662 1013826 1036877 1007394 968610 957010 952131
9610 952131 980626 987436 964813 968369 976575 1003694 982367 939300 907469 878712 854775 833960
9598 833960 788201 756787 752815 734619 717762 714810 713418 702755 692974 695021 671721 665264 643020
9585 643020 614320 604417 594496 607520 628718 644187 646056 647578 633013 614588 619384 639433 648856
9572 648856 620198 613327 653812 661706 642159 654615 666853 676620 651318 619863 603558 594642
9560 594642 588357 570739 567742 562808 564475 567106 564675 584284 600427 603151 585716 609501 638004
9547 638004 606602 587309 603674 624957 649636 651919 625956 615658 601553 597830 605075 592808
9535 592808 581674 590991 600183 575638 567397 569655 577217 566882 540749 505924 491960 500349 495808
9522 495808 496382 508522 500474 498465 520059 522668 508932 510288 507120 488322 472178 497037 503348
9509 503348 519571 533269 558199 561766 558781 540108 512833 490550 518549 523795 537166 537876 533029
9496 533029 535669 528151 516010 499084 490056 490420 489220 503312 498701 519020 518157 520268 512463 519885
9482 519885 539242 573251 583160 556890 548559 560711 571983 546218 544973 554306 573591 581873 585239
9469 585239 604925 585801 575186 591071 591988 578173 563430 565456 588410 626619 635977 625906
9457 625906 609376 602033 607535 607081 606107 634693 663047 672297 699420 706609 686950 681303 706373
9444 706373 693031 680551 715850 751377 773000 796523 824305 818225 839607 850066 864615 884138
9432 884138 908058 920332 914371 927150 934338 952694 968930 965012 996538 1067601 1094155 1124829
9420 1124829 1130938 1141596 1153691 1155239 1184203 1259504 1313162 1346294 1367770 1423775 1502124 1574645
9408 1574645 1648574 1728112 1795982 1876308 1985740 2100976 2204876 2316180 2426740 2572560
9398 2572560 2754515 2974306 3280782 3680097 4154220 4740753 5445057 6335641 7437066
9389 7437066 8833071 10534567 12536115 14824886 17351125 20083945 22873301 25408098
9381 25408098 27253301 27898326 27195065 25273841 22732197 20054903 17573092 15364207
9373 15364207 13492277 11962961 10750996 9888130 9318922 9035302 9012999 9264642 9795047
9364 9795047 10621609 11792653 13293947 15115713 17251776 19611925 22081164 24435063
9356 24435063 26395051 27603892 27702957 26626245 24656958 22256583 19913153 17841519
9348 17841519 16001410 14283346 12678121 11213208 9956229 8910495 8057370 7387252
9340 7387252 6880919 6525096 6274163 6127007 6050534 6042406 6087729 6199245 6376631 6625905
9330 6625905 6946545 7339185 7856118 8522435 9329937 10372753 11682857 13365541 15502610
9321 15502610 18145824 21342711 25099327 29313620 33916512 38726072 43436595 47532922
9313 47532922 50236454 50859795 49336912 46223658 42346220 38463122 34933827 31873603
9305 31873603 29406958 27622732 26592545 26287230 26662668 27600149 29091176 31158940 33699449
9296 33699449 36642602 39742623 42684284 45307568 47680613 49995157 52407971 54774838
9288 54774838 56684376 57483426 56675825 54065747 50025114 45296718 40659457 36496279
9280 36496279 32944747 29958482 27537949 25750207 24530026 23858366 23665653 23848198 24251121
9271 24251121 24712440 25060824 25181691 24918073 24053415 22541597 20534117 18421504 16495258
9262 16495258 14883329 13594134 12567977 11857271 11422676 11262699 11393777 11798264 12477829
9253 12477829 13476736 14772113 16378735 18277888 20354462 22522367 24604933 26347031
9245 26347031 27458772 27702395 27181669 26168831 24985811 23890970 23013208 22498787 22449858
9236 22449858 22939399 24034833 25713638 27888695 30458640 33401008 36536971 39742402
9228 39742402 42818639 45302072 46697877 46806194 45851315 44384267 42903650 41600602
9220 41600602 40457059 39162656 37406553 34974973 32145740 29299410 26823154 24946207
9212 24946207 23672357 22992824 22885699 23351074 24373270 25950108 27994213 30278347 32635162
9203 32635162 34854130 36708766 37772664 37590107 35852573 32691618 28724287 24670926
9195 24670926 20985967 17840328 15243797 13106210 11381961 9958751 8819572 7910953
9187 7910953 7204148 6633752 6156725 5801210 5492845 5222467 4989359 4807564 4670815 4601685
9177 4601685 4543496 4529981 4567358 4697571 4905281 5177393 5554104 6079808 6751721 7567317
9167 7567317 8524604 9650346 10881872 12160816 13485816 14778370 16029353 17150695
9159 17150695 17896212 17991597 17297924 15905231 14112939 12264130 10543747 9094882 7966759
9150 7966759 7113355 6477315 6067289 5874470 5803164 5884727 6137193 6569305 7156257 7948978
9140 7948978 8958036 10163711 11536363 13015745 14495087 15882914 16999088 17542326
9132 17542326 17291527 16226208 14492162 12469756 10515594 8827070 7419723 6264036
9124 6264036 5303277 4552168 3936903 3433850 3063969 2758938 2505346 2307665 2132450 1961156
9114 1961156 1811188 1686677 1588598 1475921 1373223 1305679 1262853 1226896 1180080 1116913 1037355
9103 1037355 980573 951761 927108 912891 907631 881872 849959 803634 770648 775503 749608 729552
9091 729552 714544 697988 674247 642737 618314 597526 586686 593833 568878 537396 534772 532100
9079 532100 509173 522179 508243 472754 448289 436981 402155 415170 451545 433169 411736 385993
9067 385993 362680 362046 371712 377548 341606 309889 300608 320495 331651 315709 329338 361883 328776
9054 328776 307771 275142 267818 252655 245558 254447 247791 251348 286589 260518 252528 263700 278128
9041 278128 294738 293513 274465 259076 252795 273554 305573 296312 297546 301402 292878 269719 241080
9028 241080 224452 234755 206398 211878 228525 251345 264240 259341 260341 267961 239891 216429
9016 216429 220261 215387 218111 210618 193457 178988 195796 181977 162343 167926 172114 192946 217484
9003 217484 204299 161633 129804 124056 136712 154912 173106 177658 204058 221687 245038 228009
8991 228009 187189 168317 137479 162514 165800 141743 158097 167494 173542 163002 137397 148396
8979 148396 160045 182271 164973 173771 199279 229209 241020 278296 287457 293050 308934 299989
8967 299989 261518 217761 188110 191574 185641 175846 136000 122521 146614 143193 121846 124651 154310
8954 154310 199038 206550 199140 191113 217942 238692 229792 244903 251473 271205 304607 307069 267103
8941 267103 236525 218998 208997 192380 188309 179261 169160 190289 198962 164949 148955 161424
8929 161424 152520 149756 159097 164465 126671 97409 85049 103028 135219 160777 189656 202635
8917 202635 190853 159895 162440 158315 150277 162670 170036 191755 189864 214053 276142 303276 332720
8904 332720 363805 386850 417307 426128 409875 377347 343382 328799 300024 288678 288171 275638
8892 275638 248994 242817 235833 230969 259526 292361 327737 348069 333929 339669 346309 354959 356521
8879 356521 373972 395214 403022 418249 436990 422493 397998 381568 380220 352824 292237 255219
8867 255219 244447 259588 259026 287972 297368 283057 304021 309275 298351 314314 312208 304401 319144
8854 319144 299690 254863 247870 238989 241270 227245 240782 226887 227703 235850 241357 237203 226845
8841 226845 233056 221100 227655 255695 282663 270498 288917 326186 350484 329289 282275 277993
8829 277993 270930 267628 272157 283894 294376 294632 323142 352127 384275 376476 353592 357665 409838
8816 409838 464280 471089 437361 427400 391873 358698 349094 344052 349192 377897 365258 339364 318036
8803 318036 286188 278937 264223 247163 267805 290767 296598 301686 287446 265708 292456 339113
8791 339113 372638 422697 418742 407016 371964 321110 307509 300532 294727 264146 254186 260375 240238
8778 240238 256179 248455 236833 260662 259285 232282 196732 175668 166517 175786 197426 196982 157437
8765 157437 139297 172658 185058 164608 170814 196036 173480 161476 178573 191099 195331 199028
8753 199028 195060 188232 210168 220347 222135 223632 198921 203548 228372 222448 186880 182201 179611
8740 179611 194057 202201 188950 206776 232650 228713 238894 247251 253193 238870 242907 241245 200998
8727 200998 190126 222840 278626 294805 279459 240446 234762 229731 220983 210127 229371 229762 228694
8714 228694 237681 235105 193399 151686 142899 150730 153913 152103 146399 141988 163103 177276 177817 161066
8700 161066 167218 167274 170632 159096 166294 164055 172763 161901 159699 164005 174990 208673 209949 162251
8686 162251 117407 124578 153142 160241 158305 151436 148482 170828 179972 165751 165803 175288 161642 117462
8672 117462 88284 90230 104351 139810 163011 143171 119084 76775 70334 105345 113955 112973 111317
8659 111317 118116 163892 171466 152601 176287 210378 197268 163837 151451 114590 91104 107411
8647 107411 137279 154767 150913 180620 183303 158487 183512 192730 179995 168302 161989 175117
8635 175117 213008 233410 217089 239513 261564 283281 283291 261590 267664 303835 334062 411877
8623 411877 514626 628245 764655 949764 1150095 1293779 1271117 1032530 786259 616439
8613 616439 499758 421680 351765 349509 335504 306151 268045 225740 196226 235202 233704 221528
8601 221528 198563 185812 189423 180182 191948 194590 201378 226899 260671 274411 254404 267478
8589 267478 308404 341901 382606 397092 375671 358184 390137 457981 520040 607602 741738
8578 741738 901922 1096277 1393971 1770063 2136227 2443109 2473177 2072517 1582013 1219685
8568 1219685 985885 855795 773001 741224 669702 599644 561213 523281 517044 477784 424672
8557 424672 394015 353035 319653 295022 272520 265626 278396 269620 259538 264467 254371 229797
8545 229797 239134 260267 260035 235891 252609 283165 307111 313772 296366 326233 384919 447156
8533 447156 529173 627599 752527 941213 1142609 1278677 1317912 1154477 936658 762157
8523 762157 670235 655077 682362 767431 896317 1032439 1144359 1198573 1140277 934846 730102
8512 730102 594151 515252 450036 412408 401816 349282 304069 274209 273788 251319 253390 299550
8500 299550 307294 307888 317864 329894 335679 344336 362759 380879 354552 320841 287519 280979 266212
8487 266212 260620 265419 274166 293614 329565 363331 395489 449197 501368 564585 670644 804803
8475 804803 984695 1203578 1497686 1805555 2044331 2079065 1800519 1397064 1052600 800054
8465 800054 617616 503815 442538 426972 400291 380558 369029 381102 367259 340772 332180
8454 332180 332147 337105 313550 340693 368642 399428 438618 427875 392583 361693 324602 326733 315702
8441 315702 315053 324739 356534 367083 380019 431171 429263 446126 485366 559739 658062 811138
8429 811138 967155 1143951 1341469 1589617 1799832 1863410 1730679 1526232 1306863 1047012
8419 1047012 825897 654081 539294 439217 395392 360639 303666 268081 248219 250192 275416
8408 275416 277335 276744 281642 296756 331574 353311 372744 358172 359064 343285 312514 335921 378920
8395 378920 411532 443431 469458 481794 474628 447527 454952 447376 470428 550064 620079 684239
8383 684239 792542 959034 1158286 1413769 1672167 1858411 1873831 1754700 1514827 1215462
8373 1215462 925712 721151 578283 490110 407772 351990 328424 275308 225227 192400 210896
8362 210896 237731 265008 263982 244995 238306 228266 210523 221077 267587 344244 384233 398771
8350 398771 441721 470778 485250 473588 446971 409685 353939 356208 371573 365292 367404 417117
8338 417117 485973 530879 608673 683347 803567 893458 940247 934933 852126 709460 540124
8327 540124 434233 347902 268768 240769 182581 134538 145515 150832 134609 132182 129275 136069
8315 136069 113824 95610 80320 94410 124993 137720 149906 138393 163077 185578 180279 161238
8303 161238 170998 208316 189763 181533 170982 142640 118903 110639 125800 99213 74801 55159
8291 55159 44116 39806 53562 44479 6737 -15252 23275 51256 57744 55209 56498 48411 55971
8278 55971 51930 29118 47176 71300 76869 70856 69271 77603 67543 58792 20488 17268 62588
8265 62588 59739 50028 16430 18460 30874 12388 9761 33346 32025 55995 72473 46572 27750
8252 27750 37025 32218 38903 28871 33523 33487 49226 58705 52793 43568 40753 64315 54872 30520
8238 30520 58825 38889 33045 28149 14847 8554 23822 14075 18375 31569 46858 28518 27535
8225 27535 1641 9989 26491 34302 48097 44824 33962 37407 16085 6211 24780 33115 59460
8212 59460 56750 30094 23773 5765 -991 29911 57628 68028 68809 28131 10908 -5113 -5558
8199 -5558 10027 35327 19883 52782 59697 40594 33581 47986 45415 55267 68588 66427 52243
8186 52243 29580 5315 9920 27644 13256 18027 33949 12543 21959 21919 12400 37300 44638
8173 44638 32599 7675 1713 12632 59332 61141 81580 89040 61033 32775 11675 13786 18243
8160 18243 21772 35815 58165 42445 43935 42802 45898 70358 67799 53807 95587 147906 143193
8147 143193 144372 130499 85897 94191 98994 92716 84965 88307 92358 87282 72002 69002 34974
8134 34974 36025 27434 34745 59924 58618 56353 60220 47150 54434 61211 53534 76702 69533 39128
8120 39128 26146 38076 32991 40378 40208 43865 63912 51574 25293 21546 29550 27158 47954
8107 47954 62339 56055 64058 95056 110463 103382 92016 67087 55141 43918 48940 27700 37684
8094 37684 49747 61513 58135 63315 39913 37204 51095 41430 59740 90249 104823 92056 68086
8081 68086 74598 59983 38424 47084 66599 73301 53643 43912 41722 48543 48224 68920 105180
8068 105180 84778 42899 71280 82996 100833 102073 106482 82306 40952 25603 31122 56595
8056 56595 79412 101931 111828 111133 97569 92201 101283 107732 95628 102159 93790 64010 71187 70992
8042 70992 61653 67556 92655 110676 109738 119150 135404 121243 100436 101159 86479 95874 92213 80674
8028 80674 83181 112058 108608 107518 84582 76738 97025 115227 109312 92410 129113 163327 145006
8015 145006 140231 114858 115287 111153 141136 174659 164253 136345 148185 131107 124650 114547 120114
8002 120114 125663 117272 146296 125600 104911 90759 118719 99180 97149 115018 134350 129907
7990 129907 119975 122650 130248 126994 125772 125725 104442 87505 81744 68301 46737 55017 81559 115423
7976 115423 109529 115358 118523 126793 106525 85626 98332 111682 147562 138384 110118 91318 71279
7963 71279 72366 88675 78260 57092 44101 55023 75590 102323 89326 85903 81693 79687 93684
7950 93684 88352 96004 120095 83988 62768 67779 96852 128861 112971 89326 87404 98907 112759
7937 112759 123992 124869 108685 88603 89144 81184 77877 95017 111098 136436 153007 131871 98913
7924 98913 78460 54920 46661 39983 61303 92385 105304 114347 117924 141692 116747 107448 93179
7911 93179 74719 98982 110307 85785 75764 79203 76690 82883 69991 58029 67423 67045 59985
7898 59985 52666 54130 62716 75954 83969 101198 85345 66753 79283 84059 87895 90425 55341
7885 55341 43014 35328 39675 41119 44814 29237 17395 16392 8929 29997 49978 57280 28877
7872 28877 19350 36418 68035 83823 69792 48331 67845 69254 69418 68576 40944 26530 26957
7859 26957 21967 13815 6524 35737 60999 62731 43149 33102 8268 8374 30321 38429 37937 56145
7845 56145 56786 61025 61871 43861 29932 2127 13043 20238 28028 -2502 -2063 17607 39555 15749
7831 15749 7637 2730 19373 31723 34206 26646 36390 25349 18017 6795 7594 13448 21562 53699
7817 53699 69851 62955 32403 20851 824 -6728 9294 -6109 -16617 -20405 -13628 4180 3166
7804 3166 -3727 47 24 -4420 686 10039 13652 26933 33959 -3402 -7893 1463 10631 16017 18732
7789 18732 1328 5650 1314 -17308 -1456 -38317 -48987 -9722 20210 10976 6820 18134 25665
7776 25665 12324 37921 33460 15796 -12999 -8209 -6338 -13401 -9782 6802 3116 19617 37209
7763 37209 25884 8993 23685 -7446 -28049 -25871 -29872 -14035 19481 13851 -6329 -3695 22105
7750 22105 9343 11075 16706 17092 40595 30456 32543 66758 61846 45676 -953 -55090 -36690
7737 -36690 -23220 -25680 -13873 -838 31475 6206 -19295 3488 -16423 -25005 -35720 -27751
7725 -27751 -16985 -30329 -47758 -25486 -34304 -42709 -31202 -25179 -20587 -43228 -44459 -14360 10974
7712 10974 15540 -1295 -21905 -25519 -15069 -16954 -10947 -11597 11269 17430 32316 28833 27363 40188
7698 40188 37833 22215 -590 -8869 -26619 -15351 4762 3564 6290 20030 26546 50587 24417
7685 24417 16314 33806 6339 -999 -9163 -254 24046 15059 16534 13437 22985 27294 7941 1190
7671 1190 -21589 -39425 -34493 -42701 -40217 -35762 -32370 -8397 3526 -2246 16250 33205 39602
7658 39602 43649 40758 27835 21362 2599 -11982 -9510 -3953 3264 606 -20474 -39844 -24149
7645 -24149 -13928 -15335 20069 14717 -13455 1394 11301 -8717 -19559 -2049 30978 15629
7633 15629 -4402 -15479 24822 41133 7531 1423 -3756 -41782 -42348 -22936 -25916 -7310 -6162
7620 -6162 -9695 -29346 -46263 -15598 -5884 -21489 -33634 -16288 1311 8727 -7055 -16846 -3284
7607 -3284 -11764 -30293 -31707 -55720 -12874 11894 10776 3187 -248 9192 18723 13395 7040 -6406
7593 -6406 -13484 -40025 -45317 -40989 -23808 15919 9764 9970 26534 8635 -3682 13073 19920
7580 19920 26969 -3756 -9614 -6061 7432 -8307 -32796 -44386 -45244 -4446 -7395 -13451 5995
7567 5995 -9985 -3266 2749 -1765 -12105 -16768 -6331 -14998 -27763 -24303 -14152 9840 -9638
7554 -9638 -35989 -37341 -17858 -1409 -20412 -22418 -13117 -11789 -16148 18056 46098 49013 20517
7541 20517 -13830 -14731 -17481 14658 11004 10828 19835 28574 30611 54966 49111 35924 35627 27759
7527 27759 -17003 -40008 -13074 409 -15301 -18287 -5550 2903 12075 5559 -33087 -27240 -7466
7514 -7466 -3176 -12262 -8543 -1378 -839 -12913 -38747 -42239 -28945 -4781 -19066 -23730 -13562 -14975
7500 -14975 13405 42599 19460 17860 24084 13052 19120 19780 10887 -6663 15212 31928 36262
7487 36262 1586 8440 2512 6837 8455 15737 21040 14032 -1155 -10263 -35098 -41210 -31385 -3753
7473 -3753 15937 2967 4881 -21269 -20929 -18148 -1069 -23616 -17645 -12907 13096 46148 65171
7460 65171 31030 -11239 889 3622 23557 34362 -2580 -13817 12716 29286 27870 17538
7448 17538 20776 20331 11646 17751 27650 30037 33300 25750 27870 11681 3713 3754 10001 4803 -6269
7433 -6269 -3865 -5386 14270 10725 -23741 -29866 -20600 -14730 -8964 -24971 -44942 -27087 -27882 -20437
7419 -20437 -21930 -10548 2837 -18249 -31092 -48480 -45576 -39513 -50894 -41947 -9370 2002 2315
7406 2315 -2925 -7559 4229 48672 61369 46539 19169 10986 11924 12562 4644 -20446 -30038 -2362
7392 -2362 -355 -5921 -44462 -81557 -77221 -61636 -42542 -35243 -24088 8226 28028 8821 -31083
7379 -31083 -30462 -16955 -31135 -42986 -35477 -20634 -41387 -47520 -51899 -38116 -12717 -24250 -43436
7366 -43436 -60378 -55181 -44450 -41606 -25782 4905 42345 45568 22417 -29033 -10930 16153
7354 16153 17801 38090 48217 50761 47171 30536 51608 43978 18890 5290 -5231 -9288 4754
7341 4754 12001 11688 3104 15541 20028 10218 -11187 -11904 -4542 15566 8228 -22968 2998 -11125
7327 -11125 -35868 -41924 -26722 -11478 2674 25838 52134 40424 -3505 -33123 -35481 -19668
7315 -19668 -21863 -22045 -29408 -27560 -43822 -45018 -25411 -15044 2238 648 -16535 -30895 -45909
7302 -45909 -45035 -66827 -74721 -49403 -13566 -5035 -7035 12599 34939 45386 9778 -22526 3046
7289 3046 50760 36531 10840 -3753 -24878 -32903 -34900 -24701 9446 14793 -27559 -31524 3096
7276 3096 21056 29885 18995 -574 -15808 -22492 -31212 -34179 -32983 -35489 -29838 -34583 -8457 354
7262 354 12671 -1196 -15590 -18635 -13318 14515 16644 5830 10233 -8361 -620 12678 13320 -8647
7248 -8647 -20854 -41289 -46365 -28933 -6689 -6572 -16996 -13152 -17636 -26378 -35186 -15390 -2332
7235 -2332 -15442 -11537 6338 13402 20712 35752 32330 44179 48820 33980 1505 -8270 -33724
7222 -33724 -46456 -34977 -18822 -31536 -54886 -59642 -48248 -39771 -64796 -85493 -75607 -47158
7210 -47158 -22012 -26184 -34992 -46229 -25936 -25740 -33227 -12468 -12535 -29974 -47482 -65010 -59835 -38613
7196 -38613 -23641 -19966 -4280 15611 18499 22911 29391 3520 2803 2544 -3605 -10863 -34684 -25617
7182 -25617 -19702 -29883 -4915 18519 31439 42928 53299 40278 15352 8846 2663 -4622 8314
7169 8314 23173 27504 6499 -6460 -24961 -18654 13326 32177 16385 -8993 -24487 -13946
7157 -13946 -3845 592 10405 23234 10231 9542 -2253 -1409 16187 30274 44603 29029 473
7144 473 12058 25163 17093 32052 37570 49681 53150 48177 22157 14471 17972 15714 28899 30854
7130 30854 4636 8309 -4651 825 26251 45451 7703 -6072 -3720 -22351 -40159 -53714
7118 -53714 -79582 -47499 -5602 23946 40430 37436 30564 4453 -7898 20214 29767 17379
7106 17379 -8683 -3281 -21154 3613 -2593 1423 5162 8779 17591 18112 12014 -26921 -41482 -45349
7092 -45349 -55956 -58946 -47834 -29610 -26304 -22962 -45297 -52591 -34490 -40517 -14959 27758 10058
7079 10058 11379 35402 51457 33870 3850 -8226 1064 12433 -4390 -2651 -20695 -35922
7067 -35922 -39166 -19078 15105 37464 56159 24350 20504 29759 19312 17752 10567 -3598 -5962
7054 -5962 2746 -20154 -12152 -5662 16784 29813 39478 23266 3085 4716 -4536 -9332 -23739
7041 -23739 7510 7135 -7381 -9889 15573 34796 22616 3241 247 36934 41531 24688 11625
7028 11625 24443 4175 7191 39802 43722 18206 -11652 -8660 4949 13060 5446 -29723 -66250
7015 -66250 -64516 -26877 -11129 -613 3436 18145 21547 3361 -6141 -23229 -52075 -32788 -17097
7002 -17097 -18966 6187 4987 18679 18535 22743 32039 8585 -8841 -21932 -31465 -17361 -10
6989 -10 17706 12058 7835 -12027 -1946 24802 40146 46481 35846 26052 25176 22351 6926 9228
6975 9228 -10516 -2655 -1756 -10466 -13991 -17424 6490 13571 -11804 -7692 38185 33115 23054 -3933
6961 -3933 -26271 -23505 -9090 -33002 -53506 -48556 -43192 -26159 -13924 -11035 1198 -3876 -3203
6948 -3203 -1334 2737 32527 17974 -7990 -21427 3558 26868 10029 22539 39085 47060 43273
6935 43273 39876 22939 32930 28002 19574 10863 18107 -2702 -37860 -59627 -58433 -34355 -18011
6922 -18011 -12846 13048 7925 13190 22723 45201 39381 11505 24910 16352 -531 -17791 -30504
6909 -30504 -45991 -46140 -14120 -14881 -26728 -1239 25029 1535 -17300 -39885 -37511 -51800 -68176
6896 -68176 -44441 -32364 -51942 -75536 -79580 -51896 -22611 -8896 1060 23484 8937 -11051
6884 -11051 -1807 -13068 -22654 -8980 -10945 200 13444 10040 19601 9916 -13149 -16163 -3638
6871 -3638 28138 42461 44801 65194 41829 23231 18031 16792 13049 17366 6789 -5360 2129
6858 2129 27329 18206 -4294 -22936 -29329 -11359 -13833 -31075 -29395 -19221 -13634 -22645 -36923
6845 -36923 -31437 -6858 -4085 -20619 -27621 -23007 -21651 -13149 -37674 -71605 -47974 -24835 -21526
6832 -21526 2364 11104 -39896 -42987 -3450 2508 -39670 -49844 -50576 -28731 -5284 35587 37674
6819 37674 -20518 -23109 -3620 -16514 -14937 29714 28994 5568 11775 30348 56405 56646 40030
6806 40030 42887 42008 -632 -16452 -27266 -33820 -15821 23918 33007 23936 11947 28058 20585
6793 20585 38069 38589 12964 -394 8626 -7823 -6749 1160 -21724 -40647 -15090 -22491 -32694
6780 -32694 -33414 -34623 -57917 -17173 1860 2811 7564 16336 22329 -3323 -12623 -5288 -24844 -52493
6766 -52493 -46499 -24893 -20376 -22662 -16147 -13383 -14247 -37695 -25876 6397 -7424 -10158 -2127 23343
6752 23343 26839 4337 -25392 -12535 -15041 -8527 -1691 15028 21313 39328 30754 20329 -871
6739 -871 -26039 -7411 -10709 -15823 -29120 -43639 -42877 -35476 -24967 2422 -14135 -29382 -35515
6726 -35515 -39624 -25915 -21133 -39498 -41384 -39914 -41100 -32153 -14606 -16430 -28384 -20169 -31735
6713 -31735 -29385 -2528 34812 20463 -5749 -23627 -9173 13878 13220 -284 3034 3465 1998
6700 1998 18808 41307 52679 48596 62112 83068 70039 37957 21433 3129 8630 -7963
6688 -7963 -19674 -15602 -34606 -29100 9564 35469 31632 12489 26091 -8264 -10351 2205 5120
6675 5120 6266 50401 56919 35959 38071 51530 38995 12925 -297 -4575 16424 13100 -17617
6662 -17617 6740 28328 27983 12128 16742 27497 2199 -32006 -15219 7692 5657 11970 13938
6649 13938 -9141 -43875 -30722 -10615 -12783 -31366 5720 34161 18902 -3922 -5867 -10765
6637 -10765 -35404 -37943 -20828 -18730 -13754 8809 19641 21753 14573 12394 7472 11727 -2479
6624 -2479 -13848 -10719 -2570 -19645 -43108 -55932 -54017 -32662 -18392 -39075 -22903 9665 19915
6611 19915 14815 20391 31483 14764 -3585 -2098 -14850 -7293 7691 10852 -27595 -48112 -30548
6598 -30548 -38800 -42114 -20931 -22923 -28884 -22439 -20372 -39297 -38821 -30927 -52661 -37146 -29885 1828
6584 1828 57694 68480 48084 23115 15299 7581 -17255 -19765 15416 30226 39619 37300 8262
6571 8262 -29875 -29682 -17187 10863 7814 -714 -20150 -27872 -12935 -3882 -11207 -14109 -29418 -30110
6557 -30110 -10087 -9060 -14710 -6359 4781 11502 -4235 -2883 490 21666 6652 -11379 -11729
6544 -11729 -42291 -24875 -17673 -9081 -437 5888 43216 64974 61483 32725 36094 28457 8591
6531 8591 -5846 -4387 -12161 -33928 -48092 -23072 -14346 -63055 -73778 -61193 -30529 -21401 -18568
6518 -18568 2132 29205 23730 16410 8620 -6024 -34386 -36878 -42344 -49840 -49039 847 40135
6505 40135 42727 30315 45149 46221 18914 -14296 -11037 1148 -1335 -6400 -2611 -33421 -20797
6492 -20797 5631 2471 -1420 -18440 -31684 -31820 -21273 -39937 -34093 -22115 -8245 -16531 -27252
6479 -27252 -17732 -8441 -13988 -25195 -53134 -56627 -42288 -23405 -40219 -59762 -46822 -33945 -59230
6466 -59230 -60000 -47566 -40372 -41304 -23661 15714 -14091 -9645 -2040 15053 12715 31215 19264
6453 19264 25409 23856 4576 1326 8959 28807 20652 -5598 26025 36648 16089 9190 10717
6440 10717 19237 9936 -11787 2145 8762 11400 -3663 -19126 1767 24085 34902 -420 -16668
6427 -16668 -12093 -2992 -12832 -32358 -10832 -5596 9466 7034 11732 13599 32071 22747 1585
6414 1585 -1257 -11011 -4642 6042 8091 8558 10248 -2363 -7890 -8699 -16723 -5534 2201 -6921 -10972
6399 -10972 -8521 3478 12223 -26756 -32080 -13299 16329 6239 -1578 -10336 -29207 -21756 8314
6386 8314 31069 8862 -6076 -15431 6129 23628 16673 16644 3322 -8525 -19538 -21814 -3077
6373 -3077 -20811 -38188 -33155 -8197 -25867 -15396 9039 -3341 -6831 -14861 -9892 -11348 1216
6360 1216 18341 10360 -23185 -12828 -7926 -25791 -32136 -11897 -3934 17504 42073 51931 27616
6347 27616 11050 -4128 -16174 -10282 12030 29087 25930 49336 52995 46565 29851 36814 29726
6334 29726 2896 -6525 -4938 19983 19903 22852 32307 589 5016 2369 12264 -6346 -15057 -8804
6320 -8804 -5011 20794 36239 6919 27164 37974 12454 31929 14319 -5255 -3386 769 -31845
6307 -31845 -34461 -22094 -30638 -12408 -7680 -501 23894 43850 35465 -8528 -47251 -32864 4532
6294 4532 17827 2401 1288 -8443 22780 27384 10067 8900 18778 5980 -12831 6770 16874
6281 16874 23619 24948 -1645 -6839 -6151 -14573 2548 5431 50637 64114 52906 21012 4341
6268 4341 -33918 -28062 37070 37208 690 -24683 -11524 -34359 -37745 8227 28113 25119 1338
6255 1338 35712 52909 20925 31049 47148 51584 38259 -12043 -37997 -45415 -52163 -43906 -13918
6242 -13918 -693 23746 19843 -8300 -5610 -4706 19450 26029 58609 53867 73368 68065 38927
6229 38927 25562 22833 50961 42015 20450 -1656 -11246 -227 7197 -8427 -28643 -49090 -25767
6216 -25767 -20675 -10124 -5647 -11670 -14553 -4550 16800 9606 -20867 -37326 -24869 -14874 -12768
6203 -12768 -19560 -11834 21840 50538 30106 48402 59795 26701 23575 37215 45914 -6605 -30706
6190 -30706 -16842 -33952 -44785 -3521 24178 11807 7079 10941 -7205 -20543 -12716 1737
6178 1737 19608 28354 23787 37243 52900 48071 33021 2796 4496 22612 13762 7630 18487
6165 18487 29724 7902 12457 8308 -560 -17144 -4822 25077 12328 -5040 -22435 -13625 -13694
6152 -13694 -33781 -58396 -74198 -66359 -63076 -50128 -43636 -49575 -21440 -9829 520 -30420 -50505
6139 -50505 -33530 -6520 -15766 -17212 7287 27487 41838 38796 21173 17278 -2983 -23853 -15459
6126 -15459 -11719 6577 -6421 -24965 -14006 -42060 -61877 -35054 -23866 -26297 -15332 2955
6114 2955 6329 1696 -37472 -27366 -12895 -24105 -17784 30117 50633 13418 4912 -11173 -21092
6101 -21092 -7169 4433 -11474 -33041 -32350 -19586 -25221 -28118 -16290 2203 -6413 7712 38215
6088 38215 26248 21954 3595 -27152 -44059 -35189 -62430 -70039 -25650 16197 -10941 -2282 -12230
6075 -12230 -24025 -8659 7936 21078 3185 22671 36988 31474 1107 -10525 -8695 -6264
6063 -6264 -27185 -31349 741 7262 -12862 -37108 -23865 12179 16200 22911 31217 38416 25811
6050 25811 41105 45394 -14224 -43477 -77919 -75150 -67226 -54013 -30623 3753 -6801 -8492 -7383
6037 -7383 -26609 -18024 34186 30959 1322 -18035 -2392 -14675 -20191 16400 24274 14541 -19924
6024 -19924 -42760 -13719 -8058 -926 13962 45176 19509 -663 -33363 -38570 -38181 -31185 -61205
6011 -61205 -71235 -41052 -36344 -67299 -63609 -56424 -35002 -13268 3009 -2808 14300 42602 32860
5998 32860 4512 -14877 -7965 -5063 -3680 -13472 -36695 -40738 -21792 10922 25908 20054 13116
5985 13116 16740 25914 12627 -17004 -15291 -8204 -7510 -8993 -3607 -2341 2050 -5670 -15198 3600
5971 3600 32597 46136 38728 4152 7505 -36027 -39065 -20474 2507 -8217 6507 6218 -12950
5958 -12950 -7424 7633 13908 -839 -2213 5306 -5126 1236 28916 43666 30479 877 -11139
5945 -11139 -28604 -30247 -26206 -21241 -24611 -7782 -1587 -8803 -20815 -24686 -34698 -50981 -37813
5932 -37813 -2475 -1109 -14394 -22024 -48701 -46619 -54824 -72725 -62473 -71666 -70346 -36234 -11288
5919 -11288 -18399 -43969 -45577 -23462 -11496 -35036 -27923 2877 -8612 -16334 25438 24957 -3429
5906 -3429 -3316 25578 22660 -1034 913 -6254 1728 -5305 -21919 -12583 -4236 -9164 -12457 -20480
5892 -20480 -29173 -16236 -16474 -9071 -26200 -17363 -18619 -28892 -43171 -54985 -34206 -18206 -62882
5879 -62882 -76394 -66992 -82832 -69867 -61577 -23913 -9759 -41802 -74951 -67600 -51224 -55690 -40251
5866 -40251 -52636 -42867 -20729 -15850 -18896 -9692 659 -20254 -26661 -35926 -47054 -42870 -34722
5853 -34722 -26808 -19999 -24820 -39020 -14361 -19322 -15751 17159 20344 -2533 -3269 -13230 -22409 -19828
5839 -19828 925 -7403 -12831 3965 16776 31449 19264 -3990 -3322 10476 3060 4603 -1169
5826 -1169 -18320 -1969 -20610 -24080 -39674 -33401 -8618 23574 15404 -13663 -10221 -12909 -9339
5813 -9339 -33027 -48835 -32639 2195 -10521 -21363 381 -8426 -6378 -18531 -5102 -4780 -481
5800 -481 -13540 -29230 -18655 -16484 -52813 -44962 -14700 -29460 -39242 -33268 -15055 -31617 -45146
5787 -45146 -45751 -26251 -20063 -24520 -18250 -11699 -14255 -16180 -7219 2698 -8698 4492 32749 18800
5773 18800 4843 413 7161 26858 23971 11496 1500 -2668 13918 772 -5389 -7108 19108
5760 19108 6058 -6676 -20829 16692 17043 -12968 -36267 -30901 -22829 -817 8576 -26351 -19471
5747 -19471 19703 24313 -526 564 28667 7988 -22648 -18603 2693 2332 5663 2747 -14449
5734 -14449 4554 -6920 11454 21824 12411 6211 6405 20642 16317 20560 22158 694 18445
5721 18445 33378 51099 30486 -55 -19857 -36377 -36811 -30785 -13964 -3793 6165 8013 15797
5708 15797 13176 556 -26938 -48469 -72604 -88628 -72501 -30927 -6064 -25510 -69195 -70081
5696 -70081 -56343 -54121 -41163 -24241 -33087 -25241 -19342 -32959 -16564 -21510 -17419 -8536 13558
5683 13558 -14113 -43966 -49396 -28701 -1000 -7781 -3630 -14411 -35082 -27100 -16984 -15168 -22887
5670 -22887 -17042 -25250 -46344 -42025 -49448 -32674 -21667 -8235 -9262 -13584 -14843 -22017 -9325
5657 -9325 7059 -12312 7879 15237 -1779 -6773 -15037 -11701 -16581 1739 5260 1992 -30940
5644 -30940 -33592 -9902 -10618 -6230 14576 1122 2308 16088 -2470 -16047 -1808 7883 -8814
5631 -8814 -24352 -15303 -12770 4072 7029 -8758 -35374 -39465 -28271 -27537 -25414 -5485 5713
5618 5713 -5076 -16420 -6563 143 -16899 -909 2912 14801 18182 3679 7979 -7698 3465
5605 3465 11477 -6834 15911 26094 30135 21847 10471 -6236 -1023 -4531 -24973 -20108 11376
5592 11376 26231 21165 10719 21781 16666 18283 8213 -268 3400 19340 6955 -10649 -33809
5579 -33809 -40988 -40091 -21939 -32744 -28287 -16781 -34935 -13778 4590 4555 6480 3475 -4354 -9844
5565 -9844 -40027 -57749 -66567 -59850 -36006 -12335 7141 -2972 -1201 -11120 3141 5835 22193
5552 22193 -6854 -31699 -34652 -42276 -27108 -7718 -1450 -3303 -925 12784 7362 11927 18117
5539 18117 32036 23439 -1978 -19766 -24031 -14065 -2138 17723 22330 10575 2925 10595 7025
5526 7025 7241 24415 14281 -9974 -11723 -2316 -23594 -45713 -60160 -57725 -26424 -10716 -56914
5513 -56914 -56704 -43766 -25989 -1660 6779 -19948 -16845 -7398 -8680 -11065 -12607 -11411 -23696 -14196
5499 -14196 -1201 21868 7027 -22086 -31167 -34591 -37612 -18580 9696 6029 20073 -9005 -21373
5486 -21373 -11384 3668 24661 59905 31725 9838 3550 9786 -4429 -14060 -2417 6240 -13754
5473 -13754 -16203 1581 -1599 1607 -7944 -1633 -25024 -31470 4301 -4207 -21651 -49534 -51007
5460 -51007 -52161 -58428 -34257 -7232 -5252 -15053 -8352 -23147 -20830 35770 39701 709 -36402
5447 -36402 -41039 -28888 -69943 -64727 -33866 -7833 -1148 7327 -8331 -19224 -34655 -38862 -23646
5434 -23646 -20266 -5760 -14359 -27118 -44226 -39761 -49597 -43866 -49368 -38313 -31829 -20236 6337
5421 6337 -1877 -14401 -23229 -28604 -23201 -17725 -26773 -24565 -17564 -24895 -52444 -53619 -23876 -14444
5407 -14444 -33942 -56090 -39468 -17603 -20 -20132 -21320 -11197 7419 12056 11246 10954 -13251
5394 -13251 -11509 1540 28607 30983 30863 4793 -13450 -7926 -4137 16515 26004 14346 395
5381 395 -12130 -13605 -9775 28088 43231 22459 2442 16475 23170 26407 18383 637 -19907
5368 -19907 -29289 -5631 7693 6044 604 -3608 -18740 -27531 -17258 13645 20490 22208 27676
5355 27676 16201 9389 8445 2238 -18869 -23262 -9901 -12941 -3490 4666 4485 15117 -4438 -8331
5341 -8331 -7330 -23687 -12386 -7264 -20806 -31148 -24007 -20373 -15464 -4020 -22811 -39454 -35143
5328 -35143 -27802 -32154 10905 45572 36313 23172 2154 -9474 -15687 5047 9256 4232 7457
5315 7457 6444 22993 8320 -15325 -5343 -6083 -3176 -10832 -14756 -26575 -18347 -25460 -27223 1366
5301 1366 17834 17937 18093 8042 37768 15955 -16024 -5251 -15032 -17816 -14956 -4631 2495 16291
5287 16291 -3292 -16160 -8772 2675 6257 8727 14092 4499 4210 -233 -2376 381 11818 5793
5273 5793 5391 -14638 -24480 -13782 5082 18445 -13724 -25209 -17283 -6851 -14607 -22946 4229
5260 4229 19734 21222 14941 10870 -6691 -13678 11394 11576 30806 32045 7842 -26581 -58641
5247 -58641 -57579 -43417 -33599 -56978 -56275 -49499 -37373 -10095 1226 -22876 -35985 -32041 -19654
5234 -19654 -14848 -26200 -54954 -59257 -70008 -58418 -28258 481 -10991 -7810 -25986 -24224 -6029
5221 -6029 4610 4320 22875 28478 16237 15905 2319 -15100 -12414 311 17200 15414 8871 -4425
5207 -4425 -13561 -21614 -1719 13610 12163 11708 8509 -11284 -16638 -28734 -23930 -15306 -5326 12511
5193 12511 2714 -10695 -31502 -47099 -21894 16054 21095 11466 -5480 -23641 -20976 -22361 -13142
5180 -13142 -24513 -2695 29859 7610 -5970 15572 21352 36138 22998 26798 35206 18742
5168 18742 8019 44811 54836 21930 15125 -1721 -46060 -52892 -9293 -2048 -15185 -16346 -29119
5155 -29119 -27126 -12858 -2021 -269 26028 18615 10948 -2164 5603 6664 -7881 -34972 -41349
5142 -41349 -23717 -46218 -55285 -44413 -38518 -35620 -15874 -31309 -31587 -28985 -47975 -46871 -32762
5129 -32762 -35721 -47802 -54822 -32848 -18657 -25447 -30510 -25209 -4314 20044 7056 -17789 -8638
5116 -8638 -215 4071 7549 -3492 -19946 -34820 -34817 -30332 -37359 -27047 -4309 21466 45016 33995
5102 33995 6900 222 22434 16971 40562 51234 32605 14918 -8009 7025 26997 3507
5090 3507 -23747 -38891 -12612 40330 59068 55758 28959 3953 -7848 -826 -4576 -24222 -17541
5077 -17541 265 -19445 -17852 -13339 2103 8123 -6622 -19754 -30049 -9993 15915 8081 15084
5064 15084 14839 16968 12712 -2983 8759 105 14744 15354 -36078 -63703 -45085 -33526 -32246
5051 -32246 -9170 11348 -9562 -23541 -41296 -56418 -62029 -62152 -60847 -54332 -30369 1189 9369
5038 9369 25982 21191 3318 -10376 -35238 -43857 -39250 -11723 10639 14911 14786 26157 47546
5025 47546 46585 43720 56867 53056 53817 10475 -25722 -11095 -12733 114 25832 34361 7127
5012 7127 -24220 -42712 -46534 -21648 -1601 2257 -3101 5482 322 6135 28452 54784 69007
4999 69007 53366 57806 42632 18714 9781 -8346 -3908 11673 3299 -4565 -23816 -27311 -20950
4986 -20950 -41597 -44716 -36811 -45298 -26209 5072 23619 17826 10833 -12131 -1826 10804 -9718
4973 -9718 -27499 -15170 -10901 -3478 -17680 -23181 -56855 -52778 -31815 -36568 -43172 -30772 -13317
4960 -13317 10536 7821 -575 -6750 15422 41637 27698 -2899 -11001 -9180 -2985 -347 -8130
4947 -8130 -10579 -3237 -9419 -22290 -48127 -31340 -6470 18391 -4500 -11564 -23150 -12119 19335
4934 19335 12890 23539 15449 38318 25467 11447 9983 14714 -4572 -20162 -26978 -25208 -20294
4921 -20294 -20770 -8758 8246 14407 -5595 -10069 18136 14705 13747 49063 47759 19169 -11351
4908 -11351 -17257 -9099 -19975 -55062 -69075 -38967 -30522 -22650 -32513 -48456 -23084 -8130 -21943
4895 -21943 -22766 -8303 27945 35875 34406 34537 25712 -2254 -21283 -13634 -21115 -39959 -24717 -21751
4881 -21751 -28434 -17384 -13327 1164 -2362 -7533 -10372 -5775 -28649 -9016 4589 -57088 -86489
4868 -86489 -47518 -28284 -20867 -28547 2562 -19010 -16653 -19265 -36699 -37186 -33246 -21074 -18468
4855 -18468 -29076 -36609 -20361 -30548 -28846 -17271 -36317 -30651 -34010 -2845 6034 12703 16084
4842 16084 -32412 -38601 -33123 -29759 -13381 -28877 -58347 -49780 -30093 -22280 -29970 -17686 -6244
4829 -6244 -1852 -2424 -24425 -47766 -54561 -36826 -8493 7984 22326 23564 33268 37680 -2089
4816 -2089 -46431 -59835 -47187 -12805 2473 17590 11814 -7853 -9756 -1542 -15530 -20358 -23167
4803 -23167 18712 24019 15168 25571 7489 -1516 634 -18063 -36320 -69006 -53252 -41825 -47291
4790 -47291 -34480 -14270 2243 9292 26175 -5901 -45736 -29364 -27416 -35359 -36565 -31965 -14548
4777 -14548 -9841 -23843 -4454 3102 12223 28681 45230 40343 38672 13137 -13855 -31463 -13177
4764 -13177 -8804 -14892 -29202 -43277 -38745 -47846 -54871 -60053 -49676 -42469 -56784 -32217 -18864
4751 -18864 -35016 -42807 -14355 -720 -11132 -46199 -33010 -27129 -39570 -40344 -28228 -37059 -34275
4738 -34275 -33317 2272 25196 17280 -22023 -24258 -28521 -28193 -5879 11815 24026 5082 8959
4725 8959 -3947 -1496 10119 -1362 -12642 -20949 -6077 -8999 -5961 -1425 19234 13837 11091
4712 11091 -8750 -24089 -43935 -34084 -40912 -50464 -38765 -13074 -213 39492 44792 437 -32561
4699 -32561 -29369 -61300 -90934 -72579 -65178 -71343 -84598 -38150 -24240 -17546 -3002 26330 25467
4686 25467 19190 26556 1134 -4559 10868 14401 14196 7041 18040 27206 36815 36700 -1508 -20952
4672 -20952 -8720 10724 17914 -5672 -9802 -13255 -24200 -13122 5960 -966 -13725 -18809 -21432
4659 -21432 -17360 -3229 16489 7486 1355 4782 599 14508 2311 -15905 -2038 5136 19675
4646 19675 -1591 -29181 -43550 -21907 -5036 -21985 -21060 -10406 524 -15850 -35017 -43862
4634 -43862 -11227 -12601 -17474 -8537 -14750 -9676 10176 1745 -6661 -12813 -33962 -33274 -34231 -34662 -43961
4619 -43961 -32971 -13911 -13783 -15090 -18864 -21653 -2544 15074 13182 -10295 -27055 -36691 -33961
4606 -33961 11248 13588 -36831 -36359 -26355 -36993 -39142 -20724 21537 11886 17927 2894 -7168
4593 -7168 6730 14453 9401 -5806 -14429 670 8372 3033 23310 30388 274 -419 -5504 -9149
4579 -9149 -41708 -65810 -37217 -27874 -5557 -7042 -3407 -4689 -20785 -30643 -39080 -53461 -60515
4566 -60515 -63820 -48306 -47357 -28793 -830 -4979 -32967 -10394 -12543 -5128 18894 -1065 -17972
4553 -17972 -19641 -44728 -27589 -3541 6892 -36760 -57167 -36108 -48990 -55076 -47236 -15450
4541 -15450 12479 24612 18647 -6941 1689 5459 -6322 -21274 -29767 -40946 -12673 -9491 -32862
4528 -32862 -36209 -40949 -29135 -8605 -19704 -37262 -53169 -35208 -6833 -514 -2060 -19775 -20028
4515 -20028 -6865 26163 11268 -8672 637 8721 -1374 4324 -1108 11642 33476 41921 48819
4502 48819 35807 31462 28566 1645 6631 13548 12809 1482 -4100 1118 -9242 7425 14192 -8232
4488 -8232 -19410 -14737 -23665 -32497 -22165 -44399 -48537 -58450 -50155 -24746 -10574 -9584 -13567 -30072
4474 -30072 -27371 -26803 -13163 -16998 -26476 -24730 -27253 -44479 -22603 -7491 3376 2821 9938 32817
4460 32817 32475 37322 5926 -12541 -9993 -2418 10206 -7037 -18564 -25298 -27886 -21900 -15369 -26284
4446 -26284 -20351 2418 -5798 -7519 31066 21646 -7947 -35842 -41406 -39917 -45442 -27512 -23523
4433 -23523 -29840 -25797 -25714 -31199 -11394 -4452 -21084 -50678 -39241 -35652 -33860 -30894 -27360 2653
4419 2653 10710 19592 -953 -20259 2055 -4148 21509 25675 12101 -7181 -17362 -28909 -25638
4406 -25638 -40736 -31178 -36344 -34094 -11915 -7565 -7352 -7410 -15005 -20653 -21882 -11127 2574 -28528
4392 -28528 -15336 -18346 -22402 -484 -2817 -8040 -8306 15387 54016 56850 43658 20967 8333
4379 8333 11556 6795 9927 16688 -4590 -31540 -5223 19931 11781 13298 6737 16878 27908
4366 27908 8186 -15581 -5211 -5997 -25938 -19334 -16596 -14057 10778 -11495 -55201 -54098 -24365
4353 -24365 -33864 -26349 -44732 -30114 1184 -8225 -505 -8146 -13297 -4929 -832 -20497 -24777 -26263
4339 -26263 -17177 24575 18198 150 -3857 -10036 16201 45356 18992 15152 20715 15996 5075
4326 5075 -9156 8966 23275 11082 13615 6364 -38472 -70628 -49424 5446 34619 5997
4314 5997 -6590 -7272 -23068 -9223 20205 37545 17123 34301 37695 25122 17718 8104 17710
4301 17710 10382 5384 -29379 -42795 -28795 -22888 -9991 -359 -18769 7118 4153 -9582 8057
4288 8057 3632 -19174 -27107 -4956 5732 31250 48012 28051 34220 26731 822 -13997 -19782
4275 -19782 -35922 -44332 -33039 -21446 -38776 -82557 -77834 -44941 -37256 -11371 -17590 -40624 -54161
4262 -54161 -74304 -49814 -10282 27922 22298 -9766 6514 30749 18557 -34363 -56225 -54391
4250 -54391 -51441 -50334 -25047 -4126 -22196 -56101 -67200 -30553 -10978 -11105 5071 1763 7487
4237 7487 -69 -18072 -21028 -6139 12982 16934 5355 864 9246 3858 -16752 -34824 -40868
4224 -40868 -31478 -34460 -19595 -29008 -20236 -10715 -12987 -28682 -8957 -18183 -17810 -14455 -23617 -17837
4210 -17837 1687 20673 22896 21385 20233 31555 19914 7448 -7592 -15431 -20577 -4612 -29022
4197 -29022 -17456 10591 47207 49495 22738 2179 36869 54921 27590 13375 40507 38907
4185 38907 19137 8374 -2517 -21201 -35775 -19294 -20941 -36787 -27391 -7694 -10366 10014
4173 10014 19501 -6742 -20053 8092 -7987 -23443 -27819 -33357 -2340 23592 2509 -35127
4161 -35127 -12961 -4719 1780 17191 18869 32974 40031 37393 36715 36376 7621 -2339 13096 13589
4147 13589 -10066 -43442 -19005 -3522 6038 3297 -17073 -3867 -12958 -9939 14397 20627 -4104
4134 -4104 -728 3145 -16602 -30312 -26681 -28883 -32731 -16686 -15290 -20129 3224 -482 4391 21521
4120 21521 24261 -4774 -25798 -31253 -23242 -38064 -23498 -8773 -16040 -38221 -24912 -40272 -49889
4107 -49889 -10311 -11087 -44858 -53821 -29290 -7995 -23595 -32723 -24218 -5773 -15861 -25647 -19357
4094 -19357 -18893 -29115 -43056 -48920 -43855 -14586 15841 1517 -8447 -3948 18961 2428 -10522
4081 -10522 -11695 -17457 -5734 -9729 -2158 -1203 -6186 -4735 16580 14470 28664 26866 6510 1177
4067 1177 1195 -24447 -17480 -13685 -25474 -9925 -3508 -16001 -26871 -12444 -12500 11590 43017 5303
4053 5303 -20422 -25085 -31470 -25317 -14157 -8223 -2517 19635 18837 45630 75088 63185 53857 11128
4039 11128 -17329 -21997 -48432 -75224 -47262 -51975 -47241 5190 17496 10774 -10061 -39295 -45126
4026 -45126 -28565 -27548 -20681 6733 14167 10141 -1496 669 11697 -10346 -23317 -16714 -35068
4013 -35068 -48587 -34122 -33998 -36445 -55141 -70522 -49675 -21678 -28293 -3377 14216 24281 38123
4000 38123 383 -32422 -36982 -23845 27491 36393 -13569 -33602 -28042 -43528 -37686 -35832 -42349
3987 -42349 -31455 -8035 -6932 -14700 -29924 -50029 -29404 -33139 -49928 -75433 -81553 -91710 -67166
3974 -67166 -25601 5164 10965 -26712 -47490 -26862 -35337 -16415 20724 -1546 -21065 12155
3962 12155 14523 -21873 -19491 -5873 -30577 -41847 -9570 3886 2318 27246 26184 -28741 -28889
3949 -28889 -6906 -12289 -18316 1896 33944 17957 -32211 -43785 -52126 -49773 -10904 6710 -399
3936 -399 -10671 6744 -8012 -21804 -27503 -5878 -13580 -29395 -32199 -43052 -54743 -37982 -20972
3923 -20972 -4494 -9618 -8317 -8743 8592 -5868 -50382 -56857 -37335 -36314 -63790 -58343 -28528
3910 -28528 -9511 19640 28409 34133 34735 38109 56012 32398 9147 11845 21208 11804 3447 18245
3896 18245 26785 32148 21043 34163 20603 15654 4802 8015 28241 41525 33011 28712 12476
3883 12476 11317 -21302 -31494 4624 33658 26185 4180 5617 11862 12698 14955 6116 -13 -6219
3869 -6219 -12606 -7798 -4769 -2237 16300 34037 20341 8148 19546 34752 28744 16085 -8076
3856 -8076 -8351 -1071 8134 13308 293 -38783 -42866 -32031 -18543 -22499 -29720 -42230 -31640 -7695
3842 -7695 12692 12672 8213 5973 424 -5119 -20462 -49978 -38657 -27003 9844 27010 18639 -13181
3828 -13181 -22802 -15755 4259 5704 24758 26613 20641 14565 -7452 -14089 497 8362 -9634
3815 -9634 758 18427 12904 7111 -12225 17718 5745 -17547 -33574 -39650 -35045 -27384 -5978
3802 -5978 18436 35247 20905 3811 -26126 -31739 -46734 -52760 -38486 -38352 -37266 -33234 -21381
3789 -21381 -15990 -25266 -26556 -25561 -15052 -15566 -3833 -21553 -4284 17357 12092 811 -21421
3776 -21421 -665 31597 10269 20113 37135 15315 -3029 1904 7974 -8587 -41113 -67261
3764 -67261 -47230 -48468 -43338 -32387 -20950 -27040 -24822 -33726 -26788 2623 34399 35230 25073
3751 25073 -267 -15847 -19541 -28215 -37247 -23303 6405 15835 4835 -14189 -31812 -42457 -63830
3738 -63830 -38025 -17323 -35748 -21816 -4149 8415 13047 24406 49589 59689 23615 -4550
3726 -4550 -7802 -22888 -13817 -7931 -9577 -21428 -17222 -30153 -38927 -44774 -41081 -15866 -2619 -19182
3712 -19182 -45930 -48504 -27730 -23589 -3400 3986 -12011 -1429 10589 615 -12395 -34996 -54783
3699 -54783 -46960 -31623 -29429 -17647 -24833 5354 23987 5405 -10450 8185 2198 1690 -12665
3686 -12665 -19943 -35608 -43969 -17465 -14929 -3195 12916 6329 -41718 -39513 6659 10038 -25516
3673 -25516 -36058 -33429 -13312 -23690 -39093 -3930 -6849 -6603 -24063 -51944 -30764 -23464 -21054
3660 -21054 -15769 11131 50287 42034 18865 -4527 -3553 -9253 -9020 -4984 3919 14655 26805 42467
3646 42467 43519 21391 34253 19002 -4128 -20672 -7961 1241 -3751 -6502 -10672 -24190 -10119
3633 -10119 2863 -8045 -16717 -34072 -7968 10721 16569 18166 25933 3884 -25341 -25774 -44280
3620 -44280 -51064 -12420 8933 32639 41659 59083 58237 33000 13911 -12785 -22462 18502 40536
3607 40536 55121 57532 67553 41487 21824 35187 48282 39617 3224 -7563 -10817 -7988 -4076
3594 -4076 2506 41826 71868 46590 30317 18261 7696 17395 24882 38603 35860 35766 56995
3581 56995 67121 23501 -2814 19259 7251 -530 -3461 -31602 -27903 -7005 -2582 -38526 -55099
3568 -55099 -33210 -25683 -45574 -46475 -41185 -29245 -30269 -22879 -9106 -13234 -30381 -38104 -26688
3555 -26688 -35178 -33611 -16139 -22717 -8274 -7252 688 10517 -8838 -44434 -47499 -19057 -2369
3542 -2369 -15691 -32697 -14392 -13104 -20970 -18361 4299 8904 13066 20475 14986 -17848 -27370 3302
3528 3302 487 -37102 -42055 -28167 -26042 -35983 -31911 -43602 -44361 -40807 -38546 -38127 -45626 -41843 -39335
3513 -39335 -39464 -35562 -38564 -21059 -6913 3762 48737 36222 -4464 -27972 -31851 -18041 -8743
3500 -8743 -29592 -21470 -10046 -29306 -1931 -317 -4828 33376 42231 21511 2940 8718 27057
3487 27057 -4679 -17676 23046 27059 42128 28797 -2365 -19124 -21195 -9543 3457 18431
3475 18431 34179 30377 31122 14461 -8192 -6190 20711 26622 6567 -10971 5459 15316 7965
3462 7965 12504 29555 36558 35327 12733 38673 22422 22107 14331 290 515 24975 24700 7380
3448 7380 -5712 -8718 -25924 -30906 -6180 -19619 -11783 5933 14769 4215 -713 2477 16434
3435 16434 -17544 -14613 5183 17270 9072 8179 14646 4661 -9961 -11856 13982 34207 26186
3422 26186 18851 11700 11118 19350 23809 7685 3511 -1146 -29492 -25534 -3463 -8774 -19784 -10672
3408 -10672 -6847 -20653 -16369 -7215 12847 -6742 -16781 412 -8940 -14361 -10635 8820 -2990
3395 -2990 17779 10736 1186 -3207 -17601 -21600 10333 -7743 -44024 -28744 -32705 -27190 -35560
3382 -35560 -8800 20134 37955 34878 20955 -2060 9687 2434 -21063 -20406 -40085 -43932 -36115
3369 -36115 -22360 -6302 -4283 11761 29635 6743 -5625 -21154 -32707 -24268 -34537 -28825
3357 -28825 4071 18618 17074 45930 38211 -1282 -15835 -20515 -7812 -10300 -30564 -21518 -4455
3344 -4455 -7421 -44 -4973 23800 -5964 -18410 -17747 -44685 -36989 -27176 6688 13573 2080 -15807
3330 -15807 -11994 -5047 -26699 -25906 5701 33463 15918 -5321 12327 24363 37422 24559 -16413
3317 -16413 -55855 -45386 -31448 -24949 2739 1486 -6913 -1350 -3337 -7040 -20057 -29716 -19195
3304 -19195 2723 11055 -6498 -12965 -26173 -20423 34378 37153 13257 5972 36150 17688 -14881
3291 -14881 -20569 -27386 9271 19579 2605 30265 35840 41017 27021 22898 9510 5677 35118
3278 35118 34882 26620 23891 -534 -26762 -34890 -21074 12676 16837 7830 5627 -25804 -31534 -2624
3264 -2624 20147 -2298 -25793 -22788 -27612 -19606 -6220 15064 8352 17922 8953 -25733 -57740
3251 -57740 -81106 -51057 -33540 -61820 -63604 -54886 -32247 -54233 -63481 -34876 -40441 -14687 22868
3238 22868 15562 -421 -8832 7237 24288 25990 21270 31200 720 5356 27675 22505 -6054
3225 -6054 -13788 1314 -1863 -2287 -8617 15814 31084 27034 3240 -6655 4781 24139 7467
3212 7467 3168 -11192 -3529 -1334 -9660 -12542 -22239 -34899 -38587 -27307 -14541 -10568 -31469 -40248
3198 -40248 -31636 -29038 -39779 -27489 -24733 -33984 -26803 -4334 -24564 -35647 -46670 -37356 -20139
3185 -20139 -32860 -9989 -19858 -9631 4706 -2723 -6088 16037 27366 14231 -8834 -18799 -29417
3172 -29417 -25178 -25029 -37785 -24337 13743 21038 22546 19903 -5123 -15666 27015 78319 86702
3159 86702 30099 6708 1245 -3040 33738 37088 38924 27521 24752 17889 -1668 -26471 -11900
3146 -11900 -2909 -15584 -11440 4856 8539 9588 15076 -2502 -30566 -52818 -25286 -33491 -40666
3133 -40666 -21522 -18208 -11083 -4507 -21462 -21047 -6064 -10557 -31623 -21811 -3076 -28505 -4880
3120 -4880 9093 -17958 -40698 -50593 -37668 -22982 -21431 -14993 -20182 -19648 -39199 -24311 15761
3107 15761 45316 34906 22321 2957 -16131 4404 756 -2236 3671 17196 12006 -17675 -21113
3094 -21113 -15778 -8895 -5254 -3201 10039 5151 -1181 2687 -12352 -51739 -63609 -32578 -19967
3081 -19967 -16530 -1703 18729 9055 -297 -11898 -14152 -6645 -8541 -1744 32381 63666 48631
3068 48631 44600 28636 20592 33741 68164 75903 26460 13779 18070 28648 28771 21685 6461
3055 6461 -19012 -7254 -11595 -43657 -18950 25835 32287 -1132 -27370 -28320 -6058 273 -18375
3042 -18375 -26506 -43763 -54175 -44201 -16540 -4930 -1331 36895 54698 51942 14791 8662 10602
3029 10602 17053 15026 6533 -50 -5733 442 9850 11306 16689 10335 -10321 -7597 -4194 -10074
3015 -10074 -2051 -4145 -25494 -9466 -17401 -36670 -39205 -11582 741 -734 -17476 -3582 54621
3002 54621 66962 57282 32568 41197 12053 -9125 -10879 -2458 22626 33020 27493 13201 -819
2989 -819 10397 25156 38863 28723 12513 11453 11623 17822 8331 8849 8773 7638 -3184 -16425
2975 -16425 -22084 -6911 -2877 13912 -2875 -28540 -22521 3929 28459 25757 15204 818 1908
2962 1908 9455 31031 38998 24472 -2994 -33063 -45217 -36587 -11356 -1432 18511 -1920 3374
2949 3374 22020 40631 35367 41643 41346 34664 30335 35873 48761 30057 -2864 -17897 -6432
2936 -6432 -15368 -44942 -33131 -38936 -27570 -4832 15449 -9124 -23733 -27613 -14436 -17047 -17302
2923 -17302 -247 2099 -3037 13950 17064 7672 -5904 -2733 5910 -5230 3183 11710 3318 -6954
2909 -6954 12964 42663 23163 -8244 -46990 -49012 -20220 779 5775 -4566 5017 -2862 -13147
2896 -13147 10957 22832 4914 9773 -5196 -8022 -10223 771 22897 637 1285 42256 46548
2883 46548 26339 27263 26836 8906 -12261 -3537 15233 -6262 -5947 30074 42188 50696 17685
2870 17685 3730 9623 13419 12137 13507 35004 30800 8974 7960 21173 24917 -1951 7919
2857 7919 40406 48693 29525 16157 43332 39497 5710 -15098 -42712 -46590 -43666 -59794 -52708
2844 -52708 -32505 -20817 -33685 -39104 -26599 -6993 10810 3851 6273 -13809 -36669 -12178
2832 -12178 12989 -6694 -3914 -13488 -4409 -45 -5741 -19818 -19170 6884 2009 -3857 1226 33152
2818 33152 3286 4993 25975 39822 18278 29302 9058 8340 2903 -12833 -35853 -27194 -6131
2805 -6131 -36868 -30764 -9115 9495 -3777 3562 -12233 3661 15362 5531 -5203 -23740 -38096
2792 -38096 -10575 11160 14609 -4531 -16078 -25227 -17670 -17937 -33253 -29481 6699 2734 -3029
2779 -3029 5577 -16363 7116 14646 25014 27244 7486 19598 4201 -12901 -20849 -24936 -13318
2766 -13318 18666 10545 -2601 -28821 -32439 -1780 30411 23551 21045 22087 9006 3196 -1814
2753 -1814 -15541 20342 22440 -10906 -24029 -36126 -48720 -26586 3941 16290 12122 7065 -8
2740 -8 -18333 -25230 68 -4134 -21779 -32776 -35116 -9458 -24636 -13997 -39293 -68953 -74093
2727 -74093 -53087 -38455 -48826 -58754 -12396 11921 14008 39260 47709 42190 9682 11366 14568
2714 14568 6935 7312 16639 19509 15777 -12550 -32802 -42975 -16187 11386 -14426 -52288 -12183
2701 -12183 -3029 -26741 -28573 -4586 7327 9346 -24255 -13806 -2460 -11420 18459 38091 59074
2688 59074 35533 37850 30696 32620 35244 24186 20414 28391 25733 -150 -13261 -8736 -14639 -13970
2674 -13970 -32225 -15731 -20034 -23366 -11854 -13597 -3900 -15506 -45983 -29134 1643 -1642 -10209
2661 -10209 9805 35263 22900 23975 37774 30693 21888 -3391 -10373 -2158 -14408 8164 18144
2648 18144 20649 27838 34741 33616 26760 11499 -2800 -4438 13515 -11801 -24742 -8194 -13243
2635 -13243 -23013 -9400 -26087 -66067 -44014 -36891 -46075 -21957 27242 20845 -11360 -30747 -24198
2622 -24198 -16152 -23008 8308 3519 39336 50233 36286 31090 49046 32313 10759 37726 56131
2609 56131 30526 25028 3647 -11831 -12843 -22476 -18608 -10003 17057 -2444 -48972 -50376 -8087
2596 -8087 -22774 -47573 -22995 -8559 3922 18719 6060 21049 17289 12147 -18328 -7404
2584 -7404 -4257 -1766 -9777 -14971 -19818 -10179 3127 14306 -2793 621 1304 -16544 -19452 -23713
2570 -23713 -39162 -29038 -25277 -17519 9223 3038 -3865 -10279 -22717 -10583 -7290 5912 15573
2557 15573 19069 16626 37029 38240 5842 20960 39755 44089 16746 -12658 -27371 -24107 -2883
2544 -2883 -4836 -19762 -33059 -59527 -46962 -29849 -23694 -11793 156 3396 17720 39531 11698
2531 11698 -3821 -3773 -3216 -6574 19971 33423 10888 1206 2009 13572 43394 44802 32288 39850
2517 39850 53411 53784 44138 41539 46481 47040 34948 39869 44432 43417 36333 39033 51618 51663 45298
2502 45298 43617 52331 22406 39377 43003 27150 27767 20905 16400 5066 16128 28986 2375
2489 2375 7956 23588 7842 9625 23334 24782 15694 12327 17054 15652 -1916 -25241 19354
2476 19354 45558 12539 -16172 -6092 -29446 -49311 -72992 -67839 -47770 -32779 -43524 -42851
2464 -42851 -40894 -17403 12930 16788 22854 25876 10098 -25089 -58625 -53354 -9725 8782 27162
2451 27162 27759 18837 5495 -9156 18631 29401 5441 6944 -6486 -47935 -39639 25063 46512
2438 46512 72488 58681 39759 29901 8057 -18809 -57498 -67451 -43985 -41298 -71591 -64021 -30958
2425 -30958 -36510 -53628 -46619 -22576 -7485 -11076 7480 5144 -11618 -33836 -98 31348 21850
2412 21850 16814 10457 -4134 -24333 -39564 -33174 7207 14510 -2307 -13424 10819 14122 -2615
2399 -2615 -31788 -8869 -15562 -32203 -29200 -7708 12023 7592 92 -5719 -14848 -35110 -61179
2386 -61179 -32473 -940 3027 3401 10251 14164 18502 24473 25980 18233 11585 13907 -21573 -293
2372 -293 32422 35206 17926 13624 29100 21988 31817 24940 11826 -9495 -2416 15669 7011 -18839
2358 -18839 -17348 -13784 -28663 -20748 -33825 -23590 -3491 -11639 -14788 -16719 -38719 -21528 -22875
2345 -22875 -8183 -10905 -34017 -38231 -20691 -16406 5042 15368 2531 1892 72 -2355 -14196
2332 -14196 -18766 10025 34680 40575 26311 1483 -42891 -23777 -25924 -17979 -12431 -14044 -7260
2319 -7260 2746 17401 17435 -18850 -32113 -5789 -3704 -7685 -5278 -19947 -14438 -31453 -36737 -31279
2305 -31279 20395 41213 27743 44680 38713 9948 1172 -2366 15537 19898 25096 36357 20575
2292 20575 2489 13944 3463 -15291 -22419 -12218 3028 -37779 -34994 -51702 -39771 -34407
2280 -34407 -48776 -39119 -22191 -26448 -33405 -50202 -27001 -27097 -26162 -16206 -239 15357 4501 -18999
2266 -18999 -13266 8531 -334 -19387 6362 -311 16378 27024 32154 25769 52732 82053 86524
2253 86524 81904 84793 57630 24646 24513 25037 5306 -6428 -3373 8221 23742 33090 15658
2240 15658 -15899 -1335 10342 20218 32560 47614 22544 -1951 -27305 -35232 -23828 454
2228 454 14074 29335 11796 12764 26216 22153 -5741 -33521 -16125 -20856 -31281 -42815 -32800
2215 -32800 -18997 5917 27867 16091 25784 26149 1278 -5644 -14347 7502 -24911 -39449 -42980
2202 -42980 -60772 -48625 -66152 -59012 -34666 -23984 -5959 -132 2537 -12231 -35334 -43620 4933
2189 4933 40010 18050 2034 29757 41692 46862 5976 8220 34884 10336 1029 21425 8180
2176 8180 23284 11355 -16921 -31995 -37123 -16523 3646 -12106 -12356 7169 17576 16368 -1412
2163 -1412 -6580 5321 -12232 -16125 -50875 -71647 -55748 -28413 -3230 -15853 -18803 3182 -546
2150 -546 -2247 -6137 -26817 -35688 -8211 9426 26856 39170 26026 6090 -785 3013 15888
2137 15888 -14272 -18371 10238 4641 -777 -11988 25399 38929 6078 -15816 -24495 -34211 -34578
2124 -34578 -15023 13581 6817 -10702 -1270 -870 -21493 -813 -15164 -25960 -9456 -3185 -3790
2111 -3790 -25916 -29003 -25908 -30749 -33332 -17149 6987 -5744 -1022 -2196 -2012 -18360 -44843 -43424
2097 -43424 -54177 -17712 4229 10894 16148 3978 19489 36234 38244 22540 2500 6383 9013
2084 9013 39386 35046 27833 -5537 -26180 -3412 -531 1655 1721 -9862 -11782 23564 22785 21088
2070 21088 1512 15748 13017 22054 25272 32338 20060 12717 11328 -7645 -10353 10985 41499
2057 41499 41317 12264 -11691 4769 21812 31035 16501 23011 42076 41546 12722 -27534 -35236
2044 -35236 -11867 -2840 -11381 -8866 -16048 -12578 -23056 -10248 -11657 -4742 12970 28878 33900
2031 33900 11688 10453 7082 8307 28005 54691 59654 44602 8846 6425 15264 11117 28058
2018 28058 35160 24339 27003 9578 2478 35315 33118 7077 -13775 -14082 -2769 -18111 -29684
2005 -29684 -10531 3571 -7249 -1982 -3644 6432 6550 -10338 -25706 -21423 -13236 -15207 -271
1992 -271 -1492 -11143 296 490 -11255 -3772 10567 5656 -1037 1020 -19642 -20012 -2510 -782
1978 -782 7928 28992 21623 34111 16402 7378 5038 -8587 -6158 28122 18679 1671 -18346
1965 -18346 -26553 -5481 10205 -420 -17835 -35295 -14046 -22211 -38687 -54616 -44362 -16153
1953 -16153 -9359 -759 15776 16545 -781 -16484 -13177 4616 21998 36971 36529 20842 10116
1940 10116 -20682 -28836 -25540 9237 18093 30357 26509 20214 16260 -3009 -10388 4729 6178
1927 6178 -44444 -13908 8270 9468 -6307 10531 20640 36810 44738 9166 -15110 -18385 -27090
1914 -27090 863 2414 -25477 -37953 -52917 -47931 -40030 -24058 -8863 7918 15586 23720 6296
1901 6296 5858 27715 21301 18496 6508 -13361 -5813 -16929 7510 26019 51183 60875 48544
1888 48544 22078 11617 -22809 -12824 4547 -8811 6159 31081 39454 30879 26695 23940 12151
1875 12151 -522 2771 -1729 196 6780 12886 6278 254 -7117 -16690 -12495 -25706 -7082 -8178
1861 -8178 -1360 -844 -282 19824 17226 41252 41693 60700 59531 34800 39311 63216 72219 57174
1847 57174 43003 42610 32923 32072 16712 21433 21942 11818 -8329 -30617 -9120 -6049 -36234 -38284
1833 -38284 -21883 -23015 -7353 14090 23652 24826 23653 23553 11159 1966 10665 7086 25919 36376
1819 36376 -7841 -24830 -32583 -59705 -68995 -37118 18487 45539 61388 49584 20749 11786
1807 11786 -11477 -4628 -8304 777 27172 20115 12194 -2649 -39821 -56541 -37091 -24363 -28503
1794 -28503 -18986 -2086 10160 11572 -24892 -43075 -46038 -48690 -46668 -57248 -25969 -27540 -38439
1781 -38439 -16464 2092 -3683 3858 9671 15739 24921 28767 16212 6531 1785 256 15774 13154
1767 13154 7449 31955 50072 32191 16531 16400 -16920 -22890 1718 18830 2949 3973 20409
1754 20409 -9981 -19527 25556 7167 -24148 -17846 17230 55626 65498 74293 50119 14814 363
1741 363 10195 11124 25837 10959 24349 38003 22626 11967 1405 14157 10870 9128 -4166
1728 -4166 9118 -5351 868 -4276 -18337 -28982 -24432 -3569 642 9786 16463 -2686 13233
1715 13233 30855 27597 31683 14550 -9136 12786 -3602 11650 44536 30111 21023 -10094
1703 -10094 -20075 -14748 -3734 -4577 -27150 -45647 -24738 854 5764 19338 9458 41503 60383
1690 60383 39657 34671 22657 9236 10497 -11730 -34282 -31596 -28892 -17345 -6105 400 1636
1677 1636 15809 5399 17794 42724 1988 -771 -2964 -51242 -42386 -15327 -19893 -22310 -19442
1664 -19442 -6150 -28367 -6531 6906 7044 -3858 -6095 18063 15194 -17338 -44736 -49896 -37946
1651 -37946 -19873 -10193 7049 -3982 1176 -6319 -10382 9247 31948 23906 29635 31645 49624
1638 49624 72239 69677 58457 57782 36504 27670 21348 1103 -24379 -38982 -17017 -6661 17281
1625 17281 24305 301 -6672 -271 -10139 9833 26756 28086 18702 14460 17867 33402 33904 2304
1611 2304 -5816 -11640 -30637 -7152 -13267 -3462 -2774 4818 12995 4245 -13091 -5717 16795 40971
1597 40971 65414 47686 -1887 13669 49649 42625 8937 -12064 287 7025 17951 6043
1585 6043 -29157 -38046 -31101 -14587 4247 13263 9106 4460 -3226 -37668 -25945 2386 6700
1572 6700 2940 11274 12020 17856 23899 24027 33362 20418 -4055 -8100 82 10774 -3855 -11967
1558 -11967 -4019 3287 17812 8851 -31432 -49418 -24806 -28876 -41924 -38866 -31123 -17793 -35718
1545 -35718 -27149 5918 30831 39826 26793 11871 -12457 -29552 -20212 29580 18321 24948 -8554
1532 -8554 -21873 -17279 -6731 898 10109 -1566 8636 14680 24668 25245 25407 37316 26751 393
1518 393 -4453 11695 8949 30268 69618 55035 14736 9124 34625 22323 25124 50852 59816
1505 59816 63465 65889 24264 -5514 -8413 4193 -9897 -12506 -2658 6055 -1823 12704 6267
1492 6267 -31005 -46305 -22317 787 40648 68075 33551 -1391 -14594 4061 -13833 6035
1480 6035 -2919 -17794 -34795 -26827 -894 -2747 -22339 -36632 -41089 -8559 -13155 -32355 -19446
1467 -19446 589 35777 29386 19804 25279 -8114 -51563 -37388 -6056 16214 16240 -14772 -28884
1454 -28884 -43655 -25323 -11578 -34384 -28988 -27360 -26257 19275 41420 21997 36717 35528 21094
1441 21094 30278 18426 -1560 -23902 -23742 -12979 -9658 8570 33409 36405 36770 -4080 -24637
1428 -24637 -27823 -26328 -4845 36368 38393 23261 3677 -574 24727 47014 20326 10917 23883
1415 23883 18020 -12287 9569 2749 10849 31014 10395 -5820 -15859 -7607 26355 40353 52101
1402 52101 33134 6505 15351 -3899 -10910 5452 27468 39643 60842 38131 33251 44950
1390 44950 38618 46368 51527 26413 22733 -22907 -53723 -59374 -47033 -15525 8428 -12738 -20513
1377 -20513 -12072 -19829 -5226 -1502 -11658 -31450 -13494 4009 -17231 -32603 -39166 8620 38236
1364 38236 23726 25671 28810 8531 -3167 -4450 -1324 15424 6349 21260 4466 -16723 -17805
1351 -17805 11658 21460 48556 50705 24720 15980 8237 -1287 -11199 -729 9922 12166 12951 2925
1337 2925 -1556 -11655 -8309 -16410 -19757 -5424 22678 30945 10104 3974 -17949 -42008 -37901
1324 -37901 -43708 -41001 -38005 -36829 -36126 -24698 -18288 -2421 16150 17573 -3838 -23881 -22494 -15480
1310 -15480 -3706 11227 40239 43419 21490 13638 1380 12000 48260 59114 54051 16684
1298 16684 -7833 -15799 -7189 -6988 -20390 -28825 -12117 1690 -767 -9502 -23381 -23230 -2616 -17666
1284 -17666 -6507 22575 57674 34095 27827 21070 38576 39463 24659 24259 25732 18157 6800
1271 6800 -8670 -820 25020 33090 -4113 8603 17301 20081 19880 31425 20776 28249 8025
1258 8025 -21346 -2746 49286 50266 36076 54848 39603 911 -6717 -14148 9524 9008 10845
1245 10845 24510 28779 16049 2449 -19570 -23546 177 -14225 4188 30645 32863 15087
1233 15087 19757 -2159 -33419 -23910 4152 19717 23772 14215 17785 7707 -9660 -24868 -10483
1220 -10483 6123 13555 16811 28651 59082 63024 56513 35173 20748 13794 -120 -31892 -40723
1207 -40723 -3467 22981 28378 6759 -5419 11425 25117 49005 43018 13366 -15123 -24929
1195 -24929 -18644 -6536 17351 -12301 -50172 -23067 1172 10216 21418 19679 -3336 -5456 7695
1182 7695 9592 -6729 -19879 2430 17043 18254 10578 5518 30544 30827 13263 -1419 -12349
1169 -12349 -25091 -23521 1276 19896 -6206 -2752 32741 26598 7787 4530 36600 41160 60991
1156 60991 42855 23702 14979 21519 17122 -40 -11835 956 12703 -2250 30614 25019 12067
1143 12067 10575 21254 16470 30279 40527 -1675 -6603 33151 65656 41873 -11463 -10579 -6390
1130 -6390 4242 14409 12890 -479 -24486 -23465 -8844 3333 35985 24327 37331 29411 26583
1117 26583 35922 43821 56416 32776 21224 7846 4543 2728 535 5540 43830 53223 32656
1104 32656 26357 2517 -31749 -31132 -7628 1964 -6889 -27648 -15717 -7639 -29181 -27902 11040
1091 11040 -4627 -5188 -899 1792 17698 42412 47312 21849 373 45430 51951 34258 -10050
1078 -10050 -7448 21571 16311 30579 44364 47737 54919 84097 61831 28013 4493 -10724 -26489
1065 -26489 -12307 4745 4760 -5848 -17257 -9424 22204 20079 33357 26695 24283 35802 45418
1052 45418 38627 42509 36462 6886 -14410 -14470 5185 2405 1733 -20944 -24004 -22752 -25154 -24520 -18929
1037 -18929 -7733 1292 -9735 -25535 -20336 838 -961 -7675 -14959 -34707 -9239 20633 68265
1024 68265 82700 58850 32836 48192 66438 61174 9170 -45017 -30398 1578 33544 38298
1012 38298 25291 37164 62549 65615 48375 32080 29997 39437 56266 51519 64897 53962 40384
999 40384 33276 42932 31314 52475 57697 41610 17903 13439 8612 1885 -24133 -26576 -10450
986 -10450 6789 37076 40159 24330 6364 14404 27611 49142 41240 42644 69051 79841 56838
973 56838 40793 19544 11543 13037 40205 42853 23874 31590 34870 17861 21753 43457 48436
960 48436 40660 2897 -14712 203 3 -13142 -13613 -42889 -28647 -18481 -17662 -12227 -7465 5060
946 5060 11069 35299 33069 4984 -38077 -33206 -12243 36338 16208 -13220 -6168 5346 -14795
933 -14795 -31233 -11977 3663 -9827 -26610 3461 8307 13065 32754 43800 9671 -16756
921 -16756 -43283 -50189 -987 29478 -18017 -53616 -31675 21182 25745 6021 34349 30323 16778
908 16778 23910 16768 3133 -20674 1110 19151 4280 -13906 -14476 1056 31436 54344 40255
895 40255 43520 30624 -1260 940 -11880 -15329 705 12924 12833 14560 11184 -17605 -46701 -35894
881 -35894 -22255 -24687 8518 17105 26432 33902 25098 9754 -6969 2759 26783 19989 12598 -7863
867 -7863 -14395 -4605 2469 41458 22250 23129 -3269 -27964 -21832 -19810 -8023 3066 14830 15563
853 15563 43957 38695 12802 34438 38525 22096 30232 19290 11435 16293 -1449 4841 8687
840 8687 39197 46553 37378 37063 31427 38562 49608 38572 14364 27487 30124 26032 -3462 -13353
826 -13353 -10720 -10046 8928 8042 6340 19187 30403 61027 56195 26953 13099 20464 11481 17547
812 17547 -6655 -7414 20693 61387 39206 16600 21963 18061 28263 34093 25067 27487 -4699
799 -4699 4351 19825 26868 20577 -317 31168 51595 36308 6679 15722 34566 41357 49115
786 49115 2850 -12362 -6464 16972 14458 16006 14282 -7077 22890 20587 16931 32085 34064
773 34064 16867 25154 61739 60699 42840 23185 21664 7982 11691 26790 43407 47108 44437
760 44437 35861 57244 77881 78394 55448 42014 43515 54878 43010 46782 59403 56492 24235
747 24235 4707 781 10301 38979 36830 7717 1832 -17284 -3958 20519 29363 74471 88453
734 88453 70821 61854 57821 41913 41892 40856 50455 63410 66349 56047 49333 34803 25189 16027
720 16027 17938 35201 69911 33319 -24340 -41249 -28269 -16716 7304 14832 26466 8546
708 8546 -5330 571 35542 77712 63770 65957 28153 -244 -7692 -12890 -31331 -17920 11546
695 11546 15143 -10436 -41319 -22198 6934 19780 30449 42693 55457 62224 82634 77206 69145
682 69145 28477 27608 30073 27270 37678 20698 9103 12252 6759 17274 29058 30836 41243
669 41243 37589 3317 5968 -4249 -8810 -8286 -15162 -34899 -20232 -5878 -1073 33477 46996
656 46996 26657 25474 2584 4659 19552 25155 38725 34637 18749 14057 4548 3857 -11900 -2372
642 -2372 30963 24098 26282 45950 60728 51209 46023 28129 4015 2174 10397 27336 40124
629 40124 30998 22005 15470 6047 4242 10211 47354 58276 59375 56234 35110 38147 24555 20117
615 20117 21472 27633 35468 19994 17363 44838 70624 78788 66664 39813 47010 50425 21416
602 21416 2992 7976 10357 -2772 20824 53894 56501 60907 56445 31274 8902 -1530 24429
589 24429 38973 32350 39361 43738 13535 -2813 12024 36525 49152 20944 16703 33573 48527
576 48527 54340 63625 53555 55781 50127 55600 34464 33266 29116 29314 22741 14645 32989 30176
562 30176 4495 22594 28617 28246 36673 27014 15768 4849 -21765 -133 49854 41185 18066
549 18066 4618 26859 42281 27488 38853 25230 22414 10490 -17020 -765 28316 36922
537 36922 6440 -199 8514 -2442 -10027 8103 39328 40578 41166 47103 22341 21317 38650 52921
523 52921 55932 54192 25641 -5523 22918 53231 33853 1812 -85 32868 47433 50481 59449
510 59449 46511 45962 27142 18041 40548 30028 5202 6335 18316 26761 29606 19405 16140
497 16140 31003 22739 9819 -1577 10804 19762 23915 34506 40237 49485 55345 51894 63231
484 63231 70575 61853 48407 54088 49462 32746 9311 -2921 8524 -1051 -6439 -996 8515 29166
470 29166 20249 13338 30614 31832 35096 39721 51292 27142 15148 31811 56206 57817 51309
457 51309 53305 57044 63932 63466 62147 36197 43025 52883 68789 98662 100966 80392 55187 51415
443 51415 40082 35748 31846 17526 28239 31301 27072 45088 51997 41153 21059 32196 39659
430 39659 25911 27230 49530 73166 81350 34281 -11021 -17031 38359 55056 29379 30159 46867
417 46867 28182 -11750 -37944 3815 45331 66668 84033 66395 60780 46607 50422 40569 32786
404 32786 47199 60958 50443 15408 21568 33716 54398 84872 77623 71986 42014 5785 516
391 516 12721 10598 7808 4599 20216 39656 41631 20344 19266 14000 11833 25893 50531 38067
377 38067 53177 48563 8115 9618 39728 50289 50147 39021 41628 48464 62256 50370 33057
364 33057 425 -1576 19258 35445 30195 27359 6137 9559 -21803 -30833 8239 43451 70118
351 70118 77082 59741 42180 24885 23335 16790 9450 -13694 -13005 -15859 -10669 3113 16005 31562
337 31562 40544 11248 915 -1748 -13327 220 22929 21080 12463 26158 18712 18615 21690 25646
323 25646 1079 9383 15848 13752 21182 32212 37476 48737 42683 26239 16047 9941 22039
310 22039 28753 55449 58068 44596 34216 10663 19710 19338 845 -3658 29818 18860 6090
297 6090 14712 -7355 -10809 -13295 3855 16517 17385 16754 3009 1580 9397 9165 16361 28442 30398
282 30398 16293 5482 4313 36441 76521 79547 60784 65453 76502 70244 48164 27312 25101
269 25101 5366 18367 24341 24975 15528 4340 27166 44258 51878 68349 62638 55346 53504 65743
255 65743 79175 61311 34749 21190 13441 42328 41079 43860 58938 52516 47597 32789 36805
242 36805 27357 9605 3215 18397 30699 40064 55810 59662 40429 29342 12641 -8062 -14076
229 -14076 10286 34822 15896 -2954 29427 36618 39561 47538 53979 63624 67897 47002 37985
216 37985 21372 39961 29987 26200 50285 53418 41613 45925 71633 83723 58474 36301 34028
203 34028 42778 41177 45408 20839 4983 8318 20104 33524 48804 57708 50054 46321 33167
190 33167 20556 35832 39186 38107 34990 37502 18737 11687 13990 23560 17441 1544 -15653 -12707
176 -12707 -6342 -17944 -9755 29379 54167 67508 67770 52862 38149 38928 51888 44675 32558
163 32558 23378 15379 32580 41681 34473 29706 28786 35577 31463 36551 37810 37924 28507 34256 37013
148 37013 44329 40399 35016 23595 21959 14357 11665 23230 51919 50528 45047 53865 56437 56039
134 56039 63297 63619 36750 22376 10473 37434 48105 48326 61408 59779 26580 15122 18499
121 18499 39284 51550 27172 14455 23775 54517 52457 51355 42569 13373 15145 16468 39303
108 39303 69227 50387 24061 17707 -6663 3953 40715 42129 31777 34651 25926 46873 44787
95 44787 23002 23345 13280 38144 60051 41217 41895 53742 53734 38081 34012 38328 33904 23918 25886
80 25886 37869 64138 71658 70359 59230 57198 53646 63562 49973 23457 142 -3264 6157 11895
66 11895 30638 49641 43201 51023 36505 23266 14592 26733 40886 44580 51513 61325 57898 59998
52 59998 49929 47279 27826 13466 15431 22246 15120 17850 -751 -16377 1285 20716 32917
39 32917 47076 53543 51320 47725 26449 31040 32570 34652 12367 3529 25453 39046 25992 5223
25 5223 7603 31919 44797 43930 56990 42759 24847 21591 16526 30363 23744 27407 34832 53801
11 53801 64852 51917 47196 44597 32316 28231 33864 16963 17316 41564 48620
0 48620
$$ Imaginary data points
$$ [...]
##END NTUPLES=NMR SPECTRUM
##END=
