##TITLE=Analysis number 323972
Compound Code cc 60404
Book Reference 470/123
Project Code adrs
Chemist Name mikem
##JCAMPDX= 6.0         $$ Bruker NMR JCAMP-DX V2.0
##DATA TYPE= NMR SPECTRUM
##DATA CLASS= NTUPLES
##ORIGIN= Bruker BioSpin GmbH
##OWNER= nmr
$$ XWIN-NMR		Version 3.5
$$ Thu Nov  9 17:06:58 2006 GMT Standard Time (UT+0h)  MAYBRIDGE\nmr@NMR_250MHZ
##.OBSERVE FREQUENCY= 250.131544655141
##.OBSERVE NUCLEUS= ^1H
##.ACQUISITION MODE= SIMULTANEOUS (DQD)
##.ACQUISITION SCHEME= undefined
##.AVERAGES= 16
##.DIGITISER RES= 18
##SPECTROMETER/DATA SYSTEM= dpx250
##.PULSE SEQUENCE= zg30
##.SOLVENT NAME= CDCl3
##.SHIFT REFERENCE= (INTERNAL, CDCl3, 0, 16.522)
##AUDIT TRAIL= $$ (NUMBER, WHEN, WHO, WHERE, WHAT)
$$ ##TITLE= Audit trail, XWIN-NMR		Version 3.5
$$ ##JCAMPDX= 5.01
$$ ##ORIGIN= Bruker BioSpin GmbH
$$ ##OWNER= nmr
$$ C:\u/data/dgb/nmr/ADRS/2600/pdata/1/auditp.txt
$$ ##AUDIT TRAIL=  $$ (NUMBER, WHEN, WHO, WHERE, WHAT)
(   1,<2006-11-09 17:06:35.46 +000>,<MAYBRIDGE\nmr>,<NMR_250MHZ>,
      <created by zg, POWCHK disabled, PULCHK disabled
       configuration hash MD5:
       49 4B E0 1D 92 C2 6B 37 9F E6 65 BC 52 41 86 1D
       data hash MD5: 64K
       42 93 CD 25 94 13 B8 E2 AC AF 8E EE 69 AA 8E 4B>)
(   2,<2006-11-09 17:06:48.23 +000>,<MAYBRIDGE\nmr>,<NMR_250MHZ>,
      <Start of raw data processing
       ef LB = 0.3 FT_mod = 6 PKNL = 1 SI = 32K 
       data hash MD5: 32K
       8F F0 CB 28 43 AB C6 52 EE D6 28 72 9D F5 3B ED>)
(   3,<2006-11-09 17:06:50.05 +000>,<MAYBRIDGE\nmr>,<NMR_250MHZ>,
      <apk 
       data hash MD5: 32K
       2D 46 45 70 B8 AB B6 18 69 23 90 52 75 D0 52 A0>)
(   4,<2006-11-09 17:06:50.85 +000>,<MAYBRIDGE\nmr>,<NMR_250MHZ>,
      <abs ABSG = 5 
       data hash MD5: 32K
       65 04 E8 85 66 DF 2E 06 6B F5 DD B6 E7 09 9C 17>)
$$ ##END=
$$ 
$$ hash MD5
$$ 01 7F B8 8B 44 B4 BE C2 46 CE C5 B2 05 F0 D9 61
##$RELAX= 
##$RELAX= 
##$RELAX= 
##$RELAX= 
##$RELAX= 
##$RELAX= 
##$RELAX= 
$$ Bruker specific parameters
$$ --------------------------
##$DU= <C:\u>
##$EXPNO= 2600
##$NAME= <ADRS>
##$PROCNO= 1
##$TYPE= <nmr>
##$USER= <dgb>
##$AMP= (0..31)
100 100 100 100 100 100 100 100 100 100 100 100 100 100 100 100 100 100 
100 100 100 100 100 100 100 100 100 100 100 100 100 100 
##$AQSEQ= 0
##$AQ_mod= 3
##$AUNM= <au_zg>
##$AUTOPOS= <5 >
##$BF1= 250.13
##$BF2= 250.13
##$BF3= 250.13
##$BF4= 250.13
##$BF5= 500.13
##$BF6= 500.13
##$BF7= 500.13
##$BF8= 500.13
##$BYTORDA= 1
##$CFDGTYP= 0
##$CFRGTYP= 5
##$CHEMSTR= <none>
##$CNST= (0..31)
1 1 145 1 1 1 1 1 1 1 1 1 1 1 1 1 1 1 1 1 1 1 1 1 1 1 1 1 1 1 1 1 
##$CPDPRG= <>
##$CPDPRG1= <>
##$CPDPRG2= <>
##$CPDPRG3= <>
##$CPDPRG4= <mlev>
##$CPDPRG5= <mlev>
##$CPDPRG6= <mlev>
##$CPDPRG7= <mlev>
##$CPDPRG8= <mlev>
##$CPDPRGB= <>
##$CPDPRGT= <>
##$D= (0..31)
0 1 0 0 0 0 0 0 0 0.06 0 0 0 0 0 0 0.0002 0 0 0 0 0 0 0 0 0 0 0 0 0 0 
0 
##$DATE= 1163091994
##$DBL= (0..7)
120 120 120 120 120 120 120 120 
##$DBP= (0..7)
150 150 150 150 150 150 150 150 
##$DBP07= 0
##$DBPNAM0= <>
##$DBPNAM1= <>
$$ [...]
##$SUBNAM7= <"">
##$SUBNAM8= <"">
##$SUBNAM9= <"">
##$SW= 20.6930455092707
##$SWIBOX= (0..15)
0 0 3 0 0 0 0 0 0 0 0 0 0 0 0 0 
##$SW_h= 5175.983436853
##$TD= 65536
##$TD0= 1
##$TE= 683.16
##$TE2= 300
##$TE3= 300
##$TEG= 300
##$TL= (0..7)
0 120 120 120 120 120 120 120 
##$TP= (0..7)
150 150 150 150 150 150 150 150 
##$TP07= 0
##$TPNAME0= <>
##$TPNAME1= <>
##$TPNAME2= <>
##$TPNAME3= <>
##$TPNAME4= <>
##$TPNAME5= <>
##$TPNAME6= <>
##$TPNAME7= <>
##$TPOAL= (0..7)
0.5 0.5 0.5 0.5 0.5 0.5 0.5 0.5 
##$TPOFFS= (0..7)
0 0 0 0 0 0 0 0 
##$TUNHIN= 0
##$TUNHOUT= 0
##$TUNXOUT= 0
##$USERA1= <user>
##$USERA2= <user>
##$USERA3= <user>
##$USERA4= <user>
##$USERA5= <user>
##$V9= 5
##$VALIST= <valist>
##$VCLIST= <CCCCCCCCCCCCCCC>
##$VD= 0
##$VDLIST= <DDDDDDDDDDDDDDD>
##$VPLIST= <PPPPPPPPPPPPPPP>
##$VTLIST= <TTTTTTTTTTTTTTT>
##$WBST= 1024
##$WBSW= 4
##$XGAIN= (0..3)
0 0 0 0 
##$XL= 0
##$YL= 0
##$YMAX_a= 495535
##$YMIN_a= -416377
##$ZGOPTNS= <>
##$ZL1= 120
##$ZL2= 120
##$ZL3= 120
##$ZL4= 120
##$ABSF1= 16.522
##$ABSF2= -4.171173
##$ABSG= 5
##$ABSL= 3
##$ALPHA= 0
##$AQORDER= 0
##$ASSFAC= 0
##$ASSFACI= 0
##$ASSFACX= 0
##$ASSWID= 0
##$AUNMP= <proc_1d>
##$AZFE= 0.1
##$AZFW= 0.1
##$BCFW= 0
##$BC_mod= 0
##$BYTORDP= 0
##$COROFFS= 0
##$CY= 12.5
##$DATMOD= 1
##$DC= 0
##$DFILT= <>
##$DTYPP= 0
##$F1P= 14.0000005364418
##$F2P= -0.99999901652339
##$FCOR= 0.5
##$FTSIZE= 32768
##$FT_mod= 6
##$GAMMA= 0
##$GB= 0
##$INTBC= 1
##$INTSCL= 1
##$ISEN= 128
##$LB= 0.3
##$LEV0= 0
##$LPBIN= 0
##$MAXI= 10000
##$MC2= 0
##$MEAN= 0
##$ME_mod= 0
##$MI= 0
##$NCOEF= 0
##$NC_proc= -3
##$NLEV= 6
##$NOISF1= 0
##$NOISF2= 0
##$NSP= 0
##$NTH_PI= 0
##$NZP= 0
##$OFFSET= 16.522
##$PC= 1
##$PHC0= -43.89241
##$PHC1= 4.063386
##$PH_mod= 1
##$PKNL= yes
##$PPARMOD= 0
##$PSCAL= 4
##$PSIGN= 0
##$REVERSE= no
##$SF= 250.13
##$SI= 32768
##$SIGF1= 0
##$SIGF2= 0
##$SINO= 400
##$SIOLD= 32768
##$SREGLST= <1H.CDCl3>
##$SSB= 0
##$STSI= 32768
##$STSR= 0
##$SW_p= 5175.98343685301
##$SYMM= 0
##$S_DEV= 0
##$TDeff= 65536
##$TDoff= 0
##$TI= <Analysis number 999999
Compound Code 99
Book Reference 9
Project Code 9>
##$TILT= no
##$TM1= 0
##$TM2= 0
##$TOPLEV= 0
##$USERP1= <user>
##$USERP2= <user>
##$USERP3= <user>
##$USERP4= <user>
##$USERP5= <user>
##$WDW= 1
##$XDIM= 32768
##$YMAX_p= 309341652
##$YMIN_p= -54333
$$ End of Bruker specific parameters
$$ ---------------------------------
##NTUPLES= NMR SPECTRUM
##VAR_NAME=  FREQUENCY,     SPECTRUM/REAL,   SPECTRUM/IMAG
##SYMBOL=    X,             R,               I
##VAR_TYPE=  INDEPENDENT,   DEPENDENT,       DEPENDENT
##VAR_FORM=  AFFN,          ASDF,            ASDF
##VAR_DIM=   32768,         32768,           32768
##UNITS=     HZ,            ARBITRARY UNITS, ARBITRARY UNITS
##FACTOR=    0.157963299565203, 1,           1
##FIRST=     4132.6476996994, 0,             0
##LAST=      -1043.33573715361, 0,           0
##MIN=       -1043.33573715361, -54333,      0
##MAX=       4132.6476996994, 309341652,     0
$$ Real data points
##PAGE= N=1
##DATA TABLE= (X++(R..R)), XYDATA
$$ [...]
$$ plain form
16393 -8868 -13140 -17198 -14050 4506 -3038 -7687 -79 7270 -3380 -6187 -989 5688 15608 10521
16379 10521 8370 8082 -1829 -22497 -7113 2567 3655 -1229 -1316 -3580 -11463 -10490 315 13862
16365 13862 12762 5949 2430 -4162 -11896 -11038 1308 -1286 -8573 -984 -2395 -13889 -20227 -18902
16351 -18902 -4493 -5138 -15094 -9365 -4727 -21273 -21348 -15147 -7469 -7602 -11770 -17994 -15635 -7283 -8601
16336 -8601 -12801 -12130 -10013 1316 -3971 -2899 -761 -13455 -15859 -21427 -16212 -14641 -23288 -23030 -14795
16321 -14795 -9527 4739 5295 -113 -22686 -21510 -17152 -25577 -21246 -4161 7147 7248 -1252 2779
16307 2779 7773 5555 7626 761 1176 -721 7560 20579 31393 8640 -9738 -14598 -14371 -22169
16293 -22169 -30534 -24987 -3417 3611 1442 -10887 -9672 -20601 -13937 8488 21108 15391 12734
$$ packed form
16393h868m272m058L148J8556p544m649P608P349j0650k807N198O677R920n087
16379A0521k151k88r911k0668J5384R680J088m884q7k264p883R73J0805J3547
16365A3862j100o813l519o592p734Q58J2346k594p287P589j411j1494o338J325
16351a8902J4409o45r956N729M638j6546p5O201P678j33m168o224K359Q352j318
16336h601m200O71K117J1329n287J072K138j2694k404n568N215J571q647K58Q235
16321a4795N268J4266N56n408k2573J176M358q425M331J7085J1308J01q500M031
16307B779M994k218K071o865M15j897Q281J3019J0814k2753j8378m860K27p798
16293b2169q365N547K1570P028k169j2329J215j0929O664K2425J2620n717k657
$$ plain form
16280 12734 10458 5613 5586 5047 11352 10449 3942 -3438 -3056 -11799 -24547 -26729 -35717 -37739 -32854
16265 -32854 -22261 1075 20054 14833 12915 8463 7286 7206 6255 20076 15657 20028 13918 -9288
16251 -9288 -3982 -10621 -11409 2404 -4138 -7227 -14706 -13118 -13689 -7719 -5196 -552 -7185 -5203 -4166
16236 -4166 -9141 -8724 -18745 -20190 -12990 -3642 -14773 -34311 -34917 -17698 168 14871 20474 21415
16222 21415 8229 -12054 -23063 -14679 -2016 5999 10377 10951 15005 8411 24 -4043 3828 10594
16208 10594 -2963 -6376 -1514 6244 17297 27417 18270 -809 -12205 -15302 -21665 -29568 -23318
16195 -23318 -13842 -27269 -25666 -18555 -13457 -19479 -19889 -5071 -1631 -11337 -10844 -9091 -4409 -9869
16181 -9869 -18420 -10078 -6420 -8058 -4316 976 -1817 -15645 -12954 -3758 -1790 -2308 14372 11572
$$ packed form
16280A2734k276m845k7n39O305r03o507p380L82q743j2748k182q988k022M885
16265c2854J0593K3336J8979n221j918m452j177q0r51J3821m419M371o110k3206
16251i288N306o639p88J3813o542l089p479J588n71N970K523M644o633J982J037
16236d166m975M17j0021j445P200R348j1131j9538o06J7219J7866J4703N603R41
16222B1415j3186k0283j1009Q384J2663Q015M378N74M054o594q387m067P871O766
16208A0594j3557l413M862P758J1053J0120r147j9079j1396l097o363p903O250
16195b3318R476j3427J603P111N098o022m10J4818L440r706M93J753M682n460
16181i869q551Q342L658j638L742N292k793j3828K691R196J968n18J6680k800
$$ plain form
16167 11572 8475 6387 4285 16546 22621 14859 5207 12468 22511 16564 8390 -3675 -455 10150
16153 10150 27455 21833 5790 9701 14851 4907 -7993 -19719 -21830 -11961 -16400 -15235 -7890
16140 -7890 -12501 -6392 7388 4331 12633 7814 2787 -2206 17992 39612 48674 41611 25262 20013
16126 20013 24823 18246 22186 16454 6001 -7289 -8053 -4259 -1108 -863 5409 9135 9813 10316 -4636
16111 -4636 -8646 -4511 -8923 -18298 -23248 -27717 -23839 -1903 -1264 -5803 -1822 -7999 -525 -3981 -12872
16096 -12872 -13113 -6141 -8319 -20821 -12733 -10256 -1599 6313 3321 -11152 3446 -2400 -2798 -9791
16082 -9791 -7640 -6052 -9422 -3973 -1144 -3575 -4039 -7607 -13971 -15804 -25192 -38870 -30456 -11281
16068 -11281 2381 -8192 -4002 -3886 -19864 -25321 -40397 -31996 -15421 -13320 -10370 -15295 -18745
$$ packed form
16167A1572l097k088k102J2261O075p762r652P261J0043n947q174j2065L220J0605
16153A0150J7305n622j6043L911N150r944j2900j1726k111R869m439J165P345
16140g890m611O109J3780l057Q302m819n027m993K0198K1620R062p063j6349n249
16126B0013M810o577L940n732j0453j3290p64L794L151K45O272L726O78N03j4952
16111d636m010M135m412r375m950m469L878K1936O39m539L981o177P474l456q891
16096a2872k41O972k178j2502Q088K477Q657P912k992j4473J4598n846l98o993
16082i791K151J588l370N449K829k431m64l568o364j833r388j3678Q414J9175
16068a1281J3662j0573M190J16j5978n457j5076Q401J6575K101K950m925l450
$$ plain form
16055 -18745 -25835 -22876 -7712 -2006 -7643 -5089 -5106 -7152 -3565 -8546 -16085 -11353 520 3483
16041 3483 -849 -13690 -6344 -7508 -7118 1614 5497 5474 -6713 -6946 -2977 -10611 -15818 5848 15795
16026 15795 8830 -1090 -9646 -12610 -8391 -5989 -10 10992 21360 24103 27187 28726 34228 26520
16012 26520 20009 6047 7130 13292 16590 14704 12386 7573 17189 16630 16263 6246 -1097 -5211
15998 -5211 -7177 -8046 -2075 5800 -4480 -11033 -7431 -3207 -5735 127 -762 -20206 -22335 -13705 -10085
15983 -10085 -14705 -21594 -21531 -15929 -9643 -2785 -12540 -8032 11666 -687 -3863 11239 14626 4212
15969 4212 -3656 -1776 -2311 4715 5139 -2399 -13357 -16517 -11498 -11014 -5585 -6996 -7682 -10001 -13551
15954 -13551 -4026 210 -7421 -17115 -8992 -5517 -7924 -7125 -20839 -30708 -31260 -32350 -32675 -37460 -24628
$$ packed form
16055a8745p090K959J5164N706n637K554j7k046L587m981p539M732J1873K963
16041C483m332j2841P346j164L90Q732L883k3j2187k33L969p634n207K1666R947
16026A5795o965r920q556k964M219K402N979J1002J0368K743L084J539N502p708
16012B6520o511j3962J083O162L298j886k318m813R616n59l67j0017p343m114
15998e211j966q69N971P875j0280o553L602M224k528N862q89j9444k129Q630L620
15983a0085m620o889O3N602O286O858r755M508J9698j2353l176J5102L387j0414
15969D212p868J880n35P026M24p538j0958l160N019M84N429j411o86k319l550
15954a3551R525M236p631r694Q123L475k407P99j3714r869n52j090l25m785J2832
$$ plain form
15939 -24628 -11875 -12127 -11273 -3584 -3485 -4252 -5519 -843 -1934 1510 3615 3369 9694 8049 7019 15948
15923 15948 17309 23184 11594 3921 2333 1954 4247 8645 9717 4367 -339 -9942 -25656 -32224
15909 -32224 -22266 -13244 -3658 -4910 -6804 -4306 3071 1149 -16882 -30092 -26343 -20379 -13171 -7515
15895 -7515 -15439 -22939 -17617 -11641 -6367 2453 -2214 -1464 12319 8181 -20280 -28868 -26615 -24079
15881 -24079 -19422 -6170 -4792 -13872 -7455 -3599 -3008 -4108 -13099 -15627 -14056 -12893 -15518 -24964
15867 -24964 -25108 -10732 -20632 -18552 -17654 -26134 -23884 -12049 -5102 -860 -2980 -10 -6459 -7571
15853 -7571 -8392 -8011 -9210 -15548 -14388 -8668 -3269 -7179 -17670 -17034 -11251 257 2597 -1738 -8893
15838 -8893 -12940 -15173 -18889 -32743 -43053 -40692 -32604 -28058 -23721 -7787 -14804 -22812 -19438 -24434
$$ packed form
15939b4628J2753k52Q54P689R9p67j267M676j091L444K105k46O325j645j030Q929
15923A5948J361N875j1590p673j588l79K293M398J072n350m706r603j5714o568
15909c2224R958R022R586j252j894K498P377j922j8031j3210L749N964P208N656
15895g515p924p500N322N976N274Q820m667P50J3783m138k8461q588K253K536
15881b4079M657J3252J378r080O417L856N91j100q991k528J571J163k625r446
15867b4964j44J4376r900K080Q98q480K250J1835O947M242k120K970o449j112
15853g571q21L81j199o338J160N720N399l910j0491O36N783J1508K340m335p155
15838h893m047k233l716j3854j0310K361Q088M546M337J5934p017q008L374m996
$$ plain form
15824 -24434 -29516 -27989 -15836 -2255 1796 4165 -1005 -12876 -23998 -21385 -7452 108 -4084
15811 -4084 -2266 4654 850 -2584 -6389 -8677 -7293 -14330 -18535 -3876 9321 3841 -5229 -10796
15797 -10796 -18806 -7897 1727 1485 -12282 -19011 -20697 -23652 -28290 -18327 -16216 -7469 -16709 -20265
15783 -20265 -18107 -24744 -11391 -5682 1576 -826 -4079 4067 9401 -6412 -24828 -27607 -13512
15770 -13512 -3490 -1919 1546 -21849 -18657 -6499 -15046 -22204 -16500 -3457 -13945 -14217 -13735 -16915
15756 -16915 -11718 6323 19623 7145 2166 3500 -12512 -16429 -25682 -34047 -23536 -32399 -39579
15743 -39579 -37780 -19472 -18768 -17736 -18917 -27338 -18470 -13214 -17789 -19741 -7468 -2566 149 -7479
15729 -7479 2107 -1662 1227 5646 8995 -3322 -1752 -13704 -4060 7060 16225 17505 2460 -10427
$$ packed form
15824b4434n082J527J2153J3581M051K369n170j1871j1122K613J3933P560m192
15811d084J818O920l804l434l805k288J384p037m205J4659J3197n480r070n567
15797a0796q010J0909R624k42j3767o729j686k955m638R963K111Q747r240l556
15783b0265K158o637J3353N709P258k402l253Q146N334j5813j8416k779J4095
15770a3512J0022J571L465k3395L192J2158q547p158N704J3043j0488k72M82l180
15756a6915N197J8041J3300j2478m979J334j6012l917r253q365J0511q863p180
15743c9579J799J8308P04J032j181q421Q868N256m575j952J2273M902K715p628
15729g479R586l769K889M419L349j2317J570j1952R644J1120R165J280j5045j2887
$$ plain form
15715 -10427 -12598 -20794 -40233 -52810 -39278 -24516 -20654 -20360 -15741 -10518 -5342 -2130 2361 3887
15701 3887 -2271 7509 4092 -17996 -25846 -12300 -3276 -14057 -27261 -20293 -26949 -22397 -19047 -14053
15687 -14053 5669 10459 7159 2401 -2789 -10234 -10120 -6166 8778 23349 11844 4310 7804 11985
15673 11985 12199 20420 19719 22778 12771 -275 -6160 -12631 -21571 -30820 -31344 -19769 -4769 -16195
15659 -16195 -29799 -23062 -8925 -10740 -14693 -17436 -18985 -12676 -21798 -21941 -30206 -38658 -38285 -23237
15645 -23237 -22365 -22619 -19309 -8628 -6380 -4615 9752 8889 -2200 -8040 652 157 6872 6359 3673
15630 3673 4347 13919 -3934 2680 18886 14084 7955 9791 11598 6654 453 6060 -8260 -15453
15616 -15453 -17120 -19098 -21572 -16532 -4450 1943 2898 6904 2123 -17753 -11296 5954 23645 17062
$$ packed form
15715a0427k171q196j9439j2577J3532J4762L862K94M619N223N176L212M491J526
15701C887o158R780l417k2088p850J3546R024j0781j3204O968o656M552L350M994
15687a4053J9722M790l300m758n190p445J14L954J4944J4571j1505p534L494M181
15673A1985K14Q221p01L059j0007j3046n885o471q940r249n24J1575J5000j1426
15659a6195j3604O737J4137j815l953k743j549O309r122j43q265q452L73J5048
15645b3237Q72k54L310J0681K248J765J4367q63j1089n840Q692m95O715n13k686
15630C673O74R572j7853O614J6206m802o129J836J807m944o201N607j4320p193
15616a5453j667j978k474N040J2082O393R55M006m781j9876O457J7250J7691o583
$$ plain form
15602 17062 -851 -9842 -7584 -1963 12736 15600 21721 26357 14099 -686 7531 18434 12493
15589 12493 1498 6256 22880 18381 13453 21723 22724 14020 5526 1576 12713 7571 3687 12361
15575 12361 32144 20205 1650 -16726 -17104 -7420 8822 14819 5421 -10971 -24099 -12758 -7662
15562 -7662 -13176 -8183 5263 19328 22981 15197 4834 -5187 -8207 -13070 -2856 4818 6796
15549 6796 10706 15266 4930 -15395 -16654 -14683 1109 7971 9747 -3943 -9876 -10271 -16045 -14270
15535 -14270 -10412 -9662 2113 4537 -3386 -10748 -21062 -20190 -14558 -20005 -16133 -2173 2221 -584
15521 -584 5534 16448 25386 27132 30834 25020 6988 -9326 -18617 -13692 -3003 3389 -9680 -15867
15507 -15867 -14427 -16432 -16412 -13157 -8990 -3820 2012 -7564 -21105 -12460 -1143 -5555 -2507 -13663
$$ packed form
15602A7062j7913q991K258N621J4699K864O121M636j2258j4785Q217J0903n941
15589A2493j0995M758J6624m499m928Q270J001q704q494l950J1137n142l884Q674
15575A2361J9783j1939j8555j8376l78R684J6242N997r398j6392j3128J1341N096
15562g662n514M993J3446J4065L653p784j0363j0021l020m863J0214P674J978
15549F796L910M560j0336k0325j259J971J5792O862J776j3690n933l95n774J775
15535a4270L858P50J1775K424p923p362j0314Q72N632n447L872J3960M394k805
15521e84O118J0914Q938J746L702n814j8032j6314r291M925J0689O392j3069o187
15507a5867J440k005K0L255M167N170N832r576j3541Q645J1317m412L048j1156
$$ plain form
15493 -13663 -16181 -6899 -13142 -6793 -21207 -14921 4142 -4288 -1581 4034 -1841 -7354 2745 13874
15479 13874 -2000 1326 6504 7054 9146 13629 19812 15656 12750 10593 6832 6054 13018 12776 7123
15464 7123 11168 -8985 -6729 -1076 -10033 -18498 -20816 -22917 -29042 -25361 -24970 -21363 -17237 -25829 -32802
15449 -32802 -21492 -8251 5481 2153 -3376 -12439 -2475 -215 -9360 -6830 -1962 5658 5294 -8015
15435 -8015 -27325 -24468 -16969 -2446 -6359 -19946 -36982 -38734 -11314 8101 19499 31454 31240
15422 31240 23776 1514 -23228 -25544 -4464 -8287 -11564 -15928 -15622 -9220 -18224 -15899 -3641 2462
15408 2462 43 -8478 -11376 -10855 -1541 -2610 2965 16468 12010 7289 730 406 6391 19094 10027
15393 10027 3960 2978 9812 14599 7225 -3166 191 8343 10745 -2449 -3505 -12529 -11767 396
$$ packed form
15493a3663k518R282o243O349j4414O286J9063q430K707N615n875n513J0099J1129
15479A3874j5874L326N178N50K092M483O183m156k906k157l761p78O964k42n653
15464G123M045k0153K256N653q957q465k318k101o125L681L91L607M126q592o973
15449c2802J1310J3241J3732l328n529r063R964K260r145K530M868P620l64j3309
15435h015j9310K857P499J4523l913j3587j7036j752K7420J9415J1398J1955k14
15422C1240p464k2262k4742k316K1080l823l277m364L06O402r004K325J2258O103
15408B462k419q521k898N21R314j069N575J3503m458m721o559l24N985J2703r067
15393A0027o067r82O834M787p374j0391L357Q152K402j3194j056r024P62J2163
$$ plain form
15379 396 -4115 -4544 -590 -1631 -4965 -2997 16834 21261 13122 -3718 -11218 -19317 -12104 -1308
15365 -1308 13680 13111 -7924 -9555 -14270 -15209 -1384 -12125 -21934 -26186 -22087 -13329 -14931 -15794
15351 -15794 -3467 -1195 -1034 9256 19819 24964 8916 1071 3357 -3148 -12867 -23347 -35068
15338 -35068 -21264 -17129 -7335 4030 -5230 -20583 -15798 -12458 -4911 -5378 -8020 -8060 -7721 -14015 -18929
15323 -18929 -16328 -6933 5452 11748 22341 15396 1313 5641 369 -13306 -28062 -20881 5524
15310 5524 -2265 -23615 -23175 -7947 -5261 1072 -3686 -4978 -8725 -17216 -21798 -21010 -8860 830
15296 830 -18545 -28926 -17980 -18399 -10606 -5363 -26953 -35021 -35982 -35999 -36971 -36315 -31400 -24245 -23195
15281 -23195 -13367 -2110 -4434 -13247 -12913 -15752 -31318 -35872 -47928 -43509 -21481 -13742 -6232 -3848
$$ packed form
15379C96m511m29L954j041l334J968J9831M427q139j6840p500q099P213J0796
15365a308J4988n69k1035j631m715r39J3825j0741r809m252M099Q758j602q63
15351a5794J2327K272J61J0290J0563N145j6048p845K286o505r719j0480j1721
15338c5068J3804M135R794J1365r260j5353M785L340P547m67k642m0L39o294m914
15323a8929K601R395J2385O296J0593o945j4083M328n272j3675j4756P181K6405
15310E524p789k1350M40J5228K686O333m758j292l747q491m582P88J2150R690
15296H30j9375j0381J0946m19P793N243k1590q068r61j7r72O56M915P155J050
15281b3195R828J1257k324q813L34k839j5566m554j2056M419K2028P739P510K384
$$ plain form
15267 -3848 -9175 -14097 -10136 -5362 -7479 -8861 -15750 -13458 -9034 -27589 -32862 -24799 -14154 -21761
15253 -21761 -5840 7037 9446 1132 -10832 -21814 -28334 -14001 -1374 -10005 -7719 -9706 -5560
15240 -5560 9787 3308 7613 2149 -20655 -28015 -28627 -19733 -5046 -13812 -33074 -37936 -22322 -18628
15226 -18628 5298 2757 4442 -8728 -27946 -27907 -28243 -22281 -18179 -15149 -6509 -10503 -5750 6099
15212 6099 14912 -207 -9325 -12303 -9095 925 -25231 -33000 -26590 -20045 -21685 -20627 -12852 -21749
15198 -21749 -10350 -15751 -19004 -11550 4469 21096 14770 -1586 -4258 -3645 -3543 5431 8949 10836
15184 10836 5298 -2918 -16391 -20532 -14383 -5920 -20854 -17362 -5326 -5649 -11017 -14180 -18656 -29646
15170 -29646 -20279 -3763 -7067 -6201 -14684 -18204 -21045 -22758 -33245 -38625 -30850 -27201 -22756 -11486
$$ packed form
15267c848n327m922L961M774k117j382o889K292M424j8555n273Q063J0645p607
15253b1761J5921J2877K409q314j1964j0982o520J4333J2627q631K286j987M146
15240e560J5347o479M305n464k2804p360o12Q894J4687q766j9262m862J5614L694
15226a8628K3926k541J685j3170j9218L9l36N962M102L030Q640l994M753J1849
15212F099Q813j5119r118k978L208J0020k6156p769O410O545j640J058P775q897
15198b1749J1399n401l253P454J6019J6627o326j6356k672O13J02Q974L518J887
15184A0836n538q216j3473m141O149Q463j4934L492J2036l23n368l163m476j0990
15170b9646R367J6516l304Q66q483l520k841j713j0487n380P775L649M445J1270
$$ plain form
15156 -11486 -7648 -15306 -25705 -22342 -11477 15122 12877 1232 -302 -13548 -28417 -27544 -12520
15143 -12520 -6126 2274 -3880 1625 4715 7914 7612 9453 2904 -1470 2568 -4461 -11840 -27256
15129 -27256 -39788 -27919 -18790 -6217 1904 8200 7493 -6190 -13280 -20651 -27890 -25690 -31159 -30943
15115 -30943 -21258 -8302 -3631 -739 -4304 -421 -4166 -9261 -5145 7850 3237 -12267 -11201 -18678
15101 -18678 -23074 -8363 -8070 -7217 -13719 -18236 -23595 -21144 -7983 -5888 -106 3913 2044 16785
15087 16785 20115 9042 2271 8597 21138 27833 30635 18402 8588 -2936 -913 540 -7412
15074 -7412 -2037 -4469 1274 4766 -4995 -11474 -4091 2849 -3467 -9216 -9484 -3766 582 3564 7614
15059 7614 5633 -8909 -15545 -16623 -4192 6797 -2104 -14458 -10750 189 7358 -3454 -4160
$$ packed form
15156a1486L838p658j0399L363J0865K6599k245j1645j534j3246j4869Q73J5024
15143a2520O394Q400o154N505L090L199l02J841o549m374M038p029p379j5416
15129b7256j2532J1869R129J2573Q121O296p07j3683p090p371p239K200n469K16
15115c0943R685J2956M671K892l565L883l745n095M116J2995m613j5504J066p477
15101a8678m396J4711K93Q53o502m517n359K451J3161K095N782M019j869J4741
15087A6785L330j1073o771O326J2541O695K802j2233r814j1524K023J453p952
15074g412N375k432N743L492r761o479P383O940o316n749k68N718M348K982M050
15059G614j981j4542o636j078J2431J0989q901j2354L708J0939P169j0812p06
$$ plain form
15046 -4160 14828 15034 -3195 -20247 -20052 -22250 -34830 -31568 -17925 -18830 -16664 -8053 90 -5659
15032 -5659 -9973 -691 -973 10240 17631 15552 17833 23354 25085 5303 -835 13091 14111 15653
15018 15653 18794 11971 1143 -13451 -6462 1235 5312 6246 3475 -6343 -7248 -10935 -16974 -26419
15004 -26419 -23329 -16751 -9451 -5332 -7190 -20685 -17367 -15560 -19882 -25787 -25628 -15993 2485 7650
14990 7650 -2932 -7099 -657 1083 -14545 -18316 -16076 -17413 -6746 -13076 -11312 -4073 405 -10308
14976 -10308 -8721 1390 10039 8473 -1558 -7451 -9978 -1685 13628 8565 691 -23157 -20459
14963 -20459 -23935 -21212 -5869 -3758 -26178 -41591 -43441 -39678 -32571 -27701 -20176 -7605 1512
14950 1512 13035 17986 15671 -4640 -31328 -40330 -23141 -10796 -14693 -29104 -35430 -16172 -7335
$$ packed form
15046d160J8988K06j8229j7052J95k198j2580L262J3643r05K166Q611Q143n749
15032e659m314R282k82J1213P391k079K281N521J731j9782o138J3926J020J542
15018A5653L141o823j0828j4594O989P697M077R34k771r818r05l687o039r445
15004b6419L090O578P300M119j858j3495L318J807m322n905J59R635J8478N165
14990G650j0582m167O442J740j5628l771K240j337J0667o330J764P239M478j0713
14976a0308J587J0111Q649j566j0031n893k527Q293J5313n063p874k3848K698
14963b0459l476K723J5343K111k2420j5413j850L763P107M870P525J2571R117
14950A512J1523M951k315k0311k6688r002J7189J2345l897j4411o326J9258Q837
$$ plain form
14937 -7335 82 415 -1970 -11219 -13531 -10332 -12417 -13820 -991 -13638 -27993 -16432 -7777 5973
14923 5973 11728 17609 23052 30208 29769 29350 28224 16329 4843 -2382 -11606 -6605 -10479 -16283 -29331
14908 -29331 -18317 278 4916 -5160 -3736 191 -8684 -15414 -16970 -11716 -9221 5259 3257
14895 3257 -1447 3001 2432 -10839 -14880 -463 -5991 -12282 7219 14857 -1792 1044 -7732 -4745
14881 -4745 5838 6256 1800 -1063 -5423 -12574 -4585 3943 5219 15981 11571 10055 11324 3579
14867 3579 -4013 11702 9705 -7933 -16199 -399 9570 12009 3 -5420 -640 -2511 -1194 -1846
14853 -1846 -10830 -17984 -7112 5252 10916 14093 8016 3674 7345 10139 6673 10941 9945 11251
14839 11251 5460 3486 -11014 -16099 -12390 -24909 -35289 -20838 -13867 -3185 4657 -3290 -2592
$$ packed form
14937g335P417L33k385r249k312L199k085j403J2829j2647j4355J1561Q655J3750
14923E973N755N881N443P156m39m19j126j1895j1486p225r224N001l874n804j3048
14908b9331J1014J8595M638j0076J424L927q875o730j556N254K495J4480k002
14895C257m704M448n69j3271m041J4417n528o291J9501P638j6649K836q776K987
14881d745J0583M18m456k863m360p151P989Q528J276J0762m410j516J269p745
14867C579p592J5715j997j7638q266J5800R969K439j2006n423M780j871J317o52
14853a846q984p154J0872J2364N664L177o077m342L671K794l466M268r96J306
14839A1251n791j974j4500n085L709j2519j0380J4451O971J0682P842p947O98
$$ plain form
14826 -2592 -3933 -4616 -176 813 8695 1069 -3324 -5300 -12419 -19264 -11947 -10972 -11433 -19955 -16563 -6860
14810 -6860 -551 -1150 -5950 -3638 12082 8240 -5686 -3992 -99 1858 -3485 -25664 -26456 -6293
14796 -6293 555 6640 -1105 -1535 -211 -7566 -4037 123 -7571 -211 9819 7716 7015 9840 10309
14781 10309 13398 12394 16990 8616 -3018 -736 1205 -556 -8638 -5709 -7360 3762 364 -2972
14767 -2972 15545 19662 3521 -2310 -5284 -3313 -12679 -12242 -5252 3708 2065 -4890 -1104 -8700
14753 -8700 -6681 -10596 -12027 2032 6502 -7940 -17032 -12697 -12957 -6097 -587 -4030 -10209 -5621
14739 -5621 -589 -10648 -17376 -20425 -13003 -11730 -21154 -21702 -18533 -13012 -8233 -214 -4964 -1402 9213
14724 9213 798 -1158 -2336 -337 924 12421 17483 -4076 -19375 -18923 -23745 -20728 -2114 -12770
$$ packed form
14826b592j341o83M440R89P882p626m393j976p119o845P317R75m61q522L392R703
14810f860O309n99m800K312J5720l842j3926J694L893J957n343k2179p92K0163
14796f293O848O085p745m30J324p355L529M160p694P360J0030k103p01K825M69
14781A0309L089j004M596q374j1634K282J941j761q082K929j651J1122l398l336
14767b972J8517M117j6141n831k974J971r366M37O990Q960j643o955L786p596
14753h700K019l915j431J4059M470j4442r092M335k60O860N510l443o179M588
14739e621N032j0059o728l049P422J273r424n48L169N521M779Q019m750L562J0615
14724I213q415j956j178J999J261J1497N062k1559j5299M52m822L017J8614j0656
$$ plain form
14710 -12770 -11881 -10340 -11015 -11280 -5991 -4510 -2767 15900 29486 12539 1876 14617 15896 15931
14696 15931 -2888 -4861 1756 -13040 -14159 -14571 -5562 5583 5633 -3003 -6747 -8888 -28371 -11402
14682 -11402 4976 -7576 -15539 -10238 2021 3860 -11064 -20677 -12693 2023 5588 13303 19014
14669 19014 29407 26939 22828 13680 17549 26748 16192 11226 24216 17969 21666 27623 26293 17981
14655 17981 20752 15073 4997 -2244 3656 9917 5317 5250 9151 2162 867 3876 -10010 -5550
14641 -5550 -9781 -22964 -8598 -7348 -13226 -3453 7051 14859 17033 1732 2214 40 9526 4649
14627 4649 -3678 -19537 -20997 -4739 6388 13470 15336 12732 8487 18381 29609 35216 35697 32931
14613 32931 39876 42299 53973 51542 48025 19756 3002 -46 10427 13039 9832 166 6372
$$ packed form
14710a2770Q89J541o75k65N289J481J743J8667J3586j6947j0663J2741J279L5
14696A5931j8819j973O617j4796j119m12R009J1145N0q636l744k141j9483J6969
14682a1402J6378j2552p963N301J2259J839j4924r613P984J4716L565P715N711
14669A9014J0393k468m111r148L869R199j0556m966J2990o247L697N957j330q312
14655A7981K771n679j0076p241N900O261m600o7L901o989j295L009j3886M460
14641e550m231j3183J4366J250n878R773J0504P808K174j5301M82k174R486m877
14627D649q327j5859j460J6258J1127P082J866k604m245R894J1228N607M81k766
14613C2931O945K423J1674k431l517k8269j6754l048J0473K612l207r666O206
$$ plain form
14600 6372 15061 9051 306 -10703 -8649 -6852 -14941 -16971 -2289 11095 19552 9938 9642 8367
14586 8367 11876 826 -5473 -1404 -897 3317 4291 6146 12175 -2005 -6755 5922 8989 16367
14572 16367 6516 -375 9163 14770 15036 19682 8698 12693 18037 19226 21295 13151 17766 3899
14558 3899 -1304 6014 395 -5271 -5965 -2838 -144 7626 8923 10380 16607 14160 -1461 -8875 -8069
14543 -8069 22780 26942 10606 1588 -1251 -1992 -1684 -10347 -11217 -22876 -29458 -19569 -18692 -22052 -13212
14528 -13212 -3647 -15351 -19384 -12026 -158 5495 3655 -4780 -2882 6396 12566 22622 24201 20787
14514 20787 18124 12762 5145 7634 -1261 -5363 -16131 -16948 -10503 -19998 -17366 -15619 -32024 -41845
14500 -41845 -42181 -47403 -47050 -30850 -36123 -34929 -20919 -13394 -9424 16736 17850 12561 -1425 -12697
$$ packed form
14600F372Q689o010q745j1009K054J797q089k030J4682J3384Q457r614k96j275
14586H367L509j1050o299M069N07M214R74J855O029j4180m750J2677L067P378
14572A6367r851o891R538N607K66M646j0984L995N344J189K069q144M615j3867
14558C899n203P318n619n666o94L127K694P770J297J457O227k447j5621p414Q06
14543h069L0849M162j6336r018k839p41L08q663q70j1659o582R889Q77l360Q840
14528a3212R565j1704m033P358J1868N653j840q435J898R278O170J0056J579l414
14514B0787k663n362p617K489q895m102j0768q17O445r495K632J747j6405r821
14500d1845l36n222L53J6200n273J194J4010P525L970K6160J114n289j3986j1272
$$ plain form
14486 -12697 -23581 -14965 -1581 -12612 -21936 -19583 -11194 -3741 -6374 -10210 -6874 -10123 -14567 -12701
14472 -12701 -8115 -7995 -12369 -14982 -4231 -13278 -15046 -7542 -6425 -16971 -29647 -30180 -27735 -20214
14458 -20214 -15313 -17173 -12616 -668 1222 -3654 2903 -1244 -12922 -24844 -29109 -16833 -5841
14445 -5841 -11035 999 24013 23283 21172 8058 1306 -4129 2412 544 -3051 -3538 -9130 -9774 -6805
14430 -6805 -5837 3318 5623 473 -8832 -10027 -8832 -10295 -19299 -8356 -19431 -18532 -16743 -11522 -8274
14415 -8274 -9604 -10333 -8324 -15284 -17587 -19337 -16626 -17971 -24313 -27861 -21292 -25101 -28768 -13681 -16006
14400 -16006 -18804 -29149 -43457 -54234 -52372 -38488 -31257 -17817 -17254 -32022 -23984 -20682 -24207
14387 -24207 -28042 -17273 -11301 -11809 -8438 -7994 -11495 -16732 -25292 -15399 1233 -4569 -4224 -3006 -2180
$$ packed form
14486a2697j0884Q616J3384j1031r324K353Q389P453k633l836L336l249m444J866
14472a2701M586J20m374k613J0751r047j768P504J117j0546j2676n33K445P521
14458b0214M901j860M557J1948J890m876O557m147j1678j1922m265J2276J0992
14445e841n194J2034K3014p30k111j3114o752n435O541j868l595m87n592o44K969
14430f805R68R155K305n150r305j195J195j463r004J0943j1075Q99J789N221L248
14415h274j330p29K009o960k303j750K711j345o342l548O569l809l667J5087k325
14400a6006k798j0345j4308j0777J862J3884P231J3440N63j4768Q038L302l525
14387b4207l835J0769N972n08L371M44l501n237q560R893J6632n802L45J218Q26
$$ plain form
14372 -2180 13139 9514 5149 1119 6958 8192 -3256 -6389 -11355 -20848 -14721 -13166 -15338 -36260
14358 -36260 -31458 -32730 -37444 -27115 -28222 -22194 -15777 -19199 -10104 -5923 -12411 -18975 -24235 -26100
14344 -26100 -21260 -18623 -15027 -22704 -10204 1125 7514 10527 13306 21016 19677 15078 9837 7192
14330 7192 -3087 -17725 -13852 -8310 -5785 -25568 -30873 -13231 -3514 -12291 -21406 -10215 -9353 -7109
14316 -7109 -15548 -17124 -14527 -20438 -15642 -19959 -22341 -25234 -8443 -5083 -5801 -5652 -8762 -2066 -4585
14301 -4585 -16421 -10880 -6871 -8492 -14574 -23290 -21841 -11733 -7236 -4350 -3459 -8504 -5844 -5381 -5255
14286 -5255 -10028 -3797 4807 4959 2840 -11872 -13711 -18381 -28038 -16610 -10853 -13892 -11340 -14258
14272 -14258 -17834 -26078 -24780 -25175 -23185 -20021 -20508 -10493 -9448 -9474 -15588 -11227 -289 5597 -1299
$$ packed form
14372b180J5319l625m365m030N839J234j1448l133m966r493O127J555k172k0922
14358c6260M802j272m714J0329j107O028O417l422R095M181o488o564n260j865
14344b6100M840K637L596p677J2500J1329O389L013K779P710j339m599n241k645
14330G192j0279j4638L873N542K525j9783n305J7642R717q777r115J1191Q62K244
14316g109q439j576K597n911M796m317k382k893J6791L360p18J49l110O696k519
14301d585j1836N541M009j621o082q716J449J0108M497K886Q91n045K660M63J26
14286e255m773O231Q604J52k119j4712j839m670r657J1428N757l039K552k918
14272a4258l576q244J298l95J990L164m87J0015J045k6o114M361J0938N886o896
$$ plain form
14257 -1299 -10033 -3043 5819 -2036 -17636 -13147 2927 25924 21604 13012 3477 940 -7922 -12409
14243 -12409 -11657 -17460 -10787 -8890 -12009 -7598 -3254 -6848 -21712 -11242 2598 -7393 -28719 -32339
14229 -32339 -25779 -37328 -27882 -20209 -13231 -2881 4599 4222 -802 -1421 -985 9751 6533 -3981
14215 -3981 -2327 7004 10515 3017 -1094 -5920 -546 3504 3228 1642 -7840 -2642 7870 26791
14201 26791 34198 35314 24669 11716 1605 3996 -2845 -9520 -18766 -7220 -13522 -13278 3459
14188 3459 4450 -13583 -17210 -17681 -18884 -1681 -1548 5191 6589 -2937 -18122 -15543 -14922 -11111 -5952
14173 -5952 -1245 -7354 -12214 -18587 -5980 -660 3113 9464 13854 -4655 -15577 -18298 -14367 -17613
14159 -17613 -17306 -9747 -12984 -11692 -8539 -21234 -13654 1016 10096 177 2030 -18088 -14578 -4753
$$ packed form
14257a299q734O990Q862p855j5600M489J6074K2997m320q592r535k537q862m487
14243a2409P52n803O673J897l119M411M344l594j4864J0470J3840r991k1326l620
14229c2339O560j1549R446P673O978J0350P480l77n024o19M36J0736l218j0514
14215c981J654R331L511p498m111m826N374M050k76j586r482N198J0512J8921
14201B6791P407J116j0645j2953j0111K391o841o675r246J1546o302K44J6737
14188C459R91j8033l627m71j203J7203J33O739J398r526j5185K579O21L811N159
14173e952M707o109m860o373J2607N320L773O351M390j8509j0922k721L931l246
14159a7613L07P559l237J292L153j2695P580J4670R080r919J853k0118L510R825
$$ plain form
14145 -4753 15825 23171 15510 10778 7023 9802 999 -3492 -5455 -1879 -10990 -17652 -13744 -1387
14131 -1387 5930 17306 24595 17588 15221 11281 9238 8733 -1987 491 4409 8574 15182 7266
14117 7266 6195 9598 -4263 -5591 -11835 -2144 5022 6504 -4590 2133 -2091 -12250 -5554 -4164
14103 -4164 7704 3143 1967 -4963 6222 9026 6880 19976 10316 -3845 -13610 -17108 -15185 -12112
14089 -12112 -6194 -2485 399 5165 -10871 -28730 -30314 -24420 -22259 -11901 -8833 -16107 -20211 -18963
14075 -18963 -17671 -8577 -9587 -10271 7231 24904 21221 7792 3844 3043 3399 15856 29925 22327
14061 22327 12444 12057 19161 18498 22401 -1032 -2308 15542 21011 25549 26313 16959 10227 8730 -3693
14046 -3693 -5312 4614 8296 5728 -1082 -2157 -11494 -13864 -17592 -8425 -13109 -17446 -24349 -15697 -6432
$$ packed form
14145d753K0578P346p661m732l755K779q803m491j963L576r111o662L908J2357
14131a387P317J1376P289p007k367l940k043n05j0720K478L918M165O608p916
14117G266j071L403j3861j328o244R691P166J482j1094O723m224j0159O696J390
14103d164J1868m561j176o930J1185K804k146J3096r660j4161r765l498J923L073
14089a2112N918L709K884M766j6036j7859j584N894K161J0358L068p274m104J248
14075a8963J292R094j010o84J7502J7673l683j3429l948q01L56J2457J4069p598
14061B2327r883l87P104o63L903k3433j276J7850N469M538P64r354o732j497j2423
14046c693j619R926L682k568o810j075r337k370l728R167m684m337o903Q652R265
$$ plain form
14031 -6432 3709 -9992 -18538 -13563 -27444 -29856 -25046 -16054 -11261 -16169 -8578 -10266 -11717 -13607
14017 -13607 -12586 -9189 -10016 -2129 -12152 -11158 -6042 -1661 -1300 -15286 -25318 -29178 -35218 -35273 -26442
14002 -26442 -21739 -22621 -8950 1412 -5719 -11871 -15653 -9145 -12329 -11259 -12128 -10569 -6826 -15174
13988 -15174 -24761 -4295 -6994 -24937 -15796 -5611 -12867 -15581 -26065 -29429 -15265 -1133 -11613
13975 -11613 -14683 -26623 -16396 -12129 6253 9255 -528 -20233 -17510 -3128 -2009 -16922 -16515
13962 -16515 -16368 -12378 -10238 7717 6055 -5068 -14577 -10439 -9599 -18420 -23074 -25962 -30610 -25938
13948 -25938 -21965 -8859 -8720 -3961 5800 8951 -342 -1698 7148 -751 -4311 -1617 -12428 -21286
13934 -21286 -38332 -54333 -44134 -35751 -27561 -23227 -9329 -23873 -21036 -27295 -15631 -15212 -29590
$$ packed form
14031f432J0141j3701q546M975j3881k412M810Q992M793m908P591j688j451j890
14017a3607J021L397q27P887j0023R94N116M381L61j3986j0032l860o040n5Q831
14002b6442M703q82J3671J0362p131o152l782O508l184J070q69J559L743q348
13988a5174r587K0466k699j7943R141J0185p256k714j0484l364J4164J4132j0480
13975a1613l070j1940J0227M267J8382L002r783j9705K723J4382J119j4913M07
13962a6515J47L990K140J7955j662j1123r509M138Q40q821m654k888m648M672
13948b5938L973J3106J39M759R761L151r293j356Q846p899l560K694j0811q858
13934b1286j7046j6001J0199Q383Q190M334J3898j4544K837o259J1664M19j4378
$$ plain form
13921 -29590 -37294 -39976 -34202 -33273 -30464 -15782 -19764 -28402 -25133 -24413 -22956 -21515 -12310 -842
13907 -842 2612 3862 7023 -4890 -7087 7284 13094 1734 1522 3502 8342 -3503 -2242 -2954
13893 -2954 -327 -11083 -9148 -4824 -752 1912 -11007 -15467 -6073 -5447 -8814 -21401 -19591 -17535
13879 -17535 -29829 -16737 -10867 -11281 -9868 -17801 -15206 -12649 -11113 -18111 -16964 -20986 -25839 -27490
13865 -27490 -18975 -14333 -13292 -9545 -13141 -20134 -30113 -26461 -22630 -20661 -11728 -11031 -17716 -4940
13851 -4940 -84 -371 13243 10812 -3175 -1870 -3628 -1692 -20768 -31068 -34674 -24657 -15441 -9964
13837 -9964 -5048 -1931 3766 -3557 -21015 -18760 -23614 -16046 5768 16932 24340 27136 25487 27417
13823 27417 22482 23958 10343 2631 -4178 -12917 -19381 -24937 -43588 -40634 -34808 -30172 -21480 -6298
$$ packed form
13921b9590p704k682N774R29K809J4682l982q638L269P20J457J441R205J1468
13907h42L454J250L161j1913k197J4371N810j1360k12J980M840j1845J261p12
13893b954K627j0756J935M324M072K664j2919m460R394O26l367j2587J810K056
13879a7535j2294J3092N870m14J413p933K595K557J536o998J147m022m853j651
13865b7490Q515M642J041L747l596o993r979L652L831J969Q933O97o685J2776
13851d940M856k87J3614k431j3987J305j758J936j9076j0300l606J0017R216N477
13837i964M916L117N697p323j7458K255m854P568K1814J1164P408K796j649J930
13823B7417m935J476j3615p712o809q739o464n556j8651K954N826M636Q692J5182
$$ plain form
13809 -6298 4671 4093 -6906 -17406 -19317 -22730 -20766 -24960 -16967 -4518 1465 -3863 -1997 9466
13795 9466 4075 -1248 -10088 -2975 5498 1287 -3790 -5621 -9784 -10843 -7023 -3355 5503 10050 2280
13780 2280 2346 4554 4335 8128 -8448 -9657 -3968 311 -1239 10866 12994 12098 8852 -6663 -16537
13765 -16537 -12164 -11230 -11766 -13366 -16375 -19535 -17907 -21696 -19020 -10556 -5593 -18603 -20076 -23194 -18240
13750 -18240 -8380 -5045 -3704 -6655 8040 16430 10867 -3675 -15830 -16798 -24803 -16113 -13510 -16244
13736 -16244 -21711 -9382 -10362 -9988 -25390 -45250 -33815 -7835 8410 3683 -6667 -10575 -14297
13723 -14297 -15916 -14849 -12372 -2352 -3126 -8184 -3228 -3528 8951 13096 388 -10832 -13327 -10198
13709 -10198 6318 7138 17230 15461 16172 21940 18207 8194 4150 490 -10689 -7918 7669 1949
$$ packed form
13809f298J0969n78j0999j0500j911l413J964m194P993J2449N983n328J866J1463
13795I466n391n323q840P113Q473m211n077j831m163j059L820L668Q858M547p770
13780B280O6K208k19L793j6576j209N689M279j550J2105K128q96l246j5515r874
13765a6537M373R34n36j600l009l160J628l789K676Q464M963j3010j473l118M954
13750a8240R860L335J341k951J4695Q390n563j4542j2155r68q005Q690K603k734
13736a6244n467J2329r80L74j5402j9860J1435K5980J6245m727j0350l908l722
13723a4297j619J067K477J0020p74n058M956l00J2479M145j2708j1220k495L129
13709a0198J6516Q20J0092j769P11N768l733j0013m044l660j1179K771J5587n720
$$ plain form
13695 1949 -4466 -6417 -10891 -5857 -6492 -11531 -14523 -16674 -7253 -19774 -25691 -9645 1211 7813
13681 7813 1774 1485 2650 -14926 -28793 -29131 -24841 -21449 -14752 -22634 -18680 -27736 -40511 -38854
13667 -38854 -31914 -25148 -27566 -22444 -19251 -13705 -5244 -13087 -22453 -22606 -10432 5413 1682 -8599
13653 -8599 -15792 -20292 -15215 -15963 -16969 -18940 -17358 -26838 -29174 -28978 -29253 -34562 -26855 -13351 -957
13638 -957 -7848 -27898 -22262 -10812 -17260 -20736 -15015 -4895 7477 2223 -11485 -30313 -26970
13625 -26970 -7609 -14391 -9744 1982 -7444 -23840 -31678 -32715 -23342 -28175 -36481 -41187 -34430 -9177
13611 -9177 -13438 -14690 -6625 1568 2276 2756 -1935 -9983 -16997 -20804 -6104 11029 9361 15737 19496
13596 19496 17576 6579 298 1812 -2646 -12782 -13424 -14768 -2862 -1511 -12672 -13394 -11181 -8698
$$ packed form
13695A949o415j951m474N034o35n039k992k151R421j2521n917J6046J0856O602
13681G813o039k89J165j7576j3867l38M290L392O697p882L954r056j2775J657
13667c8854O940O766k418N122L193N546Q461p843r366j53J2174J5845l731j0281
13653h599p193m500N077p48j006j971J582r480k336J96k75n309P707J3504J2394
13638i57o891k0050N636J1450o448l476N721J0120J2372n254j3708j8828L343
13625b6970J9361o782M647J1726r426j6396p838j037R373m833q306m706O757K5253
13611i177m261j252Q065Q193P08M80m691q048p014l807J4700J7133j668O376L759
13596A9496j920j0997o281J514m458j0136o42j344J1906J351j1161p22K213K483
$$ plain form
13582 -8698 -9723 -9904 -5587 1870 104 -225 -14093 -5012 4374 6916 3993 5736 12554 14149 7848
13567 7848 9547 -5570 -2032 -3930 -827 -2520 -33 126 6227 12862 7511 -8824 -1786 20464
13553 20464 20694 11945 4915 15677 13500 -411 -2399 -3613 -10922 -10474 4021 3525 6495 9290
13539 9290 -3054 -12841 -3305 -1634 2185 -16568 -13099 21 9582 2607 -63 -8447 -12887 -14666
13525 -14666 -12868 -13106 -19644 -6351 515 -9045 -8000 -9894 -6326 -6076 6678 7701 -7528 -16357
13511 -16357 -18440 -30197 -19666 -9442 -7544 -20192 -18531 -428 11260 9283 1722 -10772 -29504
13498 -29504 -39107 -34642 -22400 -18219 -10012 -7357 1897 1641 -8514 -8031 -6084 -2804 -4183 3927
13484 3927 4867 4484 8924 15389 15317 3780 -6430 -6585 1077 -276 -8652 -21407 -7372 3170 2763
$$ packed form
13582h698j025j81M317P457j766l29j3868R081R386K542k923J743O818J595o301
13567G848J699j5117L538j898L103j693K487J59O101O635n351j6335P038K2250
13553B0464K30q749p030J0762k177j3911j988j214p309M48J4495m96K970K795
13539I290j2344r787R536J671L819j8753L469J3120R561o975k670q384m440j779
13525a4666J798k38o538J3293O866r560J045j894L568K50J2754J023j5229q829
13511a6357k083j1757J0531J0224J898j2648J661J8103J1688j977p561j2494j8732
13498b9504r603M465J2242M181Q207K655R254k56j0155M83J947L280j379Q110
13484C927R40l83M440O465p2j1537j0210j55P662j353q376j2755J4035J0542m07
$$ plain form
13469 2763 -8433 -8901 -4941 10045 15857 883 -4531 6504 9452 332 -3023 8529 11352 7505
13455 7505 14901 8159 -2205 -10457 -10156 -13803 -4694 5588 119 10086 10043 14800 18014 4230 -7783
13440 -7783 -11071 -3802 -8286 1247 17604 28648 19890 25027 23851 21469 18897 12158 15275 10479
13426 10479 11695 -765 -2729 968 1020 -4437 -1140 5718 12580 15222 14788 10452 10881 11400 4188
13411 4188 2568 2629 10147 6732 14107 12649 -216 -4936 -8482 -7492 -19879 -28822 -19438 -11746 -5581
13396 -5581 -4027 -6917 553 5447 -605 -12240 -4941 9006 11074 2788 -13715 -20771 -3390 8371
13382 8371 13150 3770 6085 7662 3351 -1226 2547 -3696 -3714 -4637 -9143 1245 2461 885 -9213
13367 -9213 -14061 -10954 -6025 8354 4978 -487 1892 11099 11184 -659 -1116 -9904 -14288 -13335 -13617
$$ packed form
13469B763j1196m68L960J4986N812j4974n414J1035K948r120l355J1552K823l847
13455G505P396o742j0364q252L01l647R109J0282n469R967m3M757L214j3784j2013
13440g783l288P269m484R533J6357J1044q758N137j176k382k572o739L117m796
13426A0479J216j2460j964L697N2n457L297O858O862K642m34m336M29N19p212
13411D188j620O1P518l415P375j458j2865m720l546R90j2387q943R384P692O165
13396e581J554k890P470M894o052j1635P299J3947K068q286j6503p056J7381J1761
13382H371M779r380K315J577m311m577L773o243j8r23m506J0388J216j576j0098
13367i213m848L107M929J4379l376n465K379R207Q5j1843m57q788m384R53k82
$$ plain form
13352 -13617 -6493 -281 -591 -7151 -13879 -10093 -8812 -7739 5925 7191 -5470 -4313 14305 15132
13338 15132 6712 223 -9249 -6063 -11419 -22621 -19430 -9716 -16139 -22735 -11180 5838 21895
13325 21895 19932 947 -17681 -30066 -22869 -19089 -14927 2380 -6572 -29156 -24457 -14110 -12507
13312 -12507 -415 9130 -9676 -12336 -12596 -6317 -2955 4029 14504 17298 8836 6753 -3980 -3143
13298 -3143 -522 -811 5002 10026 21028 13099 1047 -17797 -23755 -15440 -6214 -4621 -19044 -31534
13284 -31534 -29402 -22916 -28082 -24901 -28013 -23189 -17519 202 2504 6807 3375 9051 -1687 -7885
13270 -7885 -4574 -22411 -18989 -25855 -33365 -36429 -40215 -25407 -12511 -14767 -23469 343 9867 5371
13256 5371 -1016 -5633 9176 10479 6019 6262 19066 26646 22516 17134 13450 16155 9936 17626
$$ packed form
13352a3617P124O212l10o560o728L786J281J073J3664J266j2661J157J8618Q27
13338A5132q420o489r472L186n356j1202L191R714o423o596J1555J7018J6057
13325B1895j963j8985j8628j2385P197L780M162J7307q952k2584M699J0347J603
13312a2507J2092R545j8806k660k60O279L362O984J0475K794q462k083j0733Q37
13298c143K621k89N813N024J1002p929j2052j8844n958Q315R226J593j4423j2490
13284c1534K132O486n166L181l112M824N670J7721K302M303l432N676j0738o198
13270g885L311j7837L422o866p510l064l786J4808J2896k256q702K3812R524m496
13256E371o387m617J4809J303m460K43J2804P580m130n382l684K705o219P690
$$ plain form
13242 17626 30223 26262 24838 8475 -11081 -23913 -21388 -7320 15043 19203 10078 7325 -5485
13229 -5485 -1896 -1229 -13206 -7171 927 4958 11518 15900 16495 21029 33060 49764 56527 38748
13215 38748 19173 14980 20740 30113 32375 29202 14962 5967 2785 -3145 8604 12552 -3077
13202 -3077 -18187 -6828 -6020 20780 22608 1404 -12732 -14821 5769 19966 27368 26326 23947
13189 23947 27372 35026 35874 28698 15280 1560 -8101 -14363 -8881 -10261 -11445 7997 17432 9696
13175 9696 8165 11830 10146 9288 11149 -3089 -15079 -10182 -8970 -9034 -13272 -531 15137 15603 7062
13160 7062 3048 5886 -1889 -8444 -1313 -439 -1580 1032 8934 4548 49 9313 12701 4699 603
13145 603 635 -957 -570 -1730 -562 -523 3991 9645 -1925 -9114 3484 1913 -9325 -5265 3322
$$ packed form
13242A7626J2597l961j424j6363j9556j2832K525J4068K2363M160r125k753j2810
13229e485L589O67j1977O035Q098M031O560M382N95M534J2031J6704O763j7779
13215C8748j9575m193N760R373K262l173j4240q995l182n930J1749L948j5629
13202c077j5110J1359Q08K6800J828k1204j4136k089K0590J4197P402j042k379
13189B3947L425P654Q48p176j3418j3720r661o262N482j380j184J9442R435p736
13175I696j531L665j684q58J861j4238j1990M897J212o4m238J2741J5668M66q541
13160G062m014K838p775o555P131Q74j141K612P902m386m499R264L388q002m096
13145F03L2j592L87j160J168L9M514N654j1570p189J2598j571j1238M060Q587
$$ plain form
13130 3322 1901 -1911 2717 11828 8425 5508 -10716 -15305 -11650 -11785 -12125 -6914 -6044 319 -13326
13115 -13326 -16932 -4483 7345 -1585 -16845 -9302 -9342 3772 15036 13923 25654 22043 20033
13102 20033 18939 13285 5091 9688 5733 -9022 -3780 -503 -782 -1270 -91 -8842 -14121 -7716 559
13087 559 2499 6783 19667 14759 -1633 -3531 -3502 1863 810 -8997 -12783 -12138 -20544 -16856 -2567
13072 -2567 1347 -6776 -10840 1224 2198 -2395 1649 619 10645 19106 21915 4464 2744 7265
13058 7265 13118 6352 11746 5213 -5070 -16116 -10378 -14729 -9219 1723 5135 8606 -8768 -22245
13044 -22245 -4660 -6540 -3666 -6460 -7584 9227 -4373 -12168 -6161 -12744 -6727 -223 5190 10718
13030 10718 12595 4723 4940 5383 -9044 2125 12053 19608 24657 18835 15592 5022 8741 20799
$$ packed form
13130C322j421l812M628R111l403k917j6224m589L655j35l40N211Q70O363j3645
13115a3326l606J2449J1828q930j5260P543m0J3114J1264j113J1731l611k010
13102B0033j094n654q194M597l955j4755N242L277k79m88J179q751n279O405Q275
13087E59J940M284J2884m908j6392j898K9N365j053r807l786O45q406L688J4289
13072b567L914q123m064J2064R74m593M044j030J0026Q461K809j7451j720M521
13058G265N853o766N394o533j0283j1046N738m351N510J0942L412L471j7374j3477
13044b2245J7585j880K874k794j124J6811j3600p795O007o583O017O504N413N528
13030A0718J877p872K17M43j4427J1169R928P555N049n822l243j0570L719J2058
$$ plain form
13016 20799 8537 8420 13012 7244 3900 7493 -13286 -19873 1239 -393 2020 17386 39514
13003 39514 44943 37064 25272 19401 13504 21565 23278 20820 35714 35604 30879 42814 45512 32855
12989 32855 35248 31564 13637 4549 3163 8431 3677 8731 19266 17434 20687 34491 34906 14675
12975 14675 27685 30237 15598 -3488 4509 20641 35107 44682 39265 18964 8055 8915 22889
12962 22889 25915 24339 26576 35505 42033 43515 37441 29592 20844 25863 17062 6038 5284 5380 5870
12947 5870 504 -572 958 2253 10932 26943 42246 48445 40614 37396 34412 16967 2215 9252
12933 9252 23123 22154 21674 21287 12698 14876 27142 32749 40276 49889 54449 54381 46504 33964 32080
12918 32080 36008 40560 15726 -4951 12826 18287 22277 24446 15250 24979 34657 37337 41811 50680
$$ packed form
13016B0799j2262j17M592n768l344L593k0779o587K1112j632K413J5366K2128
13003C9514N429p879j1792n871n897Q061J713k458J4894j10m725J1935K698j2657
12989C2855K393l684j7927r088j386N268m754N054J0535j832L253J3804M15k0231
12975A4675J3010K552j4639j9086P997J6132J4466R575n417k0301j0909Q60J3974
12962B2889L026j576K237Q929O528J482o074p849q748N019q801j1024p54R6M90
12947E870n366j076J530J295Q679J6011J5303O199p831l218k984j7445j4752P037
12933I252J3871r69m80l87q589K178J2266N607P527R613M560o8p877j2540j884
12918C2080L928M552k4834k0677J7777N461L990K169r196R729R678K680M474Q869
$$ plain form
12904 50680 57307 70341 78746 89950 112771 137318 149537 165998 201429 230590 273522 317559
12892 317559 365856 407692 436593 450275 458212 455791 446325 424375 391541 342336 312361 275732
12880 275732 230444 177033 136197 96191 81175 71866 80922 88008 77822 67564 58787 47249
12868 47249 27958 20463 24977 28894 35149 40919 53344 34058 12665 4510 6753 17883 28387
12855 28387 27169 28585 15900 8921 9700 8316 9627 14621 16870 24092 24121 16738 23575 28113 26731
12840 26731 27584 28674 38960 40087 31215 20160 15708 7757 1459 -4213 8147 27684 26836 11073
12826 11073 -1515 222 6555 7200 5322 10596 19269 21389 11995 9042 -4998 -10663 -6823 1220
12812 1220 -3033 -6452 -3711 -442 6447 1866 -1737 -1361 -1880 4172 13088 29832 42324 37506 32655
$$ packed form
12904E0680O627J3034Q405J1204K2821K4547J2219J6461L5431K9161M2932M4037
12892C17559M8297M1836K8901J3682P937k421r466k1950l2834m9205k9975l6629
12880B75732m5288n3411m0836m0006j5016r309R056P086j0186j0258q777j1538
12868D7249j9291p495M514L917O255N770J2425j9286k1393q155K243J1130J0504
12855B8387j218J416j2685o979P79j384J311M994K249P222K9p383O837M538j382
12840B6731Q53J090J0286J127q872j1055m452p951o298n672J2360J9537q48j5763
12826A1073j2588J737O333O45j878N274Q673K120r394k953j4040n665L840Q043
12812A220m253l419K741L269O889m581l603L76n19O052Q916J6744J2492m818m851
$$ plain form
12797 32655 28532 7028 -2522 -3382 284 5660 8191 24703 36573 45391 54817 60131 59604 58531
12783 58531 58821 46798 36101 34649 30178 32080 22883 10256 12576 11514 27390 33333 24942 19635
12769 19635 12386 9410 10650 23983 35630 27795 28827 28931 26596 19463 33742 47387 59076
12756 59076 48793 40282 31267 21584 30244 33791 34925 40158 34708 40151 45976 43893 39571 44565
12742 44565 39667 36230 38141 32969 25680 16086 13247 16045 20102 22361 21599 20734 14252 20913 12506
12727 12506 6143 13650 23648 17688 19601 17074 18584 17568 12679 -2113 2608 10051 17373 29716
12713 29716 39371 45768 35269 35011 36409 45233 44363 28764 9305 35136 45944 43679 42588 38694
12699 38694 41700 48836 43524 37458 36816 29620 33798 50357 49983 50857 54643 46974 37858 47524 52876
$$ packed form
12797C2655m123k1504r550q60L666N376K531J6512J1870Q818R426N314n27j073
12783E8531K90j2023j0697j452m471J902r197j2627K320j062J5876N943q391n307
12769A9635p249k976J240J3333J1647p835J032J04k335p133J4279J3645J1689
12756E9076j0283q511r015r683Q660L547J134N233n450N443N825k083m322M994
12742D4565m898l437J911n172p289r594k839K798M057K259p62q65o482O661q407
12727A2506o363P507R998n960J913k527J510j016m889j4792M721P443P322J2343
12713B9716R655O397j0499k58J398Q824q70j5599j9459K5831J0808k265j091l894
12699C8694L006P136n312o066o42p196M178J6559l74Q74L786p669r116R666N352
$$ plain form
12684 52876 65240 69810 65327 57458 53586 61106 65648 63139 48784 53900 65215 76470 88268
12671 88268 85393 84063 98688 139517 167924 157588 171638 204754 240265 259153 258192 247249
12659 247249 247277 234210 218055 205394 187229 190768 196302 193028 192373 190863 193690 186058 171398 163605
12645 163605 157960 147963 143647 154950 155175 157253 152165 154199 166645 171241 189450 209843 221356
12632 221356 234217 257828 259336 240433 215376 194161 179612 174756 166603 147230 140597 135142
12620 135142 147593 169041 177529 172805 181195 197010 197479 201683 215747 219805 221148 212693 200545
12607 200545 199547 209061 234758 260758 264283 264441 274855 277810 273132 258233 239624 221213 185678
12594 185678 164699 152810 147147 141553 141464 150407 155397 158939 169904 193672 217801 238384 261192
$$ packed form
12684E2876J2364M570m483p869l872P520M542k509j4355N116J1315J1255J1798
12671H8268k875j330J4625M0829K8407j0336J4050L3116L5511J8888r61j0943
12659B47249K8j3067j6155j2661j8165L539N534l274o55j510K827p632j4660p793
12645A63605n645r997m316J1303K25K078n088K034J2446M596J8209K0393J1513
12632B21356J2861K3611J508j8903k5057k1215j4549m856q153j9373o633n455
12620A35142J2451K1448Q488m724Q390J5815M69M204J4064M058J343q455j2148
12607B00545r98R514K5697K6000L525J58J0414K955m678j4899j8609j8411l5535
12594A85678k0979j1889n663n594q9Q943M990L542J0965K3768K4129K0583K2808
$$ plain form
12581 261192 282673 289572 295023 278510 226898 203023 187510 170144 159395 138754 131682 152919
12569 152919 148778 142083 147056 133398 121133 113777 112012 117125 125232 138693 144132 136648 138856
12556 138856 149546 160291 166882 183063 204933 226111 238536 238739 248102 266230 278835 285035
12544 285035 300593 311067 307952 290080 257029 244061 230637 201043 174801 174319 194252 196482
12532 196482 194407 172072 153035 151184 159717 147655 138068 137560 130935 136869 136472 129822 136809 137059
12518 137059 134079 127886 130615 137866 150089 195256 214507 224476 223770 230796 259238 274198 267404
12505 267404 256396 227027 210767 191227 165764 146273 143574 140612 134258 133345 131775 129554 125544
12492 125544 115260 121448 119256 125747 123567 115662 105489 108305 98248 83229 75373 96169 116094
$$ packed form
12581B61192K1481O899N451j6513n1612k3875j5513j7366j0749k0641p072K1237
12569A52919m141o695M973j3658j2265p356j765N113Q107J3461N439p484K208
12556A38856J0690J0745O591J6181K1870K1178J2425K03R363J8128J2605O200
12544B85035J5558J0474l115j7872l3051j2968j3424k9594k6242m82J9933K230
12532A96482k075k2335j9037j851Q533j2062r587n08o625N934l97o650O987K50
12518A37059k980o193K729P251J2223M5167J9251R969p06P026K8442J4960o794
12505B67404j1008k9369j6260j9540k5463j9491k699k962o354r13j570k221m010
12492A25544j0284O188k192O491k180p905j0173K816j0057j5019p856K0796J9925
$$ plain form
12479 116094 116259 110960 103908 107628 101830 118986 119575 119714 124587 126607 124780 129009 138921 144134 155435
12464 155435 151415 149078 140874 140410 161787 169109 171427 176110 174828 163127 163033 160479 150657 144570
12450 144570 162234 159579 142895 123897 128963 131112 133369 137678 134578 137444 144360 152218 159627
12437 159627 161421 163306 159836 165301 163352 159188 170514 193148 203522 202346 193229 179744 157848
12424 157848 153097 154872 143338 151096 162443 162224 169945 175014 160855 161561 179155 182779 195912
12411 195912 226206 225390 237263 264072 288912 303321 320580 321043 322950 316411 303767 295192 296138
12398 296138 288782 291583 283406 284969 293660 289809 278735 272624 277615 295940 304923 327290 340516
12385 340516 351590 387844 423975 442219 455883 459833 450770 434775 421529 415668 391923 381956
$$ packed form
12479A16094J65n299p052L720n798J7156N89J39M873K020j827M229R912N213J1301
12464A55435m020k337q204m64K1377P322K318M683j282j1701r4k554r822o087
12450A44570J7664k655j6684j8998N066K149K257M309l100K866O916P858P409
12437A59627J794J885l470N465j949m164J1326K2634J0374j176r117j3485k1896
12424A57848m751J775j1534P758J1347k19P721N069j4159P06J7594L624J3133
12411A95912L0294q16J1873K6809K4840J4409J7259M63J907o539j2644q575R46
12398B96138p356K801q177J563Q691l851j1074o111M991J8325Q983K2367J3226
12385C40516J1074L6254L6131J8244J3664L950r063j5995j3246n861k3745r967
$$ plain form
12373 381956 380980 380993 383150 394706 408061 405735 407945 395989 389849 388533 388881 371599 354192 347906
12359 347906 335970 311640 304600 315009 316424 316578 320280 317943 314427 309566 318245 320004 335117
12346 335117 359219 376875 387651 399179 407624 408734 407005 396446 404047 400626 403528 403378 394455
12333 394455 394589 395468 403463 414519 413712 395454 390485 389828 387623 380762 386492 387321 383024 379805 386234
12318 386234 403521 410881 429597 448678 462627 471009 476395 502086 519600 518948 533121 555339
12306 555339 562200 568485 595013 612273 628873 661016 688021 701629 708914 729647 743220 749956
12294 749956 743735 741827 742069 738743 745233 750533 765519 769747 791938 822403 854070 872886 910256
12281 910256 937369 960713 976253 1000786 1024802 1063505 1103390 1137295 1171523 1200593 1243196
$$ packed form
12373C81956r76J3K157J1556J3355k326K210j1956o140j316L48j7282j7407o286
12359C47906j1936k4330p040J0409J415J54L702k337l516m861Q679J759J5113
12346C35117K4102J7656J0776J1528Q445J110j729j0559P601l421K902j50q923
12333C94455J34Q79P995J1056q07j8258m969o57k205o861N730Q29m297l219O429
12318C86234J7287P360J8716J9081J3949Q382N386K5691J7514o52J4173K2218
12306E55339O861O285K6528J7260J6600L2143K7005J3608P285K0733J3573O736
12294G49956o221j908K42l326O490N300J4986M228K2191L0465L1667J8816L7370
12281I10256K7113K3344J5540K4533K4016L8703L9885L3905L4228K9070M2603
$$ plain form
12270 1243196 1290088 1340210 1392627 1473600 1561539 1621226 1708087 1813731 1934731 2074375 2216603
12259 2216603 2393904 2570450 2743915 2960660 3190228 3460759 3774548 4148730 4587999
12250 4587999 5107660 5726582 6459400 7354969 8485928 9966381 11899082 14444429 17737476
12241 17737476 21790302 26441931 31305150 35767152 39095156 40689403 40330867 38305305
12233 38305305 35317532 32174791 29543355 27849822 27196351 27368934 27948382 28474916 28515645
12224 28515645 27827967 26403214 24473148 22417936 20540051 19062591 18106391 17690067
12216 17690067 17798728 18398291 19511644 21157617 23273361 25759307 28448346 31081773
12208 31081773 33379169 35034488 35825613 35638467 34504908 32545071 30035210 27279126
$$ packed form
12270A243196M6892N0122N2417Q0973Q7939N9687Q6861J05644J21000J39644J42228
12259B216603J77301J76546J73465K16745K29568K70531L13789L74182M39269
12250D587999N19661O18922P32818Q95569J130959J480453J932701K545347L293047
12241A7737476M052826M651629M863219M462002L328004J594247l58536k025562
12233C8305305k987773l142741k631436j693533o53471J72583N79448N26534M0729
12224B8515645o87678j424753j930066k055212j877885j477460r56200m16324
12216A7690067J08661N99563J113353J645973K115744K485946K689039K633427
12208C1081773K297396J655319P91125j87146j133559j959837k509861k756084
$$ plain form
12200 27279126 24590905 22236024 20342307 18941069 18038974 17625698 17717621 18328410 19460775
12191 19460775 21117940 23204958 25542949 27856118 29765689 30974605 31404758 31253144
12183 31253144 30939031 31015327 31945625 33963117 36997977 40595197 44051992 46517426 47228132
12174 47228132 45763238 42311079 37587238 32415908 27503288 23333993 20085901 17746756
12166 17746756 16161314 15187632 14694945 14642514 15044256 15943537 17480766 19827625 23115067
12157 23115067 27313404 32083426 36860134 40815338 43127996 43217122 41035972 37199096
12149 37199096 32613646 28057416 24064633 20919131 18622228 17025576 15968593 15270468
12141 15270468 14804424 14477824 14202603 13924349 13631144 13370704 13175867 13116479 13285425
$$ packed form
12200B7279126k688221k354881j893717j401238r02095m13276R1923O10789J132365
12191A9460775J657165K087018K337991K313169J909571J208916M30153j51614
12183C1253144l14113P6296R30298K017492L034860L597220L456795K465434P10706
12174D7228132j464894l452159m723841n171330m912620m169295l248092k339145
12166A7746756j585442r73682m92687n2431M01742Q99281J537229K346859L287442
12157B3115067M198337M770022M776708L955204K312658Q9126k181150l836876
12149C7199096m585450m556230l992783l145502k296903j596652j056983o98125
12141A5270468m66044l26600k75221k78254k93205k60440j94837n9388J68946
$$ plain form
12132 13285425 13736026 14543588 15764099 17366297 19290760 21421511 23655808 25921007
12124 25921007 28188407 30586063 33266566 36281163 39522503 42695217 45358329 47074934
12116 47074934 47582657 46814219 44869976 42078440 38869386 35643472 32695914 30171295
12108 30171295 28027409 26083895 24146975 22130820 20086139 18129468 16377682 14954157
12100 14954157 13916434 13244256 12912495 12845012 12972409 13235958 13564446 13889761 14196380
12091 14196380 14526794 14936798 15552808 16529415 18028947 20259204 23377135 27410095 32126214
12082 32126214 36997156 41182702 43774417 44042866 41760504 37428804 32064126 26569591
12074 26569591 21589118 17512808 14382055 12008930 10217029 8841403 7745295 6880959
$$ packed form
12132A3285425M50601Q07562J220511J602198J924463K130751K234297K265199
12124B5921007K267400K397656K680503L014597L241340L172714K663112J716605
12116D7074934N07723p68438j944243k791536l209054l225914k947558k524619
12108C0171295k143886j943514j936920k016155k044681j956671j751786j423525
12100A4954157j037723o72178l31761o7483J27397K63549L28488L25315L06619
12091A4196380L30414M10004O16010R76607J499532K230257L117931M032960M716119
12082C2126214M870942M185546K591715K68449k282362m331700n364678n494535
12074B6569591m980473m076310l130753k373125j791901j375626j096108q64336
$$ plain form
12066 6880959 6167679 5577720 5094620 4698034 4347588 4045737 3789100 3543746 3305396
12057 3305396 3091145 2892747 2722454 2576604 2443630 2321804 2207927 2128146 2036017 1951581
12047 1951581 1884572 1830781 1771384 1716375 1662251 1612388 1572745 1535130 1494608 1462702 1445392
12036 1445392 1441860 1432204 1432965 1436132 1443592 1421496 1381832 1334957 1277147 1223276 1177370 1124379
12024 1124379 1080813 1045491 1023546 1007137 995672 992510 987869 975970 953156 919121 882117 840780
12012 840780 812342 788933 764684 730673 691654 657631 644137 649758 651492 634436 613558 596085
12000 596085 588369 584583 574551 552760 558293 565554 573452 577643 580836 578193 569451 575760 595711
11987 595711 605638 600145 591834 569051 550600 530782 502844 479661 460734 450872 443547 436924 432256
$$ packed form
12066F880959p13280n89959m83100l96586l50446l01851k56637k45354k38350
12057C305396k14251j98398j70293j45850j32974j21826j13877p9781r2129q4436
12047A951581o7009n3791n9397n5009n4124m9863l9643l7615m0522l1906j7310
12036A445392l532r656P61L167P460k2096l9664m6875n7810n3871m5906n2991
12024A124379m3566l5322k1945j6409j1465l162m641j1899k2814l4035l7004m1337
12012H40780k8438k3409k4249l4011l9019l4023j3494N621J734j7056k0878j7473
12000E96085p716l786j0032k1791N533P261P898M191L193k643q742O309J9951
11987E95711R927n493q311k2783j8451j9818k7938k3183j8927r862p325o623m668
$$ plain form
11974 432256 416079 424944 453959 463255 458901 458237 464601 448573 411945 395064 385802 386608 376878
11961 376878 353337 349929 361307 348906 348312 348751 366715 381130 403526 421154 435828 441699 425889
11948 425889 402100 381247 348849 328365 337379 346088 338840 348007 354206 356644 370997 390180 399434
11935 399434 402708 397352 388318 352077 347643 365014 366843 376394 398247 427695 442340 432955 418748
11922 418748 423914 418691 396089 373478 351514 333553 326281 341636 351427 358698 358980 377809 385282
11909 385282 383648 375999 358181 331322 305643 293961 301563 305362 298811 287216 276321 260203
11897 260203 241707 238312 234531 220769 215184 220855 221931 227885 238062 258755 268183 279247 298039
11884 298039 300820 307046 318858 316477 312077 298530 280986 275573 287043 290236 284324 269423 262359
$$ packed form
11974D32256j6177Q865K9015R296m354o64O364j6028l6628j6881r262Q06r730
11961C76878k3541l408J1378j2401n94M39J7964J4415K2396J7628J4674N871j5810
11948D25889k3789k0853l2398k0484R014Q709p248R167O199K438J4353J9183R254
11935C99434L274n356r034l6241m434J7371J829R551K1853K9448J4645r385j4207
11922D18748N166n223k2602k2611k1964j7961p272J5355R791P271K82J8829P473
11909C85282j634p649j7818k6859k5679j1682P602L799o551j1595j0895j6118
11897B60203j8496l395l781j3762n585N671J076N954J0177K0693R428J1064J8792
11884B98039K781O226J1812k381m400j3547j7544n413J1470L193n912j4901p064
$$ plain form
11871 262359 268645 272502 270067 280326 301675 326520 333305 346336 350720 364714 368082 368537 353558
11858 353558 330201 301469 283793 264951 246637 238929 239305 232210 222939 220431 212561 217155 219380
11845 219380 213697 218606 218622 218052 222141 219414 237955 231731 222676 242915 250040 245677 235197 227111
11831 227111 211377 212687 227289 225314 221045 225351 247742 271165 275546 278438 281301 286568 287559
11818 287559 287333 296063 297891 275009 262206 266750 255990 252440 267883 286684 294038 303337 326594
11805 326594 349050 358185 355763 343578 333759 326926 311131 309001 323883 325358 340837 345770 351840
11792 351840 357442 347134 329465 327256 335303 353251 362479 364701 356014 352748 346734 331212 340901
11779 340901 357897 366196 374216 368205 378235 386966 388821 370112 341000 317804 305443 297838 294754
$$ packed form
11871B62359O286L857k435J0259K1349K4845O785J3031M384J3994L368M55j4979
11858C53558k3357k8732j7676j8842j8314p708L76p095r271k508p870M594K225
11845B19380n683M909J6n70M089k727J8541o224r055K0239P125m363j0480q086
11831B27111j5734J310J4602j975m269M306K2391K3423M381K892K863N267R91
11818B87559k26Q730J828k2882j2803M544j0760l550J5443J8801P354R299K3257
11805C26594K2456R135k422j2185r819o833j5795k130J4882J475J5479M933O070
11792C51840N602j0308j7669k209Q047J7948R228K222q687l266o014j5522R689
11779C40901J6996Q299Q020o011J0030Q731J855j8709k9112k3196j2361p605l084
$$ plain form
11766 294754 283126 269246 268589 274273 295799 322228 341813 346404 363842 386190 401010 408946
11754 408946 405623 410402 402069 382023 364057 346347 348532 371128 393408 407683 414303 403197
11742 403197 393729 370092 346602 325979 297571 279081 272305 259964 262853 268263 271800 282830
11730 282830 280339 278650 279179 285100 294343 282263 297735 328413 350904 355966 365096 381243 369999
11717 369999 359608 348577 322085 289652 268045 246314 226485 215478 208540 203371 193909 197472
11705 197472 190161 192531 199621 207700 206756 213944 226276 233409 243428 244529 238755 250265 273955
11692 273955 275742 276923 271352 274402 288434 300256 319650 320368 323637 345008 339745 333243 347626
11679 347626 341613 312259 285583 282564 269852 249776 239473 236577 223498 219437 204097 196208
$$ packed form
11766B94754j1628j3880o57N684K1526K6429J9585M591J7438K2348J4820P936
11754D08946l323M779q333k0046j7966j7710K185K2596K2280J4275O620j1106
11742D03197r468k3637k3490k0623k8408j8490o776j2341K889N410L537J1030
11730B82830k491j689N29N921R243j2080J5472L0678K2491N062R130J6147j1244
11717C69999j0391j1031k6492l2433k1607k1731j9829j1007o938n169r462L563
11705A97472p311K370P090Q079r44P188J2332P133J0019J101n774J1510K3690
11692B73955J787J181n571L050J4032J1822J9394P18L269K1371n263o502J4383
11679C47626o013k9354k6676l019j2712k0076j0303k896j3079m061j5340p889
$$ plain form
11667 196208 194350 175642 167381 171343 175263 164267 159811 150251 139354 140516 155204 154679 160053
11654 160053 178485 200792 204048 217205 228660 251014 266778 289343 299017 318254 317980 311008
11642 311008 308595 271133 236832 199200 173219 167378 157601 145961 151765 143357 122681 102879
11630 102879 101840 109301 108600 107960 110614 111534 106105 111958 108825 105674 105623 99290 92768 93555 99467 98965
11614 98965 97314 82193 67301 73674 71716 80480 89683 98736 98573 85990 73801 74318 81449 86756
11600 86756 96340 110364 101150 98034 100165 97291 91873 81926 71623 73286 66457 57288 65911 63971
11586 63971 52622 53732 57993 62325 88433 76521 69532 65926 75089 58381 55342 70926 73571
11573 73571 79659 79826 81241 84992 87098 94402 113728 120554 127137 110862 96291 94987 84986 83136
$$ packed form
11667A96208j858j8708q261L962L920j0996m456r560j0897J162J4688n25N374
11654A60053J8432K2307L256J3157J1455K2354J5764K2565R674J9237k74o972
11642C11008k413l7462l4301l7632k5981n841r777j1640N804q408k0676j9802
11630A02879j039P461p01o40K654R20n429N853l133l151n1o333o522P87N912n02
11614I8965j651j5121j4892O373j958Q764R203R053j63j2583j2189N17P131N307
11600H6756R584J4024r214l116K131k874n418r947j0303J663o829r169Q623j940
11586F3971j1349J110M261M332K6108j1912o989l606R163j6708l039J5584K645
11573G3571O088J67J415L751K106P304J9326O826O583j6275j4571j304j0001j850
$$ plain form
11559 83136 87023 79788 82162 85542 81722 79280 95097 99603 102661 101417 88026 98505 105552 99187
11545 99187 96329 105454 105853 101081 95859 104258 109241 105501 112363 116672 106571 101160 86341 91156
11531 91156 99316 96267 86578 86581 96665 100739 104347 90723 88317 103274 119118 104975 97046 104496
11517 104496 109560 104967 106723 104794 102319 102048 102595 87343 79703 89894 101561 91631 101101 109291
11503 109291 101729 101701 95850 80633 72273 71799 73433 73575 65457 63690 79253 93766 84429 94393
11489 94393 104900 102676 105856 111579 101101 91540 79283 80225 97098 110532 119611 123646 105807
11476 105807 100364 102672 102410 93181 90913 97784 95401 83334 72513 74211 77835 84430 94835 101539
11462 101539 106526 114905 126685 125885 122697 120817 119772 121162 127231 135945 143554 170431 204105 232558
$$ packed form
11559H3136L887p235K374L380l820k442J5817M506L058j244j3391J0479P047o365
11545I9187k858R125L99m772n222Q399M983l740O862M309j0101n411j4819M815
11531I1156Q160l049r689LJ0084M074L608j3624k406J4957J5844j4143p929P450
11517A04496N064m593J756j929k475k71N47j5252p640J0191J1667r930R470Q190
11503A09291p562k8n851j5217q360m74J634J42q118j767J5563J4513r337R964
11489I4393J0507k224L180N723j0478r561j2257R42J6873J3434R079M035j7839
11476A05807n443K308k62r229k268O871k383j2067j0821J698L624O595J0405O704
11462A01539M987Q379J1780q00l188j880j045J390O069Q714P609K6877L3674K8453
$$ plain form
11448 232558 267476 306994 345545 341099 315481 278064 248882 207361 181130 174329 152963 136913
11436 136913 119108 110725 98109 84291 96431 119563 131065 125690 96410 96349 92485 80816 84835
11423 84835 96063 99216 90501 83967 79923 87114 89874 96320 98884 92097 104089 103187 100354 95655
11409 95655 93255 97744 93120 79688 79496 94923 103487 95634 91902 92069 113872 132870 130376 138648
11395 138648 150450 153583 153398 159265 169484 201931 229935 260134 296293 301075 305790 304118 292565
11382 292565 279230 256001 231431 234216 242356 236485 233549 225357 219078 203288 198221 197728 178163
11369 178163 183528 188749 185289 176472 178692 182333 170329 168330 183316 212275 226463 235398 250563
11356 250563 262275 265092 256091 249748 245697 234411 226855 219140 207724 196847 202037 206863 199912
$$ packed form
11448B32558L4918L9518L8551m446k5618l7417k9182m1521k6231o801k1366j6050
11436A36913j7805q383j2616j3818J2140K3132J1502n375k9280o1l864j1669M019
11423H4835J1228L153q715o534m044P191K760O446K564o787J1992r02k833m699
11409I5655k400M489m624j3432j92J5427Q564p853l732J67K1803J8998k494Q272
11395A38648J1802L133j85N867J0219L2447K8004L0199L6159M782M715j672j1553
11382B92565j3335k3229k4570K785Q140n871k936q192o279j5790n067m93j9565
11369A78163N365N221l460q817K220L641j2004j999J4986K8959J4188Q935J5165
11356B50563J1712K817r001o343m051j1286p556p715j1416j0877N190M826o951
$$ plain form
11343 199912 187465 178279 195566 210690 215086 228027 235400 226937 220806 231555 234096 237488 242450
11330 242450 250907 261548 263260 272830 285918 290385 297571 300147 281762 252360 225351 217097 198545
11317 198545 172140 160944 161782 167624 187531 197467 192521 177315 179201 198783 233091 261323 299816
11304 299816 329664 342986 359254 344190 308932 285770 271787 262313 248447 244693 228978 213304
11292 213304 202906 186468 185731 190875 190880 182263 179566 179969 197897 214409 228442 227274 226668 236765
11278 236765 239449 253611 284638 309190 321668 338147 363764 381374 390918 395709 414203 417672
11266 417672 413673 416836 442652 459733 455731 441329 443568 445824 425914 408308 386086 387429 389537
11253 389537 360648 344446 339216 333819 324508 335048 340757 349175 355695 368757 404366 416042 432085
$$ packed form
11343A99912j2447r186J7287J5124M396J2941P373q463o131J0749K541L392M962
11330B42450Q457J0641J712R570J3088M467P186K576j8385k9402k7009q254j8552
11317A98545k6405j1196Q38N842J9907R936m946j5206J886J9582L4308K8232L8493
11304B99816K9848J3322J6268j5064l5258k3162j3983r474j3866l754j5715j5674
11292B13304j0398j6438p37N144Nq617k697M03J7928J6512J4033j168o06J0097
11278B36765K684J4162L1027K4552J2478J6479K5617J7610R544M791J8494L469
11266D17672l999L163K5816J7081m002j4402K239K256j9910j7606k2222J343K108
11253C89537k8889j6202n230n397r311J0540N709Q418O520J3062L5609J1676J6043
$$ plain form
11240 432085 465795 493841 518537 536534 549549 569733 584612 610800 614436 610946 582579 555522
11228 555522 535884 510920 503191 488057 477809 474233 453017 414915 394557 361553 353085 372003
11216 372003 381104 388816 380778 376551 366982 361202 353337 339557 344304 347856 332248 339029 335612 339848
11202 339848 334613 327941 327665 312514 308142 312243 327674 355010 363314 365496 373957 375452 374511 382062
11188 382062 397321 402400 393355 385003 386483 385627 383376 381959 368674 370407 382978 382949 388749 379324
11174 379324 382938 406479 422692 432505 448501 465138 476694 498834 521238 520715 529850 542932
11162 542932 560770 550376 526184 496864 468699 454864 437503 425724 405922 397361 374006 362612
11150 362612 372582 380107 383384 397498 388079 381521 382517 385912 390657 375891 381510 393934 389296 378565
$$ packed form
11240D32085L3710K8046K4696J7997J3015K0184J4879K6188L636l490k8367k7057
11228E55522j9638k4964p729j5134j0248l576k1216l8102k0358l3004q468J8918
11216C72003R101P712q038m227r569n780p865j3780M747L552j5608O781l417M236
11202C39848n235o672k76j5151m372M101J5431K7336Q304K182Q461J495r41P551
11188C82062J5259N079r045q352J480q56k251j417j3285J733J2571k9N800r425
11174C79324L614K3541J6213R813J5996J6637J1556K2140K2404n23R135J3082
11162E42932J7838j0394k4192k9320k8165j3835j7361j1779j9802q561k3355j1394
11150C62612R970P525L277J4114r419o558R96L395M745j4766N619J2424m638j0731
$$ plain form
11136 378565 384422 381289 377837 379600 383583 374356 356247 344072 337537 339345 349818 367627 392633
11123 392633 413081 438385 465215 500582 541049 575174 605164 627400 645420 625896 578430
11112 578430 520987 487180 457874 430394 418194 408469 401372 380861 375176 376499 382876 399015
11100 399015 404564 408643 412772 408450 399460 391395 378474 373459 385759 393427 383720 394144 416158
11087 416158 423866 417689 422126 430208 410250 408503 403110 394592 395262 412652 416113 420324 436080 451922
11073 451922 469832 470424 471543 485437 499454 517825 521824 509777 492390 475908 465059 468378
11061 468378 469240 466887 461077 468714 469484 474482 495376 501229 514551 527042 543929 552313 565010
11048 565010 588795 589678 583179 594229 606787 620413 631572 645224 675495 684047 705839 726439
$$ packed form
11136C78565N857l133l452J763L983r227j8109j2175o535J808J0473J7809K5006
11123C92633K0448K5304K6830L5367M0467L4125K9990K2236J8020j9524m7466
11112E78430n7443l3807k9306k7480j2200r725p097k0511n685J323O377J6139
11100C99015N549M079M129m322q990q065j2921n015J2300P668r707J0424K2014
11087D16158P708o177M437Q082j9958j747n393q518O70J7390L461M211J5756J5842
11073D51922J7910N92J119J3894J4017J8371L999j2047j7387j6482j0849L319
11061D68378Q62k353n810P637P70M998K0894N853J3322J2491J6887Q384J2697
11048E65010K3785Q83o499J1050J2558J3626J1159J3652L0271Q552K1792K0600
$$ plain form
11036 726439 744788 745420 738707 742793 772312 784702 804781 827391 838281 850778 863498 883193
11024 883193 894560 907377 926004 957536 980325 1020542 1064122 1085110 1111397 1141938 1177446
11013 1177446 1204683 1218746 1239918 1285251 1334206 1374656 1419385 1462682 1506869 1552478 1638460
11002 1638460 1728521 1804017 1885546 1994907 2111695 2237102 2386945 2566334 2749935 2946724
10992 2946724 3166267 3399206 3679424 3987400 4333413 4762799 5277665 5890945 6658267
10983 6658267 7611775 8762446 10179389 11969962 14276684 17292268 21204773 26020160
10975 26020160 31426232 36765397 41099951 43661138 44137362 42732397 39966045 36637538
10967 36637538 33621732 31594642 30809437 31075803 31852654 32412160 32207954 30993433 28885826
$$ packed form
11036G26439J8349O32o713M086K9519J2390K0079K2610J0890J2497J2720J9695
11024H83193J1367J2817J8627L1532K2789M0217M3580K0988K6287L0541L5508
11013A177446K7237J4063K1172M5333M8955M0450M4729M3297M4187M5609Q5982
11002A638460R0061P5496Q1529J09361J16788J25407J49843J79389J83601J96789
10992B946724K19543K32939K80218L07976L46013M29386N14866O13280P67322
10983F658267R53508J150671J416943J790573K306722L015584L912505M815387
10975B6020160N406072N339165M334554K561187M76224j404965k766352l328507
10967C6637538l015806k027090p85205K66366P76851N59506k04206j214521k107607
$$ plain form
10958 28885826 26184936 23296124 20601480 18427948 16931370 16089493 15824303 16085536
10950 16085536 16858821 18199977 20177648 22744110 25820843 29147784 32369437 35164815
10942 35164815 37186091 38144363 37891848 36436036 33985142 30923213 27632824 24450148
10934 24450148 21679841 19507311 17994077 17123014 16854743 17148262 18034717 19550640 21638057
10925 21638057 24126112 26712495 29036224 30693188 31376361 31079841 30147340 29173437 28839241
10916 28839241 29647017 31735884 34803334 38168486 41008699 42604084 42522226 40649920
10908 40649920 37176044 32642758 27900195 23689204 20374025 17937605 16221573 15098498
10900 15098498 14419195 14130271 14185048 14563232 15309602 16478558 18184288 20572979 23772656
$$ packed form
10958B8885826k700890k888812k694644k173532j496578q41877k65190K61233
10950A6085536P73285J341156J977671K566462L076733L326941L221653K795378
10942C5164815K021276R58272k52515j455812k450894l061929l290389l182676
10934B4450148k770307k172530j513234q71063k68271K93519Q86455J515923K087417
10925B1638057K488055K586383K323729J656964O83173k96520r32501r73903l34196
10916B8839241Q07776K088867L067450L365152K840213J595385q1858j872306
10908D0649920l473876m533286m742563m210991l315179k436420j716032j123075
10900A5098498o79303k88924N4777L78184P46370J168956J705730K388691L199677
$$ plain form
10891 23772656 27813893 32413270 36887920 40350837 42081545 41735374 39446199 35742950
10883 35742950 31423398 27295967 23854848 21186746 19118231 17459007 16057136 14836561
10875 14836561 13833097 13080592 12638495 12537227 12769792 13289707 14076402 15079170 16316202
10866 16316202 17799532 19557500 21539536 23646965 25731086 27747088 29700125 31563065
10858 31563065 33318146 35000493 36642017 38206648 39521433 40374478 40551816 39957590
10850 39957590 38686640 37030438 35298890 33691484 32290988 31074295 29925214 28680605
10842 28680605 27240187 25630280 23886270 22046857 20221357 18517468 17009020 15756301
10834 15756301 14721425 13866245 13212797 12840363 12811289 13171289 13894549 14958537 16351689
$$ packed form
10891B3772656M041237M599377M474650L462917J730708l46171k289175l703249
10883C5742950m319552m127431l441119k668102k068515j659224j401871j220575
10875A4836561j003464p52505m42097j01268K32565N19915P86695J002768J237032
10866A6316202J483330J757968J982036K107429K084121K016002J953037J862940
10858C1563065J755081J682347J641524J564631J314785Q53045J77338n94226
10850C9957590j270950j656202j731548j607406j400496j216693j149081j244609
10842B8680605j440418j609907j744010j839413j825500j703889j508448j252719
10834A5756301j034876q55180o53448l72434k9074L60000P23260J063988J393152
$$ plain form
10825 16351689 18058047 20123498 22733612 26028199 30046787 34640245 39333111 43363746
10817 43363746 45866288 46193690 44127435 39996486 34563982 28834252 23632639 19392021
10809 19392021 16132071 13668549 11772724 10244854 8968273 7882169 7019542 6323093
10801 6323093 5743400 5277076 4908283 4592874 4321456 4091016 3868449 3647863 3440265
10792 3440265 3247466 3058241 2877203 2722705 2592537 2471524 2360253 2258426 2172353 2086227
10782 2086227 2004827 1936632 1854391 1794696 1734002 1684721 1647569 1612805 1557920 1516228 1483516
10771 1483516 1462902 1460897 1441141 1414557 1403857 1374335 1329743 1288244 1238384 1174535 1146201
10760 1146201 1127799 1087284 1053209 1030099 1015990 1012897 994940 972318 930220 908037 900831 894605
$$ packed form
10825A6351689J706358K065451K610114L294587M018588M593458M692866M030635
10817D3363746K502542L27402k066255m130949n432504n729730n201613m240618
10809A9392021l259950k463522j895825j527870j276581j086104q62627o96449
10801F323093n79693m66324l68793l15409k71418k30440k22567k20586k07598
10792C440265j92799j89225j81038j54498j30168j21013j11271j01827q6073q6126
10782B086227q1400o8195q2241n9695o0694m9281l7152l4764n4885m1692l2712
10771A483516k0614k005j9756k6584j0700k9522m4592m1499m9860o3849k8334
10760A146201j8402m0515l4075k3110j4109l093j7957k2622m2098k2183p206o226
$$ plain form
10748 894605 861112 833471 815453 812139 795927 784657 762494 751180 740345 755190 780243 803720
10736 803720 813461 805623 811778 835302 878172 896493 863576 818958 779545 751310 743872 737741
10724 737741 728026 703757 661892 631129 614437 597316 584794 581401 568759 554282 538816 529981
10712 529981 522087 512045 507948 497872 491529 507751 527088 524139 505373 501768 502946 511244 515042
10699 515042 530440 563390 600101 620477 640956 647302 625316 603737 575766 553534 532240 525851
10687 525851 517297 523412 517964 524626 535402 559743 604272 659246 743518 839833 934540 1011587
10675 1011587 1049870 1047802 981482 892013 788101 711369 674229 650539 645593 635849 618888 601446
10663 601446 581645 568429 558639 553529 562651 578024 592972 614710 645750 693345 747773 763388
$$ packed form
10748H94605l3493k7641j8018l314j6212j1270k2163j1314j0835J4845K5053K3477
10736H03720R741p838O155K3524M2870J8321l2917m4618l9413k8235p438o131
10724G37741r715k4269m1865l0763j6692j7121j2522l393j2642j4477j5466q835
10712E29981p894j0042m097j0076o343J6222J9337k949j8766l605J178Q298L798
10699E15042J5398L2950L6711K0376K0479O346k1986k1579k7971k2232k1294o389
10687E25851q554O115n448O662J0776K4341M4529N4974Q4272R6315R4707P7047
10675A011587L8283k068o6320q9469j03912p6732l7140k3690m946r744j6961j7442
10663F01446j9801j3216r790n110R122J5373J4948K1738L1040M7595N4428J5615
$$ plain form
10651 763388 761031 738371 683338 615441 571109 527597 501844 487403 481366 479436 469971 457006
10639 457006 453145 454268 444044 435453 443923 439595 427778 424013 416844 432094 469253 482018 495962
10626 495962 501461 485508 445182 422575 422563 417617 408966 401466 391225 393059 396094 396245 403293 396906
10612 396906 391987 388003 400816 414791 420797 429659 444561 463752 462919 455823 451732 450093 420936
10599 420936 400121 387032 379099 366874 356686 359550 360363 374482 371843 363383 351513 348274 347582
10586 347582 336679 343026 343653 341270 330563 349498 361249 369208 362492 352927 348768 354126 352266
10573 352266 361662 373877 368645 347999 312847 296715 306897 317215 337796 362458 378115 393706
10561 393706 414109 428504 438917 464822 473672 483996 503590 519758 531710 531817 542646 556480
$$ packed form
10651G63388k357k2660n5033o7897m4332m3512k5753j4441o037j930r465j2965
10639D57006l861J123j0224q591Q470m328j1817l765p169J5250L7159J2765J3944
10626D95962N499j5953m0326k2607j2m946q651p500j0241J834L035J51P048o387
10612C96906m919l984J2813J3975O006Q862J4902J9191q33p096m091j639k9157
10599D20936k0815j3089p933j2225j0188K864Q13J4119k639q460j1870l239o92
10586C47582j0903O347O27k383j0707J8935J1751P959o716r565m159N358j860
10573C52266R396J2215n232k0646l5152j6132J0182J0318K0581K4662J5657J5591
10561C93706K0403J4395J0413K5905Q850J0324J9594J6168J1952J07J0829J3834
$$ plain form
10549 556480 550211 534791 528903 524452 526203 539787 547985 546681 547578 542474 525491 529576 525275 511768
10535 511768 514192 531558 552396 602011 652404 722884 786995 859882 904987 896548 856730 816098
10523 816098 783739 769432 750138 728952 714951 706484 701504 688518 692949 717297 751364 789893
10511 789893 816308 830565 812487 800973 798428 783256 790177 810028 829164 840266 838238 826780
10499 826780 809202 796749 775505 764353 767482 804447 836166 866714 890951 913874 915299 913218
10487 913218 900870 896796 898968 898841 922644 946089 971595 995260 1008661 1034772 1056156 1086311
10475 1086311 1119357 1135567 1167064 1207115 1231898 1263842 1302749 1356057 1383102 1397004 1424383
10464 1424383 1424808 1434940 1452878 1464438 1470412 1481167 1502672 1538828 1597277 1673104 1751475 1828174
$$ packed form
10549E56480o269j5420n888m451J751J3584Q198j304Q97n104j6983M085m301j3507
10535E11768K424J7366K0838M9615N0393P0480O4111P2887M5105q439l9818m0632
10523H16098l2359j4307j9294k1186j4001q467m980j2986M431K4348L4067L8529
10511G89893K6415J4257j8078j1514k545j5172O921J9851J9136J1102k028j1458
10499H26780j7578j2453k1244j1152L129L6965L1719L0548K4237K2923J425k081
10487I13218j2348m074K172j27K3803K3445K5506K3665J3401K6111K1384L0155
10475A086311L3046J6210L1497M0051K4783L1944L8907N3308K7045J3902K7379
10464A424383M25J0132J7938J1560N974J0755K1505L6156N8449P5827P8371P6699
$$ plain form
10452 1828174 1895013 1967510 2044787 2128500 2216471 2316694 2415417 2506024 2600153 2709430 2819195
10441 2819195 2911301 3018628 3149482 3325438 3512739 3686694 3863365 4063282 4289057 4542540
10431 4542540 4841100 5164067 5524107 5932936 6399193 6904331 7417335 7948861 8548590
10422 8548590 9283523 10205184 11336035 12681525 14198918 15783514 17326608 18845731
10414 18845731 20510672 22596282 25310373 28818373 33397083 39507049 47840075 59553986
10406 59553986 76290700 100275211 134137720 179366971 232697126 282375727 309341652
10399 309341652 297702047 251560791 194236233 145158835 109356177 84454344 67048993
10392 67048993 54576823 45335244 38300595 32905181 28776598 25641164 23308908 21589059
$$ packed form
10452A828174O6839P2497P7277Q3713Q7971J00223R8723R0607R4129J09277J09765
10441B819195R2106J07327J30854J75956J87301J73955J76671J99917K25775K53483
10431D542540K98560L22967L60040M08829M66257N05138N13004N31526N99729
10422H548590P34933R21661J130851J345490J517393J584596J543094J519123
10414A8845731J664941K085610K714091L508000M578710O109966Q333026J1713911
10406E9553986J6736714K3984511L3862509M5229251N3330155M9678601K6965925
10399C09341652j1639605m6141256n7324558m9077398l5802658k4901833j7405351
10392F7048993j2472170r241579p034649n395414m128583l135434k332256j719849
$$ plain form
10384 21589059 20259108 19011046 17646783 16106863 14540363 13121805 11936078 10953845
10376 10953845 10107135 9397755 8808422 8331332 7931375 7592007 7306908 7069254 6874669
10367 6874669 6717353 6561271 6324040 6020171 5681530 5331529 5009347 4711303 4440877
10358 4440877 4207320 4011554 3844330 3705286 3577751 3466760 3368187 3268027 3167667 3048039
10348 3048039 2944695 2854285 2782686 2709514 2627369 2534704 2432872 2347131 2274952 2182488 2103104
10337 2103104 2032274 1975229 1910896 1836557 1776514 1719839 1664396 1628987 1597478 1568211 1537624
10326 1537624 1504975 1480349 1448621 1420520 1407756 1401749 1389906 1363166 1320669 1267750 1231022
10315 1231022 1206529 1188795 1175331 1152907 1129697 1100472 1086323 1075795 1073356 1063871 1035461 1012375
$$ packed form
10384B1589059j329951j248062j364263j539920j566500j418558j185727r82233
10376A0953845q46710p09380n89333m77090l99957l39368k85099k37654j94585
10367F874669j57316j56082k37231l03869l38641l50001l22182k98044k70426
10358D440877k33557j95766j67224j39044j27535j10991r8573j00160j00360j19628
10348C048039j03344r0410p1599p3172q2145r2665j01832q5741p2179r2464p9384
10337B103104p0830n7045o4333p4339o0043n6675n5443l5409l1509k9267l0587
10326A537624l2649k4626l1728k8101j2764o007j1843k6740m2497n2919l6728
10315A231022k4493j7734j3464k2424k3210k9225j4149j0528k439r485k8410k3086
$$ plain form
10303 1012375 1003260 1005514 1013072 1006185 996376 964927 928892 907069 887420 862944 838936 823316
10291 823316 805793 792921 787962 781774 788121 792475 786206 781008 788905 791346 781993 798088 812042
10278 812042 822121 837539 858425 892394 927017 966481 989767 998796 1003088 1049725 1142506 1261273
10266 1261273 1390131 1535377 1702664 1911191 2217077 2614006 3111127 3576302 3772192
10257 3772192 3541727 2995494 2393307 1889649 1536389 1295131 1134163 1016677 906265
10248 906265 820439 748597 680021 625155 580262 565772 542017 511635 497819 479817 462371
10237 462371 443185 438835 436485 434961 411715 403481 397222 394963 389865 393351 384521 371024 370916 363314
10223 363314 363537 350683 341778 340864 333773 313904 305487 292168 268622 269620 267921 278338 287648 295956
$$ packed form
10303A012375r115K254P558o887r809l1449l6035k1823j9649k4476k4008j5620
10291H23316j7523j2872m959o188O347M354o269n198P897K441r353J6095J3954
10278H12042J0079J5418K0886L3969L4623L9464K3286R029M292M6637R2781J18767
10266A261273J28858J45246J67287K08527L05886L96929M97121M65175J95890
10257C772192k30465n46233o02187n03658l53260k41258j60968j17486j10412
10248I06265q5826p1842o8576n4866m4893j4490k3755l0382j3816j8002j7446
10237D62371j9186m350k350j524k3246q234o259k259n098L486q830j3497j08p602
10223C63314K23j2854q905r14p091j9869q417j3319k3546R98j699J0417R310Q308
$$ plain form
10209 295956 293445 287530 261519 246326 263682 273934 257388 239532 232673 233904 233238 219872 220609
10196 220609 237134 245074 255554 265104 281993 302328 323370 328025 315904 313320 326678 348327
10184 348327 365987 364694 357022 361934 347010 327850 317368 319183 320016 307558 297318 290028 289023
10171 289023 291722 304925 311898 329058 336195 321642 309646 313768 325479 340274 343600 327280
10159 327280 316290 326298 344143 352748 354869 380243 390350 406726 416017 414130 424846 428180
10147 428180 434117 452913 476434 487789 485968 463692 430477 400024 383764 365803 353761 357208
10135 357208 354615 341334 327454 325162 345037 356426 362657 369236 375006 373253 376170 379304 388645
10122 388645 416877 427488 445564 466583 497910 529212 563172 605807 687335 775733 866293
$$ packed form
10209B95956k511n915k6011j5193J7356J0252j6546j7856o859J231o66j3366P37
10196B20609J6525P940J0480R550J6889K0335K1042M655j2121k584J3358K1649
10184C48327J7660j293p672M912j4924j9160j0482J815Q33j2458j0240p290j005
10171B89023K699J3203O973J7160P137j4553j1996M122J1711J4795L326j6320
10159C27280j0990J0008J7845Q605K121K5374J0107J6376R291j887J0716L334
10147D28180N937J8796K3521J1355j821k2276l3215l0453j6260j7961j2042L447
10135C57208k593j3281j3880k292J9875J1389O231O579N770j753K917L134R341
10122C88645K8232J0611J8076K1019L1327L1302L3960M2635Q1528Q8398R0560
$$ plain form
10111 866293 1010431 1206167 1435118 1655830 1793115 1797679 1696733 1577033 1541041 1598272
10101 1598272 1683615 1721255 1639432 1424571 1173035 950830 804540 698672 637373 589336
10091 589336 557254 529880 502855 463706 449499 439905 416073 419815 435034 438343 435418 425808
10079 425808 437934 447182 435526 422216 422408 419750 413078 414796 425468 439042 436075 424373 418080
10066 418080 422468 416024 407850 384584 368008 358721 360537 355987 352064 359579 382348 393816 408647
10053 408647 418789 425707 444388 448268 457597 466244 487887 502536 516875 529683 530261 536722 553747
10040 553747 586179 629098 680326 740831 825149 958078 1154776 1497371 2011349 2701674
10030 2701674 3444872 3876289 3569784 2715227 1950387 1500395 1218083 1057332 958627 894361
$$ packed form
10111H66293J44138J95736K28951K20712J37285M564j00946j19700l5992N7231
10101A598272Q5343L7640q1823k14861k51536k22205j46290j05868o1299m8037
10091E89336l2082k7374k7025l9149j4207r594k3832L742J5219L309k925r610
10079D25808J2126R248j1656j3310J92k658o672J718J0672J3574k967j1702o293
10066D18080M388o444q174k3266j6576r287J816m550l923P515K2769J1468J4831
10053D08647J0142O918J8681L880R329Q647K1643J4649J4339J2808N78O461J7025
10040E53747L2432M2919N1228O0505Q4318J32929J96698L42595N13978O90325
10030B701674P43198M31417l06505q54557p64840m49992k82312j60751r8705o4266
$$ plain form
10020 894361 853502 827699 826970 831399 833964 839202 846397 849073 849872 849773 860359 870962 881757 883387
10006 883387 893540 917966 944499 972656 1011625 1041903 1082892 1120575 1159080 1191756 1227516
9995 1227516 1261205 1306676 1358006 1417256 1480274 1526150 1580705 1643721 1716548 1800620 1888130
9984 1888130 1989928 2092635 2208860 2367484 2574836 2819390 3115480 3432813 3702810 3831244
9974 3831244 3792754 3624152 3423905 3252957 3101772 2989216 2898678 2804021 2723631 2662997
9964 2662997 2590080 2504266 2448519 2389620 2308836 2240924 2180430 2119518 2058479 1977013 1913717
9953 1913717 1846431 1793009 1736013 1698163 1652343 1614572 1572297 1537775 1508201 1479713 1452990
9942 1452990 1411879 1365043 1332019 1320213 1297443 1255678 1200314 1162516 1134476 1120037 1107143
$$ packed form
10020H94361m0859k5803p29M429K565N238P195K676P99r9J0586J0603J0795J630
10006H83387J0153K4426K6533K8157L8969L0278M0989L7683L8505L2676L5760
9995A227516L3689M5471N1330N9250O3018M5876N4555O3016P2827Q4072Q7510
9984A888130J01798J02707J16225J58624K07352K44554K96090L17333K69997J28434
9974C831244l8490j68602k00247j70948j51185j12556r0538r4657q0390o0634
9964B662997p2917q5814n5747n8899q0784o7912o0494o0912o1039q1466o3296
9953A913717o7286n3422n6996l7850m5820l7771m2275l4522k9574k8488k6723
9942A452990m1111m6836l3024j1806k2770m1765n5364l7798k8040j4439j2894
$$ plain form
9931 1107143 1105845 1101842 1107529 1089922 1062392 1034134 1009793 991573 957736 919262 894868 863970
9919 863970 816377 783454 754397 737519 721767 695572 680646 660849 636089 623774 609553 590985
9907 590985 578315 573969 557516 546406 546455 536188 521955 516670 525924 525089 528132 526544 524289 535097
9893 535097 561880 565379 545695 529274 518123 498029 477376 479302 470686 465853 479988 485766 496810
9880 496810 518614 536416 545148 539370 526749 518214 532158 545253 552418 566340 572763 564428 564276
9867 564276 574610 575793 580077 583239 610950 633541 633904 644922 655530 657826 663623 674997 676221
9854 676221 664862 647708 636718 624027 598115 588823 576738 570790 577454 580767 590338 596108 587051
9841 587051 580568 580059 593164 615496 613754 610593 599550 596818 589143 574353 581286 589476 606248
$$ packed form
9931A107143j298m003N687j7607k7530k8258k4341j8220l3837l8474k4394l0898
9919H63970m7593l2923k9057j6878j5752k6195j4926j9797k4760j2315j4221j8568
9907E90985j2670m346j6453j1110M9j0267j4233n285R254q35L043j588k255J0808
9893E35097K6783L499j9684j6421j1151k0094k0653J926q616m833J4135N778J1044
9880D96810K1804J7802Q732n778j2621q535J3944J3095P165J3922O423q335j52
9867E64276J0334J183M284L162K7711K2591L63J1018J0608K296N797J1374J224
9854F76221j1359j7154j0990j2691k5912r292j2085n948O664L313R571N770r057
9841E87051o483n09J3105K2332j742l161j1043k732p675j4790O933Q190J6772
$$ plain form
9828 606248 619679 618431 615814 621465 627410 635571 653104 677901 704406 724181 738854 767199 800641
9815 800641 825725 859277 871689 895963 949242 1001342 1063474 1134827 1200989 1278573 1363462 1452458
9803 1452458 1557208 1683282 1834912 2008621 2208766 2431398 2688287 3002608 3410248 3971030
9793 3971030 4742498 5761019 7065598 8650474 10397774 11982042 12977907 13045442 12226749
9784 12226749 10914822 9592417 8533715 7780282 7244881 6844559 6536277 6351975 6302963
9775 6302963 6364987 6439107 6418811 6276748 6081413 5972434 6039641 6310123 6833909 7638962
9765 7638962 8742915 10133453 11692616 13181305 14280820 14817184 14865970 14800828 15074263
9756 15074263 15972888 17550862 19701359 22171208 24518491 26201037 26759803 26040652 24326918
$$ packed form
9828F06248J3431j248k617N651N945Q161J7533K4797K6505J9775J4673K8345L3442
9815H00641K5084L3552J2412K4274N3279N2100O2132P1353O6162P7584Q4889Q8996
9803A452458J04750J26074J51630J73709K00145K22632K56889L14321M07640N60782
9793C971030P71468J018521J304579J584876J747300J584268R95865O7535q18693
9784A2226749j311927j322405j058702p53433n35401m00322l08282j84302m9012
9775F302963O2024P4120k0296j42063j95335j08979O7207K70482N23786Q05053
9765G638962J103953J390538J559163J488689J099515N36364M8786o5142K73435
9756A5074263Q98625J577974K150497K469849K347283J682546N58766p19151j713734
$$ plain form
9747 24326918 22312775 20642263 19625778 19203143 19069904 18820857 18154310 17017005 15691494
9738 15691494 14554883 13799268 13506896 13579286 13923647 14481225 15198611 15936176 16438077
9729 16438077 16557762 16392551 16157513 16031593 16155166 16650570 17632235 19213981 21508636
9720 21508636 24591333 28329665 32283044 35808773 38227227 39130672 38491666 36511733
9712 36511733 33485045 29922134 26395170 23320795 20887472 19119749 17936776 17264792
9704 17264792 16980111 16932253 16872068 16580725 15894451 14932319 14015468 13403121 13134437 13146895
9694 13146895 13407079 13971584 14821836 15850237 16773291 17286920 17328190 17130965 17058490 17400823
9684 17400823 18275677 19597703 21107326 22367961 23006575 22902408 22211535 21088422 19685806
$$ packed form
9747B4326918k014143j670512j016485m22635j33239k49047o66547j137305j325511
9738A5691494j136611p55615k92372P2390L44361N57578P17386P37565N01901
9729A6438077J19685j65211k35038j25920J23573M95404R81665J581746K294655
9720B1508636L082697L738332L953379L525729K418454R03445o39006j979933
9712C6511733l026688l562911l526964l074375k433323j767723j182973o71984
9704A7264792k84681m7858o0185k91343o86274r62132r16851o12347k68684J2458
9694A3146895K60184N64505Q50252J028401R23054N13629M1270j97225p2475L42333
9684A7400823Q74854J322026J509623J260635O38614j04167o90873j123113j402616
$$ plain form
9675 19685806 18198967 16886337 15962948 15499207 15290779 14967772 14204142 12917373 11323489
9666 11323489 9780644 8502492 7535616 6844673 6364763 6085427 5992357 6028203 6139742
9657 6139742 6252732 6302590 6248766 6180390 6185113 6284855 6480466 6746542 7128940 7704313 8501881
9646 8501881 9502057 10538192 11287105 11402617 10719411 9414350 7887822 6493560 5381520
9637 5381520 4530156 3903999 3427366 3069424 2782026 2541369 2347117 2182573 2025484 1878834
9627 1878834 1749142 1641732 1554619 1470914 1400125 1324957 1259991 1210371 1142888 1088573 1061384
9616 1061384 1012019 963764 934487 907249 881816 871757 844220 818350 785562 769181 763978 756466
9604 756466 739668 738452 730448 723695 723792 716688 704389 694235 699257 693647 685545 695505 705051 722899
$$ packed form
9675A9685806j486839j312630r23389m63741k08428l23007p63630j286769j593884
9666A1323489j542845j278152r66876o90943m79910k79336r3070L5846J11539
9657F139742J12990M9858n3824o8376M723R9742J95611K66076L82398N75373P97568
9646H501881J000176J036135P48913J15512o83206j305061j526528j394262j112040
9637E381520q51364o26157m76633l57942k87398k40657j94252j64544j57089j46650
9627A878834j29692j07410q7113q3705p0789p5168o4966m9620o7483n4315k7189
9616A061384m9365m8255k9277k7238k5433j0059k7537k5870l2788j6381n203p512
9604G56466j6798j216q004o753R7p104j2299j0154N022n610q102R960R546J7848
$$ plain form
9590 722899 723619 708493 694246 692691 696157 683894 658143 643990 628858 608118 584016 581436 590878
9577 590878 581479 563617 565642 581690 589229 588312 587736 591106 586660 567764 548831 529553 531448 517086
9563 517086 494803 475649 472510 471738 449839 419659 403308 372991 349373 346331 342587 342145 347342
9550 347342 351608 356261 355690 342466 311678 302229 295049 295825 325020 353072 354782 337917 345256 341993
9536 341993 327514 335721 334271 320181 301898 285598 279455 288213 294352 284660 285118 300579 291212
9523 291212 304009 309552 311236 317868 319111 304364 285663 280696 263752 264580 277924 278874 272255 267627
9509 267627 261393 254213 250246 264162 289317 298393 305047 306376 287445 279414 289617 302249 298595
9496 298595 269129 243961 223403 198675 197077 199575 200296 180256 169230 164652 161050 170830 170438
$$ packed form
9590G22899P20j5126j4247j555L466j2263k5751j4153j5132k0740k4102k580R442
9577E90878r399j7862K025J6048P539r17n76L370m446j8896j8933j9278J895j4362
9563E17086k2283j9154l139p72k1899l0180j6351l0317k3618l042l744m42N197
9550C47342M266M653n71j3224l0788r449p180P76K9195K8052J710j6865P339l263
9536C41993j4479Q207j450j4090j8283j6300o143Q758O139r692M58J5461r367
9523B91212J2797N543J684O632J243j4747j8701m967j6944Q28J3344R50o619m628
9509B67627o234p180l967J3916K5155R076O654J329j8931q031J0203J2632l654
9496B98595k9466k5168k0558k4728j598K498P21k0040j1026m578l602R780l92
$$ plain form
9483 170438 176680 180401 173026 172286 169740 174465 170319 145293 140917 142161 147684 140133 136374 122463
9469 122463 120270 126689 128966 144030 157611 154126 148862 127658 111048 111908 122730 126753 126569 142110
9455 142110 135910 126984 122265 120836 126080 131641 134419 152122 153499 142777 138432 136573 145883 152027
9441 152027 158427 163507 171866 171778 165978 167072 173764 191884 189434 182882 202818 209680 217621 214314
9427 214314 205594 212538 215430 225866 238493 250151 261369 254963 246774 250401 261667 271619 288193
9414 288193 303973 293004 280227 292801 299896 313405 332006 339589 348079 345107 357181 353286 357672
9401 357672 358959 353924 346617 338931 343242 352565 358235 361500 364786 357191 352376 373134 383441 389320
9387 389320 396537 408974 393209 379800 370033 354392 358614 370399 368666 356894 347618 331363 323142
$$ packed form
9483A70438O242L721p375p40k546M725m146k5026m376J244N523p551l759j3911
9469A22463k193O419K277J5064J3581l485n264k1204j6610Q60J0822M023j84J5541
9455A42110o200q926m719j429N244N561K778J7703J377j0722m345j859R310O144
9441A52027O400N080Q359q8n800J094O692J8120k450o552J9936O862P941l307
9427B14314q720O944K892J0436J2627J1658J1218o406q189L627J1266R952J6574
9414B88193J5780j0969j2777J2574P095J3509J8601P583Q490k972J2074l895M386
9401C57672J287n035p307p686M311R323N670L265L286p595m815K0758J0307N879
9387C89320P217J2437j5765j3409r767j5641M222J1785j733j1772r276j6255q221
$$ plain form
9374 323142 316708 289729 265511 262220 263917 255530 254185 243601 244626 255766 261372 260938 252422 239359
9360 239359 251464 271259 272545 280403 282656 286707 281197 274963 269435 279710 294436 305392 300643
9347 300643 289823 266021 267157 271067 262813 265754 269821 264796 251036 232466 233367 237007 224839
9334 224839 232798 238119 243271 271546 278999 278336 282885 288718 287882 285414 288438 291437 292186 283485 278848
9319 278848 291700 323272 336352 364973 388101 391480 375182 355364 333228 318923 301815 290279
9307 290279 288338 282965 274385 273835 275208 258437 242577 250346 253147 240286 217745 200724 193930
9294 193930 194099 197091 212626 211679 200679 193252 191897 197876 197359 201836 206781 199478 199488 203986 211313
9279 211313 211751 204030 201954 197650 189938 172094 151215 149688 161228 159552 143486 141484 140231 130844
$$ packed form
9374C23142o434k6979k4218l291J697q387j345j0584J025J1140N606m34q516j3063
9360B39359J2105J9795J286P858K253M051n510o234n528J0275J4726J0956m749
9347C00643j0820k3802J136L910q254K941M067n025j3760j8570R01L640j2168
9334B24839P959N321N152K8275P453o63M549N833q36k468L024K999P49q701m637
9319B78848J2852L1572J3080K8621K3128L379j6298j9818k2136j4305j7108j1536
9307B90279j941n373q580n50J373j6771j5860P769K801j2861k2541j7021o794
9294A93930J69K992J5535r47j1000p427j355N979n17M477M945p303J0M498P327
9279B11313M38p721k076m304p712j7844k0879j527J1540j676j6066k002j253r387
$$ plain form
9265 130844 116518 102025 80799 77463 70377 62926 53027 65000 74485 77380 79882 62739 57595
9252 57595 57002 55869 64557 67200 75150 82653 92391 100391 105855 114795 104335 89515 91508 91238 91317
9237 91317 83941 73391 59385 47548 58217 55636 46780 42441 39346 47618 62601 70777 60985
9224 60985 54756 63586 72026 63661 59277 45029 36848 48371 56695 61517 62996 63871 58897 48797
9210 48797 37919 41108 38929 46055 38584 22206 25432 41823 39436 49243 42316 38232 33127 31235
9196 31235 28184 23430 27433 18993 13459 28013 49252 65033 65794 54786 47606 49876 48190 42557
9182 42557 47787 47850 41471 44635 42255 33259 29104 39894 50547 55340 46210 38584 49060 50558
9168 50558 49225 45884 42480 35189 41071 54067 47028 43372 46164 40246 31725 20217 12913 10491
$$ packed form
9265A30844j4326j4493k1226l336p086p451r899J1973R485K895K502j7143n144
9252E7595n93j133Q688K643P950P503R738Q000N464Q940j0460j4820J993k70P9
9237I1317p376j0550j4006j1837J0669k581q856m339l095Q272J4983Q176r792
9224F0985o229Q830Q440q365m384j4248q181J1523Q324M822J479Q75m974j0100
9210D8797j0878L189k179P126p471j6378L226J6391k387R807o927m084n105j892
9196C1235l051m754M003q440n534J4554K1239J5781P61j1008p180K270j686n633
9182D2557N230O3o379L164k380q996m155J0790J0653M793r130p626J0476J498
9168E0558j333l341l404p291N882J2996p039l656K792n918q521j1508p304k422
$$ plain form
9154 10491 17283 21361 24893 19226 12316 14096 32180 45030 43641 23420 9184 1616 -4012 3112
9140 3112 10574 28763 26729 17841 12233 23422 32148 35830 39534 42359 39468 50704 58287 47769
9126 47769 26962 22972 41792 31040 29058 32828 32968 36473 42865 35689 31317 29862 35177 38141
9112 38141 47579 40495 29207 24148 17242 5354 12096 4681 1375 1682 8544 24006 23923 17385 22307
9097 22307 20354 21345 15553 20248 34777 40540 29297 32471 36718 26283 17117 27946 32357 11709
9083 11709 -345 9345 14009 7178 2670 16109 21704 14548 25656 20400 17368 28068 29320 23466
9069 23466 26440 24509 18715 16829 15219 23575 19820 7499 18416 17143 19186 23829 25906 29316
9055 29316 24358 33621 26540 10759 17170 11536 10719 10900 18847 25280 19653 18698 23578 23532 31078 34199
$$ packed form
9154A0491O792M078L532n667o910J780J8084J2850j389k0221j4236p568n628P124
9140C112P462J8189k034q888n608J1189Q726L682L704K825k891J1236P583j0518
9126D7769k0807l990J8820j0752j982L770J40L505O392p176m372j455N315K964
9112C8141R438p084j1288n059o906j1888O742p415l306L07O862J5462q3o538M922
9097B2307j953R91n792M695J4529N763j1243L174M247j0435r166J0829M411k0648
9083A1709j2054R690M664o831m508J3439N595p156J1108n256l032J0700J252n854
9069B3466K974j931n794j886j610Q356l755j2321J0917j273K043M643K077L410
9055B9316m958R263p081j5781O411n634q17J81P947O433n627r55M880m6P546L121
$$ plain form
9039 34199 42106 46466 42780 35261 11102 1080 12999 26261 30164 19550 16432 10949 4739
9026 4739 3749 18108 29852 43196 38699 18173 18794 32045 23685 3650 9652 20574 24471 32393
9012 32393 36852 34033 29412 29600 35111 35039 38733 33680 28751 32680 42314 38828 37606 43486 42386
8997 42386 30936 24975 28044 22709 17704 25437 27311 19403 16223 7437 17702 28296 27734 33785
8983 33785 33331 40069 34707 30430 32259 20104 14127 12838 3381 6461 1984 4351 7108 600 6640
8968 6640 11621 19579 17482 18924 25365 43346 31251 34140 32512 34768 19940 27074 39873 39181
8954 39181 43701 36739 35466 42454 33063 33168 25321 18838 19330 27869 32847 24422 26289 33712 33030
8939 33030 31397 32623 43133 46302 40447 36416 45641 47580 44221 29119 33551 25363 10451 13354
$$ packed form
9039C4199P907M360l686p519k4159j0022J1919J3262L903j0614l118n483o210
9026D739r90J4359J1744J3344m497k0526O21J3251q360k0035O002J0922L897P922
9012C2393M459k819m621J88N511p2L694n053m929L929R634l486j222N880j100
8997D2386j1450n961L069n335n005P733J874p908l180q786J0265J0594n62O051
8983C3785m54O738n362m277J829j2155n977j289r457L080m477K367K757o508O040
8968F640M981P958k097J442O441J7981j2095K889j628K256j4828P134J2799o92
8954C9181M520o962j273O988r391J05p847o483M92Q539M978q425J867P423o82
8939C3030j633J226J0510L169n855m031R225J939l359j5102M432q188j4912K903
$$ plain form
8925 13354 8732 14500 28826 24028 16645 25738 37674 42183 43113 43699 46485 48062 59354 58100
8911 58100 68954 64190 55888 54565 53266 50630 46191 29789 13473 15928 24368 630 -9144 2099
8897 2099 19681 20597 11150 7324 8839 447 8613 26024 25663 26276 37975 30433 27461 31211 36924
8882 36924 42788 43443 47714 44785 45730 31064 42701 43886 53699 53647 43393 51687 76475 85860 101646
8867 101646 120923 132301 150432 153102 142689 134389 123589 111451 81125 61680 57397 53666
8855 53666 52313 47162 40725 37498 32596 34913 29969 31966 40337 46220 39122 32435 38653 36851 22537
8840 22537 19639 27470 33325 36709 49567 54022 68147 82270 94625 109318 114926 115046 112377 118195
8826 118195 113969 114325 123772 135718 152217 181670 201962 216291 226943 240854 245992 243251 232795
$$ packed form
8925A3354m622N768J4326m798p383R093J1936M509R30N86K786J577J1292j254
8911E8100J0854m764q302j323j299k636m439j6402j6316K455Q440k3738r774J1243
8897B099J7582R16r447l826J515q392Q166J7411l61O13J1699p542k972L750N713
8882C6924N864O55M271k929R45j4666J1637J185R813n2j0254Q294K4788R385J5786
8867A01646J9277J1378J8131K670j0413q300j0800j2138l0326j9445m283l731
8855E3666j353n151o437l227m902K317m944J997Q371N883p098o687O218j802j4314
8840B2537k898P831N855L384J2858M455J4125J4123J2355J4693N608J20k669N818
8826A18195m226L56R447J1946J6499K9453K0292J4329J0652J3911N138k741j0456
$$ plain form
8813 232795 218358 194427 170517 155779 133676 107031 93420 86881 81524 78517 73828 74437 68271
8800 68271 53407 60502 60131 47185 37602 34903 46654 55363 47614 45750 61189 76567 85014 88024
8786 88024 98799 114598 131191 133190 127311 129097 125800 114364 117417 136926 154013 166208 179945
8773 179945 198228 207001 221620 233837 239223 247392 249901 238964 220343 195361 166379 137127
8761 137127 108688 96317 94327 78607 77365 82970 63166 58602 71694 70926 58086 55514 53417
8748 53417 64335 71501 66733 40780 31952 40616 45508 46005 35310 45237 61037 78288 86520 90564
8734 90564 92266 93253 106125 113078 111221 108464 115022 125118 120045 121199 129755 138887 156620 165185
8720 165185 174225 166783 148646 127652 116946 100114 89323 86886 69213 49967 49675 58539 57410
$$ packed form
8813B32795j4437k3931k3910j4738k2103k6645j3611o539n357l007m689O09o166
8800F8271j4864P095l71j2946r583k699J1751Q709p749j864J5439J5378Q447L010
8786H8024J0775J5799J6593J999n879J786l297j1436L053J9509J7087J2195J3737
8773A79945J8283Q773J4619J2217N386Q169K509j0937j8621k4982k8982k9252
8761A37127k8439j2371j990j5720j242N605j9804m564J3092p68j2840k572k097
8748E3417J0918P166m768k5953q828Q664M892M97j0695R927J5800J7251Q232M044
8734I0564J702R87J2872O953j857k757O558J0096n073J154Q556R132J7733Q565
8720A65185R040p442j8137k0994j0706j6832j0791k437j7673j9246k92Q864j129
$$ plain form
8707 57410 57667 57941 51545 58325 46134 36626 32558 46686 51537 45130 35745 34695 47713 55880
8693 55880 64758 53238 35993 32880 43992 40144 41949 52837 55998 56100 59332 63873 72949 73189
8679 73189 56377 43726 49024 48971 54097 51584 42836 44478 41839 40185 29380 21044 24364 16008
8665 16008 10245 15723 15339 13791 12112 17193 16840 24694 38524 41537 32533 22575 23907 24547 23346
8650 23346 44031 55678 63297 63325 61137 49082 35878 37724 36587 54298 76230 96321 94476
8637 94476 71656 85944 113387 133616 138765 125637 107968 92885 81943 74728 73084 69640 60614
8624 60614 51721 45203 36426 33507 32441 33133 28350 33157 52253 53059 53542 53079 44324 41446 31008
8609 31008 26729 29052 47216 55808 40226 27499 14732 2589 8737 18381 7604 11180 28285
$$ packed form
8707E7410K57K74o396O780j2191r508m068J4128M851o407r385j050J3018Q167
8693E5880Q878j1520j7245l113J1112l848J805J0888L161J02L232M541R076K40
8679G3189j6812j2651N298n3N126k513q748J642k639j654j0805q336L320q356
8665A6008n763N478l84j548j679N081l53P854J3830L013r004r958J332O40j201
8650B3346K0685J1647P619K8k188j2055j3204J846j137J7711K1932K0091j845
8637I4476k2820J4288K7443K0229N149j3128j7669j5083j0942p215j644l444r026
8624F0614q893o518q777k919j066O92m783M807J9096Q06M83m63q755k878j0438
8609C1008m279K323J8164Q592j5582j2727j2767j2143O148R644j0777L576J7105
$$ plain form
8596 28285 39109 37439 42644 42448 46809 38679 33962 46527 53996 65759 54959 64950 85994 86346
8582 86346 81011 83160 84849 93992 108989 108159 106340 123134 124768 116385 118509 119873 107427 99699
8568 99699 86105 81326 86873 78529 66366 81940 78593 57111 47211 43228 40874 49570 45914 45095
8554 45095 33026 22047 15812 23603 47871 37862 21146 12592 6861 19580 34449 35004 32545
8541 32545 31897 29633 19824 24829 33462 32668 29386 26332 17419 2473 -5332 -9824 4170 15020
8527 15020 14977 18358 30487 47190 46288 27985 21340 26564 21001 10548 32145 53858 31988 34662
8513 34662 40446 31089 35651 37857 39613 33956 25053 33090 36257 47608 41441 28398 15339 13803
8499 13803 29960 46639 49092 46030 55837 49034 45084 50844 48538 41301 34151 25643 16138 9327
$$ packed form
8596B8285J0824j670N205j96M361q130m717J2565P469J1763j0800R991K1044L52
8582H6346n335K149J689R143J4997q30j819J6794J634q383K124J364j2446p728
8568I9699j3594m779N547q344j2163J5574l347k1482r900l983k354Q696l656q19
8554D5095j2069j0979o235P791K4268j0009j6716q554n731J2719J4869N55k459
8541C2545o48k264r809N005Q633p94l282l054q913j4946p805m492J3994J0850
8527A5020m3L381J2129J6703r02j8303o645N224n563j0453K1597K1713k1870K674
8513C4662N784r357M562K206J756n657q903Q037L167J1351o167j3043j3059j536
8499A3803J6157J6679K453l062R807o803l950N760k306p237p150q508r505o811
$$ plain form
8485 9327 20134 37513 30269 14559 14472 26091 40801 49492 46840 12787 -7111 -4728 -1333 5533
8471 5533 7440 13943 18232 29158 30438 34806 31179 33275 26051 19076 8229 1346 3479 6148
8457 6148 15808 15281 16285 14012 15810 19243 2670 -3464 1848 13422 22015 34143 28371 27378 27307
8442 27307 16485 11099 37382 38724 30103 38449 50569 40417 37277 20869 8659 23771 32057
8429 32057 22439 17361 26273 37100 43155 43137 27487 22854 37773 36935 20715 13663 12667 12395 -511
8414 -511 1399 6445 25920 41300 40651 37737 28234 29026 33261 32368 23851 22848 17890 20772 20256 27312
8398 27312 27380 18834 19037 21252 19931 22067 13012 5531 14779 32967 33933 22541 21732 27142 28067 28532
8382 28532 39248 31025 18293 18314 24894 21861 29619 23345 21645 25990 21687 16486 15187 19834 18808
$$ packed form
8485I327J0807J7379p244j5710q7J1619J4710Q691k652l4053j9898K383L395O866
8471E533J907O503M289J0926J280M368l627K096p224o975j0847o883K133K669
8457F148R660n27J004k273J798L433j6573o134N312J1574Q593J2128n772r93p1
8442B7307j0822n386K6283J342q621Q346J2120j0152l140j6408j2210J5112Q286
8429C2057r618n078Q912J0827O055j8j5650m633J4919q38j6220p052r96k72j2906
8414e11J910N046J9475J5380o49k914r503P92M235q93q517j003m958K882n16P056
8398B7312O8q546K03K215j321K136r055p481R248J8188R66j1392q09N410R25M65
8382B8532J0716q223j2732K1O580l033P758o274j700M345m303n201j299M647j026
$$ plain form
8367 18808 16130 24416 23462 35757 28094 19459 21831 26317 31835 39979 36905 46505 54405 62322 66261
8352 66261 74922 89806 106124 111109 105171 90913 104849 83948 74776 68432 69111 75143 58566
8339 58566 43568 45691 40368 24819 18007 19533 21126 30466 31625 28748 29605 36611 46747 46208
8325 46208 38296 46085 45524 34677 37506 45508 56013 61160 53843 37835 26402 38275 45830 40406
8311 40406 42665 39226 32848 30948 33848 44927 48909 38065 31183 27146 25326 28497 28658 29790
8297 29790 32540 33605 20864 17760 19430 19834 23050 39932 26674 12875 17108 19148 9345 7135
8283 7135 8550 20970 24267 29210 31110 25521 16275 11142 17524 25133 20412 25347 12950 -1175
8269 -1175 -8779 -5840 -11721 -11935 -1996 -4345 720 7805 10476 23891 24849 19501 18268 10102 10102 -2758
$$ packed form
8367A8808k678Q286r54J2295p663q635K372M486N518Q144l074R600P900P917L939
8352F6261Q661J4884J6318M985n938j4258J3936k0901r172o344O79O032j6577
8339E8566j4998K123n323j5549o812J526J593R340J159k877Q57P006J0136n39
8325D6208p912P789n61j0847K829Q002J0505N147p317j6008j1433J1873P555n424
8311D0406K259l439o378j900K900J1079L982j0844o882m037j820L171J61J132
8297B9790K750J065j2741l104J670M04L216J6882j3258j3799M233K040r803k210
8283G135J415J2420L297M943J900n589r246n133O382P609m721M935j2397j4125
8269a175p604K939n881k14R939k349N065P085K671J3415R58n348j233q166%j2860
$$ plain form
8253 -2758 10841 9890 473 8599 23551 33434 20931 20181 24100 21800 29262 38286 34783 24113
8239 24113 16688 27237 19632 12608 13042 14217 -1759 -5858 9122 11654 21144 48756 74176 93438
8225 93438 124011 132983 139357 138762 110178 73387 52359 41615 36344 29209 14021 12452 4869
8212 4869 8787 13005 13491 13410 9185 11497 17737 16445 20521 18748 16618 19021 19976 36379 53161
8197 53161 43657 42494 38464 32600 31567 31333 32265 32233 25866 7964 7233 13750 24895 27033 33386
8182 33386 20885 21494 29119 37732 34239 41420 45164 39914 32400 27291 31798 19083 10983 23976
8168 23976 28837 22151 3764 -3463 -6791 -4338 9582 20138 12652 9468 16840 20934 30788 31951
8154 31951 36191 45520 41721 39433 43116 44397 42116 43531 27313 11837 1750 4746 7230 7558
$$ packed form
8253b758J3599r51r417Q126J4952R883j2503p50L919k300P462R024l503j0670
8239B4113p425J0549p605p024M34J175j5976m099J4980K532R490K7612K5420J9262
8225I3438L0573Q972O374n95k8584l6791k1028j0744n271p135j5188j569p583
8212D869L918M218M86q1m225K312O240j292M076j773k130K403R55J6403J6782
8197E3161r504j163m030n864j033k34R32l2o367j7902p31O517J1145K138O353
8182C3386j2501O09P625Q613l493P181L744n250p514n109M507j2715q100J2993
8168B3976M861o686j8387p227l328K453J3920J0556p486l184P372M094R854J163
8154C1951M240R329l799k288L683J281k281J415j6218j5476j0087K996K484L28
$$ plain form
8140 7558 8739 24893 33931 26826 29593 38059 35257 41961 33356 28444 27689 26951 26767 22899 28272
8125 28272 34387 23041 18730 21524 25096 34667 41179 33520 23554 32421 35006 31086 48951 64019
8111 64019 59977 51626 56454 51435 57895 54852 50346 40877 37990 29339 7044 11842 15597 14613 15416
8096 15416 21062 16669 16498 14004 18324 4559 5256 14091 17576 11968 17459 7855 -937 15282 20453
8081 20453 25432 28072 31084 23215 14983 9179 7706 5445 6570 807 12869 16572 20454 12913
8067 12913 22472 29626 18221 2974 15275 18480 43598 50875 47405 58446 78670 69871 67949
8054 67949 71805 56362 51155 57834 58033 53233 66999 72384 57561 51837 37973 24981 28508 24580
8040 24580 34668 27820 14922 24105 19910 19377 35172 38948 29471 27943 28010 22331 29511 36896 41731
$$ packed form
8140G558J181J6154R038p105K767Q466k802O704q605m912p55p38j84l868N373
8125B8272O115j1346m311K794L572R571O512p659r966Q867K585l920J7865J5068
8111F4019m042q351M828n019O460l043m506r469k887q651k2295M798L755r84Q03
8096A5416N646m393j71k494M320j3765O97Q835L485n608N491r604q792J6219N171
8081B0453M979K640L012p869q232n804j473k261J125n763J2062L703L882p541
8067A2913R559P154j1405j5247J2301L205K5118P277l470J1041K0224q799j922
8054F7949L856j5443n207O679J99m800J3766N385j4823n724j3864j2992L527l928
8040B4580J0088o848j2898R183m195n33J5795L776r477j528O7n679P180P385M835
$$ plain form
8025 41731 44331 45606 50682 55490 60271 57452 50389 49463 55921 69261 73781 68650 66715 56999 47540
8010 47540 40538 50511 55295 46602 41896 34346 31837 40196 40924 41620 53855 66928 84231 106398
7996 106398 128204 122168 110931 105909 107912 94635 81513 82314 88558 91007 93048 87835 76327
7983 76327 74180 81895 82337 82917 76291 60116 55209 45093 50518 65300 54478 38919 44512 49647
7969 49647 55483 64819 69208 71895 65688 58707 50314 51191 61457 55424 44237 49466 59731 56648
7955 56648 66533 77076 79585 86736 82350 71084 64284 55090 45591 48899 53057 53139 60001 59821 50437
7940 50437 61419 54622 58040 65169 68557 74951 86839 82973 88533 98951 93469 84142 79512 72699
7926 72699 66298 65505 63643 67190 68333 68805 77108 92778 96212 111192 128184 146671 196246 258797
$$ packed form
8025D1731K600J275N076M808M781k819p063r26O458J3340M520n131j935r716r459
8010D7540p002R973M784q693m706p550k509Q359P28O96J2235J3073J7303K2167
7996A06398K1806o036j1237n022K003j3277j3122Q01O244K449K041n213j1508
7983G6327k147P715M42N80o626j6175m907j0116N425J4782j0822j5559N593N135
7969D9647N836R336M389K687o207o981q393Q77J0266o033j1187N229J0265l083
7955E6648R885J0543K509P151m386j1266o800r194r499L308M158Q2O862j80r384
7940E0437J0982o797L418P129L388O394J1888l866N560J0418n482r327m630o813
7926G2699o401p93j862L547J143M72Q303J5670L434J4980J6992J8487M9575O2551
$$ plain form
7912 258797 322695 402033 472029 537611 563547 537141 471364 393916 334732 271168 219466 178987
7900 178987 150842 149613 149726 138061 121516 111321 108095 110285 103982 88440 89080 88309 71210 57036
7886 57036 56503 71199 77548 83148 111024 120779 104263 90130 94918 100977 108675 119711 122696 128072
7872 128072 134410 144935 166445 214851 273006 345779 467898 613538 768054 905121 980487
7861 980487 967732 877705 725761 556162 425581 345400 285645 229408 194415 157861 135095
7850 135095 130293 129222 118307 115628 100504 77899 69333 64393 67697 65703 78636 85583 77831
7837 77831 66685 59182 60486 76950 80198 76312 76306 67334 79164 88386 86089 97511 102013 110164
7823 110164 123353 143458 175125 207754 249771 297691 348946 399642 421914 406421 366541 302002
$$ packed form
7912B58797O3898P9338O9996O5582K5936k6406o5777p7448n9184o3564n1702m0479
7900A78987k8145j229J13j1665j6545j0195l226K190o303j5542O40p71j7099j4174
7886E7036n33J4696O349N600K7876R755j6516j4133M788O059P698J1036K985N376
7872A28072O338J0525K1510M8406N8155P2773J22119J45640J54516J37067P5366
7861I80487j2755r0027j51944j69599j30581q0181n9755n6237l4993l6554k2766
7850A35095m802j071j0915k679j5124k2605q566m940L304j994J2933O947p752
7837G7831j1146p503J304J6464L248l886oq972J1830R222k297J1422M502Q151
7823A10164J3189K0105L1667L2629M2017M7920N1255N0696K2272j5493l9880o4539
$$ plain form
7811 302002 241498 201512 164851 127904 100984 80798 61770 49911 44785 42328 29885 25558
7799 25558 25699 13361 578 13887 25723 23218 21495 19517 16619 20472 24685 18132 26573 30425
7785 30425 10316 -7680 7895 27951 24715 15229 16513 1711 13250 24053 6851 1815 -7593
7772 -7593 -2681 -4687 -12652 -18041 -14524 -21989 -25636 -27363 -23026 -23803 -28808 -23667 -13192 -555 3241
7757 3241 2124 5272 12205 10161 18023 27111 21599 15205 4168 12236 14624 15988 17107 19531 21448
7742 21448 10589 7048 11294 6889 -3575 -15242 -7387 -2506 -4209 6274 -3367 -7296 -3078 -1494
7728 -1494 2472 2425 -5330 -11528 -18809 -25515 -11066 -4946 604 17062 15839 1671 -8001 -5999 -942
7713 -942 -1146 9639 19118 21617 13475 460 -12464 -17534 -13826 -13699 1435 -13305 -33074 -41613
$$ packed form
7811C02002o0504l9986l6661l6947k6920k0186j9028j1859n126k457j2443m327
7799B5558J41j2338j2783J3309J1836k505j723j978k898L853M213o553Q441L852
7785C0425k0109j7996J5575K0056l236r486J284j4802J1539J0803j7202n036r408
7772g593M912k006p965n389L517p465l647j727M337p77n005N141J0475J2637L796
7757C241j117L148O933k044P862R088n512o394j1037Q068K388J364J119K424J917
7742B1448j0859l541M246m405j0464j1667P855M881j703J0483r641l929M218J584
7728a494L966m7p755o198p281o706J4449O120N550J6458j223j4168r672K002N057
7713i42k04J0785R479K499q142j3015j2924n070L708J27J5134j4740j9769q539
$$ plain form
7699 -41613 -26562 -31265 -32637 -25557 -24707 -24149 -22410 -27287 -12692 2540 6584 21521 29307 36702
7685 36702 31204 24104 13730 3995 8734 4229 -2735 -5873 1581 2574 783 6285 -1837 -17794
7671 -17794 -15149 -6882 -13778 -12567 -9521 -21660 -13913 7333 14534 16855 12260 20035 8933 8960
7657 8960 -1422 -8205 -9800 -1880 5344 7594 3391 6663 4835 -2912 3559 -380 -8700 -17008 -2733
7642 -2733 1936 -11458 -11115 -11819 -8313 -5149 -7720 -14654 -7141 8211 3039 -4814 1354 8194 4446
7627 4446 -3327 2629 -1672 1709 11593 -939 3632 5420 1607 -8881 -9142 -4558 -7699 -6924 7637
7612 7637 10163 6713 -1227 -1075 -2859 -11780 -17626 -13113 -10010 -11603 -18510 -6487 16862 -5466
7598 -5466 -9478 -173 -12173 -15926 -32435 -28029 -10837 -9533 -19231 -18474 -7521 -3449 8444 21658
$$ packed form
7699d1613J5051m703j372P080Q50N58J739m877J4595J5232M044J4937P786P395
7685C6702n498p100j0374r735M739m505o964l138P454R93j791N502q122j5957
7671a7794K645Q267o896J211L046j2139P747K1246P201K321m595P775j1102K7
7657H960j0382o783j595P920P224K250m203L272j828p747O471l939q320q308J4275
7642b733M669j3394L43p04L506L164k571o934P513J5352n172p853O168O840l748
7627D446p773N956m301L381R884j2532M571J788l813j0488k61M584l141P75J4561
7612G637K526l450p940J52j784q921n846M513L103j593o907J2023K3349k2328
7598e466m012R305j2000l753j6509M406J7192J304r698P57J0953M072J1893J3214
$$ plain form
7584 21658 20444 13316 8440 6137 8167 -733 -3568 -4721 -21804 -14661 -10307 -1163 -4951 -3094
7570 -3094 -4651 -7319 -7678 -3625 4660 13709 8271 -3295 -9280 -17567 -22482 -28554 -27069 -13483 -5627
7555 -5627 -8397 -12360 -57 -2206 -5785 -13622 -11863 3640 2414 -3085 -2527 823 10540 4792 -1640
7540 -1640 -8012 -16943 -24031 -11489 -5807 -13587 -18479 -20321 -26777 -14321 -11481 -6155 63 4968
7526 4968 2974 4396 9437 7945 1418 -8358 -8938 -15391 -13848 8179 13768 6859 -3626 775 5343
7511 5343 -9813 -15741 -19796 -27284 -20120 -11866 -6441 -13653 -13990 -13729 233 11880 6142 931 13038
7496 13038 27120 29248 21959 26892 25414 17560 4637 -3602 -24610 -37096 -37157 -28692 -19783 -12548
7482 -12548 -4276 -4368 -7447 -3768 -8191 -5693 -4139 -1011 -6047 -4065 -1788 12756 9993 3258 2532
$$ packed form
7584B1658j214p128m876k303K030q900k835j153j7083P143M354R144l788J857
7570c094j557k668l59M053Q285R049n438j1566n985q287m915o072J485J3586P856
7555e627k770l963J2303k149l579p837J759J5503j226n499N58L350R717n748o432
7540a640o372q931p088J2542N682p780m892j842o456J2456K840N326O218M905
7526D968j994J422N041j492o527r776n80o453J543K2027N589o909j0485M401M568
7511E343j5156n928m055p488P164Q254N425p212l37K61J3962J1647n738n211J2107
7496A3038J4082K128p289M933j478p854j2923q239k1008j2486o1Q465Q909P235
7482a2548Q272r2l079L679m423K498J554L128n036J982K277J4544k763o735p26
$$ plain form
7467 2532 -3349 6891 10371 7549 22222 26442 20420 14354 11097 -137 2519 6797 -1905 1046
7453 1046 -2326 -4844 -4323 -12100 -17242 -14236 -12794 -9312 -9907 2709 7696 2685 -4778 -7691 -5649
7438 -5649 -894 8615 5321 -4819 -4705 -4852 -3214 -8746 -13151 -33217 -31664 -18752 -12469 -6179 -10049
7423 -10049 -19420 -17016 -3045 7594 -1275 -6367 -19297 -12712 -7483 2472 587 -2805 -10394 -18467
7409 -18467 -23111 -8412 -12019 -26290 -32634 -13678 -14055 -19970 -15149 -3682 4686 2956 -5265 -8221
7395 -8221 -16255 -14339 5764 -1758 -2137 -10487 -10591 -10378 1165 -9535 -13619 -19112 -8333 -3631 -1068
7380 -1068 1079 2394 -2192 -8423 360 -8680 1187 -703 -586 -1757 -700 -9837 -11599 -4095 -3675
7365 -3675 4558 -810 -12601 -24992 -30975 -34217 -33152 -20336 -5976 -855 3232 -3871 3555 13434
$$ packed form
7467B532n881J0240L480k822J4673M220o022o066l257j1234K656M278q702K951
7453A046l372k518N21p777n142L006J442L482n95J2616M987n011p463k913K042
7438e649M755R509l294j0140J14j47J638n532m405k0066J553J2912O283O290l870
7423a0049r371K404J3971J0639q869n092j2930O585N229R955j885l392p589q073
7409a8467m644J4699l607j4271o344J8956l77n915M821J1467Q368j730q221k956
7395h221q034J916K0103p522l79q350j04K13J1543j0700m084n493J0779M702K563
7380a068K147J315m586o231Q783r040R867j890J17j171J057r137j762P504M20
7365c675Q233n368j1791j2391n983l242J065J2816J4360N121M087p103P426R879
$$ plain form
7351 13434 3910 596 -4702 84 -2279 -8643 -12092 -9027 -12410 -15136 -13372 -14694 -16733 -12695 -17125
7336 -17125 -30029 -19731 -4604 -6632 -4084 10290 13218 16661 10231 -11159 -20176 -9558 1047
7323 1047 8491 13971 8069 -6694 -525 -7677 -9563 -2376 7763 -1579 -10435 -9218 -5334 -16912
7309 -16912 -25968 -21012 -13572 -14978 -22421 -21404 -8325 -13965 -21527 -13211 -13885 -28270 -30660 -25978
7295 -25978 -10763 1553 699 -12248 -22079 -35628 -36094 -31363 -19972 -7283 -14521 -16571 -14765 -12475
7281 -12475 -3384 -1640 -3376 -11814 -16584 -14902 -32524 -33933 -24564 -19476 -16607 -3114 3904 977
7267 977 -11248 -16769 -11914 -4925 3864 13483 19738 8943 -8157 -7675 -297 -10537 -9051 3299
7253 3299 9518 15859 22156 29265 20708 14553 -4819 -31860 -33618 -22441 -17182 -11911 -10690 -9893
$$ packed form
7351A3434r524l314n298M786k363o364l449L065l383k726J764j322k039M038m430
7336a7125j2904J0298J5127k028K548J4374K928L443o430k1390r017J0618J0605
7323A047P444N480n902j4763O169p152j886P187J0139r342q856J217L884j1578
7309a6912r056M956P440j406p443J017J3079n640p562Q316o74j4385k390M682
7295b5978J5215J2316q54j2947r831j3549m66M731J1391J2689p238k050J806K290
7281a2475R091J744j736q438m770J682j7622j409R369N088K869J3493P018k927
7267I77j2225n521M855O989Q789R619O255j0795j7100M82P378j0240J486J2350
7253C299O219O341O297P109q557o155j9372k7041j758J1177N259N271J221P97
$$ plain form
7239 -9893 -7477 -4676 -7375 -15171 -4999 2827 5561 1356 -3192 -14596 -16889 -27289 -27518 -21330
7225 -21330 -18773 -22410 -12634 -13978 -9709 -3109 -2046 -5124 -6509 -12833 -6394 -9126 -7965 -2014 -7826
7210 -7826 -10524 1082 2800 2250 15825 19427 12754 8952 -4659 -2669 5089 -4164 -4624 6736
7196 6736 11542 5057 8973 3545 -4234 -10362 -9920 -10911 -21659 -14161 -13108 -21816 -8942 -2307 -10780
7181 -10780 -18684 -15305 -4590 -8461 -3755 -6991 -2889 -1913 -3114 6733 3851 -12850 1367 12629
7167 12629 19570 15605 9589 8722 2250 -12158 -17171 -11571 -16083 -17406 -8425 -11671 -20778 -26171 -15281
7152 -15281 -1555 -1872 8191 18273 22953 22316 22829 23927 25619 9319 682 -7192 -13294 -6476
7138 -6476 -17679 -15711 726 -1093 -9724 -13370 -12567 -13972 -7040 -192 10700 4943 -18804 -28232
$$ packed form
7239i893K416K801k699p796J0172P826K734m205m548j1404k293j0400k29O188
7225b1330K557l637R776j344M269O600J063l078j385o324O439k732J161N951n812
7210g826k698J1606J718n50J3575L602o673l802j3611J990P758r253m60J1360
7196F736M806o485L916n428p779o128M42r91j0748P498J053q708J2874O635q473
7181a0780p904L379J0715l871M706l236M102R76j201R847k882j6701J4217J1262
7167A2629O941l965o016q67o472j4408n013N600m512j323Q981l246r107n393J0890
7152a5281J3726l17J0063J0082M680o37N13J098J692j6300q637p874o102O818
7138f476j1203J968J6437j819q631l646Q03j405O932O848J0892n757k3747r428
$$ plain form
7124 -28232 -16410 -12291 -1394 -373 11870 8192 1297 -6445 -5258 -13310 -23136 -25437 -6075 -6825
7110 -6825 -3250 -1489 -4036 -2775 11651 14375 18231 18177 10654 5465 1467 11332 7174 7986 -5221
7095 -5221 -6446 5585 3384 1606 10468 19745 13344 3235 -676 -4538 -609 4002 10454 21649
7081 21649 34461 24454 12732 8321 8494 5072 -1519 10652 9195 16603 14218 3188 -3648 -4580
7067 -4580 -9625 -8025 4148 9348 -1757 -14151 -7790 -4725 -547 2989 -4992 -12026 -27016 -17429
7053 -17429 4086 9609 13115 3353 2156 8043 -5670 -6093 -1875 8343 17337 2754 -6379 -2929
7039 -2929 -131 -7289 -9865 -12153 -27799 -13903 3934 -3722 676 4605 738 -11928 -13044 -7961
7025 -7961 -13626 -18375 -11004 -18303 -13255 10098 23999 15004 -473 1376 1454 -1301 -6232 -12023 -23073
$$ packed form
7124b8232J1822M119J0897J021J2243l678o895p742J187q052r826k301J9362p50
7110f825L575J761k547J261J4426K724L856n4p523n189l998R865m158Q12j3207
7095e221j225J2031k201j778Q862R277o401j0109l911l862L929M611O452J1195
7081B1649J2812j0007j1722m411J73l422o591J2171j457P408k385j1030o836r32
7067d580n045J600J2173N200j1105j2394O361L065M178L536p981p034j4990R587
7053a7429K1515N523L506r762j197N887j3713m23M218J0218Q994j4583r133L450
7039b929K798p158k576k288j5646J3896J7837p656M398L929l867j2666j116N083
7025g961n665m749P371p299N048K3353J3901q995j5477J849P8k755m931n791j1050
$$ plain form
7010 -23073 -24233 -13168 -20595 -22663 -13203 -3612 -1268 948 -9902 -17108 -18700 -21972 -27795 -16962
6996 -16962 -5244 8824 4503 -5245 2995 9468 8215 -6034 -992 -7981 -6869 -4916 -3844 -4594
6982 -4594 7621 7462 10348 11284 -83 -6545 -2829 4370 21506 33904 28436 7001 -91 4428
6968 4428 1594 7358 -493 -8896 -4340 -4634 -16560 -13567 -10957 -12994 2974 12789 8728 -2080
6954 -2080 -9247 -17689 -27818 -23296 -17591 -9504 -10142 506 -512 -4059 -2303 10772 21009 5969
6940 5969 1338 2043 -6410 -16802 -11245 -12062 -4284 -12134 -31821 -20832 -15802 -18694 -19237 -4220 -1946
6925 -1946 -4634 -16724 -27631 -16785 -10771 -14221 -16150 -16763 -5752 -1171 916 10215 4483 7113
6911 7113 8674 4983 4586 1622 -6223 -2354 15044 9859 1362 3013 183 3498 1647 -2473 -14518
$$ packed form
7010b3073j160J1065p427k068R460R591K344K216j0850p206j592l272n823J0833
6996a6962J1718J4068m321r748Q240O473j253j4249N042o989J112J953J072p50
6982d594J2215j59K886R36j1367o462L716P199J7136J2398n468k1435p092M519
6968D428k834N764p851q403M556k94j1926K993K610k037J5968R815m061j0808
6954b080p167q442j0129M522N705Q087o38J0648j018l547J756J3075J0237j5040
6940E969m631P05q453j0392N557q17P778p850j9687J0989N030k892n43J5017K274
6925a946k688j2090j0907J0846O014l450j929o13J1011M581K087R299n732K630
6911G113J561l691l97k964p845L869J7398n185q497J651k830L315j851m120j2045
$$ plain form
6896 -14518 -7642 10382 14388 10747 22715 27261 16300 139 4393 14314 6003 -9566 -14153
6883 -14153 -21850 -24027 -21659 -14095 -18511 -32985 -38862 -29405 -18076 -3504 9257 4593 7630 11633
6869 11633 6225 10537 15432 10348 4369 8287 8536 -4735 -12116 -9421 -2309 1571 317 -15231
6855 -15231 -23785 -22984 -28514 -24843 -23580 -21987 -20955 -7449 12607 10112 12066 11834 2135 4871 -7704
6840 -7704 3389 9984 11620 13633 11111 3976 183 -4098 4571 3603 -26 -6896 -3160 -13588 -24309
6825 -24309 -17345 -11114 420 -3718 3012 -7788 -12686 -25006 -26595 -22848 -21675 -19575 -17014 -15648
6811 -15648 -16026 -11427 -9957 -16977 -11413 -5227 -17819 -14788 4936 8794 4926 11982 6647 -6596
6797 -6596 -7319 -8393 -8818 -7042 -1011 8841 -343 -9240 1325 -6388 -12079 -14579 -11454 -15673 -22686
$$ packed form
6896a4518O876J8024M006l641J1968M546j0961j6161M254R921q311j5569m587
6883a4153p697k177K368P564m416j4474n877R457J1329J4572J2761m664L037M003
6869A1633n408M312M895n084n979L918K49j3271p381K695P112L880j254j5548
6855a5231q554Q01n530L671J263J593J032J3506K0056k495J954k32r699K736j2575
6840g704J1093O595J636K013k522p135l793m281Q669r68l629o870L736j0428j0721
6825b4309O964O231J1534m138O730j0800m898j2320j589L747J173K100K561J366
6811a5648l78M599J470p020N564O186j2592L031J9724L858l868P056n335j3243
6797f596p23j074m25J776O031R852r184q897J0565p713n691k500L125m219p013
$$ plain form
6782 -22686 -25079 -23462 -24571 -22836 -12471 -14569 -11866 -11345 58 -14528 -18364 -15029 -15655 -17672
6768 -17672 -23350 -19290 -17140 -6330 2158 1509 1575 3219 10765 10818 12638 8201 6451 4616 6496 9194
6752 9194 17584 3362 4357 4597 13568 12298 5243 689 -1017 -1370 -10593 -13849 -8126 -20555 -27445
6737 -27445 -4384 7395 19170 16732 4880 -2858 -4984 9393 12321 -4733 -23238 -16179 -18646
6724 -18646 -22453 -15178 -2217 -10247 -19509 -13465 -8766 426 10324 9241 2320 -11983 -24135 -27719
6710 -27719 -9247 871 7764 312 -8796 4731 4489 -5647 -10635 -15342 -16628 -17314 -9451 961
6696 961 1129 6219 16560 13850 7315 7425 4764 -11831 -15049 -12882 -6913 -8790 2902 14246 7069
6681 7069 -4937 -187 -135 -21241 -29511 -45435 -36432 -27224 -16125 -15153 -17230 -19284 -29858 -23351
$$ packed form
6782b2686k393J617j109J735J0365k098K703N21J1403j4586l836L335o26k017
6768a7672n678M060K150J0810Q488o49O6J644P546N3J820m437j750j835J880K698
6752I194Q390j4222R95K40Q971j270p055m554j706l53r223l256N723j2429o890
6737b7445K3061J1779J1775k438j1852p738k126J4377K928j7054j8505P059k467
6724a8646l807P275J2961q030r262O044M699R192R898j083o921j4303j2152l584
6710b7719J8472J0118O893p452r108J3527k42j0136m988m707j286o86P863J0412
6696I61J68N090J0341k710o535J10k661j6595l218K167N969j877J1692J1344p177
6681G069j2006M750N2k1106q270j5924R003R208J1099R72k077k054j0574O507
$$ plain form
6667 -23351 -15509 -2707 -6252 -6814 1554 11380 7825 6037 -3378 -15759 -19969 -20423 -10487 -696 -10246
6652 -10246 -7460 -12139 -25080 -20282 -7288 -1376 -5488 -3238 -4406 -6171 -7418 7158 15630 -5473
6638 -5473 -18618 -15550 -16345 -35386 -26597 -11246 -16721 -18358 -6024 -3227 -3240 -3948 -14166 -14185 7265
6623 7265 12004 5870 7837 3897 11129 10212 6020 11474 9255 -4784 -534 11450 6424 -4420
6609 -4420 -7513 -2948 -7792 -10126 -8439 -123 -9978 -16343 -9007 -2398 -18392 -17478 -13254 -7831 -7972
6594 -7972 -3550 -9747 -9882 -12135 -12018 -15766 -7276 -7104 -3896 -3996 -5211 -7859 1744 3987 -15587 -34578
6578 -34578 -36588 -16119 -7893 1422 3955 6430 11315 11842 2790 2879 -5064 -14141 -3245 10811 6849
6563 6849 6779 6547 665 3260 -716 -1217 -11643 -19260 -23519 -27883 -23879 -24704 -6260 224 -13087
$$ packed form
6667b3351P842J2802l545n62Q368R826l555j788r415j2381m210m54R936R791r550
6652a0246K786m679j2941M798J2994N912m112K250j168j765j247J4576Q472k1103
6638e473j3145L068p95j9041Q789J5351n475j637J2334K797j3p08j0218j9K1450
6623G265M739o134J967l940P232r17m192N454k219j4039M250J1984n026j0844
6609d420l093M565m844k334J687Q316r855o365P336O609j5994R14M224N423j41
6594g972M422o197j35k253J17l748Q490J72L208j00j215k648R603K243j9574j8991
6578c4578k010K0469Q226R315K533K475M885N27r052Q9p943r077J0896J4056l962
6563F849p0k32n882K595l976n01j0426p617m259m364M004q25J8444O484j3311
$$ plain form
6548 -13087 -7715 10811 8076 -25776 -26010 -22844 -24488 -15780 -1779 5132 1012 -6649 -2989 -9255
6534 -9255 -21211 -878 -1590 -17000 -28294 -17479 -11223 -11920 -7718 -6308 -2624 6873 3265 -5501
6520 -5501 -12522 -16522 -6582 -4255 -12938 -6572 -10802 -10317 -171 -10282 -8495 -12274 -15756 -13595 -5488
6505 -5488 4534 -4165 -16287 -17190 -12918 -989 3357 -4945 -11523 -20146 -15198 -9374 -20933 -20106
6491 -20106 -3369 7821 2303 -13522 -14679 3901 -3727 -9677 -672 -2433 -7859 -12193 -18536 -13597
6477 -13597 -16734 -15960 -7573 -5649 -8883 -18893 -24509 -18263 -13695 -5049 1099 -1546 -278 5843 6605
6462 6605 17315 21076 4400 -4280 -4800 -6829 -4995 -11367 -10316 6370 1476 -18060 -29958 -35858
6448 -35858 -20615 -15351 -818 -1923 -6231 -472 9367 9407 -4390 -6046 -11362 -13579 -11312 -3307
$$ packed form
6548a3087N372J8526k735l3852k34L166j644Q708J4001O911m120p661L660o266
6534i255j1956K0333p12j5410j1294J0815O256o97M202J410L684R497l608q766
6520e501p021m000R940K327q683O366m230M85J0146j0111J787l779l482K161Q107
6505e488J0022q699j2122r03M272J1929M346q302o578q623M948N824j1559Q27
6491b0106J6737J1190n518j5825j157J8580p628n950R005j761n426m334o343M939
6477a3597l137P74Q387J924l234j0010n616O246M568Q646O148k645J268O121P62
6462F605J0710L761j6676q680n20k029J834o372J051J6686m894j9536j1898n900
6448c5858J5243N264J4533j105m308N759R839M0j3797j656n316k217K267Q005
$$ plain form
6434 -3307 -12081 -22236 -17424 -18810 -35422 -32208 -34508 -26373 -28475 -23909 -23218 -14270 -83 -2462
6420 -2462 -11094 -21514 -25781 -6843 7412 -2262 2358 1020 -7686 -2572 2596 6550 10133 1703
6406 1703 -11282 -15779 -2126 4797 5591 8167 13175 18843 15742 10283 -1475 -10638 -13917 -15044
6392 -15044 -10177 -5124 -162 -4730 -16217 -21983 -21114 -12804 -5935 -7602 6526 8071 20269 27527
6378 27527 25418 3835 -3700 -15473 -7681 -4002 -14101 -12629 -6550 5175 13535 16508 15307 6288
6364 6288 6879 1296 -3658 -3599 -2953 -12644 -14497 -16296 -9706 -7654 -10917 1625 3380 -9817 -13924
6349 -13924 -15371 -17841 -18054 -15513 -16027 -15797 -6720 -2512 -13837 -24719 -21618 -13031 -2432 -4 8649
6334 8649 13989 15910 2795 -636 -5523 -9479 -11449 -6536 -7935 -20512 -18860 -8062 -1788 -4767
$$ packed form
6434c307q774j0155M812j386j6612L214k300Q135k102M566O91Q948J4187k379
6420b462q632j0420m267J8938J4255r674M620j338q706N114N168L954L583q430
6406A703j2985m497J3653O923P94K576N008N668l101n459j1758r163l279j127
6392a5044M867N053M962m568j1487n766Q69Q310O869j667J4128J545J2198P258
6378B7527k109k1583p535j1773P792L679j0099J472O079J1725Q360K973j201r019
6364F288N91n583m954N9O46r691j853j799O590K052l263J2542J755j3197m107
6349a3924j447k470k13K541n14K30R077M208j1325j0882L101Q587J0599K428Q653
6334H649N340J921j3115l431m887l956j970M913j399j2577J652J0798O274k979
$$ plain form
6320 -4767 -12526 -8795 -7308 -9150 7815 2129 3207 2118 -15684 -27121 -10218 -7411 -4310 -3387
6306 -3387 -9180 1460 2585 8034 2120 -6256 -7525 -21202 -24353 -11352 -3616 -8182 -9705 -8730
6292 -8730 -5451 -14826 -8391 -7192 -11140 -10141 -14226 -22508 -4503 327 9 -8658 -883 3326 931
6277 931 2577 -3759 6879 5096 4428 -4324 3619 15341 9391 12 9166 19919 20866 18119 13850
6262 13850 14180 10262 13155 14932 21428 14801 18742 7798 1084 2824 683 1506 1939 -1727 -778
6247 -778 -635 11719 21068 11788 5556 -16504 -29531 -18042 -15576 -4947 14003 -2321 -15637
6234 -15637 -14695 -15181 2031 -484 -13715 -17270 -8526 6619 10829 -862 6092 10894 -370 -21004
6220 -21004 -23895 -21130 -9671 12064 20106 18804 4157 -14175 -12309 -1636 788 9030 20365
$$ packed form
6320d767p759L731J487j842J6965n686J078j089j7802j1437J6903K807L101R23
6306c387n793J0640J125N449n914q376j269j3677l151J3001P736m566j523R75
6292h730L279r375O435J199l948R99m085q282J8005M830l18q667P775M209k395
6277I31J646o336J0638j783o68q752P943J1722n950r379R154J0753R47k747m269
6262A3850L30l918K893J777O496o627L941j0944o714J740k141Q23M33l666R49
6247g78J43J2354R349r280o232k2060j3027J1489K466J0629J8950j6324j3316
6234a5637R42m86J7212k515j3231l555Q744J5145M210j1691O954M802j1264k0634
6220b1004k891K765J1459K1735Q042j302j4647j8332J866J0673K424Q242J1335
$$ plain form
6207 20365 30184 19675 9621 1109 -14417 -13782 -13128 -10987 -12949 -5752 7620 1201 769 4067
6193 4067 12410 8039 3968 -11599 -16006 -10633 -8786 -12716 -12109 -2996 4327 -8977 -13150 -10656 -26873
6178 -26873 -21603 -16271 -30664 -43369 -33941 -18763 -7161 -10836 -8436 669 1362 -3173 -4812 -15775
6164 -15775 -19766 -19411 -10774 -507 2582 -923 4590 -3538 -24865 -28944 -25593 -21319 -17664 -16030
6150 -16030 -23697 -21093 -28376 -19777 -14802 -8195 -14252 -23027 -30926 -28901 -15848 -11377 143 2206
6136 2206 2325 -15234 -24432 -16967 -14502 -12222 -240 4054 3325 -384 -10650 -19397 -28355 -25534 -27443
6121 -27443 -34174 -23828 -8224 11297 15327 -1145 -29581 -24928 -4786 -3350 -21249 -20907 -27139
6108 -27139 -20426 -17164 -4699 -3604 -2059 -2641 -1804 -19332 -24855 -11787 -9272 -4896 -9607 -9481 -11400
$$ packed form
6207B0365R819j0509j0054q512j5526O35O54K141j962P197J3372o419m32L298
6193D067Q343m371m071j5567m407N373J847l930O07R113P323j3304m173K494j6217
6178b6873N270N332j4393j2705R428J5178J1602l675K400R105O93m535j639j0963
6164a5775l991L55Q637J0267L089l505N513q128k1327m079L351M274L655J634
6150a6030p667K604p283Q599M975O607o057q775p899K025J3053M471J1520K063
6136B206J19j7559r198P465K465K280J1982M294p29l709j0266q747q958K821j909
6121b7443o731J0346J5604J9521M030j6472k8436M653K0142J436j7899L42o232
6108b7139O713L262J2465J095J545n82Q37j7528n523J3068K515M376m711J26j919
$$ plain form
6093 -11400 -8891 -6758 -9337 -10807 -9077 -3440 -5913 -6094 -5181 -10752 -6278 2805 9902 19492 14754
6078 14754 -19347 -33435 -25873 -28131 -29795 -21000 -14247 -2691 6162 1128 -11043 -8854 -5868 -12182
6064 -12182 -5622 -3829 -10184 -5264 -5079 -7408 -9883 -4210 3190 7920 -1368 -12662 -7413 2019 6327
6049 6327 4203 7173 3328 -11193 -19920 -13838 -6779 -7613 -4058 -1009 841 -16672 -11266 -5490 1511
6034 1511 -2397 -6589 -1417 -5684 -9012 3393 -4753 -5778 -17420 -33649 -26416 -16211 -13587 -5643
6020 -5643 -11657 -16960 -18679 -2165 -5068 -5871 -9950 5396 3863 -16509 -19708 -23799 -10562 7680
6006 7680 3029 -23371 -28536 -16590 -18358 -16303 -22416 -19178 -5238 10104 32108 24781 6026
5993 6026 6382 -9813 -25296 -10977 -3713 -8927 -11458 -16665 -16009 -14720 -14459 -9980 3946 2551 586
$$ packed form
6093a1400K509K133k579j470J730N637k473j81R13n571M474R083P097R590m738
6078A4754l4101j4088P562k258j664Q795O753J1556Q853n034j2171K189K986o314
6064a2182O560J793o355M920J85k329k475N673P400M730r288j1294N249R432M308
6049F327k124K970l845j4521q727O082P059q34L555L049J850j7513N406N776P001
6034A511l908m192N172m267l328J2405q146j025j1642j6229P233J0205K624P944
6020e643o014n303j719J6514k903q03m079J5346j533k0372l199m091J3237J8242
6006G680m651k6400n165J1946j768K055o113L238J3940J5342K2004p327j8755
5993F026L56j6195j5483J4319P264n214k531n207O56J289K61M479J3926j395j965
$$ plain form
5978 586 -3653 -6312 -9635 8745 13314 6594 12033 8417 -5259 -1481 530 13860 18273 -1145
5964 -1145 -24808 -32017 -23703 -13757 -5880 -17643 -15808 -3398 1468 17465 8882 -7729 -1349 -2275
5950 -2275 3401 -8878 -12760 -4036 -4055 -861 -3873 -11470 -27608 -19676 -4688 -6132 -8080 -7980 -16778
5935 -16778 3907 6226 -2689 6100 7440 8642 2456 -6954 -8218 -425 6948 -6031 2287 3660
5921 3660 10269 7961 3414 6128 11397 4871 -2203 -4215 3657 -7300 -8701 -10330 -21165 -3429
5907 -3429 2814 -566 -13320 -11574 -9419 -20640 -24962 -21351 -18359 -26183 -20018 -17044 -11441 -19729
5893 -19729 -5972 -153 -8609 103 -728 2168 509 -3927 -7018 -10894 -14230 -13868 -12556 -19116 -20612
5878 -20612 -18285 -3792 4170 12121 18313 11311 -3391 -2925 8930 5509 -2267 1301 6873 2580
$$ packed form
5978E86m239k659l323J8380M569o720N439l616j3676L778K011J3330M413j9418
5964a145k3663p209Q314R946P877j1763J835J2410M866J5997q583j6611O380r26
5950b275N676j2279l882Q724j9L194l012p597j6138P932J4988j444j948J00q798
5935a6778K0685K319q915Q789J340J202o186r410j264P793P373j2979Q318J373
5921C660O609k308m547K714N269o526p074k012P872j0957j401j629j0835J7736
5907c429O243l380j2754J746K155j1221m322L611K992p824O165K974N603q288
5893a9729J3757N819q456Q712q31K896j659m436l091l876l336L62J312o560j496
5878b0612K327J4493P962P951O192p002j4702M66J1855l421p776L568N572m293
$$ plain form
5864 2580 -6132 -11963 -10612 -17380 -14534 -3539 -8238 -16043 -2701 1072 9373 9112 603 -1314 3069
5849 3069 5629 -3841 -13122 -21631 -20635 -18877 -22855 -13482 -23951 -36814 -22576 4141 -3412 4322
5835 4322 13298 23698 4716 -17067 -21890 -17083 -8261 -3707 172 5026 -180 -5633 -556 5390
5821 5390 5156 -8364 -23496 -17549 -3825 1905 6196 7751 835 -7015 -17931 -15201 -6459 2647
5807 2647 -3537 -8627 -19954 -20899 -4178 3998 -429 4628 4565 1610 12322 15461 2400 2226 7389
5792 7389 1063 -17786 -9072 5025 7721 17955 11490 2862 2044 1941 12102 1833 -3746 10061
5778 10061 13722 10099 -6812 -17896 -15368 400 4571 -13083 -12954 -9814 -7527 -7826 -10372 -10758
5764 -10758 -22144 -23192 -27766 -3504 16923 10884 -7295 -7750 5558 12062 1943 -2213 -2108 6456
$$ packed form
5864B580q712n831J351o768K846J0995m699p805J3342L773Q301k61q509j917M383
5849C069K560r470r281q509R96J758l978R373j0469j2863J4238K6717p553P734
5835D322Q976J0400j8982k1783m823M807Q822M554L879M854n206n453N077N946
5821E390k34j3520j5132N947J3724N730M291J555o916p850j0916K730Q742R106
5807B647o184n090j1327r45J6721Q176m427N057o3k955J0712L139j3061j74N163
5792G389o326j8849Q714J4097K696J0234o465q628q18j03J0161j0269n579J3807
5778A0061L661l623j6911j1084K528J5768M171j7654J29L140K287k99k546l86
5764a0758j1386j048m574K4262K0427o039j8179m55J3308O504j0119m156J05Q564
$$ plain form
5750 6456 11267 16566 13820 16121 10577 9403 4176 1502 8305 216 -16673 -7026 -11539 -15513 6457
5735 6457 6361 2722 -2275 7098 14902 11819 12168 10966 7009 1856 4237 8993 4135 5318 1644 -2575
5719 -2575 -802 -7267 -8459 -17026 -9531 -21619 -19948 -2389 -2715 -2854 968 4216 12498 14403 -1089
5704 -1089 -25936 -24634 -24642 -24380 -10737 2522 -2761 -9789 -3652 -3667 -11424 -17074 -8749 -1836 6840 -5975
5688 -5975 -25760 -20232 -12815 -16118 -14043 -7823 -2215 -3634 -5683 -2820 13094 10141 4106 4819 -2635
5673 -2635 -4034 8852 7187 5588 6923 5540 248 -13045 -14240 -22465 -12676 -9015 3366 23379
5659 23379 22398 3663 1432 1127 9734 9991 -7910 -22059 -10045 -4137 -15215 -13682 -15375 -8756
5645 -8756 -21712 -35525 -17909 -1586 5700 8618 757 -5081 -24634 -18895 -13378 -6194 -11114 -15707
$$ packed form
5750F456M811N299k746K301n544j174n227k674O803q089j6889R647m513l974K1970
5735F457r6l639m997R373P804l083L49j202l957n153K381M756m858J183l674m219
5719b575J773o465j192q567P495j2088J671J7559l26j39L822L248Q282J905j5492
5704a089k4847J302qK62J3643J3259n283p028O137j5p757n650Q325O913Q676j2815
5688e975j9785N528P417l303K075O220N608j419k049K863J5914k953o035P13p454
5673b635j399J2886j665j599J335j383n292j3293j195q225R789L661J2381K0013
5659B3379r81j8735k231l05Q607K57j7901j4149J2014N908j1078J533j693O619
5645h756j2956j3813J7616J6323P286K918p861n838j9553N739N517P184m920m593
$$ plain form
5631 -15707 -17967 -39786 -44691 -43377 -29831 -7510 -17217 -10497 -18632 -30084 -32281 -18314 -9094
5618 -9094 86 -3517 8654 14481 -3103 -14761 -21043 -24130 -23505 -14252 -10520 -8663 -16439 -12408
5604 -12408 179 -6748 -15148 -19848 -17481 -17347 -22542 -19002 -11164 -8334 -20051 -19802 -9366 -7722
5590 -7722 -7062 4468 6498 9701 4997 4099 1718 1751 10703 8748 392 807 426 2456 9660 2372
5574 2372 -14004 -14155 -1367 1492 -6909 -10493 -10019 -5062 5913 6583 2225 1378 -5825 -27693 -27851
5559 -27851 -14982 -7686 -12613 -6208 -13588 -5667 -3317 -3141 -3080 -8265 -8511 -20371 -7077 403 -12990
5544 -12990 -135 -4969 -10419 -13983 -8863 -22671 -33196 -27887 -27503 -20406 -9927 -13640 -7706 -2230
5530 -2230 -1755 -8099 -19027 -36819 -37853 -28835 -10233 -14016 -21732 -17971 -14722 -10834 -27558 -31982
$$ packed form
5631a5707k260k1819m905J314J3546K2321r707O720q135j1452k197J3967R220
5618i094R180l603J2171N827j7584j1658o282l087O25R253L732J857p776M031
5604a2408J2587o927q400m700K367J34n195L540P838K830j1717K49J0436J644
5590g722O60J1530K030L203m704q98k381L3Q952j955q356M15l81K030P204p288
5574B372j6376j51J2788K859q401l584M74M957J0975O70m358q47p203k1868j58
5559b7851J2869P296m927O405p380P921K350J76O1n185k46j1860J3294P480j3393
5544a2990J2855m834n450l564N120j3808j0525N309L84P097J0479l713N934N476
5530b230M75o344j0928j7792j034R018J8602l783p716L761L249L888j6724m424
$$ plain form
5516 -31982 -17355 -13619 -11775 -11829 -25305 -24940 -20144 -20572 -17023 -4394 12240 9498 3260 14849
5502 14849 21806 19118 5889 -3603 1980 -2251 3456 -10574 -5729 1929 6748 -263 -8056 7125
5488 7125 15684 19463 3868 -9515 -10200 -12912 -6781 -14552 -15758 -9230 -2272 2827 4601 -1252 -2393
5473 -2393 7426 3108 -518 8958 5530 -12181 -19531 -23810 -3049 13284 5531 -1068 13093 17499
5459 17499 10420 8637 24140 33903 23122 18068 29420 24498 14260 4406 -18220 -19214 2732
5446 2732 4339 2218 2154 7211 9234 13853 21426 23158 26284 18713 9816 3275 -2900 11689 22056
5431 22056 12204 -10729 -3153 14954 16157 9905 10529 8584 5007 9689 12811 5221 3594 2058
5417 2058 5100 11283 15252 12466 7967 10817 14114 10083 17806 1021 4310 10987 -5122 -7522
$$ packed form
5516c1982J4627L736J844n4j3476L65M796m28L549J2629J6634k742o238J1589
5502A4849O957k688j3229r492N583m231N707j4030M845P658M819p011p793J5181
5488G125Q559L779j5595j3383o85k712O131p771j206O528O958N099J774n853j141
5473b393R819m318l626R476l428j7711p350m279K0761J6333p753o599J4161M406
5459A7499p079j783J5503R763j0781n054J1352m922j0238r854k2626r94K1946
5446B732J607k121o4N057K023M619P573J732L126p571q897o541o175J4589J0367
5431B2056r852k2933P576J8107J203o252O24j945l577M682L122p590j627j536
5417B058L042O183L969k786m499K850L297m031P723j6785L289O677j6109k400
$$ plain form
5403 -7522 -3624 -78 0 7341 3219 2364 -9605 -29794 -15804 -855 -1143 -11591 3431 5945
5389 5945 3754 -2875 -2747 10962 14594 -4477 -2099 4091 1998 3195 17482 9651 6032 7101
5375 7101 2944 -22138 -20320 -12022 -22794 -21205 -4866 6673 11201 9063 32 -2188 -18044 -21640
5361 -21640 7209 17804 12521 -113 -1738 137 1443 2020 -2665 -2803 7234 8345 -1732 -3918
5347 -3918 9804 14575 -2409 -7378 8810 5268 5910 5081 1010 -70 -1482 -15980 -17431 -21257
5333 -21257 -9294 -637 6944 4467 -3584 -5889 6809 11280 1531 -2901 -10353 -17200 -9729 -18700
5319 -18700 -17621 75 4708 2813 12145 13127 6143 7944 -580 -10980 -14902 -16810 -25651 -21823
5305 -21823 -22950 -23164 -17608 -15727 -10316 -9191 -14386 -15833 -1243 7139 930 3140 -3518 -6650 6126
$$ packed form
5403g522L898L546P8P341m122q55j1969k0189J3990J4949k88j0448J5022K514
5389E945k191o629J28J3709L632j9071K378O190k093J197J4287p831l619J069
5375G101m157k5082J818Q298j0772J589J6339J1539M528k138r031k220j5856l596
5361b1640K8849J0595n283j2634j625J875J306N77m685j38J0037J111j0077k186
5347c918J3722M771j6984m969J6188l542O42q29m071j080j412j4498j451l826
5333b1257J1963Q657P581k477q051k305J2698M471r749m432p452o847P471q971
5319a8700J079J7696M633j895R332R82o984J801q524j0400l922j908q841L828
5305b1823j127k14N556J881N411J125n195j447J4590Q382o209K210o658l132J2776
$$ plain form
5290 6126 2037 2232 3685 -7722 -24057 -30006 -13301 -3349 22857 35189 29340 17320 7167
5277 7167 1988 -6219 -16861 -15488 -5669 -13819 -11054 -9296 -5520 -13684 -9440 62 7487 -4087
5263 -4087 -16568 -4902 7789 48 4781 17033 21632 23260 7385 1363 -871 3092 6337 1955
5249 1955 12154 4207 -5532 -11234 -9986 -2638 -9267 -17755 -19064 -10001 -5550 -4661 -8466 -11196 -17382
5234 -17382 -13422 -3675 -2461 2244 3610 -5977 -5688 2330 7430 18406 19576 16208 14095 15519 9345
5219 9345 3986 1943 11592 4890 -12289 -1839 -781 -3172 4330 -6469 -1014 4092 10989 13810
5205 13810 14337 6805 10883 4391 1875 -10429 -20030 -15708 -5256 -8041 -15311 -7973 -5439 -4421
5191 -4421 -142 11131 -6080 -15319 -8240 -9846 -14238 -13344 -10891 11467 16347 14742 12846 2613
$$ packed form
5290F126m089J95J453j1407j6335n949J6705R952K6206J2332n849j2020j0153
5277G167n179q207j0642J373R819q150K765J758L776q164M244R502P425j1574
5263d087j2481J1666J2691p741M733J2252M599J628j5875o022k234L963L245m382
5249A955J0199p947r739n702J248P348o629q488j309R063M451Q89l805k730o186
5234a7382L960R747J214M705J366r587K89Q018N100J0976J170l368k113J424o174
5219I345n359k043R649o702j7179J0450J058k391P502j0799N455N106O897K821
5205A3810N27p532M078o492k516j2304r601M322J0452k785p270P338K534J018
5191d421M279J1273j7211r239P079j606m392Q94K453K2358M880j605j896j0233
$$ plain form
5177 2613 -6217 -6020 -14383 -22237 -24672 -11502 -8363 -5098 -5828 -6463 -851 237 -1606 -2223 -6694 -22763
5161 -22763 -12694 208 8250 10226 -4635 -9092 -5769 -16252 -15403 -13618 -6203 -11605 -15585 3147
5147 3147 11189 7506 8336 17755 16839 8177 -3879 1475 2139 10197 10184 9191 6552 7698 -6144 -1475
5131 -1475 7398 7075 -833 -2096 -1858 4507 4925 -1755 4152 7435 -3566 -12280 -7205 3512 2509
5116 2509 6722 -5445 -19053 -21148 -19328 -17865 -13007 9105 16432 24214 19978 2760 -16271 -20118
5102 -20118 -16827 368 3100 8841 5226 -5040 -21523 -18452 -20765 -27018 -30039 -27220 -29272 -26927
5088 -26927 -18278 -18192 -14734 -10318 -10578 8305 19935 12973 11211 7338 7851 7512 3780 285 -7922
5073 -7922 -5600 306 -7886 -11516 3273 8939 2293 11313 22444 22007 22096 19301 32883 21594 9505
$$ packed form
5177B613q830J97q363p854k435J3170L139L265p30o35N612J088j843o17m471j6069
5161b2763J0069J2902Q042J976j4861m457L323j0483Q49J785P415n402l980J8732
5147C147Q042l683Q30R419r16q662j2056N354O64Q058j3r93k639J146j3842M669
5131a475Q873l23p908j263K38O365M18o680N907L283j1001q714N075J0717j003
5116B509M213j2167j3608k095J820J463M858K2112P327P782m236j7218j9031l847
5102b0118L291J7195K732N741l615j0266j6483L071k313o253l021K819k052K345
5088b6927Q649Q6L458M416k60J8883J1630o962j762l873N13l39l732l495q207
5073g922K322N906q192l630J4789N666o646R020J1131m37Q9k795J3582j1289j2089
$$ plain form
5058 9505 967 -22729 -16652 -9734 -7814 -4174 1779 5837 -10073 -26477 -26067 -17959 -12384 -13735
5044 -13735 -13910 -8910 -901 -704 -8258 -8151 -2311 11639 23434 6456 6279 15302 10200 -606 -792
5029 -792 2309 6356 -6669 -7747 8103 8258 3473 2261 18041 32434 28284 19624 17904 -1542
5015 -1542 -11539 -13225 -5919 -4564 2464 -11804 -26925 -10277 6968 20981 18525 8424 2702
5002 2702 4591 502 -8276 -20418 -37443 -29271 -17574 -8936 -11266 6418 11734 7204 1302 5732
4988 5732 -1706 -1515 -7402 -4469 -14514 -12042 -2081 2717 3472 6671 6759 -3346 -4288 -211 -8487 -11511
4972 -11511 -21723 -16154 -18070 -6034 1418 -559 -11027 -15619 -12557 -16119 -28625 -21508 -1932
4959 -1932 -1948 -9078 -18375 -16678 -19820 -29234 -34827 -34344 -26227 -23769 -14647 -15408 -20987 -23816 -19356 -14332
$$ packed form
5058I505q538k3696O077O918J920L640N953M058j5910j6404M10Q108N575j351
5044a3735j75N000Q009J97p554J07N840J3950J1795j6978j77R023n102j0806j86
5029g92L101M047j3025j078J5850J55m785j212J5780J4393m150q660j720j9446
5015a542r997j686P306J355P028j4268j5121J6648J7245J4013k456j0101n722
5002B702J889m089q778j2142j7025Q172J1697Q638k330J7684N316m530n902M430
4988E732p438J91n887K933j0045K472R961M798P55L199Q8j0105r42M077q276l024
4972a1511j0212N569j916J2036P452j977j0468m592L062l562j2506P117J9576
4959a932j6p130r297J697l142r414n593M83Q117K458R122p61n579k829M460N024
$$ plain form
4943 -14332 -23250 -17919 -14700 -29724 -33020 -30520 -22426 -15289 -17098 -13728 877 1271 5842 2326
4929 2326 -8811 -16477 -8975 -8242 -25841 -20846 -21144 -29399 -17729 -9333 6763 17951 21482 12351
4915 12351 2005 -12969 -19775 -11882 -3463 1983 -2566 -2060 -968 -10261 -11033 -3832 -7629 -10133 -5540
4900 -5540 4542 -9891 -20254 -18579 -31982 -31187 -26742 -26005 -12838 -6487 -1894 -5559 -2629 3823
4886 3823 558 -7997 -10537 -27614 -44389 -34684 -24097 -12115 -6821 -7340 -18375 -13296 -12740 -14320
4872 -14320 -3499 -12708 -20434 -14871 -17142 -16129 -10028 -12645 -14059 -23060 -23614 -31542 -21438 -5688
4858 -5688 -2401 -7467 -10047 -18094 -12879 -758 119 -2890 8272 -5728 -14026 -9613 -16448 -21501
4844 -21501 -23429 -15490 -21072 -11427 -7047 -15221 -8567 -900 6050 10862 12550 1056 8054 14181
$$ packed form
4943a4332q918N331L219j5024l296K500Q094P137j809L370J4605L94M571l516
4929B326j1137p666P502P33j7599M995k98q255J1670Q396J6096J1188L531r131
4915A2351j0346j4974o806P893Q419N446m549N06J092r293p72P201l797k504M593
4900e540J0082j4433j0363J675j3403P95M445P37J3167O351M593l665K930O452
4886C823l265q555k540j7077j6775R705J0587J1982N294n19j1035N079N56j580
4872a4320J0821r209p726N563k271J013O101k617j414r001n54p928J0104J5750
4858e688L287n066k580q047N215J2121Q77l009J1162j4000q298M413o835n053
4844b1501j928P939n582R645M380q174O654P667O950M812J688j1494O998O127
$$ plain form
4830 14181 9060 -6948 -16101 -16329 -1397 -7169 -5422 -5242 -9870 -5120 4179 3024 -10054 -18117
4816 -18117 -19269 -11089 -14449 -7747 5420 581 10037 20706 14153 -1866 -20206 -15901 -4939
4803 -4939 13024 15786 2458 -5811 -20345 -21678 -9490 3619 21221 16703 23153 12075 4265
4790 4265 3581 3959 -3315 -14064 -20192 -19008 -17699 -13009 -21910 -13608 -8103 -14076 4104 3273 -15692
4775 -15692 -12865 -4343 5076 -3304 643 5400 17297 8139 -832 6003 12021 5784 -9236 -10826
4761 -10826 -4770 -4997 1140 -330 10566 11722 -4079 -9960 -19536 -4028 -266 -3459 2626 -4192
4747 -4192 -1397 6759 6715 -138 -1085 10880 15788 19069 12039 5742 -4380 -4637 -509 7338 -6608
4732 -6608 -21534 -29690 -14625 -150 -3541 9549 21734 11168 -2322 -5634 -5811 -18489 -18043
$$ packed form
4830A4181n121j6008r153k28J4932n772J747J80m628M750R299j155j3078q063
4816a8117j152Q180l360O702J3167m839R456J0669o553j6019j8340M305J0962
4803d939J7963K762j3328q269j4534j333J2188J3109J7602m518O450j1078p810
4790D265o84L78p274j0749o128J184J309M690q901Q302N505n973J8180q31j8965
4775a5692K827Q522R419q380L947M757J1897r158q971O835O018o237j5020j590
4761a0826O056k27O137j470J0896J156j5801n881r576J5508L762l193O085o818
4747d192K795Q156m4o853r47J1965M908L281p030o297j0122k57M128P847j3946
4732f608j4926q156J5065J4475l391J3090J2185j0566j3490l312j77j2678M46
$$ plain form
4719 -18043 -17376 -18405 -8502 -10895 -8452 -16716 -13043 -687 11512 5380 -11815 -11853 -23273 -26843
4705 -26843 -26016 -25791 -8055 10094 1413 8448 16996 10452 5238 2328 -295 1439 -3864 2301 16215
4690 16215 8273 -10831 -9646 -7311 -10259 -8306 9393 13020 4106 11469 32522 25398 27102 25029
4676 25029 25495 16851 24943 13326 -9778 -20952 -18376 -23405 -7837 -1166 -4790 -4933 -11324 2088
4662 2088 22104 29603 29587 22750 6196 47 -5803 -17269 -9009 -167 -7064 -10084 -5158 -2167 -4416
4647 -4416 4075 1405 -3273 -9681 328 -5553 -19637 -39090 -40098 -31171 -25169 -19845 -19585 -662
4633 -662 20109 13997 -4162 -6030 -1900 -895 -15636 304 21399 22231 17519 13386 10614 -8763
4619 -8763 -15590 -16502 -15056 -27081 -42809 -50852 -36225 -14728 -5962 -5950 -452 -18687 -30953 -34795
$$ packed form
4719a8043O67j029R903k393K443q264L673J2356J2199o132j7195l8j1420l570
4705b6843Q27K25J7736J8149q681P035Q548o544n214k910k623J734n303O165J3914
4690A6215p942j9104J185K335k948J953J7699L627q914P363K1053p124J704k073
4676B5029M66q644Q092j1617k3104j1174K576n029J5568O671l624j43o391J3412
4662B088K0016P499j6o837j6554o149n850j1466Q260Q842o897l020M926K991k249
4647d416Q491k670m678o408J0009n881j4084j9453j008Q927O002N324K60J8923
4633f62K0771o112j8159j868M130J005j4741J5940K1095Q32m712m133k772j9377
4619h763o827r12J446j2025j5728q043J4627K1497Q766J2N498j8235j2266l842
$$ plain form
4605 -34795 -17950 -7179 -7147 -11585 -3277 4492 -5205 -9026 -3912 6637 -2126 -17315 2522 11849
4591 11849 3789 -11195 -16145 -7120 -2298 -2968 -11730 -33117 -27557 -23900 -27884 -31826 -23980 -17672
4577 -17672 -19512 -9418 -14918 -19898 -19350 -1547 14003 7601 -2203 -9589 -7829 -10841 -11745 -10265
4563 -10265 -1070 13353 18204 3771 -7774 -14738 4394 -2926 -717 4477 14788 15515 -3154
4550 -3154 -2473 -2701 -5309 -4413 -10245 -13126 -17847 -14333 -7725 -769 -6798 6032 22518 10179 -963
4535 -963 2810 -3349 -6606 -16989 -31059 -32118 -21573 -20221 -14511 -8797 -7994 -13059 -20923 -23014 -17905
4520 -17905 -24683 -10639 -7104 -11927 -17999 -21531 -22345 -30592 -21054 -4294 -5077 -7395 -8540 -5495 -4732
4505 -4732 10849 15717 -4362 -10982 -10682 300 -11669 -16953 -9952 -291 1012 1125 -15 4232
$$ packed form
4605c4795J6845J0771L2m438Q308P769r697l821N114J0549q763j5189J9837R327
4591A1849q060j4984m950R025M822o70q762k1387N560L657l984l942P846O308
4577a7672j840J0094n500m980N48J7803J5550o402r804p386J760l012r04J480
4563a0265R195J4423M851j4433j1545o964J9132p320K209N194J0311P27j8669
4550c154O81k28k608Q96n832k881m721L514O608O956o029J2830J6486j2339j1142
4535i63L773o159l257j0383j4070j059J0545J352N710N714Q03n065p864k091N109
4520a7905o778J4044L535m823o072l532q14q247R538J6760p83k318j145L045P63
4505d732J5581M868k0079o620L00J0982j1969n284P001R661J303J13j140M247
$$ plain form
4491 4232 15007 6024 -826 2359 -230 -4521 -4078 8862 9635 10754 6837 -8543 -1069 18380
4477 18380 15671 14521 16075 8173 2433 4381 -1351 -1361 -10508 -16230 -16250 -7992 -4321 2618 -602 -3140
4461 -3140 -4136 -6901 -1246 11365 14185 -4913 612 2694 970 1945 -1411 -3089 8748 12599 14265
4446 14265 11471 3528 5617 3876 11284 8717 3350 -10883 -4625 5449 3470 2450 -1425 -151
4432 -151 2925 -9535 -16942 -7796 -4660 5568 9597 -1016 -7816 -10451 -24421 -24399 -12870 -9293
4418 -9293 7694 15565 8876 -7858 -12876 -4026 -1244 3389 789 -5311 -7190 -6494 -4343 -3628 -11014
4403 -11014 -7921 -419 -7839 -15160 -7286 -3764 7376 944 -13626 -25485 -28181 -20173 1927 6282
4389 6282 5929 12943 32107 37317 27996 21031 864 -9931 -7620 -6905 -11514 -1709 466 2594 -11345
$$ packed form
4491D232J0775q983o850L185k589m291M43J2940P73J119l917j5380P474J9449
4477A8380k709j150J554p902n740J948n732j0r147n722k0Q258L671O939l220k538
4461c140r96k765N655J2611K820j9098N525K082j724R75l356j678J1837L851J666
4446A4265k794p943K089j741P408k567n367j4233O258J0074j979j020l875J274
4432a51L076j2460p407R146L136J0228M029j0613o800k635j3970K2J1529L577
4418i293J6987P871o689j6734n018Q850K782M633k600o100j879O96K151P15p386
4403a1014L093P502p420p321P874L522J1140o432j4570j1859k696Q008K2100M355
4389F282l53P014J9164N210r321o965k0167j0795K311P15m609R805K175K128j3939
$$ plain form
4374 -11345 -5632 3941 1605 -6438 -10017 -6545 -1734 9035 8974 8857 8880 14437 23021 1370 770 2420
4358 2420 563 -18866 -16437 -8772 -1839 4445 399 -2725 -3100 -1335 11501 25706 18884 12537
4344 12537 8968 4836 -468 -9564 -13722 -3140 -5229 -7077 -14540 -13623 -17829 -23624 -20387 -15481 -3075
4329 -3075 -6845 -17064 -4258 2527 -222 -9410 -8804 486 12541 9704 6298 17951 17771 -629
4315 -629 -7122 -3698 -3049 2760 17717 33629 33930 12725 7240 -6103 -1459 -876 -3203 -4729 -12290
4300 -12290 -8372 -12827 -26041 -23983 -10399 2085 5634 14819 24456 29274 20393 8273 707 7000
4286 7000 16149 18183 10918 -1483 -10597 -3325 -947 3446 -7464 -12153 -12392 -20699 -16909 -16536 -8832
4271 -8832 6670 8584 6248 -3947 -8499 -8986 -14624 -24943 -44076 -48178 -34323 -19509 -4841
$$ packed form
4374a1345N713R573k336q043l579L472M811J0769o1j17K3N557Q584k1651o00J650
4358B420j857j9429K429P665O933O284m046l124l75J765J2836J4205o822o347
4344A2537l569m132n304r096m158J0582k089j848p463R17m206n795L237M906J2406
4329c075l770j0219J2806O785k749r188O06R290J2055k837l406J1653j80j8400
4315f29o493L424O49N809J4957J5912L01k1205n485j3343M644N83k327j526p561
4300a2290L918m455j3214K058J3584J2484L549R185R637M818q881j2120p566O293
4286G000R149K034p265j2401r114P272K378M393j0910m689k39q307L790L73P704
4271h832J5502J914k336j0195m552m87n638j0319j9133m102J3855J4814J4668
$$ plain form
4258 -4841 6735 3740 11292 3572 4874 -918 -29967 -27220 -17773 -10584 -8172 -14633 -18768 -11319
4244 -11319 -2352 -7932 -6841 -4327 40 -2517 -4360 3321 7668 13188 23415 31281 26229 18593
4230 18593 12289 15005 4109 1736 -2252 4922 5781 -2961 4353 7034 -1395 -5284 2277 8012 -921
4215 -921 -7569 -13154 -5212 5999 3937 8094 -2482 -12788 -7193 -9156 -12645 -805 -4469 -10235
4201 -10235 -11378 -5129 -1082 -3147 -9746 -16959 -35355 -41136 -26958 -11466 -3681 5347 1058 -11066
4187 -11066 -15702 -12260 -10591 -5285 4850 1002 -6665 -4716 -4594 -3492 10022 17017 13775 27041
4173 27041 17168 17949 8953 9197 18310 4756 -3938 17185 18769 -285 -20303 -28799 -24339 -22457
4159 -22457 -28973 -28369 -22145 -8422 -18304 -15890 -6911 -13045 -17934 -17036 -15002 -11258 -4703 13020 12432
$$ packed form
4258d841J1576k995P552p720J302n792k9049K747R447P189K412o461m135P449
4244a1319Q967n580J091K514M367k557j843P681M347N520J0227P866n052p636
4230A8593o304K716j0896k373l988P174Q59q742P314K681q429l889P561N735q933
4215i21o648n585P942J1211k062M157j0576j0306N595j963l489J1840l664n766
4201a0235j143O249M047k065o599p213j8396n781J4178J5492P785R028m289j2124
4187a1066m636L442J669N306J0135l848p667J949J22J102J3514O995l242J3266
4173B7041r873P81q996K44R113j3554q694K1123J584j9054k0018q496M460J882
4159b2457o516O04O224J3723r882K414Q979o134m889Q98K034L744O555J7723n88
$$ plain form
4144 12432 -1553 -6893 1696 3389 3676 4584 16177 37782 28877 2420 2320 2037 -17501 -20343
4130 -20343 -30800 -30682 -14366 -6699 -2314 -9183 -17866 -4795 7088 6636 10931 13734 5445 -4197
4116 -4197 -3976 -9318 -7977 -5261 -6654 -2503 3394 -2622 -10068 -11695 -11213 -10988 -4796 4504 14547
4101 14547 17838 21307 7861 -3027 -6183 -6608 -7950 -13452 -10921 -7400 -9494 -17183 -17098 -22195 -30253
4086 -30253 -26110 -9346 4721 5978 -9814 -21224 -12561 -19420 -18042 -11777 -13518 -10322 -1830 3920
$$ packed form
4144A2432j3985n340Q589J693K87R08J1593K1605q905k6457j00k83j9538k842
4130b0343j0457J18J6316P667M385o869q683J3071J1883m52M295K803q289r642
4116d197K21n342J341K716j393M151N897o016p446j627M82K25O192R300J0043
4101A4547L291L469j3446j0888l156m25j342n502K531L521k094p689Q5n097q058
4086c0253M143J6764J4067J257j5792j1410Q663o859J378O265j741L196Q492N750
$$ [...]
##END NTUPLES=NMR SPECTRUM
##END=
