##TITLE=Analysis number 324760
Compound Code cc 60613
Book Reference 486/82
Project Code adrs
Chemist Name simons
##JCAMPDX= 6.0         $$ Bruker NMR JCAMP-DX V2.0
##DATA TYPE= NMR SPECTRUM
##DATA CLASS= NTUPLES
##ORIGIN= Bruker BioSpin GmbH
##OWNER= nmr
$$ XWIN-NMR		Version 3.5
$$ Thu Nov 30 11:31:25 2006 GMT Standard Time (UT+0h)  MAYBRIDGE\nmr@NMR_250MHZ
##.OBSERVE FREQUENCY= 250.131544655141
##.OBSERVE NUCLEUS= ^1H
##.ACQUISITION MODE= SIMULTANEOUS (DQD)
##.ACQUISITION SCHEME= undefined
##.AVERAGES= 16
##.DIGITISER RES= 18
##SPECTROMETER/DATA SYSTEM= dpx250
##.PULSE SEQUENCE= zg30
##.SOLVENT NAME= CDCl3
##.SHIFT REFERENCE= (INTERNAL, CDCl3, 0, 16.522)
##AUDIT TRAIL= $$ (NUMBER, WHEN, WHO, WHERE, WHAT)
$$ ##TITLE= Audit trail, XWIN-NMR		Version 3.5
$$ ##JCAMPDX= 5.01
$$ ##ORIGIN= Bruker BioSpin GmbH
$$ ##OWNER= nmr
$$ C:\u/data/dgb/nmr/ADRS/1540/pdata/1/auditp.txt
$$ ##AUDIT TRAIL=  $$ (NUMBER, WHEN, WHO, WHERE, WHAT)
(   1,<2006-11-30 11:30:57.89 +000>,<MAYBRIDGE\nmr>,<NMR_250MHZ>,
      <created by zg, POWCHK disabled, PULCHK disabled
       configuration hash MD5:
       49 4B E0 1D 92 C2 6B 37 9F E6 65 BC 52 41 86 1D
       data hash MD5: 64K
       22 37 D9 C4 3D 95 ED 0E 77 CF C5 60 CD E1 5F 6E>)
(   2,<2006-11-30 11:31:12.77 +000>,<MAYBRIDGE\nmr>,<NMR_250MHZ>,
      <Start of raw data processing
       ef LB = 0.3 FT_mod = 6 PKNL = 1 SI = 32K 
       data hash MD5: 32K
       C1 76 14 5C EA 0B 26 18 5F CC 27 69 4E E4 EE 4C>)
(   3,<2006-11-30 11:31:14.61 +000>,<MAYBRIDGE\nmr>,<NMR_250MHZ>,
      <apk 
       data hash MD5: 32K
       9B 69 E6 77 68 33 64 B9 C0 ED E7 A4 DC 13 AE D3>)
(   4,<2006-11-30 11:31:15.41 +000>,<MAYBRIDGE\nmr>,<NMR_250MHZ>,
      <abs ABSG = 5 
       data hash MD5: 32K
       33 64 18 15 E6 DF 10 DE 00 4E 14 81 AC AD EC 77>)
$$ ##END=
$$ 
$$ hash MD5
$$ E5 B4 18 C1 2B 60 CD 5E 64 76 F5 BA AD 3D 75 7A
##$RELAX= 
##$RELAX= 
##$RELAX= 
##$RELAX= 
##$RELAX= 
##$RELAX= 
##$RELAX= 
$$ Bruker specific parameters
$$ --------------------------
##$DU= <C:\u>
##$EXPNO= 1540
##$NAME= <ADRS>
##$PROCNO= 1
##$TYPE= <nmr>
##$USER= <dgb>
##$AMP= (0..31)
100 100 100 100 100 100 100 100 100 100 100 100 100 100 100 100 100 100 
100 100 100 100 100 100 100 100 100 100 100 100 100 100 
##$AQSEQ= 0
##$AQ_mod= 3
##$AUNM= <au_zg>
##$AUTOPOS= <16 >
##$BF1= 250.13
##$BF2= 250.13
##$BF3= 250.13
##$BF4= 250.13
##$BF5= 500.13
##$BF6= 500.13
##$BF7= 500.13
##$BF8= 500.13
##$BYTORDA= 1
##$CFDGTYP= 0
##$CFRGTYP= 5
##$CHEMSTR= <none>
##$CNST= (0..31)
1 1 145 1 1 1 1 1 1 1 1 1 1 1 1 1 1 1 1 1 1 1 1 1 1 1 1 1 1 1 1 1 
##$CPDPRG= <>
##$CPDPRG1= <>
##$CPDPRG2= <>
##$CPDPRG3= <>
##$CPDPRG4= <mlev>
##$CPDPRG5= <mlev>
##$CPDPRG6= <mlev>
##$CPDPRG7= <mlev>
##$CPDPRG8= <mlev>
##$CPDPRGB= <>
##$CPDPRGT= <>
##$D= (0..31)
0 1 0 0 0 0 0 0 0 0.06 0 0 0 0 0 0 0.0002 0 0 0 0 0 0 0 0 0 0 0 0 0 0 
0 
##$DATE= 1164886256
##$DBL= (0..7)
120 120 120 120 120 120 120 120 
##$DBP= (0..7)
150 150 150 150 150 150 150 150 
##$DBP07= 0
##$DBPNAM0= <>
##$DBPNAM1= <>
$$ [...]
##$SUBNAM6= <"">
##$SUBNAM7= <"">
##$SUBNAM8= <"">
##$SUBNAM9= <"">
##$SW= 20.6930455092707
##$SWIBOX= (0..15)
0 0 3 0 0 0 0 0 0 0 0 0 0 0 0 0 
##$SW_h= 5175.983436853
##$TD= 65536
##$TD0= 1
##$TE= 295.16
##$TE2= 300
##$TE3= 300
##$TEG= 300
##$TL= (0..7)
0 120 120 120 120 120 120 120 
##$TP= (0..7)
150 150 150 150 150 150 150 150 
##$TP07= 0
##$TPNAME0= <>
##$TPNAME1= <>
##$TPNAME2= <>
##$TPNAME3= <>
##$TPNAME4= <>
##$TPNAME5= <>
##$TPNAME6= <>
##$TPNAME7= <>
##$TPOAL= (0..7)
0.5 0.5 0.5 0.5 0.5 0.5 0.5 0.5 
##$TPOFFS= (0..7)
0 0 0 0 0 0 0 0 
##$TUNHIN= 0
##$TUNHOUT= 0
##$TUNXOUT= 0
##$USERA1= <user>
##$USERA2= <user>
##$USERA3= <user>
##$USERA4= <user>
##$USERA5= <user>
##$V9= 5
##$VALIST= <valist>
##$VCLIST= <CCCCCCCCCCCCCCC>
##$VD= 0
##$VDLIST= <DDDDDDDDDDDDDDD>
##$VPLIST= <PPPPPPPPPPPPPPP>
##$VTLIST= <TTTTTTTTTTTTTTT>
##$WBST= 1024
##$WBSW= 4
##$XGAIN= (0..3)
0 0 0 0 
##$XL= 0
##$YL= 0
##$YMAX_a= 307928
##$YMIN_a= -363830
##$ZGOPTNS= <>
##$ZL1= 120
##$ZL2= 120
##$ZL3= 120
##$ZL4= 120
##$ABSF1= 16.522
##$ABSF2= -4.171173
##$ABSG= 5
##$ABSL= 3
##$ALPHA= 0
##$AQORDER= 0
##$ASSFAC= 0
##$ASSFACI= 0
##$ASSFACX= 0
##$ASSWID= 0
##$AUNMP= <proc_1d>
##$AZFE= 0.1
##$AZFW= 0.1
##$BCFW= 0
##$BC_mod= 0
##$BYTORDP= 0
##$COROFFS= 0
##$CY= 12.5
##$DATMOD= 1
##$DC= 0
##$DFILT= <>
##$DTYPP= 0
##$F1P= 14.0000005364418
##$F2P= -0.99999901652339
##$FCOR= 0.5
##$FTSIZE= 32768
##$FT_mod= 6
##$GAMMA= 0
##$GB= 0
##$INTBC= 1
##$INTSCL= 1
##$ISEN= 128
##$LB= 0.3
##$LEV0= 0
##$LPBIN= 0
##$MAXI= 10000
##$MC2= 0
##$MEAN= 0
##$ME_mod= 0
##$MI= 0
##$NCOEF= 0
##$NC_proc= -3
##$NLEV= 6
##$NOISF1= 0
##$NOISF2= 0
##$NSP= 0
##$NTH_PI= 0
##$NZP= 0
##$OFFSET= 16.522
##$PC= 1
##$PHC0= 219.959
##$PHC1= 8.804337
##$PH_mod= 1
##$PKNL= yes
##$PPARMOD= 0
##$PSCAL= 4
##$PSIGN= 0
##$REVERSE= no
##$SF= 250.13
##$SI= 32768
##$SIGF1= 0
##$SIGF2= 0
##$SINO= 400
##$SIOLD= 32768
##$SREGLST= <1H.CDCl3>
##$SSB= 0
##$STSI= 32768
##$STSR= 0
##$SW_p= 5175.98343685301
##$SYMM= 0
##$S_DEV= 0
##$TDeff= 65536
##$TDoff= 0
##$TI= <Analysis number 999999
Compound Code 99
Book Reference 9
Project Code 9>
##$TILT= no
##$TM1= 0
##$TM2= 0
##$TOPLEV= 0
##$USERP1= <user>
##$USERP2= <user>
##$USERP3= <user>
##$USERP4= <user>
##$USERP5= <user>
##$WDW= 1
##$XDIM= 32768
##$YMAX_p= 303212605
##$YMIN_p= -58039
$$ End of Bruker specific parameters
$$ ---------------------------------
##NTUPLES= NMR SPECTRUM
##VAR_NAME=  FREQUENCY,     SPECTRUM/REAL,   SPECTRUM/IMAG
##SYMBOL=    X,             R,               I
##VAR_TYPE=  INDEPENDENT,   DEPENDENT,       DEPENDENT
##VAR_FORM=  AFFN,          ASDF,            ASDF
##VAR_DIM=   32768,         32768,           32768
##UNITS=     HZ,            ARBITRARY UNITS, ARBITRARY UNITS
##FACTOR=    0.157963299565203, 1,           1
##FIRST=     4132.6476996994, 0,             0
##LAST=      -1043.33573715361, 0,           0
##MIN=       -1043.33573715361, -58039,      0
##MAX=       4132.6476996994, 303212605,     0
$$ Real data points
##PAGE= N=1
##DATA TABLE= (X++(R..R)), XYDATA
$$ [...]
23484 14782 13620 22514 28925 24969 22154 6693 -12152 -16722 -10915 -13615 -13305 -25318 -24123 -9974
23470 -9974 -13509 -12433 1835 14141 9668 3958 3759 17721 17918 11834 1383 -6328 -13829 -22566
23456 -22566 -7251 -9935 -16491 3277 24228 24580 11379 2025 -5479 -11203 -11803 -9359 -11022 -2602
23442 -2602 4738 3413 7310 6501 6902 8873 6525 1459 1282 3801 -9012 -23932 -32400 -37733 -27979
23427 -27979 -14296 -6883 -14217 -9056 823 10072 5132 1766 -7561 1515 4925 -4465 -602 15140
23413 15140 16996 11311 12972 6191 3300 3744 -16599 -20634 -5965 -719 2813 116 -1238 -4693
23399 -4693 -12065 -14157 -1572 -5773 -10453 -14499 -8220 -7639 -7266 3241 10647 4098 -11457 -16840
23385 -16840 -18452 -8580 -245 4926 14347 13796 9004 21942 3163 -18407 -7539 2937 7103
23372 7103 9511 -2753 5670 2027 201 6905 -1752 -17991 -10819 -5621 -2434 5582 1887 13514
23358 13514 4919 -1003 9166 19368 13676 7758 -8707 -8229 -13646 -19393 -7156 -6371 -7855 7228
23344 7228 10563 11675 18538 22530 22980 8887 9677 16571 8407 7339 -5218 -243 5802 5339 330
23329 330 -1181 -9172 -3933 12131 29242 21095 -7736 -15489 -6503 5962 10836 -4430 -17593
23316 -17593 -20561 -19719 -19183 -11762 6523 7433 16638 16623 19385 10970 0 -2187 105 -7603 -9531
23301 -9531 -9184 -1759 8290 12709 15805 4765 -7983 -15445 -13011 -5160 3625 -7652 -6335 -4499
23287 -4499 -5292 -1604 8773 995 -17557 -17826 -1919 1292 7195 23008 22733 9735 10309 7121
23273 7121 -2293 -3700 7420 12530 5072 -9725 -11197 -13293 -21995 -7677 3647 -1401 -12233
23260 -12233 -22719 -21284 -18296 -21380 -14424 -313 -6259 -15635 -9951 -4224 -13803 -19591 -34077 -38708
23246 -38708 -32128 -16356 -1489 1761 -6779 -9837 -16374 -21343 -30727 -35449 -34933 -35805 -30796 -8361
23232 -8361 -1659 -6178 -1179 -4351 -14676 -14847 -19896 -11861 -6840 -10068 -12625 -6655 6551 12828
23218 12828 4746 -5735 -8768 1561 -5639 -16573 -24347 -22920 -17461 -15702 -4122 -5131 -9134
23205 -9134 -7831 3092 -3057 -13159 -19388 -9559 4416 3158 -535 -12709 -11893 4265 5000 5931
23191 5931 7809 1058 2436 -4606 -26691 -29088 -22506 -16131 -15606 -40043 -35808 -7675 -799 -2996
23177 -2996 -5131 -12844 -10002 -4830 -4930 3266 -9256 -23825 -14587 -9015 -901 3950 1858 -768
23163 -768 2330 -2119 -446 -186 788 -2682 -5875 -11730 -21326 -7430 -5817 -9959 -2779 -12317 -14648
23148 -14648 -15007 -7953 -8246 -7080 -5041 -1548 -3583 -6133 -3653 -16007 -18069 -7176 -9445 -17780
23134 -17780 -12650 375 14822 14274 8770 2776 -1746 1403 -7626 -12653 -3588 -14279 -24087 -12757
23120 -12757 -9032 -16810 -13525 -10386 -10571 -5966 1314 14989 7485 -10824 -13933 -19088 -26276 -22412
23106 -22412 -5556 -6237 -9870 -7982 -12471 -8063 -5183 -11960 -1099 10264 465 -19012 -27033 -27475
23092 -27475 -20848 -9888 10228 11083 11513 7146 13195 23384 18866 12988 9390 2086 -3347 7745
23078 7745 9010 -1257 -3040 -3535 -5088 -5727 -8113 -5301 1085 18923 13436 3747 -6746 -14336
23064 -14336 -19764 -15924 -6892 -6698 -15942 -10905 -16502 -11511 -3238 -10010 -20118 -17523 -10239 -9001
23050 -9001 -11012 1415 4044 9057 12801 19918 20605 -11205 -15750 2592 5893 16348 20752 23257
23036 23257 7687 20058 18879 8463 10956 15192 13603 7520 6812 9486 -2776 -4652 -2703 6460
23022 6460 6055 2249 6204 4923 5442 -1119 -2731 2993 -11009 -17629 -2948 5366 -4991 -11230
23008 -11230 2418 1916 -9525 -14888 -9107 -15059 -15069 -3367 1978 8063 705 -6278 4529 11422
22994 11422 10031 7625 3348 3585 5755 -4638 -13543 -8511 -12376 -16129 -1088 9587 14742 17781
22980 17781 22932 16983 8756 3152 7826 11886 14801 7238 -3169 2604 7435 13822 15633 11794
22966 11794 2407 -4970 -8139 -12454 -25613 -36044 -22511 -14755 -24498 -13103 -5296 -13782 -15867
22953 -15867 -9629 -1957 9888 25354 25125 14683 13899 7179 10284 26220 12334 41 8685
22940 8685 11038 2764 72 -1139 -199 1334 -7488 -12614 -2295 -3389 -15677 -746 5212 -3815
22926 -3815 -2676 11028 16752 17973 15780 -707 -14099 -26049 -20887 -18694 -10164 -9076 -7972 -3220
22912 -3220 10242 13211 -842 1366 -1455 -13480 -20710 -22508 -24642 -17445 -6545 3401 992 6605
22898 6605 18632 3768 -5669 -13369 -12571 -416 -2118 -6029 -8793 -9412 -7481 -17270 -15466 -9026
22884 -9026 -6116 -3730 -9307 -16015 -5193 2941 10021 6465 -3253 -583 8332 12126 2743 2442 2972
22869 2972 4947 4560 4957 829 -406 8676 14530 20939 24289 16664 7050 12353 26013 26467 2486
22854 2486 -1933 3205 1051 -709 -2 -5147 -1319 -1532 -2393 -4239 1857 -2429 -6124 -4977 -3020
22839 -3020 -636 8723 12066 -4486 -24152 -1639 14291 8231 708 2403 -6083 -24301 -28101
22826 -28101 -19675 -7468 -5360 -20726 -31393 -29123 -33843 -34191 -37511 -33216 -21803 -8196 -7407 -8496
22812 -8496 -18151 -18447 -11342 -3334 5414 -773 -6526 -284 2072 -13748 -14708 -9793 -14188 -22274 -11497
22797 -11497 -10977 -16048 -13940 -15373 -24398 -27168 -20792 -24937 -19759 -13626 -17461 -18633 -12943 -15218 -15488
22782 -15488 -6909 -20656 -23039 -18315 -6368 -12094 -11604 -7656 -6147 -17872 -20621 -6443 3057 5731
22768 5731 6803 3504 11016 10676 18304 26203 20949 9752 1976 -7589 -23076 -21599 -11334 -19234
22754 -19234 -27593 -22270 -5283 2981 2092 -7988 -22804 -25068 -12770 2530 12423 -2847 -7709
22741 -7709 -14343 -23727 -18690 -10490 -9502 -9134 -4385 557 -2993 -12101 -9713 999 -8020 -8301 566
22726 566 3273 3129 8834 11950 11405 9720 5444 -6007 -7955 -5697 -14563 -6306 593 3069 -6992
22711 -6992 -6648 2736 6774 11273 -7664 -15050 -9134 -506 2328 8515 -1711 -532 3559 10762
22697 10762 5383 -3998 -276 -6907 -10810 2422 975 -11212 -11257 -3786 14764 7630 2525 -3785
22683 -3785 -7044 -3518 -1130 -5031 -1923 2557 4369 -7398 -19630 -16157 -10030 869 18209 23174
22669 23174 20172 14905 17431 22634 11488 7291 -3203 -4014 -8522 -17884 -29168 -17391 -4515
22656 -4515 1162 3873 10473 14170 9781 6360 11001 17702 7930 -5033 -16511 -19956 -10004 12653
22642 12653 20165 8116 2975 -7345 -20447 -21571 -9326 -10657 -5330 -4393 -7402 -1986 4510 4639
22628 4639 9560 2091 -6526 -4645 -6 -1000 3931 8470 7000 1950 -4519 -13672 -12060 -19869 -15469
22613 -15469 -5702 3244 1352 -14491 -16879 -22056 -25253 -35946 -18902 12796 27082 26691 34998
22600 34998 19676 13690 30315 25177 6305 7400 -949 -18124 -32136 -44925 -48096 -47564 -37449
22587 -37449 -18619 -2252 9753 6018 -832 -3985 7362 11581 7121 9095 30250 32935 17478
22574 17478 1549 -5622 -7779 -3270 2166 10418 10408 4172 5337 9276 133 -11299 -10189 5607
22560 5607 5749 -10369 -22734 -17170 -10599 -2636 -12423 -26020 -17948 -6190 -2059 -3307 587 651
22546 651 1028 -6931 -1201 -2145 -7733 -4576 -2568 3388 11797 9869 18255 27793 23317 9208 5747
22531 5747 118 -8177 -1060 9428 -4708 -16030 -13092 745 8427 10203 15057 16381 3874
22518 3874 709 -3210 1982 12687 10372 -3707 -12243 -12123 -5165 7857 2976 -7061 -10042 -9445
22504 -9445 10355 19315 19194 18512 15931 -2163 -21915 -22982 -16726 -12880 -3459 -3234 391 -3400 4159
22489 4159 12275 1880 -6223 153 15088 21242 19287 17886 27567 20606 4090 4774 2774 -443
22475 -443 7325 -1076 4787 7669 11346 -1420 -10971 -19514 -31512 -28282 -16973 3244 7878 6990
22461 6990 13837 16303 26982 17285 -3953 -12145 -6385 1022 1023 -15237 -21265 -20165 -8212 1727
22447 1727 7325 7828 14658 -609 -11246 2517 7761 7317 19761 21790 2656 -5799 -21727 -16835
22433 -16835 -2925 1018 -149 -7067 -21058 -19600 -17616 -26260 -26142 -20054 -20469 -28733 -2130 -3212
22419 -3212 -15933 -15788 -11008 -14009 179 7147 -1342 -2052 2750 5971 9114 12878 9730 5059 11034
22404 11034 7178 9763 8151 15902 26169 14714 10790 5490 10691 17026 21741 4340 -10355
22391 -10355 -16668 -27360 -17226 -9089 -1795 -1286 -2964 -5174 -18386 -22810 -9735 13231 14381
22378 14381 -1985 -6977 -11653 -10356 -26569 -25536 -11306 -161 7894 5190 5395 5364 3725 -3920
22364 -3920 -22149 -28764 -13368 -2860 8519 14504 868 -90 412 -1398 3211 1620 -1004 -6714
22350 -6714 -2675 9337 5378 -973 -874 -8123 -3815 440 2174 13316 26206 26781 30163 13192
22336 13192 -1080 1810 -882 4171 9764 1571 -3855 -8989 -15190 -25703 -11995 2902 1570
22323 1570 1305 -2408 5872 2352 -9334 -2965 3899 995 -3939 -6180 -14012 -14156 -9573 -14440 -9700
22308 -9700 -5759 -13509 -10902 -590 -1892 2177 4759 8655 4967 13389 12572 13442 371 1092 -539
22293 -539 11201 19152 17947 -8403 -12964 -1333 -1942 986 13211 2655 -11208 -14587 -16703 -18035
22279 -18035 -16540 -29129 -31041 -26984 -15109 -11035 301 5543 -8349 5134 5581 1167 2240
22266 2240 -2870 -18862 -19495 -26375 -24707 -7336 2042 -10563 -6318 -4772 -8340 -29686 -39149 -34102
22252 -34102 -24602 -20789 -18588 -11054 -7010 -17248 -27632 -16990 -8861 -11029 -10911 -3408 -9631 -23104
22238 -23104 -16836 -9484 2949 12415 -2716 173 2273 5170 8132 3836 -9952 -21738 -28242
22225 -28242 -20226 -14512 -20925 -27332 -15920 -14620 -19417 -10805 -10005 -17892 -15888 -14362 -17246 -16184
22211 -16184 -21490 -34156 -35268 -29330 -17703 -14919 -7194 1885 6822 5852 -6616 -10265 -5676 -11143
22197 -11143 -22113 -36739 -40415 -20378 -9959 -13670 -12050 -23016 -29466 -26256 -18567 -10206 -5058
22184 -5058 4948 18002 34122 17385 -2198 2965 1358 -14976 -26986 -9981 4879 9347
22172 9347 -3649 -15973 -16148 -1954 -2146 -9634 -6252 -4512 7546 4134 9750 14047 6698 1870
22158 1870 -3551 -15557 -22924 -16404 -4871 -10632 -19042 -27605 -37486 -27581 -17534 -16553 -5904 -9011
22144 -9011 -21045 -18624 -15370 -15594 -2559 -11896 -8093 3092 7889 13803 7883 5123 1765 -14664
22130 -14664 -9129 -4864 -4045 -4937 -6921 -13330 -14718 -10157 5635 18234 16232 17526 30788 40029
22116 40029 25173 28244 28667 19078 6899 -3859 279 -4966 -17584 -15912 1037 1574 -1935 -3205
22102 -3205 -16499 -15835 -5710 253 7235 29432 45343 31945 9991 2517 -664 -12067 -16539
22089 -16539 -23436 -10590 -7101 -1202 -8790 -13584 2350 -5500 -7680 -3248 4867 4448 8154 -373
22075 -373 -7246 -7734 -3386 -4848 -10386 -15639 -3380 -688 -18968 -30967 -29429 -11846 -5165 3757
22061 3757 -1714 -8068 -2377 1396 8324 960 5681 6636 -1715 -18418 -26135 -16151 -16428 -11047 -8243
22046 -8243 -17112 -19347 -20973 -18681 -8706 -9396 -8702 -14623 -1869 2430 4666 3508 16295 28324
22032 28324 24844 7959 10062 6755 4742 12282 10039 190 -4666 -5080 -441 4970 -3342 243
22018 243 37 -3433 -4361 -2855 -9428 -2653 17841 5478 90 -2458 -11982 -14287 6117 11819 -583
22003 -583 -13645 -23910 -25228 -11596 141 4968 2573 8789 8011 8269 10380 4848 -4844 1546
21989 1546 6157 262 1257 1198 3796 -2316 -2726 -11105 -13795 -21245 -22272 -20591 -22594 -25413 -9410
21974 -9410 1055 4621 -3615 7915 6632 -4738 -5006 -5123 -10226 -12021 -3231 944 -947 2745
21960 2745 8144 23013 20779 11582 -3505 -6090 -12604 -17038 -25894 -23404 -17878 -21005 -17371 -3721
21946 -3721 408 6150 4504 9832 4232 769 -682 -9395 -17486 -14447 -10455 -20786 -38392 -34544
21932 -34544 -32019 -40986 -35410 -21752 -20420 -18490 -13918 -13146 1265 10662 4010 2484 -3528 6166
21918 6166 16745 17818 8414 -16527 -34157 -23769 -8994 -13930 -18745 -24261 -9095 -4858 -4554
21905 -4554 -11889 -7650 3428 798 8117 21201 30424 22862 24249 21566 8458 5284 7958 11219
21891 11219 14320 27377 25025 6520 1618 6855 -545 -1539 -6898 -3772 330 -1838 -3974 917
21877 917 7840 5330 -23 1207 9386 17203 29212 30930 22156 4357 -2060 -7973 -15266 -11291
21863 -11291 -7371 -13004 -23039 -23913 -20990 -17262 -24395 -5405 -2220 3853 3230 351 -3978 -15328
21849 -15328 -18086 4224 12435 2836 -2146 -1512 -1443 -479 10129 4039 -4747 -12060 -28866 -37263 -32340
21834 -32340 -20986 -9497 -11843 -9720 6125 9451 11296 12796 16133 -1566 -7997 1907 -1184
21821 -1184 -16202 -21178 -16143 -1278 6679 17215 15032 300 2476 -36 7338 8215 3493 -801
21807 -801 -3782 -961 605 -11412 -22076 -20421 -5929 -9375 -5627 469 -8108 -13299 -10725 -12622
21793 -12622 -10531 -27893 -39112 -33908 -22060 -13561 3303 10077 8605 1377 8208 4017 4162 -244
21779 -244 -5033 -17210 -21901 -9117 -5747 -7895 -14173 -15681 -9742 -13474 8540 13554 13360 19494
21765 19494 3377 -5204 -5953 -5742 1897 9968 5204 5784 -2918 -16689 -5238 904 -4510 1231
21751 1231 5454 -1796 -15358 -17638 -5113 -6936 -3970 3274 7044 -4097 -16448 -10098 2004
21738 2004 1779 1769 -8296 1339 5439 10100 -1051 1060 4312 -12463 -23741 -25094 -17443 -9993
21724 -9993 6354 -1615 -11949 -12059 -2713 4357 2813 5651 1190 -6950 -12094 -5777 -17635 -22436
21710 -22436 -32046 -24105 -11669 -9339 -6047 4847 13680 10924 1715 -3006 -16201 -22443 -9807
21697 -9807 130 6649 9689 14602 6880 4231 6175 1617 -11670 -4785 -5327 -4543 -20201 -24806 -12102
21682 -12102 -5471 -7219 -18160 -7081 -13239 -18783 -14270 -9818 1267 9493 2670 -9912 -19479
21669 -19479 -28598 -19216 -7187 13242 10623 -6678 -10502 -15061 -14810 -9799 -13648 -14153 -14532 -7270
21655 -7270 -5421 -15679 -21814 -8128 -4313 -3671 16 -3573 -7957 -7109 -3700 -2981 482 804 -15286
21640 -15286 -23518 -26430 -22638 -32401 -35534 -21705 -7387 3215 -392 -29408 -34119 -20084 1071
21627 1071 7879 3444 -3765 -9523 -10896 -19527 -31302 -26808 -19814 -19746 -23520 -14911 -4182 -1943 -2968
21612 -2968 8625 18985 4863 439 -2100 -11835 -22170 -16277 276 18917 24723 18162 6381
21599 6381 15889 17351 10478 -12917 -32005 -32493 -23506 -20517 -24639 -28815 -22498 -15087 -18928 -19886 -20518
21584 -20518 -24856 -22388 -25747 -24333 -19041 1913 13235 3879 -9774 -13742 -18626 -5588 -17826
21571 -17826 -14447 4708 -2296 -10284 -2445 4515 1809 -2755 -5830 -3401 -2878 -15168 -16692 -18403
21557 -18403 -16727 -11551 -13094 -12361 -13588 -12707 -15747 -29374 -28172 -15450 -23549 -37117 -28254 -22126
21543 -22126 -13840 -26140 -45174 -44945 -28656 -15113 -7321 3640 3438 -979 -473 -2477 13118 20057
21529 20057 20548 27625 17911 19412 12173 16317 18151 9495 1459 -2506 -14417 -13640 -12957 -9227 -2779
21514 -2779 -13104 -26414 -28606 -18610 -17593 -18861 -19220 -22251 -18269 -10743 -11261 -8982 -5786 -14693 -16875
21499 -16875 -7399 -8681 -15271 -19449 -15611 -9910 -12612 -5934 -4357 3621 -3738 -10556 -7618 -5550
21485 -5550 -11772 -8976 1707 9318 9811 8802 13626 11993 -5970 -308 21202 21147 4741 -4535
21471 -4535 -247 10907 9982 3856 11430 15284 9597 1321 -10100 -13434 -9043 -3881 -4298 -10676 -11462
21456 -11462 -13244 -8144 -4156 2264 8935 10134 2385 -13483 -7376 9590 13901 5776 9123 20359
21442 20359 21351 11376 7986 6383 -8522 -24468 -23705 -17799 -8726 -11763 -10179 -16032 -12606 -20304
21428 -20304 -22995 -20774 -22912 -14121 -23608 -29249 -22648 -13401 -5000 -2551 2117 9186 -3272 -14009
21414 -14009 -22183 -10808 -2559 -9675 -11868 -18715 -28824 -22289 -26362 -23729 -14317 -10781 2331 15599
21400 15599 14511 1238 -4233 -16051 -12740 2679 8821 5440 700 -1513 -10934 -8814 -3216 967
21386 967 -9436 -2115 16232 10703 4919 12611 11141 6101 -4036 6781 8919 8123 10581 10022
21372 10022 -2384 3908 8330 -321 5010 -1961 -3046 -4726 -15297 -20792 -5334 1515 14343
21359 14343 12564 6003 5336 1828 3183 -3816 -10770 -7630 -6261 -10171 -7045 -3287 -7774 -5852 -5724
21344 -5724 -13590 -28625 -18653 -6169 16888 10510 4588 19858 19144 1785 6245 20440 11876
21331 11876 9544 9821 16021 7139 14359 20267 17097 4937 -5219 -15649 -15556 -3100 10484 17356
21317 17356 18022 16764 7506 2208 10318 8501 9041 12870 13952 10741 6124 -1483 -6718 -6001 -721
21302 -721 5633 16725 5017 -7291 -2852 -1955 794 -2257 -6802 -17584 -30034 -17804 -4539
21289 -4539 -7563 -5059 2524 -5004 -10364 3554 12454 12917 9334 6652 15381 8665 11600 8531 4935
21274 4935 -3726 -2091 -3699 -12738 -3554 -6312 1725 2760 2584 -7648 -3423 10393 8462 -9815
21260 -9815 -20735 -23400 -18909 -11224 -24141 -4845 -2344 -5892 4332 6099 6942 -4361 -13119 -3949
21246 -3949 2537 1091 6641 15601 21592 25531 29128 17092 16733 9610 -7155 -9797 -2669 -10114
21232 -10114 -10760 -16433 -30167 -30489 -24559 -13499 -3752 -1478 -9208 -15672 -11203 395 -1219 -8796
21218 -8796 -8871 6762 -1155 -23465 -26694 -25206 -25296 -12543 -4986 -1602 5261 12323 14016 7407 -1657
21203 -1657 -9165 -18179 -15671 -7049 -6158 -14896 -18642 -22201 -10272 -2084 -14751 -22136 -24527 -19364
21189 -19364 -18121 -28098 -30933 -17984 -6375 -7255 -11213 -10039 -8136 -12510 -4756 4985 17321 12096
21175 12096 5031 -7378 -1827 8430 222 14612 21447 9070 -1327 -4001 10624 -554 -16974
21162 -16974 -13730 -6044 529 -5468 -10373 -18942 -17324 -8397 -13712 -18101 -15548 -9730 -14540 -18932
21148 -18932 -12276 1760 776 -14987 -19354 -18791 -9880 756 17528 11118 2916 12647 15732 18983
21134 18983 12228 3912 2389 -3877 -4542 -4524 -6728 -3462 744 -8756 -15112 -19535 -16598 -1992 4132
21119 4132 8120 -605 -2765 1434 11654 10095 14395 13422 18607 14729 8258 3994 13188 11223 -95
21104 -95 -6631 -5194 -4534 3401 9708 9017 -3512 -4074 2377 12406 10163 3720 -817 -4195 -11052
21089 -11052 -14128 -19418 -20112 -5080 4558 5276 1721 -3596 -5310 5828 -3586 -11222 475 8684
21075 8684 1542 3122 -116 5444 3633 7590 2719 -447 -2375 -2742 -4582 -9514 -16584 -21909 -6449
21060 -6449 5596 8735 7840 1117 -3260 2345 2493 66 6803 6270 -9214 -4812 4427 13807 14377
21045 14377 7489 -11017 -12413 -2665 -1418 12768 12250 16902 19255 4128 6258 1963 7270 4568
21031 4568 5212 -6222 -19021 -9863 -4792 -7782 -24088 -31832 -25997 -8070 -2951 2540 -3971 -28594
21017 -28594 -19347 -1383 3333 -365 -933 -11783 -4472 5874 5106 1663 10918 16993 19762 11834
21003 11834 4284 -609 -9373 -13845 2144 6319 1057 3145 -5019 -9683 -1067 2293 6534 2138
20989 2138 -2081 -6079 -6434 -7100 -6272 -10034 -18459 -22631 -15717 -15165 -10012 -3214 1358 11400 14988
20974 14988 13528 7659 -7096 -4651 -2615 1430 -1571 1930 2746 -8208 -12616 -7241 -9655 1313
20960 1313 10249 1020 2805 8865 13498 1118 -10336 -8397 -4821 -362 -12998 -23913 -19749 -25004
20946 -25004 -18370 -222 -2764 -8031 -10735 -12076 -25408 -12657 -6751 -3111 -1281 -116 -3841 -14472
20932 -14472 -26566 -30859 -30045 -18430 -4363 -15058 -10404 -909 1461 1913 -6685 -8589 -11318 -5210
20918 -5210 -10131 -3654 559 14187 8123 -2276 -2172 -436 431 3805 5748 -1774 -24242 -24750 -21918
20903 -21918 -23472 -15693 -10395 -11001 -1168 -3559 -17339 -22242 -27255 -22604 -15130 -15042 -20381 -10821 1882
20888 1882 8262 14535 17670 15248 2204 -622 2190 5399 6837 2739 5416 -534 -6468 -9808
20874 -9808 -785 6901 -899 -22357 -21525 -13062 -5108 5232 1746 -3027 3188 -3305 -12272 -13542
20860 -13542 -2345 2252 -14150 -27744 -30381 -14567 -10560 -11037 -868 -1106 2098 4699 4620 10781
20846 10781 3998 -13098 -11381 -7188 -11819 -7439 -23096 -43379 -34635 -18935 -1016 17632 30141
20833 30141 37258 19566 3669 6485 13203 28809 19514 3064 -2002 7848 10752 -6536 -13043
20820 -13043 -18072 -15122 -24966 -24458 -26590 -28571 -23217 -11655 -7317 -14108 -13287 1175 8889 -4889
20806 -4889 -4402 -2473 -10222 -19475 -11769 2575 21357 23081 14845 5229 2972 11094 11516 11552 11460 16964
20790 16964 10586 -10165 -19655 -9403 -10143 -18942 -11912 1400 -2507 -4638 -14977 -9174 -1374 -2994
20776 -2994 -12349 -17703 -4749 18618 15983 2685 10017 26291 19817 15368 17247 -4469 -7045
20763 -7045 -3122 -3551 -6568 -17699 -19118 -23214 -12298 -11553 -11271 -195 9090 12362 5969 3398 -6760
20748 -6760 -5654 -1735 732 -3163 -590 4 -3590 -5051 -11215 -22333 -6220 1611 -4880 -11445
20734 -11445 -15660 -24247 -30467 -1893 11479 7522 1684 -3676 -16633 -22251 -22472 -12913 -14213 -28488
20720 -28488 -24247 -34198 -24050 -12017 -7616 14129 15713 -161 -13686 -15600 3029 11952 -1251
20707 -1251 8954 24509 30115 26088 22185 31317 15028 -6310 -9468 1979 7576 -10 -10663
20694 -10663 -1466 16545 14673 20402 20846 14885 -7099 -2906 136 -10293 -21866 -14453 9254
20681 9254 18463 15506 12216 13094 9239 7388 -3406 -11485 -22740 -13122 4193 -788 -8808 -14847
20667 -14847 -20181 -13640 -15210 -19810 -16725 -22427 -19404 -14119 -9153 -11424 -5638 -4815 -10825 -15122 -14363
20652 -14363 -5331 -14615 -9375 3384 -2061 -9866 -14493 -9583 7076 10635 -104 -12100 -8636
20639 -8636 -7733 -8249 -20461 -15291 -4662 -4524 2336 12849 23718 11976 8499 -6351 -12008 -10561
20625 -10561 8133 23870 20140 -4808 -12637 -17140 -16683 -29802 -34966 -21651 -8000 -14005 -8734
20612 -8734 64 3539 7739 -7891 -14380 -14851 -7898 351 1433 6816 8960 5055 -2392 -14246
20598 -14246 -14928 -5829 -2134 -4586 -2704 434 -9134 -19688 -3285 -10937 -15908 -12679 1938 -1475
20584 -1475 -14401 -30044 -17430 -7276 2408 4659 11847 6868 3540 -7863 6258 20139 12771
20571 12771 5132 8549 -957 -5944 -16278 -5170 -3810 -18955 -15136 -8447 -6361 -17241 -9763
20558 -9763 -12844 -6559 -9521 -5167 -6687 -5023 -3426 -4522 15497 22707 12463 4880 -4688 7237
20544 7237 17902 13730 12207 2449 -4513 1086 5428 467 -1036 10710 3889 -777 2426 3929
20530 3929 436 -6569 -7280 -4762 -13566 -34268 -24797 -20161 -9518 -2902 1353 -14921 -25589 -13793
20516 -13793 -7395 -13984 -8197 2210 10941 14684 4971 -299 -2886 -7744 -8616 10198 6313 -3113
20502 -3113 -9321 -11751 -10611 -15927 -17324 -9021 -10363 -16501 -14719 -6280 -4875 -4965 2324 148 -3981
20487 -3981 -1914 13214 8569 2701 616 -8558 -19593 -27240 -15339 -10767 -1496 7205 11886 20561
20473 20561 20807 7111 -7960 -25965 -35329 -20722 -21085 -16397 1352 6053 1380 2388 490 2765
20459 2765 3339 -1702 3200 10507 2339 -9410 -447 -3050 8252 2883 3225 9856 20893 24706
20445 24706 17413 -4181 -1116 16154 14239 4161 7557 5045 -4516 -9456 -10147 -2821 18321 29376
20431 29376 27512 32471 28507 9250 -13945 -18097 267 9830 1718 2920 8820 -605 5460 7466
20417 7466 319 2070 -11142 -16498 -14795 -3237 -9724 -5899 8585 13726 13761 5918 10410 593
20403 593 -5431 -5581 3424 18485 17366 10466 543 -10565 -13936 -16533 -13437 -3623 5369 2271 -3772
20388 -3772 -10211 10001 14533 11668 10811 15501 3323 -1642 -14690 -18780 -12074 -14121 -10718 7325
20374 7325 17604 -4306 -17486 -14325 -4208 -6013 -12739 -8693 -19288 -13740 -9682 6150 5898
20361 5898 -1360 1867 -237 4099 17251 16486 4193 6964 10461 8721 14521 9161 2364 3670
20347 3670 5409 383 -9086 -14113 -17870 -21920 -23321 -19570 -7595 -20648 -29181 -38454 -35360 -21505
20333 -21505 -12230 -19557 -30444 -23713 -1940 2526 -8913 -15939 -10817 -8191 -6715 -4403 -23133
20320 -23133 -29031 -31364 -38037 -32711 -14376 1203 9297 17681 16063 363 797 1459 1778 52
20306 52 1663 13438 10794 2095 4523 4054 16355 13114 2947 5951 6082 -8216 -16262 -16158 2013
20291 2013 1657 -3229 -5748 -4495 -1439 -3752 -18179 -22235 -13137 -12408 -12261 -4636 3849 8347 3710
20276 3710 -1775 -4509 -17036 -5154 17510 5431 -9682 -5279 895 7539 -3160 -20469 -29571
20263 -29571 -30662 -24984 -21426 -20650 -8044 7319 6870 5878 5070 1349 -5361 -6506 60 -8103 -15003
20248 -15003 6216 26867 22712 17899 16854 12360 1240 -14186 -14829 -4505 -6748 -10125 -5302
20235 -5302 -8648 -8361 -1392 -14467 -26999 -16195 -7332 -15111 -5282 1692 -2339 -2837 -1084 -914 -13461
20220 -13461 -19415 -17160 -14108 -7523 6293 8668 11915 6524 6002 7609 -8179 -21281 -23591 -9438
20206 -9438 5160 5172 -3503 -9467 1356 6478 -2291 -7721 -5847 3738 -4518 -7920 -2990 8504
20192 8504 17943 25623 22533 29318 22457 17248 14113 11522 12198 -6570 -17920 -3252 1420 5715
20178 5715 8543 11296 11448 7557 2806 2906 22112 17182 9714 12933 14544 11611 2341 -5225 6414
20163 6414 5880 -144 -8790 -13354 -7107 -7138 410 3720 -1576 -7963 -965 -2643 -2167 -7832 -780 -8423
20147 -8423 -1136 -9330 -9736 -8000 4153 5753 -4861 -13397 -8307 1812 1548 -6860 3030 4132
20133 4132 -4517 8072 6391 14628 10624 9865 22101 26195 25355 10499 11168 7282 19418 25497
20119 25497 12031 -2257 4617 2558 8538 8319 8139 -5320 -8366 14574 11524 8 10188
20106 10188 7108 -5181 -9938 -3930 -939 8478 -3573 -1264 9760 6216 9974 -3074 6377
20093 6377 17086 17670 8809 14151 3643 -3950 -3539 -14054 -11311 -7100 -13116 -16841 -7276 624
20079 624 -10018 -20115 -11056 -3802 1551 6516 3561 -2060 4675 19955 19451 17932 14374 8346
20065 8346 6281 1115 -727 1024 4005 -5023 -4740 5422 9487 14020 18349 19713 10894 -4964
20051 -4964 -8094 -3673 -4091 -15242 2431 25555 24397 22395 11373 5818 -4897 680 13180
20038 13180 13084 16509 24038 23664 19622 21576 15771 18862 19908 23681 23686 27288 28009 27264 31229 28429
20022 28429 32783 41313 33187 19344 6913 12839 23901 27223 25669 26169 25134 24426 29916 15983
20008 15983 2555 15637 14265 29783 45732 58250 71715 82085 98031 113357 121290 157945
19996 157945 186292 207213 231996 245868 241025 249760 277685 306790 343284 379742 403696 414329
19984 414329 396765 369447 328366 309162 288262 278076 257320 238053 235222 226433 213348 187448
19972 187448 163727 142776 119409 92682 71653 53079 34799 29531 31560 29549 24224 12391
19960 12391 10703 -6346 -13892 -1071 14728 7146 -6508 -4331 -9662 5587 14537 14239 9210
19947 9210 4652 5415 14014 20968 10740 -2052 -2804 -5700 1657 3446 -6585 -15931 -24588 -10423
19933 -10423 3857 20390 21991 26180 37772 25570 17779 19366 23184 27799 25371 16596 5188
19920 5188 -4692 -6968 4270 17729 12239 2493 -2436 6519 14181 4667 -4678 1727 -765 -3517
19906 -3517 -7597 -8932 -1522 1072 -5819 -9178 -10523 -3422 2097 340 1475 -7782 -1122 4004 4338
19891 4338 -72 -3083 -6295 -2016 2305 -3571 -10596 -12388 -8037 -1375 6676 10959 -7327 -13034
19877 -13034 -3606 2289 2615 2926 -4473 12905 24180 12395 -9490 -17971 -16468 -12779 -12515 -22187
19863 -22187 -21007 -14925 -14788 -14178 -10869 -14304 -18666 -18970 -13934 -7124 -3100 -705 -5683 3678 21372
19848 21372 18183 15395 14390 13494 8564 -3319 5773 4848 2838 662 10471 21357 21952 8200
19834 8200 1976 14701 9543 6674 2420 153 -2441 14264 9390 5465 8305 -254 8865 8748
19820 8748 2950 -191 -356 -12065 -11406 -1519 -2190 2049 5782 193 -8888 -15944 -13626 1130 -511
19805 -511 4532 19834 20753 28318 24541 15565 6001 633 -15592 -24284 -19645 -14117 -15794 -15521 -2989
19790 -2989 8761 5388 -2200 -5256 6446 8140 10892 7803 -3145 -6983 3224 6587 8321 10245
19776 10245 -1177 -4146 10233 9145 -5550 -6761 5158 9594 3419 4683 7618 3635 -1004
19763 -1004 -9011 -6358 -3007 -6469 -4594 4107 -1695 -11242 -14917 -2107 220 -10722 -2956 -6167
19749 -6167 -11130 -12726 -15047 -6472 -2762 5647 3389 668 -2661 -11327 -11998 -15149 -17442 -7771 822
19734 822 1418 -944 -13529 -14228 -2623 14397 15193 26370 24109 11513 -9252 -17045 -2312 13147
19720 13147 21177 14783 6649 11761 18207 10266 8384 10680 4294 -4474 -11776 -16838 -12097 -6520
19706 -6520 -5437 -1305 9625 15896 -5853 -2335 10671 26851 23541 30597 19622 15258 16062 15584
19692 15584 15102 -2136 -11442 -352 12367 -3911 -8924 -6585 10738 20971 28300 33824 40819
19679 40819 30738 19912 12512 24086 33006 23223 19807 10247 8948 5670 14126 23564 5898
19666 5898 -11766 -8623 -6304 -278 -2906 -6044 -6311 -2003 4963 -4134 -10913 -8358 9366 17966
19652 17966 7027 5927 8873 12302 14404 12619 316 19 16635 20151 11429 6235 9477 22625
19638 22625 13098 -7548 -11393 -4151 -567 4687 4064 -5973 -19678 -19695 -20574 -10989 -15009 -1874
19624 -1874 -9193 -23397 -32130 -25348 -9652 2648 10552 7731 9703 25474 23157 19072 7217
19611 7217 -3594 -972 -481 1112 1747 -2000 2216 1743 -6887 -15040 -24194 -23626 5203 19292 11003
19596 11003 21260 8120 -783 12073 31614 37033 26201 23567 22161 18209 19194 21217 15044
19583 15044 9201 11735 11139 7724 10854 15219 15061 21013 37550 38945 13706 593 -3089 23648
19569 23648 39970 40744 38156 23591 24915 12410 15359 26166 32051 26476 29253 26405 39768
19556 39768 48024 29014 32212 35305 41929 44830 35087 20686 13894 4131 6412 3806 8105 26063
19542 26063 39079 49254 50741 51946 37143 18892 43841 53052 46347 48331 49567 50831 48755
19529 48755 55401 74825 104427 133672 143078 154335 178051 203933 209837 195649 196248 207991 208788
19516 208788 207791 233777 277564 322868 364454 383527 384915 370965 338939 287957 249407 232147
19504 232147 225325 228225 235641 242218 247466 237271 224169 199470 168552 131448 97343 80077
19492 80077 75451 75285 86242 85371 99837 101964 78895 52416 39573 37306 42196 52124 52930 46067
19478 46067 49701 37763 44807 45361 31893 31116 27403 33977 44181 34273 19870 17233 25512 38825
19464 38825 46364 49362 45411 41459 41946 35235 44049 72955 73137 84409 64043 56778 47013 37915
19450 37915 32880 37521 39175 41573 38623 28141 12032 -6987 -10172 170 15145 23617 20976
19437 20976 14982 23448 28420 22811 15933 18899 25328 21878 31319 27787 16317 15090 10742 13844
19423 13844 29508 29266 38088 48179 81335 97569 103392 100177 103711 96194 83686 64740 58647
19410 58647 56620 53777 59988 66183 68607 74489 80722 78862 72788 83575 99000 108647 119473 123173
19396 123173 120729 128022 144260 142269 136860 133963 147521 168588 162201 176253 199453 218128 216728
19383 216728 214478 205119 208321 211860 211091 197873 181443 167877 163251 157735 148064 142077 133731 138937
19369 138937 143426 153870 161957 168521 165774 159056 151014 140443 119428 90874 73526 66727 60898
19356 60898 52379 54729 57484 51279 59664 62100 48958 35225 29047 27034 19381 22223 35667 45626
19342 45626 42972 28689 15469 21640 28159 20273 28392 43599 54339 47361 43471 49535 46935
19329 46935 54323 49343 45488 39204 35136 40053 34935 18814 19743 16021 11063 13737 9993 7305
19315 7305 15407 3457 5032 25125 33769 27710 13675 14637 19979 17671 10037 8023 18286 15358
19301 15358 14255 33014 33776 23882 14863 8978 9256 14271 9789 9872 17998 24102 25453 27458 20107
19286 20107 10074 15932 30097 35446 39218 27456 12533 4381 3449 1351 1975 -149 10978 23593
19272 23593 34180 39063 30580 22878 24951 44073 56472 50346 46987 47616 60000 58057 60862 79814
19258 79814 88835 93250 95472 84684 93074 105136 112695 116780 128262 126473 127653 135331 133404 123947
19244 123947 116976 106070 102570 115700 129321 138789 128378 115245 105456 99450 90976 87604 71448
19231 71448 56601 46676 45349 38692 29596 28156 31534 28691 31497 45656 51700 60004 61639 74489
19217 74489 77332 78555 62276 58943 75051 85154 94670 103165 115477 127533 118196 114057 119279
19204 119279 117740 117411 128790 147284 159321 161036 156297 135243 124813 122232 114788 92977 94886
19191 94886 103977 109208 110261 99945 92628 87712 74135 61915 53660 51477 43269 34379 34980 38841
19177 38841 45707 44974 49515 55942 56549 49822 47623 52325 49007 45367 34922 29827 32445 28353 35200
19162 35200 46950 46157 49669 57032 50923 57889 65669 76378 89484 77864 64078 64616 77173
19149 77173 70009 61290 55242 55055 61360 72041 84798 85877 77323 71886 66007 64189 60572 64784
19135 64784 65084 58327 62147 64288 61500 64209 67417 79563 87099 90809 99093 102399 99347 98464 108039
19120 108039 136167 162072 171707 187908 177812 154610 153571 153587 178547 208484 214113 224967 247295
19107 247295 250419 240699 230113 210955 201646 189821 200280 196120 185581 186599 178032 160916 127332
19094 127332 106139 92458 91850 100296 98733 97921 94545 92714 83573 70304 64697 60663 59213 52954
19080 52954 50242 64000 72541 84126 86748 87412 96538 105971 115289 131763 156211 174463 195318
19067 195318 203074 192051 177251 177180 187820 224085 252304 274822 282748 272215 255925 245842
19055 245842 236067 222909 208091 202600 224440 231083 222847 214651 191332 155147 123266 105057
19043 105057 109809 119251 122814 121095 112773 110622 108278 111261 108680 102485 105594 96345 94362 108854
19029 108854 117474 119903 132796 134990 115944 115364 111223 107692 114140 117159 108948 113562 118624 121457
19015 121457 128529 132904 138656 150601 148092 143843 137658 129597 130022 133499 135256 139286 151630 157905
19001 157905 152705 141729 134645 134046 129400 128228 124238 134007 157407 158238 155789 149635 149093 141672
18987 141672 139209 141146 136434 134861 135570 143176 150561 152956 158358 156289 160174 165190 172681 182624
18973 182624 181158 185021 190988 204712 209242 196877 194551 220808 232607 250884 256133 250355 248823
18960 248823 254608 262544 253144 261187 262997 269274 286940 288214 298296 320690 328341 345390 358601
18947 358601 366007 371743 375997 389677 401209 414812 420630 451333 484422 495577 511618 533523
18935 533523 556342 585634 611702 650844 693367 760577 838922 931060 1005558 1084543 1189033
18924 1189033 1298260 1398956 1520384 1668234 1846450 2043251 2262628 2501212 2792502
18915 2792502 3152035 3594274 4150388 4895391 5864212 7128734 8630415 10325895 12242004
18906 12242004 14339452 16379363 18079595 19471380 20677870 21705069 22590026 23580625
18898 23580625 24830394 26370362 28325097 30766732 33275870 35183556 36310707 36849265
18890 36849265 36673823 35589026 33818700 31733518 29647553 27877032 26607778 25743669
18882 25743669 24931785 24043321 23086448 21943286 20389636 18398295 16168921 13885437
18874 13885437 11708207 9764513 8095283 6700383 5596148 4759213 4126522 3642296
18866 3642296 3265481 2950691 2679172 2449238 2245881 2079712 1949378 1851624 1777117 1710169
18856 1710169 1638091 1574617 1481550 1383762 1287310 1184695 1078529 995707 933039 887182 864448
18845 864448 841401 799826 754587 713499 671350 633474 615134 581325 556659 535003 517820
18834 517820 488617 468523 448529 439042 440113 452024 454901 438410 447403 452174 460111 480267 480250
18821 480250 486290 501944 501262 488739 477339 468997 478148 489617 508474 516524 514419 492916 478674
18808 478674 462912 444568 423471 417282 433639 453907 472297 484600 480847 478289 466154 445476
18796 445476 426667 410121 416839 426455 455225 481576 484313 491174 504755 503765 497254 522676 559265
18783 559265 597163 629801 688609 761446 813741 861296 920435 984342 1058211 1139773 1235972
18772 1235972 1359627 1469317 1592611 1771724 1956644 2132338 2345657 2640570 3031361
18763 3031361 3603388 4433906 5584621 7072661 8763885 10493539 11970881 12887645 13306268
18754 13306268 13422377 13515658 13965231 14940509 16359277 17918291 19098707 19667632 19490785
18745 19490785 18509219 17029518 15435109 14049166 13123913 12694574 12593092 12534870 12149337
18736 12149337 11294346 10029252 8521400 7048505 5797247 4819056 4094144 3582733 3233373
18727 3233373 3003851 2860410 2772230 2728627 2692681 2678174 2702452 2742937 2828060 2980637 3224770
18716 3224770 3635437 4269689 5213275 6543145 8293205 10305340 12364309 14200227 15412582
18707 15412582 15942859 16075592 16102195 16475006 17458420 19047338 20958457 22616626 23584563
18698 23584563 23715957 22838313 21183816 19243615 17402825 16035447 15311314 15072738 15012546
18689 15012546 14649327 13703130 12219638 10326676 8330536 6556845 5118118 4023861
18681 4023861 3261730 2731045 2355043 2077627 1849591 1669151 1511469 1375747 1267291
18672 1267291 1159496 1053045 958590 868530 799501 728959 681259 641040 596826 554883 519413
18661 519413 483252 442098 402167 380566 366411 361401 339339 302657 284271 278951 271860 264585
18649 264585 259796 240360 233084 225455 221032 211795 209707 207295 206580 197651 191272 187810 173619 164741
18635 164741 165019 169991 147107 151686 158981 141793 132992 140237 149240 145413 152584 148832 159024 146649
18621 146649 133596 125573 116689 122905 121427 125056 143187 143747 138213 144171 156417 156529 162092 161358
18607 161358 166955 172416 182198 190860 183067 174623 185453 188132 187256 188472 194416 189436 179953 180434
18593 180434 180567 182538 179784 162496 138842 129890 131922 121301 117408 128603 138160 131477 129656
18580 129656 138597 138131 133863 134774 141377 145723 131019 124374 127557 139640 147673 155159 158842 156106
18566 156106 163702 178410 193544 206674 199675 198907 214495 227865 244456 244419 244361 243793 238152 234194
18552 234194 247323 257897 262891 259119 261035 260518 257270 255630 255325 253547 260532 258089 251171 238549
18538 238549 228496 230550 222951 208370 201400 202620 196960 195562 200314 220195 239343 256814 261327
18525 261327 252652 247111 254485 255666 273161 293737 321097 373541 425177 494110 615692 794811
18513 794811 1062155 1408883 1732471 1901799 1869069 1663396 1357209 1105084 954838 896445
18503 896445 911204 1030334 1237084 1543880 1868074 2028460 1947193 1688217 1350567 1030351
18493 1030351 788636 630408 532133 455402 403378 364669 343209 333480 315414 290898 276620
18482 276620 258841 238804 214479 189395 166547 164786 166501 171909 170644 164681 158620 146459 128783
18469 128783 123603 133996 143413 136674 142934 139191 127326 140809 128428 127499 137435 121848 125148
18456 125148 129148 117602 110761 117836 123221 145172 153048 162378 158765 162241 167584 174765 181245 194701
18442 194701 197421 205063 211824 200599 198984 193674 181976 182329 182373 176435 185970 207801 237686 270580
18428 270580 302753 334097 363349 377313 393543 375222 342820 327802 316525 328372 367651
18417 367651 420165 461183 472728 460940 443431 401491 377429 363633 385235 412669 433502
18406 433502 440581 443108 434379 415838 402679 382942 377958 390983 399991 398516 410228 428505 419203
18393 419203 411555 425025 446138 444770 443498 440576 436739 443640 459144 467649 477480 487095 522810
18380 522810 576430 635107 703086 747736 788426 826222 864861 906216 949801 968782 974846 949375
18368 949375 888015 843055 834216 882955 973673 1086818 1168473 1187017 1149214 1058146 932470
18357 932470 808527 699479 624829 586749 562945 537885 543095 551066 559468 559699 561801 571605
18345 571605 572403 597681 627566 650844 692688 724983 771258 835584 894107 948286 1016340 1097005
18333 1097005 1174299 1239084 1307512 1388070 1486787 1559282 1617731 1649692 1663033 1703951 1802571
18322 1802571 1967740 2207553 2567733 3068010 3696142 4394105 5169198 6104390 7345509
18313 7345509 9068186 11334124 13926117 16334646 18113905 19050140 19016096 17969352 16078286
18304 16078286 13756887 11477191 9649659 8429804 7796013 7648040 7912363 8624576 9912667
18295 9912667 11983694 15145115 19801516 26122326 33797977 41572070 47334351 50097614
18287 50097614 48893166 43984312 37549882 30883060 25612004 22347774 21085603 21695580
18279 21695580 24192639 28613469 34737691 41848276 47970201 51345839 51240044 46958337
18271 46958337 40353788 33155007 26878094 22716504 20825712 21144612 23508547 27666848
18263 27666848 32879458 37917228 41614202 43372019 42893568 40066867 35255696 29285855
18255 29285855 23192333 17915839 13910764 11134996 9249862 7941339 6962554 6203359
18247 6203359 5569091 5026158 4582261 4213032 3900138 3671368 3514538 3415948 3350954 3310176
18237 3310176 3266504 3183842 3062525 2919262 2756573 2600012 2462180 2379228 2345947 2361371
18227 2361371 2409866 2492825 2620967 2790167 3033773 3378107 3877401 4603128 5666508 7222772
18217 7222772 9471366 12519434 16116959 19614444 22281662 23746334 23881303 22623670
18209 22623670 20096706 16733155 13160895 9951409 7472962 5753695 4598765 3788444
18201 3788444 3212524 2796660 2469041 2198097 1987717 1837212 1754451 1725321 1754604 1800344
18191 1800344 1865724 1939241 1965356 1962511 1906835 1819832 1731488 1674106 1652576 1682122 1753087
18180 1753087 1837991 1893612 1917554 1879860 1795282 1683824 1551859 1419722 1335422 1282137 1257947
18169 1257947 1263551 1265181 1244526 1191917 1105466 1008077 892280 794483 746116 719488 695380
18158 695380 674507 674441 682820 697772 708801 716134 707629 714585 735724 786537 848577 888906 940913
18145 940913 1001159 1035289 1059066 1080581 1104688 1153257 1196155 1244534 1317351 1421850 1539685
18134 1539685 1651479 1742709 1827143 1881887 1914971 1955897 1993872 2025082 2102708 2223531 2373361
18123 2373361 2561159 2780941 3040968 3340449 3721095 4234116 4957057 6030863 7653426
18114 7653426 10067596 13568069 18712407 26472694 36089542 41338840 40240599 36225995
18106 36225995 30093102 25639362 23742532 23236393 23538465 24362032 25259617 25840311 26067251
18097 26067251 25924792 25211195 24026986 22707243 21415005 20193147 19128125 18309204
18089 18309204 17583610 16666816 15438292 13971683 12308770 10577428 8913901 7405292
18081 7405292 6107404 5087921 4353717 3832390 3446391 3167677 2977466 2834289 2734573
18072 2734573 2685714 2690357 2734663 2847430 3065520 3406245 3938188 4677822 5570555 6511896
18062 6511896 7472731 8455620 9397369 10099723 10579337 10978303 11390137 11876724 12472983
18053 12472983 13233654 13968880 14495044 14822541 14932804 14689007 14089872 13341694 12564636
18044 12564636 11791571 11101174 10574663 10118981 9567047 8828831 7961290 6987583 5968415
18035 5968415 4966989 4067492 3295998 2692874 2231611 1908697 1653164 1450985 1284938
18026 1284938 1155294 1049083 972875 900793 829706 765356 721567 667992 631603 602240 562109
18015 562109 499969 452235 434289 424665 408799 382564 356388 340395 329292 313591 309151 305973
18003 305973 304335 286671 261789 247866 243293 244060 237680 234251 232334 233879 221020 210722 196314
17990 196314 176557 168604 179337 180695 172519 173541 179267 165021 146691 146085 155055 159769 148905
17977 148905 133144 130771 129492 134120 140843 133974 132024 133049 122280 118287 112966 106701 103868 101948
17963 101948 109023 120086 117266 114812 111265 107511 107759 95550 101742 101962 96009 99706 95127 95999
17949 95999 91409 98475 113270 119873 120080 106921 86529 75932 79937 86945 100207 99895 104334 112239
17935 112239 124549 125675 117942 104746 92882 91368 99551 105626 96453 92415 84722 81713 81847 87557
17921 87557 85350 98401 96005 76225 64897 69175 60897 46427 54151 63025 58606 57317 71310
17908 71310 79700 78147 68375 84152 79327 66560 69907 79482 82317 73792 75202 83843 83657 75773
17894 75773 85832 73982 64273 62543 74399 80113 73559 68761 81004 93421 86885 84368 92235
17881 92235 95987 100941 106520 106658 102487 93151 77145 88001 91614 86955 67975 59526 65788 70372
17867 70372 65886 65190 50846 52994 53871 48042 41011 39438 22961 19386 18730 17596 19853 40868
17853 40868 47700 35384 26443 27309 30659 39505 33996 33417 45290 49087 41718 49173 70087 77139
17839 77139 65701 63706 47083 35457 32390 46353 59576 50286 36534 25669 25254 36570 40596
17826 40596 31438 24619 17428 23880 30315 47453 39079 28544 34019 42899 26324 22490 25098 28187
17812 28187 29153 27253 23845 32455 32812 43843 46086 48909 56284 66925 85391 98725 108339 117556
17798 117556 128828 140135 124277 116864 115925 96926 87923 95372 85365 81177 68206 55641 47965
17785 47965 46122 39465 43243 42581 47011 30788 32831 44321 47661 29917 18330 17167 29510
17772 29510 29560 30248 29279 41384 39899 28076 46131 65327 65226 52775 34911 36780 45093 46547
17758 46547 49749 46093 62767 82017 116881 158326 183363 204584 213585 218895 211396 193958 179145
17745 179145 146083 110868 84472 73747 69926 49553 34246 34498 39411 42240 31874 37751 39110
17732 39110 38139 37395 36132 34664 28544 10161 15422 15720 22607 18455 20781 32726 48952 43346
17718 43346 33892 22042 29373 39465 47940 52186 48835 48402 44020 41443 56976 74844 72466 88939
17704 88939 119993 150142 196838 253354 281429 292716 302080 302799 265417 217256 178976 152922
17692 152922 144784 136578 133348 143044 170982 201211 234571 266072 272238 279073 256307 209808 180953
17679 180953 146645 110474 101323 89022 88112 89055 88421 77065 82525 93584 94838 110321 134962
17666 134962 149855 169730 197963 237989 292047 334294 360431 366273 378847 383374 366502 335520
17654 335520 294695 232528 181154 152560 122882 95893 64861 52382 29838 17138 29117
17643 29117 43671 43605 39960 27702 28057 26625 17437 15702 12273 14142 16153 16971 11658 17517 28439
17628 28439 31279 25884 11728 3929 6783 19526 25371 25979 29454 40373 32823 31245 34172 39108
17614 39108 30242 23290 36310 61624 73214 80051 63527 66502 86633 96256 101789 95032 102920
17601 102920 112711 115933 112467 96459 88554 109384 127454 143075 135149 110766 84471 79433 77798
17588 77798 70145 79803 86512 67211 42742 26024 31281 29733 21220 27600 19442 -3398 -608
17575 -608 21404 37085 50423 38388 23566 23411 34155 40530 39318 40307 36258 42538 47251 52239
17561 52239 61584 62660 67040 76912 85043 105963 97949 83021 87744 98438 121515 115111 105109
17548 105109 91699 79893 73585 67192 71669 82808 90336 90635 90431 87026 85215 96507 112445
17535 112445 155123 209979 270479 291870 268391 235264 181398 114439 87896 82766 76158 93945
17523 93945 113157 127924 165327 199377 240481 267202 289010 264762 219166 159639 119187 91511
17511 91511 69274 74387 68006 55425 39221 40477 43362 42278 27750 25586 26286 21779 19757 17626
17497 17626 21161 8630 -8335 -6363 -2231 577 14739 28907 39279 42009 24224 7215 -1774
17484 -1774 1480 -1250 -8597 1316 7624 16647 21563 10528 810 -1569 -10252 -5838 -1579 3503
17470 3503 6909 17642 19746 3738 2481 3269 -2664 -8235 -8019 3054 6946 14672 19330 20898
17456 20898 12476 22329 15081 3745 -6069 -8137 5231 5458 25505 46253 58687 70046 121468
17443 121468 159626 159452 139321 95772 58331 55998 49234 43719 27152 21968 17329 265 -12041
17430 -12041 3098 -3753 -13592 -2119 -7369 -20461 -10149 9307 18366 14188 11128 11896 22995
17417 22995 20832 9210 4269 3917 -4032 -16505 -2884 13985 5047 -16974 -19728 -13101 -6846
17404 -6846 1326 13847 16712 14251 7702 -12005 -20738 -14258 -27474 -20440 -10836 -1271 -4371 -10500
17390 -10500 -13198 -5518 -8921 -13118 -16736 -11855 -19338 -21038 -6396 -10175 -9672 -7564 627 429 -1869
17375 -1869 -11827 -15451 -12320 -10685 -9298 -1905 3136 276 -1174 -5701 -2449 -6046 -16185 -1224
17361 -1224 -5321 -18971 -29270 -17859 1348 -4694 -18823 -7341 7612 6967 6676 9808 12500
17348 12500 14016 -12875 -26066 -16284 3224 -7074 -11394 -15060 -8755 8039 15583 9374 -2540
17335 -2540 -5990 -2529 2597 -529 -7126 -1452 -124 5118 8350 4144 -1989 3958 6466 6945 -8825
17320 -8825 -24443 -12666 4725 3942 1593 1483 2640 -3614 -7304 -1023 2525 9322 16174 2885
17306 2885 -10662 -22926 -33413 -17097 1865 3266 3339 6034 7858 12698 6910 -3913 -17090
17293 -17090 -24533 -22210 -10315 -7870 1601 -1068 4477 5012 16965 25293 16703 14333 15744 14050
17279 14050 18102 13328 8670 22896 19491 18077 31644 24396 18925 8274 -204 397 14869 13294
17265 13294 10455 27093 36487 16895 15650 14230 21685 29088 31561 42408 45486 27753 34261
17252 34261 36315 20968 1655 12020 18088 1475 1892 13843 8036 3942 -449 -2084 8879
17239 8879 23189 15688 8775 23129 40186 64367 84946 57655 51148 36465 18497 17600 22213
17226 22213 27949 17650 18474 25561 30475 33374 39480 59426 80572 64536 45604 40901 47165
17213 47165 43692 35216 26389 27040 27540 24888 19778 22875 20263 12504 9773 15282 13604 3788 10804
17198 10804 12348 -5300 -1804 4908 7661 8413 8737 4772 8905 3728 7805 11468 10623 3005 7792
17183 7792 16097 28167 19712 9662 19138 22826 10199 10103 14749 16832 22046 33589 40289 43697
17169 43697 29662 8097 18487 26592 26890 24804 27213 19269 7747 2665 5014 5426 11913 16036
17155 16036 24506 22395 16432 25315 34721 24965 6951 -795 -437 619 13528 16755 11937 16405
17141 16405 17815 36242 47420 45221 37974 41653 28745 28611 22506 26879 37922 28272 14131
17128 14131 16475 28292 25341 28911 30122 10983 14437 26064 38233 41995 43413 60910 63125
17115 63125 46268 44610 51527 59538 65454 92286 99544 106167 112283 112108 104565 105483 103138 92058
17101 92058 76931 79780 81509 86244 89994 97948 90163 95749 104422 110813 102058 84443 67100 76352
17087 76352 79387 70538 60827 50844 72351 91157 106016 113129 99029 88794 86924 80373 91117
17074 91117 99391 82504 72161 82447 96258 103984 107851 100131 100557 109095 129651 135940 132126
17061 132126 141628 141699 149118 176720 205583 239313 319442 438733 573737 632830 612879 533662
17049 533662 432614 353898 305646 280760 269046 275886 293970 323123 369012 467398 591289
17038 591289 687987 691759 631958 523474 426302 356273 314324 303984 309286 296692 286156 288877
17026 288877 289744 293581 302219 304217 321962 335473 349733 371504 386789 413117 447871 471026
17014 471026 499861 519128 547542 583998 632235 695311 779826 876957 965920 1019418 1065827
17003 1065827 1125453 1211278 1324873 1446341 1563643 1686201 1847291 2079585 2364219 2674054
16993 2674054 3022047 3423204 3899225 4525447 5408804 6731932 8704610 11632197 15970479
16984 15970479 22572249 32540918 45364705 55338091 56277791 49704174 39057250 28226773
16976 28226773 20820614 16784102 14980542 14733039 15799249 18309769 22776119 30136394
16968 30136394 41001960 52270805 56689380 52332919 42673834 30886766 21257060 15163088
16960 15163088 11521925 9258867 7718495 6575437 5658359 4905695 4325970 3882641 3545453
16951 3545453 3234718 2926922 2616898 2328251 2066499 1854255 1691326 1555119 1450368
16942 1450368 1361064 1283583 1222089 1173208 1126289 1053886 953352 845989 756928 693554 638323
16931 638323 611019 592912 579478 556447 524815 499739 473914 441882 412535 392654 383377 358214
16919 358214 335736 318744 307256 288804 274807 263900 249829 256917 262181 253975 258347 260543
16907 260543 246427 216239 197634 179331 169365 153107 150162 152887 148529 137359 141673 132983 129859
16894 129859 115486 122897 138221 137302 137373 126710 118237 107582 111694 108053 107003 101149 99294 96138
16880 96138 102450 100520 106883 109165 99375 103428 101574 95271 77294 74261 79398 77931 74578 73177
16866 73177 59704 56204 64577 59755 56252 64322 79297 82046 87794 103290 103778 96880 83607 75143
16852 75143 79033 79524 64221 60267 58615 52658 53008 57028 56075 62932 59998 45836 36957 43752 37572
16837 37572 40088 41787 49240 64005 66029 44156 37102 35537 28480 16872 21346 10929 18753
16824 18753 30388 25979 31832 46320 64598 70832 69926 71511 61101 33943 12461 9419 11950
16811 11950 28269 28439 32951 25557 15462 20123 35382 48153 60636 40799 39976 47314 35118
16798 35118 19462 20067 27889 47536 51551 34307 24780 11079 9773 26696 30803 26214 28753
16785 28753 9632 3505 6337 11296 14621 22167 16924 10644 11311 3476 7988 -121 5081 11996
16771 11996 23501 22994 24145 15189 4485 2123 12814 18613 18104 14705 13993 17016 14663 11385
16757 11385 4318 -8889 -12478 -6176 -7484 -8169 2323 -16843 -13270 -6586 -3997 5570 2814 4896
16743 4896 11365 16113 6072 5809 17889 8463 -7152 -6451 -7428 -5508 -10711 -3832 21444 22419 15224
16728 15224 9767 12907 15229 15140 13207 29649 46241 37800 19878 31917 32256 19587 21269 12005
16714 12005 4801 -4271 1833 14714 12576 2285 13502 20646 28652 11864 9318 10562 21419
16701 21419 18235 17162 24922 19780 20937 23714 16026 25248 18881 10647 -1926 -4328 -684 5329
16687 5329 17573 23319 18256 13913 1195 3240 9070 6477 3346 -4763 4881 7160 -3601 -10902
16673 -10902 -830 9131 14921 27536 36593 36907 28005 20434 7137 12251 2825 -10157 -15687 -4731
16659 -4731 -3236 4167 22387 42334 39200 37908 43829 53672 64366 60039 51120 44436 47420 46475
16645 46475 40731 42976 50594 47838 43080 38390 29956 26935 39574 52656 42255 31701 37862
16632 37862 30564 25669 40037 50314 52910 39604 38419 43042 56619 65387 60377 60774 51932 48321
16618 48321 60833 67475 53581 68358 86239 96688 117409 144991 170626 201548 239670 303879
16606 303879 412108 564067 806556 1151657 1598594 1947487 1991157 1774613 1407298 1041922
16596 1041922 802330 702601 697798 779579 957143 1268524 1686164 2004014 2009783 1740017
16586 1740017 1328661 926119 633860 471546 364622 291805 246209 216217 177855 154201
16576 154201 146577 129196 111589 89411 72705 72547 67838 71722 67616 52047 53309 57099 64173
16563 64173 55945 58604 46784 43314 43786 34476 32171 37918 41981 38663 36464 44047 35524 31765
16549 31765 26829 18180 13259 28197 34999 23880 10551 22722 24703 31920 24348 7273 454
16536 454 14185 16230 8003 12723 8862 10789 22113 23781 34689 20268 10871 8703 13863 24573
16522 24573 13981 5630 6528 10832 13952 12244 15595 15787 3077 -16209 -28902 -20759 -19031 -9694
16508 -9694 669 8166 19229 18250 10903 -1025 -8422 8327 29035 28836 30432 28115 25938 24548
16494 24548 23348 17858 19630 14036 13221 12404 15902 15791 4345 8294 18150 22064 16758 10431 10364
16479 10364 4001 9228 12591 10409 -11476 -20414 -16716 -13397 -10257 -14636 -17795 -13936 -5063 956
16465 956 978 9104 16422 27747 39078 35971 14159 9668 2839 -9302 -16878 -8974 -8745 -17928 -22563
16450 -22563 -25500 -24388 -20346 -18057 -13342 -16849 4196 13174 -267 -11921 360 7606 1216
16437 1216 -2199 14473 30876 36578 34396 30282 31629 45973 57962 60485 74330 114052 168235
16424 168235 219915 266743 273396 232878 177779 130713 96542 78133 73036 86503 104853 114953
16412 114953 137478 166643 221198 272883 282264 245822 199863 159163 137710 99526 62363 51569
16400 51569 43168 29757 37817 26491 14819 29148 31580 24784 19942 27704 9977 6018 9
16387 9 -3688 14009 23010 12379 8175 -3841 -1961 4429 8754 -5200 -26614 -30505 -33227 -41208
16373 -41208 -35648 -2045 17001 11744 7930 5852 9918 8194 16156 5281 -13991 -20045 -16651
16360 -16651 -17839 -18949 -20177 -18021 -27439 -42561 -27737 -11535 -11552 -16656 -27452 -21693 -14167 -5460
16346 -5460 -2896 -8306 -64 -7135 -19027 -16051 -11872 -7342 25 -1250 -11087 -27412 -37501 -27703
16332 -27703 -11072 -2161 -13544 193 -15643 -24732 -25979 -29076 -27910 -27884 -22295 -19878 -9512 -16593
16318 -16593 -27994 -32394 -25185 -17681 -4464 -4286 -908 -1051 -8943 -3407 1423 -10853 -22719 -17642
16304 -17642 -20421 -15550 -11262 -9175 -11106 -24188 -27558 -28505 -30214 -26475 -16179 -5831 -10825 -18021
16290 -18021 -18193 -17633 510 -2299 -7450 -5801 -5302 -5275 4063 13260 18033 20943 22387 6608 2807
16275 2807 18277 15640 5377 4147 6143 3554 141 -6677 -7177 -14673 -6690 -128 16922 17589
16261 17589 9356 523 944 6986 12177 6242 233 -335 3383 1815 -7640 -9316 -20730 -9791
16247 -9791 -284 3471 14226 10583 6372 -7409 -16677 -10707 -9036 1296 7940 7995 -9754 -11371
16233 -11371 -15074 -18514 -8034 -1994 9475 7040 3663 -3858 -10650 -9506 -12418 -9680 -2266 -3873
16219 -3873 -6682 -9383 -14735 -28324 -27637 -15179 -3632 -5881 457 -5713 -13605 -1178 18763 28567
16205 28567 11236 10336 17399 -621 -16784 -23268 -17604 -11406 -2766 10337 10454 3575 -9272 -18123
16191 -18123 -4834 4077 1726 -605 -12723 -26219 -32239 -41805 -45923 -21175 486 1900 -7671
16178 -7671 -13361 -16275 -2709 5164 9986 15540 15238 -3013 -3458 65 3694 -6200 -7907 -1719 -13697
16163 -13697 -8258 2681 1943 13698 8861 3307 -2367 2269 -16327 -19701 -9923 -3396 -7029 -683
16149 -683 -6365 -17291 -16199 -12138 -11785 -16080 -20785 -53 -2346 5324 21606 10642 236 -5896
16135 -5896 -5413 -2449 -13159 -17893 -22541 -13265 -16194 -25982 -22647 -30814 -28596 -30222 -28228 -27969 -27105
16120 -27105 -28651 -31352 -24126 -24266 -19315 -18854 -24587 -32409 -36657 -24673 -7617 2356 3858 -4765
16106 -4765 -21886 -26658 -34771 -32939 -15501 -9031 -6146 2019 -1484 4638 24241 7477 -12440
16093 -12440 -16351 -17961 -25568 -25473 -19962 -23149 -21403 -7930 -6634 -21700 -20740 -20729 -18678 -25263 -11731
16078 -11731 -11762 -11850 -14131 -13031 -12808 -8173 -11414 -22559 -16671 -6196 2669 6754 9840 6948 -7485
16063 -7485 -25179 -28625 -21091 -18913 -31076 -37175 -47702 -41417 -38077 -30882 -13822 -5235 -8708 -12490
16049 -12490 -17933 -5948 3004 -6853 -1767 -879 -557 -5588 -3329 -11640 -25905 -31845 -31589 -22509 -13275
16034 -13275 -2497 11316 20371 21542 15638 13540 9650 10350 16833 8699 -3731 -14922 -17302 -8587
16020 -8587 -2125 -10868 -20630 -25729 -21580 -24845 -14171 -12462 -14436 -16000 -3386 -6922 -13016 -2517
16006 -2517 3390 15568 4430 -7741 -14091 -10085 1933 3360 -5611 -2137 -4531 -9965 147
15993 147 6710 2576 -9142 -14637 -8004 -7538 -16770 -2898 238 -9282 -6655 -11059 -16952 -17806 -20947
15978 -20947 -19360 -19867 -17488 -16167 -17121 -10869 -11956 -16080 -14901 -20788 -15923 -19974 -16323 -9740 -9255
15963 -9255 -4323 -19504 -18869 -21227 -22813 -14561 -28627 -28609 -15867 -13776 -3876 5685 -2232 3230 3742
15948 3742 -14875 -20513 -27267 -37951 -28402 -8079 6112 -386 -20681 -38895 -34702 -25432 -15129
15935 -15129 -1643 -7928 -14629 -13924 -5282 1949 6642 14844 16959 -1684 -12151 -14433 -8650 -816
15921 -816 -12113 -17662 -15855 -13359 -7733 -16555 -22389 -18599 -22185 -30300 -21976 -15357 -14318 -15732 -3444
15906 -3444 -14041 -15632 1128 -10337 -8243 9602 20695 12886 13872 2541 9454 11639 2699
15893 2699 349 -13083 -13838 -18623 -19737 -19174 -23613 -28211 -22598 -11433 -939 -9768 -21583 -20633
15879 -20633 -19833 -16125 -17486 -10589 -8252 -4603 -6364 -11632 -7736 -8594 -17279 -16942 -12466 -5291 -9393
15864 -9393 -11857 3272 13893 10802 -13700 -18695 -14901 -14089 -14784 1381 3602 -5076 -20007 -19121
15850 -19121 -24894 -29379 -19606 -7956 -9247 -16415 -24533 -24059 -14165 966 -2516 -10291 5545 15219
15836 15219 -1190 -12549 -11054 -17048 -22137 -18873 -31017 -28888 -28298 -32999 -27368 -12566 -13147 -12463
15822 -12463 -5655 -1793 -1268 -11293 -16504 -2238 5661 7254 -2970 -3442 7201 -3153 -425 3951
15808 3951 -1781 -2521 -15790 -16262 -5504 -1877 3259 19365 12486 4495 6639 -2644 -14225 -7158
15794 -7158 -2394 -17384 -20041 -29218 -38416 -40680 -28463 -24976 -21341 -20868 -31769 -26238 -6169 -1686
15780 -1686 -8003 -22301 -36439 -25531 -21863 -4149 -3529 -18143 -18984 -17841 -6741 -8614 -5680 8244
15766 8244 3811 -6120 4526 1485 -7689 -4187 79 -3167 -2989 7503 -788 -3268 -5840 -17242
15752 -17242 -17442 -10710 5395 11226 4514 5243 13002 9313 4707 -2284 -18900 -17772 -7101 -14446
15738 -14446 -25496 -21741 -19904 -7843 -234 -245 -3003 -7112 -9351 -12184 -9615 652 6382 4468
15724 4468 -14886 -9897 426 4607 3262 -11693 -16825 -6438 418 -3514 -19315 -19453 -7048
15711 -7048 -605 3081 -1249 204 -9912 -24185 -32203 -45466 -37890 -23928 -24293 -20844 -16933 -14754
15697 -14754 -7698 2565 -3089 752 7491 9014 6741 4672 15353 21263 10697 2763 -12355
15684 -12355 -14943 -5476 -7792 -10767 -35146 -39752 -33938 -28119 -28803 -32375 -36432 -30553 -15761 -13402
15670 -13402 -19167 -18861 -5763 -3481 -14512 -25696 -33046 -25877 -6979 -8620 -6951 1945 -388 -13001
15656 -13001 -20509 -20350 -17524 -9555 -3879 -4256 -22784 -26640 -28366 -30525 -5751 6776 3244 760
15642 760 -5226 -4443 -3805 -4838 -6215 -10666 -12207 -19608 -20836 -9261 -7480 -757 2732 -2595 -13181
15627 -13181 -20782 -24231 -9779 4982 6682 11769 15207 4677 -1242 1164 -10160 -10122 -12703 -14663
15613 -14663 -11256 -8435 -14779 -11390 -1122 -45 -17349 -11113 4978 4390 -296 -6983 -3546 10219
15599 10219 8739 9129 10046 5808 -3794 -14154 -11377 -8094 -8538 -23670 -23160 -17279 -12377 -17829 -23583
15584 -23583 -20262 -9737 -7810 -7878 -20291 -16037 3042 7287 -10184 -11521 -2437 -839 3989 3391
15570 3391 12629 12197 7947 -1957 -4494 7123 -5292 1986 382 3080 9270 50 -12301 -12925
15556 -12925 -10456 -15580 -19652 -14658 -18889 -33713 -34387 -23294 -9146 -9535 -15850 -3095 12404 6299
15542 6299 -4006 -1021 -13370 1145 -4308 -15518 -8576 10901 11283 14652 7723 -4855 -2009
15529 -2009 -10975 -12640 -11865 -16333 -5126 3191 12898 20460 23998 27698 26854 19015 15124 7182 4772
15514 4772 3984 -1177 3303 2178 -5364 807 1822 -7146 -10995 -14129 -21820 -14354 -8024 5996 14166
15499 14166 2776 -7770 -12316 -4013 -9400 -11349 -18114 -26833 -12641 7087 3811 7146 5112
15486 5112 -8100 -4345 -6782 -20485 -8065 -13655 -25125 -29053 -6418 -1658 -1590 -12531 -10156 8478
15472 8478 6095 4985 13675 10833 4938 8821 11235 8414 8485 3099 3786 2425 -1160 -16044 -17677
15457 -17677 -7157 -759 -2049 -8193 -18732 -20712 -33033 -27292 -27192 -36592 -9365 9352 2350
15444 2350 -10095 -25962 -32726 -27832 -30753 -30449 -17159 -20057 -22011 -27875 -25889 -22809 -18560 -24109
15430 -24109 -24382 -19057 -22381 -8364 608 -5864 -13966 -6433 4461 5433 -3845 -14411 -6561 11783
15416 11783 16067 16426 13150 13743 2597 -16479 -16825 2929 10000 46 -2580 -12620 -28280 -24074
15402 -24074 -30716 -32515 -16551 -7327 -20141 -21227 -17061 -8960 -9187 -21495 -11215 -3604 -8375 -8037
15388 -8037 -10391 -14243 -28786 -25359 -18824 -8607 -7042 -9720 -11980 -18788 -16407 -13832 -15390 -29341
15374 -29341 -38610 -35911 -17088 -2839 3437 9342 2742 -15128 -17471 -16285 -10970 3985 7861
15361 7861 -7350 -3444 4232 7366 8886 7999 -2679 -18229 -2724 5643 6439 -14876 -21508 -18014
15347 -18014 -13590 -8779 1542 7508 2871 -4560 -25692 -24148 -16631 -7333 -6000 -1136 -5777 -8158
15333 -8158 -17556 -20143 -17753 -1950 -9015 -27849 -24646 -15293 -18894 -21868 -28150 -27854 -22066 -15648
15319 -15648 79 -6293 -7638 10552 7732 -16397 -25070 -18244 -10367 -10540 -10514 -15881 -19945 -21214
15305 -21214 -22398 -16650 -4633 -2845 -12439 -18882 -17414 -17405 -19253 -21593 -20162 -24123 -16837 -22312 -28632
15290 -28632 -19998 -16186 -23483 -28011 -14707 3769 5556 11713 1844 3648 8853 -6406 -20395
15277 -20395 -20263 -18247 -27972 -27147 -19522 -13005 -17225 -19567 -20662 -16294 -11413 -20127 -26553 -35584 -40298
15262 -40298 -41473 -38243 -17713 -8612 -24149 -27971 -26270 -20274 -24122 -33385 -20745 -22501 -20769 -14324
15248 -14324 -10101 -25880 -41026 -33144 -26894 -19670 -14741 -11692 -20172 -13415 -9353 -16145 -16429 -25892
15234 -25892 -20006 -11061 -11361 -13793 -17816 -2989 1253 -7933 -29729 -30760 -19946 -26744 -31048 -13514
15220 -13514 -3812 -7578 1030 2904 -8484 -8757 -18704 -21844 -17599 -8095 -7865 -14188 -21828 -13271 -4465
15205 -4465 -5719 3403 6878 -11516 -20894 -17339 -20477 -12548 -5503 -3952 -13112 -22661 -24766 -17397
15191 -17397 -2098 8440 5869 8853 3765 -11562 -11161 -5802 -15124 -11349 -4543 1290 6049 6473
15177 6473 -4978 -14815 -10016 -6775 -414 -6090 -11618 -22059 -22733 -14145 -7806 -2332 -1347 -14183
15163 -14183 -25886 -24976 -16596 -17614 -17631 -11354 -10185 -20470 -21232 -13914 -14387 -17490 -15056 -7818 6728
15148 6728 3901 -10660 -18057 -15444 -23796 -22770 -20308 -4303 -1321 -8629 -10237 -11600 -5948 -7960
15134 -7960 -8898 -13532 -16807 -12320 -6218 -5081 -416 3919 10553 7161 -1236 -2285 1727 5702 6423
15119 6423 15882 8018 -136 -9493 -8356 -15464 -15641 -13397 -20798 -24263 -18095 -2768 -232 2387 -4534
15104 -4534 -5129 -14698 -9699 5093 -4987 -12576 -15266 -18788 -32358 -42719 -51833 -38945 -32350 -6898
15090 -6898 -1291 2146 -2817 -2004 -8347 -10653 -3809 8511 -421 -9575 -11592 -11671 -14836 -17901 -24766
15075 -24766 -23518 -5745 -2345 -4356 -2928 -3868 11481 7374 1264 -20289 -31370 -31238 -28591 -23140
15061 -23140 7242 17376 2160 -14392 -34476 -21206 -17582 -6538 1468 6194 2284 -15122
15049 -15122 -17186 -20403 -10687 -7457 7684 -4549 -17787 -13319 -12155 -17807 -20323 -31092 -39369
15036 -39369 -44006 -40914 -25667 -16463 -17647 -18245 -15743 -17101 -24533 -28854 -20105 -15163 -17826 -14487
15022 -14487 -5855 -10128 -26261 -30165 -24114 -16278 -12209 -19527 -24197 -24422 -24339 -30465 -35455 -32051 -23653
15007 -23653 -17836 -17120 -17776 -17097 -12482 -10462 -2649 -25628 -17563 -6583 -7928 -10657 -11985 -12161 -3749
14992 -3749 2830 -10762 -20590 -15761 -18183 -17931 -24184 -30801 -36918 -15409 -15575 -16062 -12933 -14978 -8632
14977 -8632 2311 -4265 -7701 -12803 -14533 -10844 -264 4885 -1599 -3584 -15754 -29106 -29274 -27845
14963 -27845 -21458 -9929 2866 5002 6551 -3734 -17911 -18808 87 2226 4630 5358 -11868
14950 -11868 -23571 -23534 -21040 -16681 -15061 -21543 -24913 -12396 -5783 -8952 -18888 -25396 -30104 -40901
14936 -40901 -44816 -28028 -24403 -12411 -10076 -9365 -15950 -25793 -24287 -23703 -21012 -35993 -26690 -392
14922 -392 11216 3691 -5502 -9035 -5072 -10911 -9568 -7098 -20730 -17538 -2320 -12250 -22983 -20984
14908 -20984 -13984 -19966 -24321 -13034 -20118 -25697 -20364 -17677 5933 16730 14448 6520 459 -10684
14894 -10684 -30240 -24149 -12664 4499 7199 4875 -2634 -9630 -15195 -5630 -1773 -1742 -3287 -4945
14880 -4945 -7573 -12090 -19925 -14102 4068 13140 -3390 -25062 -27079 -34865 -24265 -24349 -24741 -24265 -27994
14865 -27994 -16495 -5068 -5414 -17360 -19291 -12779 -15239 -6474 4656 -5398 -19230 2824 4357
14852 4357 4405 -837 -21997 -37991 -22744 -22474 -28248 -16310 -13842 -30260 -44945 -41456 -36322 -25464
14838 -25464 -31111 -36635 -35240 -33948 -19418 -14905 -29750 -29623 -26125 -30442 -25018 -27673 -38706 -36054
14824 -36054 -17890 -8103 -9766 -15808 -28895 -20583 -27344 -17372 -3541 -4779 -8629 -2274 -2225 2951
14810 2951 6214 -1964 -4266 -16335 -18254 -21238 -12758 -4646 -4014 -3666 1689 5483 19201 19097 23833
14795 23833 14976 -9857 -17717 -6949 -5859 -12295 -25963 -22541 -11407 -11277 1520 9200 5983
14782 5983 -2276 5144 4653 -409 7400 12671 -4705 -13254 -22584 -27576 -21783 -21550 -18426 -7303 -18344
14767 -18344 -17996 -18361 -14007 -19623 -21793 -13381 -16304 -5697 -4224 -3415 -2313 4521 28670 25115 11419
14752 11419 -4143 -19247 -20170 -15951 -13411 -8627 -11731 -19068 -12336 1094 3849 -1070 15853 11142
14738 11142 5906 -3951 -272 934 4287 -13210 -24542 -25502 -28626 -39127 -33720 -23657 -3575
14725 -3575 228 11814 9430 5236 3864 -2631 -10113 -9759 -6223 -11968 -5697 -10824 -9636 -6473 -3011
14710 -3011 5303 3356 -3670 -12318 -24668 -24061 -23678 -20061 -16356 -7811 -9337 -6169 -2016 -10001 -9201
14695 -9201 -10710 -12042 -8542 -10941 -15698 -14544 -14752 -18548 -11997 -13141 -14524 -13890 -8390 -8542 -15157
14680 -15157 -14555 -11221 -17900 -14700 -13694 262 8082 4908 1301 5325 10425 4850 6879 -2374
14666 -2374 -5049 -6403 -5981 2811 6204 -2324 -8708 -11136 -9076 2313 11495 13112 10088 -1801
14652 -1801 -28357 -20649 -4010 9906 8121 4316 6132 5788 2677 -5528 -6725 -8713 -23953 -31330
14638 -31330 -26624 -22253 -12119 -12657 -17838 -19470 -21836 -19004 -13061 -15763 -12679 -8947 5943 -6418
14624 -6418 -20962 -9905 -8370 860 1795 -15784 -28285 -15353 -4947 2910 11380 7326 -2112
14611 -2112 -24186 -32967 -21078 -13079 -1023 955 3334 17403 21359 28763 20254 7202 -4493
14598 -4493 439 2082 -871 -1584 -8958 -6932 -3771 -6169 -3763 -7301 7894 13831 2901 -9053
14584 -9053 -28708 -16056 -4797 -2027 3472 7839 -2761 -2840 8366 12298 8326 -2368 -8450 -5390
14570 -5390 -6972 -2938 -1439 -1996 1223 7362 7723 12043 6173 -220 -3589 -6024 -2361 -4218 7156
14555 7156 14685 14423 15990 15827 8381 -7867 -7783 -2904 -278 -12111 -6918 497 3061 -3149 -14934
14540 -14934 -14949 -7736 -1054 12912 4289 -4145 -13215 -17121 -11577 -13438 -16252 -3610 3331 14037
14526 14037 1808 -19829 -27904 -15740 5361 7931 11186 5570 1822 -7266 -15517 -10840 1187
14513 1187 -4754 -4697 4013 791 -19928 -13454 -5859 -5504 -19616 -14632 635 -4220 -8360 -11078 -16731
14498 -16731 -23480 -16535 -14330 -13800 -21791 -17632 -15155 -22153 -16024 -16883 -18432 -8397 -221 2020 7968
14483 7968 3235 -9240 -4569 9529 17659 17366 23174 13555 -10768 -12355 10579 10877 -7122 -18137
14469 -18137 -5458 1759 -5949 -7057 -7069 -4402 478 3973 17281 17857 9810 12499 28464 23246
14455 23246 10470 -7287 -15674 -10042 -15978 14 10438 613 -10914 2948 10187 360 4403
14442 4403 10646 9366 388 -8874 -10644 -532 -1551 -7696 -9674 388 2014 -1988 5367 15846
14428 15846 6412 3230 2548 -11899 -23500 -19391 -14249 -3679 3985 1281 6625 10627 3019 964
14414 964 864 11862 8236 -15014 -13169 -4562 2547 10592 8459 13549 -4305 -2072 -6554 1337
14400 1337 -4857 3295 13975 2615 9038 16190 -2603 -19914 -25385 -34119 -22754 -10964 -683
14387 -683 -2185 -16220 -31588 -31699 -24164 -15896 -13911 -4937 3353 -5928 -11271 -4836 -13481 -4121 12618
14372 12618 24899 20840 29468 16485 7924 21203 15823 -1785 -1529 14407 25151 33052 42253
14359 42253 44957 39839 39521 46814 59867 79289 104264 120950 135722 149401 175206 205833 244948
14346 244948 292503 344971 395766 463464 536799 593001 645617 704266 751604 778852 796783
14335 796783 790810 787413 782977 756782 736257 715614 685854 649591 594330 519093 447914 392705
14323 392705 326687 277329 250649 222886 177668 146211 117927 92747 86637 89178 93205 106940
14311 106940 117207 99719 70702 52564 40902 37786 47965 43907 42171 36224 29063 29623 24361
14298 24361 28416 29829 39191 31700 23251 18427 18267 8751 -5693 8002 22685 20058 32299 29093
14284 29093 18098 17537 24716 35728 21353 7318 2273 5562 12137 10072 3731 4747 5166 3153
14270 3153 -4387 3771 9619 16070 5708 2282 -4085 -10571 -207 14755 13572 2720 4951 8106
14256 8106 -2323 7237 16400 7441 4830 4345 -1701 -6138 -14869 -13298 1918 3311 -4942 -7740
14242 -7740 7603 5301 -4734 -11564 -8377 18648 29021 14446 -2743 -7294 -9558 -7922 -11972
14229 -11972 -15129 -4121 10762 18852 28268 15067 10901 14144 23586 12893 14509 14761 4804 -5132
14215 -5132 7621 21797 10170 11120 12294 -166 -1770 1768 9935 2408 -4666 -3288 482 6596
14201 6596 13248 14249 28969 34466 26854 24052 17198 17273 8427 -233 -7038 -9015 -3537 -2333 9000
14186 9000 13625 29004 37344 27996 15370 2228 -4086 -13907 -16591 -7743 -2013 4088 8893 -9370
14172 -9370 -17991 -14612 1731 25513 30587 21261 5648 3899 10993 22231 25986 26379 25247 15709
14158 15709 5775 6972 16422 8169 6534 7096 -484 970 -1533 1764 9093 10432 12620 13494 4295
14143 4295 9692 18098 11574 3114 11665 6955 7475 12243 17462 14528 9476 8674 7198 21182 21443
14128 21443 26059 39210 30469 32743 31419 35816 47444 69335 86758 114183 127686 120253 125208
14115 125208 132108 136757 134987 129563 130423 106902 106743 102084 76251 69468 64577 56338 34938 16534
14101 16534 9139 8353 9256 10452 6567 16255 13783 15600 17741 20421 36580 44308 22099 24633
14087 24633 44464 58940 68459 71175 78046 81924 86893 95766 104167 116281 114697 117812 135607
14074 135607 157948 182240 226297 261294 279682 270403 252141 215040 185916 144994 109578 90639
14062 90639 80050 83325 68691 47565 38211 32934 27107 19775 18407 20954 21082 18961 18711 32357
14048 32357 27973 23901 23888 6020 -9783 -16136 -7044 -2571 12869 16660 11547 19656 16994 75
14034 75 481 294 -7149 -4226 7173 20637 11004 -7842 -11201 -12670 -9951 1957 -5858 -7839 656
14019 656 7769 21492 37915 41963 34394 42725 53313 53468 48323 47131 41325 38903 29873 28273
14005 28273 29853 35304 43229 49600 48265 41437 40669 43003 43292 29223 17450 15492 21085 15306
13991 15306 16819 11273 2820 11084 10871 1260 8236 9892 11946 10126 -15891 -25606 -23363 -5283
13977 -5283 13025 21453 20732 30352 19557 5772 5079 6308 9009 10088 7215 9747 8022 10186
13963 10186 27666 27719 10507 6796 18604 17531 8197 2174 1529 -3651 1432 -7922 -6189 7785
13949 7785 12032 2564 3982 4794 -7795 -1579 1434 8806 13969 -2367 1071 12190 4131 -5124
13935 -5124 -9894 -11595 -10915 -2292 4981 4488 326 11634 6465 6482 3624 -3160 -7301 -11749 -5081
13920 -5081 6344 13734 16385 23266 29520 28118 19122 26024 31363 45956 43810 31161 24581 31811
13906 31811 27767 18937 20131 17141 17158 12516 19168 6532 4950 13331 14059 13608 8885 4779 5750
13891 5750 4169 3999 10837 12501 -741 -13753 1123 22760 23645 16536 -1677 -11045 -10720 -4232
13877 -4232 -1588 -14867 -7582 3094 9290 6632 7884 13684 16773 6411 8823 25374 40892
13864 40892 31016 18134 8508 21799 31285 34730 24975 19758 17640 12577 1528 4644 10608 13267
13850 13267 7244 3509 13982 24254 30576 23244 10332 746 4152 3785 2060 -4508 -6951 -9399
13836 -9399 -26261 -19275 -21606 -9399 6295 16797 4922 -7021 -12142 -9050 -230 8544 9434
13823 9434 7922 14560 19321 9544 268 8548 26394 18010 6921 5559 10083 5675 -11475 -25205
13809 -25205 -14837 -10356 -13285 -3423 -19238 -14259 -11740 -13278 -3873 -1700 7798 19290 6311
13796 6311 -12637 -12740 1418 5269 6595 3485 3970 5979 1695 -4354 -7344 -4269 -5411 -554 -9315
13781 -9315 -10578 11509 32080 26527 8996 -5832 -5082 -5808 4121 7051 12156 25406 22327 14158
13767 14158 7615 -96 5479 21565 26782 23314 21921 19890 19500 12290 4644 -542 5120 2819
13753 2819 1378 7226 20209 18424 12019 13040 23219 29906 34971 44368 42045 48624 41958 31986
13739 31986 30875 33994 27599 39833 56353 58580 57548 67887 66783 75312 78341 88735 93901
13726 93901 93290 115576 127926 123718 127626 149649 157683 170496 193089 216001 218051 221555 226280
13713 226280 237250 236754 230286 235048 224405 230623 227383 205268 198694 200200 189429 181416 176660
13700 176660 184158 171846 169471 165220 162458 153249 140287 118922 113875 102293 97174 89998 72347
13687 72347 79650 69653 58887 36129 32986 39274 44765 53965 62252 68591 60810 47853 36490
13674 36490 26657 17167 9054 -4370 -7922 -4001 4473 11913 12996 11862 11344 946 -9310 10831
13660 10831 23157 6016 -2223 -171 12147 16784 -287 6029 9419 -9959 -4124 18672 32148
13647 32148 26901 13907 18399 13302 3862 11784 30988 37563 34485 32244 35971 26762 16307 25679
13633 25679 38745 37647 30042 24329 16290 19995 27625 23795 21571 25089 28743 34909 28088 8766
13619 8766 7770 3307 13054 8332 8454 20472 33277 36252 37983 45760 38754 24458 11276 15578
13605 15578 26443 25221 29265 39876 34558 29394 23646 33468 39837 30212 35529 44300 32545 27924
13591 27924 8949 3824 6615 17001 40325 51616 49325 30596 12293 16111 12255 16255 15781
13578 15781 1363 -311 4992 9705 30604 41219 40703 32394 16108 20026 25517 14313 -3511
13565 -3511 -4026 -2209 -10376 -10168 -8024 -5250 11316 18224 13995 6736 3951 8618 14655 20062 23795
13550 23795 33057 50895 40238 29156 19680 25749 29217 42489 46033 41076 19188 20268 28609
13537 28609 32300 36923 36828 29222 19061 32604 24755 2437 -13577 -8420 9129 20537 9691
13524 9691 2178 6247 21858 21765 21955 15591 17823 20134 11469 9941 22439 28526 29845 25239 18390
13509 18390 15531 20157 21182 15990 18433 12924 9679 26139 37092 28201 18567 11673 8657 19442
13495 19442 28658 35804 39173 23294 9877 18329 18116 22428 18978 5436 7150 -2076 -5563 -5925
13481 -5925 11592 15037 21450 36979 47877 39604 27748 37396 32387 22939 22594 29949 38867 33991
13467 33991 38166 36233 36264 35751 30998 21326 32548 44280 37564 22979 28493 20188 12902 6952
13453 6952 20132 10084 11339 24280 25919 17693 7557 -2471 2348 13774 25948 29944 20729
13440 20729 7852 505 491 6594 9217 -4739 -1680 1018 9428 20381 28141 31258 21630 8453
13426 8453 -318 1788 12677 8135 11981 19603 22678 22622 18790 17341 27543 34294 30021 34632 36504
13411 36504 34165 28423 29082 26931 33017 31916 31628 33704 32002 17724 9454 13175 25240 26712
13397 26712 34437 23422 19435 35992 46336 27505 5839 1512 8541 20589 15180 8016 6970
13384 6970 8621 18299 19435 16761 21041 19654 17837 30748 32412 25868 20416 16354 11224 26145
13370 26145 41660 52503 49740 44982 38636 33021 32067 32087 21552 25275 44416 48300 34276 25965
13356 25965 33378 37856 40950 34952 29614 30513 46796 35850 30523 23986 29997 26720 37166 43617
13342 43617 44568 32091 29151 33460 37029 40344 28025 30188 36324 30480 21818 20387 22553 32992
13328 32992 48989 58980 62947 57303 57815 62169 65493 83191 80034 76008 78965 87151 82349 100116
13314 100116 98068 92655 111446 133764 131023 130333 137441 152135 169211 187143 221194 289022 378683
13301 378683 513210 721887 1011802 1329832 1555641 1632929 1524995 1287110 1002199 725388
13291 725388 525835 411502 345605 289681 257317 237323 205152 179098 170039 162234 145333
13280 145333 122253 111738 104672 93757 99944 94751 107702 107604 101786 104894 107604 102001 100952 99082
13266 99082 102589 111690 115942 115528 108953 113875 116764 121408 118370 123605 126256 123462 113017 100255
13252 100255 95508 90856 89483 83529 75221 70598 74237 78596 86169 75054 73451 77213 88111 86602
13238 86602 77645 86347 98891 113698 123171 119327 123284 128344 124282 125236 127365 138439 140708 154602
13224 154602 151737 153387 172541 188551 192819 202105 191135 197929 210616 228673 252013 255886 259871
13211 259871 260710 261179 273208 277767 282308 270674 262327 250317 247535 250056 236693 222122 218848
13198 218848 220717 219318 204509 195593 198558 199136 172937 156875 157870 165519 166190 153062 137996 130258
13184 130258 133034 145146 144832 140884 133302 134469 134698 143819 129270 123267 128669 133246 134996 129049
13170 129049 118822 114053 128021 143429 161931 186393 199244 200969 194495 179023 165185 149769
13158 149769 141808 133730 124239 134180 136185 142428 137138 128500 126519 129752 141661 127401 123093 118799
13144 118799 116728 114664 110096 113403 127505 126776 126763 141628 142675 139386 137112 126027 113937 129722
13130 129722 132969 132121 129704 125445 118228 119131 127332 140335 136915 136446 148575 143341 145530 135822
13116 135822 145162 150203 177805 229273 284025 340191 366064 357185 309735 265863 241623 220583
13104 220583 195922 195931 189717 187416 188313 172793 187640 198128 193286 181128 186866 190373 185497 184124
13090 184124 178982 184907 174787 160491 148207 152893 168355 170777 175363 187367 185033 188266 190018
13077 190018 187315 195178 197409 208682 227330 215006 200035 184396 177426 185850 201478 206435 205837
13064 205837 208400 210869 207692 200470 205302 215694 216566 223389 213280 188736 194050 189425 185853 204193
13050 204193 208960 203913 202395 220517 224099 212016 207866 207645 203094 182371 166311 169419 177661
13037 177661 177770 175780 167300 161716 188743 199873 210600 232478 241993 257206 256938 240786 229410
13024 229410 224283 222220 219822 214197 226225 229259 233300 234512 234391 250618 258765 264947 254841 268466
13010 268466 286451 293202 301435 286240 258974 246450 247067 262840 284059 289072 277732 281314 307797
12997 307797 318326 318386 333154 354903 394512 420156 442650 461159 480456 508493 540051 547747
12985 547747 540045 541868 523143 503176 479821 458111 435005 420387 418970 425248 423388 414994 410219
12972 410219 408906 410656 417419 434432 434018 444254 458051 465796 471670 472795 480488 488853 496362 507535
12958 507535 529806 555976 566937 572219 565503 567024 583878 594933 591745 587620 595106 614109 621121
12945 621121 619303 636371 653101 688320 708518 708582 706198 721917 738436 746258 747747 748370 758834
12932 758834 773318 783850 797779 828354 848277 853161 860016 881718 892166 914379 952481 985052
12920 985052 1011590 1037829 1069822 1109408 1129537 1170343 1214007 1258742 1310164 1361819 1403519
12909 1403519 1437846 1464549 1486983 1525259 1556145 1612456 1660772 1706605 1751564 1805548 1861054
12898 1861054 1926747 2004867 2093474 2210786 2335868 2460246 2594178 2732144 2850622 2958530
12888 2958530 3096573 3240226 3421557 3624587 3836957 4095774 4410900 4784068 5221860
12879 5221860 5724988 6265898 6854966 7518017 8273302 9162497 10232937 11548503 13195811
12870 13195811 15267932 17990992 21600032 26411122 32987280 42240962 55586303 75359329
12862 75359329 105488856 150985537 210548325 266379177 300762518 303212605 267261498
12855 267261498 212543572 157292162 111871973 82200924 64206151 52655828 44604886
12848 44604886 38600302 33905142 30195567 27129052 24492184 22097757 19877972 17934381
12840 17934381 16292924 14988452 13977304 13212669 12628469 12142079 11723355 11341710 10985225
12831 10985225 10677957 10386129 10115767 9891486 9720193 9601461 9525535 9502631 9512287 9552104
12821 9552104 9613485 9703761 9832477 9987791 10172278 10378519 10624518 10916492 11255458 11629134
12811 11629134 12030094 12453264 12927061 13433753 13997780 14595611 15245117 15948518 16707441
12802 16707441 17504848 18349969 19258945 20187361 21159708 22168989 23188309 24206351 25237280
12793 25237280 26290689 27340315 28349305 29316583 30216352 31048831 31792595 32410471 32885020
12784 32885020 33230325 33453044 33544548 33494813 33316631 33045699 32694188 32299485 31915022 31561977
12774 31561977 31310878 31375908 32050979 33601243 35429717 35633627 33701415 30533385 26810301
12765 26810301 23670141 21445903 19820848 18521223 17398221 16404029 15507479 14684020
12757 14684020 13903784 13179512 12496278 11855463 11273663 10747079 10255353 9781392 9348329
12748 9348329 8949210 8573648 8218765 7875544 7557573 7261161 6990585 6739738 6484372
12739 6484372 6244632 6040827 5869880 5733379 5611481 5466643 5292552 5135728 4969179
12730 4969179 4795591 4641368 4493118 4353125 4200640 4064313 3923643 3788899 3677037
12721 3677037 3565648 3473179 3384176 3289924 3189606 3086563 2992242 2916069 2832440 2759402 2687397
12710 2687397 2614631 2547428 2469488 2393572 2338811 2288893 2240403 2190296 2150819 2116336 2075439
12699 2075439 2044441 1999315 1956574 1925230 1893170 1858771 1832422 1801672 1753412 1715063 1683331
12688 1683331 1647298 1605669 1565558 1554301 1543048 1523198 1505485 1494808 1481670 1456583 1431907
12677 1431907 1405529 1374719 1345108 1314671 1296705 1278537 1246395 1219695 1182628 1167276 1176291
12666 1176291 1170426 1165626 1153932 1131553 1116395 1105885 1085064 1076934 1073918 1048435 1036388 1012411
12654 1012411 995184 978479 951832 934933 920331 895713 880097 869397 870446 865272 851882 843858
12642 843858 832526 830982 831724 818690 798657 804363 800799 786872 779160 780035 766472 760010 758213
12629 758213 741393 711398 692628 693664 686873 679368 690005 682817 657916 639956 619128 595976
12617 595976 591537 597201 598721 600496 599923 588496 582516 582532 551753 535070 536663 548760 562912 559849
12603 559849 556538 541986 546581 531329 511612 512498 512855 508040 490836 470074 469873 463761 450046
12590 450046 445938 443878 443166 437622 444204 437129 437314 440894 436592 424456 431080 428713 425629 421612
12576 421612 427568 429269 423644 411164 393038 381518 368768 369374 364989 364298 359000 357460 351228 331365
12562 331365 321366 333233 335604 324601 311893 308689 301224 286796 280575 263626 260593 267151 291622
12549 291622 309907 317075 316233 301759 298986 304670 301868 284154 281144 288922 291108 294240 296614 305979
12535 305979 309248 316531 301108 287303 289995 288814 299558 293186 281322 273395 277438 264350 266301
12522 266301 268156 262277 256669 251185 247606 246447 252181 248802 237922 236685 236160 227263 218063 209374
12508 209374 202430 199382 210063 211765 209190 217572 225132 236643 243604 234962 222901 224819 230747
12495 230747 227341 210235 209994 206475 205995 197174 199118 195973 200192 203501 211851 215958 220459 216037
12481 216037 208442 210885 208074 193319 185252 194813 208877 193950 191167 208260 200867 192190 188672
12468 188672 191606 200504 210369 201765 187652 186025 199757 201175 189781 175874 186635 209936 211905
12455 211905 202003 194701 192633 195922 180951 174037 171125 174303 175557 186277 205666 203592 194462
12442 194462 188619 196617 198026 192187 192239 188656 210469 232885 225596 236697 241301 230980 234434 246016
12428 246016 252887 257812 279211 312964 337516 349123 379241 411572 446200 496630 577631 719745
12416 719745 909322 1189030 1497151 1720218 1810159 1719032 1472221 1170291 908302 719948
12406 719948 591320 499672 444621 406579 390811 380530 351154 342165 332174 324244 311695 284938
12394 284938 256327 251822 271066 298756 318091 320525 340213 364745 373023 383901 402729 398642
12382 398642 381598 364183 347973 321571 302421 297199 297025 312054 301395 288019 296647 303893
12370 303893 305650 304289 293662 290603 290883 314757 329578 320586 311204 308065 310650 321259 325188
12357 325188 322712 332412 328897 317662 327275 337887 349202 362438 362535 362280 343796 346505 343606 321296
12343 321296 293004 272901 269542 270889 255077 244156 241749 224831 218712 215290 203678 208101 197904
12330 197904 185095 197924 194293 193531 192003 199307 221425 223746 222164 208145 195070 183283 155099
12317 155099 149457 151004 145215 142490 131648 125883 127688 130710 130812 126863 119303 118879 115450 111354
12303 111354 107443 120528 130297 133128 120407 111573 102585 107980 102239 101548 109107 110452 107458 106546
12289 106546 112142 107627 101461 93483 89970 88189 95842 95791 89009 108617 110143 97498 94597 110055
12275 110055 112138 109627 96054 87820 83000 71742 68219 74141 81276 86792 84174 73969 68081
12262 68081 79561 91488 84194 71687 79990 96234 82492 70458 70841 75741 65686 54553 70648
12249 70648 84930 97391 93170 91917 93990 95529 96392 91455 80072 92378 107246 102800 111744
12236 111744 106048 94957 92279 89535 78364 83741 82029 84068 85415 81350 83549 80217 81385 92403
12222 92403 115735 129695 139313 136441 147159 174022 188093 203707 229777 268239 305862 343275
12210 343275 389995 441543 503208 565882 622526 648921 627624 563598 497644 431960 363228
12199 363228 309992 275848 246699 225208 203026 169232 138659 137935 137788 135857 119435 103924
12187 103924 101824 119158 115023 122871 124543 141642 149373 150649 142285 117930 100231 92334 91212
12174 91212 87084 79595 79141 84378 87053 91201 81981 79867 70789 56438 50297 57875 60658 58304
12160 58304 45982 44544 65513 82084 64730 51533 63121 76223 57787 49358 46710 35171
12148 35171 40048 40292 41339 40734 38745 34996 39199 58762 60476 56626 54963 47503 42768 43368 44978
12133 44978 47419 55530 65033 58641 44180 31458 34088 31096 31990 43892 43899 49163 58406 64039 63563
12118 63563 46965 42991 41446 46502 43274 47911 55400 46312 51057 50616 33834 29195 31757 30329
12104 30329 29592 30696 53581 70200 53134 32770 31426 44834 50787 48614 48111 45624 33499
12091 33499 32954 23224 27918 41609 36715 35756 36105 32983 42128 46308 43282 50623 44620 47929 51251
12076 51251 61835 64936 61965 55334 55697 45922 28415 17791 16080 21607 35336 51888 54193
12063 54193 57631 51718 38170 34674 31385 35147 42226 63181 66087 53164 37130 30294 45060
12050 45060 36067 27182 52230 58141 43424 46362 50061 41999 50680 45321 20287 -204 3449
12037 3449 9682 20468 22337 17622 25303 37317 43012 44844 51945 53867 40572 26408 11065
12024 11065 5145 -3596 6753 23096 30219 33470 40270 29147 28284 31108 32788 43543 47333 38031
12010 38031 37529 42597 50804 57264 57387 62385 50683 47467 42088 40153 48565 55983 53334 44512 36401
11995 36401 42087 41752 33926 40018 50510 47860 36082 29570 16596 9707 4958 4411 4880 487
11981 487 3015 11607 18296 18838 21712 19481 14073 21153 19253 17286 22922 26267 18746 24754 29192
11966 29192 31938 25258 19437 8150 7119 11278 13118 33162 28458 17106 13431 17875 13088 16886
11952 16886 24743 29702 38995 42339 39177 47779 32995 31198 33955 41244 38911 38100 26019 15654
11938 15654 9811 17588 23690 24677 16374 24718 27300 31455 26249 26281 25053 19717 27750 38815 40359
11923 40359 34280 23815 24042 26234 23009 17594 17124 23665 34240 30901 20317 31835 33255 30955
11909 30955 30777 28504 24738 6003 6343 25768 25196 14472 17055 11563 15916 16985 23239 21184
11895 21184 12053 27667 20574 3969 -4106 7112 21483 26390 29202 23124 14496 7896 12136
11882 12136 14508 16101 15846 18648 10348 9833 -4894 -6660 -4989 9305 14013 10388 19210 23205
11868 23205 28901 35108 34744 41321 40232 27671 24391 14942 8281 21979 33307 24890 21249 20699
11854 20699 20986 14709 25546 26122 15186 14485 22418 23779 17949 5995 -5154 15690 9982 11598
11840 11598 26854 35648 29120 18720 5858 2217 5950 11500 12983 18609 18430 9012 8061 9897
11826 9897 4480 5619 14361 10875 11326 6270 -1217 -490 3157 18724 16498 16680 19632 15464 20227
11811 20227 23577 15561 27880 34560 19161 7393 15939 13207 7411 11790 12389 5543 8617 16206
11797 16206 24627 28175 21611 17612 14353 10701 6207 5536 2804 4763 -8897 -8329 -6858 6849
11783 6849 346 8105 14679 11696 1734 118 637 -16679 -8140 -1799 -3713 -1949 -6432 -8431 8562
11768 8562 10546 12165 12160 6537 -5032 -4666 6706 19800 8303 -1261 1927 8902 -4523 -17447
11754 -17447 -12561 8342 5776 3542 14444 15785 20321 29515 40688 37724 33175 18262 13523
11741 13523 1593 -6905 3594 25032 29262 27346 35542 35290 15507 10366 4504 6740 4111 12499
11727 12499 29654 33362 22355 28242 31733 41686 38343 22663 14224 13622 9783 11357 11246 7875
11713 7875 14243 21540 23646 24969 26130 13717 26967 37817 35528 25420 22338 15239 13310 17748
11699 17748 5031 -5031 10483 15745 6995 -3039 -866 11151 5720 -3044 -17827 -7876 4254
11686 4254 1778 2525 -1815 11337 18637 15399 9976 13660 16291 7816 -4990 1680 18824 21779
11672 21779 21212 14510 4202 2777 10476 18165 16650 31937 35396 32806 20831 7572 21244
11659 21244 31796 27397 24885 26433 33983 32178 22420 9672 16159 25602 25199 9688 5734 8561
11645 8561 9040 7906 7995 9400 5747 12455 9722 8326 10984 13549 -6095 -5542 5833 17891 22759
11630 22759 16788 20687 13552 10712 15757 10092 68 1428 -2107 4508 11942 10999 18996 24222
11616 24222 10575 -252 8484 -2997 -11420 -4996 -498 4593 -698 3715 9066 10246 15929 21757
11602 21757 14383 6468 3007 721 1829 3890 16447 23891 5384 -3988 5160 2915 5082 3478
11588 3478 13010 9170 -7186 -5728 -6610 -8117 -1492 1511 5076 13690 14254 16400 14628 12809 17689
11573 17689 17719 25408 18747 11569 8795 14563 2042 4158 1626 10277 2977 -11975 -13423 -8736
11559 -8736 -3643 3137 17436 23855 19339 24776 19862 24760 41746 33651 17825 14492 20146 20604
11545 20604 28315 8875 6869 12235 5695 7597 11997 23926 19964 27986 38884 37331 34536 22597
11531 22597 11496 15488 28105 50781 73025 104490 100273 78766 78106 60309 39486 45504 42622
11518 42622 24854 16483 14100 5329 18975 32968 34240 23360 29752 43892 39446 21893 7281
11505 7281 17592 21197 18486 18797 10931 11128 20123 17424 13151 -5389 -9795 -6298 -780 13259
11491 13259 19049 21199 12459 19519 20843 15372 5058 -12630 -1452 30007 32684 17897 17192
11478 17192 17882 12273 3663 -5392 -12869 -1240 -11129 -18650 -23856 -17653 -13170 5101 3909 497
11464 497 6146 -1765 558 -7558 -4148 229 8297 11922 7812 9116 11407 -3722 -2256 -5284 -4766
11449 -4766 20788 17789 3534 9858 5101 3380 -5817 2046 -2309 4151 6079 6764 17600 22129
11435 22129 9870 3968 16418 19342 24701 22310 15868 16927 20378 24506 15478 15982 11762 15181
11421 15181 16009 -43 -4786 3894 1385 -6210 1215 -1410 1123 5271 11393 2582 -5795 -12362
11407 -12362 4438 12954 15378 11672 16524 21745 17441 13722 9662 4919 8578 12577 10574 17815
11393 17815 17133 21490 7883 -8189 -5385 13239 15054 23076 6798 13785 15226 10715 1886 10988
11379 10988 11982 10157 9922 18176 25616 24801 23322 18993 16253 9731 1215 13027 18302 2319 15804
11364 15804 12308 -3319 -6228 -2639 -1061 10515 21788 8543 -9930 -9440 -152 7650 143
11351 143 7596 11530 9186 7404 12038 10378 18431 12812 -96 748 4501 16665 27730 23486
11337 23486 16594 15205 23533 14527 -1326 -8755 -174 11885 6856 -1155 -18145 -24502 -15215 9103
11323 9103 23904 14036 -1781 684 -2610 -1082 -5811 4647 2231 1023 8890 3856 4100 18315
11309 18315 20457 7528 6195 15178 35361 25045 11910 14454 10264 4499 16877 23391 16580
11296 16580 3300 -9850 -24880 -6223 1495 -17160 -19152 -17006 -4976 6557 10684 17417 29501
11283 29501 20035 11562 3253 8444 -2432 -5876 -11474 -8187 -6551 -11393 -10421 -6031 10319 18189
11269 18189 13381 8997 10001 -7331 -22291 -28321 -21349 -1041 19126 13755 15255 16113 5260
11256 5260 5610 10218 15835 9471 11652 13872 1666 -2935 -8594 -6673 -13562 -2873 6283 10476
11242 10476 16691 8890 5757 5534 2192 3799 5874 -6459 -27418 -14947 6300 -3043 -3657 5669
11228 5669 4025 -2841 -4368 -2964 2987 7055 5425 7326 3871 -5420 -2308 3455 -5537 -6480 -11226
11213 -11226 -2894 15425 23387 18680 27291 21338 9905 11286 10455 593 3733 903 -5651 -10534
11199 -10534 -9093 12190 23237 5594 0 4433 19595 25692 4004 5050 7899 713 1321
11186 1321 3850 1738 13696 10098 9142 -7814 -23790 -18236 -12878 -29129 -20196 -7419 15184
11173 15184 3535 -8478 -1767 2917 1079 14027 13138 4303 2013 5617 -4623 -17632 -4182
11160 -4182 11033 9796 11637 8314 -997 -2315 7519 116 1020 -9003 -12062 4151 4273 -7162
11146 -7162 -18156 -37068 -45230 -38807 -14432 2978 8908 12702 -5275 -15430 -13930 -2801 14894
11133 14894 24365 26284 24956 34665 26980 19193 7365 14974 10534 6312 10442 21012 15108 2140
11119 2140 3393 6714 11460 27465 14939 7569 5749 5570 12695 8343 -7142 -9299 -690 357
11105 357 -11450 -4560 2497 -2267 1775 -2774 -1335 3371 17409 25309 14536 8431 10322 1174
11091 1174 -8618 -5566 -1593 3 4008 12733 18432 1260 -1655 13351 17888 10600 4430 5758
11077 5758 -837 -7296 -8228 -6063 -6581 6206 16202 23686 17199 -1619 -5209 6118 23627 23276
11063 23276 17542 20230 24557 16368 12549 10113 19095 24950 11483 17511 30035 26983 12165 4454
11049 4454 15982 23633 35209 25972 7297 -6892 9907 20389 11283 2658 11701 16089 16502
11036 16502 15696 18855 6317 7517 -4390 -2984 -5933 -9553 -6732 2175 14655 10616 6147 6287
11022 6287 -1706 -8089 -12422 -19391 -22778 -11722 -14138 -7673 -23949 -32042 -24186 -18421 -22209 -12909
11008 -12909 -12574 -17166 -11052 851 5604 5874 3425 3075 -13410 -21521 -25915 -28275 -16477 -3
10994 -3 9763 14269 15050 12879 18246 16314 14440 7125 15456 13172 6568 2169 -8477 -1722 6084
10979 6084 -1809 -3588 4479 10806 14864 18118 30104 32376 22732 23522 6266 -462 1380 526 -5901
10964 -5901 3373 8462 27130 3856 -22954 -12065 -1055 5928 14817 25052 28482 24473 27580
10951 27580 24676 25776 11033 6876 6875 9161 7234 7605 3468 7910 4243 7631 2363 2539 -3863
10936 -3863 1432 10498 -3241 -10498 -18163 -11818 -5420 -6218 -6881 -4482 4414 -2455 -10573 -4362 -6203
10921 -6203 -11530 -4772 3292 748 5006 2061 4877 -1382 594 -3409 -15201 -16629 -11809 -2470
10907 -2470 14482 22918 11010 1312 3129 5812 -746 6718 13679 16878 16025 1703 3016 11074
10893 11074 9537 -3899 -13518 -5814 10238 11419 14006 27013 15550 3446 9042 19861 22748
10880 22748 10935 -4287 -7389 710 10232 26595 30735 20087 8173 -3276 -2982 -5852 4134
10867 4134 22981 13320 8116 -2127 2009 -2165 -7844 -3462 569 5561 -1803 -5335 -3204 -4423
10853 -4423 -14954 -8077 13386 25213 22873 21834 10083 -2109 -228 20650 21262 16888 -277
10840 -277 -4850 9444 12984 7847 4741 7998 7638 12570 11610 34425 21474 11933 7546 4740 4191
10825 4191 -2743 2038 2843 2729 190 -661 5672 -1191 -19939 -23652 -11105 -2222 -8944 -15151 -11401
10810 -11401 -12561 -10653 -5622 1697 9642 -1566 15172 22291 6417 -5980 5269 13054 11092
10797 11092 832 3038 8225 12071 5984 16473 24366 21572 17014 7681 9956 5235 -7132 -4076
10783 -4076 175 -3972 4425 13090 14391 3230 2710 -4708 -13813 1250 9595 8688 3066 6196 -8443
10768 -8443 -10337 440 2455 4524 8753 7536 4800 9494 6818 193 -6884 -6005 1043 10214 15842
10753 15842 6849 8211 8868 3886 8024 10194 3705 2120 -5822 -5228 -1981 2503 6593 11385 7221
10738 7221 12960 28639 29112 14001 3191 -2231 -11541 -3895 4614 22417 31470 17731 15493 20691
10724 20691 15121 5784 893 -1510 -1407 -10436 -4047 8868 6737 -14920 -11743 1599 4020 -1460
10710 -1460 12721 21451 4730 -11863 -6213 -149 -21753 -28592 -24659 -20957 -10168 5373 11114
10697 11114 5212 5035 17254 4980 -10235 -19225 -24757 -25327 -20382 -3604 -3403 5633 15455 19584
10683 19584 5761 8677 1247 -9903 -4740 -2735 -8578 2571 3463 -7262 306 13001 14144
10670 14144 16386 15437 22663 31236 39242 22413 8039 6760 -6428 -13801 -13828 -10986 -13259 -6508
10656 -6508 10096 16414 14259 6770 -5543 -3245 1402 -9377 -15404 -13279 -6583 -1614 7814 10070
10642 10070 17535 33093 30670 22760 12349 557 11760 20496 33977 20008 7880 -2949
10630 -2949 -13617 -22801 -8519 -2546 13163 25420 31642 24124 10809 -2175 -7772 -8789 6805
10617 6805 775 9616 18038 13073 4299 -115 8132 4165 -7152 4458 22473 31400 33305 15367
10603 15367 18167 24207 25808 14536 18223 12064 -3463 -3756 -9431 -21878 -17317 6835 12259 16099
10589 16099 19759 23089 19708 21749 17086 20006 20782 26213 29195 21117 3712 5667 13663 7066
10575 7066 1597 2890 1447 10361 16224 22452 31088 39040 47671 35812 36032 35571 27720 21648 23629
10560 23629 9390 269 4754 -1007 18938 30297 21960 16634 13053 17040 33348 36178 16317
10547 16317 16272 19622 22833 28397 32384 20446 24569 33857 35531 20031 15261 16527 26686 28602
10533 28602 20208 20426 22351 16700 21294 33559 28692 33850 31528 41450 56230 61331 81126 116990
10519 116990 174878 236132 342495 456482 471343 413848 320075 234926 167985 118835 91197
10508 91197 84483 83624 73334 63642 54288 37344 26193 19096 26425 27103 23431 12398 10287 12418
10494 12418 13353 21674 16248 16892 22655 21206 18418 27567 36281 31992 38227 32068 32435 23919 17184
10479 17184 16439 22685 30993 38198 32492 24875 26337 33211 36568 31332 20251 17407 4783 -9042
10465 -9042 -15344 2006 7734 144 2713 4958 10815 18896 9518 -6233 815 -2240 -8148 2153
10451 2153 -6557 470 8657 12477 12009 5170 11762 23620 31084 25677 18318 19150 12514 11090 18876
10436 18876 21416 30298 37369 48201 43233 55870 56859 41088 22815 19270 28704 34463 44340 60677
10422 60677 62017 75605 83792 90810 80454 64793 62830 53750 40251 35931 37050 16791 19382
10409 19382 23932 16429 8260 6494 1660 -1454 19467 23172 7316 11263 36047 57175 62175
10396 62175 67755 80523 76479 82354 103004 117143 143272 171716 185908 197439 202097 213599
10384 213599 222999 204921 179219 151670 134500 122379 106534 86254 75794 73305 67872 51892
10372 51892 38789 37062 38516 31753 27286 27747 24952 25426 25017 28828 25493 29223 29874 27312 21070
10357 21070 5702 -1307 11613 23775 20121 13704 8688 13692 26509 16246 4189 5253 4665
10344 4665 12917 12822 15751 20262 9898 4653 6790 8270 9914 8729 21854 31074 21607 24135 15869
10329 15869 -5521 -296 20622 31257 37678 20911 26459 19397 11942 9258 16370 11282 1154
10316 1154 12198 13592 10253 8741 23122 12754 6699 3090 -875 7871 6885 -2553 -6170 -10294
10302 -10294 -12115 -3721 10562 4106 4930 7326 15414 7865 800 8717 18126 29065 11724 10507
10288 10507 25911 35247 26061 26321 13939 8979 23922 12659 -6739 -16118 6848 20300 86
10275 86 3380 -409 -12719 1399 12350 13717 17699 25802 29269 27045 19540 23500 21235 22914
10261 22914 31368 33259 42226 50116 51668 44335 24563 8697 11336 22395 36476 33543 21166
10248 21166 20932 29157 22440 29368 29189 20613 29868 26481 15783 -4419 -7577 13447 18999 12936
10234 12936 17111 18246 19748 16185 21416 19263 10258 5966 -6465 -12724 2777 14188 21164 27469
10220 27469 28955 27300 38016 50169 59772 71184 65345 71646 93483 108567 122989 165037 236518
10207 236518 317087 381248 456566 521496 586797 625540 622761 584032 508763 440370 377830 312968
10195 312968 234784 181038 139320 110579 98914 86189 89481 68693 45813 42305 43583 35260
10183 35260 34041 41264 47302 33720 30932 27420 28363 25175 27952 35758 32370 11719 8981 8551
10169 8551 -943 -217 21451 42510 50273 35645 25280 25991 18791 3591 9229 18995 9181 9237
10155 9237 6018 22465 25152 24772 10866 9831 13938 18840 24515 8847 -17682 -13780 2060 12987
10141 12987 16662 21590 10671 -2604 4691 11661 12535 16615 11052 -754 -4508 -3169 2565 7630
10127 7630 17351 19655 10296 12023 20821 11963 -1889 8375 19439 33850 28210 22290 11928
10114 11928 12183 16551 27412 21293 16417 13841 12741 17771 17415 28693 31185 38518 43116 35294
10100 35294 8817 -6980 -7429 -5141 -590 -69 -5358 -2381 2890 15241 17428 2107 5830 27485
10086 27485 43657 44653 20679 4694 2361 7594 18968 18295 20971 32384 28799 26010 22518 33347
10072 33347 35055 43155 42146 48417 51205 39591 34470 29088 31729 40763 44298 44952 48128 48437 48951
10057 48951 50257 70928 72897 81287 82578 95269 120419 141510 148762 156334 151681 172252 197571
10044 197571 228200 267242 325605 399461 487354 633319 884547 1259571 1849536 2850758
10034 2850758 4576789 6686119 7391069 6540333 5104976 3261585 2015709 1361260 1005236
10025 1005236 799452 658500 545392 448001 383891 339482 307020 278708 240530 202198 190951
10014 190951 189805 182313 171104 150917 127149 120925 103665 72050 66591 80920 85103 70648
10002 70648 71711 62938 80783 83334 73780 64314 66667 66573 61448 56143 53084 40464 46206 51839
9988 51839 48564 49899 56190 63599 62165 58239 45935 54752 67590 53714 39350 30286 36095 32107
9974 32107 35363 49617 49987 45024 45333 51167 42621 33064 30314 29594 26322 36556 43347 36684 29851
9959 29851 21321 23577 35919 49646 45533 27644 18117 20492 28286 33510 42658 45976 63346 74940
9945 74940 80602 82345 80159 75375 76383 91010 117723 138867 144384 156727 167710 187187 221112
9932 221112 245757 271849 327235 348622 353685 384409 407857 407267 427165 453537 459641 445761
9920 445761 427188 415081 386028 365760 330611 314891 309283 296200 265382 224407 196390 170849
9908 170849 140753 137457 128349 118887 108854 100701 104378 108943 107494 106238 116093 100340 93782 81548
9894 81548 66717 64810 68314 65630 61593 47643 48627 54147 56624 55757 56522 56727 52886 55727 47589
9879 47589 54274 73278 59577 45047 50667 48086 43230 42205 39772 42532 40562 40727 36312 28202
9865 28202 29463 43734 49218 53260 52644 55875 60678 70110 69566 63623 58862 64289 58457 37115 35230
9850 35230 42171 42190 39139 34195 26568 27570 35419 46517 56228 64475 66434 64593 69927 55959 49402
9835 49402 38229 52609 65212 73747 73396 71667 54803 46147 49732 47860 45973 39502 38117 64455
9821 64455 80506 63179 59775 54341 52056 56968 66526 60649 45101 56287 69111 66001 51331
9808 51331 57419 75423 73183 63810 57380 69484 62308 60159 60340 63237 64992 66562 68865 58473
9794 58473 49265 55746 57250 53294 43722 37687 44707 60327 68155 64512 63829 66102 64580 62484 50531
9779 50531 51394 65293 66875 59995 46511 50907 44685 56244 75867 79481 75557 72463 64738 64446
9765 64446 58126 64678 48065 56695 71697 70085 72888 60117 47321 48712 48073 39019 44751 53035
9751 53035 51745 59264 62289 40674 51608 75407 73509 74431 70521 63458 62940 65588 62168 49172
9737 49172 45038 60936 64107 52963 51871 47638 49964 65724 81861 78471 79139 68220 66842 80571
9723 80571 86052 80617 65021 53753 63602 69737 71716 61614 69832 69053 67853 71270 76910 80340
9709 80340 77156 65906 72555 82407 77211 86597 106030 110941 106825 96139 105506 122390 133898
9696 133898 144311 130153 136123 145647 160283 179217 198077 218497 249991 292579 334810 380368
9684 380368 428314 471759 511663 555146 588129 599561 578108 552432 515647 471518 422711 385058
9672 385058 349097 312307 267503 229706 200127 184251 173954 156948 147733 146475 141519 123305
9660 123305 115980 110905 93390 91282 99774 112881 119696 126592 114706 111810 120659 112848 113306 109239
9646 109239 105222 89201 82734 76359 73519 86294 102946 107521 109392 115781 112534 100285 78948
9633 78948 83969 99498 107594 118414 121196 114524 111288 101511 96580 101768 96037 84291 78940 74644
9619 74644 81911 90334 82160 84683 85915 84007 81125 77578 70082 89672 93441 89045 78478 69601
9605 69601 79586 92465 98551 96935 92498 109081 114208 114935 101562 90089 88125 98903 114838
9592 114838 104289 100908 102998 112819 111357 104384 94928 93678 98033 109920 92448 88310 102313
9579 102313 102452 92865 78218 75905 74698 82651 78047 86247 96017 98852 89774 82879 67575 77296
9565 77296 80297 90460 106906 107920 110135 109804 106537 103461 100998 92954 97238 97195 92189 93563 89713
9550 89713 78546 73901 69363 86399 91383 96898 109293 108863 94784 99090 112769 122267 112669 104650
9536 104650 93489 102741 123284 125752 123158 108788 96689 88974 88540 87988 90512 84742 83156 95251
9522 95251 93722 83845 105219 113473 104319 106281 122661 118861 119448 122181 121091 112914 112115 119555 117080
9507 117080 97175 110621 116149 117152 114400 112978 118417 118025 122726 122159 114119 122757 128805 128643 129157
9492 129157 109471 95885 104545 112564 126050 128979 134618 132722 135206 129729 127795 139766 153312
9479 153312 151263 135597 132141 130625 135710 138701 137341 141929 150866 151688 137359 121290 126321 125103
9465 125103 119202 120637 130023 152467 156480 148246 151121 139998 132334 133108 133684 137114 134591 146371
9451 146371 138840 132790 139974 146402 144432 134140 128764 128503 144813 154405 163291 165679 158193 157823
9437 157823 165420 159067 165807 170238 161618 152754 141190 138903 150036 160172 165514 176697 169156
9424 169156 173342 179482 186130 190895 190620 184102 182893 179328 181816 188716 173390 164273 165980 177455
9410 177455 187515 181428 181471 190471 208174 220893 209009 197420 205729 210352 220656 235467 230872
9397 230872 213075 206441 202917 204467 208804 205109 202399 216705 221989 222414 213012 215227 223880 226732
9383 226732 215098 203192 204085 211076 210757 208586 215832 219285 215343 217868 229645 233708 233749 234897 217887
9368 217887 224329 238007 245563 235890 232453 235739 235194 237130 238708 257447 256154 255529 256129 249612 237797
9353 237797 225705 228781 236940 245865 245614 247449 255471 249088 244022 248974 245965 254834 253657 264702
9339 264702 266988 271686 281120 277595 280054 278744 280089 289232 303268 314855 309651 311500 302626 292122
9325 292122 293431 295558 292021 295650 301206 309000 319666 314279 307955 302390 316033 329370 338074 339256
9311 339256 349807 362188 378474 375223 375596 382506 388635 383013 372324 368539 371107 375860 387229
9298 387229 385729 374300 381476 385220 384909 385685 387788 393391 401073 412883 424754 426273 425262 427866
9284 427866 429433 434350 445426 440409 430322 435204 451977 469814 479681 477296 483539 491064 503004
9271 503004 527991 537831 535033 552935 580005 601238 601955 588991 582095 578480 555846 527991 526148
9258 526148 535059 548145 566539 574807 579283 601825 612811 607086 599779 604310 624791 626880 628426
9245 628426 642825 653498 652052 650885 656047 661327 683638 702700 711478 707243 720644 763746 793241
9232 793241 797793 811016 843230 862258 868492 844895 820930 798156 782906 768767 765858 770337
9220 770337 766486 783977 797349 793438 798129 802684 811166 831412 849514 867031 871060 882041 877126
9207 877126 867988 872775 869845 873747 880976 886573 899817 910672 911986 916518 929998 953244 970120
9194 970120 972281 979898 994259 1001655 1003469 1016989 1028848 1029008 1022751 1028429 1030439 1030059 1055346 1080914
9180 1080914 1087899 1104052 1119063 1125544 1132984 1134705 1149316 1160836 1179834 1200380 1216912 1222626
9168 1222626 1242312 1254776 1279007 1307710 1323828 1342101 1348052 1375057 1387321 1413407 1433630 1437343
9156 1437343 1456699 1478257 1510107 1537255 1548007 1565924 1575597 1581142 1597932 1623518 1645328 1682667
9144 1682667 1717606 1741927 1768310 1793284 1816869 1852475 1889249 1914350 1935015 1968199 2005682
9133 2005682 2030565 2053401 2084610 2116077 2164435 2195128 2240311 2286528 2314140 2338004 2370165
9122 2370165 2413005 2465734 2510386 2556598 2604732 2650729 2700855 2747986 2796271 2839802 2878766
9111 2878766 2911705 2963916 3013129 3074624 3135721 3200403 3260440 3315998 3373184 3448511 3489195
9100 3489195 3536351 3615807 3707523 3791227 3889111 3981715 4054629 4111557 4187034 4274366 4363155
9089 4363155 4466866 4562843 4652155 4746315 4847301 4958477 5062354 5176328 5289255 5399216
9079 5399216 5532907 5654511 5774168 5890329 6040542 6177297 6309326 6458117 6634874 6790185
9069 6790185 6942086 7104278 7266310 7434152 7613467 7793732 7981265 8169618 8359950 8549372
9059 8549372 8751633 8954045 9173734 9380352 9600238 9818625 10038367 10261889 10491088 10715293
9049 10715293 10950868 11201318 11438607 11674614 11928041 12179015 12440151 12688672 12930413
9040 12930413 13174689 13414571 13647330 13874340 14096799 14314862 14528075 14751658 14942938
9031 14942938 15132594 15303937 15470227 15628267 15781034 15906101 16009419 16113011 16193410 16261844
9021 16261844 16292588 16307254 16325523 16335089 16326844 16300533 16256141 16184213 16080507 15971056 15852758
9010 15852758 15723332 15584327 15431446 15266155 15093631 14900183 14705685 14508075 14296652
9001 14296652 14077523 13851183 13615587 13392151 13160809 12917678 12674233 12427222 12191388
8992 12191388 11948790 11702961 11461952 11227385 11007888 10774860 10550736 10332971 10106464
8983 10106464 9889274 9681997 9475475 9254254 9036298 8839773 8653560 8463649 8280390
8974 8280390 8104982 7929477 7745108 7569369 7407100 7262997 7111893 6960747 6827327 6702129
8964 6702129 6578686 6462627 6354454 6279107 6223034 6215535 6264571 6325218 6293433 6155784 5905144
8953 5905144 5633153 5384270 5184958 5017375 4877078 4755226 4654573 4544173 4449195 4343501
8943 4343501 4258005 4169274 4064557 3979360 3903108 3826539 3758173 3690260 3606174 3544627 3479890
8932 3479890 3425059 3367122 3302708 3238801 3197075 3141959 3065756 2999600 2953126 2918555 2884854
8921 2884854 2848151 2798255 2741970 2686568 2650771 2617847 2583075 2529830 2484783 2448478 2402936
8910 2402936 2363407 2327792 2295543 2258232 2221984 2196047 2175824 2151182 2118435 2084098 2061156
8899 2061156 2034214 2006582 1988055 1964306 1936620 1920722 1899990 1867850 1851379 1847376 1845144 1841610
8887 1841610 1835454 1838585 1845805 1853178 1869140 1904527 1916800 1923524 1942489 1993686 2049964 2157636
8875 2157636 2363175 2686338 3179664 3926600 4999045 6121258 6618221 6276479 5413756
8866 5413756 4329171 3389678 2763995 2359802 2110279 1945499 1825512 1723132 1643793 1581782
8856 1581782 1539258 1500131 1446898 1396511 1349241 1319843 1291109 1245412 1210320 1199699 1185294
8845 1185294 1154072 1128822 1115192 1101883 1085036 1072621 1042625 1011570 991648 983915 980953 973801
8833 973801 972318 957029 954577 949641 941702 922393 908867 900114 880827 869630 860614 850910 848601
8820 848601 840027 826621 821212 825053 825630 820730 804580 790520 760944 760655 764202 757155 754628 744296
8806 744296 734291 716882 717941 717088 714859 700284 691934 690188 687991 679745 672589 672413 663091 660027
8792 660027 659278 656503 653316 640616 639391 642034 625968 616837 611240 604063 591914 580507 589866 598115
8778 598115 596187 577047 579134 565459 550501 541007 527138 522415 525312 528749 526459 527861 524902
8765 524902 519353 525428 516587 516072 515697 508152 501850 505198 502780 493078 508426 510480 506460 518779
8751 518779 519802 513829 498419 489187 488179 478359 470017 454962 447824 448488 454914 479725 479635 476570
8737 476570 458481 438772 438420 443144 460500 448750 447142 444057 452535 453627 447146 448171 432391
8724 432391 423492 418475 407281 421644 411844 403472 394313 401790 397723 387763 381858 375003 373590 384602
8710 384602 385026 388949 386788 378263 378152 377061 370571 367928 377125 357171 346303 360504 356224 348422
8696 348422 337468 333645 326505 333471 334597 334791 336331 339148 328254 338122 343743 340512 336604 346154
8682 346154 353512 357292 337674 328378 323792 322656 318664 320118 334737 332009 324752 325536 339031 344029
8668 344029 343611 351348 348367 319686 324888 337558 339687 344066 345329 348177 338551 334348 312697 309179
8654 309179 319315 311137 312491 312444 329386 357156 355642 359635 369400 355696 357349 355136 345177 343720
8640 343720 343227 349150 349736 354965 361080 370686 367567 353182 339965 330998 316803 315843 318850 317782
8626 317782 300678 300378 315613 310906 299169 283660 287409 291811 286284 284959 273941 271098 281822
8613 281822 280295 275517 279664 275854 262284 252141 254727 258952 265452 269093 271928 256458 262749 256794
8599 256794 241330 241106 254162 258306 270601 272643 283504 288271 282961 287064 283028 269137 248855
8586 248855 241756 238531 236909 236277 233556 229261 231356 234903 222505 205314 208125 212297 213051 201722
8572 201722 201277 191205 177827 172040 166047 168529 178840 188641 197887 198909 186270 185823 191035 186495
8558 186495 186416 176005 168580 171097 183198 187879 185240 178246 174232 170002 177148 156139 142997 146641
8544 146641 157973 161023 163085 167869 162109 144099 150422 150104 153970 152871 153209 140575 140394 142677
8530 142677 164384 166460 146991 130152 123717 131332 150540 163970 172101 160573 140668 132586 130791
8517 130791 135468 129849 139271 143084 148801 149197 151216 148845 135092 132771 121764 108401 107007 112812
8503 112812 114404 117939 125528 126301 116173 113419 123441 132458 141468 142742 135107 118755 121743 133494
8489 133494 128012 116338 115539 124622 121640 122094 120155 126411 128710 126675 130276 132278 122998 116012 125555
8474 125555 131449 132634 141525 144463 146020 146359 147162 151121 149867 142544 137058 137413 146232 131895 129154
8459 129154 136413 143195 150255 149758 144889 140652 131213 123251 126834 113610 94462 96539 113324 112280
8445 112280 102348 97122 95270 98568 116887 111886 118834 116218 104012 97160 94764 86577 71576 74271
8431 74271 89106 93774 110122 126999 130076 124388 122512 117003 108490 97002 83420 81423 85924
8418 85924 85232 91716 94024 90206 92063 88423 89613 105413 109242 95859 95141 100788 112528 108669
8404 108669 90742 86646 95909 98069 94456 89017 81580 85810 94212 91363 95148 116051 125348 127103
8390 127103 121907 126700 135440 156353 156275 164877 197613 227099 220641 202395 180134 167923 149315
8377 149315 135810 116625 100436 106143 112363 108656 113751 120580 96673 78722 86756 83982 71085
8364 71085 62078 62306 69666 74017 66312 56526 62089 80025 89408 107088 114562 110153 80821 96070
8350 96070 113703 117506 125337 133021 151042 164476 183871 186070 170388 148852 128854 122117 110417
8337 110417 90394 85243 87456 79517 77180 80821 90024 87000 96238 100934 105108 96455 76114 56091
8323 56091 57764 74511 73029 69998 72405 67744 65720 71306 71617 73276 77233 83866 78088 61952
8309 61952 59559 72312 74072 67177 73936 70775 67731 65848 62973 59033 61551 61109 69717 66729 62039
8294 62039 61969 70711 73852 76121 62220 63080 60760 51239 43407 51560 49743 35387 41844 55713 61107
8279 61107 73394 76377 75317 71738 65980 66148 66089 63634 57468 63996 68116 72297 61144 53956 53346
8264 53346 61079 59096 54497 58027 66485 56653 56805 59546 76580 86671 85774 72023 70251 66105
8250 66105 68047 64153 47736 34581 46148 56077 63430 55074 62725 68880 67392 78374 82975 87726
8236 87726 84096 79735 70979 69211 64885 68506 80768 69897 65281 62887 51401 48541 61206 76568
8222 76568 77449 62804 54343 46441 55329 58756 58044 55466 57595 57835 43041 41079 44163 52746 62004
8207 62004 50454 35038 27273 33775 37370 34711 32938 39115 43874 50849 47810 48289 52947 57018
8193 57018 39351 21556 15574 18093 38030 53555 41527 50735 64471 46529 28636 28186 29149
8180 29149 41253 54477 48851 38884 38769 60274 70783 57672 44997 42978 43647 58886 65819
8167 65819 61945 60026 45346 43900 48648 55016 56665 56026 58087 53591 57829 54283 52895 49905 50725
8152 50725 60228 49509 32990 40441 46429 64133 67877 61055 63605 62542 69205 67857 66624 54893
8138 54893 33892 22172 18778 16683 26409 34193 30288 35518 38645 49814 42700 38298 44701 44499
8124 44499 51609 40095 35536 37548 38718 39123 41148 35476 31427 40376 50913 45753 34494 30587
8110 30587 25921 10412 17113 42699 22601 2951 -3580 24057 42585 32004 27589 39057 38084
8097 38084 33114 46835 54683 58177 48933 37797 42631 52868 54178 45902 42241 55617 51130 48965
8083 48965 31698 36796 52874 58998 53720 54879 59290 57975 53432 43352 38946 43482 38200 36562
8069 36562 43820 48796 57503 64552 74458 90584 82160 75873 84802 95359 86593 82029 92540 95207
8055 95207 91839 86914 89097 88858 89023 88802 88577 77921 77328 75931 79984 70638 62965 68758 78777
8040 78777 70433 75305 85245 78953 68779 55620 52869 67363 75134 61490 58483 70924 89135
8027 89135 93599 100299 124768 158449 187622 186863 177219 167249 152526 137978 135150 130601 131301 137208
8013 137208 156257 172285 173648 138667 119117 118809 114964 108660 103274 97042 95702 87319 78612 71002
7999 71002 55981 52968 53658 62127 59180 58252 66464 62933 77145 88527 79141 69298 76676 86814
7985 86814 85271 76010 79483 87785 95337 101144 97131 77085 72977 89427 81284 88948 95281 95703
7971 95703 90305 84936 80749 76059 77836 81131 81276 77806 75046 75686 76343 68950 75777 64174 70381
7956 70381 66260 64578 49793 49279 55668 58202 55731 59953 66738 70362 51893 45434 52827 44709
7942 44709 48413 41902 32557 27065 17537 30591 42474 57384 56230 60355 59788 55567 55752 49443
7928 49443 50986 49580 48023 40834 33804 28789 35991 44209 39115 21007 8195 3776 13896 29810
7914 29810 30461 31173 23193 22726 18870 21661 38230 39668 25750 21598 24387 32220 37640 40971 50079
7899 50079 50397 34347 17960 10239 23869 23924 34482 35572 19267 24165 41823 47527 29206 25430
7885 25430 26023 25529 26102 23590 28487 31190 17538 6610 15697 21493 24640 31789 32874 32713 38649
7870 38649 38453 27769 21390 24962 37633 37377 37644 29684 36188 43261 35239 39445 40442 33614 25688
7855 25688 20189 20614 24761 21625 23878 29318 31085 13212 8307 10200 11819 2105 3137 17958
7841 17958 21971 12914 10022 20275 27179 30712 19992 19208 24364 23749 18091 22646 12685 7795 -2308
7826 -2308 6521 7067 4635 1527 2705 14545 18221 11846 18901 19881 23638 30807 26161 17929 12278
7811 12278 10562 13120 10562 18095 27163 26701 27367 21925 13556 2939 3361 11025 4971 12223 21709
7796 21709 18621 16767 21012 17797 24432 37969 47099 56542 39972 12807 18735 31032 33984 28634
7782 28634 21359 15087 23990 31965 21720 3410 6195 13110 20691 15511 17503 18923 21528 12949
7768 12949 11237 12248 23266 24208 29693 21574 13633 4909 9234 17789 29661 39195 31586 10916
7754 10916 8067 6527 918 -15802 -18386 -11818 1652 5458 6272 -12 3398 20441 13541 -4746
7740 -4746 -185 8116 17197 31390 35938 17242 26341 20468 2621 7973 8521 2565 3776 10719
7726 10719 12268 22935 38702 31866 36254 31322 24370 17601 26512 41644 47497 37805 32403 33170
7712 33170 24020 18881 13078 13814 7192 9729 9218 13033 3602 -6858 -2362 5933 7348 14136 15212
7697 15212 10123 4661 -21 2718 5604 19725 32850 12802 -859 -4995 -6426 1330 13041
7684 13041 15679 635 -17112 -16023 -12141 6269 14688 12467 8104 12895 12404 12232 21942 34837
7670 34837 25340 15231 17235 16826 4068 6474 10288 2549 10865 21011 20928 12545 6715 -3425
7656 -3425 3136 2012 -5584 -8778 -7595 -11250 -8909 -5905 -5275 -14063 -4263 1373 5295 21988 19538
7641 19538 13619 20545 12561 4772 11010 22400 35675 15474 -4701 -3645 17275 34683 33509
7628 33509 28726 18009 20414 24737 21237 808 10731 26575 32627 32546 24760 10097 7292 6306
7614 6306 16053 14727 5773 11582 19926 25151 25754 19971 14747 1314 -1289 1335 -940 7409 31380
7599 31380 38327 29319 23818 30590 23247 6709 2131 17392 14546 12364 30182 10042 361 9076
7585 9076 4363 4241 -2472 1162 10652 1726 -14585 -12630 -4023 -9258 -3824 -249 2974 651 -1180
7570 -1180 5287 13698 20621 34805 24485 6334 941 2480 -3459 -2440 2132 6719 36 4273
7556 4273 11403 16583 9939 -1210 -3926 4361 3695 15035 10330 7134 -749 -13902 -22228 -31719
7542 -31719 -31500 -16675 -380 4510 7224 10127 11277 23396 32516 22406 17927 8363 10622 3774
7528 3774 -7 4940 2988 1678 -15710 -19671 -27590 -16908 -5973 -11681 -11617 -7179 6082 13742
7514 13742 6630 15946 7810 -1597 -3080 -7705 1909 4277 6154 4167 -1059 2704 -9473 -9792 -11523
7499 -11523 -6681 -5580 -8569 2573 6543 12471 19693 25246 13498 9978 8765 5167 -3921 4406
7485 4406 -76 -1050 -1814 6815 -2873 3578 4680 -3479 -6644 3151 13509 8693 1089 -4430 -3595
7470 -3595 228 1008 -3366 -7499 -2634 -17699 -23252 -23334 -10371 3877 16540 12813 19317 19915 17373
7455 17373 18693 -2042 -12415 -3215 -880 1366 6993 9117 -4539 -10063 -2368 8130 11538 23548
7441 23548 27567 16669 17746 15992 17043 14681 -3201 484 1643 2200 12548 9075 17590 18279
7427 18279 3035 -2554 -6256 -1861 1786 -4551 -6812 -12861 -9661 -3079 -1555 16520 30153 27473
7413 27473 11986 821 9329 9630 9316 180 12739 14166 6077 9015 -3457 -8943 -13041 -14080
7399 -14080 -2767 7319 5490 2959 5711 5866 7440 5768 10629 20908 4948 2884 2979 12136
7385 12136 14353 12983 12063 380 -4827 -10888 -14283 -11427 -1289 1797 -1382 1438 -1133 -96
7371 -96 4590 -3252 -17169 -5937 -2347 -1949 -6833 -8623 2734 3323 -3479 -8594 -16367 -17761 -7412
7356 -7412 -3529 -10096 -5881 -2049 2627 -7852 -20493 -32851 -26996 -17972 -11463 5520 25868 34105
7342 34105 32722 17292 7995 12398 12726 12220 -7000 -6662 -13199 -3422 -13252 -20108 -12815 -16829 -15959
7327 -15959 -10185 -5736 -1910 -17208 -21302 -6812 -505 -7877 -1183 6742 2977 -9303 -9695 -5819
7313 -5819 2839 8725 14582 21122 21614 20189 23541 21258 17396 2397 -1275 -1318 2507 3117 5885 3980
7297 3980 -4845 -7921 3323 10781 16691 19655 15373 14841 2739 -5201 -8008 -4426 -6158 -9955 -5484
7282 -5484 -1751 2687 4349 -597 -5044 12452 11346 -2811 -16918 -11271 -4360 -10319 -3863 -10348
7268 -10348 -16184 -20848 -11092 141 2713 -20727 -26906 -16031 -5953 -5928 -5327 934 -2227 -13032
7254 -13032 -9679 841 -996 -5539 -8032 -18691 -12107 124 -3130 162 -327 -4598 -11789 -6759
7240 -6759 -15341 -16007 -11214 -10976 -5250 -2800 581 10372 19857 24512 19031 7151 -14858 -16420 -4841
7225 -4841 2796 -6018 -700 11032 3595 10478 4993 4883 1153 -7420 -7046 6844 13646 10819 8984
7210 8984 -776 1864 5131 8516 6815 11897 17482 9591 5699 -14053 -27600 -18589 -7958 -1235
7196 -1235 3736 5041 -4704 -10193 -9328 2966 4876 -3067 -15036 3688 22013 9443 -6702 -1568
7182 -1568 11253 24059 22181 12701 5833 3712 3372 9529 21500 7545 -20545 -31960 -19892
7169 -19892 2242 15021 20730 20898 18649 24034 23165 18759 15786 -4893 -13868 -11391 -12405 -9069
7155 -9069 3338 12331 14977 16140 20161 15085 20105 14857 8247 4458 14099 20711 23942 27401 18636
7140 18636 10866 18652 24572 22741 21600 7247 -2948 -2591 -6196 1856 -623 -2255 -105 -11541
7126 -11541 -8465 -11395 -20222 -10775 -7228 -9136 -3572 1616 -5065 -13101 -16832 -21989 -18253 -21908 -17854
7111 -17854 -16856 -14762 -9478 -5318 -287 -7981 -10179 -3800 2784 -4186 -18628 -19375 -22918 -22828 -14573
7096 -14573 -15658 -11640 -17012 -21632 -20996 -2188 -2966 -5146 1148 16890 21981 14537 18228 12128 3377
7081 3377 -3808 -11661 -18279 -3283 -8324 -177 -9402 -18982 -13635 -6752 10972 10470 4354 -5982
7067 -5982 -14336 -4338 -9237 -875 2656 2883 -506 323 -13290 -6607 -4375 -14619 -3121 5671 10171
7052 10171 22342 17153 -958 -14028 -8793 -7454 5168 17948 15234 9027 9460 5414 1370 10903
7038 10903 -425 -3534 -7539 -1537 -2991 -7068 -258 5763 6100 11291 10902 5903 -8149 -1290 17139
7023 17139 19628 28318 24512 8648 7941 14946 18292 10303 11211 13236 12728 13656 20389 -4190 -24982
7008 -24982 -27208 -26442 -32185 -30975 -21950 -22630 -21583 -13860 -12906 -19212 -6381 -7121 4671 -2233 -11521
6993 -11521 -10528 -7908 1364 16618 20740 15875 962 -7161 -15705 -13197 -21092 -23473 -3170 6682
6979 6682 7981 13639 13250 -4040 -15615 -6959 -10849 -11726 -6219 -16334 -9411 -13116 3714 3043 -4671
6964 -4671 2903 872 -7226 -14494 -12033 -14240 -14703 1721 800 -6485 8093 25792 15338 9899
6950 9899 -380 10614 9682 -4560 -10575 -7535 -9285 -5645 -4543 2546 -8653 -7988 -12820 -9397
6936 -9397 -9478 1383 -4379 224 8900 2798 -769 -7442 -204 -2353 2608 -333 84 3389 -5170
6921 -5170 -13198 -13848 -9408 6091 10716 785 4303 8546 -753 -17269 -9212 7476 5227 2313
6907 2313 -10584 -14636 -8730 -9477 -11691 -11006 3876 15471 17355 11642 2961 5392 -3702 -9897 -4158
6892 -4158 -9460 -4023 3764 8546 10564 12170 -1552 -10022 -496 -8718 -15423 -19096 -11943 -13856 -21236
6877 -21236 -22417 -35085 -25970 -15331 -15138 -10838 -23797 -8372 9338 18721 5942 -2388 -3970
6864 -3970 -11512 -21180 -21671 -12853 -8264 -3781 3210 -1246 3743 -7328 -15039 -4655 -16138 -20388
6850 -20388 -16718 -13133 -10841 -7328 -13717 -24605 -30160 -22466 -15402 -4333 -14624 -12156 4743 6941
6836 6941 -830 -3012 8453 9498 13029 24926 15398 18967 24802 40057 48770 39852 32026 41610
6822 41610 38629 40976 32609 16706 17193 26311 10334 -9609 -26647 -32529 -12275 14150 20678
6809 20678 25199 21015 14380 20695 21687 22820 34795 37811 41574 41589 53698 56073 58435 60069 72574
6794 72574 63889 42708 30724 27447 28119 27343 17278 8438 16619 22816 7715 13598 15461 2008
6780 2008 2253 1662 -11455 -14626 -5607 10094 20511 9929 3697 -1566 -1454 3173 4911 8319 15646
6765 15646 17277 10001 -11842 -4229 8851 432 -6653 -10186 -12884 -7346 -9352 9933 15755 10449
6751 10449 11319 23223 24612 24607 26621 21368 16212 9816 17179 24558 27961 21882 9608 6876 6444
6736 6444 7015 11375 19109 14574 4830 2099 2239 -4189 4110 3094 11357 24274 32518 37320 47313
6721 47313 76791 83154 89097 79715 66951 47047 20766 8460 1966 1171 1163 1097 8212 10803 -1132
6706 -1132 -10371 -10349 1317 2006 -11673 -10073 457 4323 -3467 -15575 -16924 135 10777 -2819
6692 -2819 -16165 -5061 9826 13499 15373 13638 7245 -1808 -449 7782 -1781 -9671 -4878 4587
6678 4587 7737 -2274 -1238 -2406 -1039 -6997 -4069 9896 8636 5449 918 7722 9307 6416
6664 6416 -6270 -28223 -33609 -38831 -37802 -30586 -22221 -13293 -5562 -14056 -5028 -9950 -16213 -11934
6650 -11934 -10637 -16346 -13209 -14582 -20557 -23872 -14178 -16079 -22000 -12788 -49 -16 -3850 -11238 -19642
6635 -19642 -24464 -23078 -25958 -25297 4262 15033 13817 11144 7428 1040 -9037 4102 -942 -1649
6621 -1649 -2183 -10740 -14575 6002 24270 24533 17234 15673 12292 5889 2092 -3327 -1322 -4944 -3015
6606 -3015 12095 10818 3897 -10187 -9180 -7990 -18626 -20826 -24665 -11256 5378 11127 21206
6593 21206 5229 -14443 -31598 -33153 -18815 -17981 -22587 -20370 -13540 -8981 -25031 -34169 -35282 -32323
6579 -32323 -28983 -15942 -17578 -16464 -17568 -21810 -18522 -18342 -28096 -24579 -16477 -16995 -15028 -26706 -32239
6564 -32239 -17533 -8178 -3443 -3860 -14951 -12703 -6334 -6138 -5446 -6928 4359 -7076 -14871 -14948 -13611
6549 -13611 -8033 2534 -923 3632 -6315 -10321 -8504 1489 3372 -1589 -1345 13355 12668 11810 4699
6534 4699 5071 -4098 -25568 -24626 -10376 8802 10742 -110 1506 2947 4386 1642 -5615 -22648
6520 -22648 -10004 2280 9061 6262 -5376 -8879 10162 13691 -2222 -19929 -860 4007 11369
6507 11369 16891 5570 -13674 -36949 -44988 -23310 -17493 -4675 5660 2366 15834 12014 12732
6494 12732 11931 12518 21153 26783 17939 9707 7329 9173 -2614 -756 -417 3590 7831 11134 -69
6479 -69 -12307 -12526 -2398 -5598 4132 6264 12245 3773 -7072 -9706 -14755 -19901 -9946 -12492 -18190
6464 -18190 -17766 -1744 7670 -6818 -22215 -25287 -15965 -11590 -2607 5877 1714 6624 1446 -4097
6450 -4097 -1441 10606 -218 -5086 -113 3003 1453 -4954 3357 -6088 -8201 -7800 -7560 2934 -9310
6435 -9310 -20560 -30160 -35185 -28276 -26345 -28725 -16155 -7591 -1313 -2407 -11752 -2466 -912 13835
6421 13835 8572 -10247 -10618 -15171 2516 5866 -4238 -10242 -6189 567 8423 5403 2106 -276
6407 -276 -1106 -7090 2906 6233 -4470 -7253 -214 -11610 -15307 -5896 307 -1069 -2004 -15464 -16654
6392 -16654 -25091 -14292 -17991 -24459 -8443 16913 31517 24829 10285 8130 13523 9659 -6754
6379 -6754 -21517 -22027 -9422 3059 6597 -7372 -20386 -12945 2490 3255 1630 -6368 -5298 8133
6365 8133 11013 8754 15183 12708 9249 -6220 -25051 -29212 -21127 -13064 1066 3716 -55 5574
6351 5574 13257 13273 11362 8882 -5282 -5496 5640 3561 -5972 -17021 -18896 -14649 -8703 -4242 -6171
6336 -6171 -6702 -30719 -27812 -19845 -13896 -17833 -19032 -22074 -6765 -3111 1103 1078 14001 12390 15218
6321 15218 15693 23562 12479 12049 12858 4465 591 -20250 -34034 -37207 -36690 -18890 -7622 -2375
6307 -2375 3731 -11228 -14035 -5718 -1039 -6592 -10010 -29319 -24539 -1205 -6339 -13315 -5520 9162
6293 9162 16846 -978 -12388 -10039 -23973 -25111 -21437 -6558 1865 4891 -20867 -28637 -20524 -10638
6279 -10638 6340 8236 6579 -4917 -9536 -21078 -22183 -10958 -2825 164 2522 10001 9282 1364
6265 1364 -15694 -2777 5837 -990 -3735 4726 19851 17399 12703 18236 30502 25746 18809 7884
6251 7884 5596 8353 12188 18611 20472 16015 -12815 -23266 -23108 -9038 -11443 -23573 -22881 -8941
6237 -8941 -7881 -17434 -11983 -8599 -8821 -11781 -15133 -6385 3662 -401 -3316 -9634 -11623 179 7296
6222 7296 8743 4650 538 -2263 4962 10852 9963 17259 17386 -2948 -16696 -12968 -4566 -15014 -28787
6207 -28787 -32665 -23726 -25134 -25503 -26088 -15636 -8949 -10135 -10905 -4694 4735 -5882 -19847 -19564 -12442
6192 -12442 -10868 6964 27885 25877 8946 -1389 -9602 -6196 -2003 1442 -4676 -7825 -8971 -8592
6178 -8592 -928 -14693 -10450 -7465 -3026 -12178 -16806 -16401 -6105 2024 3023 10331 -12488 -17795 -16880
6163 -16880 -15888 -12416 -9955 -8956 3481 9147 2216 6439 -4355 -9482 -5544 -3397 5071 8779 -1880
6148 -1880 -11845 -10908 -20890 -18133 -16625 -22148 -20697 -10654 803 4004 10991 14605 8967 -4574
6134 -4574 -10373 -503 -3662 1697 5138 837 -8840 -9442 -27433 -36262 -31813 -19012 -11689 -4941 -10407
6119 -10407 -6657 -3413 -202 -4124 -4313 -16230 -19158 -11514 -4588 -270 -9415 -17737 -21462 -29081 -29656
6104 -29656 -22732 -13644 -9063 -18624 -24080 -17921 -19469 -33318 -24805 -14021 -16957 -21052 -14362 -8024
6090 -8024 -7962 -7782 -6415 -6807 -1495 -8686 -18761 -20153 -25178 -25122 -14743 -1056 -11054 245 11472
6075 11472 -5064 -11427 -7259 -8157 -11616 -2427 5693 5436 -3952 -2575 -525 12104 24169 22059
6061 22059 7360 -3659 -11363 -21836 -16853 -20035 -24522 -20943 -12780 3748 2283 -16636 -18072
6048 -18072 -13090 -14511 -25294 -21637 -17062 -4538 1474 -2756 -11138 -22258 -12709 4812 10179 2196
6034 2196 159 5000 -4151 8680 16282 6314 -592 14718 32572 29783 11238 14913 9375 10719
6020 10719 12072 8817 16489 19725 19569 -5454 -4061 7818 18294 31566 26159 26484 28865 14012
6006 14012 21235 19463 14928 4907 -10503 -17658 -13883 -16629 -7831 -8836 -10826 -18413 -23590 -7688
5992 -7688 -11245 -10167 -9650 -9210 -3767 -9339 -13827 -11366 -18420 -12210 -8538 -10793 -8439 -19920 -35901
5977 -35901 -30898 -9567 -19562 -33117 -19744 -13312 -6429 -1699 4258 2103 11275 22598 22805 9518
5963 9518 -3766 -8383 -12686 -23316 -24310 -18836 -11592 -2858 -2401 -4532 4750 9340 4292 17889 18272
5948 18272 9853 3674 -16611 -33431 -27232 -31829 -36055 -33341 -26781 -17377 -10059 -3186 -4501 -16470
5934 -16470 -25245 -22269 -16156 -12540 -7611 844 2171 14299 24241 18315 1755 11478 9427 -5604
5920 -5604 -17388 -21457 -23428 -6940 4240 6438 17259 24642 15612 -3941 7291 11538 15972
5907 15972 13190 14405 16511 6094 10392 15230 1402 -14283 -16423 -14477 -25482 -37197 -27448
5894 -27448 -31226 -18614 -15548 -27800 -19250 -2526 13481 17874 10035 13937 19073 22880 18659 28039
5880 28039 26639 8836 -8353 -3748 8343 1113 4591 -6665 -10227 -106 -3996 -18043 -19185
5867 -19185 -23773 -14306 -7777 -12866 -24527 -22829 493 4918 7241 6874 -4453 -13815 -6850 223
5853 223 226 -1262 -19299 -24940 -24601 -19616 -8238 -5093 855 4782 7996 17613 17326 -5255 -8616 -8281
5837 -8281 1182 2018 -4321 3266 2737 4301 -971 4185 -5580 -4727 -11782 -21670 -23503 -21607 -10686
5822 -10686 -7633 6867 -470 -1478 -11209 -4491 -5360 -3845 -2911 -4419 -11597 -17809 -14714 -15334 -5301
5807 -5301 -4925 -7398 -14101 -12332 -8778 -9549 -8424 -6832 -10933 1801 2121 -12472 -12762 -8551 -1747
5792 -1747 -10712 -841 12442 -1479 -7461 2490 -6204 -17720 -19741 -18043 -23484 -12089 -1524 -6355
5778 -6355 -14172 -13189 -14838 -13257 -17059 -11465 -15603 -15961 -27809 -23136 -13052 10988 25113 14877
5764 14877 4367 5737 13349 10310 7097 11075 8479 -3883 -6063 4137 6123 -1780 2919 6990
5750 6990 2638 -2305 -7316 -65 13821 12204 4844 11188 10478 14431 4424 -8528 -5439 -6953
5736 -6953 -17129 -18050 -7202 -1164 -299 -866 -1098 -66 1003 -4126 -5562 -1499 -3069 580 11160
5721 11160 4980 -7639 -20885 -20609 -3253 4298 7643 11492 18814 14506 14005 17672 6129 -4479
5707 -4479 -5160 -4485 -19776 -22548 -14763 -14513 -8810 539 -729 6014 944 -5455 -12415 -18484 -27027
5692 -27027 -26516 -2856 -4046 -8431 -10569 -14670 -398 19158 22286 30063 27915 4949 -10670 -3914
5678 -3914 -13899 -17190 -5290 -1370 -5311 -7646 -20737 -18618 -18887 -28030 -23173 -20272 -12106 6114
5664 6114 9794 -811 -4854 3991 9009 1245 2411 -3755 -18876 -25677 -17395 -20361 -15718 -19555
5650 -19555 -30164 -21728 -9821 5066 146 -1354 504 -10209 -19720 -20867 -23537 -30999 -25630 -30489
5636 -30489 -13411 -3143 -1457 9922 -250 9290 5775 -3391 2014 -738 -4946 -12017 -13302 -17848
5622 -17848 -23556 -35012 -27373 -21644 -18327 -7778 -860 16990 10361 -1314 3344 5124 6996 10595
5608 10595 11798 9749 5414 10735 -4923 -23432 -13638 -9276 -13720 9542 14169 13377 17162 22490
5594 22490 22446 16519 7439 -901 7786 6706 1057 11393 12921 -1487 -19998 -30359 -34640 -27166
5580 -27166 -6754 100 4480 6098 5004 5904 -821 5307 6762 9170 10720 6889 14530 12577 -2408
5565 -2408 -8854 -6704 -9679 -11807 -23466 -24802 -9742 6618 11746 7291 -10669 -17378 -24011 -16874
5551 -16874 -18643 -16675 -27614 -30900 -18578 -19922 -13515 -12313 931 22422 24878 12436 681
5538 681 -11196 -27374 -24881 -18498 -14352 -12920 -12087 -1263 6939 -10622 -8395 -7173 -11639 -9789
5524 -9789 -21946 -30486 -18051 -11310 -5806 690 10665 19425 16751 16655 7993 12224 12052 1874 -12441
5509 -12441 -16871 -19047 -23494 -15921 7004 6975 4451 1987 10865 11367 12514 -2566 -7236 -9050 -15951
5494 -15951 -11513 -3233 13 -3653 -7802 3019 1622 2762 -1999 2563 -11511 -7488 3712 178
5480 178 -5230 3687 -4145 -11291 -17871 -8146 -8270 -573 -7755 -22456 -19295 -3846 14914 25749
5466 25749 26643 23525 1891 -1943 631 -18180 -27268 -23485 -13447 -10514 -9987 -12912 -11537 -15309
5452 -15309 -12074 -9978 151 7571 1011 4945 -3588 -26840 -17095 845 -8123 -17664 -16404 -16821
5438 -16821 -28034 -23701 -16696 -13307 -1489 -11921 -22147 -19898 -13531 -9143 -14364 -19441 -17440 -21425
5424 -21425 -19212 -19905 -6850 -3913 -10555 2314 10881 2444 6837 4088 -1976 6301 8110 -6432
5410 -6432 2760 10843 6409 2315 -1399 -13470 -14934 226 4568 8615 10115 12434 1861 -6029
5396 -6029 -12492 -19614 -23277 -27638 -19366 -15637 -14757 -19602 -30440 -25662 -9507 -9884 -14944 -10767 2399
5381 2399 16942 10470 4792 4862 6106 -9823 -6263 347 -1093 -1572 -8884 -3113 26 6902 -7163
5366 -7163 -21422 -9561 11024 9330 248 -6616 -8679 -10407 -5580 -2547 5784 6187 -1258 -19614
5352 -19614 -20561 -11025 -10356 -10316 4217 -7029 -8981 -10191 -22305 -30806 -23173 -7765 -8949 -21796
5338 -21796 -13009 -17523 -5809 -13339 -15523 -7665 -5009 -2134 837 7083 20420 9198 -914 -11022
5324 -11022 -6790 2183 -2326 -5076 -6306 -18405 -25501 -30311 -21482 -19794 -19666 -13455 -6965 -20321
5310 -20321 -22214 -17914 -996 13124 17819 13613 -415 -5847 -8176 -8536 -8697 -19819 -16704 -1195
5296 -1195 7615 9241 2250 -6729 -9409 -8834 -10410 -9888 -16568 -20509 -12389 -15117 -11552 -13300 -11364
5281 -11364 3608 8453 -4622 -8423 -11410 -6069 -10545 -17137 -20401 -7610 -14384 -5413 5913 1106
5267 1106 2956 6299 16961 14079 14084 5321 -7554 -19087 -27331 -29990 -33527 -18758 -17540 -11114 -2470
5252 -2470 5311 8791 6450 166 2383 5368 8147 10038 2990 8199 -480 -12374 -10304 1775
5238 1775 3705 3805 8105 6200 -3211 -6433 -11485 -18600 -19010 -11896 4985 4190 1203 -1912 670
5223 670 3877 17088 13406 3557 -4637 6308 6450 -1203 -16191 -20639 -19680 -30269 -31503 -19220
5209 -19220 -2031 -2143 -15571 -20986 -20810 -12592 -5390 -8826 -9344 -22487 -29826 -30702 -36438 -32819 -33410
5194 -33410 -25756 -9954 10659 5173 -1872 1436 -8975 -9677 -12235 -17458 -14604 492 -3053 -6581
5180 -6581 1040 -13792 -15433 -7761 10444 26452 12114 13745 22317 23522 20511 7102 -10789
5167 -10789 -18125 -20117 -19716 -5983 -4760 -3939 -1141 4617 12337 -2915 -6994 -9530 3188 18382
5153 18382 24481 10293 -3562 -13139 -2751 6606 3242 -19039 -34551 -25644 -15261 -21116 -29778
5140 -29778 -17115 -3678 -19011 -25708 -8639 -8973 -13967 -8819 -4816 -8121 -7803 142 11250 5802
5126 5802 6146 8873 -3904 -15859 -11849 -15003 -22185 -17239 -16418 -9141 -1767 3959 11113 6371 5560
5111 5560 -4411 -4045 -3060 -1850 -1894 -9492 -11711 -363 1420 17935 19677 14811 4001 -4311 -6398
5096 -6398 -7418 -11016 -16754 -15293 -18533 -2585 12913 22135 7004 -5391 -9877 -10500 -12887 -19742
5082 -19742 -23036 -21351 -10812 -10537 -10126 -4110 -3022 -10731 -14400 -3136 9179 21871 18801 9302
5068 9302 8883 628 -6416 -15624 -13430 -23641 -16785 -18581 -16297 -6689 -18695 -24390 -19821 -7837
5054 -7837 10147 18674 13868 -2106 -7792 4463 1708 -2409 -13591 -16821 -5133 2773 -7467
5041 -7467 -13275 -10508 -14502 -23812 -17669 -9749 566 -7957 -20130 -10614 2685 7571 -867 7742
5027 7742 12901 7055 -9451 -14839 -20015 -14696 -25036 -11936 554 5993 6719 6452 11172 13495
5013 13495 15010 6340 -7091 -4436 6769 11292 13219 15102 8711 20310 18922 5792 9296 -5643
4999 -5643 -23540 -33353 -29053 -18853 -6292 273 770 1514 -3327 -860 6825 4161 -12481 -11541 3110
4984 3110 19774 25187 9433 4691 9985 5964 11328 10250 2510 -565 -1390 3450 6996 -7229
4970 -7229 1241 -7578 -18591 -17281 -11422 -26167 -28262 -18387 -5355 -2591 -26150 -32233 -11183 -2726
4956 -2726 -5730 -18664 -12852 50 5954 23516 11906 2531 4255 -3531 -6971 2620 10142 2997
4942 2997 3101 6633 3635 -3579 -11330 -7439 -12307 -4802 12062 18888 16277 18271 17036 13707 -11692
4927 -11692 -29452 -12358 3115 -813 -13075 -21348 -7007 2241 17254 13086 6851 3581 10700
4914 10700 16314 27436 36793 17858 -4076 -5868 -111 -2174 -2758 -7147 -15729 -9929 -8411 -2389
4900 -2389 -7220 -18803 -23075 -22051 -17255 -12860 -20178 -25700 -17108 -22120 -22455 -17469 -13655 -19722 -12005
4885 -12005 4468 7027 2023 -2081 -10480 -12337 -10994 -6912 4091 15645 26411 22056 -1969
4872 -1969 -17357 -10828 -7970 -8249 -12178 -15280 -8443 -14523 -15017 -18347 -17094 -11970 -24907 -12259 -25527
4857 -25527 -30284 -31222 -31044 -31504 -30475 -28685 -30585 -34816 -33065 -26489 -24226 -26725 -15621 2939 12698
4842 12698 9487 13579 13429 20172 17001 -4031 -3517 4216 -15216 -26282 -24049 -19746 -13411 -13556 -14529
4827 -14529 -8137 -5994 -6044 13 4260 -10028 -33446 -37962 -16912 -13448 -14054 -10674 -6571 -10199 1602
4812 1602 12441 -9762 -27818 -26268 -15057 9134 6509 -3885 -7706 -1561 -999 -1302 6640 9651
4798 9651 681 4187 5980 14952 16939 10101 1116 7672 19159 15444 -837 -1818 10558 -863
4784 -863 -274 2991 7399 -3554 -8785 6340 5937 5318 -2942 -1054 13334 12935 10325 11382 14940
4769 14940 13864 13099 8307 -1121 -439 -3317 8745 4547 9383 7408 12372 12094 6881 -4887 -6949
4754 -6949 -2880 11561 10143 -5844 340 16100 18415 18607 6840 10262 7718 8996 -97 -38 10312
4739 10312 19469 29614 25285 19366 16138 18097 12810 6831 6391 10322 19014 9488 -7627 -22736
4725 -22736 -22220 -10129 -11044 -5028 -4330 -15203 -28200 -19681 -6102 -3041 -7233 8002 9305 -7688
4711 -7688 -13638 -12730 -3295 2067 2468 15897 20086 24058 15193 461 -5527 -7604 -2802 -8984 -10217
4696 -10217 -12685 -13928 -7911 -8817 -11500 -11650 -18082 -24271 -19668 -9933 -2228 -2566 -1347 -15018 -15066 4864
4680 4864 14604 -3546 -13088 -1375 3592 -784 -6097 -8511 3113 2763 284 -3583 -8219 -7160
4666 -7160 -16434 -29299 -18482 -15955 -14174 -7821 -1891 7507 -1385 -12686 -14241 -7442 -6069 -4102
4652 -4102 -13039 -21711 -17995 -9289 -2274 -8961 -12237 -18289 -21625 -15644 -16809 -13912 -14362 -8274 -12356
4637 -12356 -12727 -19500 -13174 -635 10928 20561 10012 -523 -18340 -30116 -21300 -15930 -18789
4624 -18789 -21493 -6975 11508 3181 -619 -15433 -9261 -15904 -19846 -15515 -12490 -22079 -2804 7736
4610 7736 4422 7806 7220 -1011 -9854 -12158 -12818 -533 10650 9844 7343 11444 8321 14222 26784
4595 26784 18290 10617 9399 12327 3614 1071 -10923 -22408 -28215 -22225 -19787 -24228 -38745 -47709
4581 -47709 -38880 -17970 -10990 -12381 -14171 -4125 -130 5473 9840 12947 -8862 -4913 381 9993
4567 9993 355 4946 6620 3022 4659 -10599 -20013 -22875 -2353 10316 14041 10790 7335 6042
4553 6042 -6755 -9149 -12448 -5345 2513 -6069 1417 -4378 -9854 -963 3932 -3930 4374 5302 -8002
4538 -8002 -18806 -17158 -18964 -28809 -34551 -13303 5564 -6063 -862 8232 2396 -12052 -8645 3232
4524 3232 12714 9918 892 -7763 3063 5601 -2103 -7446 -1315 792 -4064 -6691 -10936 -13026 -14985
4509 -14985 -15127 -5329 -7170 -12977 -14979 -20603 -15997 -4226 2366 -3628 -1993 -323 -6114 658 11655
4494 11655 9748 18662 11332 -8582 -10621 -5339 -2473 1798 -33 -14762 -18494 1579 5168 697
4480 697 -3338 -4044 -10 6058 3012 4550 12640 12486 20392 23789 11525 2002 -2213 4863 7906
4465 7906 -1152 -11009 -3034 25993 28147 16818 5347 -4060 -1841 3429 -2119 3973 1770 -690
4451 -690 2145 2636 -7015 -11290 -8140 -8524 -2355 -12432 9046 2197 -15058 -17531 -5841 2668 4512
4436 4512 -934 -9117 -8079 -11800 -13378 -14198 -11773 43 12811 7774 13883 22578 16220 -3383
4422 -3383 -8931 -10033 4092 7236 -12017 -5487 4000 2374 -7522 -16051 -18329 -13044 7095 7578
4408 7578 -4966 -15139 -29639 -30765 -29305 -21726 -12965 -10322 -941 4922 -7915 -2320 6734 9801
4394 9801 5394 -9586 2700 6872 739 3360 17710 19728 11151 14864 7977 7608 11655 13425
4380 13425 4157 -19712 -15450 -13101 -6969 7294 16449 4048 -10008 -23965 -17782 -3498 -15498
4367 -15498 -22923 -16012 -9139 5816 5123 7759 -5707 -25362 -25338 -18235 -20317 -6743 -270 -5324
4353 -5324 8294 5420 1362 -3940 12180 20201 8159 3294 -2184 -10634 -3335 -20264 -23867 -11222
4339 -11222 -3817 -4420 -4689 -14368 -2203 13405 4781 -4351 -10874 -10631 1266 18171 18889 9049 3536
4324 3536 8280 21532 25814 17442 4512 8340 7916 5607 11312 21508 6859 -9951 -8029 14237
4310 14237 -554 -19230 -12244 -2167 4284 -3292 -2923 6058 5945 -228 -7975 -1864 2616 6636
4296 6636 7035 -6941 -8808 2957 20867 18921 6708 3912 2040 -765 10304 21037 14535 5119
4282 5119 7806 -13026 -10642 13434 16762 2556 -1814 -12946 -10799 1468 882 -4631 -1816 -4907
4268 -4907 -8731 -11329 8362 10184 13663 16854 28481 23151 9598 7010 -1950 -8240 -4970 -7075
4254 -7075 -4754 1071 -7028 -15267 -5253 2894 -1699 -25235 -12417 2491 -6256 -11044 -7025 -9416
4240 -9416 -8862 -12954 -40280 -28888 -7878 -4363 -5016 -1018 -8695 -15450 -19708 -16487 -8111 -7146 -10838
4225 -10838 -52 7375 -6471 -9094 -7605 -19771 -25840 -20692 -19220 -14641 -17559 -6915 -14766 -18060
4211 -18060 -9309 -8976 -8662 3845 -1919 -1568 18814 22078 608 -18191 -24472 -32622 -36610 -36869 -27431
4196 -27431 -18877 -13381 -7087 400 13947 25263 22311 8605 -1426 8420 9342 1647 499 -4865
4182 -4865 -7814 -12939 -14496 -11771 -10426 -10634 -10755 -22618 -13745 -10131 -6122 10637 16887 17241 15944
4167 15944 18191 1935 -2311 -6077 -10985 -7235 -7934 -6661 5613 2171 165 3907 13786 12874 -6933
4152 -6933 -7811 -5750 -3960 -12759 -6595 4313 8070 6020 14533 13663 -3068 -21332 -15953 -19283 -26828
4137 -26828 -30428 -16941 -8254 552 7479 -11439 -26555 -23432 -15128 3188 25955 22617 5555
4124 5555 641 -3334 -8616 -20804 -30474 -25216 -27973 -29133 -14035 -19239 -13108 -6941 -2584 -10021
4110 -10021 -25158 -16868 582 171 5948 11666 13524 18550 6270 -5324 -7333 -4693 -6129 -15953
4096 -15953 -29668 -25051 -13743 -18034 -16705 -1818 6174 4407 3740 10195 18030 7104 4558 3104
4082 3104 11242 7051 -5216 -9396 -18161 -26062 -23992 -9947 8852 759 -2335 -1186 -14046 -16290
4068 -16290 -6502 -16866 -21922 -9682 7214 10736 -6443 -17310 -21074 -8642 -11239 -14767 -15319
4055 -15319 -25467 -30185 -25148 -28370 -28029 -11862 -4382 -18703 -14752 -9528 -9298 -13115 -15528 -6363
4041 -6363 1749 13452 13857 -7962 -25209 -30459 -25105 -6585 18256 21856 11636 -3772 -823
4028 -823 10733 10573 4402 14565 8021 16104 8955 -5457 -6354 490 19264 7982 -2324 -7787
4014 -7787 -13717 -13164 -21613 -11726 -5875 -580 -4772 -4422 -3121 -5160 9153 21889 17826 3068 -10893
3999 -10893 -28687 -30997 -13445 -10176 -12593 1478 9573 -3354 -11757 -14466 -12529 -9957 -10500 -12181
3985 -12181 -14270 -8163 -8403 -10387 -11350 -22949 -13246 -11625 -10502 -5846 -2623 -8168 -11273 -6894 -7107
3970 -7107 -13352 -9981 5447 352 -1822 -11642 -22167 -19565 -19089 -19217 -518 7169 8078 13656 1288
3955 1288 -6846 -4884 -1824 -12261 -24434 -18283 -6074 -3283 -2160 -5786 -13302 -1839 2966 -4435
3941 -4435 -1277 -10820 -9161 -4029 2063 6305 15665 24550 5283 -8416 -15485 -10487 -19750 -25119
3927 -25119 -29449 -31613 -31802 -19339 -7164 2424 9079 4079 8262 9135 -983 5523 10884 -1866
3913 -1866 -9946 4422 12162 9664 3091 4137 10452 27509 29098 20807 15746 6377 3783 4584 12528
3898 12528 15408 -3515 -27674 -20532 -12336 -15573 -21391 -9003 1726 9737 470 -7945 -6147 -2074
3884 -2074 -4635 -1318 5257 7757 17463 14103 -2865 -13266 -6610 -1759 -18754 -16959 -5553 4846
3870 4846 12957 15303 13713 1641 -5488 -9816 -5420 -5448 -6628 -359 4465 1816 1972 567 4289
3855 4289 10916 8995 6900 1321 -3146 -454 3230 2380 5216 -9469 -10502 -8418 -4755 -15402 -22561
3840 -22561 -18933 -6424 -5071 -9937 -6880 -8397 102 -3742 6364 7916 4793 675 -13061 -19159
3826 -19159 -31559 -25365 -23825 -22237 8576 24003 12979 9023 19634 16648 15164 3214 7838
3813 7838 18384 17430 -1540 -8386 -11184 -10267 -13601 -13347 -14042 -10157 -4886 4198 3734 -10543 -16261
3798 -16261 -9042 -3366 8348 15136 19673 26816 24291 13104 -4400 -10850 -5667 -5413 6017 -1362
3784 -1362 -14386 2582 6856 -9380 -14964 -12801 345 8766 10985 14813 16527 7659 11862 10632
3770 10632 10260 8262 -2537 -8565 -5276 2497 15106 3843 -7419 -20876 -20319 -7451 -3735 -239
3756 -239 1626 15514 13686 -8856 -14721 -8698 6979 16683 18170 26967 24429 22299 17612 22476
3742 22476 8929 8058 3744 9874 -6202 -12970 -7892 -2168 -9853 -631 -2323 -1416 1865 -4158 -6519
3727 -6519 -17388 -18422 -2404 11513 12778 9301 5665 -10460 -10587 -12635 -9490 -2755 4992 -2947
3713 -2947 -5206 -4934 -2700 -19360 -29022 -3753 6390 8497 3736 -4071 7755 15097 14645 19419
3699 19419 18432 11834 -4185 -24731 -22600 -9229 -6435 -7874 -362 10580 14087 27493 26738 14291
3685 14291 17025 17677 12464 9653 -9830 -23172 -11074 -4851 -10217 4613 21520 24268 18956 15697
3671 15697 18708 6573 -4629 -12978 -21448 -22934 -36876 -31535 -36498 -31249 -23749 -11880 -6405 1313
3657 1313 1842 7123 9345 -1496 -10052 -8828 -6158 -15308 -23307 -34275 -22826 -7185 3085 -4057
3643 -4057 -6406 -16845 -28491 -28325 -11891 -5517 -8381 6693 10478 -191 -4688 415 -1862 4046
3629 4046 6239 -145 4100 4535 6870 17600 14404 1132 -5660 -10436 -7013 -4278 8745 8407 9171
3614 9171 1975 -6392 -15414 -19872 -19162 -11539 -10187 -5934 6756 6912 -14436 -13192 -8120 -4682 -2301
3599 -2301 -16165 -5266 -234 21984 27807 20532 13426 -10196 -7012 -969 5303 4077 -4939 4341
3585 4341 13575 1295 -16767 -28518 -18681 -10033 4321 6174 6987 483 -3448 1739 -1660 -4207
3571 -4207 -5346 -11886 -11407 1158 2981 -239 10704 14336 7140 2877 5204 -11524 -18925 -14148
3557 -14148 -28592 -24257 -8099 -1926 286 -10408 -15544 -15537 -22430 -15392 -9655 -11797 -5593 -144 -7671
3542 -7671 -15460 -7846 -7099 5377 26801 29380 26903 16851 16165 5870 4047 -8340 -29486 -37110
3528 -37110 -17484 4046 9527 -3847 -17782 -24128 -20514 -12543 -23423 -34820 -36412 -22678 -16759
3515 -16759 -15499 -23293 -26269 -31549 -25169 -11371 -1255 2255 -6501 -12695 -20234 -18565 -8512 -3474
3501 -3474 6681 10976 -10541 -20937 -16471 -14028 330 5781 10262 18747 20425 29209 24363 2065
3487 2065 -8227 -14181 -8769 -11544 -8054 -8771 -15088 -12585 2409 3573 322 -5182 -5749 3193 8634
3472 8634 -7 2405 4521 647 -4284 -10310 7514 26750 29106 21847 1167 -10406 -12124 -1405
3458 -1405 17049 21839 10632 4784 12598 23413 23795 17759 16300 7908 13164 18489 12587 2941
3444 2941 -14450 -24290 -20378 -6076 1245 -7700 -9852 -14730 -29033 -26369 -24168 -22347 -3647 6122
3430 6122 1106 183 3491 -11743 -28431 -24057 -14638 -4305 -2641 -12130 -5533 -1922 -13371 -14187
3416 -14187 -7811 -8143 -3968 -13736 -23650 -34059 -33216 -14686 -10468 -19143 -10421 -270 1489 -8668
3402 -8668 -9712 11700 11616 13045 23302 23010 10820 -2173 -20371 -9225 3464 -2547 -8 -3535
3388 -3535 3055 14208 14987 5308 -7069 -18457 -23278 -22719 -21332 -13010 7583 14644 1604 -5086
3374 -5086 -4975 -7388 -14822 100 -3987 -18830 -17695 -13073 -12675 -9908 -17444 -13281 -6130 -38 -7017
3359 -7017 -6123 7477 6081 -557 -466 -5889 -13467 -19211 -21777 -29362 -30855 -8635 -9604 -15521 -11994
3344 -11994 -24400 -24025 -24967 -23446 -12124 -11605 -10424 -1984 -8736 -26314 -31057 -21917 -19345 -15070 -20620
3329 -20620 -12516 660 13876 26377 13596 -16676 -17227 -11899 -8031 -9857 -175 -11122 -31086
3316 -31086 -31886 -9805 8849 17343 22292 25585 14418 17092 24298 29957 22188 12334 18099 20062
3302 20062 21318 13839 -5093 -23737 -24103 -17089 -14171 -4342 -8009 -10074 -7028 84 2119 -4532
3288 -4532 -7912 3483 14091 11078 4473 -1864 1463 14205 18018 12923 11499 -680 -13191 -16472
3274 -16472 -7998 -18187 -20853 -14260 1480 11393 18547 26100 28676 16728 5487 4245 14376
3261 14376 21790 13095 4687 -2398 -961 8191 9509 -1465 -4654 933 2382 6688 12129 3809
3247 3809 -6111 -6218 -14521 -27689 -25840 -18069 -6901 -1585 1647 3829 7921 8222 -9354 -13566 -4353
3232 -4353 2137 -1784 -187 6835 8634 11864 4303 -12883 7314 20664 -1337 -585 11448 17864
3218 17864 11787 3105 5029 -4789 -1799 11382 13573 -2317 -15864 -10268 -6325 -9443 -4678 -6128
3204 -6128 -9882 -2554 14855 16000 17163 425 -7790 5014 8170 -16795 -31442 -26231 -9743
3191 -9743 1281 649 3911 12451 3522 2616 10549 1165 -1676 5125 12048 13871 5478 11495 17980
3176 17980 26913 26405 16225 20017 13646 9780 4037 8018 15419 3400 3615 89 3434 9054 17418
3161 17418 17187 12950 12841 -4512 -17299 -9506 2347 9614 16294 20474 12728 13798 9239 10821
3147 10821 15237 9221 -4528 -5587 -3896 -3661 4541 7450 10374 9707 11484 20391 21359 7927 3759
3132 3759 1260 -3072 -11046 -7221 1642 4313 -12881 -27344 -25461 -21290 -7380 -16096 -6665 5001
3118 5001 21604 21421 12815 15006 -105 -17147 -16367 -12517 -19137 -34058 -35848 -24078 -1211 20224
3104 20224 21961 12001 4578 -768 -1681 -3761 14708 4217 -1494 -6375 -13276 -7357 -8268 -12502 -6269
3089 -6269 7646 13304 -7476 -13899 -6661 10501 11087 14858 19206 14817 18310 4956 2628 -7548
3075 -7548 -8930 -8073 3431 -3405 3765 18428 28737 21606 13623 1404 -13813 -7827 14321 21880
3061 21880 19511 13881 -3858 -11766 -9024 -10041 -10090 -6811 -15145 -28291 -14941 9998 12754 5928
3047 5928 -3401 -9707 -15720 -12042 -4838 -12218 -24088 -27405 -20997 -6252 405 -3259 -12554 -19674
3033 -19674 -3403 21052 20798 15184 7778 -7847 -7978 -8400 -6883 -683 -3507 -12546 -12136 -7899 -10307
3018 -10307 -7594 -10312 -5914 -3382 -11422 -14013 -14792 -17704 -20512 -17249 -17603 -17939 -24122 -14714 -4382
3003 -4382 -3374 -1843 -1354 3170 8730 12893 12969 17938 20536 14895 8736 5097 9414 3708 9312 7090
2987 7090 10707 1118 4127 8466 12856 13325 23661 9067 2482 -7570 -9649 -5251 1004 -10563
2973 -10563 -22583 -21678 -8582 8240 11716 1758 -2702 -7365 -4133 752 951 3392 6709 -2687
2959 -2687 -5369 -10321 -16343 -12631 -13304 -11393 -7248 -6291 -2724 1806 -2891 -12948 -9773 -9902 -21642
2944 -21642 -29557 -28516 -19030 -16815 -21953 -15356 1859 10833 7578 15147 14131 10321 1277 5408
2930 5408 -2962 -12009 -2728 -4813 -3354 3036 10087 22369 25584 12014 9654 16443 2261 -847
2916 -847 10381 1683 -8576 -19012 -5738 -6554 475 -13575 -23560 -19016 -21625 -22787 -22880 -8689
2902 -8689 -1654 -9813 -11716 -14874 -16788 -12752 -11299 -18955 -18633 -14994 -19787 -7548 3275 -4352 -21125
2887 -21125 -27209 -12869 -5259 742 12310 17038 4437 1159 19375 21896 17724 16910 8614 9585
2873 9585 11246 -7679 4757 4830 -11282 -8176 -4394 -13628 -16547 -10326 -16301 -8703 2816 1517
2859 1517 -540 -2891 -6814 -9139 -3680 1188 2065 -5160 6298 25245 14438 2537 6784 10415
2845 10415 20114 5737 5355 9018 11297 1829 -5528 -16522 -22992 -14443 10163 20331 9274 2485
2831 2485 4821 6037 -1494 1085 9795 21171 15761 2220 -7673 -12869 -11724 10944 12376 17656
2817 17656 28088 22297 7281 -9142 9149 19634 13068 -440 -7072 -20088 -23085 -14803 -8214
2804 -8214 -5318 -15385 -19212 -15801 -6332 -6175 -5707 16411 17442 6467 10305 18133 12106 5057 4211
2789 4211 2283 12787 4650 -1989 -8151 -23398 -35115 -23303 -7070 -9219 -13092 -9596 -8525 10668
2775 10668 25302 20369 15174 7423 7242 -10436 -20228 -18753 -17289 -7844 9112 8169 1603 6859
2761 6859 5086 6055 2248 -8071 -10817 -1365 -3374 -13465 -13870 -2263 -5101 -22679 -23576 -8777
2747 -8777 3163 1341 -2339 -1752 935 8910 -497 -1895 6451 -5315 170 6542 5065 4561 8359
2732 8359 12286 16192 4564 5039 7571 729 -11874 -19256 -2878 17907 20094 18596 16862 19560
2718 19560 18493 -2323 -16542 -14873 -14425 -6050 2835 5559 6376 1992 -11547 -11568 -19418 -15243 -11564
2703 -11564 -5224 7506 13499 13583 6491 -6243 2659 14520 7853 -9933 -12560 -2395 2377 8040
2689 8040 23788 3924 -20350 -14821 -3092 2952 8879 -3752 2667 14850 17508 24473 14896
2676 14896 7509 18706 21194 30608 25892 22416 16291 11806 483 -2925 -4255 -8266 -5205 -132
2662 -132 5065 10077 21014 15855 10369 13653 18425 22620 15969 1743 -1926 1682 -6742 -10596 -9966
2647 -9966 -12284 -7938 5635 6377 6689 11548 5717 10201 -479 -13853 -25588 -11473 4438 7955
2633 7955 -2987 -11245 -4577 2195 6993 7175 -846 -3409 -4558 -6835 -10608 -3836 2283 -355 5713
2618 5713 1589 -9161 2363 7249 410 10156 1992 -15030 -8194 1508 1678 -1967 -6694 -4455
2604 -4455 -15768 -10515 -7211 -13349 -11317 -14462 -10800 -10042 -20099 -15107 220 16074 7854 -1292
2590 -1292 7111 17390 11748 -2952 5912 15958 11676 7272 17212 16886 13835 19162 17834 16884 6772
2575 6772 14472 26059 11075 3756 6823 9755 7313 6109 3587 -8225 -24079 -15578 -419 10990
2561 10990 -945 -6786 4633 -220 7120 17455 12275 5469 6795 4505 -20179 -29969 -32269 -19799
2547 -19799 -4258 5315 1746 -5542 -7562 -2345 6953 11653 9372 2226 5520 10431 4517 -2051
2533 -2051 -2022 3645 9913 20601 11632 5575 6558 -1696 -6279 -9378 6304 2683 -3608 13059 79
2518 79 -20135 -18916 -11284 -11086 -1922 4905 3100 -7506 -6307 -8462 -10301 301 18481 30086
2504 30086 15162 678 -9498 -7970 -12726 -13980 -4947 -4553 -15662 -18269 -6720 -4731 5020 -295
2490 -295 4021 2410 8899 2169 -1663 1433 -6520 -5704 -785 3339 -2509 -2534 -6638 3275 1031 -10522
2474 -10522 -2417 -14003 -13393 -4534 -2570 -1677 9166 4623 -8688 -10737 -1848 -4753 -12270 -10901
2460 -10901 -12758 -6189 -16656 -12857 -8791 -4252 -1706 9924 18146 5495 -5738 -3522 -3093 -9134
2446 -9134 -6457 1325 14409 26314 26513 7076 6448 4002 3055 5308 415 12047 12212 19482 17598
2431 17598 11419 15196 -655 -7789 3841 4689 317 -4075 -1703 -11791 -25545 -26228 -13298 -12832
2417 -12832 -6022 239 87 4393 -5062 933 1917 -10526 -1778 -8224 -10638 3639 25184 29299
2403 29299 13691 -10572 -18882 -676 6434 11195 16024 20938 6687 -9584 -4945 9029 8452
2390 8452 9726 14797 5619 -7777 -13283 -13646 -4548 -4123 -4968 -10496 -13466 -3032 10046 8405 15595
2375 15595 14910 18140 11421 14007 12470 17855 32540 21449 -3179 -8952 58 6176 1776 7235
2361 7235 9107 6386 9467 8066 8014 9696 7168 -6739 -771 -583 -3796 -1213 3487 1228 -5279
2346 -5279 -105 170 -6614 2352 6175 -3229 -761 5936 -4050 3807 12094 2275 -6852 -5656 5779
2331 5779 13095 10480 9108 8898 12744 18060 17457 14131 7464 7361 10122 6572 2337 10850 9337 -1678
2315 -1678 -13591 -5268 1453 -3174 -7865 -3720 -9037 -6834 -4110 -5783 -5342 1046 -1096 6869 6697
2300 6697 -2309 -16716 -14487 -6108 -19538 -24819 -26887 -18633 7479 7009 -4420 9848 10456 -627
2286 -627 -7826 -9380 -7098 -4508 -4128 1245 3643 18009 17673 10179 1693 4178 2532 -1417 5451
2271 5451 17339 8532 13115 1782 4743 -1086 -8698 2876 9743 6497 5363 -2329 -5032 -16961
2257 -16961 -16932 -11997 -3868 6056 7935 612 -4616 -313 -11071 -9818 -14716 -16024 -6464 2973 7076
2242 7076 7527 18819 17695 12549 4030 -6362 -4185 -3507 -6680 -10429 -18099 -24848 -17836 1092 -11753
2227 -11753 -14763 -19997 -13466 -12052 -15062 -5112 -5274 5398 7532 -2681 4838 4479 -3774 -6325 11133
2212 11133 26096 33235 29410 31361 28206 15426 15419 17984 11063 16553 16945 11092 17700 27381 14459
2197 14459 23227 27502 20581 20644 3533 -3508 -4340 -13602 -16859 -13039 -6582 109 11499 20539 29712
2182 29712 19799 28952 40452 43720 28779 15106 10385 12696 6702 4802 13816 5523 -6663 -10343
2168 -10343 -4415 2575 -3313 -4382 9800 11531 10970 1507 3612 759 -21 -13897 -12649 -1310
2154 -1310 -3679 10974 4832 10908 5813 -3250 -20250 -21597 -12250 -1946 11484 29271 24142 7778
2140 7778 9315 12326 15369 2845 9913 16776 11778 -6270 3944 11480 -1056 -12814 -1172
2127 -1172 3836 9289 7755 -1274 -9422 -8602 -9979 -10476 -2693 21374 27850 4811 -8426 -1181 4063
2112 4063 6007 -1321 -1627 -8985 -9492 -11415 -6936 -9500 -13279 922 1912 7503 8571 4388 5082 17566
2096 17566 20576 5194 -916 -1902 -3030 -1825 7380 4075 -352 -4505 -12080 -7710 7910 10776
2082 10776 17799 21352 9243 -1498 -12801 -15556 -13591 -16854 -23487 -18597 -13290 -13688 -12174 -4474
2068 -4474 -2767 -3025 581 -6313 -3218 4297 16605 18654 4902 -3529 -1091 760 9002 -8833
2054 -8833 -26929 -31936 -31236 -20303 -13579 -11739 -21940 -16445 -4786 -11420 -9216 -4537 609 12331
2040 12331 24975 28061 4664 1267 18038 20878 19359 -9527 -21135 -16363 -4058 11180 16880
2027 16880 4482 -7650 -3588 1372 327 5183 18054 11547 13440 11569 8709 13055 5616 -7359
2013 -7359 -12413 -4112 7521 6253 -5265 -4310 -766 -10588 -4599 5625 17957 18028 11625 21185 21911
1998 21911 8736 -8377 -13819 -14110 -28209 -13572 1156 -2088 -116 5696 12922 9212 -2157
1985 -2157 10732 14042 3527 14404 18079 6976 6502 497 -11633 -758 -3629 -16974 -23705
1972 -23705 -10266 3544 6671 8043 3791 -2361 620 8784 -47 11886 14992 4308 2731 -2133
1958 -2133 -1044 -1537 -2594 -5906 -10439 9272 11964 5925 -7227 -4793 5218 7077 5236 39
1944 39 -3136 -4665 -4084 -5719 -1390 11634 7934 6040 15168 29687 35740 31279 32239 24981 10464
1929 10464 2093 3445 -9172 -7229 -11771 -16387 -13665 -6905 3754 -4470 -591 -872 -1971 -3568
1915 -3568 591 16019 11885 3364 -3831 1718 9232 -282 -6981 -3814 -1603 2446 1073 4963 11642
1900 11642 16310 17795 15951 12549 -5056 -4275 -8079 -9419 7925 19315 7044 12782 8274 4408
1886 4408 -538 9395 12416 1117 -10261 -7664 12007 26628 25507 5218 -10984 -13767 -7411
1873 -7411 9868 8947 2112 -5879 -5759 -2908 14827 4441 -12304 -2256 1251 18790 26026 12091
$$ [...]
##END NTUPLES=NMR SPECTRUM
##END=
