##TITLE=Analysis number 324390
Compound Code cc 60810
Book Reference 511/16
Project Code adrs
Chemist Name stevem
##JCAMPDX= 6.0         $$ Bruker NMR JCAMP-DX V2.0
##DATA TYPE= NMR SPECTRUM
##DATA CLASS= NTUPLES
##ORIGIN= Bruker BioSpin GmbH
##OWNER= nmr
$$ XWIN-NMR		Version 3.5
$$ Mon Nov 20 13:25:40 2006 GMT Standard Time (UT+0h)  MAYBRIDGE\nmr@NMR_250MHZ
##.OBSERVE FREQUENCY= 250.131544655141
##.OBSERVE NUCLEUS= ^1H
##.ACQUISITION MODE= SIMULTANEOUS (DQD)
##.ACQUISITION SCHEME= undefined
##.AVERAGES= 16
##.DIGITISER RES= 18
##SPECTROMETER/DATA SYSTEM= dpx250
##.PULSE SEQUENCE= zg30
##.SOLVENT NAME= CDCl3
##.SHIFT REFERENCE= (INTERNAL, CDCl3, 0, 16.4513)
##AUDIT TRAIL= $$ (NUMBER, WHEN, WHO, WHERE, WHAT)
$$ ##TITLE= Audit trail, XWIN-NMR		Version 3.5
$$ ##JCAMPDX= 5.01
$$ ##ORIGIN= Bruker BioSpin GmbH
$$ ##OWNER= nmr
$$ C:\u/data/dgb/nmr/ADRS/640/pdata/1/auditp.txt
$$ ##AUDIT TRAIL=  $$ (NUMBER, WHEN, WHO, WHERE, WHAT)
(   1,<2006-11-20 13:25:18.36 +000>,<MAYBRIDGE\nmr>,<NMR_250MHZ>,
      <created by zg, POWCHK disabled, PULCHK disabled
       configuration hash MD5:
       49 4B E0 1D 92 C2 6B 37 9F E6 65 BC 52 41 86 1D
       data hash MD5: 64K
       87 0E CB 6F 02 35 76 F5 33 B7 75 34 0F 7B E1 2F>)
(   2,<2006-11-20 13:25:30.25 +000>,<MAYBRIDGE\nmr>,<NMR_250MHZ>,
      <Start of raw data processing
       ef LB = 0.3 FT_mod = 6 PKNL = 1 SI = 32K 
       data hash MD5: 32K
       30 9C 68 43 17 90 64 53 EA AC 03 65 7B A3 C7 EC>)
(   3,<2006-11-20 13:25:31.89 +000>,<MAYBRIDGE\nmr>,<NMR_250MHZ>,
      <apk 
       data hash MD5: 32K
       35 A1 64 3C F3 C0 78 3F 72 67 4F 4D 53 A1 0C 70>)
(   4,<2006-11-20 13:25:32.63 +000>,<MAYBRIDGE\nmr>,<NMR_250MHZ>,
      <abs ABSG = 5 
       data hash MD5: 32K
       9A 13 AC AB C4 4C 44 03 37 D0 28 89 88 B1 D6 FB>)
$$ ##END=
$$ 
$$ hash MD5
$$ 4A 2A 46 7B 9F E5 A8 75 9A 87 41 D3 95 C6 3D FF
##$RELAX= 
##$RELAX= 
##$RELAX= 
##$RELAX= 
##$RELAX= 
##$RELAX= 
##$RELAX= 
$$ Bruker specific parameters
$$ --------------------------
##$DU= <C:\u>
##$EXPNO= 640
##$NAME= <ADRS>
##$PROCNO= 1
##$TYPE= <nmr>
##$USER= <dgb>
##$AMP= (0..31)
100 100 100 100 100 100 100 100 100 100 100 100 100 100 100 100 100 100 
100 100 100 100 100 100 100 100 100 100 100 100 100 100 
##$AQSEQ= 0
##$AQ_mod= 3
##$AUNM= <au_zg>
##$AUTOPOS= <17 >
##$BF1= 250.13
##$BF2= 250.13
##$BF3= 250.13
##$BF4= 250.13
##$BF5= 500.13
##$BF6= 500.13
##$BF7= 500.13
##$BF8= 500.13
##$BYTORDA= 1
##$CFDGTYP= 0
##$CFRGTYP= 5
##$CHEMSTR= <none>
##$CNST= (0..31)
1 1 145 1 1 1 1 1 1 1 1 1 1 1 1 1 1 1 1 1 1 1 1 1 1 1 1 1 1 1 1 1 
##$CPDPRG= <>
##$CPDPRG1= <>
##$CPDPRG2= <>
##$CPDPRG3= <>
##$CPDPRG4= <mlev>
##$CPDPRG5= <mlev>
##$CPDPRG6= <mlev>
##$CPDPRG7= <mlev>
##$CPDPRG8= <mlev>
##$CPDPRGB= <>
##$CPDPRGT= <>
##$D= (0..31)
0 1 0 0 0 0 0 0 0 0.06 0 0 0 0 0 0 0.0002 0 0 0 0 0 0 0 0 0 0 0 0 0 0 
0 
##$DATE= 1164029116
##$DBL= (0..7)
120 120 120 120 120 120 120 120 
##$DBP= (0..7)
150 150 150 150 150 150 150 150 
##$DBP07= 0
##$DBPNAM0= <>
##$DBPNAM1= <>
$$ [...]
##$SUBNAM7= <"">
##$SUBNAM8= <"">
##$SUBNAM9= <"">
##$SW= 20.6930455092707
##$SWIBOX= (0..15)
0 0 3 0 0 0 0 0 0 0 0 0 0 0 0 0 
##$SW_h= 5175.983436853
##$TD= 65536
##$TD0= 1
##$TE= 683.16
##$TE2= 300
##$TE3= 300
##$TEG= 300
##$TL= (0..7)
0 120 120 120 120 120 120 120 
##$TP= (0..7)
150 150 150 150 150 150 150 150 
##$TP07= 0
##$TPNAME0= <>
##$TPNAME1= <>
##$TPNAME2= <>
##$TPNAME3= <>
##$TPNAME4= <>
##$TPNAME5= <>
##$TPNAME6= <>
##$TPNAME7= <>
##$TPOAL= (0..7)
0.5 0.5 0.5 0.5 0.5 0.5 0.5 0.5 
##$TPOFFS= (0..7)
0 0 0 0 0 0 0 0 
##$TUNHIN= 0
##$TUNHOUT= 0
##$TUNXOUT= 0
##$USERA1= <user>
##$USERA2= <user>
##$USERA3= <user>
##$USERA4= <user>
##$USERA5= <user>
##$V9= 5
##$VALIST= <valist>
##$VCLIST= <CCCCCCCCCCCCCCC>
##$VD= 0
##$VDLIST= <DDDDDDDDDDDDDDD>
##$VPLIST= <PPPPPPPPPPPPPPP>
##$VTLIST= <TTTTTTTTTTTTTTT>
##$WBST= 1024
##$WBSW= 4
##$XGAIN= (0..3)
0 0 0 0 
##$XL= 0
##$YL= 0
##$YMAX_a= 354852
##$YMIN_a= -224933
##$ZGOPTNS= <>
##$ZL1= 120
##$ZL2= 120
##$ZL3= 120
##$ZL4= 120
##$ABSF1= 16.45131
##$ABSF2= -4.241863
##$ABSG= 5
##$ABSL= 3
##$ALPHA= 0
##$AQORDER= 0
##$ASSFAC= 0
##$ASSFACI= 0
##$ASSFACX= 0
##$ASSWID= 0
##$AUNMP= <proc_1d>
##$AZFE= 0.1
##$AZFW= 0.1
##$BCFW= 0
##$BC_mod= 0
##$BYTORDP= 0
##$COROFFS= 0
##$CY= 12.5
##$DATMOD= 1
##$DC= 0
##$DFILT= <>
##$DTYPP= 0
##$F1P= 14.0000005364418
##$F2P= -0.99999901652339
##$FCOR= 0.5
##$FTSIZE= 32768
##$FT_mod= 6
##$GAMMA= 0
##$GB= 0
##$INTBC= 1
##$INTSCL= 1
##$ISEN= 128
##$LB= 0.3
##$LEV0= 0
##$LPBIN= 0
##$MAXI= 10000
##$MC2= 0
##$MEAN= 0
##$ME_mod= 0
##$MI= 0
##$NCOEF= 0
##$NC_proc= -4
##$NLEV= 6
##$NOISF1= 0
##$NOISF2= 0
##$NSP= 0
##$NTH_PI= 0
##$NZP= 0
##$OFFSET= 16.45131
##$PC= 1
##$PHC0= -48.1338
##$PHC1= 12.15396
##$PH_mod= 1
##$PKNL= yes
##$PPARMOD= 0
##$PSCAL= 4
##$PSIGN= 0
##$REVERSE= no
##$SF= 250.130017680592
##$SI= 32768
##$SIGF1= 0
##$SIGF2= 0
##$SINO= 400
##$SIOLD= 32768
##$SREGLST= <1H.CDCl3>
##$SSB= 0
##$STSI= 32768
##$STSR= 0
##$SW_p= 5175.98343685301
##$SYMM= 0
##$S_DEV= 0
##$TDeff= 65536
##$TDoff= 0
##$TI= <Analysis number 999999
Compound Code 99
Book Reference 9
Project Code 9>
##$TILT= no
##$TM1= 0
##$TM2= 0
##$TOPLEV= 0
##$USERP1= <user>
##$USERP2= <user>
##$USERP3= <user>
##$USERP4= <user>
##$USERP5= <user>
##$WDW= 1
##$XDIM= 32768
##$YMAX_p= 306367261
##$YMIN_p= -842075
$$ End of Bruker specific parameters
$$ ---------------------------------
##NTUPLES= NMR SPECTRUM
##VAR_NAME=  FREQUENCY,     SPECTRUM/REAL,   SPECTRUM/IMAG
##SYMBOL=    X,             R,               I
##VAR_TYPE=  INDEPENDENT,   DEPENDENT,       DEPENDENT
##VAR_FORM=  AFFN,          ASDF,            ASDF
##VAR_DIM=   32768,         32768,           32768
##UNITS=     HZ,            ARBITRARY UNITS, ARBITRARY UNITS
##FACTOR=    0.157963299565203, 1,           1
##FIRST=     4114.96626209081, 0,            0
##LAST=      -1061.0171747622, 0,            0
##MIN=       -1061.0171747622, -842075,      0
##MAX=       4114.96626209081, 306367261,    0
$$ Real data points
##PAGE= N=1
##DATA TABLE= (X++(R..R)), XYDATA
$$ [...]
23257b91081j87055J71096Q8934J36452L4530J24929K6027j99998J21665N0833
$$ -291081 -478136 -307040 -218106 -81654 -47124 77805 103832 -96166 25499 76332
23247G6332Q1174l0343j07072q9222r3356j15423K12572J70968k3802N3731J15193
$$ 76332 157506 127163 20091 -69131 -162487 -277910 -65338 105630 81828 135559 250752
23236B50752J06227M616k30233o5343j7741J39486R31L6340J28102j50141q3163
$$ 250752 356979 361595 131362 66019 48278 187764 188695 225035 353137 202996 119833
23225A19833p8561j3335o1886Q8181K24490p4951j95065P0429L43464q5527j43373
$$ 119833 41272 27937 -33949 54232 278722 203771 8706 79135 422599 337072 193699
23214A93699j18646m3301p0179J7217Q9587Q6270J07727j96974K673P8642N0568
$$ 193699 75053 31752 -38427 -21210 68377 154647 262374 65400 68073 146715 197283
23203A97283j62559k64568r883J71964O1667o7146P4697K1421N6745M936j39127
$$ 197283 34724 -229844 -239727 -67763 -6096 -73242 1455 22876 79621 84557 -54570
23192e4570p3294J99757N1758q0507j18192j69955p5921P2526l6801P3174J88007
$$ -54570 -127864 71893 123651 43144 -75048 -245003 -320924 -248398 -285199 -212025 -24018
23181b4018K24441n124k38110k5657J84581J37273M485j60713l2301J8560r3016
$$ -24018 200423 195299 -42811 -68468 116113 253386 257871 97158 64857 83417 -9599
23170i599j15292j04846n151J92674N2035J05587J10904J20205k17473o1612J76199
$$ -9599 -124891 -229737 -234888 -42214 9821 115408 226312 346517 129044 67432 243631
23159B43631J3986k89726j09933J4854j17586L6178m8724R5228K36983J50242
$$ 243631 257617 -32109 -142042 -127188 -244774 -208596 -257320 -162092 74891 225133
23149B25133k02896k15084l8937K4472j5269Q3790o853r1377J93392K190l50617
$$ 225133 22237 -192847 -231784 -207312 -222581 -138791 -145644 -237021 -43629 -41439 -392056
23138c92056j2064J34025P3812O8407Q7230J41412L2375r2340l25913j54627J12936
$$ -392056 -404120 -270095 -196283 -127876 -40646 100766 133141 40801 -285112 -439739 -326803
23127c26803O6891j8902O1456N3613j54729k0690K06743P8721k724o0711n93J18256
$$ -326803 -259912 -278814 -217358 -163745 -318474 -339164 -132421 -53700 -56424 -117135 -117728 528
23115E28J52803J50959l6634k0634n9438j89173l6500J59759O3831n0592L8869
$$ 528 153331 304290 267656 247022 187584 -1589 -38089 121670 185501 134909 173778
23104A73778k4100j44291o1987p5150l3565k0676j59299J72036K31646J04109
$$ 173778 149678 5387 -56600 -131750 -165315 -185991 -345290 -173254 58392 162501
23094A62501P1317l8432J36188P976r3698m989m15346j98388m2724K51982J74165
$$ 162501 233818 195386 331574 339550 245852 240863 -174483 -372871 -415595 -163613 10552
23083A0552J09308P5337L1598m4114O8226O710O837j01358j8154j39077r2241
$$ 10552 119860 195197 226795 182681 250907 257617 264454 163096 144942 5865 -86376
23072h6376N2589K147R6537j5833j82835J02398J76695L6838Q419k16435k17612
$$ -86376 -33787 -31640 64897 49064 -133771 -31373 145322 182160 190579 -25856 -243468
23061b43468Q5066J1392p2890J1959J88068J62895J23429o9821j51192j41145
$$ -243468 -158402 -147010 -219900 -207941 -19873 143022 266451 196630 45438 -95707
23051i5707Q5484m6797q4771q2402K15068j28523j05142J42377J80448J44715
$$ -95707 -10223 -57020 -141791 -224193 -9125 -137648 -242790 -100413 80035 224750
23041B24750k3976k19599P1639K45066R8664k1378k60593j14444J6089p2901P8588
$$ 224750 200774 -18825 52814 297880 396544 375166 114573 129 16218 -56683 21905
23030B1905K21062P1561j72150k5133J53150m7280k14595j15727j34992j39550
$$ 21905 242967 314528 142378 117245 270395 223115 8520 -107207 -242199 -381749
23020c81749j27383J0880Q6134M1432J90434J61668l9123p152j16909J7823j66052
$$ -381749 -509132 -498252 -412118 -370686 -180252 -18584 -57707 -64859 -181768 -163945 -329997
23009c29997q0798n4357o3888J0861O3342M5316O2005J43304K29843J06582r9990
$$ -329997 -410795 -465152 -529040 -518179 -454837 -409521 -347516 -204212 25631 132213 32223
22998C2223k21172o8470K8296j91988p0661O8322J45036j37328j77918K37430
$$ 32223 -188949 -257419 -229123 -421111 -491772 -423450 -278414 -415742 -593660 -356230
22988c56230K16693J27446J40425k4451j42673o8805J08106j754l6761k6644K2142
$$ -356230 -139537 -12091 128334 103883 -38790 -107595 511 -1243 -38004 -64648 -42506
22977d2506J08762r6089J87450J43264m1172k97180k14377k5999K65675N8273
$$ -42506 66256 -29833 157617 300881 259709 -37471 -251848 -277847 -12172 46101
22967D6101j0312j6680K37053q8370j13725J16946k1567m5067j77305L1967J59051
$$ 46101 35789 19109 256162 167792 54067 171013 149446 104379 -72926 -40959 118092
22956A18092j83409n5539J17113m4646o1324q1435j33179J05138P9171R2621J2535
$$ 118092 -65317 -120856 -3743 -48389 -109713 -191148 -324327 -219189 -140018 -47397 -34862
22945c4862Q4540q761o8333J59187J18772k79778k49141L8668J24497j3161o8837
$$ -34862 49678 40917 -27416 131771 250543 -29235 -278376 -239708 -115211 -128372 -197209
22934a97209j49572J46063J13882o6051L0468L3657J9679m0126J51739K29353
$$ -197209 -346781 -200718 -86836 -152887 -122419 -88762 -69083 -109209 42530 271883
22924B71883j67360j52994J6112J61600j84809K2070j07119M0524m0337N5357
$$ 271883 104523 -48471 -32359 129241 -55568 -33498 -140617 -100093 -140430 -85073
22914h5073K20621R0959k4399j13906k6930l328j85011k70852P3424L08719R7264
$$ -85073 135548 226507 202108 88202 61272 57944 -127067 -397919 -324495 -15776 81488
22903H1488o4979j09792J2019P9636K8598Q5369k1106j80758q6873o0248j61399
$$ 81488 16509 -93283 -81264 -1628 26970 112339 91233 -89525 -176398 -236646 -398045
22892c98045J64797M99046J16250j82461k4858r728j53896k46787o9292K46528
$$ -398045 -233248 265798 382048 199587 174729 165001 11105 -235682 -304974 -58446
22882e8446J04452J30285r5374j39813J09752k29485n5069J81817j09112P5497
$$ -58446 46006 176291 80917 -58896 50856 -178629 -233698 -51881 -160993 -85496
22872h5496J58943j32391j58299m3517N0427J53663N9862M8684j47556p6184J023
$$ -85496 73447 -58944 -217243 -260760 -210333 -56670 3192 51876 -95680 -171864 -170841
22861a70841K11153K69531n3576p1243j90994K8934O2882Q3811L0367j71343M7873
$$ -170841 40312 309843 256267 185024 -5970 22964 85846 169657 200024 28681 76554
22850G6554J13839j8065N890M2663j58450q6319r541l1164p1345j8589o8656J4811
$$ 76554 190393 172328 178218 220881 62431 -23888 -33429 -64593 -135938 -154527 -223183 -208372
22838b08372J07759R2107J00395M2104r5192n1644o4538J48025Q9269n1419M8020
$$ -208372 -100613 -8506 91889 133993 38801 -12843 -77381 70644 159913 108494 156514
22827A56514J84619M3946n3304j65428j87589M873k8712o9093O3951m5434m7971
$$ 156514 341133 385079 331775 166347 -21242 -16369 -45081 -114174 -50223 -95657 -143628
22816a43628p7953J77916j51819J5751o6453k0638J42992J1489k8451K21927J24675
$$ -143628 -221581 -43665 -195484 -179733 -246186 -266824 -123832 -112343 -140794 81133 205808
22805B05808r2942p4354N0833N7680j79891j06679j48269J0060J81574J86267
$$ 205808 112866 38512 89345 147025 -32866 -139545 -287814 -277754 -96180 90087
22795I0087N9802r2082m4182l838J67770R79j90316j47584J11361J04717k5836
$$ 90087 149889 57807 13625 9787 177557 178536 -11780 -159364 -48003 56714 30878
22784C0878m4348n334J84717q9890k18783k27419P1733Q7461M6473K33839J24189
$$ 30878 -13470 -18804 165913 76023 -142760 -370179 -298446 -210985 -164512 69327 193516
22773A93516q4663j53931k18722K71629K42691o8948Q7263m8877j31831Q3449
$$ 193516 108853 -45078 -263800 7829 250520 181572 268835 219958 88127 171576
22763A71576J04469o6722r9155j2969J92741K12219j19926j23045j18007K1431
$$ 171576 276045 209323 110168 97199 289940 502159 382233 259188 141181 162612
22753A62612R6178m7895R9788j03750K8267j80540j36780O9632J93832m341k75435
$$ 162612 258790 210895 310683 206933 235200 54660 -82120 -12488 181344 177003 -98432
22742i8432k29987J7692q446J65522J05826m6044J33400J29773n5604j42353K6083
$$ -98432 -328419 -310727 -319173 -153651 -47825 -93869 39531 169304 113700 -28653 -2570
22731b570m5794q8350j12875K6955N2904P1001J0374R0823O2167k9737O4761J64543
$$ -2570 -48364 -136714 -249589 -222634 -169730 -98729 -88355 2468 64635 34898 99659 264202
22719B64202m1775j32550o6007l7311M1002J53127K59480k81171k80181L9165
$$ 264202 222427 89877 23870 -13441 27561 180688 440168 158997 -121184 -82019
22709h2019j94248r3529p8966L47927j96733r5894K34369J44178R1405N2084O4459
$$ -82019 -276267 -369796 -448762 -100835 -297568 -393462 -159093 -14915 76490 128574 193033
22698A93033N7368L589K7210J82335j2062j82925p5087J0096Q6291n5053j85508
$$ 193033 250401 253990 281200 463535 451473 268548 193461 203557 289848 234795 49287
22687D9287R3015n5329j49225n7193j59106J04245M0909J22057q6892n4798q1463
$$ 49287 142302 86973 -62252 -119445 -278551 -174306 -133397 -11340 -98232 -153030 -234493
22676b34493K10481M726J00187P5103j89899n7950l6385p7606j38885k8607J75287
$$ -234493 -24012 -19286 80901 156004 -33895 -91845 -128230 -205836 -344721 -373328 -198041
22665a98041j5825k46213J61068P3968J31416R9774o5216O018j59076J72434J99059
$$ -198041 -213866 -460079 -299011 -225043 -93627 6147 -59069 -53051 -212127 -39693 159366
22654A59366K82033j2267j01141j45124k70035j23118M7537l057J26798J4370
$$ 159366 441399 429132 327991 182867 -87168 -210286 -162749 -165806 -39008 -24638
22644b4638K1435n0626N1080j269m2917O8869j36704K5944N9206Q8983R9794J23745
$$ -24638 -3203 -53829 -2749 -4018 -46935 21934 -114770 -88826 -29620 59363 159157 282902
22632B82902M0262j21372N704p2733O7903n1387K7549J97420l334k19437p4632
$$ 282902 323164 201792 207496 134763 202666 151279 178828 376248 372914 153477 78845
22621G8845O0711P9822q0199R1744j43055M0257n2467k15979p5300l988q1946
$$ 78845 139556 219378 139179 230923 87868 128125 75658 -140321 -215621 -219609 -301555
22610c01555J48761J80033L8264n0000j27773j72940K10805N1040l00577k14060
$$ -301555 -152794 27239 65503 15503 -112270 -285210 -74405 -23365 -323942 -538002
22600e38002M5842L9593P0726L07723M29810J1544j2830J60917p4914q268k23163
$$ -538002 -492160 -452567 -381841 -74118 355692 367236 354406 515323 440409 432141 208978
22589B08978j96394k57542O5660K11037R6J13271J00928J51414K8091j50817j49112
$$ 208978 12584 -244958 -179298 31739 31835 145106 246034 397448 425539 274722 125610
22578A25610o9640p3514r9470m227o5755m529J44428J47085K3898J630n1306P0954
$$ 125610 55970 -17544 -117014 -121241 -186996 -191525 -47097 99988 123886 125516 74210 145164
22566A45164J11344n3952K2905J69084j65505k65712O0300q1614n3932N2693J91360
$$ 145164 256508 202556 225461 394545 229040 -36672 23628 -57986 -111918 -59225 132135
22555A32135j5613j56367J28207N9483K8183j64820l63127m456P6713J36348K18871
$$ 132135 116522 -39845 88362 147845 176028 11208 -351919 -356375 -279662 -143314 75557
22544G5557j04400j48605O8015R8450Q6941k9941j57409j80344K09340K71719
$$ 75557 -28843 -177448 -109433 -10983 75958 46017 -111392 -291736 -82396 189323
22534A89323M7877Q6094j7224r130O6381j61573r6837q2537n6301l7271j7776
$$ 189323 237200 323294 306070 296940 363321 201748 104911 22374 -33927 -71198 -88974
22523h8974k3235j04761l186J67519J72307J08579P8121o5801l07508k9485J70145
$$ -88974 -112209 -216970 -220156 -52637 119670 228249 306370 240569 -66939 -96424 73721
22512G3721m2931P434K18707P9447j7128j15052l7074N1962k9335j02125K3970
$$ 73721 30790 38224 256931 336378 319250 204198 167124 219086 189751 87626 111596
22501A11596m3345q1072j90585j09710l9080P6639K921L2794k5851k19729N5226
$$ 111596 68251 -12821 -203406 -313116 -352196 -275557 -272636 -239842 -265693 -485422 -430196
22490d30196K71339L68687J93195j06974j28309r4579k16313k0996j19688j49272
$$ -430196 -158857 209830 403025 296051 167742 73163 -143150 -164146 -283834 -433106
22480d33106N2325M189J4966L11591J76464m4228j17611p5326J33656j42823O3694
$$ -433106 -380781 -376592 -361626 -50035 126429 82201 -35410 -110736 22920 -119903 -56209
22469e6209O7311k65551J00053M15038R8459j17903k22698P6334J66173M5925
$$ -56209 11102 -254449 -154396 260642 359101 241198 18500 94834 261007 306932
22459C06932J2448k59918k22489n6495J63454K96703K99043M7277k62411k76616
$$ 306932 319380 59462 -163027 -219522 -56068 240635 539678 586955 324544 47928
22449D7928j98351N7892K78188J41005j32937k25494n4401R732K57763J66806
$$ 47928 -150423 -92531 185657 326662 193725 -31769 -86170 -76438 181325 348131
22439C48131M2834q6611j06886j09855j00170R6446R6064J44479j04359q2527
$$ 348131 390965 304354 197468 87613 -12557 83889 179953 324432 220073 137546
22429A37546p1294M8187O2990r9579m8142l3518J21428P1523J43210j71163k81618
$$ 137546 66252 114439 177429 77850 29708 -3810 117618 189141 332351 161188 -120430
22418a20430m03048J85775J38231O2813K01709Q4646j58729j77108j28168J38218
$$ -120430 -523478 -337703 -199472 -136659 65050 149696 -9033 -186141 -314309 -176091
22408a76091J70p7557j19864J42410K55924Q6382q3371J4903J98174p422Q3636
$$ -176091 -175921 -253478 -373342 -230932 24992 111374 28003 42906 241080 233658 317294
22397C17294K0359k32295k37238l9438p1438K36432J20155j27560l3268J40429
$$ 317294 337653 105358 -131880 -171318 -242756 -6324 113831 -13729 -46997 93432
22387I3432J096M244O9865j3685m7059k24203j13086o5498K21570J41348l1645
$$ 93432 94528 98772 168637 154952 107893 -116310 -229396 -294894 -73324 68024 36379
22376C6379J20829O3331j59792r0486O2783M8901P4099n1369j17712m6500j45845
$$ 36379 157208 220539 60747 -29739 33044 81945 156044 104675 -13037 -59537 -205382
22365b05382k4550K9888K27042J95726K43307j18597k67797p3889j3472n8601
$$ -205382 -229932 -200044 26998 222724 466031 347434 79637 5748 -7724 -66325
22355f6325O2983l6796k93643j401J19472J20974Q4560m4860o4123p6918q9453
$$ -66325 -3342 -40138 -333781 -335182 -215710 -94736 -10176 -55036 -119159 -196077 -285530
22344b85530Q4259J73995J665l5721K970j24702q7982K9064r3960o7573J8367
$$ -285530 -201271 -27276 -25611 -61332 -58362 -183064 -271046 -241982 -335942 -403515 -385148
22333c85148J26760M1074J07348Q4411J12015P0052p0482k72832j91767J95950
$$ -385148 -258388 -217314 -109966 -25555 86460 156512 86030 -186802 -378569 -182619
22323a82619J82354Q5227r3238k9724L5494M9327p9434Q7965p6985q9112M5721
$$ -182619 -265 84962 -8276 -38000 -2506 46821 -32613 55352 -21633 -110745 -65024
22312f5024J09463J03023k1914j38342R6975L4197J60906J69988j58670k67924
$$ -65024 44439 147462 125548 -12794 84181 118378 279284 449272 290602 22678
22302B2678J5656J80501j67890q2221O5187P3478j6138q4643j5651l0030O3004
$$ 22678 38334 218835 50945 -31276 33911 107389 91251 6608 -9043 -39073 23931
22291B3931L1613N7862L0091l29290l3190K8058p9492J0108n7130k9954N6077
$$ 23931 55544 113406 143497 -185793 -218983 -190925 -270417 -260309 -317439 -347393 -291316
22280b91316q2790R1797j1921N7890k9699k2861Q6039N3550J11162j99296j03553
$$ -291316 -374106 -282309 -294230 -236340 -266039 -288900 -202861 -149311 -38149 -237445 -340998
22269c40998J21070J73497J37967N0640P6962l6933k9090j44900k82821o6891
$$ -340998 -219928 -46431 91536 142176 219138 182205 153115 8215 -274606 -341497
22259c41497K70349J91501L6547j2002j7280j53140K8118J08600O4184N7718j24019
$$ -341497 -71148 120353 156900 144898 127618 -25522 2596 111196 175380 233098 109079
22248A09079j88612M3683J31554k75486j48181L0556M2579J63954M9548j24594
$$ 109079 -79533 -35850 95704 -179782 -327963 -297407 -254828 -90874 -41326 -165920
22238a65920J96689m8669M986q1910n8147K11322M4669N1855o7883k9096l497
$$ -165920 30769 -17900 -12914 -94824 -152971 58351 103020 154875 86992 57896 54399
22227E4399N2543r583K6550j59126r2268J52067q0902n2523J7906j01193j0546
$$ 54399 106942 97359 123909 -35217 -127485 24582 -56320 -108843 -90937 -192130 -202676
22216b02676k2439P4191N5054o1772J69987K14574J74179m465j10222j66089j3488
$$ -202676 -225115 -150924 -95870 -157642 12345 226919 401098 396633 286411 120322 106834
22205A06834r4593j16323m9105k1773K34370J50107P4958l1749k02158J60762
$$ 106834 12241 -104082 -153187 -174960 59410 209517 284475 252726 50568 211330
22195B11330J94906O948j37639r9167k1027J14399j80845o1482l5112j02102p911
$$ 211330 406236 413184 275545 176378 155351 269750 88905 27423 -7689 -109791 -117702
22184a17702J76645j08815l24368N1859K30268J11050j71838j12828L7184j69558
$$ -117702 58943 -49872 -374240 -322381 -92113 18937 -152901 -265729 -228545 -398103
22174c98103K33831J01310J5768j13937J72647j33446K85004J83607k42020k27992
$$ -398103 -164272 -62962 -47194 -161131 11516 -121930 163074 346681 104661 -123331
22164a23331j10142J5461L3750j80638j28588L44013K06064o8008p3721J23349
$$ -123331 -233473 -218012 -184262 -364900 -493488 -149475 56589 -11419 -85140 38209
22154C8209m6714j33053Q9709J30702l2786j46875j80543J16093J37791k0257
$$ 38209 -8505 -141558 -51849 78853 46067 -100808 -281351 -165258 -27467 -47724
22144d7724K47217J22892m4202L2688R9370j82031k44095j06500O121M5760P6392
$$ -47724 199493 322385 278183 310871 410241 228210 -15885 -122385 -116264 -70504 5888
22133E888q4701Q1064r987j00038p8120M5186J15079j73821j00712O9149K598
$$ 5888 -78813 2251 -7736 -107774 -185894 -140708 -25629 -199450 -300162 -231013 -228415
22122b28415J58756N9222j31386J5176J16827q9247K8517k3848j69026R0682k7688
$$ -228415 -69659 -10437 -141823 -126647 -9820 -99067 -70550 -94398 -263424 -172742 -200430
22111b00430n1553r0887J45022M0346l064p3340J21550Q5457J3191J40312m2481
$$ -200430 -251983 -342870 -197848 -157502 -160566 -233906 -112356 -26899 -13708 126604 84123
22100H4123Q3980L4133N1557k23760j5264K2839Q6615j56486j11107l634Q0134
$$ 84123 168103 202236 253793 30033 14769 37608 124223 -32263 -143370 -147004 -66870
22089f6870J34276j07957k01755J50939J7590k8764K96757P7592j01529j53099
$$ -66870 67406 -40551 -242306 -91367 -73777 -102541 194216 271808 170279 17180
22079A7180M8763k7149j72731j17380o019o7417Q6052J16428P7961o3373k48637
$$ 17180 65943 38794 -133937 -251317 -257336 -324753 -238701 -122273 -44312 -107685 -356322
22068c56322l204J64820j69061L9377j11097j11149O4919J74399Q7708K7744o2363
$$ -356322 -359526 -194706 -363767 -324390 -435487 -546636 -481717 -307318 -219610 -191866 -254229
22057b54229L6542J10349m4191J01218R5933j52041R5504J0875j81900k06361
$$ -254229 -217687 -107338 -151529 -50311 45622 -106419 -10915 -40 -181940 -388301
22047c88301j30404l233K01296l7873Q2466J73606K19715M0530K3586l7683O2560
$$ -388301 -518705 -521938 -320642 -358515 -276049 -102443 117272 157802 181388 143705 206265
22036B06265O0707p9414j21462J0656j27621k39290J03760Q9302m219p8619P4550
$$ 206265 266972 187558 66096 76752 -50869 -290159 -186399 -97097 -101316 -179935 -105385
22025a05385P0233J4211j2995q4461j14946j7131J247J92293L23792K88165J31484
$$ -105385 -35152 -20941 -33936 -118397 -233343 -250474 -249227 -56934 266858 555023 686507
22014F86507R117k28294k84124j54731n5590R2873J4373R3537k8630K8632j17694
$$ 686507 695624 467330 183206 28475 -27115 65758 80131 173668 145038 173670 55976
22003E5976m8649M2442l1474j0610R0622N0151j26839l689J03030J44650J1880
$$ 55976 7327 49769 18295 7685 98307 148458 21619 17930 120960 265610 277490
21992B77490j45641k15055j66744J7310J25188M737R1938p1488O3149n8885K1109
$$ 277490 131849 -83206 -249950 -232640 -107452 -102715 -10777 -82265 -19116 -78001 -56892
21981e6892P1984n0800J9689j21074m9176J35690K3482L1290P4016m4717L6774
$$ -56892 15092 -35708 -16019 -137093 -186269 -50579 -27097 4193 78209 33492 70266
21970G0266J25339l511k4810j20389p962o5634j69744j6740K82743K94160r544
$$ 70266 195605 192094 167284 46895 38933 -26701 -196445 -213185 69558 363718 354174
21959C54174k87683j72614L7194m7847M0903j2056j40237l7583J16758R2879k21740
$$ 354174 66491 -106123 -68929 -116776 -75873 -87929 -228166 -265749 -148991 -56112 -277852
21948b77852j22583P922J25616j20049j9496J46497j3514n6874J15236K17468
$$ -277852 -400435 -392513 -266897 -386946 -406442 -259945 -273459 -330333 -215097 2371
21938B371O0429j42920J85840J24753J02176k23843k20276n5712J3303p962R1717
$$ 2371 62800 -80120 105720 230473 332649 108806 -111470 -167182 -153879 -161841 -70124
21927g0124J67066N8407M6900j02042l562n4868J15499q1273R6727K42848l07946
$$ -70124 96942 155349 202249 100207 96645 41777 157276 76003 172730 415578 107632
21916A07632k73356R5843L7164l1633K6635J61212K06677o1612k86051K7910J53613
$$ 107632 -165724 -69881 -32717 -64350 -37715 123497 330174 268562 -17489 10421 164034
21905A64034k3711j22759n0439k4615L0287J92755P919m721j06219o094n0506
$$ 164034 140323 17564 -32875 -57490 -27203 165552 173471 168750 62531 56437 5931
21894E931L5514O3784j76150L38J05337l9156J36153j30925j45444O9821K38565
$$ 5931 41445 105229 -70921 -70583 34754 -4402 131751 826 -144618 -74797 163768
21883A63768M4497q7176J0948L3284K86987J39185k90560m57422j75098K7363
$$ 163768 208265 121089 132037 165321 452308 591493 300933 -156489 -331587 -304224
21873c04224K2126J09293J43651P6400K4953K2808O021J30157k4592j47974j65358
$$ -304224 -282098 -172805 -29154 47246 72199 95007 101028 231185 206593 58619 -106739
21862a06739N2268P2390m7606R1634J20535J19393k43597j7415P2977m8093Q6314
$$ -106739 -54471 17919 -29687 61947 182482 301875 58278 40863 113840 65747 152061
21851A52061P6073L4904K8202j10666q1403m398L5773J3345N004j08932r3220
$$ 152061 228134 263038 291240 180574 99171 94773 130546 143891 148895 39963 -53257
21840e3257K15657K9961k54820j66363J48758n2240j58790P730Q6244J62665J66400
$$ -53257 162400 192361 -62459 -228822 -80064 -132304 -291094 -283364 -197120 -34455 131945
21829A31945J3497j22635k4555o4596J29936r822k5401j3280N4507N6837r7093
$$ 131945 145442 22807 -1748 -66344 63592 53770 28369 15089 69596 126433 29340
21818B9340j6875j32364M3825k7122j25664m2739Q3937J63511M1023j938N711
$$ 29340 12465 -119899 -76074 -103196 -228860 -271599 -187662 -24151 16872 14934 20645
21807B0645J06719J15981r2110j70094j96940j41928J01948K36009L2539l1787
$$ 20645 127364 243345 151235 -18859 -215799 -357727 -255779 -19770 12769 -19018
21797a9018Q4804j77816j5751j12630k33476J03208K88874K80044j27361k75198
$$ -19018 65786 -112030 -127781 -240411 -473887 -370679 -81805 198239 70878 -204320
21787b04320j54903k4335N0502J49105R9361r6126j49646k04609J52907J19354
$$ -204320 -359223 -383558 -333056 -183951 -84590 -180716 -330362 -534971 -382064 -262710
21777b62710m2253K56770j41879M7031M4955n4846L5271O1425j26982r4658O1844
$$ -262710 -304963 -48193 -190072 -143041 -98086 -152932 -117661 -56236 -183218 -277876 -216032
21766b16032K80488j30562j359K32661P3354k52448k65879q3935J53752J71184
$$ -216032 64456 -66106 -67465 165196 238550 -13898 -279777 -363712 -209960 -38776
21756c8776L4096j3667j39114P9381N001j52268j19077K21464L49236R619j35754
$$ -38776 -4680 -18347 -157461 -78080 -73079 -225347 -344424 -122960 226276 235895 100141
21745A00141J13616M9103j08058K2849o6992N5798K63055J3671j65883k05727
$$ 100141 213757 262860 154802 177651 110659 166457 429512 443183 277300 71573
21735G1573K26846K2471j62899o6754K05073L3951k28858j56258P4430J95746
$$ 71573 298419 320890 157991 91237 296310 330261 101403 -54855 19575 215321
21725B15321p7214j82524K12779P3064r4514j91265j94060J40802j972K4592p1161
$$ 215321 138107 -44417 168362 241426 146912 -44353 -238413 -97611 -99583 -74991 -146152
21714a46152m1471k8678j04292M06134R1324q8521J3071l5933m8921J4046R374
$$ -146152 -187623 -216301 -320593 85541 176865 88344 101415 65482 16561 30607 39981
21703C9981l2016J54553J8556j88887j98314j66794O3835J57732n8276k24951
$$ 39981 7965 162518 181074 -7813 -206127 -372921 -309086 -151354 -209630 -434581
21693d34581j30277k7777J71248J40857J81485K58292J02336q6824k6799L4726
$$ -434581 -564858 -592635 -421387 -280530 -99045 159247 261583 174759 147960 182686
21683A82686J28017j40365r2949l6655n5933n7441j61573k01210o4441P5391N8865
$$ 182686 310703 170338 77389 40734 -15199 -72640 -234213 -435423 -499864 -424473 -365608
21672c65608N103K08963Q2093J70528R9118N9803P4327M9213l79632j28335O6411
$$ -365608 -360505 -151542 -69449 101079 200197 260000 334327 383540 3908 -124427 -58016
21661e8016j40204J1062P4798J10199Q3226j40327l92929J60934J66404q478K8066
$$ -58016 -198220 -187158 -112360 -2161 81065 -59262 -452191 -291257 -124853 -133331 -105265
21650a05265J94564j24749m3731L8595N3358P8783j15805j13956M9375j07500
$$ -105265 89299 -35450 -79181 -40586 12772 91555 -24250 -138206 -88831 -196331
21640a96331j41825j00694j22867J52099K69623J6006j4929K00403m4644P7405
$$ -196331 -338156 -438850 -561717 -409618 -139995 -123989 -138918 61485 16841 94246
21630I4246Q2533k02081j11820J64150r7153j91150M6303L4961L6991J61895J16913
$$ 94246 176779 -25302 -137122 27028 -70125 -261275 -214972 -180011 -143020 18875 135788
21619A35788n4522l1563o6304L7932r3432o3597j12983J27445J32993J6281J43353
$$ 135788 81266 49703 -16601 21331 -72101 -135698 -248681 -121236 11757 28038 171391
21608A71391j97227M0588m2465J60848N3492p2046j10040J95780K30586p3115
$$ 171391 -25836 14752 -27713 133135 186627 114581 4541 200321 430907 357792
21598C57792l13588K2746K86149J2015k93544R4705K6636m613K5424k73175k2764
$$ 357792 44204 66950 353099 365114 71570 166275 192911 188298 213722 -59453 -82217
21587h2217J06521q250K4635l6235m0784L4939J01863p9653r6040n7837r2223
$$ -82217 24304 16054 40689 4454 -36330 -1391 100472 20819 -75221 -133058 -225281
21576b25281k030O301J15131J1028J40585j55379j24613M9147j32053o8812l3716
$$ -225281 -227311 -221010 -105879 -94851 45734 -109645 -234258 -185111 -317164 -385976 -419692
21565d19692K27469J19546j83768J6504P8401J43178M3657O4595r2875n4694o4716
$$ -419692 -192223 -72677 -256445 -239941 -161540 -18362 25295 89890 -2985 -57679 -122395
21554a22395N2087L1843K1453L104O5446J31650j03003q5138L7160l1519J43275
$$ -122395 -70308 -38465 -17012 -13908 51538 183188 80185 -4953 32207 688 143963
21543A43963r1234J3980r129N1322K731l516J81999l263Q9528R636j45035k22649
$$ 143963 52729 66709 57580 108902 111633 108117 290116 286853 376381 386017 240982 18333
21531A8333j64115O5643K30483O4409L1546j63920j39840k51661j0673K0112L09183
$$ 18333 -145782 -80139 150344 214753 246299 82379 -57461 -309122 -319795 -299683 9500
21520I500J09071k1040j4849K5486O1873P3898r2911N8500k45829l375K2226Q6725
$$ 9500 118571 97531 82682 108168 170041 243939 151028 209528 -36301 -39676 -17450 69275
21508F9275m6129j44533N0909J47667p0152l9840R7544j07748J97699K4454o9985
$$ 69275 23146 -121387 -70478 77189 7037 -32803 64741 -43007 154692 179146 109161
21497A09161K16333K55494j86201k19805K48751p6341j27854J36679P8494j33459
$$ 109161 325494 580988 394787 174982 423733 347392 219538 356217 434711 301252
21487C01252j42811j55971O5096L4453J9917k45375l02048j9755J93849J00675
$$ 301252 158441 2470 67566 102019 121936 -123439 -425487 -445242 -251393 -150718
21477a50718P9514J88504J2475j19213j28561p6030j12214P4630L4680j47956
$$ -150718 -71204 117300 129775 10562 -117999 -194029 -306243 -231613 -196933 -344889
21467c44889p8080j9406K34462R655j41845K70096r838j35200m8853K9106J72761
$$ -344889 -422969 -442375 -207913 -198258 -340103 -70007 -79845 -215045 -263898 -234792 -62031
21456f2031K86274K0511l40009Q1723O7302j1899j03953k8283J27899K25778J5571
$$ -62031 224243 244754 -95255 -13532 53770 41871 -62082 -90365 37534 263312 278883
21445B78883q7892R7062O8549m9136j30234j16484k049n6887P186K2545o6963
$$ 278883 190991 288053 356602 307466 177232 60748 58699 1812 8998 31543 -35420
21434c5420j17428L8951J01234J1207J9412k31012j46196J16768k4752p9922j78659
$$ -35420 -152848 -113897 -12663 -1456 17956 -213056 -359252 -242484 -267236 -347158 -525817
21423e25817M3809L00036J76054k1069k5154O103N4861k76305j13761J02603J16545
$$ -525817 -482008 -181972 -5918 -26987 -52141 -46038 8823 -267482 -381243 -278640 -162095
21412a62095Q2303J26017j5480O151k6058k81314p4555J95321j5487J5265q840
$$ -162095 -79792 46225 30745 36896 10838 -270476 -345031 -149710 -165197 -149932 -158772
21401a58772J67633J17737J10582P2185J7723p3459j58318J9546J05532P6675
$$ -158772 8861 126598 237180 309365 327088 253629 95311 114857 220389 297064
21391B97064M4531k53026J47516L52604k12517k74999j79536J42312j26580k10551
$$ 297064 341595 88569 236085 588689 376172 101173 -78363 63949 -62631 -273182
21381b73182p7481L5598k2364J32904P0143k9596K2214m397l4690p7525K25073
$$ -273182 -350663 -315065 -337429 -204525 -134382 -163978 -141764 -146161 -180851 -258376 -33303
21370c3303L712q4570j64330K3831n6467M8239J97699M3162j65660K0981Q8514
$$ -33303 -29591 -114161 -278491 -254660 -311127 -262888 -65189 -22027 -187687 -166706 -78192
21359g8192Q7634Q4729j64508n8752P9053Q2958p3272j0184J08113j30031p9379
$$ -78192 9442 94171 -70337 -129089 -50036 32922 -40350 -50534 57579 -72452 -151831
21348a51831o2503n7598J66310O8385j4179j46964N6177J0397p1254J0218p030
$$ -151831 -214334 -271932 -105622 -37237 -51416 -198380 -142203 -131806 -203060 -192842 -199872
21337a99872p8658J06295N4693j33991Q472N4328q0418Q5797K36612j85494m3571
$$ -199872 -278530 -172235 -117542 -251533 -243061 -188733 -269151 -183354 53258 -132236 -175807
21326a75807J05162J21063l7726o1266j0906R4465m6030J36708J95545N2408K6399
$$ -175807 -70645 50418 12692 -48574 -59480 34985 -11045 125663 321208 373616 400015
21315D00015j15290k99113p6884o6299j92946J04301K90267L2726k40480j52061
$$ 400015 284725 -14388 -91272 -157571 -350517 -246216 44051 76777 -163703 -315764
21305c15764J13194O0933J83357R6942j34575K9799J31300j25923j62007j13059
$$ -315764 -202570 -141637 41720 138662 4087 33886 165186 39263 -122744 -235803
21295b35803J11966M7632N6379J07670R531k48126l1033q8404n2441O1651J50875
$$ -235803 -123837 -76205 -19826 87844 97375 -150751 -181784 -270188 -322629 -260978 -110103
21284a10103P9507q1803m6601r4919o564k666M6075O9348N297k17960l8060K29481
$$ -110103 -30596 -112399 -159000 -253919 -260483 -263149 -217074 -147726 -142429 -360389 -398449 -168968
21272a68968J54929O7524J11568r853k47230o2585J1519K7818O1300R2821j8047
$$ -168968 -14039 53485 165053 155200 -92030 -154615 -143096 -115278 -53978 38843 20796
21261B0796J08901N4189o3714k86105q5726K54124q0442j45629Q5350p5496J41712
$$ 20796 129697 183886 120172 -165933 -251659 2465 -77977 -223606 -138256 -213752 -72040
21250g2040k15884p2419J08971J647O651Q8036j3675j06597o6394j8995Q6883
$$ -72040 -287924 -360343 -251372 -249725 -243074 -155038 -168713 -275310 -341704 -360699 -273816
21239b73816J34565J19462p5837K8215N4578q8407k77004O4783J31948j02628
$$ -273816 -139251 -19789 -95626 -67411 -12833 -101240 -378244 -313461 -181513 -284141
21229b84141J1239N6012O9274K7937J57866K07973K9366j68268o0436J19929R2251
$$ -284141 -272902 -216890 -147616 -119679 38187 246160 275526 107258 46822 166751 259002
21218B59002J69692K6026k10711k11157l63243j01981J46069P8952m0248J16259
$$ 259002 428694 454720 244009 32852 -330391 -432372 -286303 -207351 -247599 -131340
21208a31340r4261N0787K21150j08394j30591J0284N9548K8053N8020k04618l5830
$$ -131340 -225601 -174814 46336 -62058 -192649 -182365 -122817 -94764 -36744 -241362 -277192
21197b77192L1191J28317K525j87290N7753L00107K59230p9450l8418j17549j50497
$$ -277192 -246001 -117684 -115159 -302449 -244696 55411 314641 235191 196773 79224 -71273
21186g1273R6251J10236J26074p4744k17410j75758l8757P9566J70532p5491Q6283
$$ -71273 24978 135214 261288 186544 -30866 -206624 -245381 -165815 4717 -70774 15509
21175A5509l1630k27703J37017J94736J79663m6590k63704l5441P6639o9144L8070
$$ 15509 -16121 -243824 -106807 87929 267592 221002 -42702 -78143 -1504 -70648 -32578
21164c2578J82670k1505j01886m1119l3164r6616k29483R4418Q6419M3653J11724
$$ -32578 150092 128587 26701 -14418 -47582 -144198 -373681 -279263 -192844 -149191 -37467
21153c7467L3283M4526q2488J27774P6113j40589o2401o3636p4912o2018O8976
$$ -37467 -4184 40342 -42146 85628 161741 21152 -41249 -104885 -179797 -241815 -172839
21142a72839K14016k01402L8977K36700O453j65091J4374p4088J04207N8415R4837
$$ -172839 41177 -160225 -121248 115452 121905 -43186 -28812 -102900 1307 59722 154559
21131A54559j41811J7428O8917J1589j05602J40639J21810k31702j86818L7751
$$ 154559 12748 30176 99093 110682 5080 145719 267529 35827 -150991 -113240
21121a13240O5366q3775o9711L22136P6527J1101J3113R6633j29335m4365j5443
$$ -113240 -47874 -131649 -201360 120776 197303 208404 221517 318150 188815 144450 129007
21110A29007j09163Q331M4189J41259J42467P623o0837j47043k78790O8521K46939
$$ 129007 19844 28175 72364 213623 356090 363713 302876 155833 -122957 -54436 192503
21099A92503K3467j30827j70014m4201m2871M7679J68217J42626m8703j48141
$$ 192503 215970 85143 -84871 -129072 -171943 -124264 43953 186579 137876 -10265
21089a0265p6191k09066J35255K83534J18869k6211R7923n1548J3925k40909j15723
$$ -10265 -86456 -295522 -160267 123267 242136 215925 313848 262300 276225 35316 -80407
21078h0407l2215M6871Q623K04887p8462k82783o8374J91581r7993p2373J88102
$$ -80407 -112622 -65751 -57128 147759 69297 -213486 -281860 -90279 -188272 -260645 -72543
21067g2543q3767k62380P6848K32937P2641J27043K21073r9843j46045p1249j53464
$$ -72543 -156310 -418690 -341842 -108905 -36264 90779 311852 212009 65964 -5285 -158749
21056a58749J8462J02978Q4836J51331J72281L1080L44q9259q1966o5587j9203
$$ -158749 -140287 -37309 47527 198858 371139 402219 402563 313304 231338 165751 146548
21045A46548k35262r8407M6650J19247L19640J97065J00709l29723k070n0097
$$ 146548 -88714 -187121 -140471 -21224 298416 495481 596190 266467 264397 214300
21035B14300k75694m7472k2457M8379N8568R9622K82328r6009M5308J13178j00486
$$ 214300 -61394 -108866 -131323 -82944 -24376 75246 357574 261565 306873 420051 319565
21024C19565j21344k53847j69187Q1707J16173J0892j04565O9733q1107o2647
$$ 319565 198221 -55626 -224813 -143106 -26933 -16041 -120606 -50873 -131980 -194627
21014a94627O6630k19535j92842O9881K70487R5681R9346l2358j11747J79892
$$ -194627 -127997 -347532 -540374 -470493 -200006 -104325 -4979 -37337 -149084 30808
21004C0808J33098J40703j67499j45904l1386O6613j2889Q9721O4529j43991j01244
$$ 30808 163906 304609 137110 -8794 -40180 26433 13544 103265 167794 23803 -77441
20993g7441p9622O1535J22189j31224n944j57417N6491K59302n227j63865J00511
$$ -77441 -157063 -95528 26661 -104563 -110507 -267924 -211433 47869 42642 -121223 -20712
20982b0712O3828R3295j26138J7371P6821J57631j00373J3366k36722n9728R6369
$$ -20712 43116 136411 10273 27644 104465 262096 161723 175089 -61633 -121361 -24992
20971b4992J79891J58676k4848k67888j90029r7071r8485K52406K61451Q7175
$$ -24992 154899 313575 288727 20839 -169190 -266261 -364746 -112340 149111 236286
20961B36286r7601N2530q4327k6143p0338j60575k9981n0791r4476N1558J04894
$$ 236286 138685 191215 106888 80745 10407 -150168 -180149 -230940 -325416 -273858 -168964
20950a68964R3311K2093Q0368K7514j36625n2960J2863k7934R1812J57461j03211
$$ -168964 -75653 -53560 26808 54322 -82303 -135263 -122400 -150334 -58522 98939 -4272
20939d272j41024j1207P9478o9506P594J36142J29253N781j3144Q1741M4001j40725
$$ -4272 -145296 -156503 -77025 -146531 -138937 -2795 126458 132239 119095 200836 244837 104112
20927A04112p0328L6994j08028q6468N8462M7400O3906O9263K8891q1510K0930
$$ 104112 33784 70778 -37250 -123718 -65256 -17856 46050 115313 144204 62694 83624
20916H3624J11317j78419k0602j79724j14307J86863k2549n1613k128R3817L8746
$$ 83624 194941 16522 -4080 -183804 -298111 -111248 -133797 -185410 -187538 -93721 -54975
20905e4975j15047p3670J61828k977n192j77287m0872N0501J80786J55338r734
$$ -54975 -170022 -243692 -81864 -84841 -90033 -267320 -308192 -257691 -76905 78433 68699
20894F8699j43760p7545O7954n4147J49753J58869j7256Q0582l4917j82914q1561
$$ 68699 -75061 -152606 -84652 -138799 10954 169823 152567 233149 198232 15318 -66243
20883f6243p6827M7161q5539l5697K39320J38263L5448k8910r81P802N4668m1199
$$ -66243 -143070 -95909 -181448 -217145 22175 160438 195886 166976 165995 173797 228465 187266
20871A87266j5536J70036j49120M545r9924M219l4045p8082j75053J54331J13790
$$ 187266 171730 341766 192646 197191 97267 101486 67441 -10641 -185694 -31363 82427
20860H2427k12777N9398J25067n6423m7234Q0404l1180k1700m6282L9395q648
$$ 82427 -130350 -70952 54115 -2308 -49542 30862 -318 -22018 -68300 -28905 -37553
20849c7553L8540Q6679p0142L5482j5569J27366l7158j57353M9517r5665j03529
$$ -37553 987 87666 17524 53006 37437 164803 127645 -29708 19809 -75856 -179385
20838a79385J45764R0596J94778k64385N6681L34325j45613k70438p7404n5792
$$ -179385 -33621 56975 251753 -12632 44049 378374 232761 -37677 -115081 -170873
20828a70873J987L46J95525O3652M6028k1824j32016m5331p9940R3932Q648j71119
$$ -170873 -168886 -168540 26985 90637 136665 114841 -17175 -62506 -142446 -48514 -39866 -210985
20816b10985q9853L7827K22107M8579J01627N549j28322j72416p0585M217R2050
$$ -210985 -300838 -263011 -40904 7675 109302 114851 -13471 -185887 -256472 -252255 -160205
20805a60205j10078j16343L0952R1277J67009Q7823J4646o9966j70539k6363J94278
$$ -160205 -270283 -386626 -355674 -264397 -97388 -9565 5081 -64885 -235424 -261787 -67509
20794f7509J06999K72847J6865j98488k6762j03687n08J5923j13016q3350j12861
$$ -67509 39490 312337 329202 130714 103952 265 -243 15680 -97336 -180686 -293547
20783b93547J87203Q9596q2998l02787q4441K54919K89272j6038k3927R3576p9154
$$ -293547 -106344 -16748 -99746 -402533 -486974 -232055 57217 41179 17252 110828 31674
20772C1674n2793K608J02370J97774m887j85542q6907j39701p5215J34711J10898
$$ 31674 -21119 -18511 83859 281633 276746 91204 4297 -135404 -210619 -75908 34990
20761C4990J14274j52461k27897j62607l6044N09Q1905N3073j07066Q7848J05816
$$ 34990 149264 -3197 -231094 -393701 -429745 -429236 -347331 -294258 -401324 -313476 -207660
20750b07660J51843O7590P7419J21898k8246j76666r6149J02077K16328M5869
$$ -207660 -55817 11773 89192 211090 182844 6178 -89971 12106 228434 274303
20740B74303j97153r4928k5373k8349j5623l0918M5003K7879j01326j8552J93737
$$ 274303 77150 -17778 -43151 -71500 -87123 -118041 -73038 -45159 -146485 -165037 28700
20729B8700J86772J4332j62406r5232K8250n6510j96323l0923K30592Q5321k6966
$$ 28700 215472 229804 67398 -27834 416 -56094 -252417 -283340 -52748 32573 5607
20718E607J64431K47601m3236k86301m10106j83109O3735K27519n7351J49187
$$ 5607 170038 417639 374403 88102 -322004 -505113 -441378 -213859 -271210 -122023
20708a22023k9143k1298j56929K7312J58106l2951l7534P4698K04780P3887p5392
$$ -122023 -151166 -172464 -329393 -302081 -143975 -176926 -214460 -139762 65018 138905 63513
20697F3513n2892L2646L9720r0255R901j61002K11772J20006p115j41699l04282
$$ 63513 10621 43267 82987 -7268 2633 -158369 53403 173409 166294 24595 -279687
20686b79687j33446J74234m0696O0124Q0367L655k1736J31781p0825k39546J79530
$$ -279687 -413133 -238899 -279595 -219471 -139104 -135449 -157185 -25404 -96229 -335775 -156245
20675a56245J87297J22644j8557Q8377l1289k12837M1997K14o8734J4025n5661
$$ -156245 31052 153696 135139 223516 192227 -20610 21387 21601 -47133 -33108 -88769
20664h8769j79986J6156K25930J20767j5086k05734j57575J07135Q2931j21724
$$ -88769 -268755 -252599 -26669 94098 79012 -126722 -284297 -177162 -94231 -215955
20654b15955J43354K13603J71049k2077j72866j12863J52102R1356j47619l4361
$$ -215955 -72601 141002 312051 289974 117108 4245 156347 247703 100084 65723
20644F5723P0360r1113j69913K37405J9066k3601M6841q7430l2369J00186L7477
$$ 65723 136083 44970 -124943 112462 131528 107927 154768 67338 34969 135155 172632
20633A72632q989j12026j49743j65106n3363J22147P6722m1585j50973o2650K25454
$$ 172632 163643 51617 -98126 -263232 -316595 -194448 -117726 -159311 -310284 -372934 -147480
20622a47480L9894m0619J8570O2088J82425j20797k36082p0809p2014m7514K11425
$$ -147480 -107586 -148205 -129635 -67547 114878 -5919 -242001 -312810 -384824 -432338 -220913
20611b20913K18098k0094j81353J8919K62013K20604M4020r0869j00010l8910
$$ -220913 -2815 -22909 -204262 -185343 76670 297274 341294 250425 150415 111505
20601A11505J42840N7123k22397j59411J65894R4456J61805L4396J15893j72339
$$ 111505 254345 311468 89071 -70340 95554 190010 351815 386211 502104 329765
20591C29765r114L0173K5351m05587k13776J02905M5158n0450P4387j01316k90955
$$ 329765 320651 350824 376175 -29412 -243188 -140283 -95125 -145575 -71188 -172504 -463459
20580d63459l1264J90454J19897O7374j6281p7168J16557L6736P3637j37831J4751
$$ -463459 -494723 -304269 -184372 -116998 -133279 -210447 -93890 -57154 16483 -121348 -106597
20569a06597J36052r202j14923J6884J22398J56627j12843j32518k37543J04507
$$ -106597 29455 20253 -94670 -77786 44612 201239 88396 -44122 -281665 -177158
20559a77158K83212J23847O368k72744n7472R0150J28382J6007l24281L937j05874
$$ -177158 106054 229901 236269 -36475 -93947 -3797 124585 140592 -183689 -179752 -285626
20548b85626l4047K622o1788J82465k1398l045K38002L53018k5611m2913k4919
$$ -285626 -319673 -317051 -378839 -196374 -217772 -220817 17185 370203 344592 301679 276760
20537B76760k4277q8545j76120k66303q6674K97762J97429j57247j52394j44732
$$ 276760 252483 163938 -12182 -278485 -365159 -67397 130032 -27215 -179609 -324341
20527c24341J47522J84866R8265M1740j53173q192J58546J37676O3476k85839
$$ -324341 -176819 8047 106312 148052 -5121 -13313 145233 282909 346385 60546
20517F0546j97424J17290N4577p4047l6764j75702O0777K44987j7570O769k35371
$$ 60546 -136878 -19588 34989 -39058 -75822 -251524 -190747 54240 36670 43439 -191932
20506a91932j14695J27994L7752O0899l0601j54851j04036k2594J87277J23342
$$ -191932 -306627 -178633 -140881 -79982 -110583 -265434 -369470 -392064 -204787 -81445
20496h1445k67929r8353K31506M8269J09299p55m369j19334R7069q2070O7733
$$ -81445 -349374 -447727 -216221 -167952 -58653 -59408 -63777 -183111 -86042 -168112 -100379
20485a00379q7113P2257R368m2930k2556j6359P3763K37586p143j91927O3340
$$ -100379 -187492 -115235 -105867 -148797 -171353 -187712 -113949 123637 116494 -75433 -12093
20474a2093j61771j84317k7994J32936P1850J20530K12707j16886q8921o6240
$$ -12093 -173864 -358181 -386175 -253239 -181389 -60859 151848 34962 -53959 -120199
20464a20199J0736M578r3962q5925k6780K36312J59875J6934j30077r3560O081
$$ -120199 -109463 -104885 -198847 -284772 -311552 -75240 84635 101569 -28508 -122068 -115987
20453a15987J85856p9556j62531j09023j35373J40952K44568N9703M1739K9180
$$ -115987 69869 -9687 -172218 -281241 -416614 -275662 -31094 28609 70348 99528
20443I9528j28434j35159j55154P3187M3846K52273J60401p7624q4128r5759m6597
$$ 99528 -28906 -164065 -319219 -246032 -202186 50087 210488 132864 48736 -47023 -93620
20432i3620J7588J97505J16075P2036j27649l34778J9595M1994j45768J82721
$$ -93620 -76032 121473 237548 309584 181935 -152843 -133248 -91254 -237022 -54301
20422e4301J90602k18886o9518Q3153j12275k2066P2773L4908L0764R4588j30024
$$ -54301 136301 -82585 -152103 -68950 -181225 -203291 -130518 -95610 -64846 29742 -100282
20411a00282j94876J00397J27646p6270l2201j45959Q4532J74156L9978q1314
$$ -100282 -295158 -194761 -67115 -143385 -175586 -321545 -237013 -62857 -22879 -104193
20401a04193l7337J55214O4231k5624J6150P2092j15572k6953j65861J5479N6334
$$ -104193 -141530 13684 77915 52291 68441 140533 24961 -1992 -167853 -152374 -96040
20390i6040k9860j2609K15210J36121M6300n2899j6448j8477j38830k0927r8724
$$ -96040 -125900 -138509 76701 212822 259122 206223 189775 171298 32468 11541 -87183
20379h7183k10179Q3233k303K0781M6762J3236j27372n0118p876j10331n8121
$$ -87183 -297362 -214129 -216432 -195651 -148889 -135653 -263025 -313143 -321019 -431350 -489471
20368d89471q8492J85073K6045J97229J50134J15941N6928r3836o9264j99684
$$ -489471 -577963 -392890 -366845 -169616 -19482 96459 153387 59551 -9713 -209397
20358b09397k11679N6017J33563K8490j66032J16640O8352J7031J35639l46650
$$ -209397 -421076 -365059 -231496 -203006 -369038 -252398 -184046 -167015 -31376 -378026
20348c78026o25J79802J37644L4274Q1509k7807k86149Q1624P9528J79125J8921
$$ -378026 -378651 -198849 -61205 -26931 54578 26771 -259378 -177754 -98226 80899 99820
20337I9820O6652m6547k63926r945j33312k81368R3294K66320J17835m4389j7164
$$ 99820 166472 119925 -144001 -153946 -287258 -568626 -475332 -209012 -91177 -135566 -152730
20326a52730P7150j10160R000J19622k8172J56035L7388M9675O699m8218P5670
$$ -152730 -75580 -185740 -176740 -57118 -85290 70745 108133 157808 164507 116289 191959
20315A91959J17409J64623l9270J10066j10805j72184k41267j55144n0608L6045
$$ 191959 309368 473991 434721 544787 433982 261798 20531 -134613 -185221 -149176
20305a49176L01915m683j43995J41888M2925j37906q4332j2833j58366P3328J45364
$$ -149176 152739 148056 4061 145949 188874 50968 -33364 -46197 -204563 -131235 14129
20294A4129r7399K4659o3233N0902J01123k04948m4335J2522j2759M3457n5487
$$ 14129 -83270 -58611 -121844 -70942 30181 -174767 -219102 -206580 -219339 -175882 -231369
20283b31369j50966R3166M5680P6391J04791J06220j23762j33311J2884q7094
$$ -231369 -382335 -289169 -243489 -167098 -62307 43913 -79849 -213160 -200276 -287370
20273b87370J30635J94910l5661j32956j86045R0125J46071L9971J22346n4202
$$ -287370 -156735 38175 2514 -130442 -316487 -226362 -80291 -40320 82026 27824
20263B7824p374J58922k8278K5445r8935N3484R9881J29859j63995j45768q0324
$$ 27824 20450 179372 151094 176539 77604 131088 230969 360828 196833 51065 -29259
20252b9259J75036J44008n3032j39933j40684k92512R7283K86184K43686j71258
$$ -29259 145777 289785 236753 96820 -43864 -336376 -239093 47091 290777 119519
20242A19519k78796N4324O1235R3269k5215r8135k39170k15720O2782j6737K36875
$$ 119519 -159277 -104953 -43718 49551 24336 -73799 -312969 -528689 -465907 -482644 -245769
20231b45769J63128N755m6013L7566J39705j36520M5637J9495o6659j0063L9889
$$ -245769 -82641 -76886 -122899 -85333 54372 -82148 -36511 -17016 -83675 -93738 -53849
20220e3849n5259m59n297r4636j71437Q202Q6729J70659K9658J04714l7220j11358
$$ -53849 -109108 -109567 -114864 -209500 -380937 -372735 -286006 -115347 -85689 19025 -18195 -129553
20208a29553K90412N5798q1917k8728p2613J7345q944n7669n3816O6899k09657
$$ -129553 160859 216657 134740 106012 33399 50744 41800 -15869 -69685 -2786 -212443
20197b12443k246J27797l7300J12646J11729j00032j63488K4492N3722M3970J04979
$$ -212443 -214689 -86892 -124192 -11546 100183 151 -163337 -138845 -85123 -41153 63826
20186F3826j28472N2542j17463p2531K8017q6599k09371k67923O3173L10358J90740
$$ 63826 -64646 -12104 -129567 -202098 -174081 -260680 -470051 -737974 -674801 -364443 -173703
20175a73703J41558p5044j02130q1826J79744M0826L362J45345Q2712j9212l09021
$$ -173703 -32145 -107189 -209319 -291145 -111401 -70575 -67213 78132 160844 141632 -167389
20164a67389j77711K26175J45209O8136J02665j87493j04472k97141k8554R9538
$$ -167389 -345100 -118925 26284 94420 197085 9592 -94880 -392021 -420575 -321037
20154c21037K41285O4281N5017j9835n1794m5282P2847O4961l9997Q1375j32443
$$ -321037 -79752 -15471 39546 19711 -32083 -77365 -4518 60443 20446 101821 -30622
20143c0622j26234K0829k30604L0809K71979n2302j44862q6319K3855K07601K13930
$$ -30622 -156856 -136027 -366631 -335822 -63843 -116145 -261007 -347326 -323471 -115870 98060
20132I8060k9097Q947J07453J52760J79295j66898k51065k84645m9530J65957
$$ 98060 68963 77910 185363 338123 517418 350520 99455 -185190 -234720 -68763
20122f8763M482O5989j20544N8461m6440r0942p1099K4555o5792n7173J19426
$$ -68763 -64281 1708 -118836 -60375 -106815 -197757 -268856 -244301 -310093 -367266 -247840
20111b47840J38410p1207J7814J65033j68932r5077J46795j77358l1715K15257
$$ -247840 -109430 -180637 -162823 2210 -166722 -261799 -115004 -292362 -324077 -108820
20101a08820J64256j3338M6441M0166j27241o3024J00891j75919j37981K5576
$$ -108820 55436 42098 88539 128705 1464 -61560 39331 -136588 -274569 -248993
20091b48993m1203N976K09083J34086J31521N1421n6712q3930j19196j70939R5319
$$ -248993 -290196 -284220 -75137 58949 190470 241891 185179 101249 -17947 -188886 -93567
20080i3567p9553k15710K07342K53553n450J731j50897L9166n7968j13099J45652
$$ -93567 -173120 -388830 -181488 72065 66615 68346 -82551 -43385 -101353 -214452 -68800
20069f8800K8206o9844o6992K04196R7694l6366J61104l2858r3905r0189j3555
$$ -68800 -40594 -110438 -177430 26766 124460 88094 249198 216340 122435 32246 18691
20058A8691J09551j4772n9266m3158j97274r5898n1824M4997m6579N3461J61680
$$ 18691 128242 113470 54204 11046 -186228 -282126 -333950 -288953 -335532 -282071 -120391
20047a20391Q1848K3965p7252N1064O0332L0872m2830q9192J11624N7590q6850
$$ -120391 -38543 -14578 -91830 -40766 19566 50438 7608 -81584 30040 87630 780
20036G80J75O2031n4243n5242l64870j44742J24568K4266k4122J21599L07988
$$ 780 955 62986 8743 -46499 -411369 -556111 -431543 -407277 -431399 -309800 -1812
20025a812K71986J05845l22350k53613n5157L8887J56830O0938j48310n821j19515
$$ -1812 270174 376019 53669 -199944 -255101 -216214 -59384 1554 -146756 -152577 -272092
20014b72092P2743K483p7894J32388L458L7561J41493J18664o0939j58911j35850
$$ -272092 -199349 -196866 -274760 -142372 -138914 -101353 40140 158804 97865 -61046 -196896
20003a96896M187p8222J17178n2235j83282j46999K66199L37322K0794j02236
$$ -196896 -192709 -270931 -153753 -205988 -389270 -536269 -270070 67252 88046 -14190
19993a4190j40877L168M6270o4375Q0382J62188J18811Q1701J410p5346j77581
$$ -14190 -155067 -151899 -105629 -170004 -89622 72566 191377 273078 274488 199142 21561
19982B1561p5268J69691K59334p7292j21998j74685N8275P5868j32736j39534
$$ 21561 -53707 115984 375318 298026 176028 1343 59618 135486 2750 -136784
19972a36784J21551N6764J04379N7889j07548j63771o3627j06710k53305j24172
$$ -136784 -15233 41531 145910 203799 96251 -67520 -131147 -237857 -491162 -615334
19962f15334K37748N2876J82093K84957j59738K0286J34262k5627p7291k18471
$$ -615334 -377586 -324710 -142617 142340 -17398 2888 137150 111523 34232 -184239
19952a84239k5481m2090j99101K01468L06488L354k07725j39324n3348P9375J36888
$$ -184239 -209720 -251810 -450911 -249443 57045 60399 -147326 -286650 -339998 -260623 -123735
19941a23735J46654r7351j23408q5596J59363o0545j0857J82860J11676k18952
$$ -123735 22919 -74432 -197840 -283436 -124073 -184618 -195475 -12615 99061 -119891
19931a19891j3930J48694J15522L850j59607j43084k5891k2667O7947N9827k6368
$$ -119891 -133821 14873 130395 134245 -25362 -168446 -194337 -217004 -149057 -89230 -115598
19920a15598J6181N123J41678K42240q5613l59381l09757K09234K88702K56501
$$ -115598 -99417 -94294 47384 289624 204011 -155370 -465127 -255893 32809 289310
19910B89310j44939r9371o0548o3178j17015O6540K3161N1931O6552J03731P0941
$$ 289310 144371 45000 -15548 -78726 -195741 -129201 -106040 -54109 12443 116174 187115
19899A87115q3452j97730r4591K9265J35028J29132j1056j10862j68469k18776
$$ 187115 103663 -94067 -188658 -159393 -24365 104767 93711 -17151 -185620 -404396
19889d04396j97741J90626O8353q5149r778j41296k62694J2021L02047J56296
$$ -404396 -602137 -411511 -343158 -428307 -438085 -579381 -842075 -830054 -528007 -371711
19879c71711J05779j6044P1218J40771J69287j07649j96715J84634q848k20903
$$ -371711 -265932 -281976 -210758 -69987 99300 -8349 -205064 -20430 -29278 -250181
19869b50181N2077R8495R4423j52461M3763J19921M1216o9842q5539J10587j32746
$$ -250181 -198104 -99609 -5186 -157647 -113884 6037 47253 -22589 -108128 2459 -130287
19858a30287o5406J320m8229J960R465k08426J22563J16337J52880k0833r701
$$ -130287 -195693 -194373 -242602 -240642 -231177 -439603 -317040 -200703 -47823 -68656 -78357
19847g8357P1082M175j51757k00866J12426Q2166N9709Q00R5357M9211j08564
$$ -78357 -7275 -3100 -154857 -355723 -243297 -161131 -101422 -100622 -5265 43946 -64618
19836f4618j4709j6686R4282j31052j43860j47721J27677J10526J09403M9795
$$ -64618 -79327 -96013 -1731 -132783 -276643 -424364 -296687 -186161 -76758 -26963
19826b6963n8519Q82O6052K52360J3347n7176O9824K7507k28381j19826J07106
$$ -26963 -85482 -84600 -18548 233812 247159 189983 259807 287314 58933 -60893 46213
19815D6213J47192o1907k16694j59951O2607R2957N7539O7687k7892j8056R5038
$$ 46213 193405 131498 -85196 -245147 -182540 -89583 -32044 35643 7751 -10305 84733
19804H4733l8717j3736P9497R8359L9226j88027J825K27380j54743m925P4424
$$ 84733 46016 32280 111777 210136 249362 61335 63160 290540 135797 130872 205296
19793B05296k02332M235N510k29270k12128N0948J91224Q0586j46978R238J93893
$$ 205296 2964 7199 12709 -216561 -428689 -377741 -186517 -105931 -252909 -243671 -49778
19782d9778J73060K0647J31424J15602j09386k25102l57348k30415j6922l0987
$$ -49778 123282 143929 275353 390955 281569 56467 -300881 -531296 -548218 -579205
19772e79205J94628K40720J75482r2547o710O7685j4359n9254j63302j7299O2651
$$ -579205 -384577 -143857 31625 -60922 -67632 53 -14306 -73560 -236862 -254161 -191510
19761a91510J12130O8324j90324k1047K01140R973j30709m2083j04272j4421P3224
$$ -191510 -79380 -11056 -201380 -222427 -21287 -11314 -142023 -184106 -288378 -302799 -229575
19750b29575M2742J14864L1801n8074j58002r8867N1809P8643O1537L377r5984
$$ -229575 -186833 -71969 -40168 -98242 -256244 -355111 -303302 -224659 -163122 -159745 -255729
19739b55729p712o0334M9403k4441R2638K26225n2925p5095p026j26079K1162
$$ -255729 -263441 -323775 -274372 -298813 -206175 20050 -32875 -107970 -114996 -241075 -219913
19728b19913r2384o2974J11585R7050J63115J24785j00073j21884k64288k6268
$$ -219913 -312297 -375271 -263686 -166636 -3521 121264 21191 -100693 -364981 -391249
19718c91249K71198j6203J00206J36711q5772P8370K8903l2734m4367M6014o8097
$$ -391249 -120051 -136254 -36048 100663 14891 93261 122164 89430 45063 91077 22980
19707B2980j52225j4170l7070J11541r6826j9500l0955j81031o7099o0417L7596
$$ 22980 -129245 -143415 -180485 -68944 -165770 -185270 -216225 -397256 -464355 -524772 -487176
19696d87176K62429J62718J12200p0092J48673Q9882j88352p6123J54002J47852
$$ -487176 -224747 -62029 50171 -19921 128752 218634 30282 -45841 108161 256013
19686B56013j46299j50617N8783j62495j10542K6200p5335J58333J56817P1297
$$ 256013 109714 -40903 17880 -144615 -255157 -228957 -304292 -145959 10858 82155
19676H2155L8683k57122r7981J80943K05244l4566k12098j91227q9707j710K91137
$$ 82155 120838 -136284 -234265 -53322 151922 117356 -94742 -285969 -375676 -377386 -86249
19665h6249J12776O6621R6148P2273j63955j94666k1213K2007K34060L6036j36706
$$ -86249 26527 93148 189296 261569 97614 -97052 -118265 -96258 137802 173838 37132
19654C7132j24473J5769j22994k49404j26941K55663J20597N132J26185q814P4559
$$ 37132 -87341 -71572 -194566 -443970 -570911 -315248 -194651 -189519 -63334 -72148 2411
19643B411l4601P619M828M7072K5082j48759j49201j09337J16239K17004j4889
$$ 2411 -32190 -24571 -19743 27329 52411 -96348 -245549 -354886 -238647 -21643 -36532
19632c6532j77277O2637N0639K34632r5836K046J63250k3474k36431Q70R7677
$$ -36532 -213809 -151172 -100533 134099 38263 40309 203559 180085 -56346 -55476 42201
19621D2201J29178j49832o0915m340q2005J65774q866p7879O9795O0691j13513
$$ 42201 171379 21547 -39368 -43708 -125713 40061 31195 -46684 23111 83802 -29711
19610b9711l2020j01778J07434N4942M9685k06162l0831J86870J13628j27504
$$ -29711 -61731 -163509 -56075 -1133 48552 -157610 -188441 -1571 112057 -15447
19600a5447j85170P2528R5466P3170R6723k9021J9003o2642k63206J17845K08812
$$ -15447 -200617 -128089 -32623 40547 137270 108249 127252 64610 -198596 -80751 128061
19589A28061o0370o6439P3589q956Q2146N1709p0012M1852J55952j72860j36957
$$ 128061 67691 1252 74841 65885 148031 199740 129728 171580 327532 154672 17715
19578A7715o0316j22341r2894O1908J15378J3215j3511J6121j49109P1842J47508
$$ 17715 -42601 -164942 -257836 -195928 -80550 -67335 -80846 -64725 -213834 -141992 5516
19567E516q8924k56188l4483K81535M1661j42026m1873J86923M8423p8638j5764
$$ 5516 -83408 -339596 -374079 -92544 -50883 -192909 -234782 -47859 564 -78074 -93838
19556i3838l8557p069M2303L7799r0422k13364q8898P880M7455L7320M6255O2704
$$ -93838 -132395 -139464 -97161 -59362 -149784 -363148 -452046 -444166 -396711 -359391 -313136 -250432
19544b50432J51862J3876l4499j37364j39547J04974K0491J81014J02834j48050
$$ -250432 -98570 -84694 -119193 -256557 -396104 -291130 -270639 -89625 13209 -134841
19534a34841J6149J17228J13077J30816q9646j69768P601j16965O2631J71040
$$ -134841 -118692 -1464 111613 242429 152783 -16985 -9384 -126349 -63718 107322
19524A07322K50564l1221r0667R520l84330j42839J60699J41589r1677L5686J63455
$$ 107322 357886 326665 235998 245518 -138812 -281651 -120952 20637 -71040 -35354 128101
19513A28101P9301k03596J09631N5921j51171K69540j20758k97191j20724J61895
$$ 128101 207402 3806 113437 169358 18187 287727 166969 -130222 -250946 -89051
19503h9051K26794m5877l8412l9495L5724q5852R2870j2109J46521j18503l6919
$$ -89051 137743 91866 53454 13959 49683 -36169 56701 44592 191113 72610 35691
19492C5691J10560O3770o1054j56012j11514Q6499J04057O1034O5534R3330q3976
$$ 35691 146251 210021 148967 -7045 -118559 -32060 71997 133031 198565 291895 207919
19481B07919k39482n3129j04346J32739J46459j06245K03317J36376q3430k89203
$$ 207919 -31563 -84692 -189038 -56299 90160 -16085 187232 323608 240178 -49025
19471d9025j1535j04470k72536l951K82952L3711n043R1331J20230r1171J44266
$$ -49025 -60560 -165030 -437566 -441517 -158565 -124854 -129897 -38566 81664 -9507 134759
19460A34759J71199m5376p9528l2319R2617j4209j43824j00677p4707k3462j05024
$$ 134759 305958 260582 181054 148735 241352 227143 83319 -17358 -92065 -115527 -220551
19449b20551o6782j43010M9574Q6160J03996k965j5790j36597k53314j18645J44080
$$ -220551 -287333 -430343 -380769 -294609 -190613 -193578 -209368 -345965 -599279 -717924 -573844
19438e73844K89177J33970Q9239n4395J1060Q5046J60512k6025m3447k2730o792
$$ -573844 -284667 -150697 -61458 -115853 -104793 -19747 140765 114740 71293 48563 41771
19427D1771j91010M1601N6800J09768Q6721L3848J65517K54165k478J20278J42553
$$ 41771 -149239 -107638 -50838 58930 145651 179499 345016 599181 596703 716981 859534
19416H59534J07971P548j96338k29756j44867j75814l03709J1836K31160K15395
$$ 859534 967505 975053 778715 548959 404092 228278 -75431 -63595 167565 382960
19406C82960J31812n1048J13746j23742j94858o8640j07993j18262k00548R128
$$ 382960 514772 463724 577470 453728 258870 190230 82237 -36025 -236573 -227445
19396b27445p574J04608J3003K9490K3579j08876q7218J40220O6290K8492l6629
$$ -227445 -235019 -130411 -117408 -87918 -64339 -173215 -260433 -120213 -53923 -25431 -62060
19385f2060k0761L8029J56874L01103j99135l87875j33401j23583K9916K34147
$$ -62060 -82821 -44792 112082 413185 214050 -173825 -307226 -430809 -400893 -166746
19375a66746J66038M0501L0072K5270Q0506l6248j14898k8258J51121j99923j70988
$$ -166746 -708 39793 69865 95135 175641 139393 24495 -3763 147358 -52565 -223553
19364b23553o514R6096k1027j9383L7375P3748L324K2391j76387r9252K64769
$$ -223553 -230067 -133971 -154998 -174381 -137006 -63258 -59934 -37543 -213930 -313182 -48413
19353d8413L7888n2791l2828j82854N2376M8894K37317J45345O7350P2149j13728
$$ -48413 -10525 -63316 -96144 -278998 -226622 -177728 59589 204934 272284 344433 230705
19342B30705k98078P7575N7612M304j25414p9933M6488K1518J5059j53130L2789
$$ 230705 -67373 10202 67814 72118 -53296 -133229 -86741 -65223 -50164 -203294 -170505
19331a70505L9055J3050J60695R7362l7017k89704j92909N8991O7951q3843L0483
$$ -170505 -131450 -118400 42295 139657 102640 -187064 -379973 -320982 -253031 -336874 -306391
19320c06391J29327o2153J64507J02552l01608r848J31917R1568k8540J2991J7815
$$ -306391 -177064 -239217 -74710 27842 -273766 -283614 -151697 -60129 -88669 -75678 -57863
19309e7863r8891K7352m9093L9984k8433k06605l938k751m0686J16391M7908m64
$$ -57863 -156754 -129402 -178495 -138511 -166944 -373549 -377487 -380238 -420924 -304533 -256625 -257089
19297b57089l4096j62222J47401P7156J88049l925j51468M953J72754O8098J7217
$$ -257089 -291185 -453407 -306006 -228850 -40801 -44726 -196194 -191241 -18487 49611 66828
19286F6828n6283J1506r628q8414J95400J26633j3248k04389P927L4291J0777
$$ 66828 10545 22051 12423 -75991 119409 246042 232794 28405 36332 70623 81400
19275H1400r3035j00905O8755P9351J76370J93758N7583k34824o6908J69630j50920
$$ 81400 -11635 -112540 -43785 35566 211936 405694 463277 228453 161545 331175 180255
19264A80255j3412K6101j10008j69614j2943n6814j59181K8055Q5894L7643L9566
$$ 180255 166843 192944 82936 -86678 -99621 -156435 -315616 -287561 -201667 -164024 -124458
19253a24458J14728j70050p5382R9838J35970M434j30457o2446r5092J70273P4097
$$ -124458 -9730 -179780 -255162 -155324 -19354 -14920 -145377 -207823 -302915 -132642 -58545
19242e8545J15726Q1391J57811k07343k71663j14565K14382K07571L9816j09059
$$ -58545 57181 138572 296383 89040 -182623 -297188 -82806 124765 164581 55522
19232E5522l06018N1534k5565r8974K71690j1465P423m8631Q958j00586L7792
$$ 55522 -250496 -198962 -224527 -323501 -51811 -63276 -55853 -104484 -95526 -196112 -158320
19221a58320K94055Q5128j10623r0341k3526l2249M0431N7182J23265r1082j2178
$$ -158320 135735 220863 110240 19899 -3627 -35876 4555 61737 185002 93920 81742
19210H1742j84222j75793k3310l915P9439L47166k9413j91026n2106O3122j36806
$$ 81742 -102480 -278273 -301583 -305498 -226059 121107 91694 -99332 -151438 -88316 -225122
19199b25122N4764R4399n7560j1989L74886k38924l04744n937j10341p0276J77605
$$ -225122 -170358 -75959 -133519 -145508 229378 -9546 -314290 -320227 -430568 -500844 -323239
19188c23239K15706k81650j05547J14122K3876o855l4516J30634O3500l6807J30475
$$ -323239 -107533 -389183 -494730 -380608 -356732 -363587 -398103 -267469 -203969 -240776 -110301
19177a10301K54554p0926k70055k06682r5773k78283O9296J47013K75535J97947
$$ -110301 144253 73327 -196728 -403410 -499183 -777466 -708170 -561157 -285622 -87675
19167h7675r2878m512o1593o7855J14959K38404n8842L0157L1628j91341J36081
$$ -87675 -180553 -185065 -246658 -314513 -199554 38850 -19992 10165 41793 -149548 -13467
19156a3467j3033m2374J98722Q1843K0178m5305k9588o3828q9333j94999J79319
$$ -13467 -26500 -68874 129848 211691 231869 186564 156976 93148 3815 -191184 -11865
19145a1865K10981P0812p4057o1648j99747J79977J41180K380q5277n3999j01900
$$ -11865 199116 269928 195871 134223 -65524 114453 255633 258013 172736 118737 16837
19134A6837k04783o707Q7746r1692M1649n0174J94925P3229J20271N310j93404
$$ 16837 -187946 -194653 -106907 -198599 -156950 -207124 -12199 61030 181301 186611 -6793
19123f793j24825o893j2385N0036m1043k9266K47892m893J65146k21515j53162
$$ -6793 -131618 -138511 -150896 -100860 -141903 -171169 76723 71830 236976 15461 -137701
19112a37701L3511M8825K02751j3302j49313j01407q6156j60326p8807J48197
$$ -137701 -104190 -55365 147386 134084 -15229 -116636 -202792 -363118 -441925 -293728
19102b93728J08521m2008j34055J65326L5228O5546J04530J20174O0896l48429
$$ -293728 -185207 -227215 -361270 -195944 -160716 -95170 9360 129534 190430 -157999
19092a57999j78640J22764r0912J00917Q5696K35037o9946j5020q745k18169l1736
$$ -157999 -336639 -213875 -304787 -203870 -118174 116863 46917 31897 23152 -195017 -226753
19081b26753J66390K40652Q6753j58231o6476p358J29359k3850k75839k6497O3747
$$ -226753 -60363 180289 267042 108811 42335 34977 164336 140486 -135353 -161850 -98103
19070i8103J9967j01260n7352k2999k2264J29646P6063k00105Q6128J26251m4120
$$ -98103 -78136 -179396 -236748 -259747 -282011 -152365 -76302 -276407 -190279 -64028 -108148
19059a08148k2214j4721L3325J42300l26908l42818J72514J42083m6744Q6567
$$ -108148 -130362 -145083 -111758 30542 -296366 -639184 -466670 -324587 -371331 -284764
19049b84764K3901O9430O6179J41057L29285m4305O3925p3141O4735L7546k76437
$$ -284764 -260863 -191433 -125254 15803 345088 300783 364708 291567 356302 393848 117411
19038A17411R4678p568p3608l7l0196J18223p399n5276J66931j86809j72992n7156
$$ 117411 212089 204521 130913 130876 100680 218903 211504 156228 323159 136350 -36642 -93798
19026i3798R8976J39915M5066j75736k93228k05029J17883J57655J20225L6469
$$ -93798 5178 145093 190159 14423 -278805 -483834 -365951 -208296 -88071 -51602
19016e1602r6662Q4974k6359r9414l6226M632n2279M8111J20814K6290j53020
$$ -51602 -148264 -63290 -89649 -189063 -225289 -220657 -272936 -224825 -104011 -77721 -230741
19005b30741J45862R8254j9236m4937k540k17625P9787K08895J07428Q4335j51862
$$ -230741 -84879 13375 -5861 -50798 -53338 -270963 -191176 17719 125147 209482 57620
18994E7620J40653J28783r5895k8749j04818j85129k26253J97821J95248J91954
$$ 57620 198273 327056 231161 202412 97594 -87535 -313788 -115967 79281 271235
18984B71235R1300r8834r9759R6102J12908R3458k41745j40047J99560k7207j76266
$$ 271235 362535 263701 163942 260044 372952 466410 224665 84618 284178 256971 80705
18973H0705L4350K64835k6833N0463j4617n7296J11941J5676k31368J48083M81565
$$ 80705 115055 379890 353057 403520 388903 331607 443548 459224 227856 375939 857504
18962H57504Q9248j76218j24283J42458Q892k18671P6944R7842Q0941J72955L17769
$$ 857504 946752 770534 646251 788709 797601 578930 655874 753716 834657 1007612 1325381
18951A325381L64786K89449R0761J41026k12038k09284j73591k60295l09344o6094
$$ 1325381 1690167 1979616 2070377 2211403 1999365 1790081 1616490 1356195 1046851 980757
18941I80757l340J87678N12462N29582N17000M68056K64579m9509l77930m90280
$$ 980757 977417 1165095 1677557 2207139 2724139 3192195 3456774 3407265 3029335 2539055
18931B539055q26618m39503n0259q2748j07625K0549O8511J51097J05468J33276
$$ 2539055 1712437 1272934 1222675 1139927 1032302 1052851 1121362 1272459 1377927 1511203
18921A511203J07840K7791L1597k74401m49990j95613j91978k02142n4733k0829
$$ 1511203 1619043 1646834 1678431 1404030 954040 758427 566449 364307 309574 288745
18911B88745R7892Q1972K479o6772q9777r8930N7838q2061j22135J29754J19497
$$ 288745 386637 468609 471088 404316 314539 215609 273447 191386 69251 199005 318502
18900C18502K8250J6923m4158J44409O6967M602p8598L6116j16316j14783P8190
$$ 318502 346752 363675 319517 463926 530893 535495 456897 493013 376697 261914 340104
18889C40104P1495K4193o5596O2935p798J47021O6385P1822K5938m7772k0935
$$ 340104 411599 435792 370196 433131 425333 572354 638739 710561 736499 688727 667792
18878F67792j19543J29529j19650j62032L24779M60141K43181J03600J35091K3371
$$ 667792 548249 677778 558128 396096 720875 1181016 1424197 1527797 1662888 1686259
18868A686259n2448L1627o0941j43810j2990K48003L23029K44210J90054m3284
$$ 1686259 1633811 1665438 1604497 1460687 1447697 1695700 2018729 2262939 2452993 2409709
18858B409709J92620K33417K54083L10515J86198M25439N86875M94071L64313
$$ 2409709 2602329 2835746 3089829 3400344 3586542 4011981 4598856 5092927 5457240
18849E457240K88862N67639N99813O44880J001614J304561J487313K035298L039924
$$ 5457240 5746102 6313741 6913554 7558434 8560048 9864609 11351922 13387220 16427144
18840A6427144M170030O072157R076622J3583310J8186382K0730022J7794565
$$ 16427144 20597174 26669331 35745953 49329263 67515645 88245667 106040232
18833A06040232J0207189L42804j0161907j7350422j7680217j2620913o540244
$$ 106040232 116247421 116590225 106428318 89077896 71397679 58776766 52236522
18826E2236522j072061M154018R997344J5992652J8599837J5433331P579328k328854
$$ 52236522 51164461 55318479 65315823 81308475 99908312 115341643 122920971 120592117
18818A20592117j3359538k0691242k0879628j6184169j0986730p610116n539670
$$ 120592117 107232579 86541337 65661709 49477540 38490810 30880694 25341024
18811B5341024l940947k784431k085888j709518j424462r70666r48531p49718
$$ 25341024 21400077 18615646 16529758 14820240 13395778 12425112 11476581 10726863
18803A0726863q20625o33089o45435o56605l44478m06451l16255j25309j63206
$$ 10726863 9906238 9273149 8627714 7971109 7626631 7220180 6903925 6778616 6615410
18794F615410k27202l49894l60414l47078k97863k19351k51054k11913L7580L6865
$$ 6615410 6388208 6038314 5677900 5330822 5032959 4813608 4562554 4350641 4388221 4425086
18784D425086N2221k6107k17141j61531m5955l02941k81033l94720k04777q2839
$$ 4425086 4477307 4451200 4234059 4072528 4026573 3723632 3442599 3047879 2843102 2760263
18774B760263K31281J71220p8765J49156K77886K35671m2575j04364k64664m64396
$$ 2760263 2991544 3162764 3083999 3233155 3511041 3746712 3704137 3599773 3335109 2870713
18764B870713m93482l56265j6994J8745r9333k07584q7869q4563k0603m8792j64201
$$ 2870713 2377231 2020966 2003972 2022717 1923384 1715800 1627931 1543368 1522765 1473973 1309772
18753A309772j03407P291J62077n6297K0597Q6912k08535j52296j84330n2962
$$ 1309772 1206365 1213656 1375733 1319436 1340033 1426945 1218410 1066114 881784 828822
18743H28822m3856J29477P3453K8876K3655R4831j31373q0151P7602R5552k04012
$$ 828822 784966 914443 987896 1016772 1040427 1135258 1003885 923734 1001336 1096888 892876
18732H92876j03325r0621Q5000J24497N704l3598Q1151j84339l9418J15122l0158
$$ 892876 789551 698930 783930 908427 914131 880533 961684 777345 737927 853049 822891
18721H22891Q5124k15392j7873R0263m1272p2180j24166j16121N4807n0218r7944
$$ 822891 908015 692623 674750 765013 723741 651561 527395 411274 466081 415863 317919
18710C17919N1722K64026K2487J27911L04948J52001j54970j28382k64044j28402
$$ 317919 369641 633667 656154 784065 1089013 1241014 1086044 957662 693618 565216
18700E65216j17526J6259j8510J27062K84809j6125J35918K53158l5078n7685
$$ 565216 447690 463949 445439 572501 857310 841185 977103 1230261 1195183 1137498
18690A137498l08321l56982r2942Q9844j01126j53946K9324j33159L2455J59558
$$ 1137498 829177 472195 379253 469097 367971 214025 243349 110190 142645 302203
18680C02203j77707J16875M64268P3087k19100j53584L1297k13858l1794O9806
$$ 302203 124496 241371 705639 778726 559626 406042 437339 223481 191687 261493
18670B61493P2595j76362j20775j40814N416J43146N1484m6714j31966P6721J94478
$$ 261493 334088 157726 36951 -103863 -98447 44699 96183 49469 -82497 -5776 188702
18659A88702M7742P8513l9742K57145J62874j55743r4130J38232o9483j70990
$$ 188702 236444 314957 275215 532360 695234 539491 445361 583593 514110 343120
18649C43120o0435K15688k5147l3193j52012q3846N6308J12730Q597j22643k18340
$$ 343120 282685 498373 473226 440033 288021 204175 260483 373213 381810 259167 40827
18638D0827J8089J86689J21171k65367n0670j17955O9506K19619m4324J37304
$$ 40827 58916 245605 366776 101409 50739 -67216 2290 221909 177585 314889
18628C14889r3902k21600p7465L7874J63192K49409o3077l9541L838O8670j40205
$$ 314889 220987 -613 -78078 -40204 122988 372397 309320 269779 273617 342287 202082
18617B02082j32553M051p4210m9017K22141Q9912j4514k19846j54725P1560Q5458
$$ 202082 69529 73580 -630 -49647 172494 262406 247892 28046 -126679 -55119 30339
18606C0339J50599o7928o2070l1015l189J21128J45580j00309j22922J8239J15767
$$ 30339 180938 113010 50940 19925 16736 137864 283444 183135 60213 78452 194219
18595A94219P1195k5031N2524J69228m3482k14770P6173m589k67257k55189n6230
$$ 194219 265414 240383 292907 462135 418653 203883 280056 275467 8210 -246979 -303209
18584c03209Q2561k8722J80914K5531k20545j18811N2087J19780m017k17352K7556
$$ -303209 -220648 -249370 -68456 -42925 -263470 -382281 -330194 -210414 -214431 -431783 -404227
18573d04227M0397K41445L08266k5449j48073l8931O5955R1487k7563Q6306N3460
$$ -404227 -363830 -122385 185881 160432 12359 -26572 39383 130870 103307 189613 243073
18562B43073O6211Q2691r3541J4434j44901j10974j62357n4122l8719l9846L04435
$$ 243073 309284 391975 298434 312868 167967 56993 -105364 -159486 -198205 -238051 66384
18551F6384K1541k05011k6642l8732O5173O6413m6132M0376k197K11768J19196
$$ 66384 87925 -117086 -143728 -182460 -117287 -50874 -97006 -56630 -58827 152941 272137
18540B72137k17307o4874N2335L4150j17520K4702r9795J87212j39603j4744K00789
$$ 272137 54830 -10044 42291 76441 -41079 -16377 -116172 71040 -68563 -83307 117482
18529A17482J07365J34044j42119j02669k02771r2128M1890K827k1066n5604R7413
$$ 117482 224847 358891 216772 114103 -88668 -180796 -138906 -136079 -157145 -212749 -115336
18518a15336L51667j4316j68833J88682j28783p2713j25109K005j0823K23839
$$ -115336 236331 222015 53182 241864 113081 40368 -84741 -82736 -93559 130280
18508A30280M6529J7832o0305P106r3062k18751r5036Q0141N2000k17213K8810
$$ 130280 176809 194641 134336 141442 48380 -170371 -265407 -185266 -133266 -350479 -321669
18497c21669L2981K46527J42602K05345J35751k07526k58131q4828K1069M5569
$$ -321669 -288688 -42161 100441 305786 441537 234011 -24120 -108948 -87879 -42310
18487d2310j0309J15719k9172r0836k17176o1205R7180K61766J64371J50543k16925
$$ -42310 -52619 63100 33928 -56908 -274084 -335289 -238109 23657 188028 338571 121646
18476A21646p8003Q8428n7078K9133j57196j50158q8711J75788J05627l7876p6953
$$ 121646 43643 132071 74993 104126 -53070 -203228 -291939 -116151 -10524 -48400 -125353
18465a25353j26295j08388J17534N1218R7355J41359k24q8030R6606j69695j54558
$$ -125353 -251648 -360036 -242502 -191284 -93929 47430 47206 -40824 55782 -113913 -268471
18454b68471R4133p2045J29773M4443r1220q2970J05593L2904M0996J69037j4095
$$ -268471 -174338 -246383 -116610 -72167 -163387 -246357 -140764 -107860 -66864 102173 88078
18443H8078k37233l40602n1846J51961k7623Q2264J58307j9257J01482K20917
$$ 88078 -149155 -489757 -541603 -389642 -417265 -335001 -176694 -195951 -94469 126448
18433A26448k8209Q884Q5553n9946k7507k48985O7888J83391L6873q870R2240
$$ 126448 98239 107123 192676 132730 105223 -143762 -75874 107517 144390 135520 227760
18422B27760L4824j55610j04447j32702o9718k7399K7189K22907k8791j03361
$$ 227760 262584 106974 2527 -130175 -199893 -227292 -200103 22804 -5987 -109348
18412a09348J5252r4053j11806J19640J31203Q6861j0800R11J63680J05280j92289
$$ -109348 -94096 -188149 -299955 -180315 -49112 37749 26949 27860 191540 296820 104531
18401A04531k03299R9025p6162o5500l6197j77627k32722P8677n8847J23129K07858
$$ 104531 -98768 257 -75905 -141405 -177602 -355229 -587951 -509274 -568121 -444992 -237134
18390b37134M0819J90472J86306L7467k5510J34276j4412J14392K04950J0378
$$ -237134 -196315 -5843 180463 217930 192420 326696 312284 426676 631626 642004
18380F42004j98063j57037M8068J68131q7179l72052k36332J38814L26850K12901
$$ 642004 443941 286904 334972 503103 415924 43872 -192460 -53646 273204 486105
18370D86105Q2905J61180K81606j69187j44656m5629j08252L4920k14605M5584
$$ 486105 569010 730190 1011796 842609 697953 652324 544072 578992 364387 409971
18360D09971O4236r1601j67583M2162J0466l5188j18669Q8176q7875l51789p216
$$ 409971 474207 382606 215023 257185 267651 232463 113794 201970 114095 -237694 -244910
18349b44910M5868L12127R0469k3864o11k85736j05858J26413J00019Q1209k17149
$$ -244910 -199042 113085 203554 179690 179079 -106657 -212515 -86102 13917 95126 -122023
18338a22023j95963J24306J61329K76848q3521k6200O8004j83149j50187J58083
$$ -122023 -317986 -193680 -32351 244497 160976 134776 202780 19631 -130556 27527
18328B7527L8796o1911j51983Q4854M915R3793j39947j17601O4975J33230M5524
$$ 27527 66323 4412 -147571 -62717 -57802 35991 -103956 -221557 -156582 -23352 22172
18317B2172j34556k6073M3606j16917r8410k6862q1429K702M6034R6364J91411
$$ 22172 -112384 -138457 -94851 -211768 -310178 -337040 -418469 -415767 -369733 -273369 -81958
18306h1958L1833n7363l4614K17928r3194j35396O8064K67269k14059j38543j11548
$$ -81958 -50125 -107488 -142102 75826 -17368 -152764 -84700 182569 -31490 -170033 -281581
18295b81581J42948J26947o1276m7108K78705K08221j61990l37386l5306R1576
$$ -281581 -138633 -11686 -72962 -120070 158635 366856 204866 -132520 -167826 -76250
18285g6250Q77J8677k16123j56501P3558J35042r1964P1646N2444K49765R767
$$ -76250 -75373 -56696 -272819 -429320 -355762 -220720 -312684 -241038 -188594 61171 70938
18274G0938o1729K96855q541l35346j48629N9646m3337J5850J66713P4858L2792
$$ 70938 9209 306064 297523 -37823 -186452 -126806 -170143 -154293 12420 87278 120070
18263A20070j81245k21188K0225L0309M4956J61143P1741L9437J93169p7930N794
$$ 120070 -61175 -282363 -262138 -231829 -186873 -25730 46011 85448 278617 200687 206481
18252B06481O0905Q1141q4955p6377r99J5861P4263J34887J69669J29039M0867
$$ 206481 267386 348527 263572 187195 186196 202057 276320 411207 580876 709915 750782
18241G50782K5181J92735L67221M04684K49326j16192n5920j70785m98028m44076
$$ 750782 775963 968698 1335919 1740603 1989929 1873737 1817817 1647032 1149004 704928
18231G04928k12055J87927p1741N4183l5459l21384j90292M2988j38926P3020
$$ 704928 492873 680800 609059 663242 627783 306399 116107 159095 20169 93189
18221I3189J5058K2414N927P2984R8887k66495q9451Q5892m136R2661j28131k09134
$$ 93189 108247 130661 136588 209572 308459 41964 -47487 38405 34269 126930 -1201 -210335
18209b10335j35861J8435K04210m6651j31055J9085J10949j38336J37078R8094
$$ -210335 -346196 -327761 -123551 -170202 -301257 -282172 -171223 -309559 -172481 -74387
18199g4387m1783j01796q2953L70028j2784M4653L04915N1605j86607j34911k83293
$$ -74387 -116170 -217966 -300919 69109 56325 100978 405893 457498 270891 135980 -147313
18188a47313k43730J25072R3534J07447Q3976j63308j0194R8740p4492K6325L31657
$$ -147313 -391043 -265971 -172437 -64990 18986 -144322 -154516 -55776 -130268 -103943 227714
18177B27714O7164J09328j25471l70344Q1886J2590N0006k2683M0259p8462P1807
$$ 227714 294878 404206 278735 -91609 -9723 2867 52873 30190 70449 -8013 63794
18166F3794m5090l4170J27534L4672Q0390P1844J21013j26088k8076j24087P9433
$$ 63794 18704 -15466 112068 146740 227130 298974 419987 293899 265823 141736 221169
18155B21169M9626m2423k866J12616Q2109J38699J09372J88719J8029j56964r9670
$$ 221169 270795 228372 225506 338122 420231 558930 668302 857021 875050 718086 618416
18144F18416K18627Q0799K11348K54467L9856K05361L5158q4472j9939L9772J50758
$$ 618416 837043 917842 1129190 1383657 1423513 1628874 1664032 1579560 1559621 1599393 1750151
18133A750151Q7599K71303M33894K92651L68732K61262M71856N10554O93724O77243
$$ 1750151 1837750 2109053 2542947 2835598 3204330 3465592 3937448 4448002 5141726 5818969
18123E818969J142252J302809J503397J821057K052572L191070M957186P836402
$$ 5818969 6961221 8264030 9767427 11588484 13641056 16832126 21789312 29625714
18115B9625714J2973971K2969637M2623499O9231035P2967979L8667314J7308112
$$ 29625714 42599685 65569322 108192821 177423856 250391835 289059149 306367261
18108C06367261j7673725p1167260q0308342m9321194k6586969j5145243r315423
$$ 306367261 288693536 217526276 137217934 87896740 61309771 46164528 36849105
18101C6849105o264200m667595l515932k581210k287803j920887j564654j470961
$$ 36849105 30584905 25917310 22401378 19820168 17532365 15611478 14046824 12575863
18093A2575863j166399j208413j071429o60656m19344m09728m19205j94302m56697
$$ 12575863 11409464 10201051 9129622 8468966 8049622 7639894 7220689 7026387 6569690
18084F569690o08389l18321j17425k26689k28554j51940j92623r6065r9132J3030
$$ 6569690 5961301 5642980 5525555 5298866 5070312 4918372 4725749 4629684 4530552 4543582
18074D543582k6125l83669n3462L4862j8539l57588k16646k31375k56382J11977
$$ 4543582 4517457 4133788 4080326 4115188 4096649 3739061 3522415 3291040 3034658 3146635
18064C146635o0354k23212j82738q284K1995j95658j16582j5886o9891j36857
$$ 3146635 3086281 2863069 2680331 2672047 2694042 2498384 2381802 2365916 2296025 2159168
18054B159168k6369n9102j90122J40089j17780k70631j77674j7333J12441j8600
$$ 2159168 2132799 2073697 1883575 2023664 1905884 1635253 1457579 1440246 1552687 1534087
18044A534087m44028l34726K18126P4336K4730j05021n3290J80101o2707M5344
$$ 1534087 1090059 755333 973459 1047795 1072525 967504 914214 1094315 1031608 1076952
18034A076952L37045J49979K5413q551j27842l46708k52436m4757K68870L41302
$$ 1076952 1413997 1563976 1589389 1580838 1452996 1106288 853852 809095 1077965 1419267
18024A419267L42674l4138k4642J25880Q4801l05670k37271q8705m9097l1868
$$ 1419267 1761941 1727803 1703161 1829041 1913842 1608172 1370901 1282196 1233099 1201231
18014A201231j2169j51435k4184k7591J15631L4834l37077j10290N2723Q5559
$$ 1201231 1189062 1037627 1013443 985852 1101483 1136317 799240 688950 741673 827232
18004H27232k86030j97785L72495J94236q3375j50193k00238l4889K11708J56970
$$ 827232 541202 343417 715912 910148 826773 676580 476342 441453 653161 810131
17994H10131j46137m195N3238M6565M89280M39802M35227O02676M50584K65347
$$ 810131 663994 659799 713037 759602 1248882 1688684 2123911 2726587 3177171 3442518
17984C442518M11344J93738L8067j78322m40523n08197n34172k97671j70260M2274
$$ 3442518 3853862 4047600 4085667 3907345 3466822 2958625 2424453 2126782 1956522 1998796
17974A998796J68514J50311J38917L6097J3878j90945j57861k21733k21483k10861
$$ 1998796 2167310 2317621 2456538 2492635 2506513 2315568 2157707 1935974 1714491 1503630
17964A503630k43045l58838j49439j51130p744j71185o6713p635L3190q475m789
$$ 1503630 1260585 901747 752308 601178 593434 422249 355536 347901 381091 372616 367827
17953C67827l343j95008j04564j03856J41492R2804J80341J29561M4189J35611
$$ 367827 364484 169476 64912 -38944 102548 195352 375693 505254 549443 685054
17943F85054j97360j31338q3181m3424j9327k12893L9135K54385J84890O0902
$$ 685054 487694 356356 273175 229751 210424 -2469 36666 291051 475941 536843
17933E36843K0592P957P2888j9578l4889J72788m158l865j52159m2137r3901j96221
$$ 536843 557435 565392 638280 618702 583813 756601 752443 748578 596419 554282 460381 264160
17921B64160r4786q2873K85231R5356K68229J85187j11587j62172J22090n4520
$$ 264160 169374 86501 371732 467088 735317 920504 808917 646745 768835 714315
17911G14315J60499k8576q6207q5419j08761q1075j28740M4113J43947J87602
$$ 714315 874814 846238 760031 674612 565851 484776 356036 400149 544096 731698
17901G31698m2041j78011J9387L4006Q0368O5571J42367K71879K89020M27895
$$ 731698 689657 511646 531033 565039 645407 710978 853345 1125224 1414244 1842139
17891A842139L35278O435K53699K86608k39914m57668k94840k63597J67719M41145
$$ 1842139 2177417 2183852 2437551 2724159 2484245 2026577 1731737 1468140 1635859 2077004
17881B077004N15847M12820P07354Q02445N74703N90675N05063l6186j29237J98911
$$ 2077004 2592851 3005671 3713025 4515470 5090173 5680848 6185911 6149725 6020488 6219399
17871F219399K41947M23262R00030J448315J874116K914474M461718P683774J2995270
$$ 6219399 6461346 6884608 7784638 9232953 11107069 14021543 18483261 26167035 39162305
17862C9162305J7963256J6626181J1965353R476663M321904Q4356o41631j905683
$$ 39162305 57125561 73751742 85717095 95193758 99515662 99600018 98958387 97052704
17854I7052704k770490q382371j4550500r802342J618323J0981049J1628465Q173240
$$ 97052704 94282214 85899843 71349343 61547001 63165324 74146373 85774838 93948078
17846I3948078O586216K159485j706053k403599l837785n069021j1610499j9189103
$$ 93948078 100534294 102693779 100987726 98584127 94746342 89677321 78066822 58877719
17838E8877719j7314151j0991851o365111l959567k749756k175939j319312j148698
$$ 58877719 41563568 30571717 24206606 20247039 17497283 15321344 14002032 12853334
17830A2853334q16356o57286m84908q30411p29157o34707o66864p14560p85912
$$ 12853334 12036978 11379692 10894784 10064373 9335216 8700509 8033645 7319085 6533173
17821F533173n22294l72680k47771j77213J9940l02111l20365l52697p8603k47486
$$ 6533173 6010879 5638199 5390428 5213215 5233155 4931044 4610679 4257982 4179379 3931893
17811C931893k87770l88455j42849J03332J24737k5659k02294j99581q5363r232
$$ 3931893 3644123 3255668 3112819 3216151 3340888 3315229 3112935 2913354 2827991 2818759
17801B818759p6625J09299l9757k08708l58745L4109P0772L768j28855j89220
$$ 2818759 2742134 2851433 2811676 2602968 2244223 2278332 2349104 2352872 2224017 2034797
17791B034797j82201j30201q6432j26208M6769J26926J67093O6863j38767K0802
$$ 2034797 1852596 1722395 1635963 1509755 1556524 1683450 1850543 1917406 1778639 1799441
17781A799441L5219p5552j80363j66766j45170j13538j0547j52772J20083R7919
$$ 1799441 1834660 1759108 1578745 1411979 1266809 1153271 1142724 989952 1110035 1207954
17771A207954q5274p8360o218N542o5739n6926J89442J3153k31338l55309l1759
$$ 1207954 1122680 1044320 1038102 1043644 977905 920979 1110421 1123574 892236 536927 505168
17760E05168J8122j02135K51764k3834J03789J10583k08077k97699j55758J3390
$$ 505168 523290 421155 672919 649085 752874 863457 655380 357681 201923 215313
17750B15313K30999K79763O0871m1239N978R1220J66389O1603j55366l3706l9770
$$ 215313 446312 726075 786946 745707 751685 842905 1009294 1070897 915531 881825 842055
17739H42055j43228L2122J0720K9491K02962J49653K11076r1147k32732J18807
$$ 842055 698827 730949 741669 771160 974122 1123775 1334851 1243704 1010972 1129779
17729A129779k1684m8530N1535j16658k42067k11138j2507J96782L50781J43729
$$ 1129779 1108095 1059565 1111100 994442 752375 541237 528730 725512 1076293 1220022
17719A220022q7636j58953j36267K516q4947j88680R2292k786k02785j21409l893
$$ 1220022 1132386 973433 837166 839682 754735 566055 658347 655561 452776 331367 327474
17708C27474K7755J13596L5511j35147l7346l7302J67789K69824n5180j16552
$$ 327474 355229 468825 504336 369189 331843 294541 462330 732154 676974 560422
17698E60422J82770J15496l83275k08309p1441Q3344p3030j14510j52879J10279
$$ 560422 743192 858688 475413 267104 195663 279007 205977 91467 -61412 48867
17688D8867N6700P7170M2703J0739j75809k5311K4821j27847r2397L9805m7430
$$ 48867 105567 182737 225440 236179 60370 35059 59880 -67967 -160364 -120559 -167989
17677a67989Q5991K76290j4522R7339m3339p5229n1160l2082n4080M1485j903
$$ -167989 -81998 194292 179770 277109 233770 158541 107381 75299 21219 62704 60801
17666F0801O6532L7340j77605P6701J65394J14210j664M4879J2669m3465j36338
$$ 60801 127333 164673 -12932 63769 229163 343373 341709 386588 399257 355792 219454
17655B19454j8382p0179r5532k22113L3697J82572L00022J45547p4568j08031
$$ 219454 201072 130893 35361 -186752 -153055 29517 329539 475086 400518 292487
17645B92487j03041r8803J37681J17896P1948K03363o669j48020j45061j51965
$$ 292487 189446 90643 228324 346220 418168 621531 614862 466842 321781 169816
17635A69816K3265k7598j10410N7047m3206J39678j66535k07455j9930J42666
$$ 169816 193081 165483 55073 112120 68914 208592 42057 -165398 -185328 -42662
17625d2662J04672J6652M6735k7925J46971l5487k92523j38880m5758O5853J57476
$$ -42662 62010 78662 125397 97472 244443 208956 -83567 -222447 -268205 -202352 -44876
17614d4876J82597n6362o1551L6225Q7542r4395Q7048K28266o588k49494J50298
$$ -44876 137721 81359 19808 56033 143575 49180 136228 364494 357906 108412 258710
17603B58710K06781j397J9728o2868l11922j24753m0357j74649P3889J16601j00427
$$ 258710 465491 464094 483822 420954 109032 -15721 -56078 -230727 -156838 -40237 -140664
17592a40664J06764K81952M7605J7848K29149j33734k75413k31633O4215J41757
$$ -140664 -33900 248052 295657 313505 542654 408920 133507 -98126 -33911 107846
17582A07846K89800j6423j36361j16083o75j717N7949K6572p0728k3465q17m2247
$$ 107846 397646 381223 244862 128779 128104 126387 184336 210908 140180 116715 115898 73651
17570G3651K39913K08073j57776j23250N5345l7784k68534K72K41172J1206k20086
$$ 73651 313564 521637 363861 240611 295956 258172 -10362 -10090 231082 242288 22202
17559B2202J77542J19748l351R2357k5620J4481p385j18739j01323j39943Q3347
$$ 22202 199744 319492 316141 408498 382878 397359 389974 271235 169912 29969 113316
17548A13316n5564j82219L9841n1726p2003l0255J3045j09518j8164J09833L17902
$$ 113316 57752 -124467 -84626 -136352 -208355 -238610 -225565 -335083 -353247 -243414 74488
17537G4488m9149L719J41161Q945J95415J07869l15115j16724P8891J19243J50590
$$ 74488 25339 29058 170219 179164 374579 482448 167333 50609 129500 248743 399333
17526C99333L7238k11964j42013J32655j14018O3724p0314k0787l5062j56824
$$ 399333 436571 224607 82594 215249 101231 164955 94641 73854 38792 -118032
17516a18032M7867L6599J84155O0839n5332j05204j15292K02405K22063l1397
$$ -118032 -70165 -33566 150589 211428 156096 50892 -64400 138005 360068 328671
17506C28671k41398K7748J72338k15315j95725q2447n2127K77155J33679J7050
$$ 328671 87273 115021 287359 72044 -123681 -206128 -258255 18900 152579 169629
17496A69629j00922j37264o9989L7027O8512P6547j7868j15211O6036j82499n2
$$ 169629 68707 -68557 -138546 -101519 -33007 43540 25672 -89539 -23503 -206002 -206054
17485b06054J63290K86727J73607l8451k25120k58706L43342R3734o933l10654
$$ -206054 -42764 243963 417570 379119 153999 -104707 238635 332369 325436 14782
17475A4782j54647J32812k2074n5793j46346Q4815K24953p2986L9495P5223J06669
$$ 14782 -139865 -7053 -29127 -84920 -231266 -146451 78502 5516 45011 120234 226903
17464B26903k6768k57471j06163O2656R5420J41582K13106L0384k11481j24536
$$ 226903 200135 -57336 -163499 -100843 -5423 136159 349265 379649 168168 43632
17454D3632K7753q1527m7874N8092J962J40938K18970K84672M79634J35395K36117
$$ 43632 71385 -10142 -58016 76 2038 142976 361946 646618 1126252 1261647 1497764
17443A497764K35013l5037l78415m51936M3678l25198m66239r7088L533J23841
$$ 1497764 1732777 1697740 1319325 867389 911067 585869 119630 22542 26075 149916
17433A49916o8853j48069l9331J2588J21620M971k33484N6868J30803p590Q7346
$$ 149916 81063 -67006 -106337 -93749 27871 32842 -200642 -143774 -12971 -20561 66785
17422F6785j01850j4773J54834Q2203j40505K2294N8976k1071J2646J42379R3713
$$ 66785 -35065 -49838 104996 187199 46694 68988 127964 106893 119539 261918 355631
17411C55631j14105j51480j14205N364J48768K35385N5685o0832Q474l7083K4071
$$ 355631 241526 90046 -24159 -18795 129973 365358 421043 360211 368685 331602 355673
17400C55673J81509j87875k10285j12038j5174j52651j76481n2755J07769Q4604
$$ 355673 537182 349307 139022 26984 11810 -140841 -317322 -370077 -262308 -177704
17390a77704Q8048P8133L0841L7486j28819J16457k0114j63261J668J99238Q9755
$$ -177704 -89656 -11523 19318 56804 -72015 44442 24328 -138933 -137265 61973 151728
17379A51728r0927p7504J02645M0487p8073j19712P6419R6060K2378J3180P6368
$$ 151728 60801 -16703 85942 126429 48356 -71356 5063 101123 123501 136681 213049
17368B13049q8308l0006q1976q9197j18622n8971N6195J52830q4709q5358M5963
$$ 213049 124741 94735 12759 -76438 -195060 -254031 -197836 -45006 -129715 -215073 -169110
17357a69110j8229p8221o7254q2006r5848J24382L36526K02450P6450J4393p4478
$$ -169110 -187339 -265560 -332814 -414820 -510668 -386286 -49760 152690 229140 243533 169055
17346A69055L45061L5909k28019q2475j03386j14683m4396j43349o7198q4339
$$ 169055 514116 550025 322006 239531 136145 21462 -22934 -166283 -233481 -317820
17336c17820L0496K04848K55925J77688q230L03810L921j48435l4435O651j2259
$$ -317820 -287324 -82476 173449 351137 342907 646717 650638 502203 467768 474419 462160
17325D62160J71721K6681j63818O9802J01908P3933Q9399o0745J2705n9468k7426
$$ 462160 633881 660562 496744 566546 668454 742387 831786 771041 783746 724278 696852
17314F96852j61724j1222o5119k35620j01398k5915o7056o460J09308j02565j90771
$$ 696852 535128 523906 458787 223167 121769 95854 28798 22338 131646 29081 -161690
17303a61690m1414J40860O3877q5565j19856J9399M9517o5252L7504m1475m6846
$$ -161690 -203104 -62244 1633 -83932 -203788 -184389 -134872 -200124 -162620 -204095 -250941
17292b50941n2859P0855L467m7808p0110o5816K83581J71633j00739j35714J34306
$$ -250941 -303800 -232945 -229478 -277286 -347396 -413212 -129631 42002 -58737 -194451 -60145
17281f0145K32585o4862q6478M983j05482P6039L3775k6306R3563m0205j05470
$$ -60145 172440 107578 21100 26083 -79399 -3360 30415 4109 97672 57467 -48003
17270d8003M2910k44928j28840K29015J39259m3195q3652j13870J21363J34055
$$ -48003 -5093 -250021 -378861 -149846 -10587 -53782 -137434 -251304 -129941 4114
17260D114L0145j10211M7259K25300J07333J6250o26j75689k16679l7654P87Q9987
$$ 4114 34259 -75952 -28693 196607 303940 320190 319564 143875 -72804 -110458 -109671 -19684
17248a9684J28962N2220k6510J41056J4901k2241p7737J9276J89231r1825k16947
$$ -19684 109278 161498 134988 276044 290945 268704 190967 210243 399474 307649 90702
17237I0702l2102L6095j74808q9191P5027R5751J04435J02569j42524p6621o7500
$$ 90702 58600 94695 -80113 -169304 -94277 1474 105909 208478 65954 -10667 -78167
17226g8167j18632o1877Q4333k48406n6971j7242m9403J91250O9292J29948J56222
$$ -78167 -196799 -258676 -174343 -422749 -479720 -496962 -546365 -355115 -285823 -155875 347
17215C47N4622P1756K9417j38195p0634j27549L2381N6431J78443L8748j8882
$$ 347 54969 126725 156142 17947 -52687 -180236 -147855 -91424 87019 125767 106885
17204A06885j8731K383j43892Q180P3288l0281l5715Q5968K30113q1596o5774
$$ 106885 88154 90537 -53355 -45175 28113 -2168 -37883 48085 278198 196602 130828
17193A30828j22208k5940k868J77647M0565K69225k02656j37251O8241p836j65684
$$ 130828 8620 -17320 -20188 157459 198024 467249 264593 127342 195583 187747 22063
17182B2063j40307M0897J3955P7915N6572j67140k03687J6310J82851n4997n1769
$$ 22063 -118244 -77347 -63392 14523 71095 -96045 -299732 -283422 -100571 -155568 -207337
17171b07337m4236j62533J0384Q0446Q842L1651L2156P53P2405J87887R199o3989
$$ -207337 -251573 -414106 -403722 -323276 -314434 -282783 -250627 -249874 -177469 10418 19617 -44372
17159d4372j45200q8466J11383K206o943K29529J11189k07048p0354P0504M9257
$$ -44372 -189572 -278038 -166655 -164449 -171392 58137 169326 -37722 -108076 -37572 11685
17148A1685k0590N1446r213J9374l5784q7702k9535P7113P4581K9480Q7579R9874
$$ 11685 -8905 42541 33328 52702 16918 -70784 -100319 -23206 51375 80855 168434 268308
17136B68308j9152r5232o3140R1012l69758j05638N9345J1759Q9513N2728O3016
$$ 268308 249156 153924 90784 181796 -187962 -293600 -234255 -222496 -132983 -80255 -17239
17125a7239J42458R5540l3160q6315r2030m1481K66623r0916j7707N512J03245
$$ -17239 125219 220759 187599 101284 9254 -32227 234396 143480 125773 131285 234530
17114B34530M308l8202p286J11103K17329k22207j41328p7562m8360j30159m3677
$$ 234530 238838 200636 193350 304453 521782 299575 158247 80685 32325 -97834 -141511
17103a41511N5778k04307L5425J11293P2625P6489J77486m9529j31796o3271J28235
$$ -141511 -85733 -290040 -254615 -143322 -70697 5792 183278 133749 1953 -61318 66917
17092F6917J63806j62800p6756j14971k47653j44523n3649O5648K00541O3200
$$ 66917 230723 67923 -8833 -123804 -371457 -515980 -569629 -503981 -303440 -240240
17082b40240R1348Q4480R1329N5069j4566m2133Q7339r3526j07605M2246J26637
$$ -240240 -148892 -64412 26917 81986 67420 25287 112626 19100 -88505 -46259 80378
17071H0378j36832K9632J1799P7262M829k20481q201j40704J26003J38416O4211
$$ 80378 -56454 -26822 -15023 62239 67068 -153413 -161614 -302318 -176315 -37899 26312
17060B6312K7595K6081Q8292O5253l7636J0059k1868m413J05765r254J1489k414
$$ 26312 53907 79988 168280 233533 195897 205956 184088 179675 285440 276186 287675 285261
17048B85261j24943K7854m9489O7034K4734j85895n4000J19455N1792j33427j60884
$$ 285261 160318 188172 138683 205717 230451 44556 -9444 110011 161803 28376 -132508
17037a32508K20548J0291k89802R2023J31650k5882m1402j94713k77883J60104
$$ -132508 88040 98331 -191471 -99448 32202 6320 -35082 -229795 -507678 -347574
17027c47574J90613p8018J26027M3506l4075L9351J25241n4918k1667n5870K7670
$$ -347574 -156961 -234979 -108952 -65446 -99521 -60170 65071 10153 -11514 -67384 -39714
17016c9714n3182q390J06941k05117J44526r2906j20839q8389R233Q07L36805
$$ -39714 -92896 -101286 5655 -199462 -54936 -147842 -268681 -357070 -347837 -347030 -10225
17005a0225k3451k72605K14091K4065m9353k2708q8297N8683J61340P3450Q4954
$$ -10225 -33676 -306281 -92190 -68125 -117478 -140186 -228483 -169800 -8460 64990 149944
16994A49944Q9085k03363j70520j9482m3430j4225J02721K8493k00564k8188L85606
$$ 149944 239029 35666 -134854 -154336 -197766 -211991 -109270 -80777 -281341 -309529 76077
16983G6077k5357k63084j95119Q1585P8601J75808J47615J66859k05035j31305
$$ 76077 50720 -212364 -407483 -325898 -247297 -71489 76126 242985 37950 -93355
16973i3355j29815P4465J45483J15176O464J3860L5555k9294o9385q6334M3260
$$ -93355 -223170 -148705 -3222 111954 118418 132278 167833 138539 69154 -17180 26080
16962B6080J84099J63430k4775l75087m54760R7955J20717P9191M0105j10326
$$ 26080 210179 373609 348834 -26253 -481013 -383058 -262341 -183150 -143045 -253371
16952b53371J98034l2244L61037K15688J2577j99883L100J69824m801r5017j58889
$$ -253371 -55337 -87581 273456 489144 501721 301838 304938 474762 469961 374944 216055
16941B16055j35573j92100L3525K70634J43668j00850N224q6869L5182q117j23982
$$ 216055 80482 -111618 -78093 192541 336209 235359 240583 153714 188896 180779 56797
16930E6797J58745n3005k19778q7616k1219J04286M2918n703l4430r5690K7498
$$ 56797 215542 162537 -57241 -144857 -166076 -61790 -18872 -24575 -59005 -154695 -127197
16919a27197K21698N005k21123K05048J07967k03894j10245m2637l860J75177
$$ -127197 94501 99506 -121617 83431 191398 -12496 -122741 -165378 -169238 5939
16909E939O3387j4394m5288J2861j6059Q697J18904O2141R3477r16j51906n5654
$$ 5939 69326 54932 9644 22505 6446 15143 134047 196188 289665 288749 136843 81189
16897H1189l08297L0872j05337Q3901J21444K56518j4193l24736L5024J11181
$$ 81189 -227108 -196236 -301573 -217672 -96228 160290 146097 -178639 -143615 -32434
16887c2434J16114j3590l5702K5796K5725J31674J32471o4757k40083q3915k5216
$$ -32434 83680 70090 34388 60184 85909 217583 350054 285297 45214 -38701 -63917
16876f3917r6830O0212J2891J55626J11316j86359l26425o1222J24425J04105
$$ -63917 -160747 -100535 -87644 67982 179298 -7061 -333486 -394708 -270283 -166178
16866a66178N221r6233N4392J10344j56605j37504J73305j23569J25467N864M5154
$$ -166178 -160957 -257190 -202798 -92454 -249059 -386563 -213258 -336827 -211360 -205496 -160342
16855a60342Q9119O4372J01536M1709p2645j52770o865Q3388J33331k05570k4301
$$ -160342 -71223 -6851 94685 136394 63749 -89021 -95886 -12498 120833 -84737 -109038
16844a09038M4553j3751k139j7805L2826K68665R1700p6301j7635j55209j55355
$$ -109038 -64485 -78236 -80375 -98180 -65354 203311 295011 218710 201075 45866 -109489
16833a09489P3120K051r6924P6536J71422j58847k34219J55387K29145M3273j18743
$$ -109489 -36369 -34318 -131242 -54706 116716 -42131 -276350 -120963 108182 151455 32712
16822C2712o8388q8820p8504K04124J06146k7534K11004J2398k80534K6294n3154
$$ 32712 -35676 -124496 -203000 1124 107270 79736 290740 303138 22604 48898 -4256
16811d256j47764j04122n6289J86405p0184J51567J59109L8166j13349R951j00940
$$ -4256 -152020 -256142 -312431 -126026 -196210 -44643 114466 152632 39283 49234 -51706
16800e1706o0307k8167J29008J80031m9204Q4213q9494j61435J30746M9841l2842
$$ -51706 -112013 -140180 -11172 168859 119655 203868 114374 -47061 83685 133526 100684
16789A00684J30086q4683M1057R2822k7913k8271j50559j09485J66476o3971r0368
$$ 100684 230770 146087 187144 279966 252053 223782 73223 -36262 130214 66243 -24125
16778b4125J7777M0539M787q1123j68352n671m1507J64344J039Q2725k3178J21861
$$ -24125 -6348 34191 38978 -42145 -210497 -216168 -257675 -93331 -92292 -9567 -32745 89116
16766H9116J91040k3309l37877j0450l4033J0656K8097j97542p9261L2338N7697
$$ 89116 280156 256847 -81030 -91480 -125513 -114857 -86760 -284302 -363563 -331225 -273528
16755b73528M9758p4128q6876K27101K36985N8914r114j30315k9734l7872P8179
$$ -273528 -223770 -297898 -384774 -157673 79312 138226 129112 -1203 -30937 -68809 9370
16744I370j6214j56286k05407j08164L6765O9346n0435M1265J18231k9318J68411
$$ 9370 -6844 -163130 -368537 -476701 -439936 -370590 -421025 -379760 -261529 -290847 -122436
16733a22436J18246J380r9447j10932K41211R3180j14446n3929r1910q1003O0213
$$ -122436 -4190 -2810 -102257 -213189 28022 121202 6756 -47173 -139083 -220086 -159873
16722a59873K7970j00826K42468J70018k5687Q0994k39820J95546L20642j09724
$$ -159873 -131903 -232729 9739 179757 154070 235064 -4756 190790 511432 401708
16712D01708Q055k56291N7087P6708k0715p1005j22630j5032L7252m85R7130m8430
$$ 401708 409763 153472 210559 287267 266552 195547 72917 57885 95137 94652 191782 143352
16700A43352k13234q6911j36034L27066L02727j46855j60920k27174j2582J68960
$$ 143352 -69882 -156793 -292827 34239 336966 190111 29191 -197983 -210565 -41605
16690d1605J59045j36417m7033k31275P3021K89798j34820j20000K3619j24640
$$ -41605 117440 -18977 -66010 -297285 -224264 65534 -69286 -189286 -165667 -290307
16680b90307j2583N0180J14230l1784k16994J07246Q4585j16426o323K00977K16081
$$ -290307 -302890 -252710 -138480 -170264 -387258 -280012 -195427 -311853 -318176 -117199 98882
16669I8882Q4494q7017j07788k58091n5977L2853J80802o2910j00536J89746K52151
$$ 98882 183376 96359 -11429 -269520 -325497 -292644 -111842 -174752 -275288 -85542 166609
16658A66609J128j09n2984p7962k9109o5838J51768j35982j82266j906J70863
$$ 166609 167737 167628 114644 36682 7573 -58265 93503 -42479 -224745 -226651 -55788
16647e5788K8726K153l6299j60231j0734J51512K82177N3314j33831m2417J21378
$$ -55788 -27062 -24909 -61208 -221439 -232173 -80661 201516 254830 120999 78582 199960
16636A99960J77339J18110j47984p5028k8648o3070j31005j0095q4455j14150
$$ 199960 377299 495409 347425 272397 243749 180679 49674 39579 -44876 -159026
16626a59026K7351K06066n0842j66926j84581m6171R9806K25124K3802j29506
$$ -159026 -131675 74391 23549 -143377 -327958 -374129 -274323 -49199 -25397 -154903
16616a54903j01403J0972Q6444J55794l4623J6157K9287o5569q3453n0588O9784
$$ -154903 -256306 -245334 -158890 -3096 -37719 -21562 7725 -57844 -141297 -191885 -122101
16605a22101J13150J76982J39786M6719N7242N728m7379p0000j69671j47280L6948
$$ -122101 -8951 168031 307817 354536 411778 417506 370127 300127 130456 -16824 20124
16594B0124n3768j58324k8278M9416l7600K32708J87195j96165k45718J43039
$$ 20124 -33644 -191968 -220246 -170830 -208430 24278 211473 15308 -230410 -87371
16584h7371N4468K5788q4584R3685O4564p4406j31731n5188l916J54771N9573
$$ -87371 -32903 -7115 -91699 1986 66550 -7856 -139587 -194775 -198691 -43920 15653
16573A5653J77647L5313k7250R708q5756M8955o6767j05664k28245n8788J58069
$$ 15653 193300 228613 201363 211071 125315 174270 107503 1839 -226406 -285194 -127125
16562a27125J12718j60942r0943n729L2386K31811k8802j83587j66655J41084
$$ -127125 -14407 -175349 -266292 -272021 -239635 -7824 -36626 -220213 -386868 -245784
16552b45784N27310Q875j66179j1158l2814Q4318k26225J60108K38455j87588
$$ -245784 281526 290401 124222 113064 80250 164568 -61657 98451 336906 149318
16542A49318j42064P3497P6443j190k73530J0083p8021K70922R0477J34155R1166
$$ 149318 7254 80751 157194 156004 -117526 -107443 -185464 85458 175935 310090 401256
16531D01256O7277k20761j99083n1171J24108J40986N3914o8939P6439k6373J3871
$$ 401256 468533 247772 48689 -2482 121626 262612 316526 247587 324026 297653 311524
16520C11524M8244L19125J58849j24822l02057k21577l8378O8990R3128r3687
$$ 311524 359768 678893 837742 712920 410863 189286 150908 219898 313026 219339
16510B19339j52436J06164j16889J57525M08732J30451p2224m1601P0347o3292
$$ 219339 66903 173067 56178 213703 622435 752886 680662 639061 709408 646116
16500F46116o5233j08140j50995J48511J11995p8097J33186Q3297k46932j32988
$$ 646116 580883 472743 321748 470259 582254 504157 637343 720640 473708 340720
16490C40720j114o759J35169K93565O5098j56501k11813l9838P9600O3679k3155
$$ 340720 339606 332847 468016 761581 826679 670178 458365 418527 498127 561806 538651
16479E38651j36301j23533n2491P4373N0206l7941n2607j05857O966J07370K45563
$$ 538651 402350 278817 226326 300699 350905 312964 260357 154500 161466 268836 514399
16468E14399n1438r4107j01867k9088j13389R3292j18488j03384j92976K8686
$$ 514399 462961 368854 266987 237899 124510 217802 99314 -4070 -197046 -168360
16458a68360K57616M7421j08999J44590j56590k41081Q6228L6702q4040N8099
$$ -168360 89256 136677 27678 172268 15678 -225403 -139175 -102473 -186513 -128414
16448a28414K2335j3053Q9679Q4538o0732Q490L7285J53315J4133j87778o6324
$$ -128414 -106079 -119132 -29453 55085 -5647 2843 40128 193443 207576 19798 -46526
16437d6526O5541p4468J38383J19419J11119N92j06819l2976j04396o5931q3823
$$ -46526 19015 -55453 82930 202349 313468 314060 207241 174265 69869 3938 -79885
16426g9885J10600m9110j3564J74948j0480k548P6431j14757j65213K8889J49248
$$ -79885 30715 -18395 -31959 142989 132509 129961 206392 91635 -73578 -44689 104559
16415A04559M4733j02077J5491J22527Q7767j28704j00854p2344o6251j86960
$$ 104559 149292 47215 62706 185233 273000 144296 43442 -28902 -95153 -282113
16405b82113J14949M8528p7478J35387n5916q9688J0768P8269j6268J49802J66727
$$ -282113 -167164 -118636 -196114 -60727 -116643 -206331 -195563 -117294 -133562 16240 182967
16394A82967o5522M9546M2206k55553j05117K5348J07438j61239k9049j4960p6927
$$ 182967 117445 166991 209197 -46356 -151473 -126125 -18687 -179926 -208975 -223935 -300862
16383c00862L2256K15311N3030M6382j01326k88458p9520m7281L6523P3104R0825
$$ -300862 -268606 -53295 -265 46117 -55209 -343667 -423187 -470468 -433945 -360841 -270016
16372b70016J46983J73702J53700J794k63518j08394q6480R261J22521R2527l9243
$$ -270016 -123033 50669 204369 206163 -57355 -165749 -252229 -242968 -120447 -27920 -67163
16361f7163N2768P4678p7099q6098l5808j4270n9059J08585J36374K0523L9473
$$ -67163 -14395 60283 -16816 -102914 -138722 -152992 -212051 -103466 32908 53431 92904
16350I2904O5421j7862j33975Q9817J0931K7313o7895Q6397J87036o9762m868
$$ 92904 158325 140463 6488 96305 107236 134549 66654 153051 340087 270325 265457
16339B65457k95849K8629J38350o7104P9016m90l8045J31353l2760l6110L7475
$$ 265457 -30392 -1763 136587 69483 148499 148009 109964 241317 208557 172447 209922
16328B09922j11794j87479J31064L74460n9220l42507j1808q9514J73118q7159
$$ 209922 98128 -89351 41713 416173 356953 14446 2638 -86876 86242 -917
16318i17o1969o4596N6066j27843k41340o1863J57808L98621P9252k46481M4377
$$ -917 -62886 -127482 -71416 -199259 -440599 -502462 -344654 53967 133219 -113262 -68885
16307f8885M8341K34513j34456j62261j2705M847r3197J2624O8578k6181J02943
$$ -68885 -20544 213969 79513 -82748 -95453 -90606 -183803 -171179 -102601 -128782 -25839
16296b5839k41174l14738l3640Q6228L43397K77251p163m9681O8567J2010j20423
$$ -25839 -267013 -581751 -615391 -529163 -185766 91485 84322 34641 103208 115218 -5205
16285e205M4302N7384l8595k34061J03922q7399j87353j1093P3400L13279O332
$$ -5205 39097 96481 57886 -176175 -72253 -159652 -347005 -358098 -284698 28581 34913
16274C4913p0496N6966J85779N495m2711j42423j60616p6046Q3185k26775k18710
$$ 34913 -35583 21383 207162 212657 169946 27523 -133093 -209139 -125954 -352729 -571439
16263e71439Q3252q1K4744O2502K58586K28767j06287k92786n387K51523P9723
$$ -571439 -488187 -488268 -463524 -401022 -142436 86331 -19956 -312742 -318129 -66606 13117
16252A3117n8772J19785l5508j14074P7478Q647J00943L0830R5093o7834R9425
$$ 13117 -45655 74130 38622 -75452 2026 10673 111616 142446 237539 169705 269130
16241B69130j1614j36540k6526J10105q8714l377m0589q6084J03451J08169N674
$$ 269130 257516 120976 94450 204555 115841 112464 71875 -14209 89242 197411 203085
16230B03085J01375j38884k36033j32544j43245R1727k0820J70181J03726r4351
$$ 203085 304460 165576 -70457 -203001 -346246 -254519 -275339 -105158 -1432 -95783
16220i5783N4729j57530l8485K7519M2099J23866Q6783q8871j69698k49683o5030
$$ -95783 -41054 -198584 -237069 -209550 -167451 -43585 43198 -45673 -215371 -465054 -530084
16209e30084P7388J61180O5343l8282q3919J60165K26252o5588j69675j68143
$$ -530084 -452696 -291516 -226173 -264455 -348374 -188209 38043 -27545 -197220 -365363
16199c65363K19332J39310m806l8918q4602j37304m3881J28485M03446J60304
$$ -365363 -146031 -6721 -11527 -50445 -135047 -272351 -316232 -187747 215699 376003
16189C76003m27733o4451K10611L06530o1800j62523j19805j21703J06002j41097
$$ 376003 -51730 -116181 94430 400960 339160 176637 56832 -64871 41131 -99966
16179i9966j66150j17414j8134N867J68249J37920l4628M3679o7426j70949J11858
$$ -99966 -266116 -383530 -401664 -395797 -227548 -89628 -124256 -80577 -148003 -318952 -207094
16168b07094L97376n0563r6836l2528j49265j20668Q7311J00669J56977O6324
$$ -207094 190282 139719 42883 10355 -138910 -259578 -172267 -71598 85379 151703
16158A51703l7295j47604j71937o2326J86569J03524L6813k5687r0386k6128m5289
$$ 151703 114408 -33196 -205133 -267459 -80890 22634 59447 33760 -56626 -82754 -128043
16147a28043R8502O8572j2214j65031K0069P054P5538m036Q7509R3824J44815
$$ -128043 -29541 39031 26817 -138214 -118145 -111091 -35553 -39589 47920 141744 286559
16136B86559K94745j45707k69042Q1570k04856k32672O9339K32685L1859R2480
$$ 286559 581304 435597 166555 248125 43269 -189403 -120064 112621 144480 236960
16126B36960J07384J04337K7134k633k61912j37226m288j03334l22098M4675O0435
$$ 236960 344344 448681 475815 473182 211270 74044 69756 -33578 -355676 -311001 -250566
16115b50566%J66737J24724J20186j7548j33284p6203j58806J09924J21032O9664
$$ -250566 -250566 -83829 40895 161081 143533 10249 -65954 -224760 -114836 6196 75860
16104G5860m4916M5209o3589j2683j34362j16473N6942K04550j42682j10831J45692
$$ 75860 30944 76153 12564 -119 -134481 -250954 -194012 10538 -132144 -242975 -97283
16093i7283J04700J0970k40828j73108J32122L4851j53134q1463J50767K86701
$$ -97283 7417 18387 -222441 -395549 -263427 -228576 -381710 -463173 -312406 -25705
16083b5705j20470n4619K10229K98558k1651l72288j62198M4492j22567j5973
$$ -25705 -146175 -200794 9435 307993 286342 -85946 -248144 -203652 -326219 -342192
16073c42192j22671Q9724N5538p0484J75643J08648p9406J27939M1815j35742
$$ -342192 -464863 -375139 -319601 -390085 -214442 -105794 -185200 -57261 -15446 -151188
16063a51188R8145J60637J35389J07206r4715k03262j77491r2667J60629R9249
$$ -151188 -53043 107594 242983 350189 255474 52212 -125279 -217946 -57317 41932
16053D1932J59525j21975l0415J7578k8210q9227J49654n3350j24149j16400P3979
$$ 41932 201457 79482 49067 66645 38435 -50792 98862 45512 -78637 -195037 -121058
16042a21058m5715j07611J23424k030q1630J18392K30080k38611j13055P7385
$$ -121058 -166773 -274384 -150960 -152990 -234620 -116228 113852 -124759 -237814 -160429
16032a60429j4596k2078R1588O7478p7390j55982L3782N2062J1910k0462j55509
$$ -160429 -175025 -197103 -105515 -38037 -115427 -271409 -237627 -185565 -173655 -194117 -349626
16021c49626K0177J58372K7670L4561o303N7077m5389J61987K2277j75811O4333
$$ -349626 -329449 -171077 -143407 -108846 -115149 -58072 -103461 58526 80803 -95008 -30675
16010c0675j62565J3760J70094m567k23974J47233Q3129m3897o840m5870P4174
$$ -30675 -193240 -179480 -9386 -13953 -237927 -90694 -7565 -51462 -58302 -104172 -29998
15999b9998O5599n6284L5291J09523k2519k92137k6381K05973J63285l7400P9413
$$ -29998 35601 -20683 14608 124131 101612 -190525 -216906 -10933 152352 114952 194365
15988A94365j3731j68929Q9575J68952L4189j04201p6709p9384J60889q3480k50679
$$ 194365 180634 11705 101280 270232 304421 200220 123511 44127 205016 121536 -129143
15977a29143j42461R9951j10465L1560K20804J78863j74300P2096J70998K6501
$$ -129143 -271604 -171653 -282118 -250558 -29754 149109 -25191 46905 217903 244404
15967B44404k01118M2737j02863j1734n8804m1361O5692M0071Q058J09789j67940
$$ 244404 43286 86023 -16840 -28574 -87378 -128739 -63047 -22976 -14918 94871 -73069
15956g3069j63739J69336O3589l3265N5392P6448k32639j46755m8529J16899q6055
$$ -73069 -236808 -67472 -3883 -37148 18244 94692 -137947 -284702 -333231 -216332 -302387
15945c02387J83350P2922j64548j03664o1269q1163R3562K49359o9736j7133j2479
$$ -302387 -119037 -46115 -210663 -314327 -375596 -456759 -363197 -113838 -183574 -200707 -213186
15934b13186R3278n8463j00399J17867L3603K4602J6831m9116J19626j59409j04790
$$ -213186 -119908 -178371 -278770 -160903 -127300 -102698 -85867 -134983 -15357 -174766 -279556
15923b79556P9530M2842N8414k6061J91698J13104o8425J8347P855L7988j72459
$$ -279556 -200026 -157184 -98770 -124831 66867 179971 111546 129893 137748 175736 3277
15912C277j63579j68244K80933J08527P8593o0471q2307k04694N377o3034K27032
$$ 3277 -160302 -328546 -47613 60914 139507 79036 -3271 -207965 -202588 -265622 -38590
15901c8590K03104k40863l5867K689J91203J40891r2491j51206L0197L5614M376
$$ -38590 164514 -76349 -112216 -109527 81676 222567 130076 -21130 9067 44681 49057
15890D9057R6271j42844m7080r277j6988j8494q6119N53J28233J16177q9836j82826
$$ 49057 145328 2484 -44596 -53873 -70861 -89355 -175474 -174921 -46688 69489 -20347 -203173
15878b03173m9700P0918K64060P1100k75643j94384L8764m4505J61068K17662
$$ -203173 -252873 -181955 82105 153205 -122438 -316822 -278058 -322563 -161495 56167
15868E6167Q6985k7165P4406M8475p3227o4082k19291k15961r1470J08848P7300
$$ 56167 143152 115987 190393 238868 165641 101559 -117732 -333693 -425163 -316315 -239015
15857b39015q273k02274J06608o4763K89237J75809j13789m2684P8444j25754
$$ -239015 -247288 -449562 -342954 -407717 -118480 57329 -56460 -99144 -20700 -146454
15847a46454P652J13455J54103r4851j84084k10074l14165L8713J91431N0500
$$ -146454 -138802 -25347 128756 33905 -150179 -360253 -674418 -635705 -444274 -393774
15837c93774O3477M8880J5806r3302J78682K76439k960k13867j40552L4543K18814
$$ -393774 -330297 -281417 -265611 -358913 -180231 96208 93248 -120619 -261171 -226628 -7814
15826g814K18759J60555k52476l12634O004K0742j8683R7131J33245L5794j74104
$$ -7814 210945 371500 119024 -193610 -187606 -166864 -185547 -88416 44829 80623 -93481
15815i3481M0120o2942k5909j65199m526K27201L07327M1276K5866P422J46505
$$ -93481 -53361 -116303 -142212 -307411 -311937 -84736 222591 263867 289733 297155 443660
15804D43660J1798p2317q6837k36079j8612N408M4061J17183m8245j51234o3762
$$ 443660 455458 383141 296304 60225 41613 47021 91082 208265 160020 8786 -54976
15793e4976k26177n0912k8212j11196k6338R9618K65025J88469j37413N531j40497
$$ -54976 -281153 -332065 -360277 -471473 -497811 -398193 -133168 55301 -82112 -76581 -217078
15782b17078j18556J5079R0737J17987L785j01369R2528p3103R1748P7869j46044
$$ -217078 -335634 -320555 -229818 -111831 -108046 -209415 -116887 -189990 -98242 -20373 -166417
15771a66417j86424R9094L4757K27704K52922j89876j42198J81738L7187R0336
$$ -166417 -352841 -253747 -218990 8714 261636 71760 -70438 111300 148487 238823
15761B38823M7397M9605k9868k0902q8807K9114j5893j39282M1313m5201j55333
$$ 238823 286220 335825 305957 285055 196248 225362 209469 70187 111500 66299 -89034
15750h9034k23026J41757J35551K20910P5205o4536q7246l1621k56011m1144Q6334
$$ -89034 -312060 -170303 -34752 186158 261363 196827 109581 77960 -178051 -219195 -132861
15739a32861n3244l9514l8339M3310K20726K57467K6971j08926M2753J30241J8981
$$ -132861 -186105 -225619 -263958 -220648 78 257545 284516 175590 218343 348584 367565
15728C67565j45634N6462J42849j98262R677O1526n8597k2123o0493J05362J57733
$$ 367565 221931 278393 421242 222980 232657 294183 235586 213463 152970 258332 416065
15717D16065O3549J76926J76579p8187o1997l6073N4554j92484o3395k9119P7201
$$ 416065 479614 656540 833119 754932 692935 656862 711416 518932 455537 426418 503619
15706E03619M0273m5723j33320J50457m8538O6123L35507J20944j54857m47040
$$ 503619 543892 498169 364849 515306 466768 532891 868398 989342 834485 387445
15696C87445K3685J35327j18256J17847O9862j47474m4477J68587o4541p4937
$$ 387445 411130 546457 428201 546048 615910 468436 423959 592546 528005 453068
15686D53068N0979L2909j74791M1643J41147j63589j16195J4333p9031l6848k08456
$$ 453068 504047 536956 362165 403808 544955 381366 265171 279504 200473 163625 -44831
15675d4831J97189J41759J38797j82704r0851l3524J64737K61091m2328k33495
$$ -44831 152358 294117 432914 250210 159359 125835 290572 551663 509335 275840
15665B75840j61754j70425O9058r0523P2642l4076m1873N7573J39136J6552j74285
$$ 275840 114086 -56339 12719 -77804 -5162 -39238 -81111 -23538 115598 132150 -42135
15654d2135j76148p6559P3952l9292j9022P7593K5164R2249L1644O9124J26506
$$ -42135 -218283 -294842 -220890 -260182 -279204 -201611 -176447 -84198 -52554 16570 143076
15643A43076j53143k02775K02316J99072J49016k45494l4328Q2988n7489L4592
$$ 143076 -10067 -212842 -10526 188546 337562 92068 57740 140728 83239 117831
15633A17831m6059j59225l8415J39771J35175l6688j71575j2683J59856J76067
$$ 117831 71772 -87453 -125868 13903 149078 112390 -59185 -71868 87988 264055
15623B64055J76462O6713j03116l01576n2309J25105J42917l2784j85449k85673
$$ 264055 440517 507230 404114 102538 50229 175334 318251 285467 100018 -185655
15613a85655m0142K23636J14035J60709l9526L7448J50506Q764j38127j96902
$$ -185655 -225797 -2161 111874 272583 233057 270505 421011 429775 291648 94746
15603I4746J5472O2748j47103p5368J07703k38354R5679N6392K15157o0367r911
$$ 94746 110218 172966 25863 -49505 58198 -180156 -84477 -28085 187072 126705 116794
15592A16794r869q9579j53586k5989j06971J46987J09282J3819o4114p2482o6381
$$ 116794 106925 17346 -136240 -162229 -269200 -122213 -12931 888 -63226 -135708 -202089
15581b02089q5651K3252R3365Q7274j09003M1340L7278L3689k09841o3348J66939
$$ -202089 -287740 -264488 -171123 -83849 -192852 -151512 -114234 -80545 -290386 -353734 -186795
15570a86795P6551J3844K02607l1761o3484r5752J14029J85091j67419o8764q4007
$$ -186795 -110244 -96400 106207 74446 10962 -84790 29239 214330 46911 -21853 -105860
15559a05860j95806j57921J02228K86177R6539n6032j9691K43719L19367k5760
$$ -105860 -301666 -459587 -357359 -71182 25357 -30675 -50366 193353 512720 486960
15549D86960l34313j79814N4525M1001k15757r2289R7565K15012O8708r4041k84107
$$ 486960 152647 -27167 27358 68359 -147398 -239687 -142122 72890 141598 47557 -236550
15538b36550m5737J72933J84068k05383m8447K210P9236j02981O1657J39826k7650
$$ -236550 -282287 -109354 74714 -130669 -179116 -176906 -97670 -200651 -138994 832 -26818
15527b6818P3778j47945J8659j23254j86227j58392J04446J36850O0680L6120
$$ -26818 46960 -100985 -82326 -205580 -391807 -550199 -445753 -308903 -248223 -212103
15517b12103j16267Q5294L2597L3333j56302r7343m1917L1173J90850J33814k07829
$$ -212103 -328370 -243076 -210479 -177146 -333448 -430791 -472708 -441535 -250685 -116871 -324700
15506c24700j58435O7211J97933M5514j28451J8546J49074O1211j54820J1357
$$ -324700 -483135 -415924 -217991 -172477 -300928 -282382 -133308 -72097 -226917 -215560
15496b15560K43984k0524j17403J66837j00404j01048m670o0155Q3125j48119
$$ -215560 28424 7900 -109503 57334 -43070 -144118 -148788 -208943 -125818 -273937
15486b73937K02837K65098R0258K1q2076r7766p6143M0953j66562j21476R7448
$$ -273937 -71100 193998 284256 284277 202201 104435 28292 69245 -97317 -218793 -121345
15475a21345M5582L5815j06049M7417J4495o2412o1096J94667J10079m875j7590
$$ -121345 -75763 -39948 -145997 -98580 -84085 -146497 -207593 -12926 97153 92278 74688
15464G4688k17022L9372N3227l9279j4979K3551J68420J11017j58410k64720k12562
$$ 74688 -142334 -102962 -49735 -89014 -103993 -80442 87978 198995 40585 -224135 -436697
15453d36697J54240K06990o4249j25930l0369J00897J2600k55096K49413R2187
$$ -436697 -282457 -75467 -139716 -265646 -296015 -195118 -182518 -437614 -188201 -96014
15443i6014M4848J96954j73566j52506P5551J73533n8211j80717j78122j8248
$$ -96014 -51166 145788 -27778 -180284 -104733 68800 10589 -170128 -348250 -366498
15433c66498J38036J7066n2569P2345j61561l45716k8483L36428M33181P8469
$$ -366498 -228462 -211396 -263965 -191620 -353181 -698897 -727380 -390952 42229 120698
15423A20698j88208L379J73126K46409P6870j43197k24906k56131k21412K09977
$$ 120698 -67510 -64131 108995 355404 432274 289077 64171 -191960 -413372 -203395
15413b03395O3623J33149L9667L9074m6859j344j08782P6444p9157k1257J31533
$$ -203395 -139772 -6623 33044 72118 25259 23915 -84867 -8423 -87580 -108837 22696
15402B2696o4012M278k32035N9370J75943j76o5306k05924p8592m8388K37324
$$ 22696 -41316 -37038 -269073 -209703 -33760 -33936 -99242 -305166 -383758 -432146 -194822
15391a94822K40800J87605o474j10956j77184p2276j64298R2888K81930p4998
$$ -194822 45978 233583 227109 116153 -61031 -133307 -297605 -204717 77213 2215
15381B215k96322J57510J58316j459j12881p0094o5094m8349Q6414P2709j02692
$$ 2215 -294107 -136597 21719 20260 -92621 -162715 -227809 -276158 -189744 -117035 -219727
15370b19727q4764j09936j62384j40595N9197L58975K69556m1385k6660O3264
$$ -219727 -304491 -414427 -576811 -717406 -658209 -299234 -29678 -71063 -97723 -34459
15360c4459j80871m7194K2155O5157O8824J09784Q8970p7180J90263J54993J9120
$$ -34459 -215330 -262524 -240369 -175212 -106388 3396 92366 15186 205449 360442 379562
15349C79562j98675m4510M1166K5942J21649p7446j57258o0835p1298k7478m582
$$ 379562 180887 136377 177543 203485 325134 247688 90430 29595 -41703 -69181 -73763
15338g3763J24678P225j03357k4593O5795J45063k36970j47363O8918R4908j20301
$$ -73763 50915 58140 -45217 -69810 -4015 141048 -95922 -243285 -174367 -79459 -199760
15327a99760j525J47696K15669N7294p8827n5165n2698o2895Q689J23227j37207
$$ -199760 -201285 -53589 162080 219374 140547 85382 32684 -30211 -21522 101705 -35502
15316c5502j03241p3908J33474m8015j74725j0263j23939j15138O7808K07247
$$ -35502 -138743 -212651 -79177 -127192 -301917 -312180 -436119 -551257 -483449 -276202
15306b76202J18163n9220Q9173J67228p4738k8653N4212P2763r1056j23122P520
$$ -276202 -158039 -217259 -128086 39142 -35596 -64249 -10037 62726 -28330 -151452 -143932
15295a43932M1114P8964J30715k51344j82144r5680K62365J97489N1940J0884
$$ -143932 -102818 -23854 106861 -144483 -326627 -422307 -159942 37547 89487 100371
15285A00371j65170r57q8933K2178J15536j25089J53181K12104J05024M5619N9640
$$ 100371 -64799 -65756 -154689 -132511 -16975 -142064 11117 223221 328245 373864 433504
15274D33504j58008l44827j70669J22930l3955k22809j19223J0851K59852J87932
$$ 433504 275496 -69331 -240000 -117070 -151025 -373834 -493057 -482206 -222354 -34422
15264c4422P8748k2851J6443L5085r9239J65862k6516l0587j05555o4670k0578
$$ -34422 44326 21475 37918 73003 -26236 139626 113110 82523 -23032 -87702 -108280
15253a08280j29770J02666L9698k2377L7551N8323P6799J8228k1679m5691j76401
$$ -108280 -238050 -135384 -95686 -118063 -80512 -22189 54610 72838 51159 5468 -170933
15242a70933o9840J02519J50358Q4072M9976P456J9936j4020q9306k73331j13090
$$ -170933 -240773 -138254 12104 96176 146152 153608 173544 159524 70218 -203113 -316203
15231c16203J19374R0003K10726N1228n8529j6074l6278m33l4157k03363J08231
$$ -316203 -196829 -106826 103900 155128 96599 80525 44247 43814 9657 -193706 -85475
15220h5475J22075r2446j49842j3843K1174J21210J50263J01493m4746j32703
$$ -85475 36600 -55846 -205688 -219531 -198357 -77147 73116 174609 129863 -2840
15210b840l6568j1826l0706J05613R289j68456L1088l3156p466j43791j97644
$$ -2840 -39408 -51234 -81940 23673 32962 -135494 -104406 -137562 -145028 -288819 -486463
15199d86463K80741J86564J472j8069j03352N111k8184j75337L2436J02311M2903
$$ -486463 -205722 -19158 -17686 -35755 -139107 -133996 -162180 -337517 -305081 -202770 -159867
15188a59867r874j62686J85673J52928L1118J09879O0521m1775O970K07391L2829
$$ -159867 -169741 -332427 -146754 6174 37292 147171 207692 165917 172887 380278 413107
15177D13107j32552L2535j31533k00838K17456J5253k76566j02129j15478k6623
$$ 413107 280555 313090 181557 -19281 198175 213428 -63138 -165267 -280745 -307368
15167c07368k18283k10955K21412K82362J00370J5177J13291n6401k72714R430
$$ -307368 -525651 -736606 -515194 -232832 -132462 -117285 -3994 -60395 -333109 -323679
15157c23679Q7713J50955J9045K5159j52734J8857K2244m5030j60142m9008N2465
$$ -323679 -235966 -85011 -65966 -40807 -193541 -174684 -152440 -197470 -357612 -406620 -354155
15146c54155J62030r7703k1155p365R8954k8259J22531n9081j24432J11684P0987
$$ -354155 -192125 -289828 -310983 -318348 -219394 -247653 -125122 -184203 -308635 -196951 -125964
15135a25964R483j35809o4504k33035j99011L61673J09037j02203p2549N9966
$$ -125964 -116481 -252290 -316794 -549829 -748840 -387167 -278130 -380333 -452882 -392916
15125c92916J20839j11991k7901N2494J02539p130J36236j42505o3580K24275
$$ -392916 -272077 -384068 -411969 -359475 -256936 -264066 -127830 -270335 -333915 -109640
15115a09640k4658J1804m9760J820Q9519J8620O4324o0717Q5261O1894j0411K01308
$$ -109640 -134298 -122494 -172254 -170434 -80915 -62295 2029 -58688 26573 88467 78056 279364
15103B79364n2727q2760J629N0387j28593j08662m4434o0204J8628q760j37325
$$ 279364 226637 143877 145506 195893 67300 -41362 -85796 -146000 -127372 -136132 -273457
15092b73457k11718k1151L43080K34830K6474j21422o2360k04325j15169R7931
$$ -273457 -485175 -506326 -163246 71584 98058 -23364 -85724 -290049 -405218 -307287
15082c07287j3688L3871J73192N0541j96120J160K00429L23619l10882l50724
$$ -307287 -320975 -287104 -113912 -63371 -259491 -258331 -57902 265717 -45165 -395889
15072c95889Q1611J22131J50848M0276l0923j30890J82266J05810k07517m3761
$$ -395889 -314278 -192147 -41299 -1023 -31946 -162836 19430 125240 -82277 -126038
15062a26038L0414q542p8680l4623J90710Q9484j86333j15723J51763j29696j20410
$$ -126038 -95624 -104166 -182846 -217469 -26759 62725 -123608 -239331 -87568 -217264 -337674
15051c37674L5611J17644Q8987N2155k22980p659m7874J23401J84459R4660J0170
$$ -337674 -302063 -184419 -95432 -43277 -266257 -273916 -321790 -198389 -13930 80730 90900
15040I0900j59870r9904j62776l393J9661j59023l7010J62352J94427J22469l0694
$$ 90900 -68970 -168874 -331650 -335043 -315382 -474405 -511415 -349063 -154636 -32167 -62861
15029f2861n4893n2148O9334L9363L0959j32862r0730J01974L4025M4460K68266
$$ -62861 -117754 -169902 -100568 -61205 -30246 -163108 -253838 -151864 -117839 -73379 194887
15018A94887o1603k04991l6887J58709J00080r7571j1822K8478j02171k38618
$$ 194887 133284 -71707 -108594 50115 150195 52624 40802 69280 -32891 -271509
15008b71509j3999N9684M6186J89387N7314J3239p6020j07454K07276J09526j17846
$$ -271509 -285508 -225824 -179638 9749 67063 80302 4282 -103172 104104 213630 95784
14997I5784n4063j7402p9375o0678J46048j71222k39169K1034Q5925J65877J68847
$$ 95784 41721 24319 -55056 -115734 30314 -140908 -380077 -359043 -273118 -107241 61606
14986F1606j24974K3598L56139j75375j37560L3462J5829l8765R7455J53575J31208
$$ 61606 -63368 -39770 316369 140994 3434 36896 52725 13960 111415 264990 396198
14975C96198n4379k25660l5820j38613L9451J81179N2356j57994j65189r3089
$$ 396198 341819 116159 80339 -58274 -18823 162356 214712 56718 -108471 -201560
14965b01560o0720l0970J91842J74116P7057J4557k45260j41322r0113J49516
$$ -201560 -262280 -293250 -101408 72708 149765 164322 -80938 -222260 -312373 -162857
14955a62857N1781j16765J18214L77450q9906k93506j75988L199Q5432j46857
$$ -162857 -111076 -227841 -109627 267823 177917 -115589 -291577 -288378 -202946 -349803
14945c49803j16514M3012K08643L29136j91830j78224m865K70845Q4377j74717
$$ -349803 -466317 -423305 -214662 114474 -77356 -255580 -260445 10400 94777 -79940
14935g9940o5762k4769k208Q5491l6315J28612K30085k0221p4461k8762N2523
$$ -79940 -145702 -170471 -172679 -87188 -123503 5109 235194 214973 140512 111750 164273
14924A64273p738l9851k9814R0384J8380j85201k6188j20262l5577n8989P8120
$$ 164273 156535 116684 86870 177254 195634 10433 -15755 -136017 -171594 -230583 -152463
14913a52463l9289q6514L0883J27190J86780N0061l34321J04506L52196J0818
$$ -152463 -191752 -278266 -247383 -120193 66587 116648 -217673 -113167 239029 249847
14903B49847J27101j31734j15497k09749k16096R8526J23588N4636r7401j07635
$$ 249847 376948 245214 129717 -80032 -296128 -197602 -74014 -19378 -116779 -224414
14893b24414k00808N669K02940J84640r8248j26357k00614K09296K98440K21554
$$ -224414 -425222 -419553 -216613 -31973 -130221 -256578 -457192 -247896 50544 272098
14883B72098Q385p8942n871j46058J22770m2154L8885N527j80135n6539K2545
$$ 272098 280483 201541 195670 49612 172382 130228 169113 174640 -5495 -62034 -39489
14872c9489J72701K79458L3911j21517k48968N1463l4132K9347q7478j21938J18941
$$ -39489 133212 412670 446581 325064 76096 127559 93427 122774 35296 -86642 32299
14861C2299Q84j51782j27606q2049q5767J34453M2064j8124J96780n1810J49093
$$ 32299 33183 -118599 -246205 -328254 -414021 -279568 -237504 -255628 -58848 -110658 38435
14850C8435P6637p9518k33451N8747Q9417j39621K3823j46203P8805J10022N4710
$$ 38435 115072 35554 -197897 -139150 -49733 -189354 -165531 -311734 -232929 -122907 -68197
14839f8197m9169j09798J5686J99765J02541J5823j48488q4930j943p6481j09815
$$ -68197 -117366 -227164 -211478 -11713 90828 106651 -41837 -126767 -128710 -205191 -315006
14828c15006J3076K10207J35375p0690m3150k36689K0030J03223j08206j16605
$$ -315006 -301930 -91723 43652 -27038 -70188 -306877 -286847 -183624 -291830 -408435
14818d08435K8831J67445R9394j64429k10665O9239L00947p7171L2522R0587L3303
$$ -408435 -379604 -212159 -112765 -277194 -487859 -418620 -117673 -194844 -162322 -71735 -38432
14807c8432P2640j05p8368j3529O2377p0146J08099J92294J3727j13571n6227
$$ -38432 34208 34103 -44265 -57794 4583 -65563 42536 234830 248557 134986 78759
14796G8759j04706J8036K85502O6389j02083J09277k42195k59177Q9181l08345
$$ 78759 -25947 -7911 277591 343980 241897 351174 108979 -150198 -61017 -369362
14786c69362n6187J25697K67515R0966L3080j13866k78668o4919K15655m0065
$$ -369362 -425549 -299852 -32337 58629 91709 -22157 -300825 -365744 -150089 -190154
14776a90154l6666m5640j31393J16886r617J63128M7193n1234q2770J3806R5433
$$ -190154 -226820 -272460 -403853 -286967 -296584 -133456 -86263 -137497 -220267 -206461 -111028
14765a11028P0446j62029l3713m3049M509J67765J10762P224j17357P7496K6099
$$ -111028 -40582 -202611 -236324 -279373 -274864 -107099 3663 10887 -106470 -28974 -2875
14754b875k6799n8141j15569J44984k04407j07969J93063O0954O5638O9825m1897
$$ -2875 -29674 -87815 -203384 -58400 -262807 -370776 -177713 -116759 -51121 18704 -23193
14743b3193o6892j21479Q799q3087R5842J66396K16908J86146j18890j42253j16862
$$ -23193 -90085 -211564 -202765 -285852 -190010 -23614 193294 379440 260550 118297 1435
14732A435J402M1133p615o4813Q4348J11889q5440k20726j80789j74381j1725
$$ 1435 2837 43970 36355 -28458 55890 167779 82339 -138387 -319176 -493557 -505282
14721e05282N3717K5444Q6255J64446M8372m6607R0138j42758l9271K85096J49527
$$ -505282 -451565 -426121 -339866 -175420 -127048 -173655 -83517 -226275 -265546 19550 169077
14710A69077k073m776j09777J05753R5464N320o8167k9993k29770j19753j7806
$$ 169077 167004 162228 52451 158204 253668 258988 190821 160828 -68942 -188695 -206501
14699b06501r8509j25092J01553K96261K79154J02329J62362j61563j66206J09334
$$ -206501 -305010 -430102 -328549 -32288 246866 349195 511557 349994 183788 293122
14689B93122n9081j15202P849k05589r0475o1715j72529M4031P0964l6819J54363
$$ 293122 234041 118839 126688 -78901 -169376 -231091 -403620 -359589 -288625 -325444 -171081
14678a71081O279L9372J71651J37308o0973k82268o2105P1947K9359N4192q5678
$$ -171081 -164802 -125430 46221 183529 122556 -159712 -221817 -149870 -120511 -66319 -151997
14667a51997j50036Q1384k3677m4056M2404K10272P2136R311m6826L5587R0349
$$ -151997 -302033 -220649 -244326 -288382 -245978 -35706 36430 45741 -1085 34502 124851
14656A24851j51896J07737K94287J7264m514m9796k71285j38389Q2029o7949l7549
$$ 124851 -27045 80692 374979 392243 387729 337933 66648 -71741 10288 -57661 -95210
14645i5210j25269O6251J90198J54502R247k4232j69571J44451K00183k14731
$$ -95210 -220479 -154228 35970 190472 199719 175487 5916 150367 350550 135819
14635A35819k09538q2942M2404n7610Q117R0867K7931m6280p4964n6261K37729
$$ 135819 -73719 -156661 -114257 -171867 -163750 -72883 -44952 -91232 -166196 -222457 15272
14624A5272J44511J82429j84849O5530N2890n5431p7982o0645m9860k5745Q0435
$$ 15272 159783 342212 157363 222893 275783 220352 142370 81725 31865 6120 86555
14613H6555j8081J65761k2656n0521M2465J78368P3594q5350j13717o1845p8091
$$ 86555 68474 234235 211579 161058 203523 381891 455485 370135 256418 194573 116482
14602A16482n9206o66R1445K5834j8552j4281n2371J22423n5079n9358l0929L12249
$$ 116482 57276 56610 148055 173889 155337 141056 88685 211108 156029 96671 65742 377991
14590C77991J39732j37171j9176j39868o3449J92651q3156k7512J01924l5566
$$ 377991 517723 380552 361376 221508 158059 350710 267554 240042 341966 306400
14580C06400Q7956J21386j09479j29443J52943Q1715o7608j52541q5778K50416
$$ 306400 394356 515742 406263 276820 429763 511478 443870 291329 205551 455967
14570D55967j79842p1922R860j91187O0191K05865J71880r0537p174J49216Q8519
$$ 455967 276125 204203 214063 22876 83067 288932 460812 370275 363101 512317 600836
14559F00836R2985N019l13749k84786k96885j5008K55199K46400J09772R0259
$$ 600836 693821 698840 385091 100305 -196580 -211588 43611 290011 399783 490042
14549D90042j08882J41336K6790J02008j76562k8870N7333N3039j17473j21733
$$ 490042 381160 522496 549286 651294 474732 445862 503195 556234 438761 317028
14539C17028J26359K03441l1739j09366k07051j47040J8633k17147K10798J19423
$$ 317028 443387 646828 615089 505723 298672 151632 170265 -46882 163916 283339
14529B83339J65640n403Q2268J38620o8686k74520L1550J78480J00471o4284j0574
$$ 283339 448979 443576 525844 664464 595778 321258 352808 531288 631759 567475 556901
14518E56901P3831j19151r0051J24572J67278P2274j04278j24071r7273j51193
$$ 556901 630732 511581 421530 546102 713380 785654 681376 557305 460032 308839
14508C08839j29048L1465L81198J01496k0693j39451p5357K17048K58183r0701
$$ 308839 179791 211256 592454 693950 673257 533806 458449 675497 933680 842979
14498H42979j82673P1833J52213j59661j51608j22157K16932L5836j07330R0976
$$ 842979 660306 732139 884352 724691 573083 450926 667858 703694 596364 687340
14488F87340J53703j14r776K61560j0538k14457l8643Q426K33445K07584j10608
$$ 687340 841043 840929 831153 1092713 1082175 867718 829075 837501 1070946 1278530 1167922
14477A167922j22968l65746j86855k3182J59643L29207J54426j71584j9931J40185
$$ 1167922 1044954 679208 492353 469171 628814 958021 1112447 940863 920932 1061117
14467A061117J04189J0962N0960j10876J1860j8296m7945m7571n3680K66157M2323
$$ 1061117 1165306 1176268 1227228 1116352 1128212 1109916 1061971 1014400 960720 1226877 1269200
14456A269200j35206K29007K3983j29659r5104R256J9136j37573O9548N4692K62611
$$ 1269200 1133994 1363001 1386984 1257325 1162221 1171477 1190613 1053040 1122588 1177280 1439891
14445A439891J28726j20677j25318m5254J99238J59438n216p2270P4837M2520
$$ 1439891 1568617 1447940 1322622 1277368 1476606 1636044 1630828 1558558 1633395 1675915
14435A675915J67592M8048r6467J06697M1435k63843j54861Q0005K2519J45093
$$ 1675915 1843507 1891555 1795088 1901785 1943220 1679377 1524516 1604521 1627040 1772133
14425A772133j404n1496K62561J13735j31560L08612J39336P3038j25364R8958
$$ 1772133 1770729 1719233 1981794 2095529 1963969 2272581 2411917 2484955 2359591 2458549
14415B458549r4645J00114n7767m3126j15122N1771L38023K11657j0597l0214
$$ 2458549 2363904 2464018 2406251 2363125 2248003 2299774 2637797 2849454 2838857 2808643
14405B808643j94959k33099K75758K58779R7302K83640N1876N3285P1184J02673
$$ 2808643 2613684 2380585 2656343 2915122 3012424 3296064 3347940 3401225 3472409 3575082
14395C575082J54377J36574J4836J4700L2603K71790K24425k2024J05751K33945
$$ 3575082 3729459 3866033 3880869 3895569 3928172 4199962 4424387 4402363 4508114 4742059
14385D742059j58068k9153J01100O2302J43251J56764n6485l6681J01244K05871
$$ 4742059 4583991 4554838 4655938 4718240 4861491 5018255 4961770 4925089 5026333 5232204
14375E232204N5969J65343K45819L2048K43251K94956J19364j9989m3837p0125
$$ 5232204 5288173 5453516 5699335 5731383 5974634 6269590 6388954 6368965 6325128 6255003
14365F255003n5413J98567L44885M10119M36210J80965j58674J64155K80212K54248
$$ 6255003 6199590 6398157 6743042 7153161 7589371 7770336 7611662 7775817 8056029 8310277
14355H310277J77271K24918J61610J1899K65195N75606N96290L60850J93236K04473
$$ 8310277 8487548 8712466 8874076 8885975 9151170 9726776 10323066 10683916 10877152 11081625
14345A1081625J85819L61756L68756K07811K03615K79555K43017K12889L65025
$$ 11081625 11267444 11629200 11997956 12205767 12409382 12688937 12931954 13144843 13509868
14336A3509868L60874M48773N68258L87079L82583K92197L73991K52706J42446
$$ 13509868 13870742 14319515 14887773 15274852 15657435 15949632 16323623 16576329 16718775
14327A6718775R5541L28073M86834L34964J60152L65678O35680M30273J79048
$$ 16718775 16814316 17142389 17629223 17964187 18124339 18490017 19125697 19555970 19735018
14318A9735018N8281k4314K43877m3646j58185K41946L48344L79330J40796L13834
$$ 19735018 19793299 19768985 20012862 19969216 19811031 20052977 20401321 20780651 20921447 21235281
14308B1235281M8048k23993j36680P5414L4357P7129j08998J05847n1068k49547
$$ 21235281 21283329 21059336 20922656 20998070 21032427 21109556 21000558 21106405 21055337 20805790
14298B0805790j26633m06690k07551k15003k19274l03883K2104j39267j71474
$$ 20805790 20679157 20272467 20064916 19849913 19630639 19326756 19348860 19209593 19038119
14289A9038119k62519k19692j9107q7398l00052l97715n68482n28366k27618k34230
$$ 19038119 18775600 18555908 18536801 18449403 18149351 17751636 17183154 16654788 16427170 16192940
14279A6192940l67161l85230j72392m47522k0754L6945k93573k45486m24480m41860
$$ 16192940 15825779 15440549 15268157 14820635 14799881 14836826 14543253 14297767 13873287 13431427
14269A3431427l23270k72845m10452l77746j06713j026j98801n40359l54262L8657
$$ 13431427 13108157 12835312 12424860 12047114 11940401 11939375 11740574 11200215 10845953 10884610
14259A0884610j56794l51608k57108j85701l37024m75520l85033j53499k16250
$$ 10884610 10727816 10376208 10119100 9933399 9596375 9120855 8735822 8582323 8366073
14250H366073k4615k01879j75755k51337l46385j09k400j55272l02012k20844
$$ 8366073 8341458 8139579 7963824 7712487 7366102 7365993 7363593 7208321 6906309 6685465
14240F685465l6966j52968m7053l5305j41952J9941j14452m37592r3570J5497
$$ 6685465 6648499 6495531 6448478 6413173 6271221 6291162 6176710 5739118 5645548 5661045
14230E661045k12083Q0403j05539k01704k3368j82054k21281j90121P697j29430
$$ 5661045 5448962 5529365 5423826 5222122 5198754 5016700 4795419 4605298 4612995 4483565
14220D483565k99095Q1541j56154P0547R320o4937k0541j14033m6844Q078Q0255
$$ 4483565 4184470 4266011 4109857 4180404 4189724 4124787 4104246 3990213 3943369 3951447 4031702
14209D031702j41219j77403n1465k08338j13639j6678N5157k8396j20520J13010
$$ 4031702 3890483 3713080 3661615 3453277 3339638 3322960 3378117 3349721 3229201 3342211
14199C342211j08075k8635m3353j6160R1060l0748k36330j24824m2257j09632
$$ 3342211 3234136 3205501 3162148 3145988 3237048 3206300 2969970 2845146 2802889 2693257
14189B693257k9102o7258K35149J64012r0662k46561j38195l7784j02608n5865
$$ 2693257 2664155 2596897 2832046 2996058 2905396 2658835 2520640 2482856 2380248 2324383
14179B324383M0571R1790r8796M9280l538j90861l2840Q1501J99141m8583k21324
$$ 2324383 2364954 2456744 2357948 2407228 2403690 2212829 2179989 2261490 2460631 2412048 2190724
14168B190724k38135r8717J54795o4006j17062R6422K52922o174j26481j12030
$$ 2190724 1952589 1853872 2008667 1944661 1827599 1924021 2176943 2170769 2044288 1932258
14158A932258k55013k11869o2633J80249J33819J85052k62923j10992n1298J43602
$$ 1932258 1677245 1465376 1402743 1582992 1716811 1901863 1638940 1527948 1476650 1620252
14148A620252J0542k90784O765n945l4714j06297J4260J04485J54104j63096k452
$$ 1620252 1630794 1340010 1346775 1340830 1306116 1199819 1214079 1318564 1472668 1309572 1307120
14137A307120k1288k0204J40737N1733j17498l7594l1984k45619Q3929K31652
$$ 1307120 1285832 1265628 1406365 1458098 1340600 1303006 1271022 1025403 1109332 1340984
14127A340984l731J61738J5643q9573q9964n3315n8999K5952K4685n9009j17166
$$ 1340984 1337253 1498991 1514634 1425061 1335097 1281782 1222783 1248735 1273420 1214411 1097245
14116A097245j52214j4898K9956L2261p3488K33985P5791m8885o9470o8386j4661
$$ 1097245 945031 930133 960089 992350 918862 1152847 1228638 1179753 1110283 1041897 1027236
14105A027236M087o7927r7571P8272J99244j75189j01217q1788p4398r9917r1251
$$ 1027236 1031323 963396 865825 944097 1143341 968152 866935 785147 710749 610832 519581
14094E19581J15213J7726R4357M4582k39817Q6992K86398N2800j11457k27293
$$ 519581 634794 652520 746877 791459 551642 638634 925032 977832 866375 639082
14084F39082q0231N5239o721L4241J73636J71142M0348M2175j84746j92209J35334
$$ 639082 558851 614090 607369 641610 815246 986388 1026736 1068911 884165 691956 827290
14073H27290p771l7552k78914p1612J13246J74394J55521j26147j91853j79295
$$ 827290 819519 781967 503053 431441 544687 719081 874602 748455 556602 377307
14063C77307j06736j74108p3855j5806J63771K72800j21383q735k1018j86707
$$ 377307 270571 96463 22608 6802 170573 443373 321990 313255 292237 105530
14053A05530J88757R6270J30620R0709j26401o2850j4940J15203j761J46915N3761
$$ 105530 294287 390557 521177 611886 485485 422635 407695 522898 521137 668052 721813
14042G21813J51626J66073N0174j43536j93377r9438N8654j66496k3806J62753
$$ 721813 873439 1039512 1089686 946150 752773 653335 711989 545493 521687 684440
14032F84440R4516o160m3352j65812M0379l4070p7047L5946j74325p4596l0548
$$ 684440 778956 772796 729444 563632 604011 569941 492894 528840 354515 279919 249371
14021B49371N1787J26981m6360M0076n2534M5996L4444o7886r2918L6740J029
$$ 249371 301158 428139 381779 421855 369321 415317 449761 381875 288957 325697 326726
14010C26726J086P5397M8246r0487J94937J66282j2961p8093m221j18230l4117
$$ 326726 327812 403209 451455 360968 555905 722187 709226 631133 626912 508682 474565
13999D74565L7269k1406j9934m4080p6692m9262j52070K65425J06731k09218k83237
$$ 474565 511834 490428 470494 426414 349722 300460 148390 413815 520546 311328 28091
13988B8091K6327J46823L6174k7521N2605J24880O0655J28006n5036j42548j06915
$$ 28091 54418 201241 237415 209894 262499 387379 448034 576040 521004 378456 271541
13977B71541L1926L7817K13865k5951j01849k06405j80598J09803K79853O0316
$$ 271541 303467 341284 555149 529198 427349 220944 40346 150149 430002 490318
13967D90318j50312r5468j28216n2555q4251q8984Q0678J75923J14482R1479j58267
$$ 490318 340006 244538 116322 63767 -20484 -109468 -28790 147133 261615 353094 194827
13956A94827j95297N2715R0931j80023J5343M04610J58318N841j31315k01016
$$ 194827 -470 52245 143176 -36847 -21504 383106 541424 547265 415950 214934
13946B14934p0935O3566q7668l6589J48452k7371j77664L4980L8616J54641L09670
$$ 214934 143999 207565 119897 83308 231760 204389 26725 61705 100321 254962 564632
13935E64632K2452j56805j02568k0114p8200j42181j17098J61953p1831l9570
$$ 564632 587084 430279 327711 307597 229397 87216 -29882 132071 60240 20670
13925B0670J34820J47239Q6902j3003L7251j96441k13266m5353M8532K8272J787
$$ 20670 155490 302729 389631 376628 413879 217438 4172 -41181 7351 35623 37410
13914C7410L0788J9665P1701Q1139J72985K6522j65435j75006n7376k7778R5371
$$ 37410 68198 87863 159564 240703 413688 440210 274775 99769 42393 14615 109986
13903A09986J0288R0049J67973p9134m2093k8713o0137k04438k1705J40254O4118
$$ 109986 120274 210323 378296 299162 257069 228356 168219 -36219 -57924 82330 146448
13892A46448J42107J34193n8036j84183j38421q0621J46402J50668j46485k8457
$$ 146448 288555 422748 364712 180529 42108 -38513 107889 258557 112072 83615
13882H3615j43859k503N5740o2781J55838k02666l34516j5117L10763J88316K6136
$$ 83615 -60244 -62747 -7007 -69788 86050 -116616 -451132 -466249 -155486 32830 58966
13871E8966j85213r15P2549j19462K4005R7660q5700m4795K11328j6374J4374
$$ 58966 -126247 -127162 -54613 -174075 -150070 -52410 -138110 -182905 28423 12049 26423
13860B6423R0924k18161j81914r155J52743O3837k04124k86236J50070O9655O6576
$$ 26423 117347 -100814 -282728 -291883 -139140 -75303 -279427 -565663 -415593 -345938 -279362
13849b79362Q3955j10661J8526L1567J87522K28912R4561N6879o3333j9638p3621
$$ -279362 -195407 -306068 -287542 -255975 -68453 160459 255020 311899 248566 228928 155307
13838A55307O7062j11059P7747L2408n5883j46455K7101Q1180J35580L2753j52444
$$ 155307 222369 111310 189057 221465 165582 19127 46228 127408 262988 295741 143297
13827A43297j96248J28823l0231r2059r1865n312J37160P5652J52049O0106j11348
$$ 143297 -52951 75872 45641 -46418 -138283 -143595 -6435 69217 221266 281372 170024
13816A70024r3580m2250j31033J39866K14244n9589k66486p3772J04027P6038
$$ 170024 76444 34194 -96839 43027 257271 197682 -68804 -142576 -38549 37489
13806C7489P1916O3131j63760m2892J12166k84897k15295J02869K15187K00126
$$ 37489 109405 172536 8776 -34116 78050 -206847 -422142 -319273 -104086 96040
13796I6040J31987O0487k21891K7015p9234l16365m3652J02261J11774L44140
$$ 96040 228027 288514 66623 93638 14404 -301961 -345613 -243352 -131578 212562
13786B12562J93553p3912L0905K63620J44812N595J0263l17320j80672j83141
$$ 212562 406115 332203 363108 626728 771540 777135 787398 470078 289406 106265
13776A06265k489J48069J22314J82831J46238j35741j70216k82750l57036q5060
$$ 106265 103776 251845 374159 556990 703228 567487 397271 114521 -242515 -327575
13766c27575j71095J95457K02176M4746j306j14496K20154L51938j91611J25194
$$ -327575 -498670 -303213 -101037 -56291 -57597 -172093 48061 399999 208388 333582
13756C33582J72613R1063q4457r3525j41087N2306J8591j03710J4286K3928m2686
$$ 333582 506195 597258 512801 419276 278189 330495 349086 245376 259662 283590 240904
13745B40904j68960k0284J63536J49968l2932P7900J03884j68090j23139j27348
$$ 240904 71944 51660 215196 365164 332232 410132 514016 345926 222787 95439
13735I5439P0541j66898P9547j33245j15725J03005L23071J25097J57320N7179
$$ 95439 165980 -918 78629 -54616 -170341 -67336 255735 380832 538152 595331
13725E95331J25161j41353j78275j66144j70018j03533j11764Q594K9472n4972
$$ 595331 720492 579139 400864 234720 64702 -38831 -150595 -142001 -112529 -167501
13715a67501J02405O4962q3881j67827k3909M7842R5375J46785K1445j85585j09776
$$ -167501 -65096 -134 -84015 -251842 -275751 -227909 -132534 14251 35696 -149889 -259665
13704b59665k44835j07305K40144J23363q756j8599P3557K1615j3920J40260o1246
$$ -259665 -504500 -611805 -371661 -248298 -257054 -275653 -202096 -180481 -194401 -54141 -115387
13693a15387m3J37154l9290m8409r2259j26400J8288J41544j72109o095n3781
$$ -115387 -115430 21724 -17566 -65975 -158234 -284634 -266346 -124802 -296911 -303006 -356787
13682c56787Q9910J12257O3246J14991j3596j02909j83832P3049J23477J40077
$$ -356787 -266877 -154620 -91374 23617 10021 -92888 -276720 -203671 -80194 59883
13672E9883J39059n1814r297p73l0008O8994j94883k56354k57513k9929J29557
$$ 59883 198942 147128 137831 137058 107050 176044 -18839 -275193 -532706 -562635 -433078
13661d33078J46989R8644Q538Q5018o185O3120j2734J02880R0584Q652q7948p7982
$$ -433078 -286089 -187445 -178907 -93889 -100074 -36954 -49688 53192 143776 152428 64480 -13502
13649a3502k10762j30906q976n3815O2561J69723j07501j48420K95120J8683k22792
$$ -13502 -224264 -355170 -364146 -417961 -355400 -185677 -293178 -441598 -146478 -127795 -350587
13638c50587J92463J96789J03033k04513p8102m2088r3348J55933k2079K36002
$$ -350587 -158124 38665 141698 -62815 -140917 -183005 -276353 -120420 -142499 93503
13628I3503j59695L8717J23890P4389J03528p6063L5118l5781Q48j3134J41526
$$ 93503 -66192 -27475 96415 170804 274332 198269 233387 197606 198454 185320 326846
13617C26846M9115Q9770J38414J0444M8975K7239J57952o957k14810k13109p1122
$$ 326846 375961 465731 604145 614589 663564 690803 848755 841798 626988 413879 342757
13606C42757k4079J77965n6113j60743j87484j58502j41427R9198J70576L7036
$$ 342757 318678 496643 440530 279787 92303 -66199 -207626 -108428 62148 99184
13596I9184P946O018k30357j79784N523R6531k9906j75079J41487P979Q33Q2898
$$ 99184 107130 113148 -117209 -296993 -291470 -194939 -224845 -399924 -258437 -250458 -249625 -166727
13584a66727r7312r3194r9334K35950K91469J37299j25817J07597J27236J36629
$$ -166727 -264039 -357233 -456567 -220617 70852 208151 82334 189931 317167 453796
13574D53796q558j26895l9900j60013k69659j52302n3479J25191Q8254Q2465J16016
$$ 453796 445238 318343 278443 118430 -151229 -303531 -357010 -231819 -143565 -61100 54916
13563E4916L8066o661P090k4154Q6023R4502j7766m3644J26744K61166L2945j65171
$$ 54916 92982 86321 93411 69257 155280 249782 232016 188372 315116 576282 609227 444056
13551D44056o7579J33127J57444n3766J1772j39472N6536J17118K5323q2010R912
$$ 444056 376477 509604 667048 613282 625054 485582 542118 659236 684559 602549 612461
13540F12461J28870J57856n974J8062k39917R073J3051n1128l2969P2724n7181
$$ 612461 741331 899187 893213 911275 671358 680431 693482 642354 609385 682109 624928
13529F24928k32644n3756K3221K3408M9248j44319L6090p3475R513j46077N5477
$$ 624928 392284 338528 361749 385157 434405 290086 326176 252701 262214 116137 171614
13518A71614J75209j07592j45342r7316J31027j28916o9699j1486K4459J94394
$$ 171614 346823 239231 93889 -3427 127600 -1316 -71015 -82501 -58042 136352
13508A36352J1471J73768N25j14795n4320j12715p6894m3888O8615Q2901J51279
$$ 136352 147823 321591 322116 207321 153001 40286 -36608 -80496 -11881 71020 222299
13497B22299j02310q8144n441j5024j5777K5883j44913j52223R4862o8331P3597
$$ 222299 119989 31845 26404 11380 -4397 21486 -123427 -275650 -180788 -249119 -175522
13486a75522L948j73147P6398J92920J48698K9488k8360m8811j26918L6827J8635
$$ -175522 -171574 -344721 -268323 -75403 73295 102783 74423 25612 -101306 -64479 -45844
13475d5844L9764K6113K5893O332j9750j20502Q7549q9337Q0586J12518o2140
$$ -45844 -6080 20033 45926 52258 32508 -87994 -445 -89782 -9196 103322 41182
13464D1182J5120q4719p002j08809m7678q1125K7445J06665J25340K20181k03848
$$ 41182 56302 -28417 -35419 -144228 -191906 -273031 -245586 -138921 -13581 206600 2752
13453B752j30456r2940K4532R5545j53325P7264K43879O6269Q5057J1028K36750
$$ 2752 -127704 -220644 -196112 -100567 -253892 -176628 67251 133520 218577 229605 466355
13442D66355M771k47690r025j37491O9378K25482m1126j52346J07263j2108p9859
$$ 466355 471126 223436 214411 76920 146298 371780 330654 178308 285571 273463 193604
13431A93604j9297j3045j80993J36869k7746j76403j68608P9557J77253J24638
$$ 193604 174307 161262 -19731 117138 89392 -87011 -255619 -176062 1191 125829
13421A25829o5230j8311J2259J54152J40003Q9711K76833J08001l9470j35077
$$ 125829 60599 42288 54547 208699 348702 438413 715246 823247 783777 648700
13411F48700L5098j21867r9169j61594Q1226N9787j33993j85571M9424J12455
$$ 648700 683798 561931 462762 301168 382394 442181 308188 122617 172041 284496
13401B84496o822j25180l77396J23516K81889J76100j21014j52423K33182J10603
$$ 284496 277674 152494 -224902 -101386 180503 356603 235589 83166 316348 426951
13391D26951R8614L5246n7156n2258j32053O1389J010l4778N9423O3350K01567
$$ 426951 525565 560811 503655 451397 319344 380733 381743 346965 406388 469738 671305
13380F71305m1955j14680l9667r7598j59061j21538j77647r1475j44330M0523
$$ 671305 629350 514670 475003 377405 218344 96806 -80841 -172316 -316646 -276123
13370b76123O7602J42206p0773j11323j2034J24901m7447K70999K24411j97330
$$ -276123 -208521 -66315 -137088 -248411 -260445 -135544 -182991 88008 312419 115089
13360A15089j07711k4251J14112J37968J70344J06070o0377J5808o9804M1962
$$ 115089 7378 -16873 97239 235207 405551 511621 451244 467052 397248 439210
13350D39210l748J03204L9389O8139J8718J60842K20325j6572M5477J48913j51406
$$ 439210 435462 538666 578055 646194 664912 825754 1046079 1029507 1074984 1223897 1072491
13339A072491N6632J29322L2011J06676K61994L20927L7243K93901O34641P84909
$$ 1072491 1129123 1258445 1290456 1397132 1659126 1980053 2017296 2311197 2945838 3730747
13329C730747M30895M85213P00777Q38239J115332J712477K325406L169619M996343
$$ 3730747 4161642 4646855 5347632 6185871 7301203 9013680 11339086 14508705 19505048
13320A9505048P727464J1272297J3923937J3552304J1377010Q719214N178303
$$ 19505048 27232512 38504809 52428746 65981050 77358060 86077274 91255577
13313I1255577J199694j785682l988631o549308j0944583j3313290j1273711p091461
$$ 91255577 92455271 90669589 86680958 80131650 69187067 55873777 44600066 37508605
13305C7508605l428539p55461L37847P02430R44089J021194J440799K450378L710884
$$ 37508605 34080066 33324605 33662452 34364882 35308971 36330165 37770964 40221342 43932226
13296D3932226N376395N200228M836343O523889Q352380J0453282J2126710J1709883
$$ 43932226 49308621 54508849 59345192 65869081 74221461 84674743 96801453 108511336
13288A08511336R206105M684351J64495j896941k241039j764014l154730p224354
$$ 108511336 117717441 122401792 122566287 120669346 118428307 116664293 113509563 106285209
13280A06285209r989755j0173770q548622o274521m563101l178394l867771n284576
$$ 106285209 96295454 86121684 77573062 71298541 66735440 63557046 59689275 54404699
13272E4404699m909138l552383k393834j358849r95623p52934l54586L62076K495900
$$ 54404699 49495561 45943178 43549344 42190495 41194872 40441938 40087352 40449428 42945328
13263D2945328O427456J1105648J3971401J3323383J0415999P356746L150920
$$ 42945328 49372784 60478432 74449833 87773216 98189215 105545961 108696881
13256A08696881j073435m000511n844903r075407j4392629j6399623j3684649
$$ 108696881 107623446 103622935 97778032 88702625 74309996 57910373 44225724
13249D4225724r190115o077727m375692l152092k303806j786445j533500j182935
$$ 44225724 35035609 28957882 24582190 21430098 19126292 17339847 15806347 14623412
13241A4623412r07390r97887p46239l81720p07533n55130m57220n95272m72896
$$ 14623412 13716022 12718135 11971896 11590176 10882643 10327513 9870293 9275021 8802125
13232H802125l12121l58783m64544l71157j69789m69806k92931k88090k28978
$$ 8802125 8490004 8131221 7666677 7295520 7125731 6655925 6362994 6074904 5845926
13223E845926j82172P9017m6080n07069j90648m5192l12978o1850Q2193P1174
$$ 5845926 5663754 5742771 5696691 5189622 4998974 4953782 4640804 4578954 4661147 4732321
13213D732321O8330K663m7801N28j17484k46972l02352j75483p9264j6090q2879
$$ 4732321 4800651 4803314 4755513 4756041 4638557 4391585 4089233 3913750 3834486 3818396 3735517
13202C735517k62760j26891p1207k09724k39459J15039j31512L923J5857n5013
$$ 3735517 3472757 3345866 3274659 3064935 2825476 2940515 2809003 2812926 2828783 2773770
13192B773770j23855j20281J23833K522O0013j12589j96615P9920J15549K8272
$$ 2773770 2649915 2529634 2653467 2655989 2716002 2603413 2406798 2486718 2602267 2630539
13182B630539l5679k18767L6312j4908j94374K2269o1251j23087j02968r2884
$$ 2630539 2594860 2376093 2412405 2397497 2203123 2225392 2164141 2041054 1938086 1845202
13172A845202o2578n7259L11384J73798L4639o6809j1997j91769N5152J58605
$$ 1845202 1782624 1725365 2036749 2210547 2245186 2178377 2166380 1974611 2029763 2188368
13162B188368J81429K08173R5899M0604p5512j97482j08603l28780k68710r3321
$$ 2188368 2369797 2577970 2673869 2714473 2638961 2441479 2332876 2004096 1735386 1642065
13152A642065k9501j33625k1630Q035l20204q2465p7205O8796K34753J23393J89301
$$ 1642065 1612564 1478939 1457309 1465344 1145140 1062675 985470 1054266 1289019 1412412 1601713
13141A601713k879o7030L59487J63986j00417j77955k13314j83257N112K33971
$$ 1601713 1598834 1531804 1891291 2055277 1954860 1776905 1563591 1380334 1385446 1619417
13131A619417j34923p9457P6623l3603o8364J20292j56917o8686j02851J00681
$$ 1619417 1484494 1405037 1481660 1448057 1379693 1499985 1343068 1274382 1171531 1272212
13121A272212P9287K9404j60145k36092R1282l3509r8125J29680Q4932j73211
$$ 1272212 1351499 1380903 1220758 984666 1075948 1042439 944314 1073994 1158926 985715
13111I85715o6520L2975J4791j56125n8878J3721J2886m2340J2211j02136L1184
$$ 985715 919195 952170 966961 810836 751958 765679 778565 736225 748436 646300 677484
13100F77484j80681l9216L3544J26092O1072n4948m6851K529R5744q5510M7323
$$ 677484 496803 457587 491131 617223 678295 623347 576496 579025 674769 589259 636582
13089F36582J35200k41182l0476m2152n394j16010p4980K43893j00427j18805
$$ 636582 771782 530600 500124 457972 452578 336568 261588 505481 405054 286249
13079B86249k2669J85919J35329k95063r3490J31600J73269K28247L7138j72694
$$ 286249 263580 449499 584828 289765 196275 327875 501144 729391 766529 593835
13069E93835K36366m3708m4799j75346j32855M4841l9277P985P0205O5863j21243
$$ 593835 830201 786493 741694 566348 433493 478334 439057 447042 517247 583110 461867
13058D61867j16420j71361P8623L2568o0098J02743n117q3674o2542j26386J33409
$$ 461867 345447 174086 252709 285277 225179 327922 322805 239131 176589 50203 183612
13047A83612K27865j2894Q0808M5268k2120q6071r3553l6554J74241k3417o1099
$$ 183612 411477 398583 479391 524659 502539 416468 322915 286361 460602 437185 376086
13036C76086R4462n0829o691o4643k82153j07212k5871J88634M2980o3162N9243
$$ 376086 470548 419719 413028 348385 66232 -40980 -66851 121783 164763 101601 160844
$$ [...]
##END NTUPLES=NMR SPECTRUM
##END=
