##TITLE=Analysis number 323675
Compound Code cc 60830
Book Reference 511/12/1
Project Code adrs
Chemist Name stevem
##JCAMPDX= 6.0         $$ Bruker NMR JCAMP-DX V2.0
##DATA TYPE= NMR SPECTRUM
##DATA CLASS= NTUPLES
##ORIGIN= Bruker BioSpin GmbH
##OWNER= nmr
$$ XWIN-NMR		Version 3.5
$$ Thu Nov  2 12:01:34 2006 GMT Standard Time (UT+0h)  MAYBRIDGE\nmr@NMR_250MHZ
##.OBSERVE FREQUENCY= 250.131544655141
##.OBSERVE NUCLEUS= ^1H
##.ACQUISITION MODE= SIMULTANEOUS (DQD)
##.ACQUISITION SCHEME= undefined
##.AVERAGES= 16
##.DIGITISER RES= 18
##SPECTROMETER/DATA SYSTEM= dpx250
##.PULSE SEQUENCE= zg30
##.SOLVENT NAME= CDCl3
##.SHIFT REFERENCE= (INTERNAL, CDCl3, 0, 16.522)
##AUDIT TRAIL= $$ (NUMBER, WHEN, WHO, WHERE, WHAT)
$$ ##TITLE= Audit trail, XWIN-NMR		Version 3.5
$$ ##JCAMPDX= 5.01
$$ ##ORIGIN= Bruker BioSpin GmbH
$$ ##OWNER= nmr
$$ C:\u/data/dgb/nmr/ADRS/2010/pdata/1/auditp.txt
$$ ##AUDIT TRAIL=  $$ (NUMBER, WHEN, WHO, WHERE, WHAT)
(   1,<2006-11-02 12:01:10.48 +000>,<MAYBRIDGE\nmr>,<NMR_250MHZ>,
      <created by zg, POWCHK disabled, PULCHK disabled
       configuration hash MD5:
       49 4B E0 1D 92 C2 6B 37 9F E6 65 BC 52 41 86 1D
       data hash MD5: 64K
       31 48 7C DC BD 49 2A BD AF AF 3C 91 72 F6 04 70>)
(   2,<2006-11-02 12:01:25.61 +000>,<MAYBRIDGE\nmr>,<NMR_250MHZ>,
      <Start of raw data processing
       ef LB = 0.3 FT_mod = 6 PKNL = 1 SI = 32K 
       data hash MD5: 32K
       20 94 D5 0A C1 8B AB 3E 0E 4F 7A 23 10 4A A0 BD>)
(   3,<2006-11-02 12:01:27.20 +000>,<MAYBRIDGE\nmr>,<NMR_250MHZ>,
      <apk 
       data hash MD5: 32K
       F6 4E 1C 04 84 93 A1 20 4E 5B 2F DE 4C 41 51 05>)
(   4,<2006-11-02 12:01:28.03 +000>,<MAYBRIDGE\nmr>,<NMR_250MHZ>,
      <abs ABSG = 5 
       data hash MD5: 32K
       95 A2 9B B9 7E E9 B5 F2 3E F3 53 2F B8 7F 55 F3>)
$$ ##END=
$$ 
$$ hash MD5
$$ 58 81 49 6E 84 DA 49 60 01 01 CF 27 FC C1 62 9E
##$RELAX= 
##$RELAX= 
##$RELAX= 
##$RELAX= 
##$RELAX= 
##$RELAX= 
##$RELAX= 
$$ Bruker specific parameters
$$ --------------------------
##$DU= <C:\u>
##$EXPNO= 2010
##$NAME= <ADRS>
##$PROCNO= 1
##$TYPE= <nmr>
##$USER= <dgb>
##$AMP= (0..31)
100 100 100 100 100 100 100 100 100 100 100 100 100 100 100 100 100 100 
100 100 100 100 100 100 100 100 100 100 100 100 100 100 
##$AQSEQ= 0
##$AQ_mod= 3
##$AUNM= <au_zg>
##$AUTOPOS= <6 >
##$BF1= 250.13
##$BF2= 250.13
##$BF3= 250.13
##$BF4= 250.13
##$BF5= 500.13
##$BF6= 500.13
##$BF7= 500.13
##$BF8= 500.13
##$BYTORDA= 1
##$CFDGTYP= 0
##$CFRGTYP= 5
##$CHEMSTR= <none>
##$CNST= (0..31)
1 1 145 1 1 1 1 1 1 1 1 1 1 1 1 1 1 1 1 1 1 1 1 1 1 1 1 1 1 1 1 1 
##$CPDPRG= <>
##$CPDPRG1= <>
##$CPDPRG2= <>
##$CPDPRG3= <>
##$CPDPRG4= <mlev>
##$CPDPRG5= <mlev>
##$CPDPRG6= <mlev>
##$CPDPRG7= <mlev>
##$CPDPRG8= <mlev>
##$CPDPRGB= <>
##$CPDPRGT= <>
##$D= (0..31)
0 1 0 0 0 0 0 0 0 0.06 0 0 0 0 0 0 0.0002 0 0 0 0 0 0 0 0 0 0 0 0 0 0 
0 
##$DATE= 1162468869
##$DBL= (0..7)
120 120 120 120 120 120 120 120 
##$DBP= (0..7)
150 150 150 150 150 150 150 150 
##$DBP07= 0
##$DBPNAM0= <>
##$DBPNAM1= <>
$$ [...]
##$SUBNAM7= <"">
##$SUBNAM8= <"">
##$SUBNAM9= <"">
##$SW= 20.6930455092707
##$SWIBOX= (0..15)
0 0 3 0 0 0 0 0 0 0 0 0 0 0 0 0 
##$SW_h= 5175.983436853
##$TD= 65536
##$TD0= 1
##$TE= 683.16
##$TE2= 300
##$TE3= 300
##$TEG= 300
##$TL= (0..7)
0 120 120 120 120 120 120 120 
##$TP= (0..7)
150 150 150 150 150 150 150 150 
##$TP07= 0
##$TPNAME0= <>
##$TPNAME1= <>
##$TPNAME2= <>
##$TPNAME3= <>
##$TPNAME4= <>
##$TPNAME5= <>
##$TPNAME6= <>
##$TPNAME7= <>
##$TPOAL= (0..7)
0.5 0.5 0.5 0.5 0.5 0.5 0.5 0.5 
##$TPOFFS= (0..7)
0 0 0 0 0 0 0 0 
##$TUNHIN= 0
##$TUNHOUT= 0
##$TUNXOUT= 0
##$USERA1= <user>
##$USERA2= <user>
##$USERA3= <user>
##$USERA4= <user>
##$USERA5= <user>
##$V9= 5
##$VALIST= <valist>
##$VCLIST= <CCCCCCCCCCCCCCC>
##$VD= 0
##$VDLIST= <DDDDDDDDDDDDDDD>
##$VPLIST= <PPPPPPPPPPPPPPP>
##$VTLIST= <TTTTTTTTTTTTTTT>
##$WBST= 1024
##$WBSW= 4
##$XGAIN= (0..3)
0 0 0 0 
##$XL= 0
##$YL= 0
##$YMAX_a= 506224
##$YMIN_a= -319174
##$ZGOPTNS= <>
##$ZL1= 120
##$ZL2= 120
##$ZL3= 120
##$ZL4= 120
##$ABSF1= 16.522
##$ABSF2= -4.171173
##$ABSG= 5
##$ABSL= 3
##$ALPHA= 0
##$AQORDER= 0
##$ASSFAC= 0
##$ASSFACI= 0
##$ASSFACX= 0
##$ASSWID= 0
##$AUNMP= <proc_1d>
##$AZFE= 0.1
##$AZFW= 0.1
##$BCFW= 0
##$BC_mod= 0
##$BYTORDP= 0
##$COROFFS= 0
##$CY= 12.5
##$DATMOD= 1
##$DC= 0
##$DFILT= <>
##$DTYPP= 0
##$F1P= 14.0000005364418
##$F2P= -0.99999901652339
##$FCOR= 0.5
##$FTSIZE= 32768
##$FT_mod= 6
##$GAMMA= 0
##$GB= 0
##$INTBC= 1
##$INTSCL= 1
##$ISEN= 128
##$LB= 0.3
##$LEV0= 0
##$LPBIN= 0
##$MAXI= 10000
##$MC2= 0
##$MEAN= 0
##$ME_mod= 0
##$MI= 0
##$NCOEF= 0
##$NC_proc= -5
##$NLEV= 6
##$NOISF1= 0
##$NOISF2= 0
##$NSP= 0
##$NTH_PI= 0
##$NZP= 0
##$OFFSET= 16.522
##$PC= 1
##$PHC0= -43.92407
##$PHC1= 20.33424
##$PH_mod= 1
##$PKNL= yes
##$PPARMOD= 0
##$PSCAL= 4
##$PSIGN= 0
##$REVERSE= no
##$SF= 250.13
##$SI= 32768
##$SIGF1= 0
##$SIGF2= 0
##$SINO= 400
##$SIOLD= 32768
##$SREGLST= <1H.CDCl3>
##$SSB= 0
##$STSI= 32768
##$STSR= 0
##$SW_p= 5175.98343685301
##$SYMM= 0
##$S_DEV= 0
##$TDeff= 65536
##$TDoff= 0
##$TI= <Analysis number 999999
Compound Code 99
Book Reference 9
Project Code 9>
##$TILT= no
##$TM1= 0
##$TM2= 0
##$TOPLEV= 0
##$USERP1= <user>
##$USERP2= <user>
##$USERP3= <user>
##$USERP4= <user>
##$USERP5= <user>
##$WDW= 1
##$XDIM= 32768
##$YMAX_p= 321780702
##$YMIN_p= -981752
$$ End of Bruker specific parameters
$$ ---------------------------------
##NTUPLES= NMR SPECTRUM
##VAR_NAME=  FREQUENCY,     SPECTRUM/REAL,   SPECTRUM/IMAG
##SYMBOL=    X,             R,               I
##VAR_TYPE=  INDEPENDENT,   DEPENDENT,       DEPENDENT
##VAR_FORM=  AFFN,          ASDF,            ASDF
##VAR_DIM=   32768,         32768,           32768
##UNITS=     HZ,            ARBITRARY UNITS, ARBITRARY UNITS
##FACTOR=    0.157963299565203, 1,           1
##FIRST=     4132.6476996994, 0,             0
##LAST=      -1043.33573715361, 0,           0
##MIN=       -1043.33573715361, -981752,     0
##MAX=       4132.6476996994, 321780702,     0
$$ Real data points
##PAGE= N=1
##DATA TABLE= (X++(R..R)), XYDATA
$$ [...]
22146 244923 386121 301340 214723 199566 72971 -7466 -140496 -256445 -376378 -386159 -513505
22135 -513505 -472017 -247487 -218848 -352212 -474987 -402207 -251003 -144861 632 120288
22125 120288 434493 352536 42364 136765 160380 175063 143335 54245 19673 -41504 -178986
22114 -178986 -198971 30439 241240 47418 -139957 114036 235711 165632 -129145 -9057
22104 -9057 215392 192206 126011 156808 252010 243421 93944 -97403 -111545 90242 226939
22093 226939 263521 109884 -42770 -41816 -3233 216342 193615 296818 431764 479359 372288
22082 372288 259526 411831 356657 114678 -24736 -30412 18344 110239 149546 101899 75993
22071 75993 138137 -51889 -172286 -357839 -116852 -75925 -79642 99369 -124417 -288480
22061 -288480 -62534 -85005 -126365 172808 213828 119336 51236 305337 246460 312273 55885
22050 55885 38551 -1436 112882 241405 248827 27733 -7039 132589 43185 105032 197807
22039 197807 188890 135559 129027 -5069 -52103 -39928 123837 259540 194612 188259 55545
22028 55545 -126287 242728 333180 458803 340044 228767 174765 7770 70795 190125
22018 190125 243799 339552 201641 35311 -162309 -168810 -178341 -42492 -24137 -186767 -232224
22007 -232224 -193323 22884 -134941 -246433 -301466 -13775 74159 18958 -143614 -465718
21997 -465718 -362811 94230 432488 348693 227906 480484 511777 550665 754648 598095
21987 598095 633486 602449 336268 51326 220847 355461 304498 288765 198675 146407 36639
21976 36639 -81229 152655 249105 316492 331520 295152 115674 201591 337276 201062 148591
21965 148591 233791 224640 24020 93254 47553 -77262 24806 -40872 -114427 -246514 -459580
21954 -459580 -461277 -557321 -594506 -361313 -44886 -9775 133292 135608 157644 330145 200069
21943 200069 -21586 -79517 -140437 -96602 15602 69853 58885 -14972 -195587 -508705 -413669
21932 -413669 -270004 -51576 55239 -85103 -212966 -154509 104242 7529 42254 -181269
21922 -181269 -443552 -146286 -29997 -18495 -78616 -146640 128633 252879 80249 -65140
21912 -65140 -196307 -148185 55472 36014 -46918 156562 119532 161331 172833 168582 226639
21901 226639 84624 -42315 -165670 -192552 -237660 -325633 -228042 -126493 205018 336492
21891 336492 506003 331223 -148568 -209734 -4615 99170 100957 129062 196466 153430 61723
21880 61723 -300886 -310362 -148721 -51189 86302 -12050 -120219 -154027 23031 43421 -21642
21869 -21642 -226412 -448780 -332981 -535486 -741836 -708731 -364907 -169017 -177891 -29224
21859 -29224 -56927 -47667 102131 175234 -110940 -123879 -162806 8341 212506 276241 -37280
21848 -37280 -80896 -34976 188261 344596 109749 -34397 2027 171746 220866 150374 188680
21837 188680 247972 386707 194844 -112716 -133039 -314975 -345427 -53260 142168 28269
21827 28269 54485 272529 203216 209931 209392 8347 -77239 -123064 -180741 -50100 117299
21816 117299 118937 -72961 -130586 -166439 -365969 -637370 -429358 -311468 -137682 60795
21806 60795 -170049 -22695 -137412 -213659 -218084 -202430 71381 152156 177588 147947 31715
21795 31715 16410 -215116 -213990 -242291 -203634 -412591 -208544 123581 17883 -120005 -247215
21784 -247215 -157957 -49090 75442 138413 52310 144313 264331 201227 159001 142627 194691
21773 194691 153102 125220 272504 342799 319345 183495 103889 -43040 -150874 7690
21763 7690 -46965 -112362 -55570 273656 461647 352797 197695 -261379 -155427 7517
21753 7517 59257 -165098 -312814 -224228 -156777 -237976 -80636 245598 163015 195116 188728
21742 188728 185777 115519 110487 243336 470049 304576 -145781 -181705 -181174 -254092 -327590
21731 -327590 -298673 -193717 -207430 -105088 -165403 15735 -17336 -90296 -51653 -5275 30629
21720 30629 -7168 12204 115442 165460 389089 471292 435195 254928 38928 -71613 -2602
21709 -2602 -19488 -20300 92380 161775 192662 87746 243934 188018 326740 475936 301368
21698 301368 113412 151244 170851 88742 54655 181472 225980 109618 263733 380241
21688 380241 235180 189334 402105 427594 542058 428732 201837 95841 329600 157642
21678 157642 -135030 -354937 -249082 -210554 -255971 -147755 292608 305732 81636 -247696
21668 -247696 -286056 -393103 -354481 -205656 -345727 -313992 -361877 -312940 -204439 -150334 6595
21657 6595 -179849 -99014 15678 -132686 -234956 -27525 99550 152223 596 -510155
21647 -510155 -624857 -401564 -107879 117693 -132958 -261979 -154621 -58264 68906 32149
21637 32149 -75364 -136804 -170460 -55951 -12498 53233 -156163 -314327 -359440 -179866 -216495
21626 -216495 -47064 24108 61874 151674 39628 136315 34377 -54429 -71928 -262796 -120450
21615 -120450 99224 241896 282002 109856 54924 -58462 -232015 -156149 -56606 -22904
21605 -22904 -104125 -60701 -50826 122331 218996 324719 548467 280441 -136283 -252885 -255671
21594 -255671 -98897 -202335 -486569 -365766 -18705 75132 -107147 -222433 -33372 96921
21584 96921 41167 -88728 -64278 -188141 -261807 -422320 -378668 -399639 -345716 -194927 -23550
21573 -23550 44755 19671 -143715 -88690 -96026 -52579 -144797 -154475 -374705 -490105 -449516
21562 -449516 -189462 -189501 -144048 92599 304179 223329 -114471 -258337 -176063 59386 320148
21551 320148 330333 129422 -141115 -218143 -194319 -19372 -87736 -126318 -162151 -32525 84467
21540 84467 160294 90662 10381 -86519 -241376 -376823 -282329 -86078 -89445 -199305 29693
21529 29693 45432 146607 -71728 -309333 -134465 -31532 46827 -200769 -257498 -23048
21519 -23048 787 -219305 -393681 -347246 -192332 -130999 192640 300929 222605 246929 159379
21508 159379 205532 343902 268390 296464 342462 276027 110837 -54308 -163716 -240963 -221869
21497 -221869 -152475 -112099 -125037 -178285 -203259 -225215 -11161 76678 78232 73621 -149893
21486 -149893 -107611 -371710 -441340 -326211 -66646 -90618 -112589 -242185 -248598 -165470 -295043
21475 -295043 -439302 -351639 -174565 -31719 -1134 -77424 -353035 -566400 -678339 -607156
21465 -607156 -376939 -177946 -48557 142807 17839 64519 322202 254593 28408 -7358
21455 -7358 -46974 -66894 -56012 -71028 -184951 -121647 28569 39482 2770 113439 13530
21444 13530 114267 144849 121274 -96640 -74923 -175689 -470157 -658877 -562677 -523695 -524645
21433 -524645 -603415 -513038 -226750 -380453 -327033 -260420 134672 281402 170831 195930
21423 195930 264550 54274 39977 35329 56579 128665 127683 273486 533672 571042 413303
21412 413303 250397 192210 138045 41716 136122 1927 -174524 -159882 -149289 -36062 -179026
21401 -179026 -372557 -266865 66027 223900 194277 118206 7348 -101700 -239674 -222452
21391 -222452 -150037 -34097 -187888 101076 212626 -66637 -157667 -203380 8444 -98069
21381 -98069 -260195 -150488 -55018 -40499 -67832 134793 179840 -168282 -375895 -357076 -288374
21370 -288374 -195435 -152398 -123937 68796 369980 326017 177885 -22883 5775 8294 -150270
21359 -150270 -182328 -226109 -254697 -239797 -430810 -482097 -423605 -571273 -177995 -27975 -123975
21348 -123975 -209271 -109442 63541 252795 165793 268727 344276 475167 395967 380441 147618
21337 147618 -23773 -184461 -179197 34568 118808 333681 345830 125157 156997 153640 278966
21326 278966 246609 40032 -285135 -322066 -35706 -65552 -231773 -352000 -191816 86555
21316 86555 63111 46204 129673 18969 122384 205264 320200 401162 305649 -6999 -205671
21305 -205671 42179 30488 -198524 144957 206743 302503 20342 -133727 -108274 -41709
21295 -41709 141714 19630 -13052 -35003 -183039 -317123 -115839 -150070 -482361 -521047
21285 -521047 -245351 -243436 -250402 -158816 -52339 56502 7745 -76035 121439 421633 445274
21274 445274 191203 -17204 -24210 -11744 -32775 -121362 -218968 -39001 -118536 -136957 -155097
21263 -155097 -123470 -100084 -31673 82532 -55976 -30431 16329 48506 61950 104183 99132
21252 99132 113704 13189 -91557 -113758 -31278 -32005 -264024 -28223 84627 -23984 -26173
21241 -26173 -74953 -179296 -353656 -192964 40427 343349 312199 28584 -148394 -231420
21231 -231420 -96739 -32099 87916 110518 -124433 -81880 77632 28092 -134654 -124778 47463
21220 47463 143731 83967 51342 81603 42155 30728 106549 170773 140103 16460 14452 -21344
21208 -21344 35646 -173062 74710 277935 148572 47591 -330006 -526361 -409993 -119291
21198 -119291 22529 228587 309192 28820 100770 83139 59574 28646 63294 81745 -133627
21187 -133627 -99852 25523 275315 257821 -118 -191108 -160981 -106687 -176049 -238837 -288655
21176 -288655 -534192 -433845 -257358 -53279 -39726 153640 388554 579882 394995 139714
21166 139714 26703 -72286 -118025 -105450 -238557 -310612 -237313 -42226 -27600 7199 -47775
21155 -47775 -39046 178132 262403 48035 -53563 -182848 -336328 -449590 -439752 -577394 -512440
21144 -512440 -265586 -225333 -70378 -106157 -131494 -34523 -61093 -227120 -252609 -211170 -342434
21133 -342434 -356751 -267810 -265909 -368974 -444905 -219624 -131122 -84009 -42208 158972 218748
21122 218748 338474 303548 138553 41691 -37058 86740 -28719 -242082 -384515 -324410
21112 -324410 -161311 -45032 121503 78917 -81971 -110595 -133072 -203645 -75217 -6617
21102 -6617 -29273 -144722 -188869 -212283 -333701 -299875 -335168 -226522 -226997 -271704 -233393 -24138
21090 -24138 -119464 -272924 -236680 -187683 -104266 124958 27726 -141576 42995 117662 -106694
21079 -106694 -335258 -192475 -70380 -140875 -171472 -181929 -34982 -122147 -162968 -85816 370
21068 370 -3949 -135191 -164851 7110 -168982 -92785 -71816 -136824 -194000 -271139 -80118
21057 -80118 88553 90346 -103824 -335732 -348012 -111603 47781 2387 -149987 1511
21047 1511 60863 116466 225318 267515 37746 -287036 -225620 -93321 -66988 -14542 -37733
21036 -37733 104466 97655 -151411 -141965 -92863 -286935 -436305 -173637 -47720 -178308 -133964
21025 -133964 23254 -8436 -23369 -14391 -59989 38028 60745 46972 71081 20993 28402 26815
21013 26815 -135855 -274714 -275887 -79774 -86998 -68208 115346 113196 125188 225031 295667
21002 295667 85932 -346088 -314470 -320068 -21373 362538 228983 56243 -146557 -401485
20992 -401485 -253580 -141551 124381 150434 -85758 -265593 -239727 -191591 -200602 -250320 -304877
20981 -304877 -290322 -320067 -264435 -231717 -161055 -133275 -308434 -386473 -299448 -131086 64106
20970 64106 -53852 -23568 -82187 -468661 -349251 -168086 116363 267918 390348 311551
20960 311551 274172 275653 17737 -32010 162270 210038 102499 13156 27998 14268 67222
20949 67222 194383 438378 362852 -7326 12815 52236 -214723 -277707 151687 464725
20939 464725 530620 314107 -44900 -143859 -42998 -46930 -26201 -150893 -40626 229548
20929 229548 46069 -124160 -359537 -248091 -39202 -19791 15908 261799 290845 -112736
20919 -112736 -323853 -205860 -147775 -90533 -3155 204381 318732 122835 -25535 -15749
20909 -15749 94282 54602 60338 162618 67694 92214 72175 217504 299263 271102 307691
20898 307691 412630 394726 454262 502975 477172 221534 -35272 108330 110406 48905 -128987
20887 -128987 -390012 -304931 -250324 -174590 -61042 91257 -6836 -45594 -3718 -31417 -199002
20876 -199002 -35226 112497 282895 88344 -20923 -75517 -141420 43509 44589 -40008
20866 -40008 -98649 -114415 105175 160105 92797 17179 -130311 -256266 -249803 -45598 -19211
20855 -19211 -104055 -83872 30121 -109232 -37239 -175158 -369066 -405022 -387428 -391199 -211202
20844 -211202 -68183 -112995 186997 270817 190420 203298 39729 -24620 13788 55530 208808
20833 208808 144714 45132 40226 143072 150594 247065 556150 470375 507303 288027 -27462
20822 -27462 -172052 -104779 -234674 21692 242179 127489 -71228 -316227 -482962 -532813
20812 -532813 -244604 -43457 59673 107687 86745 82915 195286 156279 158369 1504 105996
20801 105996 34021 -167618 -72796 -1039 -137098 -108726 -166790 -260939 -406234 -429652 -257690
20790 -257690 117480 436907 266220 82222 -90715 118393 107348 180696 309351 194369
20780 194369 131633 61374 164863 244744 174267 12607 -128943 48227 146680 81907 114019
20769 114019 302215 207109 -37651 -262421 -232305 -63770 168602 238348 -80381 -327443
20759 -327443 -236653 25018 562644 567022 446177 268353 134537 -41022 -57320 40351
20749 40351 -12256 -109591 -140877 -124324 -120175 -249318 -59312 67479 194258 112405 68545
20738 68545 -34000 -67687 -110779 -150249 -76199 -142898 -103262 -213257 -163091 -65507 110770
20727 110770 55088 -89098 -208946 -11772 -78885 -11752 -242039 -366799 -195720 5146
20717 5146 176002 211340 -42708 -115206 167471 291060 272630 58533 11595 141008 26257
20706 26257 -248521 -78288 -118895 -93554 115390 115987 152281 -40236 15866 178613 38988
20695 38988 -31092 -102614 -72117 -71157 50728 58945 -4622 -178894 -304351 -260644 -112684
20684 -112684 -19588 -57166 124490 155689 261120 431060 291149 100861 90006 54259
20674 54259 91868 -207171 -279141 -315913 -371707 -342874 -135207 36748 229061 163291 134082
20663 134082 210661 184994 214391 184060 250104 264933 50102 -111993 -73083 -171331 1762
20652 1762 239524 318515 223273 306119 198200 81080 146147 -26232 -151633 -113915 66313
20641 66313 196228 62589 -56418 -223710 -375969 -160458 -184929 -245731 -25272 99800
20631 99800 41716 -30649 175838 -6095 31531 81566 139203 126201 -187385 -386896 -431366
20620 -431366 -369841 -260405 -7969 -129435 -108973 -101906 -275720 -450318 -343717 -526801
20610 -526801 -654703 -533731 -362048 -129768 80493 138572 88228 121594 97144 -66004
20600 -66004 -77860 62082 167893 286838 130827 139359 11409 -80573 -204952 -173594 -378214
20589 -378214 -406759 -279735 -129040 -148241 -80831 -229101 -158649 80100 -9662 -181837
20579 -181837 -167399 -211146 -256456 97854 366021 180548 30840 -249807 -305631 -237373
20569 -237373 -299749 -280377 -194388 -98366 -111981 -122251 -208078 -89700 -133140 -340499 -306349
20558 -306349 -2518 -82346 -65309 58089 118718 -23276 -200145 -301616 -378462 -266087
20548 -266087 -260439 -307383 -278307 -212223 -360677 -427652 -189606 -190950 -494098 -649963 -534568
20537 -534568 -178666 -243519 -199466 194060 265816 93797 -134212 -165107 -68880 -161071 -341309
20526 -341309 -57830 61448 71760 85013 58484 67510 28626 -53576 239696 168102 54546
20515 54546 304816 485342 356683 59463 -417261 -295511 1064 78415 -28712 -63226
20505 -63226 132516 168319 255193 237683 143444 233880 297983 193435 150752 308582 274284
20494 274284 141389 183076 196691 11621 -48173 -295376 -454051 -384860 -221687 -16119
20484 -16119 -139156 -295704 -337380 -346960 -227306 -148869 124341 389559 236321 127815
20474 127815 167188 189566 160983 221564 272297 54353 -96949 -166894 65156 103102 117455
20463 117455 13335 -90853 -30004 -103483 -394862 -420773 -180976 -86987 -36542 -61344 -184856
20452 -184856 -223906 -123958 -309866 -166011 -92083 -3055 -19619 44870 41652 -120675 -176061
20441 -176061 -91198 26399 39450 28834 -54644 190997 242150 -48867 -80801 -247966 -387777
20430 -387777 -330452 103766 319105 178583 -63541 -309358 -487550 -647706 -639984 -417264
20420 -417264 -333831 -534385 -537973 -332286 -73335 168825 192975 218597 17354 -274343
20410 -274343 -215778 -99559 -211297 -295384 -317508 -346845 -341764 -353776 -348446 -361359 -294286
20399 -294286 -55921 -166126 -237921 -193531 94874 237504 436581 419963 361553 258054
20389 258054 262474 188002 -60261 -167217 90971 134971 51653 186249 90146 86861 59346
20378 59346 89852 36770 183696 56523 -26706 -56469 141315 223824 31392 197449 284881
20367 284881 425662 296995 166288 -14967 -252798 -368129 -294068 -76382 3 -187474
20357 -187474 -134353 -67925 -188485 -288498 -92606 -27454 -142159 -79202 29326 97932
20347 97932 -163536 -172906 -126824 -232433 -205921 15527 2274 -61535 62181 42396 -200635
20336 -200635 -165197 11109 219888 261548 133330 11240 -113799 -133220 -105384 -50756
20326 -50756 -24927 -241366 -427155 -401622 -228549 -138432 -256726 -377455 -370798 -208620 -105849
20315 -105849 -150787 -211853 -287551 -447583 -307900 -427281 -287862 -145120 -158760 -109520
20305 -109520 -329791 -453398 -282149 -178581 -192883 -95322 -109485 35042 109003 -47700
20295 -47700 -311567 -409238 -366414 -351218 -250955 -211862 -127538 -89511 -10419 152475 -101554
20284 -101554 -328874 -461145 -538601 -275488 -192152 -226606 -252481 -143285 3847 -29457
20274 -29457 79336 177350 -27904 -249805 -297440 -392085 -425488 -239249 -248835 -4101 -171987
20263 -171987 -449196 -499295 -362819 -163484 14249 7718 -179687 -248076 -126719 -171094
20253 -171094 -47437 61050 -188907 -266716 -168154 -180363 -156838 -410137 -492977 -292099
20243 -292099 -194485 96746 164613 58480 9294 80666 22839 -209044 -93955 -113907 -115795
20232 -115795 -43590 -101707 -87975 34145 -10942 424828 998029 805139 365370 309867
20222 309867 184600 198855 367207 445496 304570 448053 402673 350115 352486 453737 233554
20211 233554 195443 -163237 -279572 105167 252428 150376 13090 83315 188924 232316
20201 232316 66905 102915 62084 75960 132490 -53914 -178106 -131228 -195001 -158800 -3109
20190 -3109 97196 30619 218605 200339 146781 73973 254228 172059 60354 68696 5416
20179 5416 -174692 -121188 -21883 18218 119378 141995 96604 47045 -21016 -132151 -231990
20168 -231990 -107388 -105477 -265836 -267256 -90330 46004 116661 169485 73646 -108347 -167914
20157 -167914 -29872 -120469 197746 94873 -22901 179232 142884 1556 -63341 -150207
20147 -150207 -9128 -116811 -323740 -369519 -152641 192 112978 295467 204812 75206
20137 75206 -113380 -62581 177280 352511 265912 23528 -71272 11955 -88547 58052
20127 58052 -38436 -76209 106723 112944 66537 63006 -239424 -258401 -245272 -101508 -68557
20116 -68557 -110927 -254193 -119990 31916 -243884 -346825 -171804 -180689 -158175 -163482 -49589
20105 -49589 -121705 -127418 38635 13894 35535 183527 287327 274624 220556 228542 223662 31020
20093 31020 -209550 -174160 8951 185326 224693 187396 63661 1849 14535 171205 422586
20082 422586 360964 163351 29271 -121798 -261416 -171916 -46715 -12095 25397 15247
20072 15247 -212518 -185173 -296233 -490794 -491060 -628291 -556683 -399551 -372249 -303715 -331610
20061 -331610 -169083 -137307 -19298 63448 -100945 33024 145751 -130895 -126949 -96120
20051 -96120 78485 289318 178801 50 -55459 -141868 -119463 8116 217838 236606
20041 236606 -117894 -70106 102299 130434 -35499 190843 340439 323655 325043 300378 179668
20030 179668 385690 234441 100337 230570 182751 66694 163509 -7454 130599 158023
20020 158023 117673 -28537 98955 97124 104523 183850 80949 -8802 168535 220438 20638
20009 20638 53261 -228320 -296661 -275564 -109863 -89844 40979 174860 51499 120146 130511
19998 130511 107043 57349 44198 42816 156730 208195 -19651 -281582 -173227 -261147 -414089
19987 -414089 -527498 -469879 -415894 -72565 103152 -44250 98995 -59020 -207173 -198209
19977 -198209 -160126 -79837 -159252 -288577 -91332 10693 -106580 -249482 -108615 -177851
19967 -177851 -335419 -280760 -169236 1148 84589 222137 -40397 -381276 -307804 -212000
19957 -212000 140412 143159 282877 293879 -14347 -131199 48947 88583 -67308 -197515
19947 -197515 -17245 84032 -136750 -201823 -62545 -114744 -167916 -233689 -258292 -232331 -14705
19936 -14705 365896 360953 116244 -82928 -36990 -222549 -284019 -269869 -199467 -29431 -181448
19925 -181448 -218161 -305722 -307919 -531002 -542478 -466955 -196219 11713 -149142 -269092 -129965
19914 -129965 -134002 -86718 -33941 -158604 -118572 -134481 37619 40388 -207144 -315130 -220049
19903 -220049 -204309 -104005 -90289 -197456 -155971 143887 235825 249949 167625 235115 182874
19892 182874 -71412 -67731 79994 327754 209686 68983 158111 341095 329428 340791
19882 340791 504882 496691 73480 -92141 112783 161789 151856 62064 -91137 -155498 -134424
19871 -134424 170325 188927 2891 -15315 -268465 -432647 -415720 -277226 -150292 -40583
19861 -40583 161722 -49425 -121985 -118843 -75361 -297628 -425531 -256649 -325926 -392625 -74084
19850 -74084 380231 462427 481963 168542 -8914 -6662 -52793 -25568 41842 210548 63404
19839 63404 -40458 -118306 -46396 78775 -74280 -472169 -453706 -105946 124851 63094
19829 63094 110923 15915 -83515 -71399 18414 294650 303957 252739 293062 142535 97305
19818 97305 12578 289582 78042 -6416 -21979 -33030 -49938 -153974 -124934 -217882 -184022
19807 -184022 -170639 -100049 -50190 -81173 -109128 91056 341241 341728 207059 145228 49529
19796 49529 112893 -3383 71912 -98479 -304220 -190220 -140346 -290574 -262132 -160991
19786 -160991 -424618 -408853 -127081 195352 67519 -33590 118608 142210 -244933 -383389
19776 -383389 -514864 -334380 21515 296954 130973 225191 17690 -220267 -269866 -308188
19766 -308188 -315901 -400189 -281213 126278 204949 -159993 -273936 -416508 -516607 -637184
19756 -637184 -527336 -137415 180254 160240 52760 -7488 -135106 -147489 -319444 -316351
19746 -316351 -221247 -337911 -439454 -402664 -174225 -243704 -181503 72299 190107 64476
19736 64476 237085 304608 403501 272307 258129 142349 77021 79137 45924 -27463 -281718
19725 -281718 -271635 -188046 -158008 -142615 -24118 182017 155766 -98238 -202236 -256935 -348198
19714 -348198 -521360 -416255 -431826 -406990 -96015 -89609 -26112 14174 22618 -959 -118316
19703 -118316 -162062 -68437 13709 -38771 -154785 3342 -67471 -103662 -16733 27271 38858
19692 38858 83250 213342 424218 184053 69128 292504 282007 282860 252848 136718 -107530
19681 -107530 -173944 -179704 -211861 -277970 -236135 -110762 -127176 -82847 -30831 160463 -19579
19670 -19579 -178147 -235117 -177645 -149623 -89232 81754 27781 -71856 73939 83080 -164615
19659 -164615 -390140 -381663 -365649 -282918 -242415 -274559 -225460 38522 132302 -128548 -171429
19648 -171429 -174535 -150150 -49394 114195 183311 90104 74860 -70190 -62989 -879 -159611
19637 -159611 -355729 -235681 136509 265031 74483 153393 339278 314962 145793 73899
19627 73899 104155 40421 76971 -60910 -142705 -297264 -221230 58651 199926 29940 87399
19616 87399 -155819 -294131 -263044 -53032 51387 84331 -35579 -108195 368 -82741
19606 -82741 -136917 -314435 -288757 -239370 -131931 -211000 -316316 -182811 142005 25369
19596 25369 85313 204925 133937 33567 13326 -267028 -276573 -313940 -333093 -67004 -53265
19585 -53265 -202221 -106306 -81276 24676 173549 248881 126143 236220 140415 -54290
19575 -54290 -109977 -108026 -162474 79634 292732 408163 369194 233328 -46408 -416783 -250409
19564 -250409 -21993 -66949 136848 204791 68450 112691 -132004 -267844 -111427 -47554
19554 -47554 207864 228818 357546 242905 -64573 -151136 -194436 -312014 -235210 -205982 -100622
19543 -100622 -23204 -59807 -9572 -106342 -342636 -441994 -136388 97097 131571 52025 -1494
19532 -1494 -6328 -13120 147379 158137 357305 303804 -34281 -66371 85697 181007 248610
19521 248610 310493 162000 241247 347592 133829 89737 311311 322836 148051 164851
19511 164851 141277 177525 40828 -101755 77343 83997 38733 120840 367189 566904 100496
19500 100496 -134026 75832 190681 79227 -71110 -59383 156914 4757 102168 96766
19490 96766 3192 156266 226563 180462 11733 -155458 -49416 9565 5424 302467 216839
19479 216839 162053 157889 -163262 -190307 -198294 23743 280773 223034 -44020 -211363 201779
19468 201779 394923 164304 237310 204677 39295 80151 -37452 -109659 -222886 -259155
19458 -259155 -272943 -414496 -254068 -74079 75604 59552 122215 147174 231620 202345 332638
19447 332638 266394 142885 -237 -156164 -181732 -301601 -206371 -210814 -236045 -133392 -257778
19436 -257778 -492445 -368710 -252915 -46051 -67548 -118595 -227804 -408285 -209940 -273382
19426 -273382 -422155 -569482 -396672 -436612 -294921 -242215 -256444 -131328 -185365 -429463
19416 -429463 -407746 -482209 -608854 -568309 -341412 -135733 93850 -37132 123381 187290
19406 187290 258575 241381 158379 276113 448721 449350 250454 224305 206964 95941 286858
19395 286858 54099 45397 103913 98893 79139 34926 165893 132255 86859 68901 -15703
19384 -15703 -34733 -103844 -11718 -46889 202437 555591 354995 52910 -122024 5861
19374 5861 124812 75342 149507 78913 85951 52927 -154145 -101372 -33397 195670 458343
19363 458343 508259 268665 310902 264947 127927 -73363 -89228 -150458 -228905 -225339 -34519
19352 -34519 35053 116511 190398 274015 417566 451318 425303 233935 -59214 -261374 -30717
19341 -30717 200281 424574 462511 380167 366715 391678 566102 600791 860738 816661 943419
19330 943419 883222 856598 832860 772712 957938 819824 705880 727324 1041227 922170
19320 922170 760466 661535 716314 807559 577925 512624 316198 59404 -26599 -288937
19310 -288937 -293462 -162027 -67770 96160 457009 481574 723476 1165515 1237528 1325142 1167557
19299 1167557 916332 912452 1082048 898501 803028 794841 902299 1020386 1005907 689610
19289 689610 292475 186398 75622 149292 169956 116791 237418 394430 265933 206289
19279 206289 362966 133149 -158511 20178 266628 355927 262184 -13640 -22411 9017
19269 9017 248343 438856 227143 258743 194087 155502 192355 333255 3706 -236786 -206603
19258 -206603 -132025 7876 167371 151713 69181 11330 -10728 -111887 -56738 176901 429968
19247 429968 494421 356954 164765 -47502 68537 41178 171228 307903 173570 -49257
19237 -49257 -79311 166007 140300 -100142 -66167 130496 166422 122863 226111 511796 595725
19226 595725 652332 280680 105585 121535 147723 261409 346796 382720 121865 26443 201708
19215 201708 322200 290255 233334 -82461 -327806 -329687 -146346 -16308 45849 91987 325917
19204 325917 336208 260619 450893 411726 306410 99074 180952 -6590 8929 331251
19194 331251 285789 292150 298899 174238 115975 -21341 77838 9468 -43180 17596 105742
19183 105742 191944 209928 243869 87659 95394 278572 155564 299427 382609 307379 362549
19172 362549 399205 439766 375851 207006 -59613 -72963 -71759 115727 337235 305303 502403
19161 502403 476132 264551 185747 418032 482883 343933 153895 70225 -72910 -150815
19151 -150815 -3575 20176 25051 -77299 -180505 -123626 -122380 101287 304301 23982 -83231
19140 -83231 3996 -84906 -88385 80231 40591 -43148 6660 17855 19317 -246314 -213135 -58143
19128 -58143 89592 169756 84016 -39637 -24076 173108 216177 323226 349856 296201 188996
19117 188996 -18108 -125656 -384179 -342813 -173381 -5563 160611 121918 -16544 158139
19107 158139 319509 50263 -71297 -189710 -273728 -235377 -142123 -15581 -42958 -17147
19097 -17147 -102913 -36054 79559 -84107 834 643 -23624 146221 292857 89763 91639
19086 91639 163853 57031 30340 -64744 -161715 82434 -99771 -112065 -165011 21723 284485
19075 284485 173408 72465 155624 268593 561926 680479 679887 607709 366574 267237 292862
19064 292862 410902 306056 357629 394046 378650 16780 -46245 -204545 -201870 -299921 -93490
19053 -93490 221371 253069 49594 -60076 -166464 -16752 258871 386913 480888 565174
19043 565174 406106 478335 464633 524656 269152 190417 260182 301534 363416 249108 331265
19032 331265 298904 80472 74372 406495 570257 518009 344224 242841 65879 -126178
19022 -126178 -95106 102592 428184 497243 525927 439686 754457 904753 874836 594594
19012 594594 499686 505248 494721 743484 586291 597809 546438 748696 743060 392276 291843
19001 291843 364247 557561 749076 679894 476764 460198 431002 547751 250334 204679
18991 204679 319724 438373 558016 580876 571799 544656 633590 443783 386906 443627 400445
18980 400445 341280 382924 419105 582670 496296 210837 24594 119055 273175 322799 378673
18969 378673 275471 380366 591925 443379 268287 237865 385358 339423 277185 594836
18959 594836 716780 604759 425643 500855 685636 522400 726824 841014 747638 868270
18949 868270 786511 890211 1044322 694248 678578 759122 583549 543362 465970 362963
18939 362963 385358 357806 331593 515168 759747 734105 640308 643206 786811 924453 573513
18928 573513 475370 668744 672541 502762 521585 677207 752033 623133 360086 243040
18918 243040 498163 682402 967512 1205807 1243627 1119634 1090780 1142266 1119450 1210286
18908 1210286 1217369 1381425 1653977 1777321 1825498 1754410 1821209 1879817 1744896 1915054
18898 1915054 2060498 2161068 2075155 2010153 2138181 2311426 2224797 2073757 1980206 1733464
18888 1733464 1886122 2149234 2075492 1712481 1464598 1617965 1884554 1947706 1866628 2003769
18878 2003769 2236210 2528040 2883042 3250151 3303428 3168137 3212899 3175173 3268238 3310164
18868 3310164 3410108 3423813 3262233 3140372 3218158 3295247 3385889 3211715 3083828 2984434
18858 2984434 2668632 2668830 2641371 2601821 2522639 2433053 2335769 2114538 1993084 1808879 2037095
18847 2037095 2240414 2360110 2490466 2574141 2552470 2925987 3086796 2795042 2490271 2306993
18837 2306993 2697148 2741196 2557341 2546350 2518455 2670670 2711382 2718655 2808569 3131832 3093122
18826 3093122 2766408 2599679 2826113 3078707 3071885 3290871 3449161 3737603 3785242 3673068
18816 3673068 3817947 4073243 4322211 4345975 4542771 4872691 4954394 5183260 5304939 5490527
18806 5490527 5831330 6368843 6953505 7187716 7572785 8072218 8638914 8825384 9045313
18797 9045313 9246626 9512546 10053685 10492311 10837282 11511176 12244094 13447909 14927135
18788 14927135 16324496 17777821 19655326 22031328 25065919 28981547 34443516 41777124
18780 41777124 51573298 65067787 82990298 105208456 128562597 147557380 157661436
18773 157661436 158817362 152116775 141437302 132566822 130431049 136608492 148753393 161141042
18765 161141042 167784475 165524602 153953678 134904190 112597886 91780025 75225408
18758 75225408 63460539 55538387 49774695 45830963 43819473 43336118 44514418 47576292
18750 47576292 52475996 59834582 70519997 85439607 105422569 128772576 150294200
18743 150294200 164738089 169605727 165295056 154556982 142563420 135251697 136225049 145199819
18735 145199819 158240799 168424104 170101456 161982184 144961097 122091172 98154476
18728 98154476 77599348 61690122 50018280 41823810 35500789 30639824 27064214 24058498
18720 24058498 21683618 19882499 18314001 17034861 15913842 14920067 14196144 13445863
18712 13445863 12712391 11983398 11533423 10919807 10411779 10042010 9830475 9672427 9321406
18703 9321406 8829043 8180695 7670586 7171554 6596978 6345464 6125670 6009990 5769116
18694 5769116 5450664 5171898 4999220 4775535 4529742 4196089 4086235 4062521 3997036 3887862
18684 3887862 3628541 3286901 2793929 2500080 2313549 2570406 2842692 2882983 2867927 2474821
18674 2474821 2375225 2294503 2173021 2085535 2130660 1815394 1733276 1919387 1944260 1622583
18664 1622583 1560274 1521300 1550301 1563763 1268162 1187212 1346910 1415554 1476278 1267802 1011385
18653 1011385 1094864 977066 1056941 1027919 919053 707727 551525 689739 632145 850522
18643 850522 942470 1178433 1313323 1193569 1045853 968667 770573 691559 689933 645877 650675
18632 650675 593226 525591 658294 720159 516425 572861 572679 453726 341883 196389 222426
18621 222426 533152 693655 545448 357078 389365 540541 644575 606208 621617 672737
18611 672737 490524 386476 75372 80224 351335 224777 61187 12212 282691 475908
18601 475908 353587 267216 305548 334115 210993 122986 101294 -49032 -135343 -233965 -136296
18590 -136296 -98858 -167445 -41813 105753 148188 421808 468735 309994 212131 409197
18580 409197 409694 164766 43343 109279 116253 137337 -58625 -91187 169270 301667 197039
18569 197039 30134 2287 -82314 -273037 -374917 -275875 -344088 -44567 -374 95479 92676
18558 92676 210102 -25947 -173697 -283117 -416883 -192396 35047 -104169 -292126 -221827
18548 -221827 -325097 -93040 99381 46742 129197 144833 101725 193447 4787 -232773
18538 -232773 -294490 -297069 -198732 94025 297361 227704 141981 161696 72541 -133505 -177880
18527 -177880 -144280 -72362 -109497 -170150 -300789 -298503 -217084 -323732 -273848 68683 243868
18516 243868 185095 -173149 -287653 -69026 139853 138927 8631 -389191 -471590 -512619 -338737
18505 -338737 -329102 -217757 -73730 -61650 -11374 51862 37922 111831 21298 -130692 -52995
18494 -52995 -221893 -269441 -355311 -362049 -311399 -193223 -149124 -158841 -221528 -152353 -115428 -232838
18482 -232838 -391292 -422563 -528082 -220987 -60380 -317735 -500404 -513128 -456629 -159376
18472 -159376 53479 -164757 -143842 -149474 -201367 -155949 -315753 -397422 -319682 -240865 -152955
18461 -152955 -225930 -299153 -211350 -12093 -178302 -55015 82881 13402 270501 455505
18451 455505 312079 94198 -26753 -135352 -173202 -187252 -169989 -406448 -270930 -113722
18441 -113722 -142828 109048 123671 -87098 -159254 -209908 -252273 -269479 -63579 198594 160035
18430 160035 109336 372 19686 43016 90354 -86798 -40259 -32071 -200611 -324936 -299263
18419 -299263 -272258 -339671 -370626 -50467 161129 252610 350136 279799 142053 96284 -56981
18408 -56981 -44321 62982 103472 -159579 -282316 -245112 -101978 -31220 -108213 -244205 -161020
18397 -161020 -148054 -72152 -132887 -338270 -318147 -147534 -39764 -175788 -133488 9748
18387 9748 105836 116860 401649 423797 262801 332294 284670 206957 237145 239855 115155
18376 115155 71195 253957 363035 267394 263224 107886 47300 293653 270053 152420 208926
18365 208926 234586 71428 -343035 -454752 -202884 -110143 -128654 -184666 -158538 -131363 103823
18354 103823 130321 -23650 -99532 -225994 -123740 -117235 -123081 -407411 -422459 -317544 -484362
18343 -484362 -430932 -362547 -302617 -264336 -151087 -145280 -322789 -378410 -336679 -272142 -134644
18332 -134644 -237374 -322252 -344187 -281109 -136628 -203136 -296270 -463937 -426609 -260696 -221785
18321 -221785 -70217 130522 78692 -4254 -56851 -243896 -387914 -263565 110073 271459
18311 271459 244027 15742 -74799 -19758 115659 232241 203764 -28887 -44032 113080
18301 113080 240764 99593 -37920 -95887 262781 -15427 -141796 4110 43715 5909
18291 5909 154887 226591 -18184 -194923 -23174 164349 71603 -61638 -24214 198270
18281 198270 522849 442078 406434 445340 329162 172707 69590 216220 188298 22446
18271 22446 113273 236392 402607 352013 114259 268276 319107 90913 37024 328171
18261 328171 304393 192735 18453 54603 249490 378392 73918 117876 355932 593145
18251 593145 659849 457445 346357 433002 353705 406973 444734 426210 464148 461370 463922
18240 463922 593959 490814 452712 394572 400820 331706 277167 261560 439421 453888 356137
18229 356137 275653 311843 140912 237915 503761 588832 600547 403019 248127 354551
18219 354551 523079 708855 680977 605448 457087 351015 537808 954809 842988 828476
18209 828476 1062203 1220095 1260151 1176858 922346 948946 1011858 1089642 1187864 1224675 1056334
18198 1056334 925492 702846 402620 319153 523242 588776 495252 384364 420627 163081
18188 163081 254495 514249 639695 597155 490980 420238 595431 691689 822379 1056741
18178 1056741 1375877 1501069 1356015 1238399 1137383 1204483 1435778 1697422 1808633 1734007
18168 1734007 1724157 1796735 1941564 2120376 2373047 2410565 2291948 2264816 2269047 2090452 2132135
18157 2132135 2176856 2112087 2025717 1892892 2042348 2113363 1841626 1848798 1817890 1793268 1778619
18146 1778619 1999090 2175122 2134791 2015276 2185250 2354124 2666863 2891024 3041631 3051773
18136 3051773 3129029 3432512 3832760 4259383 4591921 4908528 5145530 5530567 6155189 6819237
18126 6819237 7365529 8324501 9668783 11162757 12857126 15079793 18067330 21935884
18118 21935884 27399013 35662388 48294675 68470685 102002776 155234540 223578167
18111 223578167 276023734 293069064 280463200 243848698 181123312 121244967 81299110
18104 81299110 57621112 43343981 34292939 27771766 22939084 19429456 16960508 15157576
18096 15157576 13546872 12369642 11273629 10184122 9108194 8369333 7653497 6900393
18088 6900393 6188809 5369757 5253305 5185571 5000913 4887058 4510176 4122455 3826730 3547956
18078 3547956 3277304 3039592 3041288 2932732 2868637 2815542 2873658 2820650 2776920 2792970 2757906
18067 2757906 2316338 2176306 1852756 1652681 1725364 1542566 1290949 1213334 1261258 1232985
18057 1232985 1068881 1069975 1095935 1211727 1234766 1105193 1021820 1144149 1120593 919679
18047 919679 912009 813186 940613 1148685 1304099 1296362 1248727 1028155 789223 691311 816563
18036 816563 692488 751096 712054 571217 691687 811232 738669 568623 254930 246487
18026 246487 337277 456892 372230 241997 456861 922074 1091616 981713 810751 526496
18016 526496 618874 729299 735473 700623 600277 352131 161962 356483 382017 286586 392289
18005 392289 374228 642653 753308 730893 731545 615271 379493 280678 298811 549240 402988
17994 402988 496189 337714 301798 486948 671512 557646 202607 198872 462375 866313
17984 866313 796178 496522 435371 274059 259397 223229 16516 19462 83168 -58769 234289
17973 234289 577518 558372 332140 -42529 -206772 -99222 55949 24414 -47098 8382
17963 8382 164581 326830 307716 321219 101400 -186067 -70767 -1571 -47601 169134 -42068
17952 -42068 -254548 -392677 -146443 -16206 118050 373283 285278 275853 270270 315187 600472
17941 600472 645031 409814 -15975 8930 113186 21042 -146016 -126995 -73435 -271451
17931 -271451 -349167 -121175 57642 65207 -163010 -290433 -293506 -220421 -179886 -254793 -253861
17920 -253861 40307 105299 39834 -138713 -448487 -509282 -377997 -334127 -228633 -126100
17910 -126100 207047 200842 118849 135971 338397 526031 405731 275306 173160 42713
17900 42713 -24569 -218782 -463388 -490207 -234060 173644 267092 428629 186785 46153
17890 46153 37249 151295 139842 -28798 -143367 -60695 -91112 55315 -18780 -35513 -41887
17879 -41887 -115483 1834 -111542 -248272 -347482 -149029 210450 315566 307556 298307 211059
17868 211059 49073 -33031 14727 -27851 25239 22528 -84920 -102430 68293 69122 -61095
17857 -61095 41049 -43996 166952 208333 272099 158128 37516 -99872 -58139 -76128 -160151
17846 -160151 -107137 -48124 83081 98210 122631 321480 431892 153463 -42132 -63449
17836 -63449 298116 520275 431910 626259 567137 444898 591441 467804 340687 414188
17826 414188 322875 154579 230805 355999 457211 412267 249146 182281 369213 443081
17816 443081 329558 169192 201869 504735 632876 590740 551103 1006005 1292469 1474593
17806 1474593 1562952 1515505 1316302 1027557 785587 939543 989235 1117807 1205094 1138382
17796 1138382 1436445 1718257 1664377 1475194 1419380 1512096 1514949 1289842 1065450 993753
17786 993753 868535 761657 598764 594890 827505 900212 681633 560019 670792 752264
17776 752264 882801 1015126 1048193 1224499 1318991 1299122 1107698 871473 911117 1143303
17766 1143303 1066695 1064066 1154630 1328549 1440722 1427492 1683166 2047307 2272871 2399143
17756 2399143 2649364 2571930 2417159 2143071 1859198 1664132 1516214 1548428 1780883 1973868
17746 1973868 1853658 1638958 1665075 1687827 1539391 1671198 1815805 1739709 1610729 1536540
17736 1536540 1446504 1106953 1046474 1060665 1170111 1395845 1313492 1221060 1161796 1261560 1188539
17725 1188539 1181202 1257583 1392944 1196074 1351603 1688273 1708684 1786150 1967979 1899383
17715 1899383 1771714 1805913 2029653 2299437 2379791 2222197 2016082 1994285 1961929 1992387
17705 1992387 2073481 2281361 2524336 2357198 2402609 2430935 2368908 2428962 2456572 2433478 2416520
17694 2416520 2279409 2482693 2632804 2854128 3250153 3486162 3672762 3838970 4072711
17685 4072711 4394927 4887619 5358016 6180194 6891408 7161147 7511089 8099461 8545101
17676 8545101 9175337 10033274 10981249 12091146 13566871 15508313 18097667 21170100 25621540
17667 25621540 32259905 42668540 57683705 76148416 95078446 110617209 122716582
17660 122716582 132048252 138486267 141334305 141459379 141382602 142600979 143570189 143444564 142775197
17651 142775197 142698567 141474087 137447108 129586010 117903897 103326559 85881601 67750340
17643 67750340 52490058 41471702 34058503 28988363 25562369 23356003 21966443 20883662
17635 20883662 20234137 19528875 18669504 18148938 17984332 17832912 17526560 17520161 17675275 18164127
17625 18164127 19013341 19983746 21380062 23160862 25449270 28734574 33616068 41035973
17617 41035973 52243933 68731639 89946405 112209986 130867107 145269526 156319701
17610 156319701 163753776 167149897 167321264 166981774 167682241 168214330 167560596 166398619 165428199
17601 165428199 163984676 159683057 150947376 137933550 121125891 100972777 79210099
17594 79210099 60447901 46621677 37061497 31101398 26857500 23437283 20839707 18672981
17586 18672981 17092079 15695240 14376806 13563698 12730511 11838401 11159704 10284424 9557072
17577 9557072 8680077 8050840 7704973 7220796 6749508 6542959 6478618 5972573 5550905 5225462
17567 5225462 4759867 4401010 4147952 3950004 3840229 3701701 3531334 3677851 3813891
17558 3813891 3721824 3406829 3474850 3550608 3592234 3416812 3282808 3540043 3718919 3773626
17548 3773626 3559525 3096306 2902659 2720301 2362325 2228329 2195636 2119708 1955365 1749463
17538 1749463 1686275 1649443 1610822 1606302 1441368 1206869 1420638 1565651 1645605 1706486 1624570
17527 1624570 1371589 1393137 1407269 1263353 1180643 1303042 1568108 1903626 2155790 1874442
17517 1874442 1466965 1414715 1244825 960376 1005529 917886 917057 867033 541607 105865 1913
17506 1913 199016 395772 788652 805253 1027588 1112540 1118360 1037629 731985 755462 459849
17495 459849 83025 -239344 -181012 167251 25782 195987 189590 153520 400995 749239
17485 749239 783681 484052 443787 594719 538639 651416 696738 755366 463761 144215
17475 144215 138894 132419 361244 377020 297033 497965 900621 1080830 1080643 921992 623151
17464 623151 348228 465206 573032 262080 111429 20813 -103082 -221668 -326902 -92295
17454 -92295 200787 229371 308137 532677 570876 602091 776490 1078037 1372216 1746751
17444 1746751 1663221 1542884 1434838 1164259 714774 135824 -262652 -150346 210753 152516
17434 152516 119427 139351 26388 -30832 -63586 -190210 -278651 -170803 -231789 -233366 -121405
17423 -121405 -78911 -104116 82481 -27666 -55037 -219082 -299827 -341116 -283668 -353807 -234214
17412 -234214 -219338 -146566 -126703 -373088 -326636 -245231 -372621 -329041 -265546 -246506 -127027
17401 -127027 -283678 -385790 -352963 -58031 6242 -92 -63248 57115 140366 176762 200830
17390 200830 80535 61158 173776 176969 47698 1160 -114977 20933 190958 178020
17380 178020 51774 180980 96514 11573 -45968 -323193 -466102 -276211 -99208 -124795
17370 -124795 -86385 -168786 -198076 -212469 28918 269745 263909 205675 57783 -107259 -104870
17359 -104870 7812 -220546 -226673 -164084 -249158 -227052 -404087 -300028 -433209 -615606
17349 -615606 -604458 -401501 -279799 -225233 -305452 -565193 -575439 -217987 21006 -120336
17339 -120336 -185277 -42267 241353 224541 330337 8019 -281802 -255789 -3866 6889
17329 6889 -38659 69680 284403 -200602 -305356 -216141 -78825 -133023 -207762 -138529 -195689
17318 -195689 -224338 -284762 -145506 85851 79141 161789 -27795 -124907 -212304 -454130 -474005
17307 -474005 -176171 35545 -149186 -247735 -357874 72494 222818 -107747 -259195 -253518
17297 -253518 -252300 -308407 -47191 229832 351156 155524 239454 342904 385968 219075
17287 219075 -126898 -140890 10485 12660 -130458 -286418 -344085 -407173 -290510 -165288
17277 -165288 -194550 -103416 -88470 -261493 -291636 -290785 -434360 -436280 -382927 -358086 -189260
17266 -189260 -267197 -202198 -218577 -254096 -28554 205868 177309 213790 -31942 -165423 -139648
17255 -139648 149061 198660 150189 -46734 -127871 -14010 -86091 -81703 63496 158176 165742
17244 165742 19689 -2437 -160782 -84727 55662 399080 434695 170654 -156656 -181949
17234 -181949 20850 95341 143873 20551 -94609 -11772 184014 428626 324283 319685
17224 319685 318357 62585 -47478 50181 -59575 -160685 -38726 -89224 -62528 -46310 -72350
17213 -72350 -86687 -82539 59637 214684 107293 3941 65785 101458 -31187 551 54086
17202 54086 329137 262992 206956 218735 248436 486678 572330 455864 488042 441917 287127
17191 287127 356872 379869 346489 428454 289053 -34502 18491 -23043 -102171 -101911 170207
17180 170207 276228 -142427 -356982 -81423 198041 181398 230898 152873 155962 348366
17170 348366 536827 350287 235703 460222 684235 948564 1350073 1682061 1804472 1923539
17160 1923539 1948105 1841322 1762219 1589243 1361914 1281002 1498539 1326940 1171044 1408015
17150 1408015 1204200 994306 1032360 1173733 1380258 1488092 1165982 1296258 1519764 1403954
17140 1403954 1321395 1361315 1450062 1619152 1397804 1341040 1301441 1452403 1813792 1949941
17130 1949941 1889950 1964405 1900693 1927612 1644180 1253112 1057469 744513 577668 505402
17120 505402 553262 569675 412625 623084 1012480 1608493 2089349 2128557 2089150 2290446
17110 2290446 2762719 2850880 2997631 3074400 3296847 3447071 3461479 3417400 3155594 2830764
17100 2830764 2565022 2470111 2519662 2484812 2487270 2451695 2259167 2256344 2349281 2025813 1684973
17089 1684973 1676321 1488282 1628964 1655795 1614073 1777446 1952108 2267977 2463321 2643247
17079 2643247 2766575 2923874 3174697 3309351 3373093 3278238 3473877 3328981 3193602 3329256
17069 3329256 3239922 3360479 3613681 3832434 4076992 4054325 4097379 4394135 4535869 4349582
17059 4349582 4520878 4971096 5316662 5761448 6311600 6859285 7138315 7672024 8293206
17050 8293206 9033011 10032698 11388859 13459066 15996477 19415000 24278249 30770386
17042 30770386 40877834 56284895 79322934 111789056 148904747 178158808 190343106
17035 190343106 184448612 162695458 129808324 96264915 70182420 52818274 41791566
17028 41791566 34500419 29940420 26922443 24422363 22655033 21019473 19637854 18569411
17020 18569411 17866650 17626523 18112129 18996936 20110680 22042773 24761364 28418836 33740773
17011 33740773 41685620 53771399 71761603 98303867 132377928 165233416 185316177
17004 185316177 187459219 173369057 146306137 113343030 84606810 64976419 52996704
16997 52996704 46371972 43335128 43092495 45465124 51115499 61427979 78563972 103860263
16989 103860263 134264376 159447615 170451106 166343731 148508414 120206598 90420252
16982 90420252 66880747 50728963 40328788 33940684 29584311 26268085 23798518 21752844
16974 21752844 19910405 18541871 17556356 16778135 16294121 16054955 16460880 17442566 18980762
16965 18980762 20955237 23592360 27655853 33788506 43471560 58153742 80221105 109254052
16957 109254052 138304467 156570616 159572035 148502246 125350033 95714680 69437337
16950 69437337 50446140 37975091 29817815 24396741 20761316 18214844 16144219 14165723
16942 14165723 12144654 10770210 9863187 9090249 8424008 7873446 7175482 6500294 6160924
16933 6160924 5959151 5817325 5623486 5415123 5317392 5464764 5262316 4840998 4359199 4009856
16923 4009856 3996283 3482255 2846264 2766821 2894094 3044610 3010843 2951771 2727353 2656436
16913 2656436 2594510 2713617 2653811 2525317 2480304 2190804 1845604 1592011 1516915 1527992
16903 1527992 1440083 1588335 1900520 1682616 1266174 1168560 1275625 1228680 1114057 963057
16893 963057 978342 1115754 1186387 1004662 928129 798411 689831 758075 951589 1033104
16883 1033104 1045438 697679 591234 705668 779672 791055 940101 754682 451211 409362
16873 409362 432046 457286 486334 451497 532350 401495 216780 114916 56897 153999 246967
16862 246967 176639 253458 474690 481933 603700 596402 261245 288839 320352 203949 317554
16851 317554 323038 268836 270178 -53419 -266 51623 -77113 31273 250323 186314 -132757
16840 -132757 1221 255592 608292 727896 493439 182116 -29654 -133952 -219570 -284233
16830 -284233 -192571 -35247 71047 48937 203065 442793 399206 126674 -178037 -122544
16820 -122544 18998 -111430 -226233 -164129 -331062 -513590 -411915 -217970 -210718 -118506
16810 -118506 -49249 -3613 213919 343159 146985 -85797 -380615 -556718 -637079 -249338
16800 -249338 -31244 -2641 25301 -56143 -98866 -161158 -205398 -198141 -15060 -133268 -181751
16789 -181751 -20089 216299 287505 243050 102223 16726 -51413 -319453 -203804 155284
16779 155284 24285 -151498 -106096 -227109 -273521 -144934 -72705 3473 -137298 -305842
16769 -305842 -96941 7495 -17937 -158090 -132007 -218514 -248853 -256224 -258785 -350152 -432770
16758 -432770 -247063 -202021 -218701 -128360 -251330 -216287 -106983 -62563 -36547 51140 -104556
16747 -104556 -66144 10977 292979 431168 399496 329313 385748 321474 183831 44722 92539
16736 92539 -53047 -48960 -2272 -160236 -533394 -436320 -253067 -197516 -96984 46571 -107259
16725 -107259 -50428 -224915 -146473 30955 137438 -138582 -94193 -199013 -395373 -379224
16715 -379224 -275297 -253755 -223638 -321013 -421014 -583521 -590007 -538878 -300291 -231698 -286822
16704 -286822 -243637 -470362 -617517 -309062 -104994 -75087 53086 -55159 -226751 -115004
16694 -115004 -64587 -179608 -168442 146244 321433 413644 281715 -116835 -316469 -210394
16684 -210394 -19128 66398 16165 313217 350037 449250 347335 254755 555460 546046 305064
16673 305064 50540 162461 360488 283028 177164 138769 5841 -69763 33519 115845
16663 115845 179684 306050 162678 -65836 8751 15384 161289 278967 290420 82517
16653 82517 17134 104381 263114 225427 103170 -55389 53955 165574 273666 325341
16643 325341 249782 68649 66385 -160497 -206407 -244019 -114238 -29963 -25409 -279432 -232145
16632 -232145 -86179 95184 276879 158704 10306 -239761 -265151 -205465 -138315 -196982
16622 -196982 -221156 -124221 -1847 -128449 -279290 -174733 -241098 -140373 129938 -68007
16612 -68007 -214330 -295162 -375079 -497712 -375328 -171945 3944 -50421 -245960 34018
16602 34018 486289 308620 229389 315811 314527 159300 -97676 -26761 -16334 12489 27850
16591 27850 -26717 -391582 -402677 -337186 -453614 -532484 -482484 -549308 -270365 78395 179177
16580 179177 268510 117636 -52738 -147457 -46808 48313 228431 382228 341046 198972
16570 198972 -30493 -298089 -247801 -174231 -176648 -145568 -59397 -209980 -4241 9878 -177252
16559 -177252 -261601 -396955 -448125 -311980 -401321 -667178 -763451 -678358 -368526 -523535
16549 -523535 -403319 -138794 -101390 142038 85870 230931 418178 121287 166845 47861
16539 47861 -15646 73890 -85030 -187659 -108471 -322691 -152823 -151997 -210888 -93157 -27878
16528 -27878 -96253 -116175 -228050 48738 209900 -34090 -146049 -261314 -195091 -110752
16518 -110752 83065 337544 625799 631872 826775 1019866 1247820 1107919 893135 441586
16508 441586 264165 230247 199391 7463 -175570 44691 353863 284981 72630 -241452
16498 -241452 -395399 -346717 -399287 -431755 -390848 -254030 -445428 -676027 -689031 -614944 -426335
16487 -426335 -270530 26080 439256 564171 620196 977781 1067529 921783 786328 510792
16477 510792 240116 181845 258534 161093 131190 73130 117591 88471 -152276 198064 709406
16466 709406 976005 1249635 1152284 697511 371961 419573 331055 366298 353237 33472
16456 33472 -38639 112424 -77333 -155365 -188659 -263590 -270437 -428802 -140646 -48432 -3640
16445 -3640 -56763 -230410 -346798 -204350 -7575 102252 106934 -106629 -296013 -206159 7394
16434 7394 350923 475410 405822 307052 331605 437693 142581 155323 162535 -224833 -391731
16423 -391731 -356742 -269604 -186218 17043 115479 -53105 -69265 -156157 -43318 -128265 -268676
16412 -268676 -326903 -577201 -542713 -593576 -422142 -173695 -301900 -497484 -563800 -401569
16402 -401569 -87610 -221665 -394842 -185219 -21665 -81727 -157170 -200627 -325848 -235438
16392 -235438 -65057 39606 38194 -105091 -122134 -132364 -179065 -363821 -389866 -256733 -261858
16381 -261858 -76889 -111059 -323353 -409542 -444804 -354854 -259057 16983 97453 109782 -58072
16370 -58072 -115003 -228677 -145590 72478 -195296 -343510 -226754 -225176 -298933 -366936 -401954
16359 -401954 -322558 -268826 -297918 -107563 -39854 -180931 -371424 -224064 -83081 -69381
16349 -69381 -188350 -282430 -614140 -712163 -658633 -389093 -33982 -27158 -108271 -370950 -355439
16338 -355439 -186144 28495 -5590 -161362 -282786 -325821 -469071 -603255 -688369 -508145
16328 -508145 -431782 -676273 -641852 -346323 -202994 -22092 -23289 -156710 41071 -61845
16318 -61845 -225307 -191820 -165090 -146316 -57674 -65699 -85452 26670 -86191 -9741 -13609
16307 -13609 -268976 -477671 -554430 -434032 -142306 -81327 -129974 -330487 -391033 -674623
16297 -674623 -817784 -653349 -491106 -427753 -312443 -96400 -118411 -363862 -267380 -142192
16287 -142192 208874 38449 24913 88340 28168 153767 107087 -58260 -362195 -466820
16277 -466820 -254275 -18155 -136651 -470043 -606392 -604297 -614222 -642651 -629096 -605092 -399776
16266 -399776 -178471 -18739 -47280 -301087 -426335 -249470 -158955 -137928 -209966 -218556 -392361
16255 -392361 -423789 -343993 -167073 -78696 -374442 -405762 -303806 -153403 98189 142195
16245 142195 -231830 -214599 31984 196938 103350 -72136 -142491 -312112 -340678 -204429
16235 -204429 -171231 -73696 -25353 35981 36751 -120166 -173919 -162703 -276145 -351898 -486417
16224 -486417 -351740 -202620 -168554 -120600 -187540 -215576 -185551 38702 108232 176215 131363
16213 131363 -164134 -631753 -587682 -407576 -44082 211564 152079 -74841 -224744 -126420
16203 -126420 31169 -164068 -386091 -544935 -633032 -442958 -224734 -243135 -415051 -344391
16193 -344391 -349554 -487007 -603967 -540067 -572584 -491343 -323905 -367200 -443203 -179339 -59643
16182 -59643 -114759 -356772 -384159 54807 88629 -137299 71045 94709 31388 -180837 -370232
16171 -370232 -430439 -372833 -309786 -216830 -85246 -200581 -258947 -284449 -71548 116985 234479
16160 234479 292612 122071 -23942 8745 202474 106229 -12438 -143997 -140262 -193008 48040
16149 48040 234589 110354 -19367 -270651 -187139 21209 -122251 -229314 -194155 -181714
16139 -181714 -2876 76569 -43830 -157743 -275723 -282713 -297731 -520257 -530080 -371167 -176634
16128 -176634 -39964 -115080 -159649 -219620 -481155 -227570 34618 25065 -97502 121893
16118 121893 -10293 -98536 -163659 -41631 -86038 -208615 -114357 -77910 70972 118117 -68813
16107 -68813 -607 -151010 -67645 21317 -87139 -73254 -53644 -129626 -221418 -143813 -60644
16096 -60644 -346629 -392628 -333343 -315647 -301347 -127506 -414311 -218886 -107311 -232252
16086 -232252 -331967 -413183 -271234 -398567 -425954 -244571 19996 100247 -132964 -56368
16076 -56368 -101224 -8728 198544 90208 -26672 -212205 -160503 -213812 -352875 -241287
16066 -241287 -8498 9613 -103095 128086 -6754 -112292 -80364 -216450 -307635 -141983
16056 -141983 -132125 96717 102964 -65025 -149723 -140482 67568 -96531 -211456 -163319 -166202
16045 -166202 -225138 -234366 -67760 94084 118198 -138858 -483988 -404094 -244324 -360346
16035 -360346 -500527 -473819 -223338 95639 162677 3938 -233208 -250009 -178066 -256132
16025 -256132 -200197 -53288 18758 299014 204798 -7498 -22650 85235 38985 -53109 75563
16014 75563 -5998 -52437 118907 140627 -243541 -460530 -590465 -419854 -360851 -238916
16004 -238916 -170385 -418901 -563166 -526348 -515146 -404622 -300916 -144765 -110569 -181261
15994 -181261 -253184 -262840 -152657 -30361 -153095 -397936 -485578 -331406 -466537 -397420
15984 -397420 -353161 -398180 -375007 -641628 -504248 -362737 -418319 -348681 -263415 -140469 -126929
15973 -126929 -235919 -337847 -398661 -434340 -496238 -468843 -376247 -503350 -407842 -335973 -459459
15962 -459459 -434121 -243900 -218795 -252685 -240770 -46181 167163 120051 -37827 -72654 -30255
15951 -30255 -376212 -355594 -171517 -148838 -273708 -127320 28017 -51110 -164163 -113008
15941 -113008 -240442 -238864 -25935 131782 194911 147329 199267 284454 228199 -68783 -203150
15930 -203150 -207061 162482 361361 185468 102791 -66270 70670 -28555 -63644 -49298 -230320
15919 -230320 -160876 -1955 147051 164586 204863 352355 233504 135685 -68106 -169654
15909 -169654 -337696 -305142 -192947 -193397 -301540 -326004 -330718 -340770 -346288 -67986 -161951
15898 -161951 -285622 -426848 -248589 1962 17601 -426446 -497234 -308224 -277113 -183259
15888 -183259 -41217 -67411 -65069 -66397 16579 -201917 -120163 11493 -129664 -499781 -489367
15877 -489367 -269656 -146373 -224419 -330646 -214845 -199846 -171641 -53012 -96642 -140043
15867 -140043 -100454 -60948 -221811 -243733 -94331 24255 -39849 -36895 148375 539168 649481
15856 649481 386933 113405 -221520 -72892 66243 183370 276827 128035 -76030 102079
15846 102079 196792 235619 585078 512359 169212 140651 222048 373288 415267 352308 379387
15835 379387 679967 598765 406623 122181 53824 45760 175836 282372 79643 220713
15825 220713 741039 698824 541572 558427 378095 40398 -192784 -79673 121409 163575
15815 163575 146425 172893 5430 -186958 -327818 -255515 -136968 69085 117980 158375
15805 158375 285507 384817 504809 626014 826289 665468 621911 762826 766326 609619
15795 609619 647469 504233 315511 437721 437904 559951 510289 420759 234330 140972 165185
15784 165185 223649 541100 1125366 934414 328289 73932 44630 142114 121221 192806
15774 192806 190721 -11545 -28739 126171 276709 144194 103747 77664 -103625 121923
15764 121923 362518 186231 152183 308311 371988 340709 227242 147179 128067 -77257
15754 -77257 -395797 -236470 -63880 -55662 108812 180399 176011 150896 109774 64678 -52171
15743 -52171 -150472 -97808 -191911 -204444 -124451 106949 242165 2290 -79685 118506 363305
15732 363305 328857 285217 249825 -243566 -392372 -504458 -529377 -313540 -180921 -71988
15722 -71988 93880 202983 160316 -67754 -134566 -266838 -284202 -241018 -202602 -6070 -73245
15711 -73245 -111838 -239231 -125763 -119432 25592 46257 23966 -146475 -169427 -178414 -244040
15700 -244040 -368928 -572713 -417364 -507972 -613641 -502412 -237478 -35694 -52144 -349222
15690 -349222 -269904 -311572 -289925 -196380 -61727 63801 -19283 -204268 -177990 -63741 -194
15679 -194 138865 -109980 -166331 -218080 -306536 -209460 -158914 -158736 31241 104559 -269 -130375
15667 -130375 -384684 -249652 -134227 -172935 -221794 -253051 -126 520 -39242 -39386 -38912 -87096
15655 -87096 -27177 75584 -145170 -366041 -252077 -187519 -142428 -232379 -553242 -346818
15645 -346818 154674 332614 33971 -238173 -424214 -213366 -67822 40236 111339 -216065
15635 -216065 -255077 -333152 -639016 -410890 -174492 189557 246210 12270 -136894 -19889
15625 -19889 -60243 -262174 -368735 -517683 -361619 -147692 -292912 -410061 -558570 -490913
15615 -490913 -375077 -399637 -473021 -519504 -380401 -473575 -512545 -446429 -347217 -287743 -223854
15604 -223854 -206879 -149537 34657 -184297 -323233 -424065 -420837 -399015 -239153 -259673 -134619
15593 -134619 -49166 59537 49896 -205805 -44972 -127806 -345143 -283533 -467809 -560487 -710593
15582 -710593 -465586 -370016 -203262 -363031 -541949 -335103 -229480 -340329 -279834 -62380
15572 -62380 129700 75821 -119905 -165316 -316839 -517845 -542086 -476565 -381987 -363016 -315098
15561 -315098 -307441 -387842 -584741 -539075 -610427 -597780 -444994 -342258 -428862 -183548 -200089
15550 -200089 -364747 -554665 -602613 -434240 -407779 -516076 -504519 -620419 -643889 -512891
15540 -512891 -231506 -163351 -165282 28117 -137477 -294914 -227621 -389791 -424304 -297499
15530 -297499 -179105 -462078 -498373 -403713 -315414 -200926 -250934 -278244 -413239 -461793 -391112
15519 -391112 -436131 -247740 -314582 -563562 -490612 -231965 -199666 -436646 -390490 -461438 -672976
15508 -672976 -725890 -344229 -117403 -12821 -129803 -275321 -141640 -113643 -330071 -480071
15498 -480071 -567304 -683797 -501491 -272476 -316331 -318414 -179244 -321467 -222078 -243679 -353459
15487 -353459 -439894 -584894 -638105 -426604 -212624 -247390 -483438 -461684 -321538 -186195
15477 -186195 -80501 99549 29423 1055 40973 89456 103359 222487 221123 111800 91785
15466 91785 94922 -397735 -704568 -715281 -403531 73355 159601 -232745 -243826 -272819 -277503
15455 -277503 -387280 -496943 -344926 -146790 -106811 -102004 -372285 -515743 -483084 -330742
15445 -330742 -113122 -134773 -283731 -394050 -621693 -467383 -182099 -451012 -607695 -435685
15435 -435685 -528545 -456602 -187581 -39721 -91702 -177727 19445 69204 88465 203580 15880
15424 15880 -59666 -5619 -28533 -499092 -627558 -854623 -981752 -658915 -432917 -276680
15414 -276680 -488835 -413516 -193266 -197591 -225953 -58724 -12790 -200481 -314050 -229572 -378199
15403 -378199 -549299 -417494 -214674 -198328 -232050 -214920 -251070 -170325 -440034 -604354
15393 -604354 -539706 -275703 -518136 -617908 -560057 -386428 -423601 -506997 -656632 -659342 -542199
15382 -542199 -482715 -436435 -320510 -198911 -182913 -295815 -98657 19044 -15286 -256200
15372 -256200 -300424 -161895 -100250 71781 88577 -169628 -275352 -345275 -557052 -643840
15362 -643840 -642484 -501328 -213909 -348218 -488338 -267470 -146622 -205085 -205009 -4577 100864
15351 100864 148493 200470 -50097 -31161 -99014 -285980 -304541 -349711 -301502 -52040 143882
15340 143882 -196680 -39907 50592 -11421 -190101 -522817 -300570 68025 100926 132762
15330 132762 182672 45786 164196 52952 64335 -32539 -179667 -214517 -210984 -51120 -55367
15319 -55367 -353290 -276583 -59006 -108156 -167621 -237248 -48974 -65032 -90380 369 -109512
15308 -109512 -165849 -344282 -648323 -690324 -344799 -12006 219951 129628 -274310 -441545
15298 -441545 -349422 -271264 -281278 -191878 -113796 7439 7311 -359487 -227400 -254700 -130413
15287 -130413 -346785 -575085 -517207 -230510 -255227 -144788 -105067 -249315 -492483 -307252
15277 -307252 -310508 -308337 -80941 20235 131426 121229 232216 387573 218376 -48489
15267 -48489 -298594 -328147 -154429 -143482 -299474 -361240 -323469 -171852 -297665 -551092
15257 -551092 -359156 -84064 -24771 129360 -7021 -246802 -264804 -374538 -240405 -79201
15247 -79201 -58583 -158365 -394572 -453757 -407578 -309081 -320059 -396591 -303133 -134364 -164069
15236 -164069 13940 393090 254672 48529 -83072 -98670 -98077 -122356 -104801 -160793 -211784
15225 -211784 -189373 85797 69911 -96777 158486 139548 -73677 -90311 42514 -77563
15215 -77563 -121351 -326503 -559093 -481758 -160362 -176710 -97266 -322907 -375070 -402184 -413615
15204 -413615 -383874 -470611 -559917 -625052 -428113 -130978 167605 189068 231339 187680 100674
15193 100674 41280 61367 58899 56026 -214558 -313131 -402923 -497415 -356554 -291222 -409797
15182 -409797 -477257 -359446 -176633 -78295 -29819 -164805 -434446 -164495 -129579 -240755
15172 -240755 -305104 -116335 -116276 -142858 -122019 114134 122379 82806 46198 -812 -228910 -397300
15160 -397300 -71526 -101299 -200158 -275132 -37354 69945 53266 28258 -254227 -388743
15150 -388743 -413160 -252022 -220871 -504284 -751489 -685050 -427689 -429447 -412911 -26849 -64478
15139 -64478 -314283 -287155 -94364 92261 -98006 -22244 -266517 -185881 -20170 -145165
15129 -145165 -271602 -44652 84238 95220 -105438 -495589 -438646 -342383 -384396 -178979
15119 -178979 -99823 31857 136056 111296 91668 -1325 -486752 -776478 -627407 -430658
15109 -430658 -313008 -301777 -223423 -322890 -433241 -190454 -75101 -176533 -261409 -127036
15099 -127036 3087 96034 -128552 -326653 -399332 -260798 145228 12554 -236930 -98101
15089 -98101 -1998 -275581 -531934 -450542 -388619 -287311 -190450 -127459 -165479 -68160 -112668
15078 -112668 -243400 -432618 -403518 -348801 -427958 -246225 -101550 -259862 -305612 -165006
15068 -165006 215263 141937 -102454 -119072 -189914 -69608 -171558 -160125 -208709 -330960
15058 -330960 -304546 -123420 -131013 -153659 -42131 -165797 -380938 -364296 -208765 174554
15048 174554 259583 235288 78826 22140 1498 -293756 -292838 -221253 -177971 -98182 -420
15037 -420 133425 278369 151313 110687 171668 104984 37544 -77497 -39278 243562 280738
15026 280738 281566 95339 7319 -39950 -16140 -124737 -117972 -6933 296625 291377 6719
15015 6719 -118417 28761 -98941 -189311 -147150 113789 382534 337194 316151 123842 34075
15004 34075 -57904 -33084 14136 -140674 -379400 -166655 -228442 -247100 -236953 -61078 45483
14993 45483 -53542 -30943 39547 -123653 -252433 -2470 77460 9221 159683 254819 313417
14982 313417 258823 69300 -3583 63062 23496 107622 224238 -86511 -97345 -84011 -7914
14971 -7914 70204 123395 62228 74784 119903 19697 35892 278750 374213 206097 165192
14960 165192 321236 589123 592079 404822 251364 275813 334049 235111 170550 361365 329187
14949 329187 251028 229700 341511 341697 257669 123248 147150 169461 202616 417598 605632
14938 605632 452455 210649 180460 266932 413881 293284 97541 177533 469553 556677
14928 556677 583648 432318 447658 590763 840049 1002731 1045152 848110 599258 361143
14918 361143 451183 662695 1039424 1150779 1081941 1060400 1089657 1108339 923110 581111
14908 581111 380643 581496 762113 882978 1012750 1007646 901719 1057772 1198384 1057256
14898 1057256 1058863 1008922 968470 949878 1010470 1035183 1008000 1037874 1099453 956410 811222
14887 811222 663696 792588 905340 714644 742666 805395 875916 871655 856862 1079219 1135200
14876 1135200 972170 824120 739581 465266 213431 167292 173305 258484 122285 223005
14866 223005 212040 265515 380073 459552 383290 173918 96137 100805 72704 75227 125660
14855 125660 255262 353033 367257 452702 294757 299855 390892 312384 270541 307194 223759
14844 223759 327311 313783 486149 434666 98957 -176643 -67912 89018 128930 403632
14834 403632 680339 520649 51713 -148859 61834 315542 166776 -138683 -125673 -250877
14824 -250877 -137140 163067 -81030 154500 419382 343803 201617 271376 260512 364768
14814 364768 272861 208969 161408 245121 418994 586599 610473 245138 91147 117758 223550
14803 223550 208306 70520 75599 -23173 -90187 103136 132323 -178278 -130832 98046 216739
14792 216739 136298 -8959 -125582 89566 232378 228885 69620 107175 100219 360210 420482
14781 420482 226136 166928 168516 312463 203477 62108 58152 307355 421563 297470
14771 297470 172585 56362 156529 49305 -95280 173260 283111 395084 364106 286475
14761 286475 189767 149033 66725 -242617 -257830 -3867 255369 4734 -116911 53531
14751 53531 85843 2382 -32257 -53273 -194047 -300294 -63963 282175 419442 277253
14741 277253 -99875 -221102 -149805 14569 269910 324883 324747 249606 314216 462565 53022
14730 53022 -108558 56962 104756 252483 359720 413428 579699 609269 371173 287320
14720 287320 322298 582984 482942 403183 240770 -3294 -203730 -51183 49766 133653
14710 133653 343399 498312 666214 849132 672902 448960 411605 328168 516315 700300
14700 700300 684799 691359 437196 286109 383959 662628 526525 349366 323268 580540
14690 580540 514135 515306 496029 617901 541359 419722 587283 708339 605943 490981
14680 490981 359560 284575 257164 469452 764352 930879 817911 643182 509329 648279
14670 648279 633779 622792 349705 83702 37259 409530 585014 394723 363828 461975
14660 461975 626423 636709 604477 587393 523309 496816 412221 445477 541538 504516 509230
14649 509230 456301 417533 357181 409716 491568 441610 658091 810101 505543 404079 544084
14638 544084 839820 1206086 1141122 939828 797395 732972 1036898 1379516 1282012 1259471
14628 1259471 1114758 1139864 1064496 1112027 1285570 1482896 1536482 1520446 1550816 1509985 1324541
14617 1324541 1373204 1322653 1356340 1301499 1329165 1466763 1618656 1556370 1379870 1286766 1346520
14606 1346520 1437031 1429051 1664124 1842624 1817449 1685414 1511302 1420985 1409833 1422823 1564445
14595 1564445 1729791 1642099 1384328 1237043 1452413 1463010 1520092 1499679 1319115 1309989
14585 1309989 1194302 1319455 1336066 1420698 1696622 1618726 1686569 1800887 1763280 1663207
14575 1663207 1526233 1571278 1754806 1486033 1333397 1306631 1247412 1345814 1514470 1422666
14565 1422666 1208031 1337076 1540997 1434099 1375917 1518423 1677192 1723910 1672333 1703786
14555 1703786 1657332 1792299 1814671 1988962 1823979 1467842 1530997 1646126 1572052 1635294
14545 1635294 1776841 2093982 2275225 2176878 2213990 2311278 2203824 2261599 2165028 2169009 2284536
14534 2284536 2231455 2415213 2556471 2475642 2435196 2514491 2536123 2531860 2798433 2952319 2883650
14523 2883650 2823875 2592823 2644294 2804844 2616317 2681504 2674817 2788380 2811583 2897213 2742050
14512 2742050 2807315 3019510 2932912 2809314 2955694 2926702 2990773 3120049 3389081 3455770
14502 3455770 3622408 3792351 3628800 3694062 3711694 3859137 3871078 3784405 3688972 3746916
14492 3746916 3742445 3912768 3741333 3726195 3996837 4147490 4188861 4188477 4232577 4342590 4352553
14481 4352553 4328269 4434683 4421257 4440794 4503366 4681125 4888645 4962500 4962415 4834224 5109616
14470 5109616 5504119 5369297 5471569 5580924 5455832 5541993 5646221 5787550 5928816 6231246
14460 6231246 6437171 6404869 6273903 6095527 5902396 5872405 6471687 6901302 6871569 6949684
14450 6949684 7011183 7171277 7427104 7528839 7677066 7738174 7874636 7936541 8085436 8205194
14440 8205194 8093440 8180070 8320796 8628949 8593772 8963482 9319088 9496972 9546810 9685866
14430 9685866 9860908 9916707 10088798 10521116 10747669 10701853 10738215 10911774 11078601 11343212
14420 11343212 11707529 11952424 12159394 12263052 12549185 13048705 13533164 13792945 13818303
14411 13818303 14264414 14692181 14875671 15084209 15241750 15940340 16406410 16756149 16817258
14402 16817258 17203155 17594229 17894349 18220042 18690240 19149770 19711416 20098792 20703632
14393 20703632 21093337 21551735 22116918 22568400 23277753 23753073 24114549 24557678 25136873
14384 25136873 25618701 25955433 26504840 27467901 28099926 28704931 29241605 29906138 30489900
14375 30489900 31165104 32036157 32919962 33445317 34016187 34777104 35444292 36106332 36931938
14366 36931938 37626647 38209194 38956341 39630671 40357197 41064733 41282444 41945025 42646867
14357 42646867 43303289 43986781 44589472 45276927 45819948 46240861 46708417 47100376 47730122
14348 47730122 48171497 48775410 49202549 49507960 49791661 50059581 50148324 50254023 50569577
14339 50569577 50774451 51077115 51267925 51208494 51085217 50696501 50556379 50420978 50434018 50276866
14329 50276866 49930652 49684228 49560659 49108943 48923733 48788322 48464064 47859483 47390467
14320 47390467 46982507 46485491 46096334 45378499 44629723 43953164 43021753 42057205 41497015
14311 41497015 41369900 41036335 40416680 39549901 38653331 37981310 37339830 36604285 36144708
14302 36144708 35553798 34764063 34041940 33474923 32717937 31985286 31561682 31338203 30657367
14293 30657367 29857876 29132230 28732050 28240636 27644351 26956859 26328611 25849265 25193225
14284 25193225 24492620 24271681 24015238 23485125 22936083 22492029 21910742 21550866 21285245
14275 21285245 20916331 20662392 20176399 19409373 18994427 18530950 18019762 17863530 17851209
14266 17851209 17814092 17283659 16736352 16384024 15986976 15621496 15567409 15264446 14870604 14488696
14256 14488696 14326198 14247122 13831638 13560544 13334685 13275070 13213290 13092101 12734433 12229588
14246 12229588 11727044 11531739 11211448 10951241 10595437 10423740 10377662 10436817 10311832 10154109
14236 10154109 9877019 9570939 9374320 9037852 8972818 8859166 8711722 8702996 8523957 8259590
14226 8259590 8140351 8013647 7853117 7677833 7573955 7604230 7666040 7720231 7691952 7334316
14216 7334316 7002139 7031123 7136130 7121829 7117401 7142144 6794816 6450947 6371368 6129549
14206 6129549 5949728 5857921 6048044 6164477 5810174 5665133 5842825 6028157 6020452 5778315
14196 5778315 5242361 5035247 5048222 5011096 4762803 4622799 4908874 5191378 5206823 5015414
14186 5015414 4897141 4759512 4470337 4368297 4209777 4036056 4218388 4230577 4194060 4124928
14176 4124928 4002239 3756481 3740058 3791602 3899455 4092375 4105784 4079707 3772394 3502162
14166 3502162 3393782 3411570 3465013 3370868 3332327 3468067 3607068 3445812 3222037 2969696
14156 2969696 2846811 2766119 2817771 2778946 2822736 2639158 2622270 2818690 2739031 2728592 2818173
14145 2818173 2599578 2568535 2334327 2409707 2744471 2893268 2686346 2619281 2518549 2588982
14135 2588982 2633667 2635267 2610866 2413037 2469404 2497239 2286406 2251800 2230526 2299396 2464325
14124 2464325 2470323 2466974 2568788 2375366 2332302 2185127 2079595 1968986 2117233 2173230
14114 2173230 2334954 2299037 2454838 2473672 2284509 2269210 2198127 2050920 1940576 1798505
14104 1798505 1751527 1851289 1790291 1503292 1378317 1646465 1754625 1727177 1851698 1554256
14094 1554256 1350846 1364791 1646066 1612904 1423219 1379375 1267751 1228294 1266131 1437165
14084 1437165 1438794 1458492 1487758 1377929 1380284 1511673 1737983 1767575 1596279 1567936 1278714
14073 1278714 1317746 1311508 1435767 1277765 1254320 1392756 1577603 1432749 1487191 1662931
14063 1662931 1785588 1583122 1341203 1414325 1483775 1439848 1404549 1251619 1086587 1120051
14053 1120051 1133596 1162142 1120106 866361 973440 1088910 1102465 1056885 868226 865830 962290
14042 962290 1235590 1259423 1263085 1077442 807136 871495 1088672 1069358 1156649 1242064 1039677
14031 1039677 1070259 1008705 706907 594127 709473 938527 1108925 1036034 1170988 1149735
14021 1149735 1133567 804517 577085 822299 987007 959080 843796 998798 1206893 1142344
14011 1142344 1001494 919278 724012 706606 670766 697937 762697 670812 696340 801093 782690
14000 782690 1014522 1063488 826816 768878 752922 635165 765740 817322 799763 806758 798641
13989 798641 899590 947131 924985 700555 525987 628909 451969 398644 522240 456657
13979 456657 498798 427773 444132 501521 483669 563385 630539 535425 366895 166038 309853
13968 309853 552108 785913 748355 401572 191673 357362 464666 419922 619350 544853
13958 544853 635834 637443 523244 443512 300615 320483 380067 583375 618571 642957 702049
13947 702049 518202 365149 442353 397699 207700 218476 204921 327739 475595 630095
13937 630095 670033 481550 197422 409854 747221 659053 449349 405400 482316 450445
13927 450445 444386 480858 435246 363973 391138 198468 235132 17165 -107252 44889 334290
13916 334290 504638 590595 478747 434646 513169 490711 287897 -30835 -63017 15065 276699
13905 276699 438304 350496 169799 -33273 72384 208435 509646 444432 290229 191780
13895 191780 3334 -135884 -86258 -128123 -70286 326597 666546 614353 725854 728930 553870
13884 553870 381367 596650 494568 410559 431748 528259 453288 406775 370843 107225 -19905
13873 -19905 -28549 10351 -150406 -118330 11714 -66954 13724 -4280 -57510 98021 58832
13862 58832 128551 84537 -142267 -72627 272549 282775 175530 225576 164893 138653 343396
13851 343396 428809 337992 416371 123616 -21794 -56001 -76510 -80680 110209 37432 215960
13840 215960 141345 -32509 -247107 -384984 -80322 228777 182760 125058 8101 -14688
13830 -14688 -175143 -274423 -306651 -110124 -34502 -153971 -272547 -51645 18053 116299 -81288
13819 -81288 -309439 -432077 -763853 -402443 59416 576610 586665 420798 438947 368645
13809 368645 330449 193849 76543 135037 239349 347247 295303 356304 531555 669306
13799 669306 703691 802061 931308 1177815 1135034 1090704 1102556 1015788 950279 628422 654100
13788 654100 705879 566366 581555 542455 427127 404819 380452 448364 523505 432620 645112
13777 645112 696393 814992 1153568 1352266 1522374 1741016 1669911 1887013 1957682 1993689
13767 1993689 2005519 1840785 1613673 1493016 1376335 1310591 1090888 1235590 1288645 1195769
13757 1195769 1016504 892551 991307 1153888 967451 909115 945377 688752 574599 527760
13747 527760 584691 525248 598607 786119 1049399 1383847 1552056 1552853 1498828 1564503 1622472
13736 1622472 1514904 1505956 1390505 1128653 1033577 843349 797934 647644 351836 50734
13726 50734 -43281 -1582 189310 359892 257644 38937 59042 384168 550655 542879 179631
13715 179631 -159255 -364112 -421498 -372556 -504897 -566338 -440740 -355083 -176590 -100940
13705 -100940 -155566 -118339 -261553 -529630 -521715 -335133 177604 88911 -75923 -97239 -71322
13694 -71322 -163107 -126898 -33178 13362 -81475 -343546 -457496 -172934 -72932 153666 260121
13683 260121 57250 16006 -124887 -178616 -64956 -220162 -84858 19752 39980 37987
13673 37987 90860 -221 -173893 -293746 -24582 251968 300014 81022 -51675 -118655
13663 -118655 34812 78812 -158700 -244998 -130283 57944 -4402 -105753 -254193 -235741
13653 -235741 -133323 -479 51927 -39878 103416 21475 144320 125699 -127968 -155919
13643 -155919 -221099 -406395 -530341 -405139 -234684 -187754 -186137 -25490 -226913 -349800
13633 -349800 -333520 -407015 -22091 -705 -28939 30159 321214 280397 -81104 -24732 16593
13622 16593 -19535 -300588 -379819 -312462 -265386 -214902 -105502 5597 145740 218002 86763
13611 86763 -324420 -601015 -518357 -322244 -201654 -21866 74232 58062 32471 5315 83118
13600 83118 84413 -128975 12150 257231 190378 -183290 -64888 202681 108551 186462 131646
13589 131646 -22845 -57894 -60013 -52725 4399 -73009 -49975 74148 -97014 -100981 32060
13578 32060 18911 -96157 -17143 -150035 -368964 -217693 -94537 -193962 -260890 -145368
13568 -145368 -89765 -71682 -140406 -121688 -249670 -34696 215439 384663 517722 541982
13558 541982 600753 470392 447052 405598 451376 525323 428153 584729 720832 536587 495461
13547 495461 461957 406622 392892 445840 561636 454854 392567 391812 143832 329362 511039
13536 511039 698286 733214 667326 341971 498933 502466 328423 257416 231929 404735 475667
13525 475667 404422 291803 62204 -10712 97488 -42791 65548 -19274 -209054 -78012
13515 -78012 -236185 -362104 -302267 -226242 -268977 -161533 31883 121793 181035 213282 92764
13504 92764 -129948 -185925 -101136 56126 61470 -3816 12342 4382 13128 1883 46906 -32351
13492 -32351 -12611 -182626 -278885 -239804 -58857 495 -281299 -434047 -538964 -492416 -284635
13481 -284635 -132301 -92906 25796 36305 67347 8442 128130 137575 83771 55366 38973
13470 38973 -17226 104526 285052 248468 193742 414359 626788 514709 432562 228399
13460 228399 3150 -280314 -617901 -585600 -441385 -69248 195892 272684 483605 951495
13450 951495 884192 531588 560046 704677 997009 791886 593688 514126 281572 97854
13440 97854 -30157 193894 63609 -229062 -14562 173310 296563 518420 336630 -59849
13430 -59849 -209410 -9918 264122 503628 474931 441001 341429 137394 118202 382802
13420 382802 513403 425289 558158 650837 704953 646814 396376 271812 357607 249953
13410 249953 338794 415826 411589 457213 690614 719610 531202 136017 -236478 -212003 8543
13399 8543 327812 567528 512199 509569 626214 706864 546476 256821 227187 327249 624252
13388 624252 883053 863345 953363 1054550 1264696 1457113 1518273 1670309 1551458 1501419
13378 1501419 1599970 1753902 2100158 2308729 2264656 2353688 2508001 2313923 2049892 2218849
13368 2218849 2496887 2746815 2840177 3037794 3121463 3497384 3754355 3719345 3758632 4067500
13358 4067500 4541243 4897911 5301876 5532855 6077516 6581697 7165482 7769320 8640216
13349 8640216 9535090 10745215 11854233 12905593 14640924 16912673 19440271 22351322
13341 22351322 26146983 31248062 38472913 48689353 63111156 84017092 111894615
13334 111894615 145263123 179068092 207773501 229633242 244176766 249589485 244901616
13327 244901616 230765706 209583503 182863833 154012025 128726584 110905846 100965224
13320 100965224 96912360 96904674 99075246 102664467 107418666 113572689 121410322 131743905
13312 131743905 144488213 158157782 172131820 189089886 210788923 236324709 263268919
13305 263268919 287691685 306189247 317448366 321780702 320604816 315283395 306062878
13298 306062878 292527877 274190099 252268311 230735135 212116071 196941558 184058316
13291 184058316 172828010 162092437 150830445 139676527 130615832 124138786 119275381
13284 119275381 115718306 113603281 113813292 117456960 127453000 146302795 174311119 207280783
13276 207280783 238646356 263637100 280772926 289296148 287076681 273250976 250095220
13269 250095220 219732151 184202933 148469053 117603154 94123527 77150790 65204269
13262 65204269 56418390 49671386 44689596 40352314 36915507 33873374 31018243 28632071
13254 28632071 26728771 24768238 22972647 21499785 20154741 19157762 18315543 17359239
13246 17359239 16492380 15698169 14924689 14227746 13522567 13117602 12685931 12272209 12004885
13237 12004885 11473983 11105492 10749646 10455241 10046654 9707753 9317241 8923671 8748951
13228 8748951 8431364 8183314 8099916 7973260 7874562 7799482 7733734 7353607 6845450 6791956
13218 6791956 6619548 6349571 6142194 5626792 5261869 5232639 5244112 5348891 5346766 5293700
13208 5293700 5385737 5319806 5005303 5046752 5382418 5416384 5029628 4814666 4824636 4901587 4898173
13197 4898173 4834264 4654579 4640249 4439126 4336718 4200815 3947460 3997716 3935164 3630754
13187 3630754 3363591 3349627 3210654 2950261 3074655 3273554 3234387 3114003 2896067 2890908
13177 2890908 3064788 2886588 2755839 2818976 2755167 2783677 2675213 2893174 3092654 3024365
13167 3024365 3087044 3096413 2988324 2920066 2870175 2956811 2976049 3182223 3221796 3520830 4071591
13156 4071591 4506704 4651798 4913937 4408940 3611168 2953567 2816542 2708058 2408066
13147 2408066 2024367 1912273 1747621 1926740 1966942 1833993 1934328 1652544 1514410 1447418
13137 1447418 1432233 1576133 1854746 1746584 1630104 1618565 1609951 1779097 1507959 1327688
13127 1327688 1317707 1256143 1153903 1293034 1262149 1534947 1522500 1340575 1189021 1085381
13117 1085381 1031069 1070139 1215300 1438241 1687839 2069557 2295558 2439445 2369651 2135627
13107 2135627 2007748 1793489 1466199 1244878 1123712 1180226 983848 1239979 1318594 1036117
13097 1036117 982068 863091 649601 375527 520201 730486 840260 951519 806799 811956
13087 811956 701705 361102 225999 442308 777336 985164 792749 778846 645541 500087
13077 500087 363809 481372 606304 703745 743327 506621 496404 603838 824366 989505
13067 989505 1144404 1491460 1426862 1169309 1216276 1271731 1177395 1037032 788696 829455
13057 829455 933957 994232 868736 647127 714105 515915 318575 506825 568057 280169
13047 280169 393500 452212 457575 350629 217776 185913 535930 577201 507200 527379 411963
13036 411963 413473 751951 691809 527776 445485 397135 390913 436922 461552 475372 710189
13025 710189 887156 876966 825826 948018 1243836 1289469 1632147 1862958 1947958 1961081
13015 1961081 2022229 1767999 1504572 1497332 1573577 1708613 1792658 1917235 1927138 1923396 1783191
13004 1783191 1555852 1198312 986231 827958 905431 789666 888814 638581 404075 298971
12994 298971 435541 536751 669192 806855 714130 434763 413779 466581 450533 611423
12984 611423 614178 692027 997169 1066618 978981 886954 833740 926269 1012581 923482 593616
12973 593616 656595 863664 715115 530068 534122 595303 757257 408769 66176 99862
12963 99862 185181 148696 399682 458701 397869 438325 309459 575743 533025 531746 472127
12952 472127 740743 865401 837972 906889 1056726 1209170 1148598 991096 867189 723307
12942 723307 666063 825562 819860 914208 1004720 1170993 1200214 1220569 925887 717540 821193
12931 821193 686802 614896 612193 315772 380016 280106 114586 36980 305046 319319 -5853
12920 -5853 -40757 138283 -4397 -103651 83782 128063 446 257167 520651 472428 361502
12909 361502 431053 308806 101566 -98165 -39690 415877 655500 655335 623040 436437 251171
12898 251171 292741 5293 140805 322976 191367 352910 512141 464380 159325 10372
12888 10372 104794 183076 223940 284042 304432 260181 225114 238054 92311 385615 491472
12877 491472 410156 -15224 -156092 -82499 106000 362572 336277 464177 539952 516501
12867 516501 149367 -125230 96511 303966 370460 528348 706025 1002499 1221287 1485073
12857 1485073 1342697 1004271 1028514 861557 824824 719211 668666 426959 345368 313569
12847 313569 537406 535205 569382 611358 497540 541018 417449 589337 720339 678745 779450
12836 779450 937377 1031180 1011576 1347823 1349295 1322317 1500302 1608224 1819441 1896879 1635729
12825 1635729 1576271 1477056 1522261 1632056 1375586 1128972 994462 864532 706209 937181
12815 937181 1024976 803966 893875 837190 737396 737872 861480 907232 945277 970517 1088453
12804 1088453 1431971 1472911 1669117 1639648 1362069 1162196 1145688 1228415 1181083 837387
12794 837387 577411 416598 175177 165375 327611 536113 622149 472096 268297 189718
12784 189718 139302 230261 169201 80471 140614 55026 -77172 -384130 -217922 -167976 -377040
12773 -377040 -463687 -354300 -254542 -71955 85594 57003 280650 425581 364215 123651
12763 123651 77938 39121 -95502 71665 -63662 1548 -148761 -254394 -236743 -296902
12753 -296902 -253885 -293725 -117068 -66172 -240789 -549224 -449381 -105056 262648 198607
12743 198607 -68316 -99543 89019 -106527 -27382 44273 -75427 -177680 -314444 -457037
12733 -457037 -546081 -470680 -133452 -64615 -69806 176593 158374 -32665 -347319 -260618 -90644
12722 -90644 -74705 -60803 182963 273105 427931 436595 422029 456377 400510 513606 474033
12711 474033 492365 749124 618695 584527 769287 1006407 1052200 753542 761972 936984
12701 936984 1038989 1138058 1416960 1059564 835321 884433 813193 644339 617353 715813
12691 715813 799709 659007 663234 664054 793606 1038784 1108872 1206320 1124710 1226714 1016828
12680 1016828 762750 891071 1141267 1158538 966789 940123 1015652 877410 806357 738707
12670 738707 796095 664683 717542 1011576 1084231 810979 607339 632026 312380 215074
12660 215074 105010 -10332 328556 482135 665400 633768 663003 987094 967693 647282
12650 647282 500784 551707 572947 445092 238288 395508 586411 696373 576906 470720
12640 470720 509956 524758 330730 193490 79815 -200919 -192509 121451 329717 101412
12630 101412 30515 -64622 -30246 22381 -1166 -47232 178 275147 387646 227223 359718
12619 359718 224565 14836 -139685 -160727 -128224 96611 -140007 -161313 106334 61030
12609 61030 344161 496837 349954 -74648 -204236 -45760 110765 -68157 -319533 -121558
12599 -121558 153062 185325 -58931 -366448 -324233 -246877 -289226 -342467 -317134 -176804 53726
12588 53726 16679 27746 -91693 47871 353583 377385 487294 561741 592913 346905 10875
12577 10875 4892 194398 265787 688208 776496 636416 314469 372982 400629 372327 621764
12566 621764 621251 413851 359968 77384 141632 308838 211721 323965 191640 266839 127091
12555 127091 65050 280672 292714 302358 362141 461542 389241 439728 577766 850090 1229513
12544 1229513 1514528 1579034 1558755 1421927 1340305 1188650 1175642 1229657 1115489 1048170
12534 1048170 1064300 1007705 767746 533881 613905 976503 1039063 919670 1030042 813064
12524 813064 726014 738358 824460 711211 743914 720542 394896 257624 130779 284250
12514 284250 332755 489730 421014 219927 199336 184629 303874 183608 122253 564153
12504 564153 701297 790628 876397 996832 866514 805230 517923 478582 353309 487907
12494 487907 541762 239687 143157 1166 73083 312820 348965 192959 -13654 57557
12484 57557 384465 577611 473061 229688 85658 91308 246914 230584 271074 182217 332722
12473 332722 374499 315537 124839 -76765 -218399 -130037 4572 223434 204346 316486
12463 316486 437972 226719 173373 149849 -123284 -212065 -297101 -86934 -74588 -100058 150458
12452 150458 134273 87419 151899 75172 -25755 38921 285374 43681 91069 198193 160868
12441 160868 171354 312862 223337 28530 314181 543884 531287 381308 141522 86168
12431 86168 17779 113946 151460 218127 -92650 -273525 -367802 -345733 -400393 -390268 -274469
12420 -274469 -11130 81790 237404 171413 49919 -165421 -233513 -254243 -196178 -408006
12410 -408006 -467041 -283293 -125074 52944 60195 5806 -2941 18900 153053 238389 57423
12399 57423 37675 -47467 -129179 163116 480345 577045 719348 739723 539356 407093 498308
12388 498308 655122 558777 488842 128626 -98959 153948 349704 387433 442129 479863
12378 479863 739402 822527 741303 726968 715939 708503 542129 359703 485910 357016 231823
12367 231823 78927 49361 -6391 -31510 -337964 -413840 -435708 -525756 -256819 19158 215747
12356 215747 412140 285664 118572 -113666 -64426 118085 263857 17046 57191 134542
12346 134542 57077 -130665 -340351 -306879 -300938 -302615 -340578 -206862 -227506 -302446 -208882
12335 -208882 57959 188560 427489 446797 258012 292223 371335 634972 840442 642575
12325 642575 369431 218242 143879 -7849 133274 398045 846075 970287 811312 651674
12315 651674 424849 564910 897008 810513 805379 1001778 1092579 1162848 1339547 1346645 1378830
12304 1378830 1640369 2044901 2487091 2662415 2706142 2839440 3430164 3879044 4329805 4645055
12294 4645055 4956155 5459340 5960417 6794866 7945013 9222775 10893631 12868067 15054629
12285 15054629 17478345 20519708 24802148 30761822 38948710 50890150 68254857 91618752
12277 91618752 119892393 146854137 166000237 173348814 168519914 153685488 134033395
12270 134033395 115530280 102099465 94872791 93973855 99967593 113199986 134011662
12263 134011662 160926918 189208585 211056370 221456115 219340888 207270762 190493576
12256 190493576 174902140 164209919 158232283 155649807 156021782 160146508 170339351 187325919
12248 187325919 207910135 226453236 238359520 241398162 237043344 229621677 224129585
12241 224129585 222189671 221232989 218230239 212964386 206780297 203512095 206524445 216641459
12233 216641459 229315435 238469457 239730326 231462675 217094655 200531225 185902278
12226 185902278 174775566 166989115 162166198 161267926 166040125 177797904 194473183 210342196
12218 210342196 218157675 214672375 199971238 177028549 151564740 129398258 113207673
12211 113207673 103489854 99739618 101787637 109973763 124029064 142276935 159733447
12204 159733447 170578164 171112813 160626782 141371210 117373552 94435039 75833490
12197 75833490 62102359 52311687 45019035 39927003 36104434 32760445 30268589 28144654
12189 28144654 25841079 23702055 22119929 21070316 20015632 18990468 17699215 16754574
12181 16754574 16016387 15427315 14742837 14077283 13755912 13147085 12414351 11839612 11311334
12172 11311334 11047635 11005514 10872855 10575566 9942743 9273235 8965845 8937123 8826016 8681945
12162 8681945 8401066 8109449 8118995 8030146 7903736 7572642 7334449 7142884 7074657 6785216
12152 6785216 6837818 6676461 6089110 5745790 5773947 6128728 6253026 6007330 5971781 5849943
12142 5849943 5554127 5227200 5155260 5156461 4961751 4765825 4732507 4732343 4710488 4683488 4582728
12131 4582728 4487618 4243860 4033543 4129379 4325038 4158746 4036062 4075388 3873894 3811897
12121 3811897 3791934 3778497 3659198 3475725 3261780 3167645 3171126 3080599 3097057 2957666 3131731
12110 3131731 3038729 3033747 2873119 2921562 2824759 2877226 2810846 2900956 3161548 2957700 2864848
12099 2864848 2988929 2953033 2991185 3061248 3079116 2887960 2781272 2878956 2967784 2981750 2663266
12088 2663266 2341342 2330780 2309675 2316371 2292080 2298476 2306594 2575926 2727863 2449547 2174651
12077 2174651 2118150 2338618 2355779 2168096 1734842 1643582 1588312 1613254 1596781 1667810 1624381
12066 1624381 1495787 1633490 1435368 1196941 1217819 1197735 1346932 1346700 1340585 1409479 1311797
12055 1311797 1371916 1449879 1437753 1353101 1423063 1569680 1532466 1236622 1101033 1177376 1270412
12044 1270412 1144883 1082980 1141733 1312141 1396625 1369180 1435693 1607323 1559437 1316780
12034 1316780 1240526 1218506 1263300 1362244 1467966 1482568 1490767 1192340 1002723 1114133 1209759
12023 1209759 1399711 1549573 1562613 1206715 991658 964366 926648 1120124 1442799 1450151
12013 1450151 1119025 880806 1166535 1368221 1370253 1348528 1267163 1297071 1308847 1234407 855781
12002 855781 955843 982720 770645 965792 1081205 867509 890967 782772 614874 540836
11992 540836 680136 898841 982770 991928 953561 936092 821155 778854 941605 1287300 1270123
11981 1270123 1086215 1103687 721707 446882 384896 571702 714295 884311 892840 775387
11971 775387 675482 836811 869553 682120 718413 740389 757815 1071022 1225904 1270474 969262
11960 969262 861846 876021 907357 1031585 842205 954684 933896 742319 528574 659343
11950 659343 955132 983817 1000897 942628 815151 759085 609205 514972 419107 333847 612848
11939 612848 637621 581108 637003 641654 667676 666088 563690 522253 762544 803716 706471
11928 706471 515148 125616 97415 484422 796019 684002 506234 313862 189557 436136
11918 436136 529677 754150 475588 333433 260109 396722 513857 680575 683004 607410
11908 607410 572434 685504 728892 582216 465599 517893 480875 583291 605475 447178
11898 447178 275070 211340 278005 274146 373419 264074 202968 569932 795910 580185 409950
11887 409950 522606 554397 474629 532581 457909 254406 238961 143299 296557 384274 349699
11876 349699 594897 835978 725370 610730 636669 748210 628042 664762 773300 852516
11866 852516 966415 1167300 1013585 912631 559930 531828 499141 231344 24494 131512
11856 131512 88378 39293 268518 490907 391970 416224 604755 482022 310246 216911
11846 216911 238900 366067 469412 322445 473411 558342 644319 610555 661560 801111
11836 801111 759774 971381 1115746 1241697 1255273 1364622 1111749 909853 901267 1028312
11826 1028312 1018321 995541 1098995 1064003 1247882 1153221 1009811 1395172 1487236 1413468 1464906
11815 1464906 1553163 1467617 1320084 1240492 1292275 1363733 1461462 1533446 1452293 1396444 1394640
11804 1394640 1469867 1600773 1675845 1465755 1304681 1577785 1768584 1713030 1495668 1259795
11794 1259795 1196059 1079648 1106224 1359828 1775221 2036641 1943477 1644034 1565477 1601086
11784 1601086 1513689 1511284 1610035 1599408 1465918 1533269 1434979 1264945 1259005 1410259 1447596
11773 1447596 1372968 1491736 1462753 1180418 993334 713748 473223 492538 646059 708337
11763 708337 759462 988474 1422496 1440438 1665368 1828789 1558742 1117541 903233 729125
11753 729125 536020 357249 223564 259988 505153 832866 691966 406346 643070 687487
11743 687487 506025 366089 493675 424438 209646 243471 281506 166687 199103 90312
11733 90312 -65534 69192 145280 229955 207450 161269 79169 182553 195251 354577 460986
11722 460986 418244 380105 394433 430393 153937 -29853 -110524 -93461 -79030 -37444 -243194
11711 -243194 -107696 143230 280655 88995 107348 197597 145624 176144 307833 85479
11701 85479 -167702 -54933 138532 363176 472082 580324 436153 368854 445080 343641
11691 343641 370711 361869 271920 307839 135289 30854 241135 439184 581011 398063
11681 398063 178222 271839 287591 230355 300503 461696 436402 446695 153177 -57975 2896
11670 2896 199469 130535 120914 405938 332674 315023 316132 199652 104885 376032 670108
11659 670108 527842 367679 398085 379293 299966 22997 -65763 5771 39498 249293 338879
11648 338879 392625 290934 363043 373767 138383 63950 -127733 -119740 83007 188670 211080
11637 211080 361072 243941 161355 100353 152160 377989 434648 312875 237938 229811 277545
11626 277545 576908 542275 343563 379715 520511 497071 168833 97464 171441 322106
11616 322106 517535 543313 219375 29373 -122235 -32353 -20422 289226 294890 165067
11606 165067 395988 370895 327443 346571 287459 158927 235865 322498 373977 351580 214236
11595 214236 262337 285154 80354 -47986 -19574 88065 297358 420467 140841 -191635
11585 -191635 -200905 61512 35273 205667 54969 -68808 76396 286873 502607 460468
11575 460468 427056 255321 86634 290637 590219 740542 628603 602753 476198 271746
11565 271746 313509 427080 658637 487729 289929 333934 337744 425976 504352 316635 231199
11554 231199 260755 292284 448582 343609 167707 1639 -95502 -5077 6808 141221
11544 141221 194871 115411 -80084 -281956 -252744 -6306 238544 234896 151996 245175 528567
11533 528567 698291 587485 410102 411914 414865 503352 518727 691291 535708 349717 345313
11522 345313 379060 323293 254136 461281 319146 151140 137976 139433 253531 384987 339657
11511 339657 5884 -142952 -73549 254648 267009 251590 347703 389055 349776 262454 149079
11500 149079 81753 146752 320155 578045 517699 542229 500775 539078 741616 583671 326808
11489 326808 124477 -40001 46041 -5966 43386 -19155 -13745 -244110 -224476 -288861 -152894
11478 -152894 -141588 -69186 20302 -24245 -107270 29541 197212 171624 -119548 -229369 -149711
11467 -149711 -151417 -1936 88171 103417 117055 288857 250450 445961 546575 258674 120157
11456 120157 192319 117568 102003 184352 135158 -29602 -226940 -309523 -272410 -108341 -86487
11445 -86487 209668 70247 -144420 -79859 122258 119799 151499 259823 167522 71384 -50698
11434 -50698 -74749 75653 25075 32770 101386 38664 107453 332390 229379 -84225 -2957
11423 -2957 68759 146711 328841 -22858 -47350 38571 63811 -161715 -478708 -509206 -227479
11412 -227479 -140642 -190955 -10997 -177918 -217140 -20923 11606 -36785 -73087 110261 152165
11401 152165 -42785 -141904 -132338 -352953 -160345 -76685 -22748 -11040 75790 237607 291714
11390 291714 95041 14323 -35103 -22303 57348 216886 220190 231891 131920 214748 242843
11379 242843 262279 15961 61582 225694 46397 -28224 -11681 238636 304186 102077
11369 102077 2889 139181 521727 599199 458400 442870 498661 417652 287745 279805 133001
11358 133001 -27984 91250 409088 487488 462368 523841 545859 473607 429663 170825 57753
11347 57753 193120 134352 315 31152 2581 -43832 -261856 -212439 212421 487690 410837
11336 410837 337619 430444 629075 622268 449211 171705 -230748 -159070 31013 191432
11326 191432 264201 150436 1167 223701 83875 -152463 -195758 -62836 -16107 75541
11316 75541 484033 502272 620625 439162 233521 383449 332018 251383 251207 261432 154396
11305 154396 27209 276403 381946 354986 478954 635357 553328 513143 579501 531118
11295 531118 330652 195274 133618 284853 390372 406803 296655 181469 300891 389321
11285 389321 408197 352977 292477 171868 502793 715488 547198 403317 228810 100247
11275 100247 117001 -30040 -140772 -66994 97109 35489 -92605 74401 186665 111737
11265 111737 -77856 -111217 -127331 -160670 -450891 -421806 -115566 31599 -149129 -60560
11255 -60560 72643 150788 204663 225324 168851 101091 57203 74399 -3011 32639 120917
11244 120917 150738 88856 33192 143152 39572 -35659 97302 -46483 -214375 -130162
11234 -130162 -2330 163484 -19955 -228531 -25589 40549 -57771 -4618 210690 -57744
11224 -57744 -178843 -30053 64216 70016 244474 257341 115825 21762 91621 73075 -28737
11213 -28737 -39708 286246 345913 271432 104461 192469 431424 473325 242110 283824 190186
11202 190186 298705 504593 261266 24024 -143883 -146805 -186850 -43738 139123 -62010
11192 -62010 -171890 -74449 123383 223932 251997 6624 -136313 -102071 -16355 13125 20160
11181 20160 122953 210606 323765 330428 298093 347704 10182 -126351 -74773 -96978 -7230
11170 -7230 148914 394878 493256 363095 226311 95053 59183 205212 164135 158816 128220
11159 128220 17335 126569 284024 156791 35725 270496 266237 22596 24806 87734
11149 87734 166858 82650 -236804 -150187 130032 195076 214169 203845 366239 361818 330896
11138 330896 222988 157436 24713 35091 -71009 1255 270743 198851 -53911 -205131
11128 -205131 137525 314977 311594 162607 4300 -140355 19322 93840 -28857 -117011
11118 -117011 -108172 207322 221124 -4983 -2745 168342 297556 466242 305722 76483
11108 76483 163100 156178 107594 47678 -6626 83143 10149 -113565 -136683 -91242 -29453 -133885
11096 -133885 -84235 61022 -30882 -30289 87358 175883 -772 -51744 99479 -114619 -33785
11085 -33785 29516 -83274 -9422 -86602 -167536 -104191 163174 93716 -212295 -25948 -91733
11074 -91733 -108329 -11623 -116919 23580 262515 296339 224700 93943 -63800 -146157 -57813
11063 -57813 19603 -65268 87322 144076 41103 45831 141932 172620 -20492 51515 245764
11052 245764 239620 60245 -64623 -203042 -190787 93186 285172 255260 36089 -77418
11042 -77418 -134489 -95852 -44493 198575 450893 495133 412857 515880 468676 225563 -59627
11031 -59627 171701 233513 -13925 -248994 -549381 -542700 -165052 56879 244705 536869
11021 536869 615693 447260 303361 283424 123058 332813 266536 141688 131974 44492 -163539
11010 -163539 -126988 -189985 -25573 84354 173887 124979 -25419 217622 377422 182436
11000 182436 -122447 39830 -56599 -162793 -146381 88173 -18524 -76612 -48346 68519
10990 68519 16053 -4263 34675 -2269 -57822 118655 45184 -201250 -156847 -17541 207967
10979 207967 91407 155243 207940 204202 15169 63304 179963 -42254 -231495 -102214
10969 -102214 89042 252437 350674 279792 -22178 -122686 54402 226338 413858 353686
10959 353686 325978 26620 -285968 -179694 -60438 85504 -69008 -99025 -35629 -84443
10949 -84443 -165413 -75134 -291429 -329996 -159954 4594 -141770 -248115 -265835 -232207 -123586
10938 -123586 -49626 84077 85436 88647 68256 64761 18179 -180478 -144443 -21016 39757
10927 39757 -44545 -84654 -285105 -471004 -444556 -328153 -435965 -398288 -326843 -98801 120112
10916 120112 374924 266686 -50276 38602 143161 101701 -245069 -367435 -178697 -222416
10906 -222416 -40307 246393 401094 65061 -77565 -7466 160967 53563 -94601 -216210
10896 -216210 -278326 -159212 -40115 154911 250987 392088 336340 153849 -60950 -52023
10886 -52023 39992 -120037 -117145 -126837 -153468 -134132 -141480 -223217 61849 34092 31456 -29512
10874 -29512 -76107 141857 264275 214699 168880 105978 33464 -127107 71609 244744 190007
10863 190007 302714 393852 522006 507570 537593 99256 -80211 -240066 -14637 -147606
10853 -147606 -167729 -86328 -203003 -176830 -240959 -130235 11792 49743 -67081 -225068
10843 -225068 -225139 -210979 100484 96031 -63244 -177618 -127902 -51240 162861 459916 451825
10832 451825 252600 251250 335519 46784 -18506 137116 -50572 -392089 -138873 124862
10822 124862 188038 201755 -152694 -122727 -44847 19559 -31619 37318 236588 334181 304362
10811 304362 232562 214304 253712 255685 34362 -155804 137425 422950 322810 122752
10801 122752 319058 418083 349061 409052 345313 370160 432452 384885 113085 8959 12272
10790 12272 14647 6410 1735 -40166 -161696 -186205 -250631 -218488 -156077 -159677 -161171 -145919
10778 -145919 -83078 67217 154773 59442 16667 290570 376344 248531 378947 409379 321916
10767 321916 108520 473 64532 93800 61342 -137041 -240685 -191636 -179122 9771
10757 9771 188649 67347 17895 179343 204098 221628 134339 -2054 185227 200554 128613
10746 128613 191723 191930 399123 362259 310011 517013 471160 438718 386667 252850 -100420
10735 -100420 -226788 -115839 227402 445054 645441 516171 531946 469863 294149 336269
10725 336269 596766 617911 481086 251227 289927 197271 150512 306752 285873 261828 23603
10714 23603 -36189 -5448 24912 -132307 -72026 -3107 -36981 91959 177888 189416 54211
10703 54211 12659 70574 146789 248827 200126 377076 515389 430272 168287 -84565 -176448
10692 -176448 -243624 -346207 -247540 -261647 -155660 125129 371351 270440 286476 176684
10682 176684 -35781 77793 39808 47761 397719 406584 300297 241889 233484 242352 144743
10671 144743 166739 451990 402577 268861 488318 475076 303306 159937 -94336 47329
10661 47329 22682 96402 -28186 -41814 37165 53771 103553 275638 332072 219201 354762
10650 354762 556755 346318 80630 37823 -23534 251259 385530 273201 -87390 -323549
10640 -323549 -39195 181696 546872 409267 54724 -74240 -120214 -211259 -138081 47059
10630 47059 216778 211712 108084 187300 -75022 -598743 -699488 -668984 -666024 -627320 -402402
10619 -402402 -310499 -454816 -350623 -351127 -203543 -227497 -96644 87257 -30189 -156531
10609 -156531 -191460 -69599 -53968 76567 12212 15331 -3584 26276 -139194 -130985 -33883
10598 -33883 31402 -18475 -202476 -356547 -159252 -95105 -20040 128606 228009 43336 -268374
10587 -268374 -396544 -304199 -117520 -83844 43966 161660 44564 -64086 26501 172595
10577 172595 80309 42587 -21662 -122145 -151050 -313718 -467339 -386044 -67722 -186737
10567 -186737 -136574 79692 182591 273409 283464 467906 477962 302495 132283 -116947
10557 -116947 -222492 -19619 20248 82753 55910 58283 42859 111203 45842 -189746 -308031
10546 -308031 -230230 31637 127263 -44 96428 -117069 34243 257863 312162 159225
10536 159225 103885 42846 108857 -46757 -502072 -718597 -726420 -490416 -270604 56183
10526 56183 239985 326046 324946 8590 -290748 -488686 -432561 -459606 -530205 -556649 -567932
10515 -567932 -616990 -862315 -865475 -535218 -179355 -25220 16321 67401 87867 16258 -8228
10504 -8228 9922 370588 478241 207098 -151098 -50684 72727 124307 67603 -119988
10494 -119988 -66695 199061 -1868 -193376 -456549 -428352 -172707 64447 235222 120684
10484 120684 190531 -33747 -93845 -13707 -193824 -109684 -214088 -512605 -580779 -522300 -556522
10473 -556522 -387468 -94814 -66935 -207867 -101388 -125996 -204383 -297037 -240551 -141074 -199830
10462 -199830 167750 396252 24493 -197293 -215494 -291851 -277945 -3078 -31306 -70738
10452 -70738 86161 223615 85332 -124098 61080 188215 225975 87149 -375435 -139896
10442 -139896 161981 379595 332966 82852 -26351 -127381 -221442 -236211 -105519 -152476
10432 -152476 -201120 -157302 -104141 -61630 -7881 143596 41908 -4723 -63487 96565 122843
10421 122843 67967 -60598 -207186 -266272 -182054 -5364 -76317 31319 -92105 -143920
10411 -143920 -30454 280644 335604 279263 149965 -89385 -91787 -249333 -444420 -691226
10401 -691226 -621117 -259249 79628 306104 230850 34587 -86110 -29018 -46383 -38297 -36878
10390 -36878 -207987 -394983 -298530 -386470 -360083 -369136 -362418 -139573 -10507 -12653 -132441
10379 -132441 -220610 -325651 -265315 -244999 -179206 -54193 -11014 -15233 -225213 -517127 -543794
10368 -543794 -442744 -394108 -260996 -326798 -40331 242716 193645 -87936 -165999 -164254 -290833
10357 -290833 -185796 -224454 -206746 -170564 166496 180264 769 -263200 -533226 -508928
10347 -508928 -370288 -267826 -219569 -139580 5518 82202 -9268 -176535 -179733 -40763 -89849
10336 -89849 78921 45641 -152209 -176 224812 -13750 169405 262557 121736 44362
10326 44362 -99099 -312679 -362851 -435848 -339008 -131795 -103405 -17601 421414 354252 279596
10315 279596 167070 -193775 -187914 -200230 -81977 332188 427886 282636 153346 211358
10305 211358 228930 239207 300074 90727 -251082 -565809 -494439 -182112 35955 295782
10295 295782 273893 370014 305595 62253 132490 149143 -45195 47503 66414 4959 21890
10284 21890 132957 204091 267162 259493 175821 288999 685867 654054 359800 338355 235776
10273 235776 322907 73498 -219009 -504237 -368958 -270974 -123491 -215138 -250194 -8771
10263 -8771 -12512 -261352 -152068 -100572 -76351 25707 87808 206835 163358 246143 656
10252 656 -22753 122638 322543 297174 -74282 -364461 -205580 136016 222967 398173 18754
10241 18754 -144901 -91429 -301292 -577451 -521393 -397662 -79901 81377 180265 52096
10231 52096 -169824 -35920 262710 344825 257588 254204 258053 131408 243670 462472 440840
10220 440840 282026 90126 -124459 -84786 128095 290743 348912 229022 -25344 -69249
10210 -69249 -76207 -56911 107610 190961 108842 14076 -117139 -276736 -263877 -195522 -211229
10199 -211229 -115427 -326755 -449068 -429539 -360304 -316714 -192833 -373128 -415091 -535599
10189 -535599 -480568 -369421 -353530 -166381 -256643 -65770 43569 304192 171571 194813
10179 194813 43251 -48474 -69402 142199 58420 -6552 193942 455902 346853 27595
10169 27595 -84599 -208469 11482 219069 159770 -145452 -339615 -357932 -110238 52791
10159 52791 164949 339243 314424 229039 215703 162351 57131 132241 -25190 -70039 -260207
10148 -260207 -324496 -163667 68585 -56855 -101240 73304 219858 222920 100496 -91848
10138 -91848 -152876 -115521 -96945 -38657 -315827 -298371 -38100 144598 46647 106974 1596
10127 1596 175565 149448 -100143 -160019 79696 327455 140948 -301927 -511776 -290526
10117 -290526 3083 310527 447590 149868 26964 111573 45685 6597 -29945 87313
10107 87313 179392 113447 16975 224488 358868 252307 -66573 -188230 -165347 -49969
10097 -49969 72321 33077 139071 181494 -28582 -246488 -215392 -199073 -293344 -313786 -335247
10086 -335247 -162216 -156350 -26852 -178669 -250036 -190184 -65772 -134003 80886 421521
10076 421521 603684 648721 326115 170993 21909 -68488 -135111 -188258 -54876 -98101
10066 -98101 -81821 46706 -28534 -45754 -151369 -60231 -80067 -11589 130878 234909 292227
10055 292227 142925 -18137 158401 184554 31742 203487 416941 279843 274612 378211
10045 378211 359336 348927 104191 163370 301573 229667 487193 647917 349320 31221
10035 31221 -16480 49227 81449 -120210 -67914 -72274 -166356 -191589 52887 -16048 -56898
10024 -56898 -109783 -65572 125845 44249 -34640 85259 133971 -76064 -228000 -508146 -409918
10013 -409918 -292619 -136966 103001 110270 214891 7531 -373661 -540389 -493351 -291525
10003 -291525 -138580 -183700 23252 1082 -72713 -209719 -237004 -310724 -262039 -272669 -127734
9992 -127734 -5867 124583 357179 404343 249874 319833 245937 240653 312513 145428 202972
9981 202972 146886 -117073 -7142 17325 264514 266098 12874 -119967 -99430 38041 169650
9970 169650 95126 119873 74618 363693 369178 359884 175528 -1859 -131951 -58941 -14745
9959 -14745 24675 -12884 102907 77869 52538 115212 136239 320256 307054 239980 -23035
9948 -23035 94972 -3184 -49369 133264 268930 257321 115803 68293 272863 324611 163499
9937 163499 119261 116957 76951 234035 277707 426825 149409 90528 97755 87299 -19615
9926 -19615 -8969 -55591 46323 342767 392942 314771 491413 514118 535711 626632 458820
9915 458820 471542 520866 553851 485924 374947 418698 511420 617751 685537 759604 827924
9904 827924 764814 529550 500844 606989 771749 862132 1144994 960025 890431 1108986
9894 1108986 1170124 966950 772740 618772 442460 320753 323441 332111 190528 453557
9884 453557 724261 512640 423304 281622 102913 86206 186824 307646 352546 517893
9874 517893 371713 394604 430989 545174 768641 740738 570838 494224 492815 637710 409808
9863 409808 307538 591077 960318 1266991 1306964 1402452 1528556 1674705 2084434 2872348
9853 2872348 3909858 5640376 7173619 7848004 7479686 6527738 5350097 3956434 2928468
9844 2928468 2262273 1806986 1454389 1145057 901648 790194 837115 805269 695055 433988
9834 433988 769892 843728 828263 990834 933280 646602 491597 466567 464183 602201 718826
9823 718826 655174 793692 889721 714802 884170 772440 907079 774859 703408 859137
9813 859137 917547 940122 802153 668425 793515 830039 872152 919223 819124 748183 654778
9802 654778 559760 567323 631396 555003 513814 536504 600824 688708 678089 551320 500674 541526
9790 541526 545618 782487 954905 1066735 906089 624257 805069 902483 956109 943167 924340
9779 924340 853553 806411 967644 911653 842787 785083 630196 713370 802594 682048 618392
9768 618392 770762 944746 839252 654045 757041 832266 776477 988116 1065630 1024006
9758 1024006 1000646 783634 667598 721161 824174 992218 993538 958444 725710 648858 724482
9747 724482 733993 798949 1086355 1054034 1208589 1221284 1092759 744245 730523 810517 843830
9736 843830 1135050 1433239 1223624 1161605 906923 936177 1216706 1501929 1572928 1657108
9726 1657108 1748801 1722370 1523934 1682280 1579276 1546219 1727787 1755213 1841489 1875678 1886847
9715 1886847 1953992 1887568 1997362 1698080 1617894 1725253 1838099 1836045 1955424 1931503 1884969
9704 1884969 2169253 2350803 2095415 1779557 1954273 2182508 2229185 2139004 2033289 1888139
9694 1888139 2089873 2143786 2076833 2087455 2241890 2265538 2137096 2069290 2186582 2317765
9684 2317765 2140947 2351979 2610549 2832690 2915283 2894915 2677266 2657741 2683882 2877104
9674 2877104 2867760 2877253 3020834 3064474 3141056 3062853 3098424 3233735 3162294 3173230 3251695
9663 3251695 3230843 3264518 3464178 3809337 3935475 3932701 3665322 3834150 3888880 3704422
9653 3704422 3660038 3954054 4075041 4061686 4045632 3954160 4283768 4301978 4168344 4211498 4271017
9642 4271017 4472684 4382217 4255229 4393589 4753561 4937615 5053548 5262512 5348823 5311172
9632 5311172 5157238 5253272 5234434 5171075 5266500 5544063 5372471 5130431 5185261 5156928 5145688
9621 5145688 5368714 5431670 5666292 6116972 6163408 6066308 5975438 6074630 6079911 5988135 6014214
9610 6014214 6013368 5899314 5978669 6042096 6041395 6141729 6203885 6003113 6434027 6387523 6370655
9599 6370655 6319712 6174656 6079623 6324658 6420284 6522149 6502854 6568546 6527142 6502917 6556218
9588 6556218 6595378 6394868 6185965 6481457 6808827 6674730 6520863 6396385 6510103 6531196
9578 6531196 6272385 6045850 6026344 5961880 5852050 5901665 5817604 5835619 5732642 5481810
9568 5481810 5615669 5800219 6137828 6386490 6255588 6059751 5828989 5687440 5535435 5430875
9558 5430875 5258925 5073687 5107873 5325927 5355857 5427427 5747607 5782673 5563949 5363232
9548 5363232 5005228 4865818 4636572 4554086 5065596 5527975 5427333 5319796 5292871 4989585
9538 4989585 4855766 4633835 4474678 4139995 4151260 4271998 4337510 4251049 3992778 3889815
9528 3889815 3836869 3982400 3933022 3876887 3978599 4077837 4342516 4317383 4177946 3839762
9518 3839762 3631844 3617762 3647828 3488304 3252344 2969652 2770224 2674299 2701825 2702026 2815554
9507 2815554 2789488 2576803 2225242 2194561 2163257 2350150 2735579 2793399 2924172 2726168
9497 2726168 2568796 2680663 2850326 2757197 2792457 2720575 2309814 1935075 1771557 1834289
9487 1834289 1886514 2200587 2337581 2144413 1990029 1954674 2025618 2174698 1975096 1708868
9477 1708868 1913845 2156918 2069498 2185615 2055632 1988744 1992358 1884928 1732062 1542229
9467 1542229 1401935 1576388 1605436 1482066 1598387 1440273 1220561 1157404 1002877 1133615
9457 1133615 1259357 1210708 936613 821842 780470 965610 1106425 1255058 1300503 1547316
9447 1547316 1690356 1640444 1180921 843504 891257 856277 790837 1141000 1364513 1421972
9437 1421972 1504943 1325364 1168246 1181784 1242711 1153322 1193634 1377736 1423651 1449134 1372910
9426 1372910 1204341 1077704 1183918 1166870 1090155 1176512 1158992 995657 955744 1111530
9416 1111530 1208183 1147094 1006039 992366 722040 954935 997233 1352205 1464148 1618232
9406 1618232 1512158 1244068 1055453 1018979 1117155 1157589 811251 611656 772948 708230
9396 708230 773685 841736 705392 787841 955851 811251 651854 757571 729303 677791 666756
9385 666756 639252 588968 608680 719477 700262 641818 770309 821500 656280 433624 489227
9374 489227 589792 708654 630785 320342 222263 115467 105192 163369 174261 54779 -131928
9363 -131928 -214147 73210 284459 451081 258164 10993 -61009 36944 226534 533244
9353 533244 644645 473882 405760 563347 368807 275541 287467 437361 453402 225561
9343 225561 82248 192754 231153 162137 310299 585254 614317 638937 597856 753729 887815
9332 887815 918600 691022 371369 251597 192707 329691 547555 513846 361569 284901
9322 284901 270882 328833 289450 433941 602164 613273 337366 349386 518060 388299 612079
9311 612079 700371 622667 433528 397086 408158 455082 547211 743736 920918 641741 579431
9300 579431 401274 202746 220586 538214 582222 389668 485310 329327 289068 489785
9290 489785 542579 371814 385061 274824 -13844 -62030 -29862 115530 65554 93164 304848
9279 304848 465733 546404 615945 470637 246279 450443 251724 -58656 10636 91733
9269 91733 99356 247143 479976 484473 274875 214444 228278 119646 165250 186558 298446
9258 298446 399839 213204 342690 483058 258436 238154 318383 176374 289360 419204
9248 419204 361837 308556 341012 277420 401970 604113 539040 516807 401667 278400 152049
9237 152049 234936 335732 571722 617251 606584 565585 326946 379395 467955 374034 526427
9226 526427 443645 394551 540119 610933 368692 358520 319264 441228 395985 81103 25331
9215 25331 124415 255797 253278 273228 441742 532097 456959 312175 305978 668746 733955
9204 733955 522968 375078 408710 309370 207251 80567 -77940 -139837 -186235 51602
9194 51602 205832 429116 645250 702243 370396 247655 140493 462425 648714 571399
9184 571399 322308 351962 516012 574167 510257 315071 571256 536013 56870 -32023 170083
9173 170083 356406 264499 291086 88297 -6096 -89417 -138116 -82103 -129138 -586 245972
9162 245972 518445 262966 143522 271705 516602 909677 1099675 867848 494338 344309
9152 344309 448442 369228 369746 549755 308051 189422 134145 110812 151747 89228 243255
9141 243255 354098 459700 502439 340054 187025 185571 127845 222228 301271 213630 66897
9130 66897 240198 457517 439949 272554 299690 215588 245727 344740 188966 -112459 -149955
9119 -149955 4264 234294 210618 465437 747769 870906 989677 935352 505881 318394
9109 318394 425256 555106 458612 268831 204928 9682 -61880 32465 36108 155389 118170
9098 118170 25084 -183638 -321800 -68967 176443 376115 399233 52387 49155 205878
9088 205878 200697 258138 333450 385528 368869 189157 10025 99653 157796 271916 302007
9077 302007 163138 224129 206742 199414 175662 227607 221360 43423 -52693 -71661 32974
9066 32974 256878 165595 -68998 81480 134990 136241 71523 125996 43486 179596 443312
9055 443312 371943 552833 663181 408351 303780 66714 110565 255760 242062 262967
9045 262967 271894 33360 -48663 41186 -102581 -110137 16012 130544 314864 291996 307700
9034 307700 264822 123788 57159 99679 -131258 5461 136065 48901 -140344 -144555 -72330
9023 -72330 -66620 -35155 -358603 -506204 -326790 -159777 12444 -25901 -130343 -76375 -195546
9012 -195546 -159672 -134147 -110499 -71555 108465 217930 56559 -75736 -34588 77188 393796
9001 393796 663528 655425 318560 191758 39400 48035 -105827 -259304 -112671 -19339 -66885
8990 -66885 -84654 -98885 -231673 -272508 -122628 81837 243185 -31572 -272375 -184649 -78613
8979 -78613 -92019 12830 341079 521911 402687 386590 236076 2596 84308 99860 97284
8968 97284 113050 102269 -86672 -429751 -459676 -537366 -251059 97902 103535 -65158 162725
8957 162725 103060 798 79248 205906 156489 79867 86944 116605 116709 72443 97084 31197
8945 31197 -57654 -152377 -287009 -31547 353209 327508 27837 -112202 -80174 -24083 -91742
8934 -91742 -62595 22366 70959 134287 223688 206726 243062 241664 183914 130892 153358 139505
8922 139505 -28664 29845 36052 -194526 -205986 -132440 -181397 -6185 155642 378230 307888
8911 307888 284566 256231 156619 117706 284998 290433 238548 231472 80841 12 -185501
8900 -185501 -201369 -176786 -186825 -32255 184538 218662 177748 262356 127350 61304 75373
8889 75373 331186 569638 400198 379684 384791 208093 157491 -77761 -121764 -3213 -29234
8878 -29234 107240 157291 166161 -91862 -176528 -4583 -153535 -203760 -172504 -197794 -102560
8867 -102560 48879 127905 54003 -12606 -2893 105782 -39759 73932 448337 526715 152917
8856 152917 -73752 -33292 -21515 -1144 79125 161141 73812 -54363 108149 -47018 -167202
8845 -167202 -87138 -72849 56213 -116788 -152357 -186609 -266023 -2340 128082 120366 244086
8834 244086 157754 168084 302286 143258 -2144 201200 259796 262955 177343 226257 118967
8823 118967 -18674 -3062 161374 327836 467509 250762 148794 36682 -82154 -257102
8813 -257102 44094 52655 43179 47057 56962 231127 134187 -17014 -3372 -39971 102221 96074
8801 96074 112307 194242 210372 20192 -136379 -175917 -81623 183931 153261 -22033 230300
8790 230300 367313 334982 222595 85727 106055 -15165 -148979 -303684 -322776 -272013
8780 -272013 -150737 -181706 -192692 -78435 -186097 -288143 -83807 8384 169750 12180
8770 12180 -113184 -218106 -180883 -66461 -124347 -227095 -258721 -184044 -236141 -265281 -107842
8759 -107842 59012 35123 127225 43533 161740 107198 -123358 -110214 99236 155307 -116477
8748 -116477 -354110 -140575 56630 92720 117811 1816 -221944 -19711 -127122 -269174
8738 -269174 -13345 -8269 -194802 -7507 -41416 57434 305225 102919 -134716 -7689
8728 -7689 388117 301267 146411 -52991 -272573 -426532 -114774 -35028 -54148 51345 193953
8717 193953 391611 384836 255521 10779 22459 -24667 -141165 -16782 195383 316796
8707 316796 396636 376354 303654 430808 246776 191160 216686 339849 375992 -10089 -278563
8696 -278563 -188521 15943 130463 129272 -185166 -140669 19668 11075 111722 110051 113785
8685 113785 77977 219278 68587 -12489 110578 136160 128779 -120239 -170495 11406 113380
8674 113380 82499 14214 -117227 -132020 -133824 -66668 -71090 -147329 -110713 94189 -28056
8663 -28056 -159555 -22130 148958 203107 218074 322183 449998 515350 541071 491865 405896
8652 405896 646120 874761 940812 1348298 1847777 2224077 2191596 1950646 1815778 1606870
8642 1606870 1092558 708298 794210 623591 519019 302368 237278 227857 97498 -62452
8632 -62452 -140241 -171468 46401 215808 444292 410397 476348 845542 999849 1209707 1333879
8621 1333879 1620763 1658120 1546656 1257147 818257 756969 540893 486120 747772 835789
8611 835789 711264 597541 760865 1169471 1445622 1601410 1946940 2664694 3202518 3722287
8601 3722287 3725184 3835037 3479838 2894954 2250944 1544897 1402322 1448977 1455746 1533785 1481653
8590 1481653 1296418 1223273 1216906 1166877 1159266 1356508 1508178 1753565 1691084 1657188 1901535
8579 1901535 2437586 2708672 2950009 3250586 2997483 2593166 1786541 1279616 1330639 1143000
8569 1143000 1197905 1240076 1208054 1105233 1168341 1087899 855037 587433 476018 849000
8559 849000 1186418 1495720 1833268 1803175 1786891 1873270 1671667 1261251 645791 432881
8549 432881 427656 447783 496244 471426 449702 268450 286543 608755 847135 790122 520614
8538 520614 546351 826469 1105064 1103272 1040555 1337888 1680062 1608302 1342211 1402098 1329214
8527 1329214 1118491 1273884 1390766 1469575 1432330 1286642 1211207 1087166 881830 720889
8517 720889 570428 297866 157300 -49725 -150412 -147186 -96852 -138632 -134544 -17142 124252
8506 124252 319863 447970 550776 463216 497886 466486 403624 351991 480538 368170 351835
8495 351835 245215 229587 307979 241872 51767 130172 -30911 -54598 12132 -18291 -40818
8484 -40818 -4089 129502 357591 606271 692395 493148 545213 577610 323745 152697 279761
8473 279761 375933 272005 159725 -239490 -408276 -316325 -89045 -21950 193304 371898
8463 371898 282698 267068 430679 304164 354815 360711 243631 138531 11408 158534 355914
8452 355914 303416 170626 88830 81524 -164121 -240544 -62014 165906 485101 234017 -190815
8441 -190815 -283435 -173427 285329 342306 333276 311014 345560 399486 351127 410230 348848
8430 348848 146719 -214360 -25570 127699 145109 160765 -157679 -288141 -99360 15834
8420 15834 168199 365403 437230 450981 356244 169038 -82857 -62112 71541 131315 -102129
8409 -102129 -262012 -116628 36527 135069 320200 367329 95401 24294 200381 515019
8399 515019 456679 232617 -42436 33906 -11441 -316861 -371611 -138276 71197 338339
8389 338339 271815 406849 63607 -178007 -210692 -188491 -85211 -302493 -416129 -433290
8379 -433290 -160095 13730 58868 195169 122723 1316 -125943 -172441 -77405 -143459 37460
8368 37460 48609 70887 -116679 -137824 118558 164020 -53133 -172343 153532 367978 226520
8357 226520 148175 46870 -129264 93366 78879 232617 200803 46541 105403 184603 158779
8346 158779 83934 139308 26016 69874 257686 359583 319279 383847 315404 102858 112162
8335 112162 262640 234048 178097 -2944 70321 59826 -179622 -126607 -77920 -90732 -58724
8324 -58724 29992 226935 225419 48586 -162308 -186339 -100890 -94211 -275055 -178315 187626
8313 187626 142834 135744 336911 470293 363829 242305 322844 502108 353905 366716 237595
8302 237595 182831 -11270 -116400 53219 28016 -242712 -447273 -495576 -82393 212970
8292 212970 181718 173914 -30484 -159771 -112381 -34939 107438 202590 111289 77319 225
8281 225 -34178 196805 194343 324712 -9631 -163931 -39828 -148073 24172 41283 -81569
8270 -81569 47941 189868 78001 -68361 -98606 -113408 -114013 6282 -110940 -150418 -120156
8259 -120156 -21605 -17399 -212026 -281891 -414848 -193927 -157094 -345663 -407558 -201441 -47581
8248 -47581 141724 233753 266653 77277 125038 145790 268258 221442 135411 136341 280920
8237 280920 322598 580734 358156 144837 23126 -105934 -74027 53026 -99326 -272342
8227 -272342 -301518 -119973 57099 166569 162202 -12878 -58089 -111990 -102585 -106797 100187
8216 100187 30986 -28435 142786 173829 62318 -71253 -36258 -75325 -374515 -595268 -661048
8205 -661048 -545251 -89100 -80229 -4527 211345 227928 72473 202368 280958 176128 53386
8194 53386 -81026 -96657 -35228 -137744 -93422 -116658 -310228 -255946 -304131 -195682 -165557
8183 -165557 -335505 -367289 -398980 -169187 -36064 225452 326974 380483 205376 27082
8173 27082 141358 179418 82240 210363 264619 39733 -269428 -238543 -233410 -392846 -184200
8162 -184200 -145418 -156073 -82752 -39940 -38850 -39749 -135589 -129008 356563 387583 179405 14349
8150 14349 -35026 -80275 179401 202279 149373 -20542 -111095 -138820 -119013 111097 555413
8139 555413 596729 296973 177431 -12179 -56871 -86463 -119771 -227395 -70208 -40648 -68162
8128 -68162 -46087 105152 334384 294286 131344 66036 -97481 -117667 -256976 -249851 33534
8117 33534 112931 23468 -250982 -240407 -144135 -166238 -276987 -115836 -111360 -209170 47615
8106 47615 -91994 -263501 -464936 -445397 -389717 -516502 -521851 -370744 -415535 -310870 -70060
8095 -70060 31703 226923 97623 -183181 -95293 171435 130980 105945 -65909 -199223
8085 -199223 -145917 131193 77370 148208 126789 144699 328366 359870 37620 -56868 -78941
8074 -78941 -325030 -459053 -492114 -515345 -353268 -120183 170180 338209 240501 179734 155074
8063 155074 253185 172141 63891 -39465 -219545 -297850 -332699 -383100 -92475 133318 1388
8052 1388 22039 187284 115266 -51073 -278421 -403084 -272726 -145979 -235642 -355182 -202575
8041 -202575 15195 -149940 -329147 -376905 -541977 -390403 -128916 28194 261438 373164
8031 373164 167435 -150340 -210220 -269154 -190733 119925 97168 5172 -18962 130654 115621
8020 115621 179101 29925 -42133 -177781 -151664 -200026 -245009 53722 196225 340297 579502
8009 579502 514340 267866 168665 342761 406086 247971 272118 465029 744895 589089
7999 589089 338220 390421 335613 195861 250266 288398 139167 -28798 -103327 -32402 111690
7988 111690 208194 351817 567018 445491 277543 274294 18781 -202470 -224723 89875
7978 89875 127373 -167158 -273313 -271076 -207126 -296241 -303718 -278219 -289460 -146753 -218918 -130360
7966 -130360 154205 616631 774741 525311 443276 545150 671212 549159 436099 338523
7956 338523 375272 410875 356986 391506 422271 372680 188080 161550 336702 286332 148252
7945 148252 245832 160070 180189 259355 378799 465323 368507 556219 575656 504801 536531
7934 536531 456437 216794 377294 313293 126979 56746 -148206 -89263 -208189 -122607 308073
7923 308073 535632 554173 742483 687726 424265 432146 358206 19592 -127907 -29132 79194
7912 79194 -56272 -11848 197089 293802 316759 276885 142496 31100 366443 214877 345892
7901 345892 454291 442542 389597 258507 257018 314567 349586 392421 56529 -61470 117152
7890 117152 127600 -20206 -119452 -96708 171460 274282 246053 175630 -22648 160715 -72219
7879 -72219 -44481 -9463 -2004 7149 236036 198570 103887 -13036 -122329 -95137 130130
7868 130130 240358 161286 134701 -57751 135338 422608 402112 236790 190110 244894 430387
7857 430387 104311 -224313 7968 120335 33447 -150618 -50053 -636 50228 290793
7847 290793 262089 113633 38604 118947 109239 -6851 -49398 -122203 33058 338448 256535
7836 256535 132649 190915 220232 -135336 -273640 18794 291536 302169 242286 86784
7826 86784 -72538 -33208 81626 291767 125226 -107061 101551 430521 213110 -24387
7816 -24387 -180615 -216067 -120118 -135239 -104150 -188790 -260658 28251 -101248 -176298 -61962
7805 -61962 58404 -50519 51371 -104009 -290029 -122048 -12203 -90028 -75026 -105365
7795 -105365 -182973 -29495 18123 108888 132854 -159699 -321830 -391852 -361528 -138383 277036
7784 277036 597455 292737 -64748 -266985 -337110 -448310 -465414 -233597 -308380 -352435
7774 -352435 -379062 -419371 -296186 -254855 -173357 -83822 -235536 -136829 -138678 -114963 -346378
7763 -346378 -326267 -25342 -73940 -366844 -437451 -467803 -656867 -476997 -71030 71247
7753 71247 -111638 -251438 -218647 -81556 -166449 -183421 -182704 -209372 -129079 -96085 -41746 -96238
7741 -96238 -169609 -295756 -338405 -74451 -102384 -124718 -212844 -174910 -80387 -167969 -163384 -214035
7729 -214035 -276569 70380 190805 346175 287918 -47874 -242124 -275292 -40958 -97327
7719 -97327 -208532 -126959 -37769 -248010 -167619 133643 347449 511688 236569 -83871
7709 -83871 -155881 -36490 -9101 -271514 -357248 -138935 -140412 -116516 -38250 12079 -97920
7698 -97920 -66983 175615 305470 234313 25933 -95299 -103429 -25282 343927 384171 337619
7687 337619 92964 12624 39847 -101511 -230649 -125668 -26867 73528 -95129 -249789
7677 -249789 -30647 167897 329339 151230 -153952 -322100 -50889 154190 149843 22019
7667 22019 45050 30817 8569 -67223 158033 246317 -82239 -32228 245641 215787 151554
7656 151554 -67303 -413964 -617480 -566431 -473690 -249915 -43134 17425 40138 213597
7646 213597 -39462 -137471 -123040 108090 150855 14715 -40928 117427 155354 -4698 125773
7635 125773 298287 191286 60601 -75668 -183186 -70087 -209466 -204743 54344 -73512
7625 -73512 -149223 -125335 -174236 -154872 -137738 -197165 -304040 -161275 24224 250451 246719
7614 246719 39741 -41523 121096 188122 206140 -62170 -144930 4674 25136 -27842 -151977
7603 -151977 -57413 -22114 -200113 -364392 -323270 -139147 86508 71577 -20212 12114 9431
7592 9431 565 -142006 -421471 -405878 -33311 184348 257321 -12873 -211528 -47767 60293
7581 60293 7524 -158822 26947 247166 409583 232043 133164 103339 -161998 -27056
7571 -27056 120803 179124 115579 195474 171520 101119 -116440 -342193 -267849 -339612 -346175
7560 -346175 -335052 -518557 -208438 -81747 -72820 -11572 -233965 -321675 -301721 -311782 -549121
7549 -549121 -549488 -295011 -166289 -357983 -598926 -807297 -683557 -436115 -261013 -492997
7539 -492997 -143497 73666 -104797 -348239 -360330 -333206 -398203 -335273 1364 82077 34532
7528 34532 16263 -20532 -3622 20488 -174594 -110201 -48844 -169420 -166621 -245925 -233759 -215338
7516 -215338 -57615 -98315 -128375 -29597 174847 366614 264473 -83172 -67219 71085
7506 71085 341305 337339 26123 -53295 -53979 12771 76243 151337 225401 -33744 -371800 -645690
7494 -645690 -656983 -261844 177278 124706 -345270 -616867 -431624 -285018 -317188 -259227
7484 -259227 -26900 97403 65283 70679 -49932 -51030 68096 167423 327167 234391 136018
7473 136018 74340 220207 162228 51268 -30831 -164241 -205835 -34061 -21052 -80171 -82274
7462 -82274 -311492 -382631 -240487 -47507 202339 7521 -332954 -379172 -269890 -446546
7452 -446546 -441023 -551941 -599869 -309550 -131457 114969 167687 70314 -249442 -187641 112533
7441 112533 380864 295894 131749 59957 191332 185617 111325 147093 74226 -175477 -148267
7430 -148267 31638 120396 1400 -141988 -385120 -184060 -167013 -53047 -31313 -6369
7420 -6369 -9970 90021 226387 133519 196506 60972 -169131 -107663 -148058 -293234 -248499
7409 -248499 9414 -41132 -64573 28596 238109 289774 295281 28985 14046 58588 -13026
7398 -13026 -20691 -135494 -131686 -94516 53958 137857 127613 -42548 -169318 26813 76754
7387 76754 34888 -47654 -413340 -276944 -142516 -12267 -29700 -134986 -184595 -314259 -676704
7376 -676704 -628449 -621902 -453260 -204133 -111881 -149859 -282103 -444892 -469745 -321918 -448488
7365 -448488 -352607 -87864 -110248 -362987 -279866 -28055 25747 -135183 -391090 -251260
7355 -251260 -114062 40731 -58376 -385641 -328626 -238256 -206797 -170080 -188515 -364793 -399144
7344 -399144 -493596 -539601 -424494 -93248 44622 -6855 55745 88276 34084 29716 -191928
7333 -191928 -186619 -102967 -245417 -353615 -98017 4688 -260321 -134047 32510 1856
7323 1856 -167294 -417091 -471157 -429293 -619571 -389461 -169737 -15798 23210 -58087 -198783
7312 -198783 -133031 57256 177445 231267 203372 102576 -27460 -174928 -38944 18113
7302 18113 24088 -231921 -341143 -191594 -234190 -544393 -601351 -501542 -168684 -176460 -298737
7291 -298737 -404902 -417212 -221453 -208620 -297783 -209383 56116 116110 29237 82153 68957
7280 68957 -97422 -221199 -153371 -180083 -205398 -15165 137464 -234859 -277561 6326 215382
7269 215382 120811 -139279 -311462 -157594 58514 120242 53422 60478 -77328 53812 10758
7258 10758 -163195 -239765 -76737 -52529 -13713 -95905 -95840 -250604 -278580 -234827 -60173 65931
7246 65931 245916 240481 187339 210688 7394 -86130 70025 181071 -624 27598 38316
7235 38316 99282 -9807 -154187 -256448 -93648 41185 338008 187950 17232 -32429
7225 -32429 -198160 -323181 -230046 -92919 -82083 -145989 -374556 -392412 -223100 -205549 -240874
7214 -240874 -69361 68229 73006 -207543 -194500 -197016 -270094 -26207 10429 -48613 -102282
7203 -102282 -249699 -179400 -137077 14726 32011 19576 206952 104413 7568 18002 211299
7192 211299 295097 181274 -13612 -150584 -300419 -226628 -221344 -300913 -370209 -298999 -327702
7181 -327702 -306410 -206612 -24947 47766 -50738 -13394 -214314 -347370 -329610 -256034 -72853
7170 -72853 25188 182850 114899 -54349 -82784 -5534 53481 -192687 -255984 -134550 -135795
7159 -135795 -228567 -189659 -413185 -434595 -151299 87398 161110 138912 -60932 -306921 -256818
7148 -256818 -275461 -485937 -266868 -330633 -378034 -106915 -4114 82700 -17147 -146486 19752
7137 19752 23654 -91761 6303 51524 11611 60158 -166116 -223161 -390714 -285590 -171889
7126 -171889 -161031 -288310 -302739 -346625 -146860 -18796 89785 -3941 -43345 192149 221855
7115 221855 301001 182847 237424 206245 153869 -46659 -170687 49104 296219 304591 -22585
7104 -22585 -57785 73856 56923 -146611 -137053 -122280 -317964 -68205 34256 -105439 -98466
7093 -98466 -203286 68277 185592 220257 107428 170215 472873 218726 62077 64695 8154
7082 8154 -256060 -359914 -199007 -101953 -30074 -127334 -262113 -155722 -170640 -273530 -246412
7071 -246412 -249999 -584812 -739052 -777723 -547587 -93502 322234 363693 65158 -165083
7061 -165083 -427752 -335122 -338406 -333722 -467945 -179282 76085 -6037 -173835 -117965 2991
7050 2991 -181586 -240830 -174692 -78114 -32329 108627 229883 188276 209424 351332 487243
7039 487243 345290 210553 213033 -67503 -117606 -194417 -189443 -77496 105480 15258 -178798
7028 -178798 -267823 -361579 -276995 -199978 -339583 -472581 -555003 -406976 -85579 -192136 -319575
7017 -319575 -229623 -154940 -103336 -129224 -402285 -336020 -55199 -12868 -9065 -23399 -132879
7006 -132879 183090 549396 404697 186206 -40105 -86135 -97022 -212378 -247213 -95481
6996 -95481 4633 -16727 27338 269340 375263 361831 200941 356503 205610 -13155
6986 -13155 -111255 6011 -36225 -229049 -194104 61040 77659 311049 313531 221665 -225172
6975 -225172 -188788 -95402 -85339 -40704 -233716 -374867 -380423 -441756 -475104 -602662 -819806
6964 -819806 -558589 -101692 7588 -142793 8763 56128 -263199 -340330 -175200 -267197
6954 -267197 -118494 -77727 -151085 -252302 -255740 -349242 -296046 -130710 79032 17249 -252907
6943 -252907 -97889 62114 -79335 -68511 -78138 187424 230132 296528 497760 406615 242948
6932 242948 262422 243332 183544 256706 81079 -118789 -244608 -492477 -522468 -381269 -198825
6921 -198825 -184906 -388463 -314074 -79656 -27343 -91960 -33369 -28612 -182020 -106943 -21098
6910 -21098 -97126 -249080 113727 219893 232870 61512 -35756 123379 395889 219466
6900 219466 97358 19501 33181 -125545 -101106 -287567 -205780 -45923 67971 140410 91811
6889 91811 312158 498600 391720 341736 230104 340533 563438 561172 528668 131999 -215603
6878 -215603 -401117 -269128 -380809 -389257 -446767 -287236 168848 271711 274178 122180 86928
6867 86928 5402 -51176 68365 -143646 -270355 -259619 -189085 -520980 -622949 -631622 -550833
6856 -550833 -216221 -37102 -47677 -89752 44788 149853 -139150 -374876 -330918 -358917
6846 -358917 -268403 -132472 123518 193323 68647 -582 45005 -232840 -198854 -6921 -103621
6835 -103621 -192908 -18390 -83346 -209023 -284349 -190115 -309743 -312010 -140206 -40632 -29857
6824 -29857 7877 -124273 -124003 199314 298105 335646 277294 134184 205742 270268 369699 126360
6812 126360 -77731 23983 -2229 99610 -23734 52257 35276 -120740 -271525 -275552 -175125
6801 -175125 -342864 -328248 12637 19278 -8598 35986 314974 344698 247327 179724 -125206
6790 -125206 -347350 -425230 -262996 -103869 -32403 200194 115970 -147232 -339336 -433986
6780 -433986 -247207 -90846 -169697 -281590 -227726 -245474 -102180 -45431 36661 68778 147518
6769 147518 67328 17664 63086 141329 167877 328436 370582 285840 169208 129148 259569
6758 259569 -28920 -219919 -463279 -469101 -428119 -392180 -193945 44102 206978 296510 315873
6747 315873 114977 -108760 -54380 -96695 -222566 -196105 -12002 52392 40769 -125300 -20299
6736 -20299 -319995 -520715 -411592 -351066 -96680 15403 55025 -4477 -122552 -265186
6726 -265186 -192491 -212427 -83001 -91366 -79485 14083 -195126 -120577 34670 303170 416453
6715 416453 573557 455782 355999 114112 83697 89210 -38447 -1842 16750 -69702 15917
6704 15917 -59945 -286411 -245361 61341 111884 -127820 -216296 -127698 -281302 -354125 -213883
6693 -213883 75224 113805 47904 4113 10559 132699 188953 251908 -15045 -118165 146663
6682 146663 111876 -91396 -139359 -340787 -609403 -709327 -549235 -427925 -211199 -69751
6672 -69751 -99751 -418897 -285464 -292673 -251806 -250412 -387721 -228830 -221206 -363050 -300630
6661 -300630 -241143 -230436 -176657 -203469 -404852 -532539 -444127 -700693 -709256 -686152 -665095
6650 -665095 -369935 -402320 -405479 -441744 -547503 -490256 -337954 -105680 -159480 -298170 -411894
6639 -411894 -330801 -142063 21172 -13974 47783 60200 -40006 73846 80951 -169361 -347587
6628 -347587 -352689 -178642 -224300 -359369 -363461 -129958 -128184 -85192 9693 59167 -112456
6617 -112456 -171450 -177281 -295392 -361250 -254971 23418 158121 240232 262578 500574 806008
6606 806008 666424 481301 296881 251237 352385 477313 145426 -139520 -170091 -192587
6596 -192587 182565 342437 367843 125209 72152 225087 207995 384283 406282 503002 481647
6585 481647 445572 182501 108053 -78133 -112846 -94525 -161035 83154 246944 -41174 119324
6574 119324 261284 167132 72067 -53419 -287783 -180843 84685 118201 -1837 19944
6564 19944 227661 480751 488493 259712 68975 -132277 -78717 79666 122865 78435 157671
6553 157671 158421 51624 44660 111225 155899 164768 63374 35349 -293810 -362568 -161869 -21921
6541 -21921 10949 -216947 -330769 -259835 -401812 -298352 -193620 -77289 -19229 67616 120123
6530 120123 7315 152456 337753 359084 79255 -34373 68218 11159 13250 -126392
6520 -126392 80276 175143 -152065 -283551 -536836 -717196 -441976 -331020 -345173 -259794
6510 -259794 -173119 15397 15970 -408963 -851984 -920489 -544448 -228413 -161994 -78777 -259351
6499 -259351 -410673 -160281 65638 92090 -104384 -144132 -174928 -226410 -271701 -219633 127589
6488 127589 332200 343856 230980 62527 -251287 -222221 82987 122085 -35929 109214
6478 109214 3106 -45152 -84753 -104930 -90578 3881 270332 -35063 -125232 81208 266063
6467 266063 144629 46135 6964 -5708 99611 65016 -238476 -280024 -210843 -101287 -48768
6456 -48768 -94774 38690 133117 35350 -255724 -98945 40027 -28278 -21800 22876 -131782
6445 -131782 -264893 -165944 -155415 -2334 115958 -160870 -517739 -638725 -383023 -262670
6435 -262670 -86228 -133210 -142648 -91089 6515 121247 341988 203972 261522 214225 167284
6424 167284 78548 -42650 129184 187148 -7365 -105665 -156543 -74983 80839 -234710 -499286
6413 -499286 -512766 -221594 161050 285632 211196 142083 280781 277494 311452 290608 269792
6402 269792 278197 242144 136012 170867 17301 180405 199633 150079 115138 -24689 -96389
6391 -96389 123877 68015 -92980 -57127 73484 -55876 -356921 -322473 -255268 -316296 -140962
6380 -140962 -121087 -235627 -321365 -88854 10059 136795 45129 121033 334006 274224 92883
6369 92883 208365 74107 -41047 -42714 6011 -103582 -17027 -98733 -152882 -42752 -203138
6358 -203138 -229347 -270914 -526019 -366734 -199195 -193515 82156 58808 123097 166778 130805
6347 130805 -91310 -241797 -222224 -197369 -204462 -167364 -331283 -461860 -455006 -356367 -1267
6336 -1267 119613 106883 170197 404570 261823 346231 339680 171194 -17249 -114290 -90399
6325 -90399 44673 -96644 -137750 -162093 -119953 -63929 264535 -168653 -531925 -677739 -703029
6314 -703029 -418914 -76495 -278990 -255966 22915 98179 -106634 -20317 227087 158904
6304 158904 112863 52577 -154 -411583 -456656 -354728 -387120 -39651 21756 -23854 1782
6293 1782 3507 -99518 -249028 -90737 -14171 -36921 -8773 171661 98486 12953 112911
6282 112911 45291 53005 112972 227345 182599 280720 133793 -7931 -290272 -403291 -321351
6271 -321351 -302179 -95966 64084 42644 34134 135654 148750 79940 -45568 -232237 -143706
6260 -143706 -111055 -241208 -346993 -391906 -335039 -314382 -284702 -269003 15880 16714 -25442
6249 -25442 -77510 -101331 -286684 -171401 257735 413034 276786 18506 27775 -16215 -233909
6238 -233909 -454151 -552946 -566074 -347475 -189516 26736 126897 65705 154954 -18352
6228 -18352 -50161 105881 112141 -311215 -506822 -295516 28591 131247 131122 -252627 -531780
6217 -531780 -437138 -319880 -27637 113883 153227 174793 164080 21806 -263978 -431955
6207 -431955 -394534 -273959 -314188 -67935 -134353 -237103 35037 54264 -42666 -131044 -276645
6196 -276645 -600909 -415527 -279104 -301577 -371057 -331077 -228427 -120835 -119477 21434 31766
6185 31766 -194189 -268361 -420742 -568165 -605716 -404460 -416496 -144795 -33344 -109930 -471728
6174 -471728 -506455 -524493 -419647 -398079 -438652 -402365 -210938 -298843 -352095 -332183 -341679
6163 -341679 -298210 -263336 -68362 140153 255427 214880 99523 146567 52247 33650 -132812
6152 -132812 -40352 -48148 -307904 -486982 -507126 -287807 -366112 -351378 -116968 -290811 -442415
6141 -442415 -571005 -616843 -504625 -211493 236629 344595 187176 23800 155034 97219
6131 97219 -212910 -310236 -236005 -197035 -242356 -266312 -63259 -156670 -198772 -134964 88955
6120 88955 211958 232618 286908 272202 179114 224295 27407 -172364 -464548 -650471 -647620
6109 -647620 -235958 -223211 -350230 -362072 -297040 -278693 -630153 -777124 -885749 -591362
6099 -591362 -389289 -314051 -174523 75486 160905 82302 -69401 -260318 -105219 15396
6089 15396 -153937 -69145 -81564 -376861 43449 64959 60447 -154512 -217831 -288367 -351733
6078 -351733 -277430 -192801 -133581 -135275 -116415 -184451 -321322 -273534 151119 244697 124757
6067 124757 55417 52543 21715 -155380 -260762 -259178 -157260 -79619 -203139 -288723 -60390
6056 -60390 187761 137975 50263 120953 -74690 -128516 58293 189718 298978 122799 -45684
6045 -45684 -52971 18255 43676 70398 -98217 -125891 58551 373598 459864 175200 -102499
6034 -102499 -303729 -463199 -445797 -217551 -61691 -63236 87592 255020 262139 160887 124001
6023 124001 -107675 -25951 183385 281867 202631 308926 323420 134557 -31296 -88068 -156982
6012 -156982 -85805 -201257 -204900 -190506 -426295 -561368 -310184 -228073 -101424 -97724 -16466
6001 -16466 153317 315098 124756 9440 -190661 -263020 -131192 -230149 -381485 -151059
5991 -151059 132945 256525 101714 70512 -66023 -72795 -261954 -526700 -418083 -342758
5981 -342758 -336082 -289140 -61878 118805 14416 95385 74121 -10747 -144115 -110203 -239883
5970 -239883 -35474 86662 71114 31621 -107141 -219545 -252410 -151727 -164324 -66689 -119174
5959 -119174 28587 187268 292161 279086 -99723 -208817 -23802 146002 70865 24229
5949 24229 424594 268394 236067 158888 129943 97465 -172048 -45705 -37519 -118091 -34146
5938 -34146 -39836 -49507 20416 85486 225859 303942 125264 -193722 -3174 178132 62428
5927 62428 -21418 139363 284867 248178 -57913 -79350 -195679 -152297 -34489 -65149 16348
5916 16348 -232906 -437679 -475930 -324672 -292865 -175552 -15435 -64148 -192431 -249007 -177991
5905 -177991 -21729 -150637 -29008 26653 -132032 -239853 -62728 83271 -179235 -163992
5895 -163992 192750 -121372 -45654 26912 -122124 -219350 -34750 -156703 122466 145203
5885 145203 21975 -55268 -300823 -278403 -220574 -227528 -267822 -58492 177569 242253 112302
5874 112302 96223 -87307 -48738 24879 37742 230563 288598 66850 -48119 12376 60362
5863 60362 -108528 -210325 -192692 -49301 -38947 63041 282027 331267 145729 -86502
5853 -86502 38395 80452 171816 59396 -79791 -173480 -136372 -50156 -32385 47491 -102343
5842 -102343 -166164 -443263 -443681 -521870 -382959 -188083 -133987 -772 639 -200168 -209669
5831 -209669 -443608 -441293 -211256 -120206 -138820 -108298 -13083 90448 11111 104321 144450
5820 144450 -27994 -397843 -414950 -85491 -14579 -41293 -99877 -203008 -491473 -591923
5810 -591923 -464834 -224075 26124 20274 -78458 10047 8982 160632 98050 243088 347337
5799 347337 51812 -70585 -7690 56951 144966 90837 -193763 -176698 -107170 -10308 -59658
5788 -59658 66899 -35122 -305118 -194536 -235382 -272773 -335977 -205608 -48865 -43261 10604
5777 10604 96714 -63122 -116406 -74139 4914 332783 74561 -134859 -128210 187469 61988
5766 61988 -174185 -256716 -167615 -141604 -123153 3670 1149 -196282 -263630 -250533 -408353
5755 -408353 -346638 -111013 -341 -20714 -142057 -74316 155210 105687 179803 105653 -102547
5744 -102547 73251 183113 249985 176550 68149 10458 -53759 85719 189127 298482
5734 298482 267009 73312 -25702 -65975 8765 291930 268262 35054 -149368 -136683 -114455
5723 -114455 13611 275305 440068 312497 199145 99255 17330 19277 -20017 -43819 -251332
5712 -251332 -172414 -29471 -205548 -343245 -312881 -295238 -327289 -332302 -361186 -122279 64866
5701 64866 150868 -61620 33964 -262368 -382576 -348459 -284566 -259207 -398524 -258423 -435109
5690 -435109 -393783 -312990 -336341 -304530 -26324 -105743 -390861 -367032 -187014 -244234 -260718
5679 -260718 -293533 -483491 -474341 -321151 -293060 -266309 -170283 51258 185739 78724 -181870
5668 -181870 -253653 27230 -114102 -138930 -139636 -45778 24292 -15692 37986 -69803 -127366
5657 -127366 144408 219954 55459 -22480 -44455 -225981 -484572 -634458 -798988 -550284
5647 -550284 -322336 35466 194076 42947 12645 118217 39885 -199698 -272052 -301530
5637 -301530 -158104 -164951 -120896 45517 46503 23017 88298 202893 258118 41728 45067 151056
5625 151056 -99644 -224453 -237511 -381591 -439402 -297538 -302968 -226292 -34185 129055 137546
5614 137546 84083 37038 689 -88378 81309 323543 66980 -140942 -208849 -258048 -226147
5603 -226147 77258 254431 -36457 -248653 -316539 -94826 71473 134950 116611 -10662
5593 -10662 48175 174161 -37631 -193077 -237987 -327313 -368987 -272942 -90945 55420 -31126
5582 -31126 -49130 54355 48317 -120835 16706 -45674 -257181 -395868 -220006 163652 173306
5571 173306 -34691 -15995 127839 108029 132942 119376 107597 -28381 -65903 141811 149207
5560 149207 -303335 -409845 -30041 -12740 -190004 -120417 47918 38311 -50847 -270340 -342148
5549 -342148 31993 677 6616 -8020 -119887 -157019 -168342 -160009 -38229 160337 -56585
5538 -56585 -334036 -285735 -118040 -63450 -181579 -24879 201904 172700 91159 -28411 -50414
5527 -50414 -187786 -102710 -89859 19652 169328 121621 92404 112856 91626 108010 38301
5516 38301 -45701 -15274 166906 89899 26673 277766 246482 -164559 -282295 -442037 -356608
5505 -356608 -289753 -203287 -65027 91357 -108593 -133884 -336528 -167377 -120979 -59655 11535
5494 11535 -82700 -20607 72474 105675 -107449 -353724 -321410 -239186 75778 52140 -203561
5483 -203561 -77005 -223072 -318620 -292452 -316859 -282992 -178938 -217891 -92385 120469 -104650
5472 -104650 -162661 683 212248 269532 339259 354215 233028 203374 180627 99661 222436
5461 222436 278983 66979 38829 169853 -159145 -233519 -99734 -148238 -163548 -150602 -290339
5450 -290339 -261136 -247178 -121480 21321 35157 193396 70158 -61108 85439 59696
5440 59696 26640 -7320 108118 89705 -149484 -161564 -44478 -28881 199815 142442 113875
5429 113875 -92882 -72232 -99486 -68237 -44051 -51242 -210317 -138437 -29041 22939 -106545
5418 -106545 -62953 148377 255652 159314 -8795 41865 81792 186410 293965 187471
5408 187471 -110624 -165073 -113716 -333574 -274908 145599 141595 45344 242756 247461 -38074
5397 -38074 -242267 -271603 -174099 7685 14927 242439 165928 183737 149617 -18947 -61132
5386 -61132 -43922 1701 -15425 -72023 -158334 -131019 170369 257172 74692 -168814 -47848
5375 -47848 35115 -6869 -38355 83219 443076 420032 216699 194849 59255 3487 676
5364 676 79161 -54377 14249 -298810 -367232 -145364 11490 -29040 30851 121866 30386
5353 30386 -92239 -114929 -171562 -208131 -439380 -525109 -466686 -483485 -489089 -341823 -379702
5342 -379702 -297108 -187413 -82032 -72644 -40327 118629 86616 105486 93689 87433 36572
5331 36572 75735 141449 35653 -62289 40864 148660 184681 197086 66533 -80468 -126265
5320 -126265 -43045 17892 191673 214463 229859 210736 15725 -140473 -253525 -62993 -80407
5309 -80407 -127000 -67201 -14898 103437 -3456 137833 184949 34478 5622 -52716 -28392
5298 -28392 10516 -274185 -224141 -148972 -117232 76324 299215 308867 -43668 -151902 -31579
5287 -31579 83737 95690 -34726 -114219 -43897 56601 67923 221816 176691 -84381 -80894
5276 -80894 117405 175597 113354 -216339 -408988 -113082 -87719 -109457 91963 372202 391458
5265 391458 59771 -154267 -73359 197325 177088 418380 119734 208772 349694 144573
5255 144573 165087 185324 177926 199747 246623 358257 414012 140686 59550 -42579 -210162
5244 -210162 -209172 -99766 -274725 -256800 -142176 -213111 -265689 -198869 -179712 -461355 -514182
5233 -514182 -406854 -81787 -134426 -25566 64461 104672 229289 136695 -35927 128836
5223 128836 282033 414696 167741 -5362 49070 9394 -72542 -79408 106605 199604 307892
5212 307892 375204 306223 163144 22868 -105670 -467628 -390454 -145729 -17547 -106468
5202 -106468 -45581 -62432 -20115 -115293 -313187 -122403 165710 354870 312195 282255 244827
5191 244827 146172 126034 171454 27143 -143479 -275949 -238081 -173544 140211 83470 -49915
5180 -49915 18876 77793 20343 57523 -30957 -213506 -258559 -135898 -263262 -151266 -350537
5169 -350537 -161365 10335 -48976 -30745 -157897 -110160 -50728 -115487 -447693 -480603 -319817
5158 -319817 -265914 -352373 -367067 -355878 -170846 -214346 -280511 -131436 -117614 19255 127887
5147 127887 155976 -149011 -134360 -111333 -185754 -355447 -81378 66755 118973 310371 119707
5136 119707 62441 32732 114211 292270 109545 28013 -70185 -169915 27400 44645 -80684
5125 -80684 -262888 -302884 -306726 -250113 1764 228798 110616 -724 69476 72939 196687
5114 196687 22416 -191463 -234488 -213050 -20738 64265 -50018 -296152 -386933 24311
5104 24311 220564 277818 237555 -58027 -163585 -541924 -639055 -449369 -267371 -265363 -281982
5093 -281982 -452458 -516314 -280083 -49109 -166239 -70160 -253678 -292976 -173251 -248365
5083 -248365 -291779 -175398 -193895 -219193 -350050 -564620 -216186 185015 227159 87273
5073 87273 50983 132416 183419 5936 45940 86408 38792 -113761 -39395 -83278 109184
5062 109184 357446 134737 73862 -81359 -257839 -135428 -119065 -317637 -451581 -457158
5052 -457158 -227182 -120280 30013 142948 -67420 -304370 -475812 -347633 -140864 4848
5042 4848 29226 9900 -123619 40007 84304 99828 -50283 -277902 -433614 -340740 -58084
5031 -58084 -35581 -389140 -592139 -423483 -33666 143122 158317 102740 228391 199013 44447
5020 44447 -445634 -255385 -280055 -181773 -79403 -132252 -167181 -139336 -108082 50289 185059
5009 185059 181765 121342 63784 -88294 -201194 -284977 -273614 -178568 107397 133538 -6310
4998 -6310 -5881 67850 111716 113176 179153 253498 277685 126461 -27928 -73112 13793 244230
4986 244230 -19092 -198198 -61722 251721 413839 66190 -118716 -178396 -17889 -3943
4976 -3943 141301 204905 326364 178153 251902 89878 26877 4586 -86530 -39386 76918
4965 76918 -49232 -57606 -5889 -344528 -357455 -241733 -25456 75150 -60153 -111914 -110966
4954 -110966 -195130 100933 338889 141111 73952 173518 90799 4964 -28673 -227126 -270461
4943 -270461 -145854 97704 -103521 -316419 -218962 -144750 -66346 76125 74857 -134483 -265925
4932 -265925 -352292 -432334 -378271 -43870 -12017 -165448 -108530 -26312 101524 87058 71737
4921 71737 82411 12619 -19302 -60120 -137078 -482970 -618070 -626565 -300935 -46791 -186285
4910 -186285 -201451 -64645 -117268 -131098 -36126 92654 -39697 -349893 -558463 -693385
4900 -693385 -376230 -93994 -123394 -202636 -329284 -422513 -212156 -132433 -172571 -102753 -39197
4889 -39197 -40326 61026 -103347 -66038 97715 234534 -72738 -122569 -83879 -234510 -244747
4878 -244747 153227 118295 -11362 47887 44723 127677 63351 -110467 -165360 -315948 -376988
4867 -376988 -219425 -122917 -128755 -159646 26240 122305 99424 28594 1595 -96337 -133208
4856 -133208 -79199 43127 113948 76801 329308 202822 213134 398810 345687 414173 213130
4845 213130 58729 172604 170664 202444 42644 -68853 -63684 -258898 -222210 6113 39286
4834 39286 190051 372646 312094 95170 15998 90039 -70800 -132683 -246765 -437144 -358460
4823 -358460 -186214 -124142 -47496 -194012 -182209 -205044 -148147 -143158 94429 68822 -77211
4812 -77211 -31899 -92347 -263607 -298988 -253547 -315634 -208096 -122544 -65939 66684 141171
4801 141171 215947 113662 -3511 -122390 1023 197622 194085 285855 277060 104692 120488
4790 120488 117919 52024 200866 369002 218075 94973 -58397 -80353 -127506 -56514 26220
4779 26220 143963 166645 136333 146013 287298 494560 571416 212800 144976 166780 56259
4768 56259 28097 -59285 -139333 -177249 96101 -14794 -329749 -298486 -308079 -341046 -316749
4757 -316749 -260676 -165047 -68625 -226533 -259976 -179466 -71053 22423 -218735 -130982 -291884
4746 -291884 -200114 -338298 -236592 163914 183078 163718 296688 269293 215109 -127286 -296120
4735 -296120 -253523 -76233 101632 494 12425 65013 -14287 128081 40098 63283 -102290
4724 -102290 87746 232556 192570 65943 -206970 12005 -36719 -150504 -206612 -140307
4714 -140307 -87996 -21422 -50518 63188 -20410 -159359 -364958 -246995 15663 -58569 209575
4703 209575 351157 61815 33867 108955 10543 15406 -67147 27576 102299 -271717 -441766
4692 -441766 -19583 350366 584741 227892 -97045 -248678 -300618 -342497 -554347 -530254
4682 -530254 -184655 80144 183448 167808 62803 109323 142135 -205968 -248907 -64201
4672 -64201 -78275 -121772 -32014 187474 263650 107366 -42343 72114 87986 -83688 -241455
4661 -241455 -256283 -243128 -352004 -12039 134917 19208 70561 265733 568457 565369 414667
4650 414667 276918 254798 310390 185458 100375 73887 65328 50538 -104933 -33567 113272
4639 113272 127754 -49669 -264341 -231320 -181535 -338885 -473010 -431494 -522782 -446617 -274181
4628 -274181 -12987 -28172 -28989 -53623 -39276 -21335 75997 105692 130219 19013 147153
4617 147153 417827 346159 245582 226804 451158 248204 -246153 -348800 -336742 -211801
4607 -211801 -130193 -218680 -151639 -43997 76409 33515 56171 69676 146732 359106 289831
4596 289831 184206 -81173 -205357 -67937 -79293 -72251 251494 335826 576498 317438
4586 317438 190020 256305 383813 424149 220200 -131624 14865 -142886 -176676 -137810
4576 -137810 -73152 -184309 -395186 -358304 -43780 -93267 -164885 -207727 -99995 -37991 -34677
4565 -34677 -210163 -50632 89633 70727 86646 -77981 -378782 -210544 -270073 -458742
4555 -458742 -417080 -99122 48459 49779 -141069 -43657 275049 458405 370471 284340 110139
4544 110139 -26528 72462 83253 22135 -116800 -182655 -266874 -321996 -355040 -252847 -52025
4533 -52025 57426 267014 348064 386471 243871 56059 -58164 207758 256349 285100 274236
4522 274236 278341 354989 473852 646194 638858 518518 67526 -314014 -165523 -192223 -247089
4511 -247089 -236739 -296501 -221986 -132355 -136893 -28128 -85292 -132238 -313448 -285515 -229720
4500 -229720 -341552 -344632 -16480 32249 -30482 159880 228436 64573 -12962 115488 243119
4489 243119 68146 125341 133545 119641 44406 219496 74533 77698 194293 316078 236183
4478 236183 -78840 -114424 -22335 -52164 -164690 -56709 83758 9781 -9243 7361 -74258
4467 -74258 -136069 -128793 -11026 99541 -230922 -387175 -361744 -485064 -481612 -479231 -267279
4456 -267279 -135715 -215230 -339102 -43918 387900 290692 -117024 -320613 -292229 -99072
4446 -99072 132076 77883 232870 122503 -14652 83802 91943 -56020 -183973 -264541 -472169
4435 -472169 -213622 214531 415390 355418 312266 260465 175363 61733 142471 61125 -101316
4424 -101316 -112372 -171489 -308963 -327402 -178312 -69497 -61658 -440559 -631336 -464105 -124856
4413 -124856 -131511 -91717 -23547 -38019 155381 177316 224709 66692 -31236 -117421 78669
4402 78669 388552 12393 -297679 -238523 114207 264174 310915 359206 376632 287442 81217
4391 81217 182153 110576 -38446 -35461 -115361 -334167 -182952 23014 -62462 -51679 85965
4380 85965 -218903 -617987 -584582 -131761 181453 180157 110247 242465 144677 42418 176521
4369 176521 121540 96783 -63039 -18498 14529 -27024 -125210 -194351 -186359 -1207 212043
4358 212043 154893 127489 100928 15560 -86622 -120483 -161308 -21050 129476 72109 -8653
4347 -8653 -171466 -225717 -270974 -265387 -96517 -92134 -91175 -128486 -65442 -133401 -189719 -105957
4335 -105957 -16275 -166710 -224302 -33250 -150427 -244719 -60803 256313 289141 185997
4325 185997 288908 525738 677261 427160 54775 -65268 -133595 -325732 -486984 -267383
4315 -267383 -8501 -264058 -136007 -74614 -63949 -267836 -465789 -415498 -260609 -285355
4305 -285355 -419302 -284958 -37460 -135251 -436538 -533520 -454940 -360180 -512525 -445356 -311472
4294 -311472 -325337 -518548 -473975 -411363 -160167 124057 220299 366113 510752 303011
4284 303011 165767 4741 227744 334632 278745 290694 181026 98112 -43482 12368
4274 12368 10004 -211598 -384760 -500589 -427949 -135912 -31694 -151363 212565 435085
4264 435085 228759 -15661 -57235 -162350 -376330 -211049 88652 116470 108467 131532 119214
4253 119214 329394 267985 33243 53474 64049 22070 -81081 -18164 120935 59075 53904
4242 53904 225908 417231 555421 350888 204029 138440 33629 105232 37286 196001
4232 196001 80477 -47452 -56416 -47800 -71054 -54867 -9358 90163 248325 239215 34755
$$ [...]
##END NTUPLES=NMR SPECTRUM
##END=
