##TITLE=Analysis number 324649
Compound Code cc 62003
Book Reference 511/22
Project Code adrs
Chemist Name stevem
##JCAMPDX= 6.0         $$ Bruker NMR JCAMP-DX V2.0
##DATA TYPE= NMR SPECTRUM
##DATA CLASS= NTUPLES
##ORIGIN= Bruker BioSpin GmbH
##OWNER= nmr
$$ XWIN-NMR		Version 3.5
$$ Wed Nov 29 09:58:46 2006 GMT Standard Time (UT+0h)  MAYBRIDGE\nmr@NMR_250MHZ
##.OBSERVE FREQUENCY= 250.131544655141
##.OBSERVE NUCLEUS= ^1H
##.ACQUISITION MODE= SIMULTANEOUS (DQD)
##.ACQUISITION SCHEME= undefined
##.AVERAGES= 16
##.DIGITISER RES= 18
##SPECTROMETER/DATA SYSTEM= dpx250
##.PULSE SEQUENCE= zg30
##.SOLVENT NAME= CDCl3
##.SHIFT REFERENCE= (INTERNAL, CDCl3, 0, 16.4527)
##AUDIT TRAIL= $$ (NUMBER, WHEN, WHO, WHERE, WHAT)
$$ ##TITLE= Audit trail, XWIN-NMR		Version 3.5
$$ ##JCAMPDX= 5.01
$$ ##ORIGIN= Bruker BioSpin GmbH
$$ ##OWNER= nmr
$$ C:\u/data/dgb/nmr/ADRS/1380/pdata/1/auditp.txt
$$ ##AUDIT TRAIL=  $$ (NUMBER, WHEN, WHO, WHERE, WHAT)
(   1,<2006-11-29 09:58:01.66 +000>,<MAYBRIDGE\nmr>,<NMR_250MHZ>,
      <created by zg, POWCHK disabled, PULCHK disabled
       configuration hash MD5:
       49 4B E0 1D 92 C2 6B 37 9F E6 65 BC 52 41 86 1D
       data hash MD5: 64K
       F3 AE 9F D2 E6 4A B9 8B AE BE BA 90 20 A5 07 2B>)
(   2,<2006-11-29 09:58:19.88 +000>,<MAYBRIDGE\nmr>,<NMR_250MHZ>,
      <Start of raw data processing
       ef LB = 0.3 FT_mod = 6 PKNL = 1 SI = 32K 
       data hash MD5: 32K
       D1 A4 19 91 7B A6 32 AE E0 03 8B B4 39 4E 0B 3D>)
(   3,<2006-11-29 09:58:21.76 +000>,<MAYBRIDGE\nmr>,<NMR_250MHZ>,
      <apk 
       data hash MD5: 32K
       4A 19 A3 9B FE 51 A5 66 FF F2 E8 9B 6F 63 08 20>)
(   4,<2006-11-29 09:58:22.66 +000>,<MAYBRIDGE\nmr>,<NMR_250MHZ>,
      <abs ABSG = 5 
       data hash MD5: 32K
       E1 1F 98 20 F1 56 6E E9 1E 51 70 F4 C3 95 BB B9>)
$$ ##END=
$$ 
$$ hash MD5
$$ 10 69 A8 DD B8 20 54 F4 F2 8E 6C AE 95 F0 B3 E8
##$RELAX= 
##$RELAX= 
##$RELAX= 
##$RELAX= 
##$RELAX= 
##$RELAX= 
##$RELAX= 
$$ Bruker specific parameters
$$ --------------------------
##$DU= <C:\u>
##$EXPNO= 1380
##$NAME= <ADRS>
##$PROCNO= 1
##$TYPE= <nmr>
##$USER= <dgb>
##$AMP= (0..31)
100 100 100 100 100 100 100 100 100 100 100 100 100 100 100 100 100 100 
100 100 100 100 100 100 100 100 100 100 100 100 100 100 
##$AQSEQ= 0
##$AQ_mod= 3
##$AUNM= <au_zg>
##$AUTOPOS= <3 >
##$BF1= 250.13
##$BF2= 250.13
##$BF3= 250.13
##$BF4= 250.13
##$BF5= 500.13
##$BF6= 500.13
##$BF7= 500.13
##$BF8= 500.13
##$BYTORDA= 1
##$CFDGTYP= 0
##$CFRGTYP= 5
##$CHEMSTR= <none>
##$CNST= (0..31)
1 1 145 1 1 1 1 1 1 1 1 1 1 1 1 1 1 1 1 1 1 1 1 1 1 1 1 1 1 1 1 1 
##$CPDPRG= <>
##$CPDPRG1= <>
##$CPDPRG2= <>
##$CPDPRG3= <>
##$CPDPRG4= <mlev>
##$CPDPRG5= <mlev>
##$CPDPRG6= <mlev>
##$CPDPRG7= <mlev>
##$CPDPRG8= <mlev>
##$CPDPRGB= <>
##$CPDPRGT= <>
##$D= (0..31)
0 1 0 0 0 0 0 0 0 0.06 0 0 0 0 0 0 0.0002 0 0 0 0 0 0 0 0 0 0 0 0 0 0 
0 
##$DATE= 1164794279
##$DBL= (0..7)
120 120 120 120 120 120 120 120 
##$DBP= (0..7)
150 150 150 150 150 150 150 150 
##$DBP07= 0
##$DBPNAM0= <>
##$DBPNAM1= <>
$$ [...]
##$SUBNAM7= <"">
##$SUBNAM8= <"">
##$SUBNAM9= <"">
##$SW= 20.6930455092707
##$SWIBOX= (0..15)
0 0 3 0 0 0 0 0 0 0 0 0 0 0 0 0 
##$SW_h= 5175.983436853
##$TD= 65536
##$TD0= 1
##$TE= 294.16
##$TE2= 300
##$TE3= 300
##$TEG= 300
##$TL= (0..7)
0 120 120 120 120 120 120 120 
##$TP= (0..7)
150 150 150 150 150 150 150 150 
##$TP07= 0
##$TPNAME0= <>
##$TPNAME1= <>
##$TPNAME2= <>
##$TPNAME3= <>
##$TPNAME4= <>
##$TPNAME5= <>
##$TPNAME6= <>
##$TPNAME7= <>
##$TPOAL= (0..7)
0.5 0.5 0.5 0.5 0.5 0.5 0.5 0.5 
##$TPOFFS= (0..7)
0 0 0 0 0 0 0 0 
##$TUNHIN= 0
##$TUNHOUT= 0
##$TUNXOUT= 0
##$USERA1= <user>
##$USERA2= <user>
##$USERA3= <user>
##$USERA4= <user>
##$USERA5= <user>
##$V9= 5
##$VALIST= <valist>
##$VCLIST= <CCCCCCCCCCCCCCC>
##$VD= 0
##$VDLIST= <DDDDDDDDDDDDDDD>
##$VPLIST= <PPPPPPPPPPPPPPP>
##$VTLIST= <TTTTTTTTTTTTTTT>
##$WBST= 1024
##$WBSW= 4
##$XGAIN= (0..3)
0 0 0 0 
##$XL= 0
##$YL= 0
##$YMAX_a= 268938
##$YMIN_a= -309913
##$ZGOPTNS= <>
##$ZL1= 120
##$ZL2= 120
##$ZL3= 120
##$ZL4= 120
##$ABSF1= 16.45269
##$ABSF2= -4.240482
##$ABSG= 5
##$ABSL= 3
##$ALPHA= 0
##$AQORDER= 0
##$ASSFAC= 0
##$ASSFACI= 0
##$ASSFACX= 0
##$ASSWID= 0
##$AUNMP= <proc_1d>
##$AZFE= 0.1
##$AZFW= 0.1
##$BCFW= 0
##$BC_mod= 0
##$BYTORDP= 0
##$COROFFS= 0
##$CY= 12.5
##$DATMOD= 1
##$DC= 0
##$DFILT= <>
##$DTYPP= 0
##$F1P= 14.0000005364418
##$F2P= -0.99999901652339
##$FCOR= 0.5
##$FTSIZE= 32768
##$FT_mod= 6
##$GAMMA= 0
##$GB= 0
##$INTBC= 1
##$INTSCL= 1
##$ISEN= 128
##$LB= 0.3
##$LEV0= 0
##$LPBIN= 0
##$MAXI= 10000
##$MC2= 0
##$MEAN= 0
##$ME_mod= 0
##$MI= 0
##$NCOEF= 0
##$NC_proc= -3
##$NLEV= 6
##$NOISF1= 0
##$NOISF2= 0
##$NSP= 0
##$NTH_PI= 0
##$NZP= 0
##$OFFSET= 16.45269
##$PC= 1
##$PHC0= 222.6468
##$PHC1= 6.674432
##$PH_mod= 1
##$PKNL= yes
##$PPARMOD= 0
##$PSCAL= 4
##$PSIGN= 0
##$REVERSE= no
##$SF= 250.130017335984
##$SI= 32768
##$SIGF1= 0
##$SIGF2= 0
##$SINO= 400
##$SIOLD= 32768
##$SREGLST= <1H.CDCl3>
##$SSB= 0
##$STSI= 32768
##$STSR= 0
##$SW_p= 5175.98343685301
##$SYMM= 0
##$S_DEV= 0
##$TDeff= 65536
##$TDoff= 0
##$TI= <Analysis number 999999
Compound Code 99
Book Reference 9
Project Code 9>
##$TILT= no
##$TM1= 0
##$TM2= 0
##$TOPLEV= 0
##$USERP1= <user>
##$USERP2= <user>
##$USERP3= <user>
##$USERP4= <user>
##$USERP5= <user>
##$WDW= 1
##$XDIM= 32768
##$YMAX_p= 373017834
##$YMIN_p= -128738
$$ End of Bruker specific parameters
$$ ---------------------------------
##NTUPLES= NMR SPECTRUM
##VAR_NAME=  FREQUENCY,     SPECTRUM/REAL,   SPECTRUM/IMAG
##SYMBOL=    X,             R,               I
##VAR_TYPE=  INDEPENDENT,   DEPENDENT,       DEPENDENT
##VAR_FORM=  AFFN,          ASDF,            ASDF
##VAR_DIM=   32768,         32768,           32768
##UNITS=     HZ,            ARBITRARY UNITS, ARBITRARY UNITS
##FACTOR=    0.157963299565203, 1,           1
##FIRST=     4115.31166606769, 0,            0
##LAST=      -1060.67177078532, 0,           0
##MIN=       -1060.67177078532, -128738,     0
##MAX=       4115.31166606769, 373017834,    0
$$ Real data points
##PAGE= N=1
##DATA TABLE= (X++(R..R)), XYDATA
$$ [...]
22117 -2738 -40459 -65352 -51175 -36140 199 -17777 -27382 -30384 -58906 -38296 -35311 -48990
22105 -48990 -37314 -36016 -40327 -21614 14735 48547 43582 23032 21116 14258 -10639 2288 3800
22092 3800 11001 493 4437 -543 14465 4887 -8961 5616 34265 -154 -16624 860 22570
22079 22570 53666 57463 43709 44712 30344 11603 31392 51399 9384 -16614 -33894 -31566
22067 -31566 -35476 -17667 23340 31845 10025 17792 43413 41332 32280 -1247 -48587 -68282 -26538
22054 -26538 -11557 -30936 -40034 -22152 -4741 17322 19513 26765 23457 -39471 -57873 -37078
22042 -37078 -42852 -50339 -21124 22866 18993 7885 -20128 -49186 -43960 -18399 -45633 -38793 -21852
22029 -21852 -22370 -3722 23005 29655 14889 15176 340 -16151 -2865 1954 -14812 -15740 -23852
22016 -23852 -20411 -5274 151 -2743 -15249 -22240 27849 44571 25446 1732 2434 7224 -7200
22003 -7200 -26703 -39940 -40083 -42489 -10306 9352 7208 21042 -12005 -23629 -25173 -27838 -10494
21990 -10494 10372 -10437 -12269 24473 39703 16170 16223 18141 49162 50584 29823 3192 -13019
21977 -13019 3652 -18658 -24843 -5441 -24336 -33126 -12159 -20866 -39260 -1228 9034 -3574
21965 -3574 -26773 -20788 12416 45058 35011 -2756 -7460 -13388 -16913 4137 10229 -10926 -13278
21952 -13278 -10041 -27010 -16601 15089 11980 -10192 484 25084 -15597 -40189 -58824 -48778
21940 -48778 -13938 -1686 -7264 -15197 -52372 -31806 -20064 -27015 -57110 -58913 -21809 -20429 -22585
21927 -22585 -298 36527 17557 -850 -3631 -9649 -12717 -15567 -20452 -28191 -25118 -23354 -10470
21914 -10470 -6020 -1856 -29841 -5763 1879 20841 962 -28693 -22468 15137 4092 -21417
21902 -21417 -19350 10473 -589 22192 37417 64532 24703 -42262 -35824 -18801 -3729 5860
21890 5860 -5657 11233 5090 13264 -207 5726 21574 5350 -16207 -45860 -33668 -12146
21878 -12146 19968 11201 6736 -16289 8669 15222 22805 9175 664 -14096 -11864 -2252 7632
21865 7632 5766 -46106 -42740 -37345 -30915 -26717 28138 19402 -7236 -14737 -19353 -40149 -11325
21852 -11325 10785 1470 -3065 -25413 -19239 9293 13462 -5591 -1507 -13248 -9761 3396 -1937
21839 -1937 2015 -13136 -13212 -19606 -18972 -37102 -39584 -40669 -69299 -76813 -43481 -11970 -15165 -25215
21825 -25215 -31099 -30188 -6868 24790 17469 -9420 -19944 -22130 -19279 21597 61835 61081 30798
21812 30798 11928 3976 6849 22197 8888 15106 33925 47524 52448 18943 -150 -21810
21800 -21810 -32868 -38883 -14843 -36976 281 -25770 -11436 15963 10432 5291 -10019 -22522
21788 -22522 -52391 -55156 -45281 -37750 -43660 -59316 -33655 9609 23865 18323 3047 -18741 -50007
21775 -50007 -55665 -66593 -39491 -34635 -51953 -22127 3582 11350 10762 6680 -10169 -4167 -5671
21762 -5671 11417 24104 18485 22859 16833 24829 16671 3538 6152 -3948 -29650 -32198 -15450
21749 -15450 -20482 1679 26800 1235 -22396 -35375 -50937 -32663 -2001 492 -11261 21770
21737 21770 20232 -26892 -34918 -30212 -3833 20316 69210 86785 57738 38174 19020 12919
21725 12919 -6172 298 10256 -4946 -25827 -25935 -24204 -21297 -15288 -18044 -7813 11342 -894
21712 -894 -14304 18280 44462 22910 13360 1632 -2962 -2218 20945 -19617 -43447 -14718 -596
21699 -596 10652 -13836 -31592 -36146 -33016 -56796 -80980 -58597 -32369 -13530 -11785 -928 -33563
21686 -33563 -60280 -66199 -12901 -22112 -72961 -82017 -53743 -50001 -40872 -39829 -21985 -6383 6633
21673 6633 32564 34322 12993 -45037 -30377 -40265 -34642 -16551 -44401 -50659 -28049 -14602 -14520
21660 -14520 -21789 -12597 -15324 -56606 -47901 -16978 -14997 -55446 -40861 -673 -22290 -51069 -61057
21647 -61057 -87253 -98810 -93758 -80002 -36194 9003 -10354 -3337 2588 -16795 -21353 -37971
21635 -37971 -55243 -49359 -42205 -29559 -30820 -44779 -40747 -50350 -29670 -15756 -30277 -32442 -4197
21622 -4197 5341 1382 -15648 -11153 -779 18042 29938 812 -25474 -35366 -24698 3391 19064
21609 19064 25903 9420 -5008 -8345 18882 24329 5201 -10888 -2303 23621 40231 40420 48558
21596 48558 46980 30972 27234 31290 9266 22511 59378 55011 24827 -3785 -3231 -15831 -16042
21583 -16042 -8446 12814 24282 2774 -18885 -26827 -39278 -33812 -5391 4336 12964 22048 11255
21570 11255 22307 7231 -30688 -37669 -42519 -16504 -13474 16791 14973 19380 44009 23559 13730
21557 13730 10642 9427 -5 -7877 -726 22389 31531 25991 -14069 -17551 -39901 -26380 -15053
21544 -15053 -54809 -78917 -67428 -30828 4975 19313 26416 22958 26382 3768 4234 -4569 -8267
21531 -8267 14755 26231 29662 18555 8324 7503 -1515 6355 40881 49028 42520 24252 6061
21518 6061 -13936 -11087 -29593 -11691 -6562 255 1420 11685 31156 37866 31546 32807 60033
21505 60033 32990 30219 47621 13407 -12369 -9800 -20854 -18330 -6218 243 -12413 -17880 -837
21492 -837 6021 -12289 -11446 -835 -1515 3559 -20397 -21242 -6386 -15803 -3903 -15902 -28646 -12756
21478 -12756 8173 -3321 -22258 -33900 -20975 -8711 -8285 -561 -1402 -10710 -8001 -12152 -2512
21465 -2512 8337 -9183 -11153 11887 3574 -38506 -23406 -16715 -7950 -4192 -13556 -25036 -22821
21452 -22821 -28882 -34594 -38200 -11727 5237 20601 26931 26769 29602 41461 52615 72969 60474
21439 60474 15983 -16459 -30234 -15554 -24901 3198 18065 16966 47173 66986 13861 -2690
21427 -2690 -15735 -15731 -12755 -21968 -17424 -27893 -11957 1946 1700 -23483 -14249 705 6170 424
21413 424 -16788 -43975 -66723 -75653 -73979 -81869 -88840 -58956 -36412 -17909 -34067 -58756 -43493
21400 -43493 -34839 -19124 -110 25310 12675 1827 -8063 -17735 -13226 -17009 19200 29546 29890
21387 29890 8934 8201 12410 -1958 -24712 -41246 -44516 -33855 -3923 17836 -1162 -37794
21375 -37794 -17507 -4224 -17194 -32554 -34985 -30375 -35477 -32381 -26480 -7811 -984 -16331 -35523
21362 -35523 -29776 -18897 -30033 -46820 -30347 -26582 -31310 -39073 -47902 -30304 -36541 -59190 -46596
21349 -46596 -39167 -24770 -32832 -29878 -22496 -16266 -13514 -37374 -25797 1379 -13099 -3954 36950
21336 36950 36887 -5957 -33094 -13538 -3007 -13281 -3344 -21146 -23620 -18159 -7631 -767 -22615
21323 -22615 -20020 -25131 -35747 -48085 -24869 -27311 -49348 -60267 -54530 -38750 -40128 -23771 -24598
21310 -24598 -22112 -24523 -37006 -26392 14223 19522 22922 18893 13792 31546 46756 59129 39012
21297 39012 38849 24438 170 -4105 -11903 -5880 39362 57771 48097 45230 30185 933 234
21284 234 2746 18906 27256 27663 26738 -20292 -24881 -2436 4822 -9847 -26789 -45332 -50839 -40512
21270 -40512 -23930 -20064 -3647 21084 29016 27478 40799 30462 2733 -15804 -18923 -16253 3998
21257 3998 11514 15508 7819 -10484 -21072 -27570 -26752 -36272 -47003 -35521 -33337 -41589 -19865 3678
21243 3678 489 -9206 -478 -3954 -8222 -16281 -28440 -13952 20474 33208 14997 -10290 -25845
21230 -25845 -17780 -10902 25079 -830 -24852 -67131 -66811 -28453 -38238 -36685 -29248 -1410 -6211
21217 -6211 -35755 -23414 -17128 61 3176 -16058 -31349 -6708 -5309 -4734 -6392 2285 -5377
21204 -5377 -9236 -21103 -5679 4472 3216 21864 50834 31727 2005 -29168 -18192 -19314
21192 -19314 -22208 -7469 -28311 -17228 4241 -12856 -6976 11620 27337 37803 5323 -8929
21180 -8929 -42813 -9729 31223 13913 747 27042 31988 27663 34534 11162 13619 8027 25660
21167 25660 54614 74185 76320 40345 5079 -9227 -8299 37530 34512 -719 5086 21001 24198
21154 24198 15995 4556 24358 25044 27916 25842 -17401 -26838 -25746 12736 -7579 5707 37800
21141 37800 51293 40610 -1243 1353 -2101 14709 22368 40033 26167 16648 25305 3272 -16809
21128 -16809 10502 43530 41747 20853 -988 -11113 12298 40657 57213 49978 14190 25312
21116 25312 40065 17655 7083 -9520 -42035 -23433 18466 26019 47731 41965 14122 -15320
21104 -15320 -5317 -17125 -23213 -11142 -19498 -22499 -11882 -29740 -42813 -42205 -10356 -8433 -7077
21091 -7077 -2743 13474 11156 8956 -2346 -1761 7738 15817 24608 22279 13597 36961 38867 37552
21077 37552 21313 4977 -23913 -30432 215 34583 38970 14051 10946 1145 -6166 -22528 -20895
21064 -20895 -12700 -225 16270 15823 6547 26160 48625 32205 8153 -2986 -13711 -27776
21052 -27776 -13302 -8234 -9410 4604 41437 31126 -13205 -15960 -27772 -27999 -1244 24232 5979
21039 5979 -11717 -27098 -17591 -26512 -25101 -619 -11783 -3631 23749 34238 19024 47935 74042
21026 74042 55045 51981 48647 12535 -2998 -6309 -8484 -6641 12109 30781 35994 3332 -8130
21013 -8130 -39895 -53666 -16298 -11369 -11365 16588 22605 6801 4629 -2862 -4403 -16133 -23129 -32220
20999 -32220 -26729 -41184 -33825 5517 13888 34027 56299 27307 -8873 -24980 -19408 -4284
20987 -4284 2557 8379 -10280 -44131 -74111 -53121 -33353 9667 736 -9951 -39506 -51270
20975 -51270 2564 15334 -6375 -33502 -29904 3115 41976 56658 51674 25569 12338 27845
20963 27845 28646 26707 1906 15791 3021 -1987 38131 6798 -28100 -16967 -39472 -40477 -21165
20950 -21165 7960 35818 13290 -8903 -9867 1691 14541 32516 45787 39631 9049 24992
20938 24992 41849 67143 80304 55916 31846 20557 10816 3507 -108 31112 30442 24839 -4299
20925 -4299 27194 70901 76410 21315 -1463 1837 1495 -15653 -19052 -8404 1169 -1018 12949
20912 12949 21617 20980 -2404 1690 19618 30163 44390 60405 50584 56790 57085 40806 40902 45777
20898 45777 22769 11989 7870 12605 24770 8533 -213 -32963 -57049 -40078 -65319 -60363
20886 -60363 -25183 -8530 -19088 -13266 -14222 -13817 -30168 -51003 -28583 -21786 -13781 -20059 -47741
20873 -47741 -51371 -55252 -39972 -19142 -21789 -248 43272 46332 25854 19197 -9795 -26536 -22302
20860 -22302 14 7888 -16060 -13270 -6263 -22983 -34060 -21734 -28874 -25269 -22709 -17011 -16059
20847 -16059 -18972 -26381 -1121 12803 4999 -14682 -24632 4076 26545 32333 42419 22143 20418
20834 20418 13930 804 -5458 -5218 -11331 -28480 -7844 -10623 -21150 18732 38553 18462 -3641
20821 -3641 -12387 -754 8171 -19832 -25498 -21204 -24030 -58695 -62129 -55373 -24203 -4020 -11283
20808 -11283 -5318 -17166 339 -10971 -30741 -25946 -5130 -20358 -20867 -3312 -444 -3898 -27844
20795 -27844 -21489 -279 1418 14066 -9427 -38398 -50571 -72541 -42332 -72530 -78540 -66152
20783 -66152 -51956 -35394 -48860 -40223 -17450 -22140 -24536 1549 7604 1652 -9034 -10043 -14509
20770 -14509 14458 30444 -25368 -76314 -76403 -67950 -61658 -34337 -21508 -17811 -22424 -24942 -14258
20757 -14258 33711 50649 -3952 -14606 30517 42503 1547 -5986 50676 61487 60386 44085
20745 44085 37862 29329 12252 -9174 -30252 -37820 -2360 21443 -1249 -5700 -7411 -21506 -11973
20732 -11973 2746 10839 597 -13539 -3081 -1315 19337 32759 28134 6989 -8970 -13915
20720 -13915 7745 -5424 -11775 -16001 -35075 -76350 -62463 -14963 11091 27783 -4460 -36338
20708 -36338 -41306 -26512 -13356 -3130 3870 4537 -6876 613 11796 9917 14096 -12386 5563
20695 5563 56446 46136 19707 20547 28168 46403 30328 -8454 11562 32206 25058 15482 26515
20682 26515 50406 11847 -9220 -7868 -14937 -10661 19246 53334 45827 -3450 -34528 -29639 -12046
20669 -12046 -20964 -26815 -14222 -46397 -53916 -44094 -34657 -77417 -74785 -43256 -29499 -30179 -53655
20656 -53655 -69880 -80113 -70400 -22410 12918 2549 4254 11677 20591 17317 6242 -16178 -15847
20643 -15847 24523 45721 -5478 -1847 53215 93513 64387 33110 7817 4414 10776 26412
20631 26412 28562 13878 7050 18686 32304 15714 5928 24376 31207 -16035 -52430 -39653
20619 -39653 -15224 13261 16555 24708 21618 4632 5653 33427 33766 -4148 -2255 -24206 -42042
20606 -42042 -28045 -26069 -29355 -52796 -66013 -53117 -42877 -38708 -18979 -11174 26302 49691
20594 49691 61106 63869 75506 60808 51667 36741 -1752 -18684 -17435 -26890 -30590 -41084 -47590
20581 -47590 -12374 -33791 -17473 -12466 -18421 -16824 -17096 -2888 -29506 -26683 -5647 18756 20157
20568 20157 31642 54530 82192 73605 40269 -1326 -10310 -6622 -2676 -19181 -32706 -38440 -36454
20555 -36454 7003 46571 47512 54261 11163 -25948 -52823 -26580 -32996 -44179 -15344 21133
20543 21133 41777 52118 25866 29274 30969 14951 971 40099 50420 29265 45633 30109
20531 30109 30937 19811 17460 22783 45372 18979 -15944 -17422 -19424 11663 36839 19676 -13231
20518 -13231 -39880 -26424 -4913 8248 5387 -20653 -17473 -23864 -12932 -5470 -38259 -45001 -13912
20505 -13912 24693 12381 -2503 -18773 -6824 27147 22975 19056 35161 19123 -3793 -28261
20493 -28261 -41248 -63768 -46156 -26226 -5814 36788 51836 60849 46346 20880 18415 4611
20481 4611 1598 -38225 -35421 -19625 21705 46690 52353 44156 32845 21514 18573 68235 88084
20468 88084 84237 120942 158383 178657 227400 290916 340408 340644 302530 258118 184178 145185
20456 145185 132974 136143 136129 146206 161816 170405 217581 271205 292453 297609 277590 243002 201036
20443 201036 137850 99520 92739 75577 61227 37618 19449 34596 18615 7137 -14899 -16598
20431 -16598 14002 15031 46708 48721 10678 -24230 -35770 -31824 -47800 -53840 -25658 6131
20419 6131 12159 20546 14150 12679 16612 -7844 -23016 3915 6399 -17564 -35172 -46884 -22107
20406 -22107 20214 45756 68534 83004 66727 24356 16365 35322 51276 59393 46428 32735
20394 32735 11437 -3703 -1819 -31066 -39140 -32178 -36852 -148 27057 28351 9195 -11525 -20049
20381 -20049 -6041 -4358 2253 23472 29344 18184 18727 21005 5829 7303 21248 17737 13797
20368 13797 9198 21047 16962 33108 44584 27584 36557 42052 42828 59642 63677 53982 37419
20355 37419 9945 14346 18850 31295 31757 22897 -29766 -12398 29151 36192 10555 -3608 5132
20342 5132 37827 50326 6303 -22675 -21527 -29034 -64273 -77070 -78791 -79895 -45388 -40563 -41055
20329 -41055 -28077 7277 -20652 -20353 11083 4818 -7907 1499 16487 7854 12960 12412 8084
20316 8084 19995 2010 -10256 -15926 -14252 -20889 -12859 31162 32754 8572 -24246 -51023 -51829
20303 -51829 -42905 -42880 -27447 -15306 -15990 -3617 20108 19347 9226 24497 17858 -2123 14262
20290 14262 -4766 -3539 7534 1093 -20854 6750 49044 70686 54181 27386 16287 21434
20278 21434 8326 -13058 -25402 2067 -14380 -14031 17090 17864 -11563 -32091 -25991 4153 36151
20265 36151 38626 40077 32208 -570 -34195 -36416 -7687 26096 -2907 4891 4076 -3812 2369
20252 2369 35457 37696 10272 9387 17286 20159 18538 6622 7104 33476 39369 29474 26478 6859
20238 6859 5240 21966 52977 11356 42395 57837 17233 13387 -11056 -45012 -17720 28863
20226 28863 41164 70597 71530 50401 15109 9342 27401 3791 -5917 2595 -13449 -6743 14103
20213 14103 24611 16002 13836 9413 8595 24591 30827 14494 16260 21814 40968 17450 3010
20200 3010 -19946 -49776 -60211 -26518 -22447 -42192 -29399 -2223 1507 -31823 -21923 2164
20188 2164 39212 47020 12142 16205 22373 -7695 -30181 -26632 -6047 5763 35022 28368 13614
20175 13614 23353 6467 20527 27804 11808 -7549 -14966 -11495 -30959 -4444 3119 3575 6384
20162 6384 -9291 -34958 -43626 -30335 -38897 -54079 -12010 24417 34094 21419 4847 31931
20150 31931 21794 1328 -5384 13169 37827 54237 36860 24999 33257 43982 62064 51162
20138 51162 31717 4068 2739 18496 32370 30954 49680 45469 48051 81819 89653 90548 86281
20125 86281 109317 119736 96834 96678 99352 92497 98533 88314 67404 47950 20952 23240 51848
20112 51848 84426 66193 61451 31439 19513 23564 50078 92107 65534 46499 60512 44861
20100 44861 18730 20108 27361 32509 16584 -1795 18037 40583 31015 30398 22697 10132 37067
20087 37067 63101 54993 25935 1633 12641 10990 13126 -3411 -14889 -32128 -34949 -49770
20075 -49770 -24944 -6081 -1965 20747 28067 42874 55055 82426 61706 44002 17333 17426 10279
20062 10279 -51 277 9436 21843 10245 12967 22548 39229 57430 27274 6758 -6494 -38428
20049 -38428 -51290 -23302 -4397 -6192 23185 43808 39397 28274 59956 79888 86970 95214
20037 95214 105330 79390 46341 43290 53682 77307 69695 78753 92699 80527 95948 111613
20025 111613 72849 51997 79211 102036 122179 114835 57696 38964 22611 35743 61767 55399
20013 55399 38422 57533 102174 117052 123656 136591 119921 104408 91328 88419 99924 83013
20001 83013 84246 122219 122019 83919 59229 71949 90121 77478 75390 124252 128221 97389 82691
19988 82691 103430 144618 163832 137988 128589 121059 103703 128140 152183 122802 74465 74388 106249
19975 106249 96044 90796 115759 109056 117716 131901 114184 73828 43679 58130 105551 117805
19963 117805 95464 92906 112448 120761 133167 156955 170997 192965 176780 172948 162349 157618
19951 157618 132926 103834 105991 101224 106304 129212 140203 138605 160420 172046 158108 98085
19939 98085 120878 134715 148945 139637 174431 207734 221879 244829 258810 254181 256498 248975
19927 248975 246708 232042 228147 252743 267948 293634 336455 368857 412592 434965 454394 480550
19915 480550 515779 558652 615075 669253 726223 827660 915253 939397 943431 919535 843500
19904 843500 798883 812317 846784 937119 1058081 1152292 1232637 1358737 1498513 1647530 1784896
19893 1784896 1874585 1978109 2133188 2317326 2600433 2973702 3428766 3886760 4348452 4906621
19883 4906621 5586473 6505982 7603488 8822185 10206553 11921423 14179221 17334708
19875 17334708 21830059 28216561 36731690 46465046 55685743 62182541 60912105 49704580
19867 49704580 36792731 28092254 23321090 21170700 20815491 21999192 24949878 30066195
19859 30066195 37535739 46425877 54976867 60899397 59131469 47003783 32507206 22059570
19851 22059570 15605646 11580317 8853300 6955188 5577348 4579716 3866576 3383009
19843 3383009 3033351 2763818 2553279 2394743 2308523 2185403 2036443 1894424 1718955 1569821
19833 1569821 1471365 1408706 1362812 1288834 1142556 956312 818635 748456 708124 670537 685051
19822 685051 698529 716569 739176 757517 803297 841050 811352 669532 527350 445391 372097
19811 372097 334440 300551 277605 263430 222788 168250 141682 126801 130616 134410 119428 103080
19799 103080 118346 126961 154073 170992 150544 145645 140442 144915 149629 139343 142194 119997 115818
19786 115818 112554 94970 85886 86224 102083 66127 58018 55762 23945 20620 45270 66970 90282
19773 90282 90249 89334 91531 76178 53170 56943 89435 125752 98796 102577 112130 110948 78230 62792
19759 62792 49760 41351 30438 15454 1001 -392 12662 26967 64215 72976 92635 80739
19747 80739 39163 24848 3307 -13778 -13723 -42485 -13263 -4921 -8597 -1084 -162 -1682 -29403
19734 -29403 -20816 -13868 -29281 6197 37913 30469 6468 -5267 -3075 2564 15296 19684 1442
19721 1442 6486 -5251 -10161 -806 -37993 -62565 -36417 3733 27606 37502 52191 70160 56446
19708 56446 24192 18693 -1053 -19175 -35481 -30696 4593 22099 30070 25640 43238 35291 44689
19695 44689 22048 -4894 -3984 -19507 -29779 -29176 10429 35314 6521 19090 52885 44578 27329
19682 27329 14165 13582 -10968 -13688 2830 33256 43339 57297 81577 65227 41727 24273
19670 24273 21691 28335 33448 21680 3863 -7627 -11024 -17762 14914 35655 24665 12092 21735
19657 21735 29877 27187 -362 -2430 -25973 -4463 63834 96542 69534 35186 21587 19152
19645 19152 17334 16338 16731 6544 7718 -1752 18646 48969 32780 -14302 -43067 -76157 -71426
19632 -71426 -70041 -70644 -64598 -57531 -17623 -463 -957 -16759 -23111 -43757 -37577 -25232 -21680 7078
19618 7078 3838 -7378 -4637 13927 24197 -7637 -12161 3722 2768 -18648 -34995 -50173 -50890
19605 -50890 -45491 -22551 1522 17182 34348 2603 -17031 -28 24504 -3639 -4691 5671
19593 5671 24135 35904 37708 16746 2777 1823 -3167 -11228 -22194 -23472 -37867 -42115 -8082
19580 -8082 -9530 7812 29162 18622 -26615 -30542 -43741 -31502 -12938 -20413 -29641 -23443 -7570
19567 -7570 3577 -10206 -14265 -20149 4977 371 -17611 -23986 -12204 -35245 -22188 15287 14680
19554 14680 14853 19292 19248 11644 21022 9778 3914 -181 20891 2596 27362 48854 35279 44682
19540 44682 18516 -6123 -9826 -21064 -17656 -34712 -20230 -29391 -19227 94 13225 -16645
19528 -16645 -48825 -56744 -41537 -14467 16496 25070 8644 26461 45130 40957 47127 37585 36476
19515 36476 54138 88046 79975 50315 23108 -2458 -14332 -27077 -35704 -8187 -1048 12717
19503 12717 7876 -25479 -45230 -33581 -18116 -27757 -56979 -63769 -59406 -47645 -34987 -15234
19491 -15234 -46393 -44043 -30077 1278 51938 95473 58007 37322 30144 9382 -36502 -48836
19479 -48836 -30886 -34355 -45011 -13289 7967 26447 38358 -6452 -12598 -13077 -32635 -27170 -30838
19466 -30838 -47502 -20267 -16726 -24574 -23168 -14973 -9015 -1930 -10502 -18008 -18156 -33853 -32756 -8015
19452 -8015 3668 26732 33122 -11640 -28175 -12043 24500 30502 19507 11133 7173 -6205 -1997
19439 -1997 -26193 -53467 -51165 -67075 -42096 -15288 -2968 -4668 -3507 80 21929 40822 38242
19426 38242 2112 9415 24525 10780 11334 5283 9073 42988 26907 11564 12745 20370 10289
19413 10289 -1278 -1630 10571 -8572 -9216 13905 26333 52535 56514 50273 64343 70991 56761
19400 56761 18650 28313 18935 8929 12705 36141 51467 58184 38659 1692 -18639 -2667
19388 -2667 -32029 -64252 -27169 -38166 -66033 -34098 -36782 -29051 -49070 -46458 -23398 -18035 -26700
19375 -26700 -24394 -24559 -38308 -43040 -23491 -30123 -17375 -2564 6638 -9425 -24863 -21963 -13409
19362 -13409 -15324 9952 49685 35965 17342 32659 73266 68311 20892 11932 8506 7297 -10045
19349 -10045 -39580 -26615 19401 16102 -8167 22765 10831 -13218 -34754 -29998 3480 12417
19337 12417 -12304 -19745 -22160 -33567 -19800 166 31728 12434 6679 14912 10391 3500 -5475
19324 -5475 -29757 -15809 13287 -1913 -14862 -31306 -15286 5448 15942 16716 29332 15340
19312 15340 36039 56191 43060 36228 34003 53695 37193 34532 38941 66975 85288 72012
19300 72012 32910 18990 -18512 -34794 -41628 -14729 10538 38506 54279 21726 8529 -4652
19288 -4652 21543 36500 37608 9114 14854 42208 68012 36603 41242 64518 78432 107842
19276 107842 142338 203466 259990 297594 324734 327331 272937 202891 176806 148403 129868 131793
19264 131793 129256 146620 165811 181115 228726 276583 298728 336676 286822 199239 134232 94572
19252 94572 30921 38138 28124 23732 44812 70701 48932 20292 28288 56268 47046 27651
19240 27651 14210 37382 26300 -8025 -22472 1574 13732 -19764 -18622 -34818 -18226 -14509
19228 -14509 -55769 -51775 -24321 -26972 -52470 -43209 -36356 -24256 -16001 -16619 -773 -12139 -13662
19215 -13662 -51973 -60009 -52956 -46931 -43611 -33420 -17451 -34727 -42764 -71398 -58808 -31000 -7582
19202 -7582 -36700 -36473 -25408 -36934 -16935 -11724 -2703 -3167 4148 14357 32447 1171 15129
19189 15129 31076 23256 25708 26322 846 -24601 -23543 -12410 -1060 -1966 -7656 22703 39143
19176 39143 21497 20662 22015 14499 11161 2701 -497 8971 -22954 -46698 -33072 -10098 16112
19163 16112 31659 2404 -30102 -27470 -24785 -6740 12323 22481 4404 -47745 -53094 -25853
19151 -25853 -27971 -18845 -1695 33544 15252 -22116 -38960 -6260 12910 -3643 -12723 3595
19139 3595 18377 -12697 -30011 -41810 -45685 -51443 -20343 -528 19135 44095 71699 53878
19127 53878 23717 -29761 -16533 -3553 5327 25165 14028 -8579 36040 146 -22479 -37828
19115 -37828 -36020 -52520 -41643 -40324 -22081 413 14840 32608 36521 18023 393 -9834
19103 -9834 -28956 -18359 8772 -1680 -22609 4702 -503 -7221 -9673 -34810 -49319 -65698
19091 -65698 -36151 -24410 212 120 -7976 10735 16638 -33652 -48323 -37792 -38356 -18230 1763
19078 1763 1727 19382 37617 32824 17706 1340 -16670 -29953 -29536 -18586 -40688 -33179 -18503
19065 -18503 -5667 -17823 5058 5543 -23617 -15162 1116 2404 -9795 -31200 -35326 -34093 -4191
19052 -4191 5493 -10284 3296 -1602 24063 47217 47267 30363 26997 56382 66807 50607 17593
19039 17593 7750 1630 -27924 -45041 -35155 -34043 -10715 2390 -8536 -7291 -6176 -7719 -13350
19026 -13350 -4739 22996 54470 67506 24776 6876 42024 13924 9239 32114 19538 27697
19014 27697 30149 3327 -1109 -4083 -492 31466 20514 -5006 -2419 9891 8919 1759 -3886
19001 -3886 21720 51549 43666 10734 -22091 -61391 -65186 -81541 -55635 -11777 -4243 -24407
18989 -24407 -40340 -9277 11479 -40981 -70503 -41499 -4975 28590 28538 -2519 -28983 -47476
18977 -47476 -46798 -24230 -8181 -5279 -23099 -28260 5066 18718 8279 14237 14401 197 -1501
18964 -1501 -9507 -25096 622 7398 -21035 -15332 3477 8207 10274 -23711 -53621 -30822 14358
18951 14358 -1539 -50054 -59120 -50618 -22357 941 -10487 -25823 -6989 1771 -24290 -48990
18939 -48990 -48327 -38923 4801 37952 40697 30055 16596 -22799 -37891 -29888 -19802 -9045 -14300
18926 -14300 -24655 -58950 -54769 -39882 5399 10077 -7372 -27852 -56987 -63605 -54620 -14387
18914 -14387 -3384 -4218 -1761 -19536 -38404 -45134 -43379 -30374 7119 13364 9909 10389 19761 30973
18900 30973 23037 13806 51568 39088 22277 10243 9802 11693 -1019 -21792 -20928 7373 27307
18887 27307 35393 52831 48434 8154 -11534 -12482 16358 36498 33247 25552 17872 7964 -1450
18874 -1450 -12216 -2482 18403 3240 -13772 -3921 -5867 -16385 -23585 -27651 -24832 -10819 14139
18861 14139 -2073 5604 8489 -19470 19328 54304 74793 47715 35016 37192 6373 -9484
18849 -9484 -8429 797 24414 24497 15290 25340 28957 -9567 -20056 34031 39770 26731 -3363
18836 -3363 -28537 -24465 -5975 -17320 -14415 -8781 -23789 -24895 -30958 -14352 -5243 21919 48757
18823 48757 66167 46609 3164 -22113 -18230 -7090 -14004 -34406 -7131 18288 23359 12351
18811 12351 20569 44512 49845 34445 11106 5412 17044 16794 5625 -25090 -39479 -63763 -80070
18798 -80070 -54701 -31816 -18862 -17942 -14150 -11152 10292 -5922 887 11095 5688 21040 50632
18785 50632 35567 35858 42253 42488 14657 -10143 33571 65719 76743 117568 131435 116259 136942
18772 136942 160149 148677 179719 267053 349435 426163 559531 603177 563203 483701 381995
18761 381995 292038 189855 134793 123712 112244 127715 156219 179180 202713 239885 282552
18750 282552 309801 332386 315331 260944 199873 163101 130270 90474 72505 58991 51959 47818
18738 47818 18651 -8235 -28295 -8108 1740 22424 22929 12200 2899 -3410 19198 24423 15094
18725 15094 -2542 -29734 -27958 -22466 -1560 -1035 31951 12182 -24640 4272 23045 30168 47921
18712 47921 36490 21348 6335 -8872 -16555 -26405 -29865 -21536 -3839 4296 18849 -10588 -22103
18699 -22103 -21125 -3951 14591 41859 16394 6121 17560 24137 2483 2869 15261 33428 12199
18686 12199 17036 -13772 -9587 -26599 -37220 -24425 -117 9867 8492 9698 -13088 -35318 -9025
18673 -9025 15413 8228 -13527 -18976 -1038 -2589 2228 -3667 -15862 -18825 -11949 -16271 -22717 29491
18659 29491 60627 56887 61064 30837 14711 -4997 -28670 -17698 -5592 -15790 19211 52629
18647 52629 49056 54550 63695 68201 42545 62433 72767 87615 83792 63293 18055 -11647 43916
18634 43916 38200 19255 43942 70459 60631 26414 26954 43391 12986 -45076 -68287 -50609
18622 -50609 -28192 -8819 -10088 -6567 7629 -3588 -35312 -23604 -21782 -20077 -6399 -10108 -6877
18609 -6877 17428 10666 -29197 -33691 -9741 -17853 -15124 9638 27408 59408 47332 9175 -13368
18596 -13368 -49943 -62015 -42015 -15122 -13485 -27692 -27918 -4535 16812 29046 4134 -2193
18584 -2193 -18521 -19569 -25269 -11078 14700 10930 -12889 -23284 3668 25351 13676 19533 27322
18571 27322 33047 35544 39930 62239 37782 30414 19502 -14967 -14370 -5062 1733 36039 56622
18558 56622 42873 36327 43148 17821 -11902 -12754 6100 2042 3069 24770 37495 45015 63555
18545 63555 66648 49190 32743 35716 26401 30630 34566 4168 32989 58301 25721 21772 11953
18532 11953 -9677 -31857 -33657 -34380 -49350 -53712 -42052 -27810 -23590 -29243 -32180 -16139 15655
18519 15655 27643 28482 43883 45873 38049 22743 38251 -802 -49048 -21707 26975 16996 620
18506 620 22167 66763 57891 33945 48513 26017 6086 3331 -24862 -2616 25892 47643
18494 47643 46859 49602 61068 74948 109622 103612 80838 44254 25192 1972 -8467 1576
18482 1576 44162 77172 92109 74184 75799 58136 43483 42766 51264 58830 56122 73034 84801
18469 84801 109198 94570 78374 84575 46571 49919 56827 58017 80706 94152 79263 60454
18457 60454 63149 55620 9775 -13694 -18650 -8148 -16716 -7043 14973 49081 62069 58065 29697
18444 29697 32784 47317 48861 48492 30043 45498 85068 70623 49737 55100 52730 63982 94438
18431 94438 88589 74260 64800 52255 28090 13179 13129 33350 42861 67222 80861 63496 41853
18418 41853 51079 57326 35147 47754 61183 69476 52656 38819 42696 48905 41917 31340 34723
18405 34723 64669 105323 91579 68814 89318 109601 107497 105312 104739 98581 57830 54452 62552
18392 62552 75346 75168 61767 83469 96161 107679 99972 64672 46958 23019 29352 68290
18380 68290 90782 104880 91390 108060 117385 113007 109462 88674 58438 45227 36045 9432
18368 9432 28939 88997 114510 86293 54911 38116 48404 80922 97703 95852 140820 150690
18356 150690 119406 123033 122009 108744 85191 84433 81085 101736 82130 63620 78203 99813
18344 99813 139628 148800 99237 63279 61321 53018 47008 72089 85272 108867 115446 89906 49522
18331 49522 59989 61626 96900 106534 106079 108973 95188 87138 97849 98198 90434 81149 113411 127333
18317 127333 120077 99820 108922 106214 135628 118835 103732 113297 115828 134937 140343 150089 173978
18304 173978 166808 169542 153354 168215 185609 204129 195997 181292 176591 182518 184341 204972 212663
18291 212663 183151 169275 156223 204195 228680 251893 258745 256676 282011 303133 345321 366668
18279 366668 360971 335676 334853 347779 355941 371953 387993 406767 468349 499958 535075 584042
18267 584042 629809 666780 747558 841061 905731 971808 1033149 1135277 1256517 1373247 1519120
18256 1519120 1766134 2118152 2520335 2982531 3419464 3868303 4377230 5056028 5883126
18247 5883126 6762611 7783012 8946608 10299991 12101672 14635715 18264356 23759101
18239 23759101 32188585 43568246 55871503 67486230 74469165 65303382 44962046
18232 44962046 30388641 22952748 19580802 18552765 19108378 21164158 25204315 32235273
18224 32235273 42435251 53758895 64398865 70820544 61919154 40968083 25052940
18217 25052940 16167448 11233827 8350460 6538887 5259818 4259588 3545460 3034969
18209 3034969 2711023 2529708 2460495 2429751 2416084 2298349 2014124 1640276 1351210 1179155
18199 1179155 1047543 919166 822233 712036 609524 545276 500949 472658 451719 449391 424915
18188 424915 421313 404129 379584 356164 289605 234101 252061 229358 226612 232666 216673 229471
18176 229471 223651 210701 211866 218678 253241 239096 216147 217281 241478 265798 249919 242346
18164 242346 218654 210960 243089 225720 228073 194710 181180 185698 206786 231496 245968 257873
18152 257873 249738 247386 241615 237671 248452 236287 228256 251037 277994 267355 308484 364009
18140 364009 394145 391236 400299 409110 457004 488333 529514 572662 637936 733227 809018 877187
18128 877187 1013503 1200495 1435107 1694023 2042262 2526383 3116558 3774951 4510588 5366486
18118 5366486 6279207 7285898 8498505 10148881 12561513 16383760 22487072 31570161
18110 31570161 41941713 51770390 60311698 56728903 36392223 20927426 12874806 8565277
18102 8565277 6133135 4575015 3530604 2806006 2279905 1865917 1558147 1365525 1203019
18093 1203019 1076560 952148 824593 750829 707780 647980 588464 504272 463707 423243 377528
18082 377528 331924 300577 265664 236966 236897 215165 249282 253308 236419 179015 135265 132987
18070 132987 148448 129033 140225 121428 79412 59937 84958 82561 84822 82437 78454 56146
18058 56146 63504 69380 46779 40119 38414 43176 39890 34170 42509 28980 52788 66573 48253
18045 48253 42021 44588 27943 54740 59980 13925 4681 13205 8404 5178 37430 66377 75632
18032 75632 93216 73426 54335 63100 65659 50557 58366 69166 76500 57071 30968 21967 1811
18019 1811 -13284 -33035 -29451 -24655 -24828 -2811 6868 9943 7391 22917 24498 -669 5624 25889
18005 25889 -9283 -20462 -29578 -28245 2415 8559 -3008 -3675 11799 4803 15792 25381 512
17992 512 -13849 -1518 17372 42610 33081 4209 3468 -19084 -55010 -34800 -16561 10257 25126
17979 25126 -13151 -20528 6465 -7059 -2175 -650 5150 10624 24411 44608 45260 42288 25847
17966 25847 35094 40001 34331 33048 62971 49493 31239 29694 32175 -9853 -21198 -18547 -20497
17953 -20497 -54651 -65255 -29436 -2257 -12207 11995 -1699 9571 2850 -42821 -70853 -51294
17941 -51294 -9025 -2409 -37069 -36482 -45433 -46151 -9712 6515 -5147 -22373 -31971 -17669 -8116
17928 -8116 19666 46236 15494 20596 29313 4316 -31292 -15326 20699 41945 55660 14270
17916 14270 5584 26185 33413 13835 8465 13321 7347 26741 17570 -15044 -16687 -7700 -10544
17903 -10544 -8636 6780 -5486 -4004 -9023 17028 69489 35011 -1777 -4936 1038 1080 3422
17890 3422 5120 17598 2907 -17438 -6082 21138 6104 -15478 -32153 -18887 -7163 -702
17878 -702 15899 16546 8650 -3588 -18499 -519 1791 9744 27120 59814 37677 8581 -26469
17865 -26469 -73702 -72907 -68757 -48949 -20683 -19060 -24364 -32536 -57609 -59168 -34406 -13475 -13573 1243
17851 1243 357 -17502 -48480 -64794 -61073 -28441 -7938 -13376 3996 -14881 -17359 -24718 -29049
17838 -29049 -33367 -10876 26045 53133 29619 15884 15385 -5040 -9541 5614 -15633 -16713 -35761
17825 -35761 -33442 -49479 -26335 -429 -6177 -21481 -2103 8787 30340 32133 6772 -8956
17813 -8956 -20519 -25656 -22589 -24012 -21714 -10951 22637 -5484 -20734 -37353 -53610 -42740 -44147
17800 -44147 -21736 -16928 9028 29405 39975 5965 -24730 -37478 -17984 -15014 -36750 -40311
17788 -40311 -34898 -2204 -629 -38931 -34101 -19886 -26747 -19294 -22076 2702 -12572 -75343 -73543
17775 -73543 -54483 -41823 -34051 -40724 -22747 -7654 -41555 -50851 -72489 -86920 -63123 -53697
17763 -53697 -5573 -9215 -36618 -17669 25625 21405 2417 -25291 -45659 -50498 -44559 -33739
17751 -33739 -31054 -18681 -7895 -11341 12766 45159 14020 911 -6703 -36477 -16707 10523
17739 10523 9707 -4040 9222 -19270 -32214 -16032 -1 3454 11703 -11220 -6202 11817 16547
17726 16547 -4760 347 13996 40589 29621 18520 29268 15833 5677 9411 24902 38280
17714 38280 64781 52506 69796 84397 85581 43498 65834 111175 142490 186890 249096 301902
17702 301902 360519 409935 395718 283003 175391 120878 137223 158965 150185 166057 164726
17691 164726 149196 204434 269261 327170 358233 321575 206681 101232 9304 -25686 -40664
17680 -40664 -50161 -44557 -18770 -29566 -62582 -48454 -351 48469 30804 4341 30039 3331
17668 3331 -17099 3419 -24895 -51116 -32594 -28471 -40404 -45152 -37787 -34693 -18095 -24226 -38073
17655 -38073 -49758 -66718 -63469 -42308 -39017 -15052 -3594 -29106 -48442 -26201 3736 -12057
17643 -12057 -36772 -5774 14696 -8699 -6925 -4127 -45186 -60935 -45558 -47065 -57096 -66680
17631 -66680 -69093 -50699 -28873 -12238 -3271 2793 -17945 -28296 -15993 -48177 -88116 -108127
17619 -108127 -57950 -43674 -43939 -34006 -13637 -26638 -53354 -65455 -44529 -32595 -26531 -43773
17607 -43773 -35791 -36422 -69483 -94249 -68805 -57460 -46873 -45165 -51667 -45316 -16332 7788 1989
17594 1989 -23263 9664 3590 -26089 -19415 -8562 -17200 -58177 -63921 -66589 -72923 -70884 -33752
17581 -33752 8967 22373 27615 8234 -11857 4775 10116 255 -16400 -10065 12606 -7252
17569 -7252 -67789 -81325 -73336 -66905 -35797 -14010 3519 939 17363 44567 48549 55320 41643
17556 41643 3875 -775 8976 11188 3323 9157 13186 23726 17435 -7647 -37447 -20430 -2830
17543 -2830 -2111 -526 -8885 -17753 -24507 -40823 -65151 -98939 -85985 -53013 -27085 -16138 -24734
17530 -24734 -7238 10943 7417 846 -1203 6797 24786 48266 43762 6729 -12642 -44151 -47927
17517 -47927 -23344 672 -14085 -6144 -2868 -2958 13764 17858 9322 -8994 -20779 -2504 19301
17504 19301 23231 -1437 -32638 -14892 -13584 -34582 -59660 -77418 -91719 -59066 5865 5988
17492 5988 -24065 -44554 -58434 -71973 -57252 -45752 -22534 -21035 -11980 -21095 12318 -17819
17480 -17819 -19267 -32066 -21948 9240 7156 -781 -5797 -36788 -17998 6537 18260 35576
17468 35576 14796 -20599 -15323 -1942 -20218 -26788 -37815 -15953 -14700 -10469 -28769 -23293 -29849
17455 -29849 -25641 -39197 -51594 -29742 -4476 24556 17150 28405 49267 89365 150396 201694
17443 201694 217676 265217 296367 196798 62510 7275 -23498 -8065 250 -9238 -14237 -25596
17431 -25596 -40716 -42168 -49367 -48527 -25846 8326 -8273 11300 37383 52226 19677 -3692
17419 -3692 3140 12361 11000 -8624 -24446 -29728 -61005 -46638 -20302 -15965 -16119 -21447 -11384
17406 -11384 11333 15046 21779 28277 27759 42411 59480 32289 1975 22209 44889 43589 38681
17393 38681 8516 -30642 -26361 -9333 -40035 -55797 -41870 -60551 -81553 -84756 -40293 -8594
17381 -8594 -9618 -35231 -35941 -33126 -15990 -14727 -7087 -41005 -37637 -27379 -50805 -44277 -40312 -19351
17367 -19351 19464 18512 9734 25520 23012 4484 -21631 -19333 -5451 139 9999 19230 27655
17354 27655 -1048 3921 39476 20102 -29891 -18673 -20132 -23433 -31725 -1488 6200 -1551 -26480
17341 -26480 -89271 -60437 -32093 -34121 -2063 24515 44327 47091 36430 14362 -8437 -11742
17329 -11742 -22664 -36811 -35761 -26676 -19003 -45415 -44424 -32143 -46600 -35818 -29773 -44241 -17619
17316 -17619 -24266 -51097 -28029 -18833 -32928 -25241 -20698 -21778 1743 -15533 -12274 614 -4367
17303 -4367 -22853 -36748 -48655 -34349 -6539 -12580 8808 47074 51446 8785 -48230 -67234
17291 -67234 -62991 -42602 3161 -13715 -38613 -27526 -30035 -53832 -41976 -38502 -28071 1162
17279 1162 10290 -5531 -16705 -35347 -38033 -14239 -8925 -34372 -47295 -61922 -48065 -28438
17267 -28438 -11285 -13425 -36138 -41699 -9768 -17154 -13497 -27384 -6737 -3367 -21702 -41956 -30136
17254 -30136 -23451 -25981 -4790 18459 731 2970 40321 32734 22933 26375 12258 24578 23184
17241 23184 -16930 -28682 -7465 -20073 -21141 -15671 -28395 -11607 -1660 30473 30925 27701 -9077
17228 -9077 8312 15040 3623 12450 4380 11457 23589 -2154 -8515 -28290 -25501 -37203 -24912
17215 -24912 -19444 -22429 -20547 -30592 -53644 -57758 -21715 -20694 -55190 -61669 -110637 -117238 -100154
17202 -100154 -96832 -103403 -89908 -95609 -91833 -87673 -77795 -90929 -74219 -35826 -36092 -2075 -21664
17189 -21664 -33232 -30598 -16895 21434 25447 -2708 14100 9139 -17740 -34999 -27546 -4415
17177 -4415 -3001 -12511 -4303 -14853 -32855 -48651 -37175 -45035 -32890 -8323 9999 16100 6324
17164 6324 -6366 -25350 -22866 -18772 -33359 -37704 -14256 8277 17759 21794 27644 -7293 -11738
17151 -11738 -17515 -35045 -37938 -34087 -15618 -27364 -33098 -17517 -20703 -35895 -28628 12544 30009
17138 30009 14289 4541 -11067 -8757 14597 -22777 -53139 -67269 -55265 -24402 -19366 -45049
17126 -45049 -48023 -6754 -8019 -19862 1035 6184 21316 16806 -4319 -30123 -33938 -40901 -29073
17113 -29073 -8241 -8074 -8278 -6643 10171 2984 -17839 -61141 -44758 -22518 -23121 -8425 27106
17100 27106 25749 33600 27182 9709 3105 114 -4807 9661 9053 -29052 -38628 -24283 -2642
17087 -2642 -619 -19442 -22373 -14978 11994 4426 9020 11769 10852 18364 7214 11960 31724 54696
17073 54696 55489 40420 19809 14967 13874 20639 -4646 -13453 -14262 -24457 -40412 -16082 6842
17060 6842 1130 19963 36508 32628 -13410 -41347 -19038 19117 10573 -5231 329 -14177 -17682
17047 -17682 -8545 -24337 -35415 -29146 -13722 11113 42184 25644 9506 38167 37810 11027
17035 11027 12024 -18703 -27842 -21958 -36232 -41759 -72405 -75423 -61690 -53072 -38612 -48934 -53590
17022 -53590 -45993 10201 37625 35603 26328 14709 5798 4375 4113 13621 18208 16266 28971 23600
17008 23600 32496 28310 36466 35435 18252 23775 20073 -24037 -37827 -46296 -55299 -81435 -33501
16995 -33501 -20646 -12091 -20841 -34235 -15178 18696 33326 13843 -11392 -9738 -9426 -7369 -4297
16982 -4297 6586 4400 -33083 -57269 -48075 -26935 -11810 -6865 3248 -18731 -38742 -43205 -54710
16969 -54710 -49330 -39724 -50578 -41538 -35868 -8696 -21695 -7580 9680 -38111 -39361 -32892 -43336
16956 -43336 -37855 -33030 -53748 -60628 -28600 -63301 -64609 -89203 -86818 -80489 -80365 -94540 -84665
16943 -84665 -30435 -13953 -44868 -50265 -36573 -16388 4828 15963 19048 38468 43115 25706
16931 25706 20652 24676 22671 4821 -6761 -16624 -38455 2318 4950 18042 23275 40142 -4418
16918 -4418 -12184 -30749 -47879 -40104 -45741 -38460 -41494 -36361 -31669 -17101 17182 21309 620
16905 620 -19912 -10761 14199 44079 44629 53921 55019 24408 39652 47079 38215 30048 6062 -8997
16891 -8997 -7417 -5807 -3304 -11879 12453 14675 18598 22836 -16154 -25659 -10395 1055 -51278
16878 -51278 -49262 -44016 -29126 -30232 -41584 -40084 -15658 -12287 -40221 -66891 -72922 -85461 -80675
16865 -80675 -64053 -33468 -21349 -25735 4619 -20836 -16654 -44845 -61694 -51462 -40696 -26217
16853 -26217 -34853 -26169 -16796 -6627 -30738 -35508 -45038 -55822 -42155 -26305 -4929 -882 28210
16840 28210 32383 30938 -9163 -45787 -52808 -26217 -2475 -7720 -14215 -21465 -26249 -39149 -43434
16827 -43434 -34572 -29872 -21219 -22735 -33937 -30903 -21466 -6400 12889 16206 6382 -14177 -26817
16814 -26817 -15923 4585 -10765 -32536 -2910 1025 19732 1638 2582 21376 14537 -2592
16802 -2592 16076 -994 -6175 -18001 -45342 -50281 -34268 -13484 9025 -22642 -12430 11084
16790 11084 16251 47801 46193 10134 -17210 -7728 -11080 -24278 -14691 799 -29769 -41768 -13078
16777 -13078 11322 -10161 -28793 -21270 -30314 -24465 -37777 -42356 -37897 -29979 -15333 -18452 -4110
16764 -4110 15034 24455 35920 43611 37605 47325 32209 -8838 -10183 276 -16857 -38555 -22177
16751 -22177 -32706 -48707 -10570 11721 -5731 -8034 -14447 -36775 -32506 -18099 -31422 -18676
16739 -18676 14196 42010 35036 23697 8506 -17474 1823 -2889 -37393 -45954 -15039 4470
16727 4470 28999 63406 78230 50565 28694 34716 33008 43046 40969 4451 -14314 -39443
16715 -39443 -40307 -51840 -26910 13603 13720 29257 10753 -7784 1047 2250 1661 -17711 -25756
16702 -25756 -1724 10434 35873 33407 9500 -37514 -27080 -16988 -18020 -38409 -21758 8537
16690 8537 12273 10185 -4662 -44668 -43436 -28004 -16995 -18611 -20609 -27998 -39424 -30000 -40598
16677 -40598 -10083 9150 2397 -26294 -22182 -8745 3951 16692 37640 23320 35860 30219
16665 30219 3765 -10052 -1560 985 29329 17509 -7219 -21442 -14053 -15321 -34692 -21466
16653 -21466 12914 -964 -35088 -27621 -14171 -28278 -25613 -37233 -15922 -17247 5053 -14006
16641 -14006 -2825 -1165 -7377 -33795 -46505 -40209 6236 -4633 -61376 -75875 -67358 -59837 -48638
16628 -48638 -36288 2438 11553 17015 16999 -16289 -32641 -46363 -58801 -55874 -47504 -71176 -74702
16615 -74702 -36374 -19272 -33387 -41345 4303 4017 9178 40717 44954 43802 8994 -18064 -24692
16602 -24692 -25617 -49408 -45789 -27660 -6773 3857 -1959 -676 6547 28125 53783 42547 31746
16589 31746 4693 -15732 4787 25445 40 -10866 20437 21654 15190 15475 18510 6898 -17268
16576 -17268 -11749 -14085 -49599 -26333 -1139 22947 16628 -6328 -25699 -45242 -32992 -17856
16564 -17856 -27887 -35385 -17810 -22828 -14448 -8202 -26712 -60157 -70427 -51672 -48748 -37717 -27940
16551 -27940 -48720 -78846 -69189 -37508 -29923 -30346 3388 -1199 -11060 -15288 -18098 -18200 -48139 -36689
16537 -36689 -18829 -25020 -37545 -30933 -3737 -21214 -28072 -11824 -3427 -17572 -15260 -175 -2931
16524 -2931 9650 6075 21992 51138 29347 40966 36074 31769 29810 -1079 -33458 -32868 -59427
16511 -59427 -53320 -55061 -37334 -12701 -29992 -35536 -7104 -1533 19878 17769 -17399 -32845 2823
16498 2823 24014 9770 9467 16863 13573 9631 -21615 10827 18031 7383 -8775 -9292 1855
16485 1855 48263 42036 22398 41058 36387 30912 -10583 -34513 -25370 -6598 -13290 -17991 -24701
16472 -24701 -21297 -24551 -28765 106 7428 -1369 -8532 -21435 -42351 -36056 -14497 -11142 -11885 -19964
16458 -19964 -13346 -30174 -9625 -13214 -22002 -28796 -2823 6852 2048 31336 39631 31784 52585
16445 52585 58645 55212 9224 -15815 -16228 -6194 17770 8362 14056 64458 45191 6238 851
16432 851 -16520 -21543 -38082 -42322 -43587 -18803 -13688 1247 -811 9078 -11203 -47825 -47326 -25280
16418 -25280 -30034 -24608 -14291 -36356 -56249 -64821 -64412 -72757 -58578 -40755 -12113 3989 -24143
16405 -24143 -28182 -45030 -37178 -40025 -26563 -5304 -21548 -23055 -33956 -26943 -21088 -10964 -689
16392 -689 4 9362 17238 -4859 -18133 -13778 -30700 -27873 -11248 -6464 -7522 -4001 917 13596
16378 13596 18129 20969 48933 64374 92385 84544 48505 22155 20197 37223 42183 25848 31247
16365 31247 49244 35269 19779 1669 -332 26953 43607 -3965 -35806 -33017 -15231 -8000
16353 -8000 -50373 -73699 -45937 -48346 -56570 -66807 -80360 -68354 -68418 -53614 -29762 -3 13894
16340 13894 37969 12271 -25770 -14679 27374 41140 41775 27438 -8723 -15661 -27094 -33295
16328 -33295 -42819 -22618 18500 42559 15624 -5325 -4019 -15671 -29700 -43917 -39714 -20859
16316 -20859 6362 35506 34448 17516 15129 -2153 -14152 -22707 -3882 -23836 5340 40140
16304 40140 11668 -21456 4499 8949 1337 922 28045 9584 -26045 -21603 6321 21490 14423
16291 14423 -16198 -38417 -9331 20867 26724 -1125 23764 42296 27503 5233 10997 34130
16279 34130 19851 -10017 -26368 -8461 -9815 -3169 13294 -9631 1962 18943 -10063 -11857
16267 -11857 -17671 -23881 -32661 -29440 -27529 -6600 43256 56105 -11867 -43589 -35909 -35427 -34062
16254 -34062 -10922 34952 18879 -11331 -5845 -20686 -33900 -40693 -51451 -40484 -36391 -50482
16242 -50482 -25772 5750 12176 29730 22051 31747 36294 35656 -1858 -21303 -18251 -31819 -15322
16229 -15322 -30424 -51488 -56542 -15095 -8354 9561 5485 2194 10145 23980 41511 44039 46446
16216 46446 49174 42649 48295 45450 7479 2587 4216 -24299 -18924 -22661 -22673 -37861 -60651 -59010
16202 -59010 -20896 4444 19420 35543 35272 -6478 -61360 -72814 -55558 -14476 17699 15616
16190 15616 5037 -11968 -6668 11358 13485 -926 -3811 15586 22378 5861 3751 -13278 3676
16177 3676 16838 29385 43962 38261 26583 19310 47109 40554 43113 54853 39235 25972 -21067
16164 -21067 -27249 -19272 -39268 -32154 2434 9537 -19767 -15744 -28328 -29046 -39076 -46471 -41465
16151 -41465 -47330 -26831 11166 3803 -8795 -33275 -45230 -57217 -79685 -72874 -15844 6205
16139 6205 -1415 -21836 -8961 -3314 -5979 21296 25685 22755 20217 -5720 -19478 -19298 -769
16126 -769 64314 73110 36990 17423 44392 65844 48878 32714 14410 5321 13766 25349 20498
16113 20498 -2188 -21403 -37553 -17923 -286 -1530 -3433 10658 19006 11462 -7268 -15450 -12768
16100 -12768 22103 54019 46974 14551 -14458 -31235 -24441 18437 26689 15296 336 -21324
16088 -21324 -28334 -2484 15859 4514 4972 -19253 -43892 -31766 -33142 -47760 -50459 -52512 -48386
16075 -48386 -26614 -8146 10655 50109 50583 30448 3077 -18730 -15055 -1228 -50732 -52681
16063 -52681 -35062 -24984 -16921 -7655 -31355 -49418 -14401 -4669 -2195 -36531 -32416 -14168 447
16050 447 -4472 -1306 6027 -718 -13014 1085 28179 41795 38584 33225 17061 6107 -15494
16037 -15494 -47142 -28471 -16800 -46312 -18897 26466 9751 -3320 -23596 -34042 -12686 5048
16025 5048 21341 4686 3225 -1441 -7663 -18197 -26481 -47256 -58545 -53986 -8162 19546 6870
16012 6870 9822 -22059 -40927 -17800 -7435 11630 -11371 -20624 -11798 -20085 -17716 -14760 -31933
15999 -31933 -7022 2842 -9535 -21126 15616 29608 7557 22793 3895 -147 -16387 -46108
15987 -46108 -11269 7236 246 -10185 19954 41160 30299 -3552 -7620 5204 24683 32059
15975 32059 -18739 -29495 -40364 -15300 -2184 5285 -4037 -42999 -40609 -13345 -11955 17
15963 17 9408 13587 -30 -11084 -16404 -15978 -16841 -3164 14321 34727 47771 4602 -14845 -22064
15949 -22064 -13272 -19555 -23629 -6541 -140 18277 13470 11329 6472 19435 6362 11389 24918
15936 24918 7183 -17933 -21833 -12136 -530 -16361 -24125 -27230 -62145 -69106 -54345 -57990 -54593
15923 -54593 -45242 -26225 -29566 -15581 -11044 -40156 -41640 -3619 22591 19294 -8140 -15391 -10716
15910 -10716 -4460 -1963 18686 18938 24895 7905 8529 16536 36122 45977 51534 49276 24155 16680
15896 16680 44984 48821 29337 40216 38565 33662 24641 9378 4609 14546 11692 -27331 -55790
15883 -55790 -43662 -20850 -10253 8409 32120 45135 14928 457 -1099 -18713 -32316 -27589
15871 -27589 -5865 -15356 -21758 -7949 -41629 -45136 -38605 -5164 26957 32958 30670 18659 2744
15858 2744 10648 16074 -19210 -70219 -56681 -11736 22835 31855 22459 -14532 -39190 -36856 -13325
15845 -13325 3589 8226 6680 -9683 -17374 -25858 -22055 -28961 -59818 -43350 -49739 -37245 -48528
15832 -48528 -22434 269 -13999 -13776 8675 12182 -5683 11651 15891 -13138 -8639 6220 -12042
15819 -12042 -21022 -1146 -2735 4803 -1823 6629 -22101 -20157 6127 -20685 -62448 -39255 16949
15806 16949 18176 -38583 -66611 -22130 -11998 5170 24650 22914 20133 15846 -4822 -28483
15794 -28483 -11722 14980 23646 42366 36694 35838 7412 -13636 -25305 -38190 -22878 -44506
15782 -44506 -43239 -11044 16663 35283 53145 20372 -2252 -32652 -42077 -35391 -25131 -43538
15770 -43538 -42626 -43051 -47741 -36987 -42929 -44982 -12461 -6980 16438 -5814 -45958 -63083 -60250
15757 -60250 -36812 -24710 -27936 -25941 -24216 -56863 -86302 -75997 -54945 -24788 3740 27708
15745 27708 28006 11833 -10606 -10215 -40304 -40129 -32158 -10133 -5970 13123 28919 8306 309
15732 309 27082 11751 1236 -11148 -14165 -8550 -32612 -14065 5930 9983 9392 756 13443
15719 13443 12424 -20509 -30026 16394 31831 9567 -42078 -46246 -33140 1007 -7876 -16121 -24924
15706 -24924 -36100 -31101 5437 21669 38059 28152 -4850 -5801 -12341 -16839 12856 34292 16503
15693 16503 1016 -14857 -33231 -28832 -5451 30660 1130 3403 25049 43177 46322 32270
15681 32270 12529 21022 33530 11078 6788 7463 -18291 -5940 -17765 -12450 -3564 -3949 -4892 14431
15667 14431 3463 672 13433 38435 45142 18869 -9656 -34072 -59347 -22475 -5232 9741
15655 9741 19697 12267 4184 3323 -450 1637 15118 -16972 -37323 -12098 -2853 -10748 -26105 -55306
15641 -55306 -46962 -33837 -10294 -2761 -28069 -33631 -43398 -64467 -30234 7934 23453 -5084
15629 -5084 -13841 -4176 -20910 -22710 -19247 12383 22521 -8133 -8334 -22585 -64046 -43225 7308
15616 7308 9359 -17364 8724 21610 34100 39766 9934 -7217 6378 24925 55046 70814
15604 70814 81251 51621 37064 52572 33583 2253 -6975 9116 -10517 -37453 -52688 -28924
15592 -28924 -7608 8890 -5689 -17543 -13256 -33405 -55327 -74016 -43033 -38567 -53129 -62598
15580 -62598 -15008 36015 77872 52342 17840 7265 -10163 -3835 25280 26823 11359 8857
15568 8857 1688 10827 10615 28094 18397 12898 7543 1473 -7416 -18013 -27145 -29354 -7440 23198
15554 23198 35522 29466 17234 3894 2102 16365 8294 -29565 -21542 -22464 -28453 -28193 -27405 -37129
15540 -37129 -34032 -12442 -35929 -42701 -19427 -6803 -24165 -29526 -25763 -3330 18779 14336 -24591
15527 -24591 -46217 -18612 1663 20507 27035 13385 2232 5075 -28127 -60667 -59163 -38749
15515 -38749 -4318 37583 84285 90143 65723 24789 -3530 141 9676 2071 -38757 -41516 -14026
15502 -14026 7318 35743 31837 6517 -23869 -34900 -18505 14908 20435 10138 18089 14403
15490 14403 -9727 -19176 3881 37561 18954 -1754 -2588 -10753 -11931 -23351 -48638 -68420 -61523
15477 -61523 -61250 -76318 -98436 -57785 620 5249 -31138 -48898 -36872 -11040 4720 3317
15465 3317 7518 5795 -2449 15513 47339 59143 40629 42271 26147 27511 32332 21230 18640
15452 18640 46508 33334 24667 4165 -6035 17517 -8731 -25525 -17273 -34572 -37456 -21275
15440 -21275 2584 3281 16884 31648 39047 9843 -12089 -44839 -41988 -41554 -26192 -4431 1161
15427 1161 -8290 -46961 -48890 -16866 17756 37173 24938 16001 19704 15833 11021 16405 -5795
15414 -5795 14046 32018 32042 30901 9125 -1383 -3656 286 -25198 -20652 -16278 -2606 12437
15401 12437 -15785 -42172 -57653 -69419 -41865 -22175 -2163 -28502 -62189 -70217 -49059 -27221
15389 -27221 -26612 -33712 7690 20500 11492 7019 6252 8353 -15701 -47864 -46815 -2830 17327
15376 17327 9835 14065 14735 21442 -11340 -55854 -41950 -10428 15118 -13695 -38535 -5041 23164
15363 23164 41554 62145 47865 24941 33927 47359 34858 26000 -2681 -8033 34134 48069
15351 48069 40429 7593 -28183 -39824 -46645 -62830 -50504 -41813 -22423 -22713 -6258 17929 24209
15338 24209 -5763 -43069 -58640 -46675 -29597 -14970 -3886 -3520 -12215 -11682 -3173 19350 29986
15325 29986 -5180 5847 13285 -22858 -20208 6328 9894 18056 32911 36143 36701 26454 7696
15312 7696 -3049 -17392 2493 5939 22574 -6485 -43269 -75478 -73955 -63210 -50828 -16068
15300 -16068 -32324 -40269 -40332 -41207 -12396 -15636 -35238 -34620 -25885 -23609 -18855 8540 21831 14279
15286 14279 -1045 -31671 -35585 -33324 -11187 -8230 3857 -5391 -27988 -23967 -34295 -30863 -10867
15273 -10867 -1929 -594 9052 3403 7719 17271 17707 12683 17006 15229 16926 12220 32052 47058
15259 47058 63613 68665 13475 -14115 -250 100 15825 17942 -5764 -5952 -1479 23765 1819
15246 1819 -29011 10903 26316 10143 27615 6561 -52 -2461 -6022 8665 12734 7905 22408
15233 22408 19912 36 -36686 -30441 11828 1932 -6301 5008 -819 1247 -22049 -42098 -62740
15220 -62740 -54850 -42252 -5053 783 -5939 23133 37174 34218 19416 16093 3932 -13013 -13207
15207 -13207 -32839 -29715 22309 36651 -19964 -57018 -47621 -18031 -8465 -7482 265 16126 1439
15194 1439 -2323 -43426 -45266 -20213 17229 29913 1056 -11974 -23346 -20116 -3475 -4822 -21122
15181 -21122 -32781 -15138 -15589 -15844 9638 21210 27841 31066 5642 3503 -344 -10510 -34079
15168 -34079 -45031 -38440 -17799 -734 13801 17792 1735 -21035 -19293 -11132 -28869 -47487
15156 -47487 -51088 -35144 -22413 -37261 -32809 -8934 14377 -1022 25019 8285 -4793 11035
15144 11035 -10591 -30656 -56997 -55776 -7458 -33170 -14987 12499 21291 12994 -5470 34180
15132 34180 27804 -10633 -25488 -36159 -41401 -30394 9659 6746 -12790 -11923 -23806 -27139 -17296
15119 -17296 -8745 -26866 -45542 -55536 -36714 -26415 -5107 25591 25666 17442 38628 22903 11908
15106 11908 19026 18967 28266 7011 2073 1795 -17787 -32266 -19721 53 -5052 -30316 -20636 -16919
15092 -16919 -7577 -810 6788 22532 39802 40894 26346 33742 45001 51317 45954 41050 36658
15079 36658 28030 21616 1306 -10897 3401 9757 -2928 -6479 317 19799 8499 -14371 -13136
15066 -13136 11089 5884 -3648 7315 15867 5481 -21750 -33888 -29417 -23205 -3188 7147 -4500
15053 -4500 -19790 -50805 -55401 -25120 9161 15196 33224 18094 -3584 -3228 -5885 -12063 -9489
15040 -9489 -15629 -5096 12859 -15713 -7719 -4739 -10202 -16110 -26733 -14466 5192 9 27047
15027 27047 54856 66870 62312 30166 36794 30590 12928 9442 30047 39357 41019 68847 69965
15014 69965 48569 10673 28340 46665 34827 48595 91547 115374 122723 157910 166640 185976
15002 185976 211693 212911 121985 75121 96178 74100 56956 32812 42579 77645 62507 34544
14990 34544 18159 -2533 -27996 -30075 -29924 -37853 -23290 -31147 14046 24624 21466 5168 -31208
14977 -31208 -11719 8211 36234 24724 15842 6855 -11225 -17574 -30414 -16659 7564 47599
14965 47599 78359 50367 31016 39045 19994 -905 -16956 -2285 -2001 -17121 -3642 -8842
14953 -8842 -27722 -4019 4332 10967 7089 13053 5621 -11995 -3311 4630 15888 31813 30840 17008
14939 17008 24172 42509 62494 9722 -31314 -56717 -58296 -8863 24561 3437 -9031 -22580
14927 -22580 12442 42009 25178 9699 10600 31918 48241 54204 80165 69650 53476 22964
14915 22964 -5621 -6064 10872 -940 -9372 13184 28620 -11105 -23241 -4710 20718 2365
14903 2365 3958 11675 27024 28969 43756 44246 66362 51751 27935 26652 31679 51849 60898
14890 60898 31727 33339 19515 -16698 -36877 -9235 22955 21173 2598 -10615 -14088 -2026
14878 -2026 859 8351 21283 7421 17349 16597 5720 13950 48837 58780 57151 65169 53665 56081
14864 56081 66176 80943 59803 33838 -738 -1521 2565 -24294 -22053 -16251 -30979 -28236 -27514
14851 -27514 3625 42452 56589 38699 11092 -30251 2162 48006 53236 29814 25816 26825
14839 26825 11738 26734 35938 36568 35506 16082 4301 9001 7253 5419 3532 5243 13455 9332
14825 9332 11082 20169 2764 -5074 -20389 -34953 -20807 -2722 9720 39155 42154 32722 14808
14812 14808 27861 19445 16120 4340 -3948 -2750 14508 7410 8199 18161 14081 18857 15871 16206
14798 16206 -4368 -11635 -5404 -3529 8589 29662 68400 40640 6873 -1403 3879 -10018 10394
14785 10394 21513 767 -16367 2295 6603 8118 -1954 -20215 -36330 -33733 -41464 -39070 -26713
14772 -26713 4175 17676 29875 36329 34276 29351 25756 16383 14035 35098 19158 17136 51017
14759 51017 19361 9387 29033 635 -5448 15988 4747 6889 -5922 -11611 -28319 -63969
14747 -63969 -60178 -4893 15597 -5207 -19632 -5997 -13122 -26484 -20210 4973 19400 659
14735 659 -36954 -23989 -32405 -23107 5770 2542 -23286 -26450 -10796 -27725 -28032 -15045 -2780
14722 -2780 -16202 11330 37188 25575 8927 -1691 -774 -52617 -46584 -7561 15819 6831 10495
14709 10495 12453 -13024 -14513 6744 -6740 -12385 -7679 -7146 9426 -259 4828 20899 39142
14696 39142 20568 16282 9933 4554 15556 -534 -14120 5748 8506 -4526 13165 -1027
14684 -1027 -135 8408 20328 29162 16303 31549 39206 5518 3199 5363 7363 659 -18166 -27986
14670 -27986 -15737 5933 15603 35420 42419 57616 35668 -15543 -20481 -26959 -23214 -5491 4354
14657 4354 12722 13170 -13886 -22364 -24969 -28237 -10041 -16943 -30668 -5092 1666 -6380 -330 -1309
14643 -1309 26444 15253 -26657 -24717 -29343 -30172 13377 29171 3920 -11346 10016 17104 36770
14630 36770 14735 -4507 -20468 -16239 -13693 -33275 -48290 -12542 23609 30800 25997 32351 38840
14617 38840 32760 14383 -12316 -19738 -28530 -8601 22590 64692 106045 109931 98239 29150
14605 29150 22243 15506 17924 3137 -9865 19877 32953 42882 62046 85092 68867 20834
14593 20834 11831 16554 30834 21659 -2548 -11681 -16793 1639 36255 26276 8949 13410 26806
14580 26806 -21291 -16530 -24225 -15805 -22015 -8896 929 34394 32713 21555 38196 45323 39467
14567 39467 53654 51526 16585 10614 90 1996 27998 41509 31871 28896 18952 44177 57156
14554 57156 49022 17408 -7035 -2731 -7630 -24117 -30266 -38356 -48064 -35268 -4974 -7918 -29926
14541 -29926 -31730 -16950 -13876 -16638 -30676 -14249 844 -6451 -5401 428 12310 43548 18952
14528 18952 22306 8505 -24619 -14842 -1722 3830 -12034 9100 45976 48055 11139 6830 29445
14515 29445 44147 16317 -12677 -31526 -16841 -13549 -9796 -4978 3393 978 -4225 -30080 -55619
14502 -55619 -36970 -29553 -73242 -65068 -45349 -42354 -55764 -43432 -7398 4389 4986 -11060 -5992
14489 -5992 -17887 -35550 -34978 -34151 -49601 -41391 -28254 -18726 -6619 2072 2698 11406 7446 7364 -645
14474 -645 16532 -1950 14310 37226 43817 39745 11424 10328 4789 7100 -832 -21054 15740
14461 15740 46878 19375 -20443 18941 19667 -3103 -19701 10102 26436 -13315 -17775 12491
14449 12491 16612 24594 -14161 -897 29244 39343 38734 8650 16197 8791 14017 45268 45521
14436 45521 58029 62699 30715 11044 26896 37809 42143 11615 4077 1189 24542 25924 24277
14423 24277 6469 -503 15695 16966 17430 45219 27898 11825 15130 9169 -9491 -9986 4834
14410 4834 17038 13277 15564 25104 51069 36851 34826 24098 32973 20585 20577 36051 16961 -1234
14396 -1234 -41691 -49575 1179 -8673 -25808 -15376 -907 31451 66761 69981 53810 29517
14384 29517 -13609 -30006 -820 -3363 -9275 -7698 -10839 -24502 -15595 11760 45950 46934 22064
14371 22064 18748 21164 38781 44369 37355 23896 46874 49321 32566 28931 41301 61415 43752
14358 43752 13844 26045 46131 53999 42638 13879 3797 -25900 -36566 -36832 -39244 -38267 -19250
14345 -19250 13316 7855 2841 -13085 -3166 15785 10854 8486 35476 46197 28846 20300 3160
14332 3160 -16618 -11599 2979 10500 29843 49000 36074 -1092 10340 -2124 -15191 -51896
14320 -51896 -22318 8507 26203 24673 -2989 19782 -2869 -9562 30807 46432 44285 18202
14308 18202 4384 3779 -5246 8576 15840 43024 57946 58528 35470 45191 45134 27695 -10843 -24143
14294 -24143 11229 33871 27376 7260 14238 43770 78758 48107 6358 42108 79252 65974
14282 65974 23075 7700 44971 56660 73337 71219 68170 54728 31688 20459 10355 12266
14270 12266 13484 20801 14119 11771 37881 57625 43014 36939 2810 1414 30484 8099 -21056
14257 -21056 -21561 -197 15741 -1545 -2090 36012 36528 2318 -6399 11387 22566 21992 13415 34193
14243 34193 20224 -7288 -31559 -27722 4929 28942 39147 20426 35981 72665 49098 12415
14231 12415 -17074 -7034 -16943 -5163 32568 47097 13930 15482 -5518 14822 33559 49496
14219 49496 36673 9206 3646 32095 30706 6674 29168 50291 19711 16757 31215 51080
14207 51080 51291 27852 23711 -20068 -18883 12359 25183 7991 -3426 -1344 9106 12259 87
14194 87 1799 -16310 -27253 -21706 -30513 -24522 4594 25660 22009 9552 -12989 -29554 -37977
14181 -37977 -20266 6726 -2134 -17350 7003 40621 22331 9733 8387 29894 23829 16274
14169 16274 24028 39048 33184 19312 17622 25722 33963 23381 17588 22984 59105 60631 72673
14156 72673 37267 14112 25274 37407 34155 16505 12713 20377 39161 38034 38239 24687 23715
14143 23715 52866 64016 46119 52048 30730 29359 49919 58958 53787 46966 29955 15355 5375
14130 5375 -3120 17540 12883 12683 25659 38164 23976 45192 36374 18896 24504 -2469 25841
14117 25841 24002 13559 -29251 -18020 9059 -2207 15136 21416 14179 -27035 -51138 -33544
14105 -33544 -24938 -14436 12625 75763 81420 77517 63450 34588 18334 14446 13307 47895 42334
14092 42334 24010 51370 53947 70591 64870 58692 44464 20752 -15303 -514 19576 6774
14080 6774 8739 15644 15404 4287 8789 -36978 -34728 -18153 12403 59363 67983 27189 1426
14067 1426 6267 15230 -7478 -12921 -5822 -16893 -2625 13274 2272 -32652 -41997 -21336 12268
14054 12268 28668 18774 16602 -8837 -26230 -23797 -32287 -50466 -43903 -36417 -20721 -25345 -19055
14041 -19055 4103 21610 1611 -16928 -6315 2499 -19354 -48188 -51923 -50007 -40837 5017
14029 5017 24025 42606 73760 86546 74019 69887 75265 60179 50249 53476 26672 36945 60380
14016 60380 68002 70739 54275 21781 9025 -5811 -6960 20660 36782 37385 73215 63217 39100
14003 39100 29901 55786 53057 38041 28590 7380 6152 31172 36279 36491 25873 26630 38171
13990 38171 35121 19569 -20224 -1220 34199 29436 41050 50270 27788 9067 32546 55610
13978 55610 53660 18075 15229 21245 33460 28947 13410 8212 33910 39117 46886 54938 72969
13965 72969 52572 48664 9919 32227 48719 36530 -2397 -10618 3395 24197 40289 20956
13953 20956 -3059 3389 6349 19947 39393 16900 15574 27160 10584 9090 12080 16777 40540
13940 40540 28386 31037 45370 29957 20056 26834 48294 39321 28662 32223 49721 31214 21619
13927 21619 60783 92153 73046 39206 35172 41422 7229 -13431 -6698 23831 44395 37298
13915 37298 22331 39829 42755 43727 53035 81059 47214 32468 34192 42822 70406 50426 21393
13902 21393 33490 80381 106116 108026 92041 65592 49021 24620 -742 25290 48488 32078
13890 32078 17474 48940 66424 94214 90658 52727 33959 32473 -6568 23497 37815 16106
13878 16106 4403 42076 63828 42748 14579 33171 38682 44848 43043 64903 74843 82599 54157
13865 54157 47004 52312 86402 117982 118568 150355 196900 271583 288585 301964 316819 295969
13853 295969 270624 211745 133242 127612 103129 72831 62974 87742 80076 87914 98765 121771
13841 121771 139061 117938 119105 131101 150337 158675 138921 145971 199331 224296 266046 331176
13829 331176 342404 371424 407269 374161 369292 320126 267033 220892 214639 216422 193651 154885
13817 154885 128825 138966 126117 100983 147522 159563 142181 128759 135504 156638 133090 109553
13805 109553 115133 121956 132144 121354 151449 199898 257533 311594 325372 334274 304465 254903
13793 254903 201399 170515 161354 150381 114847 89995 88415 66609 62968 52601 31888 19519
13781 19519 22084 49062 60032 40073 53463 65134 83418 71671 58663 48576 91736 64028
13769 64028 77416 99052 98144 44069 -11611 792 37300 69732 55301 1500 -11954 230
13757 230 26988 46003 59361 64816 70018 83773 85014 59573 26573 37991 43143 35351 27400
13744 27400 40410 -156 -4234 28629 45853 45916 45061 45317 38943 49434 35515 32199 64261 80921
13730 80921 52667 63577 70846 37242 306 -2296 4315 -9518 18798 37174 51738 98074
13718 98074 120920 83925 53387 51132 43073 51755 55908 49314 74911 56771 48742 76353 80097
13705 80097 70143 64417 70986 74472 49005 58782 52432 49544 26784 38389 35351 49406 60026
13692 60026 63552 76236 101171 98421 63135 27159 19783 13681 23763 48379 60017 49697
13680 49697 64994 67614 61192 69081 73387 58086 47885 48713 66048 83307 86195 73801 40570
13667 40570 35276 22413 22167 13667 24473 44592 72487 71170 73757 87615 100953 92917 60890
13654 60890 60495 102869 98041 103137 116253 109469 96420 99702 102854 126842 112371 100322 100337 92477
13640 92477 75489 36622 30660 44202 67706 83956 111569 101671 87163 77518 82452 57804
13628 57804 58489 70369 81098 81860 91879 93341 88386 96186 97538 151782 141585 116435 132522
13615 132522 152244 149569 148736 150603 159176 145813 133089 128365 115147 119579 95155 60256 58135
13602 58135 60666 70689 108102 128698 103608 70128 76700 97704 112722 135937 115363 79066
13590 79066 63065 46530 45544 54659 85263 108846 129783 130921 80041 61383 57217 79452 103462
13577 103462 105810 110333 48967 26741 59691 86255 72833 56913 42360 26873 18586 45949
13565 45949 36883 40974 50501 72813 95255 78405 78139 96686 102265 105599 92582 83221 71625
13552 71625 75227 83252 84414 102926 102067 149598 161854 126871 120165 144972 128473 114740 163845
13539 163845 170291 174984 169729 188722 164278 127117 124669 118806 101111 84457 107198 139963
13527 139963 176072 172739 174563 172437 153949 142890 123741 141757 134263 146066 139493 140041 157948
13514 157948 137028 165262 207976 240301 268718 244111 253654 239126 199238 186061 168021 150705
13502 150705 129023 136200 142918 155648 173988 181516 177154 198060 215480 216975 216472 202249 203517
13489 203517 199379 156550 126358 132570 151104 165261 205182 211573 213944 188073 191853 183258 153344
13476 153344 144947 187199 191860 191367 191349 177747 200859 220068 222995 210284 225188 235585 237202
13463 237202 217098 205158 190922 195562 221170 245739 229422 217424 229304 284554 303632 352672
13451 352672 353836 368151 377853 395345 396533 372322 380718 377518 392683 377381 396233 410063
13439 410063 388649 406700 426787 430938 409198 428432 425457 435022 482708 516974 502607 495863
13427 495863 521656 577179 609115 617913 655428 653897 670419 721473 758517 811168 860505 895468
13415 895468 957064 1059403 1135462 1174807 1244179 1331277 1454096 1581217 1756177 1972301
13405 1972301 2225617 2509827 2900948 3343943 3908150 4590806 5345995 6174562 7127732
13396 7127732 8208238 9469654 10989012 12943661 15597698 19246151 24341206 31120085
13388 31120085 39145515 47307485 53702452 55355726 49935597 39656027 29511457 22108399
13380 22108399 17393711 14547637 12929422 12148550 12041193 12580553 13701218 15217058
13372 15217058 16878288 18237520 18744842 18496374 18491260 19481672 21624434 25010967 29853187
13363 29853187 36242159 43956742 52489687 60485786 65871662 68928472 71107272 70926555
13355 70926555 66293895 58444254 51080989 46217219 43219181 39565259 33144471 25741318
13347 25741318 20125725 16746361 15040754 14499314 14793079 15642369 16756742 17733710 17850438
13338 17850438 16973833 16071137 15880014 16465103 17911738 20300958 23991885 29381143 36588196
13329 36588196 45155373 53717334 60078198 60862026 53588287 41165781 29348171 20817525
13321 20817525 15210807 11536924 9042933 7291965 6028541 5068964 4369927 3837427
13313 3837427 3400464 3012187 2690604 2388353 2107873 1867937 1690236 1546037 1426078
13304 1426078 1323482 1209996 1111868 1024084 966699 897706 778966 725021 691392 694445 684161
13293 684161 654405 635161 615916 596077 556894 529276 494163 458792 466495 461551 418376 364120
13281 364120 357842 353110 367059 357819 332164 341950 315977 302960 265110 229435 206998 207002 198074
13268 198074 220052 247474 240329 240663 237442 224053 226587 213429 215159 239836 238348 220938 223198
13255 223198 205168 223621 239610 235228 239942 201022 199555 203775 178757 175325 186043 219816
13243 219816 208935 211325 219029 194997 181405 179470 156998 138738 136521 137248 130470 114450 109581
13230 109581 95858 99520 96492 72843 54282 73141 68909 77281 108593 109468 114903 106513 116560
13217 116560 104114 106729 122753 128142 144794 152387 159536 147911 141114 150911 153177 150463 171390
13204 171390 173439 144297 118186 125314 133513 147104 150785 112899 89623 59563 65844 65641 51878
13191 51878 54879 85849 75302 92935 141906 150558 113841 73474 59938 50690 59500 77904
13179 77904 94403 103952 81729 58779 30732 41129 61742 64344 58774 66841 97592 86806
13167 86806 54490 42482 40300 36567 53831 77771 87597 72018 67917 56898 65816 68686 62878
13154 62878 34197 16603 22467 36822 48243 71097 86682 98041 79287 63569 49766 64543
13142 64543 69225 67036 78166 79914 91118 60577 46991 24900 37413 48755 44311 54408
13130 54408 89323 110367 121866 106080 84566 69565 70689 66099 37881 43582 81346 72828
13118 72828 65057 74704 61005 37990 26396 2503 14927 21932 51259 59828 49454 48334 55235
13105 55235 52882 58555 76781 74759 64114 2740 -14505 3503 -18715 -7470 6931 -11274
13093 -11274 -18244 10447 15194 20539 59816 79715 34804 6772 -6222 -16380 148 2086
13081 2086 -26816 -1680 17322 -4483 2701 3119 23904 27333 30744 65876 89529 64419 32139
13068 32139 2343 18336 49561 43094 40295 33356 23526 35457 32758 43989 76139 77574 76703
13055 76703 89362 78386 70554 65072 41234 42951 41578 11945 4884 27492 26709 26420 -7566
13042 -7566 -40941 -57483 -15911 -11888 -22567 -4846 -409 11987 13114 29070 40274 55896
13030 55896 53974 42873 34022 14788 5785 28985 35291 35869 33818 59731 60891 34332 18462
13017 18462 46541 65950 41923 11112 22084 53173 69014 62671 20833 -13363 -31275 1946
13005 1946 13317 30640 32297 26821 27238 25418 2736 -29013 -16135 11358 39 -11774 -33506
12992 -33506 -663 26679 26359 12939 24952 34368 21917 24376 66753 81789 44489 6702
12980 6702 -25352 -21228 -7617 27667 35302 30842 33597 15938 -17394 -13482 -32895 -47031 -32253
12967 -32253 -7738 -18094 -8453 12609 6591 8949 6552 2407 30098 14371 9258 22714 20533
12954 20533 20019 17170 30598 53628 48562 11740 39019 62152 48582 69517 59024 38835
12942 38835 60323 46131 28403 39532 43480 23059 -648 8759 1197 -10351 20706 24054
12930 24054 31820 28636 24438 43268 48608 62565 63467 73432 86032 88607 74978 73893 73771 85793
12916 85793 124177 128000 152366 172065 195327 256496 294985 332509 347430 326193 267242 234337
12904 234337 196844 159974 108191 91206 93630 101034 90705 98399 78826 73298 99873 112412
12892 112412 111763 120607 116561 121678 147325 181937 232415 300099 340489 335052 358267 377360 359298
12879 359298 355139 327724 268342 245851 253350 248230 216336 195728 171239 147285 136801 120174
12867 120174 109960 120221 106624 93076 94713 111517 152047 164540 171770 156986 167648 187133
12855 187133 207592 217146 243320 296431 346588 385950 375983 348403 318369 254548 185145 123405
12843 123405 79768 67095 53005 56908 86886 103456 111950 102636 93173 104774 93172 60702
12831 60702 62379 62235 71731 63070 56336 47657 44374 27315 41587 65648 84888 112960 123347
12818 123347 88315 85565 94101 131699 172353 198518 184573 193818 206816 230804 256160 286446
12806 286446 297586 336440 359450 357415 307146 233134 145413 121351 136935 148865 143100 139378
12794 139378 144622 131445 135081 156340 186741 181740 166182 154468 151768 154158 161740 190979 254352
12781 254352 292562 314903 299123 294281 328310 341959 372488 400970 374133 327507 295301 270455
12769 270455 247218 230033 221796 182888 159418 168122 182680 175231 161471 135558 109009 89155
12757 89155 73435 82441 111561 139221 162228 192307 224661 247726 228378 252954 270016 306516
12745 306516 277237 226379 189328 141507 121107 116982 103988 101596 122327 98597 97961 76139
12733 76139 54454 43477 38962 24791 45030 87550 75729 46692 14727 19491 44644 44989
12721 44989 76772 91409 97625 76952 55773 48656 74516 100558 88866 72031 26939 -25309
12709 -25309 -26756 19109 19758 16720 34129 51489 69421 74900 46398 43227 51257 67722 67042
12696 67042 41245 42000 68851 84252 98077 57711 40520 43581 43499 60047 60323 47433 31211
12683 31211 29203 61150 78413 85642 70065 38106 61566 60669 46573 47441 49293 60925 55283
12670 55283 24148 3183 1768 37093 50029 35952 26015 2355 34584 42606 27781 25966
12658 25966 1556 1562 36762 63233 58668 57750 53938 67934 48349 52857 72865 48122 34587
12645 34587 32716 18323 31094 44485 50752 50226 37128 59689 49691 46882 57045 57591 76092
12632 76092 123660 113955 106462 98915 104797 94196 68574 51664 56650 69993 73168 74079 93274
12619 93274 121061 133821 117430 70659 91413 101021 98944 115756 104858 118486 104044 75775
12607 75775 29575 42146 50860 56067 73839 85920 116313 114445 101331 85125 81833 91345 100456
12594 100456 79881 64659 92453 109808 111455 117561 106412 88893 103048 134678 124666 116803
12582 116803 108422 104889 127516 147285 125322 101497 97612 103127 102569 121758 122443 137696 153739
12569 153739 164850 151835 130513 117297 110045 87976 76906 80544 100235 123068 113258 129750
12557 129750 141543 140116 162915 153579 135214 147268 120497 122731 127435 122569 96118 122994
12545 122994 129557 119143 125023 126151 119813 157538 175375 205743 230077 271041 275291 305258
12533 305258 349134 423631 472938 521082 591712 677486 788165 956990 1236851 1679836 2275775
12522 2275775 2826099 3346712 3468679 2474226 1477129 936281 648991 502226 412524 375402
12512 375402 328753 289033 285097 265190 217569 201050 201308 202476 201732 174012 181046 165877 144570
12499 144570 184775 217506 202274 216193 217635 229672 224108 189198 209396 250282 290274 329100
12487 329100 334881 323357 283151 224596 192914 156029 139698 125137 145777 181024 208282 201276
12475 201276 224983 234536 225004 248300 255995 236752 217849 224847 234773 234455 223877 237526 226304
12462 226304 221583 236644 234893 253254 267481 247800 204965 201435 211997 224839 229177 232418
12450 232418 225819 253778 242335 235239 254030 250672 252908 273804 271741 310044 272289 228806
12438 228806 222693 245001 236764 238340 257192 267283 292427 277143 299246 340208 350977 361291
12426 361291 349801 316263 314927 313678 328054 339663 369776 381213 377384 392213 416607 430172
12414 430172 430181 442004 428063 403976 409516 461164 508456 565998 593068 579575 572444 599908 644868
12401 644868 664948 662949 686201 734822 804268 859094 906396 983110 1062999 1136586 1228299 1298915
12389 1298915 1400272 1487707 1607900 1786903 1971557 2173363 2439562 2739441 3097521 3573324
12379 3573324 4172165 4887051 5730454 6757184 7920111 9260394 10817692 12681601 15005724
12370 15005724 18056841 22151743 27696005 34679790 42639501 50332932 55847613 57078833
12362 57078833 53103815 45131391 35781022 27548276 21511792 17631175 15358334 14277053
12354 14277053 14055758 14482884 15390696 16538261 17548609 18133137 18275419 18355839 18973760
12345 18973760 20495208 23160535 26979842 31853404 37415847 43112526 48212135 52405985
12337 52405985 56103158 59947310 64110184 67464414 68458685 66173548 61093867 54476435
12329 54476435 47237073 39719858 32347968 25832942 20880973 17659794 15926753 15267220
12321 15267220 15319462 15697562 15989814 15907826 15428068 14775946 14370854 14517374 15247331 16658514
12311 16658514 18927540 22283019 26861916 32681397 39262815 45474067 49579978 49788660
12303 49788660 45501546 37857803 29122822 21445277 15754372 11845684 9193327 7352989
12295 7352989 6055716 5072194 4299184 3683807 3158113 2737238 2430620 2190613 1965071
12286 1965071 1765322 1618311 1490017 1342875 1219284 1127409 1051145 971686 881205 798606
12276 798606 769052 758208 723990 665600 611143 614433 635943 602345 572464 528798 491839 515134
12264 515134 530439 493052 474490 463733 472819 473696 468004 462327 457435 422033 399620 355032 352988
12251 352988 390812 412829 416147 457713 486024 525989 564009 602587 657874 745731 881241
12240 881241 1087565 1338633 1661421 1963925 2131756 2041354 1716306 1319185 968856 735614
12230 735614 551468 414641 372959 356311 335690 320885 322773 282139 267792 248613 230318
12219 230318 229993 266014 246917 246282 218065 181766 176608 174460 184997 174539 190613 180057 175550
12206 175550 180565 169738 139977 139518 129692 116420 101687 127661 112503 129629 125160 126356 131512
12193 131512 130764 120237 106789 114153 109812 114106 107006 79483 98449 112152 99782 114089 135467
12180 135467 159991 151039 126815 121202 129172 113068 103108 104429 112863 116192 96349 96030 91929
12167 91929 92828 98823 111717 108888 92626 103604 102277 108906 98053 76450 40628 41152 50273
12154 50273 33626 33708 47107 66935 54067 34216 56348 61031 48808 69216 77363 83102 66613
12141 66613 84825 126422 127336 107557 96178 110973 121120 102659 76193 65783 81641 89338
12129 89338 66401 12979 26211 40939 40450 104066 139498 133124 84289 63484 90351 104956
12117 104956 120389 126914 129506 120954 87073 100543 139787 167256 159575 137084 119546 106075
12105 106075 111454 117928 96311 42787 33145 70484 71596 64027 79823 90533 93668 92873 74974
12092 74974 66377 69396 72446 90649 80086 81424 103422 85794 74716 78494 73949 76779 106765
12079 106765 95845 69085 89598 64354 65080 59985 69990 96234 117285 152652 166227 154235
12067 154235 144411 123061 111765 147386 150990 157454 188005 208443 222237 202113 227061 248100
12055 248100 243758 240427 261194 237338 212834 212113 197170 173285 172002 143399 161911 154441 113531
12042 113531 104526 86828 91883 89002 104690 131375 108478 110535 132960 148840 126107 114901
12030 114901 106831 137592 135862 103864 67924 50866 42722 41091 37399 29489 20203 35877 49424
12017 49424 61953 70003 43225 40543 57170 93459 54298 19920 24994 49184 50418 52142 41934
12004 41934 28199 36010 55781 81544 84939 55041 14180 34138 64020 43962 6795 11769
11992 11769 37215 28566 24609 -5596 -28168 -10943 49861 127209 160377 149170 147468 124140
11980 124140 80731 59746 73941 107866 120250 104369 92546 102761 112973 126524 163953
11969 163953 200535 225718 253429 253060 260025 258987 287307 260651 211242 206367 220676 215373 192721
11956 192721 229113 258827 257669 251349 244572 224105 221054 201660 149577 113537 147697 179683
11944 179683 196029 238287 258865 281357 312991 308610 296806 322343 347908 357619 374281 383671
11932 383671 369715 351648 314778 301947 292085 309816 330430 335949 352862 390009 403182 384942
11920 384942 367950 352703 379273 385449 407031 463717 489197 430873 373036 351970 316640 295465
11908 295465 285899 261607 255385 238650 249018 258655 283210 281323 293128 297324 311122 343946
11896 343946 370669 423255 476709 527067 594029 644525 640984 664064 717787 716182 724089 756188
11884 756188 747100 711182 688733 652799 610892 555760 534034 572428 548398 515064 523196 521763
11872 521763 523325 552690 578123 582905 588610 602768 612672 651722 696507 730763 752788 813266
11860 813266 867037 921597 965335 1018125 1050520 1027480 1006971 1023311 1029596 1027739 1052139 1087346
11848 1087346 1111136 1130936 1163230 1203199 1253358 1315795 1327021 1350196 1430034 1505525 1588051
11837 1588051 1674547 1756384 1841514 1966552 2138752 2349705 2566336 2806697 3107415 3396530
11827 3396530 3702580 4019546 4360169 4768451 5273636 5874625 6594336 7494571 8636624
11818 8636624 10107806 12004416 14458092 17576100 21502647 26276907 31859095 38196166
11810 38196166 45223216 52797439 61335381 72010720 86952088 109174476 142174537
11803 142174537 188346398 245995609 307236272 356727916 373017834 339102088 264464497
11796 264464497 183590994 121213978 81682717 58211280 43887614 34698682 28455700
11789 28455700 23853446 20118419 16904084 14181314 11958862 10191240 8831841 7767942
11781 7767942 6886063 6165158 5540347 4984399 4481415 4029567 3673255 3349013 3059160
11772 3059160 2824092 2621147 2468869 2355739 2278262 2196914 2126698 2035607 1947033 1856273
11762 1856273 1737915 1588367 1450463 1367752 1279102 1190431 1075622 997524 972748 928204
11752 928204 852575 792362 752872 720061 663808 646292 631164 616353 593022 580506 533233
11741 533233 489344 483632 480024 503383 517248 540239 510346 471574 438899 404855 392124 379633
11729 379633 359793 365120 351643 345149 367767 372749 317983 289839 285265 258126 256480 268662
11717 268662 288258 238286 205920 197091 200385 211695 248338 230838 206417 179663 163459 182283
11705 182283 177838 165418 187760 213655 213265 225164 226695 223215 194802 218972 252800 242415
11693 242415 237993 227441 229031 221882 237030 250412 243575 227902 199800 188737 186065 211752
11681 211752 201191 164430 138586 141954 127806 117929 109537 107995 138919 175040 159814 138412
11669 138412 131809 124953 113318 104438 97586 79615 79244 97484 81155 46623 24995 56224 84450
11656 84450 115531 111689 96245 115719 134393 133214 89874 41437 -20153 -76950 -113511 -117075
11644 -117075 -123885 -108103 -56773 -28884 -19800 -15426 -39628 -24401 14674 179 -22011 12946
11632 12946 64402 68294 91262 75842 48015 40243 34653 -9925 -32964 -14814 8851 12965
11620 12965 36738 30967 16623 4166 -9768 -2478 -3901 28653 66294 115332 134711 104756
11608 104756 119028 105660 112675 129715 114823 95804 73198 63060 66196 56024 56453 84290
11596 84290 102914 88992 71886 65640 58766 54413 79652 92116 68681 45059 39353 32400 22381
11583 22381 33055 54214 48110 30064 50837 70511 79786 61572 60825 53636 26565 15053 4917
11570 4917 -6316 -10933 -13818 -43184 -46220 -21335 -1907 39453 50303 28029 16261 344
11558 344 -26989 -41657 -24445 -27996 -32497 -12135 -7201 17162 24283 46173 49794 59107 56347
11545 56347 62955 38906 16612 -1660 -32779 -30428 -9594 1007 11379 -3415 -29965 -24493
11533 -24493 -5761 9703 22322 33577 31421 31093 34734 41788 63828 65998 55451 66467 57802
11520 57802 38290 28338 16161 16324 33804 43116 50886 68979 65435 59131 59833 61551 58581 79433
11506 79433 70856 74936 102528 112558 81273 58641 27583 11465 16511 24144 -7840 -7223 959
11493 959 -17507 -1672 41124 34639 11615 2818 15454 44599 42096 44831 51562 22946 -22269
11480 -22269 -24709 -20054 -17750 -43611 -48608 -25627 8430 -10153 -36084 -14598 -5252 -26434 -34521
11467 -34521 -6938 -36394 -35056 23703 33010 11160 -16176 3028 -1764 5401 -3397 -12441 -3821
11454 -3821 -3871 -6753 -35285 -58879 -65190 -73238 -81592 -51515 -11119 5419 5389 -9398 -20493 5434
11440 5434 1818 -21718 -22878 -17249 8784 8897 8809 23101 22717 42334 42669 -8234 -54641 -67081
11426 -67081 -57834 -33311 -12952 2811 10859 17838 1410 -10275 -1585 25079 40783 30968 16340
11413 16340 11508 53191 38256 17680 -15019 -27548 -22907 -7128 -6379 -6302 -17989 -24204 -12458
11400 -12458 -43906 -49179 -38312 -32121 -21388 -12247 2100 8841 -12141 4510 -744 -13406 -16023
11387 -16023 -16830 936 25965 37146 7767 -5799 -6223 5746 5193 13028 13981 3533 -26289
11374 -26289 -6176 15064 32125 43572 61663 135353 189610 202122 217387 259260 306011 366354
11362 366354 414093 542626 748871 1020522 1352395 1637042 1822354 1784710 1493644 1108895
11352 1108895 748028 474735 316104 251892 216935 189998 161457 122303 88586 90546 80735
11341 80735 46049 16295 21081 29615 22935 6024 7069 -21578 2642 -5404 36803 53050 46531
11328 46531 44129 36318 40685 23237 13340 7552 157 19068 28068 34298 17789 -16047 -14810
11315 -14810 -11219 -7982 4825 6633 -11804 -51790 -63005 -59524 -43224 -19984 6187 7551 22562
11302 22562 13153 -21326 -4922 -2881 -36841 -50099 -50537 -61910 -52343 -31659 -31045 -28707 -39415
11289 -39415 -56872 -35444 -39696 -38654 -27983 -13282 -18045 -41629 -67340 -63962 -44935 -6529
11277 -6529 -531 -1027 -19876 -73939 -87913 -51634 -17999 -18000 21242 44549 17939 771 -18526
11264 -18526 -27656 -14501 -18369 -16574 11386 45929 57149 57961 52280 4905 -15625 -1244 -28524
11251 -28524 -42928 -58864 -59254 -49630 -16875 -10296 -28993 -26310 -25278 -28946 -22660 -18139 22542
11238 22542 60398 29918 14090 26708 21480 487 -24453 -19586 -17702 -26175 -17021 14110 -2888
11225 -2888 -5883 -7851 -386 4078 -15075 -22869 -30745 -48472 -60137 -37535 -19314 -16641 -4242
11212 -4242 18792 -13204 -11883 -9827 -28266 -14725 -28110 -29965 7759 9106 -12267 -15234 11970
11199 11970 5702 -3287 -31688 -40050 -47907 -55795 -39730 -5431 -8363 -19242 -53454 -53358 -11124
11186 -11124 -206 -2908 -3039 -10595 -11520 -371 10090 4299 11204 26851 35068 21409 15227 -20805
11172 -20805 -23446 -2000 507 -12119 2470 7192 -40949 -45124 -39784 -57089 -73123 -28643 -12010
11159 -12010 -6637 -22845 1075 30288 17167 -34466 -25161 -9261 -19371 -37403 -45236 -47202
11147 -47202 -25810 8427 -34569 -58831 -34661 -25902 -49006 -68109 -73746 -38869 -34610 -51064
11135 -51064 -58235 -57335 -54250 -68127 -71634 -65186 -47098 -37858 -61735 -28112 -2930 -36921 -49324
11122 -49324 -41484 -35992 -9431 -15222 -25327 -48787 -36814 -29368 -1642 30252 4237 -32544
11110 -32544 -9360 18690 7738 -12820 -30513 -41723 -19532 -15511 -22043 -35640 -45802 -52455
11098 -52455 -34532 -29225 6870 16822 -25233 -41315 -23009 -1203 -4026 -23305 -2581 24739
11086 24739 16656 -1555 -19323 -23540 -21081 -5020 -18115 -12611 -6205 -1496 -8937 -24649 -6598
11073 -6598 13194 -5708 -1052 -1205 -29642 -39704 -52693 -27614 -10871 -23896 -14482 -25951 -29474
11060 -29474 -11507 -26991 -58749 -34571 -6665 -4327 -7583 17299 -19743 -43586 -43210 -38629 -31497
11047 -31497 -12941 -3321 -19749 3281 11280 10247 -8069 -28702 -38639 -23963 -852 6602 -1987
11034 -1987 -18614 9815 12276 1467 -8366 -35324 -21617 -17293 -36665 -21453 11298 6360 3003
11021 3003 -29437 -10908 20752 29057 35613 16928 1072 3003 -7919 -1226 37823 39076 41050
11008 41050 -3747 -36334 -42545 -46092 -47590 -24696 21390 21739 -6308 -6030 33345 56412 29807
10995 29807 8022 -358 -25167 -50058 -35718 -20860 -20221 -18575 -26097 -39301 -32651 -18719 2529
10982 2529 -22684 -34263 -48644 -59386 -47162 -23276 -30908 -33678 -57417 -43121 -28394 -9417
10970 -9417 -9221 -14336 16351 10566 -13245 -15276 2355 -918 -29805 -48031 -49903 -15597 -2685
10957 -2685 -33300 -35055 -20453 -12237 28668 26462 5785 -6336 -18792 -7656 -6880 -8629 -15821
10944 -15821 -27713 -22599 -34096 -6981 21106 3687 -18683 -16642 23519 43248 3875 2558
10932 2558 -8524 -23378 -20759 -4438 -7287 5027 -3764 -42445 -43803 -37657 -33541 -18695 2685
10919 2685 -13940 -36929 -83742 -83644 -57934 -42958 -4376 1631 -9197 7047 16359 21474 9265
10906 9265 1678 -15682 -40829 -55182 -44564 -37466 -16962 -9170 5553 11524 -15841 -11914 -6798
10893 -6798 -20306 -21725 8726 19229 10581 8862 18163 37464 353 -12368 7755 10280 41562
10880 41562 53029 40765 32587 12221 -43903 -51195 -28276 -15346 -23843 -32959 -9069 -10766 -26328
10867 -26328 -10578 8063 14816 18174 33854 46268 42013 38669 31513 5645 2527 -7217 -18195
10854 -18195 -21158 -17653 -31041 -31440 -36570 -37252 -85751 -100809 -65475 -30170 -5906 -16171 -41206
10841 -41206 -18850 -10659 -12743 -13430 -30542 -54545 -49890 -52206 -48527 -38361 -40036 -18620 -8300
10828 -8300 -8344 -40995 -39837 -32302 -28148 -28478 -54589 -61815 -61910 -31313 -31610 -61186 -65865 -36714 -27342
10813 -27342 -20008 -604 -1001 -13678 -14818 -22881 -15400 -1163 10976 10834 7985 14066 20551 23618
10799 23618 -18015 -22830 -20770 -24162 -50844 -66943 -57797 -33976 -30359 -39710 -10565 9417 6014
10786 6014 -1156 -7169 14073 5906 -2954 -16339 -32899 -19248 -991 22616 27426 9196 -23180
10773 -23180 -27740 -29976 6693 26580 3140 -29199 -42264 -42463 -34655 -49911 -76577 -46470 6728
10760 6728 28960 3656 -21088 -48794 -48996 -51127 -36153 -11192 23563 40164 24413 -10180
10748 -10180 -35980 -22581 20425 34885 4203 -2554 -32623 -45843 -48143 -46151 -33995 -27876
10736 -27876 -19151 14468 1096 -22057 -24173 -33362 -14991 13430 30072 42405 4765 -1024
10724 -1024 -27280 -47991 -50713 -35177 -32028 -43779 -58746 -17771 -9664 8457 -6883 -16524 -23067
10711 -23067 -37260 -45064 -43457 -22291 22797 -10444 -33358 -58219 -63114 -20202 -19221 -22816 -2553
10698 -2553 -10494 -35907 -64906 -70587 -64889 -75297 -45875 -2690 3928 -7933 -15037 -1453 231
10685 231 1426 -8114 -11577 -2653 10980 14124 2037 -27757 -52967 -37089 -15843 -1271 -7386
10672 -7386 -261 -4735 -19602 -17138 -26551 -18308 -6837 6084 -26181 -22761 -18798 -11800 -21540 -61372
10658 -61372 -57303 -33705 973 20283 -17919 -25594 -779 9507 5075 17803 44511 47183
10646 47183 34362 -5765 -30975 -50985 -25161 -1398 6749 17686 14777 -1962 3394 27474
10634 27474 17012 -25620 -47089 -56280 -41322 -34808 -23393 -10703 -13053 -17065 6124 -9097
10622 -9097 952 14034 -20352 -29774 -21484 -26801 -16512 1198 -4649 5205 -9351 -13282 -41130
10609 -41130 -60847 -37590 -1488 1315 3382 8543 5694 -8366 -9461 -5154 12233 -14257 -21320
10596 -21320 -16315 4857 -2910 -29714 -45379 -60124 -64323 -59886 -73910 -65758 -45846 -37094 -14346
10583 -14346 22502 19138 10764 10847 11079 14008 9427 -16969 -36478 -28179 -13254 -8269 6333 -15396
10569 -15396 -15791 11048 24831 13086 -38054 -31995 -20689 -8173 -3795 12063 10843 -20642 -37001
10556 -37001 -39698 -60614 -65412 -48292 -18992 -6946 32242 36123 -10317 -24340 -25163 -1023 -21291
10543 -21291 -5160 6936 877 -20073 -36643 -28699 -43443 -23787 19673 3593 -36912 -38628
10531 -38628 -50815 -40066 -46482 -57482 -72386 -66683 -47446 -21717 16912 30340 19774 11831
10519 11831 5957 17533 16733 -16172 -33556 -11730 -30943 -58408 -51162 -12586 -1436 -22629
10507 -22629 -11675 29406 22755 -24099 -39810 -17850 18077 19688 6900 15383 24669 36163
10495 36163 14801 13281 21173 30414 20156 -3939 -18924 -19020 -12053 -22752 -37302 -27169 -34261
10482 -34261 -35929 -18253 8916 17110 23382 16070 12104 29370 52954 38666 9245 18950 54523
10469 54523 71505 71549 69716 52378 25083 1754 -23600 -21977 -18544 4902 14540 14161 20577 29761
10455 29761 42686 26250 5917 -17426 -23642 3723 14599 15561 31913 52986 44785 42141 40859
10442 40859 19370 -20631 -55507 -61127 -47925 -29385 -39531 -56755 -78061 -61306 -35732 -41338
10430 -41338 -42047 -25445 1895 -13520 -17727 18814 12928 21113 45515 46104 21856 -2144 5707
10417 5707 -966 -4243 -2160 1485 1925 10925 16369 -4724 -30744 -61507 -50793 -30159 -11158
10404 -11158 -8004 -4590 -13322 -32877 -37802 -54149 -46643 -41076 -10019 1373 -20540 -14548 -8266
10391 -8266 -1872 -30864 -34805 2974 34606 46251 49626 19748 -20596 -13278 -30772 -21328 -21334 -31472
10377 -31472 -17934 21269 13385 22712 -12920 -40085 -29689 12273 27887 11781 26441 27993
10365 27993 39039 30680 -14550 -28757 2019 26069 37638 37945 39994 29828 32792 59841 75720
10352 75720 75753 64480 50539 36240 17475 25795 24538 30294 40662 17875 -9939 10143 8111
10339 8111 -2138 33887 56995 23012 2577 -15560 -24292 16302 49622 56051 77514 62962
10327 62962 42755 54677 6152 -42678 -43863 -39847 -12597 -7904 2384 10798 -11881 -27587
10315 -27587 -52562 -62662 -25473 20018 46228 46220 29750 51635 50881 12956 6183 14630 15513 39986
10301 39986 14446 -10646 -16137 3131 23194 28081 9173 4091 10772 17816 9480 -6842 -41933
10288 -41933 -85699 -94897 -54177 -26304 -11109 -12933 -17576 -10599 8317 -2675 -8467 -8368 2884
10275 2884 5516 21638 20665 34204 66540 49195 11022 20907 27070 28608 17581 34091 40887
10262 40887 26711 24524 -10416 -12328 -8411 -10554 35521 44853 41222 19919 4662 5645 2005
10249 2005 27518 65597 57864 59849 80547 78818 62241 65035 50367 39268 21470 16375 6824
10236 6824 -1533 5362 17049 22314 9089 29785 71879 68173 42089 47721 66288 39138 37592
10223 37592 24362 22215 -751 -19801 811 31003 60928 53607 41552 15560 17769 29157
10211 29157 15267 -10314 -4363 17086 11885 -3744 14937 5148 4170 15666 10284 11124 -8282
10198 -8282 -21103 -10900 -11497 -2934 -5828 -28277 -73594 -89605 -91101 -77876 -50959 -24786 -26802
10185 -26802 -36371 -10706 22032 6693 -19358 -15499 -12157 -2083 -5470 -17144 -41804 -41775 -20429
10172 -20429 -32230 -31078 -12342 -2924 -124 -11443 4134 -9370 -757 -10968 -12104 -5018 -18078
10159 -18078 -17295 -7574 -24754 -22281 -20420 -24432 -15066 9750 41568 50420 23750 18883 -5518
10146 -5518 -15938 -18645 12092 27505 22967 17995 55164 96260 72149 60314 57087 32939 13947
10133 13947 9852 480 2606 907 9509 11134 8192 12072 26734 38688 33279 25798 45362 59286
10119 59286 46714 28366 15618 4816 1031 15072 25393 16497 1551 -13450 6698 21650
10107 21650 29912 29707 11347 31870 32420 5245 8384 22917 29297 36345 41274 27304 18472 32240
10093 32240 23194 23973 32357 35742 37905 47138 62085 70495 49097 50970 79094 96960 119700
10080 119700 112646 79770 84036 65745 81173 91375 82247 81972 140454 122971 121307 199813 251861
10067 251861 303103 360437 409234 443986 527476 625924 711698 875381 1028742 1166329 1348273
10056 1348273 1572070 1931514 2499975 3372286 4722437 6515870 8322933 10070278 10798748
10047 10798748 7875015 4448197 2622037 1700024 1225569 949598 745797 581155 496229
10038 496229 408716 347337 277262 202871 184644 220490 228535 250949 229769 240887 224214 176326
10026 176326 160137 139570 90598 51592 66054 113421 104957 86257 70828 72492 71829 35910
10014 35910 29602 37515 13393 47348 81488 54185 12945 15025 -5368 -38145 -59931 -38328
10002 -38328 368 28307 37669 5596 9342 14076 19638 11021 23406 38741 53399 41897 50365
9989 50365 25249 -4277 17930 69811 56564 21406 25827 24180 17176 -5726 -23595 -17110 20997
9976 20997 34217 25478 42182 39659 16764 2678 -6586 -4920 -2817 2641 2027 -10244 -47693
9963 -47693 -42344 -35443 -14483 -7996 -6594 -953 19551 14803 22925 39327 42457 41320 40863 40918 78884
9948 78884 108136 110214 86353 108322 144870 151639 129165 128305 185568 221089 262869 303860 254451
9935 254451 180337 151810 136300 105661 76259 70573 77906 55325 26212 747 -7925 9778
9923 9778 -2869 -11445 8642 6312 8432 -14208 -13408 -13348 -6031 22117 28510 28648 63881 86547
9909 86547 81637 70685 80548 71102 34003 26600 43211 36037 44771 74174 58282 50555 32014
9896 32014 40577 55384 33933 50776 49151 44434 34613 14816 -22335 -47704 -21131 -5972 10017
9883 10017 -7293 -10277 20268 46342 37066 13145 -26324 -44516 -12463 9599 11401 6868 -1953
9870 -1953 -6079 -11472 8271 17256 13773 13474 18253 22841 23198 6564 15945 12045 3483 16138 30308
9855 30308 42215 60826 48153 39453 35872 29437 57630 73965 43102 54964 87098 87270 78588
9842 78588 62949 48632 25818 849 3969 18478 9653 20146 53972 49156 43358 64552 77806
9829 77806 82060 57268 87192 81686 86805 95468 73179 80038 83948 66831 40353 41206 73210
9816 73210 80623 95915 118143 113494 119624 123924 118663 104477 93952 79437 93166 133069 111839
9803 111839 74878 67389 70176 76075 66197 75342 51679 28644 69068 104590 104913 92325 93067
9790 93067 88247 75997 58322 72607 85978 53768 39150 35814 23170 29792 29855 44944 64970
9777 64970 60914 57895 42586 78990 105024 96852 62075 55214 68147 91184 66538 43258 42934
9764 42934 20565 11517 15585 26026 48440 63974 83368 89775 51526 62668 93273 113027
9752 113027 100882 83880 58257 84635 99453 86438 91607 103905 109306 116930 106013 85989
9740 85989 81433 41586 51939 59405 66823 93389 101963 88193 99775 80728 83420 104955 92529
9727 92529 70742 75957 107708 116757 126836 127141 98862 79094 75158 99308 121213 126886 143356
9714 143356 142900 160172 151021 137280 106155 87939 77337 50910 38071 54006 64224 82455
9702 82455 98674 89868 102847 148743 155586 124768 92272 109987 115406 122265 133991 136501 160922
9689 160922 171707 154750 173990 152092 148182 151352 150597 184183 170754 167939 152076 162072 177322
9676 177322 175741 157460 157073 142485 144449 162525 151189 116802 128079 155035 183592 182525 155320
9663 155320 144315 149734 147986 162706 146812 141690 144659 136619 169173 181138 182067 150131 152614
9650 152614 191038 210097 207000 204759 217659 213165 237086 258362 228414 211376 193417 205930
9638 205930 208244 216029 220364 236129 215037 169386 188706 210805 212456 207299 180858 185529 172101
9625 172101 187646 201431 195202 235455 250830 223933 224280 227187 214819 198995 215550 239596
9613 239596 236551 218533 205824 239238 263502 267077 260580 257353 250084 216947 221838 255724 279727
9600 279727 275945 262101 256048 248999 277154 291415 318022 316528 343850 363378 366624 353242 316312
9587 316312 283012 259717 249938 256225 267495 282784 284623 314425 323027 323191 310763 321956 342573
9574 342573 333038 343186 321733 314966 305732 302828 326042 337404 336041 333095 327661 362661 344424
9561 344424 335285 351379 364122 391364 389082 387951 382558 387067 357436 360813 380847 403435 410814
9548 410814 388592 379116 365381 345233 350500 342653 323967 343995 332349 334062 328724 323713 349276
9535 349276 373394 394175 422711 423946 433019 438512 447310 451159 434379 435852 440130 412494 440699
9522 440699 472125 454373 446497 449120 448037 464226 442131 433397 461644 469042 478854 486772 463634
9509 463634 465009 474798 470095 463585 500148 503049 470337 432329 446195 451748 443366 416324 397225
9496 397225 384458 437912 484805 508505 511834 502592 515097 527118 528281 524915 498550 466125
9484 466125 470059 458686 459860 470888 449977 465111 494314 490042 489559 474681 433128 452674 481844
9471 481844 494962 506955 523044 502206 470350 466606 483388 463681 418503 422725 410928 401041
9459 401041 396154 428196 447993 458036 456853 485304 478466 475405 452924 452310 452179 420568 400995
9446 400995 403568 401411 409666 432150 409661 433320 441761 421614 415593 445141 427931 416636 411052
9433 411052 382073 371257 389149 395589 381817 357344 388699 403904 404085 435185 447247 404717
9421 404717 375160 363347 388777 398726 405005 411088 389375 397876 404678 386737 385298 377342 381702
9408 381702 395677 378450 355476 355164 368041 378769 365826 353722 329987 337435 313240 324309
9396 324309 327401 329604 318679 351292 343597 331090 322332 336562 314633 337638 338614 332958 326129
9383 326129 305305 299785 297074 308490 305507 282280 284151 300229 299599 308113 316573 320960 324153 297926
9369 297926 285836 266935 270661 259938 245755 246291 253215 257999 253277 242772 250740 278941 270389
9356 270389 242993 231454 243873 241614 235018 229919 191154 170166 203063 239097 246699 223092
9344 223092 183056 185668 204302 200291 200003 212692 225967 234538 229090 222300 237017 218624 220385
9331 220385 225134 244588 235366 195904 182945 171860 160505 170636 180408 130325 125137 132860 142856
9318 142856 158435 179622 179772 169790 179214 189596 181300 160187 173883 177181 201728 199628 165326
9305 165326 165352 159938 141149 143477 138447 133154 136810 172570 194327 182490 168649 160560 130692
9292 130692 125480 125782 114478 112612 109519 119947 153783 163749 168001 172843 169480 176153 182465 192314
9278 192314 193089 153044 90178 67650 110165 116071 125541 92641 80881 91540 86804 92536 130907
9265 130907 136256 112180 106685 112682 100278 64017 59850 78931 89324 104237 100911 95946 121150
9252 121150 120701 93712 96354 85502 98062 115204 133469 141853 128054 122443 132179 120755 104591
9239 104591 84573 111220 147879 141795 155158 176253 157709 154707 125174 81094 42363 61733
9227 61733 71961 89600 96823 65919 67901 58813 29674 27084 24806 28976 63506 80603 103199
9214 103199 120452 109452 105338 115193 110557 85550 68389 53821 55719 55632 90226 108592 90936
9201 90936 45794 58746 80922 99020 70115 69696 88747 97121 89965 110799 140684 137979 107277
9188 107277 83131 77202 77350 90893 118563 105920 102830 78005 56493 75500 109628 74062
9176 74062 49351 49469 48323 59306 83765 71400 49783 35670 30653 19629 46122 80822 88515
9163 88515 87930 104931 121576 109449 72540 54018 22854 49308 87605 78291 56693 73127
9151 73127 117015 98082 80418 71347 79739 71716 55650 59111 40576 35161 34064 28263 49962
9138 49962 68935 74085 57282 48795 59305 87189 80222 55185 22107 26455 2129 -28433 -15124
9125 -15124 -12248 7 31499 21419 2459 26252 54951 50304 57660 77959 69579 55047 36671
9112 36671 28436 25901 33485 69162 49365 37866 22537 -10548 -13636 20174 42637 38479 38856
9099 38856 2581 -19695 -7311 -9722 -2678 19957 34137 57798 54576 28172 35580 35267 -4313
9086 -4313 10067 24261 21868 73387 87616 74515 60538 40111 49213 71704 72424 72435 43215
9073 43215 4907 -27116 5786 14347 18077 19358 40290 63025 38565 18794 -1767 -3003 -8828
9060 -8828 -2263 26098 42709 64733 76369 87967 144196 130457 86349 76521 55239 60651 42548
9047 42548 33658 54620 50881 46493 37726 47627 45748 23392 -13630 -8623 -4275 -14803 -905
9034 -905 25466 30614 4898 -2269 14200 18440 10751 -203 9110 18629 18136 19950 18259 15200
9020 15200 30972 38772 21428 16988 9789 37384 22151 -25473 -30483 -14911 42340 52772 16052
9007 16052 11895 8541 11967 19915 8533 10272 14297 37670 53652 62689 52957 35325 24512
8994 24512 15780 35484 11001 5527 3321 -16384 6045 20519 24404 34106 44269 38805 9821
8981 9821 38851 46953 31502 29286 28248 30169 28371 15914 2025 10773 31258 64902 74101
8968 74101 68008 56839 63244 55709 47335 33193 25725 26464 34490 29075 42911 40417 47935 76549
8954 76549 65875 16236 10301 11045 14989 14719 46991 51779 36259 -3645 -12442 1849 27336
8941 27336 42117 24935 24060 26544 17251 29678 48553 23860 19781 31253 26351 14293 18320
8928 18320 30471 6421 -3134 19188 19738 19942 28726 36241 14185 -10130 -20766 -2315 35548
8915 35548 42041 45034 64641 68013 47671 26295 12881 -256 10425 32053 34926 23704 43291
8902 43291 42331 35724 41290 46933 32416 32366 63456 58425 56719 54620 44186 45998 36675 45337 37003
8887 37003 41332 33898 29818 79341 97199 55319 23967 778 3778 8829 6666 29883 31519
8874 31519 17474 12268 -8087 -1732 15101 -1323 5010 -25472 -36985 -18865 -19074 -36244 -9879
8861 -9879 37940 50600 4487 -5031 -2291 37556 51855 35718 -5829 -4959 5150 15905 33103
8848 33103 20283 30147 35739 25305 37321 62309 57834 31989 33268 44711 45311 53898 32377
8835 32377 10234 34362 26101 14454 10272 -3789 -32469 -40851 -23485 14653 24848 18132 13042
8822 13042 969 -1633 28606 -2849 -24708 6350 11649 -9262 -18971 -15307 8036 4772 -35088
8809 -35088 -26669 15747 24339 18901 15566 7182 -69 -28996 -25336 -23214 -16492 21472 39514 28832
8795 28832 30985 38633 8347 9293 5575 9164 8646 32482 55499 87759 58774 48544 44798 25151
8781 25151 7363 14621 11663 26126 35447 59087 37268 6583 23832 25757 24239 13045 -3149
8768 -3149 -44250 -31778 30830 52207 65879 56376 47350 22794 6001 6985 35651 62026 38366
8755 38366 4107 -14414 -38019 -12649 18010 20153 16700 -47315 -60881 -61788 -24506 5868 33600
8742 33600 30772 13771 4849 6248 24852 26284 22348 15140 17260 30471 53049 57801 29249
8729 29249 28790 37074 47455 70054 47860 17813 -5386 13706 17674 653 30698 56735 42956
8716 42956 49141 52748 32144 18837 16053 25469 54472 73721 58112 36732 68267 66887 80591
8703 80591 59669 22209 27599 29236 24586 9651 29270 12988 17963 28757 32376 30796 65085
8690 65085 89141 84479 72061 69571 78715 86993 86012 118607 126603 127352 128330 109863 135710 151781
8676 151781 167214 180195 201174 253408 282264 324063 368500 406701 386917 313749 241940 196693
8664 196693 164266 152583 107297 139491 152474 160691 177175 141862 107918 85481 80832 83716
8652 83716 75445 63045 70629 61764 40320 56357 50489 51778 38451 25815 30068 51621 48327
8639 48327 52149 53167 27408 40355 82584 80769 66444 45178 39355 38816 57926 52462 46134
8626 46134 54756 47685 20959 31879 35655 28219 47297 63683 80714 65022 68516 49849 19077
8613 19077 23165 42489 56975 72043 89515 96567 132580 144024 119501 115923 135376 143121 143230
8600 143230 192130 235380 218594 190991 173191 205608 237297 258494 261372 281868 278361 260997
8588 260997 253058 240780 231031 193253 157296 131991 101828 81702 117379 118235 93469 76521
8576 76521 68762 69804 58024 53774 17988 13968 34739 65692 36410 -424 -14900 684 22215
8563 22215 23727 53859 57766 67010 81765 81845 70381 64686 52602 45029 49723 51170 68367 82897
8549 82897 68138 34086 15661 -14514 -17661 5651 47347 75779 72479 46278 79610 91885
8537 91885 88369 84012 52064 17701 11261 15053 27833 15935 39179 57126 59828 47797 50171
8524 50171 57101 99765 82863 52988 24777 34927 49939 56716 41049 10546 6946 -5599
8512 -5599 -2653 30517 32541 27405 28354 23896 7783 9847 14470 33599 38591 21073 25399 12757
8498 12757 21653 10280 -11666 -14055 -9604 1146 1330 -39899 -73539 -50002 -12632 -10369 -9236
8485 -9236 -7258 29748 55982 51543 55326 32346 18664 17322 -3484 -11068 -19001 -4964 -14807
8472 -14807 -6888 -1935 -3276 -13278 -1263 6919 5131 -3764 -1541 2397 2995 -12067 -24597 -36481
8458 -36481 -16498 31188 43218 57877 48569 60669 34051 35763 47180 21609 15709 12624 29343
8445 29343 13885 -3414 7631 14914 14433 5019 -15642 -28513 -19413 -18229 -7052 2623 4451
8432 4451 2681 6636 6521 121 22083 24011 29182 48398 27723 7510 26557 36325 38609 41688
8418 41688 20362 11938 13317 -8948 -6298 -12113 -26851 -18393 3351 17060 -32094 -43919 -31632
8405 -31632 -34279 -28154 -31403 -6859 -18356 -884 48536 45699 3386 -28111 -489 -4626 -15608
8392 -15608 27759 71481 83898 48956 -17150 -25411 -4152 -7514 9656 5809 -5902 24833
8380 24833 26158 -20032 -22692 -16028 -4205 -1431 -1828 9800 9159 1594 -5699 7500 -5368 -20600
8366 -20600 -44709 -37899 -30821 -15054 -22764 -24670 -1004 44697 45682 3172 -11363 -6806 4914
8353 4914 1156 -19264 -26246 -16196 13645 47749 43751 24774 45951 57755 34716 37217 37957
8340 37957 30910 27364 12415 -17665 -39133 -31895 -65367 -52918 -37734 -31334 -28006 -47060 -65349
8327 -65349 -66911 -35861 -33754 -44539 -33967 -43688 -15659 12752 31419 15474 2773 -2301 -30935
8314 -30935 -15090 3571 4303 -24609 -51280 -51984 -27650 3169 20834 24890 20797 14196 21878
8301 21878 13074 3144 -3070 -8220 -2598 3735 11713 -10514 -24066 11694 35816 42372 40789 56475
8287 56475 58385 51324 16052 -31199 -21434 7058 36560 31120 36735 32177 26286 30835 39262 20248
8273 20248 -9291 -19308 -9332 237 -722 18768 26181 -23400 -37728 -23566 -26174 -42216 -39355
8260 -39355 -15105 29316 41272 15507 1534 17054 10650 -2029 25360 31203 6260 11678
8248 11678 47807 23376 -7218 -12694 -45437 -25965 21839 21662 20676 18864 25806 -6327 -35911
8235 -35911 -43943 -36848 -39697 -29904 -13040 -2569 -34401 -52586 -41377 -45680 -37758 3118 8754
8222 8754 -6139 -52683 -68872 -49352 -23592 -18992 -30603 -21041 -10370 9516 6794 -9381 3473
8209 3473 -6448 -2477 19973 35845 -2683 -15257 -16762 -25103 -19526 -8737 1272 25767 25702 -6854
8195 -6854 16645 25731 3156 564 23959 21084 -11284 -29563 -21910 -24976 -26935 -22645 9585
8182 9585 -8237 -19605 -57343 -54102 -49051 -28530 -5173 -18216 -39442 -39134 -8801 19154 -3017
8169 -3017 -5774 4028 9795 35137 59259 43341 20810 3503 -24413 -29434 -11892 -18897 -40070
8156 -40070 -31884 -2930 14889 8206 28113 16689 18005 33237 42594 66559 69365 43709 34904
8143 34904 30677 35129 33466 63140 25972 2382 -18052 -14102 -9885 16128 52331 54813 27695
8130 27695 43452 26089 46105 63347 66813 48566 22970 -1609 12335 13356 -5705 866
8118 866 1653 4917 12774 6611 -16621 -15963 -290 14693 22973 5257 -3360 20143 -8026 -23426
8104 -23426 -6288 -11753 -46626 -41346 -32944 -60555 -47617 -8090 -6325 -25399 -28615 -31258 -130
8091 -130 -23809 -24870 -29468 -41701 -21005 -8375 73 -6811 -17957 -25622 -14626 -17691 -6699
8078 -6699 -26566 -18555 -26784 -22380 -5096 -6004 -18780 -21875 -9522 15552 -592 -16747 4940
8065 4940 -21194 -32621 -11027 -6176 -11542 -4049 14208 50495 49070 12559 -26345 -15279 1045
8052 1045 2547 1146 6316 22295 56420 105360 82612 65094 71288 75195 61682 62977 49074
8039 49074 44794 63858 67004 46865 29009 25481 31661 34509 61297 78613 69462 46016 51293
8026 51293 53414 49090 66082 53315 44793 40217 14684 21860 41896 50631 56523 48728 46261 29936
8012 29936 21034 10430 -1893 31135 43983 52561 30128 6204 -25951 -21576 18165 35523
8000 35523 18014 -6045 -29070 -12056 30766 38711 24978 16553 53019 71592 55310 51792
7988 51792 30058 15511 -1934 -848 12885 34949 44893 65291 71656 51820 35962 41139 34308
7975 34308 22467 7664 -2801 18077 38109 11259 2016 9492 -7131 -7412 -12855 -19235 -8884
7962 -8884 -11850 -11850 4131 -4334 -18099 -27834 -43174 -34559 -112 3176 9645 -14546 -45553 -8787
7948 -8787 28776 6186 -1949 12056 7116 -11073 -9890 18203 26204 20456 554 -21016 -3857
7935 -3857 10996 18931 29396 22126 9405 5447 -2869 -3955 -15798 -25328 -5598 -25546 5994
7922 5994 12731 7441 -19528 -41917 -11673 -19236 -18670 -664 -2389 -22450 -48224 -58534 -52645
7909 -52645 -36948 -16489 -8370 -14476 -12056 -9346 -10043 -10643 7219 33846 57368 40311 11561
7896 11561 -674 24352 58372 50895 16400 1301 14229 36042 42918 -525 -17013 -13869
7884 -13869 5290 21922 10958 20117 44311 -9580 -42260 -7034 2820 22906 29745 6390
7872 6390 -30010 -54179 -67959 -27294 4557 6256 6629 -34375 -18072 -8044 -15909 911 -19788
7859 -19788 -17781 -10438 -9592 -20690 -20003 13014 12390 38294 46205 61110 45679 50521 64022 55279
7845 55279 15665 -20288 10772 2422 18351 24107 32006 30682 -6686 -4457 11391 13249 -10254
7832 -10254 3672 9488 -20822 -5757 49545 33684 18861 16058 -8114 13141 -22092 -34672
7820 -34672 -10125 14534 -18918 -8838 4820 20850 26484 -6778 -22445 -18757 -5535 9272
7808 9272 20129 7755 -13616 -21824 -20051 -28106 -5023 43591 43814 14821 -665 -5112 -24081
7795 -24081 552 3527 -31203 -66119 -57514 -76124 -58171 -24981 -26826 -14750 -6926 -8629 -1723
7782 -1723 10342 10713 14411 768 -4202 -5443 -5090 -6913 1682 30408 39985 33053 39584 19059
7768 19059 -7922 -32839 -28818 -30212 -38697 -25064 -20972 -34883 -43741 -48493 -19145 5381 8701
7755 8701 -11093 -36770 -35229 -29123 -13999 -10484 8583 15805 -23095 -14222 -10999 -23285 -38937
7742 -38937 -25703 -14726 -28901 -52925 -53383 -38516 -4217 32174 31349 15924 772 -19172 -16781
7729 -16781 -26683 -18143 -18480 -11967 -4144 -13687 -35004 -41573 -31547 -44561 -13393 -589 469 -20571
7715 -20571 -43472 -36834 -51339 -51539 -21359 -20200 -34484 -54276 -67942 -80713 -64705 -40737 -35085
7702 -35085 -35578 -44913 -25890 -12927 -15785 -7836 -3422 720 -10629 -10119 227 -21865 -52684 -62167
7688 -62167 -47608 -52461 -29660 -17696 -3608 -24483 -3011 -7222 18936 36189 24825 29017
7676 29017 32543 -4777 -22404 -27824 -16121 10879 9847 3756 9097 -24100 -59737 -47594 3106
7663 3106 53992 60404 52410 20530 8338 15078 42623 34243 35595 22611 28373 32008 59065
7650 59065 36496 21665 25303 28874 42390 78647 82951 49771 38452 28512 20906 10993 12333
7637 12333 35139 28236 3317 -11345 -23139 -7869 -10088 -11511 -16433 2101 20364 20478 -13519
7624 -13519 -24445 -8516 -4778 1739 -6148 4201 7184 -27604 -43525 -47689 -9506 -30053 -40623
7611 -40623 -21472 -13589 -6784 -19297 -19632 18873 16154 26083 -10328 -37798 -27267 -4831 1977
7598 1977 -36296 -32091 -45961 -55296 -45516 -33983 -25323 -19073 -1009 18114 24410 46511 39714
7585 39714 12945 9859 -25788 -19067 -20314 -9028 -14724 -17859 -10559 -5798 1902 8178 -19756 -39226
7571 -39226 -67303 -80120 -58052 -23648 12622 3378 -16578 -14314 -12868 -17223 -14268 6955 3031
7558 3031 24590 54006 39724 13344 -134 -34910 -42784 -31347 -2403 22201 24396 28096 4879
7545 4879 -369 -11821 -57216 -61248 -36679 1924 7730 -60 9487 856 4610 -8943 -18643 -35906
7531 -35906 -33373 -8053 -16244 -39788 -63675 -87358 -63821 -46566 -26890 -20437 -4333 -22604
7519 -22604 -60851 -67493 -29790 -22458 -23989 -3646 -10600 -29809 -37587 1134 41152 27737 -2230
7506 -2230 -9221 13581 14007 12277 24504 15889 5922 7167 25855 35098 37216 14318 -6083 -5740
7492 -5740 8619 31013 17564 5684 6879 -7663 -1964 9078 -3701 -14512 -25488 -17012 18691
7479 18691 19748 -1179 -1886 11510 1783 -1362 -4869 -2562 1928 21010 39417 55127 52954 19151
7465 19151 17298 62897 86662 78730 25828 25313 47276 38509 46188 39622 8960 -33558 -56701
7452 -56701 -52969 -27233 -20318 -24314 9593 -4231 -25157 -24527 -35190 -23975 21303 -8730 -8697
7439 -8697 9628 4534 17631 -126 -21299 -27259 -5381 11825 -16242 11004 46951 63680
7427 63680 28264 15283 45652 20819 3051 -4626 -34133 -20626 9449 4364 -10053 9888
7415 9888 19512 38231 31058 3988 -4340 18933 22903 16901 19405 18977 18936 -6447 -2035 328 -10978
7400 -10978 -31448 -44076 -31824 -46549 -53826 -21671 -2189 -21303 -30123 -18952 15307 29380
7388 29380 -2373 -29873 -3618 19671 -7055 -27767 -15146 -1020 -5729 5848 -1087 16896
7376 16896 32816 33071 14767 -11426 -25787 -20842 -38702 -41507 -8941 -709 -7049 -26595 -30006
7363 -30006 -31085 -46520 -63311 -47233 -23451 -26810 -19920 -18392 1335 -3380 8475 6838 -15069
7350 -15069 1637 -18031 -27685 -22045 -30608 -41217 -27699 3130 23447 47519 34575 9073
7338 9073 -1107 -15264 -55442 -73696 -66125 -35727 -12897 -26673 -9446 -1296 11747 44407
7326 44407 40579 21399 13738 2202 -22378 -38022 -31487 -16366 -23743 -9103 -23753 -8703 30412
7313 30412 36815 17745 9652 10704 -15032 -26157 -1242 -16300 -25212 -41023 -66157 -49442 -18640
7300 -18640 5996 39991 46812 39966 7274 -24101 -35050 -26706 -22225 -22259 -441 -10642 -2518
7287 -2518 30359 29028 -11318 -29394 -307 15281 1865 -18654 -19539 -12786 -19252 -4985 -37
7274 -37 -21079 -5391 15594 -3482 -9679 411 3323 628 -9085 -3161 939 12895 8305 15258
7260 15258 24073 33382 29188 8781 11734 38951 10879 -16741 -29765 -32827 -32589 -20564 -12817
7247 -12817 -28832 -27487 -28651 -22814 -43634 -50170 -51438 -47315 -30655 -33317 -21998 -37050 -52739
7234 -52739 -37677 -46759 -28179 -34183 -50360 -29708 7500 9361 -1934 -25463 -83952 -107412
7222 -107412 -76386 -56334 -38413 -16932 -7945 22889 23724 4062 14187 30040 58969 29982
7210 29982 -2730 17788 23151 -13432 -43601 -53891 -37653 -787 981 -29384 -49847 -24629
7198 -24629 -17944 -32401 -7535 21000 13280 -7627 1509 8174 -6282 -48389 -32424 -13052 -3929
7185 -3929 -2515 -293 -42596 -52053 -46983 -19876 18580 17016 7513 -6616 -6336 -1364 -27203 -39116
7171 -39116 -25348 -7407 -4811 7956 9795 8859 7934 7398 20936 16416 12152 30201 53438 31616
7157 31616 -13834 -36924 341 11422 -1104 -17535 -22882 -32400 -19711 4945 16557 969
7145 969 19099 11779 -18163 -41157 -42916 -20517 20844 23359 33869 8662 -9044 -1614 -41746
7132 -41746 -62267 -50742 -43605 -68275 -96412 -111629 -101035 -50066 -12644 23008 29105 1215
7120 1215 -29736 -49522 -67971 -60926 -34327 -49177 -44882 -45405 -48047 -28673 604 35259 35913
7107 35913 24174 26561 11013 -13160 -18698 -17346 -3164 21141 -5814 -45876 -25552 3262
7095 3262 -29744 -63158 -49192 9605 4520 -19978 -3377 21750 31073 42927 11005 -8693
7083 -8693 225 -5161 -18205 -21188 15134 32348 56306 53478 35700 10723 -14574 -22356 -7920
7070 -7920 -30144 -29583 -32578 -39999 -37160 -29799 -21590 -10923 -15627 8469 2047 5758 12285 5813
7056 5813 -6193 -30910 -27322 -1145 12693 -3334 20559 40261 16779 -7756 -9462 -10252 -18891
7043 -18891 -13813 -1661 -20718 -34207 -61157 -68654 -30588 -11457 -20038 -47803 -39321 -31700 -25083
7030 -25083 -29924 -34783 567 10821 -1017 -24528 -6631 -18522 -56407 -76743 -53312 -39757
7018 -39757 -25690 5234 20684 -4963 -43405 -55842 -35987 -46834 -41478 -33711 -55302 -62178
7006 -62178 -50412 -37261 -1058 7567 -5026 4639 11788 581 -4036 6880 15126 23996 30812
6993 30812 -9257 -19330 -3437 6173 -3505 194 9214 -26055 -23413 -2946 19915 30309 39693
6980 39693 25381 4981 -13683 -24756 -8275 -1939 4169 21926 18074 -8247 -13126 20478 66755
6967 66755 55168 17056 616 20770 17571 22980 28660 10049 17925 26443 7768 -6348 -10975
6954 -10975 -15535 -13025 9705 -17792 -48505 -36666 -41038 -47973 -12678 1011 6787 1277 -3415
6941 -3415 -15242 -23189 1721 -7191 -18670 9371 12084 -3073 9256 23055 -1369 -29933 -44968
6928 -44968 -46867 -17456 -5319 -15689 -24559 -29047 -7127 -16963 -13191 -2448 -9988 7088 10947
6915 10947 -11722 -26587 -24913 -49802 -18650 -4684 4070 26310 27757 20130 8714 4408 4822
6902 4822 -4414 -21326 -29696 -14709 -6804 -36736 -49950 -58596 -47860 -38127 -20422 -24018 -42833
6889 -42833 -17457 -5530 4753 -6071 -11229 -18907 -14832 10609 8861 -4191 -14642 -15241 15550
6876 15550 35945 21466 -13624 -2681 -190 -3390 -16109 -12421 3111 -5449 -19569 -36106 -26198
6863 -26198 -24307 -22252 -46561 -47462 -38142 -55155 -56707 -35433 -39615 -58453 -68074 -66083 -65309 -74802
6849 -74802 -61370 -43383 -61255 -60670 -29741 -36544 -35170 -26201 -33620 -41623 -44977 -27856 -13000
6836 -13000 -21050 -29243 -25903 -22995 -18216 -8631 -14381 -48037 -39633 -12227 9569 -799 -15255
6823 -15255 -27813 -39226 -19741 13408 24787 29062 35164 13382 3992 -11379 9243 -10662
6811 -10662 -17576 -2287 12686 7142 -10408 -13543 -21348 -20831 -16583 -14512 -20572 -25343 18743 21087
6797 21087 36363 44141 26599 3970 20641 39219 32707 -4494 -18796 -9726 -21293 -43142
6785 -43142 -25894 -31261 -22392 -17529 3464 12455 30262 45080 27325 29801 44668 60797 44597
6772 44597 8334 705 11131 -22627 -29152 -25172 -25086 -9694 -10908 1586 -7232 -15562 3178 14252
6758 14252 32542 27223 10982 7099 11812 11389 13967 19039 13472 32205 47663 65941 86807
6745 86807 77962 31017 -10730 9167 30431 -876 -10163 -3387 -13299 -20057 -15368 -12717 -31598
6732 -31598 -7752 22368 43457 20848 22950 36391 55880 64160 62594 51735 84769 163498
6720 163498 270187 305852 368085 435810 513000 584983 540180 378119 245500 145446 114268
6709 114268 65680 48548 40450 24600 10810 -7268 -29388 -30498 -24654 -44090 -46241 -7292
6697 -7292 -8007 -4349 8483 13754 14777 -15722 2453 34004 31350 3683 -16744 -29142 -8023
6684 -8023 -1752 8771 -8503 -8122 -4344 4583 -15984 -27601 -42120 -67983 -87220 -43190 -8450
6671 -8450 -11704 -3563 -16638 -25768 -46931 -47037 -23596 -22706 -19944 -7714 12767 16903 1830 -25123
6657 -25123 -4214 -6564 -6541 -1374 -35053 -33404 -7431 3921 -4985 -23824 -29126 -26121 -28253 -19378
6643 -19378 -9868 -12763 -29658 -25006 -32494 -52068 -33246 -10714 -3855 -4831 -34409 -37273 -45440 -33204
6629 -33204 -9520 -13695 -13295 -3498 1851 7553 -30980 -28943 -17236 4550 51220 64853 47229
6616 47229 43036 6816 -14590 5620 -2356 -3130 25157 17424 -9816 -9561 -2658 2500 29060 46455
6602 46455 41398 40119 44118 -594 -27596 -38662 -52970 -45763 -28348 -34885 -39164 -32026 -7692
6589 -7692 -6750 11963 19663 14317 -5123 2983 27842 22327 -14180 -38995 -32659 -2019 13142
6576 13142 22984 11249 3057 -8807 1166 -16328 -32378 -16557 8990 -2883 -10131 -22266 -30357
6563 -30357 -41806 -18074 -15437 -16087 -13135 -5910 -27658 -34814 -29022 -10637 -4586 -9555 -19651 -21054
6549 -21054 -21106 -40827 -28293 -12392 -13494 -49197 -49852 -17593 -27533 -31519 -25190 -33434 -58025 -55334
6535 -55334 -64519 -43510 -40326 -58007 -59608 -53896 -62917 -49568 -33206 -221 18701 24384 26899
6522 26899 19832 7590 -37767 -39185 -29435 -29786 -29828 -21407 -13316 -4014 -18740 -13395 3690 12339
6508 12339 69 -30190 -28754 -7190 -26383 -30171 -617 1463 4799 -7192 -19457 -20839 -21910
6495 -21910 372 8595 2605 4423 15193 13171 -9837 -24674 -22272 -6741 -10583 -19771 -3015
6482 -3015 -3252 4716 22828 28489 16818 -30334 -47343 -58648 -39745 -10041 -357 -8475 -17686
6469 -17686 -52483 -68235 -44421 -31158 -42767 -26396 14000 32510 -6449 -29973 -38050 -27888
6457 -27888 -7324 -4349 3684 -4294 -3327 11191 13806 -18445 -15648 -31350 -39797 -57609 -74877
6444 -74877 -17544 -15224 -24589 -29579 -31023 -34907 -49148 -43455 -47101 -37235 -21958 -39433 -38986 -6227
6430 -6227 30165 24384 3853 -6281 -9216 -5586 -23411 -10422 4445 29612 10609 -24455 -13325
6417 -13325 -942 -9698 -6969 11960 9906 35136 54954 8973 -24665 8729 -78 3994 1716
6404 1716 -1828 -8426 3481 23667 38774 38714 59726 53738 13742 -14738 -32012 -36120 -42516 -32256
6390 -32256 -30019 -15215 1287 -1311 18152 16596 16738 11130 3391 29959 26319 15980 12930 -14844
6376 -14844 -12069 -31564 -53748 -49771 -42523 -38612 -50086 -24331 -338 -23932 -25860 -89 -24391
6363 -24391 -63270 -36400 -41040 -31007 -23128 -16202 -26924 1907 -5584 -18658 -29548 -22227 -16325
6350 -16325 -22054 -2404 6029 -2673 -11764 -11159 9774 13065 16492 3601 -2547 6771 6657 -4289
6336 -4289 -25575 -39745 -18711 12799 29654 14909 -11240 -13738 -20308 -32823 -35679 -5532 38235
6323 38235 29191 5556 -12276 -40520 -44706 -15297 -27084 -25526 -12331 -6290 -18402 -10136 -16671
6310 -16671 -35280 -43907 -17211 -30287 -31550 -15269 -26205 -42340 -72100 -51202 -23585 6205
6298 6205 10414 18082 -9952 -4270 23276 33941 49173 37058 27033 1373 -14280 4228 19283
6285 19283 9137 -10393 -11953 20994 50245 31243 10362 -30248 -32903 -19369 -9892 -10023 -2829
6272 -2829 11208 20012 33051 28902 22405 10360 12509 12980 12831 -1387 -12978 21886 43534 15369
6258 15369 11759 33673 48767 29222 12520 -6803 -4993 -17356 8251 20070 40733 46020
6246 46020 47721 38481 19200 -7891 -3277 -951 -11322 -51171 -69758 -54656 -56143 -39065 -5272
6233 -5272 2946 -3736 -9611 -16819 -7938 16731 55185 44303 23157 -1545 -23558 -14951 18286
6220 18286 13778 -2394 -36572 -50435 -27294 -28364 -55360 -62602 -59405 -46617 -51816 -44381 -70668
6207 -70668 -61357 -53112 -41746 -20045 -3198 9664 -817 -4344 -8890 -17142 -21136 -25953 -25974 -28965
6193 -28965 -17724 -14403 -21852 -9355 19752 23823 13954 15959 -1029 -22640 -25294 -10855 3962
6180 3962 13393 12051 10562 21337 16811 12834 -12918 -28266 -41806 -37520 -36826 -21515 9426 -436
6166 -436 -39820 -63165 -54168 -71677 -73855 -46235 -16573 -18033 -17916 -21358 -21011 -7841 -17162 -9319
6152 -9319 29238 16787 29038 17194 8994 12512 4421 -10779 -21690 -31795 -26958 -5941 -816
6139 -816 5767 9161 -8711 -12226 -12826 -7905 6377 3531 -7255 -4932 -5313 452 8993 1694 -7931
6124 -7931 10742 14426 41477 62574 45960 -729 -15789 -6566 24080 32975 16228 -10058 -8941
6111 -8941 -20236 -17137 3006 -13229 -27958 -19981 -9418 -26869 -1164 24302 31910 14716 23931
6098 23931 39946 14439 -5830 -6888 -17876 -10329 -8094 -7623 -23164 -59108 -71617 -66750 -57858
6085 -57858 -49111 -21685 -51311 -88377 -83243 -59665 -70358 -45328 -1613 33189 42509 20895
6073 20895 -26326 -32900 -24862 -35133 -67833 -57751 -51039 -56607 -56748 -38381 -23584 -20443 -28528
6060 -28528 -20061 -17429 -28096 -20398 -16748 -5302 10533 25792 17257 29241 58281 66104 61371
6047 61371 55597 27677 20400 29513 35568 47369 39838 13435 -4570 -16779 8630 12236 17176
6034 17176 25436 22896 27320 6234 -23226 -38310 -27073 -2461 4227 -12768 3659 22549 26339
6021 26339 -11740 -55805 -58459 -25687 -12150 -7204 5461 -5870 14901 18168 -4860 -25419
6009 -25419 -39183 -24407 -20272 -28332 -9543 -19377 -34295 -36822 -55517 -42466 -548 21813 -11925
5996 -11925 -40031 -76022 -49896 -18487 -10228 15735 38057 8167 -17048 -30816 -6877 18205
5984 18205 -37261 -49942 -15438 525 -23227 -12725 -1462 41752 23518 16395 14638 19519
5972 19519 29992 57474 49434 8033 14037 10862 -5497 -14340 6720 -5088 4476 32030 26100
5959 26100 20216 -4890 -43555 -38545 -14836 -9504 -13468 -259 3972 -15850 -70821 -93339 -84934
5946 -84934 -66684 -69094 -28291 -18617 -38243 -28189 -29391 -58290 -69226 -62037 -77122 -48781 -11027
5933 -11027 -5357 1400 -1256 22103 26174 -3310 -6750 28510 47475 27172 2333 -9589 21954
5920 21954 21087 17593 11321 11401 -2478 -4257 6762 -17113 -26159 -26231 -23691 -17298 -595 817 5312
5905 5312 30640 46282 44343 20628 10942 -3364 -23182 -26476 -40250 -18183 2445 -6891 -31515
5892 -31515 -35783 684 15390 27757 29057 23530 16302 4908 -2567 -5350 12816 12370 -7158
5879 -7158 6254 -5443 -19733 -26236 18075 30233 22994 7504 -23583 -36485 -61696 -67951 -51028
5866 -51028 -31334 -4741 -20784 5364 36005 2896 -13857 2571 13192 32035 16946 -10055
5854 -10055 10235 1840 1678 -28572 -7133 -14443 -1784 -20831 -64114 -58060 -24907 -13909 -45816
5841 -45816 -32771 -4801 1624 18427 17797 5819 4076 -8544 2091 483 15844 11878 1870
5828 1870 -175 18947 -8073 -28193 -12785 -25627 7401 4068 -29023 -24147 -22793 -8357 25365
5815 25365 1230 -35546 -8705 2478 -6779 7877 -2215 -9029 -16198 -12948 -24890 -21379 -5934
5802 -5934 -1040 -4825 11880 13552 -13149 -22672 -13883 18277 50805 72024 23054 -22190 -24121
5789 -24121 -41113 -41401 -22161 -38335 -43430 -35905 -34094 -31454 -40449 -30240 -5987 -189 -5843 23979
5775 23979 -10042 -35910 -44866 -13713 7340 16801 42753 53133 49769 52583 40552 23832 6188
5762 6188 1317 15592 26152 -2102 -10175 23135 22330 -24255 -37620 -38778 -37708 -14660 -12141
5749 -12141 14837 37636 16605 -36693 -55452 -24372 -25585 -7215 38314 45854 27995 27012 20620
5736 20620 5083 -30560 -17845 9153 25032 35269 18752 4986 14960 15888 -5679 -20657
5724 -20657 -9551 -33381 -23876 12151 34037 79545 66789 36831 31201 9324 5869 -2907 -35005
5711 -35005 -43156 -53547 -40058 -19100 -2465 -26136 -54611 -45021 -200 14124 11937 15455 -2535
5698 -2535 -13221 -17984 -5912 -6244 2387 5636 5948 -1406 -25758 -22358 -19277 -24705 -6463 30029
5684 30029 22232 -18617 -26242 -16484 -12816 -16450 -30433 -38323 8962 26051 18436 -3119 -3363 27653
5670 27653 24950 24341 -10100 -22143 -23539 -5905 -11220 -2897 25603 32284 20778 17487 22727 6918
5656 6918 -8189 -30736 -23930 -6486 -6621 -21658 -27566 191 13212 33340 59205 30092 18943
5643 18943 23862 -16224 2573 9214 25819 11181 -4211 -16576 12244 19501 22242 32089 44620
5630 44620 38341 34901 12583 -30865 -32144 6459 20272 29357 74671 36820 -23962 -33189 -30280
5617 -30280 -25045 8781 10741 739 -5033 -21877 -27315 -29378 8622 8915 18457 10315 -9554 -12222
5603 -12222 -7062 -9494 -8731 -12090 2952 -209 -18795 14094 -5499 16500 54837 57760 34508
5590 34508 7053 -867 17442 25621 -4373 -11762 -35220 -24973 -6862 -2502 25038 40716 24889
5577 24889 22597 29042 15127 12037 5220 -21149 -32899 -53861 -94213 -72525 -72916 -74071 -54206
5564 -54206 -40025 -31101 -1698 -22 21007 46058 62040 62422 43796 10731 -22617 -27868 -17574
5551 -17574 -676 17356 38857 24537 10793 -12682 -628 -6598 8576 -25336 -59128 -46425
5539 -46425 -31162 -17707 -9108 -39363 -42702 2130 34145 41330 2464 -29575 -41059 11028
5527 11028 36842 29585 23695 14723 -3588 1037 25977 17779 31016 25780 32871 41567 4115
5514 4115 -4633 20814 28176 22245 31931 19590 6163 -16557 -28775 -35704 -23107 757 11794
5501 11794 2675 -25395 -19311 860 -20649 -32151 -25183 -39207 -21485 -4289 8648 13378 14659
5488 14659 -9469 7438 26079 25390 10955 -28810 -48475 -44460 -40685 -26758 -20980 -5528 -25079
5475 -25079 -51188 -57108 -49602 -5307 20844 -2411 -22314 -11387 -44973 -42942 -1861 52214
5463 52214 75913 37627 -3758 -26155 -2975 17154 15205 -17629 -5715 15997 33745 51105
5451 51105 59199 39338 15959 -6134 -30550 -37255 -35026 -15647 9856 35151 35785 3729 -6604
5438 -6604 44930 63916 62559 48235 24533 13123 16453 -4535 -17319 -11233 -19444 -2520 33515
5425 33515 17415 -1287 -1499 -21677 -31244 -42641 -48731 -17146 4229 -13541 -28627 15153 42109
5412 42109 17032 -5186 -413 -11723 1876 -1633 -16220 -7203 8291 -5840 -43444 -51478 -20785
5399 -20785 -16423 -35371 -6258 9365 -8746 -13449 4947 -1555 -21850 -12556 14535 13473 19724
5386 19724 25088 39857 2874 -45107 -15916 11773 37255 67465 62677 65498 46246 6608
5374 6608 -27058 -34675 -35473 -30382 -19501 -32152 -10525 -12824 5008 26724 23144 17273 26404 15021
5360 15021 4006 17654 31963 -10240 -37612 -23686 -20868 -7522 -35612 -65443 -61094 -47237
5348 -47237 -44963 -19862 -29276 -27240 -28418 -39957 -16323 24583 24600 36425 38382 22641 7716
5335 7716 22180 42698 58788 49784 9512 4310 -37 -16371 -14183 -37131 -45631 -26186 -152
5322 -152 -18632 -5862 14987 23131 9733 -2496 20881 18864 24173 28029 15513 29193 56023
5309 56023 70362 50692 30365 8705 14311 -7301 -11870 -20145 9491 24344 21479 25148 5489
5296 5489 -2814 1260 -15061 -7667 2131 656 -74 -142 12631 15801 -17414 -17238 12299 29861 -13716
5281 -13716 -39153 -38055 -26950 4551 3822 -6514 -1219 -13839 -6372 4509 -8782 -15888 -23552
5268 -23552 -34961 -54041 -51776 -23206 -6371 -2564 3217 6037 -20042 -12449 -22716 -21651 -664
5255 -664 107 -35779 -18580 -37127 -41945 -28175 -22444 -17952 -14437 9007 -7142 11166 32907
5242 32907 38377 5180 -24837 3042 -442 2964 -5475 -20187 -6396 5198 2400 -5495 -10311
5229 -10311 -8626 -27459 1481 -4604 -25500 -7972 7170 -11243 -11089 -19232 -31161 -3592 11951
5216 11951 -21520 -59431 -62036 -59151 -25724 10747 28590 30856 38638 35367 34397 44196 53940 69783
5202 69783 22733 6350 19670 7620 312 11782 -4496 12870 25958 27586 2735 -4403
5190 -4403 -728 -21559 -32267 -5020 14890 12794 9592 -19922 -1643 -1310 -21620 -10950 -15234
5177 -15234 -32004 -32578 -21903 -27612 -56261 -62037 -66331 -55816 -30680 -43428 -43220 -37865 -11120
5164 -11120 -6754 -16502 -5252 -10387 2691 7586 9381 -25873 -12271 22643 71512 68046 24726
5151 24726 3835 19839 10841 8443 10422 -5678 -6352 7935 17024 26136 20105 26931 15241 -12305
5137 -12305 -35154 -45200 -25652 -8187 18377 32578 4646 -28622 -18912 -29692 -42304 -19789
5125 -19789 -15410 -8641 6270 -5347 -25266 -18314 -30624 -41641 -42028 -34000 -48122 -35577 -1892
5112 -1892 4339 10484 -10884 -10238 -2049 5118 -8158 -18377 4067 36119 49208 46234 40358 27168
5098 27168 31799 7891 7968 10750 9098 -7751 -37093 -71313 -56808 -39468 -3504 2830 7035
5085 7035 477 4608 19655 16851 -23102 -35770 -28954 -5409 3809 11208 -28816 -46420 -43081
5072 -43081 -16961 15199 -3315 -9628 -14876 -19207 -15716 -18733 -9214 -16459 -20544 -24768 -25410 -26598
5058 -26598 -31969 -26357 -26367 -22523 1609 5971 -28626 -61380 -101949 -98078 -91185 -64023 -33170 -31210
5044 -31210 -16550 935 6586 -23810 -21531 -36314 -21794 -11974 -15629 5034 14902 7766 -26135
5031 -26135 -3663 483 -17027 -42515 -38469 -18496 -5813 -18448 -36661 -27586 -23492 -7065 -2716
5018 -2716 9545 9818 11954 -9643 -20938 -20735 -3642 -789 -35528 -19782 293 -6416 3320 -10335
5004 -10335 -24380 -18003 -3316 -19846 -32573 -31576 -17167 -14591 -931 -14909 -6213 -2954 8362
4991 8362 7969 -16017 -41957 -46544 -41172 -23935 -9333 21138 27955 5472 -16363 -16796 -20916 -14296
4977 -14296 -7754 -16670 -4198 3850 -11753 -32023 -14928 -3321 9162 5835 41524 31847 10465
4964 10465 -8775 -42439 -47137 -30653 -21515 -29953 -28128 -19040 -18427 -9852 -28556 -11732 807
4951 807 -1487 -10481 5134 -28442 -35825 -24260 -34765 -25574 -503 939 -40831 -25013 -20218
4938 -20218 -26522 -32395 -21631 -6555 6894 6726 -2855 -17759 -11096 12592 46285 56846 48767
4925 48767 36901 13568 28788 34482 12550 7979 2896 7891 22485 12709 -32602 -30406 -12720
4912 -12720 8481 5371 4152 22437 23282 4217 6955 9739 -4510 -15419 -25714 14147 39920
4899 39920 32670 -2358 27640 42605 14247 -12973 -10396 2277 9748 -25064 -21428 3479 5318
4886 5318 5583 2587 -3566 -1377 9006 -3189 -30709 -30510 3779 1434 -3257 -16698 2829 10932
4872 10932 -3023 -12504 -20526 -5961 13556 19760 45702 49471 33585 16344 22385 22414 17791 41052
4858 41052 24515 44908 25134 13741 32393 36421 35006 -1305 -22150 -33270 -32839 -46384 -49613
4845 -49613 -36017 -67044 -72827 -52711 -58431 -51097 -59276 -81708 -77818 -47893 -39987 -45872 -38183
4832 -38183 -33495 -1725 4450 -7279 -13903 -26654 -7652 -16642 -23724 5789 11255 19453 19703 22837
4818 22837 39143 51936 42639 29269 19286 21799 7104 -20136 -21718 -7478 -19939 -28129 -38737
4805 -38737 -25665 -30286 -44090 -26204 -30473 -48479 -47581 -52153 -65790 -80838 -70837 -30935 -4727
4792 -4727 -15255 -33693 -30238 -32084 -16028 -10604 1507 -14042 -27917 -4611 -2161 -10495 -17601
4779 -17601 -20900 -14370 -5510 -36093 -58703 -57192 -53029 -66474 -47362 -16079 12765 -21197 -30153
4766 -30153 -9547 -19062 -17461 -42430 -22911 -15966 -3265 941 25195 8097 -20540 -46621 -29245
4753 -29245 -2291 16546 -16399 -34247 -25254 -21228 4151 -4806 -4763 13331 28882 40341 45852
4740 45852 24360 -7959 -18638 -17546 -25174 -39200 -41313 -2500 51148 55726 50656 43138 35691
4727 35691 15001 28737 33943 30834 14978 -7967 16655 21827 -12052 -38449 -12840 -28546
4715 -28546 -4453 30625 25276 -1833 -17395 -5231 -7318 -24262 -40150 -26009 -28813 -22530 -2172
4702 -2172 27211 47973 21921 -15663 -32888 -9922 -2035 -10653 4908 23574 39652 60132
4690 60132 26427 23561 21396 -3948 -13517 13144 16501 -4377 -3513 -15187 2015 11410 -10499
4677 -10499 -14748 11710 35799 20293 24647 14308 23394 12264 12965 18483 17680 1601 -695 4647
4663 4647 36991 25092 16397 -5779 -18693 -30866 -34472 -32612 -18895 15597 13688 30012 29394
4650 29394 51887 24465 -5445 -24698 -29063 -9241 -15135 697 27068 10237 -35075 -14347
4638 -14347 19484 398 25387 29299 8325 15924 15261 -32121 -55985 -62978 -69408 -44271 -13760
4625 -13760 18966 40843 35611 13517 -1698 6918 23304 24847 12866 15961 37644 56076 24232
4612 24232 -1664 -9754 -37987 -43085 -8112 -15879 -18979 -14256 -11292 31968 46163 36424 18953
4599 18953 4878 -2600 -125 18428 1277 -16556 -17732 -26861 -4760 13466 13858 -23577 -48892
4586 -48892 -42276 -21346 -1001 27905 39186 17342 4665 -10602 -19163 -45307 -39537 7262
4574 7262 35832 41241 48578 29058 -3872 -17358 -7612 15208 6472 9039 39805 42914 47100
4561 47100 65482 47162 23901 -15422 -36395 -19959 24649 18667 6472 23981 25167 -7772
4549 -7772 -12559 -19198 -7748 -28950 -32908 -29300 -142 36604 62284 26663 -3542 26269 29307
4536 29307 33088 9482 10713 -9488 2974 23395 36117 42488 53601 30120 7314 -24487
4524 -24487 -18338 24237 56226 38253 40611 54257 33110 -12289 10523 52859 55521 36300
4512 36300 30247 -18081 -40368 -28314 -25101 -19751 -26687 -16255 -37161 -55878 -45285 -23780 26955
4499 26955 22456 26703 35503 39359 14800 -1286 6221 37475 58462 50821 24262 18180 24612
4486 24612 43842 43677 17813 -21066 -26702 -28550 14407 57234 31594 11447 18294 24829 1458
4473 1458 -38629 -48507 -40841 -61866 -57537 -35879 -38110 -18980 -6850 5869 17244 -9910 -36111
4460 -36111 -45129 -23465 -1871 6477 8178 -27704 -30696 -20225 -35065 -46836 -67358 -65472 -55749
4447 -55749 -43737 -54113 -58024 -47117 -17413 -11167 -6773 -8442 4548 -10220 -12681 -44792 -46611
4434 -46611 -18631 -16070 -28464 -6520 11197 31229 48203 43517 32286 22475 14873 -1734 -4538
4421 -4538 -28411 -45076 -33493 2309 7153 17628 23420 13104 -20624 -26522 -11149 -9975 -2590
4408 -2590 17433 6763 -11077 -17799 -26066 4595 -7721 -32215 -10931 -8957 -23981 -80 -5409
4395 -5409 -17137 -50415 -47367 -33213 -39191 -42653 -36728 5155 -18596 -48859 -30958 -39422 -72396
4382 -72396 -56913 -13990 9343 -20112 -36198 -48631 -78300 -31169 -37703 -43504 -44951 -61357
4370 -61357 -70284 -63625 -50579 -51375 -62494 -31205 -5572 18457 26160 14294 -187 -10874 -2487
4357 -2487 -1279 -12848 -4140 -7822 -14693 -21005 -11467 -28345 -31928 6877 17916 5930 6950 10600
4343 10600 31331 9263 -4514 -14924 -45079 -55126 -28778 -364 10344 6488 22620 8862
4331 8862 876 3613 -5465 10999 12875 -20034 -50470 -38071 -8310 2472 -1427 -8524 8755
4318 8755 -6150 -12714 1523 -5820 -26176 -28820 -24276 -34742 -34052 -39385 -29906 -37926 -44112 -26794
4304 -26794 -28367 -23043 -1408 36952 38460 -4943 -38902 -41616 -67893 -72607 -39948 -34125 -13731
4291 -13731 12585 637 -16921 -17059 -27748 -13677 -8326 -8355 -12233 -5943 -31390 -18114 1393
4278 1393 30952 25888 22691 54899 47801 -1133 -34376 -16967 34415 46099 38912 43745 66263
4265 66263 74908 39087 -4784 -268 -8475 -19435 -35290 -23705 5767 1731 -27463 -8894 -19135
4252 -19135 -49673 -2500 16651 48471 61395 52428 52710 26346 11405 23345 12394 21660 21608
4239 21608 2262 2459 25216 22567 -23154 -18364 22663 1350 -17260 -25007 -49748 -48085 -23915
4226 -23915 -19737 -12511 -5280 -2126 -28461 -25087 -42471 -73850 -45607 -47675 -48776 -49896 -39994 -34802
4212 -34802 -38888 -19073 -12882 -22273 -22594 12830 18240 22474 6371 -1806 -351 -15582 3125 -11801
4198 -11801 -13680 -17091 -40935 -61281 -65881 -48651 -36010 -4143 -18634 -31477 -23246 -44596 -29244
4185 -29244 10595 38078 -6836 -59978 -50236 -19160 -20439 -4890 -104 -30347 -28296 -18618 -9168
4172 -9168 12632 38425 31072 25490 -18866 -19504 -1886 19319 8535 25032 62107 44955 35411
4159 35411 30892 24944 32154 24422 6144 -54154 -33401 -13622 -22980 -33325 -16724 5554 -5309
4146 -5309 -44099 -85731 -68375 -41882 -20401 2874 29544 54999 49160 23367 6889 43054
4134 43054 34967 17433 46147 41238 -1517 -4552 7721 -1569 1150 405 7517 11542 -10851 -20343
4120 -20343 -10210 -4154 16703 29317 30986 15046 9815 -3714 -29973 -48897 -23286 399
4108 399 -5175 -17952 -37162 -39508 -18912 -2582 6758 -13606 -42060 -70955 -57730 -30180 8041
4095 8041 20668 45233 71232 66285 27686 -13591 -2008 9945 -20180 -21796 30131 57337
4083 57337 58889 38144 47482 68356 53768 39080 24221 27861 30780 14931 -6623 -10629 1961
4070 1961 13582 21862 26424 19182 4947 -29461 -25008 -3531 2593 16999 19636 12406 19997 850
4056 850 12844 35355 42876 37784 19253 -9000 -29081 -32989 4444 24727 21397 27302 27553 15987
4042 15987 15325 23849 32657 15123 -1736 16331 1572 12755 43532 62256 53883 32658 3981
4029 3981 17681 16288 13990 -4101 -31583 -60895 -39077 -28142 -19437 -16150 15830 25522 5295
4016 5295 -16716 -21160 -16212 166 20946 7351 -1882 -12415 -7869 -10543 2907 20040 24663
4003 24663 14201 -39976 -42841 -24509 15602 57404 67798 53692 33145 22977 13637 12755 39796
3990 39796 26928 13599 -18023 -32359 -36532 -761 50479 35784 31167 24585 19510 -618 -36558
3977 -36558 -8579 11607 6488 20023 6733 15650 11321 -5841 -22217 -32948 -46684 -30697
3965 -30697 -7497 -13573 -15997 4033 11802 4049 6886 -27592 -28266 2322 13823 43086 26848
3952 26848 -1979 13959 30905 21331 34730 37343 19909 16766 25544 28717 25918 4518 5566
3939 5566 -4608 -21988 -43751 -43939 -70943 -57638 -37324 -33818 -11722 -26516 -26543 -22577 -23455 -28890
3925 -28890 -29664 -53708 -44947 -32649 -10608 1511 -2708 -9700 -12371 -13711 31025 49794 35801
3912 35801 16351 1268 -20723 -1941 -2734 -9239 -14881 -39399 -27349 -34380 -37502 -15240 20722
3899 20722 33879 43262 39692 28311 4890 -13935 -25144 -34581 -37044 -30633 -29128 -49721 -21616
3886 -21616 3897 24808 30575 7410 -46191 -59267 -46685 -28427 -13782 15392 42161 73325
3874 73325 40670 14252 -12415 -26403 9906 22289 -6939 -32236 -25785 -2227 61136 100537
3862 100537 88422 75316 45646 48896 44650 18635 -24 21744 38561 25777 1026 -35113
3850 -35113 -28187 11580 20618 -9803 -12012 14291 16716 505 -9449 -7478 -23520 -14273 9032
3837 9032 -8494 -7414 -1548 515 2675 -484 11894 10311 10554 29262 14329 35402 51596 57050
3823 57050 39459 18887 -5882 -693 -2763 -26010 -7121 499 38555 77644 44536 13625
3811 13625 14765 19033 29021 34640 27944 8983 8648 35434 49130 64750 63363 32354 22806 19072
3797 19072 16466 -12421 -55192 -44612 -21461 -20640 7214 28238 -1588 -29341 -44447 -53605 -25571
3784 -25571 -17457 3952 -8092 -16918 -30387 -52505 -60373 -17524 3179 17724 3336 24183
3772 24183 24056 15380 25011 42691 26727 23065 -4409 -12707 -9048 -6484 -7380 -26788 -35757 -34324
3758 -34324 -29463 -5533 -15276 -39246 -30587 5265 20156 -1807 6881 28550 43537 16865 2476
3745 2476 52777 57911 53384 52597 42984 43397 42128 37454 32814 24369 11970 10451 15063 17491 1396
3730 1396 -32518 -20906 -15689 -30162 -38182 -44827 -50672 -45780 -41605 -53022 -31065 -21499 -55753
3717 -55753 -31610 -29663 -50151 -39403 -23671 -2777 -11560 -17440 8945 11907 -15893 -39580 -33140
3704 -33140 -15148 14145 14194 17923 13094 14843 11801 1979 -42907 -39372 -23605 8331 -7721 -23795
3690 -23795 3949 -10950 -17699 -14533 -28305 -12717 -18683 -20761 -11493 -22498 -14396 -27903 -12090
3677 -12090 20521 35040 23435 -27348 -60493 -53164 -37322 -26797 -49210 -59959 -43024 -18090
3665 -18090 -26680 20249 54878 51841 40181 5331 9112 20313 -7318 -33236 -60485 -41723
3653 -41723 -28948 -15661 -6070 351 4573 -2436 18215 49325 30951 13506 21408 22885 20243
3640 20243 4618 -24226 -6394 16722 39764 49988 33736 5643 -10778 -36463 -22424 -21707
3628 -21707 -28425 -29034 5745 20390 3472 -1549 33522 41176 13370 7957 11758 40913 44733
3615 44733 27159 14041 18966 44619 33307 4162 17664 18013 7925 4668 1161 -25124 -47536
3602 -47536 -43859 -47389 -58816 -64082 -68909 -44002 7979 20249 30447 27563 35506 54410 59226
3589 59226 27764 22526 3878 -9733 -7779 -15940 -22503 -21431 -26862 -4130 45470 51707 28754
3576 28754 22583 -4962 -33519 11010 29843 12405 12461 11432 344 2570 -16044 19929 42974
3563 42974 1873 -14675 -5421 1886 -7359 -24765 -16127 -11792 -5056 -21870 -35873 -26886 -27089 -35568
3549 -35568 -51457 -55263 -33974 -26224 -50530 -57010 -48358 -35416 -48742 -24838 -7143 -6097 -10127
3536 -10127 -7002 -8553 -19609 -32799 -17571 2845 -13264 -16544 -3889 17920 26596 8014 -5094
3523 -5094 15439 -5550 -25716 -3916 45045 31723 3382 -12323 -29994 -19208 -8318 -1231
3511 -1231 15111 31216 18847 9766 23792 25627 -8516 -23785 -8172 14683 17343 -11342 -37844
3498 -37844 -50152 -27571 -5677 -51999 -88031 -48280 -13773 10211 -14269 10743 -1307 -4034
3486 -4034 -506 11795 22322 11203 11017 5828 -5712 -27241 -22638 -7700 -3152 -1078 11739
3473 11739 26322 18963 5527 -3651 900 -512 -2148 20290 33085 43475 34162 -8591 -5458
3460 -5458 -1924 15763 33072 16384 19964 21160 16510 42554 53855 44763 61537 62104 52752 32419
3446 32419 39020 24034 33196 6205 5757 5971 16479 43054 41033 16888 -5621 973 18996
3433 18996 38074 50525 67588 43377 38747 63689 66432 78065 87391 63441 43186 -14031
3421 -14031 -19230 -16285 -42854 -45880 -35190 -35131 -11630 -34202 -42924 -36746 -16997 -17913 -11630 8847
3407 8847 13101 3435 26984 6316 4562 10452 20241 19209 32561 28410 7314 -24944 -31176 -12954
3393 -12954 2993 9413 13591 18210 -3780 1546 18453 23693 9158 6580 10275 -15474 -17326
3380 -17326 12872 49677 28145 17927 7932 4062 14052 22703 3212 -27925 -15661 7035 17375
3367 17375 16633 1935 42491 46100 43364 21754 4962 -11355 -20923 517 1452 13724 -1697
3354 -1697 -15644 -14152 -9172 -4458 5944 29821 31806 37536 38495 41227 50490 44530 23187 -1775
3340 -1775 15135 31986 38170 2676 19301 30209 7789 -17595 -23047 -30085 -22406 -21115 -23326
3327 -23326 -12607 -5116 16759 42542 30286 5945 -8859 8249 7098 -3608 19314 7205
3315 7205 13296 -10328 -4653 1822 7284 10978 -1895 -4123 -19955 -29326 -34118 -33482 -23260 -43146
3301 -43146 -57351 -46316 -39022 -18126 529 15542 9410 144 5489 15984 26101 25328 15553
3288 15553 16816 10661 1174 -30311 -77671 -69870 -47433 -31768 -40512 -50055 -32535 -9650 -28915
3275 -28915 -42422 -57286 -50338 -55085 -50321 -40609 -44818 -30579 -27834 6522 18198 23697 36350
3262 36350 43298 29689 13122 22901 19794 -7925 -9279 -5436 -7286 -17845 -3939 -1300 -4161
3249 -4161 12893 14334 40519 47965 35898 -3410 30524 59951 45111 19945 -3049 -14329
3237 -14329 -9466 -8585 6147 1537 -22290 -34146 -17400 2344 9288 43640 35333 15596 2987
3224 2987 -6832 6837 9750 -4336 -4484 -19161 -15772 15249 9132 16165 34926 12439 -2584
3211 -2584 -12961 10697 21330 13312 -9712 2374 39079 58211 59450 54698 27849 4449 25508
3198 25508 48711 46936 43739 48846 -8146 -36955 -31431 1664 -22513 -22501 -22541 -5054 15921 21142
3184 21142 20612 22871 22447 -9291 -14612 -17785 -34637 -56671 -43163 -41708 -47072 -27282 -33725 -28873
3170 -28873 -5318 -28497 -11415 23288 5249 -8195 -32661 -17115 483 -10832 -20374 -43532
3158 -43532 -36959 -2379 32998 15024 -32268 -22956 -8394 -3853 2821 4256 -20669 -11301 15656
3145 15656 26289 451 4303 -6880 1367 17291 44343 47453 15034 3767 -10552 11153
3133 11153 20446 -39 -27471 -14671 -21343 -48727 -43633 -20023 6458 11527 26205 28267 9014
3120 9014 -18651 -59849 -51037 -10129 9245 17927 6042 -24222 -20734 13984 36484 29250 3581
3107 3581 8461 -1281 -116 2538 6260 -20708 -29728 -18839 1739 9406 2074 1208 -6073 -12715
3093 -12715 -13594 4197 2989 2088 -27713 -25712 -60320 -62264 -32599 -27013 -1204 16891 39391
3080 39391 13946 13935 13770 13953 44471 17433 -11766 -1376 -8108 -9244 -9758 16349 46423 79663
3066 79663 69940 54620 16998 29436 56236 81300 59809 14647 -17094 -11122 -11495 6796 34919
3053 34919 33619 38115 43272 24913 16697 17979 26019 -18897 -36808 -53213 -38848 -24203 8502
3040 8502 18308 15163 30795 47548 33706 13567 22475 17539 25297 16936 27771 62831 83168
3027 83168 71452 27022 17700 18428 62067 56328 26849 -1765 -6768 16349 22797 24979 22053
3014 22053 14817 32625 -1963 -8870 22873 33687 28192 18836 13140 -14168 -16551 -22932 -612
3001 -612 14657 16094 5019 -1533 7195 234 -16736 24931 36922 57254 49267 6251 3784
2988 3784 2719 1853 15033 29009 14202 1262 315 7509 19586 -11723 -19768 -15252 -16428 2858
2974 2858 33415 22920 34870 35706 42007 42567 25501 15636 34445 41182 30934 6632 13432 10870
2960 10870 17181 34795 18042 18143 36999 42740 37997 30818 10665 -6001 -26311 -3579 -14946
2947 -14946 -11963 22344 33532 13950 9881 7094 23217 9677 -32257 -33825 -26041 -18594 -11382
2934 -11382 1164 4069 11475 27249 49666 61031 47839 10140 3877 -97 18212 14939 -6776
2921 -6776 -8192 12851 23878 3652 -18326 -4140 -7548 8974 13221 -4967 -9417 4840 -2882
2908 -2882 -10869 -27286 -2245 32080 37327 31372 29422 31879 11909 11872 11422 34209 32975 27301
2894 27301 -997 -21941 -3796 1309 -4874 -4023 -16633 -17927 -13561 8615 9657 11317 44639
2881 44639 57385 19289 8905 1244 7381 40783 40681 11228 -9704 -20250 -6316 -5578 3079
2868 3079 6885 7283 5501 25864 10994 -14861 -21707 -28464 -19483 14465 24393 38976 59090 49443
2854 49443 29785 17797 5364 6343 15166 13841 -4901 5773 -5109 -41955 -31186 -43537 -46026
2841 -46026 -23297 -35675 -32484 -9888 7845 -5079 602 -10295 -24786 -22692 -36979 -35232 -16695
2828 -16695 -36582 -28950 -3261 4446 26047 38591 54412 20560 -14731 -21211 -6828 -7424 12941
2815 12941 44059 42596 11947 36588 31459 21863 37102 63082 43993 12157 2332 31669 27503
2802 27503 -4063 14198 53071 66726 63503 48867 16531 -14251 -34545 -32303 -11144 -20794
2790 -20794 -24531 -23666 -9678 11813 9578 -240 11002 42311 37003 12683 3705 24236 29156
2777 29156 26064 33402 50806 32701 -6982 18 31478 19420 5044 6616 2998 15357 -3099
2764 -3099 2504 41200 26937 8030 25542 11478 14229 -7245 -29373 -23532 -8496 -1496 9319
2751 9319 15270 28445 44760 41565 68193 46200 -5017 1400 10452 1755 -8164 -1009 1555 -4554
2737 -4554 -20043 8679 28602 5114 10379 5272 -28706 -59042 -40743 -14376 -8021 9435 485
2724 485 -8291 -13596 -26009 -25722 -44125 -28559 7586 5608 -16583 -984 25808 52360 60463
2711 60463 72760 19977 -25286 -13636 -7330 -2858 -5398 -5499 2038 2073 5031 -20110 15605 42760
2697 42760 59394 33801 10503 36553 22604 -7616 10640 25168 2078 6060 1768 -364
2685 -364 6923 8001 -17100 -18779 -19491 -13047 -3476 -11457 -42395 -51691 -31038 2061 -4699 -21294
2671 -21294 -7295 24384 8057 -14036 -22689 -26825 -47027 -56528 -56086 -9089 4292 18443 52491
2658 52491 67882 30889 864 14824 10559 -17299 -35237 -24807 -9314 -1098 14240 41095
2646 41095 10535 2369 13504 2491 -17778 2163 -1991 -37159 -32383 -15452 -7577 -747 4366
2633 4366 -13916 -14634 -2502 -10338 -21838 -37760 -20610 28121 29829 34622 21684 -4853 17615
2620 17615 31153 22496 -8062 -29358 -11964 17960 8223 11767 15712 16913 16611 31005 7658
2607 7658 2585 29611 42936 8496 -26458 -31401 -20853 -1080 10039 34778 24806 9893 9065
2594 9065 2596 -6591 2432 1361 11981 8621 16712 6078 -15595 -6296 -29993 -27855 -956 25180
2580 25180 48730 34367 1452 -12943 -25524 -37416 -30919 -16732 17308 15911 1137 8885
2568 8885 25618 22080 -5736 -10525 15240 8079 -2419 12159 -13848 -27198 -21924 -12372 -3823
2555 -3823 3756 -8699 -15209 9637 20426 4432 18822 38229 13110 12138 25604 11041 -9194
2542 -9194 -39393 -40354 -35669 -29801 -26692 1840 20499 -4388 -41483 -54261 -47258 -53441 -33121
2529 -33121 -8203 -13279 -4494 24698 16084 -23974 -35465 -26771 -49214 -45103 -24899 -44026 -41676
2516 -41676 -32808 -20097 -32042 -62061 -62420 -49078 -46580 -16120 4217 -9249 16160 53957 33193
2503 33193 -4184 24443 26040 26584 32405 1501 3861 -17420 -43600 -35832 -5309 -3911 2597
2490 2597 6580 -14288 -14468 9145 24337 11646 -236 -7418 -33944 -26866 -37760 -51297 -37353
2477 -37353 -43406 -35044 -10917 12498 23011 -559 -7098 19788 35870 15193 7426 -4767 -7237
2464 -7237 -17381 -32192 -26241 -35153 169 32061 3665 -11422 -5347 -17239 -15160 12460 3646
2451 3646 -28340 -26336 -16634 -9677 377 12515 24559 8550 -20271 -22020 -38800 -48294 -56087
2438 -56087 -30526 -18855 -13131 4433 19788 -14379 -28877 1271 20481 23221 3808 22198
2426 22198 26506 -5194 -18394 -7699 4124 903 -51075 -36935 -21388 -29367 -24316 -14076 3283
2413 3283 13017 -10655 -41677 -4904 27980 6899 7144 7190 24883 54103 49430 8077 22948
2400 22948 23542 23390 15214 13699 -10497 -36358 -42594 -8931 3465 2354 -18766 -53727 -28422
2387 -28422 -16199 -21675 -2557 10338 13847 8163 10273 12338 36787 32279 -24925 -7061 15747
2374 15747 -12675 -43230 -39964 -33369 -12068 24095 19569 -81 -19624 -41797 -14525 460
2362 460 1783 3947 -19542 -26922 15364 24638 -9079 -18915 -11356 -5169 6906 22494 22523 -15862
2348 -15862 -38799 -30831 -11290 14954 -531 10250 11981 21169 38476 32128 53490 37765 54379
2335 54379 51792 46264 49628 47914 47479 53887 40609 10893 -10890 -3639 13375 21722 -5740 826
2321 826 32006 61288 48319 27981 42666 20431 18910 3223 -30354 -50093 -31511 -32363 -9241
2308 -9241 -16014 -20194 -20097 -21604 -19044 3536 11629 10542 -4230 -25384 -28335 -5121 11653 23275
2294 23275 19486 -735 -12612 -1205 31360 4287 -4718 -14483 -18561 -28130 -43120 -37272 -9574
2281 -9574 -29821 -14463 165 18880 20176 24155 47542 50592 37657 34553 32409 37691 12861
2268 12861 4576 10830 -2938 -7220 -26778 -14116 -2533 -7544 -36972 -9518 2142 -3336 -6826
2255 -6826 24541 58909 72359 68732 71252 26183 -3132 -1860 8724 35867 44354 23079 7604
2242 7604 42152 24013 18721 449 -2266 -18270 -16216 -19537 -24296 -14175 -11193 1034 10365
2229 10365 33971 38259 52848 23005 3730 18142 31727 29084 34334 18256 34034 -988
2217 -988 3947 10876 13508 4041 -21232 5927 -2252 -34797 -35593 -30018 -17094 -2902 -34379 -35818
2203 -35818 -25146 -24063 -15033 9619 15238 -7428 -18179 -9093 2995 13462 -2278 1568 9950
2190 9950 -13966 -25695 382 17929 9060 -5814 -24228 -34241 -65430 -73805 -51632 -26280
2178 -26280 6221 41729 9689 62 -13603 -31531 -17906 -29835 -46628 -45783 -25427 -46809
2166 -46809 -77790 -93915 -78832 -24710 -7507 9104 25646 -3484 -10218 11237 17218 -21287
2154 -21287 -27889 -6378 7986 9786 11735 36913 56112 38761 28408 26768 18192 -8732 -7303
2141 -7303 -2985 -17181 -21310 -1085 -3054 -19761 -14643 -13998 -26054 -5021 -25861 -20023 -25902 -8217
2127 -8217 -16289 -36238 -17374 22285 38077 31443 -448 -17231 -25604 -36505 -25495 -40273 -33352
2114 -33352 -39062 -62472 -81089 -43816 -31280 -34759 -37593 11329 23013 20093 31616 50464 44352
2101 44352 25961 16009 -6288 -2248 -5077 -18648 6272 -2725 -10436 -27274 -30129 9323 21659
2088 21659 17373 29515 35490 44194 53542 30383 25930 46188 25225 -2717 -6327 5629 21965
2075 21965 44807 33065 1009 -10329 8089 8445 -7274 -593 2384 -13007 -6437 22116 9301
2062 9301 -14890 -11351 -20329 7055 16851 -8338 -9332 2013 8234 1633 -128 -794 -5724 -26635
2048 -26635 -32258 4997 38205 47077 60906 40861 25617 16353 -8338 -3976 -3242 8207 -11854
2035 -11854 -27957 -17469 -2995 -20247 -52030 -66636 -67977 -73685 -65060 -29514 -17425 -17154 -9111
2022 -9111 -22207 -28829 -25098 -39286 -26697 -13000 5475 -8288 4994 29411 47903 54506 72533
2009 72533 47809 35362 21904 -8409 5024 30628 47549 53708 33292 28379 27622 44420 39916
1996 39916 6093 -12369 -31501 -37485 -2674 16183 -2944 -25918 -11718 2313 -7348 -13561
1984 -13561 -6917 4604 -30783 -25510 -30484 -1483 10764 2511 624 15963 3584 11086 5863
1971 5863 24923 43413 36928 66719 61388 2351 -25577 40880 74771 67301 77446 42298 -6766
1958 -6766 -26487 -57997 -31366 -918 27258 14133 -16901 -30079 2448 6226 1987 35869
1946 35869 37893 7459 24114 49601 66094 51163 29693 41740 19211 2944 38034 33592
1934 33592 8850 -30922 -53617 -45592 -37756 -32224 6312 41906 47286 25550 21209 13755 -12241
1921 -12241 -3270 -17935 -16354 -37954 -30976 -3331 23442 17139 17156 7518 -21847 -8317 -5417 -18631
1907 -18631 -23634 15466 49484 52832 23202 19401 23306 5248 -8654 3433 34030 6995 -36453
1894 -36453 -44545 -49562 -16156 10193 -21557 -55486 -67129 -65976 -39565 -44100 -27444 -18639 -36078
1881 -36078 -56482 -36949 -34548 -60228 -57714 -33522 -23493 -15542 -39803 -82626 -101801 -78563
1869 -78563 -14732 14267 32014 54207 55626 42318 29342 50841 58822 47774 46125 30771
1857 30771 -3413 8130 23655 10826 -9398 -29611 -45460 -26878 -14071 17984 11511 -654
1845 -654 -35076 -30976 2328 -7698 -27953 -32738 -7665 22669 54919 51416 39338 33156 42496
1832 42496 61940 45286 32225 31973 28873 14690 -12253 -9517 -7526 -9074 -12549 6886 34691
1819 34691 11046 -18513 -6355 2191 18877 22740 9910 -4477 29033 45699 31765 8288
1807 8288 -17317 -26282 -6461 16837 39760 38564 21306 31432 46696 42127 21076 25995 19985
1794 19985 37302 58517 59456 43971 47065 39324 45138 10812 -9268 -23688 -5807 4934 -19683
1781 -19683 -69505 -49195 -21355 -13165 -14180 -23230 -44956 -63496 -49601 -29079 -13865 -21827 -270
1768 -270 19102 24564 20532 -1162 -7143 23470 39975 31217 48568 57710 52878 45471 57319 68566
1754 68566 61839 21512 2259 -8753 -19409 12319 3137 -114 3384 9005 -9405 1482 9325
1741 9325 14002 1851 7894 22751 42270 34755 3288 -46434 -53875 -42774 -16399 -11933 -6087
1728 -6087 -8235 -23704 -13624 12235 4268 9367 35683 59372 -5490 -27324 -13307 24882 55802
1715 55802 63163 49206 25259 9263 7765 -7536 -28865 -47086 -60917 -38039 -40126 -8774
1703 -8774 1801 5376 -690 -1293 -2633 -11143 -25601 -15670 -4721 -10241 5470 20392 19243 36478
1689 36478 38924 21031 -8626 -31210 -6737 11293 20682 4538 -12793 5821 -13740 -10277
1677 -10277 -3154 28946 39728 18175 -13340 -20954 -20949 17759 26692 32463 4949 11271 -5879 -13780
1663 -13780 -26621 -53778 -57665 -44776 -45811 -11086 -8126 -5292 -11115 -33522 -20575 -7424 4083
1650 4083 28786 39947 32006 -851 -7930 -11737 952 -27035 -21702 -11862 1558 -7130 -21101
1637 -21101 -18218 -41908 -36195 -16319 -16196 -16959 -8115 -4831 -8446 27589 72362 62991 52363 66161
1623 66161 82050 52348 22979 17555 7442 14990 -4852 -22404 -2377 21217 47041 14889
1611 14889 -46162 -58535 -29783 -6791 -5206 8217 21628 36328 42719 52968 36366 -900
1599 -900 -879 -24310 -9904 -22321 -28634 8261 1398 -344 5105 -21984 -17089 6396 32838 30707
1585 30707 21740 9119 29498 55001 51686 29014 33521 15960 -11460 -24221 -39416 -39015 -36882
1572 -36882 -29470 -44451 -37610 -38934 -48795 -40090 -42386 -20833 -18786 -13780 284 -3985 -886 25997
1558 25997 34878 27435 -5305 -32990 -34278 13583 38425 17159 6340 19830 45502 27800
1546 27800 3332 2155 11934 30060 10307 19122 50228 48834 55092 35598 30287 41877 31722
1533 31722 16356 22227 3051 -7113 -4347 -16073 -24175 -18178 -24013 -37283 -59374 -59557 -49770
1520 -49770 -11494 18990 9397 -23128 -16226 -18048 -28757 -34742 -54274 -40906 -16086 -9960 -14829
1507 -14829 -3953 -1364 12667 43780 59739 29969 6400 11689 18836 42828 58287 41333
1495 41333 10889 5803 64756 92212 68281 42699 8441 -17901 -22226 -14978 -8993 4725 8455
1482 8455 15539 -12694 -2126 24592 23616 6378 30310 35892 32005 20483 8032 10050 3884
1469 3884 1774 32905 47407 12160 -9285 42184 45918 14801 18768 9697 5159 -13136 -7912
1456 -7912 -13847 3827 37154 44726 29841 15679 23453 14506 -9260 676 5067 -1167 -1534 15884
1442 15884 5381 -35746 -46620 -32817 2468 328 -30880 -11851 2608 -181 -2120 -13761
1430 -13761 -17552 -5013 -37280 -45859 -6948 -5577 -11914 -4524 -5627 -32872 -8604 7852 23571
1417 23571 -1139 -807 13913 32502 29024 4345 956 -1182 4180 27719 53344 71855 72732
1404 72732 53422 17700 1848 -1223 19490 35760 13911 -12089 -28789 8194 12416 12473 16216
1391 16216 21673 14916 13395 -10256 -18396 -8676 -17789 6068 3922 -5342 -7793 6650 -407 -14079
1377 -14079 -16260 -23027 -25469 -14397 2858 9759 -2848 -22725 -8969 -1789 -67 -22359 -25923
1364 -25923 -34044 -32282 -44184 -51901 -51183 -54255 -30912 -32040 -63575 -61780 -34919 -12714 15699
1351 15699 -4333 -23469 -36933 -57460 -14550 5931 17600 36900 32124 6267 -6093 -4089
1339 -4089 16186 7725 6601 5199 3727 -30982 -41488 -34547 -23277 -14633 -8486 17409 20541 5952
1325 5952 4730 33117 17610 23403 42364 39698 37798 48226 37568 20564 20854 4006 3152 9874
1311 9874 -11482 -22801 -10259 1441 -1794 -29934 -29709 -32765 -21301 -21323 -23441 -7782 8852 -10019
1297 -10019 -14838 -27994 -19374 9424 11158 5424 4912 6822 11680 38630 38028 45472 56253 52292
1283 52292 25741 14109 14659 14474 12794 -2195 18185 36567 37894 28928 -15153 -46845 -32460
1270 -32460 -9731 2407 -8966 9671 27992 29172 17649 4833 -19024 -27537 -36048 -19538
1258 -19538 -35814 -43478 -41512 -29219 -4927 375 -7891 -23463 -45130 -26622 7642 42562 56920
1245 56920 9291 894 8987 -5681 -13557 -9522 -2659 -1552 -5303 -20249 -25529 -2874 36124
1232 36124 41613 39224 46196 49539 25469 -16373 8928 16194 14418 58112 16991 -41019 -67347
1219 -67347 -61498 -24475 -11878 -9261 -11686 -28502 -36898 -10661 4033 18437 48145 36648 24727
1206 24727 1634 4040 16788 9787 3911 -8567 24772 37779 7865 9596 20931 46461 47676
1193 47676 42294 45594 40772 29260 30524 29730 23518 -5283 -43998 -32950 13030 20441 50833
1180 50833 46619 44775 23497 8603 -43 -25943 -18510 5404 21414 15710 -3624 -19067 -4406
1167 -4406 -10953 -25499 -39164 -45596 -11914 4606 -13672 -35077 -8198 15536 10541 7038 -7694
1154 -7694 11726 30693 25942 11642 -11057 14638 14099 17443 38674 38811 39327 21979 -26726 -56126
1140 -56126 -56633 -22032 -8076 9305 33017 8941 -45212 -66983 -74350 -44318 -31270 -2749
1128 -2749 -5961 -15298 -353 10841 18076 37574 61155 45123 7623 -41477 -72316 -42595 9982
1115 9982 13235 6925 13584 24740 27024 14188 -1583 12996 -2139 -10058 -20150 3005 32876
1102 32876 6438 -28113 -16931 -6899 25674 14101 -18139 -11077 -9578 -8108 -146 12032 8085
1089 8085 -15239 -56324 -46686 -9662 2150 3168 6976 -5507 -23247 -34819 -24678 14992 13481
1076 13481 -18089 733 7407 -31051 -30908 -23927 -38548 -26097 -10159 5136 -3255 13388 27838
1063 27838 26711 13064 -7665 1220 10552 21666 13966 7804 12991 26677 44616 41140 34991
1050 34991 44995 35010 7279 13356 18811 12781 11974 27161 16326 4629 26193 41390 27501
1037 27501 16816 19735 -458 15758 27134 29643 39963 53373 63479 8331 -47589 -40541
1025 -40541 -39047 -48221 -32432 12466 28428 11924 8203 12000 23438 32963 26734 38950 45138
1012 45138 -3966 -22020 9100 36303 16575 -22848 -41495 -21235 -17452 -43019 -48748 -20208
$$ [...]
##END NTUPLES=NMR SPECTRUM
##END=
