##TITLE=Analysis number 324512
Compound Code cc 62010
Book Reference 511/28
Project Code adrs
Chemist Name stevem
##JCAMPDX= 6.0         $$ Bruker NMR JCAMP-DX V2.0
##DATA TYPE= NMR SPECTRUM
##DATA CLASS= NTUPLES
##ORIGIN= Bruker BioSpin GmbH
##OWNER= nmr
$$ XWIN-NMR		Version 3.5
$$ Fri Nov 24 13:30:18 2006 GMT Standard Time (UT+0h)  MAYBRIDGE\nmr@NMR_250MHZ
##.OBSERVE FREQUENCY= 250.131544655141
##.OBSERVE NUCLEUS= ^1H
##.ACQUISITION MODE= SIMULTANEOUS (DQD)
##.ACQUISITION SCHEME= undefined
##.AVERAGES= 16
##.DIGITISER RES= 18
##SPECTROMETER/DATA SYSTEM= dpx250
##.PULSE SEQUENCE= zg30
##.SOLVENT NAME= CDCl3
##.SHIFT REFERENCE= (INTERNAL, CDCl3, 0, 16.4512)
##AUDIT TRAIL= $$ (NUMBER, WHEN, WHO, WHERE, WHAT)
$$ ##TITLE= Audit trail, XWIN-NMR		Version 3.5
$$ ##JCAMPDX= 5.01
$$ ##ORIGIN= Bruker BioSpin GmbH
$$ ##OWNER= nmr
$$ C:\u/data/dgb/nmr/ADRS/1060/pdata/1/auditp.txt
$$ ##AUDIT TRAIL=  $$ (NUMBER, WHEN, WHO, WHERE, WHAT)
(   1,<2006-11-24 13:29:48.75 +000>,<MAYBRIDGE\nmr>,<NMR_250MHZ>,
      <created by zg, POWCHK disabled, PULCHK disabled
       configuration hash MD5:
       49 4B E0 1D 92 C2 6B 37 9F E6 65 BC 52 41 86 1D
       data hash MD5: 64K
       E1 66 05 BE FF 36 60 05 78 9B F6 C3 CD C8 13 4F>)
(   2,<2006-11-24 13:30:06.13 +000>,<MAYBRIDGE\nmr>,<NMR_250MHZ>,
      <Start of raw data processing
       ef LB = 0.3 FT_mod = 6 PKNL = 1 SI = 32K 
       data hash MD5: 32K
       7F D6 CE D3 BA DA 96 B8 DF 2A 6B D9 30 FE 8A 74>)
(   3,<2006-11-24 13:30:07.84 +000>,<MAYBRIDGE\nmr>,<NMR_250MHZ>,
      <apk 
       data hash MD5: 32K
       8E 4D 71 EA 60 FA 94 0E 89 41 ED 46 BF 9A 5A F7>)
(   4,<2006-11-24 13:30:08.64 +000>,<MAYBRIDGE\nmr>,<NMR_250MHZ>,
      <abs ABSG = 5 
       data hash MD5: 32K
       98 F2 AC 68 05 38 0D 95 21 4F BA 2B 8F DA F3 52>)
$$ ##END=
$$ 
$$ hash MD5
$$ 97 1A 8B AD B7 10 B5 A1 A9 55 CA 80 60 B8 FB 91
##$RELAX= 
##$RELAX= 
##$RELAX= 
##$RELAX= 
##$RELAX= 
##$RELAX= 
##$RELAX= 
$$ Bruker specific parameters
$$ --------------------------
##$DU= <C:\u>
##$EXPNO= 1060
##$NAME= <ADRS>
##$PROCNO= 1
##$TYPE= <nmr>
##$USER= <dgb>
##$AMP= (0..31)
100 100 100 100 100 100 100 100 100 100 100 100 100 100 100 100 100 100 
100 100 100 100 100 100 100 100 100 100 100 100 100 100 
##$AQSEQ= 0
##$AQ_mod= 3
##$AUNM= <au_zg>
##$AUTOPOS= <53 >
##$BF1= 250.13
##$BF2= 250.13
##$BF3= 250.13
##$BF4= 250.13
##$BF5= 500.13
##$BF6= 500.13
##$BF7= 500.13
##$BF8= 500.13
##$BYTORDA= 1
##$CFDGTYP= 0
##$CFRGTYP= 5
##$CHEMSTR= <none>
##$CNST= (0..31)
1 1 145 1 1 1 1 1 1 1 1 1 1 1 1 1 1 1 1 1 1 1 1 1 1 1 1 1 1 1 1 1 
##$CPDPRG= <>
##$CPDPRG1= <>
##$CPDPRG2= <>
##$CPDPRG3= <>
##$CPDPRG4= <mlev>
##$CPDPRG5= <mlev>
##$CPDPRG6= <mlev>
##$CPDPRG7= <mlev>
##$CPDPRG8= <mlev>
##$CPDPRGB= <>
##$CPDPRGT= <>
##$D= (0..31)
0 1 0 0 0 0 0 0 0 0.06 0 0 0 0 0 0 0.0002 0 0 0 0 0 0 0 0 0 0 0 0 0 0 
0 
##$DATE= 1164374987
##$DBL= (0..7)
120 120 120 120 120 120 120 120 
##$DBP= (0..7)
150 150 150 150 150 150 150 150 
##$DBP07= 0
##$DBPNAM0= <>
##$DBPNAM1= <>
$$ [...]
##$SUBNAM7= <"">
##$SUBNAM8= <"">
##$SUBNAM9= <"">
##$SW= 20.6930455092707
##$SWIBOX= (0..15)
0 0 3 0 0 0 0 0 0 0 0 0 0 0 0 0 
##$SW_h= 5175.983436853
##$TD= 65536
##$TD0= 1
##$TE= 294.16
##$TE2= 300
##$TE3= 300
##$TEG= 300
##$TL= (0..7)
0 120 120 120 120 120 120 120 
##$TP= (0..7)
150 150 150 150 150 150 150 150 
##$TP07= 0
##$TPNAME0= <>
##$TPNAME1= <>
##$TPNAME2= <>
##$TPNAME3= <>
##$TPNAME4= <>
##$TPNAME5= <>
##$TPNAME6= <>
##$TPNAME7= <>
##$TPOAL= (0..7)
0.5 0.5 0.5 0.5 0.5 0.5 0.5 0.5 
##$TPOFFS= (0..7)
0 0 0 0 0 0 0 0 
##$TUNHIN= 0
##$TUNHOUT= 0
##$TUNXOUT= 0
##$USERA1= <user>
##$USERA2= <user>
##$USERA3= <user>
##$USERA4= <user>
##$USERA5= <user>
##$V9= 5
##$VALIST= <valist>
##$VCLIST= <CCCCCCCCCCCCCCC>
##$VD= 0
##$VDLIST= <DDDDDDDDDDDDDDD>
##$VPLIST= <PPPPPPPPPPPPPPP>
##$VTLIST= <TTTTTTTTTTTTTTT>
##$WBST= 1024
##$WBSW= 4
##$XGAIN= (0..3)
0 0 0 0 
##$XL= 0
##$YL= 0
##$YMAX_a= 256338
##$YMIN_a= -303622
##$ZGOPTNS= <>
##$ZL1= 120
##$ZL2= 120
##$ZL3= 120
##$ZL4= 120
##$ABSF1= 16.45124
##$ABSF2= -4.241932
##$ABSG= 5
##$ABSL= 3
##$ALPHA= 0
##$AQORDER= 0
##$ASSFAC= 0
##$ASSFACI= 0
##$ASSFACX= 0
##$ASSWID= 0
##$AUNMP= <proc_1d>
##$AZFE= 0.1
##$AZFW= 0.1
##$BCFW= 0
##$BC_mod= 0
##$BYTORDP= 0
##$COROFFS= 0
##$CY= 12.5
##$DATMOD= 1
##$DC= 0
##$DFILT= <>
##$DTYPP= 0
##$F1P= 14.0000005364418
##$F2P= -0.99999901652339
##$FCOR= 0.5
##$FTSIZE= 32768
##$FT_mod= 6
##$GAMMA= 0
##$GB= 0
##$INTBC= 1
##$INTSCL= 1
##$ISEN= 128
##$LB= 0.3
##$LEV0= 0
##$LPBIN= 0
##$MAXI= 10000
##$MC2= 0
##$MEAN= 0
##$ME_mod= 0
##$MI= 0
##$NCOEF= 0
##$NC_proc= -3
##$NLEV= 6
##$NOISF1= 0
##$NOISF2= 0
##$NSP= 0
##$NTH_PI= 0
##$NZP= 0
##$OFFSET= 16.45124
##$PC= 1
##$PHC0= 218.4897
##$PHC1= 7.328597
##$PH_mod= 1
##$PKNL= yes
##$PPARMOD= 0
##$PSCAL= 4
##$PSIGN= 0
##$REVERSE= no
##$SF= 250.130017696944
##$SI= 32768
##$SIGF1= 0
##$SIGF2= 0
##$SINO= 400
##$SIOLD= 32768
##$SREGLST= <1H.CDCl3>
##$SSB= 0
##$STSI= 32768
##$STSR= 0
##$SW_p= 5175.98343685301
##$SYMM= 0
##$S_DEV= 0
##$TDeff= 65536
##$TDoff= 0
##$TI= <Analysis number 999999
Compound Code 99
Book Reference 9
Project Code 9>
##$TILT= no
##$TM1= 0
##$TM2= 0
##$TOPLEV= 0
##$USERP1= <user>
##$USERP2= <user>
##$USERP3= <user>
##$USERP4= <user>
##$USERP5= <user>
##$WDW= 1
##$XDIM= 32768
##$YMAX_p= 519707451
##$YMIN_p= -246427
$$ End of Bruker specific parameters
$$ ---------------------------------
##NTUPLES= NMR SPECTRUM
##VAR_NAME=  FREQUENCY,     SPECTRUM/REAL,   SPECTRUM/IMAG
##SYMBOL=    X,             R,               I
##VAR_TYPE=  INDEPENDENT,   DEPENDENT,       DEPENDENT
##VAR_FORM=  AFFN,          ASDF,            ASDF
##VAR_DIM=   32768,         32768,           32768
##UNITS=     HZ,            ARBITRARY UNITS, ARBITRARY UNITS
##FACTOR=    0.157963299565203, 1,           1
##FIRST=     4114.94908729452, 0,            0
##LAST=      -1061.03434955849, 0,           0
##MIN=       -1061.03434955849, -246427,     0
##MAX=       4114.94908729452, 519707451,    0
$$ Real data points
##PAGE= N=1
##DATA TABLE= (X++(R..R)), XYDATA
$$ [...]
17371A7779m947j6208J795O908L5226P584J680l894q051J0024j5356l1074m101
17358b635j381n99j1174R738m579R17l267m083p359j5240j5323J4926J8620K9325
17344G886K3873j0128m346J0694k3665k0581j2818l783R076J1713m057k6912J0591
17331c2457P198p650j672j2640K9716L3871k9723o032J0906q948j6942p807P307
17318c4873J5934J0419J2250J0448L317j7608K8460L1569m880k8212k509K7340
17306E1655o295k1170k6165k343L860r45j732N774K0026j5674L2746P677k8141
17293A9273j420J5140M409N906l4741k8719j5697J0958j6320o143J4324N724K7735
17280D29K4767j2980k4690K738o287L445n513L7867k91k6950j8099l5974L920
$$ y = [17779, 12832, -3376, -1581, 5327, 40553, 48137, 49817, 45923, 37872, 47896, 32540, 1466, -2635, -4016, -4615, -15789, -6051, -10630, -9713, -12980, -17063, -24422, -39662, -54985, -40059, -21439, 7886, 31759, 21631, 17285, 27979, 4314, -16267, -29085, -32868, -23792, -12079, -16136, -43048, -32457, -25259, -32909, -34581, -47221, -17505, 16366, -13357, -19389, -8483, -17431, -34373, -42180, -34873, -18939, -8520, 3730, 14178, 17495, -113, 28347, 59916, 55036, 26824, 24315, 51655, 45360, 24190, -1975, -4318, -458, -1403, -3135, 2639, 22665, 6991, 39737, 47414, 19273, 17853, 32993, 37402, 43308, 8567, -20152, -35849, -24891, -41211, -47354, -33030, -27306, 429, 25196, 12216, -12474, -9736, -16023, -12578, -18091, 19776, 19485, -7465, -25564, -61538, -57618]
17267e7618L8163K3183J2118k5360L691K4740j0424p869j5195j5979Q31K6736
17255b983r125n636K467K8826q944j0634R560o504j6988J2038L637K0195J3027
17242B8936j283l400k0085P870K434K919J1833k7838L936J5511K3697o766j7644
17229B0120j8215Q193J6738L488J910m2494j6474J2187J8773K7810j3496Q920
17217B7460r634K391j2460n621K2644L6626N5939O2806R2967J36272L9094o3078
17205C85406j03076r3366m5774k8903m3285j3591n240M8364P3786R0271J20730
17194C85322O5191k6467j03028j11922p9298m5346j4946l520K4920j0738l8982
17183D1186N864j1178o928j177O878J6100L041q851k4240k9137o83J2705j6822
$$ y = [-57618, -19455, 3728, 15846, -9514, -5823, 18917, 8493, 624, -14571, -30550, -29719, -2983, -12108, -17744, -15277, 13549, 4605, -6029, 3531, -2973, -19961, -7923, -4286, 15909, 28936, 27653, 24253, 4168, 12038, 14472, 17391, 29224, 1386, 5322, 20833, 44530, 37764, 20120, 1905, 10098, 26836, 30324, 32234, -10260, -26734, -14547, 4226, 32036, 18540, 27460, 17826, 20217, 7757, 2136, 24780, 61406, 117345, 180151, 273118, 409390, 448484, 385406, 282330, 188964, 143190, 114287, 71002, 57411, 52171, 100535, 174321, 264592, 385322, 450513, 424046, 321018, 209096, 129798, 84452, 69506, 65986, 90906, 80168, 41186, 47050, 35872, 28944, 27767, 34645, 50745, 53786, 44935, 20695, -8442, -9125, 3580, -13242]
17170a3242j8406J486L3962j815J4674o216l7292j1079L0367R418K0466K6797
17158D9120j4959m823L527q273k8525k638J0380K5885J406l0299j1158k7785n590
17145d3732J7411L1185J2563j0957J1555O684j4917m983K3600k2713j6864l7898
17133d9066j5760K6752N2357P480j6519M396j351k1233p369J0268R591j4972N927
17120i499o09M739j1194j1002J5967k1460p333L49J4664J1133J8236M2296J3343
17107E9630j2159k0531l4633k3204K396N417K0048L938j5632L437k1152j3705
17095d6150M1309L0102k1385j0076K835j2804m5212J063L014L4219K1744Q342
17083G001L009L506j2035O012L9375L586O726k0852l3382j4905J0686J8763J9265
$$ y = [-13242, -31648, -30162, 3800, 1985, 16659, 10443, -26849, -37928, -7561, 1857, 22323, 49120, 34161, 29338, 32865, 24592, -3933, -6571, 3809, 29694, 31100, 801, -10357, -38142, -43732, -26321, 4864, 17427, 6470, 18025, 24709, 9792, 4809, 28409, 5696, -11168, -49066, -64826, -38074, 14283, 21763, 5244, 9640, 8289, -12944, -20313, -10045, -454, -15426, -9499, -10108, -5369, -16563, -27565, -11598, -33058, -40391, -40042, -25378, -14245, 3991, 46287, 59630, 47471, 26940, -7693, -30897, -28501, -23084, -3036, 902, -14730, -11293, -32445, -46150, -4841, 25261, 3876, -6200, -3365, -16169, -61381, -60318, -57304, -23085, -1341, 7001, 10010, 13516, 1481, 7493, 46868, 50454, 57180, 36328, 2946, -11959, -1273, 17490, 36755]
17070C6755Q197m3956k4749K8412J9320l4977L813k275j6546j2252j7004j5004
17058g0266L7749K0496J1474m0476R04o210J2279J8245J6190J7803k3560r939
17046a5311o892J347K1395q352k3617j6231Q479r962Q348k6245L036K1261J5779
17033b6965J3827P298L538K091j0314K1047p709k651J6743o731l5123J0777r478
17020b3650j0808j3735n660J8817J1393q07j864P623N526k406j9302m4844J8145
17007f1572K7901k838J5636K6386L7238J0894k3426j7693j2489k9085j2996j90
16995d2234N076j188K9498j138r541J211p556n470k4856K2753L7262j414M06k6528
16981b3719K247j2033O192K1098j7676l059K8520j7999p335k752K435k246j4368
$$ y = [36755, 44952, 996, -23753, 4659, 23979, -10998, -7185, -9460, -26006, -38258, -55262, -70266, -32517, -12021, -547, -41023, -40119, -46329, -34050, -15805, 385, 18188, -5372, -15311, -22203, -20856, 539, -7813, -31430, -47661, -39182, -49144, -40796, -67041, -64005, -42744, -26965, -13138, -5840, -2302, -211, -10525, 10522, 2813, 162, 16905, 10174, -24949, -14172, -23650, -34458, -48193, -53853, -35036, -23643, -24450, -26314, -18691, -13165, -15571, -34873, -79717, -61572, -33671, -36509, -20873, 5513, 42751, 53645, 30219, 12526, 37, -29048, -42044, -42234, -37158, -38346, -8848, -9986, -19527, -18316, -25872, -31342, -56198, -33445, 3817, 2403, 2809, -23719, -21472, -33505, -27313, -6215, -23891, -26950, 1570, -16429, -23764, -26516, -24081, -26327, -40695]
16968d0695Q793M5096q584n98J388j0301J124j3713j9221j5378J0744L6479N631
16955G65l6298k843N700N703J880j1036l4731o021K8229N2801K3333j6814j9760
16942i092r763m805j6679j6970K3082M532J6692K1511l402o580k8045J3561N756
16929a0202J3376K8753M486k1568n4423k8288m147L8186O867O882O35j6822K825
16916c3440K7250J2960m0773o367k500j3558j036l247J433O463K5536j2968L8443
16903a804M0653j9497M197J3151o9083l5533J5764J8293K0537N396l7497m945
16891e0368j2202n634k494O392K5354K3966P8J1722j2349m9473J0685L8210O586
16878i527Q964l593M983J7793J3884k4755j3350j3485j2488K739o160j5980K792
$$ y = [-40695, -31902, 13194, 4610, 4012, 5400, -4901, -3777, -17490, -36711, -52089, -41345, -4866, 765, -35533, -38376, -32676, -26973, -25093, -36129, -70860, -76881, -48652, 4149, 27482, 10668, -9092, -18855, -23660, -40339, -57309, -34227, -29695, -13003, 8508, 5106, -1474, -29519, -15958, -10202, 3174, 31927, 36413, 14845, -39578, -67866, -72013, -33827, -26960, -20078, -19443, -36265, -33440, -6190, 6770, -34003, -40370, -42870, -56428, -57464, -60711, -59278, -52815, -27279, -40247, -1804, 38849, 19352, 23549, 36700, -32383, -67916, -52152, -33859, -13322, -7926, -45423, -50368, -62570, -68204, -70698, -64306, -38952, -14986, -14908, -3186, -15535, -65008, -54323, -16113, -9527, -563, -4156, 827, 18620, 32504, 7749, -5601, -19086, -31574, -28835, -34995, -50975, -48183]
16865d8183L048p428r575j1875k0503k5682P29K9390L3526M9084K072o508q466
16852b0371J1121K0711n795M301j0194k5053l686o444O677J9058J7235K3302R330
16839D0192n4181k0530k1921L547J7231L697J6640J3244k9869j9732J6473J5010
16827b0199j0054m778K6492R892j5823l549j554J386L960J2045L348J418j8389
16814a5805j6731j8684J2361k1131j4880K0223J2983O104L2972K5797l0880k5888
16802c3559j245o95K9031L2619k3935p660r692o774L084J2314o361l0552j1460
16789e4885J2352O531m137K1687K912K8211l84j8503j5846j4223l339k0678j325
16776f1627j686J3610J7115N209k5571j3119J0833J9067K2012k4545l9654K0960
$$ y = [-48183, -45135, -52563, -62138, -74013, -94516, -120198, -119469, -90079, -56553, -7469, -5397, -11905, -20371, -9250, 11461, 5666, 9967, -227, -25280, -28966, -35410, -28733, -9675, 7560, 30862, 40192, -13989, -34519, -56440, -52893, -35662, -31965, -15325, -2081, -31950, -51682, -35209, -20199, -30253, -35031, -8539, 1353, -14470, -18019, -19573, -18187, -14227, -2182, 1166, 2584, -15805, -32536, -51220, -38859, -59990, -74870, -54647, -41664, -35560, -2588, 23209, -7671, -33559, -34804, -35499, -6468, 26151, 2216, -5444, -15136, -21910, -18826, -6512, -12873, -43425, -54885, -42533, -36002, -40139, -18452, -15540, 12671, 12287, -6216, -22062, -36285, -39624, -60302, -61627, -63313, -49703, -32588, -27379, -52950, -66069, -55236, -36169, -14157, -38702, -78356, -57396]
16764e7396M2199J173J0216j5193Q575J5065J4051J1229j7288j5158M665J193
16752C331l390P142j3799l0839J2032n916n472J6004p685l3289k0967L0331J8237
16739c4280L4302J8379k2001j8233l6132j1007L1204K4041m0168J1562M0717R872
16727H256k1312n492k5783K595J9715l95O158R579o678J0362j8571j8470K1769
16714a8267J9428R281Q379J5372j7189n845k7040j3738J4632j3933j7601J2444
16702c4077Q528K5582L7404j2495m3843K961M936J4366L7013k0251k9694j6176
16690b5746p55J3585K2802M2560J1797k4123k3296l623J4794k3900J8200J7529
16678C9824r307k7060J2263L91q848O8k2314j7346l5850K9463p30o05j2522L12
$$ y = [-57396, -15197, -14024, -3808, -19001, -10426, 4639, 18690, 29919, 12631, -2527, 2138, 3331, -59, 7083, -6716, -37555, -25523, -31439, -36911, -20907, -28592, -61881, -82848, -52517, -34280, 22, 18401, -3600, -21833, -57965, -68972, -37768, -13727, -53895, -42333, -1616, 8256, -13056, -18548, -44331, -41736, -22021, -22416, -16258, -6679, -13357, -2995, -21566, -40036, -18267, 1161, 10442, 18821, 34193, 17004, 11159, -15881, -29619, -14987, -28920, -46521, -34077, -25549, 33, 37437, 24942, -18901, -15940, -11004, 3362, 40375, 20124, -9570, -25746, -26501, -12916, 9886, 52446, 64243, 40120, 16824, 13201, 27995, 4095, 22295, 39824, 30517, 3457, 15720, 16111, 7263, 7331, -14983, -32329, -68179, -38716, -39446, -40051, -52573, -52261]
16664e2261j4264J1088J8219K310j491N5712K1898L2302L058r953k4257n258j2272
16651B4831l0884m1617l6721J2729M0987R932l965J1554J0781K5252k2080r337
16639h538j8831J0295J1537L565j5012k138O465k4951J4049K8026l1098l3459
16627f0090J879J864L5443o562N57P333K0029K1635n021k8086K714j8320J8936
16614g689M094l828m7460k1667J8211M6317L4072j8m6476r058K5627J8996n394
16601E727l013n887m0152j9632K4955J8718J4087j6613l0997M285L4129K3834
16589I441J1554Q227j2573J4000J5932p050j3187K0787N35k6882j8512k0261K5217
16576G228lK4658J094o101m614J1065J0730j4567p813N32k0342j2654j5127l3318
$$ y = [-52261, -66525, -55437, -37218, -34908, -36399, 19313, 41211, 73513, 76571, 66618, 42361, 37103, 24831, -6053, -47670, -84391, -71662, -30675, -20743, -24708, -13154, -2373, 22879, 799, -8538, -27369, -17074, -5537, -1972, -16984, -19122, -12657, -37608, -23559, 4467, -26631, -60090, -58211, -56347, -20904, -27466, -26909, -19576, 453, 22088, 17067, -11019, -8305, -26625, -7689, -3595, -7423, -54883, -76550, -58339, -12022, 22050, 22032, -24444, -33502, -7875, 11121, 5727, 2714, -3173, -43325, -62957, -38002, -19284, -5197, -21810, -52807, -48522, -14393, 9441, 20995, 29222, 16649, 30649, 46581, 39531, 26344, 47131, 47666, 20784, 2272, -17989, 7228, 7225, 31883, 32977, 26876, 22262, 33327, 44057, 29490, 21677, 22209, 1867, -10787, -25914, -59232]
16562e9232K746J6057J338j6175K1151K798k1494L4986K8592r458j7551J8112
16550A870K6881q480j6978j0787M853N98R700m818o105o132L74r763J3417J2621
16536G251L003J4129L3001K3369j7646j2926o326M12J4812J0610K2873L6290L605
16523A32457l3616Q528J1055k4293K7853K7964p026m502R76J0326j0671l4006
16511A05045J3391J1222k509j0086k4211m0168n944K8435P865q655O453j5171
16499F5667j7350J382j7187k3255O654L3923m907l9771o2562r386J4032J2988
16487c9772M972M145k547J5849Q090p142O248q365R847N537K1724j701k2505l0947
16473c6567J2194K2400k1058P102K8494R491j5262L811K159p613L709j0159k3098
$$ y = [-59232, -56486, -40429, -39091, -55266, -34115, -31317, -52811, -17825, 10767, 1309, -16242, 1870, 28751, 20271, 3293, -7494, -2641, -2043, 7657, 2839, -3266, -9398, -9024, -18787, -5370, 7251, 10254, 24383, 57384, 80753, 63107, 50181, 43855, 44267, 59079, 69689, 92562, 128852, 132457, 98841, 107369, 118424, 94131, 121984, 149948, 142922, 138420, 139396, 149722, 139051, 105045, 118436, 129658, 127149, 117063, 92852, 52684, 46740, 75175, 83040, 74385, 80838, 65667, 48317, 49699, 32512, 9257, 15911, 49834, 44927, 5156, -57406, -66792, -52760, -39772, -34800, -30655, -33202, -17353, -9263, -16405, -10157, -18522, -8675, -3138, 18586, 16885, -5620, -36567, -24373, -1973, -23031, -15929, 12565, 22056, 6794, 10605, 12764, 5151, 8860, -1299, -24397]
16460b4397j4485o26J9562j2272k0934k1960p842L6199J5385R981J2658J3o222
16447a4940J814q144J0633Q244k5236K783J4630j8309l680K8966k1524j9006K1010
16434b2759J4983J3495J3118L476j6072k3022P54R559J0209J3494J2733P527O631
16421D4126P654O92J2071o524j1095l1675j9065N795m1041N105R63M876K6166
16408a952N673j5730L053L63j0448j4438J6173n394r307J6169o825K9068P461
16395A3866r916j6039K5701O382j8796k7043J2230N822J1024J4780j7990m4560
16383d4539N8K233L7884n841K776J1632N893j6941j6295L342j0320p97k2974J2016
16369d1873M2779L0377q104p512q405J6706j0974j7027K160k0255M973l2956j7583
$$ y = [-24397, -38882, -39508, -19946, -32218, -53152, -75112, -82954, -46755, -31370, -21389, -8731, -8718, -14940, -13126, -21270, -10637, -2393, -27629, -24846, -10216, -28525, -32205, -3239, -24763, -43769, -22759, -7776, 5719, 18837, 22313, 6241, -16781, -16027, -6468, 3741, 17235, 29968, 37495, 44126, 51780, 52472, 64543, 58019, 46924, 15249, -3816, 1979, -39062, -33957, -32994, -28118, -1952, 3721, -12009, -8956, -8593, -19041, -33479, -17306, -22700, -32007, -15838, -22663, 6405, 13866, 3950, -12089, 13612, 19994, 1198, -25845, -13615, -7793, 3231, 18011, 21, -44539, -44481, -42248, -4364, -10205, -7429, 4203, 10096, -6845, -23140, -19798, -30118, -30915, -53889, -41873, 906, 31283, 23179, 15667, 7262, 23968, 12994, -4033, -1873, -22128, -17155, -50111, -67694]
16356f7694J787M6548L089m800J2544J4138j0745j0854l2056j0345J8096k452
16344d2744K4361r815m5449l165K4039K1338J0448N346K9986K0093o479K2212
16332E0171j6457k8330l2011m0392J3023L0413J173R515q968j1270O456J3217
16320a3460j6240l3058o718J7040L5982K7552j1176l650O335J1452o041l882j6876
16307a2740n555j3147J9896K681K7628J5082j569k2711r295k4275J3669K6712
16295A6376N41J7237L951l2246j0241K4466p200q573M216j2768K2513J9726M593
16282D2591O724K7789J5489k7027m0263k4971K673m993J7902Q304j0703k3425
16270i910m872j7548r037L2000q962L10l550M747L8690j1004r038k5520j0460
$$ y = [-67694, -65907, -19359, -16270, -21070, -8526, 5612, -5133, -15987, -48043, -58388, -40292, -42744, -18383, -28198, -73647, -76812, -52773, -31435, -20987, -15641, 14345, 34438, 27959, 50171, 33714, 5384, -26627, -67019, -53996, -23583, -22410, -12895, -21863, -33133, -26677, -13460, -29700, -62758, -69476, -52436, -16454, 11098, -78, -3728, 2607, 14059, 8018, 4136, -12740, -18295, -31442, -11546, -8865, 18763, 33845, 32276, 9565, 270, -24005, -10336, 16376, 16917, 34154, 38105, 5859, -4382, 20084, 12884, 4311, 8527, -4241, 18272, 37998, 42591, 49315, 77104, 92593, 65566, 25303, 332, 3005, -1988, 15914, 24218, 13515, -9910, -14782, -32330, -41367, -9367, -18329, -18019, -21569, -16822, 21868, 10864, 1826, -23694, -34154]
16257c4154N742M735M592J5103j250K3656J5168k044j3314O758j5j1981k241o930
16243C825P758j5122J4852k883l6082J4342n588k0815R613K6662M527l61m318
16230c590q703J1155P385q955j8083K774J681J1186J8788M180J5222m998K32l2870
16216d596R484M863j0025j752P663l8580K0034J3029J1965j522J7284K000k7665
16203B182J3448j1753j2412J3876P418P074J2286M804r856J4226Q604P593K6616
16190H4106k3134l3276l3280K3505L737j4099j5569m005m670m1844N589k979J5065
16177d0854L6766K0792K254l3869m5867M013L2460J6354M007J1604k3432K9573
16165A3801j1650m1477l719M9629J7315j8130k7494k636n200J1440K2070J0623
$$ y = [-34154, -28412, -23677, -19085, -3982, -5232, 18424, 33592, 31548, 18234, 24992, 24977, 12996, 10755, 3825, 11583, -3539, 11313, 8430, -27652, -13310, -18898, -39713, -30100, -3438, 1089, 728, -3590, -12293, -1138, 6247, -2708, -20791, -18017, -16336, -5150, 13638, 17818, 33040, 28042, 28274, -4596, 4888, 9751, -274, -2026, 5637, -32943, -12909, 120, 12085, 10563, 27847, 29847, 2182, 15630, 3877, -8535, 5341, 12759, 19833, 32119, 36923, 27067, 41293, 49897, 57490, 84106, 60972, 27696, -5584, 17921, 21658, 7559, -8010, -12015, -16685, -58529, -52940, -55919, -40854, -4088, 16704, 18958, -14911, -60778, -56765, -24305, -7951, -3944, 7660, -15772, 13801, 2151, -39326, -43045, 6584, 23899, 5769, -21725, -24361, -29561, -18121, 3949, 14572]
16153A4572j3604l1359Q532L6182j748K1596l7176k2154j2453Q029K2747P037
16141B01o242j6580m955J1452K1461K7423O715n63j9117M009l3490j4667q75J5482
16127i746Q759J2719P4J3608l27k2149k5211k2584N779k2035n607P449J5020J0980
16113c3271K5550J3228M718k7874j8269L177L27R452N295J6712K0666j053l5135
16100a6477l4724L3116J8605o075Q556j7866j5401P656q276m669k752k5346Q415
16087e5238L4061J2484o142n226k798j0542Q16N5125L2193m3102j3795K3504j5840
16074E500J426K290N797l331M247j5723J379K2017J7298q699m5312J7954p629
16061b786k1977M3098J1136n592j2770j9081J5363N907J2778K726q85k4040n1776
$$ y = [14572, 968, -30391, -21859, 14323, 12575, 34171, -3005, -25159, -37612, -29583, -6836, 201, -6041, -22621, -27576, -16124, 5337, 32760, 39475, 38912, 19795, 23804, -9686, -24353, -25228, -9746, -987, 11732, 11806, 25414, 25087, 2938, -22273, -44857, -39078, -61113, -66720, -59271, -44251, -33271, -7721, 5507, 10225, -17649, -35918, -32741, -32414, -22962, -17667, -955, 19711, 18658, -16477, -51201, -18085, 520, -5555, 3001, -14865, -30266, -22610, -30886, -35555, -38307, -63653, -55238, -21177, -8693, -14835, -20061, -22859, -33401, -32585, 22540, 54733, 11631, -2164, 21340, 5500, 6926, 9216, 15013, 11682, 15929, 206, 1585, 23602, 40900, 32201, -13111, 4843, -2786, -24763, 18335, 29471, 23879, 11109, -7972, 7391, 13298, 26076, 28802, 27917, 3877, -47899]
16048d7899J4544o949R094O055K9673J0522O851l665k488j7364J9103J6901k1920
16035A2458k7894j6671l12L257J1360M188r580O123k1019p940J5784L6303J2411
16022A8468P126J7028j8069J0023j770j9903k717k7297J9296J543m0269l0609
16010f7150L5599P511J7903o473P315R418k4494J089L0579L8261q500k8225r219
15997C614j267N631K5213j2210k0444j1868j9060j4528L7634K2451K9875R755
15985E4796k3740p27M508q892J628m947j9091p39k1971j6368L656p03l290N172
15971c0708K4927M217n253k911L219L870K6151q595k5962O135J62n840J4122m122
15957e88J3602k8653MJ7005l527p962j6035k8306J023J5444j297p00O822l592
$$ y = [-47899, -33355, -40304, -31210, -25155, 4518, 15040, 21891, 18226, 15738, -1626, 17477, 34378, 12458, -15436, -32107, -32419, -29162, -17802, -13614, -23194, -17071, -38090, -46030, -30246, 6057, 18468, 25594, 42622, 24553, 34576, 32806, 12903, 10186, -17111, 2185, 3728, -36541, -67150, -31551, -24040, -6137, -12610, -5295, 4123, -20371, -19282, 11297, 49558, 41058, 12833, 3614, 2347, 7978, 33191, 20981, 537, -11331, -30391, -44919, -7285, 15166, 45041, 54796, 31056, 30329, 34837, 25945, 27573, 22626, 3535, 2796, -19175, -35543, -31887, -32590, -35880, -30708, -5781, -1564, -6817, -9728, -6509, -2639, 23512, 14917, -11045, -4910, -4748, -10588, 3534, -588, 13014, -15639, -15635, 1370, -2157, -10119, -26154, -54460, -53437, -37993, -39290, -39990, -33168, -36760]
15943c6760k0852k125O348l52K0623k403p370N259m244J9006L6295J1214k6191
15930a552N774m070L74j9624k3546l212K6231K5621L508j7021J3223n716k2484
15917b2494J8526J7357O847R276k0502j3730j4227J2708j3890r314j9573J5375
15905c3641K0560J2468j3452j6395K0870o297q831P874J1561j1112r180J6539
15893i036r06k6490n2814K3593K5992j065K2648k0064j7626k6119K3272L0306
15881b8309N0444j8735k1093j6102O068m34j1231p84K6166L8236j783r469k1612
15868h638J2582J2701q800J909J1570o621k5236n4411j2071M1508J8244j6339
15856c3602J9410J8646r488n159J2765N785j6326P641k93O114r660j4286j9210
$$ y = [-36760, -57612, -59737, -53389, -53741, -33118, -35521, -42891, -37632, -41876, -22870, 13425, 24639, -1552, 4222, 152, 526, -19098, -42644, -45856, -19625, 5996, 9504, -7517, 5706, -10, -22494, -3968, 13389, 20236, 29512, 9010, -4720, -18947, -6239, -20129, -29443, -49016, -33641, -13081, -613, -14065, -30460, -9590, -15887, -24718, -16844, -5283, -16395, -25575, -9036, -9942, -36432, -89246, -65653, -39661, -40726, -18078, -38142, -55768, -81887, -58615, -28309, 22135, 3400, -17693, -33795, -27727, -28161, -39392, -40176, -14010, 24226, 22443, 12974, -8638, 3944, 16645, 7845, 9754, 21324, 14703, -10533, -64944, -77015, -35507, -17263, -33602, -14192, 4454, -5034, -10193, 2572, 8357, -7969, -328, -621, 5493, -4167, -18453, -37663]
15843c7663N200J8552K204j6598j0106j3771L9904N5356J0948k5565j015j4873
15831A2573N650l5551j5923N107K2801L1515N019o984N738l6361K384P650R460
15818A3078q585j0530Q547J6322j123l81k0905J3091q829l4186J9999j628J2189
15805b941m054M385R213j179J437k9031j0800J705J8489J0565j0923R132l990
15792g992J2036J4397o591l2338p356m75K046K2357K2249J1161M582k1501k6128
15779a3553j0772j3557j4490L493j670J9910j8271r926J7415J37o322j0384K0607
15766c7383j0574j9829L1333N2775m6219N837K0473K7461K2047j7922j2933l14
15754A4752m909k6868n542Q028K7405K810j3917j4733M232J5453k622k7334j8104
$$ y = [-37663, -32463, -13911, -11707, -28305, -38411, -52182, -12278, 43078, 54026, 28461, 27446, 12573, 18223, -17328, -33251, -28144, -5343, 26172, 31191, 24207, 29945, -6416, -4032, 3618, 13078, 4493, -6037, 2510, 18832, 17709, 17328, -3577, 9514, 685, -33501, -13502, -15130, -2941, -6995, -2610, 6603, 5424, 6861, -22170, -32970, -31265, -12776, -2211, -13134, -4002, -7992, 4044, 18441, 11850, -20488, -27844, -28319, -26273, -3916, 18333, 29494, 34076, 12575, -13553, -24325, -37882, -52372, -48879, -50549, -30639, -48910, -58836, -41421, -41284, -47606, -57990, -37383, -47957, -67786, -36453, 16322, -29897, -24060, -3587, 23874, 45921, 27999, 15066, 14752, 9843, -17025, -22567, -14539, 12866, 15676, 1759, -12974, -8742, 6711, 4089, -23245, -41349]
15741d1349J8750K4436J780k4840j9001j0761J2217j003J8830J8343K0451j277
15729A6576q377k7326J5982j5611k3995N99k395J1207K3252K6053k511l1401l4082
15716e2029r427K7345J7344j2297j1415j0925R864M6536L5536l348k3975j2297
15704I12p826m710k3191R959K5106J3658j0356j813L8629J3548q636m9214k3317
15691b7251L2407J0596k3039k4045P846J4858p86j7135O428j165K1948M789j6813
15678a1362j6918L6093P907j5908J0030n27k1109J9749k7j7262k291K88L673O754
15664i10l9823l2189J154K7860J2996p245q22K9771L3234n765j5276M782O449
15651A4216l2453n709j9448R729K5213k0702J4487R666q415J0727m699L6657j1616
$$ y = [-41349, -22599, 1837, 3617, -21223, -40224, -50985, -38768, -39771, -20941, -2598, 17853, 16576, 8199, -19127, -3145, -18756, -42751, -42152, -44547, -33340, -10088, 15965, 13454, -17947, -52029, -61456, -34111, -16767, -29064, -40479, -51404, -41540, 4996, 40532, 37184, 13209, 912, -6914, -11624, -34815, -24856, 250, 13908, 3552, 1739, 40368, 53916, 45280, -3934, -27251, 5156, 15752, -7287, -31332, -23486, -8628, -9414, -26549, -20121, -21286, 662, 5451, -11362, -28280, 7813, 15720, -188, 9842, 9315, -11794, 7955, 7928, -9334, -11625, -11337, -7664, -910, -40733, -72922, -71768, -43908, -30912, -38157, -38979, -9208, 24026, 18261, 2985, 7767, 14216, -18237, -23946, -43394, -33665, -8452, -29154, -14667, -5001, -13416, -2689, -7388, 29269, 17653]
15638A7653l2838l4591J5391M1753P075j3430k2686K3985J9248k4019j0590j1566
15626b4615j8336M866J2909j6111q277o155J4204K5524L432k1188j7385Q842p077
15613d9367K7887P312k4534j5291K5834M2020O385Q742k4115k2382n623J5179
15601g953j7575K5276j1623k7647o211K4267n452J9447K5057O508k3233m2840
15589d1979L697j3730K7772M6146K5228k0530j1303L93k1585l784r792Q557P862
15576c048K1131J7464j9827r602M5m874p956q563k212L1145j6153O41j6468k5417
15562d3694j1895K1959P142J2761J2351K4201K2543j0330l118L479k8848n514
15550A037J2113n138J608k1134m812N354L455o422K3642Q045m922K4052J7464
$$ y = [17653, -15185, -49776, -34385, 7368, 14443, 1013, -21673, 2312, 21560, -2459, -13049, -24615, -42951, -38085, -25176, -41287, -49564, -55719, -41515, -15991, -12559, -33747, -51132, -42290, -49367, -21480, -14168, -38702, -53993, -28159, 13861, 20246, 28988, 4873, -17509, -23132, -7953, -25528, -252, -11875, -39522, -45733, -21466, -26918, -7471, 17586, 24094, 861, -41979, -38282, -52012, -24240, 21906, 47134, 26604, 15301, 15694, -5891, -9675, -19467, -10910, -3048, 18083, 35547, 15720, 6118, 6163, 1289, -6667, -15230, -17442, 13703, -2450, -1809, -18277, -43694, -55589, -33630, -26488, -13727, -1376, 22825, 45368, 35038, 31920, 35399, 6551, 1037, 13150, 8012, 9620, -11514, -16326, -10972, -7517, -13939, 9703, 17748, 12826, 36878, 54342]
15537E4342m322j4077n119K5259j478j7099j4964j5714J9257R257j5410j3822
15525F110J1734n183Q120P388l3274k7343P244N2557P907l534J2557O150j2501
15512C7932j2944J2354j5210j6163k9660q89L2449Q037J6694j7512j3985k041
15500i38k5619l8567K0589K4989J7678J4524R83j7847J4178J900k3136l1015k618
15487d4899p927L095J8866O447J4304M975l252k7034l146J5951J2261L873j9062
15474b5548n529j6264J4032K8325J568k1568J674L974j0479k874L8217J6153R75
15461B2656r507J3748N531n160l9086J1246L147K360J9452J702j2329N088o377
15448A2471o767J794J7530J4438p868K912L274m2421k0739j8391K3977J422L963
$$ y = [54342, 50020, 35943, 30824, 56083, 54605, 37506, 22542, 6828, 26085, 35342, 19932, 6110, 17844, 12661, 20781, 28169, -5105, -32448, -25204, 27353, 35260, 31726, 44283, 50433, 37932, 24988, 37342, 22132, 5969, -23691, -24580, 7869, 15906, 32600, 15088, 1103, -938, -26557, -65124, -44535, -19546, -1868, 12656, 13639, -4208, 9970, 11870, -11266, -42281, -44899, -52826, -49731, -30865, -24418, -10114, -5139, -8391, -35425, -38571, -22620, -10359, -6486, -25548, -31077, -47341, -33309, -4984, -3416, -24984, -23310, -19336, -29815, -32689, 5528, 21681, 22656, 13149, 26897, 32428, 27268, -11818, -572, 2575, 4935, 24387, 26089, 13760, 18848, 12471, 5704, 7498, 25028, 39466, 31598, 34510, 37784, -4637, -25376, -43767, -19790, -18368, -14405]
15435a4405J3512K0925L989j1491j4941k2667J0813P379J7452j2510m65j2334
15423a4743J0979N702L487m602j1072M1518l2r993r990j8307J4207O884r927k4666
15409b0555n982j8879J7003J8927J5003J8908J871j8250p340J04l990j4543J1103
15396f620Q833k2744o226l847j7958Q02q153K0697N5240K4304k6813k8581j0873
15383b1939k144j6534K375L0723J9244J955m772k1920m2583j0947J8237R022k804
15370d2087j360Q240J0819q814L0342J5889k9343k0945k66J5761M3536l189j5403
15357C180k2838j6840K4879K9698l093j2871O724l378J2090p476k1430j3393j1454
15344c6202J5675L302j2036N838J066n601J0893q441o827K3218K5230l292k6490
$$ y = [-14405, -893, 20032, 24021, 12530, -2411, -25078, -14265, -6886, 10566, -1944, -2409, -14743, -3764, 1938, 5425, 823, -10249, 31269, 31237, 21244, 11254, -7053, 7154, 14038, 4111, -20555, -26537, -45416, -28413, -9486, 5517, 24425, 26296, 8046, 706, 810, -3180, -17723, -6620, 2213, -20531, -26757, -30604, -48562, -47760, -55913, -35216, 20024, 44328, 17515, -11066, -21939, -24083, -40617, -38242, -7519, 11725, 13680, 8908, -13012, -55595, -66542, -48305, -39283, -42087, -43447, -35207, -24388, -33202, -2860, 13029, -16314, -37259, -37525, -21764, 21772, 18583, 3180, -19658, -36498, -11619, 18079, 14986, 2115, 8839, 5461, 17551, 10075, -11355, -24748, -36202, -20527, -17225, -29261, -23423, -22357, -27958, -17065, -25506, -32333, -9115, 16115, 12823, -13667]
15331a3667j1771L325j9402K45N3565k3845l4681K1574K3681K397p164m766J0208
15318c01q131j2342r63J9122J7269k6206l0292p854J4860j701p929J4949K3783
15305e736J8812J0184l4237Q829Q958k366K98l6494k213J3518O522L849m063l3917
15291d8056l685j1548j962L1347N26K2689N930K8169K079k5905j6792L5547J4219
15278C2558K018l462L192J5262j6013o745N478N343K3581k0854k7696j8904K4732
15265A8490Q49j0620J5584l673k5100k5338K6463K3955J4583j554r663Q730k6535
15252F171q714j1607J4964K8029J5821j5181m799k215k6258K32m060O902l394
15239d109k435j1976k8766K4746J2176r301l882l536M896J1508l925Q998j0902
$$ y = [-13667, -25438, -22113, -41515, -41270, 12295, -11550, -46231, -24657, -976, 1421, -5743, -10509, -301, -8432, -20774, -21737, -2615, 14654, -11552, -41844, -49698, -34838, -36539, -44468, -29519, -5736, 13076, 23260, -10977, -2148, 6810, 4444, 4742, -31752, -33965, -20447, -13925, -10076, -14139, -48056, -51741, -63289, -65251, -33904, -33378, -10689, -4759, 23410, 25489, -416, -17208, 18339, 32558, 34576, 31114, 34306, 49568, 33555, 26810, 32288, 37631, 61212, 40358, 12662, -6242, 18490, 19339, 8719, 24303, 20630, -4470, -29808, -3345, 20610, 35193, 33639, 23976, 32706, 6171, -2543, -14150, 814, 28843, 44664, 29483, 24684, 22469, -3789, -3557, -7617, -715, -4109, -6544, -18520, -47286, -22540, -10364, -19665, -23547, -27083, -22187, -10679, -14604, -5606, -16508]
15226a6508k568q444k8091l8046j6591K2774L8605l852J3896L1945L5776Q887
15214C7783l322J3178o447l6005l1226J2623o096r27J2159P170M069J0414l351
15201A0022J9567R475p490J5724m3327m3044k0134J4512J0020L2115L2037K6816
15189E6293L694K2381J8485L6234O0210L2918M0194k3614n3518m4931o1328l0108
15177E6910k1247o808j3248l1261J3583L8608m403l600P455k2498k2721M0129
15165C0899M6014J2912l0408m5378j7184J5606k861j7886M439K5195j7694P857
15153A1511L622l7063J4720K1304k4179m5850k0718J6330L4877L0822O65j3994
15141g953j6826K9777L7362O350n0333L11j875R822L3922l1763l7439K292q891
$$ y = [-16508, -19076, -27520, -55611, -93657, -110248, -87474, -48869, -52721, -38825, -6880, 28896, 37783, 34461, 47639, 41192, 5187, -26039, -13416, -19512, -20439, -8280, -1110, 2959, 13373, 10022, 29589, 39064, 31574, 47298, 3971, -39073, -59207, -44695, -34675, -2560, 29477, 56293, 59987, 82368, 100853, 137087, 197297, 230215, 270409, 246795, 193277, 148346, 87018, 56910, 35663, 28855, 15607, -15654, -2071, 36537, 32134, 28534, 35989, 13491, -9230, 30899, 76913, 89825, 59417, 14039, -3145, 12461, 9600, -8286, -3847, 21348, 3654, 11511, 15133, -21930, -7210, 14094, -10085, -55935, -76653, -60323, -25446, 5376, 6041, -7953, -24779, 4998, 42360, 48710, -1623, -1312, -3187, 6635, 40557, 8794, -28645, -26353, -35244]
15128c5244J7268r444P377p536K4368M635l1678k1284j2492K0221J9050R625K235
15115a2899m070l0860p710L1744M5707j5800k3946J1965R694k0615O061K4670
15103A3941q92k0984J326O115j2196J3714n024N902j7435j2056P262K6972m294
15090B351K463R119n092Q488p882q15L4763j839o408k8176j7322j1647K4529K776
15076E308o265n420j3311J8779l854j2296k2202L641K7131K8413p675k849K098
15063A1498j8114k2074K4985q592p966j0441K4284k952m1710L1765Q319j125Q291
15050c832L0116L2467j9950j1324j6076j1920M519j0612k0083J4610L128o930
15038a5887k1552K8477L3300K213L471j0979n45j6296j0463J4516P358N517N722
$$ y = [-35244, -17976, -27420, -20043, -27579, -3211, 1424, -30254, -51538, -64030, -43809, -24759, -15134, -12899, -16969, -47829, -55539, -23795, 21912, 6112, -17834, -5869, 3825, -16790, -10729, 13941, 13049, -7935, -6609, -494, -12690, 1024, -4000, 1902, -15533, -27589, -20327, 6645, 2351, 4814, 13933, 8841, 17329, 9447, 8632, 43395, 41556, 35148, 6972, -10350, -21997, 2532, 5308, -957, -6377, -19688, -909, -4763, -17059, -39261, -35620, -8489, 19924, 12249, 9400, 11498, -6616, -28690, -3705, -12297, -20263, -30704, -6420, -9372, -51082, -19317, -10998, -12123, -3832, 26284, 58751, 38801, 27477, 11401, -519, 4000, -6612, -26695, -12085, -8957, -15887, -37439, -8962, 24338, 26551, 30022, 19043, 18498, 2202, -8261, 6255, 13613, 19130, 24852]
15025B4852k3555k4409p099L32q359L164K165j178J0594J9631J3867K12j0340
15012a23p596k378K8425J4311j1787j0962R403O817K931M561m918j6314j5116
14999b746L5188M570k5268k1237J1756J9579j6535N431j0768n296j5855M782q709
14986b5108m432J0711n155K9498M9376O281k1493l0033M74m546r764O457N352
14973G618M539j2087k676p321l1061K4889J7522P948k2920j704j5100j4096J6238
14960b8211j965R111K9438J8020L052J9177l264m8495l7139l365L6332k3118m028
14947c4455M592K9737j8674n017L1741K6188J0897L376j5957J2254r676q906j1754
14934A4346l3996k8653l001N313j7452J1680K6676K204k946L9015Q953k7728l2529
$$ y = [24852, 1297, -23112, -30211, -29879, -38238, -35074, -32909, -34087, -23493, -3862, 10005, 10217, -123, -7719, -10097, 18328, 32639, 20852, 9890, 19293, 26110, 29041, 33602, 28684, 12370, -2746, 32442, 37012, 11744, -9493, 2263, 21842, 5307, 10738, -30, -5326, -21181, -16399, -25108, -29540, -18829, -23984, 5514, 54890, 61171, 39678, 9645, 10119, 5573, -4191, 2266, 7618, 12157, 70, -2606, -9927, -40988, -16099, 1423, 9371, -13549, -15253, -30353, -44449, -28211, -30176, -21065, 8373, 26393, 29445, 48622, 45358, -3137, -40276, -43641, -7309, -30427, -34455, -29863, -126, -18800, -23817, 7924, 34112, 45009, 48385, 32428, 44682, 35006, 26100, 14346, -19650, -48303, -51304, -45991, -63443, -51763, -25087, -22883, -25829, 13186, 22139, -5589, -38118]
14921c8118K0101l391J1487L5875q62l8021p579l09K8838K7058q544R706q58l0210
14907E173n732K4993j2968J958M209j9229M004J354J371J0072O727M117m812j1270
14893I967k2059j5748p702Q927J6120J2890K1980J0779K7375j183k5785l5983
14881d22j7114j184J3198r423j3544j0685K4726k507J3059J4112l741j1048j884
14868f457K3412J980j1721M660m970J0811J7111j5655k4476k106J4645J6271l331
14855B0174L64J0945O158K2527k6918l4378N39J6803j0338K5445p606l280L5057
14842E5492l5754k5513O396K9810K517l5258J2589L3732J7315k6514l2143l2763
14830c0094O7L7100o409J4284K3370j7670j8068j2521j0475K0116K5585J5400
$$ y = [-38118, -18017, -21408, -9921, 25954, 25092, -12929, -20508, -20817, 8021, 35079, 26535, 36241, 35383, 5173, -559, 24434, 11466, 13424, 17633, -1596, 2408, 3762, 5133, 15205, 21932, 26049, 21237, 9967, -12092, -27840, -35542, -26615, -10495, 2395, 24375, 35154, 62529, 61346, 35561, -422, -17536, -18720, -5522, -14945, -28489, -39174, -14448, -16955, -3896, 10216, 6475, -4573, -6457, 16955, 18935, 7214, 11874, 6904, 17715, 34826, 19171, -5305, -7411, 7234, 23505, 20174, 20538, 31483, 37641, 60168, 33250, -1128, -589, 16214, 5876, 31321, 23715, 20435, 55492, 19738, -5775, 621, 30431, 32948, -2310, 10279, 44011, 61326, 34812, 2669, -30094, -30027, 7073, 664, 14948, 38318, 20648, 2580, -9941, -20416, -300, 25285, 40685]
14818D0685k6062J0239M068m389K030j3257M271K0747k1798l8947K7393K5976
14806C0956j1074j3697j8399m56o478N8826K3535j0937k7938j6424l897j2803
14794h786k0670l643K3551J0083P5K0851J2229m275n243r073n370P525K7300Q041
14780E2595j8407j958Q597j0279L067j3131k0946o324j6974m64j136j0430K2791
14767a2999L7070j4507k9181m209n446L483K365j0008K386J4329k4057o517J5686
14754c1605K7165M4295k482l0184l4449k746K2538M408K4372j5371k4583L104
14742a5538L956K4447J3491j1060j9203p287j5453j4272j4242J849k8645P917
14730g4040L1803Q645j3076J4700K5322J3211k7125j8043J8142M623m710k730
$$ y = [40685, 14623, 24862, 28930, 24541, 26571, 13314, 17585, 38332, 16534, -22413, 4980, 30956, 19882, 6185, -12214, -12670, -19148, 39678, 63213, 52276, 24338, 7914, 4017, -8786, -29456, -33099, -9548, 535, 610, 21461, 33690, 29415, 24172, 15099, 9729, 17254, 44554, 52595, 34188, 32230, 40827, 30548, 33615, 20484, -462, -6786, -23760, -24224, -25360, -35790, -12999, 24071, 9564, -19617, -23826, -29272, -25789, -23424, -33432, -31046, -16717, -40774, -47291, -31605, -4440, 39855, 37373, 7189, -27260, -30006, -7468, -3060, 21312, 5941, -18642, -15538, -11582, 12865, 26356, 15296, -3907, -11194, -26647, -40919, -55161, -53312, -81957, -74040, -42237, -33592, -46668, -31968, -6646, 6565, -20560, -38603, -20461, -15838, -20548, -23278]
14718b3278o570l072j935J8455J119M232J5489q578o906R588J3629L0729J4634
14705E7536k9541l8179j0828K4127K7091K005M775j0442k1602k6688k4373J6291
14693b9828L3778J9869J5731k0035k9244k1586K6577J527J1024k1030k4876l735
14681d1828Q133K9925j558j7336m19J6379o928j6138P366L1455J9920k3910k5427
14668b0366M578K0402M782j0464q218J2713K0224j000K0967K0595k3408k0870
14656A9935j3470J290K8852J3315o802j3455O300J2650j0479j9799j209L217J5004
14643C5349L2270m4006k2183k422L438p811r139m753M754Q206p087L0654J067
14630A8337J197K0651j1152j9051J9354J8126K4612n433k2032j0550j8300J1033
$$ y = [-23278, -29848, -32920, -34855, -16400, -15281, -11049, 4440, -4138, -11044, -1456, 12173, 42902, 57536, 27995, -10184, -21012, 3115, 30206, 32211, 36986, 26544, 4942, -21746, -46119, -29828, 3950, 23819, 39550, 19515, -9729, -31315, -4738, -3211, 7813, -13217, -38093, -41828, -33695, -3770, -5328, -22664, -23083, -6704, -13632, -29770, -22404, 9051, 28971, 5061, -20366, -15788, 4614, 9396, -1068, -9286, 3427, 23651, 22651, 43618, 64213, 40805, 19935, 6465, 7755, 36607, 49922, 43120, 29665, 35965, 48615, 38136, 18337, 17128, 20345, 35349, 67619, 23613, 1430, -992, 2446, -5365, -14504, -19257, -14503, -6297, -13384, 17270, 18337, 19534, 40185, 29033, 9982, 29336, 47462, 72074, 66641, 44609, 34059, 15759, 26792]
14618B6792J2654j676j8052k606K4602L22Q400J0377K2450o930L092j0298o989
14605F2138j2358k2804N008N229J8479p547r528j1964O117j0917m873L783K1654
14592D2417J8722p328l935J1866J269N6J3918O207j8294l187q231Q702o248k540
14578E3394j8996k9034k0305M9976L1731o572j6750N917j7269K4304r077R355
14566E6674O204K79j6575M074j5739j2629N766j0890k0171K7318n857k6609O117
14553b038J7701n996p93L863K4365j3465N942J7439K210j4596j0611j0288P887
14540B1620K6620J5779k0244o329k1644K703L6096N086j1618P977K5568l840N799
14527H3573q425O269K762m937j59L087j101J5679l1282o838J577K1163k0202k830
$$ y = [26792, 39446, 37770, 19718, 17112, 41714, 42036, 50436, 60813, 83263, 76333, 79425, 69127, 62138, 49780, 26976, 31984, 37213, 55692, 48145, 38617, 26653, 32770, 21853, 16980, 20763, 42417, 61139, 53811, 49876, 61742, 63011, 63067, 76985, 83192, 64898, 61711, 53480, 62182, 55934, 53394, 34398, 5364, -14941, 35035, 66766, 60194, 43444, 49361, 32092, 56396, 47319, 56674, 62878, 63157, 46582, 50656, 34917, 22288, 28054, 17164, -3007, 24311, 18454, -8155, -2038, 15663, 9667, 8874, 12737, 37102, 23637, 29579, 47018, 49228, 34632, 24021, 13733, 21620, 48240, 64019, 43775, 37446, 15802, 18505, 54601, 59687, 48069, 56046, 81614, 77774, 83573, 75148, 81417, 84179, 79242, 79083, 82170, 81069, 96748, 65466, 58628, 60205, 81368, 61166, 58336]
14513E8336j2026R988q092K954j7839j1770k898J4038k0241R339l764K128n566
14500A4587j8253J4235J3195k032j119j1291L958J3930J2533l5870j4951Q8l965
14487a4955k8577J0091J4048K4567R414r068K3284K87j8253j5773J1947J3184
14475B0196O235J71J2442J3896o668J2391o072l9779j134P289L891m358l607q862
14461F031M782j0746k859L1878L4945m7652j9103k0582j9934K6149L115j5954
14449b9930n45J4138k372j1342J2634J5964j4845j1479P309K2387j5547l3590
14437d7218J2368K3210L2521k1893k2907j4103j6094k6215N151L4611K0629L343
14425a6597m574R117q87K2253Q804l208R9j1784j3169j7395K9606k847k2965q837
$$ y = [58336, 46310, 56298, 48206, 51160, 33321, 21551, 18653, 32691, 12450, 21789, 18025, 20153, 14587, -3666, 10569, 23764, 21732, 20613, 9322, 13280, 27210, 39743, 3873, -11078, -10990, -14955, -43532, -33441, -19393, 5174, 14588, 5520, 28804, 29091, 10838, -4935, 7012, 20196, 26431, 26602, 39044, 52940, 46272, 58663, 52591, 12812, 11678, 18967, 22858, 18500, 14893, 6031, 10813, 67, -2792, 29086, 64031, 16379, -2724, -23306, -43240, -17091, -13976, -29930, -30475, -16337, -18709, -30051, -17417, -1453, -16298, -27777, -20468, 1919, -13628, -47218, -34850, -11640, 20881, -1012, -23919, -38022, -54116, -80331, -75180, -40569, -19940, -16597, -21171, -12054, -12941, 9312, 18116, 14908, 15007, 3223, -9946, -27341, 2265, -582, -23547, -32384]
14411c2384j0214L4116L3183j8506j3607J0430J9958N979m5715j107K7045o382
14399B796j5413K1366Q25j2905l547K608L349m783k3029L5189J8350j6497k2547
14386a4238J7792J2063J2209L5984j870l9316M152N471j2191m462j1540k6449
14374b2395l347J8843J9180r147L4316L175k4902r936o578p477N392K0561N05
14361A8190j3221J8194K8632K0825p780j1313n0218l577k0162m816K7005M769
14349F528k9616k1302N114j0936J4876O424J8872R369K9742K1270j28R976k9403
14336C0786n357P717r815k6834J4109K2339p079k403j8312O37M317M300J6910
14323C1315j7793j1959L1658j0540j3522J578L1268J012l0720J5668L2565n712
$$ y = [-32384, -42598, -8482, 24701, 6195, -7412, 3018, 22976, 28955, -16760, -17867, 9178, 2796, -12617, 8749, 9574, -3331, -6878, -4270, -921, -5704, -28733, 6456, 24806, 8309, -14238, 3554, 15617, 27826, 63810, 61940, 22624, 26776, 32247, 20056, 15594, 4054, -22395, -25742, -6899, 12281, 3134, 37450, 40625, 15723, 5787, -791, -8268, -2876, 17685, 18190, 4969, 23163, 51795, 72620, 64840, 53527, 3309, -268, -20430, -25246, 1759, 6528, -23088, -44390, -39276, -50212, -35336, -28912, -10040, -671, 29071, 50341, 50213, 60189, 30786, 25429, 33146, 23331, -3503, 10606, 32945, 25866, 23463, 5151, 5788, 10105, 14405, 31315, 13522, 1563, 33221, 22681, 9159, 10737, 42005, 43017, 12297, 27965, 60530, 54818]
14311E4818m6623k5874K452o441J0876N165O195l3308j6667M2429K3606J5573
14299C2201K8011j232m7910l5388q06L360k2699k798P22Q838J6674l7250o603
14286f4880L5258J4284k146K0577L0597k990k6744j3271J839k775l742J2234q200
14273i959k665k843L198N988o720k4833L109J3880K499o759o950J5994Q188Q167
14259B94p252N631j8408k5152q042p749o477J8924K5400j896m403K4392N815j487
14245d10L4410M2739j7927J8099k0926k4140j1809k4216P32Q185J1478j6505j0806
14232a1096K549M139o608o728L084j509K8701L895K8023R389k4877j8155m842
14219E965k7622L323L5557O654j1737J0049j5457L832r226Q560K0067j8907R863
$$ y = [54818, 8195, -17679, -15227, -21668, -10792, -5627, 568, -32740, -49407, -6978, 16628, 32201, 60212, 58980, 11070, -24318, -25124, -21764, -44463, -47261, -46539, -37701, -21027, -58277, -64880, -29622, -15338, -17484, 3093, 33690, 30700, 3956, -9315, -7476, -10251, -13993, -1759, -9959, -12624, -15467, -12269, -6281, -13001, -37834, -34725, -20845, -18346, -25105, -32055, -16061, -7873, 294, -6958, -1327, -19735, -44887, -52929, -60678, -67155, -48231, -22831, -24727, -29130, -4738, 1077, -410, 34000, 76739, 58812, 76911, 55985, 31845, 20036, -4180, -3448, 4737, 16215, -290, -11096, -8547, -4408, -11016, -17744, -14660, -16169, 12532, 16427, 44450, 53839, 28962, 10807, 5965, -21657, -18334, 17223, 23877, 12140, 22189, 6732, 10564, 1338, 9898, 29965, 11058, 20921]
14206B0921O337P291K2088o151q755j2418Q005J863l7529l5117N38R710J0022
14193a3195L3945N266K7130K4837l6892J3458p803l0635j396L323j1181L5697
14181D2554K2762m2473l4512j1148K0872N5898N934l7307j2978r466Q291K2349
14169C0776j3850j997J9473J0707J1571k0899p593J0951j1251r942j0237p88K6366
14156C3287K3166j535k5791l693K084R576k0618k2096K5612J2867k4733j9855
14144a1729J5969J6445q634J1528P07K778J9830N38j9158l3554J5664J1158j3711
14131G831L742p648J3865J357j03o067p164Q309n953m076j5431L2728K9089l685
14117D6794M018j210j8502O219O391K448k7331j0503j7026o711O521L3327M3179
$$ y = [20921, 27258, 34549, 56637, 50486, 41731, 29313, 37318, 39181, 1652, -33465, -32927, -23217, -13195, 20750, 26016, 53146, 77983, 41091, 54549, 46746, 16111, 14715, 18038, 6857, 42554, 65316, 22843, -11669, -22817, -1945, 53953, 59887, 22580, 9602, 136, 8427, 30776, 16926, 14929, 34402, 45109, 56680, 35781, 28188, 39139, 27888, 17946, 7709, 6921, 33287, 56453, 54918, 29127, 25434, 27518, 37094, 16476, -5620, 19992, 32859, 8126, -11729, 4240, 20685, 12051, 23579, 24286, 27064, 46894, 47432, 28274, -5280, 10384, 21542, 7831, 11573, 3925, 17790, 19147, 19044, 12977, 5813, 14122, 8169, 4093, -11338, 21390, 50479, 46794, 50812, 49602, 31100, 37319, 43710, 46158, 18827, 8324, -8702, -15413, -8892, 24435, 67614]
14104F7614r078l76j6627k0460p283J7575P730k8894m740j1195j3686Q061P101
14091d258P383k358k0301j4710L7536J1167k4698j4722j2930L8321L6060k6135
14079A0355r876L1445m578j2062k0857n279P482J012n916r300j03K6536m6176
14066c7317k1639K8323K5596j0873K2867J7286l0829n049k727j6923j214M6068
14054A3569K8445J685k62p476K1862J4850j9597o801l178j0891L596M6056M4429
14041A26287L2538j3747j6920j7187J481k068K5736K6347L3759P4111p27n5005
14029B14605o6046m1579l8912j6353k9784p859M314O2822M1657r311k0289l5750
14017E7515j4345k166O838K7332j8280j5569l4145l1595O814L1152j4020J9962
$$ y = [67614, 58536, 58160, 41533, 21073, 13790, 31365, 39095, 10201, 5461, -5734, -19420, -11359, -4258, 3125, 767, -19534, -34244, 3292, 14459, -10239, -24961, -37891, 430, 36490, 10355, 479, 31924, 27346, 15284, -5573, -10852, -3370, -2358, -8274, -17574, -17677, 8859, -37317, -58956, -30633, -5037, -15910, 6957, 24243, -6586, -11635, -14362, -31285, -32499, 13569, 42014, 43699, 43437, 35961, 57823, 72673, 53076, 46275, 43097, 32206, 35802, 81858, 126287, 158825, 145078, 128158, 110971, 112452, 110384, 136120, 162467, 196226, 270337, 269610, 214605, 148559, 106980, 68068, 51715, 21931, 14072, 18386, 81208, 122865, 113554, 93265, 57515, 43170, 41004, 47842, 75174, 56894, 41325, 7180, -24415, -17601, 13551, -469, 19493]
14005A9493n916K653L0404P91K489m3455l1722K1977j849o136j1888K8789Q573
13992A4203k5124k1279l5409K4251K4602j5507n755q764J2703L0419K3362P642
13980B5344k550j4615P078K0380k5310l742K667J6776l5838m6959O924K3347j6501
13967d2999J6549J3424O408J4836K7224P286k4444j4855j4178l1032K0026j7694
13955c9449J4719L0984j163J8119j0102r105J9696R951j3931j6314m543k8307
13943b9445j3192K6846K0516J5661J0822K178j9858o008j6196m055J1299K7908
13931B6476K3196k6226l0713J8123o642m423m747K3209P089j6964O937k2305j692
13918h682j1003k6576J2812M6078l1461J1237J8691K735M866K479q383o187p119
$$ y = [19493, 13577, 16230, 46634, 47425, 49914, 6459, -25263, -3286, -5135, -11271, -23159, 5630, 14203, -10921, -32200, -67609, -43358, -18756, -34263, -40018, -48782, -36079, -5660, 17702, 25344, 22794, 8179, 15257, 35637, 10327, 6585, 9252, 26028, -9810, -56769, -49845, -26498, -42999, -26450, -13026, -6618, 8218, 35442, 42728, 18284, 3429, -10749, -41781, -21755, -39449, -24730, 6254, 5091, 23210, 13108, 4003, 23699, 33650, 19719, 3405, -1138, -29445, -42637, -15791, 4725, 20386, 31208, 33386, 13528, 7520, -8676, -12731, -1432, 26476, 49672, 23446, -7267, 10856, 4214, -209, -4956, 18253, 25342, 8378, 15315, -6990, -8682, -19685, -46261, -33449, 12629, -18832, -7595, 11096, 13831, 18697, 21176, 12793, 6606, -513]
13905e13l255J0875J1320l2501J0141J8959J0923j6381j0724j6613K2893J7398
13893B2522l007J3660J715r427L2677L2381l0728j3368J7751k5050p084P19P895
13880D0656P048l1470n674K4772J9167j2875J1815K8173O389n00j7085k2226j0930
13867C7260o343j135K326j1753k4931L2030P563K6515m539k3435k9047n649K4708
13854B3570J7730R386O965j7879k2922J7123K3223J3316j7511k1822m0718j774
13842a1313j4195K233J1340P17k5770M188J5535J7437J996k6136q897J6945K4365
13829H445M989j8565p674O214K600P521n891K2055M932P830J231K3503L0378L9705
13815A27273L918J7996M2356N0992Q2427N7736k2783p4728o5906p5386k9899n673
$$ y = [-513, -3768, 7107, 18427, -14074, -3933, 15026, 25949, 9568, -1156, -17769, 5124, 22522, 19515, 33175, 34890, 25463, 58140, 90521, 59793, 46425, 64176, 39126, 32042, 32761, 40656, 47704, 16234, 10560, 35332, 54499, 41624, 53439, 81612, 88001, 87501, 70416, 48190, 37260, 30917, 29782, 32108, 20355, -4576, 27454, 35017, 61532, 56993, 33558, 4511, -1138, 23570, 41300, 50686, 57651, 39772, 16850, 33973, 57196, 70512, 53001, 31179, -9539, -11313, -25508, -23275, -11935, -11218, -36988, -32800, -17265, 172, 2168, -23968, -32865, -15920, 8445, 13434, -5131, -12805, -6591, -3991, 3530, -2361, 19694, 24626, 32456, 33687, 57190, 87568, 127273, 131191, 149187, 191543, 242535, 324962, 382698, 359915, 285187, 219281, 143895, 113996, 108323]
13803A08323k0098q661J7537Q27j6745j8565L1817L7998r634o387L081L5150k574
13790A52069j916L7385L2345K3563k5216K553M3941Q0882P4547M7666k9936n8984
13778C78899q0111p3117j8596Q731J1753k6252n0587j7740j0186j4969J1778J6025
13766A35628r797o949k7033l615K848J3690J9415o802j0108J6632K6781O2880
13754B13570R6003P6951R767j5910q8633q9924m2454l2731m5362J3539l781l7059
13742E3976p332J1471k5717o174l535L79N749N733O202K7922k5973j4984K3304
13729E1021l2043k1759r217J0607K2052N38j0393j787k1154O582n09L836m944
13716g170J4133J3025j6258l5066L075K3009n251O602j3390m810j676K3861L6468
$$ y = [108323, 88225, 79564, 97101, 97928, 81183, 62618, 94435, 132433, 122799, 116412, 119493, 154643, 152069, 150153, 187538, 219883, 243446, 218230, 220783, 264724, 345606, 420153, 467819, 437883, 378899, 298788, 225671, 207075, 215806, 227559, 201307, 150720, 132980, 122794, 107825, 119603, 135628, 125831, 118882, 91849, 88234, 91082, 104772, 124187, 117385, 107277, 123909, 150690, 213570, 309573, 386524, 396291, 380381, 291748, 201824, 159370, 126639, 81277, 94816, 91035, 53976, 46644, 58115, 32398, 26224, 22689, 23068, 28817, 34550, 40752, 68674, 42701, 27717, 51021, 18978, -2781, -11998, -1391, 20661, 21199, 10806, 9019, -12135, -5553, -6062, -2226, -7170, 6963, 19988, 3730, -31336, -28261, -5252, -10503, -3901, -17291, -22101, -23777, 84, 36552]
13703C6552J2619j1293j9635L7514o104j0495k4420n765j580J5531J7066M431
13691D4421k2828k1701l7272L8357M2715K7601k9882j2549P918N083r369l9707
13679g213N799N4989j227n3722j737J1408N140N102J3516L9181J5263J5524k3697
13666G8326m977k1630j5072k0214j574J9971J4780l1703J3446J2629j6253K2968
13654E0697R634K9549k3381n3055M139j3972q178Q177N541K1315J4704k9891l5157
13641a9878q656K7948L144J2337k5997j6176J122J6371K2043N0079K2829j0150
13629G5016k6853k3314J2452K1143K207r149P895k2538m9575n196K8036l091l5756
13616b8723j2769L907M673P302K4715M919K734K7460R494j8818j0518R855K0796
$$ y = [36552, 49171, 37878, 18243, 55757, 49653, 39158, 14738, 8973, 7393, 22924, 39990, 44421, 21593, -108, -37380, 977, 43692, 71293, 41411, 28862, 36780, 41863, 32494, -7213, -1414, 53575, 52348, -1374, -3111, 8297, 13437, 18539, 32055, 71236, 86499, 102023, 78326, 73349, 51719, 36647, 16433, 14859, 34830, 49610, 17907, 31353, 43982, 27729, 50697, 60331, 89880, 66499, 13444, 17583, 3611, -4567, 3610, 9151, 30466, 45170, 15279, -19878, -28534, -586, 2558, 14895, -11102, -27278, -26156, -9785, 12258, 62337, 85166, 75016, 48163, 24849, 37301, 58444, 60651, 51502, 59397, 36859, -12716, -17912, 10124, 7033, -28723, -41492, -37585, -32912, -25610, -895, 4024, 6758, 34218, 43712, 24894, 14376, 24231, 45027]
13603D5027J7459q958k0054J7251L4667K4409L50J375Q554k3730m6455n1270m21
13590a796J2081L0431K4455K3671l5836m1065K4128J7563p045j4973q085J1737
13578C5266r948J7715M1618J5811K2606k0251k123K2409o385k3416K9618J8860
13566A41780m2874K2786K5922j2933N084K7835K2314R113j0639j8573k0599k1188
13554A28028K2224N856K4352K7975j2908j5783l2764m2530k7247J4081K3839R72
13542A16095N93k5881j1630l441o436Q16O368L1015k2105k2507L30k0323j4950
13529B7944n001m027j378Q127j6566M732J2025k717J5505K6493L5343j8991l9121
13516D2368j2601k022J3849J8207J1365m0390l3691L6952L6056K6522P340j3791
$$ y = [45027, 62486, 53528, 33474, 50725, 85392, 109801, 110151, 111526, 120080, 96350, 49895, -1375, -1796, 10285, 40716, 65171, 88842, 53006, 11941, 36069, 53632, 46587, 31614, 23529, 35266, 25318, 43033, 84651, 100462, 123068, 102817, 100694, 123103, 116718, 93302, 122920, 141780, 98906, 121692, 147614, 134681, 139765, 167600, 189914, 199027, 188388, 169815, 149216, 128028, 150252, 156108, 180460, 208435, 195527, 179744, 146980, 104450, 77203, 91284, 115123, 116095, 116688, 90807, 79177, 75736, 69300, 70116, 76484, 107499, 85394, 62887, 63217, 42894, 27944, 22943, 18916, 17538, 25665, 9099, 13831, 25856, 23139, 38644, 65137, 100480, 81489, 42368, 29767, 27745, 41594, 59801, 71166, 30776, -2915, 34037, 70093, 96615, 103955, 90164]
13504I0164K0231L2791k4419k4340M406j2631J1602L740m256J7192L7519K1296
13492A73295r49K9640K6563J7486l112N916j3697p401j7630j0051j2197J8344
13480B06207k841r98K1354K5801K8917j0792j1097l1546j0412n102j3262r869
13468A86360m89K8005M444P373L0304L6856j0824n4299k4446l7243l1944j25J2918
13455A46890K4635k3790j5979L1918J4334R019j6653l5022L758L1750K2390N132
13443A98382l032j7674L6325l579n591J6467O063l7506k8923l4711k2757J5325
13431A18789j3504j8580J5018j1572l1355J0595M2013J1366o412j5661J2306o247
13419A06756J5281Q597j1979j0310Q811J6904j6122K3470L4432K1136K0705k362
$$ y = [90164, 110395, 143186, 118767, 94427, 98833, 86202, 97804, 101544, 97288, 114480, 151999, 173295, 172346, 201986, 228549, 246035, 242923, 248839, 235142, 227741, 210111, 200060, 187863, 206207, 203366, 202368, 223722, 249523, 278440, 267648, 256551, 225005, 214593, 209491, 196229, 186360, 185871, 213876, 218320, 225693, 255997, 292853, 282029, 227730, 203284, 166041, 134097, 133972, 146890, 171525, 147735, 131756, 163674, 178008, 187027, 170374, 135352, 139110, 170860, 193250, 198382, 195350, 177676, 214001, 210422, 204831, 221298, 227361, 189855, 160932, 126221, 103464, 118789, 105285, 86705, 101723, 90151, 58796, 69391, 111404, 122770, 116358, 100697, 113003, 106756, 122037, 130634, 118655, 108345, 117156, 134060, 117938, 141408, 175840, 196976, 217681, 215319]
13407B15319l8654j1089J4444j4140k5133R509qo884J5910k735j1409J4519J006
13394A60655l252L1585J5787K0706N055J2918K2531L1004p580O095k573J629K7924
13381C22484L4314j3755K222L5944N7186M4676J6068k4983J6607L3310K7678M8945
13369F00696K2856L9296M7860Q7755P5793P7905R5298J14696J53308J95510K08838
13358A719811K77097L22795L33827L52355M30674N53701Q01036J245491J860245
13349G897032K863507M344459O612090J0079982J4474170J6213230Q910320n297733
13341F6097057j4556682j5131745j0990342o706697l936578k314413j241606m67829
13333A0751165K79098J108334K148309L020384K280339k56250j842824j462555
$$ y = [215319, 176665, 165576, 180020, 165880, 140747, 150256, 150248, 143364, 159274, 156539, 145130, 159649, 160655, 157403, 188988, 204775, 225481, 230536, 243454, 265985, 296989, 289409, 295504, 292931, 294560, 322484, 356798, 343043, 345265, 381209, 438395, 483071, 499139, 474156, 490763, 524073, 551751, 600696, 623552, 662848, 710708, 798463, 874256, 952161, 1047459, 1162155, 1315463, 1510973, 1719811, 1996908, 2319703, 2653530, 3005885, 3436559, 3990260, 4791296, 6036787, 7897032, 10760539, 15104998, 21717088, 31797070, 46271240, 62484470, 71394790, 66097057, 51540375, 36408630, 25418288, 18711591, 14775013, 12460600, 11218994, 10751165, 11030263, 12138597, 14286906, 17307290, 19587629, 19331379, 17488555, 16026000]
13325A6026000K25407K429817N049513P897095Q571901M480918M41527J673914
13317D6796092O760014J1237617R714505J119482q672259j2864656j0531817m998769
13309C8560209N88708L192780k90880o001540p830881o206277l475226j041985
13301A7494908Q83604K003596J139069j572738l155272k866441j638388m02318
13293A1886020O67005J784381L197356N160156Q177651J2500014J6768800J5461134
13285G5602517L090397j1808689j7712125j5363286j0282409o204461l767734
13278A3554210k420203j708636j289963j065686q53103o67384n35323m48282m57062
13269D108568m96316m68152l77987l09303k55574j87791j06794o7153o2621r7574
$$ y = [16026000, 16251407, 18681224, 23730737, 31627832, 40199733, 44680651, 45122178, 46796092, 53556106, 64793723, 74508228, 75627710, 66955451, 54090795, 43558978, 38560209, 39148917, 42341697, 42050817, 36049277, 28218396, 22012119, 18536893, 17494908, 18378512, 20382108, 21521177, 19948439, 16793167, 13926726, 12288338, 11886020, 12553025, 14337406, 17534762, 22694918, 30872569, 43372583, 60141383, 75602517, 78692914, 66884225, 49172100, 33808814, 23526405, 17321944, 13554210, 11134007, 9425371, 8135408, 7069722, 6216619, 5549235, 5013912, 4565630, 4108568, 3612252, 3144100, 2766113, 2456810, 2201236, 2013445, 1906651, 1839498, 1776877, 1679303]
13259A679303j50766j01119q4555n3073n3779m4962K0736L9001P8320J43789J75004
13248A647899J19121k6121j90258k48846k36734j29751q5597o7285m6376o8711
13238F67341n0344k5079l3551k3239M378l4836l1081J7812K5538K1734m846l8131
13226D95696l5181j2141k2565m2627n8965j7809l244j921k5624J8522J0465n334
13214B99272K5037K3328j0710l7624k4058j5487j7529n4188k7949M9L7188K6756
13202B24085j6907k6121j4611n69j5881K0409J2624l7773l9612l0089r01J5392
13190I0046j167O074l645l585l254j6144j7907k4307L1348J0229K9553O608k8667
13177G5182l1155M0340N7002M9740L0479N943J9730L9012K5998L1532K6341p291
$$ y = [1679303, 1528537, 1427418, 1342863, 1289790, 1236011, 1191049, 1211785, 1250786, 1329106, 1472895, 1647899, 1767020, 1740899, 1550641, 1301795, 1065061, 935310, 849713, 782428, 736052, 667341, 616997, 591918, 558367, 535128, 539506, 504670, 473589, 491401, 516939, 538673, 533827, 495696, 460515, 448374, 425809, 383182, 324217, 306408, 303164, 301243, 275619, 294141, 304606, 299272, 324309, 347637, 336927, 299303, 275245, 259758, 242229, 188041, 160092, 160141, 197329, 224085, 207178, 181057, 166446, 165877, 149996, 170405, 183029, 145256, 105644, 75555, 74654, 90046, 88879, 94953, 91308, 87723, 84469, 68325, 50418, 26111, 57459, 67688, 97241, 103849, 75182, 44027, 84367, 141369, 191109, 221588, 227531, 247261, 286273, 312271, 343803, 370144, 362853]
13165C62853r5726p7945p2846l2929K8481n335K2372L5619J3162j8282l8910l2452
13153H8062k510R051m267M9750N4569k208j1560K9289O255J0477J0622j9898J3885
13140B31517L6232J8155J404j8910k6515o2613l9830N279j2571m08J4800r761
13128A36779J5781j2825k5179o763j8851R823r789k6282J1215N2965O4872L9865
13116B31611R77o798l7094k4530k8697k0230J2795j4487l0055O381J3519M3591
13104A46983j7854j6421K2724K7002J2436q31k1945l2455l6094l0767l090N463
13092E5151K8915K2479k6908j5444J0260K1853J1417m3834n397J3882j7438j2932
13080D2004q618J1772J1153K5572r816k7140j333K4728K9560J5163M537q225j6437
$$ y = [362853, 267127, 189182, 116336, 83407, 111888, 106553, 128925, 164544, 177706, 159424, 120514, 88062, 85552, 94603, 90336, 140086, 194655, 192447, 180887, 210176, 216431, 226908, 237530, 217632, 231517, 267749, 285904, 287308, 268398, 241883, 179270, 139440, 144719, 132148, 131740, 146540, 136779, 152560, 139735, 114556, 107793, 88942, 98765, 88976, 62694, 73909, 126874, 191746, 231611, 232588, 225790, 188696, 164166, 135469, 115239, 128034, 113547, 83492, 89873, 103392, 146983, 129129, 112708, 135432, 162434, 174870, 174039, 152094, 119639, 83545, 52778, 49688, 55151, 84066, 106545, 79637, 64193, 74453, 96306, 107723, 63889, 58492, 72374, 54936, 42004, 33386, 45158, 56311, 81883, 72067, 44927, 43594, 68322, 97882, 113045, 117582, 109357, 92920]
13067I2920l7386k3107O811j6875P373J3134J7495P366m236J5971P708J040J7819
13054A06033K8156O996l465m093k2888J1496L8561k7339q197k7714k769k638k4804
13041F7335J4743M8921j004k7570l4024L950K3860p896k9561l1239K4147K4225
13029G5887M685k956J2679j8797J0208K2401l1666k988j9342L0567L5649M3537
13017A59864N1339K4505J0667l3809o2869n4282K22M3026K5541K7811j1709k3298
13005A57008k5975k0422l4254j4130J28r944j5240k774j2966o042J9384j0197
12993B4576J8581K7549P507j984j3332j5393J3976j7804K9125L784j5315l162
12981E8108n546l1999o302N298j8787j8588k9943m138o157R846K2798J5145j3654
$$ y = [92920, 55534, 32427, 39238, 22363, 29736, 42870, 60365, 67731, 63495, 79466, 87174, 88214, 106033, 134189, 141185, 137720, 133627, 110739, 122235, 160796, 133457, 125260, 97546, 94777, 92139, 67335, 82078, 130999, 129995, 102425, 68401, 72351, 96211, 88315, 58754, 27515, 51662, 75887, 80572, 77616, 90295, 71498, 81706, 104107, 72441, 69453, 50111, 80678, 116327, 159864, 211203, 235708, 246375, 212566, 149697, 95415, 95637, 138663, 164204, 192015, 180306, 157008, 131033, 110611, 76357, 62227, 62355, 52411, 37171, 34397, 21431, 15389, 34773, 24576, 43157, 70706, 78213, 76229, 62897, 47504, 61480, 43676, 72801, 76585, 61270, 58108, 52562, 20563, 14261, 19559, 772, -17816, -47759, -51897, -58054, -48208, -25410, -10265, -23919]
12968b3919r009R616l926K239r563j2159l072J0180K4675O197j0053J5706J2953
12955I865j1060P192J9699l943k105r766P842J7055J2554K9503N1039j8815n3945
12942E5115m1731j3913M629J2240O283L9225K3045L409j8577L548l5178k5312
12930A2783N330M708j1167l748J0641K1507R287j4442j5871k1103L851P655K9996
12917C9427R593l871n05L9885O1933M2299j3083n5771l7420m0680j5122J2655
12905C9340n719J0054L2134K3006k3337j293k3297Q579P707k5788k5417L929J1265
12892C1163j1039m0347m438K8919L056M252m034J8524o909L670j2154J0563O332
12879B7558o805n38L3190l564q596L4317O1422N9385O9350P0634L0380l8306j09737
$$ y = [-23919, -32928, -23312, -27238, -24999, -34562, -46721, -49793, -39613, -14938, -8741, -18794, -3088, 9865, -1195, 5997, 25696, 21753, 19648, 9882, 17724, 34779, 47333, 76836, 127875, 109060, 55115, 13384, -529, 4100, 16340, 22623, 61848, 84893, 88302, 69725, 73273, 38095, 12783, 18113, 22821, 11654, 7906, 18547, 40054, 49341, 34899, 19028, -2075, 1776, 9431, 39427, 49020, 45149, 44644, 84529, 146462, 188761, 175678, 119907, 82487, 41807, 26685, 39340, 33621, 43675, 75809, 98815, 75478, 74185, 50888, 59467, 67174, 41386, 15969, 19898, 31163, 20124, -20223, -24661, 4258, 7314, 11566, 7532, 26056, 19147, 22817, 10663, 21226, 27558, 20753, 20215, 53405, 49841, 41245, 75562, 136984, 196369, 265719, 336353, 366733, 328427, 218690]
12866B18690o0593l1638n3354l7729n799n818O979M0185J218J4007N3672K1791
12854A61611l5334q865k204j1098l443K8347M0476N7053N9160J3619N754L8155
12842C43231Q9024L5170k6293m4169p9232q9466l4793j4575M1657M1920J8219
12831B80693j295j9328o1818m2690J930j4513j022J6312k6492k8943k0986j4518
12819F7330J9321Q182j0942M2377M8947L1629P5606Q0358J6516m0479r5028o5408
12807A78409n1032k2004j0311N547J9128k7944n0593J894K3911j686P607l0855
12795D2071j6622j0374k060J2602N941L243O4832K7106k5844l7176k5919J9172
12783E6972K1815j5025j3534p383k6080l7423L9528j0305j9259L8769O150m951
$$ y = [218690, 158097, 126459, 73105, 35376, 29577, 23759, 30738, 70923, 72141, 86148, 139820, 161611, 126277, 117412, 115208, 104110, 100667, 129014, 169490, 226543, 285703, 299322, 305076, 343231, 432255, 467425, 441132, 396963, 317731, 228265, 193472, 178897, 220554, 262474, 280693, 279398, 260070, 198252, 155562, 157492, 142979, 141957, 158269, 131777, 102834, 81848, 67330, 86651, 94833, 83891, 126268, 175215, 206844, 282450, 362808, 379324, 338845, 243817, 178409, 127377, 105373, 95062, 100609, 119737, 91793, 41200, 43094, 67005, 65319, 72926, 42071, 25449, 15075, 13015, 25617, 31558, 34801, 99633, 126739, 100895, 63719, 37800, 56972, 78787, 63762, 50228, 42845, 16765, -20658, 18870, 8565, -10694, 28075, 34225, 29274]
12771B9274k8304J9567J1259J0500j4464j1641q268j6426J0435p621q839R183
12759e345J2369M848k6857j2198j7591P335J8460K237L9249k806j2611P281J0790
12746B5161R526L668m657j9639m672j7764j1193K1000k206j913L417J0169j2194
12733a297J4897r856J3277j7663k5074J614K2164J7095k474m961K3822K9287j1287
12720D9544j2082J9105l4669j2954q691j5350L696N345J0355j3993J536m319J4435
12707A958O684j9800J1796J8931K6593J443k6183j5650n993J024Q03L336J0081
12694A5023K5815o064j9086j1195q721J3221o99p88N888R955M0979k3456k8539
12681A2333K1950j887k6405J7615k727J9538K3400P781l2886k1768l1939o918
$$ y = [29274, 970, 20537, 31796, 42296, 27832, 16191, 7923, -8503, 1932, -5689, -14528, -5345, 7024, 11872, -14985, -27183, -44774, -37439, -18979, -16742, 22507, 19701, 7090, 14371, 25161, 34687, 38355, 33698, 14059, 9387, -8377, -19570, 1430, -776, -2689, 728, 10897, -1297, 13600, 3744, 17021, -642, -25716, -24102, -1938, 15157, 12683, 7722, 31544, 60831, 49544, 37462, 56567, 21898, 8944, 253, -15097, -11401, -6056, 4299, -9694, -8158, -12477, 1958, 8642, -11158, 638, 19569, 46162, 47605, 21422, 5772, -221, 803, 1606, 4942, 15023, 40838, 34774, 15688, 4493, -4228, 8993, 8294, 7506, 13394, 23349, 64328, 40872, 12333, 34283, 32396, 5991, 23606, 20879, 40417, 63817, 71598, 38712, 16944, -14995, -21913]
12669b1913J3364P184K3477J664j289o250N65k7526l1509P625J6527q007R710
12656a6378J8797K2436j5645j2339j5746J0164J9257R329k5835k1976Q396K2479
12644B939K055j6164L046J4187L567K6056Q777j1746j55j9962M655M153j4959
12631F449J6512K409k4016N210k3615J7233L0695o230j6716j0958L877K3083J8054
12618D1987m8276l4184M016M0013K7440N394k7882j7342Q480J7196J6722j9524
12606A4040J9375j0088m2504l3993J1927K0012M915K3405K0526r978K3776J5740
12594E7153j2769J2501J000k4979m9840J093J562j1488m868L3522K2428J5393
12582D0708r572k0191j949J6573L27J846n961N484J0837p02j153J3008q534M499
$$ y = [-21913, -8549, -1365, 22112, 23776, 22487, 16237, 16802, -10724, -42233, -34608, -18081, -26088, -16378, 2419, 24855, 9210, -3129, -18875, -8711, 10546, 19875, -5960, -27936, -19540, 2939, 4994, -11170, -8124, 6063, 9630, 35686, 44463, 32717, 32562, 12600, 17255, 21408, 6449, 22961, 25370, 1354, 6564, -17051, 182, 30877, 24647, 7931, -3027, 850, 23933, 41987, -6289, -40473, -36457, 3556, 30996, 36390, 8508, -8834, -354, 16842, 33564, 14040, 33415, 23327, -19177, -53170, -41243, -21231, -16316, 7089, 27615, 17637, 41413, 57153, 44384, 56885, 57885, 32906, -16934, -15841, -14279, -25767, -30635, 2887, 25315, 40708, 31136, 10945, 8996, 25569, 25896, 27742, 21781, 27265, 38102, 37400, 36247, 49255, 40721, 45220]
12568D5220J227m1764j2845K6489J4958L420j6826j4022J8786q550j911j4353
12556a71q681r302J183r913K6288M1802m560p589k9871j2944K3553J1129R286
12543C0210N378k8705J9811P730q257j2416J540M59r559J5939J2620p205k76k7093
12529A76M406K7041k2593l492p713K0293M4330K3990r433k6952k9834j3135N95
12516G679l023p92J166J1741j6233R939Q47j1686L566r404j850J6784j395k297
12502E042J6014J4146M5095K3056N1867P7304Q8323O1960J8737k2300q5685r4367
12490A99192k5487l033m1695k6346k9453j6971J3771L6939J7833j0607o513n423
12478A02207N3685N5715L7110L6579K8484l371l2110l4392j4094K9273O5482R9879
$$ y = [45220, 46447, 4683, -8162, 18327, 33285, 36705, 19879, 5857, 24643, 16093, 14182, -171, -8852, -18154, -16971, -26884, -596, 41206, 36646, 29057, -814, -13758, 9795, 20924, 30210, 35588, 6883, 26694, 34424, 26167, 13751, 15291, 15750, 6191, 22130, 34750, 27545, 27269, 176, 4582, 31623, 9030, 5538, -2175, 18118, 62448, 86438, 77005, 50053, 20219, 7084, 7679, 4656, 3864, 5030, 16771, 538, 10477, 11324, -362, 3204, -6200, -8050, 8734, 7339, 5042, 21056, 35202, 80297, 103353, 155220, 232524, 320847, 382807, 401544, 379244, 293559, 199192, 173705, 170672, 128977, 102631, 73178, 56207, 69978, 106917, 124750, 114143, 107630, 102207, 155892, 211607, 248717, 285296, 313780, 310409, 278299, 243907, 229813, 259086, 324568, 424447]
12466D24447R5762J7098p6674j03700p3068M12O895K2824j5011o4195m6154m248
12454A84388K0184L1530K9954L200l506J956k3616n2085j6509K1382L6630j4352
12442B19156O088N2090L2301N7051O8924L7714l3894q5431q5422n9851m5617m8914
12430A14195j0846n387j4870m400l714J7610J5821R949j3976j3164J3377J8961
12418A23556k315j902Q550o115k3392k9226j0653M161j5802j3901p89j6204J006
12405A6974q341K0664K1125J4064q530j2124j9676j1441j0570J0636K0462J5588
12393D8831O573l1655m6121L978L0507k1878J5884J5053k692K9340M347j1328
12381D0839L5772n930l7416k0276K5503K7410J2549J3583j1885l5151P109J0193
$$ y = [424447, 520209, 537307, 460633, 356933, 283865, 284277, 291172, 313996, 298985, 234790, 188636, 184388, 204572, 236102, 266056, 269256, 265750, 267706, 244090, 192005, 175496, 196878, 233508, 219156, 225244, 277334, 309635, 366686, 435610, 473324, 439430, 353999, 268577, 208726, 163109, 114195, 103349, 97962, 83092, 78692, 74978, 92588, 108409, 118358, 104382, 91218, 104595, 123556, 121241, 119339, 127889, 121774, 98382, 69156, 58503, 62664, 46862, 32961, 32172, 15968, 16974, 8633, 29297, 50422, 64486, 55956, 43832, 24156, 12715, 2145, 12781, 33243, 48831, 55404, 23749, -22372, -18394, 12113, -9765, 6119, 21172, 18480, 47820, 52167, 40839, 76611, 70681, 33265, 12989, 38492, 65902, 78451, 92034, 80149, 44998, 52107, 62300]
12369F2300q589k7100k1158l6561K6727L2499N314Q557l1203o623j4556j0629
12357b1022O104L4962r484L2199n295l6966m3412J83K5101J3639N325M926K3985
12344C0245J6059J3753N398k0007l023j227k4276l1720j6993L9088J9511K4861
12332E1669j8523j9470j9562k3572N548J6268m655Q557L354J6776N570K5308M7817
12319I5085J6403r361k4508l0054l755r454K4811R738M183k0658l3043L710J0548
12306C3645o824j2502K5156J8015m6908J859K2705j2249k7239q252L8480P107
12294C2993J1353j1667O010j798N629J1809O560N515Q300j207o854K77o811j7560
12280D2549L201o968J7040K4237J8315j9874l5883k537Q29l073K607R477l775
$$ y = [62300, 53711, 26611, 5453, -31108, -4381, 28118, 33432, 41989, 10786, 4163, -10393, -21022, -14918, 20044, 10560, 42759, 37464, 498, -42914, -42731, -17630, -3991, 1334, 6260, 30245, 46304, 60057, 65455, 45448, 42425, 41198, 16922, -14798, -31791, 7297, 26808, 51669, 33146, 13676, -5886, -29458, -23910, -7642, -12297, -3740, -386, 16390, 21960, 47268, 95085, 111488, 102127, 77619, 47565, 43810, 34356, 59167, 68905, 73088, 52430, 19387, 23097, 33645, 26821, 14319, 39475, 57490, 10582, 12441, 35146, 22897, -4342, -12594, 25886, 32993, 44346, 32679, 38689, 36891, 42520, 54329, 60889, 66404, 74704, 73497, 66643, 66920, 60109, 42549, 45750, 38782, 55822, 80059, 98374, 78500, 42617, 40080, 40909, 37836, 40443, 49920, 46145]
12267D6145J0120j05K1387M959j209j6868k480k7673J6909N860J0407k847n866
12254E8739O327j7041J9266L2398K444P870J7914k4500o168k2996l1131k2519
12242B0603l4402N744J7363L9739K1842M2914L148l0974k1044j3216j1476j740
12230C8501L1868R107j5037n57J1373M782j3510K410k5045K953L165k4323k423
12217B3264K73J7846K4129o32Q004L3001P449p905j8967k3352L3363K3918l007
12204A17384P824J947j6276j4616R542m121j7682K4254L5690O218l756O700n460
12191A47648r551L6008K6276j1743l5778j208K172J4054J0320K1497L8956J9979
12179B58630L1407O4147J9134q4144p5985l5051k6824l8181o942J1807M7644K1389
$$ y = [46145, 56265, 56160, 77547, 82506, 81297, 64429, 61949, 34276, 51185, 57045, 67452, 64605, 58739, 65066, 48025, 67291, 99689, 102133, 110003, 127917, 103417, 97249, 74253, 43122, 20603, -13799, -8055, 9308, 49047, 70889, 113803, 116951, 85977, 64933, 51717, 40241, 38501, 70369, 79476, 64439, 63882, 75255, 80037, 66527, 68937, 43892, 46845, 50010, 25687, 23264, 23537, 41383, 65512, 64880, 72884, 105885, 113334, 105429, 86462, 63110, 96473, 120391, 117384, 125208, 127155, 110879, 96263, 105805, 101684, 84002, 108256, 143946, 150164, 146408, 153108, 147648, 138097, 174105, 200381, 188638, 152860, 151652, 153824, 167878, 178198, 199695, 238651, 258630, 290037, 354184, 373318, 289174, 213189, 178138, 151314, 113133, 106191, 117998, 165642, 187031]
12167A87031N831L319j5418l0755K215J5111K8025J8051K0606m8243j3982K3999
12155A95790K1404J1250j0621r992m0848Q973q808J3430m422l5173N137j4422
12143A31698r236J2769k1731O522M818r315J6137L9079J8312L873j6610p025M539
12130A73830k0614j9562K604J0562R963J4706J4240l4401n3261q02L9613j310
12118A35568J9955L577j2089j3962K45P186L8545o664J1166M467k4473K2905L8480
12105B24906K8174P95J563p544J5434o022J8250k816K668L7625L2795L9722J7822
12092D03372L3216Q840J4478J8089J5185J5618L1491O8739R3549J22181P7579
12081I02337J1948O4568J18217J29879J33460J76468J99948K47534K99490M02664
$$ y = [187031, 192862, 196181, 180763, 150008, 152223, 167334, 195359, 213410, 234016, 185773, 171791, 195790, 217194, 228444, 217823, 207831, 166983, 175956, 167148, 180578, 176156, 140983, 146120, 131698, 122462, 135231, 113500, 120022, 124840, 115525, 131662, 170741, 189053, 192926, 176316, 169291, 173830, 153216, 133654, 136258, 146820, 156783, 171489, 185729, 151328, 98067, 97265, 136878, 135568, 155523, 159100, 147011, 133049, 133294, 140480, 179025, 172361, 183527, 187994, 163521, 186426, 224906, 253080, 253875, 255438, 247894, 263328, 257306, 275556, 272740, 275408, 313033, 345828, 385550, 403372, 436588, 445428, 459906, 477995, 493180, 508798, 540289, 609028, 702577, 824758, 902337, 914285, 978853, 1097070, 1226949, 1360409, 1536877, 1736825, 1984359, 2283849, 2686513]
12071B686513N68000O87522Q59589J013927J250041J880310K971917M653277P229175
12062B3800271J1093861J5875197J8659436J1818231n150818j6806100j7624360
12055D1665718j2711788p740475m562885k703554j423294l92901M92082J473129
12047A4096032K642640L175228J222704j695894k317511r13175J207204L535763
12039B0952991O150971Q107763N800773j98681k518096J43176N636324J1268200
12031E5343421J3597654Q731167j654027j0403508j1720084p093032j390418J88836
12023D5600009m429537q148763p709859n036307k353391k50213J427676J870107
12015B0969722l28088k837429l274631k261068j080994k13058N41779J451140
$$ y = [2686513, 3254513, 3942035, 4801624, 5815551, 7065592, 8945902, 11917819, 16571096, 23800271, 34894132, 50769329, 69428765, 81246996, 76096178, 59290078, 41665718, 28953930, 21213455, 16650570, 13947016, 12523722, 12130821, 12622903, 14096032, 16738672, 19913900, 21136604, 19440710, 17123199, 16210024, 17417228, 20952991, 27103962, 35211725, 41012498, 40813817, 38295721, 38438897, 44075221, 55343421, 68941075, 77672242, 76018215, 65614707, 53894623, 46801591, 45411173, 45600009, 41170472, 33021709, 25311850, 20275543, 17922152, 17671939, 19099615, 20969722, 20641634, 17804205, 14529574, 12268506, 11187512, 10974454, 11516233, 12967373]
12007A2967373K753463M609049P247717J1115612J5312636J5325587M622264j0267094
11999F3686607j6861062j4950733r975167o016720l705815k404518j611661j153177
11991G007754r17869p79620o88493o18663n19629m26414l68865l15187k37474
11982B135540k02676j45843j11231j06848j14889j01115j07383p2449n3273n6654
11972A063179r1208p0391m5193j5591k4926k7311o0251p6275l2271k9602k5400
11961E64760l5814l079Q540q347q45J7588L431o695l4832l2910r328M47O9m149
11947D58836n414k2070l5835N560n114k7329j6004j6827l2013l1604k1717j3873
11935B36596n815K8769L4527M0429L7938K7289l1244l3512n665O4355J02676J08885
$$ y = [12967373, 15720836, 20329885, 27577602, 38693214, 54005850, 69331437, 73953701, 63686607, 46825545, 31874812, 21899645, 15882925, 12177110, 9772592, 8160931, 7007754, 6089885, 5310265, 4621772, 4003109, 3483480, 3057066, 2688201, 2373014, 2135540, 1932864, 1787021, 1675790, 1568942, 1454053, 1352938, 1245555, 1173106, 1119833, 1063179, 971971, 901580, 856387, 840796, 815870, 788559, 728308, 652033, 619762, 590160, 564760, 528946, 525867, 534407, 526060, 525215, 542803, 546234, 539539, 504707, 471797, 462469, 462916, 462985, 458836, 453422, 431352, 395517, 401077, 395963, 368634, 352630, 335803, 303790, 272186, 250469, 236596, 230781, 259550, 294077, 334506, 372444, 399733, 368489, 334977, 329312, 393667, 496343, 605228]
11923F05228J61725L12552N44388P01581N15706k22750o82880o64595m34866k41523
11913E94566j32993o8759l3852J825m1021p0472m8310m0142j757j683P367m911
11901A59858l3801j7303j3206j3577Q39L3985M0909m2419m0974N419r945J2745
11889H2530K0641J1473M1343L6665J6778N4697N5931K1710n9460o2351n2648l9452
11877A27857k4689K274J336J489k9265j6519m574m2268p206J4473k4396J920P057
11864G489K5220K0990N1920P229j8095K4442p024m431j7712r986r780j1265J4396
11851G3393m263m2677k9019N1400L8311J8620L296J2642J4763k347m2038m4961
11839D7120n1449q046K3662p231L0319K7829K7845l343k5806M171J5166k8143
$$ y = [605228, 766953, 1079505, 1623893, 2325474, 2841180, 2618430, 1935550, 1270955, 836089, 594566, 461573, 392814, 358962, 360787, 319766, 249294, 200984, 160842, 159085, 157402, 164769, 159858, 126057, 108754, 95548, 81971, 82810, 116795, 157704, 115285, 74311, 79730, 69785, 82530, 103171, 114644, 155987, 192652, 209430, 264127, 320058, 341768, 282308, 219957, 167309, 127857, 103168, 105442, 106778, 108267, 79002, 62483, 57909, 15641, 8435, 22908, -1488, 432, 7489, 32709, 53699, 105619, 112848, 94753, 119195, 112171, 107740, 90028, 80042, 70262, 58997, 73393, 69130, 26453, -2566, 48834, 87145, 105765, 109061, 121703, 136466, 134119, 92081, 47120, -4329, -12375, 11287, 4056, 34375, 62204, 90049, 86706, 60900, 65071, 80237, 52094]
11827E2094k0787J0782K1875Q69O444M058j5207K5652K9511J7925m960K492N336
11814A36084j7399l1865k5840J0916K972K258J3537P701J3605J0037J5382K7345
11802A64733M7820M0456O0465O7223K9460l8139j82180j38273q6841m9659j7412
11791a02347j0288J3458L5472N0536K2460q798n06j956Q75J0076K7285p64J4275
11778D9778L1818J9787k3549K0268J4962m1530j3075J7400j2691j3010k8064N593
11766B7687J0249J4207M108j3581q819J8288K336j5552m614q51J5141K0194N1761
11753A20554K7412J0120j046j1897k6774l981p374L9321J9538K382k628k9182
11741A36445l9620L424M5130M7440N5904M3272m667R640R548n836j8156n4341
$$ y = [52094, 31307, 42089, 63964, 64833, 71277, 75335, 60128, 85780, 115291, 133216, 128256, 130748, 136084, 118685, 86820, 60980, 71896, 74868, 77126, 90663, 98364, 111969, 122006, 137388, 164733, 212553, 253009, 313474, 380697, 410157, 372018, 189838, 51565, -35276, -84935, -102347, -112635, -99177, -63705, -13169, 9291, 493, -13, -1969, -1094, 8982, 36267, 35503, 49778, 81596, 101383, 77834, 98102, 113064, 71534, 58459, 75859, 63168, 50158, 22094, 27687, 37936, 52143, 56251, 42670, 33851, 52139, 54475, 38923, 34309, 33458, 48599, 68793, 120554, 147966, 158086, 157040, 145143, 118369, 114388, 107014, 146335, 165873, 168255, 165627, 136445, 96825, 100249, 145379, 192819, 248723, 291995, 287328, 296968, 306516, 300680, 282524, 228183]
11729B28183j5208J5937R232O3166J49285K56407L21376K79654q281k80468l70309
11718F48974k41663j34146q8380l7788J3710K8005l0204j0054j0530Q968M496
11707A51388j769j9322m098k4923k9058K1415K0740K4267k0254j1479N352Q741
11695A21000K379l6343l6246j5871l3012k4867K314M0077K9542m8684o443P036
11683H82k1461n020K4813O4153Q121j9549m2274k0969k6760J429L879k0888l2150
11670h5794k6584L2018L5248O8542R0506M7556K7613M6865J17708K07080L18120
11659H78878M12628L72034j9409l69041m00742k76192j59853q8790j06054m6083
11649A97376k9375l302J0663M4480O4694M6435l9459l0005P1543M2623m5546n3806
$$ y = [228183, 212975, 228912, 238144, 301310, 450595, 707002, 1028378, 1308032, 1299751, 1019283, 648974, 407311, 273165, 184785, 146997, 160707, 188712, 158508, 148454, 137924, 146892, 151388, 149619, 130297, 126199, 101276, 72218, 93633, 114373, 138640, 118386, 106907, 112259, 121000, 123379, 87036, 50790, 34919, 1907, -22960, -20646, 19431, 48973, 289, -6154, 882, -20579, -25599, -786, 63367, 71488, 51939, 9665, -11304, -38064, -36635, -32756, -53644, -85794, -112378, -80360, -45112, 23430, 113936, 161492, 189105, 235970, 353678, 560758, 878878, 1291506, 1663540, 1644131, 1275090, 874348, 598156, 438303, 349513, 243459, 197376, 168001, 164699, 175362, 219842, 284536, 330971, 291512, 261507, 333050, 375673, 330127, 276321]
11637B76321n3105m2764k6134j7868P687r451O320O3325K9176J3280J1160j1931
11625B46016L6200N2693O5844J5819M8425J21489J81256J27236K4291q3727j37948
11614F97594K0169O7119k0896O108q4936j45697j63954j47359o5444m0875r052
11603A12777p104J5715R518J654Q884J7331L5292K0258J8513M135l9504m051M5776
11590B39194M6882P0224N3340R168l7912l8953j4269k9302j3782j3495k2613l4683
11578B13799n3107l9703N534M8147L4024J6430J2540j8015k2835j9688J3409J6440
11566B06975K676j6475q271L5391O4096O7446J00278M1019l6230m3035o2395o4824
11554B86651l5148L3695J2746Q049j4841J0478r892n369p577J5799J2967J588
$$ y = [276321, 223216, 180452, 154318, 136450, 144137, 134686, 141006, 204331, 233507, 246787, 257947, 246016, 282216, 334909, 400753, 416572, 464997, 586486, 767742, 894978, 919269, 835542, 697594, 717763, 784882, 763986, 770094, 685158, 539461, 375507, 228148, 162704, 121829, 112777, 105673, 121388, 130906, 132560, 141444, 158775, 194067, 214325, 232838, 236973, 197469, 193418, 239194, 286076, 356300, 409640, 418808, 380896, 341943, 327674, 298372, 284590, 271095, 248482, 213799, 160692, 120989, 126523, 174670, 208694, 225124, 237664, 219649, 196814, 177126, 190535, 206975, 209651, 193176, 184905, 220296, 284392, 351838, 452116, 493135, 456905, 413870, 351475, 286651, 251503, 285198, 297944, 305993, 291152, 301630, 291738, 286369, 278792, 294591, 307558, 309146]
11542C09146j2218Q251L5635L6105L514L8373O6164M6886n968O106N3969M1166
11530F27129K5753R637M9913M9199N8335J13279J16979J01310Q2198O3063J1833
11519A308628R3826J76399K72408L70506M67946N69636M77093J01249j94907k00266
11509C442518N6421K41135M03056N97677O21349O36975Q64697J294043J894468
11500A0052339K619411L079299L161583L400871M132553O593901J1427600J9495504
11492F3963061L2130436N3454923Q9229727J36465252J38420497O043555j20385963
11485C99321488j41372774j01331826n5868603k9774329j7046446j0660516o780904
11478C6486090m575490l929228l557463l419647l213833k788513k233972j826451
$$ y = [309146, 296928, 305179, 340814, 376919, 380433, 418806, 484970, 531856, 525888, 531994, 585963, 627129, 652882, 662519, 712432, 761631, 819966, 933245, 1050224, 1151534, 1233732, 1296795, 1308628, 1402454, 1578853, 1851261, 2221767, 2689713, 3259349, 3736442, 3837691, 3642784, 3442518, 3498939, 3740074, 4143130, 4740807, 5362156, 5999131, 6863828, 8157871, 10052339, 12671750, 15751049, 18912632, 22313503, 26446056, 33039957, 44467557, 63963061, 96093497, 149548420, 238778147, 375243399, 513663896, 519707451, 399321488, 257948714, 156616888, 100748285, 70973956, 53927510, 43266994, 36486090, 31910600, 27981372, 24423909, 21004262, 17790429, 15001916, 12767944, 10941493]
11470A0941493j504578j039074p02755o58661o60824n99711n56633m88352l47045
11461D383860k51837k11149k35571j72410j39094q7893m4615K5995J59447M04093
11451C830826Q22388J454624K103251J775323l50347k035251k190194j535626
11443C874994r22099n40942l49334k42695j71097j23877q3243p3329n1070q4205
11433A233103j03149p9354m2249o7052n7370l7241m8701o9735l8239j0712r39
11422F78362M043M84n82j6743n3974j8234M411l0840j5416l3205m5862n914M965
11409D71495j9746k7054l5850j596L2464J8398N862r924k3888j53K2135k665p6662
11396C52816l5515J2985L8872O609j6207k5753n0179M202R816K610l760k0085
$$ y = [10941493, 9436915, 8397841, 7695086, 7036425, 6375601, 5775890, 5219257, 4730905, 4383860, 4132023, 3920874, 3685303, 3512893, 3373799, 3285906, 3241291, 3267286, 3426733, 3830826, 4653214, 6107838, 8211089, 9986412, 9636065, 7600814, 5410620, 3874994, 2952895, 2411953, 2062619, 1819924, 1648827, 1524950, 1441707, 1368378, 1317308, 1233103, 1129954, 1050600, 1008351, 941299, 883929, 846688, 797987, 728252, 690013, 679301, 678362, 682405, 682889, 682307, 665564, 611590, 593356, 597767, 566927, 551511, 518306, 472444, 466530, 471495, 451749, 424695, 388845, 387249, 419713, 438111, 443973, 434049, 410161, 410008, 432143, 429478, 352816, 317301, 330286, 369158, 375767, 359560, 333807, 283628, 287830, 297646, 300256, 296496, 276411]
11384B76411K1672P657r50K184n198k098J5960J4192O562l5927m375j6386L9573
11371C19277K1633k3774J506k0252m5002j72909j71527r0583m2568J24012J25427
11360B5240J32450J2383j71232j32885q1515k6698O0642J03144M3252O436j513
11349c0296k3573j3466K8544K9253K0736K4035j5932k5582N259j2048P636L6370
11337C0936k3886q0794o3659K4759Q3423K3854K2552J1807J4683m49j9870j5801
11325G555R917L523k9121k5779N440M226K5365K6417J360L3j0631k9279J1238
11312B64J9257L3300J0633k108M5971O9202N6378K5629j252l7993m9821k8024
11300A41436l5538n0277n615m3k1879k2738N157M3748N9264J7106l0381k1153
$$ y = [276411, 298083, 305740, 304790, 306974, 301776, 299678, 315638, 329830, 336392, 300465, 296090, 279704, 319277, 340910, 317136, 318642, 298390, 253388, 80479, -91048, -181631, -224199, -100187, 25240, 157690, 170073, -1159, -134044, -215559, -242257, -181615, -78471, -35219, -28783, -30296, -53869, -67335, -38791, -9538, 11198, 35233, 19301, -6281, -1022, -13070, -5434, 30936, 7050, -73744, -137403, -112644, -29221, -5367, 17185, 28992, 43675, 43226, 23356, 7555, 17472, 20995, -8126, -33905, -28465, -24239, 1126, 27543, 28903, 28936, 18305, -10974, 264, 19521, 52821, 63454, 61346, 107317, 176519, 232897, 258526, 257274, 219281, 169460, 141436, 105898, 55621, 50006, 49963, 28084, 5346, 10503, 54251, 113515, 130621, 100240, 79087]
11288G9087j0671j3670l077J5886n46O983j3867n8484j1190k2763j1386O5173
11276B1475N1004k798L4406j932j8390m3956k3289q628k4436J1025r797j3547
11264b8863K2386K4082K3898K7285p194Q344n296J2151K407j5108L165k8657p492
11251C1108o800j4492J2864J1992J5332j9670J7168L1989K1361J7163K9109J8731
11239A65855N873J8036n1831m2921k8768r480L679J1609l496L1019R562k1472
11227H7665k6590n12l245j7526R626N891J2392K2539J8025j1423j6554J4026K399
11214I6713l077k2799k8079j7541K8765M630k377n473K8949J3772l1k1424r15
11201G1113J3387k239R258Q865k6874j4520Q033J1639k9621p808J6014L07q261
$$ y = [79087, 68416, 54746, 51669, 67555, 67009, 73992, 60125, 1641, -9549, -32312, -43698, 21475, 72479, 69681, 104087, 102155, 83765, 39809, 16520, 7892, -16544, -5519, -15316, -28863, -6477, 17605, 41503, 68788, 61594, 69938, 64642, 76793, 79200, 64092, 67257, 38600, 31108, 24308, 9816, 22680, 34672, 50004, 30334, 47502, 79491, 100852, 118015, 147124, 165855, 171728, 189764, 137933, 95012, 66244, 56764, 60443, 72052, 68556, 99575, 109137, 87665, 61075, 60563, 57318, 39792, 49418, 55309, 67701, 90240, 108265, 96842, 80288, 94314, 96713, 93636, 70837, 42758, 25217, 53982, 58612, 56235, 50762, 79711, 93483, 93452, 72028, 71113, 84500, 82261, 91519, 100384, 73510, 58990, 67023, 78662, 49041, 41233, 57247, 57554, 49293]
11188D9293j215L4332L0791K7934j5888j6346M5506M5353o1200j62077j66557
11177a90074n6353L0405N7361K9593L219O498R446L967J3783P228J9203J3968
11165e1756J6623J0749K5122L417o446p489j3277N805k0472J1223J5245r490j4883
11152c5629m262Q517j5619J3962K4823k8456J6197K4831k9645Q237J9802P478
11140A0236j1592j6743K7804n454j5561n02J1562j960L135j525l668N443o59N858
11126F374J7488j1339R334J8067k3221j3046M433L425J1232J4658k7794r29J6739
11113B5421j3211k5055n737K4852K4942J6482j4281j0995k264j5885j5713l418
11101a4862m445M7199J682k0983k209J2171L274M880P342J2049q774q155k1227
$$ y = [49293, 48078, 82410, 113201, 141135, 125247, 108901, 154407, 199760, 138560, -23517, -190074, -246427, -216022, -158661, -129068, -125849, -119351, -109905, -105938, -92155, -84927, -65724, -51756, -35133, -24384, 738, 4155, -2291, -9780, -23057, -17252, -37724, -26501, -11256, -20746, -35629, -39891, -31374, -46993, -33031, -8208, -36664, -20467, 4364, -25281, -17044, 2758, 10236, -1356, -18099, 9705, 4251, -11310, -11812, -250, -2210, 925, -600, -4268, 1175, 516, 6374, 23862, 12523, 21857, 39924, 16703, 3657, 8090, 11515, 22747, 37405, 9611, 8682, 25421, 12210, -12845, -18582, 6270, 31212, 47694, 33413, 22418, 20154, 4269, -11444, -14862, -19307, 27892, 29574, 8591, 6382, 18553, 21827, 26707, 34049, 46098, 37324, 29169, 7942]
11088G942j0668m934N565K5529j4933O498K6216L253k0755j7837n124n062L7792
11075C3482l3549l9262j2059N6811M0471l5025q688J4619n024j0079j3470J6063
11063D290N9460N717L637p104j6690J9748M8979P3184J05334J44328K43728L97606
11051A082217O34882O97152K22024m61929p08505n80319l28612j74916j12714
11042B69280q7068k9099Q675l6593k6046M963j6453j2306l5632l6664L118n390
11030G85K5224j0535j3255j5560l7595k6245J0229K4318J2278J8659K1580L779
11018A3662m7210j3101K6115K7711K7970Q363N437j8192O043Q001j850J6412J69
11005E9530l174j2936m5393p102L774k7720O199K0155K4309O382p832j6338k185
$$ y = [7942, -2726, -7660, -2095, 23434, 8501, 14999, 41215, 44468, 23713, 5876, 752, -4310, 33482, -67, -39329, -51388, 5423, 45894, 10869, 2181, 16800, 11776, 1697, -11773, 4290, 63750, 69467, 73104, 66000, 49310, 69058, 118037, 191221, 296555, 440883, 684611, 1082217, 1717099, 2414251, 2636275, 2174346, 1465841, 885522, 556910, 381994, 269280, 182212, 153113, 161788, 125195, 99149, 104112, 87659, 75353, 39721, 3057, 6175, 785, 26009, 15474, 2219, -13341, -50936, -77181, -66952, -42634, -30356, -11697, 9883, 13662, -33548, -46649, -20534, 7177, 35147, 43510, 48947, 30755, 36798, 44799, 42949, 59361, 59530, 56356, 43420, -1973, -9075, -5301, -33021, -26822, -6667, 17642, 24024, 16192, -146, -2331]
10992b331j5575k3732K4772L8121J4112r73j972l9695K776o617m452o570j6446
10979c8582j906P849J7812J3412O257l832j3Q26J0539J6766k3645k2777O253J5205
10965D164K665m6786m348K1773p824o017K3364M14O049j0688m305q776P181K2903
10951b31J2178n436k9585J212l351k3674K2931J6626P095J525j1419P338J2999
10938H208L863J7385J4917j4740k1113q176k6945N25J5581J1027M58L5726K0376
10925E7092n331J40J8161k9043l0618q325l013K4497J8174J2102r884j5212m807
10912B3933n846j2979j1037j0679m5924p398J5146K7180P325K4294l598j4906
10900a4489m376J2020K0532L1588K588m2775j3114R727J1404R783O699j7683j7184
$$ y = [-2331, -17906, -41638, -16866, 21255, 35367, 34394, 32422, -7273, -4497, -11114, -15566, -22136, -38582, -40488, -32639, -14827, -1415, 4842, 1010, 997, 1823, 12362, 29128, 5483, -17294, -11041, 4164, 6829, -39957, -44305, -22532, -30356, -36373, -13009, -12595, -6546, -17234, -21539, -30315, -23134, -231, 11947, 6511, -23074, -21862, -25213, -48887, -25956, -9330, -2235, -710, -12129, -4791, 8208, 12071, 29456, 44373, 29633, 8520, 344, -26601, -26076, -10495, 532, 990, 36716, 57092, 51761, 51901, 70062, 41019, 10401, 2076, -937, 23560, 41734, 53836, 43952, 28740, 23933, 18087, 5108, -5929, -16608, -62532, -69930, -54784, -27604, -20279, 4015, 417, -14489, -18865, -6845, 13687, 45275, 47863, 5088, -8026, 1701, 13105, 22888, 29587, 11904, -5280]
10887e280k001N018L6585M0722j4670p587l4025j8480O65K7275j299K4597L987
10874E5507J5538K2147R331k4799n532M970l438k0186O904j2977q169P939J5806
10861F3041j8821j4378k1988n384j2520J9948P880k7762r330K8161J7969N245
10849C2061p735q951j6930J8784L1566k4600k2627j5032k0735j4617m4453k0753
10837a14022M5913J8233K0437K5506J6771o26j6833n87Q869J0309K1903J187P458
10824D4518J2281J622O242M71K2343L801J4062m096J887K4083M638J2716j9605
10811A24963n1373r854l3835q15K5995K689O989Q401o823o060m8994m5632j2808
10798d7157M858N2501L701k4585k6057q853L471J3338J9015J958j3670j224J699
$$ y = [-5280, -7281, -2263, 34322, 75044, 60374, 52787, 18762, 282, 947, 28222, 26923, 51520, 55507, 71045, 93192, 102523, 77724, 72192, 77162, 73724, 53538, 60442, 47465, 39296, 47235, 63041, 44220, 29842, 7854, 2470, -10050, 9898, 17778, -9984, -19314, 8847, 26816, 32061, 24326, 15375, -1555, 17229, 48795, 24195, 1568, -13464, -34199, -48816, -93269, -114022, -68109, -49876, -29439, -3933, 12838, 12212, -4621, -5208, 3661, 13970, 35873, 37060, 44518, 56799, 58421, 64663, 65134, 87477, 91278, 105340, 101244, 103131, 127214, 131852, 144568, 124963, 73590, 63736, 29901, 29086, 55081, 57770, 64759, 73160, 66337, 60277, 11283, -34349, -47157, -42299, 10202, 13903, -10682, -36739, -45592, -42121, -28783, -9768, -7810, -21480, -22704, -21005]
10785b1005N669J4395o775K7590r47k8227j0289J8278l379J1051k9426k7464j1158
10772f1687N047M3982K8193n438Q183K70j5626m281J1702J5909m042k1634k1135
10759b0557j5001M3030j078j9798J065j5808k2043J0876L5965j2035K9424J7552
10747C1592j9049j7094K2767M248j6208p805k1504k2657j6897L8429K5454J5764
10735A7040R836K0679k9625l139J1364l1350j2642O079J6124q741m8676m896n606
10722f3553k2242L7981M0186J7266J600j5726j7815K2978k258l425N884p466j9406
10709b5996k0568K4926K2954R002q960R21M9610N674k8864l3894k5852J479l865
10696c3433K2241K9669p570P256j744M1079K2679j2141k92K1974l2131l7298j6432
$$ y = [-21005, -15336, -941, -7716, 19874, 18927, -9300, -19589, -1311, -4690, 6361, -23065, -50529, -61687, -56640, -12658, 15535, 10097, 18280, 18550, 2924, -1357, 10345, 26254, 22212, 578, -20557, -35558, 7472, 6394, -13404, -12339, -28147, -50190, -39314, -3349, -15384, 14040, 31592, 12543, -4551, 18216, 22464, 6256, -1549, -23053, -45710, -62607, -24178, 1276, 17040, 26876, 47555, 17930, 14791, 26155, -5195, -17837, -11758, 4366, -4375, -53051, -57947, -63553, -85795, -47814, -7628, 9638, 11238, -4488, -22303, 675, -1583, -5008, 876, -6590, -25996, -46564, -21638, 1316, 10318, 1358, 2279, 51889, 57563, 28699, -5195, -31047, -29568, -33433, -11192, 18477, 10907, 18163, 16419, 57498, 80177, 68036, 67744, 89718, 57587, 20289, 3857]
10683C857k0163K360R702k1916J3593K1079K1025J9626p20l4902J462j0927j1482
10670g406K990j353n457O232k4712K768K0301k6092j5561J8482L2309K9313j5414
10657A6400j7761J3040k0656r350j4910j711K4964K6578j8600n130j1866M9042
10645C0040Q267j6903J9283J1820k6862l8150p047l307N643k3849L847K7383M993
10632d842M55K910J2777J5186L881k8552k3048l105K1290K9244L1360l97m1654
10619A5505o8443j2215L234J0665K2198J5819j9527K375j0647k636M1299K8333
10607B5960p37l3668r251J644K2836J5232p9n810p956K3714j5075k7894j1184
10594b2268k1838j6120k7189K4966K9468L332p064j680J2024M639k364J4522L717
$$ y = [3857, -16306, -13946, -4244, -26160, -12567, 8512, 29537, 49163, 48443, 13541, 15003, 4076, -7406, -4416, -5769, -11226, -4994, -29706, -26938, -6637, -32729, -48290, -29808, 2501, 31814, 16400, -1361, 11679, -8977, -18327, -33237, -34948, -9984, 16594, -2006, -7136, -19002, 30040, 38307, 21404, 40687, 52507, 25645, -12505, -19552, -22859, -17216, -41065, -37218, -9835, -4842, -4387, -1477, 11300, 26486, 30367, 1815, -21233, -24338, -3048, 26196, 57556, 57159, 15505, -52938, -65153, -61919, -51254, -29056, -13237, -32764, -30389, -41036, -43672, -2373, 25960, 25223, -8445, -17696, -16052, 6784, 22016, 21937, 16127, 8171, 31885, 16810, -11084, -22268, -44106, -60226, -87415, -62449, -32981, -29649, -36713, -38393, -26369, -21730, -24094, -9572, -5855]
10581e855l5915k0902R945J0798p377l187L4462J2429n797n420K8374K291q304
10568E542k4605J1169R139p389o192n974j0488J0788J2595J0224q318k0555J4621
10555i443L4229k8366O794m090n36k7358j6030K3111l208q340O957K3332P581
10542D633O836j6937j2370O077k1116M360K1738K7064k3676k6644n986J4325J664
10529b0032j4814R515K6283K7627M986j966j2682j1187k6890N705n50K3464L0164
10516C9623j4877J149P48l3233J3271m318j4035K0489R438Q330j908j3907p747
10503C023n817j6903j299J9763R170Q080K334j6976l3207K8862k0459J9064j527
10490e892L386K8470j2869l151k2855j3823M499J3675K0408o01k2979L864j8330
$$ y = [-5855, -41770, -62672, -52727, -41929, -49306, -52493, -18031, -5602, -11399, -16819, 11555, 13846, 5542, -19063, -7894, 1245, -6144, -12336, -18310, -28798, -18010, -5415, 4809, -3509, -24064, -9443, 24786, -3580, 3214, -876, -1412, -28770, -44800, -21689, -24897, -33237, -26280, -2948, 4633, 11469, -5468, -17838, -11761, -32877, -28517, -6779, 20285, -3391, -30035, -36021, -21696, -20032, -34846, -25331, 952, 28579, 33565, 31599, 18917, 7730, -19160, -13455, -14005, 9459, 39623, 24746, 25895, 26643, -6590, 6681, 2363, -11672, 8817, 18255, 26585, 24677, 10770, 3023, -2794, -19697, -20996, -1233, 7937, 16017, 18351, 1375, -31832, -2970, -23429, -4365, -5892, -2506, 25964, 13095, 9944, -12911, -26734, -22235, -8560, 11848, 11247, -11732, -7868, -26198]
10477b6198k1914L160j5452N436K062K789L7873j0569p467n261K7522J2430j070
10464C341K3210l736M264l5160j226J4726j6382q160J2021J8200k7567l3506M4472
10451e503L5531k649n0177m3336k1937J3866j2865N2776K6933p243j2528k0523
10439d7655k9690L1448L261J8429N41j3488J015L8671Q907k1373J108J5288k0282
10426a3820o589K1189j392K608K1879j6858q385M508K2552l7944j2546L4372J2039
10413B1613j3019j2812n712J9877k3897n671J802R999N318k0987j8847N083N303
10400c1950J5636J8656K0509J0591k9702j3885j9260K4052J0017j1080m092l3297
10388d3805R411K5422j2956q479o105j3204k839J5587M1428L3236M655k2906l486
$$ y = [-26198, -48112, -44952, -60404, -54968, -52906, -50117, -12244, -22813, -30280, -35541, -8019, 4411, 3341, 26551, 22815, 27079, -8081, -9307, 5419, -10963, -19123, -7102, 11098, -16469, -49975, -5503, 30028, 27379, -22798, -66134, -88071, -74205, -87070, -34294, -7361, -14604, -27132, -47655, -77345, -45897, -42636, -24207, -23666, -37154, -36139, 2532, 11439, -9934, -8826, 6462, -13820, -20409, 780, -612, 1996, 23875, 7017, -1368, 3140, 25692, -12252, -24798, 9574, 21613, 8594, -4218, -9930, 9947, -13950, -19621, -17819, -7820, -2502, -23489, -42336, -37253, -31950, -16314, 2342, 22851, 33442, 3740, -10145, -29405, -5353, 4664, -6416, -10508, -43805, -34394, -8972, -21928, -30407, -36512, -49716, -52555, -36968, 4460, 37696, 42351, 19445, 15959]
10375A5959m6786j7285Q363m037j6309M717J93j870L0255J4458J2366p254p439
10362a4669M71k1185J0875J7745k889k1202M76p331L5496j4930k6967k3820j6652
10349h4582k5401L5934M3364K5720J9635R138Q799q645K157K5771r04l9028k9498
10336a7540J8682K6927k4438l108L7186L800k1629r1J4114j7590m2964l613K6823
10323c441k840N736K704k809L9902K4382O314k7868l9225m626M5582L2365J5861
10310I2037r12j0490J7120J8019J3500J2814L5408P1232M3021N1967J31724J81708
10298F57148K55290M42789O68586J117834J818553K474760J416830j357223k325210
10289E169357j932356j152603o55929l71083k27659j90843j40632r7924l7424
$$ y = [15959, -30827, -48112, -39749, -43786, -60095, -55378, -55185, -57055, -26800, -12342, 24, -7230, -14669, -14198, -35383, -24508, -6763, -9652, -30854, -30378, -37709, -2213, -17143, -44110, -67930, -84582, -109983, -74049, -30685, -4965, 14670, 23808, 32607, 23962, 26119, 51890, 50986, 11958, -17540, 1142, 28069, 3631, 523, 37709, 41509, 19880, 19789, 33903, 16313, -26651, -30264, -3441, -6281, -545, 2159, -650, 39252, 63634, 69948, 42080, 2855, -1771, 43811, 76176, 92037, 91125, 80635, 97755, 115774, 129274, 142088, 177496, 248728, 291749, 343716, 475440, 657148, 912438, 1355227, 2023813, 3141647, 4960200, 7434960, 8851790, 7494567, 5169357, 3237001, 2084398, 1428469, 1057386, 829727, 638884, 498252, 400328, 362904]
10280C62904l5259m3535p5288k6315K2009k4032j6265L8k4695k7670K16J4516
10268A26624J0300n0545k5140N375K5225k264K966j3790k1498K6562P128R812
10256A00755m2668k7679k1182j5446k6836P710J0958k470P122j1495j0993j7880
10244e0104j3917j2986j4189J5941M9136J6329j560R581N769j2879j0885K0551
10232G87o149k6051q402q091j2204J8777K1644J4127J056k467J3357p82J414p945
10218i29N59K4528l501j4329m154k7240j3469J7411R002j53R809k9110k5845Q153
10204d9268J6931M7668K0835p969j4131j6150J3246O287J8851j5358j5467j460
10192D015k1635J4239j9296R439K1841J6671l8001j4621j4794P87L8021K8493
$$ y = [362904, 327645, 284110, 208822, 182507, 204516, 180484, 164219, 164257, 139562, 111892, 112108, 126624, 136924, 86379, 61239, 66614, 91839, 89575, 92541, 78751, 57253, 83815, 90943, 100755, 58087, 30408, 9226, -6220, -33056, -25346, -14388, -16858, -9736, -21231, -32224, -50104, -64021, -77007, -91196, -75255, -26119, -9790, -11350, -1769, 4000, -8879, -19764, 787, -5362, -31413, -39815, -47906, -60110, -41333, -19689, -5562, -4506, -6973, 6384, 5602, 7016, -929, -370, 24158, 20657, 6328, 2174, -25066, -38535, -21124, -12122, -12275, -2466, -31576, -57421, -49268, -32337, 15331, 36166, 28197, 14066, -2084, 11162, 17449, 36300, 20942, 5475, 4015, -17620, -3381, -22677, -13238, 8603, 25274, -12727, -27348, -42142, -41355, -3334, 25159]
10180B5159J1447m1561J9046N5827k0506k1034m517o422k1148l57r261q363q396
10167c0086J7710J0197n814j2283J9384K3162O563k127l037J0891k7597k7040
10155b0077k0035k6622Q97M7668K8871O136k5864m2835k634P668J4291j590K199
10142c1927P494k3796j9810K5283J4810l339N55P009J9693J2585n794m5789P69
10129d2257L9675J2055k1445J1515J2412P009k8931j3892r417j2551j002j2712
10117e9541j508L4927r758P748L3710J5673l2347j3392K7791K7046j897J0399
10105C8851L307l9107j9094R041J6678j86l464j398L235J868L541j6220j3375
10092a6323p296P136O11j4748J3545M0361K0334r183q189j0150J2760o032J699
$$ y = [25159, 36606, -4955, 14091, 69918, 49412, 28378, 23861, 17439, -3709, -4066, -13327, -21690, -30086, -12376, -2179, -7993, -20276, -892, 22270, 28833, 26706, 23669, 34560, 6963, -20077, -40112, -66734, -65837, -18169, 10702, 16838, -9026, -51861, -54495, -46827, -32536, -34126, -31927, -24433, -48229, -68039, -42756, -27946, -31285, -30730, -23721, -4028, 8557, 2763, -43026, -42257, -2582, 9473, -11972, -457, 11955, 18964, -9967, -23859, -33276, -45827, -46829, -59541, -61049, -26122, -35880, -28132, 5578, 21251, -11096, -24488, 3303, 30349, 28452, 38851, 42158, 3051, -16043, -7002, 9676, 9490, 6026, 4628, 7863, 9731, 13272, -2948, -16323, -23619, -16483, -15872, -30620, -17075, 23286, 43620, 34437, 26248, 16098, 28858, 22826, 24525]
10079B4525J1391J8308k4765M317O094k0380k3966j7622M466J1192K019J8362
10067A3941N1814J5503O778K728l5597J2810K0828K8134j1401M018M747J4979
10055A29282P0485J03236J72343K77235M60782P46171J168392O45107q09140j103050
10045A860843q48712l95884j63460j16702q6037o6331l4745m1772j3268J9347
10035A13279m255l765j6994j6964l1266j4089L468J0991n917k619J3854m007j8154
10022B3562k0992O69k1964j0933K1369k6536j2981K8122K5906j0145j4697l2533
10010e1153K006K4220K2631L831k0230J0119L2615k8873K1856K5305l4636j1513
9998c822J221j897J6771K3175k0300j5680k4515q533j443r379O177K7794r594
$$ y = [24525, 35916, 54224, 29459, 33776, 39870, 19490, -4476, -22098, -17632, -6440, -4421, 13941, 65755, 81258, 88036, 90764, 55167, 67977, 88805, 116939, 105538, 109556, 114303, 129282, 199767, 303003, 475346, 752581, 1213363, 1959534, 3127926, 3773033, 2963893, 1860843, 1012131, 616247, 452787, 336085, 250048, 183717, 148972, 107200, 93932, 113279, 109024, 105259, 88265, 71301, 40035, 25946, 29414, 40405, 34488, 31869, 45723, 41716, 23562, 2570, 3239, -18725, -29658, -8289, -34825, -47806, -19684, 6222, -3923, -18620, -51153, -49147, -24927, -2296, 1535, -18695, -8576, 24039, -4834, 17022, 42327, 7691, -3822, -2601, -4498, 12273, 35448, 15148, -532, -25047, -33580, -35023, -44402, -38225, -10431, -20025]
9985b0025j7910j3364M260K5134o70L0641R852r233k411k973m450p12j4322j5217
9971c1400J9060j136R939p846k8894j5839K2823n924o674j198J5502L8465K0877
9958B7755r979j8958m4586j1496J6276J1903j9125j777R715J3887Q600k341K4323
9945D197J7827M230r86k1884j3402k6159j1926K9895J6676l1313j5020J926J7143
9932b8796J2289J8359k5322q977M2253L439r559k4564j770J8909J4261j9606j3459
9919b2543q545J925r676j8394j4299J6719K4355r493j6359J1558j5538R216L3793
9906a7281P692j4964j4665o509M021J6110k2378j5980J9736K6144J3813k504J1935
9893E170J043P186k9922m6724O131l2350O639r933K5324L9118M75P49J2579j4071
$$ y = [-20025, -37935, -51299, -47039, -21905, -22575, 8066, 17918, 8685, 6274, 3301, -1149, -1861, -16183, -31400, -12340, -13476, -3537, -11383, -40277, -56116, -33293, -39217, -45891, -47089, -31587, 6878, 27755, 17776, -1182, -45768, -57264, -40988, -29085, -48210, -49987, -40272, -26385, -17785, -20126, 4197, 22024, 26254, 25268, 3384, -10018, -36177, -48103, -18208, -1532, -32845, -47865, -45939, -28796, -16507, 1852, -23470, -32447, 9806, 13245, 3686, -20878, -22648, -3739, 10522, -9084, -22543, -31088, -29163, -38839, -57233, -71532, -54813, -30458, -39951, -56310, -44752, -60290, -51074, -17281, -9589, -24553, -39218, -45727, -41706, -25596, -47974, -63954, -44218, -18074, -4261, -6765, 5170, 6213, 13399, -16523, -63247, -57116, -89466, -82827, -92760, -67436, -28318, -27843, -27094, -14515, -28586]
9879b8586L3285K7282n563K736l4393k627J5502j5169q104J5017K8030j8032r707
9866c29n791j3333L5636K246k0820k2153L035J0704q970r237P306j4636R689k691
9852b9344j4576Q528L7945J2460q180j9160p758J8070P397k640j2005j240n31
9839a1034K226j9149l124K2708l801K2040Q749j1729p043J642k4636J7987J2508
9826G344J3381j8939Q092P364L0097J6801J8677j6302p641j5461l2559n300p157
9813a603k338K787j8284j3327J1092K8774J2549j0849l452j9609o158J6733K0150
9800A6465j5007j9338q030n478j7999j8610N574q055J4703J1297M1197J0298k305
9787D712j4592j9231k4108P560K9005R369k477R776J8224L6802j2874n646j0549
$$ y = [-28586, 4699, 31981, 26418, 29154, -5239, -7866, 7636, -7533, -15637, -620, 27410, 9378, -329, -6120, -19453, 16183, 18429, -2391, -24544, -21509, -10805, -19775, -29012, -21706, -36342, -26653, -29344, -43920, -35392, 2553, 15013, 6833, -12327, -20085, -2015, 5382, 2742, -9263, -10503, -11034, -8808, -27957, -31081, -8373, -12174, 9866, 18615, 6886, -157, 1485, -23151, -5164, 7344, 20725, 1786, 9878, 17242, 47339, 64140, 82817, 66515, 58874, 43413, 10854, 5554, -1603, -3941, -1154, -19438, -32765, -21673, 7101, 19650, 8801, 5349, -14260, -20418, -3685, 16465, 1458, -17880, -25910, -31388, -49387, -67997, -62423, -70478, -55775, -44478, -3281, 7017, 4712, -9880, -29111, -53219, -45659, -16654, -7285, -9762, 14, 18238, 55040, 42166, 36520, 25971]
9774B5971k8171k0459O120r647j2949l332j3442j8343L5184M4621J268o543l2266
9761c1988k2572O773j9902k389M1131N701k691l517J1412l413M623K4904Q566
9748A6638j0795N115J2543L514o851j1069l657L0299K2969j2267k7575k779l3617
9735a7532k1901L442L2118J9040k94j7676j5397o641M93O125P768J5978J9440
9722B4963k882k4493N219k7942k6473L058J3647o088k233M3414J1008J1025l406
9709A8817R172j6759k7931r603J6747L6027Q539l9454j5382J4302j6097M693J5487
9696a442M275o18Q335P22p86j0917N316O238k5403J9838j29K7361P416l7194k1188
9681a8176P181l0104j9946K8804K1990O515l6571k3613K4559M4271K0288q265
$$ y = [25971, -2200, -22659, -16539, -26186, -39135, -42467, -55909, -74252, -39068, 5553, 6821, 278, -31988, -54560, -47787, -67689, -70078, -28947, -23246, -25937, -29454, -18042, -21455, -16832, 8072, 16638, 5843, 10958, 23501, 27015, 20164, 9095, 5438, 35737, 58706, 46439, 18864, 16085, -17532, -39433, -35991, -3873, 15167, 14873, -2803, -18200, -24841, -24348, -18223, -10455, 5523, 24963, 22081, -2412, 2807, -25135, -51608, -48550, -34903, -40991, -43224, 190, 11198, 22223, 18817, 27989, 11230, -16701, -26304, -9557, 26470, 35009, -4445, -19827, -5525, -21622, -16929, -1442, 2833, 2215, 10550, 11272, 10486, -431, 4885, 11123, -14280, 5558, 5429, 32790, 40206, 3012, -18176, -10995, -41099, -61045, -32241, -10251, -3736, -40307, -63920, -39361, 4910, 25198, 16933]
9669A6933N436p721R218r439O696K382Q530K3277j1789k6992l3648p107M50K7990
9655D216J8419K1928q531k8595j8515K8380J1095J1391P607K6207k0324j7448
9643C5830o076k4438N834m7933j2846K3876J9099k6936K5545N798m403p331j2846
9630b6827q931J2827l307L648K1064Q737l04k5138j9575J3769L155K993J8340
9617D51L5825R211m4945k1864K097j2613K1083k5477j3291K594K1157j679K5908
9604a543Q135R656r786l2458n0741L247M5880L2209M27M148J0060L6976K3176
9591G9386k7879l8443j654J0232J849o551M038k7069j2513K8710L412l041j6864
9578f387P324K159K6390N890k4476m4377j46L4992K0827k3239M952j5242l887
$$ y = [16933, 22369, 14648, 23866, 14427, 21123, 23505, 32035, 55312, 43523, 16531, -17117, -24224, -23774, 4216, 22635, 44563, 36032, 7437, -11078, 17302, 28397, 39788, 47395, 73602, 53278, 35830, 29754, 5316, 11150, -36783, -49629, -25753, -6654, -33590, -8045, -2247, -6650, -13981, -26827, -35758, -22931, -26238, -22590, -1526, 7211, 6907, -18231, -37806, -24037, -20882, -17889, 451, 36276, 45487, 542, -21322, -19225, -31838, -10755, -36232, -49523, -46929, -25772, -27451, -1543, 6592, 16248, 6462, -25996, -76737, -73490, -27610, 4599, 5026, 9174, 19234, 56210, 79386, 51507, 13064, 11410, 21642, 23491, 16940, 20978, -6091, -18604, 10106, 13518, 10477, -6387, 937, 3096, 29486, 35376, 10900, -33477, -33623, 1369, 22196, -1043, 3909, -11333, -15220]
9565a5220j5403p791O482J436p0J5895J1194K741K6713j0730m365J7543j1092
9552A7333J1833l060j5019P65k0750o099L557O239P342K249J3784j4736J1787
9539A5225M890r738j3289J2213J5595J1679j1805p161l634q682j1442Q221K0830
9526B2902m155l840j7650j6534j3742p023K7919j2036k485J6323P656l0818K4956
9513h527K5507L7l1062j2191k1655j2038J6943L8983l811j58l496P766J3061j2979
9499c620m7317o931K9006L7123K3616K0540n131m0163j3293M57J4845L521n204
9486G449k3233j7747l8954J5598L7762K8903M132k736k203j433l8350m2145J5221
9473e7736K9990J6510o95j3411Q958L4358J0387N2J8064K1097l2187j5767k0189
$$ y = [-15220, -30623, -38414, -31932, -30496, -30566, -14671, -3477, -736, 25977, 15247, 10882, 28425, 17333, 29166, 26106, 11087, 11852, -8898, -14997, -11440, -5201, 2141, 4390, 18174, 3438, 15225, 20115, 10377, -2912, 9301, 24896, 36575, 24770, 17609, 13975, 5293, -6149, 2072, 22902, 18747, 14907, -2743, -19277, -33019, -40042, -12123, -24159, -26644, -10321, -2665, -33483, -8527, 16980, 17017, -14045, -26236, -47891, -59929, -42986, -4003, -7814, -7972, -11468, -3702, 9359, -3620, -50937, -57868, -28862, 8261, 31877, 52417, 47286, 7123, -6170, -5713, 9132, 12653, 7449, -15784, -33531, -72485, -56887, -19125, 9778, 13910, 11174, 8971, 7538, -30812, -72957, -57736, -27746, -11236, -11931, -25342, -16384, 17974, 28361, 28413, 46477, 67574, 35387, 19620, -569]
9460e69k2729M234P627j5631q444j3018j3444N113M1086L6595j7596J5436j2431
9447F229p634O206J9069j1766j2915p449K2Q402k511k53q012J223j1072K4594
9433D133O373J549k4820N504L3281K1325L588n980p405J2376L075o696j7735J2714
9419D1282o401l296J079O51p080Q95j1095n88p275R623R671M74q447k4350o2314
9404f7171j967N0930J6152K2328j2310k40q375J4011P951L988j7231L505J9789
9391C1360L3455m0293l5685j174K8538l096k9633m848J9890M74PJ3194J0093k7040
9377d758k6013p559j0654L5601J3526j2594J4262J4318r525j4722j7346J1259
9365a4205l54j1494J9977P467j3001R366J4935k002n702r113K027K518P78J262
$$ y = [-569, -23298, -19064, -11437, -27068, -35512, -48530, -61974, -56861, -15775, 20820, 3224, 18660, 6229, -1405, 4801, 23870, 12104, -811, -8260, -8238, 164, -2347, -2600, -10612, -9389, -20461, 4133, 10506, 12055, -12765, -7261, 26020, 47345, 50933, 44953, 37548, 49924, 52999, 46303, 28568, 41282, 34881, 31585, 32664, 33315, 26235, 27130, 16035, 15447, 8172, 17795, 27466, 27940, 19493, -4857, -67171, -69138, -18208, -2056, 20272, 7962, 7722, -653, 13358, 21309, 25297, 8066, 11571, 31360, 64815, 24522, -11163, -12337, 16201, 13105, -16528, -21376, -1486, -1012, -1005, 12189, 22282, -4758, -30771, -38330, -48984, -13383, 143, -12451, 1811, 16129, 6604, -8118, -25464, -14205, -14559, -26053, -6076, 1391, -11610, -2244, 12691, 10689, 4987, -4126, -2099, 419, 1197, 2459]
9351B459o427R314j5834J7463J6449P855o157q375Q048r460N737l80J7015M581
9337D2288L325m223q685k0239j705N788m304M96m139k9773Q069K2460N911p229
9323H040Q642R600J2543K7822J0891J271J2802k398j5900m0829r50r981L240m17
9309B4376n949K250K4788L4760R546l1677k9242j4770n339J2684J3241J0851L2461
9296G7980O107r08l0606l1572p439O015l05Q682M172k8844R746J7071j0538k775
9282A6786J8664K0190j9329j8053L504O562j0697o719R308J0641K1893J752n535
9269D8967O263k1877k236N164k2671n428K1277J1949J3779q396j5538K28k2572
9256H909j1748K1653K0642j4645R516M7181L7100j1735m0895p473j8969l0177
$$ y = [2459, -3968, 5346, -10488, 6975, 23424, 31279, 25122, 16747, 24795, 15335, 21072, 20692, 37707, 42288, 45613, 41390, 32705, 12466, 10761, 16549, 12245, 12741, 8602, -21171, -13102, 9358, 15269, 8040, 16682, 26282, 38825, 66647, 77538, 78809, 91611, 89213, 73313, 32484, 31534, 21553, 24793, 24376, 18427, 20677, 45465, 80225, 89771, 58094, 28852, 14082, 8743, 21427, 34668, 45519, 77980, 84087, 83179, 52573, 21001, 13562, 19577, 19272, 27954, 32126, 3282, 13028, 30099, 19561, 16786, 35450, 55640, 36311, 18258, 21762, 28324, 17627, 10908, 20216, 30857, 52750, 54502, 48967, 55230, 33353, 31117, 36281, 13610, 8182, 29459, 41408, 55187, 46791, 31253, 31481, 8909, -2839, 18814, 39456, 24811, 34327, 81508, 118608, 106873, 65978, 58505, 39536, 9359]
9244I359n09n057k081J5080K4599J6740m502R342k8421k0280j7262K8885M5674
9231G1567N148k3040o755j0840j6296J4288L3372Q623j2676j4999k0601P375k435
9218C2731R72L026j4445K319j849m475K4095M686j619J4204J3073K1743K3483
9205A17944K4713l1069j6164M0693P375l265K1548n480Q820K7016J9387K6267
9193B37785K7239J5698J3954K4341N7041O1538N8241N7231M8546R1833J31381
9182H24828J66243K11203K97517M25511O16845Q88982J377026K081663L100050
9173I989868M437646M992988K301542k546399m879379m509721l052735j892442
9165D841368j172175p84244n67372l80630k82421k48291k28459j62637j16571
$$ y = [9359, 8850, 3793, 1712, 16792, 41391, 58131, 53629, 62971, 34550, 14270, -2992, 25893, 71567, 76715, 53675, 46920, 36080, 19784, 34072, 67444, 76067, 63391, 48392, 27791, 35166, 32731, 33703, 36729, 22284, 24603, 22754, 18279, 42374, 47060, 45441, 59645, 72718, 94461, 117944, 142657, 111588, 95424, 136117, 143492, 140227, 161775, 156295, 165115, 192131, 211518, 237785, 265024, 280722, 294676, 319017, 376058, 437596, 495837, 553068, 601614, 693447, 824828, 991071, 1202274, 1499791, 1925302, 2542147, 3431129, 4808155, 6889818, 9989868, 14427514, 19420502, 21722044, 19175645, 14296266, 9786545, 6733810, 4841368, 3669193, 2884949, 2317577, 1936947, 1654526, 1406235, 1177776, 1015139, 898568]
9156H98568j03488j20266o9149n7501n6325k1448l7197n4193l7264r58j2174n0689
9144B77916k7461J27j5960m269j8422p243l9024l6653l673o407K8397K5806k6411
9131A46723l2543j4220n880K370l529j5220O943P358K4951L529j6840o142l3864
9118F3636j7114Q567j5319r850K5218l657k7047j1563J5047K2148L7899J6947
9106A04912l2548m1093k7420P363J7183L115o954q664J1356j5532j5015J8598
9094A5301K1920n539p798l031K250J5148O619k5506O697j0041k5160J523K8636
9081B1019J8314J2595J667J699P168P547k3156k2574j9334L001P877O073R497
9068C1393j390k0153O613L8593J3422o453K3235k3540n313J5632p028l1889j0625
$$ y = [898568, 795080, 674814, 605665, 548164, 491839, 470391, 433194, 379001, 341737, 340779, 328605, 277916, 250455, 250582, 234622, 230353, 211931, 204688, 165664, 129011, 125338, 118931, 147328, 173134, 146723, 114180, 99960, 94080, 96450, 92921, 77701, 84644, 92002, 116953, 120482, 103642, 97500, 63636, 46522, 55089, 39770, 29920, 55138, 51481, 24434, 12871, 27918, 50066, 87965, 104912, 72364, 31271, 3851, 11214, 28397, 31512, 24558, 15894, 27250, 11718, -3297, 15301, 37221, 31682, 23884, 20853, 23103, 38251, 44870, 19364, 26061, 16020, -9140, -7617, 21019, 39333, 51928, 53595, 55294, 62462, 70009, 46853, 24279, 4945, 7946, 15823, 21896, 31393, 30003, 9850, 16463, 55056, 68478, 62025, 85260, 61720, 56407, 72039, 65011, 33122, 22497]
9055B2497K0649K3083J3066J0336J600k4099q040k1635Q079k273o125j8826j0880
9042G432j308J9867j0129k2025L552k2581P746K5783K350N052k787k3087J0948
9029H13K5708K094N928j4015j9880n331L9436K8673o877l1508m6096q026Q405
9016b0676K1456J1771J7183M1437L7176l0967j5962m4310P020q381k4136K5287
9004A6898R77L0001p053j4551l4171R786K6445K1272J4355M0967j5676k4748l6639
8991B7863Q189N3180L1664J002l4790l6612k5169j1797P970Q46L9913j391m0067
8978B0801j2291K7872L6083k090j4606j2743k0786J0260K0983p221k42K349l1415
8965A6954j2720R944r10n652j4508J1830K7775j6572j1897l3790m209N3663J0891
$$ y = [22497, 43146, 66229, 79295, 89631, 91231, 67132, 59092, 37457, 45536, 43263, 37138, 18312, 7432, 6124, 25991, 15862, -6163, -2611, -25192, -17446, 8337, 10687, 15739, 12952, -10135, 813, 26521, 28615, 34543, 20528, 648, -4683, 34753, 63426, 56549, 25041, -21055, -29081, -20676, 780, 12551, 29734, 71171, 108347, 77380, 61418, 17108, 24128, 15747, -8389, 16898, 17875, 47876, 40823, 26272, -7899, 1887, 28332, 49604, 63959, 104926, 89250, 64502, 27863, 36052, 89232, 120896, 121898, 87108, 50496, 25327, 13530, 21500, 22346, 62259, 60868, 20801, 8510, 36382, 72465, 70375, 55769, 43026, 22240, 32500, 53483, 46262, 46020, 48369, 16954, 4234, 14178, 13268, 7616, -6892, 4938, 32713, 16141, 4244, -29546, -33755, 19908, 30799]
8952C0799j4429k990j5279j3901L3878K1546J1184P060j1467j5965K519L4578
8940F7533L4535n332n4164k3729j9201J0607J4883J4760m61p350K2267P396O374
8927F8118j3719k819j9790k8068m52P037j5549j4384K5954K1916m890j3118p604
8914B632M5443o887k500L862j5300n760l329P732J3926N672J5452J941j4271N144
8900E3757j4031q434o18j317J7507k4139M62P064k9823k4511J2186L2418K8428
8887D8949L926Q499R087n0369k0792l971K6225K5943M523k2517q028K3141k2423
8874B2193K2146J2781r103J5751K2633K244J6934M7476K9229M5094O6457R355
8862C03190o3603o9746n9663j5875k0501j3618k9541J636N0140O2406N1661j4497
$$ y = [30799, 16370, 13380, -1899, -15800, 18078, 39624, 50808, 57868, 46401, 30436, 32955, 67533, 102068, 96736, 42572, 18843, -358, 10249, 25132, 39892, 39431, 32081, 54348, 61744, 68118, 54399, 51580, 31790, 3722, 3270, 10307, -5242, -19626, 6328, 28244, 23354, 10236, 2632, 48075, 41188, 38688, 42550, 27250, 21490, 18161, 25893, 39819, 45491, 60943, 62884, 48613, 53757, 39726, 31292, 30674, 29357, 46864, 22725, 23187, 30251, 428, -24083, -11897, 20521, 48949, 52875, 61374, 70461, 20092, -700, -4671, 21554, 47497, 52020, 29503, 21475, 44616, 22193, 44339, 57120, 48017, 63768, 86401, 88645, 105579, 153055, 182284, 227378, 293835, 303190, 239587, 169841, 110178, 94303, 73802, 60184, 30643, 32279, 82419, 144825, 196486, 181989]
8850A81989k0777k9047m6070m233J1798k8422l823o12k2382J5266P711k6319k8494
8837F585J1133j0637l0194m749J9833J3897j227M4129J204o513L5561K1719l635
8824I7106k5903k9184J9324K0608M97k9355l1475J4396k4919J5817K0294k6635
8812B0571j2600j4359k5009J7925J0729k3803M98L2957L3049k0840n562K6421
8800C9977Q544n480M630j1871L669k31j89Q210j239O803M0339j2860n408k1949
8786E2945j9790N3948K7365m707j1616k4886l9637O030J9048P998k1535k3157
8774B2006j3938L198K291K0263K934k5871J0851J6138L1681N325k1404j173K2664
8761G4965J5017j58L2294M593M684k382l3207r847r179k610l2656j0744J5406
$$ y = [181989, 161212, 132165, 86095, 81862, 93660, 65238, 61415, 60803, 38421, 53687, 61398, 35079, 6585, 17718, 7081, -23113, -27862, -8029, 5868, 4641, 48770, 49974, 43461, 79022, 100741, 97106, 71203, 42019, 61343, 81951, 82448, 53093, 21618, 36014, 11095, 26912, 47206, 20571, 7971, -6388, -31397, -13472, -2743, -26546, -26048, 6909, 39958, 19118, 13556, 39977, 48521, 43041, 47671, 35800, 39469, 39238, 39049, 47259, 46020, 52823, 93162, 80302, 74894, 52945, 33155, 87103, 114468, 109761, 98145, 73259, 33622, 39652, 58700, 66698, 45163, 22006, 8068, 11266, 13557, 33820, 36754, 10883, 21734, 37872, 69553, 74878, 53474, 52301, 74965, 89982, 89824, 122118, 126711, 131395, 129013, 95806, 85959, 76780, 74170, 41514, 30770, 46176]
8748D6176j3502J3503N3773O644M925j0477r984k1062j117J4312J3660j3559p771
8735G5521l116R631J4962j8631L612J3049J366r154l5093k1009N648j5865K6146
8722D7067M0693M880k0922m0312j1618J3475J4854R730j2242J7665R563R577j1676
8709G0734j1178j6593J9666k731j0008L6545r966Q062J8208o528p686N136K810
8696I6471j0014j3058o909L783o375L7958K0938J0557k2849j7006p234o373L4628
8683A14517K8045m499j0468J3569m87l867Q300j7930k2441J2201J419o343J265
8670A13281L2883r304k3234J0011K1553j2011k0019j083O3930K9846k6319l6965
8658A42569j1563j1432R468j0331N740K6828K3334q28q448J4691n999K4517L1517
$$ y = [46176, 32674, 46177, 99950, 106594, 111519, 101042, 91058, 69996, 68879, 83191, 96851, 83292, 75521, 72405, 82036, 96998, 78367, 81979, 95028, 96394, 87240, 52147, 31138, 36786, 20921, 47067, 87760, 92640, 71718, 31406, 19788, 33263, 48117, 57847, 45605, 63270, 72833, 82410, 70734, 59556, 42963, 62629, 59898, 49890, 86435, 76469, 84531, 102739, 96211, 88525, 93661, 96471, 86457, 73399, 66490, 70273, 63898, 101856, 122794, 133351, 110502, 93496, 86262, 79889, 114517, 142562, 138063, 127595, 141164, 140677, 136810, 145110, 127180, 104739, 116940, 118359, 112016, 113281, 146164, 136860, 113626, 123637, 145190, 133179, 113160, 112077, 176007, 205853, 179534, 142569, 131006, 119574, 129042, 118711, 124451, 151279, 174613, 173785, 165337, 180028, 174029, 198546, 230063]
8645B30063o845l1137j3458N036L5731j1623j7014J0264j0140Q503J6627M5290
8633B61297K2291k6849k5934J8069J0015K4717J0901K6547N2003l805j795O653
8621C74110Q172M377J7136L0183K5157k2931o406M1503L1075L1096K1202rJ0102
8608E64767l212N622O9777P3253L6487K4486L4586O2689P0256P3269R5200N1377
8596A158557P6238P3303M5950J2608k8082m4998o7915j01189j14076j26237r2027
8585G92132r8500o2169o0020p0076l9290k4697j133J6768k5300m6616k5184j5230
8573C40685k5853L796j6477l0846k7653o362j1214j9371q525j5378K1745M0001
8561B44548k6848k0674q284k050L3825K2355L824l7199J698M889K765r676k644
$$ y = [230063, 223218, 192081, 178623, 183659, 219390, 207767, 190753, 201017, 190877, 199380, 216007, 261297, 283588, 256739, 230805, 248874, 258889, 283606, 294507, 321054, 373057, 369252, 367457, 374110, 382282, 386659, 403795, 433978, 459135, 436204, 429798, 471301, 502376, 533472, 554674, 554665, 564767, 561555, 567177, 636954, 710207, 746694, 771180, 805766, 868455, 938711, 1011980, 1107180, 1158557, 1234795, 1308098, 1354048, 1366656, 1338574, 1293576, 1225661, 1124472, 1010396, 884159, 792132, 693632, 631463, 571443, 501367, 462077, 437380, 436247, 453015, 427715, 381099, 355915, 340685, 314832, 318628, 302151, 271305, 243652, 237290, 226076, 206705, 198180, 182802, 204547, 244548, 217700, 197026, 188742, 186692, 220517, 242872, 246696, 209497, 211195, 216084, 218849, 209173, 206529]
8548B06529j2809J9360j7651n3805j8666J9395J0723j7894n701L992m067J1495
8536A40901j2856j772P156k4242J0077R416N009L467L969K5003r669q661l6250
8523A11548k4809K5188j6221R81Q08j9119j2414q836K2766L7560q768j9486j3395
8510G5803K9120R618r709l149m6820j1178J0142L8312J0821j0118J2872J2273
8498A17987k6611k4603R867Q367l903L0657K0685j4277m6567p697N644J374L610
8485G4533J9031j3865k68M202k8110j1903Q179j1326J5677Q709O358J3209J3028
8472I7454n787R986J6453j9852j2812k4087M369L487J0110n536l589j0784j1284
8459D8128J3544K3182Q332J4268k0552J363k600k8309j2178O905J1909k014J34
$$ y = [206529, 193720, 213080, 195429, 141624, 122958, 142353, 153076, 135182, 129481, 133473, 129406, 140901, 128045, 126273, 133429, 109187, 119264, 128680, 133689, 137156, 141125, 166128, 156459, 147798, 111548, 86739, 111927, 95706, 96687, 97495, 78376, 65962, 57126, 79892, 117452, 108684, 89198, 75803, 104923, 114541, 104832, 101683, 54863, 43685, 53827, 92139, 102960, 92842, 105714, 117987, 91376, 66773, 76640, 85007, 81104, 111761, 132446, 118169, 71602, 63905, 69549, 70923, 74533, 93564, 79699, 79431, 83633, 55523, 43620, 51799, 40473, 56150, 64859, 71217, 84426, 97454, 91667, 101653, 118106, 98254, 85442, 61355, 65724, 69211, 79321, 73785, 70196, 59412, 48128, 61672, 84854, 93186, 107454, 86902, 88265, 85665, 57356, 45178, 52083, 63992, 61978, 62112]
8446F2112o176j675j540p734o764J468j1525J5058J1020l418K3697J7807j7775
8433G4555l7410j4182K6957J6434l4630n734J1737j5556J5042q773k4794L3784
8421C7430L2534O482K738j2496J1248j0812j1095k758L4988l216k6043o986j3865
8408C8149k4932k19J4225M1879j5663k3396l0510L5688K4486N679j4043k9370
8396B1973L399K1366M3120j3224k1786J1454J1052q505k0399J9962J6372j4589
8384G0195j657m298J6886Q273J1098p594k8298k1125r913l7901J221N231p329
8371e211j369j1207M6184P269j933P114O597j7001j6281J7771J519J5168k6935
8358B1685l1554j6387J8729L2390K1657J8284k1016j5175Q658j0592r589j7407
$$ y = [62112, 55936, 54261, 52721, 44987, 38223, 39691, 28166, 43224, 54244, 50826, 74523, 92330, 74555, 37145, 22963, 49920, 66354, 31724, 25990, 37727, 22171, 37213, 28440, 3646, 37430, 69964, 76446, 79184, 66688, 77936, 67124, 56029, 53271, 88259, 85043, 59000, 52014, 38149, 13217, 12998, 27223, 69102, 53439, 30043, -467, 35221, 59707, 65386, 51343, 21973, 25372, 46738, 89858, 76634, 54848, 66302, 77354, 68849, 48450, 68412, 84784, 70195, 68538, 64240, 81126, 89399, 100497, 92903, 64605, 43480, 33567, -4334, -3113, 2118, -5211, -6580, -17787, 28397, 35666, 33733, 40847, 47444, 30443, 14162, 31933, 33452, 48620, 21685, -9869, -26256, -7527, 24863, 46520, 64804, 43788, 28613, 37271, 26679, 17090, -317]
8346c17o510K5991L0717k1748l621r286r892K1719j0498j1857J2193J5012J8734
8333E0637p008k4692K8408q56J0435j8617j6979J6220K7507o201m557q826o651
8320C8820L3475O545k9495m427j6639p733L3425K0858r602q603j7409r90l987
8307C4238J9941l75J3863m974m222j4952m3271j4719j3733L2485M5558M9035J1092
8294A09966j6419k2140j3597J2652J0445J3433q086j7028l3112j3740m2573m0020
8282f0219r394N7848L4960j9716j9807R148P051K356J9117Q766J9078J2453j5801
8269D5840j2700J9044N647j5504j9943Q536j1247l509K7880L5538N763n0601m6166
8256a1422J9277K5166M491N667K7203K3238p619j4641M192k5946k0303l686J4756
$$ y = [-317, -6827, 19164, 49881, 28133, 24512, 15226, 5334, 27053, 16555, 4698, 16891, 31903, 50637, 43629, 18937, 47345, 46489, 56924, 38307, 21328, 37548, 65055, 58854, 54297, 45471, 38820, 72295, 78840, 49345, 44918, 28279, 20546, 53971, 74829, 65227, 56624, 39215, 38225, 34238, 54179, 53804, 67667, 62693, 58471, 43519, 248, -14471, -28204, 4281, 49839, 98874, 109966, 93547, 71407, 57810, 70462, 80907, 94340, 86254, 69226, 36114, 22374, -20199, -60219, -69613, -11765, 23195, 3479, -16328, -7180, -129, 2227, 21344, 30110, 49188, 61641, 45840, 33140, 52184, 57831, 42327, 22384, 30920, 19673, 16164, 44044, 79582, 85345, 34744, -11422, 7855, 33021, 37512, 43179, 70382, 93620, 86001, 71360, 75552, 49606, 29303, 25617, 40373]
8243D0373q761o406K7071J804K3429j7723j7208L665P276j5903q335J878K642
8230C3802k0736j4207Q961K9277o490k0187j9483M526K8446p541j7222J8350j4671
8217B825J760M106K8643J2668j1810K2314r29r015o731k8078m8295l061L105K7603
8203d895L2651K0959q612M93M178k087k4194q715K2205j610o048O046P212j8332
8189A9251K6214J4200J1017J4168R569j3774j6552k9545l2800J88J217O363Q065
8176A7581J0733J8486m062j4507R1o598L503J1531k844J3965R681j0891P323R401
8162F3393r466N515N729n871n278J8296j2924q18R109k7315k9763J233r086p589
8148d835m653K3495J5682L347j9312j5032K8309M2120m637Q823J2909m266k3125
$$ y = [40373, 31612, 25206, 52277, 54081, 77510, 59787, 42579, 46244, 53520, 37617, 29282, 31160, 33802, 13066, -1141, 7820, 37097, 30607, 10420, -9063, -4537, 23909, 16368, -854, 17496, 2825, 4585, 8691, 37334, 50002, 38192, 60506, 59577, 50562, 43831, 15753, -32542, -35603, -32498, -4895, 27756, 48715, 40103, 40596, 44774, 42687, 18493, 9778, 31983, 30373, 24325, 30371, 37583, 19251, 45465, 59665, 70682, 84850, 94419, 80645, 64093, 34548, 1748, 1936, 3153, 9516, 17581, 28314, 46800, 42738, 28231, 28322, 21724, 25227, 36758, 33914, 47879, 57560, 46669, 53992, 63393, 53927, 59442, 65171, 59300, 54022, 72318, 59394, 58576, 67685, 40370, 10607, 11840, 2754, -4835, -9488, 14007, 29689, 33036, 13724, -1308, 27001, 69121, 64484, 73307, 86216, 81950, 58825]
8135E8825q493p966n158j310p458L370R711K7621k0397j3972j4353K1747R300
8122E1467m5880N034J3132k994J5617J5854K0860K5134k1960k9796k288J2434
8110E6614k5859j8953Q677m934j2028R26K6079L5187Q189K4057R785l2423l8247
8097C7070j6919K4742j8827m692j3048o051M0511K093L216p687K252J3502r926
8084D6236O38P256P411r415J079k6259j2009r86k158o14p232j0810K0181j0843
8070B475J0395K3114j062K0757j14L339j5647j5095j1656L2169J8472L012r526
8057F0633K149R69J7840J5031M931K774l441m604J5380J9462j5112M78L6795Q673
8043A61958K584j0304J7381J3596j2286k0928j859n878l8116j5399K1384J4971
$$ y = [58825, 50332, 42366, 37208, 35898, 28440, 31810, 41521, 69142, 48745, 34773, 20420, 42167, 51467, 5587, 10621, 23753, 20759, 36376, 52230, 73090, 98224, 76264, 46468, 44180, 56614, 30755, 11802, 20479, 15545, 3517, 4443, 30522, 65709, 73898, 97955, 107740, 75317, 37070, 20151, 44893, 26066, 21374, 8326, 2275, 42786, 44879, 48095, 40408, 42660, 56162, 46236, 46874, 54130, 61541, 52126, 53205, 26946, 14937, 13951, 11793, 11179, 3947, -6863, 13318, 2475, 12870, 35984, 34922, 55679, 55565, 58904, 43257, 28162, 16506, 48675, 67147, 70159, 60633, 62782, 63751, 81591, 96622, 101553, 104327, 100886, 96282, 111662, 131124, 116012, 116490, 153285, 161958, 164542, 154238, 171619, 185215, 172929, 152001, 150142, 144264, 106148, 90749, 112133, 127104]
8031A27104J8018R049L729j9804l0078K5469J9087P29N328j2821j4018j6715N474
8018A20551J6997j8239k2337N406R628M4533L5199N064L6105L3419K3172N8740
8006C48238N7175O3367M0985K357n1680k6025L803K0752j0781l3432n8046j4844
7994C41869K6653P485J4851l127k9891l1368m9677j9668k3683k2040o303o176
7982A98925j2536k1316O498J7739n130R211l690Q966J2483J6445j6561J0305J3166
7969B34505K234o643Q020J2307J5222L2274J3743L1774O3099K0477J7325L1658
7957D75995k8155K189l4558j4659k903l5657k3133K0889k503m1521l1180j0752
7945B74052l5037P319j0268j1902k5100l2050j6635j7246k929q486j565L7713
$$ y = [127104, 145122, 154171, 157900, 138096, 108018, 133487, 152574, 153303, 158631, 145810, 131792, 115077, 120551, 137548, 119309, 96972, 102378, 112006, 156539, 191738, 196802, 232907, 266326, 289498, 348238, 405413, 468780, 509765, 512122, 460442, 434417, 438220, 458972, 448191, 414759, 356713, 341869, 368522, 376007, 390858, 387731, 357840, 326472, 276795, 257127, 233444, 211404, 205101, 198925, 186389, 165073, 171571, 189310, 184180, 193391, 189701, 198667, 211150, 227595, 211034, 221339, 234505, 236739, 230096, 238116, 250423, 265645, 297919, 311662, 343436, 406535, 427012, 444337, 475995, 447840, 450029, 415471, 400812, 397909, 362252, 339119, 360008, 357505, 315984, 284804, 274052, 239015, 246334, 236066, 224164, 199064, 167014, 150379, 133133, 130204, 121718, 120153, 157866]
7933A57866L3475J869r377R320K4605n282j6900j4653K8019n467J6797j615l0550
7920A88107K9209K2590j1237j184q791n6J2695p494j7777l1577j1180K051j2370
7907A52986p330J4470o413k6914K3894n887l7843j2434j068j250j7701J958J2617
7894H9085K086k1593j8532N789K9686L673l8388N092K787j3896k1671K0J8159
7881D2297N959j5423P155Q075p716m6500J1625K4498K0543L1853n119k7528j5681
7868C4038K5626Q882k6277Q403K8923j132k1313q523q852o881l068R087J5743
7855E4656N006q757q349j590j4841j5042J4141N903K096L673m360k7948pJ6739
7841B1320K2349l317n322J7046o405K0469K0415P88n827j8917j6758j7296j0212
$$ y = [157866, 191341, 193210, 183833, 193153, 217758, 212476, 195576, 180923, 208942, 203475, 220272, 218657, 188107, 217316, 239906, 228669, 227485, 218694, 218638, 231333, 223839, 206062, 174485, 163305, 165356, 152986, 145656, 160126, 153713, 126799, 150693, 144806, 106963, 94529, 93461, 92211, 74510, 76468, 89085, 91171, 69578, 51046, 56835, 86521, 90194, 51806, 56898, 59685, 45789, 24118, 24138, 42297, 48256, 32833, 39988, 48063, 40347, -6153, 5472, 29970, 50513, 82366, 77247, 49719, 34038, 59664, 68546, 42269, 50672, 79595, 78463, 57150, 48627, 39775, 32894, 29826, 38913, 54656, 59662, 50905, 42556, 40966, 26125, 11083, 25224, 31127, 33223, 36896, 32536, 4588, 4581, 21320, 43669, 40352, 35030, 52076, 45671, 66140, 86555, 87343, 81516, 62599, 45841, 28545, 18333]
7828A8333J49L1743J8324k6025N984J5191j7786k9063j0864K2620J1452k4465
7816A5593l0617p446o407Q188K7895J0489p837Q621j082J9588M5761J789l1810
7803E2725l1750r683J1679J0576j1632k0736J4137K999l4138J944R000J9255k4153
7790i777j1474M8278K9354m0879j594J1678k1791j0414l229k2085Q019O58j995
7777b5251K8468M5493n057l0862j3753J4959J015j0083j0954L004j9680J190O132
7764a5379p995K7869J9868j8565j4307k481k6926m58K4572J0748l05l3185pJ9228
7750a7323J4867j6854l641k9655J6407J560J2423O498o562Q859m4Q653J5206Q029
7736A8423J0484j4890J433M597j2528M321j340O667L604l654K0548k474k5404
$$ y = [18333, 18482, 50225, 68549, 42524, 48508, 63699, 45913, 16850, 5986, 28606, 40058, 15593, -15024, -22470, -28877, -20689, 7206, 17695, 9858, 18479, 17397, 36985, 82746, 84535, 52725, 20975, 11292, 22971, 33547, 21915, 1179, 15316, 18315, -15823, -13879, -4879, 14376, -9777, -21251, 27027, 56381, 15502, 13908, 25586, 3795, -6619, -9848, -31933, -23914, -23256, -25251, 3217, 48710, 43653, 12791, -962, 13997, 15012, 4929, -6025, -3021, -22701, -21511, -15379, -23374, 4495, 24363, 5798, -8509, -10990, -37916, -38374, -13802, -3054, -3359, -36544, -36551, -17323, -2456, -19310, -22951, -52606, -36199, -34639, -22216, -15718, -22280, -13421, -13465, -4812, 10394, 18423, 28907, 14017, 15450, 20047, 7519, 11840, 10500, 17167, 20771, 17117, 37665, 35191, 9787]
7723I787L917R793p46M189j1431k0969k1373j2094j3300M8549K0113j5177j5245
7710a3987O626j3023j1154k1274M700n429K3802J4582o476k8520J0195L2881J9510
7697A2433L216J3746k59j8319M507M7773k6609k4207K3334q351p58K8339k6876
7684B7969j3406n854j5151o81Q02M046J1823j7292k1469n517q811r549J1110L413
7670c8567k804J3956J4695R180L5897L185Q250m960j4996j3406j4914K356K267
7657A39J9431j2525J012l179k1456K574p961j9060j6176K8389m510J0009j317
7644b4630r305M424K871j7489K4528j1525j076j6590j2049J532K6289k006k0289
7631e5315K834J4387P323J6783j4694k4887K8503K326l964K170K515O649j943
$$ y = [9787, 13704, 23497, 22751, 26940, 15509, -5460, -26833, -38927, -52227, -3678, 16435, 1258, -13987, -7361, -20384, -31538, -52812, -48112, -53541, -29739, -15157, -21633, -50153, -39958, -7077, 12433, 15649, 29395, 29136, 10817, 15324, 63097, 36488, 12281, 35615, 27264, 26506, 54845, 27969, 14563, 8709, -6442, -7123, -6321, -2275, 9548, -7744, -29213, -34730, -43541, -53090, -41980, -38567, -41371, -27415, -12720, -3540, 32357, 35542, 43792, 38832, 23836, 10430, -4484, -2128, 139, 19570, 7045, 8057, 4878, -16578, -14004, -21965, -41025, -57201, -28812, -33322, -23313, -24630, -33935, -29511, -26640, -44129, -19601, -31126, -32202, -48792, -60841, -59309, -33020, -35026, -55315, -52481, -38094, -30771, -13988, -28682, -53569, -25066, -22740, -26704, -24534, -22019, -15370, -17313]
7618a7313K3593n412N167P030J9060k200j7035m3442j11K0950K855L0854J7794
7605D1790j2430o912l031K1808k2506k7085J1654j923j251K8309K2774j9064j2720
7592A9413o629J9330L5831p307M881k0351j5557j3209k8575k4008j6240L107J2918
7579c6396K6076J5644j9198J2186j1423j8784n562L7154L8283j2900R586J6776
7567E1442P018j8763L1588j7154k1846j3320n714J1106P604M745Q817k2272k1389
7554A862K70J9023K350l8778k123L2961J2574l2125j8557K3272Q33j1590J3303
7541C275Q036l0367k8774m142K5899K2918M640l6328k4512j0407J3494J6557J8679
7528b1032p999o647M4957j9505j08K6737o182k1503r996p276n066q378o204o77
$$ y = [-17313, 6280, 868, 6035, 13065, 32125, 29925, 12890, -30552, -30663, -9713, -6858, 23996, 41790, 29360, 22448, 19417, 41225, 18719, -8366, 3288, 1365, 114, 28423, 51197, 32133, 19413, 12784, 32114, 67945, 60638, 65519, 45168, 29611, 16402, -12173, -36181, -52421, -49314, -36396, -10320, 5324, -13874, -1688, -13111, -31895, -37457, -303, 37980, 25080, 34666, 51442, 58460, 39697, 71285, 54131, 32285, 18965, 13251, 24357, 31961, 36706, 45523, 23251, 1862, 2132, 21155, 23505, -15273, -17396, 15565, 28139, -3986, -22543, 729, 1562, -10028, 3275, 11311, -19056, -47830, -51972, -26073, -3155, 1485, -34843, -59355, -69762, -56268, -39711, -21032, -29031, -35678, 9279, -10226, -10334, 16403, 10221, -11282, -21278, -28554, -33620, -41998, -48202, -48879]
7514d8879Q279J2500j386K5261M604K6527j313k1425j1507O649J1445k235O65
7501I185j5404Q52K2852q444j1123j1819J1694K4525J1693J8407j8430j6816J1632
7488B8804o103J7947m230k0945l1376O348J7737j5678l1150J1438M385r880J5217
7475a7486k8909m813K6003J7491k8982R411O170L942p39j1351j8543L3843K7634
7462A3671j654k3798k9438j5322m648K8024j1398Q471k551P074L067k996k0229
7449e1727J2494M1053K3926j1372N135p516j3435q581J1361l022j701J780l382
7436d987J8562j3232k8371o16K4319J4383J050k7554n4089j5182K7716O1842K9319
7423C3160k2288K133J456o163j2710q631K1239j1174J1594L0541K1416j7456l1
$$ y = [-48879, -40600, -28100, -29486, -4225, 379, 26906, 25593, 4168, -7339, -690, 10755, 8520, 9185, -6219, -5367, 17485, 9041, -2082, -13901, -2207, 22318, 34011, 52418, 33988, 17172, 28804, 22701, 40648, 36418, 15473, -15903, -9555, 8182, -7496, -38646, -27208, -22823, -32703, -17486, -46395, -51208, -25205, -7714, -36696, -27285, -21115, -17173, -17912, -29263, -47806, -13963, 13671, 12017, -11781, -41219, -56541, -61189, -33165, -44563, -36092, -38643, -31569, -28502, -31498, -51727, -39233, 1820, 25746, 14374, 19509, 11993, -1442, -10023, 1338, -1684, -3385, -1605, -4987, 13575, 343, -28028, -28644, -4325, 10058, 11108, -16446, -70535, -85717, -58001, 3841, 33160, 10872, 13005, 14461, 8298, -4412, -13043, 8196, -2978, 8616, 39157, 60573, 43117, 43086]
7410D3086k6672J8181K4023r348j165j4695j1423l0447k3266j2545p657o393J974
7397e6347K4549J4391m950q518N118O003M618J5871m515K773K9901L2127j8930
7384D2091m9500k7384j9053j3487P643O436J7426J2880K548n5139J4023K4566
7372c6950k2029l810L9694K9131k3583j0541K3115K7686R084l4051m851P622j1437
7359a0920L91K2479K00k8492j7120M215J2365k540l051J5346j0309l2794r453
7346e9683M1220K5574j8632n187r480j9324K9080J8061q515j7491j0857L5484
7334B50K6544k0802k9157j9170n608R907J8554r805l0149K2237K9891K4029q813
7321G908l2155K0296J2736M868J1551P062n4154k9494J9658J7529K6543M000m002
$$ y = [43086, 16414, 34595, 58618, 49270, 48105, 33410, 21987, -8460, -31726, -44271, -51928, -58321, -56347, -31798, -17407, -22357, -30875, -25757, -19754, -15136, 735, -3780, -1007, 28894, 61021, 42091, -7409, -34793, -53846, -67333, -59690, -53254, -35828, -22948, -20400, -75539, -61516, -36950, -58979, -62789, -23095, 6036, -17547, -28088, -4973, 22713, 31797, -2254, -7105, 517, -10920, -10529, 11950, 12150, -16342, -33462, -29247, -16882, -19422, -22473, -7127, -17436, -50230, -59683, -18463, 7111, -11521, -16708, -26188, -45512, -16432, 1629, -6886, -24377, -35234, 250, 26794, 5992, -23165, -42335, -47943, -38036, -19482, -29287, -59436, -37199, -7308, 16721, 7908, -24247, -3951, 8785, 13653, 25204, 32266, -21888, -51382, -31724, -14195, 12348, 16348, 12346]
7308A2346L039r063J0332R349j1401j0857j2084J3648k2760j4394j1059J2859
7296c0045M309q086J2672J3030n270M059J9990j4990j3866M369J6960J693k1829
7283a7004j8813j2668K0809K4263J2452j0329j8329m946j2605q817r6j1891K9097
7270b8877Q879p38j1421K8066L3458O874k0477j8874j1709j3449q932K3420l587
7257a7367R477l402K764j0951j1891M069M359J2675k2N094K211J08J8755r000
7243F879k2670o956Q210R882R658J4828j1397k8394j2634R821J4337l710K0597
7230H451K4457L570k8749m2633P854K5194j4395N816L9149J9327j6436k1043M19
7217A0981j1221j1278k898L33J4262J0642j7814J683R490J3107k5231l296R493
$$ y = [12346, 15385, 6322, 16654, 26003, 14602, 3745, -8339, 5309, -17451, -31845, -42904, -30045, -25736, -33822, -21150, -8120, -13390, -9331, 10659, -4331, -18197, -13828, 3132, 4825, -17004, -35817, -48485, -27676, -3413, 9039, -1290, -19619, -24565, -37170, -45987, -46083, -57974, -28877, -19998, -20736, -32157, -4091, 29367, 36241, 15764, -3110, -14819, -28268, -37200, -13780, -17367, -7890, -11292, -8528, -19479, -31370, -27301, -22942, -10267, -10289, -5195, -2984, -2876, 15879, 6879, -15791, -22747, -14537, -4655, 5003, 19831, 8434, -19960, -32594, -22773, -8436, -12146, 8451, 32908, 36478, 7729, -34904, -27050, -1856, -16251, -10435, 28714, 48041, 31605, 10562, 10981, -240, -11518, -14416, -14083, 179, 10821, -6993, -5310, 4180, 17287, -7944, -11240, -1747]
7204a747L848O319k5107k1623m597J2683M578p57k1762Q840O854j838k8506k7496
7190i0311K152J8434N6624L3924L446k491q117k8740l447m166j8244N688j1723
7177d6971K8813J3811m929j8289L41M1179r056l8238K8864p735r377n580l545
7164c0712Q170J4393l3897q740K4647M205J3186L1096j053j0594j5947j4290j4892
7151c4428M317K3887J9648K1732j7856k2041l812q821M06J3651Q172j8840J336
7138a2649P704k3566q294K095n203K191L8154K2842l223L238j5849j7661m274
7125a4495n538j1478q809k208J835p721j4041o987R350K2004J1858l062L3440
7112D148R210j1629j5647j1306J2734J4509m523l2802l649l243p983k4355R877
$$ y = [-1747, 2101, 8420, -16687, -38310, -42907, -30224, -25646, -26403, -48165, -39325, -32471, -34309, -62815, -90311, -88159, -69725, -13101, 20823, 24269, 21778, 13661, -15079, -18526, -22692, -40936, -35248, -46971, -18158, -4347, -9276, -27565, -27224, 13955, 4899, -33339, -4475, -12210, -21587, -27167, -30712, -22542, -8149, -42046, -50786, -26139, -21934, -8748, 22348, 21295, 10701, -5246, -19536, -34428, -30111, -6224, 13424, 35156, 17300, -4741, -8553, -17374, -16968, -3317, 4855, -13985, -12649, -4945, -28511, -36805, -34710, -39913, -37722, 432, 23274, 20051, 23289, 7440, -10221, -14495, -20033, -31511, -40320, -42528, -40693, -48414, -62455, -69442, -60092, -38088, -26230, -29292, 4148, 13358, 1729, -13918, -25224, -12490, 2019, -2504, -35306, -38955, -42198, -50181, -74536, -64659]
7099f4659L4270J4758l4528j1999L5035K62L904J9688L1495j2857m8298L674K1202
7086h053L1246J6297p159L666q229r548l1087j4758j7330J3109J980J84o690K0771
7072a5601L3757k1278Q00K2797j5j2365q096K0644J2864l6057j1121n813j1883
7059c1367j4024k506J4847L535j2824j764K0058L4935k6213k3908K0589K7979
7047I337M230k3536j2012r681l1505J5508m503K0050L5k431M106j4630l9085L0197
7033e3920K0709M01j9900j4096l952N3045M1860K911j1395J7237P967J927k579
7020D0215k0053k4846j7537L6216P349m3942o424K7322j285J231K8850L73k9757
7007b288j0873j6205k0929j6970J4237K8685n875p785Q810K6722P061j5573J0200
$$ y = [-64659, -30389, -15631, -50159, -62158, -27123, -26861, -22957, -3269, 28226, 15369, -32929, -29255, -8053, 23193, 39490, 32331, 35997, 27768, 18220, -12867, -27625, -44955, -31846, -29866, -29682, -36372, -15601, 18156, -3122, -2322, 20475, 20460, 8095, -1, 20643, 33507, -2550, -13671, -19484, -31367, -45391, -47897, -33050, -29515, -42339, -44103, -24045, 10890, -15323, -39231, -18642, 9337, 13567, -9969, -21981, -31662, -63167, -47659, -52162, -32112, -32077, -34508, -30402, -45032, -84117, -53920, -33211, -32810, -52710, -66806, -70758, -17713, 24147, 27058, 15663, 32900, 40867, 42794, 40215, 20162, -4684, -22221, 13995, 21344, -22598, -29022, -1700, -2985, -1754, 27096, 27469, -2288, -13161, -29366, -50295, -67265, -53028, -24343, -30218, -38003, -29193, -2471, 4590, -10983, -783]
6994g83K103l1330r096j2549M474J9417Q109l0442l1023L8031J2885O101J6960
6981g143K2521K4098l064k2940l755k5098k7344K016Q696M0503L2743Q837r293
6968D0777k4668k53p40j5444k1093j1601l055J2896J7673n791K0463J375K038
6955A2577l877Q749J7823j5757l4810m4906q787K4486K1035K2582K2149n648k7892
6942a2276j9131L633M4140J1817l4851p842j097j6175P75r213L675K2263j2500
6929b6782l2929K2895N5794M218j4507j8858J1391L71K0614q6O13j6575j4203
6916h044m988J9253N576k848P514l8961K805K8104L91j5657l523J3383Q932R04
6902A2841R614J725j0745o863o615j926o901J7666K914n089Q46j0153J0071m264
$$ y = [-783, 1320, -30010, -39106, -51655, -47181, -27764, -19655, -50097, -81120, -43089, -30204, -24103, -7143, 15378, 39476, 36412, 13472, 9717, -15381, -42725, -40709, -32013, 8490, 41233, 50070, 40777, 16109, 15856, 15116, -328, -21421, -33022, -36077, -23181, -5508, -11299, 9164, 10539, 12577, 8700, 17449, 35272, 19515, -15295, -60201, -68988, -44502, -23467, -885, 21264, 15616, -12276, -31407, -27774, 16366, 28183, -6668, -14510, -15607, -31782, -31007, -40220, -36545, -14282, -26782, -59711, -36816, 18978, 23196, 8689, -10169, 1222, 1593, 22207, 22121, 22734, 6159, -8044, -13032, 6221, 11797, 8949, 16463, -22498, -19693, 8411, 8802, -6855, -10378, 3005, 11937, 12841, 22455, 24180, 13435, 6572, -43, -1969, -8870, 8796, 11710, 6621, 7467, -2686, 7385, 3121]
6888C121m58J9919l8528k3799j3818o73J2024L1788N139R547J3099k2339j5859
6875b0837Q392j9840k8641n528O604J9799N2440J9901p416m8452l874L0429K394
6862E371J7625M7268l52k2507j0694j1986k4211j253k2080r475K266J4954l184
6849a8258r083M319J4969k837k1414j1916J1240j5830P601J5573M652q980n109
6836c5073m574L874L1448K1399J0330K0539l6149l1055J867l280j4368k6210J2120
6823d9132L4779r41K0836J2817o37r1k2727l3841K2525P675m058n032k4204n726
6809d7757N483K0847L3184M50p045r219j8279j333L6020O324k4639k1773J6265
6796a1472J7104j3121l2104k3404j152J5948L38K6922J1351k1702r658j1418j3885
$$ y = [3121, 2663, 22582, -15946, -39745, -53563, -54236, -42212, -10424, -5285, 4262, 17361, -4978, -20837, -12445, -32285, -60926, -66454, -59850, -40051, 12389, 32290, 24874, -23578, -27452, 2977, 5371, 22996, 70264, 69912, 47405, 36711, 24725, 514, -739, -22819, -32294, -30028, -15074, -18258, -27341, -23022, -8053, -10890, -32304, -44220, -32980, -48810, -41209, -25636, -20984, -29964, -35073, -39647, -35773, -4325, 17074, 27404, 47943, 11794, -19261, -17394, -20674, -35042, -61252, -49132, -14353, -15294, 5542, 18359, 17722, 17631, -5096, -38937, -16412, -8737, -12795, -17827, -42031, -47757, -42274, -21427, 11757, 12207, 5162, -4057, -22336, -23669, 12351, 18675, -5964, -27737, -11472, 5632, -7489, -39593, -62997, -64149, -48201, -47863, -20941, -9590, -31292, -40950, -52368, -66253]
6783f6253O184K3129J8931K4804J5448q19j5620p825k0230J1987L1302J4599J2036
6770D7673k4979l5653L0043R284m989M567Q797R220r914j2713m4000l7100L3142
6757b6622L0994n478P054j7375k026J1469J0111L018l380j7155r598j5068P262
6744b6794K9203Q748Q971p528J365K3695l084J1597K5670j7103j7735M226j3016
6731B8215j8297N484j6249K8250M1485r488k3709j0767J6450K2687K9740O0006
6719A53807M3173O9735K2214m4519o9574m1879m8897k2150m3571l7317k6783P371
6707c8390o212q148J2341L2529j035k878o325o75r576m804j9895J6111N968p297
6693c8286J4384O976k825q470J8667O279N496J1218k5443j5319J6194K5431J7206
$$ y = [-66253, -60069, -36940, -18009, 6795, 22243, 21424, 5804, -2021, -22251, -10264, 21038, 35637, 47673, 22694, -12959, 17084, 26368, 21379, 25946, 34743, 43963, 34049, 21336, -22664, -59764, -26622, 4372, -1106, 5948, -11427, -13453, -1984, 8127, 11145, 7765, -9390, -18988, -34056, -26794, 2409, 11157, 20128, 12600, 13965, 37660, 34576, 46173, 71843, 54740, 37005, 41231, 28215, 9918, 15402, -847, 27403, 68888, 59400, 35691, 24924, 41374, 64061, 93801, 153807, 196980, 266715, 288929, 244410, 174836, 132957, 84060, 61910, 18339, -18978, -45761, -38390, -44602, -52750, -40409, -7880, -8915, -11793, -18118, -18793, -28369, -33173, -53068, -36957, -30989, -38286, -23902, -16926, -19751, -28221, -9554, -3275, 2221, 13439, -12004, -27323, -11129, 14302, 31508]
6680C1508n093J2035n046k7458k5131l5817L608N9557J4987j1868J671O157J2343
6667C1453K0398k9605n7241j9498k5143k710M568M6426L7269j0632j4956K5281
6655E610L5202j9240j6939k9750L465J3324j1319K2691J3439j6128k0556M852
6643a5349J6685l5086J1475M3855R870m789k409n3578l8295k3101K8902L0665
6631c1155K2174J6263J2112L1649k0899j6152P289m4747k0314O574J9210L8930
6619B0934N355o903q572j5543j9173K2612J7047O867j4123j0255O695r500r465
6606a4024l500k6582m92K3468j5852p919J2316M6839p501o063J907j2294k2773
6593c2470J291Q221l095N906J59R94j8534K0833O556k2790k2411J4385J7792J636
$$ y = [31508, 26415, 38450, 33404, 5946, -19185, -55002, -51394, 8163, 23150, 11282, 12953, 19110, 31453, 51851, 22246, -34995, -54493, -79636, -82346, -77778, -31352, 5917, -4715, -19671, 5610, 40812, 21572, 4633, -25117, -21652, -8328, -19647, 3044, 16483, 355, -20201, -15349, 1336, -33750, -22275, 21580, 31450, 26661, 24252, -29326, -67621, -90722, -61820, -31155, -8981, 7282, 19394, 51043, 30144, 13992, 21281, -23466, -43780, -37206, -17996, 20934, 26289, 19386, 10814, -4729, -23902, -1290, 15757, 22624, 8501, -1754, 4941, -4559, -14024, -17524, -44106, -44598, -21130, -36982, -44901, -32585, 14254, 6753, 690, 2597, -9697, -32470, -31179, -22958, -26053, -20147, -19988, -18994, -37528, -16695, -10139, -32929, -55340, -40955, -23163, -21527]
6579b1527j296j9300m482J7986K1927j176k0871k2705J3349J7743N92n06k684
6566b2950q704q861j11K284N2822O769O953J3754k538j5257k9058L5498K1349
6553E1950j5253j7773j3650J1622P813P524j0215k6602J1479Q019M421n178j4329
6540a72P370M837K3303j0314k5797n527j407N890J3448L3766K6911j0974k1250
6527D0084j3956j5294j0701j5170l2560p558L1485K9518M106j4414k6212j6938
6515d7610J6009r946j378j3685L219K3030L8848J8209j2475j9267j0405K1514
6503F063L0518j1327n0026k0781O357O967J6511N549k629K2755O218l6538q563
6490b8926k513j1506Q184K8560o797K9879R643k0258k3478q194J6116P911J2473
$$ y = [-21527, -22823, -42123, -46605, -28619, -6692, -7868, -28739, -51444, -38095, -20352, -19760, -20266, -22950, -31654, -40515, -40626, -38342, 14480, 21249, 28202, 41956, 39418, 24161, -4897, 30601, 51950, 36697, 18924, 5274, 16896, 24709, 32233, 22018, -4584, 6895, 14914, 19335, 14157, -172, 7198, 12035, 35338, 25024, -773, -6300, -7707, -1817, 11631, 45397, 72308, 61334, 40084, 26128, 10834, 133, -15037, -47597, -55155, -23670, 5848, 9954, -4460, -30672, -47610, -31601, -41547, -42925, -56610, -53391, -30361, 8487, 26696, 14221, -5046, -15451, 6063, 36581, 25254, -24772, -45553, -39196, -32229, -15718, -10169, -12798, 9957, 16175, -20363, -28926, -31439, -42945, -34761, -6201, -12998, 16881, 26524, 6266, -17212, -25406, -9290, -1379, 11094]
6477A1094K4279k4777k6237M802j6137m9534j7151L5976J8636N092L7154q180
6465d983k4645o207k7992J9306J8304j0250J6593j7232j2659M710L3j559R890
6452c6691j5820P731J7954l409J1999j5166M559J4482M933K0745k6976k4705K3218
6439a7146J3229j502K16k3765j7939N399Q870K1396M203j1507J9726j398l5720
6426c5938J9555R660O404k3400J39K1775o539j2962J2476O633k540m501j576L2133
6412B1319J9196k1425j1796O158k2391r441P08K5882P168k2378L298q332l9709
6399e1743j16K4103J4940J9908J0544m090k3966p248P127J0573K6892J2405j4670
6386B4659j1064j4902J2156K0486r577l2325k9654k0872J8762J7249O449J2420
$$ y = [11094, 35373, 10596, -15641, -10839, -26976, -76510, -93661, -57685, -39049, -33957, 3197, -4983, -29628, -35835, -63827, -44521, -26217, -36467, -19874, -37106, -49765, -45055, -45022, -46581, -36691, -52511, -44780, -26826, -30235, -18236, -33402, -28843, -14361, -9428, 11317, -15659, -40364, -17146, -3917, -5419, -5203, -28968, -46907, -41508, -32638, -11242, -7039, -18546, 1180, -218, -35938, -16383, -6723, -319, -23719, -23580, -1805, -8344, -21306, -8830, -2197, -4737, -9238, -10814, 21319, 40515, 19090, 7294, 13452, -8939, -18380, -17672, 8210, 15378, -7000, -3702, -12034, -51743, -51859, -27756, -12816, 7092, 17636, 13546, -10420, -17668, -10541, 32, 26924, 39329, 24659, 13595, -1307, 10849, 31335, 21758, -10567, -40221, -61093, -42331, -25082, -18633, -6213]
6374f213J1379J637j5432j0623O152J1001j3460j8459N237o830J1080J0860j5462
6361b9133K883J8176j626j3130J4253J9826K0493j2529q696K5822p964q027k7424
6348g076r916L521k6209K166M0430K2974j1753M249j4851r260Q875J622j3547
6335h775k832K3590J3011j1454j3620j3550k4056m76Q997j5349J3800J6060N208
6322i446j3996j4078J8243J7775J9899q696m0841J0236J9510j7206J8303J6924
6310A6627J46L5622m4331m1505N465J2720j2351l729j4581Q592K539K005L2679
6297a02L7813j2747Q109J6215k596m1989j8578k7911K1581J1433j5178M377K0574
6284A001k0576J0770J6415K6099j7388j3603n636j0015j93J4560J3280P973P380
$$ y = [-6213, 5166, 6803, -8629, -19252, -13100, -2099, -15559, -34018, -28781, -35611, -24531, -13671, -29133, -26250, -8074, -9700, -22830, -8577, 11249, 31742, 19213, 10517, 36339, 28375, 20348, -7076, -16992, -13471, -39680, -37514, 2916, 25890, 14137, 18386, 3535, -5725, 3150, 4772, -8775, -11607, 11983, 24994, 13540, -80, -13630, -37686, -38162, -29165, -44514, -30714, -14654, -9446, -23442, -37520, -19277, -1502, 18397, 9701, -31140, -20904, -1394, -18600, -297, 16627, 16773, 52395, 8064, -33441, -27976, -15256, -27607, -31336, -45917, -37325, -34786, -32781, -102, 37711, 24964, 33073, 49288, 46692, 4703, -13875, -41786, -20205, -8772, -23950, -19573, 1001, -19575, -8805, 7610, 33709, 16321, 2718, -2918, -12933, -13126, 1434, 14714, 22687, 30067]
6271C0067L496k3620K571N709K4728J2243j8875P091k0954k5869j8620J3835K8478
6258B0280P091N105j8878l0219j4192K528J8218j9464l686l0919J673L5499K8345
6245A381M070J7250j0069j03k5406J4622q574K0340m120k7536k220k4973P639
6232c7699o845r505o574n332K931L2460K4334P205l384p493j1163P749j1137N449
6218a9004L1299J0661J8390q758k7587P838j6770j0869k6819J2649j9214L912
6206d4272K8404K3584N381j5326j0065k3407j0611m488O124k6259k9678K2846
6194g7767L4094K6638k888K0034M333J1M3239J5697k7581l4379q592k0775J397
6181b6539J3516k7974j4666L302K0770M2770r540k4893k814J0734K082J1820R41
$$ y = [30067, 33563, 9943, 12514, 18223, 42951, 55194, 36319, 43410, 22456, -3413, -22033, -8198, 20280, 27371, 32476, 13598, -16621, -30813, -28285, -10067, -29531, -33217, -64136, -62463, -26964, 1381, 5451, 22701, 12632, 12529, -12877, 1745, -6829, 13511, 9391, -18145, -20365, -45338, -37699, -44544, -54049, -60623, -65955, -63024, -30564, -6230, 975, -2409, -9902, -21065, -13316, -24453, -19004, 12295, 22956, 41346, 32588, 5001, 12839, -3931, -14800, -41619, -28970, -48184, -44272, -15868, 7716, 13097, -2229, -12294, -35701, -46312, -50800, -44676, -70935, -100613, -77767, -43673, -17035, -19923, 111, 4444, 4455, 47694, 63391, 35810, 1431, -7161, -27936, -26539, -13023, -40997, -55663, -52361, -31591, 11179, 1639, -23254, -26068, -15334, -13252, -1432, -491]
6168d91P433J4813J1912l8651j2100m025M991k1683m3433K94J8035L3012K0857
6155i036l210k5909j3270J5416L2595n609l89K112l4332o006L4591J5144l448
6142a351j1969j1720O949j097j4192K2617J1315J835n505R650k245k2694l9161
6129e7568k375M9415L8492M366q735l1108k1886k4499J0860K4925j4726m239M292
6116c2786m312M244K9167K2915J5825m1435Q331Q384p298q99P986j48k1292m944
6102a6262L532M752P894J2257J1616j699k1385m2329J732L4741K49m221R149K6611
6088B6637j271l6016J4196J8736O999m3970k6822k86Q750o307l383J1597j5600
6075d6740k4J5278K1537L1473J9842L6269p205J4063j4298r982K194l1089k8413
$$ y = [-491, 6942, 21755, 33667, -4984, -17084, -21109, -16118, -37801, -81234, -80940, -62905, -29893, -9036, -12246, -38155, -51425, -36009, -3414, -9023, -9412, -7300, -41632, -47638, -13047, 2097, -1351, -13320, -25040, -18091, -19188, -33380, -10763, 552, 2387, -3118, 6532, 4287, -18407, -57568, -59943, -10528, 27964, 32330, 23595, -7513, -29399, -53898, -43038, -18113, -32839, -37078, -32786, -37098, -32854, -3687, 19228, 35053, -6382, 1949, 10333, 3035, 2136, 10122, 9974, -11318, -16262, -12730, -7978, -84, 12173, 23789, 22090, 705, -41624, -39892, -5151, -4902, -9123, 26, 26637, 25366, -10650, 3546, 22282, 29281, -14689, -41511, -41797, -33047, -39354, -42737, -31140, -46740, -46764, -31486, -9949, 21524, 41366, 77635, 70430, 84493, 70195, 60213, 62407, 31318, 2905]
6062B905J0902K8828q659l734K5765k340J2994N549k0780j9835J4559Q656l2267
6049B2543q712K304K6748j44j3284l2990k1842j4118J5311n173r341J6116L7759
6036A5177O495k5507j5699J2166j0934q268l446J1921J7270k207k687K5233L6084
6023E5598O886n1680l9942L2239L7623j0047j3138k432J219J0878K4266j8992
6011C2478l1709J2283N157n010O657r594k1926n541j0417J5258k2250l6348m060
5998g5022L3138P900L3268L550q539Q082M266n0691j970M531J3037j074N426o655
5984c0753P793k171o939K0563M1472j8603j1294K7412J7073P547r019j0179k2117
5971A0785l0641k1882K2697J6277J3045K880M620k293J3283m888l2276j1268J8530
$$ y = [2905, 13807, 42635, 33976, 30242, 56007, 53667, 66661, 72210, 51430, 31595, 46154, 54810, 22543, 13831, 16135, 42883, 42739, 29455, -3535, -25377, -39495, -24184, -29357, -38698, -22582, 15177, 21672, -3835, -19534, -7368, -18302, -26570, -30016, -18095, -825, -3032, -5719, 19514, 55598, 62484, 10804, -29138, 3101, 40724, 30677, 17539, 15107, 16326, 27204, 51470, 32478, 769, 13052, 18209, 13199, 19856, 10262, -11664, -17205, -27622, -12364, -34614, -70962, -75022, -41884, -33984, -716, 2834, -5705, 2377, 6643, -44048, -46018, -41487, -28450, -29524, -24098, -30753, -22960, -25131, -32070, -11507, 29965, 11362, 68, 27480, 44553, 52100, 43081, 32902, 10785, -19856, -41738, -19041, -2764, 10281, 13161, 17781, 15488, 28771, 23883, -8393, -19661, -1131]
5958a131J6015q289m1936n447m387L934L2881r213m081n915j0483P002k5088L267
5944e2871K5924j7419m859M41R765L7454Q441m679K367K0366k2039r486N062j6303
5930a7836j3791K2919K3499L5022J055m6244l1583M236k227J1413O439m6312m0149
5917i3559J9944L0742K2404l141j2658n518j881J6911J6227n439r197J1452J4678
5904I65k7122j941j4324k8714l473L1302O0639J7553J0482k970O527n550m7086
5891c712k3173j5737n693k9362K3631K1613L1474k6413j7940O312J9847K8225
5879I072o585j1035j1053K5602p870k8784j8411J6653k2153k8705O864K5578J3578
5866c7249K0783Q72j8030J4354K7000r354j2265j093L671R394j3399J858K238
$$ y = [-1131, 14884, 6595, -35341, -40788, -45175, -41241, -8360, -17573, -21654, -27569, -38052, -31050, -56138, -52871, -26947, -44366, -49225, -48784, -39019, -1565, 6876, 2197, 4564, 24930, 2891, -6595, -1533, -17836, -31627, -8708, 14791, 49813, 50868, 4624, -26959, -22723, -24950, -13537, -7098, -53410, -93559, -73615, -42873, -20469, -23610, -36268, -41786, -43667, -26756, -10529, -15968, -25165, -13713, 965, -26157, -28098, -42422, -71136, -74609, -43307, 17332, 34885, 45367, 42397, 48924, 43374, -3712, -26885, -42622, -48315, -77677, -54046, -32433, -959, -27372, -45312, -39000, -19153, 9072, 2487, -8548, -19601, 6001, -1869, -30653, -49064, -32411, -54564, -83269, -76405, -50827, -37249, -16466, -15594, -33624, -19270, 7730, -1624, -13889, -14982, -11311, -1917, -15316, -13458, -11220]
5853a1220j7152O206R6K8K3209J7797j632k5285L300p018j677R209L188j1763
5839a2714j3509K2544M83k0405O552K9487J8809P790k7249k9736l3121J96L4543
5826a6330j6926k62K6088J1143j6084j7321M373J2677K436r944p615j001p773
5813c6539j1222K4272J8819j0430n381o038J590j1810J5314K2321P602J0934j2219
5800G213o209l831o346N25M017P327L460P402l636N7Q628K4650k7188m5007l612
5785c2550J221M123J542J7970L190k4677j7780L1L1356L590r480r47M2810l71
5771B0028k1836j8611j7799K3346R74l0276m072J7767j4140p258L5913k669q027
5758b6660L373M869J2342P843j367K316M17o727j7696l044J1307M298J8875J403
$$ y = [-11220, -28372, -22166, -22070, -22042, 1167, 18964, 17332, -7953, -4653, -11671, -13348, -4139, -951, -12714, -26223, -3679, -3196, -23601, -17049, 12438, 31247, 39037, 11788, -17948, -51069, -50873, -16330, -33256, -33518, -7430, 3713, -12371, -29692, -25319, -12642, -10206, -20150, -27765, -28766, -36539, -47761, -23489, -4670, -15100, -20481, -26519, -24929, -36739, -21425, 896, 8498, 19432, 7213, 1004, -2827, -9173, -8648, -4631, 2696, 6156, 13558, 9922, 9979, 18607, 43257, 16069, -28938, -32550, -31329, -27206, -25664, -7694, -4504, -29181, -46961, -46930, -15574, -11984, -21464, -22411, 20399, 20028, -1808, -20419, -38218, -14872, -13898, -44174, -48246, -30479, -44619, -51877, -15964, -18633, -26660, -23287, -18418, -6076, 1767, 400, 2716, 3133, -3594, -21290, -24334, -13027, -8729, 10146, 11549]
5744A1549p951k3304j3525L213R287o595N880L082J3123K891L352r590Q008K5890
5730B5310N671n59j9015N843j4195N170m5816J1327M5002L178k4884J4824K9645
5717D1501o237l5506j1560j810m742k2113P022K026n258J4415K0417o470J6345
5704H030K5130K315k1122l0331j8508P488K7661J0051R792J3119m419M760n697
5691B8269O4M366l4384l8308L635l025J4108p326k1176K3983O635o264K3048J6829
5677A0454r514L528p610r263q101K448l4793J5719J6047p884j3634j8650n925
5664f7178L1204L1224L174k1864p460k585O517K1672L998R158K990N191k4261
5651h220M567K4263M933k0331o508n222J0950J5237j6907j8140O391K4159l0746
$$ y = [11549, 3598, -19706, -33231, -30018, -20731, -27326, -21446, -18364, -5241, -2350, 1002, -8588, -580, 25310, 30981, 30422, 11407, 17250, 3055, 8225, -37591, -26264, 18738, 21916, -2968, 11856, 41501, 35264, -242, -11802, -13612, -18354, -40467, -33445, -31419, -36677, -22262, -1845, -8315, 8030, 33160, 35475, 14353, -15978, -34486, -26998, 663, 10714, 20506, 33625, 29206, 33966, 28269, 28333, 32699, -1685, -39993, -36358, -39383, -25275, -32601, -53777, -29794, -23159, -29423, -6375, 10454, 940, 4468, -3142, -12405, -20506, -18058, -52851, -37132, -21085, -28969, -42603, -61253, -67178, -35974, -4750, -1576, -23440, -30900, -33485, -26968, -5296, -1298, 7860, 10850, 16041, -8220, -3653, 20610, 25543, 5212, -1296, -6518, 4432, 19669, 2762, -15378, -8987, 15172, -15574]
5638a5574l446J6947j0781P50k9332k579L8455j9629j5715J9496L113N967l075
5625a5403L900J4279L779q876J0223J3971k5095k0146l2966r361L9100j2660Q068
5612c1187N0902l795j1926j9767m298n345j9255j519Q332R562Q207J3287k1657
5599b8459r678M374K1771K0499P994j0294m6226L200L6541M9736j259l0689k0124
5586b614O667k1558l9054k521K6377j6036j0612j2736K015K1153M2598N3224L861
5573E0764l3755O540J3278l5655j2800K73j085J8132J716p844j2497R724J2150
5560H941J3533l036j0285M698k6974r247l169k716L5978K447j0896o993n025J7612
5546D868L173J0870j1788l3995j8378L6540K0191k564k1103k3638j8472K3045
$$ y = [-15574, -19020, -2073, -12854, -12104, -41436, -44015, -5560, -25189, -40904, -21408, -18295, -12328, -15403, -11503, 2776, 6555, -2321, 7902, 21873, -3222, -23368, -56334, -65695, -26595, -39255, -31187, 19715, 15920, 3994, -15773, -20071, -25416, -44671, -46190, -37858, -28296, -20089, -6802, -28459, -38137, -33763, -11992, 8507, 16501, 6207, -40019, -36819, -278, 49458, 48199, 17510, -2614, 4053, -17505, -56559, -59080, -32703, -48739, -59351, -72087, -70072, -48919, -6321, 46903, 50764, 17009, 23549, 36827, 1172, -11628, -11355, -12440, 5692, 7408, -436, -12933, -3209, 8941, 22474, 19438, 9153, 13851, -13123, -22370, -25539, -28255, 7723, 10170, -726, -7719, -12744, 4868, 8041, 18911, 7123, -26872, -45250, -8710, 11481, 8917, -12186, -35824, -54296, -31251]
5534c1251J4505k7930J3297K6833M218l2591l6435J4511M968Q799J3744J0020
5522a7312J6446k0153k8797j1283j5107J8406K7484q239J183j2286R91R384k392
5509d1675m17l495K6405J19J4248K6099q293j0403L800J289K0042J3654l6383
5496D990p186l855k3885o446m116N917J8952n137j5220J4907M44q117R456J4652
5482d644J2850L653J7948l625j7143N210k701n416j507k9896k1094J075j5384
5469f0674r107K2247L2631L6070Q886n832K854J6459J6160J363k6564L520l6258
5456A755j24J1032n911j912J621j1499o760j7292J951J0090R680N278J401k949
5442c639j4175J2147K7199K4385j7048j7236n963L249K6771R545k9606R269K558
$$ y = [-31251, -16746, -44676, -31379, -4546, -328, -32919, -69354, -54843, -49875, -41076, -27332, -17312, -866, -21019, -49816, -61099, -76206, -57800, -30316, -38555, -37372, -49658, -48667, -39283, -41675, -42092, -45587, -19182, -19063, -4815, 21284, 12991, 2588, 6388, 7677, 27719, 41373, 4990, -2196, -6051, -29936, -36382, -40498, -34581, -15629, -20766, -35986, -21079, -20635, -28752, -19296, -4644, 8206, 11859, 29807, 26182, 9039, 14249, 11548, 6132, 4625, -25271, -46365, -45290, -60674, -69781, -47534, -14903, 21167, 30053, 24221, 27075, 43534, 59694, 61057, 34493, 38013, 1755, 1631, 12663, 6752, 4840, 6461, -5038, -11798, -29090, -27139, -17049, -7369, -2091, -690, -3639, -17814, -5667, 21532, 45917, 28869, 11633, 5670, 8919, 35690, 45235, 15629, 24898, 27456]
5429B7456q752L836j802j966J5206J1258j8146l2918K633m038L892L441n40p209
5415g649K099o390k0718J221M8989N866n262k2971j1399L055l305k727L086k702
5401a8807l267J3548j1322N267L205j2184J1419R386j3290n01k9151r167R903
5388d4961J2465L3174J7980r259q190J0712J0243j2285k4833J9491K179k5448
5376a8732J1616o954l188O045p8k5575j3444n721o510K1170J5036m22J932K0920
$$ y = [27456, 18704, 22540, 20738, 18772, 33978, 45236, 27090, -5828, -3195, -7233, -3341, 100, -440, -7649, -5550, -11940, -32658, -31437, 17552, 23418, 18156, -4815, -16214, -13159, -16464, -19191, -16105, -18807, -22074, -8526, -19848, -14581, -11376, -23560, -12141, -2755, -16045, -16546, -45697, -54864, -44961, -32496, 678, 18658, 9399, 1209, 11921, 22164, 9879, -14954, 4537, 6716, -18732, -7116, -14070, -17258, -11213, -11291, -36866, -50310, -56031, -62541, -41371, -26335, -26757, -24825, -3905]
$$ [...]
##END NTUPLES=NMR SPECTRUM
##END=
