##TITLE=Analysis number 323946
Compound Code cc 63606
Book Reference 510/6
Project Code adrs
Chemist Name jimp
##JCAMPDX= 6.0         $$ Bruker NMR JCAMP-DX V2.0
##DATA TYPE= NMR SPECTRUM
##DATA CLASS= NTUPLES
##ORIGIN= Bruker BioSpin GmbH
##OWNER= nmr
$$ XWIN-NMR		Version 3.5
$$ Thu Nov  9 09:36:34 2006 GMT Standard Time (UT+0h)  MAYBRIDGE\nmr@NMR_250MHZ
##.OBSERVE FREQUENCY= 250.131544655141
##.OBSERVE NUCLEUS= ^1H
##.ACQUISITION MODE= SIMULTANEOUS (DQD)
##.ACQUISITION SCHEME= undefined
##.AVERAGES= 16
##.DIGITISER RES= 18
##SPECTROMETER/DATA SYSTEM= dpx250
##.PULSE SEQUENCE= zg30
##.SOLVENT NAME= CDCl3
##.SHIFT REFERENCE= (INTERNAL, CDCl3, 0, 16.522)
##AUDIT TRAIL= $$ (NUMBER, WHEN, WHO, WHERE, WHAT)
$$ ##TITLE= Audit trail, XWIN-NMR		Version 3.5
$$ ##JCAMPDX= 5.01
$$ ##ORIGIN= Bruker BioSpin GmbH
$$ ##OWNER= nmr
$$ C:\u/data/dgb/nmr/ADRS/2490/pdata/1/auditp.txt
$$ ##AUDIT TRAIL=  $$ (NUMBER, WHEN, WHO, WHERE, WHAT)
(   1,<2006-11-09 09:36:03.63 +000>,<MAYBRIDGE\nmr>,<NMR_250MHZ>,
      <created by zg, POWCHK disabled, PULCHK disabled
       configuration hash MD5:
       49 4B E0 1D 92 C2 6B 37 9F E6 65 BC 52 41 86 1D
       data hash MD5: 64K
       0A 5E 6F 2F C0 3C 45 E5 3D 86 90 33 3C 5D 49 B1>)
(   2,<2006-11-09 09:36:21.98 +000>,<MAYBRIDGE\nmr>,<NMR_250MHZ>,
      <Start of raw data processing
       ef LB = 0.3 FT_mod = 6 PKNL = 1 SI = 32K 
       data hash MD5: 32K
       19 3E 52 49 B1 D0 BD 91 48 20 7D A9 7D 2F D8 DE>)
(   3,<2006-11-09 09:36:23.63 +000>,<MAYBRIDGE\nmr>,<NMR_250MHZ>,
      <apk 
       data hash MD5: 32K
       E1 A9 BD 26 0C 50 55 8C F2 0D 56 A6 9F 3E 80 00>)
(   4,<2006-11-09 09:36:24.43 +000>,<MAYBRIDGE\nmr>,<NMR_250MHZ>,
      <abs ABSG = 5 
       data hash MD5: 32K
       AF 67 B8 A3 B9 48 1F D3 18 BD EB A7 F9 12 85 68>)
$$ ##END=
$$ 
$$ hash MD5
$$ F7 1A 4E 1F ED B0 C9 5B AD 7C 07 08 21 3A F5 56
##$RELAX= 
##$RELAX= 
##$RELAX= 
##$RELAX= 
##$RELAX= 
##$RELAX= 
##$RELAX= 
$$ Bruker specific parameters
$$ --------------------------
##$DU= <C:\u>
##$EXPNO= 2490
##$NAME= <ADRS>
##$PROCNO= 1
##$TYPE= <nmr>
##$USER= <dgb>
##$AMP= (0..31)
100 100 100 100 100 100 100 100 100 100 100 100 100 100 100 100 100 100 
100 100 100 100 100 100 100 100 100 100 100 100 100 100 
##$AQSEQ= 0
##$AQ_mod= 3
##$AUNM= <au_zg>
##$AUTOPOS= <10 >
##$BF1= 250.13
##$BF2= 250.13
##$BF3= 250.13
##$BF4= 250.13
##$BF5= 500.13
##$BF6= 500.13
##$BF7= 500.13
##$BF8= 500.13
##$BYTORDA= 1
##$CFDGTYP= 0
##$CFRGTYP= 5
##$CHEMSTR= <none>
##$CNST= (0..31)
1 1 145 1 1 1 1 1 1 1 1 1 1 1 1 1 1 1 1 1 1 1 1 1 1 1 1 1 1 1 1 1 
##$CPDPRG= <>
##$CPDPRG1= <>
##$CPDPRG2= <>
##$CPDPRG3= <>
##$CPDPRG4= <mlev>
##$CPDPRG5= <mlev>
##$CPDPRG6= <mlev>
##$CPDPRG7= <mlev>
##$CPDPRG8= <mlev>
##$CPDPRGB= <>
##$CPDPRGT= <>
##$D= (0..31)
0 1 0 0 0 0 0 0 0 0.06 0 0 0 0 0 0 0.0002 0 0 0 0 0 0 0 0 0 0 0 0 0 0 
0 
##$DATE= 1163064962
##$DBL= (0..7)
120 120 120 120 120 120 120 120 
##$DBP= (0..7)
150 150 150 150 150 150 150 150 
##$DBP07= 0
##$DBPNAM0= <>
##$DBPNAM1= <>
$$ [...]
##$SUBNAM7= <"">
##$SUBNAM8= <"">
##$SUBNAM9= <"">
##$SW= 20.6930455092707
##$SWIBOX= (0..15)
0 0 3 0 0 0 0 0 0 0 0 0 0 0 0 0 
##$SW_h= 5175.983436853
##$TD= 65536
##$TD0= 1
##$TE= 683.16
##$TE2= 300
##$TE3= 300
##$TEG= 300
##$TL= (0..7)
0 120 120 120 120 120 120 120 
##$TP= (0..7)
150 150 150 150 150 150 150 150 
##$TP07= 0
##$TPNAME0= <>
##$TPNAME1= <>
##$TPNAME2= <>
##$TPNAME3= <>
##$TPNAME4= <>
##$TPNAME5= <>
##$TPNAME6= <>
##$TPNAME7= <>
##$TPOAL= (0..7)
0.5 0.5 0.5 0.5 0.5 0.5 0.5 0.5 
##$TPOFFS= (0..7)
0 0 0 0 0 0 0 0 
##$TUNHIN= 0
##$TUNHOUT= 0
##$TUNXOUT= 0
##$USERA1= <user>
##$USERA2= <user>
##$USERA3= <user>
##$USERA4= <user>
##$USERA5= <user>
##$V9= 5
##$VALIST= <valist>
##$VCLIST= <CCCCCCCCCCCCCCC>
##$VD= 0
##$VDLIST= <DDDDDDDDDDDDDDD>
##$VPLIST= <PPPPPPPPPPPPPPP>
##$VTLIST= <TTTTTTTTTTTTTTT>
##$WBST= 1024
##$WBSW= 4
##$XGAIN= (0..3)
0 0 0 0 
##$XL= 0
##$YL= 0
##$YMAX_a= 626741
##$YMIN_a= -496293
##$ZGOPTNS= <>
##$ZL1= 120
##$ZL2= 120
##$ZL3= 120
##$ZL4= 120
##$ABSF1= 16.522
##$ABSF2= -4.171173
##$ABSG= 5
##$ABSL= 3
##$ALPHA= 0
##$AQORDER= 0
##$ASSFAC= 0
##$ASSFACI= 0
##$ASSFACX= 0
##$ASSWID= 0
##$AUNMP= <proc_1d>
##$AZFE= 0.1
##$AZFW= 0.1
##$BCFW= 0
##$BC_mod= 0
##$BYTORDP= 0
##$COROFFS= 0
##$CY= 12.5
##$DATMOD= 1
##$DC= 0
##$DFILT= <>
##$DTYPP= 0
##$F1P= 14.0000005364418
##$F2P= -0.99999901652339
##$FCOR= 0.5
##$FTSIZE= 32768
##$FT_mod= 6
##$GAMMA= 0
##$GB= 0
##$INTBC= 1
##$INTSCL= 1
##$ISEN= 128
##$LB= 0.3
##$LEV0= 0
##$LPBIN= 0
##$MAXI= 10000
##$MC2= 0
##$MEAN= 0
##$ME_mod= 0
##$MI= 0
##$NCOEF= 0
##$NC_proc= -4
##$NLEV= 6
##$NOISF1= 0
##$NOISF2= 0
##$NSP= 0
##$NTH_PI= 0
##$NZP= 0
##$OFFSET= 16.522
##$PC= 1
##$PHC0= -46.67963
##$PHC1= 4.608134
##$PH_mod= 1
##$PKNL= yes
##$PPARMOD= 0
##$PSCAL= 4
##$PSIGN= 0
##$REVERSE= no
##$SF= 250.13
##$SI= 32768
##$SIGF1= 0
##$SIGF2= 0
##$SINO= 400
##$SIOLD= 32768
##$SREGLST= <1H.CDCl3>
##$SSB= 0
##$STSI= 32768
##$STSR= 0
##$SW_p= 5175.98343685301
##$SYMM= 0
##$S_DEV= 0
##$TDeff= 65536
##$TDoff= 0
##$TI= <Analysis number 999999
Compound Code 99
Book Reference 9
Project Code 9>
##$TILT= no
##$TM1= 0
##$TM2= 0
##$TOPLEV= 0
##$USERP1= <user>
##$USERP2= <user>
##$USERP3= <user>
##$USERP4= <user>
##$USERP5= <user>
##$WDW= 1
##$XDIM= 32768
##$YMAX_p= 389224710
##$YMIN_p= -445478
$$ End of Bruker specific parameters
$$ ---------------------------------
##NTUPLES= NMR SPECTRUM
##VAR_NAME=  FREQUENCY,     SPECTRUM/REAL,   SPECTRUM/IMAG
##SYMBOL=    X,             R,               I
##VAR_TYPE=  INDEPENDENT,   DEPENDENT,       DEPENDENT
##VAR_FORM=  AFFN,          ASDF,            ASDF
##VAR_DIM=   32768,         32768,           32768
##UNITS=     HZ,            ARBITRARY UNITS, ARBITRARY UNITS
##FACTOR=    0.157963299565203, 1,           1
##FIRST=     4132.6476996994, 0,             0
##LAST=      -1043.33573715361, 0,           0
##MIN=       -1043.33573715361, -445478,     0
##MAX=       4132.6476996994, 389224710,     0
$$ Real data points
##PAGE= N=1
##DATA TABLE= (X++(R..R)), XYDATA
$$ [...]
24453 28063 114 -28565 -8385 -35254 -58951 -60499 -20349 -8655 33444 52892 41479 17705
24441 17705 343 -71770 -103826 -126310 -142803 -35398 7411 15544 1994 49683 89998 99600
24429 99600 49761 10999 -34603 -55255 -11361 5115 12872 12669 31702 -3359 -42651 -28880
24417 -28880 -48584 922 53339 104650 59253 -13180 -67172 -13612 6702 12049 56561 41277
24405 41277 -2158 -9503 13545 32757 98635 111341 26490 -36424 -92670 -25980 -8496 2047
24393 2047 12825 71732 7082 -62333 -97330 -72301 -52482 -34758 36063 73546 -10301 -105565
24381 -105565 -38415 -17292 9513 20665 4343 -29272 -71664 -36226 -58747 -86341 -61057
24370 -61057 39701 57885 48052 8812 -54199 4616 17753 -991 -32873 -41914 -24793 -67717
24358 -67717 -59360 -41319 -1520 22900 32368 81722 99556 120783 102958 33483 52673 16058
24346 16058 -47089 -6240 83281 85019 62501 77707 66072 76552 80595 37555 31632 44825
24334 44825 39795 18468 21939 45696 91172 60405 63172 86394 98738 26072 -5908 -62348
24322 -62348 -22775 -3821 -45191 -18283 -5490 -25698 -60115 -90390 -52483 -67968 -64418 -9398
24310 -9398 13215 45211 14639 40576 8962 14296 54107 87715 81267 45867 -3867 -41510
24298 -41510 -79701 -130752 -130042 -78361 -59021 -80038 -139096 -180978 -156527 -102964 -63294 -45367
24286 -45367 3616 3863 -23007 -58819 -77300 -9736 -6531 -9346 -1374 -31440 -38237 -46113 -17363
24273 -17363 18402 4303 -22293 -14326 14874 78616 86344 130437 130459 39320 -10047 -63065 -92944
24260 -92944 -90751 -52278 -76614 -56000 -18442 -3687 -23998 -66208 -18365 -30044 -53536 23932
24248 23932 16100 -76084 -103035 -76842 -24788 34973 41343 906 53276 141411 120095 61054
24236 61054 -1813 -19766 -36299 -45513 -55959 -81385 -74972 -34563 12385 -14125 -10145 70149
24224 70149 38495 -3780 29301 5931 1505 -3897 -10841 -24564 -48222 -47144 -11386 9974
24212 9974 3214 -10534 32566 26721 -31790 -10349 49853 73672 27471 36595 6051 -17237
24200 -17237 -79787 -92205 -29161 11102 32807 34920 13618 -20795 -6114 39 -43757 -65075
24188 -65075 -71904 -43319 17456 35822 -67319 -140593 -100152 12762 74822 82648 105913 87729
24176 87729 47032 32207 -20851 -7467 45304 50415 63318 63192 -3352 4696 -11173 9973
24164 9973 -30171 -58433 -32009 46179 64440 50302 8982 -6351 47032 49700 -28635 -50741
24152 -50741 -20248 30445 53613 39525 -5719 -32808 -2329 2405 -9555 -10976 -63109 -100049
24140 -100049 -74699 -80401 -71564 -59018 -64985 -37081 -119864 -91829 -91818 -62601 -57845 -23306 -20728
24127 -20728 11935 19264 66890 67624 -19365 -41810 20320 70276 28054 -13552 -51896 -125118
24115 -125118 -115039 -88094 -53498 18084 7149 -35280 -23860 18329 23422 28369 21410 46778
24103 46778 82232 68172 49835 -32452 -3646 -10041 -112592 -132619 -136431 -137728 -84990 -33136
24091 -33136 -10976 2901 1580 19184 -5946 -78213 -97542 -28340 41044 86869 27688 -21533
24079 -21533 -26216 42800 72462 7144 -48911 -42659 -38751 -106778 -129870 -87490 -113165 -61789
24067 -61789 -23497 -6789 -21309 -34283 48196 -243 -62365 -15027 -10625 14999 -25900 -1673
24055 -1673 -27817 -64238 -133018 -134997 -66841 -6264 14296 40350 31263 61236 17279 -24697
24043 -24697 -55423 -108110 -173330 -132482 -63292 -42979 -64218 -7201 60362 112510 94239 57038
24031 57038 44370 31797 55755 71295 57595 20777 -44013 -41242 -20082 -2938 -28254 -66882
24019 -66882 -100496 -64449 -49926 -35250 -37625 -84912 -57026 -41051 -83403 -77129 35689 72140
24007 72140 53526 27831 21381 -18435 3370 47696 72996 83589 65339 58911 29878 31254
23995 31254 -3136 33623 89934 132641 113171 108817 45668 4239 5689 -17212 -41318 -15930
23983 -15930 -10658 -48685 -36418 -35770 -23296 2414 42042 54026 27447 63240 107474 72914
23971 72914 93506 122699 124372 50245 34875 38639 54078 68910 126093 86583 9900 -11928
23959 -11928 -1988 2102 -58726 -33149 11933 -35519 -51511 -26688 -29500 -41340 -27268 -26916 -19319
23946 -19319 28788 42396 -43499 -64001 -25365 882 8173 10790 43029 71384 55410 17590
23934 17590 -5645 -269 -26272 -92599 -85443 -44129 -41150 -48609 -23696 24083 46086 -2013
23922 -2013 -20324 60333 34138 -9639 16531 -10590 -156417 -160595 -102668 -43646 -2085 -21458
23910 -21458 -30557 -62293 -59442 -24583 -60375 -64456 -48011 -55683 -8043 53383 15600 20898 10539
23897 10539 9057 -46121 -57838 -32140 4655 5483 13381 -3643 7278 4605 -14869 -320 -14104
23884 -14104 -7101 3344 -27878 -64770 -63763 -67955 -105030 -47419 -18451 -35507 -61403 -92154
23872 -92154 -50837 -5634 25542 55234 81613 4928 -10651 58934 114881 129474 101421 44785
23860 44785 26956 26883 42852 -16247 11116 75504 108778 142744 156703 101602 26989 -37202
23848 -37202 -66329 -58477 -28183 -26375 -82065 -66597 4370 18221 44782 72921 98551 88945
23836 88945 30461 -17675 -48303 -51865 -16284 26412 -9232 -20380 -10905 -17800 27056 1713
23824 1713 -32795 -34206 -30205 -21809 34163 -27393 -123289 -91759 -8752 -629 22600 37037 14428
23811 14428 1788 -11424 -13557 738 23758 58370 112242 148077 115286 33078 36903 71542
23799 71542 38294 48331 54152 71673 31267 -15583 -21586 -135 6024 -58235 -65007 -14105
23787 -14105 -49168 -58259 -57515 5935 61142 103871 51374 -70502 -57449 -71640 -41281 -74748
23775 -74748 -55660 -53899 -35066 -33997 21892 37426 -32826 -41512 -49632 -95106 -94565 -19314 27246
23762 27246 -13094 -47591 -1919 29143 34575 46811 77215 67865 90271 110472 95449 16783
23750 16783 -12738 42499 47817 8280 -36640 -86906 -39805 -25615 13262 33871 47825 24628
23738 24628 16709 59318 24118 -21794 18040 111033 162204 134376 96789 92098 84242 65218
23726 65218 81688 1876 11203 23365 2283 860 -41835 -44301 -41588 -86679 -127504 -102610
23714 -102610 -123656 -115338 -125235 -77675 -132090 -189245 -190785 -110209 -89366 -82936 -30592 -28804
23702 -28804 -33090 -23226 -25994 -15201 -23389 18700 3517 -25469 -31928 -57313 -58004 -138087 -91336
23689 -91336 -26375 -8176 18767 959 48599 105860 40578 -25910 -3465 15593 15907 81549
23677 81549 110981 125070 113203 31959 16294 7818 61764 108553 99477 94103 32291 -14841
23665 -14841 13780 21575 -46335 -87386 -108240 -117155 -63013 573 -53982 -49649 -91947 -121190
23653 -121190 -80808 -39101 -15631 15718 -9215 -13063 -27942 20017 31636 5886 30362 26496
23641 26496 -21641 -64154 -17116 -48500 -46663 -72705 -39498 -60401 -56791 -58950 -93233 -91621
23629 -91621 -40230 -29857 -9233 -10927 -28569 -42848 -25032 -26684 7500 10427 2587 -41191
23617 -41191 -93581 -119932 -75924 -42489 -53351 -58436 -41430 -50107 -60192 -62363 -110269 -167861
23605 -167861 -156813 -96506 -56671 -42351 -72699 -91145 -106320 -64030 -35911 32662 61509
23594 61509 18552 12762 16660 -7918 -33525 -26440 -24250 -30093 -68903 -73139 -50450 26371 62426
23581 62426 17177 -26223 7675 65207 20263 -47303 -86445 -74480 -27981 35239 17502 81263
23569 81263 96340 77583 83303 111915 121740 115126 161108 141689 81091 60177 8968 -71971
23557 -71971 -57152 -36083 -37894 -38782 -30553 21307 40943 68919 6898 14499 62348 43850 72240
23544 72240 67817 38990 47494 -5168 -19409 -29381 -7869 -21799 -19418 -30842 -70169 -19715
23532 -19715 10671 -19637 -64143 5174 39479 33775 34758 -4463 12716 27981 10456 10979 -2250
23519 -2250 -29084 -27273 26815 32669 65383 48267 29125 30913 45461 72940 61101 23580
23507 23580 49874 18450 -13027 15763 27413 28930 68001 118746 59649 -46734 -36149 27945
23495 27945 75551 40257 33674 -12986 -116663 -113603 -65211 -86815 -106919 -74183 -39373 -80193
23483 -80193 -92404 -70264 -52125 -54106 -25170 49073 107784 90617 32111 18441 39147 5860
23471 5860 -59061 -85500 -78284 -44383 7845 33610 7100 -15078 40372 49029 -8291 -38449
23459 -38449 -36531 -18798 -57241 -132026 -94223 -46917 -30507 23332 -11292 -95095 -138872 -121595
23447 -121595 -63374 -25925 12349 5160 -43932 -77256 -125800 -138361 -73197 -4701 40435 41187
23435 41187 34608 39192 -7040 -727 -20233 -65994 -68144 -84479 -61542 -76299 -58391 -28084
23423 -28084 -44876 -72033 -21794 -42664 -2730 45162 33822 79202 54880 41009 17188 41963
23411 41963 44540 80823 124924 134959 97688 24467 38512 87681 102314 49374 40273 56134
23399 56134 45971 378 -20110 -64071 -67007 -106980 -123048 -52774 23834 -12169 -24565 -45384
23387 -45384 -29886 23684 50926 5503 13987 39571 75144 19322 -34281 37041 53025 78572
23375 78572 101699 27464 -92022 -128048 -72558 10816 60676 -23651 -57789 -40472 -36672 33856
23363 33856 43495 -4945 20382 12518 -66505 -37613 2230 -13937 33420 90330 53194 49090
23351 49090 72409 67792 31309 30795 -14304 -21250 -38459 -64563 -8399 26528 34349 80302 87713
23338 87713 53412 45157 -11570 -45113 -105944 -177338 -186214 -145995 -194850 -199364 -146323 -78469
23326 -78469 -77205 -99264 -65989 -66970 -35403 22611 31923 -51638 -40240 -50264 -91310 -85734 -114665
23313 -114665 -96528 -25043 24185 -5956 16629 75268 62536 -5999 11717 11632 -4432 -34056
23301 -34056 -44128 -76871 -78721 -86606 -73141 -83868 -43825 -42594 -21875 8647 34806 -8203
23289 -8203 -61098 -23059 -40286 -7141 -16746 -28005 -16579 -15649 -11808 -26726 -2018 18896 33165
23276 33165 42585 -20032 -87401 -88062 -27528 -33840 -28428 18706 17032 -49468 -35393 -25033 -36506
23263 -36506 -5762 26639 23742 3149 -33993 -4343 97052 142531 101892 -5346 -69978
23252 -69978 -10864 48182 88041 86635 161310 136739 76978 75032 89759 72486 37267 14591
23240 14591 25101 -39059 -41837 -41999 -132941 -128157 -154040 -121823 -44060 32806 55167 347
23228 347 35453 77058 31571 -6987 -35967 -67352 -82355 -42216 -7209 1212 26377 -50606
23216 -50606 -43150 -36105 -74335 -125930 -115214 -120959 -132873 -102043 -79144 -23389 -575 -43053
23204 -43053 -71886 -74949 -85772 14707 52755 1085 -74774 -100452 -142429 -116002 -70043 -108510
23192 -108510 -110040 -95311 -110625 -79151 -46363 -15612 7471 -55540 -23084 1397 -42724 -18170
23180 -18170 2507 6393 9054 -20183 18322 -6404 -22878 -3799 24147 25060 -44380 -67702
23168 -67702 -85668 -64612 -52773 -8989 -44172 -31906 -28099 -18731 -19888 -57694 -55050 -635
23156 -635 1850 -51166 -225 30130 -4191 -52003 -21897 -88280 -116380 -49456 27665 14821
23144 14821 -17797 -5594 23290 53919 48998 8681 -29440 -115222 -199537 -194393 -73950 -36427
23132 -36427 -11015 -2938 17753 26492 29719 -5508 -48593 -60608 -49972 -62684 -42499 -9547
23120 -9547 11517 6454 -24232 -20999 -60904 -106723 -42330 -24684 -27643 -76367 -73344 13020 25274
23107 25274 -46271 -44962 -35397 -67383 -46274 16234 18502 36720 83922 44268 19959 -69077
23095 -69077 -79396 -21718 -85530 -80354 -45986 -19382 19810 8181 -41699 -28407 21980 58423
23083 58423 27888 57886 67742 47347 77220 52725 22952 12409 24831 -2451 -35049 15274
23071 15274 47237 19785 -27261 -19359 13132 6771 25588 70586 74705 50852 5420 45465
23059 45465 49108 33192 -2019 -2250 34119 791 -9235 -17087 54999 71825 52939 109441
23047 109441 147057 127631 91819 48231 -10327 -121079 -96313 -66364 -65651 12379 -22317 -53732
23035 -53732 -66895 -82413 -51559 12993 -10699 19756 46021 43101 81755 50572 -22663 -42264
23023 -42264 -89070 -109211 -61930 -87435 -97540 -24129 45028 24884 64105 38649 33167 53218
23011 53218 27231 20460 -44303 -8083 -53619 -19477 -7757 -5613 -35709 -73392 -68952 -45952
22999 -45952 -33727 -59672 -32659 -6338 -4508 -40112 -4659 -60161 -53890 -18967 -6055 24522
22987 24522 55658 88173 63094 36284 13941 -21747 -35956 -73244 -28822 21426 32346 11629
22975 11629 55260 92432 134996 78019 3063 25977 25388 12842 42571 59835 36308 25204
22963 25204 36234 54757 69570 34387 -14380 12879 34831 38494 -838 23356 17253 -16661
22951 -16661 -43617 -68369 -43830 -84741 -95485 -42895 -1645 -28745 -19069 -115248 -130391 6836
22939 6836 58465 28974 23996 -47422 -81359 -36486 40950 -21254 -80539 -92248 -114207 -64024
22927 -64024 -29337 -18681 -50211 -52740 -24331 -37014 -40910 -35199 -100522 -91065 -35962 -13385
22915 -13385 -6159 34781 -4627 21184 11166 -47096 -49556 -77223 -62782 -69552 -100845 -115313
22903 -115313 -60762 8913 68421 127253 74050 -2958 5327 29235 20654 -37118 -73961 -48687
22891 -48687 -57429 -100965 -80942 -46459 31167 36541 66699 73590 94515 71452 16215 -5263
22879 -5263 -10657 -13775 18632 63090 72274 31955 -27568 -43526 -19172 -20094 42356 71048 4255
22866 4255 -19545 27380 5561 -75535 -50825 -45333 -101541 -70810 -45325 -77745 -122745 -43833
22854 -43833 -52705 -99168 -28337 14782 16752 -32370 -64377 -68658 -70092 -37870 33176 7522
22842 7522 30571 42211 2072 -38054 23447 86667 59633 -7554 -42671 -28489 -10642 42932
22830 42932 33983 23126 -36371 -55660 16609 69557 -1444 -26191 39922 36858 -8796 -50682
22818 -50682 -19137 75133 116272 107277 66227 32050 28530 16204 -11901 5066 -4133 7862
22806 7862 -23362 -5201 29476 34038 66706 43846 -62718 -37583 17766 -3844 20159 63612
22794 63612 66879 112693 93349 125800 102223 85497 84998 64546 -23614 -52059 -48517 7564
22782 7564 -30465 -43379 -58098 -18211 -25925 -6963 9419 5284 7543 -13644 24046 61733
22770 61733 32296 20777 79602 84560 62156 -28171 -17575 -676 31766 49180 2426 -41815
22758 -41815 -22287 -54982 -85538 -30896 -4989 26710 16286 -35292 704 10516 -4430 43208
22746 43208 98498 54146 -1815 -12647 1654 -20268 -24254 -21265 -36104 -30703 -6613 59958
22734 59958 101502 116539 36142 6679 -2780 -3286 -4450 15528 410 -27468 33444 61468
22722 61468 51333 2890 -50317 -66906 -34522 62446 48577 -10103 -1453 -11492 700 48290
22710 48290 34326 -23868 -24706 -14639 -47507 -57935 -12614 -5450 34793 29108 47040 53987 26463
22697 26463 -17574 -9360 40975 108489 142031 70954 67757 89495 98897 77378 84514 36996
22685 36996 -38 -5986 30409 48269 22864 -14807 25448 4173 24444 107400 137755 59808
22673 59808 19401 -3047 -44943 -39399 -15800 6755 30909 38049 72210 150123 122207 68116
22661 68116 47695 60383 42258 -2534 -62027 -93215 -77658 -62161 -114488 -139098 -72996 -43294
22649 -43294 -75727 -50085 -90570 -122091 -95897 -14923 81369 117810 73826 40506 -2365 -20425
22637 -20425 -528 -60926 -112206 -1153 59028 34666 4067 -17035 -34592 49683 -25425
22626 -25425 -50637 -38097 -45646 11613 -21703 -29171 -3794 -25407 899 21461 30354 5441
22614 5441 8616 22773 34183 -19424 -55346 -40015 -34932 -113785 -160070 -135317 -111374 -146434
22602 -146434 -101069 -6655 16930 -29512 -85872 -49266 -20758 -20642 -55685 -47684 -14085 -13610
22590 -13610 -15285 -31834 -17703 84851 122702 62686 -922 -67906 -83255 -43165 -40940 -3326
22578 -3326 7041 10404 -297 -7873 6809 -44929 -53774 -15857 45888 47458 20926 39374 37789
22565 37789 -12327 -24925 16652 18241 -23818 -49264 -81955 -80101 -44381 -17216 15977 48142
22553 48142 24029 -27198 -24027 1091 -15976 -26044 -58435 -64721 -72782 -97665 -39067 77274
22541 77274 112167 57182 4912 -28450 -38184 33910 -10055 -76844 -70102 -10545 6657 -1026
22529 -1026 -4297 57768 99826 -14112 -8076 24602 -302 12083 36163 -584 -40640 -57273
22517 -57273 -13616 37185 49874 14969 12763 34571 45591 27358 3456 -30601 -26264 -7520
22505 -7520 -85799 -103438 -78976 -10733 31105 10291 -47557 -96618 -69750 -4016 37752 61957
22493 61957 35964 -10851 -16756 -62492 -53824 -23004 -31728 39360 53106 55190 -8718 -28495
22481 -28495 -27158 -1591 24991 -30550 -76719 -33494 -8277 15572 33077 26006 63673 64771
22469 64771 53367 26120 -37775 -71935 -138551 -88252 -80623 -61687 -16783 -35466 -32455 -56255
22457 -56255 -42580 -26433 -18298 -25574 -27225 -15181 575 -79274 -110385 -104306 -115510 -91357
22445 -91357 -23453 -24920 -36130 20235 10068 20136 -3292 8560 47036 -4910 -65498 -65427
22433 -65427 -10650 -22475 6063 -6657 -8355 -46277 -16709 70470 82733 51793 59895 14204
22421 14204 -37381 -40575 -24095 21386 750 -26172 -44054 -67474 -28393 26057 16485 13428
22409 13428 19961 -23549 -104214 -97963 -93454 -70558 -27846 39438 41482 23608 26562 26505 -3965
22396 -3965 -4960 39806 46515 -21536 -10629 -7318 7738 54205 90275 61721 31518 -13675 -70379
22383 -70379 -60684 -66884 -44856 20050 -25766 -1100 -32047 -34449 5270 -20348 19985 5721
22371 5721 12147 14525 2220 -43835 -88473 -76234 -46646 -88957 -123989 -164613 -138768 -121219
22359 -121219 -100112 -57018 -16958 -61715 -51612 5170 139590 201122 142026 129243 126585
22348 126585 72912 27248 25917 44173 79399 65736 35115 49989 74701 87535 67614 68255
22336 68255 78312 35401 -14909 -27943 -96906 -111425 -67079 -34591 -73021 -71975 -73679 2336
22324 2336 13259 -17079 -18009 -11372 -5139 26167 46847 17405 -25437 -68423 -68441 -39289 -55465
22311 -55465 -34249 597 -142 25251 -30903 -42238 -30233 -53953 -45692 -6470 52249 55582
22299 55582 22027 -15035 -8347 -26633 -119120 -135870 -111822 -83195 -40676 29111 57226 -4593
22287 -4593 58907 92024 70201 46785 30275 21137 30522 1747 -44697 -61075 -32945 -43726
22275 -43726 -38550 11520 40400 50516 88279 73977 -680 8443 35516 -25551 -25189 -15278 23010
22262 23010 45181 -30428 -10001 25755 116642 122871 65702 68635 56251 50070 -21596 -37265
22250 -37265 -32539 -26717 3392 32108 15339 18195 -45512 -88190 -40348 -9774 -18255 -69356
22238 -69356 -54327 -53270 -27082 -46872 -24197 -6586 32387 61857 88569 60329 62224 107304
22226 107304 17716 -22673 -52863 -878 49179 1131 -65172 -102672 -137212 -175473 -164088
22215 -164088 -140388 -141050 -128985 -64339 61978 124721 52953 5596 352 40154 -6189 4537
22203 4537 -8764 -56953 -83256 -100233 -93860 -36390 -32306 -23127 -57900 -27047 46469 44640 -10429
22190 -10429 -20440 -8830 -13708 -2762 25768 57921 132090 74009 35761 28965 -22322 -48165
22178 -48165 -58545 -2053 29280 21423 -33110 -46359 -33804 -7394 -72141 -78699 -60313 -2702
22166 -2702 -39375 -26605 -31351 -58469 -45952 -25284 -35160 -51047 -117624 -120599 -61906 -32544
22154 -32544 -13503 3244 26510 86460 124911 95753 98710 122136 65463 1819 1759 18401
22142 18401 8926 -22942 -29142 -3664 -61360 -61306 -68482 -84042 -80827 -64648 -10992 -30895 -34180
22129 -34180 -1420 -23285 -67165 -114448 -69110 -1668 20541 1958 -65688 -105139 -74660 -68287
22117 -68287 -51065 -31761 4565 1680 -6935 36545 -44974 -40745 -8069 -33419 -26786 1708
22105 1708 -8704 8606 -13600 -22310 -36761 -63130 -115475 -89281 -35487 -35375 -70453 -70289 -62604
22092 -62604 -74211 -100149 -61794 -22159 -32819 -68964 -39354 -22764 -6306 2673 -7109 36027
22080 36027 48791 19909 50446 94419 30982 -4875 -41320 -21544 23036 2272 27471 38876
22068 38876 55532 117083 86266 62997 30777 3755 4000 14004 -9033 -23736 -60827 -145440
22056 -145440 -157519 -122933 -121613 -19251 21425 10602 18989 19887 -6724 -43027 -21657 22339
22044 22339 57585 60158 12305 8499 -14656 -91482 -73567 -8837 23353 30124 62320 112724
22032 112724 156555 86379 35485 -42964 -32542 -2815 14676 30353 17957 8137 53250 78928
22020 78928 60613 -70927 -54034 12174 25745 3006 23380 41019 91243 121377 83024
22009 83024 67816 43746 -7639 -10387 -84796 -106700 -60947 -65658 -45517 6501 28883 16689
21997 16689 -40630 -45714 -93238 -38682 -30628 -53966 -12343 -1467 -21674 -60735 -1479 18795
21985 18795 -35635 -36163 -49844 -70313 -94489 -110007 -59711 13541 -26437 -47333 -27349 27300
21973 27300 47699 36893 -61441 -106948 -84918 -108909 -37581 22397 48809 53468 13272 24047
21961 24047 34937 -12843 -10927 4310 -20098 -7098 14820 39210 41420 -6098 -36893 -27723
21949 -27723 -9933 -31455 -7707 -2711 -20676 -63617 -44280 10367 3091 -14659 -54750 -92649
21937 -92649 -52375 -62812 -128924 -140849 -126735 -75395 -7973 -13956 18511 68108 99922 87566
21925 87566 86969 86666 47630 -19087 -58353 -1127 37436 -26008 -4821 -4763 -2641 6839 -28423
21912 -28423 -29099 -14907 -39077 -83615 -116506 -96117 -74349 -21954 23165 -11857 -31480 -35213
21900 -35213 -56634 -62295 -87660 -84423 -68671 -2350 63296 78568 79407 16989 -17599 -18007 14449
21887 14449 38751 77339 102475 99175 48129 18039 52031 6252 -32298 -239 3959 21689
21875 21689 28188 -46954 -73185 -10166 4443 -75291 -39187 26896 22463 49670 11510 -28973
21863 -28973 -90407 -108807 -86115 -52202 -28454 -61753 -40637 3497 34676 20202 -21908 -34320
21851 -34320 -56882 -63936 -118809 -170236 -170570 -139183 -62201 -7703 -65627 -104490 -102463 -48825
21839 -48825 -27173 -45 21744 20962 25145 19613 -11191 -34593 -7210 33968 70020 38733
21827 38733 -6668 -30588 -1292 -21240 -46531 -34575 -8675 11617 59279 68113 77946 17557
21815 17557 35140 69884 42190 -5033 -47866 6919 -6933 -59126 -75909 -4820 -180 -9827
21803 -9827 -9343 -42168 -45637 -17329 -25853 -4680 -32380 -24724 8102 -19081 11158 61452 88107
21790 88107 54524 6294 43990 80464 59434 34637 24928 48047 28911 -26524 -51824 -23507
21778 -23507 35451 14572 -33535 -36644 -13716 -29656 27478 27270 -44488 -57350 -84067 -131135
21766 -131135 -87055 -47489 -34983 23949 77719 67090 -3669 -526 -21497 -114 287 -36876
21754 -36876 -52010 -10193 49657 85976 60065 56616 52508 -606 -25490 -2220 10779 -5034
21742 -5034 -5586 -11227 -31512 -88258 -111297 -42717 -28170 5835 11547 -2458 -36392 -36747 -43416
21729 -43416 -55875 -58386 -119995 -117482 -47307 -2444 -92268 -121062 -93446 -96554 -59423 -5173
21717 -5173 34168 25716 -3530 -30445 -68902 -84264 -96017 -107584 -104097 -63520 -93788 -97693
21705 -97693 -86248 -58309 -29999 -23479 -36530 -13929 21225 -19715 -67138 -15272 -49149 -76086
21693 -76086 -10046 -7863 11496 48090 41119 27028 4098 -59812 -50850 1424 32330 -38578
21681 -38578 -49325 -48863 -30079 -18821 -50204 -77272 -37462 -9464 -68959 -94855 -56016 -64402
21669 -64402 -93256 -83429 -78393 -121614 -99743 -44876 -45451 -68924 -44084 -33443 -50988 -76004
21657 -76004 -101578 -64763 -11362 34154 99890 73245 83587 68139 17774 11893 35708 -6954
21645 -6954 -46348 -32469 28114 36486 -4231 6524 20122 29938 81815 82225 64811 65074 40526
21632 40526 30089 -17884 -19331 -4518 -10379 -28433 -43558 -77349 -70341 -35963 -36013 -12765 6686
21619 6686 46753 20109 -7737 11640 -3100 1809 21595 -763 -22809 -71684 -99289 -58089
21607 -58089 -51634 -47398 -27187 -66725 -114850 -113306 -103506 -125037 -104600 -65135 -80302 -56419
21595 -56419 -88625 -56484 -15441 -33921 -30984 -56387 -54207 -43707 -61374 -111898 -141484 -97419
21583 -97419 -61359 -5859 63448 91424 114746 124066 79370 66614 -16568 5865 -2682 -28787
21571 -28787 -14741 -1855 -1058 -10592 -20868 -55587 -29360 -38335 -75498 -84930 -37401 -78411 -14595
21558 -14595 15269 30765 5056 13176 35145 5944 -4948 -11289 39187 80972 11266 -79428
21546 -79428 -78220 -9597 5735 -21664 16849 1911 -58351 -88844 -77598 -39222 -68706 -64379
21534 -64379 -40386 20762 55090 -17294 -413 55041 36092 341 -38040 22842 18500 -54795
21522 -54795 -76074 -18667 -2685 -88203 -124806 -88948 -6405 25937 26687 -10654 -7591 29323
21510 29323 18464 -14880 21627 1659 -30147 -5099 -70989 -85770 -118793 -159609 -119890 -36234
21498 -36234 -24723 3548 19945 -15140 -49318 -46243 15606 -37571 -54971 -3737 34508 -34794
21486 -34794 -31912 16891 -37408 6650 53815 7394 57013 51052 -11828 40681 8528 24628
21474 24628 55608 46192 41350 13066 -8791 -99820 -75013 -21459 -34177 -79254 -66965 -29835
21462 -29835 -33476 27341 64292 65428 35564 51208 67971 46039 37372 12831 -12455 45227
21450 45227 43930 29002 63511 55907 49150 46244 -45267 -49214 -55821 -28203 -9550 -7559 -28670
21437 -28670 6318 -3672 10648 59822 123539 115500 46934 50054 8008 -37141 -30276 -21137 -35340
21424 -35340 484 53658 36748 -1005 -57958 -83469 2320 -6479 -32993 -44866 -86430 -52393
21412 -52393 -14068 -75993 -85540 -82169 -3899 51708 127017 157599 77242 54362 32161 47106
21400 47106 39145 -4457 -35079 -916 -21063 -61948 -108970 -91793 -33407 17810 30117 33043
21388 33043 59176 59610 21739 79953 56922 69697 31699 -15448 -22268 -21087 8810 11631 28055
21375 28055 30171 14384 -22144 -36751 547 11850 7521 3583 -48578 -56357 -12464 20628
21363 20628 -28112 -89697 -91062 -6144 -4692 12376 -1496 -23651 -42654 33131 37438 28307
21351 28307 48822 91084 65951 57229 39726 -32150 -38322 -11033 -27321 -52497 -59044 -74518
21339 -74518 -114969 -122672 -125887 -90784 -48302 -53119 -47256 -63479 -39440 -16947 33924 25333 16524
21326 16524 5512 28039 97457 109379 64631 44900 97840 90543 27047 -8912 -61718 -75544
21314 -75544 -50088 32777 14217 -29231 -88190 -56262 952 33030 72968 84906 95886 61394
21302 61394 -24001 5138 -18312 -41990 -66163 -94209 -97643 -148566 -115711 -56665 -14951 39399
21290 39399 42659 37544 -39081 -95827 -126997 -137205 -83995 -47343 -34577 -25300 -14237 -15886
21278 -15886 21728 59964 18422 -19008 -1448 77525 96052 109505 104143 48144 13147 -5737
21266 -5737 22965 66574 82579 98254 62982 21613 28009 656 -47263 -54500 -39559 -41516
21254 -41516 -37035 -70921 -36166 12281 -14546 18016 19310 -27324 -20364 19329 99011 150063
21242 150063 144720 125284 55461 53856 43012 2089 5128 3154 -34600 -21857 32052 51311
21230 51311 -40891 -85284 -55889 -52830 -45228 -21166 21832 16703 -35473 15110 20043 26241 78260
21217 78260 92846 -3902 -57234 -101210 -126341 -75400 -47725 -30514 -62174 -4318 25557 -112
21205 -112 42274 52122 23095 -19940 -44501 -13473 62648 17435 -4798 -54494 -133717 -133385 -49059
21192 -49059 34487 73819 72272 8383 -69078 -115809 -126464 -99831 -28960 -24140 -19268 -21539
21180 -21539 -74404 -79153 -85550 -84034 -101550 -90588 -97525 -36683 -26170 -31617 -73335 -72434 -55950
21167 -55950 4972 12714 -13798 -71478 -95165 -79331 -25291 -18394 786 -27954 50244 47569
21155 47569 -7642 -95291 -105779 -49774 -40370 -95425 -143336 -86623 3162 -23564 -66027 -31985
21143 -31985 -21959 -31547 -40143 -10508 -68954 -77210 -57229 -42600 -23709 4845 -45546 -55846
21131 -55846 -45852 -5684 -36318 -6664 11715 23793 24840 10110 56016 21993 10166 29051
21119 29051 18881 -43796 -86027 -40399 18748 75605 15461 -12187 30403 30224 6434 -13787
21107 -13787 -39750 -30867 -31747 -21533 -30869 -23375 -31118 -29467 -10441 -1438 24796 7742 -38607
21094 -38607 -1559 63059 72448 69138 29651 59663 38053 -56905 -90915 -84885 -57344 4440
21082 4440 28449 52828 30816 -21077 -9709 -6274 -29780 16047 -13082 -86608 -103703 -87121
21070 -87121 -47196 -65526 -79412 -23643 37653 32296 -570 -19796 4663 -7276 -13126 26150
21058 26150 61023 59903 40030 50935 27466 -1343 -7587 6337 38659 91100 88818 84033
21046 84033 66979 -4753 5348 30579 -7388 -31185 -56465 -77535 -59133 -12061 -7534 -35570
21034 -35570 73366 90837 42642 -4206 -18996 -5384 -4639 29391 86306 82466 -35371 -29457
21022 -29457 -16484 -17457 -54654 -29873 -16166 -34095 -2198 30657 12453 -4087 -6914 10801
21010 10801 5003 34191 37626 66717 24512 27962 10326 375 18324 -56853 -135865 -97503
20998 -97503 4486 22596 70523 39519 6887 -23522 -65360 -101227 -100545 -59356 -72671 -87882
20986 -87882 -59125 40612 75322 70681 78086 80828 13930 -12099 16723 4407 -11776 -48489
20974 -48489 -37332 -24376 -66373 -98385 -85217 -61911 -45481 -16259 -15729 20028 80917 39850
20962 39850 -25228 -39683 -17373 8752 2597 37932 67987 83075 22985 -16727 46593 31225
20950 31225 5109 17529 26225 25162 39059 20458 6676 -77180 -24071 -20834 4428 -20718
20938 -20718 -83308 -48850 -11192 36245 92087 152601 102204 -1088 -84630 -106036 -112518 -98538
20926 -98538 -61133 -20867 24117 -20768 -81698 -45489 -9040 5703 17391 9409 27358 -22198
20914 -22198 30099 44158 46596 25744 12430 -42733 -80593 -18594 41196 -33472 5446 23749
20902 23749 48031 65068 10341 -46607 -17684 -5735 17936 -10151 14696 5145 -17842 -79565
20890 -79565 -109361 -90459 -68568 -49150 -18453 56706 49132 57873 26007 12566 -31258 -62591
20878 -62591 -85285 -54983 -46959 -115026 -111320 -49315 35163 33554 35798 14228 -31935 -38030 -16639
20865 -16639 50289 24468 1632 -33789 -49949 -9430 4633 -23575 78022 128202 86530
20854 86530 53752 14410 45010 59744 61242 37156 32111 21284 -6890 -11961 -10746 44999
20842 44999 48125 -26738 -19266 -21383 -67465 -40991 -23072 4697 111399 96394 -9680 1426
20830 1426 33439 47752 65102 58052 15772 85974 84221 84202 53685 4488 -68197 -46836 46318
20817 46318 32441 -37038 -14961 -13583 -84578 -111664 -48976 32630 5268 -28673 -55302 -72247
20805 -72247 -57850 -51064 -50139 -97198 -78268 -35963 -6913 40872 43258 6205 -3158 12263 45862
20792 45862 16408 17201 20893 -28164 -22012 -18497 -12566 -4950 -61995 -90649 -47580 -22657 -60407
20779 -60407 -60609 -35043 -32693 -40718 17191 13150 -23099 -20743 -32416 31369 93448 92894 93612 67029
20765 67029 -569 -35379 27090 80412 103010 18219 -28092 -65027 -7841 26378 -38479 -122916
20753 -122916 -108230 -82517 -143413 -137362 -127804 -145666 -95661 -62537 -103422 -142798 -120957 -58296
20741 -58296 -6939 -13934 -486 -56064 -73255 -69913 -45959 -3687 3621 32361 9370 75
20729 75 56238 45646 45835 41549 -2336 7611 35817 -8088 -17283 -8480 -6945 19194 54643 53436
20715 53436 62380 47138 23165 57207 74276 38131 47440 94232 63438 -43698 -93073 -103589
20703 -103589 -118805 -92186 -80519 -67149 -136704 -133389 -151688 -115191 -75661 -65472 -75492 -18
20691 -18 55849 45886 9397 -14685 -67235 -85570 -103862 -28887 -1107 38885 73528 -20842
20679 -20842 -37404 -3857 26426 30571 8877 -66310 -126437 -134501 -87182 -45823 -29817 -6479
20667 -6479 -19792 -35661 21756 53721 76802 55267 23591 48438 105161 54024 753 38862
20655 38862 5503 25501 40144 20563 -26701 -79450 -75787 -23695 -40055 -116501 -139912 -85270
20643 -85270 -44948 -11328 23009 -16150 -64792 -85410 -35127 -76184 -54820 -43227 -25868 -31143
20631 -31143 -13209 -30986 -36394 -57572 -58382 4114 -6408 -36901 -4063 36920 72328 66003
20619 66003 9134 -25006 -26398 -42803 -35921 -53836 -65058 -68836 -96018 -89252 -26792 6146
20607 6146 18233 -27169 -24810 16626 -5527 -48762 -2861 66028 74135 -3875 -38658 -24403
20595 -24403 -2622 -4541 -14457 -2620 -27258 -25755 -24050 -9575 -21295 -51200 -57131 -7907 -15325
20582 -15325 -50865 -79914 -11047 34768 40923 -12277 2338 93380 91715 29620 10674 58085
20570 58085 -11424 -44687 -19108 -44473 -15006 73723 28329 48722 60869 49547 31473 -38961
20558 -38961 -69491 -57051 -104073 -35087 18503 35449 9943 1465 22532 10441 -42203 -68873
20546 -68873 -28538 -53108 -50596 10037 -4796 22293 13767 -5492 -20262 -95406 -169084 -175080
20534 -175080 -105604 -45410 7420 39304 64390 5383 -60962 -90505 -76579 -129710 -99248
20523 -99248 -552 -1196 -11213 9907 -32312 -69718 -81871 -98529 -64439 -86955 -86844 -33451
20511 -33451 -51529 -40331 3619 -12355 5639 -4845 -3366 -13445 7348 27717 36316 49142
20499 49142 35376 1189 -30548 -28885 9199 14366 -53491 19423 78921 39780 17055 59905
20487 59905 49337 20227 -43753 -60415 7988 -33173 -29550 31975 20447 -10517 -101860 -67999
20475 -67999 -21320 -50611 7798 27625 47386 27089 31606 -22132 -59268 -48804 -23641 -5266
20463 -5266 -17400 -39993 -42397 -25918 11727 9745 28691 21100 1941 3198 11089 14979 -33689
20450 -33689 -35692 -31410 -44173 -79292 -133870 -128976 -46752 -6098 29773 25011 -5841 51539
20438 51539 96694 7202 -17044 9740 527 -19479 -24289 -62210 -68093 -74949 -75846 -75938 -52197
20425 -52197 -31251 -31095 -41542 -25030 -15404 -2424 18795 44995 96506 73060 32163 13120
20413 13120 -40663 -33210 -6862 46511 54918 42130 11993 41930 105790 98914 58577 37717
20401 37717 54749 44257 27023 -1062 -31527 -37963 -44719 -58476 -42306 20769 -4150 -15733
20389 -15733 31063 643 -71181 -43511 -6075 7945 -31814 -12385 12931 43570 99639 79528
20377 79528 82283 93228 89119 5080 -31077 -7898 5765 27567 -23258 -54232 -50457 -41509
20365 -41509 -37734 -66025 -64067 -21249 27348 27605 44307 72066 106805 124296 55896 11896
20353 11896 -38577 -106975 -93279 -117945 -141922 -103161 -87939 -53452 6098 -25955 -28663 -13894
20341 -13894 -47153 -62293 -58203 -61576 -63558 -37276 -24063 35858 29724 14679 -9870 -86294
20329 -86294 -104113 -120113 -84099 -43569 -33666 -26163 26245 -25867 -84601 -46062 -77126 11588
20317 11588 25250 13276 -16370 -36072 -77418 -80155 -26690 46618 90756 53165 41497 99239
20305 99239 94365 50617 51300 35012 30304 60221 91043 86130 30195 56606 41673 56502 46283
20292 46283 27399 19060 -30600 -30676 -18885 -17222 36106 27232 -8262 57680 74936 69610 18278
20279 18278 5748 -22258 -9166 -12094 -73755 -61610 25136 99097 81147 29696 21290 -43411
20267 -43411 -94079 -110197 -80176 -9264 -47860 -41106 -91734 -124313 -31791 22670 31928 29765
20255 29765 264 -76429 -76569 -112308 -147974 -120258 -73308 -32380 8489 24189 4836 -41529
20243 -41529 -63126 17052 108252 103615 43265 38912 -5875 -28699 2454 -28385 -39148 22948
20231 22948 19647 7892 41562 13051 23505 26360 12645 12480 40899 86673 96421 85755 60422
20218 60422 21771 45538 45492 2506 -73083 -75054 -57624 -73413 -56113 -25991 21835 14036 -50400
20205 -50400 -38314 -52465 -59344 -18518 -42490 -32309 8464 15821 -1196 -3470 53035 47128
20193 47128 12381 -23880 23026 50446 57631 30572 -44779 -60623 -64114 -16370 40507 33918
20181 33918 -48252 -81854 -95042 -135266 -122507 -93960 -52840 -47484 -70859 -62438 -39721 -29822
20169 -29822 -36017 -60875 -112960 -70397 15878 40674 15530 -1248 24744 21892 34638 -32244
20157 -32244 -20646 1524 -1492 18963 -9758 -51833 -37945 15579 -19031 -9709 -53513 -78406
20145 -78406 -52428 16602 43434 18438 11408 13187 71765 111274 119894 94153 83008 59334
20133 59334 74919 80389 63716 91046 57816 86663 79113 64574 66220 80111 3981 -68910
20121 -68910 -79832 -62966 -39098 -6196 47882 81731 65741 33292 39956 29640 40685 60788
20109 60788 80570 58170 47108 25642 62221 73675 34983 15073 -615 -12223 26389 61392
20097 61392 64081 119603 87245 40882 -21136 -23812 -67497 -37748 -838 -38028 -121682 -145584
20085 -145584 -76804 -43228 -47672 -18507 28695 61877 71216 -3732 13587 25579 -35695 27246
20073 27246 13490 -12340 -12185 -46645 -104496 -179207 -173311 -68218 56493 89184 100125 37578
20061 37578 -5853 1255 -37984 -46209 -40983 -21565 -41506 -38559 -40510 34095 3580 -59442 18340
20048 18340 36103 -46965 -66388 -43342 -21913 19364 -3834 -49374 -79820 -95291 -75988 -64880
20036 -64880 -31454 -12486 -36579 -13555 85765 27158 -2433 11585 -138 47652 5227 18122
20024 18122 95561 56786 -29174 -79192 -102351 -65101 -89310 -86027 -31551 -31006 -15916 35611
20012 35611 -12520 -7823 15396 24950 62960 71857 31020 28726 -28108 -74743 -53271 -12935
20000 -12935 -12929 3780 5092 -27467 -24545 -68302 -55430 2889 -7184 -27134 -17594 9446 21495
19987 21495 38692 21112 -27133 -59853 -21339 73533 132827 58634 23401 31745 37692 16905
19975 16905 -4597 27716 -29797 -47255 -39487 -2170 10439 9166 15218 11720 23607 -21448
19963 -21448 -29576 -3765 13875 -20737 9188 14855 8464 -60971 -109114 -12739 -7855 -15526 -19549
19950 -19549 -65061 -60037 -23243 15127 -4568 25653 -19358 -113859 -114192 -50835 -46331 -51616 -119239
19937 -119239 -48583 24841 66687 34992 29406 31738 -15071 -90184 -118136 -87802 -87538 -87963 -63153
19924 -63153 -45402 7006 -5558 -44034 -88735 -74036 -63233 -94478 -131821 -63301 23317 44373
19912 44373 -10667 -7486 39786 37105 25980 31594 40123 26080 45851 83082 58208 33013
19900 33013 -31210 -63990 -50037 -6436 23237 -6675 -65301 -18485 -4456 -12315 5975 45433
19888 45433 51038 78256 46526 9549 21652 60948 38359 -35188 -24376 46787 74926 77888
19876 77888 48363 3311 -11171 -1498 -2105 -7778 -38699 -1241 20245 60693 -49700 -108511
19864 -108511 -64348 -66100 -63150 -74596 -106752 -132810 -55262 4824 -26072 -33627 -82041 -109398
19852 -109398 -149373 -95083 -42234 -55466 -60385 -20327 51203 9531 3254 11638 21570 -26088
19840 -26088 -64266 -25161 -15151 550 12066 5781 31795 104390 122041 81218 62815 12054
19828 12054 -30822 -37030 -16660 29513 30672 -21158 -56487 -75520 -18539 -3765 -40905 -28089
19816 -28089 -19501 -13610 25368 77434 66359 84148 86424 90695 105882 39411 -8497 -3850 5202
19803 5202 26098 -18415 -19974 -26152 -9299 27199 39756 -13047 15357 17015 3147 -32418
19791 -32418 -68486 -14939 -55759 -46623 -20681 -51827 -71524 -4725 -25234 -17826 7044 27836
19779 27836 59219 65039 52883 27238 -8849 -97513 -110186 -37419 2390 -8310 -24096 -32124
19767 -32124 -37855 -101217 -56437 16824 39499 -22730 -39040 -77824 -17774 29071 69769 79677
19755 79677 56344 40419 13024 46777 87598 111867 106660 113169 145785 156488 174378 150800
19743 150800 60230 -13901 825 17998 -18191 -25011 33407 59101 83021 88969 81050 31747
19731 31747 -35896 -7921 -5236 -5097 -6579 56494 37499 -37517 -40496 -81800 -103108 -88725 -83238
19718 -83238 -31754 6287 9976 14872 38952 -10261 -45243 20558 -3835 -36669 -50825 -116729
19706 -116729 -132177 -93408 -69902 1212 56343 14854 -3677 467 -16855 -33825 -20679 -36863
19694 -36863 17699 -17112 -93733 -30789 10891 18520 68387 55737 4668 50547 108398 102876
19682 102876 109287 66710 41757 12998 -27595 -63868 -41908 14452 20601 -38801 -40512 -59513
19670 -59513 -61409 -48188 -27206 9566 29277 5986 -13165 -6169 -2668 -23645 -42174 -8823
19658 -8823 25652 11351 -49453 -94954 -48376 -17251 -33271 -25177 -10052 -27762 -58129 -13433
19646 -13433 41107 19067 32067 2600 -43774 -95167 -57482 -35656 -29552 1884 38623 44532
19634 44532 53516 66011 35009 36278 1654 -18827 -36449 -29219 16882 83583 74545 58044
19622 58044 75970 123709 132910 167142 67181 28328 11408 55942 61915 144853 128258 -7564
19610 -7564 -46208 -9758 46518 92909 107237 102329 100002 116698 169697 165648 44022 -14741
19598 -14741 -14705 -27171 63961 93798 78083 46060 47105 99656 56319 42522 37974 31511 -12350
19585 -12350 54808 89571 91691 78065 20063 -38348 44137 69785 63783 30328 8774 24123
19573 24123 21475 888 9679 27585 39109 33186 39327 -1274 -26793 -47531 -47169 1082 -5708
19560 -5708 -3142 78184 107138 87213 91310 91746 111104 78566 34867 13393 55777 63768 65545
19547 65545 49271 40028 17575 10562 72079 129438 124512 101064 89227 126656 97210 51561
19535 51561 4427 -3930 32568 60550 39919 11514 82607 61576 16949 -5145 63627 120913
19523 120913 65017 -14612 -66888 -35064 -60821 -11028 76972 64361 30033 17985 -7103
19512 -7103 30013 80042 47977 -12184 34318 109685 158120 114427 119138 213250 217126 239149
19500 239149 232831 216278 333073 419334 482410 399477 363991 390902 391073 392722 411188 446031
19488 446031 451216 439989 411687 352296 366187 396595 359268 367058 400632 335175 266721 274462
19476 274462 246351 231110 240578 170461 149742 153058 177281 231542 214547 123651 92624 81630
19464 81630 71797 -8604 -40666 -32785 -33194 -36574 -41908 -5215 38068 133942 100114 53964 24748
19451 24748 19902 7165 -21048 -49458 -2058 41829 88301 86099 23827 -29891 6343 -8673
19439 -8673 -2070 -53904 -4941 58258 62474 117236 113475 131426 206754 166332 141263 84773
19427 84773 83645 111687 128115 100061 99939 100984 107797 88372 108045 190651 176898 195529 191984
19414 191984 172600 112746 69173 73652 48344 43499 117184 159499 133345 76323 74445 86349
19402 86349 60760 86131 112391 98739 24830 44226 112511 111694 103673 103417 65505 41248 55516
19389 55516 54190 49881 62244 82539 114392 118183 43000 32336 42938 56983 21848 -23415
19377 -23415 8702 45765 53613 38800 73034 43479 2229 -22949 3416 -5271 -28547 -11729
19365 -11729 15222 -22312 -51699 -36594 -223 -20200 -8130 11769 23737 46546 102381 121841
19353 121841 108035 128191 199853 299945 314687 243147 213812 179576 138118 151128 234775
19342 234775 307275 353200 342174 337285 339649 316074 278315 283916 273185 213710 174934 178938
19330 178938 158010 197642 190133 194098 159762 102857 67687 2938 -38648 -6825 -11450 -397
19318 -397 -2273 15881 -17014 -44022 -18982 -32339 -72134 -45169 9935 10805 -16879 19664 93710
19305 93710 137498 164517 112925 117271 165444 249361 292193 244449 217085 242797 245793 219656
19293 219656 233126 277864 302394 327126 299375 333961 350819 293532 296707 301337 301558 304551
19281 304551 303505 255131 202899 182205 184643 105953 106949 177366 164354 110821 131692 140220
19269 140220 139621 101434 101745 116992 43613 -13657 -10878 -41552 -14575 -13002 2422 57068 128101
19256 128101 94357 77696 55251 39460 42013 49606 40750 13680 15326 2147 3194 94059
19244 94059 201132 167866 140830 65115 13075 8091 73072 43780 38412 20154 47540 92274
19232 92274 124896 81155 32188 14912 925 -13759 -33830 -77889 -70357 -44914 -29545 -4472
19220 -4472 22252 60585 78601 89922 85585 55705 -5728 -44550 -28577 -17277 -20609 -25817
19208 -25817 -45024 -42187 -17816 -17643 -45601 21302 66877 67737 137058 98636 61431 37748 46573
19195 46573 46167 -8109 15294 51233 44662 37564 -1797 -30160 -52243 -41898 -15993 87584
19183 87584 116591 127931 51414 34366 35143 -5896 -25045 -18231 5291 72973 81390 41834
19171 41834 22382 -5066 30147 106371 146996 112264 91394 47336 42407 110218 96855 65749
19159 65749 65235 23653 -3270 -12798 12510 22019 -35257 -21290 14277 34211 27310 -50721 -58915
19146 -58915 -36760 -62658 -52255 56042 70356 28964 49311 20746 56326 33360 -18040
19135 -18040 -21922 -7805 6238 43208 62086 782 44660 78833 73414 129079 176474 99054
19123 99054 12873 -43628 -62263 5132 20625 93222 97777 78646 53584 48976 24840 11902
19111 11902 17636 16942 27751 -3093 -2389 -46871 -51491 -28030 19816 -2081 12615 6033 -44422
19098 -44422 -100538 -63041 -25518 -49230 -49992 -36940 -54848 32599 90369 97078 89835 47475
19086 47475 54105 112053 62076 35078 43160 -9109 10370 -19294 21254 16351 -19450 20442
19074 20442 43061 62462 21351 -13233 18726 27080 -22975 -58397 21105 51338 17061 -14008
19062 -14008 9624 19359 38692 14525 468 37459 81988 18385 6088 33492 69790 63925
19050 63925 44481 28516 -11363 -31347 -2984 16077 1140 32563 54131 30434 6461 34291
19038 34291 72099 77511 90879 89415 116767 97218 18321 43072 63216 74508 44859 -8690
19026 -8690 -41713 -7121 66850 66986 55706 98629 67677 17362 26648 -29066 -15860 -29207
19014 -29207 -20401 -29306 -10043 7369 21836 63117 26408 10880 -14818 -43128 -24960 -67214
19002 -67214 -36050 12465 78125 75686 47457 18461 -18691 -81425 -52731 40069 114557 106992
18990 106992 104956 74492 103709 94837 73378 6977 15119 51938 71038 5174 37039 65404
18978 65404 51636 9742 -19572 6905 19821 29663 50771 80377 82036 82578 50724 74380
18966 74380 57134 95709 111534 85308 19202 -455 47522 52218 63314 64758 83323 90347
18954 90347 46951 15355 2659 -65276 -74654 -80032 -28442 -2884 46618 21180 -19993 -71242
18942 -71242 -35380 13441 -1546 5686 -14602 8937 -7594 56614 113654 48389 57660 97446
18930 97446 79939 108028 61770 16360 37477 98329 142475 103612 126759 128109 69029 26730
18918 26730 -5264 70765 134995 60740 13496 -5565 44410 57284 42747 17735 63314 49375
18906 49375 31585 14470 7723 74451 114245 92041 129209 81230 91333 161146 198282 155446
18894 155446 95672 88842 147999 139752 147741 165646 192376 176338 80307 5209 -6666 31362
18882 31362 123593 142207 148255 157045 139336 166113 140988 111024 135974 144601 141579 127943
18870 127943 69819 10906 20956 75509 112956 93050 14952 21415 25265 5337 43297 83148
18858 83148 122273 201474 212482 159274 85391 118050 167626 72647 29724 73614 114576 168803
18846 168803 166394 154828 196588 162653 123970 119429 156881 114510 56479 68258 128756 98875
18834 98875 79791 64711 127726 181132 199845 215617 183048 128943 167043 181451 135844 124131
18822 124131 101341 109185 123785 168861 125517 104255 147926 166730 138762 56767 68614 117259
18810 117259 169951 154646 146332 139047 97675 137941 141981 136050 153971 188006 232521 285688
18798 285688 247684 222269 236969 263441 294073 335184 325407 316297 233791 220744 257943 261336
18786 261336 222180 146997 150740 161360 158485 172098 149612 236388 254438 242946 240997 282351
18774 282351 350015 410574 430492 474828 587276 642434 666377 689561 727656 717998 621049
18763 621049 529028 457905 456016 496336 514886 498550 511638 490093 512012 548205 562512 542103
18751 542103 507230 512998 579529 667118 732556 795354 868988 916736 971325 1065479 1052668 1009672
18739 1009672 953078 901054 825557 733253 626770 513340 512461 466921 445395 446683 461822
18728 461822 434411 435873 428694 425710 447118 448033 447755 495583 574312 551764 537401 521557 475326
18715 475326 512481 535978 568511 593187 657361 711467 719745 684526 662574 656626 661518 679239
18703 679239 660229 646994 635447 654355 677280 718309 847885 926672 969123 1051502 1098611
18692 1098611 1109439 1068492 1061458 1076974 1021079 943369 901614 838402 742839 670981 704772
18681 704772 586559 485483 479446 470141 379852 328644 324421 356538 354965 347457 345990 340003
18669 340003 373462 351548 365689 391294 413096 417010 371079 357454 369160 440322 474615 457810
18657 457810 438446 453136 506335 632555 673208 650594 685737 685319 697244 780183 770666 727818
18645 727818 707481 670655 674599 692501 643140 640000 687432 695985 696462 683841 649609 610229
18633 610229 565970 544039 512045 496494 458784 370710 316168 314480 312945 263130 302328 248711
18621 248711 269319 243461 227199 282234 356494 355974 293895 350159 355654 338713 296147 275950
18609 275950 353656 381148 404953 448147 461372 438959 444424 546934 558398 530461 468997
18598 468997 452086 469926 552922 619882 606216 516314 495483 516276 500874 474019 461463
18587 461463 445710 393453 356390 329097 320719 266466 242697 258366 263889 247364 240455 201521
18575 201521 200490 240820 272758 278552 214371 212620 201364 210837 219443 242470 214295 187359
18563 187359 205402 204057 191256 120383 101699 121235 125363 177690 231372 255445 269086 226592
18551 226592 237749 251011 254558 244324 247069 297363 347726 342513 402699 449239 498375 497693
18539 497693 544265 551154 576912 582120 585948 610870 625572 677630 700689 703744 728378 782638
18527 782638 821686 824676 815775 826277 838751 756613 729803 771562 816218 819212 732869 682277
18515 682277 680430 639036 562075 575327 584274 518332 495112 479812 503863 496709 441377 387151
18503 387151 382218 467418 484342 482219 474598 502708 489175 475150 523292 655695 724407 707640
18491 707640 637362 672013 697062 602723 521157 473633 458263 471937 429682 355683 286248
18480 286248 226935 284101 351321 415023 416239 388398 344339 345405 411645 414215 376483 396483
18468 396483 392119 377021 383782 353383 350841 371736 382916 416144 428696 413428 385449 353108
18456 353108 340412 421259 467457 505174 567648 632386 677526 717079 782567 836073 854610
18445 854610 896731 948665 983914 981554 917944 829961 768573 642662 547014 553765 553778 521696
18433 521696 473277 471729 497779 476283 394258 362281 318651 384873 475782 504030 462970 423618
18421 423618 479633 553319 567750 575165 582789 625515 598368 493185 493218 510644 553129 552562 491040
18408 491040 455488 468646 458747 469355 509168 520786 586446 637321 639267 655297 661959 673656
18396 673656 680654 709937 675993 654882 635711 610961 604805 648677 646023 598529 607972 637499
18384 637499 656907 641865 570993 561127 582118 586688 620347 622274 598684 574764 589320 603178
18372 603178 580137 580339 639704 626878 628149 604741 685999 678398 680305 683194 641165 649108 654755
18359 654755 648864 637542 634213 659181 716301 707459 649779 599492 581999 559614 608631 649488
18347 649488 673129 702765 734708 726155 799558 797080 753925 716165 739136 813749 841524 833601
18335 833601 862153 896912 895595 910259 846004 846226 893136 901858 933510 996413 1060080 1084738
18323 1084738 1146233 1227494 1250788 1269084 1295643 1323574 1383808 1453551 1511235 1545414 1586226
18312 1586226 1613949 1619081 1633088 1715035 1770145 1824288 1855143 1912097 2056515 2168146 2314107
18301 2314107 2450973 2776885 3216301 3816503 4556606 5479225 6949241 9074424 12037069
18292 12037069 15957706 20593264 25443083 30057152 34020880 36806685 37786796 36677422
18284 36677422 33781203 30046145 26045884 21845306 17837435 14606222 12349035 10831937
18276 10831937 9753890 9008869 8523069 8217814 8036889 7996573 8118731 8372988 8715377
18267 8715377 9279828 10138012 11184071 12201344 12883984 13152487 13294892 13428993 13346099
18258 13346099 13057880 12997776 13451247 14583778 16525266 19530538 24190053 31300445 41573999
18249 41573999 54644880 68594664 81551695 92415630 101718670 110728110 118988712
18242 118988712 125711865 131101633 135330927 139760862 142814067 141471290 134874033 125176929
18234 125176929 114672026 102804261 88938243 75398070 64295741 55920916 48877274
18227 48877274 42036730 36036853 31649524 28572407 26396760 24928453 24077449 23744933
18219 23744933 23995942 24914263 26390419 28023440 29537641 30762226 31722311 32788489
18211 32788489 34199768 36165397 39306342 44376262 51045978 58510337 66559311 75388153
18203 75388153 84440473 92477541 98894686 104890607 112129818 119689289 126828525 136220483
18195 136220483 149639960 167328308 187249109 206140326 220590757 228195124 228562265
18188 228562265 222799202 209724442 187124283 159237136 133112192 110736506 91371202
18181 91371202 74665616 62043612 53531943 48064693 44636072 42406955 40680051 38891295
18173 38891295 37123971 35474765 33841664 31901041 29875304 28267517 27327021 27022263
18165 27022263 27330953 28535927 30869632 34420682 38685643 42583995 45016579 46185842
18157 46185842 46829599 47342806 47442488 47458941 49713829 55623581 64774307 76023777 88834101
18148 88834101 103272661 119056809 133874087 144316235 149037064 148931344 146963385 143527185
18140 143527185 137922475 129908242 121963106 118187332 118015231 118160527 116829663 115110530
18132 115110530 114277703 113109967 109750457 104636149 99836800 96476144 92993467 87900076
18124 87900076 81695159 76171338 71570729 66331775 59481208 52882169 47972949 44702455
18116 44702455 43069546 44387447 50042400 59971506 70423972 75821126 75929457 73290030
18108 73290030 70305435 65685466 53337488 40067164 32012661 27604214 25385822 24465708
18100 24465708 24324908 24665253 25578006 26997527 28482200 29475927 30304961 31688282 33573664
18091 33573664 35277785 36410467 37835638 40032575 42492888 44193798 44776437 44755661
18083 44755661 44746495 44391587 43049104 40700255 38574731 37176274 35818277 33629373 31130890
18074 31130890 29083050 27188755 24728516 21727830 19051964 16932260 14945350 13112830
18066 13112830 11630965 10531444 9661511 9022731 8515221 8004371 7557023 7198397 6922579
18057 6922579 6701791 6504885 6313905 6195571 6109246 6117510 6122379 6196578 6308830 6365510 6521695
18046 6521695 6793706 7165468 7740628 8497221 9416289 10799600 12743901 15367472 18644942
18037 18644942 22571180 27339269 33002597 39358730 45746388 51302391 56409289 61727788
18029 61727788 66544588 69671146 71343185 73525757 77204702 80956143 84079148 87688546
18021 87688546 92474695 98313483 103431810 106247189 107266700 108116276 108675943 106507213
18013 106507213 101358534 96497476 93369449 90160893 85682804 81036975 77467827 74684109
18005 74684109 71579285 67161343 61468084 55904572 50944981 45462547 39305225 33611605
17997 33611605 28963060 25084848 21631604 18713647 16476174 14825619 13459819 12215379
17989 12215379 11192361 10392670 9696790 9065299 8413606 7763745 7227118 6754609 6300381
17980 6300381 5849299 5413886 5063464 4805872 4502578 4230341 3942096 3681508 3465349
17971 3465349 3333309 3210417 3041434 2970864 2907038 2765693 2558934 2441427 2345717 2273858
17961 2273858 2241325 2214395 2102110 2021640 1921647 1850205 1755077 1674095 1618365 1593165 1635083
17950 1635083 1688265 1678423 1585596 1525499 1484786 1477263 1494757 1556196 1558595 1606274 1638687 1698753
17938 1698753 1791924 1738505 1675692 1692092 1695444 1681746 1635241 1648550 1669647 1661786 1637937 1619784
17926 1619784 1651217 1670676 1710976 1751824 1682341 1650428 1596009 1565334 1529797 1529837 1565113 1572909
17914 1572909 1574795 1595296 1646458 1629439 1605075 1578753 1524118 1431875 1364484 1309872 1260448
17903 1260448 1146412 1102361 1088240 1012581 944405 966591 952933 934460 916924 922073 856828
17892 856828 808698 847246 910414 902886 913741 975097 1019924 1026410 1021220 1020075 993579 924795
17880 924795 954288 911942 865694 881869 915450 903130 820939 812992 849872 836373 903685 956994
17868 956994 964184 940420 909008 955715 951490 913926 944153 990226 1104101 1134045 1168660 1141368
17856 1141368 1059719 1051734 1026138 1056764 1097491 1158661 1144045 1154034 1166622 1217245 1313281 1376110
17844 1376110 1463633 1570148 1672982 1694390 1808171 1958013 2100587 2238283 2377660 2498538
17834 2498538 2673773 2921371 3190707 3540020 3972596 4505592 5257541 6204662 7499855
17825 7499855 9443032 12129878 15667737 19991470 24845478 30052553 35180346 39416961
17817 39416961 42481932 44510632 46116063 47485688 48199933 49300522 51695572 54482508
17809 54482508 57113161 59453170 61371717 62874739 63187646 61676552 59415783 56955256
17801 56955256 54533351 52283657 50017760 48448956 47728118 46861233 45411123 43358304
17793 43358304 40677332 37420007 33292038 28660276 24548792 21018224 18028729 15708494
17785 15708494 14106969 12928000 12082388 11577949 11315117 11248009 11432217 11923212 12916805
17776 12916805 14540997 16831316 19608316 22794065 26444564 30327821 33730674 36197672
17768 36197672 37865158 39266289 40610282 41322101 41603347 42972040 45223689 47426926
17760 47426926 49310970 50899734 52379192 53479928 53074008 51415172 49468810 47650196
17752 47650196 45996946 44159033 42431888 41671352 41275808 40532659 39377035 37850906
17744 37850906 36139976 34201300 31860135 29965551 29405773 29722946 30353787 31250023 32514473
17735 32514473 34761256 38278453 42337832 46086194 49429793 51714244 52893742 53633393
17727 53633393 54053304 54168108 53351929 50909750 47708146 44409578 41315110 37981136
17719 37981136 33049812 27227709 22752509 19787529 17869991 16618545 15756745 15235666
17711 15235666 14924091 14858213 15060670 15503345 16265127 17510590 19222343 21342586 23786107
17702 23786107 26741913 30092280 33268925 35724745 37585134 39430922 41938781 45470208
17694 45470208 50776771 59872845 75074884 97543883 126193979 157094838 184599623
17687 184599623 205125464 219948990 231927535 240353696 241258239 233168175 222599453
17680 222599453 215876971 212080001 206239777 195514270 182328721 169468976 156252860
17673 156252860 141266795 124945404 108707153 94072895 80805432 69275829 60413466
17666 60413466 54121398 49323457 45542994 42530037 39974191 37528056 35087016 32779679
17658 32779679 30850576 29362552 28230759 27366954 26776249 26575155 27006099 28330023 30963186
17649 30963186 35257174 41072825 47925009 54916360 61361021 67038094 72093058 76497931
17641 76497931 79732443 82118870 84892524 89886060 98536448 112171445 131592040 155180430
17633 155180430 177278822 191207492 195866334 195461201 191171560 178647747 155860974
17626 155860974 129909580 108560226 92432980 78748089 66319548 55901180 47834386
17619 47834386 41795315 37384481 34088445 31562593 29486171 27910304 26725450 25793903
17611 25793903 24898912 23813332 22613322 21286353 19890898 18496887 16761494 14817755
17603 14817755 13084766 11701546 10585526 9694439 8897093 8208695 7624001 7109305 6559571
17594 6559571 6151123 5857866 5573259 5268312 4989578 4753844 4490041 4246226 4102169
17585 4102169 3947338 3773633 3658109 3528575 3342232 3232788 3163101 3042169 2908933 2872874
17575 2872874 2761730 2726867 2654830 2541019 2427829 2305317 2295547 2214604 2137893 2085477 2032733
17564 2032733 1968461 1893915 1816184 1768224 1738611 1692257 1660144 1639033 1595966 1558594 1488185
17553 1488185 1465630 1414298 1337121 1360358 1348770 1338668 1372384 1381302 1313541 1262516 1244567
17542 1244567 1199655 1210547 1241598 1171876 1052752 1049593 1056464 1035701 1017056 1026587 939585 845893
17530 845893 818293 814607 841119 806395 745508 729118 751906 813951 874048 916432 988024 1013194
17518 1013194 1001664 970302 989236 1019885 1031622 1024679 1007438 1011056 1019975 1036284 1069115 1110040
17506 1110040 1071770 1033372 1051884 1108547 1042102 950298 864844 827669 843137 885979 811085
17495 811085 748631 747566 736410 758623 793390 715966 673152 674000 636929 618391 591550 569574
17483 569574 559925 526183 476964 469789 501556 459101 407401 363166 349417 376567 374685 379053
17471 379053 358217 322511 296616 232998 230973 200464 173603 117096 140009 96148 70567 124088
17459 124088 117008 113710 125836 164378 186545 192125 155993 155782 134914 162304 211123 240627
17447 240627 272348 346308 402168 453400 466126 437820 421856 400590 327908 317202 320059 277724
17435 277724 228357 225278 214028 243992 275391 258833 272226 227330 209663 206922 168029 185061
17423 185061 218144 212920 182636 260117 290929 233391 237566 216729 181694 161924 105311 99188
17411 99188 90538 44038 -224 -4306 -2999 24004 61892 60188 64245 86810 51919 331 22046
17398 22046 44238 43360 4541 23356 55904 62035 30097 -6560 -5138 -23179 -72651 -39408
17386 -39408 -40531 8116 52338 34406 8345 -7712 71545 135313 185583 177134 138670 117697
17374 117697 87075 78508 47602 45081 132615 186433 217601 269637 188184 107648 78637 127164
17362 127164 135881 92938 39978 108647 152039 196246 208520 188888 93809 36507 111600 96418
17350 96418 56423 69576 55783 41139 94516 112037 124735 32022 -48636 -61548 -99910 -168342
17338 -168342 -134169 -126283 -53856 -16227 -45319 -70828 -6863 -27825 -48645 -74307 -78966 -17696
17326 -17696 16279 3767 -9932 18777 63061 129077 119905 84394 76645 72664 84438 57912
17314 57912 59114 108331 111500 89114 130384 131246 145141 136749 85757 133470 131819 167766 215779
17301 215779 288863 362085 328497 275591 269537 336392 335667 299312 267671 363793 434362 452576
17289 452576 451806 431048 460506 462307 436748 416009 374588 370012 347642 310272 301143 256938
17277 256938 233021 261118 318805 326709 259729 151629 182752 219691 157794 99766 73355
17266 73355 38053 12334 70740 132103 195602 220009 173600 131310 37841 -34442 19831 80628
17254 80628 169773 224941 237137 233803 216252 193393 228340 256681 240791 291449 368278 364869
17242 364869 329701 270529 272015 341877 333510 256123 269726 304538 293406 302237 317260 285643
17230 285643 294755 343076 395575 373069 344401 347557 316425 273915 279882 295796 258837 275390
17218 275390 249514 222185 218769 267807 305327 253949 259660 299504 284138 241841 221717 240295
17206 240295 206727 154587 146731 83484 94651 62095 158548 228669 278271 286365 246824 262225
17194 262225 299939 372566 442148 433301 414785 482990 465283 447816 531556 585839 624014 638040
17182 638040 590011 588265 567663 619891 724112 738802 739579 804745 884999 982174 1039727 1057333
17170 1057333 1005346 996234 976911 968780 986711 834673 703415 621055 570272 526454 470053
17159 470053 404761 350829 191553 137236 161658 234586 248613 245869 264115 234344 179183
17148 179183 190101 241178 229715 153661 96087 187630 269116 322869 385630 478264 446992
17137 446992 446185 503536 578694 573517 645072 634434 506386 419233 458750 524142 572794 599409
17125 599409 579315 584220 577617 515943 485058 418712 431829 452717 397041 371511 361214 412355
17113 412355 397206 357080 347091 354448 313785 285321 218247 211307 201275 197078 168992 114434
17101 114434 34741 65789 104077 122974 103697 56629 -29468 -42200 516 81712 119299
17090 119299 73606 5643 -26419 -81234 -59732 27514 89295 32788 66986 62198 27540 14363
17078 14363 821 -8862 -18064 47820 40982 -30325 21235 26605 14842 -13500 -24801 -54994
17066 -54994 -65575 -80606 -15486 110486 117323 38142 575 -4216 -57897 -60876 -19367 -57195
17054 -57195 -77091 -32533 -39546 -34600 -31718 12856 86007 65324 -42043 -55720 -16284 35253
17042 35253 20473 44857 -23699 28453 102221 98081 69411 -18958 -55129 -12385 21454 29027
17030 29027 43685 39044 21039 27831 22492 -89098 -108940 -52935 -7809 35836 45357 40625
17018 40625 34537 11693 39332 92591 94783 76790 48014 55740 48818 54389 27007 21832 60282
17005 60282 49615 47823 81567 35072 -5408 -61373 -86886 -18625 -25042 -55269 -38551 -1252
16993 -1252 16655 23709 -25120 -80982 -35658 35123 -936 -6787 -4350 405 -51143 -62907 -65901
16980 -65901 -16231 2187 34252 45999 5953 -15796 -16460 -50641 -19159 -41291 -71369 -46437
16968 -46437 -62387 -50061 -3545 -44067 -57188 -46027 -51624 -118154 -80526 -66118 -94348 -108401
16956 -108401 -57968 -27160 -9969 -12040 -18810 -32585 -63649 -73192 -24717 -13497 -15965 -30277
16944 -30277 -55514 -87427 -75617 -6966 45378 61041 51184 22095 12586 3052 -28212 -71996
16932 -71996 -78351 -85649 -63047 -17468 -22121 -24484 -55399 -73167 -81212 -9031 66295 64247 -12699
16919 -12699 -53497 -70029 -32208 -27350 -18827 14834 11305 -220 18811 28137 -3343 -81026
16907 -81026 -93803 -110233 -122912 -121173 -85909 -28616 48010 58891 42361 5149 -51989 -48710
16895 -48710 -34145 -69779 -62328 65300 74607 34177 48365 18377 38114 29204 -6295 -23908
16883 -23908 -17701 -31448 -16739 25323 72155 93581 82414 72640 54066 47984 113697 77977
16871 77977 40814 23553 53944 10367 31574 69745 46839 9968 -21740 48739 96395 56245
16859 56245 29209 25150 24373 -24208 -48798 -29262 20658 52015 49220 121282 189168 147395
16847 147395 45239 19560 -57057 -94260 -49516 4156 14970 -2466 12612 11376 14
16836 14 50502 62465 63068 26754 -21316 -48340 -53139 -59594 -50675 -24599 -77072 -53922 -49979
16823 -49979 -1168 17879 -4820 30034 54679 37307 -11575 -30922 -64605 -22099 -7013 3033
16811 3033 30315 23881 46281 73849 11745 7864 18481 36648 32869 17504 7570 -20883 -67232
16798 -67232 -50625 -43124 5631 45823 -18853 -31463 12751 43142 34053 52263 44984 4658
16786 4658 -29322 -24418 -4625 842 8463 26892 11843 24640 -38100 -51837 -25713 -22462 -27117
16773 -27117 -38620 -46200 -26153 25324 27337 -19074 -4349 -8307 -27658 -22517 -53734 -38069
16761 -38069 11895 36296 44878 104451 86227 45451 18461 -18940 -79460 -93626 -63212 -24321
16749 -24321 -13998 -62315 -77599 -41407 -47743 -6788 29366 35589 59621 -20862 -16368 42940
16737 42940 55309 14730 191 10082 44920 26090 25921 21828 40697 4406 -80774 -37483
16725 -37483 1309 3428 -37713 -60791 -65276 -47623 -25983 -24862 -47675 -125 64257 68358
16713 68358 33527 -20114 2548 7038 -13410 -33025 -45632 -82242 -89145 -108758 -68488 -64607
16701 -64607 -14987 -4904 68552 -5144 -52871 -49959 -51361 -5490 13004 -23610 -5263 71453
16689 71453 3713 -3955 64265 63480 -3914 -85365 -100823 -67117 -71892 -37414 16416 -22208
16677 -22208 -52454 -41962 -67283 5299 17832 14735 11663 -18865 -10432 -38116 -52795 -95547
16665 -95547 -66888 -37172 39624 6746 -35675 10876 32591 28338 48535 39053 1477 609
16653 609 18824 -38463 -56986 -59150 -22823 -33800 -47940 -17018 27543 -10196 -5990 72312
16641 72312 147161 87474 27143 5657 -21082 10632 29029 56803 31702 35840 20213 -66530
16629 -66530 -120513 -116239 -132783 -100396 -62984 -64761 -77976 -72665 -64455 -49649 -39868 -119561 -107107
16616 -107107 -67190 -83835 -94182 -135271 -58826 -61001 -102521 -90323 -84157 -118975 -98972 -40043
16604 -40043 -11135 -662 27414 34629 -7944 -15645 12139 15557 50275 166706 157422 168374
16592 168374 107481 35410 -12967 -106769 -75880 -15968 56752 56389 54746 75913 45007 70199
16580 70199 152839 175130 186497 198900 128052 33018 14885 41847 27454 -33069 -47586 -95727
16568 -95727 -103666 -103301 -48680 17973 46965 58620 16253 -57764 -99950 -52283 4860 -50284
16556 -50284 -69627 -14813 -974 -15289 -10989 17442 -11057 -78034 -111203 -128361 -126686 -64302
16544 -64302 4971 80553 106695 48645 16657 79174 85740 123140 14190 -87774 -116762
16533 -116762 -80183 -85358 -64861 -66290 -66352 -40236 -57475 -60690 -42963 -7050 9441 26627 1452
16520 1452 20968 1127 -19837 -14551 -61542 -90459 -122942 -79347 -47776 -66575 -35507 -77547
16508 -77547 -120339 -68059 -41793 3176 1070 30454 -17930 -28237 -30694 -40698 -74176 -72948
16496 -72948 -48077 -36884 -16853 -10570 71782 92576 80435 78432 68591 31407 -20585 -10517
16484 -10517 -17975 -7003 -3177 -46826 -77582 -78207 -112778 -64407 -35709 12710 65063 76278
16472 76278 58573 37676 -9663 -29033 2260 -4052 -3246 7036 3761 -16515 -6849 45021 15283
16459 15283 -41508 -29216 -10051 -39752 -23384 36707 16609 -49842 -69880 -58204 -39668 -85434
16447 -85434 -54381 13677 39867 33716 -6500 -49044 -35567 -3383 -22928 -57569 -55662 46154
16435 46154 83540 71857 112451 100710 139104 89498 85646 26798 -24708 -3140 57107 59422
16423 59422 72257 21399 -9281 -28693 -65418 -41085 -1838 46932 12329 -52044 -96342 -109631
16411 -109631 -125588 -79796 -326 28783 43163 1450 890 10444 18306 5009 -19424 -34979
16399 -34979 -21990 2923 -8148 -23059 -26871 3051 -7971 -56258 -22611 6355 -11019 17276
16387 17276 44508 31210 -13739 -21857 -26049 -63279 -61474 -41909 -61933 -53252 -73353 -62888
16375 -62888 -28111 -48979 -127303 -145472 -142105 -113872 -71505 -114733 -60863 -5031 -3364 48302
16363 48302 66734 40244 28008 42488 70212 84614 81086 109385 117351 14569 40373 93741
16351 93741 77240 25976 69329 75158 9280 -37919 13132 32072 25555 -24932 -70786 -116554
16339 -116554 -70277 -69849 -63959 -24307 -735 -8110 -964 36577 54384 56474 37573 20446 -53892
16326 -53892 -45101 -496 34530 50730 70514 43737 38675 60801 23563 3255 -21688 13068
16314 13068 4277 -42012 -55683 -77852 -87337 -73418 7838 17956 57913 73027 82871 158252
16302 158252 169083 159798 151415 114800 77807 71675 59167 48589 61217 37412 30036 42033
16290 42033 -15377 -34432 -40862 -69709 -45793 -12903 -34405 -14013 24093 69865 79801 15239
16278 15239 7741 49526 65871 29641 -41361 -32124 -50264 14211 10604 -14895 -24288 26657
16266 26657 32171 37415 41365 49480 66435 10419 -18460 7062 60219 79840 2769 -41882
16254 -41882 12625 105856 118543 43312 14908 -9048 -20351 -56397 -31582 11196 72329 63305
16242 63305 50934 65897 63497 41121 8403 64114 58945 35081 -11571 -78409 -55641 -46283
16230 -46283 -44901 -58599 -42774 16829 6336 11950 55994 26553 1760 -7844 -83702 -110436
16218 -110436 -48556 24094 64360 71851 52723 67614 74302 41335 40389 10326 -59713 -62379
16206 -62379 9909 -4281 -61848 -59606 -38334 -19254 27058 70604 -19116 -36520 32144 42684
16194 42684 -2904 33956 46071 25638 -13760 -37838 -8325 -1115 -11669 12948 47223 86628
16182 86628 69209 21621 -3133 32294 -6615 27659 82964 55915 -25500 -88289 -116166 -74516
16170 -74516 -85729 -136825 -115964 -9246 -45404 -67689 -73404 -29179 37187 58535 -3971 -68618
16158 -68618 -44714 83065 87535 6053 -31386 -71547 -68868 -10668 -52258 -43436 -78785 -92721
16146 -92721 -96618 -17230 70653 89278 54562 188 -5459 17233 57827 66326 60317 67322 100589
16133 100589 101389 58300 71723 47841 -26661 -48976 -22500 22651 97193 117207 103691 50970
16121 50970 -24755 -82997 -72186 -88064 -26622 19528 -27639 -66213 -62661 -36719 -31761 -18388
16109 -18388 -876 17685 84484 76247 49441 -15562 -46915 -53172 -71193 5047 71684 116759
16097 116759 112144 48899 -15589 -43118 -52609 10961 116469 129402 73081 -405 -9681 -4318
16085 -4318 -22024 -21941 14864 22467 61639 30153 -57730 -45142 -22427 27293 33030 -29432 -85571
16072 -85571 -94632 -49036 13641 16120 15147 46056 85112 61708 1657 -21171 -15611 17842 56826
16059 56826 26641 -16916 -27976 -43896 -51255 -67761 -23506 -12009 39179 111127 79574 50842
16047 50842 65851 91620 70248 56173 82991 34248 47631 68094 63759 96191 48875 54822
16035 54822 58140 93995 123763 70032 42993 -7262 -19721 9959 -22988 -8342 -44305 -75543
16023 -75543 -61915 -431 41018 24416 -399 -14072 19965 53580 16606 -52685 -60402 -91783
16011 -91783 -66521 -16665 36824 26397 21453 15545 23995 -46406 -52797 -51768 -72277 -30638 -25052
15998 -25052 -61765 -35705 -12085 11341 8812 -87473 -159686 -142598 -91523 -102104 -77930 -17927
15986 -17927 2026 12355 16228 22451 3625 -5553 -9096 -19126 49991 51284 -587 -33645 -29795
15973 -29795 -19648 -56756 -80505 -57444 13781 90800 46881 206 26515 25108 -48089 -58850
15961 -58850 -24527 7106 -15238 -18986 -54281 -740 12290 -54532 -25259 33716 154926 177440
15949 177440 97082 45955 6008 -45498 -13745 10575 -17478 -52111 -37207 17920 -42191
15938 -42191 -113783 -90214 -14075 14191 1695 18638 -2372 -30107 24000 46432 57266 42924
15926 42924 95989 145133 44600 -12039 -29464 6708 -59510 -68424 -68758 -52599 -66539 -70265
15914 -70265 -62497 -74427 -89109 -75835 -90121 -61787 -39346 -45323 -65012 -66214 -17154 -44898
15902 -44898 4186 28605 -20262 -77132 -51635 2898 -60488 -79528 -69471 -102023 -110448 -118716
15890 -118716 -132477 -87760 -33778 -44731 -58938 -100741 -92585 -32040 -23099 -39174 -21690 14412
15878 14412 -5263 -59954 -73592 -29181 9003 -46252 -73692 -44800 -61976 -15647 15564 8595
15866 8595 -32561 -16635 3481 15423 -2769 -13624 -68857 -92719 -53850 3641 41547 126603
15854 126603 132175 79008 28850 -24343 -76039 -80637 -115956 -85313 -54613 -103931 -87244 -63353
15842 -63353 -25186 16735 85107 80683 20597 -4124 873 70950 53372 43766 66338 38083
15830 38083 62904 -17905 -78982 -63371 -17130 26708 2671 5916 11624 23266 51433 45300
15818 45300 14403 16507 64972 92138 96029 70305 47039 24044 42435 28259 -25942 -18365
15806 -18365 20467 12389 -32015 -31363 46516 46868 20564 17524 67381 101094 104786 92279 49348
15793 49348 -53439 -64880 -53994 -40241 -35014 11834 38987 -3795 -59342 -46149 -573 -53550
15781 -53550 -93709 -5148 81558 87022 45658 69860 20225 14123 93983 100362 20407 -24134
15769 -24134 -33405 18699 -16352 -129377 -140364 -83430 -88942 -118578 -59367 -38001 -24995 35123
15757 35123 21539 4090 -49216 6203 14630 -12638 -55823 -58245 -39760 -19152 2400 53841
15745 53841 48528 -817 -20761 -55177 -40847 -96564 -97282 -42761 11288 22297 42173 65704
15733 65704 104398 111598 128878 81153 -13923 -2329 -662 3601 -42849 -45507 -20859 -15993 -30993
15720 -30993 26103 92525 69414 86477 64579 412 -60236 -3377 38323 21541 -52960 -80354
15708 -80354 31 55940 60638 71593 58380 51396 22445 1862 56121 49835 4363 42883
15696 42883 70780 10305 9993 33999 53628 49269 22432 69096 51090 37478 37301 50600 20287
15683 20287 -2983 -44553 -64901 -33224 -3791 -18416 -25569 -2977 -18048 -46202 -37821 -33356
15671 -33356 -49833 -104395 -120819 -112744 -83292 -95423 -63878 -15958 -52025 -49273 -103154 -145695
15659 -145695 -67433 -46587 -59285 -67750 -50718 -14361 60977 79577 74443 78213 42873 79843
15647 79843 59471 35698 -16411 -17256 -38858 -14128 22132 -23921 -21889 -35953 -37542 5606
15635 5606 92771 112596 47246 -8168 -31409 -3459 3684 28536 13668 21735 -3838 -20105
15623 -20105 -1674 65153 125060 115351 145262 170734 123864 35320 -6029 -88610 -79471 -5817
15611 -5817 56078 103693 136405 106933 4288 -17077 27609 30432 24916 66496 34685 59322
15599 59322 57657 40298 4137 29538 54986 21853 -19845 -10151 -6909 16896 -14693 -3771
15587 -3771 -19998 -47378 8334 5395 16752 -23888 11436 41017 2074 5044 45287 32805
15575 32805 44688 40254 37902 -26013 -70234 -51736 -42522 -37648 39096 66153 56687 20852 -21091
15562 -21091 13550 11541 22651 75492 74389 24615 -10465 -6059 -54198 -18488 3368 -26188
15550 -26188 -47877 -35570 -37460 -42411 -18263 -43954 -11648 23529 -7012 -45384 -1462 8280
15538 8280 24395 13458 -55464 -23955 33341 24956 -22081 14326 25459 -68677 -42411 47517
15526 47517 9711 -1897 11978 57083 65285 63371 45146 48698 30952 6499 36461 43962
15514 43962 33730 9368 -1503 -55313 7805 34119 78943 104657 32786 -38713 -11781 -17784
15502 -17784 -52781 -55030 -73727 -75578 -132532 -84579 -34009 -21540 -18877 19134 18459 -62600 -58236
15489 -58236 -74539 -5059 -22218 -73528 -53546 -17533 -66604 -55960 -7888 50320 34517 76452
15477 76452 48141 42362 70009 91100 50385 -20742 -20211 -60675 -141733 -120003 -32134 19204
15465 19204 50550 67725 33052 23788 40435 82858 113201 115111 52314 36654 30075 -49780
15453 -49780 -91345 -8911 27344 -2586 -7082 -3804 9602 27374 47794 11800 45975 74366
15441 74366 90982 126913 148995 113391 51941 -184 -1647 22359 -9544 -46851 -39502 50921
15429 50921 49542 -1680 8769 6876 -31438 -42176 -16845 17434 36765 -42637 -5462 52572
15417 52572 83647 68072 1818 7146 83641 87066 36229 39032 49815 25293 1567 -7288
15405 -7288 -9268 -23423 -2674 -32681 -60744 18460 63797 46791 85539 75356 30534 14406
15393 14406 -20064 -50582 -38996 -14626 -6717 -19373 -22797 26119 18267 42793 10669 -37750
15381 -37750 -78529 -69146 -69871 -54849 43577 151898 180595 162503 92209 88042 93167 67089
15369 67089 48892 62348 61275 57711 -4992 -61395 -21535 -12816 -44955 -64509 -41851 -45346
15357 -45346 -37160 -24014 -22604 -97160 -53817 -9368 14732 23757 39473 25297 19369 -32312
15345 -32312 -87107 -91566 -78232 -17887 30361 16292 8076 -52194 -73413 -61118 -79501 -29028
15333 -29028 22687 7051 -50030 -75874 -58716 8897 2751 -10375 -25755 20999 113772 122131
15321 122131 72195 29461 975 -36325 13170 25677 57544 97805 52996 27819 -15004
15310 -15004 -64913 -100982 -84898 -47922 -64658 -74455 -55620 1807 13893 -52684 -62986 71231
15298 71231 54253 33052 45904 61583 60432 -7915 -2899 11299 -7212 -9431 -5065 21262
15286 21262 93449 66960 46036 65892 78073 91141 107464 75848 64473 87443 57563 -11365
15274 -11365 -7228 57722 80822 21861 446 19603 -41300 -112348 -129368 -139705 -42622 38987
15262 38987 5532 -17609 -25365 -20838 47320 41771 81478 66780 82039 100432 86460 50142
15250 50142 63260 77959 62663 12744 22373 82679 74121 13345 4094 3126 4310 27010 13091
15237 13091 7166 29321 58259 111754 128559 129446 60646 36188 3139 47283 -11597 -55858
15225 -55858 -61576 -75274 -41014 -38502 -58056 -72244 14309 56757 92746 119480 98529 58996
15213 58996 49232 37827 80045 67932 -14358 -43283 -13518 -6407 -2235 3333 -42245 33035
15201 33035 71503 8786 -50289 -60204 -34594 -37811 -68264 -68657 -53322 -2770 -37934 -103872
15189 -103872 -111680 -99266 -107872 -29732 -22622 -79472 -79876 -44038 -42525 -56966 -51758 -36890 -34683
15176 -34683 -29256 13454 -21597 -19691 -32249 -30944 15092 109085 129601 144365 155396 114833
15164 114833 82777 16963 60843 98714 135136 104870 78308 44197 40630 42617 -35849 5061
15152 5061 27860 81557 73502 11187 8023 53867 42258 42716 65953 120441 138803 133185 135904
15139 135904 113086 84070 69888 85478 82151 64973 78299 71495 38598 12746 -6938 18950
15127 18950 42160 120398 109187 73577 69793 66471 25782 4721 44046 33345 12038 40986
15115 40986 90406 50797 -15045 -48139 -12553 52074 93257 37612 15842 22901 29663 68591
15103 68591 90121 75606 60296 29349 11625 42624 43051 74509 63006 85369 33063 -22886
15091 -22886 -36817 -15394 46519 85863 79739 10375 40086 120053 178382 226674 168094 103246
15079 103246 91926 79468 60753 73668 68452 78355 122482 167087 205887 225567 189384 149535
15067 149535 106770 137644 258003 409480 538587 669275 792049 1000261 1279612 1489166
15057 1489166 1645480 1785431 1893678 1982812 2055970 2046150 1917160 1782623 1577713 1375160
15047 1375160 1197867 1085060 863961 719402 593269 545088 454902 402742 362995 316306
15037 316306 262785 180122 163579 218671 279715 235132 244713 269217 201611 183691 156584 154733
15025 154733 170162 130351 128942 147041 87326 93150 111270 70998 25584 8575 -42961 -50960
15013 -50960 -2421 23998 15312 24721 4258 -30971 -33787 2310 -4031 -8303 11475 41265 70906
15000 70906 92873 58310 20760 37051 72438 56004 19469 -2509 22814 35900 43599 58408
14988 58408 82993 53660 46219 69501 79488 30330 26902 6715 66274 33543 -25284 -61548
14976 -61548 -45549 -39919 -51415 -45620 -50722 -69607 -89774 -98006 -43258 22952 42438 75207
14964 75207 78609 37308 31788 22972 21068 49571 65488 4699 -21115 4683 53528 74161
14952 74161 89056 85222 118648 114015 122685 151817 170556 44002 -55622 -78197 -76405 -69979
14940 -69979 -77500 -38375 -37631 -79818 -80541 -113547 -56009 29122 6847 -16059 -1050 13360 51534
14927 51534 57446 31138 68421 92033 117248 90789 42884 2163 33553 35627 40394 52690
14915 52690 73291 21849 -46413 -64893 -3789 67167 47528 13184 49559 94701 60325 83814
14903 83814 122128 141444 138353 98188 128976 95205 72447 136428 159146 179175 145952 151770
14891 151770 185913 238825 200648 112668 180918 199819 220346 179943 152556 135340 170559
14880 170559 127499 89468 120133 112290 88817 90786 102200 93748 74037 79224 60541 89376
14868 89376 176110 274113 225545 212344 225222 250364 313629 341842 323771 362593 436408 458380
14856 458380 456296 485195 546889 536825 530898 501372 410483 432374 373400 359400 357448 297732
14844 297732 218663 168027 119473 141970 209155 249047 274477 250283 191166 169482 146436
14833 146436 145129 166585 215313 193053 189781 212043 215787 178728 150047 122227 88612 66130
14821 66130 28318 71430 95673 112903 125055 166260 141078 110395 129697 108159 148363 177815
14809 177815 159014 120994 97027 119073 139626 138785 185028 182044 185869 189064 160682 138271
14797 138271 122933 200488 229894 266388 278858 346837 362421 361311 346240 324912 349880 407705
14785 407705 357126 314667 268422 232508 224922 262107 278987 295819 317999 300059 266840 276884
14773 276884 273113 271540 304835 281312 285579 237369 166567 123352 133799 172576 162695 157468
14761 157468 233830 261071 278182 307084 293798 288356 310502 347457 340544 335338 350014 363884
14749 363884 377689 337397 311312 331249 320559 317614 313579 347612 326449 302743 268704 302890
14737 302890 347317 391165 400291 476696 514855 556171 602461 610096 609995 654469 719428 734484
14725 734484 769249 865739 951040 1047675 1165473 1292441 1460868 1575873 1679396 1808716
14715 1808716 1928354 2013689 2023176 1936395 1836194 1766029 1591088 1410860 1280120 1136550
14705 1136550 1040763 1020441 952978 901902 857811 829740 839616 850464 845289 799023 712562 640329
14693 640329 576237 602864 585772 537980 520210 521719 492734 503610 559728 653533 627797 578567
14681 578567 639709 677458 662651 666886 683407 747906 739204 643170 706630 749397 796792 813683
14669 813683 809453 904038 975614 1054546 1071453 1072081 1098354 1144038 1201749 1257836 1292729 1377841
14657 1377841 1501556 1566231 1625439 1655376 1675874 1768986 1803859 1805209 1843841 1983167 2076614
14646 2076614 2165139 2249315 2312770 2399426 2449848 2544411 2688649 2802895 2943785 3074008
14636 3074008 3182895 3256829 3429943 3637523 3921025 4238595 4571349 4946249 5379235 5929180
14626 5929180 6509029 7208797 8131023 9198494 10502898 12079841 13999161 16226990 18912157
14617 18912157 22188656 26169649 31091830 37400811 45877643 57601894 73644718 94862957
14609 94862957 121527244 153394129 190021847 230400106 272046750 310993542 343786837
14602 343786837 368839159 384859936 389224710 380211186 359643228 331491777 298315029
14595 298315029 261045375 222188362 185721807 154301538 127908364 105961079 88491624
14588 88491624 75242613 65335520 57686830 51538616 46481435 42091905 38119759 34527442
14580 34527442 31348459 28465040 25903151 23642722 21617143 19774118 18126269 16717270
14572 16717270 15366696 14168793 13101069 12186802 11315187 10536928 9854738 9160657 8553892
14563 8553892 8011680 7557474 7119885 6680999 6259420 5848645 5484856 5239227 5027574
14554 5027574 4768106 4580603 4412459 4204742 4026111 3866775 3776814 3613796 3481377 3327284
14544 3327284 3169212 3064083 2944363 2859478 2714728 2556546 2392674 2302644 2246348 2256557
14534 2256557 2230868 2147009 2076732 1997630 1984039 1988785 1967892 1876916 1761703 1720873 1672627
14523 1672627 1632344 1618680 1545422 1519742 1462255 1390240 1407076 1391502 1313091 1251463 1267787
14512 1267787 1295729 1305036 1287434 1260300 1180056 1111056 1091056 1042568 988521 951837 924507
14501 924507 908379 860892 813150 792643 866917 847559 794349 693203 682390 715228 725015
14490 725015 695900 719872 696466 655663 628124 632038 632098 612877 557333 542540 513466 516981
14478 516981 555729 549372 553265 562038 545328 515857 520434 560928 561161 530679 467788 451391 446197
14465 446197 392677 445435 457587 427076 404021 410119 418526 451669 426739 408512 387925 372045
14453 372045 336291 326538 297741 251191 273556 314044 277471 251674 267847 274904 295802 345202
14441 345202 316845 315943 350081 320451 283746 293816 279879 246088 218936 231712 209604 132526
14429 132526 129874 144048 118524 116017 127298 175527 196190 174164 159966 150956 49033 -27724
14417 -27724 16971 15274 -3295 44654 60128 8248 21242 83368 101634 96861 48379 9888
14405 9888 39783 87855 137452 92062 93338 84222 78400 126143 151692 106512 128887 104710
14393 104710 66353 74582 37977 52621 35661 -15506 -21535 63411 76922 117691 80710 66751
14381 66751 74552 20126 5633 20085 35712 12534 20347 44858 78906 107742 84507 35546
14369 35546 55407 49202 27699 -4982 -43256 -56446 9040 42727 11757 43546 87738 98736
14357 98736 87226 62489 16646 18476 49499 56329 141698 166856 156241 155355 108262 117425 35681
14344 35681 24439 91407 103841 103400 129625 142206 148428 113263 97086 101155 129751 199910
14332 199910 154966 152049 111903 73304 55545 30121 -32736 -43620 -39108 -64641 -99771 -44933
14320 -44933 -21330 -11765 -42478 -112861 -153328 -57600 -38750 -50416 6108 1993 -22838 -12357
14308 -12357 -25674 -28819 -18430 -84501 -102808 -104493 -54719 -55164 9923 13193 -40609 -60315 -26782
14295 -26782 -8921 -43557 -766 1489 69838 83710 96409 139168 172910 128586 107036 129389
14283 129389 107139 137021 134518 149186 127091 96318 103660 82199 44514 1524 16248 13513
14271 13513 48777 68771 56811 41131 40495 9464 -9190 -15911 -56016 -129219 -173454 -149062
14259 -149062 -55545 36351 95216 40922 -17582 -25485 10160 -7001 -6153 -6390 -60691 -35088
14247 -35088 35422 61914 17391 -19198 1955 41425 39365 -21198 -2729 -15263 -55070 -46873
14235 -46873 -60373 -146410 -158250 -69406 55283 112284 82066 72913 46083 33286 59122 37772
14223 37772 -7121 -56680 5784 59686 72443 40689 50577 17643 8180 -10348 -76708 -104558
14211 -104558 -125077 -100080 -77395 -37795 -20615 -22892 -38973 -57055 992 23627 -21702 -83945
14199 -83945 -87742 -63645 -26811 1576 13188 27203 21114 -99653 -120971 -79083 -23317 57064
14187 57064 42497 -28850 -20307 -43406 -23157 -55857 -33087 -23016 -98558 -105380 -122381 -59415
14175 -59415 -36649 -40773 -19399 -59327 -63537 8382 16488 -11709 -8849 5456 -24233 -113
14163 -113 32293 36630 41135 53093 89465 123544 130580 205227 195319 239615 290642 343556 374609
14150 374609 458301 604247 741467 857424 1077900 1376929 1606329 1791165 1920049 2032123
14140 2032123 2148969 2107098 1943164 1800207 1569218 1390085 1257141 1066631 876750 669016
14130 669016 515146 456097 451853 417885 345411 263926 214475 177400 201064 172189 216865
14119 216865 207145 183426 156514 121543 134968 115296 100112 82654 121290 88342 104306 100760
14107 100760 105161 142761 120120 64038 86124 78672 92220 95056 74965 69604 55557 66343
14095 66343 58523 75174 41583 6145 24748 29857 21950 22004 53768 101991 108181 37715 -23632
14082 -23632 -38105 -14689 -24352 -104921 -168863 -131682 -125498 -120921 -97830 -62440 -26007 14560
14070 14560 42841 -19058 -79497 -95711 -71422 -39570 -47275 -90816 -109601 -59326 -48214 -76594
14058 -76594 -69860 -54671 -27933 -21111 -41560 -74842 -17720 25355 57451 75069 52946 41206
14046 41206 16244 -41223 -63379 -4146 22245 -7306 11358 46347 34463 13212 -13355 -32122
14034 -32122 -24071 57360 94294 83345 20073 -8353 5613 19369 -17118 -15162 -21786 -15342
14022 -15342 46150 54819 60917 37145 46152 89262 90641 75718 68465 97492 101721 50324 27563
14009 27563 26435 50193 49473 54945 139980 122842 115783 144524 103356 33151 -30036 -67394 -27360
13996 -27360 24551 96989 84525 63292 70900 15455 -9694 15836 12055 55785 23549 -7825
13984 -7825 -36634 -2907 30566 16983 9700 20005 -8636 -43684 -36051 -46854 15371 -1046
13972 -1046 -120029 -169249 -140703 -79453 -53757 9373 67823 30011 -33304 -13258 16177 -3146
13960 -3146 -46210 -63925 -20516 -52644 -22020 53115 95989 174086 196198 152452 132671 192333
13948 192333 242849 183292 104018 52840 25176 -7055 -18655 -61847 -59563 -25937 8710 -4063
13936 -4063 -21870 -44920 -45706 4188 -9480 -28233 17979 14879 -41911 -15994 -56786 -32236
13924 -32236 17714 33825 9078 -57594 -70388 -75051 -85588 -79726 -106251 -54630 5872 18879
13912 18879 2252 -30755 26346 91457 63498 99629 73925 48767 8542 15190 38579 6253
13900 6253 -4725 36164 51769 72098 77323 62887 16854 -13690 -9553 -16266 -17954 -13 34970
13887 34970 53323 77775 72025 9920 -19767 -8253 -11312 1479 70641 106195 81622 71260
13875 71260 125345 99595 80149 96292 75044 116372 168177 148265 86227 29922 -18815 -70999
13863 -70999 -44919 26647 86723 134159 122945 49063 37005 37678 59285 -36581 -73675 -55237
13851 -55237 -17242 56771 19421 -16713 -30835 -56719 -72262 -24555 34728 75819 73560 38821
13839 38821 10569 24346 9095 25725 70077 85556 74005 9997 -12248 33703 110181 111633
13827 111633 131716 157642 199562 240392 264782 312741 482958 629160 807757 1110461 1376782
13816 1376782 1550617 1745979 1895457 1928566 1900743 1747286 1566964 1371455 1130495 904412
13806 904412 739285 546060 401903 315524 262016 190488 185218 211641 190226 149099 118951
13795 118951 54571 14933 71800 39331 68871 108259 57653 -8030 -21831 -64060 -79433
13784 -79433 -38507 -6178 7080 -64426 -111669 -117336 -83251 8303 35672 -3600 -63531 -22701
13772 -22701 858 -57339 -71439 -29769 -30180 -21309 -10064 -9673 -83980 -84065 -62504 -56543 -37080
13759 -37080 49212 71648 12586 25216 14041 -44965 -51023 26964 -9843 -25544 13407 11953
13747 11953 -14191 12595 65967 59875 63889 6972 -28908 -84144 -42087 -44040 -65528 -126926
13735 -126926 -121649 -52310 14455 35190 -22989 -35037 -38432 -94084 35266 75816 65973 6150
13723 6150 -31738 -24917 6756 13831 32767 38556 8490 -24862 -69236 -49046 -43868 -68369 -95471
13710 -95471 -29211 17869 40421 40495 55431 74487 2047 -25766 -56887 -79825 -88956 -68451
13698 -68451 -72248 -39510 -58946 -97264 -105135 -107828 -94758 -876 82152 62012 7592 14748
13686 14748 12071 2202 29837 30739 -9268 -57241 -33920 -22862 18704 77889 47012 -25612
13674 -25612 -45288 -21535 41488 92762 40323 20522 997 -29007 -53284 -15772 -43209 -12783
13662 -12783 16089 30411 34578 33054 -44316 -88535 -85856 904 48646 81170 110509 119056
13650 119056 151111 132368 72399 50693 110943 126767 147837 147578 93377 21479 28963 84403
13638 84403 69215 56403 -5849 -66712 -92332 -85115 -46849 -35590 20293 -572 -13197 4644
13626 4644 60824 53576 43922 26890 20593 21301 53012 59074 51582 59635 44778 59267 46650
13613 46650 59407 124654 151762 212232 310139 369807 460734 646166 746981 717999 677078
13602 677078 638009 544671 407020 331418 306577 281558 242087 235611 199281 129139 55322
13591 55322 26431 20868 42849 38785 -4067 -94727 -119831 -92542 -63710 -63684 -43292 -17662 -50904
13578 -50904 -15050 -14158 -17691 -22436 -4204 83569 86399 27224 30394 68940 128976 183324 200743
13565 200743 284571 348312 429901 585663 706522 755739 761395 794916 778952 644377 499668
13554 499668 384885 268853 181749 129685 106580 118624 57813 4868 26052 45385 81345
13543 81345 76645 112303 118017 44937 11518 29175 -2266 37013 72827 144575 97512 51649
13531 51649 25170 5135 -18774 -7796 -8267 -6884 25112 28818 66881 73279 -9442 -4824 8818
13518 8818 27225 166274 248199 231562 265083 269020 220614 206422 139531 87302 112541 114876
13506 114876 54902 27131 13930 -61360 -111608 -82031 -12301 61852 30474 64071 38160
13495 38160 24710 16261 39246 14037 1869 -15714 -35148 -30249 -19331 -10635 -5568 -22383
13483 -22383 -40692 -9798 21604 46206 84422 102345 36176 56998 -7153 -33685 -26286 18799
13471 18799 49638 48435 -1322 -18920 -37115 -81597 -29736 -24092 -67836 -30099 -39522 -74340
13459 -74340 -45458 -3119 -23007 -4331 34206 -13710 -8910 37925 15140 17083 20533 -40826
13447 -40826 -20367 13676 18343 -36926 -29415 -20998 -29575 -48287 -37386 -32756 14207 6741 -41461
13434 -41461 -77637 -158973 -120387 -64770 -61313 -82560 -92701 -78475 -99231 -78802 -45145 -11574
13422 -11574 -822 18329 -2725 -57598 -27190 1973 31838 84350 43517 66423 115773 108247
13410 108247 57924 -6095 -724 22189 42251 42007 3312 36489 71153 104818 82451 59639
13398 59639 37552 32238 16724 10873 7377 35051 60627 49708 87337 92265 57574 139940
13386 139940 149258 47141 12975 24209 -37573 -101167 -76934 676 10947 28173 -13322
13375 -13322 -38416 -7147 70112 32601 -41166 -7092 25521 13099 -24997 -48825 -20730 8872
13363 8872 43276 49623 29555 9373 -23551 8914 19992 50951 11240 -45005 -78937 -106607
13351 -106607 -79016 -74117 -9857 -28739 -101730 -95125 -64750 -90242 -132294 -96508 -31047 15514
13339 15514 -44894 -72391 -28985 8933 9910 12619 -20500 -35994 -48319 -44050 -21250 -10315
13327 -10315 8358 22714 46061 -2579 -32068 -5358 -24672 -68684 -112338 -79825 -47494 -60984
13315 -60984 -56054 -30765 19353 16275 5054 22287 67438 28523 -1835 -16049 34729 67378
13303 67378 -2678 13892 17386 -19263 -109715 -174430 -163340 -87190 -7686 3823 -2320 -15983
13291 -15983 -56246 -106902 -72115 -62481 -98409 -89333 -55257 -46746 -14653 30073 27155 43295
13279 43295 -6118 -65975 -68057 -66483 -91953 -60193 -29820 -41186 -21425 -3280 23053 29090
13267 29090 26668 2366 -11443 14260 22057 -29474 -48780 -45000 -8717 -2544 1335 -18874 -58901
13254 -58901 -42665 -79118 -19772 5446 2933 -28156 -57565 -34064 -93049 -154113 -91480 3606
13242 3606 75058 71603 45606 6275 -78424 -33563 -27581 -74094 -107569 -96107 -52045 9670
13230 9670 -54631 -113111 -45179 34552 58152 63012 64337 74512 67284 19156 -18874 28648
13218 28648 21475 -15743 -42335 -51290 -52519 -61177 -91551 -105796 -64265 -61124 -50192 -47193 -41984
13205 -41984 992 13329 61106 75211 94810 93362 81475 -15252 -60125 -54199 -4894 36153
13193 36153 15400 83111 110767 87452 17561 -47967 -41165 23394 90807 67331 11948 41602
13181 41602 47398 43911 16460 35476 7840 2448 31680 61025 -2137 -41191 -76676 -84853
13169 -84853 -91843 -72906 -4973 10347 -15697 -5019 8142 38786 65338 11118 -61330 -59345
13157 -59345 -61008 -6879 7168 -29145 -45113 -71490 -118592 -103047 -103137 -27303 15994 16542 27710
13144 27710 47660 50876 -11125 -15201 4721 17174 -42242 -52259 32546 119132 112722 116755
13132 116755 102936 76482 29442 74288 121882 120273 42232 3577 44146 81063 112684 85760
13120 85760 25367 17505 41486 95278 104216 78179 24309 -37144 -102110 -134955 -96989 -30661
13108 -30661 12224 -23188 -41820 -110690 -160651 -113645 -100747 -60278 49787 101504 114061
13097 114061 40771 -39094 28436 83259 41264 7566 28710 32411 34989 70964 42520 4526
13085 4526 -12263 15888 16792 -43402 -62421 -32884 21553 24729 -9598 -49009 -50618 -65686 45589
13072 45589 129819 114243 71548 38081 -9176 -31096 9318 17377 -15020 -40772 -82190 -82863
13060 -82863 -46626 22150 36355 11298 -9674 -69485 -108006 -100770 -60557 -38617 -33524 -33880
13048 -33880 7381 58719 33442 -59471 -56185 33435 48772 31561 -27167 -87877 -89780 -67764
13036 -67764 -74720 -139314 -114326 -114692 -100114 -115661 -122689 -96109 -24672 35970 15399 -33802
13024 -33802 -32257 -10427 -24669 -80059 -37423 -20990 19465 46614 34785 19659 12961 -3994
13012 -3994 -6324 -19655 -32208 14887 74859 93339 96644 71282 -16071 -55081 -28886 33707
13000 33707 26086 -16828 -11306 -15098 -20398 6719 -7766 14627 73686 93066 18211 10885 16574
12987 16574 -38439 -61123 -56644 -65187 -30726 -30252 -48167 -29320 25780 29680 -40123 -28831 20791
12974 20791 72968 99315 172582 142440 84234 -11672 -21064 -29535 -89100 -89530 -26802 -41893
12962 -41893 -57009 -45144 12282 21131 12752 -19024 33307 11219 4633 -4421 -50107 -53171 -58430
12949 -58430 -94199 -72091 -129693 -130769 -124223 -169550 -123588 -10296 18039 -2876 26028 82407
12937 82407 95886 101966 91879 983 -42139 -13529 11836 8670 8702 -34803 -88789 -167691 -208277
12924 -208277 -134689 -131674 -151646 -200536 -189080 -122823 -50323 -47188 -53972 -16626 12619 3986
12912 3986 850 24759 26329 49958 48755 -31179 -53947 -89096 -90319 -23643 19197 12643 -13913
12899 -13913 14379 -20167 -6660 24218 -14122 -13816 -53557 -52106 -2232 23006 14962 6323 23158
12886 23158 59676 36862 4971 -10824 -45054 -38931 -34423 -73565 -62767 -24991 25012 70061
12874 70061 34642 -27432 -15163 3510 -5134 -17940 -41335 -43023 -16714 -65048 -104326 -62005
12862 -62005 103 -7859 4584 -51012 -85113 38957 75438 34573 11662 53223 141952 191739
12850 191739 227084 228805 248002 238761 135776 71078 50335 38475 -41078 -78379 -76529 -65867
12838 -65867 9455 11190 7138 -32885 -43045 -76310 -35455 -28129 -47305 -63522 -75665 -77540
12826 -77540 -107781 -133329 -79650 -41477 -40053 -36019 5092 69631 39772 54858 22388 -42935
12814 -42935 -58541 -65684 -686 29517 32912 60991 64161 41604 19241 7148 -32669 -29239
12802 -29239 8526 15386 -5563 -32436 12543 20296 9701 31636 46055 45459 8882 -32096
12790 -32096 -27255 -82915 -94470 -98321 -99108 -106361 -64682 -16012 19420 55622 47318 110069 110031
12777 110031 26104 13739 -17629 -71011 -34318 -20533 -55073 -82640 -83087 -47564 39612 83715
12765 83715 50446 12789 -8691 -32738 -50629 -23899 -35007 20338 43184 127943 149786 102681
12753 102681 31216 -20109 -15918 -4894 -24816 -44485 -15158 -30638 -75507 -49989 -56243 -35667
12741 -35667 -42492 -61661 -15932 -24804 -26505 -7988 -20442 4070 11668 -20284 -52270 -45231 -859
12728 -859 -13038 13420 -6816 -16933 16538 67373 31940 -16324 -16048 34422 30695 13802 -25330
12715 -25330 -35623 23105 78509 67571 67229 65810 85023 121406 92653 75014 61645 29910
12703 29910 -2150 15434 47993 23374 12160 -21343 -48397 -38978 15684 -18704 -3935 59179
12691 59179 117535 116526 37218 22545 31579 8265 6526 -2553 -37515 -58919 -103658 -118367
12679 -118367 -127921 -112123 -82487 -46428 -102598 -97999 -45121 -5505 -24143 5768 -23099 -54596
12667 -54596 -104959 -78857 -37019 -64015 -79814 -29350 -14314 30470 38378 10708 -24302 -14814
12655 -14814 13088 20583 -2545 -42338 -105089 -118780 -58790 -40872 -9703 15565 -38185 -53132
12643 -53132 -243 90 -22392 -46678 -115491 -84626 -48916 -41674 -52729 -44892 10482 40958
12631 40958 -44918 -91036 -65727 -35592 -22703 -20205 -12909 -64871 -66280 -36579 -19728 -11846
12619 -11846 12548 -5620 -21197 -39679 -106004 -110440 -96935 -76289 -16032 50214 85945 102509
12607 102509 74324 -36508 -42677 -12930 962 7686 53721 74114 48566 172 8702 -5182
12595 -5182 -676 -47244 -39827 -53909 -14040 24336 26764 26541 33293 -9647 -38498 -64942 -61636
12582 -61636 -36201 -89626 -156275 -142002 -66350 -2102 5282 -12544 -35387 -53876 -129238 -117533
12570 -117533 -116647 -156972 -162795 -180439 -103760 2714 9944 -21275 -3317 57286 47827 51805
12558 51805 21467 -10490 -45163 17921 96663 94408 65330 35795 34310 -1547 -40417 -45624
12546 -45624 -7083 40703 14164 -14607 -42705 -10558 -37526 -51335 -12558 23095 24433 -36247
12534 -36247 -8272 10522 -22282 -3116 -72 20451 77349 90668 80909 31103 -47728 -66614
12522 -66614 -44280 -70554 -52144 -23575 33756 -21950 28829 119166 96213 45752 26699 -9952
12510 -9952 -34285 29650 38766 10979 -44104 -107150 -106453 -52244 -49810 -59944 -21838 -9809 -7885
12497 -7885 18285 -8650 -31943 -52340 17157 39339 -20990 -86565 -105113 -67199 -45208 -37457
12485 -37457 -23694 4006 -31112 -50589 -92477 -25019 37908 -24717 22057 15984 31739 84405
12473 84405 59039 96835 140575 152045 94168 88211 44081 29162 40888 -25141 -30067 -89763
12461 -89763 -127457 -93792 -102381 -153800 -94467 -42181 -23748 -27138 -36980 -31761 -20289 -36204
12449 -36204 -21331 -33192 -104121 -72825 -46442 -51990 -69172 -766 13715 -3895 2675 -20245
12437 -20245 -31199 -36976 -94051 -97901 -509 97742 112074 124169 152601 134285 60151 58981
12425 58981 105837 67497 64236 126264 99312 70126 4319 -73475 -45748 5919 -33297 -29335
12413 -29335 -59535 -102077 -118160 -30845 -18779 -123596 -131989 -80371 -37272 -30646 -21044 26238
12401 26238 28933 5103 13191 5936 -43765 -25585 40203 35066 -23068 -2788 12160 -38094
12389 -38094 -14261 21631 42068 14722 11191 13429 18315 20264 78208 86362 52592 45147 3169
12376 3169 24437 29430 31540 3339 -17444 -44289 -41130 -81371 -64985 -35115 -45040 -90509 -44931
12363 -44931 44278 42234 65607 3092 -25616 4452 34468 -14025 -33837 -88931 -136370 -116382
12351 -116382 -131400 -92718 -32335 -25498 -71066 -23521 -51693 -54042 -14968 -47190 -57733 -30307
12339 -30307 -49014 -84997 -109607 -24185 55134 81474 33335 -26702 -19439 -22558 -16225 -17719
12327 -17719 -44161 -52146 -25008 -35399 2893 41537 26337 35325 32532 38562 12813 -23210
12315 -23210 -2157 4472 33886 -5915 -19893 -8873 62147 72855 -5151 -89035 -57404 32747
12303 32747 62453 101217 118193 140416 115697 46445 -17081 -47991 -18266 38345 36590 45570
12291 45570 48725 63815 105219 69089 -12797 14729 -322 -66815 -74996 -47128 -37232 -17438
12279 -17438 21749 -3962 -14063 23840 31209 33118 1280 -12915 2570 45812 73779 76285
12267 76285 55353 84622 178306 176094 112348 91468 86062 79498 54970 64199 115348 94303
12255 94303 31189 -42617 -19606 -1475 16287 12682 -32831 -31037 -20328 -33364 -29706 -9886
12243 -9886 12736 43513 68397 105360 123501 142995 145558 157636 143860 119082 104593 101570
12231 101570 39873 62104 67725 45832 27803 28808 29224 18157 -21865 -15136 -40268 7404
12219 7404 31554 24152 34782 59312 32998 -34185 -30466 -48304 -35336 13278 38152 16160
12207 16160 17672 12871 -19480 -40863 -27736 -30535 -10842 -58681 -47882 -40379 -65427 -35020
12195 -35020 -925 -39788 -23876 -54396 -28747 23271 21727 13427 42694 78642 135345 137183
12183 137183 110829 -30935 -71416 -30785 -29147 -26164 -34748 -48497 -78225 -106944 -95226 -97729
12171 -97729 -135340 -87171 -71489 -60347 -78607 -75063 -27892 -27804 -41715 -21999 -32151 -81379
12159 -81379 -87410 -62399 -87700 -93837 -102243 -166380 -187873 -114107 -89352 -77011 -49553 -11213
12147 -11213 12325 -19064 -12591 -13083 -1896 14787 -6343 -4907 -51602 -16498 7150 -1551 -9697
12134 -9697 -55489 15086 4136 -28399 -16470 -2352 38994 68795 67477 40176 36300 -47270
12122 -47270 -83951 -99903 -77835 -25827 15604 31643 12703 -48011 -115094 -108531 -95626 -90814
12110 -90814 -16931 17060 42863 11191 4505 45431 80351 105030 84245 40722 12148 49970
12098 49970 105761 163823 122218 32343 2381 33652 -645 43603 42152 -19481 -77902 -56321
12086 -56321 -15492 11136 24515 6975 6023 48745 8307 -52158 -52613 -49538 -56682 -95705 -111549
12073 -111549 -55651 -61054 -82597 -56769 -68510 -73263 -73597 -18904 -13572 -20053 -16179 5666 33883
12060 33883 -7804 -64705 -104412 -116628 -107031 -98016 -93780 -119368 -82495 25078 8269 -16602
12048 -16602 -17376 -28486 -28549 -91523 -117566 -87192 -82110 -38124 -13133 -19705 -28321 -97648 -153424
12035 -153424 -135349 -145165 -71374 21780 730 -6772 -34687 -75589 -10312 -20104 -4179 47100
12023 47100 32039 -23851 -20660 -40288 -43407 -9850 -15201 -9888 -16046 -22808 -32079 -53598 -44415
12010 -44415 16448 49951 -907 -47541 -47885 -57148 -34403 -10976 -20254 -60558 -91117 -133831
11998 -133831 -108261 -95443 -104553 -102373 -98391 -34038 37127 81520 13633 -77301 -92203 -93471
11986 -93471 -84079 -67574 -4001 25605 -54606 -105994 -107355 -54648 -34128 35115 1454 -17860
11974 -17860 -39501 -45222 -13920 37250 15064 34622 47090 59121 80408 51456 9398 -12118
11962 -12118 -30471 -75547 -95056 -77367 -48145 -65453 -78363 -77999 -43105 -69904 -7089 49735
11950 49735 -28399 -93480 -95469 -61342 -42788 25609 71600 80065 29787 -9362 -33175 -129537
11938 -129537 -129550 -45514 -75573 -111376 -110771 -81182 -36206 21564 84850 71640 13728 2295
11926 2295 35668 22646 -65896 -95640 -88155 -133892 -94885 -65270 -26162 176 10030 5729
11914 5729 45014 3175 -65434 -33377 45278 13775 22537 10284 -14574 -46150 -61934 -69548
11902 -69548 -33549 34017 122205 23856 -6900 -3676 1651 -21508 -14681 26902 20650 21464 22539
11889 22539 5897 -18607 7983 -2566 37597 69896 56888 4117 49840 41956 40096 33670
11877 33670 27491 31168 22170 -6469 -36191 -51064 17071 21773 32046 36583 -12003 -38561 -26896
11864 -26896 -55305 -90418 -62559 -24892 -84834 -83659 -17791 71831 76339 33312 -5973 9974
11852 9974 -12400 -85355 -57908 46202 59087 -32180 -40748 -43290 -49136 -76810 -91836 -44576
11840 -44576 -35876 1445 -49421 -71193 -25981 -14367 -30763 -41608 -70087 -106727 -72274 -81108
11828 -81108 -33928 -12370 1677 2897 -10625 33428 23392 39291 41161 -39998 -58581 -101360
11816 -101360 -99758 -117070 -131410 -56318 -198 -3052 -49870 -69021 -69750 -76028 -124209 -137513
11804 -137513 -84622 -31906 8726 8486 33061 18465 21707 24107 -9082 -481 -11997 -36968
11792 -36968 -90826 -117738 -119447 -106220 -151504 -156174 -109235 -114923 -147742 -140359 -132816 -122438 -85842
11779 -85842 -71938 -29331 56273 57556 14162 -48687 -71638 -63640 -8109 36872 -12132 7917
11767 7917 22330 -31112 -82381 -108823 -94089 -9462 13959 -2049 -7952 47358 98133 65566
11755 65566 38056 63511 101929 127024 169950 134104 58822 -17266 -51961 -107685 -87196 -68888
11743 -68888 -83620 -103874 -61889 -10847 21237 -2149 -32636 24932 33453 51749 102213 97647
11731 97647 33574 -44133 -19777 17807 3199 -466 5040 15286 -11658 -1502 -11845 -13631
11719 -13631 -67095 -83507 -75822 -67087 -75396 -21346 -4338 -33837 -67790 -110783 -135186 -124893
11707 -124893 -102284 -76412 18096 99467 39343 -14194 -57994 -119299 -121352 -123056 -95347 -106340
11695 -106340 -108054 -124212 -119094 -43770 66595 80815 56615 34852 24796 -14516 -39777 19707
11683 19707 9958 -47416 -11904 -26494 -52768 -29383 -9421 -37052 -73843 -46326 -30468 -75855
11671 -75855 -91661 -5290 -13916 -40572 -4841 -6456 -816 -38294 -69387 -64352 -10398 21884
11659 21884 75829 100505 71767 46691 53383 9807 -34048 16658 2515 -36716 1320 4992
11647 4992 -27007 -85869 -82537 -80780 -55893 -35034 24738 81676 138628 97884 40713 52792
11635 52792 42542 -22197 -36422 65204 90226 34364 34985 -36845 -44103 -3470 14951 44292
11623 44292 41010 -23376 -78206 -96089 -18661 27072 -11988 31779 30218 1762 -44365 1801
11611 1801 81671 20433 -3168 39772 34235 80961 37479 30704 50988 -29014 -42325 23749
11599 23749 31395 28964 34129 43907 9872 7108 61239 34147 29713 25037 -38578 -71328 -54525
11586 -54525 -23456 -60727 -84857 -46894 -42409 -43519 -69658 -44675 -9758 -6689 -65753 -72544
11574 -72544 -31825 -8932 -70616 -72439 -24554 -9510 -13003 -4277 1035 28398 -5837 -19805
11562 -19805 -30022 -44755 2888 -16032 -48036 59835 61013 -13573 -75052 -94982 -91530 -65612
11550 -65612 -33965 -14478 15535 -15464 -38645 15064 11100 -26566 -8631 10811 22506 53022
11538 53022 13727 3750 -52100 -53314 -44099 -67236 -105011 -82606 -55437 -63036 8270 48936
11526 48936 14419 24964 57080 43913 -46658 -63220 -56209 -94763 -102881 -84089 -24788 10476
11514 10476 74036 41283 17036 -32139 -28325 -51256 -112991 -103413 -97923 -98390 -89728 -122418 -97139
11501 -97139 -80535 -23436 20478 7019 -19944 -58244 -33827 -20986 -63853 -85298 -56143 -48227
11489 -48227 -36385 16623 20933 -13548 -5476 -32980 -67647 -93915 -110778 -41206 15629 11759
11477 11759 -23720 -105525 -139299 -125991 -140448 -153483 -131175 -118083 -108464 -93044 -85415 -21904
11465 -21904 22214 53566 10836 -40951 -29597 8210 -14353 -5975 -11862 -22108 45546 63889
11453 63889 17940 -3694 -43345 -72087 -70409 -47068 -53156 -41684 -32436 19537 3300 -30266
11441 -30266 -71633 -20232 3167 -25664 -33896 30570 860 2572 23932 6082 18567 79751
11429 79751 38932 5772 25722 44276 42857 68166 34351 44862 51547 48745 38882 52292
11417 52292 57852 4323 33442 47656 24655 -6731 -40290 -75383 -62668 -60330 -42142 -64304
11405 -64304 -3903 34206 14239 -43310 -37406 -85833 -129464 -118083 -83245 -106765 -99105 -98933
11393 -98933 -123675 -122642 -142918 -90560 -27255 40800 57358 64059 3812 -53324 -71223 -84239
11381 -84239 -32141 -7453 -17787 -47796 -95225 -69156 -29600 -42124 -28326 -7030 64438 74887
11369 74887 14028 -42896 -42067 -3442 3923 -40097 -80515 -74695 -112317 -187642 -212639 -159786
11357 -159786 -63379 -17250 -40773 -18133 -21964 -24206 -37658 -52374 -23089 -25701 -42174 -24945
11345 -24945 18992 31191 41325 16984 21414 16728 5141 60124 55549 1942 -27043 -8565
11333 -8565 -60884 -49402 14465 14952 27600 40241 58956 86768 127421 79865 35167 48860
11321 48860 55348 27830 33344 66605 66927 63307 50592 5148 5490 -8491 31807 38201 -16451
11308 -16451 -77742 -62927 -52818 31182 110835 88216 74715 37533 -26603 -55269 -39706 -26079
11296 -26079 -17061 -32585 -42487 7113 62233 68979 53045 7174 37215 59407 69625 28181
11284 28181 1213 -7291 -647 33337 96649 36955 -11636 48960 50445 25340 -10839 -6438
11272 -6438 13280 -52177 -32514 2580 -28048 -27810 -47695 -51862 -51618 -73307 -62540 -61028 -27970
11259 -27970 -22696 -7948 3234 20665 73352 11533 -23943 -46891 -58886 -75326 -93541 -66615
11247 -66615 -37073 -66306 -91726 -49497 -26561 -71162 -94572 -80499 -26540 -53549 -102030 -62119
11235 -62119 -18863 23893 5851 1568 -39298 -66581 -78011 -83082 -77371 -49977 -81532 -121969
11223 -121969 -95169 -37242 -19764 6984 -19761 -12814 3495 29410 2827 -5958 -15508 -27609
11211 -27609 -29684 -49305 -47948 -46135 -40031 -27639 1658 -51050 -92498 -2420 -38958 -55211
11199 -55211 -20618 -11386 2508 38376 -22623 28592 80624 52590 52845 23947 32447 25874 30118
11186 30118 35148 35018 45054 44230 48769 76774 77005 55643 60100 91912 93176 139992 116935 20898
11172 20898 -34506 -79383 -62747 -40578 -15447 45300 -33847 -41929 -78322 -57268 -48598 -61828
11160 -61828 -54011 -80569 -34516 1490 -47328 -30566 52824 66892 10435 -66883 -70334 -49409
11148 -49409 -108752 -101776 -153728 -139046 -100954 -93265 -61869 -44439 -30822 -60025 -58558 -97024
11136 -97024 -87683 -41795 -65943 -27680 -13596 47921 90011 -23025 -104016 -108477 -140126 -118743
11124 -118743 -82609 -31399 4807 10905 -7745 -29136 -17123 18489 77960 38721 45753 -13837
11112 -13837 -51676 -68668 -39383 -35638 -27250 -31495 43085 54308 23730 -38462 -59351 -31791
11100 -31791 -6923 45094 74161 68964 20924 46914 78256 72406 60070 19628 24053 -43647
11088 -43647 -32603 -10244 16556 35854 -7116 -15469 10784 -5623 5612 95651 58217 3616
11076 3616 28780 35378 22465 25803 35641 13818 10339 80939 82359 3963 -57097 -63927 8188
11063 8188 17197 -16033 -14068 33546 13675 -61683 -80146 -49096 -71302 -99128 -118302 -144064
11051 -144064 -106778 -40026 -47839 -58046 -18566 -40363 -50627 -59227 -46974 -58310 -10620 -718
11039 -718 -29388 -6499 17998 -41878 -121159 -131537 -82654 -51593 -43662 -41843 -45768 -66354 -43490
11026 -43490 -30377 -106523 -87779 -15485 -30087 -66491 -110131 -126013 -148142 -194421 -161404 -161391
11014 -161391 -168071 -117864 -54704 -66501 -60622 540 36204 133463 154865 57551 25064 47816
11002 47816 16770 -17295 -72296 -111677 -88829 -78086 -3994 86403 50947 12159 64020 105073
10990 105073 119200 14993 9490 55727 107822 81110 -1689 -49227 -4287 20404 -55117
10979 -55117 -21411 36266 50888 -13943 -63432 -40499 -34565 346 58409 22635 -1229 -11609
10967 -11609 -2529 5383 -49065 -95236 -44604 -15793 -11019 -25815 -2123 27738 17986 41438
10955 41438 76526 119248 83934 99941 69776 84082 107768 116286 131251 67208 32231 101
10943 101 -17196 -1691 -5991 10613 -1535 59830 72197 38866 -34728 -26453 -37339 3502
10931 3502 -16750 1081 19881 17842 51557 92064 89015 51861 33212 -21814 -70489 -88179
10919 -88179 -39918 -42113 -26097 60102 64169 12285 -37877 -25376 18611 -10887 -1085 -43005
10907 -43005 -9941 -250 22088 42813 37381 -10763 -31912 -39711 -83 -3194 -25178 -16177 14120
10894 14120 62523 32226 -24461 -57242 -45498 -11070 34689 22529 -12212 -86427 -91806 -57959
10882 -57959 -70179 12509 61967 57433 58272 106216 89542 81682 6197 -9972 328 23987
10870 23987 -3302 -12768 -18838 -58908 -14824 47527 42666 28601 52313 35436 34306 -49424
10858 -49424 -81645 -86700 -75421 -119303 -105810 -32436 -21484 -2990 -3083 -14833 33212 20378
10846 20378 13644 -55772 -94485 -69443 -26205 -29144 -37093 -76211 -39462 -12867 -43106 -49226
10834 -49226 -55493 -64026 -57281 -33118 -34352 -36936 3371 -7570 -399 3714 18328 33572 48881
10821 48881 13676 -12837 -31155 -11828 -14302 -84824 -103175 -34970 985 5044 12846 -40880
10809 -40880 -109013 -68383 -13301 -4392 -3087 28482 22628 7759 13100 17774 2948 -18986 -8835
10796 -8835 15501 5504 -32802 -70714 -44841 -19211 -45854 -24669 -10660 -7155 -67708 -132060
10784 -132060 -42414 -11838 14819 17003 -8636 -55615 -54487 -46605 -54815 12726 77741 68863
10772 68863 1806 52655 27670 -25598 -36740 -4476 -20105 -71979 -39751 8680 -34251 -70974
10760 -70974 -121183 -96164 -98830 -65817 -85929 -74986 -56720 -72757 -47433 -43027 23590 -12722
10748 -12722 -1245 -51908 -100199 -62377 -20577 14647 28028 51275 22570 12577 7340 537
10736 537 4595 -30683 4173 165465 215035 197305 173335 142383 102964 126324 129924 130916 107315
10723 107315 83953 47895 -24419 -98617 -59560 -25382 -30069 14088 36966 55059 38804 13499
10711 13499 10687 -127 -38823 -47384 -87179 -117959 -68084 -41003 -6423 25277 33838 33242 27186
10698 27186 44272 -7470 -28772 3235 15750 -10441 4245 -14036 31771 67602 38156 -24631
10686 -24631 -47090 -63311 25887 14981 -26854 -74583 -66345 -25773 45221 50168 -4567 -10218
10674 -10218 -38717 -32136 -12263 -12154 10230 64532 69119 50746 -34549 -77933 -88133 -61526
10662 -61526 -60252 -141 36945 106078 92432 74119 75634 75175 57379 40852 16572 -11596
10650 -11596 42756 107992 96389 77827 77946 37346 -31574 -33448 -11720 -7302 5802 -73506
10638 -73506 -85042 -53947 -16132 20049 71714 47556 -41880 -44076 -76391 -102661 -74242 -18419
10626 -18419 -19902 -21276 -42858 -71933 -55051 -30141 -1662 -64470 -88494 -63942 -26475 -52046
10614 -52046 -45166 -35471 -54556 -78437 -62886 -25002 -7552 11217 60989 14679 -19824 -42691
10602 -42691 -64171 -72017 -35967 -1213 16753 -24760 -16845 -14312 22766 23733 42798 21204 -27523
10589 -27523 -27877 29641 52484 64236 25493 -24278 -26088 -4465 59908 108246 134897 39050
10577 39050 -78995 -105452 -75598 -63266 -39000 23110 26420 65951 56943 -4171 -38125 -10123
10565 -10123 -15090 -23059 -38266 -24356 -15516 28986 14893 -42291 -22187 -37242 -36051 -26738 -30169
10552 -30169 -52559 -82905 -104783 -124766 -60196 1082 -741 -42277 -83611 -84850 -6829 13356
10540 13356 27860 61594 92750 75097 66798 73731 38532 17569 2578 8514 52075 89882
10528 89882 34147 8303 80140 120698 77828 54886 34365 -57867 1669 49429 16169 32629
10516 32629 36960 33456 -6847 -51019 -111289 -115751 -62013 26670 20772 -64358 -54446 -59573 -60976
10503 -60976 -84398 -72140 -28543 -59008 -82814 -24888 5223 443 79883 73111 53248 38577
10491 38577 35218 27091 22479 -35556 -77780 -56972 -112208 -207362 -158309 -132316 -104946 -51025
10479 -51025 -52817 -58511 -64038 -101736 -144542 -196517 -131805 -66096 -2517 66683 66556 34338 92184
10466 92184 50429 26543 13656 -32283 8729 8025 424 1822 24983 31418 36357 20126 -5355
10453 -5355 16549 52232 17515 -46842 -21047 36355 48120 -17704 -64825 -60882 -65619 -58724
10441 -58724 -80552 -83677 -57418 -94625 -102529 -38889 -55225 -60789 -45276 -57866 -18069 -22970
10429 -22970 -20643 -18387 31704 57280 2394 -62794 -138446 -166845 -102070 -25113 -25269 -75879
10417 -75879 -58467 -52297 -36312 -41216 -66631 -34129 18614 43746 72806 59468 59173 54970 -23492
10404 -23492 -4739 -10781 -10150 48102 -3022 -61540 -77374 -76874 -43171 -2524 3846 -19300 -27175
10391 -27175 -45015 -4295 39348 -28163 -40157 -10504 31545 81032 72726 94622 93380 68497
10379 68497 83180 120712 62067 32109 -23390 -41702 -67323 -56757 -27163 22923 -1575 816
10367 816 -23155 -88753 -85006 -80254 -76652 -79745 -113119 -70112 -99491 -92910 -92659 -81250 -52839
10354 -52839 -49961 -11562 25939 32449 4276 1912 2616 -45762 -13489 -26629 -8457 -2752 7234
10341 7234 -20247 10165 83194 43337 57185 46829 54094 65481 56674 -16273 -61463 -70369
10329 -70369 -42883 6530 42046 -1792 -26615 -36605 16127 45315 71621 82390 79956 63846
10317 63846 81453 93658 65975 49122 40614 41941 20687 -8954 2820 64653 80140 21896
10305 21896 15067 5981 -24470 -31102 -41002 -52677 29273 49065 64939 89638 111209 79899
10293 79899 17929 -39527 -39998 -79259 -100259 -100585 -72496 -52349 -33904 -19182 -40185 -57557
10281 -57557 -29909 41008 48412 2376 33227 41384 -8396 -22163 -3640 -8401 -30558 -20225
10269 -20225 1683 46483 43873 -16951 -54740 -52302 4942 3365 7782 40076 24770 19114 -15332
10256 -15332 21196 37985 41571 -18528 -34573 -9280 -5489 -47078 -34864 -4517 11975 44859
10244 44859 -4804 -27578 -32556 -17438 -26035 -4146 83587 57566 12816 64889 88100 31201
10232 31201 -31975 -44829 -8932 8409 -2475 -22653 -36754 -126337 -189552 -168498 -103107 850
10220 850 10538 -16110 -42137 -55739 -14346 -12603 -14227 43640 58123 63517 44872 -26720 -75666
10207 -75666 -31891 -13805 -15600 12946 -7960 -46213 -89 26348 -25648 5526 60538 56667
10195 56667 43926 36419 27977 64481 21430 -16576 -1393 -38687 -24599 -7266 -29989 -72948
10183 -72948 -26211 27969 43333 17968 6257 59145 135363 78600 59555 85467 110621 52600
10171 52600 -2293 -36922 -11746 -10480 -27149 3898 43300 4145 -80675 -59320 -19558 48134
10159 48134 131511 149173 116232 91592 105245 54453 17027 61652 74459 14419 -7428 -14503
10147 -14503 -36354 -1174 17418 16990 -17388 -12169 37621 55093 -18566 -76910 -41246 -10917
10135 -10917 53189 78903 82339 27253 -52223 -57733 -9362 42913 60147 37823 17817 30952
10123 30952 16758 -16611 -56308 -77196 -67198 -48721 -10998 6787 5209 16843 36424 41681
10111 41681 60810 6463 -83247 -100461 -42660 -18591 32958 56736 4854 -27130 -48450 -24762
10099 -24762 28604 56608 119717 106698 41066 9477 -9810 -49211 -63540 -40200 20813 40599
10087 40599 60030 10527 -31904 -13860 -35449 -89705 -7878 -20085 -44194 -25754 -20497 -13359
10075 -13359 -9359 4792 -17002 -5258 -52540 -84037 -114831 -36088 -51261 -64703 -44993 -36750
10063 -36750 18811 -3084 -22820 -20830 -25214 -40127 -39614 -36560 19716 -9535 -26365 -68065 -112058
10050 -112058 -77345 -66013 -25843 20961 85490 60393 12510 49778 80241 71996 -8217 14355
10038 14355 11686 -13548 -1938 -6114 -2921 -65217 -56213 26486 45136 26942 -26917 -40495
10026 -40495 -34215 -24520 -66743 21070 35440 21920 101040 117942 108008 -19451 -113381 -99574
10014 -99574 -45244 -32949 -43150 -12283 -54616 -81871 9141 46939 259 9805 20959 -11364
10002 -11364 54474 149020 118308 24471 38173 55333 57296 92312 -701 -34289 -21521 -39858
9990 -39858 -42766 4850 28017 -17858 7187 4106 15927 -13575 -55223 -29410 22859 37717
9978 37717 -8625 -1507 37097 41141 36593 38074 -2836 15793 24498 50996 22550 -55587 -35327
9965 -35327 39557 19235 562 9630 32743 42248 47505 67512 -3500 4002 36400 68976 -2872
9952 -2872 -59579 -96991 -82971 -95809 -91554 -32326 -39778 -31540 -10777 51863 30463 51970 82210
9939 82210 76104 29353 -43447 -27993 -20727 -20417 41859 54919 -23870 -104781 -96937 -66235 -95919
9926 -95919 -153405 -102280 -95647 -90908 -60724 -8180 33118 -36482 -86307 -66576 -24126 17903
9914 17903 2261 -68287 -60469 39624 76399 126870 126773 45079 -21999 -49647 -64576 -8360
9902 -8360 62198 135335 112867 58198 41386 55635 90246 76999 29474 59699 129815 118090
9890 118090 132890 128183 50809 58639 117330 94885 54066 -35426 -63467 -61583 4469 -18949
9878 -18949 -34404 -20753 -22924 -2639 6510 6603 71354 110458 87725 50734 98478 71065 -7594
9865 -7594 -29318 20651 -17511 -8567 -10558 -6993 34871 76773 49962 92588 94865 37637 13292
9852 13292 -20225 66698 118195 68773 73938 27767 6921 11285 36758 96662 106077 91718
9840 91718 91093 123240 132470 133127 118555 52749 37787 6487 -9049 14390 50160 67903 -6625
9827 -6625 -47631 -56947 25899 36657 7265 6581 -21850 -48934 -16713 -18279 -72 -11232 -1715
9814 -1715 -7822 2294 -25689 -9741 28409 93684 87934 71330 -44330 -91795 -77451 -101270
9802 -101270 -119700 -151630 -101198 -74368 -45688 27297 92155 122615 78908 43424 26598 45565
9790 45565 33920 57740 11228 -62677 -56458 -33650 -45981 -28183 7332 4036 1191 42586
9778 42586 4743 -75725 -90511 -69780 -36658 -8558 23394 -5576 37107 34224 36242 24676
9766 24676 24640 18097 7989 12707 11814 -3885 -38243 -46738 -27825 -31061 -60574 -30132 -20287 7663
9752 7663 27103 -9890 -40637 -66396 -92596 -194812 -181188 -84665 10816 52410 74000 24468
9740 24468 24877 30015 21410 -28437 -67936 -91702 -101811 -76550 -37087 -4298 12935 -77713 -98842
9727 -98842 -58456 -58143 -9597 47636 76126 24716 58078 120017 170100 201302 164321 81813
9715 81813 108708 57010 7552 26205 21390 -45874 -28934 70990 73248 52440 66265 123146
9703 123146 104657 41453 15171 -3119 31309 45379 46449 77447 67485 39700 -14460 -13028
9691 -13028 -29642 -37220 -60265 -52739 9312 15117 7861 22316 40228 -50811 -62700 -99964 -63262
9678 -63262 -34087 -12353 -18183 -19088 13563 -45852 -123565 -96519 -134662 -137076 -167854 -131874 -110402
9665 -110402 -84705 574 -37230 -104663 -130275 -81494 7430 80708 5684 1562 -33089 -49942
9653 -49942 -7914 -465 41033 48814 9580 12162 53533 34154 -32859 -36706 -7513 11176 -13330
9640 -13330 -69821 -136766 -152942 -110862 -94044 -105161 -45012 -75424 -75360 -61002 -38640 -34547 -52189
9627 -52189 -40306 -63273 -35471 -11479 -21094 -2164 -25291 20255 58565 57510 51243 9873
9615 9873 -20861 -50479 -31657 -14201 -47191 863 47927 49885 29783 -31415 -93802 -123889
9603 -123889 -46832 -22618 4509 23085 13640 42412 -33270 -77953 -31234 4971 -3818 -2981
9591 -2981 25782 53943 74196 65698 70317 118346 101524 54228 26778 -7557 -33606 -13671
9579 -13671 13836 -20155 -96486 -126225 -104762 -84621 -41492 -52400 -57961 -9361 20028 -12399
9567 -12399 -3590 28838 16085 -14855 -9488 -1907 -30601 -44512 -55400 -43169 -53725 -33250
9555 -33250 4283 47680 81115 39890 37698 73349 50599 16848 44286 84745 88615 79338
9543 79338 71508 84366 105977 35326 21042 56626 73495 38280 11658 -9579 -48977 -74288
9531 -74288 -41605 25204 32866 16575 -52019 -112710 -103565 -43222 -46015 -20007 -25434 -6036 -24699
9518 -24699 -30018 -42866 -71517 -98293 -111129 -69227 -12450 38435 3962 -27927 -44951 -30880
9506 -30880 -11335 -41108 -59085 11942 6000 -796 15687 -33687 -16252 38639 46356 70972
9494 70972 53414 50718 62526 60179 63526 41058 19030 1547 -3043 -21203 29 38462 66180
9481 66180 69480 55758 -15964 -33531 37252 32655 45100 31503 -17951 24345 87362 97180
9469 97180 76260 52301 34451 3624 25890 53976 40346 -7808 -30256 -85846 23443 90132
9457 90132 58525 43556 73346 99846 98368 39687 -7039 56970 63206 58253 69632 12125
9445 12125 15366 -1072 18880 -11119 -73087 -111041 -88535 -8594 -16206 -4500 24918 50882
9433 50882 18818 -9978 24492 -84106 -141251 -110905 -86911 -29127 -46205 -53049 -7805 -54582
9421 -54582 -39253 17280 -14990 -46533 -12907 16262 31828 39880 62659 15047 -60112 -10290
9409 -10290 10786 -39635 -45369 -61263 -35580 -11257 39907 -10205 -7772 -29421 53032 9756
9397 9756 -84694 -118282 -92191 -53068 -38521 -35447 -26940 -16813 -27997 -66100 -6770 9282
9385 9282 -6163 -207 10022 -4319 62524 48636 60925 59457 16121 32051 17880 -198
9373 -198 30611 71791 102183 75750 40086 -23218 -33062 -34258 -38704 -32607 -40382 4985 63334
9360 63334 32343 4383 38612 35567 56353 91278 91665 92642 107672 81660 60840 83682 107248
9347 107248 104423 67421 61680 83446 45669 -335 -65928 -124824 -48875 27233 -34285 -87026
9335 -87026 -81270 -38997 -16779 10648 44239 51618 35024 -54614 -54138 -51195 -2156 70066 126527
9322 126527 144617 113603 100794 112000 101175 138306 93636 110191 162973 174442 70065
9311 70065 -24667 -60860 -81844 -67462 -11753 46702 87035 56196 -65691 -93968 -44314 -15363
9299 -15363 2161 70382 89136 77984 57489 77143 118503 121920 84029 40697 22019 31633
9287 31633 83277 116873 99444 112363 136626 105024 51037 32371 62373 50840 22969 9400
9275 9400 10878 -7688 -11593 3372 -6775 29078 33352 37553 -9822 21803 67327 26922 -63738
9262 -63738 -83595 -14476 -632 1147 13647 11966 -12836 -4771 56133 67541 -35229 -64454
9250 -64454 -50267 -22667 -34496 -13249 21819 -4229 22563 97602 30357 -65649 -80506 -53070
9238 -53070 -38423 15145 24869 -22936 -79228 -74999 -86240 -58404 -13632 -29868 -12328 -12889 18882
9225 18882 50786 95595 135192 178913 158058 128377 87041 54130 44819 20338 36516 61564
9213 61564 38609 28425 421 -34449 -40251 -4513 -11876 13872 40457 33352 7829 7546 60492
9200 60492 153939 169293 127154 74596 76184 69750 44272 -12113 28745 -8384 -9697 -26212
9188 -26212 7185 93806 111049 48232 -33852 18078 54473 71605 138162 92865 -35417 -82801
9176 -82801 -58727 -4146 48110 109745 151118 146405 124590 113028 88509 39185 25060 50692
9164 50692 40137 47740 57429 37491 49717 38215 57601 33725 -58270 -118263 -97188 -1110
9152 -1110 31672 -6771 2955 188 77386 125696 107175 79786 76297 96425 114156 102431 101481
9139 101481 100231 80077 93503 133803 138627 171994 191436 125426 86243 81696 63487 130074
9127 130074 137982 104318 86084 80820 95221 62533 96344 135551 120774 125957 105836 149524
9115 149524 163735 173954 198920 240015 191610 187362 220020 232198 283675 301354 233244 296202
9103 296202 410328 435463 431151 392428 357313 396739 483205 500154 500886 497349 502177 539894
9091 539894 637929 711278 838274 944874 1038575 1198632 1385882 1597929 1875064 2287605
9081 2287605 2817843 3591672 4651140 6365446 9176239 13733508 20547890 28604446 34779416
9072 34779416 37291502 37074226 35799403 34199426 29394274 20859318 14278858 10352196
9064 10352196 7966771 6392650 5324121 4593918 4118981 3761014 3404481 3092093 2856964
9055 2856964 2671376 2462080 2245226 2083598 1900804 1698935 1582946 1393941 1241414 1180970
9045 1180970 1085403 1024483 1035263 962413 841974 757877 751769 628864 636209 631620 618737 554087
9033 554087 548299 535173 517285 454755 426035 385302 392217 392766 319914 282636 297948 362363
9021 362363 351355 282501 245502 252550 249643 239173 210585 162352 161025 169144 138300 194028
9009 194028 192979 135871 166625 169910 192703 216646 217210 148092 109993 178977 202210 186737
8997 186737 156862 128748 93968 71519 93836 119981 123203 145690 191429 132092 107202 119278
8985 119278 180602 146553 111776 109817 87306 42666 28350 29693 68363 37521 -20886 -19763
8973 -19763 25434 4795 24055 96984 64779 62694 122516 56703 60719 71818 53512 47961
8961 47961 23309 10050 -2390 33633 124465 89320 56171 23997 68585 54935 38256 107985
8949 107985 104811 60692 47192 34240 41000 59425 55318 64731 71648 93020 93310 43245 104
8936 104 13608 42004 4232 -24894 -8753 -3564 29591 71304 25429 -7709 23036 41716
8924 41716 90699 119074 63938 13712 25413 53000 59108 15589 38113 27720 22155 60527
8912 60527 137180 147301 144424 172176 197125 244513 270649 213558 191512 229341 356166 491135
8900 491135 608459 701755 759507 823015 822007 810134 768894 647895 456909 352313 306289
8889 306289 253501 198138 131465 51442 33492 109091 117197 70623 57488 22735 -5921 2735
8877 2735 36547 481 -75412 -67927 -57510 -47849 33616 33020 51428 99092 59454 61274 36687
8864 36687 50289 59394 64939 127214 255926 326796 457078 616761 815198 1058549 1311369
8853 1311369 1546313 1610905 1572837 1532464 1434317 1187489 917284 759792 587509 430909
8843 430909 387490 323620 260031 216827 145775 94068 96597 119222 152936 133603 169072 149662
8831 149662 108886 177798 162982 107239 94204 59092 66769 48904 30635 -18191 -62171 6967
8819 6967 17980 75017 90454 109483 124133 154028 202113 311881 440296 560325 676478
8808 676478 772925 837055 817990 760169 740091 670027 509216 347038 239341 214645 183199
8797 183199 170676 176218 149659 173908 138821 128468 144118 153053 62473 29358 3106 7966
8785 7966 19715 37257 32933 55834 85088 62519 -19277 -47090 -20933 23140 42173 48308
8773 48308 35569 33273 12195 -1145 33091 41183 43364 16766 70753 51145 -22172 -55565
8761 -55565 -51155 -32530 6493 34180 77728 30695 20278 -1292 56462 193039 195940 154672
8749 154672 188818 183751 140774 91788 118857 141624 117330 59308 19291 51462 19729 -28640
8737 -28640 -80856 -48931 -25090 -7354 15424 52206 91558 48232 76827 168219 150556 74552
8725 74552 3558 -37125 39190 86526 74883 101011 70100 -5910 1032 80671 92704 42659
8713 42659 39961 69810 57329 42031 66728 86846 73333 25849 36646 72516 103742 127742
8701 127742 138339 131841 71485 79391 70539 111315 73013 59026 63766 63531 92236 137798 170033
8688 170033 176498 111452 41891 80247 125101 63654 66431 146878 136876 131356 169260 141154
8676 141154 84082 72774 122678 175887 156702 149422 170027 123810 168385 215470 203122 169072
8664 169072 192836 188227 192806 205807 147013 167392 150116 174010 182086 191756 158358 185455
8652 185455 193418 178808 216448 309064 333760 343042 286106 290618 293163 263327 217493 225452 194332
8639 194332 206776 255256 315218 278906 237984 307841 410537 451011 500598 559304 562198 599387
8627 599387 710350 794695 860880 938622 1025892 1040426 1080013 1100067 1137545 1169207 1135299
8616 1135299 1139339 1084859 1024934 912300 810218 709711 646451 630370 592241 539761 475249
8605 475249 452106 343677 298875 333546 321901 338390 300479 238028 206040 205022 234110 275325
8593 275325 217428 197212 253805 226024 181917 212124 194116 229381 272952 252204 167009 152324
8581 152324 164097 136345 128121 98533 120936 161977 195986 251121 254432 203598 234896 248557
8569 248557 302619 283303 241939 265217 250066 230671 202260 202142 228428 226773 159161 138990
8557 138990 201628 225982 216346 206146 193397 186856 220137 179121 135605 123122 78902 110875
8545 110875 175962 221474 236414 206146 109879 68602 102336 165344 189847 127897 50265 22634
8533 22634 68444 64847 78552 53544 51796 104229 103308 132621 109853 60091 48770 66220 82316
8520 82316 88361 102179 76755 32951 76390 76695 130569 123291 104426 96658 64180 50942 77805
8507 77805 98479 153493 163290 117462 90337 77898 28335 18056 -1335 -26005 49434 97739
8495 97739 76797 47134 28897 29596 41848 67515 113932 95877 67428 11727 -15247 82261
8483 82261 74399 69664 130207 153791 132771 133656 26468 -22737 -37633 -92042 2004 45831
8471 45831 62644 4282 -28546 22157 2645 -29146 4776 47186 11064 4333 18067 13237
8459 13237 528 -20806 -3562 52006 65112 70497 103785 104014 149128 153138 157529 125056 44318
8446 44318 18949 -9008 -13814 -27841 -51144 -32117 5729 45596 8813 1282 5620 14674 45297
8433 45297 48418 189 16712 50238 52643 34401 -23844 -57154 -15781 -21912 -15205 47448 51739
8420 51739 73472 71132 69599 3710 13759 45674 70524 98722 123139 105030 61880 53747
8408 53747 25846 -27065 2572 43008 66381 151170 214398 126167 57537 65328 46635 74882
8396 74882 50348 69100 50022 28027 39814 37600 -7423 2463 24663 32827 10126 52087
8384 52087 17441 36466 54165 40373 95856 94079 62589 63693 102224 92947 29966 11920
8372 11920 44863 40132 51600 54132 58836 61977 84185 79163 90943 82727 46866 64277 39665
8359 39665 -10716 -40600 -18405 3168 19410 49947 3226 7912 46847 52885 -30883 -45491
8347 -45491 -42127 -22892 -6521 -52346 -41400 -32172 -68699 -56864 113 11649 10993 -38349 -28270
8334 -28270 7984 48595 68114 61159 97738 90618 108347 43285 52920 13550 17673 53344 -24242
8321 -24242 -7400 -19851 53 38147 84308 93458 72927 72760 78247 96419 118310 96307 44363
8308 44363 22073 21415 29195 -14889 12365 82581 129433 115153 38210 -29874 16289 37809
8296 37809 -35336 -41682 21133 41643 67820 50466 39813 39187 27363 48923 42515 51011 72471
8283 72471 47363 83511 31638 -24373 -19737 -19195 6050 78506 76435 41495 47208 73964 86476
8270 86476 44156 27997 -15154 23810 -28368 -68596 -51485 -42557 8692 41487 8805 34917
8258 34917 31554 13345 89134 101157 4825 -14020 37005 11344 12587 -5104 -57800 -80230
8246 -80230 -19851 45687 41270 45552 53218 42071 30085 24228 -37418 -42087 2002 23513 63921
8233 63921 75033 36549 -6999 31985 89819 84656 25709 -42202 -28428 -12427 55482 57693
8221 57693 16900 -6257 10023 24324 34659 3737 -20069 17936 44810 59051 61164 25756
8209 25756 35336 48146 85519 38929 -4764 2564 33215 10762 9092 -8200 1991 -32290
8197 -32290 -21686 -22846 -71695 -72875 -49869 -12730 33715 45474 44372 -6863 -26961 -26764 -18823
8184 -18823 2159 -33247 -1824 2112 -55521 -52950 -77871 -73392 -26142 -28084 -7047 -34120 -43299
8171 -43299 -35757 -18124 -21892 11751 43043 47212 2117 73178 163227 180546 167330 146333
8159 146333 113456 84683 107858 124122 76153 12594 -1013 -44454 -75238 -47620 -48665 -9596
8147 -9596 49455 72669 43231 51357 60144 3522 -11609 -15906 -17979 -51746 -25368 79262 139692
8134 139692 189693 136660 7379 -41893 -40803 -70556 -87042 -108007 -78235 -12804 -1171 4425
8122 4425 37186 35335 -11561 18153 37506 29551 29733 77146 98067 127360 114257 24444 25327
8109 25327 37492 22203 -33107 -21935 -44731 -88403 -98422 -42146 -30156 -2309 15398 24029
8097 24029 56136 124764 106340 129056 131820 121455 109224 102897 125326 147914 111361 15184
8085 15184 39852 5392 27390 32478 37513 49863 67495 102801 121045 135889 120709 146357
8073 146357 142197 78108 96162 103077 110934 92512 85972 127147 93466 89728 93926 110623 153819
8060 153819 187243 191488 147471 86733 65306 69669 79349 203148 223877 190364 203217 199139
8048 199139 209547 133731 112330 85212 110485 170022 191698 136047 24275 52437 132759
8037 132759 166557 158768 198836 159908 183335 189915 162366 146862 193727 217200 172458 151664
8025 151664 179415 170698 155991 144185 148980 188131 156342 151885 117123 58021 48872 60680
8013 60680 84419 147461 126164 153279 232493 216985 191064 210809 207968 236108 254746 261524
8001 261524 272403 262586 283934 279999 294006 279197 272141 283707 260174 242693 287833 335559
7989 335559 286517 263533 337919 320953 281889 318247 297182 237544 237047 222247 217820 206433
7977 206433 225004 268227 254620 284934 256431 202895 145037 123739 78528 123297 180253 175298
7965 175298 196778 285873 292091 266729 266063 280954 270093 267919 272352 274525 302005 324107 307365
7952 307365 306352 278899 336622 344534 308510 256641 227127 236296 246048 250810 246785 189059 213664
7939 213664 317346 312984 284531 274923 268161 278069 279716 255144 230755 263061 243109 170165
7927 170165 97264 112179 165823 205366 214695 175130 194711 202904 196743 174226 177008 138900
7915 138900 147511 147267 127462 106345 111056 148181 157939 149595 116783 111951 106873 102764 106568 150948
7901 150948 111205 80718 115543 102063 26550 -19833 -51515 -14549 -7729 82231 144386 129715
7889 129715 144987 147140 96860 58364 94206 98149 42528 48976 42837 19853 32316 103841
7877 103841 112250 153196 213593 180862 120321 72457 74791 77294 56951 -39386 -56408 -22380
7865 -22380 -9011 11104 18552 51496 83724 69522 67100 55120 52246 77744 112346 60061
7853 60061 15515 56861 44304 -45964 -67778 -32434 -4048 -43251 -19297 -36467 -42547 -12168
7841 -12168 14581 29015 13107 12051 63330 73687 55161 42010 23376 -20992 -30426 9943
7829 9943 -2264 -31953 -58430 -74933 -11003 57050 75502 100307 97961 77993 90015 142207
7817 142207 148858 148823 55873 38827 10867 28311 46765 51908 40626 -15966 1626 -22096 -118679
7804 -118679 -124379 -70732 42134 59449 6672 5796 5648 48029 42024 40414 10602 -29209 23269
7791 23269 43107 32520 36840 35951 14326 -21442 7408 59935 50142 8183 -31858 -32220 -51441
7778 -51441 -12477 12686 -49452 -93594 -74287 -24075 -77411 -37637 68185 97853 74813 63738
7766 63738 39657 51040 63310 18770 34662 65309 12790 -73762 20467 116370 103566 35583
7754 35583 16769 32281 12869 -471 -62211 -82578 -13157 -15478 27840 38604 55720 20038
7742 20038 2051 16335 -80622 -123259 -141639 -106479 -9100 40145 56843 40148 1996 -20092
7730 -20092 -49830 -16395 39024 54106 5202 -7465 -8412 40197 79648 85093 108190 98833 120110
7717 120110 123259 142893 120806 84957 80510 98836 57819 31228 61792 39645 37850 -18602
7705 -18602 -66523 -120156 -143866 -96753 -22928 2187 14170 4554 -453 30836 44573 26871
7693 26871 27400 7488 22950 5752 30578 60087 11746 -46285 -41948 -46292 -57182 -32012 -37770
7680 -37770 -25852 -46374 -67239 -65700 -78298 -38694 7119 -19553 -55266 -8873 -29226 7987
7668 7987 54760 76619 35997 -741 -35830 -40778 48364 48862 8808 -29141 9092 36700 71174
7655 71174 94219 74565 -12508 -64437 -35098 1499 10042 -2260 -10794 -16008 -27572 -48493
7643 -48493 -13638 33161 27150 -29827 -73975 -71274 -53870 -35858 -81536 -63490 -23114 -8795
7631 -8795 -66313 -83579 -51749 -8051 -51564 -42255 -27582 -33912 -38005 -19166 -27509 -58948 -65146
7618 -65146 -8868 48911 7393 -5537 31093 78676 125691 111433 71827 21253 57687 -12187
7606 -12187 -20129 34766 8601 -53065 -73934 -14755 7002 79634 98062 40247 -41693 -54710
7594 -54710 -41123 -60363 -7462 39611 -6853 -21290 -9706 8548 -8005 -76265 -66749 -67669
7582 -67669 -69128 -95783 -81679 28653 58953 10766 13276 -17524 -87372 -114564 -81454 -6952
7570 -6952 23391 -10993 3984 16711 21406 -5903 -114948 -108486 -40044 56727 91784 69988
7558 69988 -3227 -3096 28121 22247 19838 1398 -62846 -103762 -55360 -2430 -15171 50578 56867
7545 56867 16837 43884 -1308 -49779 -51776 -45015 -101303 -187019 -199817 -173276 -103735 -70659
7533 -70659 -47245 -26655 -47182 -58951 -4973 22049 6951 1366 -20339 -7543 -44168 -20058
7521 -20058 -1751 -17421 -3427 -58862 -27466 -20286 -26271 -25681 -70691 -81862 -50975 -3999 -170
7508 -170 -16954 -5420 94525 143567 76096 73542 -892 -70110 -113543 -117584 -128396 -126250 -61071
7495 -61071 -12996 50882 14527 31116 48342 4037 -33271 16377 37409 24334 -25109 -59428
7483 -59428 -42270 -96594 -99631 -85463 -80378 -61009 -63212 -58038 -21495 -6376 11497 -43194 -45909
7470 -45909 -50466 -60420 -81357 -62950 -59207 -46646 -113217 -135313 -117228 -84707 -5307 40100
7458 40100 21088 -45444 -27983 46229 37280 40738 98112 51734 20021 -23882 14110 48543
7446 48543 480 -17630 -66092 -69853 -80314 -78897 -66090 -31265 -25290 -8289 -12089 -16123 -41693
7433 -41693 -31082 -5178 -26893 -63907 -72134 -14098 -1758 -46070 -88889 -71849 -77748 -94102
7421 -94102 -62892 -46548 -58410 -79193 -107273 -63259 -33012 -60411 -78881 -55419 -4144 -13459
7409 -13459 -31543 -15029 -19380 -58561 -54258 -85079 -71521 -56397 -83551 -60463 -65507 -59839 -72750
7396 -72750 -60812 -1066 22382 11325 -17842 -60922 -80341 -109190 -126385 -141387 -130531 -99759
7384 -99759 -35869 -67503 -108172 -86900 -63116 -75034 -105173 -79811 -110457 -91016 -117451 -147040
7372 -147040 -85257 -62275 -79010 -103638 -110739 -78380 -44008 -64521 -31690 6761 -5014 -30526
7360 -30526 -24359 25233 29565 -9432 -29120 -2360 38710 42302 38735 14004 -47777 -94656 -89105
7347 -89105 -59604 -15943 -11095 -57686 -8840 -14906 -32020 60106 85287 85546 85005 65549 -1642
7334 -1642 -44485 -16412 -53907 -45753 -21101 -9554 -24145 -29420 121 -13102 -23716 -84124
7322 -84124 -34591 13964 89765 84897 48426 5502 1021 -47035 -84659 -88017 -33332 -2145
7310 -2145 30417 57972 -10096 -13263 -4824 17485 -18656 -24936 -24392 -42157 -62668 -115829 -138613
7297 -138613 -132929 -111007 -68730 -41037 -34096 -45345 -37649 -44653 -36676 -14416 7785 7450 14635
7284 14635 29030 42856 68912 119566 116284 50222 53581 106010 157432 70392 9190 -5834
7272 -5834 14592 24455 30169 75278 28058 -57257 -79200 -3519 52950 50735 39815 -61148
7260 -61148 -71495 -41204 -21383 45833 -17818 -72615 -53331 -83072 -84698 -88062 -132059 -102606
7248 -102606 -89515 -20806 47708 36007 753 -2083 9912 16308 54825 -17100 28105 67269
7236 67269 64167 60886 41309 32323 8593 -27221 -49367 -18278 39738 39579 9789 33783 41449
7223 41449 22735 4515 4192 20206 -36412 -39640 -40420 6534 4406 30855 -16906 -29679 -15955
7210 -15955 -4632 27827 82075 71260 15089 9483 33037 479 35503 104091 78448 75369
7198 75369 60716 39529 12657 -2181 98 -1773 856 59158 55220 -3487 -15729 263 31170
7185 31170 57937 -26703 -70861 -78118 -84467 -8061 16670 36420 17967 -40298 -59599 -99992
7173 -99992 -90050 -95764 -93340 -20391 -22834 -71096 -100137 -111842 -148928 -110231 -87519 -52304 -21562
7160 -21562 -1465 -38545 -122547 -124273 -71840 20892 44548 39282 45347 70726 14009 -8578
7148 -8578 4268 -63384 -79280 -70524 -20848 -17197 -41979 -37536 -76037 -31584 42453 116903 188243
7135 188243 177857 137909 80033 46787 51756 74308 49269 15573 19750 14605 -11252 -9783
7123 -9783 26229 -20336 -45719 -48961 -49668 6633 23166 -17094 -59586 -52401 -3648 26988 30568
7110 30568 58596 5109 -45662 -20437 19400 6577 16574 -63123 -54143 25792 -621 10175
7098 10175 65539 37090 16390 -2399 -48786 -80238 19274 67184 8811 2457 -10652 5747
7086 5747 -26089 -7528 23085 71632 114893 77186 -1930 11677 55104 11588 -62314 -93705
7074 -93705 -76771 -76396 -86715 -118719 -134932 -160960 -126722 -111827 -49571 -29671 -31553 -74495
7062 -74495 -40891 -29012 -17074 8850 -29727 12226 15958 45151 3331 -55695 -53196 -47252
7050 -47252 -48630 -27613 -1945 -19859 11616 -21114 -41289 -10776 9895 -29538 -37753 -47451
7038 -47451 -44307 -83934 -49193 21825 34938 32071 49206 28472 10009 -19001 -84009 -101736
7026 -101736 -130750 -127864 -60310 -60052 -21573 -39672 -27315 5788 -8684 -34109 -63063 -47252
7014 -47252 14876 52769 33693 17952 -41446 -83673 -75424 -81224 -134981 -115717 -77622 -17523
7002 -17523 51248 77681 27542 -69232 -79227 -78392 -113628 -95412 -64887 -69515 -104288 -90746 -112384
6989 -112384 -162114 -126569 -99077 -41974 -77608 -70976 33646 17940 36194 52693 46713 24825
6977 24825 -36460 -56134 -61998 -53140 18505 -10177 -35992 -78545 -86818 -68595 -57199 -79473
6965 -79473 -43387 -55052 -16838 56051 113720 82215 22248 -45707 -33912 9701 19102 -8761
6953 -8761 -29933 -26576 -53041 -28741 50071 83087 66972 80506 87345 97701 74776 8634
6941 8634 -50413 -85960 -111131 -137383 -176345 -146043 -76076 -32089 -60078 -38165 30182 8966
6929 8966 -49416 -26448 24640 1448 -42519 -92208 -93206 -91446 -55415 -80692 -75237 -75980 -91996
6916 -91996 -59538 -10840 15082 -12051 -13695 58751 71081 -4067 -57071 -87712 -83354 -44990
6904 -44990 -23567 -48870 -97934 -72399 -2707 -64121 -103047 -65292 -18607 23791 -54322 -114152
6892 -114152 -86497 -74266 -20638 23763 4806 -50458 -58819 -17953 24995 -15537 1273 87154
6880 87154 35309 29592 81941 134789 127476 139029 139121 60930 -48266 -30028 16578 68389 94335
6867 94335 74590 -1694 -14733 17723 -4866 -1433 -22481 -13166 -6319 7121 -58882 -42692
6855 -42692 -52178 21187 35252 12054 20249 60948 126295 77032 16505 5745 -41595 -51613
6843 -51613 -25542 -50778 -30285 -80770 -141752 -163181 -114516 -91648 -36862 -47134 -94081 -38627
6831 -38627 -9558 -8059 -38937 -22317 -8072 -24292 -45370 -61513 -12910 -7024 -12987 -15759 26638
6818 26638 -9942 20626 -42741 -99586 -102877 -39146 37587 -16020 -55821 -68653 -84902 -135746
6806 -135746 -160820 -147339 -128116 -130901 -70177 -85382 -48233 -7617 27396 13984 7875 19785
6794 19785 23299 27443 73962 72080 42108 -15169 -19265 1440 -45967 -106406 -70016 -6268 17678
6781 17678 -18991 -26937 -64057 -73599 -23025 -14286 -24639 -39707 -43466 -33331 1319 41617 58465
6768 58465 29810 39588 59671 65443 128807 235142 262554 271396 230383 174104 157862 148270
6756 148270 114221 131376 119182 79332 25933 36547 49712 20125 67247 109877 89448 23936
6744 23936 57426 77112 40462 -27405 -54934 -10041 -8283 -70200 -24476 24603 54432 100413
6732 100413 100498 105279 35227 2817 -57247 -89544 -73577 -125721 -140001 -77953 -81732 -64614 -91269
6719 -91269 -56705 -26446 -70531 -131803 -175944 -88353 -11517 98 27250 44350 20933 21329
6707 21329 -16770 21352 -10063 4516 64252 83249 70521 84624 88739 84352 112026 150887
6695 150887 110053 140812 104138 49168 41934 48184 20500 -37281 -27922 28131 29548 17029
6683 17029 54877 59864 15667 23588 50383 48851 -41150 -72990 -54673 -29626 27470 28296 -9803
6670 -9803 -24728 -25668 -50508 22523 70021 32756 -30512 -35183 -36249 22321 55799 73719 47983
6657 47983 80280 138482 120101 40278 737 -2422 -33080 -80840 -54839 -71408 -61832 6533
6645 6533 40799 49889 62109 24432 33985 34694 -12290 -16878 354 1988 -44408 -34465 -12181
6632 -12181 60829 102268 52259 11320 -31277 -68428 -33525 -27306 -13572 21697 -54902 -95221
6620 -95221 -57268 34165 108340 96082 45577 95371 38621 7310 556 -41444 -26657 -18981
6608 -18981 -17524 -35510 -29701 -110781 -193956 -205629 -116741 -18140 29322 -1894 -29203 -60881
6596 -60881 -71709 -95717 -109500 -37123 47396 42898 10745 -24600 47503 120124 134400 64726
6584 64726 56580 96107 73674 67053 55257 -16566 -55137 -43887 -39412 -20320 -80248 -58000
6572 -58000 -10925 -10046 -70383 -108719 -128882 -127265 -70073 -80476 -54833 -91063 -153145 -139833
6560 -139833 -94265 -56086 -70519 -24574 13719 -22947 -93646 -88634 -112807 -90232 -24503 -9787
6548 -9787 2295 -23737 -10637 -5637 -15454 -96681 -117391 -57795 -37457 -82781 -40457 29454
6536 29454 -30361 -62666 -61718 -30959 17847 77140 75512 34289 -9440 -68478 -113424 -79854
6524 -79854 -50676 -80703 -103725 -35563 10321 38498 91622 51896 4073 -66962 -103167 -108732
6512 -108732 -95002 -83463 -39740 17384 -19584 -52409 -52629 -59739 -75178 -81854 -5104 1683 -7382
6499 -7382 -3665 2936 4760 -37564 -43932 -21459 -20638 -20215 -34756 -112777 -147658 -84240 -18736 -46532
6485 -46532 -35143 24438 88351 79146 -17094 -73241 -56420 -20286 8745 -62194 -92837 -46758
6473 -46758 -25554 -17901 20720 36176 -1855 -34394 -12426 -38482 -63818 -94484 -101042 -40487
6461 -40487 -53673 -116078 -114662 -84295 -67338 -14853 -51897 -89675 -88248 -9008 519 -23232
6449 -23232 -31887 -53350 -93666 -58177 -39928 24325 29156 16333 77329 74388 92387 98272 71509
6436 71509 -7716 -20947 18897 49163 6527 -35825 -29690 -59716 -105204 -124629 -107111 -92602
6424 -92602 -120872 -99212 615 26209 1555 -9025 -28032 -50910 3306 -42766 -47179 -69233
6412 -69233 -103364 -122835 -71344 -31584 -21377 -9438 -56224 -44885 -75511 -76638 -86444 -78000
6400 -78000 -56997 -105342 -67637 53480 39637 -24004 -14392 -23259 -48732 -55574 -33259 -4317
6388 -4317 -55883 -111400 -128721 -131966 -53718 21157 54931 47898 -27138 -24427 1343 -922 13255
6375 13255 -9333 -34970 -25775 4429 53827 93118 59109 18562 24035 34420 62301 30129
6363 30129 7716 31180 28318 72019 130346 88536 3233 8589 33903 70546 19569 -18139
6351 -18139 -56226 -100337 -68937 -23316 -22193 -35597 -65765 -64077 -91341 -71005 -25688 -25598 -82026
6338 -82026 -90679 -25692 8116 10364 -8045 29 -307 -2842 47840 18547 -5994 -51169 -28315
6325 -28315 -51331 -37345 33938 26411 -20270 -72467 -106408 -95495 -91131 -124404 -40977 17157
6313 17157 -62149 -118183 -89164 -81512 -71931 -76055 -99173 -52529 -20704 -3705 -14677 -37568
6301 -37568 -61829 -47766 -62097 -58061 5629 -12169 -26904 3574 11034 -35023 -22236 -12357
6289 -12357 18615 27218 38738 82582 26655 -35798 -18944 -11111 -27607 -61301 -65965 -83202
6277 -83202 -64573 -48457 -61544 -33318 47735 66354 20574 -68101 -53594 -9815 1976 -50916
6265 -50916 -71163 -23929 -90399 -75485 -62438 -54544 -30033 -33466 -30904 2252 88322 61314
6253 61314 9664 44140 38841 50492 18183 -5826 -60823 -59970 -93754 -88833 -27688 13681 -12725
6240 -12725 -68705 -39858 -74601 -70512 -43967 9258 -60766 -83053 -10154 15459 -874 40277
6228 40277 28880 -13263 7319 -9045 41566 78663 110996 117963 62033 21496 34480 17636
6216 17636 2832 21489 -26666 -40425 10283 -28987 -111543 -159011 -111367 -23599 29135 -4817
6204 -4817 -62862 -36052 -78585 -92831 -109622 -106564 -39988 29549 11496 -19646 -20447 46145 140092
6191 140092 77466 49769 37694 30773 -20816 -105136 -87860 -44882 -26504 -10791 24445 105118
6179 105118 67313 78597 18733 -40102 -36376 -40110 -45300 -14680 -15083 -2133 15778 24783 -5664
6166 -5664 -17929 33299 89452 71618 23878 36545 89668 79209 35296 7058 2964 31921
6154 31921 54259 50401 17505 -10090 -13584 34090 52533 -9037 8670 24207 13119 21464
6142 21464 24465 35056 84733 138491 104966 38351 15315 15808 -33418 -73110 4063 29678
6130 29678 54404 73564 74101 29124 -38094 -57139 -25210 -26409 -46343 -24040 -34617 -42905 -27519
6117 -27519 -15085 -28508 -51544 -83561 -93474 -59091 -99344 -144119 -77980 -23204 -64609 -149038
6105 -149038 -114319 -72773 -104741 -84047 -76955 -56050 -106341 -70116 -20782 -15546 1226 -22719
6093 -22719 -35548 -28407 -56265 10354 35042 11395 4359 -17424 9315 -1422 -12983 22903
6081 22903 -26761 -23372 6886 -20412 -51967 -63543 -8182 -13808 -41718 -86246 -86609 -46577 6048
6068 6048 32285 1615 14879 12252 -42127 -59341 -115563 -73057 5543 36108 42943 -9078
6056 -9078 28042 26366 -21501 -80064 -42898 28274 9202 -31058 3257 -13851 -27364 -28022 -35127
6043 -35127 -19028 6059 41198 85782 90909 37540 -21105 8606 15536 -647 21088 22664
6031 22664 -763 -184 22589 17184 54991 47383 32294 48760 15928 3063 -604 35788 100641
6018 100641 104337 77509 35365 48733 80826 45836 7515 44852 21307 -42068 -52210 -15665
6006 -15665 36957 -168 -4029 -3010 10456 -23107 -20843 -30638 10405 61033 96652 134858 123159
5993 123159 93361 65201 22393 -37633 -35570 -60302 -78847 -7078 14910 -15876 -85460 -96475
5981 -96475 -80323 -61678 -67802 -46575 -72248 -59404 11882 3848 44278 43011 -35069 436
5969 436 3996 -31155 6813 -42594 -74068 -42152 -17211 -64979 -66765 -49963 -1695 22247 30297
5956 30297 587 11713 29994 67596 37942 25005 -13623 -49324 -112890 -101471 -76739 -2936
5944 -2936 -28013 -53204 -44269 -22482 34627 45386 5748 -7398 22384 13890 -30908 -15697
5932 -15697 -18130 -33542 -83983 -108314 -129358 -76496 -30029 -5400 13436 10080 3250 48987
5920 48987 46296 10702 61291 83201 89501 138170 143878 145600 70648 37599 24656 -2923 21812
5907 21812 27676 -10278 -20787 47609 76382 108947 88552 72490 74464 85702 42398 25967
5895 25967 -39670 -60894 -38195 -38603 26007 44751 59157 64970 22056 -7077 -65557 -124802
5883 -124802 -94361 -36174 -39787 -50278 -50219 -76243 -74672 -4764 10919 18029 -36013 -21068 -31015
5870 -31015 3742 -4101 -50728 -51149 -40404 -89630 -85089 -39313 14764 44068 54293 44322 -4576
5857 -4576 12129 19347 18988 48034 86230 80323 43295 76953 45949 19271 8966 10959 40871
5844 40871 -53443 -104247 -59181 -13425 -39144 -47446 -71912 -107917 -127951 -105676 -110720 -119337
5832 -119337 -83144 -46046 -9978 -17825 -73034 -34596 -9358 3655 -37534 -13385 50862 95998
5820 95998 53699 11672 15676 12458 -3186 8976 -22045 -82436 -52014 -7695 -30402 -39727
5808 -39727 -99295 -106343 -127291 -150104 -109107 -84679 -71366 -71119 -26822 11071 22088 49120
5796 49120 95593 146487 111296 51275 116438 122253 119472 108776 81178 62598 58077 26516
5784 26516 -9516 -45644 -32944 211 1591 76861 65488 24205 36244 57398 52452 46474
5772 46474 -13018 -14039 -6711 15685 46906 28183 3362 14945 23994 -17945 -84565 -81989 -81072
5759 -81072 -67042 -63169 8669 36939 77128 94926 32871 63017 106639 56273 34668 35112
5747 35112 -1282 -23620 -37285 27203 25961 -17573 -15990 2452 -262 -34606 -35603 -10770 25339
5734 25339 73595 117825 136828 120808 64145 7928 12046 34520 63143 55990 73402 105887
5722 105887 76878 59969 32386 39129 11342 -37827 -65591 -73667 -98296 -103485 -121122 -178368
5710 -178368 -140862 -171674 -130464 -24891 -28636 7171 -4529 5555 8301 -5039 -959 72139
5698 72139 123354 158233 175811 138769 94524 62677 46085 73489 90002 53366 39707 -15377
5686 -15377 -25304 34918 11956 -869 -3550 -43775 -44891 14280 1112 1439 17095 -1250 -22982
5673 -22982 -22436 23701 2327 -35342 6703 6151 -46562 -54614 -52877 -20338 -6353 90999 53628
5660 53628 75120 56798 20022 72447 99796 83700 76217 50608 50385 -14 -25143 -19049 -25353
5647 -25353 -79362 -94677 -86975 -39381 -40007 -9571 -32705 -92223 -129348 -54373 8671 36876
5635 36876 69243 68514 39617 -1784 14202 55955 72108 114720 107404 43787 -16285 -62227
5623 -62227 -15645 -9888 -56069 -57303 -47724 11747 49441 25424 34636 79047 76054 90429 60415
5610 60415 70875 33385 15791 29982 -93 6718 -216 -69218 -47715 -11091 -34560 30597
5598 30597 39281 3417 7245 26523 -67818 -132266 -42094 -77829 -74645 -46863 -39608 -486 -14261
5585 -14261 -73286 -22542 8734 -15077 -78228 -128763 -182085 -98939 -29733 -46062 -81466 -59269
5573 -59269 -69940 -43364 -11496 -13229 20860 28183 -12576 -3542 -21509 -538 4083 -50886 -107849
5560 -107849 -79681 4849 -7183 -51017 4404 -4054 -41568 -57299 -5043 42297 37042 42716
5548 42716 32168 4794 26363 14792 16522 34031 -2509 -50551 -72428 -56867 -15026 -4817
5536 -4817 5140 42072 32615 -71004 -136372 -151290 -165504 -121542 -67821 -10455 -23826 -21503
5524 -21503 -50518 -90383 -137570 -172921 -161843 -154656 -32362 -29004 -18922 17802 18519 18753 -4529
5511 -4529 -59581 44696 102429 101646 115189 124577 156916 117011 106534 98219 78424 -27854
5499 -27854 -94622 -55799 -32886 26486 9691 -33413 -20889 40542 72598 47031 38061 38621
5487 38621 5357 -53518 -8095 30164 59196 71590 14929 28386 34735 -16660 -78092 -31286
5475 -31286 15045 29356 26671 -35610 -76803 -105826 -102614 -10866 -63715 -155670 -150848 -93993
5463 -93993 12152 895 -41018 -42081 -3456 15045 -53207 -47618 -10070 -60050 -38845 -5124
5451 -5124 29832 -14166 -52522 -17349 -7522 29811 109497 152600 87973 21943 -21015 -14965
5439 -14965 -9801 52871 90675 88592 23058 -26246 -32889 -66943 -81689 -94964 -111402 -102192 -71085
5426 -71085 -55437 -8008 12006 36492 74109 11762 -46845 -27679 80379 16487 -129668
5415 -129668 -82126 -65097 -109005 -55540 -55578 -74798 -13152 33947 -29501 -53795 -48984 -42095 -28425
5402 -28425 4802 34434 -27679 -43326 -13072 -11037 -21729 -22240 -25948 17670 -43574 -48678 -5680
5389 -5680 5032 -6714 10734 56671 66042 20462 -18452 7191 -3181 12888 45142 36807
5377 36807 67713 49854 33040 -19913 4385 367 -17432 -63371 -51364 -58732 -60009 -20627
5365 -20627 -38705 7064 23302 5093 -42812 16587 20462 31145 49209 36277 39185 -4330
5353 -4330 -61817 -52018 -29038 9629 28634 58438 70740 39038 -7979 -9610 2769 19067
5341 19067 -37080 -9875 87234 42343 48292 51142 37139 47234 16873 -33097 -73863 -83087
5329 -83087 4787 40683 -18209 -9857 43336 125848 114282 66826 1253 -72371 -95376 -90324
5317 -90324 -94357 -148507 -90303 -54761 -47960 12506 46721 82373 21356 -1341 3483 12965 20727
5304 20727 15612 45889 77531 67961 85346 34173 -26320 -24737 6456 17078 53559 32360
5292 32360 31883 50025 117224 54963 -3940 3369 -67874 -86949 18153 14988 2687 40754
5280 40754 5868 8814 -15835 -53652 -5717 18150 13927 -16586 7095 -22097 10369 72578
5268 72578 66137 6357 -7074 9557 57423 -182 -60465 -100374 -115744 -73270 -70962 -89101
5256 -89101 -103967 -80866 -35221 -43939 -11287 36019 37199 65130 121715 87248 41203 10385
5244 10385 -9571 -42568 -26358 27879 18864 29015 24438 -49504 -50409 -10442 27489 54587 52884
5231 52884 25848 -19332 3469 -30686 -38291 -26921 -30626 -48411 -62753 -37994 10013 5265
5219 5265 -62913 -60705 -52578 -56690 -38343 -12382 1120 -35297 43260 104719 135846 147857 101954
5206 101954 59078 23395 14686 53586 93040 70222 94563 113807 124289 73798 -8873 -53542
5194 -53542 -108465 -59465 -19081 4751 16885 64490 67512 11715 -56051 -68122 -65324 -33122
5182 -33122 -29129 -68228 -84441 9313 12291 45844 55815 77079 55904 -18400 -61404 10761
5170 10761 81427 95167 112862 86306 -8557 36251 113218 114789 93655 52029 -52205 -64388
5158 -64388 -13438 44260 66378 53127 5206 -19098 10813 75363 99336 88607 96413 115992
5146 115992 100208 47110 -20311 -40346 6374 63 12802 33623 6545 -13684 81836 131306
5134 131306 149983 132287 74000 61097 74489 21926 -13310 -43108 -20716 -41157 -33285 -7073
5122 -7073 -38877 -22726 -10522 -24593 -49838 -82986 -30400 47871 39285 38440 25566 44967 226
5109 226 -130750 -172769 -192800 -154790 4290 5122 -42937 -83449 12963 94328 124876 101597
5097 101597 54958 -10077 -33005 -26022 -43805 -99030 -124429 -98192 -49379 -68833 -81036 -63579
5085 -63579 -100206 -74656 35797 83570 14488 -62780 -65253 -44064 -54206 -92450 -95022 -129131
5073 -129131 -113164 -61694 -50474 -26268 8263 41293 29057 -31987 1888 22347 -36249 -69819
5061 -69819 -40965 -14694 28605 1350 -5355 7168 27459 21517 -7147 -40801 1029 4127
5049 4127 -42441 -73772 -70633 -18327 -259 22657 48309 31384 84061 52812 -23871 -57062
5037 -57062 -63987 -41427 5868 31430 23623 -21663 -30636 -16432 -67423 -61614 -80690 -70008 8098
5024 8098 40766 29619 -9539 -14045 8960 66505 84695 47648 9697 42123 2685 -28664
5012 -28664 16360 -10031 -6094 39429 12886 -35709 -78945 -60699 -39644 -11676 -17718 -35171
5000 -35171 -41073 -64140 -39899 7957 15840 36302 24384 81045 106429 79534 69550 43490
4988 43490 67225 60239 6479 -46472 -36596 72985 134123 90504 68720 31700 33635 62155
4976 62155 104695 80888 68961 107326 43858 3998 -528 -25500 -37270 -35624 -84508 -52407
4964 -52407 -95734 -46109 65653 99110 82911 27847 -7061 -43645 -63553 -52199 -63185 -61910
4952 -61910 -40153 30083 26941 38363 2307 -2665 -41386 -62587 -8508 -37518 -61757 -35582
4940 -35582 -67403 -39305 -10797 15475 -7494 -78131 -82099 -22302 48807 11786 -20433 -26718
4928 -26718 10757 43897 64025 -5643 10913 -8960 -17506 51572 75988 78786 100260 72689
4916 72689 29431 15154 22254 -1843 -48502 -154499 -158476 -105773 -32055 -16437 -8491 51633
4904 51633 39385 41612 24684 -44551 -125202 -105532 -41902 35165 49932 44264 12472 34782
4892 34782 95801 79668 18510 -46419 -51307 -60546 -19903 21000 19000 19057 54996 80256 36493
4879 36493 24272 10819 3270 52428 -4340 -12107 44418 46558 -11673 -18553 -58304 -65290 -34388
4866 -34388 -38618 -79339 -76037 -176889 -207694 -153098 -62254 -54591 -65128 -94562 -74430 -47348
4854 -47348 -29448 -6163 37092 80548 94871 61931 32820 -29221 -63515 -35393 -33224 -35527
4842 -35527 -9474 -16653 -13195 -18832 -19473 -6759 25156 49343 26279 -6617 -52182 -14083 15878
4829 15878 45690 50905 48021 39135 9369 -32888 -90381 -95759 7852 96673 100942 -1150
4817 -1150 -51889 -49135 -35704 -94602 -102392 -65945 -17266 -8001 -30981 -50631 -32519 -28405 -24041
4804 -24041 45154 40047 85293 122269 92900 36891 6326 -40260 29638 90514 63238 105107
4792 105107 63040 107377 99712 63887 44410 33745 46509 59227 80642 63851 -12828 -11885
4780 -11885 25252 -10001 -49222 2296 -24983 -69082 -68593 -67235 -25892 -34115 -47156 -46456 7721
4767 7721 48611 75198 76896 16757 -527 19093 8428 3359 45765 49484 5689 -8333 -35378
4754 -35378 -107134 -114860 -108124 -88424 -96898 -67426 -56589 -81667 -118132 -112121 -85486 -99082 -123701
4741 -123701 -110399 -51511 40900 55633 75332 84603 100315 -4124 -106179 -104502 -21030 5611
4729 5611 30904 24898 -27066 -31430 -23619 -29435 -42853 -31672 -27367 -87961 -98040 -72812 -21736
4716 -21736 -51695 -56031 -47615 -2386 47335 -16859 -23965 8773 62867 53791 -14058 -46687 -16917
4703 -16917 41437 106422 129404 138742 78154 64326 75169 -10382 9696 75394 42416 -34380
4691 -34380 -92710 -90531 -27451 7137 -39221 3400 25404 74524 28695 19698 45951 29218
4679 29218 50783 68107 39493 12024 42296 111504 95258 31321 -53979 -79673 24461 43568
4667 43568 39961 100970 69799 24969 11345 -19677 -36138 -14924 -12536 1039 -7490 -12316 22665
4654 22665 24983 48049 10725 -48828 -32295 -43561 -70804 -33080 30383 46119 44068 33724
4642 33724 12060 -27552 32573 95996 98953 -3883 -42107 -61810 -32844 -25506 -22285 -57052
4630 -57052 -73599 -88253 -81944 -90587 -53865 -38046 -51913 18728 8287 16056 16606 -37575 -75195
4617 -75195 -72870 -41902 -10066 -29213 -59976 -10907 -20476 755 52051 16049 -7413 -55991
4605 -55991 -74262 -84931 -70259 -98140 -42773 -4341 25584 99837 66573 -7869 -12722 21673
4593 21673 -42625 -1642 25589 11334 -2183 40046 -17926 -44504 -74673 -59851 -69237 -39858
4581 -39858 -34436 -79303 -98440 -96342 -59900 -9661 78493 82117 81387 48212 38209 72579 47351
4568 47351 8808 9015 -17480 -32932 -72093 -87311 -31342 88777 81026 52840 31674 48346
4556 48346 89573 129314 61888 38926 59313 79528 30617 -10364 26564 25772 49226 39491
4544 39491 47734 93978 86518 37332 -22889 -58816 -83876 -38761 16510 22277 -4904 -18895
4532 -18895 -4133 -5664 11804 -45610 -38598 -4839 -3931 -22116 -7793 -50067 -90422 -74475 -42483
4519 -42483 -14455 -47519 -1216 34078 13512 -6699 -36370 -23788 42683 95313 72298 68506
4507 68506 95826 70653 28215 32283 30873 -4907 -60122 -56338 -7993 -36740 -37202 -15824 45478
4494 45478 62866 50026 13654 -22141 -48748 -67302 -2800 71588 6707 -54268 -34661 -15067
4482 -15067 -42256 -6476 -9371 -16462 -7024 22604 -1980 -38439 -41222 -69718 -60970 -60624 -7195
4469 -7195 37343 18810 44504 64268 79518 47408 -646 -15530 -30680 -74400 -104867 -88188
4457 -88188 -50531 -16132 -8091 -45989 -45246 -37204 -23078 -20277 -6923 26632 65183 71803 59773
4444 59773 17153 -41446 -21929 -35002 -26459 -41762 -48880 -78928 -99510 -71616 -105839 -119433
4432 -119433 -47032 -8987 -1679 -24733 5257 28007 51576 44429 35116 47875 110640 123130
4420 123130 109172 14207 -14449 -9383 -37941 -22300 -35221 -51163 -48615 -21393 65821 54341
4408 54341 49787 30523 1437 62673 109547 121992 144380 86830 28881 -27881 6046 24000
4396 24000 7697 33425 8262 -34913 -6239 18981 82513 122330 110946 84132 24373 -7316
4384 -7316 -14789 -53906 -104935 -100196 -94764 -77478 -34882 -9275 11826 12052 -10561 19370 49728
$$ [...]
##END NTUPLES=NMR SPECTRUM
##END=
