##TITLE=Analysis number 324142
Compound Code km 02778
Book Reference 1
Project Code adrs
Chemist Name andys
##JCAMPDX= 6.0         $$ Bruker NMR JCAMP-DX V2.0
##DATA TYPE= NMR SPECTRUM
##DATA CLASS= NTUPLES
##ORIGIN= Bruker BioSpin GmbH
##OWNER= nmr
$$ XWIN-NMR		Version 3.5
$$ Wed Nov 15 09:44:53 2006 GMT Standard Time (UT+0h)  MAYBRIDGE\nmr@NMR_250MHZ
##.OBSERVE FREQUENCY= 250.131544655141
##.OBSERVE NUCLEUS= ^1H
##.ACQUISITION MODE= SIMULTANEOUS (DQD)
##.ACQUISITION SCHEME= undefined
##.AVERAGES= 16
##.DIGITISER RES= 18
##SPECTROMETER/DATA SYSTEM= dpx250
##.PULSE SEQUENCE= zg30
##.SOLVENT NAME= CDCl3
##.SHIFT REFERENCE= (INTERNAL, CDCl3, 0, 16.522)
##AUDIT TRAIL= $$ (NUMBER, WHEN, WHO, WHERE, WHAT)
$$ ##TITLE= Audit trail, XWIN-NMR		Version 3.5
$$ ##JCAMPDX= 5.01
$$ ##ORIGIN= Bruker BioSpin GmbH
$$ ##OWNER= nmr
$$ C:\u/data/dgb/nmr/ADRS/390/pdata/1/auditp.txt
$$ ##AUDIT TRAIL=  $$ (NUMBER, WHEN, WHO, WHERE, WHAT)
(   1,<2006-11-15 09:44:23.97 +000>,<MAYBRIDGE\nmr>,<NMR_250MHZ>,
      <created by zg, POWCHK disabled, PULCHK disabled
       configuration hash MD5:
       49 4B E0 1D 92 C2 6B 37 9F E6 65 BC 52 41 86 1D
       data hash MD5: 64K
       D7 AD 5C 29 23 18 C9 C9 12 37 8C 10 E0 14 1B BF>)
(   2,<2006-11-15 09:44:41.72 +000>,<MAYBRIDGE\nmr>,<NMR_250MHZ>,
      <Start of raw data processing
       ef LB = 0.3 FT_mod = 6 PKNL = 1 SI = 32K 
       data hash MD5: 32K
       DC DA 8C 8B 5F 8C CE DE 90 34 A9 64 E1 11 04 C5>)
(   3,<2006-11-15 09:44:43.67 +000>,<MAYBRIDGE\nmr>,<NMR_250MHZ>,
      <apk 
       data hash MD5: 32K
       D7 A1 8D 78 18 44 BA EF 8F 6E 98 BF EC 9A 10 70>)
(   4,<2006-11-15 09:44:44.42 +000>,<MAYBRIDGE\nmr>,<NMR_250MHZ>,
      <abs ABSG = 5 
       data hash MD5: 32K
       70 42 0D 86 5D 44 37 63 96 AA 71 0A 80 19 61 9E>)
$$ ##END=
$$ 
$$ hash MD5
$$ B3 33 3A 28 B3 3B 76 C4 16 BC B6 96 D2 85 CD B9
##$RELAX= 
##$RELAX= 
##$RELAX= 
##$RELAX= 
##$RELAX= 
##$RELAX= 
##$RELAX= 
$$ Bruker specific parameters
$$ --------------------------
##$DU= <C:\u>
##$EXPNO= 390
##$NAME= <ADRS>
##$PROCNO= 1
##$TYPE= <nmr>
##$USER= <dgb>
##$AMP= (0..31)
100 100 100 100 100 100 100 100 100 100 100 100 100 100 100 100 100 100 
100 100 100 100 100 100 100 100 100 100 100 100 100 100 
##$AQSEQ= 0
##$AQ_mod= 3
##$AUNM= <au_zg>
##$AUTOPOS= <4 >
##$BF1= 250.13
##$BF2= 250.13
##$BF3= 250.13
##$BF4= 250.13
##$BF5= 500.13
##$BF6= 500.13
##$BF7= 500.13
##$BF8= 500.13
##$BYTORDA= 1
##$CFDGTYP= 0
##$CFRGTYP= 5
##$CHEMSTR= <none>
##$CNST= (0..31)
1 1 145 1 1 1 1 1 1 1 1 1 1 1 1 1 1 1 1 1 1 1 1 1 1 1 1 1 1 1 1 1 
##$CPDPRG= <>
##$CPDPRG1= <>
##$CPDPRG2= <>
##$CPDPRG3= <>
##$CPDPRG4= <mlev>
##$CPDPRG5= <mlev>
##$CPDPRG6= <mlev>
##$CPDPRG7= <mlev>
##$CPDPRG8= <mlev>
##$CPDPRGB= <>
##$CPDPRGT= <>
##$D= (0..31)
0 1 0 0 0 0 0 0 0 0.06 0 0 0 0 0 0 0.0002 0 0 0 0 0 0 0 0 0 0 0 0 0 0 
0 
##$DATE= 1163583862
##$DBL= (0..7)
120 120 120 120 120 120 120 120 
##$DBP= (0..7)
150 150 150 150 150 150 150 150 
##$DBP07= 0
##$DBPNAM0= <>
##$DBPNAM1= <>
##$DBPNAM2= <>
$$ [...]
##$SUBNAM7= <"">
##$SUBNAM8= <"">
##$SUBNAM9= <"">
##$SW= 20.6930455092707
##$SWIBOX= (0..15)
0 0 3 0 0 0 0 0 0 0 0 0 0 0 0 0 
##$SW_h= 5175.983436853
##$TD= 65536
##$TD0= 1
##$TE= 683.16
##$TE2= 300
##$TE3= 300
##$TEG= 300
##$TL= (0..7)
0 120 120 120 120 120 120 120 
##$TP= (0..7)
150 150 150 150 150 150 150 150 
##$TP07= 0
##$TPNAME0= <>
##$TPNAME1= <>
##$TPNAME2= <>
##$TPNAME3= <>
##$TPNAME4= <>
##$TPNAME5= <>
##$TPNAME6= <>
##$TPNAME7= <>
##$TPOAL= (0..7)
0.5 0.5 0.5 0.5 0.5 0.5 0.5 0.5 
##$TPOFFS= (0..7)
0 0 0 0 0 0 0 0 
##$TUNHIN= 0
##$TUNHOUT= 0
##$TUNXOUT= 0
##$USERA1= <user>
##$USERA2= <user>
##$USERA3= <user>
##$USERA4= <user>
##$USERA5= <user>
##$V9= 5
##$VALIST= <valist>
##$VCLIST= <CCCCCCCCCCCCCCC>
##$VD= 0
##$VDLIST= <DDDDDDDDDDDDDDD>
##$VPLIST= <PPPPPPPPPPPPPPP>
##$VTLIST= <TTTTTTTTTTTTTTT>
##$WBST= 1024
##$WBSW= 4
##$XGAIN= (0..3)
0 0 0 0 
##$XL= 0
##$YL= 0
##$YMAX_a= 415953
##$YMIN_a= -358446
##$ZGOPTNS= <>
##$ZL1= 120
##$ZL2= 120
##$ZL3= 120
##$ZL4= 120
##$ABSF1= 16.522
##$ABSF2= -4.171173
##$ABSG= 5
##$ABSL= 3
##$ALPHA= 0
##$AQORDER= 0
##$ASSFAC= 0
##$ASSFACI= 0
##$ASSFACX= 0
##$ASSWID= 0
##$AUNMP= <proc_1d>
##$AZFE= 0.1
##$AZFW= 0.1
##$BCFW= 0
##$BC_mod= 0
##$BYTORDP= 0
##$COROFFS= 0
##$CY= 12.5
##$DATMOD= 1
##$DC= 0
##$DFILT= <>
##$DTYPP= 0
##$F1P= 14.0000005364418
##$F2P= -0.99999901652339
##$FCOR= 0.5
##$FTSIZE= 32768
##$FT_mod= 6
##$GAMMA= 0
##$GB= 0
##$INTBC= 1
##$INTSCL= 1
##$ISEN= 128
##$LB= 0.3
##$LEV0= 0
##$LPBIN= 0
##$MAXI= 10000
##$MC2= 0
##$MEAN= 0
##$ME_mod= 0
##$MI= 0
##$NCOEF= 0
##$NC_proc= -4
##$NLEV= 6
##$NOISF1= 0
##$NOISF2= 0
##$NSP= 0
##$NTH_PI= 0
##$NZP= 0
##$OFFSET= 16.522
##$PC= 1
##$PHC0= -46.26676
##$PHC1= 9.721702
##$PH_mod= 1
##$PKNL= yes
##$PPARMOD= 0
##$PSCAL= 4
##$PSIGN= 0
##$REVERSE= no
##$SF= 250.13
##$SI= 32768
##$SIGF1= 0
##$SIGF2= 0
##$SINO= 400
##$SIOLD= 32768
##$SREGLST= <1H.CDCl3>
##$SSB= 0
##$STSI= 32768
##$STSR= 0
##$SW_p= 5175.98343685301
##$SYMM= 0
##$S_DEV= 0
##$TDeff= 65536
##$TDoff= 0
##$TI= <Analysis number 999999
Compound Code 99
Book Reference 9
Project Code 9>
##$TILT= no
##$TM1= 0
##$TM2= 0
##$TOPLEV= 0
##$USERP1= <user>
##$USERP2= <user>
##$USERP3= <user>
##$USERP4= <user>
##$USERP5= <user>
##$WDW= 1
##$XDIM= 32768
##$YMAX_p= 354077093
##$YMIN_p= -555844
$$ End of Bruker specific parameters
$$ ---------------------------------
##NTUPLES= NMR SPECTRUM
##VAR_NAME=  FREQUENCY,     SPECTRUM/REAL,   SPECTRUM/IMAG
##SYMBOL=    X,             R,               I
##VAR_TYPE=  INDEPENDENT,   DEPENDENT,       DEPENDENT
##VAR_FORM=  AFFN,          ASDF,            ASDF
##VAR_DIM=   32768,         32768,           32768
##UNITS=     HZ,            ARBITRARY UNITS, ARBITRARY UNITS
##FACTOR=    0.157963299565203, 1,           1
##FIRST=     4132.6476996994, 0,             0
##LAST=      -1043.33573715361, 0,           0
##MIN=       -1043.33573715361, -555844,     0
##MAX=       4132.6476996994, 354077093,     0
$$ Real data points
##PAGE= N=1
##DATA TABLE= (X++(R..R)), XYDATA
$$ [...]
18093F765080o76032m94414k91633l82930k91096j36708m26915l63941j11800
18084C589611j21229j32682l10351k49211m9079r6945l5917o8900j10913j46858
18074B267526j05751K8287J1720o9160j75598k51639j61054L0576p2698J68070
18064A670279J02921j09636k61855m1711q4710o7806o4622m8560l3856o2026Q738
18053A007156Q7266j06623p3780J32581j18333j71475l4408M5473p7254Q0802
18043G71405j9452l9744q5425q7796k04014k9130M2862N7304R7884K5892j34041
18032C95745L4370J4471j30309j43749N6262P6867k2074k3642K8377j31701r9488
18021E5129J44900J16427n6405l2194K217m1513l7910n5172m087M5467K9494P5745
$$ y = [6765080, 6089048, 5594634, 5303001, 4920071, 4628975, 4492267, 4065352, 3701411, 3589611, 3468382, 3335700, 3025349, 2776138, 2727059, 2630114, 2594197, 2525297, 2414384, 2267526, 2161775, 2190062, 2201782, 2132622, 1957024, 1705385, 1544331, 1574907, 1502209, 1670279, 1773200, 1663564, 1401709, 1359998, 1275288, 1207482, 1142860, 1094300, 1060444, 998418, 1007156, 1094422, 987799, 914019, 1046600, 928267, 756792, 722384, 767857, 690603, 771405, 751953, 712209, 626784, 538988, 334974, 305844, 348706, 406010, 503894, 529786, 395745, 430115, 444586, 314277, 170528, 226790, 303657, 281583, 257941, 286318, 154617, 55129, 200029, 316456, 260051, 227857, 230074, 188561, 150651, 95479, 91392, 136859, 166353, 242098]
18009B42098M5132J1211n7504q081L8894k9341l2995L2914O1416L0170j78792
17998A55122r0912n0891n1731M8733J87138M9685j01774o5576j7893M5179R23
17987A08003n6614J03462K1284J09517J33686k1717p4972J7822j3592j00324r4500
17976A32055J9420L0958j11605p0590J5921R548q181r135J26509J28422p403j5567
17964B40352l2785k0216j08926k5881q9720j37471M5081O2394M4948L8277O9473
17953H5526R0260k4106J15653O0817P166j5900n1782j96888k7191J3051K4282
17942H0888P7496m8654M3744P3358j57234k22014J7893L9517j2007P9073J20575
17931I2635M9786k4000R460J3679o6417j48173m722m3634K6279P0078L5054J6932
$$ y = [242098, 287230, 298441, 240937, 232856, 271750, 242409, 209414, 242328, 303744, 333914, 155122, 64210, 13319, -38412, 10321, 197459, 247144, 145370, 79794, 61901, 107080, 108003, 51389, 154851, 176135, 285652, 419338, 397621, 322649, 340471, 326879, 226555, 132055, 151475, 182433, 70828, 238, 16159, 25707, 17526, 8391, 134900, 263322, 255919, 240352, 207567, 187351, 78425, 52544, -37176, -174647, -129566, -67172, -22224, 16053, 85526, 175786, 151680, 267333, 328150, 335316, 319416, 267634, 70746, 43555, 56606, 80888, 158384, 109730, 153474, 226832, 69598, -152416, -134523, -95006, -107013, -27940, 92635, 142421, 118421, 127881, 141560, 75143, -73030, -77752, -121386, -95107, -25029, 10025, 26957]
17919B6957L7277J06396N3574m6496Q9763o3727n3044L8858r7378r3138n1174
17908e2132j9574m7222p5806Q4120P4359j15554J07929J68037j3796K8339r6573
17897D2127j66873j34327J58293J54518N4597n3064k8464m2083k7621J20781L9163
17886A17047j82372q3722p4722J62265J26334j6586q0999O9162O5088k4171n0533
17875B6791j22542j50586n5177J46002K69705K5818l2095k3961o0206O5249N7819
17864A46817J5604r0612L8103N7526r4162q5043q5479j2205O3220J20723n0968
17853B3524L6216O766r3929j20230R620K3122P6059K4764l140l7106o6590o6868
17841a87792P9919J7224k7643J75650L7268k0560O080j38140j58505p8318M5975
$$ y = [26957, 64234, 170630, 224204, 177708, 267471, 203744, 150700, 189558, 92180, -958, -52132, -71706, -118928, -194734, -110614, -36255, -151809, -43880, 124157, 110361, 138700, 42127, -124746, -259073, -100780, 53738, 108335, 55271, 26807, -15276, -42897, 77884, 117047, -65325, -149047, -223769, -61504, 64830, 48244, -32755, 36407, 101495, 77324, 26791, -95751, -246337, -301514, -155512, 114193, 140011, 107916, 83955, 23749, 88998, 146817, 162421, 71809, 109912, 167438, 73276, -11767, -97246, -109451, -46231, 74492, 23524, 59740, 66506, -27423, -147653, -138033, -114911, -38852, -14088, -17228, -54334, -120924, -187792, -107873, -90649, -118292, 57358, 94626, 74066, 80146, -57994, -216499, -294817, -248842]
17830b48842J58859k9798j10644Q2263m7136j03738M5714O3675n021l4686O9833
17819a59521J53991R1001j3586p8122l1119N1260J0284q2492J0466p4834j30871
17808b53543M131o6200O1780J20490n8410n8850j7821j54324M9659q727J44736
17797b37079J90926l2092K9025k2834J13511j03088q4029N996M0980R4224L184
17786a276J02962O8285o2657j98191j61041J20526P7493O5306o7061j8746J26790
17775E2390K5901J4159M1748M7607m5055j47427j19984O7783Q7857O3161m3748
17764D4392j59554p4979J53044O0495o9749j07996Q8883M1621j2286j81590J1800
17753b05919K7831K4841N0313o2422J2807L3824K9889Q5451k1368J69384o0280
$$ y = [-248842, -89983, -119781, -230425, -148162, -195298, -299036, -253322, -189647, -194668, -229354, -159521, -5530, 85471, 71885, -6237, -37356, 13904, 24188, -58304, -47838, -122672, -253543, -249412, -315612, -253832, -133342, -191752, -250602, -268423, -422747, -373088, -381815, -237079, -46153, -78245, -49220, -72054, 41457, -61631, -145660, -139664, -98684, -4460, -1276, 101686, 169971, 107314, -90877, -251918, -131392, -53899, 11407, -55654, -74400, 52390, 78291, 92450, 134198, 181805, 136750, -10677, -130661, -62878, 24979, 88140, 44392, -115162, -190141, -37097, 23398, -46351, -154347, -65464, -23843, -36129, -217719, -205919, -178088, -153247, -102934, -165356, -152549, -118725, -88836, -3385, -24753, 144631, 84351]
17742H4351j27585l7531Q2402M6114N5760m5459P2939j34572j27139J04180o6887
17731i3427k8959L9309Q6144l0712N4292N6303j34776q4726p4234l2207M1744
17720b01249J03158o3260n5465o4841O5150M3868P0158k7034M6673J14573M9728
17709H1459N8034Q9639J3601j39688p5928j71051j81905N3638K6788r6616k3906
17698c65935J34850P539j33947o9550R6123O8395l4882R6020K5270P0871N2343
17687e2903r2998j19919Q2792J68123N783l9427l1967r8181j57998J15707J66482
17676e4506M5605Q6845J32129l9301N4239j82977j4185P5007j44095l342O0911
17665A6330n3141j02159M3506J07954R6027m3599j0143j02536J54816J98155J24889
$$ y = [84351, -43234, -80765, 1637, 47751, 103511, 58052, 130991, -3581, -130720, -26540, -93427, -122386, -83077, 3067, -27645, 26647, 82950, -51826, -136552, -210786, -242993, -201249, -98091, -161351, -216816, -281657, -216507, -172639, -102481, -129515, -82842, 31731, 81459, 139493, 229132, 242733, 103045, 27117, -143934, -325839, -272201, -245413, -342029, -365935, -231085, -223546, -357493, -427043, -330920, -262525, -297407, -201387, -176117, -105246, -52903, -145901, -265820, -183028, -14905, -9122, -48549, -80516, -178697, -336695, -220988, -54506, -8901, 77944, 210073, 170772, 225011, 42034, 27849, 102856, -41239, -44581, 16330, -36811, -138970, -95464, 12490, 108517, 64918, 54775, -47761, 107055, 305210, 430099]
17654D30099o5597l2157R1368P4658o6988K2365k7164K2862R2749q1531j05977
17643C54687P3020R1384j05324l1441k7865L3309J06878k6250j73356m5324q5288
17632A64430j10189J2935L4520o8126o5905J35333Q0898l2778J1177J19279m1034
17621B40540o7061j11601M2400p272n1782k2761o6571n6676L9344P4857N763K8540
17609D7720J18510J27866n0795j59077j64491j32510j22241J1734O7613J01102
17599a54569Q5307N5171j48537m0000N7176L9931L8948l1290J67945J9493p0946
17588A8629J6048p3971J9081J21850o8509O1120l6048p4068j03698j59618J00238
17577a78946Q7228L9971k9197q6171n3233l0986J6094n3514K08216N2314o311
$$ y = [430099, 364502, 332345, 423713, 498371, 431383, 453748, 426584, 449446, 542195, 460664, 354687, 427707, 519091, 413767, 382326, 354461, 387770, 494648, 468398, 295042, 249718, 164430, 54241, 67176, 101696, 33570, -32335, 102998, 183896, 151118, 162295, 281574, 240540, 173479, 61878, 104278, 97006, 45224, 22463, -44108, -100784, -61440, 13417, 19180, 47720, 166230, 294096, 243301, 84224, -80267, -212777, -335018, -323284, -255671, -154569, -69262, -14091, -162628, -202628, -145452, -105521, -66573, -97863, 70082, 89575, 18629, 34677, -39294, -20213, 101637, 33128, 94248, 58200, -15868, -119566, -279184, -178946, -91718, -51747, -80944, -167115, -220348, -251334, -235240, -288754, -80538, -28224, -34535]
17566c4535N2810j0279J13549M203q4010j21419l0879J17406p0793l5669L1011
17555f8605q0312o1191j9943N3629J78022M8293j2440N4285Q0196L523j79308
17544c851j21555M6839J11886p0307r701L3516p4473j48980l0628p6309P2795
17533b70768J45685J9564Q1421J79434j4845l36547k28150o682R4009J06273J03531
17522a27075L4193M516K42638J35503j82909q5619m1016j01339M190j02599K7902
17511a91615J16712J15117o7378l3186N6872J01264k0640O685l2968j01056q1691
17500a31884l3222J14128j80035j50219K9728J22009r9307M4837p6888K9773K4417
17489c06663J69907J7783q2814Q7021q885m9627q9767k6041J74281J35704k5939
$$ y = [-34535, 18275, 7996, 121545, 125748, 41738, -79681, -110560, 6846, -63947, -99616, -68605, -148917, -210108, -230051, -176422, 1600, 49893, 37453, 91738, 171934, 175457, -3851, -125406, -78567, 33319, -36988, -46689, -13173, -87646, -236626, -267254, -343563, -270768, -125083, -105519, -24098, 155336, 140491, -196056, -424206, -430888, -336879, -230606, -127075, -92882, -88366, 154272, 289775, 106866, 21247, -19769, -121108, -116918, -219517, -191615, -74903, 40214, -27164, -60350, -3478, 97786, 77146, 83831, 50863, -50193, -131884, -165106, -50978, -231013, -381232, -351504, -229495, -328802, -283965, -360853, -331080, -306663, -136756, -118973, -201787, -114766, -123651, -173278, -263045, -289086, -114805, 20899, -5040]
17478e040o55m6184L040J04953k9767k5126n7214l6322J8395Q4929r8947l2917
17466a20855q0654J3849Q9148O204q0104N1364R9720N6851l2385n0618L2541J39679
17454A24740l9116p6262j24261k6945J17536K9093p1666J23010K77273K79549
17444F12951K86875K06286O3833l27152l71936k65792l3226J2149m7351j11376
17434B5261o3697O7735J6164O3084L4500j17087k8664j09462O7047P9080p0110
17423c6149J67262O7201J5146o2507j82554J678J30377m0706j9645q5151L0773
17412a4275O147m4701j7919l9202k0408J40N8015Q5474J00343j56693O0617O8035
17400H5573j77363j66373J00521M5433q8171O4024J43996n6841j23983K2821N3333
$$ y = [-5040, -5695, -51879, -48839, 56114, 26347, 1221, -55993, -92315, -73920, 11009, -87938, -120855, -201509, -187660, -98512, -92308, -172412, -121048, -21328, 35523, 3138, -47480, -14939, 124740, 85624, 9362, -114899, -141844, -24308, 4785, -66881, 56129, 333402, 612951, 899826, 1106112, 1169945, 842793, 470857, 205065, 171839, 183988, 136637, 25261, -38436, 29299, 45463, 108547, 143047, 25960, -2704, -112166, -45119, 33961, -36149, 131113, 198314, 213460, 150953, -31601, -29923, 100454, 59748, 40103, -45048, -14275, -8128, -52829, -70748, -109950, -130358, -130218, -72203, 13271, 113614, -43079, 17538, 85573, -91790, -258163, -157642, -112209, -200380, -136356, 7640, -49201, -173184, -150363, -97030]
17389i7030j10024L0304K6963j7832n022K3583L7610O9392p2931n6578N6597J3835
17377a01133N7351N3716p5649q1423K3701J11966Q6629k1211p3341J2087j7590
17366b4897j34752J15865J08399l8145p6841L0646k8684L1530L644n156N2574
17355C4183j08996j61248k8108M2648J80682k1256j34580j17624N4577O2128K6674
17344a70920j4558N702J37419p0573R4016Q4291k67105k9795K3491J25360q7662
17333a70334k1828l7020O0094J17596l1156p6510P0126P7670M4782M0710j01650
17322b7520n390R536q3125q3715l1427M473j4433r313P3877p637k3050L6302o6456
17309b27878n2124O2540R0978n1849j76360J6559Q2818J87592J16364r4877j20799
$$ y = [-97030, -207054, -176750, -149787, -167619, -172641, -149058, -111448, -42056, -114987, -171565, -114968, -101133, -43782, 9934, -65715, -147138, -123437, -11471, 75158, 53947, -19394, -7307, -24897, -159649, -43784, 64615, 26470, -50371, -19725, -48409, -16879, -13235, -18391, 34183, -74813, -236061, -264169, -221521, -40839, -62095, -196675, -314299, -259722, -197594, -170920, -185478, -179776, -42357, -112930, -18914, 65377, -201728, -231523, -208032, -82672, -170334, -192162, -229182, -169088, -51492, -82648, -159158, -89032, -11362, 33420, 74130, -27520, -32910, -23374, -106499, -190214, -221641, -217168, -231601, -240914, -167037, -174674, -197724, -161422, -227878, -280002, -217462, -126484, -178333, -354693, -338134, -255316, -67724, 48640, -46237, -167036]
17298a67036o4692L3135Q0155L0464j01398r8893l8359N0134J51868O5917l4440
17287i3145r621O4627o2489j6862J66605Q6640k3029r0395m4236n3864O1922Q0669
17275F6822P0617k65j81707J14466j0630j14187j92201k8069R5189J07099M0866
17264c2000R4344J36893j64737q188M9693o7412n7395m339p7153K3464K4205K1914
17252f0711L4485j14823p1340m2118J7868Q2227j4209M5385J04692M1413P873
17241C0742j6130K400j9475R5928q64j21791k26080k3188L6478Q4313L7879n5035
17229a74823k0357k1896J2782K1702q2050O9418Q4187J28408n2029Q2719K69950
17218C18011Q3271o3003q2496Q6501J06266r5256q7767j70313K5963j5406p6846
$$ y = [-167036, -231728, -198593, -118438, -87974, -189372, -288265, -326624, -276490, -124622, -58705, -93145, -102766, -38139, -100628, -117490, 49115, 135755, 112726, 22331, -21905, -75769, -13847, 66822, 137439, 137174, -44533, 69933, 59303, -54884, -247085, -275154, -179965, -72866, -32000, 62344, 199237, 34500, 26312, 76005, 8593, -48802, -53141, -130294, -106830, -82625, -60711, -26226, -141049, -212389, -254507, -236639, -154412, -168621, -123236, -18544, 22869, 30742, 14612, 17012, -2463, 93465, 92601, -29190, -255270, -278458, -241980, -157667, -119788, -174823, -195180, -217076, -204294, -182592, -264642, -195224, -111037, 17371, -34658, 48061, 318011, 401282, 338279, 255783, 342284, 448550, 353294, 265527, 95214, 121177, 105771, 28925]
17207B8925q02J45592Q5499J5708J3193K1503j07285k1551m5182m7930J38652
17196B26322J7501j30242O7205Q6923n9041M5915j85084j98649L4077M1089M7948
17185f036K00311K3201m44M9456m5333J3031J66363R8065n2071j54327p8475j8120
17173A95621J82588J11767l4566l9008l5829r2272m5348j26718j55334m4069m2262
17162a25430P8737L1851J70501Q5901o5873n266N5131L0573Q3942o2499q59j3906
17150B62803n7086P8678Q8973j19856k28618Q0195o3099p3003k6951M651P2784
17139A9471Q2804o2661j42142P119N7473r653N9609q8209o8853k6062n833J9611
17127a57326J05167N7019J0344J02327K8528j93122J9727M2654j55148m4912Q6129
$$ y = [28925, 28123, 173715, 259214, 274922, 288115, 309618, 202333, 180782, 135600, 87670, 226322, 243823, 113581, 180786, 267709, 208668, 254583, 69499, -129150, -95073, -53984, -6036, 194275, 217476, 217032, 266488, 221155, 234186, 400549, 498614, 446543, 292216, 213741, 195621, 378209, 489976, 455410, 416402, 380573, 288301, 242953, 116235, -39099, -83168, -125430, -46693, -14842, 155659, 241560, 175687, 170421, 225552, 256125, 340067, 277568, 276709, 262803, 205717, 284395, 373368, 253512, 24894, 105089, 41990, -31013, -57964, -53313, 19471, 102275, 39614, -102528, -95409, -37936, -47589, 12020, -76189, -145042, -171104, -176937, -157326, -52159, 4860, 15204, 117531, 146059, -47063, -27336, 15318, -139830, -184742, -98613]
17116i8613o8383Q390J93725j33124J6374N049o7127j01396Q7743o8179K3614
17105b01927M8533N1778l6599P709J04161L3467N9516n8716k2470K6314q3629
17094g1863j9330M0836n5216n7086M1684q66O213j708o2908N4737K37245O4532
17082A76270o0187K6976o9339j979L5338m1465j55263K3623J83032K56m8046j55238
17070h6022r0003R168o2614N5811k283j2923R8483J01624m9316m2097P3466K4751
17058A8045j34842p0211P9439m0927j2397J1117p6530K8494J65942k9964k05287
17047b67121O4328L7015l8542o501J07991J60762J35761m3028j21951j46846n0321
17036a68453N9045K5138l6193r3180J33998O3015m163l5198J9302P0744n3803
$$ y = [-98613, -166996, -158606, 35119, -98005, -81631, -76582, -143709, -245105, -157362, -225541, -201927, -153394, -101616, -138215, -130506, -26345, 7122, 66638, 7922, -14548, 11766, -71863, -91193, -50357, -105573, -162659, -120975, -121841, -115628, -117336, -180244, -125507, 111738, 176270, 116083, 143059, 73720, 71741, 107079, 65614, -89649, -66026, 117006, 117262, 69216, -86022, -176025, -166857, -229471, -173660, -175943, -188866, -90383, 11241, -38075, -80172, -6706, 18045, -116797, -187008, -107569, -148496, -160893, -149776, -226306, -197812, -31870, -61834, -267121, -202793, -165778, -204320, -210821, -102830, 57932, 193693, 150665, 28714, -118132, -168453, -109408, -84270, -120463, -213643, -79645, -16630, -20793, -55991, -36689, 34055, -19748]
17025a9748j0712J08926l313q914n2458q9312M836o4714m1833P9657K09228j0183
17013A01460P599k377J8479p2260K7161O0926k8192n7799N9022k0141l7552l8417
17001A7909n6853m7696R3068K9478j60776m0609j13643Q8822J03205Q6607J2898
16990A2410r8387j28018q0509L5418K4484K1026l2678J18253O8783M4478l7253
16979e1993j07657P2208J05088K4202l3147M4401k3515L423Q7329j02443o5885
16968d7989P0900p2753j44278m6336p6114K1033J49579J31113j11244n112l3799
16957a65000J0896j902k7377O2790K6105J74248O9397O8677k38975j92495l7744
16946b51380J28033k268m1198K028k0283J6751J50891J44133m5411m6775j60190
$$ y = [-19748, -30460, 78466, 75153, 66239, 13781, -75531, -70695, -135409, -177242, -97585, 111643, 101460, 109059, 106682, 125161, 52901, 80062, 140988, 112796, 54997, 114019, 93878, 56326, 17909, -38944, -86640, 6428, 35906, -124870, -165479, -279122, -190300, -87095, -488, 12410, -85977, -213995, -294504, -259086, -234602, -213576, -246254, -128001, -59218, -14740, -51993, -159650, -87442, 17646, 41848, 8701, 53102, 29587, 33010, 120339, 17896, -47989, 22911, -49842, -194120, -240456, -316570, -295537, -145958, -14845, -126089, -131201, -165000, -154104, -156006, -183383, -120593, -94488, 79760, 149157, 217834, -21141, -213636, -251380, -123347, -125615, -166813, -164785, -185068, -168317, -17426, 126707, 81296, 34521, -125669]
16935a25669M1613m4640j84775M2056K57856J50748k9139l9121K1674n4477m7186
16924a1060l5837Q1439J8306l8692p1222j02758p8992R0238J19215O6449K8100
16913F5186j23266o0217K5234Q1157l8665J3779l1675n3533o9920o0597J5983
16902b36534K24231J11775j65674k2403l6936P8333O4442j18958n6787k4344M2600
16891a40255J76773L5645J3755p7244j01755j10835O3508J17849j01148q7987
16881b11694N6576P4590J1268J12604q63j21517O6584j7902J8991j0341R1516
16870F9812M9763J120o88J16809Q5448j70241k5905n3988q9464j85731j05037
16859c08102L9853J15708J78293l8750K5556m6966M6572J35136P2962j00881j0535
$$ y = [-125669, -84056, -128696, -313471, -271415, -13559, 137189, 108050, 68929, 90603, 36126, -11060, -46897, 34542, 52848, 14156, -57066, -159824, -238816, -148578, -29363, 37086, 65186, -58080, -118297, -93063, -11906, -50571, -36792, -68467, -122000, -191920, -252517, -236534, -12303, 99472, -66202, -88605, -125541, -47208, 17234, -101724, -158511, -182855, -140255, 36518, 72163, 85918, 8674, -93081, -203916, -140408, -22559, -123707, -211694, -155118, -80528, -69260, 43344, 42481, -79036, -12452, -30354, -11363, -21704, 69812, 119575, 120695, 120007, 236816, 322264, 152023, 126118, 72130, -17334, -203065, -308102, -268249, -152541, 25752, -12998, 12558, -34408, 12164, 147300, 220262, 119381, 108846]
16848A08846q5842j38953N682J21716L8626k6057P9503K77j04037l2428J5263
16837a7404j09215N8512J64371J37020j10527n4897q7750n666P3663L7383j9283
16826F6207K4326K2345j12950l0879R4679M4057m2274m8895j23315r7142J45818
16815e8023j4969p3867p0262J315L6185P6984J31720Q7528L3418K1766j20422
16804E1373j19956J6053P7207Q8448K9965J4968r7773m8532R4936n2952Q459N7463
16792A19659Q2325r8264o4201J6940l6383r0077O5856O4879K8915L3201m4608
16781G8242j7451l8608J23710q178j6599P6696j6347l3384m7441J44072J14413
16770C59125o7665l2932k2378n484p4359O4276n8827N250J8426N35P3976j28093
$$ y = [108846, 23004, -115949, -110267, 11449, 50075, 24018, 103521, 103798, -239, -32667, -17404, -126619, -68107, 96264, 233284, 122757, 67860, -19890, -25556, 48107, 85490, 66207, 90533, 112878, -72, -30951, 63728, 107785, 65511, 16616, -106699, -203841, -58023, -72992, -146859, -217121, -215806, -179621, -102637, 29083, 116611, 150029, 171795, 51373, -68583, -52530, 24677, 113125, 143090, 158058, 60285, 11753, 106689, 53737, 62196, 119659, 201984, 103720, 39519, 56459, 20076, -70001, -4145, 60734, 89649, 122850, 78242, 60791, 22183, 145893, 137715, 121116, 197812, 181465, 148081, 100640, 244712, 359125, 291460, 258528, 236150, 230666, 156307, 220583, 161756, 167006, 185432, 185967, 259943, 131850]
16758A31850j55194N3631O8113J40964L2869j75771m7803o630m3568Q205R8036
16747A04702J09024l2235j57329J38650J38085j06497j04658l9042L321j31409
16737g7388r3702J32867J25093O7210R2803M0918n7586j70465n3822J04552J00269
16726B10749q4196j31818J2277J18950R581q7325m4113P1119J91672Q4436R5941
16715D47273j8407j39554r2282j3866P3975M8266k688p9071L9731q1693L5456
16704B17140J87022O1561m3442j0460R7873J4144O4767J78690J674R164J9102
16693G97235j9724J8651k8466l0067J29557J28676N3739N5860M3541J82784M7052
16682A378838J25965L23287J78674J21316K09106M18679N26706L88612N86758
$$ y = [131850, -23344, 30287, 98400, 239364, 272233, 96462, 48659, 42029, -1539, 6666, 104702, 213726, 181491, 24162, 162812, 300897, 194400, 89742, 50700, 54021, -77388, -171090, -38223, 86870, 154080, 246883, 287801, 230215, 59750, 5928, 110480, 210749, 126553, -5265, 7012, 125962, 135543, 48218, 4105, 75224, 266896, 351332, 447273, 428866, 289312, 197030, 183164, 257139, 305405, 302717, 223646, 263377, 181684, 217140, 404162, 465723, 422281, 411821, 509694, 523838, 588605, 767295, 768969, 778133, 797235, 777511, 796162, 767696, 737629, 867186, 995862, 1049601, 1105461, 1149002, 1331786, 1378838, 1504803, 1828090, 2006764, 2128080, 2337186, 2755865, 3282571, 3671183, 4257941]
16673D257941Q93951J286626J942536L016132M212991M920117N060188M539238
16665C0129720K546390J13114l475059n002912m408982k624900k98225J804049
16657A8783195L353735M213114M514414L690650K329331M60485p31140J287636
16649C7901420N104111R126778J1856618J2421618R176701M107923l668108j1948944
16641G4078117j2919204j0244806m655589J369865O775116J0826354J2858877
16634G8088730J1528482O776294K77733r762486j3876874j2076609o613014o96795
16626E3645461M026078Q092262J0486238R140055Q334675R883431O441489N48760
16618A10598449L99864j766379n157396n925818j0441061j4682182j2047403r634952
$$ y = [4257941, 5151892, 6438518, 8381054, 11397186, 15610177, 20530294, 25590482, 30129720, 32676110, 32789224, 29314165, 24311253, 19902271, 17277371, 16979146, 18783195, 22136930, 26350044, 30864458, 34555108, 36884439, 37344924, 36613784, 37901420, 43005531, 52132309, 63988927, 76410545, 85587246, 89695169, 86027061, 74078117, 61158913, 50914107, 46258518, 47628383, 54403499, 65229853, 78088730, 89617212, 96393506, 96671239, 86908753, 73031879, 60955270, 54342256, 53645461, 57671539, 65763801, 76250039, 85390094, 93724769, 103608200, 110049689, 110598449, 110998313, 109231934, 104074538, 98148720, 87707659, 73025477, 60978074, 51343122]
16610E1343122r484354p769666n056821k318960j46509J295614K450700K909401
16602C3222527K520419K808962K869882K18170p45992m95080j215344k133659
16594C7049885k526936m440833m566505l527366l463715l403973k733780j891700
16586A0495077j436987j044066q17195p30007n65956m23649l37275l83433k87721
16577D468788j90701k20402k96730j26201p5829p2514j61716j41883n3850j29917
16567B999045j56112n2654p1202p1698j5558j24279j19036n8813j93448p3782
16557B062463j66447j08886k27674l08188P835J26014k2553j65164L1393J35938
16547A364731O3400m1116l8232n3558j35730M0320q4687O2221L3658r0366j24396
$$ y = [51343122, 41858768, 34089102, 29032281, 26713321, 26566812, 27862426, 30313126, 33222527, 35742946, 38551908, 41421790, 41639960, 40893968, 40398888, 39183544, 37049885, 34522949, 30082116, 25515611, 21988245, 18524530, 15120557, 12386777, 10495077, 9058090, 8014024, 7196829, 6466822, 5900866, 5477217, 5139942, 4756509, 4468788, 4278087, 4057685, 3760955, 3634754, 3558925, 3486411, 3324695, 3182812, 3128962, 2999045, 2842933, 2790279, 2719077, 2647379, 2631821, 2507542, 2388506, 2329693, 2136245, 2062463, 1896016, 1787130, 1559456, 1251268, 1259103, 1385117, 1362564, 1197400, 1228793, 1364731, 1428131, 1387015, 1348783, 1295225, 1159495, 1199815, 1115128, 1177349, 1211007, 1120641, 996245]
16536I96245j0157Q8045j4906k9875K8865Q6045j47645j15116Q8027J002j36232
16525H34298M747k2861J43295j22658k82132k3933J4912j84049K6414K61903J26197
16514G76133L5304j11076j6666R3493R7446o4010k26811j46883J32091J73403
16504G42424N6974o1746r4125j13383m5025p7999j2070R332Q5153L5914M9320
16493E74769K601m0383m6192k1527m3649l8258l2154j3935O267J2212J22331r4159
16481C87923j49538j36083J1044J32020J5428N9255p5933J7921K8926J7243j2634
16470B95572L8243j22210m4089K5398P7915j09090j70556N6660J34347J14492
16460B96682P208L6221j5693n4664o2724O4951J7134j07516j10263j56432o4404
$$ y = [996245, 986088, 1074133, 1059227, 1029352, 1058217, 1144262, 996617, 881501, 969528, 970530, 834298, 839045, 816184, 959479, 836821, 554689, 530756, 545668, 361619, 388033, 649936, 776133, 811437, 700361, 683695, 777188, 874634, 810624, 583813, 436930, 569021, 742424, 799398, 737652, 643527, 530144, 485119, 407120, 395050, 404382, 489535, 525449, 574769, 577370, 536987, 490795, 469268, 425619, 387361, 355207, 341272, 347539, 359751, 482082, 387923, 238385, 102302, 113346, 245366, 260794, 320049, 244116, 262037, 290963, 308206, 295572, 333815, 211605, 167516, 192914, 270829, 161739, -8817, 47843, 182190, 296682, 303890, 340111, 324418, 269754, 207030, 271981, 289115, 181599, 71336, -85096, -149500]
16449a49500J22602J62777K7777K931L0207q006j00953M4469m3986k4119L5414
16438I9613O6770j02668N161J61996O8741m5836J5559j0463k3211j4689K6058
16427B47031K9812n8954p0084K4474p1799k3583R8466L1838m9884n8397O5725
16416A64645k1867P3188L0767q6792R1407R8848l4848j11139j08255n1647l0935
16405A3372N1334J98617R7810n5366n8635n8999N3603J09741J44388L4941P9362
16394F10168m953j68387j70213J73387R759j39917n5482J0419j29428k9096R6097
16383B02354j6885n5820m6064j33001m6597P9640J53552J08560n550j17590J09079
16372B31678L2221j65826j08578j27854J11138J28155m6839Q8391r4207n6122
$$ y = [-149500, -26898, 135879, 163656, 166587, 196794, 188788, 87835, 132304, 88318, 64199, 99613, 166383, 63715, 68876, 230872, 299613, 253777, 269336, 258873, 235662, 220973, 247031, 276843, 217889, 147805, 172279, 100480, 76897, 175363, 207201, 157317, 98920, 164645, 142778, 215966, 246733, 159941, 251348, 350196, 315348, 204209, 95954, 44307, 13372, 64706, 263323, 361133, 305767, 247132, 188133, 241736, 351477, 495865, 530806, 610168, 605215, 436828, 266615, 440002, 449761, 309844, 254362, 264781, 135353, 106257, 202354, 185469, 129649, 83585, -49416, -96013, -16373, 137179, 245739, 240189, 122599, 231678, 263899, 98073, -10505, -138359, -27221, 100934, 54095, 142486, 48279, -7843]
16362g843J0846M9979l3913j13338L2514J20700K2204M8459L722n7294j26369
16351e0333l7345n4386n016j0383J412P8615J54140L1321j14321p0857R8234j3708
16339G373L1514R7879n8101k00462j7293J59260J11522J33405q0166l09470m3752
16328a68291N8281J31570p1636k7433n7206n3024J4361J05766K5316q4880k0439
16317a47615N0994O5401j1499j66897k6653r2666m9841l4803N8838p9602P7871
16306c56472J18683J21465J63827J38157P9580q92j29599j56285j02393Q4822
16296c9107M5188O4209J8847m9397j35936J4596j56438j6925J18341K2362k9219
16285a43479m606J84559K07661P990k1926N9184N842l6164j30159o3653r549O9030
$$ y = [-7843, 3003, 52982, 19069, -94269, -61755, 58945, 81149, 129608, 133330, 76036, -50333, -87678, -142064, -147080, -157463, -156051, -77436, 76704, 108025, -6296, -77153, 21081, 7373, 38887, 136766, 78665, -121797, -139090, 20170, 131692, 265097, 184931, -124539, -168291, -110010, 21560, -50076, -77509, -134715, -187739, -173378, -67612, -42296, -127176, -147615, -96621, -31220, -42719, -209616, -236269, -328935, -378776, -413579, -354741, -434343, -356472, -237789, -116324, 47503, 185660, 265240, 264348, 134749, -21536, -123929, -39107, 6081, 70290, 89137, 39740, -96196, -81600, -238038, -254963, -136622, -114260, -143479, -148085, 36474, 244135, 252125, 230199, 289383, 295225, 259061, 128902, 65249, 55700, 124730]
16273A24730J18662q4950j45434M2489j21516j67919M6027N7091J98513J31218
16263A98911k17369j43239l0241q6511j6064O7997O3390O186r6297M9047J20090
16252h4100j3838N6867n7757j8164J01959J0058N5399K2379N2170J38073k39740
16241B3306k34911m0190R044J18243J09755l6729n5509J1394K3422J7341j3749
16230f8583j33893r5424J97962J91914m4182k2286j61990j03641M3377J2210L1869
16219a52667k036J35226k114J55702Q5288n0096r92M4930k8406n6030o0012l2087
16207C6706j24666j2317J06323o351l4471K4571J216j8390Q7014j13460o160M6163
16195a3822q1571O8067L6379J9470j8823j762N1757L4733j11966r5632j4641N4937
$$ y = [124730, 243392, 158442, 13008, 55497, -66019, -233938, -187911, -130820, 67693, 198911, -18458, -161697, -191938, -278449, -294513, -226516, -163126, -156940, -253237, -204190, -84100, -97938, -41071, -98828, -116992, -15033, -4975, 50424, 72803, 124973, 263046, 23306, -211605, -251795, -242751, -124508, -14753, -51482, -106991, -95597, -72175, -54834, -68583, -202476, -297900, -99938, 91976, 47794, 25508, -136482, -240123, -196746, -184536, -152667, -154703, -19477, -21591, 134111, 219399, 169303, 168311, 213241, 184835, 128805, 68793, 36706, -87960, -100277, 6046, -305, -34776, -10205, -8989, -27379, 59635, -53825, -59985, -13822, -95393, -27326, 9053, 28523, 9700, 7938, 59695, 94428, -17538, -113170, -127811, -72874]
16183g2874J19946m2490j24033O6766R6810o3016J9150K8072O8378p5947j53203
16172a32441j26252N7653j222k5632J04479J97528q0770k7532J3692O516p1019
16161h5000m4099j2232N4300Q8667N9900l228j32252J6384J62209R9163n5858
16150A47954N5075l1058j50931J25780K103k63670J0841K7942j0648J19648N0677
16139H3713L2629j07327J3364N3101N4739o9248L4277m245p9010J02440P2619
16128A87052q9007q3149m7256m5186Q587m7234J250R6999O529P2488J97446l126
16116B55393j66132n0709J2163k0158r6741O9230L7584n560K2361J6471J2882
16105H6784l1699m5356K4787J57973J61955j15865q3749l4538L6707O7620j8559
$$ y = [-72874, 47072, 4582, -119451, -52685, 44125, -18891, 259, 28331, 96709, 20762, -132441, -258693, -201040, -202262, -227894, -123415, 74113, -6657, -34189, -20497, -13981, -85000, -129099, -141331, -87031, 1636, 61536, 58308, -73944, -57560, 104649, 203812, 147954, 203029, 171971, 21040, 146820, 148923, -114747, -103906, -75964, -86612, 33036, 83713, 116342, 9015, 22379, 75480, 130219, 60971, 95248, 91003, 11993, 114433, 187052, 98045, 14896, -32360, -77546, -68959, -116193, -114943, -17944, -11415, 61073, 258519, 255393, 89261, 38552, 50715, 30557, -66184, 3046, 40630, 35070, 57431, 73902, 86784, 55085, 9729, 34516, 192489, 354444, 238579, 154830, 120292, 156999, 224619, 206060]
16094B06060N2287j30074N7915M0742j635L259l7738M7508n022O0858L8648Q8073
16082D20881p8675p4302j19956J19102m7648j00986p5634l9498J24950J43333
16072B71567J90755j7864k0891J20544N3439n8133n046j84919j01259O3254q4196
16061B27251j03506j11870J24151P9536p0826K1592j36014j00836N3783L3668
16051A6929l2040J89382K13311J0094j44984j34848M7634J45583k0843k6358o8484
16040A95376K3941j9610o0000N5366o0685n1873R4774m9321q3000O4289m3849
16029F5408j24246j19107J6482J5930J54422p408q8667n6878k2366M5377L0795
16018i0258J27025k2624k59770P997J18170k8894p7997J05562J30499K4968p5911
$$ y = [206060, 258347, 128273, 186188, 226930, 225295, 228554, 190816, 238324, 233302, 294160, 332808, 420881, 342206, 267904, 147948, 267050, 219402, 118416, 42782, 3284, 128234, 271567, 462322, 444458, 423567, 544111, 597550, 539417, 534371, 349452, 248193, 311447, 227251, 123745, 11875, 136026, 215562, 144736, 166328, 30314, -70522, -16739, 16929, -15111, 174271, 387582, 397676, 252692, 117844, 165478, 311061, 290218, 263860, 195376, 219317, 199707, 139707, 195073, 134388, 82515, 177289, 127968, 44968, 109257, 65408, -58838, -177945, -161463, -145533, 8889, 1481, -87186, -144064, -166430, -121053, -90258, 36767, 14143, -245627, -237630, -119460, -148354, -226351, -120789, 9710, 34678, -41233]
16007d1233o2625N5549O2993p9669r1041N2030J30289q6929o0682M0O8278J1849
15995d1151l5550M648j41859j16465M8611L5772J30741O2198q9865O9954q602
15984h1568j38045j8100R9481J07581J8832n9103l6407m0517j9768P3474J51497
15973E7357J9873J12242j1324j02632L8484J14694l3823K495j3640k8707J5995
15962A71014K1705j3131L5294p6291M6733r5726m0061Q2892R6329j27694j31367
15951c0303J2743M2239N7265Q1575O4613Q1751P2476j00282k0799l4520j366r5771
15939A29621q0344M0938R1903l6073j7576K1363p1590l6222J0757l5206n8017
15928d0446J3683j09349j48440J800J40897P9118R9447L7781r9680j41293j00497
$$ y = [-41233, -103858, -48309, 14684, -64985, -156026, -103996, 26293, -60636, -121318, -121278, -53000, -41151, -76701, -72053, -213912, -330377, -281766, -245994, -115253, -53055, -142920, -72966, -81568, -219613, -237713, -138232, -30651, -11819, -70922, -107329, -147846, -167614, -94140, 57357, 77230, 189472, 178148, 75516, 114000, 228694, 194871, 197366, 183726, 155019, 171014, 192719, 179588, 214882, 138591, 185324, 89598, 49537, 132429, 228758, 101064, -30303, -17560, 24679, 81944, 163519, 228132, 309883, 382359, 282077, 261278, 226758, 225392, 129621, 49277, 90215, 182118, 146045, 128469, 149832, 78242, 42020, 52777, 17571, -40446, -26763, -136112, -284552, -282752, -141855, -62737, 36710, 74491, -25189, -166482, -266979]
15917b66979J6421K0668K5727q4137J3629K0387J05733M639j59138r3590K46309
15906a50331J63974l1603p7094l7882K9968l9021M6326k6133n4400O0658Q1556
15895c3982K11610j5135k63883r2098J79579k8546j36082J9983J7508Q5096N9609
15884C659j33685r9534j06710L5701R1334J6739J4675p6078j76383j761R7273
15873c34770K9542j2052J47627J88331J3749m9777r7292r1758K1661p0372n5181
15862c10292J8236K3580P2613L697p6346j2736L2322k7023O8390P5505k9151J26551
15850c4654J7823j06913l9948p9856P9045l9883K2968R4641R869n897o784j35349
15838b24938j61562p769O4122J10129o4843j27298J41065l2481j07594M0463J00335
$$ y = [-266979, -250558, -229890, -204163, -288300, -274671, -254284, -148551, -143912, -303050, -396640, -150331, 13643, -17960, -95054, -132936, -102968, -141989, -95663, -121796, -176196, -115538, -33982, 177628, 162493, -101390, -193488, -13909, -42455, -178537, -158554, -141046, -55950, 3659, -130026, -229560, -336270, -300569, -209235, -192496, -177821, -253899, -430282, -432043, -334770, -305228, -317280, -169653, 18678, 32427, -17350, -114642, -206400, -184739, -255111, -310292, -292056, -268476, -195863, -192166, -268512, -281248, -248926, -275949, -207559, -132054, -161205, -34654, -16831, -123744, -163692, -243548, -164503, -204386, -181418, -86777, -76908, -82805, -89589, -224938, -386500, -394269, -330147, -220018, -284861, -412159, -271094, -303575, -411169, -370706, -270371]
15827b70371K0377p4419R8337J0989m2689Q8667J68119K8985Q2648j02525q7421
15816g9303j53186m453P3834J5181J03363L6697l1326L3818N034j00006m7548
15805a47895l8077j6351Q3813l3419o6530n8827K5706J51311J4100L1742r6768
15794a51195o2936J22246L6348M7613o0309p6649R4432o1254l2236K4699k4941
15783a44182K2311J18274l5967j33994R662R3443n6149r3904O1456J04336J01287
15772D6573J05136p2353m913j89346j46972J63392J51056q6555O1932K0473j60093
15761a11670q4348p7128L4792L5608K1216P7771k6089k548k3480n655j01307j14661
15749c77499N3159J26022N1106o5755k8223J03369L4025j8685j2024l0347j14839
$$ y = [-270371, -249994, -324413, -226076, -215087, -257776, -169109, -990, 27995, 110643, 8118, -79303, -232489, -236942, -163108, -147927, -44564, -7867, -39193, -5375, -341, -100347, -147895, -185972, -202323, -118510, -151929, -218459, -277286, -251580, -100269, -86169, -54427, -151195, -214131, -91885, -55537, -7924, -68233, -144882, -50450, -111704, -143940, -119241, -144182, -121871, -3597, -39564, -173558, -163896, -70453, -126602, -220506, -159050, -54714, 46573, 151709, 79356, 74443, -114903, -261875, -98483, 52573, -33982, 27950, 48423, -111670, -196018, -273146, -238354, -202746, -181530, -103759, -129848, -132396, -155876, -161531, -262838, -377499, -324340, -198318, -147212, -212967, -241190, -137821, -103796, -122481, -134505, -164852, -279691]
15738b79691J34722J23190r741M7345J6386j30007q2694q322J09251R4144m2082
15727b7499m0578L884m6235r7470l9913L7741m4142j68350j33282N1184K17136
15716b87524K21324M2481l9719L4494L145l3266r0068n8890J64008L8917k8179
15705c3277j32148m8737O1092j2335m0830J1703J91078N7461L910j13122j6990
15694g2195J11159J15749R1261p4614k12818q8185m5062m9643M2335O9694R7428
15683a4891k3234Q5862k0208j36620j18691L8754J18477J5067j44271J3955J21210
15672f4590Q9711r9462j11267o3758O011M7075j5890n7326O2753o064l3297J06431
15660a39673N5886p8753j08007j1049l485m3867Q4055K05241l4047m6177J11238
$$ y = [-279691, -144969, -21779, -31520, 15825, 32211, -97796, -180490, -188812, -79561, 14583, -27499, -68077, -64193, -110428, -207898, -247811, -210070, -254212, -422562, -555844, -504660, -287524, -66200, -23719, -63438, -28944, -25799, -59065, -149133, -208023, -44015, -5098, -33277, -165425, -214162, -153070, -165405, -206235, -194532, -3454, 54007, 57917, -55205, -72195, 38964, 154713, 245974, 171360, -41458, -129643, -174705, -224348, -182013, -112319, -14891, -38125, 47737, 27529, -109091, -227782, -189028, -70551, -55484, -199755, -185800, -64590, 25121, -74341, -185608, -249366, -243355, -196280, -212170, -269496, -206743, -212807, -246104, -139673, -83787, -162540, -270547, -281596, -285081, -328948, -244893, -39652, -73699, -119876, -8638]
15649h638m2262j04078J07448p123q7169J52927O1079o7599j47876k3991o9277
15638b36559J3736Q7227L4897J13765Q760n6152j97941k35315J79235J8850J5507
15627b53990p7734M1968R0799m9203R6710J08920M4428J14443O4365q5489j46011
15616e0794r2574J1696j1050N9994L9539q3393j24544K0112J47367M1220j59995
15605b02422m1999J17981J09145J2868J12115j5379m6843j31277r7322m4138k7445
15594b54716q5364q0987r5475J87315J95014j1988L1058M453K6487J35238M9937
15583A00972K5608n787k39451j48396k4642O2415J40819P4811Q652N496q3826
15572h3329o2391K9675k1667Q8298M2900J7979r0385j24028M7371j6527n0686
$$ y = [-8638, -50900, -154978, -47530, -54653, -141822, 11105, 72184, 4585, -143291, -167282, -236559, -222823, -135596, -100699, 13066, 21826, -34326, -232267, -467582, -288347, -269497, -253990, -331724, -289756, -198957, -248160, -151450, -42530, 1898, 116341, 180706, 95217, -50794, -143368, -131672, -142722, -82728, -43189, -126582, -251126, -231014, -83647, -42427, -202422, -244421, -126440, -17295, -4427, 107688, 92309, 45466, -85811, -183133, -227271, -254716, -340080, -421067, -516542, -329227, -134213, -146201, -115143, -110690, -84203, 51035, 100972, 126580, 120793, -118658, -267054, -291696, -229281, -88462, -13651, -4999, 497, -83329, -145720, -116045, -137712, -49414, -6514, 11465, -78920, -202948, -155577, -172104, -222790]
15561b22790n4407m3350J15971J86133J34681j16400o8917j26840K1096K02441
15551B7618J31653p8607k3857N8241j13020K3651r1005k8610K6391l8697r1515
15540a97757R2502J45295J43736r5658o9360n2608n9402K053O8180M9228J8067
15529D4276k1803M8938m3094J6512r959q1146k9732m4519J2253r9766n2513P4214
15517a86339n3006J2762Q2146M3081P4414k7466N205j18489j51744o3399j09026
15506d91861K8623O6710J86980J01349j3421q9994l5570M1951N696P8959K3066
15495i7512p0453J10301M438k1702j0607n8951K5296p232j9163n1719K3624J10177
15483f3503k2923k6067J37505o4929j51063J30979J5788j16409K4423P7802k3260
$$ y = [-222790, -277197, -320547, -204576, -18443, 116238, -162, -69079, -195919, -174823, 27618, 159271, 80664, 56807, 115048, 2028, 25679, -65326, -93936, -67545, -106242, -197757, -105255, 40040, 183776, 88118, 18758, -33850, -93252, -91199, -23019, 26209, 44276, 22473, 71411, 28317, 44829, 34870, -46276, -76008, -120527, -108274, -208040, -260553, -186339, -239345, -226583, -144437, -101356, -26942, -54408, -49203, -167692, -319436, -382835, -491861, -463238, -396528, -209548, -108199, -121620, -211614, -247184, -205233, -199537, -120578, -97512, -167965, -57664, -53226, -74928, -85535, -144486, -119190, -126422, -145585, -197304, -173680, -63503, -86426, -112493, 25012, -39917, -190980, -60001, -44213, -160622, -136199, -58397, -81657]
15472h1657Q4955J9064n7764r036m719K7964M0034J38954j69339k30714q3792
15461c26050J26060o721o9171o8258M4308O7973J128M6718K670j25579l9882J53793
15449a93011J7995L5924J00361m9749M0513R048m0220p8422O7884Q1718o4687
15438g2646l5688m1301l3090l7534k5413q9161o3378J6608J49982J86842n9332
15427a04111m2166P6900o0952m3135K1532r0160k9363J3476O1861N7435o8062
15416b06745O1089J63346j01944r4379k8840l566L4384l9369k3795J11517q299
15405a36601n060n7481K366J1535Q9777K2199k7953Q991j06081K4955m7756K2147
15393a98962J53091P1688p0996p7332n9030m9351N5756R1734k6351l1327J12092
$$ y = [-81657, 3298, 22362, -35402, -44438, -49157, -21193, 18841, 157795, -11544, -242258, -326050, -199990, -206711, -275882, -344140, -299832, -231859, -230731, -184013, -181343, -306922, -346804, -193011, -175016, -139092, -38731, -88480, -47967, -38919, -79139, -157561, -89677, -7959, -72646, -108334, -149635, -182725, -220259, -245672, -334833, -398211, -381603, -231621, -44779, -104111, -146277, -69377, -130329, -173464, -151932, -242092, -271455, -257979, -196118, -138683, -206745, -145656, 17690, -84254, -178633, -207473, -211039, -176655, -216024, -239819, -128302, -136601, -141661, -199142, -196776, -185241, -95464, -73265, -101218, -92227, -198308, -173353, -221109, -198962, -45871, 25817, -45179, -122511, -181541, -230892, -175136, -83402, -109753, -141080, -28988]
15382b8988J20454o0234j16975o8316J35881M9321j11226o4424j8628L0300K8061
15371a04774n5121j19152N3962P3318K6891n6733r633R7952m6991N2554N2365
15360c5362p4189j9499p1976n5818o878N3696O3046J43618J03028j7730k5242
15349E6694M4061K6825r2507j39689l9041m8374j3031K6159M095J10828Q1453
15338A7473j10227m9767j5149P0867q5053P2362n4547j34558J27410J12694M6625
15327a870L9160M2460r1293n3322N6964q3482j04536m3186j14026o8464J05979
15316c15616Q6373p8727Q7530J55838o8708j32471k702l3227N7758m4594N8386
15305b30160Q1639L3459l9858R1755J22227q7265j27182O6975J7863J02816J9109
$$ y = [-28988, 91466, 31232, -85743, -154059, -18178, 31143, -80083, -144507, -163135, -132835, -104774, -159895, -279047, -225085, -151767, -124876, -181609, -191242, -93290, -140281, -87727, -35362, -109551, -129050, -201026, -256844, -263722, -210026, -146980, -3362, 99666, 81936, 56694, 100755, 127580, 35073, -104616, -143657, -192031, -205062, -178903, -174808, -63980, 17473, -92754, -142521, -157670, -86803, -171856, -99494, -154041, -288599, -161189, -48495, -1870, 37290, 79750, -11543, -64865, -7901, -91383, -195919, -239105, -353131, -421595, -315616, -229243, -307970, -220440, -64602, -133310, -265781, -268483, -301710, -243952, -288546, -230160, -148521, -115062, -154920, -63165, 59062, -28203, -155385, -88410, -70547, 32269, 51378]
15294E1378N198l3863j28032n8481o8473k303Q6566O6010J32568K3547p7576j32241
15282a35702j46373k2957N0762K2925J6340J00465l4887n8286m8715Q8536J8361
15271a49531j35377O8446J53448J17280r2557q7401n4254l6201o0201J1935K788
15260b61625o4344J2569M2201Q2906J80757n2791k07206M3911Q9610R574r4456
15249b18894r6970p131l4663r3192R3922J35642J00297J1485j16624j42979m7801
15238d16908P2561R1300J20355n3449J9156J09775j01290k2744R6337J34996k9885
15227B0204J3078p3659j10454m3853l870R1391N3765K3410J62108j6234m5893
15216F9993o5215k6951j9981j38593l3700M4262J12357p84M8454J0609N7869j0099
$$ y = [51378, 56576, 22713, -105319, -163800, -232273, -234576, -148010, -82000, 50568, 74115, -3461, -135702, -282075, -305032, -254270, -231345, -215005, -114540, -149427, -207713, -256428, -167892, -149531, -284908, -216462, -63014, 54266, -38291, -125692, -179946, -216147, -276348, -264413, -261625, -325969, -313400, -271199, -188293, -7536, -60327, -267533, -223622, -134012, -124438, -218894, -315864, -322995, -357658, -450850, -356928, -221286, -120989, -109504, -226128, -369107, -416908, -344347, -253047, -132692, -186141, -166985, -57210, -158500, -181244, -84907, 50089, 20204, 33282, -40377, -150831, -194684, -198554, -107163, -53398, -29988, 132120, 115886, 69993, 4778, -22173, -42154, -180747, -214447, -170185, -57828, -58612, -10158, 451, 58320, 48221]
15204D8221n0968N5286n9772n8132j22173j01807K388Q9601j5754K8327j5487
15193b00270J84783N9249j4316j18670M4234n3191j50846k1652K7509n4305L9802
15182b57673p913j39477m4497J0495K7964P6817O2956M0335R4232M5666k134j65771
15170b59000r4852n5944n5612L3639O9643m841R1239l7105J0021P7288l2166R3523
15158a64167O654M1777L7215P6575R0572O2516j13701L8335m7455j8251r73j04637
15146i5540l4214j22668k8650J75144R8772o1419j05808j54308J9041M2191p9489
15135c46948k9898J3746N3387j5403J05251J53015k9022N8960l4195j16538j13750
15124c01395q0802L6627N1855J17398l5227p9801L6268j7663J61517Q3158q0762
$$ y = [48221, -2747, 52539, -7233, -65365, -187538, -289345, -286957, -197356, -213110, -184783, -200270, -15487, 43762, 29446, -89224, -44990, -98181, -249027, -270679, -243170, -297475, -257673, -265586, -405063, -449560, -439065, -411101, -334284, -271328, -230993, -136761, -91095, -93229, -259000, -353852, -409796, -465408, -431769, -362126, -366967, -275728, -312833, -302812, -225524, -257690, -164167, -157513, -115736, -78521, -1946, 88626, 151142, 37441, 75776, 28321, 10070, 9097, -95540, -129754, -252422, -281072, -105928, -7156, -68575, -174383, -328691, -309650, -267459, -346948, -376846, -363100, -309713, -325116, -219865, -66850, -95872, -36912, -71107, -187645, -301395, -382197, -345570, -293715, -176317, -211544, -291345, -255077, -272740, -111223, -28065, -108827]
15113a08827q0518j5284j30092J8367M6468L5697n4159m4478L7734L3076m3785
15102c05801m9755K83177P9780o397j1878N9839l089j17119j1831P1230K974O7867
15090E8997l8299M1125R4772q9224r7436R262m5484l7048j8519l0487n0726j5623
15078b18690N967k5557L4987J62n3845o6174K5459L9024Q4600P0690j02302q5989
15066b91668J89740J14801O705O898N3490n5125r3510P0457o985o6233n0103p154
15054a28687l2780j1880R656j40123m7858J12236J19513N8650m6555j17372O8157
15043a57043N9338N3211j16372j04900J1755o4975N4962p2634o6528K2400K2922
15032c57864J6566J41510N4501o1847j78256J9222P1300J02488N8155o6360n0416
$$ y = [-108827, -189345, -204629, -334721, -316354, -269886, -234189, -288348, -332826, -295092, -262016, -305801, -355556, -72379, 7401, 1004, -10874, 48965, 45876, -71243, -83074, -11844, -8870, 58997, 20698, 61823, 156595, 67371, -30065, -20803, -66287, -103335, -121854, -152341, -203067, -218690, -212723, -238280, -203293, -203131, -256976, -323150, -297691, -258667, -174067, -103377, -205679, -291668, -101928, 12873, 19578, 26476, 79966, 24841, -68669, 1788, -5197, -71430, -121533, -128687, -161467, -173347, -163691, -303814, -351672, -239436, -119923, -61273, -107828, -225200, -157043, -97705, -44494, -160866, -265766, -254011, -318986, -264024, -336658, -403186, -380786, -357864, -341298, -199788, -145287, -207134, -385390, -366168, -294868, -192380, -134225, -200585, -251001]
15021b51001Q6952K08276J17097o9436j64027n7445Q7234Q2843j03570j30648
15011a93725J7084O2764l8383K7841o363J06452j01841o030j5533j23319j10386
15000c81439N7089R7060R1827j1303M4262J008K6829j01063k6016M3389N3739
14989a04618R7736l4976r6844j68429M5823Q5085J19290M3871q1889M1355P4822
14978B1226k9926j33614j26635O0779N9331M643m5785J25986J23018n0726k1386
14967a3089k513k1033l4651O2381L8916P6597r8574j12789l2939J09084L9724
14956A1114j3257j03052o9332K0490Q7931J04749j17556j53836L6721O1451R2329
14945d2248K858J21915K5105j01918j24010r2158p8155O261L5929N8166j8111
$$ y = [-251001, -164049, 44227, 161324, 91888, -72139, -129584, -42350, 40493, -63077, -193725, -176641, -113877, -152260, -124419, -130782, -24330, -126171, -132201, -147734, -271053, -381439, -324350, -227290, -135463, -146766, -102504, -101496, -74667, -175730, -201746, -158357, -104618, -6882, -41858, -138702, -307131, -261308, -176223, -56933, -13062, -94951, -53596, 21226, -8700, -142314, -268949, -208170, -148839, -144196, -189981, -63995, 59023, 8297, -13089, -15602, -36635, -71286, -8905, 30011, 106608, 8034, -104755, -137694, -28610, 11114, -2143, -105195, -174527, -154037, -66106, 38643, -78913, -232749, -196028, -134577, -42248, -39390, 82525, 107630, 5712, -118298, -210456, -288611, -282350, -246421, -188255, -206366]
14934b06366l7021j2217l7597K7890j01872k4000L5008K5229J48722p6154o4586
14923c22964K2973O6248J99598J24686j1102k00766p6907k8389J09142J37414
14913A9933j28257r3261j6395O6602k188n1112L8063Q4683Q3956J30318n3294
14902G9048j65252j23377p4277J56102M0004j53723r3203l492J44201M5160o5412
14891b14221r3024M5956J18644j5388P0241J15441L8744k23825p3022M5634N0915
14880a33905J42340o2063j17200j7722O9284M1221j56505j23168K8347J01943
14870b27428M5432q3689J57658o3850l4316M1720o571m9308Q9053J676j05299
14859b34922J10768N5471k8074K7441L7869J65498N7951j7425L5484o0387N0233
$$ y = [-206366, -243387, -255604, -293201, -265311, -367183, -391183, -356175, -330946, -182224, -258378, -322964, -299991, -233743, -34145, 90541, 79439, -121327, -198234, -226623, -117481, 19933, -108324, -201585, -217980, -151378, -153566, -204678, -166615, -81932, 2024, 132342, 79048, -86204, -209581, -283858, -127756, -87752, -241475, -334678, -338170, -193969, -148809, -214221, -307245, -261289, -142645, -158033, -87792, 27649, 66393, -157432, -230454, -184820, -133905, 8435, -53628, -170828, -188550, -119266, -78045, -234550, -357718, -329371, -227428, -181996, -265685, -108027, -171877, -206193, -164473, -171044, -220352, -131299, -129623, -234922, -124154, -68683, -96757, -69316, -31447, 134051, 192002, 174577, 210061, 149674, 199907]
14848A99907r3087j14046L5141m842N3049k0186j51089j77198K8194K0637J690
14837b21830j1542k7111j3438J53330p0903p4751k1109r1182J2470K43301J23654
14826H89o5921o5051l2598j1866K1233J07095n7741o1934R427M6064N7945j9640
14814g2098P161j98J03782J2988j3258n4404R9523j9774j1722k4705n0903M2866
14802A9258n1819p7512m121n2261o0821p6605K00964R0425r8515o4997Q4984j34235
14790b25255n5766J39814M6125p2710q4902j907J68434k8913j28115q1183J1769
14779c12609K8197N3190r2198k189J5592O900R9872l7780m2976J00110l8192m0291
14767b62374j469l6001Q271k6993M0594o3614n3591J82100J39977L6165j28583
$$ y = [199907, 106820, -7226, 27915, 23073, 76122, 55936, -95153, -272351, -244157, -223520, -221830, -233372, -260483, -273921, -120591, -191494, -266245, -287354, -378536, -366066, -122765, 889, -65032, -130083, -162681, -174547, -153314, -46219, -103960, -165894, -156467, -110403, -52458, -72098, -64937, -65135, 38647, 51635, 38377, -16027, 83496, 63722, 52000, 27295, -23608, 19258, -32561, -110073, -114194, -166455, -227276, -303881, -102917, -12492, -111007, -176004, -91020, -225255, -281021, -141207, -95082, -167792, -252694, -254601, -86167, -115080, -243195, -324378, -312609, -284412, -231222, -323420, -325609, -310017, -303117, -203245, -241025, -284001, -183891, -222083, -262374, -263843, -299844, -291573, -318566, -277972, -341586, -395177, -213077, -73100, -36935, -165518]
14756a65518Q2099Q2475p3664l4860r351M9104o0492J3732R6480J33339R6719
14745B10063q2357J0605j2988P0348r7844K233j7297p7635p6084r5725J11350
14734e5331M863j5206r1736m7290Q9839k6073q4903L2045p632M1413J00060K08984
14722A49033p2708j30178P9997Q4012k5573j05402n4083j0205k3973J1900l3372
14711a30552p5035N2538J24227j2500p5254q6591J05792J4458j6519m3123M8203
14700i4356P3056k10919k8228R7194Q8092o9437j72691p2161R2443P2807N8908
14689a65292K1097J2132Q8111N2853j26481p5580P5657N2497J4054J3706j31280
14678a68526j23731j18364Q938J02374Q7378n8949M2286P1894r972k6034l19M5704
$$ y = [-165518, -83419, -944, -74608, -109468, -118819, -69715, -130207, -116475, -19995, 113344, 210063, 127706, 138311, 125323, 195671, 97827, 100060, 82763, 5128, -70956, -166681, -55331, -50468, -65674, -157410, -204700, -114861, -140934, -225837, -193792, -201424, -160011, -59951, 149033, 76325, -53853, 26144, 110156, 84583, -20819, -74902, -85107, -109080, -97180, -130552, -205587, -153049, -28822, -41322, -116576, -203167, -97375, -82917, -99436, -142559, -94356, -21300, -232219, -260447, -163253, -75161, -144598, -317289, -389450, -297007, -224200, -165292, -144195, -132063, -43952, 8901, -117580, -193160, -117503, -65006, -50952, -37246, -168526, -292257, -410621, -401683, -299309, -211931, -270880, -228594, -156700, -166672, -192706, -193025, -147321]
14666a47321J32122M660J5341l0379p3116j4831J1708o6879J09658N5823q5358
14655h8572J2858j1942j01088l9424J06661j1896k76349L1326J25403l655j7937
14644b74615q9028J51253p002Q8127N7809M153k07562k8222K2744O8660R6308
14633a17375Q5755N4305p7120l6616j42611l5073J6085j6833J20475J7822j62538
14622b93724j11030r9434J05735J68921j2817K2650J03967M0970l8874n7388K8834
14611a42190j7180M5383L338r9032l8807L0181O5611j08410k5895J4308M5283
14600b27410j5778l8991l0777J27361N3729M4956K166r0604P1214L2429L0706
14589d0999j43364j0787n5622k05872m838J39762M5172J46219P2601L8642n9813
$$ y = [-147321, -15199, -10539, 4802, -25577, -98693, -113524, -101816, -168695, -59037, -3214, -88572, -75714, -87656, -188744, -228168, -121507, -133403, -409752, -378426, -253023, -256678, -274615, -363643, -212390, -219392, -131265, -73456, -69303, -276865, -305087, -282343, -213683, -117375, -31620, 22685, -54435, -91051, -233662, -268735, -252650, -269483, -149008, -131186, -293724, -404754, -504188, -398453, -229532, -242349, -219699, -115732, -74762, -113636, -171024, -142190, -159370, -113987, -110649, -209681, -248488, -218307, -152696, -261106, -287001, -272693, -227410, -243188, -282179, -312956, -185595, -131866, -86910, -84744, -175348, -104134, -71705, -40999, -184363, -195150, -250772, -456644, -461482, -321720, -276548, -130329, -57728, -19086, -78899]
14578g8899R951J55416P0575p8637L0055N1491o7402j6005j19896j37450j40847
14567c21648P1904J9118j16666R8196J15066L8595k3923o3399K6192n8195L5415
14556a79345J50261j63584j68486J97038O5029l7168K0923L9005L4612p4567n7962
14545a74244P991J03326L7627O2243L4836p0362o2313k5404j20357L455M7876
14534a55326R1683p0151n6859n3428N3771J20425L484l8354r6893q7302j57327
14523d46277n7567J0555O0383n6597J01228K41965N8954k764l2024j31882Q5177
14512a68849o034m0688j24382n9976Q0520J92300P0066J8537Q4668K8887j25837
14501e0788j09401J739J36843L1556M9682L0518m8040j06683J64607J27352n8027
$$ y = [-78899, -68948, 86468, 157043, 78406, 108461, 159952, 92550, 76545, -43351, -180801, -321648, -249744, -230626, -347292, -249096, -134030, -95435, -119358, -182757, -156565, -214760, -179345, -29084, -192668, -361154, -164116, -99087, -136255, -115332, -76327, -41715, -116282, -174244, -166253, -62927, -25300, 36943, 71779, 1417, -60896, -86300, -206657, -203202, -155326, -63643, -133794, -190653, -244081, -190310, -69885, -66401, -104755, -201648, -288950, -446277, -503844, -493289, -432906, -489503, -388275, -146310, -87356, -90120, -122144, -254026, -168849, -174883, -215571, -339953, -399929, -319409, -127109, -57043, -38506, 46162, 75049, -50788, -160189, -158450, -21607, 9949, 59631, 90149, 42109, -64574, 100033, 227385, 169358]
14490A69358j31252M940j5212p8923n9670j7688m66J16998N9511k6316q1939j5363
14478g6022J1135n9927n477o7051m3121k2760N941N4392j72770l4130J34361J40587
14466a34842Q1515R4378m7204N3228J16333m6651j5151r3083K6847N9736L7332
14455A32438J43465K6968J1201J21222J92079K91327K48552P7126J58762O4340
14445A467480o6693j11668k3478k36476j68512k37308j31126M685Q1277j6566
14435E61615j17704k30553k37625j1345N0713r9944J7453J08545p5239J1070J01357
14424G8343n3931j57346Q1055K2353j15700k20378J8033N6372J143o5066J31207
14413b23915J11252N5322m8263j31816L1880J00413l9532j27191N2090R1708P1139
$$ y = [169358, 38106, 43046, 27834, -51089, -110759, -128447, -128913, -11915, 47596, 21280, -60659, -76022, -64887, -124814, -130291, -197342, -240463, -263223, -257282, -202890, -375660, -409790, -275429, -134842, -53327, 41051, -6153, 47075, 163408, 116757, 101606, 8523, 35370, 95106, 132438, 275903, 302871, 314072, 435294, 627373, 918700, 1167252, 1244378, 1403140, 1467480, 1400787, 1289119, 1265641, 1029165, 860653, 623345, 492219, 496904, 578181, 561615, 443911, 213358, -24267, -35612, 15101, -84843, -67390, 41155, -34084, -23014, 78343, 24412, -132934, -51879, -29526, -145226, -365604, -347571, -291199, -290056, -355122, -223915, -112663, -57341, -105604, -237420, -205540, -105127, -144659, -271850, -219760, -128052, -56913]
14402e6913J07962O659j65359k7733M5845N8012N2655n0307j46539q2533O3457
14391a94794N7477o998J8144k9107j72675o544K836K3646J10687J2374q2229n1
14379b67234J7353J62063p4184j7036R9020J12679r0560j03747q9794m0373O7347
14368b24466n1907m2656Q9444J86845J64362O0585Q4467l8555k50639q0971j01614
14357b05105Q5810K1j0690k5651j07334O6207N6527Q4561J1332N633R8791Q5521
14345A45623o9448j32260m3052J9277N4177j4942P6955j7404J5461j2722q5349
14334f3684j17986k41093J26329J89799L427n6261k9068m238m4568k6368n1604
14323c15315j01702K73N0486J21967J02302o7123j57642J17800J86154J35680
$$ y = [-56913, 51049, 57708, -107651, -135384, -89539, -31527, 21128, -29179, -175718, -258251, -194794, -137317, -144315, -126171, -155278, -327953, -334497, -331661, -308015, -197328, -184954, -267183, -267234, -249881, -87818, -162002, -179038, -80018, 32661, -57899, -161646, -251440, -291813, -224466, -276373, -319029, -229585, -42740, 121622, 182207, 266674, 228119, -22520, -103491, -205105, -119295, -119274, -129964, -155615, -262949, -196742, -140215, -55654, -44322, -38689, 60102, 145623, 76175, -56085, -99137, -79860, -25683, -40625, 36330, 18926, 34387, 21665, -63684, -181670, -422763, -296434, -106635, -103208, -159469, -188537, -192775, -237343, -263711, -315315, -417017, -416744, -366258, -244291, -141989, -209112, -366754, -248954, -62800, 72880]
14313G2880N1002r1873J20145O4610k4721j15266j88147j20516K7368m1178m6302
14302b91998P9996l1897O1935J18933J0119L6429j53336j73324q670J88667J15021
14291d8125M7482L1897m161n9778k0604Q918o7325J7997M0373l625J4095J7747
14279b5109m0652j73955o9079L7259J53482O3792o599j43212m8017M3370j7047
14268b25767J15282Q3543P400O1921R4314O2809J45865j4982j44474j61741J11080
14257A35250K11333l3300j86849N4921J8387L0425K3581l4472l6632j86984j97118
14246b01458n4773R8358J57803J33561o0553J7363M3977k7840r2986k3096K730
14235f914m7194m6843P8513O9314j5930r9643n2045o6540j38551O8029Q6444Q0317
$$ y = [72880, 123882, 32009, 152154, 216764, 192043, 76777, -111370, -231886, -204518, -245696, -291998, -212002, -243899, -181964, -63031, -52912, -16483, -169819, -343143, -351813, -163146, -48125, -643, 31254, 27093, -32685, -53289, -44371, -111696, -93699, -53326, -56951, -42856, -25109, -65761, -239716, -308795, -271536, -118054, -54262, -60861, -204073, -252090, -208720, -225767, -110485, -26942, -19542, 42379, 136693, 199502, 345367, 330385, 185911, 24170, 135250, 346583, 313283, 126434, 181355, 199742, 230167, 253748, 219276, 182644, -4340, -201458, -256231, -157873, -70, 133491, 72938, 90301, 134278, 106438, 13452, -9644, -6914, -54108, -100951, -22438, 46876, 30946, -68697, -120742, -187282, -325833, -257804, -171360, -91043]
14223i1043J42002m7625k36166O8323j03776n0223K8443R9156j5247q264P5195
14212a39225L6166j4614J24426j4931j13791R7332Q2615j74322n9999R5677N9993
14201b0673R12j03284k231n0859M1128Q5228Q5846K1932j50433J9497o5673r9783
14189b38393O2392j4906O8495M9987Q7463K0944J5570O592M230R5217K5750p2212
14177A11129r2510k57757K169m6955K968r3674K6798R4943J00579m1285j8700
14166b12295J5819R8042m3096n4657j24592Q6149J14405J3977O009P070j25915
14155b19084O3707N1713j5285p8081o3528j2569O4775m1973R5577K03414J5218
14144F3884k1764J2302Q1495m6100k7094j15784J08191J46291L7575J3671m5375
$$ y = [-91043, 50959, 3334, -232832, -164509, -268285, -318508, -290065, -190909, -206156, -214420, -139225, -103059, -117673, 6753, -8178, -121969, -24637, 57978, -116344, -176343, -80666, -20673, -19761, -123045, -125276, -176135, -135007, -49779, 36067, 57999, -92434, -72937, -138610, -238393, -176001, -190907, -122412, -72425, 15038, 35982, 51552, 58144, 62374, 157591, 183341, 111129, 18619, -239138, -236969, -283924, -280956, -374630, -347832, -252889, -152310, -193595, -212295, -196476, -98434, -141530, -196187, -320779, -234630, -120225, -106248, -100239, -93169, -219084, -155377, -103664, -118949, -197030, -260558, -273127, -208352, -250325, -154748, 48666, 63884, 42120, 54422, 135917, 89817, 62723, -53061, 55130, 201421, 238996, 252667, 207292]
14133B07292j6104o3108k1969l0332Q9416J13936j17173m2090q9434r609j27106
14122a06281j9683M5773Q2512N1885k1694q3769j49563K096J89757J71505r3100
14111F9438p4056P7679k0846q8444K2681K7525o7646O107P0718l2221L9061J22979
14099A52975j24153l5405J08353N7902j8690r0203j30668n5466o9016j14519K5647
14088b93243J58944J64806O3507m1506j9292J38308r935m94M6647J8201q6110
14077A39833J4146N8338j2332O4059K02258J15184K465r2594p0911r4315J8108
14066C44239o6555o5431l369P0226M5948J39502J88189Q784P0208L7364P8557
14055H47662r219k6113m4702J20048R9467L6764K6264O7842P9807Q985Q0650M7964
$$ y = [207292, 191188, 128080, 106111, 75779, 165195, 279131, 161958, 119868, 30434, 20825, -106281, -125964, -80191, 2321, 54206, 32512, -51257, -200820, -198724, -8967, 162538, 69438, -4618, 73061, 52215, -36229, -13548, 13977, -53669, -47562, 23156, -9065, 29996, 152975, 28822, -6583, 101770, 159672, 140982, 50779, -79889, -135355, -204371, -318890, -293243, -134299, 30507, 94014, 52508, 33216, 171524, 161589, 161095, 207742, 225943, 139833, 153979, 212317, 199985, 264044, 466302, 581486, 583951, 491357, 420446, 326131, 344239, 277684, 212253, 208884, 279110, 325058, 464560, 652749, 661533, 731741, 769105, 847662, 838443, 812330, 767628, 887676, 987143, 1023907, 1050171, 1118013, 1197820, 1206805, 1287455, 1335419]
14043A335419L12956K69651J77113Q1954P6156K2718J63057J37516l9118J91860
14033B729282L89432M51292K25641L34896N66962M90968P19107Q13920R39770
14024G661270J123127J398954J502948J841263K210895K798427L501871M393268
14016B6432023N813604P949505J0851971J4929766J9842043K5385255L0854776
14009A42058943L4817337L6221862L5254635L0187340J9699097P526038n600274
14002C00164978j8224992k7744920l3609686l6985974l5229516l0133213k4967092
13995I3269585j9774916j4387385j0244430p508078n612561m362032l356464k855244
13987B5168475k427388k086153j716920j656129j596747j405134j196332q27600
$$ y = [1335419, 1648375, 1918026, 2095139, 2177093, 2253249, 2275967, 2439024, 2576540, 2537422, 2729282, 3118714, 3570006, 3795647, 4130543, 4697505, 5188473, 5907580, 6721500, 7661270, 8784397, 10183351, 11686299, 13527562, 15738457, 18536884, 22038755, 26432023, 32245627, 40195132, 51047103, 65976869, 85818912, 111204167, 142058943, 176876280, 213098142, 248352777, 278540117, 298239214, 305765252, 300164978, 281939986, 254195066, 220585380, 183599406, 148369890, 118236677, 93269585, 73494669, 59107284, 48862854, 41354776, 35742215, 31380183, 28023719, 25168475, 22741087, 20654934, 18938014, 17281885, 15685138, 14280004, 13083672, 12256072]
13979A2256072r05234q49777o83824n33452l99804m97877m38750m04857j42453
13970G400044k37380l30075m75968k95440j71746j76303j52633k68236l44794
13961D947469j60841k43634k08823j94515j52935p4025j70690j27150k83896k87781
13951C043179j90387l619l2301k15165L0326O0432j05114j14188o1736p712k04320
13940B199395n329N3962k09389r6809j44210q9822j14269M5581O598q0141K4037
13929A589604J00220N5767P3760j7154M4448j23509o8582K32404K42636Q9990
13919B219584M9118N0183L1295l18229k25078j11221L2061o8347j99489p233K25925
13908A678569K38301K01284j7235J0867J1168J36740K11881K083R8957O6954q2307
$$ y = [12256072, 11350838, 10501061, 9817237, 9283785, 8883981, 8386104, 7947354, 7542497, 7400044, 7162664, 6832589, 6356621, 6061181, 5889435, 5713132, 5560499, 5292263, 4947469, 4786628, 4542994, 4334171, 4139656, 3986721, 3912696, 3742006, 3614856, 3330960, 3043179, 2852792, 2849173, 2816872, 2601707, 2632033, 2692465, 2587351, 2473163, 2411427, 2403715, 2199395, 2194066, 2248028, 2038639, 1941830, 1797620, 1707798, 1593529, 1639110, 1645708, 1565567, 1589604, 1689824, 1745591, 1819351, 1802197, 1846645, 1723136, 1654554, 1886958, 2129594, 2219584, 2268702, 2318885, 2350180, 2031951, 1806873, 1695652, 1727713, 1659366, 1459877, 1452644, 1678569, 1916870, 2118154, 2100919, 2111786, 2122954, 2259694, 2471575, 2473658, 2572615, 2639569, 2557262]
13897B557262k04120r5197k28755l75745k97820N4480R0798k29532j39644L0024
13887A161751l7178o9509K3643j12953j1679p8273J9297J2282L4351K31668O8183
13876A241583k1508P0465R488N2380J07493o7220k40009k81952r3286j12661j54735
13865E10038j18925J37610J44951N601j02233j46648m0178N4818n478k2682o7029
13854C49845L0092j49183r8154M054O9826N6244J18886m1694J5049O688L940m8279
13842C17314o0798O9860N009n7612m7933J02086N5924k3532P1319J215J9182J5557
13830D67591P2310L6645o2315O4474j32531j21666n0952j42973j3769J44200P2832
13819C33846p7389m7743q3407r0261J4935O0997q028q237N3197n6406p3419k3504
$$ y = [2557262, 2353142, 2257945, 2029190, 1653445, 1355625, 1410105, 1500903, 1271371, 1131727, 1161751, 1124573, 1055064, 1078707, 965754, 954075, 875802, 895099, 907381, 941732, 1173400, 1241583, 1220075, 1290540, 1300028, 1352408, 1459901, 1392681, 1152672, 870720, 777434, 664773, 510038, 391113, 528723, 673674, 679275, 577042, 430394, 390216, 445034, 439556, 416874, 349845, 379937, 230754, 132600, 136654, 206480, 262724, 381610, 339916, 354965, 361653, 365593, 317314, 256516, 326376, 331385, 273773, 225840, 327926, 383850, 360318, 431637, 432852, 452034, 467591, 539901, 576546, 514231, 578705, 446174, 324508, 273556, 130583, 116814, 261014, 333846, 256457, 208714, 125307, 35046, 49981, 110978, 102950, 94713, 147910, 91504, 18085, -5419]
13807e419P1562n2568j47816k4045M4855q92J25409m3462k4260m5600m1725l5114
13795a79075o32J5287J05399p3706L1810J01291J23778j01368q7584Q4829R66
13784B0995K6753j3537J6201M0026j28438J6509N6857o0431o4909r91L0755J32732
13772G2522Q041L6524N6069j3815N2199M3351q5559l2761M5680q7699p5704L9913
13760E8761M4714R9203R7309O6648j11938P7368M8481j64407l4036k69976m7385
13749a35258L6704q2731O4671N5113l1217L018K4346m6100M0068J69124j01999
13738d261j67475J09986K7417q8395K0862n421L8496q7831l3759O1097j1510M3188
13726i7606m4145O1691J09610l258O1329L5919m2150j22982K2126l1788l6820
$$ y = [-5419, 66143, 13575, -134241, -158286, -113431, -114323, 11086, -32376, -56636, -102236, -143961, -179075, -179707, -164420, -59021, -132727, -100917, 374, 124152, 22784, -64800, 20029, 20995, 47748, 34211, 50412, 90438, -38000, -21491, 35366, -25065, -89974, -90965, -60210, 72522, 80563, 117087, 173156, 159341, 211540, 254891, 169332, 136571, 182251, 94552, 18848, 58761, 103475, 202678, 299987, 366635, 254697, 332065, 380546, 216139, 182103, -87873, -135258, -98554, -181285, -116614, -61501, -92718, -89700, -65354, -111454, -71386, 97738, -4261, -171736, -61750, -34333, -122728, -101866, -107287, -68791, -156622, -190381, -129284, -140794, -97606, -141751, -80060, 29550, 26292, 87621, 123540, 81390, -41592, -19466, -51254, -88074]
13715h8074J38324o4174j29756j30878J14323O5893p6477R0281l0121p5292l1426
13704b17377l2900O7491O5070L2917L8441l8681l3432q3184L8874M9312O1509
13693e1960l7792O1070M7747J00157k8799l1392K4226o3003k1504k8098r9261
13682a28609J06578k5227k7900N2443r0534p4699Q5779J03916P5449k16967q3059
13671b22830J7253Q9999J27534K8091M7115o5100L0075J1818J38940L8443n9579
13660A81759j45215j73380J79525R4789k3840j19945n5816J3926j5241j13939
13650a77377K4601K18412J9837L9018R8987J7963k8144r7628j28629m2783p996
13639f3739o4347L2391J7732o1174L8254n4937N3383L4376M1421N9229R7883k84
$$ y = [-88074, 50250, -13924, -143680, -274558, -160235, -94342, -170819, -80538, -110659, -185951, -217377, -250277, -182786, -117716, -84799, -46358, -85039, -118471, -201655, -162781, -113469, -51960, -89752, -28682, 19065, 119222, 90423, 59031, 83257, 20254, -1250, -29348, -128609, -22031, -47258, -75158, -22715, -113249, -187948, -102169, 1747, 77196, -139771, -222830, -205577, -115578, 11956, 40047, 87162, 22062, 52137, 63955, 202895, 241338, 181759, 36544, -136836, 42689, 137478, 113638, -6307, -62123, -48197, -63438, -177377, -152776, 65636, 85473, 124491, 223478, 241441, 213297, 115669, -12960, -55743, -63739, -128086, -95695, -77963, -139137, -100883, -155820, -102437, -68061, -26640, 32589, 130472, 130188]
13627A30188r0134j13580q9409N8900K01521Q4839J5546N4844m063r3687j44842
13616A0123m3730O3800J9159K1079k26357j94696J46525J71870j2044P3664J18732
13605A48125l7868J09655o5387r8770j04936l5371p3804P0444k7938l5478m3657
13594a94985J69709K46493q337L996l8534r2799L7396J2867R615J31290p4632
13583B02079l9395M6569P070L5768m6328p3925O6126N8461Q5378M3026j02705
13572B82124j87143j260l8453K08960l0905J14772l0749J48596J64580R2130J14738
13561H37390K66590K01091R3843l6692M5889Q3819j17649j40561j19196l0858
13551A083666j54987j11552k27201j38202P4225K7807n3314j81923j46671M1273
$$ y = [130188, 40054, -73526, -162935, -104035, 97486, 182325, 197871, 252715, 248652, 154965, 10123, -33607, 30193, 49352, 70431, -155926, -350622, -204097, -32227, -44271, 29393, 148125, 110257, 219912, 154525, 55755, -49181, -84552, -158356, -87912, -115850, -151328, -194985, -25276, 221217, 212880, 216876, 178342, 85543, 122939, 135806, 145421, 276711, 202079, 162684, 209253, 216323, 252091, 205763, 131838, 197964, 256425, 341803, 384829, 282124, 94981, 93721, 55268, 264228, 233323, 348095, 317346, 465942, 630522, 722652, 837390, 1103980, 1305071, 1398914, 1362222, 1408111, 1491930, 1374281, 1233720, 1114524, 1083666, 928679, 817127, 589926, 451724, 525949, 553756, 500442, 318519, 171848, 213121]
13541B13121O9184M7683m2416o8775J58156J4890L8600p701p5337j03557J71280
13530D15128Q0476L8106p377J48112J32112j06259j09210o1087J38730J4299R5312
13519G78342J78720J92640J51860K07361J37484Q9626J44425L29171M02271N88111
13509C200011P23813R05074J196685J685167K336641L365222N025840O884314
13501B5322767Q077975Q042441O650215M184815j691178q627322j0570665q323852
13493B3065196n880906l960769k630234j639269j201704q94396p92153p02379
13485E363386m51390m17714l86945j58239l1292j28375k7177P3125J15741K8344
13475C979464J11641J63199J15536K06412K24178L08882N60733O76398Q70065
$$ y = [213121, 282305, 329988, 287572, 218797, 376953, 391843, 430443, 422742, 347405, 243848, 415128, 495604, 533710, 526333, 674445, 806557, 700298, 591088, 530001, 668731, 683030, 778342, 957062, 1149702, 1301562, 1508923, 1646407, 1736033, 1880458, 2209629, 2611900, 3200011, 3923824, 4828898, 6025583, 7710750, 10047391, 13412613, 18438453, 25322767, 33400742, 41443183, 48093398, 52278213, 50587035, 41959713, 31389048, 23065196, 17184290, 13223521, 10593287, 8954018, 7752314, 6857918, 6065765, 5363386, 4911996, 4494282, 4107337, 3949098, 3917806, 3789431, 3762254, 3835379, 3951120, 3979464, 4091105, 4254304, 4369840, 4576252, 4800430, 5109312, 5670045, 6346443, 7216508]
13466G216508J191079J469461K104002K488645L337594M580807O438517R583906
13458C8410519J4164543K0148055K5472369K6763850K2418448J5277093J216896
13451A63871773k5072782l6582285k9725768k0347085j3135378q415318n621717
13444B4971440l743323k740294k054786j745878j719020j421950q60531o64690
13436A0020968o09189o46448l42181l61434k43682k05014o8510j52819P8553J63270
13426G633514K06971K02223M20357O35056Q57394J029442J341434J836282K307205
13417A6469878L117733M356628O219399R004209J3345623J9299406K4940997K7114198
13409A23868071K3747473J6829218M692342k0892463l7224930l2181320k2614037
$$ y = [7216508, 8407587, 9877048, 11981050, 14469695, 17807289, 22388096, 28826613, 38410519, 52575062, 72723117, 98195486, 124959336, 147377784, 162654877, 163871773, 138798991, 102216706, 72490938, 52143853, 39008475, 30593157, 24971440, 21228117, 18487823, 16433037, 14687159, 12968139, 11546189, 10685658, 10020968, 9411779, 8765331, 8423150, 8061716, 7818034, 7613020, 7544510, 7391691, 7470244, 7633514, 7840485, 8042708, 8463065, 9098121, 9955515, 10984957, 12326391, 14162673, 16469878, 19587611, 23944239, 30163638, 39167847, 52513470, 71812876, 96753873, 123868071, 147615544, 164444762, 169137104, 148244641, 111019711, 78838391, 56224354]
13402E6224354j4632841r467047o051448l954575k713710k362126k031110j630675
13394A3380822j450009j197577r78950o97253o36489m92061m68293k37952k92338
13385F929900k57050j93176j95310j31218r0199o1729N508J9533J32387L39230
13375F497876M79514N60396P27748J071238J393038J799345K682646M191742O183536
13366B5587079P966953Q848837Q034453N945284K032321n360238j1039622j0701355
13358C1313712q108862n588292l696507k409465j575749j379991j146001r43753
13350F465092n96188o07931o07179m70780k45887k31545k25142j11317k50096
13341C119027j24837P1685j53168j97317r2536r6064k56084j49756J32324Q6649
$$ y = [56224354, 41591513, 32124466, 26073018, 22118443, 19404733, 17042607, 15011497, 13380822, 11930813, 10733236, 9754286, 9057033, 8420544, 7928483, 7460190, 7222238, 6929900, 6672850, 6479674, 6284364, 6153146, 6062947, 6001218, 6006726, 6026259, 6158646, 6497876, 6977390, 7537786, 8265534, 9336772, 10729810, 12529155, 15211801, 19403543, 25587079, 33554032, 42402869, 50437322, 56382606, 58414927, 53054689, 42015067, 31313712, 23204850, 17616558, 13920051, 11510586, 9934837, 8554846, 7408845, 6465092, 5868904, 5260973, 4653794, 4183014, 3937127, 3705582, 3480440, 3369123, 3119027, 2994190, 3065875, 2912707, 2715390, 2622854, 2526790, 2270706, 2120950, 2253274, 2339923]
13331B339923j5349j55514j90438j11068k33296m9252j20367L4283J6633l6230
13321A479325k0885m3748j62191n5350l0737o2590K5673O6644j5439r9006j18604
13310I63092k75347j754R1069L1960Q5548L4996k0422p4631j23923j41048k0030
13299E49510J4040N3316Q9602o2589l1119j4754O2692J22796L5326j70083j07595
13288E41142R9841R963J48927O4241j82283p6269m2383P578J18395Q5008O486
13277G80646L563L978o342j85561j26303q7335n1416J429r413j6346O33N5030
13265C62563j0997Q1008R1761l7243j74762J2750m6337M4819N764q3155L4090
13254B80261n1476m2024O3821J95055P6792m8157n994o0952L7481n5304j25800
$$ y = [2339923, 2324574, 2169060, 1978622, 1867554, 1634258, 1585006, 1464639, 1498922, 1515555, 1479325, 1458440, 1414692, 1252501, 1197151, 1166414, 1103824, 1129497, 1196141, 1180702, 1081696, 963092, 687745, 685991, 777060, 809020, 894568, 929564, 909142, 834511, 710588, 569540, 549510, 563550, 616866, 706468, 643879, 612760, 598006, 660698, 783494, 818820, 648737, 541142, 640983, 650946, 799873, 864114, 681831, 605562, 563179, 570757, 689152, 774160, 780646, 784209, 788187, 781845, 596284, 469981, 382646, 331230, 332659, 323246, 306900, 307533, 362563, 351566, 432574, 524335, 487092, 312330, 325080, 278743, 323562, 329326, 246171, 280261, 228785, 186761, 250582, 445637, 522429, 474272, 468278, 407326, 444807, 389503, 263703]
13243B63703J6274P8717j102N3525O2609j10292n0331k9584o5824o5150n1007
13232A01538p458L4186P3790J11839r540j28896k2238P786j27335Q5236Q3732
13221B02640O824l7577j00598m2932P8095p2657m5219N1325P5937P5716P4849
13210B66403l8452M128k1923J9809n9004P6876O3935j48982k4171J06409J7448
13199B62476j730P107Q2296k8621j67769j81797O4523K00563j4033n4777M7292
13188B15530j16937l1163J42086R1305R3996r7811q9744j00769j17321M0262M2824
13177G2258l0934k7897R3086N439J9680J04365k3905o9085K4094O3724K4467j52336
13165A02956m6237J04876K4331q426M6321N5427J21283K26834K3022J4801j21217
$$ y = [263703, 279977, 358694, 357592, 411117, 473726, 363434, 313103, 283519, 217695, 152545, 101538, 94080, 128266, 202056, 313895, 304355, 175459, 153221, 161007, 33672, 118908, 202640, 209464, 171887, 71289, 28357, 106452, 33795, -11424, 39901, 115838, 191554, 266403, 227951, 232079, 210156, 229965, 170961, 247837, 311772, 162790, 138619, 245028, 262476, 260746, 267853, 350149, 321528, 153759, -28038, 36485, 237048, 223015, 168238, 215530, 98593, 67430, 209516, 300821, 394817, 297006, 207262, 106493, -10828, 29434, 72258, 41324, 13427, 106513, 111952, 131632, 235997, 212092, 143007, 167101, 230825, 255292, 102956, 56719, 161595, 185926, 177500, 223821, 279248, 400531, 627365, 650387, 665188, 543971]
13154E43971o4292j8434M9223j90210p1795j22589j38180j12913o3149J3815O9352
13143a05201J5127J48816O9354j0173K4958O5740R6426k0235j3261r564j69370
13132I2617n6905j9088J5282N8081j05719Q0915N0458n8751j27487N7775n3993
13121f6815K0988O1007M1539k7554j1209M2187Q443J43115j9830q0900r0419j9959
13109E93r5208m8218R7094J27376m0605q6735k6890M9851j31174m0305L3419P6671
13097h4131K59471J29791j59327j44604J1929Q0121K5502k937N4097R5801O870
13086B72583q4016j33274q9613O8517j6530P0994J18963m0259j27636J5793j7150
13075C8372n9078j1568n0693N0083N2016L8379k3663j43151Q8535N1505L3934
$$ y = [543971, 479679, 461245, 510468, 320258, 248463, 125874, -12306, -125219, -188368, -174553, -105201, -90074, 58742, 128096, 117923, 142881, 208621, 305047, 284812, 271551, 261987, 92617, 35712, 16624, 31906, 89987, -15732, 65183, 115641, 56890, -70597, -12822, -66815, -45827, 15180, 56719, 29165, 17956, 60143, 68586, 211701, 191871, 110971, 20552, 593, -94615, -142833, -45739, 81637, 41032, -45703, -72593, -22742, -153916, -194221, -160802, -84131, 175340, 305131, 145804, 1200, 13129, 93250, 118752, 115815, 169912, 265713, 272583, 188567, 55293, -34320, 34197, 17667, 88661, 207624, 167365, 39729, 55522, 38372, -20706, -32274, -82967, -32884, 19132, 57511, 33848, -109303, -20768, 30737, 64671]
13064F4671J1495j67637j48007M0265n7577O6461M2525J55160n3176j4061j4804
13053g4685J25829m3644j18319O1137j4240o8111J1672N7805k1490p4767R483
13042a49330J44639P6470J14271l0917o2193r1695R0622N01M9930J23263p1254
13031A94307o162n4275J61314K47517J68983Q1920P8820R1021j04602j98023k32941
13020D27879k30830j62999k21373j6808J77554R1159k5734l9511k5014J28068
13010A02391M4330P7869N1063m6952J6652O1796j107N876N1724j93603L4267J55468
12998C59774J42701L339p6823j44492o3247j130k9417o7004K1319P1309J26020
12987C42349K54244J3111J24402j06309P6742R0840J95021K66876J18382J9245
$$ y = [64671, 76166, -91471, -239478, -199213, -256790, -190329, -147804, 7356, -45820, -59881, -74685, 51144, 7500, -110819, -49682, -63922, -132033, -120361, -62556, -84046, -158813, -149330, -4691, 71779, 186050, 155133, 92940, 1245, 91867, 92368, 142298, 265561, 194307, 188145, 133870, 295184, 542701, 711684, 793604, 872424, 963445, 858843, 660820, 427879, 197049, 34050, -187323, -204131, -26577, 64582, 38848, -663, -25677, 102391, 146721, 224590, 275653, 228701, 245353, 307149, 306042, 311918, 363642, 170039, 204306, 359774, 502475, 505814, 428991, 284499, 221252, 220122, 190705, 123701, 145020, 216329, 342349, 596593, 609704, 734106, 627797, 704539, 795379, 990400, 1257276, 1375658, 1394903]
12977A394903k16403j61190k90430l38855J03214K8618j7126J67783N8817j21357
12967F07974p6463J10590j21125o5342j2987O8328K32324M5583k8237O331M7932
12956H14908p9913j0259K18359J27789J24202o9760J8298M0779m1819Q5941Q1449
12945A309974K28923R8637J29884j3749n258O2263J54556K30429L19806L97965
12935B913430L23935M07651K66342J75190J19974K04683L85247L25084M40568
12926E562104O16017O95009O97524O44770Q33158P70371J066636J176729J394644
12917A3456962K101778K716780L387300M250121O009980Q442523J1828018J6744232
12909F8937694K3562831L0733511L7792682M3976562M7635826M2203425K8049576
$$ y = [1394903, 1178500, 1017310, 726880, 388025, 491239, 519857, 502731, 670514, 729331, 607974, 531511, 642101, 520976, 455634, 442647, 510975, 743299, 788882, 760645, 766976, 814908, 734995, 724736, 943095, 1070884, 1195086, 1125326, 1143624, 1184403, 1142584, 1228525, 1309974, 1538897, 1637534, 1767418, 1753669, 1748411, 1810674, 1965230, 2195659, 2515465, 2913430, 3237365, 3645016, 3911358, 4086548, 4206522, 4411205, 4796452, 5121536, 5562104, 6178121, 6873130, 7570654, 8215424, 9048582, 9818953, 10885589, 12062318, 13456962, 15558740, 18275520, 21662820, 25912941, 31922921, 40365444, 52193462, 68937694, 92500525, 123234036, 161026718, 205003280, 252639106, 294842531, 322892107]
12902C22892107J6604455K182717k6609922m3866454m3586234m2703771m1755052
12895A43157846l4443548k5200040j7694825j2108608q277279n978592m457886
12888C4997068l594096l085437k517226k038974j874921j548193j424173j285852
12880A7628196j155410j160082j100700r71574r27538q94901q68155o60817n87425
12871I301594n59468o40387n57972j96450l16136l57534k05978l16290k75521
12862E875858k58388j36151k00800k76707k07771j23920l1697j87329l08352k84806
12852C859937k47863j63374q2202r7710k1703l8018j3528k9375j36356j03775
12842B926033o1526k6480j27114j81750j73325p6917l7176m773k29975p4469k6134
$$ y = [322892107, 339496562, 341679279, 315069357, 271202903, 227616669, 184912898, 143157846, 108714298, 83514258, 65819433, 53710825, 45433546, 39454954, 34997068, 31402972, 28317535, 25800309, 23761335, 21886414, 20338221, 18914048, 17628196, 16472786, 15312704, 14212004, 13240430, 12312892, 11417991, 10549836, 9889019, 9301594, 8742126, 8101739, 7543767, 7347317, 7031181, 6673647, 6467669, 6151379, 5875858, 5617470, 5481319, 5280519, 5003812, 4796041, 4672121, 4640424, 4453095, 4144743, 3859937, 3612074, 3448700, 3366498, 3268788, 3247085, 3209067, 3195539, 3166164, 3029808, 2926033, 2864507, 2838027, 2710913, 2529163, 2355838, 2278921, 2241745, 2236972, 2006997, 1932528, 1906394]
12831A906394q4867n2292N6401N6488P1507p4361n1553l7619k1571o1812j48478
12820A558237l3393J08264j14407j46956j61681q6102M6171M5571l2158j6334
12810A167212J791J3755J2472J722M5090j9282N888r4962o3751k2661j08309j03635
12798H35330j25556J8008J07263M5064n2807L8247M184j5837n0773j65167L0415
12787F68371Q0241J21769P5137o1437j9769j41265j32971R7482O3061M4707M1545
12776H36871J01857J3970j23901O953O9146k09663j17390n206J129L1729L3886
12765F39381K1354l4432q7625N545j49711j07113R2563R9140N2884J7004Q8440
12754F37430J43638n6670j41764j28025L3682K08119l8068r8034N0099M5070M0433
$$ y = [1906394, 1821527, 1769235, 1825636, 1882124, 1953631, 1879270, 1827717, 1790098, 1768527, 1706715, 1558237, 1524844, 1633108, 1518701, 1371745, 1210064, 1123962, 1170133, 1215704, 1183546, 1167212, 1169003, 1182758, 1195230, 1196952, 1242042, 1222760, 1228648, 1133686, 1069935, 1047274, 938965, 835330, 709774, 727782, 835045, 880109, 827302, 865549, 869733, 853896, 803123, 637956, 668371, 748612, 870381, 945518, 884081, 864312, 723047, 590076, 687558, 750619, 795326, 836871, 938728, 952698, 828797, 835750, 904896, 695233, 577843, 572637, 573766, 605495, 639381, 660735, 626303, 538678, 544223, 394512, 287399, 379962, 479102, 531986, 548990, 637430, 781068, 724398, 582634, 454609, 488291, 696410, 658342, 560308, 610407, 655477, 695910]
12743F95910j2623M909n6552j53399m5592j0574m5737P6760R0476p2144j80209
12732B91225N0044K29062J32826J8282m0204j93831j50365M0442n6134j95325
12722A26022q5943J3823R3978J4778R0234O479K6209j59631O1051J37855n7311
12711B67544M1692M4517j00413m7791M2117Q7955P8264R0155j00609j47630o4861
12700A90940Q8196P9813o9987j46667l9093J24569M9404k4316j2349K2840n0415
12689B12935m0925K7157m0675q3745J41507P4300J37283K5206m9548o8837j8178
12678C16480p2095M5819M747R6252J60910L2510k7141j63976p4850j18012j14491
12667H6153J05068J47140j17208r7878N720m6399o2522L9016P2007L6543l8636
$$ y = [695910, 683287, 688196, 631644, 478245, 432653, 422079, 376342, 453102, 543578, 471434, 291225, 341269, 570331, 703157, 721439, 681235, 487404, 337039, 377481, 321347, 126022, 40079, 53902, 147880, 162658, 252892, 259371, 285580, 125949, 187000, 324855, 267544, 309236, 353753, 253340, 205549, 247666, 335621, 413885, 504040, 403431, 255801, 190940, 279136, 358949, 288962, 142295, 103202, 227771, 277175, 252859, 240510, 263350, 212935, 172010, 199167, 158492, 74747, 216254, 290554, 427837, 453043, 403495, 334658, 316480, 244385, 290204, 294951, 391203, 552113, 584623, 557482, 393506, 318656, 200644, 86153, 191221, 338361, 221153, 123275, 128995, 82596, 20074, 59090, 131097, 167640, 129004]
12656A29004r3599j11216k4326J44259J75734l469n3120L5691M8983L7195j10599
12645A74537O9102J42812n5188n7390r1838q9850L7603J71599m5314R312q6536
12634A78849l597l2658P3586j02520j34511j5680k6827L4196m8029q0661M4834
12623a13018N711P253R5348J37087L0285m5804k9751r7092O2968K04j55367J69410
12611F7234K65106p05j61056j99216M6836M0842L9662j4896m023K1585k4339J04605
12599A81635n3008j4963n8839K6749O431j31703p6637R8425J52957k7201m0569
12588F3277K887l3179L9173m347M0175J5738J3884L610j0170J63564N8048l8509
12576C14151p4787l9463N605N5797m1335P554O4885M7904n3336m7903r3482M9717
$$ y = [129004, 35405, -75811, -100137, 44122, 219856, 216387, 163267, 198958, 247941, 285136, 174537, 243639, 386451, 331263, 273873, 182035, 92185, 129788, 301387, 256073, 265385, 178849, 175252, 142594, 216180, 113660, -20851, -36531, -63358, -29162, -77191, -157852, -113018, -107307, -100054, -4706, 132381, 162666, 116862, 87111, -9981, 52987, 53191, -102176, 67234, 332340, 331635, 170579, -28637, 18199, 59041, 98703, 83807, 79784, 101369, 77030, 181635, 128627, 113664, 54825, 81574, 88005, -43698, -120335, -21910, 131047, 103846, 63277, 66164, 32985, 72158, 67811, 107986, 123724, 137608, 141218, 131048, 294612, 352660, 314151, 239364, 199901, 205506, 261303, 219968, 227522, 292407, 340311, 286975, 239072, 145590, 195307]
12564A95307J9839j39641P2461l0457N9489j42075J6894k8892K43Q4070j35405
12553b8167j4574M9278R2644q0980o0967N7818L2438L6824j0120J5771O8398j15728
12541D2635O4258k720O4153O7000m8889q6719j39256k5474K16916J27421N4894
12530C34219j04776R8598L9841k50295k7601m3968o5919n6340k728K6965Q5071
12519C3067J8670p8675p8270n839k3524O7135N0937P4776Q5666m0670O8551m4687
12507A27137n242l2227P2660J24774k1458j06659j13307j62730k5585J0855j4319
12496a46101Q476J46399Q5281Q1246l8776K0456R4041N3204j20360j63914k00029
12485a80077L8552N4168Q5446J59841n9026j01262J02763J21722j28832r0736
$$ y = [195307, 215146, 75505, 147966, 117509, 176998, 34923, 51817, 22925, 23168, 107238, -28167, -42741, 6537, 99181, 18201, -42766, 15052, 47490, 84314, 74194, 89965, 158363, 42635, 106893, 104173, 168326, 235326, 186437, 99718, -39538, -65012, 151904, 279325, 334219, 229443, 328041, 367882, 117587, 89986, 46018, -19901, -76241, -78969, -52004, 33067, 51737, -26938, -105208, -111047, -134571, -67436, -16499, 58277, 143943, 103273, 171824, 127137, 121895, 89668, 162328, 287102, 265644, 158985, 45678, -117052, -142637, -131782, -146101, -137625, 8774, 94055, 175301, 136525, 156981, 251022, 304226, 183866, 19952, -180077, -141525, -87357, -1911, 157930, 98904, -2358, 100405, 222127, 93295, 2559]
12475B559M8934P8464J61406m3507r4496j41734J17148p369j7686r7838j0351
12464d470o2533k7831J4894J674r463m8551j79493P1761K18108K34052K43775
12453D51923O0834m2654r5661M1307J49552L636o7302O6644Q6798J90357K40353
12442A085787J63561K21717K32724Q2292k0389K450j50641j71403j04962k84787
12432A056349l32840j70175m4662r1179J3828j94557p8552O1289q1635j11202
12422B6664J2342J06484j2170q9807n3620K04944J02364j78607p6755R9670j5436
12411A26073O9311R587J7413o1014j18390q1918j08439N8225N6891N785M2758
12400A6282N6085L0467Q0094j06661p7587O8804J21979L6119j35874j8890p0319
$$ y = [2559, 51493, 129957, 291363, 247856, 153360, 11626, 128774, 121405, 103719, 5881, -4470, -67003, -94834, -79940, -78266, -87729, -136280, -315773, -244012, -25904, 208148, 451923, 512757, 470103, 374442, 415749, 565301, 568937, 501635, 568279, 655077, 845434, 1085787, 1249348, 1471065, 1703789, 1786081, 1765692, 1768142, 1617501, 1446098, 1341136, 1056349, 723509, 553334, 508672, 417493, 431321, 236764, 158212, 219501, 137866, 26664, 39006, 145490, 133320, 43513, -10107, 194837, 297201, 118594, 41839, 141509, 126073, 195384, 204971, 222384, 161370, 42980, -38938, -147377, -89152, -32261, -26476, 16282, 72367, 102834, 182928, 76267, -1320, 67484, 189463, 225582, 89708, 70818, 499]
12389D99n9505j783q1652J5533n5910L855J16003J03445J652L9079M5749n3251
12377G3714L5109m2090r1152K6380q0557M5782O1803M5885R6480R9624O3946L3309
12365C68233q2650M6577K0531j42706j40183o7818K2073r3883m4458O9717J06169
12354F1602N4010k5642j40802m82j3276p0306l561k8703j7033J14687J16026O7439
12342A13959J32191R3622K2054N4885p0844j83008j85793K2876J35479L5357j13905
12331E6873J8920Q7557j94573Q5522N1137l0477M3882L7094j26986j10614m3349
12320a25014R0417J24062r7163j02110j4963R6743N8513J18122P8355j43161O2633
12309A46434J7019o3244Q4038m0889n3836k849L4819k4163M5852R635o7671N3756
$$ y = [499, -59006, -60789, -142441, -126908, -182818, -178963, -62960, 40485, 42137, 81216, 126965, 73714, 108823, 66733, -24419, 1961, -78596, -32814, 28989, 74874, 171354, 270978, 334924, 368233, 285583, 332160, 352691, 209985, 69802, 1984, 24057, -69826, -114284, -44567, 61602, 115612, 89970, -50832, -51314, -64590, -134896, -138457, -167160, -184193, -69506, 46520, 113959, 246150, 339772, 361826, 416711, 345867, 162859, -22934, -58, 135421, 170778, 56873, 75793, 163350, -31223, 54299, 105436, 74959, 118841, 155935, 28949, -81665, -125014, -34597, 89465, -7698, -109808, -124771, -28028, 30485, 148607, 226962, 83801, 146434, 163453, 100209, 184247, 143358, 89522, 86673, 121492, 97329, 143181, 152816, 85145, 138901]
12297A38901q3426j65722k9190k5093p5708J32186J06491Q3500J02910j0891j12566
12286F1392j15859p6931K10845K3751m4756P6026o040j75474O8386m8873k3419
12275e0952R7476j74967j34145L5270Q6982R2969J76706k3013J6889r5507m2335
12264a4627p9901N3596L0539O331O1669j1388K728L2741K5809L9567O6208m4620
12252A68652m0580j90756L2095o3024L8844Q5287k8744o5161j2437l2215P0298
12241c7741O9269L8473m9603q9746p897Q7505q9801m3592M0177J57166J23011
12230A97221m2316M5654k1790m4787k809j6880p2444j74767M7132R0359J04062
12219A08635K0712n412j70248j29319J11493J05446J9737P5462M844j6062j00755
$$ y = [138901, 55475, -110247, -139437, -164530, -240238, -108052, -1561, 81939, 184849, 173958, 61392, -54467, -131398, 79447, 103198, 58442, 134468, 128428, -47046, 21340, -27533, -50952, 46524, -128443, -262588, -227318, -140336, -47367, 129339, 106326, 123215, 27708, -14627, -94528, -40932, -10393, -4062, 57607, 46219, 48947, 81688, 107497, 147064, 213272, 168652, 128072, -62684, -30589, -93613, -54769, 30518, 1774, -63387, -75824, -108039, -37741, 31528, 70001, 20398, -69348, -77245, 10260, -79541, -123133, -82956, 74210, 197221, 154905, 200559, 178769, 133982, 131173, 114293, 41849, -132918, -85786, 4573, 108635, 129347, 123935, -46313, -175632, -64139, 41307, 61044, 136506, 141350, 125288, 24533]
12208B4533o2044N4326m1072q9680J35261p1444j04668J15599j3335J27920j5529
12197E9867j68059M4673J21930M135K1762o3681j5514J61048m6298n6925l4939
12186B7999N6733J75114L6014o5467j53959j2181O917j9853n9964N0217j51837
12175a10267j22169K8564J05315J51140m9173K028J22162j9983n89O2987L6848
12164B06863j67562j20401Q9676j1506j23475j61390J18593P8984R2355n0205
12154d8068M4632J06155l1414j22940J57600J22952j48214r4553J53786R921n1318
12143I8539M1884k7969k2757K5791k0687q0800j14098J9018M1058j21820N9834
12132a02007K3160K3443J3909O0739j2210R0223P429M7843m5377j02781n2256
$$ y = [24533, -37511, 16815, -24257, -113937, 21324, -50120, -154788, -39189, -52524, 75396, 59867, -108192, -63519, 58411, 62546, 84308, 20627, 5113, 166161, 119863, 62938, 27999, 84732, 259846, 295860, 230393, 76434, 64253, 71170, 51317, -8647, 41570, -110267, -232436, -203872, -98557, 52583, 3410, 5438, 127600, 107617, 107028, 170015, 206863, 39301, -81100, 8576, -2930, -126405, -287795, -169202, -90218, 2137, -48068, -3436, 102719, 71305, -51635, 105965, 228917, 80703, -13850, 139936, 149857, 98539, 140423, 112454, 89697, 115488, 94801, 14001, -100097, -81079, -40021, -161841, -102007, -78847, -55404, -41495, 19244, 7034, 97257, 104686, 152529, 107152, 4371, -47885]
12121d7885k3213k6334r758R4480Q1785J52899L4071j19257j94562Q2702J61230
12110A86158O23m8127q9711o8765j19354q1225l2074K931J67203J06338J33324
12099A57321O0964j52323r1441k5995J37387r0610m9126L646L6272p4723J9305
12088f9323J1949R781N185O2386j02335n4216l2538P4591k01P1346J30190P8171
12076A84986n5749j03745l8908p9116q4028n1791Q6497Q8658L4145O8440j9151
12065C0238r8093q8528j09708o0538P2882M3072j2149J26489J21160K2910K3943
12054G1678m5009j14383r8284N2226N8453j4264M6458l91k6848K7781r7942L0776
12042a09749J39977N8540J0748K0003J8008r399K4752j15209q0193p0565J03366
$$ y = [-47885, -71098, -97432, -107190, -12710, 69075, 221974, 256045, 136788, -57774, 24928, 186158, 186781, 138654, 48943, -19822, -139176, -220401, -252475, -249544, -82341, 23997, 157321, 218285, 65962, -25479, -51474, 85913, -4697, -53823, -50177, -13905, -88628, -69323, -57374, -47593, -42408, 19978, -82357, -136573, -169111, -94520, -94721, -23375, 106815, 184986, 129237, 25492, -13416, -92532, -176560, -228351, -141854, -53196, -19051, 49389, 30238, -67855, -156383, -266091, -326629, -253747, -210675, -222824, -96335, 24825, 47735, 71678, 26669, -87714, -185998, -133772, -75319, -89583, -43125, -43516, -70364, -42583, -140525, -109749, 30228, 88768, 99516, 119519, 137527, 128128, 152880, 37671, -42522, -113087, -9721]
12031i721R1508R4849p6651J7584Q4401L2291M7515o8132m1288m349j15991O343
12019E8359j7775n5360M7307l8914m7858L5199j31110j8709J4602J49J8529L1723
12007a03858r087M1550m5108n8242K3481J04634J01658o8969L291Q9318O5263
11996A43931p6643k30677j88953P7566J20418Q8322N9109R2615q3639m7027N6265
11985A1287j9920n6023N809N3643R867q9916l4621P1182Q2720l7706K1038J23009
11973A40369P022o3534j2948l3077j07093n2150L8673N9282M3013q6972m6032
11962a13447R637M8073O321O5617J12947j1804q4504p1493K7377m9531n6544J37539
11950B0188K17359j54553K6076J03813n839j23489m8731O0188o6598m4061k9822
$$ y = [-9721, 81787, 176636, 99985, 117569, 201970, 234261, 281776, 213644, 172356, 168007, 52016, 58359, 40584, -14776, 32531, -6383, -54241, -19042, -150152, -168861, -154259, -154110, -135581, -103858, -112945, -71395, -116503, -174745, -151264, -46630, 55028, -13941, -10650, 78668, 143931, 67288, -163389, -352342, -274776, -154358, -66036, -6927, 85688, 2049, -44978, 11287, -8633, -64656, -58847, -5204, 4663, -85253, -119874, -48692, 34028, -3678, 17360, 140369, 147391, 83857, 70909, 37832, -69261, -121411, -82738, -23456, 19557, -67415, -113447, -103810, -55737, -49416, 16201, 129148, 117344, 32840, -38653, -11276, -60807, -117351, 20188, 237547, 82994, 109070, 212883, 207044, 83555, 34824, 95012, 28414, -15647, -45469]
11939d5469L0479J77623J36500l0157L8170q9708J1318K497k08770O2123P2898
11928A57504l3836r669n1421M9242p3293M5254J1692m3786k6560J84432K702L4483
11916B46744R146j96232q1583q6408j05034O1368R0347O540P2059M8017o0481
11905D483k763P190l1529l8837L3063N840j38400M824R4902O0614M4410k5361
11893A8436Q6639l9971l8969p6891J34654M2120m5829j60010q7705J06954J34128
11882G3556l0276R4037j00059j10807J24833K01775k5475l6729l4034j57983o4826
11871f5988Q7011o69j24878m2309J47961K4726M8638p5650N519R1181m2035o0906
11859g399l2591J06659M9963K1996m713k9952o4552J832o5539K67j92779n1077
$$ y = [-45469, -14990, 162633, 299133, 268976, 307146, 217438, 228756, 231253, 22483, 84606, 157504, 123668, 113999, 62578, 111820, 38527, 83781, 95473, 51687, 25127, 209559, 212261, 246744, 255890, 59658, -21925, -108333, -213367, -151999, -61652, -55112, 16947, 64964, 4483, 1720, 8910, -22619, -61456, -28393, -22553, -160953, -156129, -61227, -613, 43797, 18436, 105075, 65104, 26135, -50756, 83898, 126018, 80189, -79821, -167526, -60572, 73556, 43280, 137317, 37258, -73549, 51284, 253059, 227584, 190855, 156821, -1162, -65988, 21023, 20354, -104524, -146833, 1128, 25854, 74492, -1158, 4361, 95542, 53507, -7399, -39990, 66669, 116632, 138628, 133915, 103963, 39411, 41243, -24296, -24029, -216808, -267885]
11847b67885J60888J20838J9091Q636N9195N1754q5113q7946L4737l4551K1736
11836A380j03794k305l8736n053r5782Q2877J11007N3721N049K1256q1144M3043
11824h481K8074k6517J08087m8066p0127R2710N206p4753K006P838M1522o2974
11812e475p3915M5846J00641P7190k7128o5295r9619j49577N2161J73622J15615
11801A44066M2939R358P2582k8336j77790j90976j5004j0672J63124J50313j3931
11790A45673J45874o5850j65688j3297J37008j00797k85917J11688J87347M9608
11780A45649j82629j59758m1699Q7968P7834K7214Q4370K218j22340k4074k4033
11769a29280J17019k9201r5069J29073R2168K9694q034j2091l2560j19171J7685
$$ y = [-267885, -106997, 13841, 32932, 41568, 100763, 152517, 67404, -20542, 14195, -20356, 1380, -102414, -104719, -143455, -148508, -244290, -161413, -50406, 3315, 8364, 29620, -51524, -8481, 19593, -6924, 101163, 53097, -17030, 75680, 80886, 6133, 8139, 15977, 57499, -5475, -79390, -33544, 67097, 144287, 117159, 51864, -47755, -197332, -145171, 28451, 144066, 187005, 196363, 268945, 240609, 62819, -128157, -143161, -153833, 9291, 159604, 145673, 291547, 225697, 60009, 46712, 183720, 82923, -202994, -91306, 96041, 145649, -36980, -196738, -238437, -150469, -72635, -45421, 38949, 41167, -81173, -105247, -129280, -12261, -41462, -136531, -7458, 84710, 114404, 106370, 94279, 61719, -57452, -39767]
11758c9767q5246k13780L0833R5898Q6137J03520J3239j9322J13021J04025k0084
11747A68474p5437O0157N8318P3902m6902n4490j41508r8646m4753k3843O5251
11736e9477n7155M2327J34657M315n5858l3760o3903J03483N9511k5399r0432
11725d1691M2214J9801r8982L8492M0812L9714M8522k9884Q110N0820l2422l2985
11713E2521l6979O6071r0557r4508k1563N7825K2290o4207P2756L5854m3593q2984
11701a27074j68524R1212N158O3430J07053M2578J00119p0972m9677J1226m2299
11690c7770r2261m619K1348j06271o0277J59459R1729P6690k0307J36570k300
11679A61991j2024R954L7731j2691p0880L8010m8967p1604j7244j02727o8671
$$ y = [-39767, -125013, -338793, -307960, -212062, -125925, -22405, -9166, -28488, 84533, 188558, 168474, 93037, 153194, 211512, 285414, 238512, 184022, 42514, -56132, -100885, -124728, -59477, -116632, -74305, 60352, 64667, 8809, -24951, -88854, 14629, 74140, 48741, -41691, 523, 20324, -78658, -40166, 646, 40360, 88882, 58998, 67108, 117928, 85506, 52521, 15542, 81613, -8944, -103452, -125015, -67190, -44900, -109107, -36351, -497, -44090, -127074, -295598, -204386, -199228, -135798, -28745, 13833, 113952, 42980, -6697, 4529, -37770, -130031, -134650, -113302, -219573, -279850, -120391, -28662, 48028, 27721, 164291, 161991, 149967, 159921, 197652, 184961, 114081, 152091, 103124, 31520, 14276, -88451, -157122]
11668a57122L5599r9255l3594L9569J20503q1117n8028R725l3451M9017J26895
11657h1259O8757r6807O8714M6243K2628k265k03p2474q4381q2034J7756R7826
11645i7499J4881o2645J08523J21891k3712J1851r751m6850p3108J05096m605
11634D4072q3731J05528o3569l4097K3874k0919l3616J19448p2510k42058R1716
11623a65862J59144q1635k7694J20766J01880J50470m6668j72087j36715j2343
11613a10744N3232m1509L8172j697K579m9940k6314J12790N4006k1930j19048
11602a10403q8075Q1362J43701K2213J00399L2616n7000j8141L1109l0866K130
11591A09045r1973p8532J07060k0780n3687J17572Q8224P8574J76779j19654j32285
$$ y = [-157122, -121523, -220778, -254372, -214803, -94300, -175417, -233445, -223720, -257171, -208154, -81259, -12502, -109309, -40595, 5648, 28276, 26011, 25808, -46666, -131047, -213081, -195325, -97499, -82618, -145263, -36740, 85151, 61439, 73290, 63539, 16689, -56419, 48677, 44072, -39659, 65869, 2300, -31797, -7923, -28842, -62458, 56990, -15520, -257578, -165862, -6718, -88353, -116047, 4719, 106599, 257069, 210401, 38314, -98401, -110744, -57512, -99021, -60849, -62546, -59967, -109907, -136221, -23431, 30575, 8645, -110403, -198478, -117116, 26585, 48798, 149197, 181813, 124813, 106672, 137781, 106915, 109045, 17072, -61460, 45600, 24820, -28867, 88705, 176929, 255503, 432282, 312628, 180343]
11580A80343n3200m5796o2536j13296R475N3224k6216j29638P0210O3311J2995
11569d1124O8025P8049R046k2319K1486m626k05421J1485N7092L3328P4893m2730
11557C7184J4204j12556l5882m5457R2316m2224N674l9487m1424P8756Q2208j6626
11545b3314j16029J5236k2569K1402j1123J76515p202N6673R6742j04518j27819
11534d6006m7181J05119J34625J38883l3717o3111r8264p0849J1550q1088o7328
11523a17367N3387j17713l0542J39299J67464j5008J10982r6510j18993M2869
11513A7868Q9252j10968j55888K1673J15346m3082N1608n9281r1770K01368m8592
11502a2466k8375J844K10739M2480j13460m656r0629p3658j09328l9196J44627
$$ y = [180343, 127143, 81347, 18811, -94485, -85010, -31786, -58002, -187640, -117430, -54119, -41124, 26901, 104950, 113996, 91677, 113163, 108537, -96884, -85399, -28307, 5021, 79914, 37184, 51388, -61168, -97050, -142507, -50191, -92415, -86741, -126228, -167652, -88896, -6688, -23314, -139343, -124107, -146676, -125274, -136397, 40118, 32916, 89589, 186331, 81813, -46006, -93187, 11932, 146557, 285440, 251723, 188612, 90348, 19499, 31049, -50039, -117367, -63980, -181693, -212235, -72936, 94528, 79520, 190502, 93992, -25001, 17868, 107120, -3848, -159736, -138063, -22717, -65799, -14191, -73472, -165242, 36126, -12466, -40841, -38997, 171742, 214222, 100762, 96106, 5477, -68181, -177509, -216705, -72078]
11491g2078M9323j04329R5233r855o8854P8592L4195n6201q6599M9030n9356r9632
11479b50531Q9877M0909K8132N4200R548J0700m9092M6059M3818m6943L9107k2856
11467g072j19371m2239m2465J4554J48474J71478J39781r6815j85915p0173J57868
11456F8105k2960j48291j9023O244R515M7837L6074M4422J2489q886J1107l4190
11444B443o4748p6332l5039K3054M9075J44985J51538k0379j09429K023P0267
11433A37458M4918k4656j44976o8602J9494j3664k2139Q1701M6754o0316j6050
11422b0078m8396j56273l239P9012N1047Q374N4216J2898M2940R176P4049J05050
11410B08776p066K143j21034o8897R76J5651k6222J08171M6086m7265r8653l1572
$$ y = [-72078, -22755, -127084, -31851, -41706, -110560, -31968, 2227, -53974, -140573, -91543, -150899, -250531, -160654, -119745, -91613, -37413, -27865, -17165, -66257, -20198, 23620, -23323, 15784, -7072, -126443, -168682, -211147, -196593, -48119, 123359, 263140, 166325, -19590, -89763, 68105, 45145, -103146, -122169, -115925, -106410, -58573, -22499, 21923, 34412, 25526, 36633, 2443, -62305, -138637, -173676, -150622, -101547, 43438, 194976, 174597, 65168, 67191, 137458, 182376, 157720, 12744, -55858, -36364, -50028, -72167, 9534, 56288, -4028, -20078, -68474, -224747, -227986, -148974, -97927, -89553, -35337, -22439, 20501, 29677, 103726, 208776, 201710, 203853, 82819, 13922, 14898, 30549, 4327, 112498, 158584, 111319, 12666, -18906]
11398a8906P5600o9417j07835p5947j54933l2036J20434J22510Q756N881k8503
11387a54396m287N6329J7641o6J3469K9438p0381J22007o4574r5354J15551q2583
11375a17206q3290P8982P6764L5748k2154j0377J2618j60973P7581R4246O0132
11364D2071q9291o0122M7983J47331J24749j4397R519m2652n3144K6589O3672
11353B02308L77J8508l1414P5736R0841J19581j7885j09212k20448j60906M205
11342b8309R865o0833j35831n0012J36758K09113J1768p7475K0001P4165j05282
11331C928p6709P848J6782O2614O5164J23531j18725r7370p7613n6865l196l3362
11319a83973R5414K10835p7043p8925L9196k8981j18161k469R0845o0500K5445
$$ y = [-18906, 56694, -12723, -120558, -196505, -351438, -383474, -263040, -140530, -131774, -125893, -154396, -158683, -102354, -84713, -84779, -71310, -41872, -112253, 9754, -54820, -150174, -34623, -117206, -200496, -121514, -44750, -9002, -31156, -41533, -28915, -189888, -112307, -18061, 42071, -47220, -107342, -59359, 87972, 212721, 198324, 207843, 165191, 112047, 138636, 202308, 202685, 221193, 189779, 265515, 356356, 475937, 458052, 348840, 128392, -32514, -28309, -18444, -79277, -215108, -265120, -128362, 80751, 92519, 15044, 35045, 109210, 3928, -72781, -64933, -48151, 14463, 79627, 203158, 84433, -12937, -90550, -147415, -150611, -183973, -88559, 122276, 45233, -33692, 5504, -23477, -141638, -144107, -53262, -113762, -88317]
11308h8317K3028n1914o4424M7320j6348J1422n5258R5405O2504R6750j00932
11297d0764K581J0225o3525q0291j32951Q3745O6120O6470J52810M3982m9603
11286E8799q923K3989J04915j27741j9522J07354j28j7641N0676j57665j26219
11275a12106K6298L1568j5870l4553r1315L2537J74693J96792N9236q5863j03461
11264G7956o2937K8896N2772p086j4845L9286n7790m4536m2744Q0207m4072m2720
11252c7613J9437l7159O0697q85L1180O1081j28357L9601n4517O6294N3243M3620
11240A16622k9120O302K3139j33709k3305k0825r8638l8578k4126Q4074M7308
11229i0856K0325M7557J5024J06366O9363r2135k9987n3608o3300r5360P2962
$$ y = [-88317, -65289, -117203, -181627, -134307, -150655, -139233, -194491, -99086, -36582, 60168, -40764, -38183, -27958, -91483, -171774, -304725, -220980, -154860, -88390, 64420, 108402, 58799, 49876, 73865, 178780, 51039, 31517, 138871, 138743, 121102, 171778, 14113, -112106, -85808, -54240, -70110, -104663, -195978, -163441, 11252, 208044, 267280, 181417, 77956, 15019, 43915, 96687, 89601, 74756, 114042, 56252, 11716, -31028, 49179, 5107, -37613, -18176, -55335, 5362, 4477, 35657, 96738, -31619, 7982, -46535, 19759, 73002, 116622, 87502, 93804, 116943, -16766, -40071, -60896, -159534, -198112, -222238, -138164, -90856, -70531, -22974, -7950, 98416, 167779, 75644, 45657, -7951, -71251, -166611, -93649]
11218i3649N0945k0578n2554K7381J0206J18682P8782p6322j06934j44967R5886
11207a13122P4508r293p3092M5395p9187o6862P7829r2617K0402Q2943P9808L7660
11195a5628j2755j98k5083J7604J10265J8148j02352Q9378K945n0101r3537j99989
11183b61303k487Q9187J17547J81435K0729k9180J5214j15583j09304q4352p6527
11172b54624J28697M5205j38076L3532J92719K8592j5946j4364l2846R5488Q0419
11161A48796M2580k7629n7181j3541K2680n0852p8818j8630K8120J06218j13747
11150a2004j24985L814j405j2225J8902m3160M0650R0326O9442k3610N7565L6355
11138I9665J8802R0861P3581J6217r9280r5412o7027n6179l6030J640J27688P3462
$$ y = [-93649, -42704, -63282, -115836, -88455, -78249, 40433, 119215, 42893, -64041, -209008, -113122, -38614, -47907, -120999, -75604, -154791, -221653, -143824, -236441, -216039, -133096, -53288, -15628, -28383, -28581, -53664, -36060, 74205, 92353, -9999, 79379, 82324, 32223, -61314, -261303, -263790, -174603, -57056, 124379, 145108, 115928, 131142, 15559, -93745, -178097, -254624, -125927, -80722, -218798, -185266, 7453, 36045, 20099, 5735, -27111, 68377, 148796, 191376, 163747, 106566, 93025, 115705, 64853, -13965, -32595, -4475, 101743, -12004, -136989, -133175, -134580, -146805, -127903, -171063, -130413, -40087, 29355, 5745, 63310, 99665, 118467, 209328, 282909, 299126, 199846, 104434, 37407, -18772, -54802, -53162, 74526, 147988]
11126A47988P203m7883k52962O1913L3227o1382l7695K3866O0857J7407R0140
11115D2679P261k7511K2906N689k2208K7967j06775l0369q606L0563q2241O7755
11103g2890J81704J11553j46611j25585L9494j12899M5820N4785r2599r29R4794
11092b3363Q5161K3074J1407q037o520o1130j3571N4384J6679j5395J5528J18496
11080A96713M8786J8283N5763l6039j25021k14290o8610J48671J05676m39j16489
11069A3004j6992O9945l4272o1151K00996O459j1229J44848M5103q9335l1168
11058B36208q7041n3124q502j4290r5361p1205M1089m723j38349p3377O3526K25843
11046B0694J59956p5233O541n9255j67955j28513r1454M4473J18180J19372K5718
$$ y = [147988, 155191, 107308, -145654, -83741, -50514, -111896, -149591, -125725, -64868, -47461, 42679, 49940, 22429, 45335, 51024, 28816, 56783, -49992, -80361, -88967, -58404, -140645, -72890, 108814, 220367, 73756, -51829, -12335, -125234, -79414, -24629, -117228, -118157, -23363, 61798, 84872, 96279, 88242, 81722, 20592, 7021, 61405, 78084, 62689, 78217, 196713, 245499, 263782, 319545, 283506, 158485, -55805, -124415, 24256, 129932, 129493, 13004, -3988, 65957, 31685, -29466, 171530, 177989, 166760, 311608, 356711, 267376, 236208, 149167, 96043, 87541, 73251, -22110, -93315, -52226, -56949, -195298, -268675, -205149, 20694, 180650, 105417, 111958, 52703, -115252, -243765, -335219, -290746, -172566, -53194, -27476]
11035b7476j6619J0275p2989O3728l1940L1104j34118j12454j5686k5115J81790
11024a49500L0720l3360m5964l1855N9220M4994m3049P753L2456J9224N8429O8406
11012A7474J9605j00619q4983J00620o0587m7924J15185R7990m3823r7334l7709
11001a22105r1654J46420N8713O516J35813O6293M0308k682j34644j9104J07625
10990A91499L0466n2967j36902q1355k5636m5205j1011P4067R2028J14028r1709
10979E7303q3221k1060l7400l1210M0916N4324J6677m4489J0499j4321j27378
10968a79360q3893K46149J45976m0787J4171j6118o7677N0637Q4662r4562p5993
10957a6795l9400m9620N1004J42222L8421K6084P1140q3123l5211o7447M8491
$$ y = [-27476, -44095, -33820, -106809, -43081, -75021, -43917, -178035, -290489, -306175, -331290, -149500, -118780, -152140, -198104, -229959, -170739, -125745, -168794, -161041, -128585, -109361, -50932, 17474, 37079, -63540, -148523, -47903, -108490, -156414, -41229, 56761, 12938, -84396, -122105, -213759, -67339, -8626, -2110, 133703, 199996, 240304, 237622, 102978, 83874, 191499, 221965, 168998, 32096, -49259, -74895, -120100, -131111, -57044, 34984, 149012, 57303, -25918, -46978, -84378, -115588, -74672, -20348, -3671, -48160, -37661, -51982, -179360, -263253, -17104, 128872, 88085, 102256, 86138, 18461, 69098, 153760, 59198, -16795, -56195, -105815, -54811, 87411, 125832, 151916, 223056, 139933, 104722, 37275, 85766]
10946H5766Q0659O4914j88j56907j27689Q8940N3505K7614l5098j02287J5005
10935e766P1884M1450J58373j36378j38414j07126o8741O3557O245k1578J57571
10924B1077R3393M4171k4947n1424l262K2028p6946o566r9887J1961J09080j9669
10912A9009P029K29519J33587M0731j56152k18943r3500J9358P3220l5183m7606
10901b8931o9159p3351M2708m197L9626R9495q9815l6914J36426L8735m6876J9486
10889B7233J01785J2762N976j05311j03649J31723N3004r1234M639q2195o1643
10878a06910O7713r5576N7684J44797j1402p2676j38997O5923J33731R1045K7395
10867A62727j8910o2992m1859J9769l479p7300n6047L9282J10337M0835M9284
$$ y = [85766, 166425, 231339, 231151, 74244, -53445, 35495, 89000, 116614, 81516, -20771, -5766, 66118, 107568, 265941, 129563, -8851, -115977, -184718, -121161, -114916, -136494, 21077, 114470, 158641, 133694, 82270, 79008, 101036, 24090, 17524, -82363, -70402, 38678, 19009, 26038, 255557, 389144, 429875, 273723, 54780, -38720, -19362, 53858, 18675, -28931, -98090, -171441, -128733, -132930, -93304, 6191, -83624, -120538, 15888, 54623, 7747, 27233, 129018, 141780, 147756, 42445, -61204, 70519, 123523, 32289, 36928, -45267, -106910, -39197, -134773, -77089, 67708, 56306, -16370, -155367, -89444, 44287, 135332, 162727, 143817, 80825, 38966, 58735, 55256, -22044, -78091, -38809, 71528, 112363, 161647]
10856A61647O1439j38680j34354r2729J8282J59018K2901M346J44738J0402L452
10845B20462M756l8430J4655l04937k22727P637j27747L3416J36178L06545R6215
10834A26023K4231j74169n2704L4888Q1205P221k2900K7077J5065Q740j1190K2373
10822H5860p3944j68541o7385O2888m7668o4226J83454J21816p6144Q357p745
10811d3278R0091Q3836j11382j24431o5596P2366N6265M0014N6651j0027Q7625
10800A32134j8208j08055r809K682J8966k3590l0171J1716n9375K2569J72120
10789A10979J46700k0243q9551j9279q7919k7803N6174K6400q0681k03281l5894
10778b24398N9115O839J93250O9028n7594q9873J24638R4859R6652l0544j19167
$$ y = [161647, 223086, 84406, -49948, -142677, -124395, 34623, 57524, 61870, 206608, 217010, 220462, 225218, 186788, 201443, -103494, -326221, -318584, -446331, -412915, -276737, 29808, 126023, 150254, -23915, -76619, -41731, 39474, 46695, 23795, 50872, 65937, 74677, 63487, 85860, 11916, -156625, -224010, -161122, -208790, -273016, -89562, 32254, -43890, -35533, -43278, 46813, 130649, 19267, -105164, -170760, -98394, -42129, -2115, 54536, 44509, 132134, 113926, 5871, -3938, -1256, 17710, -5880, -36051, -24335, -83710, -61141, 110979, 257679, 237436, 147885, 128606, 40687, 12884, 69058, 95458, 14777, -188504, -224398, -165283, -158444, 34806, 103834, 46240, -43633, 81005, 175864, 272516, 241972, 122805]
10767A22805j43611n744J5144P1083j0275J20836m2533n9828m3243p2166M3327
10756d205k1498n9903k8360o8836Q3854N0117K6258j5106P674m812J39180K03358
10744C07721l1094p2429j4439j02181m7814J23992P9267l1715j03807o9499j24153
10733h6151k8242R2316Q3287N6049J2835j36352J8830K367q7130P2736P0549l1021
10721D0073q5052J05242L9343K5727k6085P4620M025r3565l1661L9143n8440l3103
10709B67N0111l9389j75360M6990J64125J7139j69715j21401K8309l384J14560
10698h7748J00131Q1335M7908j838o4498o7332l2215r2177Q5939J12934J17913
10687B00352o3922j90692K6019n6793k5574K9221P1288m2421k9676j9183j4798
$$ y = [122805, -20806, -26550, -11406, 59677, 49402, 170238, 127705, 67877, 24634, -47532, -4205, -25703, -85606, -113966, -182802, -98948, -48831, -22573, -37679, -30005, -34817, 104363, 307721, 276627, 204198, 189759, 87578, 39764, 163756, 243023, 211308, 107501, 38002, -86151, -114393, -22077, 61210, 117259, 130094, -6258, 12572, 14939, -72191, 545, 71094, 40073, -44979, 60263, 99606, 125333, 99248, 173868, 177893, 84328, 52667, 91810, 33370, 267, 50378, 10989, -164371, -117381, 46744, 63883, -105832, -227233, -198924, -202308, -87748, 12383, 93718, 141626, 139788, 75290, 7958, -24257, -116434, -30495, 82439, 200352, 136430, -54262, -28243, -85036, -110610, -81389, -10101, -52522, -82198, -101381, -116179]
10676a16179o6124k5685q0689l4643K17770n0129L8566q7383O0262m2423L9236
10665a47421j621m8551K8965O0806J93557N3288j01000j5190m0979j35248l8703
10654a92097M6301M9741j7262j05777J83137O2655l8739k3530j84815K4750J47803
10643d7833K8467j8340n3761o4112N0207l5681K9846M9636l9236j53655K13977
10632d0485K6299j08330l5090J02168k5861o2164P9376J28403K1303k9980J5496
10621G1135J06705p2716j01710J21112m3356n5363M0139Q4896M6300j32857m6830
10610A7455J21259M7619P2686l4315M6279r1881j42316j7500N4828n1187l9929
10599a7002l1907J2354Q5928p9814j10342J5249L6591m1607L3545K1485M5991
$$ y = [-116179, -182303, -207988, -288677, -323320, -105550, -155679, -117113, -204496, -144234, -186657, -147421, -149042, -197593, -168628, -107822, 85735, 139023, 38023, 22833, -18146, -153394, -192097, -145796, -96055, -113317, -219094, -35957, 26698, -12041, -35571, -220386, -195636, -47833, -19366, -37706, -91467, -155579, -105372, -141053, -111207, -61571, -100807, -254462, -40485, -14186, -122516, -157606, -55438, -81299, -143463, -64087, 64316, 85619, 55639, 71135, 177840, 105124, 3414, 124526, 81170, 25807, 65946, 150842, 197142, 64285, 17455, 138714, 186333, 259019, 224704, 270983, 179102, 36786, 19286, 74114, 22927, -17002, -48909, -36555, 49373, -30441, -140783, -125534, -88943, -130550, -97005, -75520, -29529]
10588b9529M812l0748O9334j42238p7722P2754J29469R5478N6575M3302n7971
10577A33516l5338q144k2789m3469m1493Q230N2498J57198m9908r0575j59130
10566i9404J04210P7176j33147o0200J99513J26436J8888m6336j35137j45107
10556i3108R2958L8037j09713k1624p7368o5238K8723Q0875O7003R6149K6760
10545F3454j4800j20812q2271J08035K01622k0625j12737K8476j4893j04306q3884
10534a52741k2285j9113L9437J03227o6766R5150K4566n7549p9375n0177o2297
10523b47923Q9247N4996j9068O3518J48956L2935k8449j9712M7695L1544m8830
10512A04909M0467n328J00611J7137o1765j27354j29467J24488J05252k3984k7781
$$ y = [-29529, -24717, -55465, 13869, -128369, -206091, -133337, -3868, 91610, 148185, 191487, 133516, 98178, 90034, 67245, 23776, -17717, -9487, 43011, 200209, 150301, 59726, -99404, 4806, 81982, -51165, -111365, 88148, 214584, 233472, 187136, 51999, -93108, -150, 37887, -71826, -93450, -170818, -236056, -207333, -126458, -59455, 36694, 63454, 48654, -72158, -154429, -46394, 155228, 134603, 21866, 50342, 35449, -68857, -152741, -175026, -194139, -154702, -51475, -118241, -23091, 1475, -56074, -135449, -185626, -247923, -158676, -103680, -122748, -59230, 89726, 122661, 94212, 74500, 122195, 153739, 104909, 145376, 140048, 240659, 257796, 196031, 68677, -60790, 63698, 168950, 144966, 117185]
10501A17185j74687L0868k5987J0095N6241Q4367j39392j47142L8732R2536Q0308
10490B3124L6035J40689J3348j12446P5084q9239n9349J20147j8107j18818j22259
10479a11791L9128J6413J635L7363J49978Q1494R154k01061o301N1051l5050O6134
10467I8147j02918j37960m9014J01061Q6845l91M9061J44827J43582O1469q9526
10456C05183l49237N9276J29494k8376l6890j69947J0466L4505N082J9691K4879
10445D126Q4872J04542k0446K1019n2582K6962n454R3123K810j72953J02695O8796
10433B57510n1079r4916M5929Q4033q2507M0835l6258j15108J65546L9226j46616
10422A06595l7559K6289p1269j55204o176O4078q8950J7516J40204Q0978K959
$$ y = [117185, -57502, -26634, -52621, -42526, 13715, 98082, -41310, -188452, -149720, -57184, 23124, 59159, 199848, 213196, 100750, 175834, 86595, 27246, 147393, 129286, 10468, -111791, -72663, -56250, -54615, -17252, 132726, 214220, 223374, 22313, 16012, 67063, 32013, 98147, -4771, -142731, -191745, -90684, -3839, -4230, 44831, 189658, 333240, 394709, 305183, -44054, 15222, 144716, 116340, 79450, -90497, -80031, -45526, -40444, -20753, 4126, 88998, 193540, 173094, 194113, 141531, 168493, 163039, 256162, 258972, 86019, 188714, 257510, 206431, 111515, 157444, 241477, 158970, 199805, 163547, 48439, 213985, 253211, 106595, 69036, 95325, 24056, -131148, -137324, -73246, -162196, -144680, -4476, 76502, 79461]
10411G9461o2698L9044k4076l0219Q8995j45910q3041O0303m8712p9993J25762
10400h1084J3286J16437n2582k4872m4320O972J05926Q0501k2152n9434O5809
10389A04487K0187k8671l6605j00460q516k2730N7377Q6422o101r0259R2329J62029
10377B29489M0629Q9050k39702O178K30179j95711q5840j878o133m7878n2732
10366c4349J55251K0412o9941J4025m4042M1575m7102q4780N219N5348J1636m392
10354A8860j24274o9181J16647J09918j2605j42486k7096J3665N3817L9119J53231
10343A29615N7359K95k10704q967J50844P3342o9488j38619j2027J191j02564
10332a29723L5084J24680J09928O731J1172j7298L8L9924k1373n2752k03547n6047
$$ y = [79461, 16763, 55807, 31731, 1512, 90507, -55403, -138444, -78141, -126853, -206846, -81084, -67798, 48639, -3943, -28815, -73135, -66163, 39763, 120264, 98112, 38678, 104487, 124674, 96003, 59398, -41062, -49578, -72308, -14931, 71491, 65390, -24869, 67460, 229489, 270118, 359168, 119466, 125644, 355823, 160112, 74272, 72394, 66261, 18383, -34349, 120902, 141314, 71373, 85398, 41356, 82931, 35829, -48951, -43732, 11616, 23252, 18860, -105414, -174595, -57948, 51970, 39365, -103121, -130217, -116552, -62735, -23616, 129615, 186974, 187269, -23435, -32402, 118442, 191784, 122296, -16323, -28350, -27159, -129723, -94639, 30041, 139969, 146700, 157872, 140574, 140612, 180536, 159163, 106411, -97136, -153183]
10320a53183k3006k5863N370J50136J54736j8868o8400q018L0112N157l4684k6814
10308a3325K9942O4009m7524p4385K2659R0354L5011n8921R940K7045J4762o1199
10296C8368j17027p3248R3866Q8611K4193l0066L7838J7538K6412r9673n8561
10285e1749P1298O5447J7066m5749J5844J438j05303m2841J14135P9190j49511
10274c0735n2315l4493P6582K43005J63918q6812j05682n5721M6324j8166q923
10263A36982J64881M9676j46474M1550j8604r4080l5475J24889J98909o5400p8852
10252B78002k842p6607j03174q1280K0799P3237n9155P6700L4095m295r4947j77316
10240a16783M1095k4334j9963J54120o0832N5699l6285n054o0532n954J03599
$$ y = [-153183, -176189, -202052, -196682, -46546, 108190, 89322, 20922, 12904, 43016, 48173, 13489, -13325, 16617, 80626, 33102, -41283, -18624, 71730, 106741, 47820, 57760, 84805, 99567, 38368, -78659, -151907, -58041, 30570, 54763, 24697, 62535, 80073, 106485, 6812, -51749, 19549, 84996, 102062, 56313, 72157, 73595, -31708, -74549, 39586, 118776, -30735, -83050, -117543, -40961, 202044, 365962, 279150, 173468, 117747, 164071, 145905, 136982, 301863, 351539, 205065, 246615, 228011, 133931, 98456, 223345, 422254, 356854, 278002, 275160, 198553, 95379, 14099, 34898, 108135, 48980, 125680, 159775, 155480, 60533, -116783, -75688, -100022, -119985, 34135, -26697, 29002, -7283, -12337, -72869, -78823, 24776]
10229B4776J29044J23024j54043j24778m0732Q1267Q7026J38822j87704R3758
10219A70460J07594K1372o7209j3345j7284J70767j747j52820o4865M3461K2241
10208B18625m3873j22634m0380J759J76725J50136J36618L38025L05522L33575
10198A454098L31236K81484J11594L6543J10414K3981P3513J17225L135j10968
10188B432255j36557k02373l38814m27714k14211r1813j56632j87377p1429j35464
10178D69871n9145j9258m1191k9497J04894J73594p5145j72678j75409j07985
10168F8051P549J5710n1214M9069J41884Q2940p025j31562Q7875R2495k13831
10157A41941r6556J45054J01717L977k4298j04499j0009j78547l0175R4486k3259
$$ y = [24776, 153820, 276844, 122801, -1977, -42709, 38558, 125584, 264406, 76702, 170460, 278054, 299426, 232217, 218872, 201588, 372355, 370608, 217788, 152923, 196384, 218625, 174752, 52118, 11738, 13497, 190222, 340358, 476976, 815001, 1120523, 1454098, 1785334, 2066818, 2178412, 2214955, 2325369, 2349350, 2422863, 2540088, 2543223, 2432255, 2295698, 2093325, 1754511, 1326797, 1112586, 1020773, 864141, 676764, 605335, 469871, 410726, 391468, 350277, 320780, 425674, 599268, 524123, 351445, 176036, 68051, 75600, 91310, 40096, 89165, 231049, 313989, 306964, 175402, 263277, 355772, 141941, 45385, 190439, 292156, 296133, 271835, 167336, 157327, -21220, -51395, 43091, 19832]
10146A9832r8086m2214R7991n4321r6754N5792J23529M6023n5480p1765R218N9663
10134f572M6651J17969m1384j45493M4315L409J9176J01807j52226k63351O9514
10123b06185J70086l107j10074m7404L7554J2420L4432M9832Q983p4913K0609
10112a07767R0303p186k1273P2068J01042n0909O6623k3560k08296r1989J7581
10101a63363J15914Q5700k969j40336j28263L472n6391p4192R1841R4162J7047
10090a57378n4116J64364J15410J2541j08923n7767n5995O5891J46051J34930
10080B05008k7412l6356n5807j3927k8696j48038m639r9274Q6741O8124J07940
10069E3664J15766l0920j3338O7611o1969M6916K7455n9190r8761q0534j15016
$$ y = [19832, -78254, -120468, -22477, -76798, -173552, -117760, 5769, 51792, -3688, -75453, -66235, -6572, 40079, 158048, 116664, -28829, 15486, 18895, 38071, 139878, -12348, -275699, -206185, -36099, -39206, -149280, -196684, -159130, -146710, -112278, -62446, -53463, -128376, -107767, -17464, -24650, -45923, 26145, 127187, 76278, 142901, 119341, -88955, -180944, -163363, -47449, 38251, 35282, -105054, -233317, -229845, -286236, -360428, -268587, -174425, -157378, -211494, -47130, 68280, 80821, -28102, -85869, -141864, -75973, 70078, 205008, 177596, 141240, 85433, 71506, 42810, -105228, -109867, -209141, -122400, -54276, 53664, 169430, 138510, 125172, 192783, 130814, 177730, 205185, 145995, 47234, -33300, -148316]
10058a48316n0138O9120q575K0644J59092J85596J12727j26791j00252K150l2602
10047H2655j16650j85541p573K9357J64465L0922p9535J22320K7606k07275J71006
10036C1757J64695l7396k14832n4092O313Q2663J04248J05239n2814j78363q1824
10025a24406J83649k8597m5620l3802R5392Q4553N1412j91277q851L6599R131
10014B8183j02011R7220R5334k00834K295J3976J476M2028P9131o9473J7315k0278
10002a5638k9912k0876r2785R7164L5827O184r982J05039k4989o3202n7226N4165
9990a6231j2199J62906n1470Q92N0652k1183K5682p628j09375p3573o187n2057
9978a09771j514P126R403J22471L9031M5062p5689m9944P7776J07725K5677K3118
$$ y = [-148316, -198454, -129334, -137909, -117265, 41827, 227423, 340150, 213359, 113107, 115257, 82655, -33995, -219536, -227109, -197752, -33287, -2365, -81900, 40420, 68026, -139249, 31757, 196452, 159056, -55776, -109868, -103555, -20892, 83356, 188595, 135781, -42582, -124406, 59243, 30646, -14974, -48776, 46616, 131169, 182581, -8696, -17547, 19052, 28183, -73828, 23392, 118726, -82108, -79813, -65837, -64361, -22333, 56798, -12675, 4640, -15638, -45550, -66426, -159211, -62047, -26220, -20036, -30018, 75021, 50032, -13170, -70396, -16231, -28430, 134476, 83006, 83898, 134550, 113367, 139049, 131421, 22046, -51527, -57714, -109771, -111285, -104159, -94756, 27715, 66746, 111808, 36119, -13825, 63951, 171676, 197353, 220471]
9966B20471k52135j74965K36J651Q6007R8054K3258j64007j3175M386k8009J34307
9954f3921Q8853J12151O9752J42090j6554j63511l1775J43235l0136j71893N6445
9943A34736K13837J46840M1865M0249q0520j88469k096k4384j23725j89217j62911
9932a93795P8199J41173P3431k03544j29554k2137J05370J20487k035K05348J90116
9921C63059k33234k03211l7483L7781l1047m3382Q0169o2404M8822L1592N9700
9910A0362r0257Q0176J33194m1992j0716j600N3130r0251o2810J19956J23361
9899B22553N4994q3728K7437M4243j20697m8305L5065J0255L8094j56236K4004
9888D7679N9669j8031j79J17096J7318q8814j46240J85737O8080j55414k2886
$$ y = [220471, -31664, -206629, -206393, -204742, -118735, -20681, 2577, -161430, -174605, -170219, -198228, -63921, 24932, 137083, 206835, 348925, 332371, 168860, 137085, 280320, 250184, 78291, 134736, 348573, 495413, 537278, 577527, 497007, 308538, 306442, 282058, 158333, -30884, -193795, -115596, 25577, 99008, -104536, -234090, -256227, -150857, -30370, -32405, 172943, 363059, 129825, -73386, -110869, -73088, -104135, -147517, -67348, -129752, -80930, -49338, 10362, -79895, 281, 133475, 91483, 80767, 79167, 132297, 42046, -20764, 99192, 222553, 277547, 193819, 221256, 265499, 144802, 96497, 131562, 141817, 179911, 23675, 47679, 107348, 89317, 89138, 206234, 223552, 134738, -11502, 174235, 242315, 86901, 64015]
9877F4015K9166N8526P8757Q982M4896q3998o1410j68206K5192J24627L648l8092
9865H6103J6930r8569l4430K3786O9552O8584n7487k9251n5482N5450J61273j23476
9853H2983J07742J11791O5420J06370K8721J03479j39750k11392l610j12409j18430
9842B0915o233K7065N3335n2522P4462N3391o1708r4619P4765Q7222J5307L373
9830A94753l4908O5686Q5223n9438j94807J32036J7930r0636j14822J26821k9093
9819I8745k2872R5667P2853J47334j5853k13315n8357j70064j11258K13830J43726
9808A80436m6096r3166j07411q038J52991P1595q4378n3736j21044o74J4648N1010
9796d3863l7784r367K6155M0944O4251J37795O2698r7234q7138j37632p3161q8925
$$ y = [64015, 93181, 151707, 230464, 239446, 284342, 200344, 138934, -29272, -4080, 120547, 124195, 86103, 103033, 4464, -29966, -6180, 63372, 131956, 74469, 45218, -10264, 45186, 206459, 82983, 190725, 302516, 367936, 474306, 503027, 606506, 466756, 255364, 251754, 139345, 20915, 14682, 41747, 95082, 42560, 117022, 170413, 108705, 14086, 88851, 176073, 191380, 194753, 159845, 225531, 310754, 251316, 56509, 188545, 206475, 115839, 1017, 127838, 98745, 75873, 171540, 244393, 391727, 375874, 162559, 104202, -65862, -177120, 36710, 180436, 134340, 41174, -66237, -74275, 78716, 150311, 65933, 12197, -108847, -109521, -94873, -43863, -81647, -91014, -64859, -23915, 40336, 178131, 240829, 143595, 56457, -81175, -154336, -243261]
9784b43261J9377K1821O5579K2993r4307Q0006K5956k1806k0649J03949J6426
9773b3916j7927r847j53745k1327O7153M2467J64183J9371O4726J32439n6572
9762B07005l201r8938J6433J14916q1414j02600l1839J9913o2576J46021J30926
9751B54646J4803k0032j10126p1364K194J6143j9746l6834J47937J1206j96745
9740g918J3844J252J6721J01775O2287L9667j03390o8224q814J0228O426o8295
9728d441Q8190J54622l2683m4574k2879K7069R5373j4529j32231j18809l7739
9717d2631j3009n6284k1162J15504J17605O6235j8363j3796n5959m5652k4675
9706G813J28494L7147P1243K5266L4945N6898k04914j78376k7030J07248L5057
$$ y = [-243261, -223884, -202063, -136484, -113491, -207798, -127792, -101836, -123642, -144291, -40342, -23916, -41843, -51690, -205435, -226762, -159609, -117142, 47041, 66412, 131138, 263577, 207005, 203804, 104866, 121299, 236215, 154801, 52201, 20362, 40275, -22301, 123720, 254646, 269449, 249417, 139291, 67927, 70121, 86264, 66518, 29684, 177621, 188827, -7918, 5926, 7178, 23899, 125674, 187961, 227628, 124238, 56014, 47200, 57428, 63854, -4441, 83749, 238371, 205688, 161114, 138235, 165304, 260677, 246148, 113917, -4892, -42631, -55640, -111924, -133086, -17582, 100023, 166258, 147895, 134099, 78140, 32488, 7813, 136307, 173454, 244697, 269963, 304908, 361806, 156892, -21484, -48514, 58734, 93791]
9695I3791l4976k2624M3608M9239o8492k4011n6222K5447Q6780n4690O7538J02798
9683B08186p7751k9126J05393k2502j48496m8629m7198r4249K7461l0718J19858
9672c7771J73012O1395j13166r6788N7962M2745n3851J01610r64L7368q8458m7070
9660C6024J6503J14953k8319p9417j2596J29021n9188j24781M9907N9765O4007
9649A65879n3293n4607N3620j59762j33575N0609J24665J35341N4251j46225p1669
9638c4766R8567J01774j0179J04252J5226p421k4528n9513J9817o8468M3003k0304
9626A57460K9786O5914n1024P0204J34751K1254j29932j56544m990m5611k2372
9615F8896m1198P9783m1658O8224J90741K9509j47275q2199O1288Q8913M4697
$$ y = [93791, 58815, 36191, 79799, 129038, 60546, 36535, -19687, 5760, 92540, 37850, 105388, 208186, 130435, 101309, 206702, 184200, 35704, -12925, -60123, -154372, -126911, -157629, -37771, 135241, 196636, 83470, -13318, 44644, 87389, 33538, 135148, 134184, 171552, 83094, 36024, 52527, 167480, 139161, 59744, 47148, 176169, 116981, -7800, 42107, 101872, 165879, 112586, 57979, 111599, -48163, -181738, -131129, -6464, 128877, 183128, 36903, -34766, 63801, 165575, 155396, 259648, 274874, 267453, 242925, 183412, 203229, 134761, 177764, 157460, 187246, 253160, 202136, 272340, 407091, 428345, 298413, 141869, 136879, 91268, 68896, 27698, 107481, 65823, 134047, 324788, 354297, 207022, 124823, 186111, 275024, 319721]
9604C19721p2098j23574j04402q4617J84496O7949j50819j29132J32765J73477
9594B13766M9242o5661j29506n5315K0646K0238L2946L8437O6213p9126k34163
9583a22283J3401L4125Q9873M3287J4987J9881O3034R6317L8861j26794j20665
9572D4024L2329j7100p9224n4675n3498j2660P9286J61869J13178p5459q8080
9561D9990n5503J45421O9562j23792j34535N8308K01407m2416l8179J43361n7593
9550B16031p525Q6003j58370j03603L8778N6369m0403k24995P2592J64134J2979
9539A11990k8670J02486r4019q9230J3591J13743O1609j0036j29191n3739m541
9528f007J17778J58799J04302j97435m7068P6135j15767j88881q7623M9531J12735
$$ y = [319721, 247623, 124049, 19647, -64970, 119526, 187475, 36656, -92476, 40289, 213766, 263008, 197347, 67841, 12526, 33172, 53410, 86356, 124793, 191006, 111880, -122283, -108882, -74757, 15116, 58403, 73390, 93271, 156305, 252622, 291483, 164689, 44024, 76353, 59253, -19971, -74646, -128144, -140804, -61518, 100351, 213529, 138070, 49990, -5513, 139908, 209470, 85678, -48857, 9451, 210858, 168442, 130263, 273624, 216031, 208506, 294509, 136139, 32536, 71314, 127683, 87280, -137715, -65123, 99011, 111990, 83320, 185806, 91787, 2557, 16148, 129891, 191500, 181464, 52273, -1466, -6007, 111771, 270570, 374872, 177437, 130369, 206504, 90737, -98144, -185767, -136236, -23501]
9517b3501P4879M4116j0814M9147K9481j2624j02226j39719J75860K4112Q511
9506A17222N7289k3321K545J4837n9522N6820k4590q0557M7130J603o4149q2245
9494c6938N8446O7331K1631o7075r1425J4320P9476R8871J23865p4551J8508k02119
9482A0340j04719k0199p3018L5486M7758j020K7557m1012N3079O1275j02628l6776
9470a43877N0799J41232R6770r6846j05641p3435J99737P3043p0490o9951N5925
9459E7266P8221p4442O6095R3264J00111o3358j40287k48600j43343J09786J44326
9448b0961J05836m1192o9105J10557O7016P734o2992l9137Q6700N2897o1480j90827
9436e4954J3810N4562j3350l3190L1612n7496k1441l4303k8230M7205P0070J2476
$$ y = [-23501, 51378, 95494, 84680, 133827, 163308, 150684, 48458, -91261, 84599, 108711, 117222, 174511, 151190, 153735, 168572, 109050, 165870, 141280, 60723, 107853, 109456, 45307, -36938, 21508, 88839, 110470, 43395, -48030, -33710, 45766, 144637, 268502, 193951, 212459, 10340, -94379, -114578, -187596, -152110, -104352, -105372, -77815, -118827, -65748, -4473, -107101, -143877, -93078, 48154, 144924, 48078, -57563, -130998, 68739, 141782, 71292, 1341, 57266, 135487, 61045, 127140, 220404, 320515, 257157, 116870, -131730, -275073, -165287, -20961, 84875, 43683, -25422, 85135, 152151, 159885, 96893, 57756, 144456, 197353, 135873, -54954, -41144, 13418, 68, -33122, -1510, -59006, -80447, -114750, -142980, -95775, -25705, -13229]
9424a3229j09401j33335J8250P1429j9247K2590P1393J5922Q6931J4831Q5955
9413A12089q4400n3538o4986K2839R8188J13160n8997j1544L3130o0705m869M5024
9401H5391p2694r6369k3884J347M9219N5849j82814p3398Q0937J66167P1415j50638
9389h9472j08282J70934J51157k4907p6335J1969m1851j22849M6796k8235k4334
9378a35409k0730j5605j1376J0051O4897J00050J26394J22357j22574p8950q5866
9367d6761n7643M9421J47633J2355j10885j360k6302k0456o1301K0735N2458J06067
9355F3961q2888p4885J22817O1239p2234j3935L9068l8249J5873q2853j1272N2355
9343b1003M5593R5123j03363J685m1716o5585N6931J95943j08068j64313M9958
$$ y = [-13229, -122630, -255965, -237715, -166286, -185533, -162943, -91550, -75628, 11303, 26134, 112089, 27689, -25849, -90835, -67996, 30192, 143352, 84355, 72811, 105941, 45236, 40367, 85391, 12697, -83672, -107556, -106209, -56990, -1141, -183955, -257353, -176416, -10249, 61166, -89472, -197754, -26820, 124337, 99430, 23095, 35064, -6787, -129636, -82840, -111075, -135409, -156139, -171744, -183120, -173069, -108172, -8122, 118272, 240629, 118055, 39105, -46761, -104404, -54983, 92650, 105005, -5880, -7240, -33542, -53998, -115299, -94564, -42106, 63961, -18927, -93812, 29005, 90244, 18010, 4075, 43143, 4894, 20767, -62086, -73358, -21003, 24590, 119713, 16350, 18035, -23681, -89266, -32335, 163608, 55540, -108773, -58815]
9332e8815J84711J30528k5620j21997p591j58065p6926J81261J20877j02614k6319
9321C9430N6203k3386P166K0201j08568K5527o8120q5099Q5118J90539P9765l8019
9309A80757o4043j44137j65973j17108J26441N8351K04864N1612m3170o3643N0979
9298G4930n3752J40768M6642j00494r7211m374o7394p9310L3385J09549l2839
9287c0100r0643Q8826r1200K2014o797n817r5418N8616J4288p0762l0807R995
9275b27805m1407R9776J49514R3231k0859p3811K7723K2251m6586N17K8026j01058
9263i0488j3610k8205Q6263N5971M9575Q0386l3741o9650j7709J91993L8710j26645
9251A22850j02724N1870p5526K990N0627r017r4014p191N7461L9036k0422L9968
$$ y = [-58815, 125896, 256424, 230804, 108807, 101216, -56849, -133775, 47486, 168363, 65749, 39430, 95633, 72247, 79413, 99614, -8954, 16573, -51547, -136646, -51528, 139011, 218776, 180757, 116714, -27423, -193396, -310504, -184063, -125712, 79152, 130764, 87594, 23951, 74930, 21178, 161946, 208588, 108094, 10883, 6509, -60885, -140195, -106810, 2739, -30100, -120743, -31917, -123117, -101103, -107900, -113717, -209135, -150519, -136231, -206993, -237800, -227805, -269212, -169436, -19922, 73309, 52450, -21361, 6362, 28613, -17973, -17456, 10570, -90488, -104098, -132303, -46040, 9931, 59506, 139892, 106151, 36501, 18792, 210785, 249495, 122850, 20126, 71996, -3530, -540, 50087, 41070, -52944, -60135, -2674, 36362, 15940, 55908]
9239E5908N0845j72519O29l3175j28859J23007K9547n3421K4547l8587J3847M8037
9227h0194J14326p926j17226r2409l1756J72430J75465L6160j4316M4938l0912
9216A68580j49881K2931o5614l5152k1134j22976l8891M9190M8116K7720K3043
9205i4068m0100P8443J37762Q676k11277k0010K2396R8877r8768k693K01105r081
9193G1262o8347j07510R560P3596M4848J11752J2240j34257o7594k0567m8481
9182a23498R6251J00759j6199j01185R8091K9172l1057J25518O531J0723o5418
9171A29688j23154M5916J09541R7867R0685j595J15442J73421P5564q6783j05931
9160E20661q3613q1618n9524o4072r9257j14582p3589M8358q4190j5734N0670
$$ y = [55908, 106753, -65766, -65137, -98312, -227171, -104164, -74617, -128038, -103491, -142078, -128231, -80194, 34132, 26206, -91020, -183429, -215185, -42755, 132710, 168870, 154554, 199492, 168580, 18699, 41630, -23984, -59136, -80270, -203246, -242137, -192947, -144831, -117111, -94068, -134168, -55725, 82037, 90713, -120564, -140574, -118178, -19301, -118069, -120762, 80343, 71262, 2915, -104595, -95035, -21439, 23409, 135161, 147401, 13144, -54450, -75017, -123498, -27247, 73512, 57313, -43872, 54219, 83391, 52334, 177852, 184383, 195106, 129688, 6534, 52450, 161991, 259858, 350543, 348948, 464390, 637811, 713375, 626592, 520661, 437048, 355430, 295906, 231834, 132577, 17995, -55594, -7236, -91426, -107160, -56490]
9149e6490J60645J67460M07j67253n6318k3711j11682Q804j06297o7060J33698
9138a17797J56526L3371N0917o0092j69678m337j45389M9045K07531J56881j5830
9127A41148N897P1679p788R6639Q0495J53285L54990K91044K48219J41900R3764
9116A671272p7421k53000l04878j34592j21577k29032j48644r6987N5697l891
9106C56947j11085n0636j48920n6724P5238R5771k1980l0363n9843j2845Q5818
9095A21378K0409l7567K5327m9331j54520M1836l9252J0301J02471K8481J9720
9084H9253l5335o8009m0430K3569L8924M3618m7534J06051J81231K13218N7890
9073E62446Q9772J95583j01920n4485o2731j79327j34455j38353r8730R696Q301
$$ y = [-56490, 104155, 271615, 272022, 104769, 48451, 24740, -86942, -78138, -184435, -251495, -117797, 38729, 72100, 123017, 62925, -106753, -111090, -256479, -207434, 97, 156978, 141148, 147045, 218724, 210936, 307575, 388070, 541355, 896345, 1187389, 1435608, 1577508, 1671272, 1593851, 1340851, 1035973, 901381, 779804, 550772, 402128, 305141, 360838, 356947, 245862, 195226, 46306, -10418, 64820, 160591, 138611, 108248, 48405, 35560, 121378, 141787, 104220, 129547, 80216, -74304, -32468, -71720, -61419, 41052, 69533, 89253, 53918, -14091, -54521, -30952, 7972, 51590, 4056, 110107, 291338, 504556, 562446, 652218, 847801, 745881, 691396, 628665, 449338, 314883, 176530, 77800, 87496, 95797]
9062I5797k2177N7230j29945o2738L2436M6868O8826j71554p403J27230P0234
9051A04804p8854p8777M9589J68306o846k9580r7925o4847K5626Q6911n8499k7940
9039h032L0532o7514K9515Q6374o0560R682Q658L160L7816j6321J7347N9480P1677
9026B01814m8504o242N6739Q4837k8077j3677j1785p082L3222p0870L8618k7038
9014B01955j10628j08120k3255o3071n2301R3224j4868k0581Q7589N1532m3774
9003b298r1579O8538R9497J9956m9282M5343m5153p4029k2643j6462j31483N7773
8991a41822N5576O7490j93120K9131J18977J05386K2477L9906P9193K8854J0095
8980B22143J09205j0669j42505j07681K08666j5855M1957l6769l2759m122P9042
$$ y = [95797, 73620, 130850, 905, -61833, -29397, 17471, 86297, -85257, -92660, 34570, 104804, 25950, -52827, -3238, 165068, 158222, 128642, 30717, -34130, -8504, 78407, 19908, -8032, 22500, -45014, -15499, 70875, 10315, 19997, 28655, 31815, 69631, 53310, 70657, 130137, 201814, 153310, 147068, 203807, 288644, 260567, 246890, 235105, 228023, 261245, 190375, 228993, 201955, 91327, -16793, -40048, -103119, -155420, -62196, -77064, -97645, -10056, 41476, -2298, -93877, -25339, 74158, 94114, 44832, 90175, 45022, -29007, -51650, -68112, -199595, -141822, -86246, -18756, -211876, -182745, -63768, 41618, 64095, 104001, 183194, 212048, 222143, 331348, 320679, 178174, 70493, 279159, 263304, 305261, 268492, 235733, 231611, 310653]
8969C10653L4997k03540j84218J29423J17575p3152r7468P6151L6244q6932q4120
8958b4387Q911o2223N0959K1761L420K23010J69057m7084j19903k0804K4195k13954
8946A2958j1417M3496O8765m4502L3357m8503q5875O9223o4621o5394Q1465P9784
8934F8736K0492l8074m4589P4809R527J4754q0516j16008N0031L3084O0469M8880
8922A01595Q93K2823m8968p2572j57282j41204P5737k9821J50332n1443O8071
8911h1839J54988p0232r0803j06398o0723Q6210R7012j7745j10385P4554J25197
8900a64K626r7771K8724p7226j540N7133L2923N2954k1827m4559J3085p5655q1826
8887b13123Q6533K66317J76270n2576j52249j79766L6929O8175j33197j03442
$$ y = [310653, 345650, 142110, -42108, 87315, 204890, 131738, 34270, 110421, 146665, 59733, -24387, -15476, -77699, -26740, -4979, -1559, 221451, 390508, 343424, 223521, 202717, 226912, 12958, 1541, 45037, 113802, 69300, 102657, 54154, -31721, 37502, -27119, -92513, -11048, 68736, 89228, 51154, 6565, 81374, 90901, 105655, 25139, -90869, -40838, -7754, 52715, 101595, 102488, 125311, 76343, 3771, -153511, -294715, -218978, -248799, -98467, -149910, -81839, 73149, 2917, -87886, -194284, -255007, -168797, -71785, -89530, -199915, -125361, -164, 2462, -95309, -66585, -143811, -145351, -88218, -55295, -2341, -24168, -68727, -55642, -131297, -213123, -126590, 139727, 315997, 263421, 111172, -68594, -31665, 36510, -96687, -200129]
8877b00129N6743O7428r4934o301l0677Q0004J55326P4483o9005j36390K8030
8866g5422l1188J35553P3142j92855m1117L4659o3190n4723J63042k3914j28189
8855b04202R7157J7863j6667P9257J04996m1851l3558K5305Q8094P9414K5758
8844B21566R4084J68105n9214n1983l4465q2272K7366q5270q8187l3512J9646
8833I5864O2120j20707k72434j21993J21291J62347L8975Q894P3090Q5784q27
8822A32404l4706L6224K8122P4292M9341j51352j08176M2614M7312J19730L2936
8811B68741Q807n3244p7591L7889M977K7743N1586O3831O8420K5851L0490J10425
8799E67925Q9760J39986J5895O5944j08857P1050J57988J02457o9828n2442J40985
$$ y = [-200129, -143386, -75958, -170892, -177193, -207870, -127866, 27460, 101943, 32938, -103452, -75422, -106610, 28943, 102085, -90770, -131887, -97228, -160418, -215141, -52099, -76013, -204202, -107045, -89182, -105849, -26592, 78404, 36553, 2995, 28300, 116394, 195808, 221566, 315650, 483755, 424541, 372558, 338093, 255821, 283187, 197917, 109730, 76218, 95864, 157984, 37277, -235157, -357150, -235859, -73512, -34537, -25643, 47447, 133231, 132404, 97698, 133922, 162044, 236336, 285677, 134325, 26149, 68763, 116075, 235805, 268741, 277548, 224304, 146713, 184602, 189579, 217322, 268908, 332739, 401159, 427010, 457500, 567925, 657685, 797671, 813566, 879510, 770653, 841703, 999691, 1102148, 1032320, 979878, 1120863]
8788A120863J29080J80909L19292J90425J85155K77548J86469L17628M44262M36156
8778C787787O16784P39803J004941J224306J458988J785998K355936L489223N095997
8769B1559763P729433J1546209J7089887K3908711K8723636K7937489K2193250
8762A60688378J3822018q618049l4174195l6800339k7510782j8617476j2037304
8755C6752251p658225n277992l724380k477408j881683j552396j160557p42692
8747A2276918n24559o09710n79885n24953l24338l38737j18200m4520M655R7202
8737I313873J56379L35912O32871R01056J070300J220284J465158K033875K433323
8728A9563031K990575M204273O100792R177037J3646927K0882905L1815099M5778836
$$ y = [1120863, 1249943, 1430852, 1750144, 1940569, 2125724, 2403272, 2589741, 2907369, 3351631, 3787787, 4404571, 5144374, 6149315, 7373621, 8832609, 10618607, 12974543, 16463766, 21559763, 29289196, 40835405, 57925292, 81834003, 110557639, 138495128, 160688378, 174510396, 165892347, 131718152, 94917813, 67407031, 48789555, 36752251, 29094026, 23816034, 20091654, 17614246, 15732563, 14180167, 13019610, 12276918, 11752359, 11142649, 10562764, 10037811, 9713473, 9374736, 9256536, 9212016, 9216671, 9313873, 9470252, 9806164, 10439035, 11340091, 12410391, 13630675, 15095833, 17129708, 19563031, 22553606, 26757879, 32858671, 42035708, 55682635, 76565540, 108380639, 154159475]
8720A54159475N7842102N8491603M7637033L5946880o927273p0682234p9536583
8713A96931003n9483198l9464941k5370023j6252256j0743887p160442n058318
8706C3397938l938196k957932k255561j767330j454358j445470j489134j534254
8698A6555703j194378q75847n91634n18828n00382m07388k35922k88808K1322
8689A1963838J98336L21868L79824O13106Q72564J013919J359780J781457K680312
8680B1185004M168600O216032R399139J4180270K0331320K5873741K7372333K3172303
8672A51898742J6308534J157454k6196570l7449371l0502988k0909973j3752953
8665D0552875q912832n870531m001983k859775k279191j812306j313121j017882
$$ y = [154159475, 212001577, 270493180, 318130213, 354077093, 347149820, 276467586, 196931003, 137447805, 97982864, 72612841, 56360585, 45616698, 38456256, 33397938, 29459742, 26501810, 24246249, 22478919, 21024561, 19579091, 18089957, 16555703, 15361325, 14485478, 13893844, 13375016, 12874634, 12467246, 12231324, 11942516, 11963838, 12162174, 12484042, 12863866, 13476972, 14349536, 15363455, 16723235, 18504692, 21185004, 25353604, 31569636, 40968775, 55149045, 75480365, 101354106, 128726439, 151898742, 168207276, 169364730, 143168160, 105718789, 75215801, 54305828, 40552875, 31640043, 25769512, 21767529, 18907754, 16628563, 14816257, 13503136, 12485254]
8657A2485254q33995q07320q58160p58949o95611n73327n46981n28902n02224
8648F379785k42474j16892k00957j64409k73274k47135k07079j78706l28564j19672
8638D300623m4469j54366j81171m4328J14899j64433l51752j63708p8573N332
8628C238054q9293j0942P5516j05860j15251j16002j29047p4615l4408p2404j7815
8617B547933p8094L339l2503j32172j26901J16400N4251j58532j84744r3524J58835
8606B074288J09289j34376j48786J1155k6775n5602r4084l9510j4881M3769J867
8595A726354j7172N7050q267J0218N8868J65069r4276j91169j49456m0267j37900
8584A379052j26604o9379J51916Q1206K2411P8272j92984j99953J02722l2825
$$ y = [12485254, 11651259, 10843939, 9985779, 9226830, 8531219, 7957892, 7410911, 6882009, 6379785, 6137311, 6020419, 5819462, 5655053, 5381779, 5134644, 4927565, 4748859, 4420295, 4300623, 4256154, 4101788, 3920617, 3876289, 3991188, 3826755, 3475003, 3311295, 3232722, 3238054, 3148761, 3137819, 3213335, 3107475, 2992224, 2876222, 2747175, 2672560, 2638152, 2565748, 2547933, 2469839, 2473178, 2440675, 2308503, 2181602, 2298002, 2352253, 2193721, 2008977, 1915453, 2074288, 2183577, 2049201, 1900415, 1911570, 1884795, 1829193, 1735109, 1695599, 1680718, 1724487, 1726354, 1709182, 1766232, 1757965, 1768183, 1827051, 1992120, 1897844, 1706675, 1557219, 1516952, 1379052, 1252448, 1183069, 1334985, 1416191, 1438602, 1516874, 1323890, 1123937, 1226659, 1193834]
8574A193834J4124p5687j81957j07468L2245L5090q9830o0189M6587O4487J02786
8563I74022P3224J6940j1716O5674N0154j43186N9944M7129p1790o5312P922J0905
8551A013910j9536k7501n048p4200M324m9542J21095M9372l3516o4642M2781l1741
8539I25756j47400j62622J0929q011O810J03936K7340p4952n7641O5010o5743
8528F23412L5512K25401p9327j127l8093p5868J45670j4539k928L2829n1867j39068
8516F60007q2731L1905J03717J12615q5004j93642N5448P8822n8010r4901k978
8505E25248m2169l1824P1026L120J823l9629j27362L9104N1670Q7898J11946P8107
8493G28958o3929j93603j85790k2272k0234q3193R0581L3902j972L2672k1271
$$ y = [1193834, 1207958, 1132271, 950314, 842846, 875091, 910181, 820351, 760162, 806749, 871236, 974022, 1047246, 1064186, 1052470, 1118144, 1168298, 1025112, 1085056, 1132185, 1060395, 995083, 1003005, 1013910, 994374, 966873, 961825, 887625, 891949, 842407, 963502, 1012874, 979358, 914716, 957497, 925756, 778356, 615734, 626663, 618652, 625462, 729398, 756738, 681786, 624145, 689155, 623412, 658924, 884325, 804998, 803871, 765778, 689910, 835580, 821041, 818113, 850942, 799075, 660007, 577276, 609181, 712898, 825513, 740509, 546867, 602315, 681137, 623127, 528226, 525248, 483079, 451255, 522281, 525401, 527224, 487595, 360233, 399337, 451007, 538905, 650851, 728958, 665029, 471426, 285636, 263364, 243130, 159937, 250518, 284420, 282448, 315120, 293849]
8482B93849O9738J52859N9860j00416l862J2374o247j02194p5732r8435L4978
8471B36772N1680l2486m061M2955p3795j73223L0913j8395J7075K187J03730J43558
8459C26910k9440j9766J4285n9148L8404r3329Q8553J01231O6197r9630p2976
8448B61291O3710P2521n5405M6237L3914k1193P9474o2147o3120M1382q755j17825
8436B70084l6776q1248o2483Q3767J75372j6226j54992q5849p279P0456J36773
8425B91599j9012K0230k6768p6322j8450j6024J24159j9294k5801M4871K5780
8414C04968q4589k6344j01250J9536L1112j32802N3486K52017J04724j022J04216
8403E24052J030q9101N0419R4802j3391L3590J1322j34065j54130r0545m6254
$$ y = [293849, 363587, 516446, 576306, 475890, 472028, 484402, 478155, 375961, 300229, 201794, 236772, 288452, 255966, 251905, 294860, 221065, 47842, 78755, 60360, 77435, 79622, 183352, 326910, 297470, 277704, 291989, 232841, 271245, 177916, 266469, 367700, 433897, 334267, 261291, 325001, 397522, 342117, 388354, 422268, 401075, 480549, 418402, 355282, 396664, 387909, 270084, 233308, 152060, 89577, 173344, 348716, 332490, 177498, 91649, 84370, 154826, 291599, 272587, 292817, 266049, 189727, 171277, 155253, 279412, 260118, 234317, 279188, 304968, 220379, 194035, 92785, 112321, 143433, 10631, 64117, 316134, 420858, 419836, 524052, 525082, 435981, 486400, 581202, 567811, 601401, 612723, 478658, 324528, 233983, 187729]
8392A87729j6120J0341l5616K6672l6473o4606j37723Q1438J13954J33346J1739
8381B74681n6910j41691l0843R041P9618L883k30599P2999J78220l4099R5857
8370B20157J13812j08482Q975M6238N3179l6801p9834L8064J16137j547M2756
8359D12654J98220K80754Q3624L7389k2061j84701j77374o5622j56621q7813k3931
8348B94518p0116J41735O0951m8063m4722l5282m8569j38282R4113J88004M0272
8337D34559k9904j07010l0497M567j43356l2218J17897J4697r3504P7390m6330
8326A66291j5075L0739j5779O0665N2641l703J55239Q870j77696M9069L64707
8315F75968K79462K72231L92406L02871J57497p0058k28103n01316l75698j53448
$$ y = [187729, 171609, 181950, 146334, 173006, 136533, 71927, -65796, 15642, 129596, 262942, 274681, 217771, 76080, 45237, 54278, 133896, 137779, -92820, -19821, 158399, 124300, 220157, 333969, 225487, 234462, 280700, 333879, 297078, 217244, 255308, 371445, 369898, 412654, 610874, 891628, 975252, 1012641, 990580, 805879, 628505, 562883, 406262, 318449, 294518, 224402, 366137, 427088, 379025, 334303, 299021, 250452, 112170, 206283, 394287, 434559, 404655, 297645, 267148, 271715, 128359, 96141, 214038, 228735, 135231, 212621, 166291, 151216, 181955, 166176, 226841, 279482, 275779, 431018, 439888, 262192, 311261, 675968, 955430, 1227661, 1620067, 1922938, 2080435, 2010377, 1782274, 1280958, 905260, 751812]
8305G51812k49763k6345o1317j68735l4488J0862N4523J35256j04468L8684j2308
8294C33713k1914j26764j22926k1254J18447m9871j1663r257P9984q7110o6899
8283A4486J33049O9417k3666j50271k2245J84261J02913J54948l6075m3070n3056
8272C30691o6440k6636N3166K02815J50359Q2936P1188j5572l7048o8852j19283
8261E57324j36418l1840M8435J6414J28081M9910j62563r7500p1090o1223n8883
8250A80647j35780q1136P2761J35276J59490K4976j29796r1186K1155Q7171P9903
8239C23481p8084n09K7255q1926o8657m1957M4792J22545J61925l3372k81211
8228I4282r1727J1636Q2374J4197j52599q3990m4832J45291K14184O6896p3328
$$ y = [751812, 502049, 475704, 414387, 245652, 211164, 222026, 276549, 411805, 307337, 346021, 333713, 311799, 185035, 62109, 40855, 159302, 109431, 97768, 88511, 168495, 81385, 14486, 147535, 216952, 193286, 43015, 20770, 205031, 307944, 462892, 426817, 383747, 330691, 264251, 237615, 290781, 493596, 643955, 726891, 798079, 782507, 745459, 676607, 557324, 420906, 389066, 437501, 453915, 581996, 631906, 469343, 371843, 300753, 239530, 180647, 44867, -36269, 36492, 171768, 331258, 356234, 226438, 135252, 156407, 243578, 323481, 245397, 244888, 272143, 190217, 121560, 79603, 124395, 246940, 408865, 375493, 94282, 2555, 14191, 96565, 110762, -41837, -125827, -170659, -25368, 188816, 255712, 182384]
8217A82384J06240M9406k07242j25557j0094K556N1976P4053q2812j15600N7480
8206a7210J398k9657P0682R7697K5476l4117K0534Q35O6345j7386R0338P3881
8194C48816p9322j60616K147q6491j44123n481J53200R9072j8264j438J2981J46326
8182B66807J10576l8041k0522j55699j87815Q1324J13450o4251j035O4615N6856
8171B26265l0453m0707j05019J7462K9006q6331K2775J28551l9295j23829Q9485
8160H7910l7109q62P6364M1217J05791N9977N4666k5303j91378N1788K760p7954
8148A47867j0942J3006q7598L2039l4030K7127N0894q5382K7953J06903k2777
8137A65060k807m725j8362P5456N1063L0178p1971l1656K3804L5140j30756P5813
$$ y = [182384, 288624, 338030, 130788, 5231, -4863, -2307, 49669, 123722, 40910, -74690, -17210, -15812, -45469, 25213, 122910, 148386, 114269, 134803, 135638, 201983, 184597, 274935, 348816, 269494, 108878, 111025, 24534, -119589, -125070, 28130, 127202, 108938, 107500, 120481, 266807, 377383, 339342, 318820, 163121, -24694, 56630, 170080, 105829, 104794, 169409, 226265, 195812, 155105, 50086, 67548, 96554, 10223, 32998, 161549, 122254, -1575, 87910, 50801, 49939, 126303, 167520, 273311, 333288, 387954, 362651, 171273, 223061, 225821, 147867, 136925, 149931, 62333, 94372, 60342, 87469, 138363, 52981, 80934, 187837, 165060, 162253, 157528, 139166, 214622, 265685, 295863, 223892, 192236, 216040, 251180, 120424, 196237]
8125A96237j9832P2782n4664k5475J20307L3609M1455l8508q8840j46529n5646
8114C4896J841J52992N9478j61094n5144K07321M0698p2973K1319J5052q202o2455
8102A73729j86371n3845J91237Q0140J05483Q1733r2107k32736j41009P3322J01120
8091A00696j1184n2689J5102Q2517O0702j375L399p1405J22512m508j00796p2222
8079G0749N2582L0482p0898J588l9906l5312J9933l735q6978J05270J21433M9673
8067B14881j02920l6042Q8591L1539n5406j03590p0322j43287P0918k0341K1200
8056a04779R9342J40838J44206L1247q1450p1019M217J09668J5136j13984j65763
8045G659O3324P6963j60321k4171L4979K7859J105m2169J04009j57116M1090J30015
$$ y = [196237, 176405, 249187, 194523, 169048, 289355, 322964, 364419, 325911, 237071, 90542, 34896, 36737, 189729, 249207, 88113, 32969, 240290, 280988, 208015, 229334, 244386, 236184, 173729, -12642, -66487, 124750, 204890, 310373, 392106, 299999, 67263, -73746, -424, 100696, 89512, 36823, 51925, 134442, 195144, 193769, 197168, 125763, 248275, 243767, 142971, 70749, 123331, 153813, 82915, 84503, 44597, 9285, 29218, 25483, -61495, 43775, 165208, 214881, 111961, 75919, 164510, 196049, 140643, 37053, -33269, -176556, -105638, -125979, -104779, -5437, 135401, 279607, 310854, 229404, 158385, 162602, 272270, 287406, 173422, 7659, 70983, 147946, -12375, -36546, -1567, 26292, 27397, -14772, 89237, -67879, -26789, 103226]
8033A03226Q4311m6165Q4172j808j78097p0533J08173J07782L7802l3816r6811
8022I8236o5145q572R4086J76792n415k46085o2313P1340K0303M0165j04159q7719
8010g8486L8322o4397j16194J89566J05160K3063l2337k3397O2269J30047K840
7999B36456n9957j3823j19504k08988J3574J31917j2766j27489J06296J45307
7989I1023K5122m8423o2122O0207J8904k50766K6345J08289Q0772N2745R389j1914
7977I9571r6789m6735L3026Q4327N1203J6770m0818m1317j24917K3638J23486
7966H1445R0477J19811n7000m2790j2497m7886l9217J13454J26575m6228r0275
7955A95869r8739J6856q087o3046P0940N0734K2209l3733o1702q139j13581N179
$$ y = [103226, 187537, 141372, 225544, 223736, 45639, -24894, 83279, 191061, 228863, 195047, 98236, 33091, 24519, 118605, 295397, 289982, 43897, -18416, 52924, 73227, 113392, 9233, -78486, -40164, -104561, -220755, -31189, 73971, 97034, 64697, 41300, 103569, 233616, 236456, 176499, 162676, 43172, -165816, -152242, -20325, -33091, -160580, -54284, 91023, 116145, 67722, 5600, 65807, 84711, -166055, -139710, -31421, 49351, 102096, 111485, 99571, 2782, -43953, -10927, 73400, 124603, 141373, 100555, 59238, -65679, -42041, 81445, 171922, 291733, 234733, 191943, 179446, 131560, 92343, 205797, 332372, 286144, 195869, 97130, 113986, 105899, 42853, 113793, 164527, 186736, 153003, 91301, 83162, -30419, -25240]
7943b5240J29369j7637j46510Q5849n1658o8203J11143M375L7556J10175J26677
7932B95896K8881j82143j47040k4825O3944M999q1851K2465J25891R7372K3348
7921B26937k0919j18764j06481N4084J2862M685N9963J02950j7922j41674k5985
7910B9736n702J91530J65906o9763p3763L2736K6705j09214n5034L2012j28189
7899C6960l7171l9486J14569J32943p1350k04367J46997J45164P2818o7432j04704
7888A24941j32485n5209M9319P0346P2623P0143m3655n7621O0503q9690O2374
7877A31589N4226K0424j10520k3070L4821N8608M1235p6246L6089M0116p9224
7866A28048j33243J3165o5502r1643J02322J54951q0043J0752J287N1133l4655
$$ y = [-25240, 104129, 86492, -60018, 25831, -25827, -94030, 17113, 21488, 59044, 169219, 295896, 324777, 142634, -4406, -29231, 34713, 39712, -42139, -19674, 106217, 203589, 226937, 206018, 87254, -19227, 34857, 47719, 52404, 112367, 215317, 197395, 55721, 29736, 24034, 215564, 381470, 311707, 237944, 270680, 297385, 188171, 133137, 165149, 36960, -211, -39697, 74872, 207815, 136465, -67902, 79095, 224259, 297077, 229645, 124941, -7544, -62753, -13434, 56912, 129535, 199678, 156023, 98402, 158905, 69215, 131589, 185815, 206239, 95719, 72649, 107470, 166078, 207313, 131067, 167156, 207272, 128048, -5195, 7970, -57532, -149175, -46853, 108098, 28055, 38807, 40094, 91227, 56572]
7855E6572j8321J25027N9403N4681r1627p2297J313J4034r7435r48J4203l0518
7843A4087J38335j9352j45089K1022N2153m2079r5927j04516M3899J38738j5531
7832a4260q1891Q828m4742O8631J47503m5150k5929l9557j34619N0626J5455J32075
7820C6970J78487Q1844m9575r0605k4700r6471q5416M7931j4335r5274J975R8730
7808a0439k2452M1616J37120K03331K3801j47130j33661O4760j1590N5844O4048
7797B65248j25914m3413K6818M2723P1049j63514K7964Q889q7355M5586J74163
7786B42244j45283j37116m8126K9585n1429J36770Q1764L7070L7621j27460p6618
7775b0978p0320m2526O5091P7997J63683K9102J5432j21128p5765r318J7751j42970
$$ y = [56572, 38251, 163278, 222681, 277362, 185735, 113438, 114751, 128785, 31350, 30402, 44605, 14087, 152422, 133070, -12019, 9003, 61156, 19077, -76850, -181366, -137467, 1271, -14260, -96151, -87323, -132065, -63434, 84069, 38919, 12990, -26567, -161186, -110560, -95105, 36970, 215457, 297301, 247726, 157121, 132421, 35950, -49466, -1535, -15870, -111144, -109169, -10439, -32891, 8725, 145845, 349176, 372977, 225847, 92186, 156946, 145356, 201200, 265248, 139334, 95921, 122739, 165462, 236511, 72997, 100961, 109850, 22495, 68081, 242244, 96961, -40155, -88281, -58696, -110125, 26645, 108409, 145479, 183100, 55640, -20978, -91298, -133824, -68733, 9264, 172947, 202049, 217481, 96353, 20588, 11270, 29021, -113949]
7763a13949m2842l4344J46078M0332l3215j29435J7938O2885K7526Q9361P2756
7752A03091M4123r7379o001L6923L4521q6284j5497j0139j31531l5976N3048J2569
7740i8532J8646Q321N3947O1333O9891j58429j07095m9620J70930J25195j4821
7729G9766O7467P5606L6905p5993j94897j21784P0258J21358M7944j15480o2585
7718g1435Q2503R2288J84098J18802k5661k20349m3157Q685l0591q6175j9963
7707a0955p0781k2527p332r3942o6013n3533K798K17221J39997n4445L6885Q1798
7695I9171J7942o7352j8643O898L0012N129N4642N4227r8377k8196j11919J32289
7683G5823L6596O1330r5054k6708L7273l7391J01205J3730r2774j52413q404j1353
$$ y = [-113949, -156791, -191135, -45057, -4725, -37940, -167375, -149437, -86552, -59026, 30335, 103091, 147214, 49835, 43834, 80757, 115278, 28994, 13497, 3358, -128173, -164149, -111101, -98532, -79886, -71565, -17618, 43715, 113606, -44823, -151918, -201538, -30608, 94587, 79766, 147233, 222839, 259744, 183751, -11146, -132930, -62672, 58686, 106630, -8850, -71435, 11068, 103356, 287454, 406256, 380595, 160246, 117089, 125774, 95183, 9008, -10955, -81736, -104263, -111595, -205537, -271550, -325083, -322285, -105064, 34933, -19512, 17373, 99171, 117113, 49761, 31118, 38016, 68028, 73157, 127799, 182026, 83649, 55453, -56466, 75823, 112419, 173749, 78695, 51987, 89260, 51869, 153074, 166804, 74030, -78383, -86787, -98140]
7671i8140q5745M9659K4789J63836j22157r8073j6799q442K2612m0328k246K8724
7659a82310l1879K8244J03657r4117p6292m8354M4648J06966r4957J6472L3364
7648a94558j01464k0978J15778J12211l9623Q1791J6136P495p8048L604o7869
7637a65525k9010R0135J40898k187j51450o9310r850Q0485N0983l5047R809O5104
7625b4965O61q9519l1413J12450M7099j1020m0097P0131L4787L7816n5783m3712
7613F435l1100l0092J4818n1364M5417J05631K3148m2390j12062K2769j0858R042
7601e0606J20986n4818M468L5851j29939j22721N274M1351L1997J43281O7913
7590I3037j31177m1149R7099q1315P4212k3737p4409q8358j16598j66099J29459
$$ y = [-98140, -183885, -134226, -109437, 54399, -67758, -165831, -182630, -191072, -168460, -208788, -211034, -182310, -214189, -185945, -82288, -176405, -252697, -301051, -256403, -149437, -244394, -227922, -194558, -296022, -317000, -201222, -89011, -128634, -46843, -30707, -23212, -101260, -97656, -165525, -194535, -104400, 36498, 34311, -117139, -186449, -196299, -115814, -64831, -99878, -90069, -24965, -24304, -113823, -145236, -32786, 14313, 3293, -36804, 33327, 68114, 105930, 50147, 6435, -24665, -54757, -39939, -91303, -45886, 59745, 82893, 40503, -71559, -48790, -59648, -50606, 70380, 15562, 20030, 55881, -74058, -196779, -191505, -150154, -118157, 25124, 93037, -38140, -79289, 17810, -63505, 10707, -13030, -87439, -175797, -292395, -458494, -329035]
7579c29035J32838J588J111J11781O1814J0747R6107L9508m7304L7390o9808j17396
7567g0659P7468k4170l2160J08321p12n1625J7002K2208J56919J15237j33983
$$ y = [-329035, -196197, -194609, -193498, -81717, -19903, -9156, 86951, 126459, 79155, 116545, 46737, -70659, 6809, -17361, -49521, 58800, 58088, 6463, 23465, 45673, 202592, 317829, 183846]
$$ [...]
##END NTUPLES=NMR SPECTRUM
##END=
