##TITLE=Analysis number 323679
Compound Code km 05335
Project Code adrs
Chemist Name endeavour speciality chemicals
##JCAMPDX= 6.0         $$ Bruker NMR JCAMP-DX V2.0
##DATA TYPE= NMR SPECTRUM
##DATA CLASS= NTUPLES
##ORIGIN= Bruker BioSpin GmbH
##OWNER= nmr
$$ XWIN-NMR		Version 3.5
$$ Thu Nov  2 17:45:11 2006 GMT Standard Time (UT+0h)  MAYBRIDGE\nmr@NMR_250MHZ
##.OBSERVE FREQUENCY= 250.131544655141
##.OBSERVE NUCLEUS= ^1H
##.ACQUISITION MODE= SIMULTANEOUS (DQD)
##.ACQUISITION SCHEME= undefined
##.AVERAGES= 16
##.DIGITISER RES= 18
##SPECTROMETER/DATA SYSTEM= dpx250
##.PULSE SEQUENCE= zg30
##.SOLVENT NAME= CDCl3
##.SHIFT REFERENCE= (INTERNAL, CDCl3, 0, 16.4506)
##AUDIT TRAIL= $$ (NUMBER, WHEN, WHO, WHERE, WHAT)
$$ ##TITLE= Audit trail, XWIN-NMR		Version 3.5
$$ ##JCAMPDX= 5.01
$$ ##ORIGIN= Bruker BioSpin GmbH
$$ ##OWNER= nmr
$$ C:\u/data/dgb/nmr/ADRS/2110/pdata/1/auditp.txt
$$ ##AUDIT TRAIL=  $$ (NUMBER, WHEN, WHO, WHERE, WHAT)
(   1,<2006-11-02 17:44:27.58 +000>,<MAYBRIDGE\nmr>,<NMR_250MHZ>,
      <created by zg, POWCHK disabled, PULCHK disabled
       configuration hash MD5:
       49 4B E0 1D 92 C2 6B 37 9F E6 65 BC 52 41 86 1D
       data hash MD5: 64K
       CC 68 B6 68 22 08 A4 2A 2B 3C C5 B8 FF C1 53 FE>)
(   2,<2006-11-02 17:44:49.11 +000>,<MAYBRIDGE\nmr>,<NMR_250MHZ>,
      <Start of raw data processing
       ef LB = 0.3 FT_mod = 6 PKNL = 1 SI = 32K 
       data hash MD5: 32K
       DB C0 22 80 F5 86 7A D9 B3 7E CC BA F8 0B B4 3B>)
(   3,<2006-11-02 17:44:53.87 +000>,<MAYBRIDGE\nmr>,<NMR_250MHZ>,
      <apk 
       data hash MD5: 32K
       C7 EF F5 5C 91 B4 A1 A2 82 4D 7D 42 09 60 1F F9>)
(   4,<2006-11-02 17:44:55.34 +000>,<MAYBRIDGE\nmr>,<NMR_250MHZ>,
      <abs ABSG = 5 
       data hash MD5: 32K
       BA A0 99 B2 D4 4A 0D 44 A6 18 7A C0 83 A6 67 F1>)
$$ ##END=
$$ 
$$ hash MD5
$$ F5 F9 42 C0 55 95 B8 04 63 46 2C 7B 22 D2 AE 67
##$RELAX= 
##$RELAX= 
##$RELAX= 
##$RELAX= 
##$RELAX= 
##$RELAX= 
##$RELAX= 
$$ Bruker specific parameters
$$ --------------------------
##$DU= <C:\u>
##$EXPNO= 2110
##$NAME= <ADRS>
##$PROCNO= 1
##$TYPE= <nmr>
##$USER= <dgb>
##$AMP= (0..31)
100 100 100 100 100 100 100 100 100 100 100 100 100 100 100 100 100 100 
100 100 100 100 100 100 100 100 100 100 100 100 100 100 
##$AQSEQ= 0
##$AQ_mod= 3
##$AUNM= <au_zg>
##$AUTOPOS= <45 >
##$BF1= 250.13
##$BF2= 250.13
##$BF3= 250.13
##$BF4= 250.13
##$BF5= 500.13
##$BF6= 500.13
##$BF7= 500.13
##$BF8= 500.13
##$BYTORDA= 1
##$CFDGTYP= 0
##$CFRGTYP= 5
##$CHEMSTR= <none>
##$CNST= (0..31)
1 1 145 1 1 1 1 1 1 1 1 1 1 1 1 1 1 1 1 1 1 1 1 1 1 1 1 1 1 1 1 1 
##$CPDPRG= <>
##$CPDPRG1= <>
##$CPDPRG2= <>
##$CPDPRG3= <>
##$CPDPRG4= <mlev>
##$CPDPRG5= <mlev>
##$CPDPRG6= <mlev>
##$CPDPRG7= <mlev>
##$CPDPRG8= <mlev>
##$CPDPRGB= <>
##$CPDPRGT= <>
##$D= (0..31)
0 1 0 0 0 0 0 0 0 0.06 0 0 0 0 0 0 0.0002 0 0 0 0 0 0 0 0 0 0 0 0 0 0 
0 
##$DATE= 1162489465
##$DBL= (0..7)
120 120 120 120 120 120 120 120 
##$DBP= (0..7)
150 150 150 150 150 150 150 150 
##$DBP07= 0
##$DBPNAM0= <>
##$DBPNAM1= <>
$$ [...]
##$SUBNAM7= <"">
##$SUBNAM8= <"">
##$SUBNAM9= <"">
##$SW= 20.6930455092707
##$SWIBOX= (0..15)
0 0 3 0 0 0 0 0 0 0 0 0 0 0 0 0 
##$SW_h= 5175.983436853
##$TD= 65536
##$TD0= 1
##$TE= 683.16
##$TE2= 300
##$TE3= 300
##$TEG= 300
##$TL= (0..7)
0 120 120 120 120 120 120 120 
##$TP= (0..7)
150 150 150 150 150 150 150 150 
##$TP07= 0
##$TPNAME0= <>
##$TPNAME1= <>
##$TPNAME2= <>
##$TPNAME3= <>
##$TPNAME4= <>
##$TPNAME5= <>
##$TPNAME6= <>
##$TPNAME7= <>
##$TPOAL= (0..7)
0.5 0.5 0.5 0.5 0.5 0.5 0.5 0.5 
##$TPOFFS= (0..7)
0 0 0 0 0 0 0 0 
##$TUNHIN= 0
##$TUNHOUT= 0
##$TUNXOUT= 0
##$USERA1= <user>
##$USERA2= <user>
##$USERA3= <user>
##$USERA4= <user>
##$USERA5= <user>
##$V9= 5
##$VALIST= <valist>
##$VCLIST= <CCCCCCCCCCCCCCC>
##$VD= 0
##$VDLIST= <DDDDDDDDDDDDDDD>
##$VPLIST= <PPPPPPPPPPPPPPP>
##$VTLIST= <TTTTTTTTTTTTTTT>
##$WBST= 1024
##$WBSW= 4
##$XGAIN= (0..3)
0 0 0 0 
##$XL= 0
##$YL= 0
##$YMAX_a= 277423
##$YMIN_a= -414437
##$ZGOPTNS= <>
##$ZL1= 120
##$ZL2= 120
##$ZL3= 120
##$ZL4= 120
##$ABSF1= 16.45064
##$ABSF2= -4.242533
##$ABSG= 5
##$ABSL= 3
##$ALPHA= 0
##$AQORDER= 0
##$ASSFAC= 0
##$ASSFACI= 0
##$ASSFACX= 0
##$ASSWID= 0
##$AUNMP= <proc_1d>
##$AZFE= 0.1
##$AZFW= 0.1
##$BCFW= 0
##$BC_mod= 0
##$BYTORDP= 0
##$COROFFS= 0
##$CY= 12.5
##$DATMOD= 1
##$DC= 0
##$DFILT= <>
##$DTYPP= 0
##$F1P= 14.0000005364418
##$F2P= -0.99999901652339
##$FCOR= 0.5
##$FTSIZE= 32768
##$FT_mod= 6
##$GAMMA= 0
##$GB= 0
##$INTBC= 1
##$INTSCL= 1
##$ISEN= 128
##$LB= 0.3
##$LEV0= 0
##$LPBIN= 0
##$MAXI= 10000
##$MC2= 0
##$MEAN= 0
##$ME_mod= 0
##$MI= 0
##$NCOEF= 0
##$NC_proc= -4
##$NLEV= 6
##$NOISF1= 0
##$NOISF2= 0
##$NSP= 0
##$NTH_PI= 0
##$NZP= 0
##$OFFSET= 16.45064
##$PC= 1
##$PHC0= 146.9763
##$PHC1= 2.892123
##$PH_mod= 1
##$PKNL= yes
##$PPARMOD= 0
##$PSCAL= 4
##$PSIGN= 0
##$REVERSE= no
##$SF= 250.130017848115
##$SI= 32768
##$SIGF1= 0
##$SIGF2= 0
##$SINO= 400
##$SIOLD= 32768
##$SREGLST= <1H.CDCl3>
##$SSB= 0
##$STSI= 32768
##$STSR= 0
##$SW_p= 5175.98343685301
##$SYMM= 0
##$S_DEV= 0
##$TDeff= 65536
##$TDoff= 0
##$TI= <Analysis number 999999
Compound Code 99
Book Reference 9
Project Code 9>
##$TILT= no
##$TM1= 0
##$TM2= 0
##$TOPLEV= 0
##$USERP1= <user>
##$USERP2= <user>
##$USERP3= <user>
##$USERP4= <user>
##$USERP5= <user>
##$WDW= 1
##$XDIM= 32768
##$YMAX_p= 476979232
##$YMIN_p= -1466804
$$ End of Bruker specific parameters
$$ ---------------------------------
##NTUPLES= NMR SPECTRUM
##VAR_NAME=  FREQUENCY,     SPECTRUM/REAL,   SPECTRUM/IMAG
##SYMBOL=    X,             R,               I
##VAR_TYPE=  INDEPENDENT,   DEPENDENT,       DEPENDENT
##VAR_FORM=  AFFN,          ASDF,            ASDF
##VAR_DIM=   32768,         32768,           32768
##UNITS=     HZ,            ARBITRARY UNITS, ARBITRARY UNITS
##FACTOR=    0.157963299565203, 1,           1
##FIRST=     4114.79880795999, 0,            0
##LAST=      -1061.18462889302, 0,           0
##MIN=       -1061.18462889302, -1466804,    0
##MAX=       4114.79880795999, 476979232,    0
$$ Real data points
##PAGE= N=1
##DATA TABLE= (X++(R..R)), XYDATA
$$ [...]
26872 -474355 -570471 -369364 36996 -70707 -96812 -316442 -665617 -541243 -410202 -504164
26862 -504164 -597846 -562238 -505864 -433004 -210115 -440376 -612791 -421971 -462804 -232955
26852 -232955 5631 -25152 -93673 219877 112492 -7109 -86121 157805 28874 -89557
26842 -89557 84053 140013 -64711 -320525 -105348 -217135 20415 70257 263300 531184
26832 531184 351512 270770 344460 102318 99137 268608 -122679 -223388 -430605 -342910
26822 -342910 -135031 -86844 -133341 -11989 487379 584855 595523 637863 632561 884942 583173
26811 583173 370670 228225 385934 440284 410222 255788 405451 467638 405578 258275
26801 258275 72808 63604 61182 126554 277839 377299 564170 463970 214357 532757 739267
26790 739267 670577 607959 333271 128943 74010 337538 435595 -3821 106772 277576
26780 277576 69042 -345792 -541569 -707851 -227323 239360 548484 278824 -68274 220635
26770 220635 384099 292669 57780 -492097 -786208 -536306 -10532 76211 450604 293650
26760 293650 209721 217551 726151 1049848 939579 724890 410877 427701 420989 78743 -468287
26749 -468287 -620179 -574369 -533203 -297385 -132866 160626 525991 608684 458778 511688
26739 511688 466399 503436 367579 232696 59821 342126 730781 941309 1183737 852886
26729 852886 712655 290388 -265436 -777782 -750403 -797474 -358065 -38138 68767 26055
26719 26055 275842 495892 673996 513217 119175 -105245 -84974 -107291 21578 -56908
26709 -56908 -388541 -193178 -114124 -459768 -396632 -458000 -541325 -388361 -316490 -112339 284032
26698 284032 228891 184548 241819 36378 -224585 -51859 -79461 -660884 -283195 129116
26688 129116 36244 -103725 123229 241973 -39909 70243 56490 390969 452627 425651
26678 425651 549229 466008 272423 77432 90094 45783 610 441303 700333 380646
26668 380646 123144 -16987 4327 -40547 -248166 -87122 -117382 -198468 -60642 576842
26658 576842 789083 323821 137649 221604 392506 251848 87378 201000 -113559 -47200
26648 -47200 -28782 -393012 -748796 -539054 65512 187075 195956 469553 350019 -26644
26638 -26644 -529966 -630034 -16359 216205 487023 640616 911231 415608 62331 55442
26628 55442 212073 410688 256677 194562 176781 107391 112918 -34638 -277864 -36177 51957
26617 51957 739 -148845 -273046 -308199 -164515 -178872 -11450 39667 -71580 -156727 -48667
26606 -48667 -30250 -26645 57386 109161 123806 109601 -55496 -57358 -84414 -306433 -342735 -436223
26594 -436223 118369 219615 158339 125983 -150682 -322620 -168469 79826 153484 16888
26584 16888 307585 411534 107619 105621 248873 388072 520705 632469 695886 530929
26574 530929 388607 305568 62693 239117 445731 383973 121737 350758 736839 839361
26564 839361 546988 94878 70437 229706 21042 -88498 -15955 109693 136530 34608
26554 34608 134902 490673 277400 226582 221885 211641 41549 -263097 -342240 -523818 -715823
26543 -715823 -537223 -41533 135127 -95051 -172134 -78065 177206 194065 -139064 -583454
26533 -583454 -526746 -176190 -302471 -402687 -191598 -112247 -227111 -58746 -167692 -321793
26523 -321793 -373772 -397563 -565574 -358507 -340719 -144392 -159879 -238712 -33159 -132774 -122096
26512 -122096 -211653 -172003 -193342 -28315 96869 -206705 -328862 -249817 -167303 20084
26502 20084 -97302 -386881 -326428 -230319 -44421 -220421 -363387 -143216 -204358 -399801
26492 -399801 -547869 -389972 -119726 144959 465550 693300 371789 -58406 329299 311305
26482 311305 235737 196675 204981 430465 57371 -265886 -145715 -222225 -86647 -333234
26472 -333234 -536787 -259080 47620 -78489 -342749 -567004 -620789 -734620 -1038072 -686981
26462 -686981 -334259 -422250 -462315 -140941 -11775 133197 345291 209575 -81849 -35567
26452 -35567 -405351 -316683 -13137 -95990 -21880 -252262 -297431 41335 189906 -61292
26442 -61292 -84795 12202 -68857 -152603 121345 202889 254316 71338 -72492 114459 -133421
26431 -133421 -424928 -313138 -115261 -346695 -362692 -517265 -481745 -282016 -141836 92483
26421 92483 -89530 201959 361799 23392 -248022 -20532 61598 121889 -162921 -167082
26411 -167082 -332163 -312428 42804 312446 299870 71165 261452 519324 369490 -49066
26401 -49066 -118003 -43716 10195 -79037 -157281 -344830 -467666 -182775 234070 -183001 -336260
26390 -336260 -322092 -388511 -629526 -742190 -709775 -91004 340898 582548 639616 273784
26380 273784 13563 83814 -94499 -327740 -689485 -554310 -221632 -175674 -119607 -183762
26370 -183762 93661 45981 20874 316531 400767 144886 -64858 -68618 -321156 -297561 -85645
26359 -85645 -31612 206233 129870 202369 187432 -158489 14918 47011 93906 164307 289168
26348 289168 329324 83663 -167765 -382410 -94556 46047 119871 37357 166652 362832
26338 362832 286678 -107071 153009 -8049 -95100 71276 32924 -87773 -198946 -187897
26328 -187897 145002 507712 240712 -36784 179648 246373 25114 152639 116729 158787
26318 158787 10434 -298886 -290373 -189582 -104051 275756 430870 115170 -260746 -125121
26308 -125121 166899 37788 86365 44163 65763 94202 -114689 -211288 -523548 -632026
26298 -632026 -67674 17910 64560 171510 -24347 -148869 -61571 467516 587949 435949
26288 435949 301235 -91898 -179774 -218787 -15359 -67107 -351639 -394071 -50541 295470
26278 295470 451726 401704 219775 54760 -73344 -291043 -214871 -161996 56518 279275
26268 279275 412489 566686 273142 254423 258173 223242 6045 101280 416249 651141
26258 651141 290216 394755 119096 -312383 -287273 -246528 -249909 -99000 -607094 -663770
26248 -663770 -325704 179800 194942 245546 -46209 -454711 -224971 227931 385454 182532
26238 182532 -60024 -161240 -228545 -60312 -129192 17957 -68867 -309085 -244529 -209328
26228 -209328 109548 313960 263604 297172 334509 264829 201443 279455 162838 226221 45174
26217 45174 -440826 -571832 -464243 -393824 -152137 -188515 -173461 -207895 -82114 111870
26207 111870 -204806 -376451 42585 393340 587504 656593 479456 115733 75888 245888
26197 245888 272139 298510 400106 158441 173108 344727 380035 379938 325302 35489 -44867
26186 -44867 -25161 -9815 -64132 4047 -18906 -110412 -8034 36183 275912 480053 586176
26175 586176 578873 677514 332762 -228264 -136634 330264 352498 465948 477581 429360 487641
26164 487641 548113 402493 486867 378103 87055 202134 135678 -80781 174481 137031
26154 137031 229354 209813 9846 -307356 -287903 -458871 -283182 -267407 -338281 -298210 -397170
26143 -397170 -54564 17969 347823 320749 -134907 -104965 -267506 -155625 264274 346301
26133 346301 482665 138808 -83362 94386 49444 238456 303607 457960 668090 833235
26123 833235 575582 253632 191603 101505 -86887 -269822 -291425 -317209 -359380 -369236 52508
26112 52508 352410 621042 749175 626743 40482 -412178 -564291 -614595 -618589 -340153
26102 -340153 -251918 -349474 -558277 -311083 70766 118187 382693 720917 848101 554347
26092 554347 318321 -26984 -259278 -159332 85650 -180088 -185641 129071 246341 29420
26082 29420 -306088 -426992 -501668 -60505 178848 283295 140186 37198 -362067 -211483
26072 -211483 104214 115213 37631 -147723 -156328 -400122 -449131 -118103 -27264 117598 -121211
26061 -121211 -17235 299165 190250 -93441 -539917 -486711 -123611 -78498 -382402 -673356
26051 -673356 -478465 -460673 -261052 -158973 20374 36747 -104770 34130 84321 111313
26041 111313 292207 -119671 -122570 -187085 -562488 -595980 -758043 -517016 -280504 97881
26031 97881 48613 79281 -68457 -196132 -360071 -436356 -538319 -375353 -309187 -341382 -615032
26020 -615032 -460141 124354 304668 115644 153605 539590 731884 247073 -387043 -307869
26010 -307869 -411623 -369783 -38049 -38510 -63150 145434 435560 369010 440930 41103 -149131
25999 -149131 -147636 -118724 -390628 -684109 -488057 -145500 -57001 196281 419457 349144
25989 349144 -76509 -55346 446111 677706 734382 584873 464214 510009 259649 116414
25979 116414 -37203 183406 321432 8515 -64219 94256 141613 453621 807005 747858
25969 747858 557874 268290 -7289 -151919 -184570 -255722 -115737 62754 225164 377273
25959 377273 314056 543101 577934 140494 206979 40266 -98572 -59489 292140 21374
25949 21374 -203147 -46932 -26594 -351826 -715355 -640010 -259799 326863 409190 239239
25939 239239 -33392 -300715 -27258 454160 894100 723713 633166 142314 100092 501827
25929 501827 553278 344027 99902 -321297 -284382 -137892 -29831 33336 43090 345879
25919 345879 711047 547594 428240 430477 542142 458785 91024 111816 202778 242569 62558
25908 62558 -69982 -117405 -394384 -358990 -128108 60964 31863 190393 77059 -528561
25898 -528561 -477695 -475444 -352684 -65709 220603 700950 488651 311869 590276 1109458
25888 1109458 1189078 965971 297182 103417 191588 384863 -27459 67597 254113 360046
25878 360046 181359 2913 -9407 -397103 -559665 -499972 -161400 -22492 107983 92322
25868 92322 54420 -132303 142536 216738 -122448 -142359 -105935 -423455 -291856 108181
25858 108181 93181 117296 117835 75267 -434106 -357887 -146115 -414271 -328128 -430706 -345919
25847 -345919 -148616 -8928 412557 238696 68708 -258849 -448887 -281999 65981 -201420
25837 -201420 -209345 -5431 -42102 -88262 119139 -466124 -634673 -371155 2340 -132519
25827 -132519 -201855 -176654 -54531 -25380 12474 -10762 -111065 -297352 -385732 -174620 316638
25816 316638 317448 281143 657086 823631 458067 67458 43790 199386 293037 23794 342513
25805 342513 560880 340465 -161594 -437677 -148706 -28015 63298 -6880 -135920 144023
25795 144023 298497 539719 340439 -136091 -120836 143380 -37969 -57677 -284133 -497291
25785 -497291 -570457 -758315 -261591 134268 55444 -18310 188071 314726 407915 340736
25775 340736 -50577 -312540 -340879 -387663 -531889 -274387 249915 327190 -86392 -145851
25765 -145851 -345184 -553662 -190775 163722 342611 170526 216665 233715 119253 67947
25755 67947 -25948 -10187 -38420 -360375 -418577 -339216 -225276 77939 410723 449889 172033
25744 172033 -341248 -492135 -148943 183872 37790 -169121 -123919 115257 196242 363508
25734 363508 335275 30767 -104844 154193 405312 483716 258462 -168030 -209522 -236279
25724 -236279 -412698 -39765 -159432 -489593 -97738 125450 3986 47334 134822 -19762
25714 -19762 -189240 -273803 -284453 -472064 -591632 -155354 -22560 -34422 -274144 -477714
25704 -477714 -515366 -28150 768984 766003 468344 331306 316477 26929 167653 293177
25694 293177 231381 -27443 -267602 -449482 -308590 -163288 -149754 -21884 -240263 -89877
25684 -89877 100665 -9367 -210446 -377359 -516275 -517202 20115 69655 147862 154696 -206861
25673 -206861 -289549 -246031 -329265 -194202 -123534 56169 -30084 -238329 -216868 -443852 -323989
25662 -323989 102147 396105 227879 -81453 -469430 -456427 185207 401993 403383 270047
25652 270047 -4645 -353079 -289503 138096 -3632 -151127 -145217 25721 445623 73293
25642 73293 -92917 -5065 -183090 -359533 -772328 -528508 -68728 118179 525215 447965
25632 447965 343551 215791 101238 2673 69490 8187 124946 41923 -235118 -253271
25622 -253271 -161267 -32375 -105543 -57832 -60858 -137637 -234317 98073 -122682 -431033 -549434
25611 -549434 -461509 -410652 -394081 -239900 -291564 -316959 -237847 -72405 24244 93141 -111676
25600 -111676 240079 411273 33573 -361672 -404506 -44710 -77639 -193398 -480805 -618423
25590 -618423 -686557 -549402 -546400 -423252 -194937 -150536 117870 245923 327372 265534 84559
25579 84559 310253 666677 160665 -262864 -176767 225608 328042 149657 202372 184778
25569 184778 403368 353559 697850 768665 316166 -16720 -277324 -304717 -14812 257690
25559 257690 120994 386226 338233 146264 -39266 61509 43205 261655 585438 818640
25549 818640 621433 655454 453310 218215 -237074 -690730 -426857 -193954 -233831 134206
25539 134206 415995 123288 -37187 176732 513885 889209 609384 256096 297754 529476
25529 529476 533649 574778 474309 435126 106470 -99500 178520 351723 394318 398750 155679
25518 155679 223490 285044 393507 426807 304588 -236505 -329317 32996 270310 357504
25508 357504 242067 247048 357297 869565 965407 342652 91523 -59275 56729 -111095
25498 -111095 -195710 -233627 -180946 83483 217358 198327 207220 174154 306336 179945 -62680
25487 -62680 -5934 305968 468048 555667 217139 -76072 -2524 -51014 92462 37848 120515
25476 120515 5641 281594 270775 -56763 35306 -125563 -262261 -81858 129774 72501
25466 72501 -423450 -711302 -709159 -612807 -471341 -552267 -262812 -178572 -305288 -492028 -630729
25455 -630729 -378515 -290519 -481032 -733700 -671338 -375322 -154415 2710 47287 -281930
25445 -281930 -434288 -318737 -234164 -11287 346129 200766 -251719 -388940 -147322 15234
25435 15234 -43013 -92074 -5071 -8393 -145809 -308201 -586502 -728078 -291463 -94522 -4368
25424 -4368 -250322 -323092 -72131 157068 124929 -49241 -227557 -2488 -59825 -92263 -255311
25413 -255311 -349266 -308237 -650842 -706644 -586376 -830538 -832609 -618708 -444142 -570620
25403 -570620 -571918 -429961 -4695 346708 249329 70176 594539 600723 362038 194007
25393 194007 58400 78645 196862 220100 7349 -171089 -131209 -22411 -235693 -251542
25383 -251542 -355614 -557182 -376564 -315852 -394283 -567677 -173408 126112 15212 -109026
25373 -109026 -178550 -276229 -369836 -344158 -461753 -621554 -151648 233471 293653 185286
25363 185286 75158 -84917 8288 113238 256144 288503 276823 515785 233605 -123089
25353 -123089 -415431 -95528 122423 66490 264465 141428 67467 164468 212149 162423
25343 162423 230186 332755 418953 432208 595419 648601 462546 233363 -333755 -742615
25333 -742615 -548480 -406921 -161929 -108323 -340529 -493940 -331683 -331779 -133038 -207446 -231605
25322 -231605 7123 139324 166880 370644 388493 -70341 -355533 -172392 177063 88210
25312 88210 -217445 -536 -101375 -268565 -180027 -287800 -103474 -186297 -163718 52161
25302 52161 -137368 -317856 8002 195699 67729 -265458 -273915 123387 186571 15072
25292 15072 -522039 -703263 -507316 -540765 -597839 -437279 -70329 173970 220905 328099
25282 328099 295451 422356 419124 433402 675981 753083 548221 32771 -221048 -235886 69331
25271 69331 151549 230563 262216 -120702 -413369 -107376 82669 -2793 -137255 -36654
25261 -36654 -27735 -11468 49230 -226190 -645177 -792434 -737634 -324977 -95036 57088 423549
25250 423549 247142 -164444 -81583 -199875 -266514 -185741 -133796 -212790 259381 431493
25240 431493 359037 333813 174151 -330344 -445775 -346640 -373377 -263689 -343946 -570474
25230 -570474 -494894 -202256 -42921 32403 -240667 -28284 231724 297080 410938 425491
25220 425491 267247 79005 32915 422617 677422 495933 446914 57545 -136336 18389
25210 18389 104317 341146 155248 -229812 -592548 -487640 -287765 -158665 -150885 324603
25200 324603 398470 -9812 -267604 -558729 -796816 -436700 -137592 67849 190908 700764
25190 700764 485606 216318 133534 119099 48087 95762 70125 -19412 -333284 -457247 -406916
25179 -406916 -181219 171071 202332 -142236 -57986 209614 313643 199580 190563 54988
25169 54988 91944 -19360 -385690 -224534 -217904 -243183 -73215 216012 579344 719535
25159 719535 361405 518163 241592 -247287 -534403 -521350 -399410 -265561 -77046 26890
25149 26890 -294246 -946394 -1091968 -608629 -444460 -171221 -77904 280069 430424 214673
25139 214673 -69841 -33128 140702 101160 28218 249202 389452 278685 16364 -296608
25129 -296608 -222578 -136258 -231817 -224419 -227587 -201284 32748 -48175 57703 166555 70459
25118 70459 -119710 -332586 -540760 -476115 -362312 23784 351125 377702 592788 355379
25108 355379 222784 71409 -295288 -635573 -599403 -485651 156984 -34374 -223635 262112
25098 262112 172898 -113350 187715 543893 754354 664750 134730 49479 4692 -206703
25088 -206703 -303782 -461637 -369011 -245730 184167 304751 265049 528675 336495 118640
25078 118640 79856 168281 193280 504240 752756 647774 225286 298241 126773 -235309
25068 -235309 48151 189437 -309191 -229194 236192 451627 226551 208907 7051 -260113
25058 -260113 -269867 219972 291648 280347 86030 -47947 -161160 -76038 -106398 -187320 -351565
25047 -351565 -262935 -83885 -140486 188668 -153962 -167431 -25556 16306 222047 -131762
25037 -131762 261632 365822 340499 349469 285029 166140 67730 -120823 34614 82096 -90251
25026 -90251 107630 221153 150416 157766 480001 737134 553053 4061 214526 784227
25016 784227 725015 67307 -116410 295549 344229 352026 564917 113742 -246644 -147461
25006 -147461 148002 -27649 -424477 -444003 -83791 -66229 -65626 -119402 -136083 -226682 135228
24995 135228 341935 244723 191317 118382 -224929 -503091 -329029 -213916 -270405 -243748
24985 -243748 -258390 -287196 168909 422516 315068 -84874 -319876 -155897 -549287 -455324
24975 -455324 -273598 -439674 -287552 35731 220020 195559 171777 433452 263716 33449
24965 33449 10104 41202 -213636 -111425 125896 -28336 -114709 197710 278967 93177
24955 93177 -41184 -122690 -221753 -47059 41917 93330 235948 132100 -7090 123804
24945 123804 137263 222744 -30332 -406891 -281287 -316245 -225026 -6154 -212921 -250344
24935 -250344 -395289 -278920 -124134 238657 827764 625464 378278 -23681 161785 333029
24925 333029 322795 -129609 84765 191008 368944 449006 38761 104095 201297 -3650
24915 -3650 -430736 -481679 -301159 1916 316344 34171 -68604 10641 97125 132701 26208
24904 26208 209464 161924 21334 -160688 -106984 -213300 -251129 -416184 -454264 -151820
24894 -151820 257240 330932 24363 119190 45018 325199 78789 -279338 -159676 -54538
24884 -54538 53051 -27316 57913 -167928 -226076 -176103 -110103 -224125 -269071 -428673 -727214
24873 -727214 -606880 -597617 -391685 -241601 -119770 38605 -236567 -94654 -94969 -246712
24863 -246712 -99163 41813 209827 482416 225233 -240192 -759820 -636809 42729 376867
24853 376867 422602 294415 -119021 120187 496220 104256 -144084 -115400 -201337 97091
24843 97091 -80056 235324 531673 347385 257623 30584 -174692 -224879 -292419 -343260
24833 -343260 -148263 291233 221272 413123 189036 98028 -85947 -375473 -537208 -299487
24823 -299487 29397 272034 126734 -81336 144181 48927 229452 559464 805854 767103
24813 767103 676800 578017 569986 551340 832536 783556 526117 526799 601818 551629 258607
24802 258607 138852 -93122 -98773 165886 149007 -2826 -231302 -61370 238172 256119
24792 256119 332414 194779 105586 79621 -369603 -336846 -297543 62408 73606 -286119 24500
24781 24500 589766 1049832 980890 312846 36630 76548 292377 565399 215758 -218542
24771 -218542 41367 359925 392074 554258 362590 20183 -129252 237922 490169 295609
24761 295609 281800 509758 634142 1051694 915327 438205 379002 182972 303167 358174
24751 358174 471380 485223 263704 -93823 -27314 -70733 -16691 229922 258747 152692
24741 152692 202582 226034 -78064 -480992 -700596 -734566 -744512 -673264 -575019 -394105 -40027
24730 -40027 21194 60437 81206 -16182 25119 64737 204208 193954 336379 458441 488025
24719 488025 600446 407675 225131 63208 -123367 -155787 -26996 -93297 36636 14139
24709 14139 123640 506 -20227 -19272 454484 690780 423658 154307 14783 -130106
24699 -130106 -387808 -405736 -55503 24200 174311 428954 694834 619938 368343 256407
24689 256407 252360 295004 -70314 -148142 -343754 -426241 -184959 105815 251137 378719
24679 378719 262229 -63015 -206284 -192057 -40663 22556 -90631 -120995 -27719 -34756 179055
24668 179055 193057 -224956 -182770 -191271 -122595 -71539 -163761 -301739 -184135 -353810 -83309
24657 -83309 257626 308216 347421 313571 26223 -64884 160602 52642 258806 274825 -30532
24646 -30532 -314868 -675748 -687649 -190370 374306 536052 650130 598453 254948 27583
24636 27583 24434 147927 76500 -73182 -92286 42542 32967 166369 311609 675409 709507
24625 709507 575403 211479 439961 520704 306716 280469 277403 438856 651497 508573
24615 508573 314305 109611 -137191 137136 115528 22722 -287076 -574525 -277484 41682
24605 41682 335489 406399 332641 232678 165448 -99146 -151526 -429042 -569737 -468313 -229571
24594 -229571 -63118 77323 -78505 -348555 -530463 -231581 -341738 -167157 -38675 223271
24584 223271 391011 520959 543396 256228 146412 336010 215030 444064 681998 480192
24574 480192 538180 730257 706311 555795 219344 73753 -127004 -243772 -155960 -121037
24564 -121037 -93081 -43798 -422955 -404566 25910 251396 303966 185340 249193 75841
24554 75841 230613 337029 344032 311136 17461 64580 -15820 -95350 351387 597571 432736
24543 432736 -86743 -69856 -483928 -744772 -448463 -99629 5909 158647 154980 183471
24533 183471 -27885 -314978 -47583 202032 316424 -278105 -580325 -328511 -159950 217257
24523 217257 85835 -38182 -175079 70940 112475 -142124 -776337 -1008038 -776426 -400018
24513 -400018 -112675 -243702 -503196 -638716 -538929 -174293 -85786 79325 -25449 -17641
24503 -17641 307358 406636 307067 -34680 -137080 110659 390517 711722 332636 -20945
24493 -20945 -123220 44501 638579 734316 791114 888739 726224 398662 237268 13313
24483 13313 -118282 41545 134771 -51248 208877 265984 461774 545944 343167 103152
24473 103152 46210 8137 -37644 338971 375695 268678 127545 32852 213826 477295
24463 477295 53922 -467652 -481329 -499270 -431487 -144734 89653 -74239 38609 15934
24453 15934 10532 -248710 -397232 -211086 -36448 152030 89226 67922 221448 273322 -2587
24442 -2587 -89560 -121023 74805 97545 -123533 -220023 -27329 -11895 -427962 -377139 -306202
24431 -306202 -399513 -138258 97136 -98373 -452699 -468882 -247174 -57220 -410369 -183231
24421 -183231 24284 -117978 -554252 -381511 -111862 53889 -39243 -495462 -576468 -401010
24411 -401010 -104766 980 -171558 -121539 -158874 -340262 -143623 -397242 -830643 -718615
24401 -718615 -517389 -471161 -499455 -611227 -586784 -668021 -738783 -514881 -338195 -400456 -378692
24390 -378692 -476523 -77853 67420 -123177 -393353 -489469 -180840 -200030 -154563 -431717
24380 -431717 -807090 -718030 -426935 -253620 -71697 247240 555399 306496 299866 285216
24370 285216 -35678 -179065 -125465 -502011 -449118 -154937 -151593 -255477 -278116 -408135
24360 -408135 -529139 -363152 -552453 -230986 -555024 -582789 -102383 -249233 -357978 -298411
24350 -298411 -79462 46921 154401 99176 46469 -131225 -223030 -257770 -364932 -235751
24340 -235751 48383 -89270 -123970 -100544 -35193 10778 -53845 -345710 -333584 18596 239594
24329 239594 278545 496713 394666 397043 498941 453826 433133 580653 663297 632970 331652
24318 331652 152987 391785 514484 493786 555235 534618 570870 24847 -475660 -147345
24308 -147345 275892 207641 88104 -107541 -192013 -321399 -318138 -334078 -252890 449462 459145
24297 459145 -59447 -61256 32065 70808 181092 188923 -46455 40035 62391 206821 40127
24286 40127 -91153 -279389 -323667 -285011 -323898 -67834 51310 -145810 -658801 -763629
24276 -763629 -124611 345285 73205 -242330 -59903 69699 253129 432170 491359 448114
24266 448114 138652 -151034 8085 -136204 -568990 -954848 -1056028 -571139 -516782 -662300
24256 -662300 -603980 -43331 230025 173555 207952 -215293 -309756 -425709 -554913 -333206
24246 -333206 -150409 -364710 -359048 -404015 -219037 20495 28640 287896 133590 397034
24236 397034 282386 -134267 -167931 -234819 -170389 -62898 -230937 -92349 -385099 -477068
24226 -477068 -136985 -102219 -23308 79895 -218016 -214717 -579687 -586947 -275873 -226236 -512259
24215 -512259 -651566 -273532 31549 77727 336 26552 267229 252254 96049 -160879
24205 -160879 -510094 -457350 -547926 -755713 -711446 -402553 -196219 312995 508642 346942
24195 346942 366640 305477 36784 -53382 -141169 -408553 -398535 -132836 -327307 -327726 -145238
24184 -145238 148681 139559 -482025 -456226 -190287 -140906 16509 146775 357040 354565 479463
24173 479463 551294 377362 281610 486646 428723 397955 330164 119340 -14112 -72450 -6571
24162 -6571 90805 56311 289448 265426 10120 -261674 111114 202517 230198 332491 779762
24151 779762 878398 950440 614958 168952 -47050 -92614 -292508 -349695 -217349 -25447
24141 -25447 408236 437655 6910 -198582 -45013 124393 -42226 -262484 -243602 -23714
24131 -23714 -202508 -368046 101952 367954 27381 -318899 -745147 -708899 -382080 -143940
24121 -143940 -20031 -140987 136468 139940 394927 763935 622517 689982 469682 166677
24111 166677 359456 164389 -8297 -8309 -96775 117090 374923 116744 245855 292743 182105
24100 182105 66106 -185821 -90698 -151423 -479052 -771614 -856159 -454238 -197796 325635
24090 325635 -34577 136848 255963 -238046 -446367 -546528 -504020 -331880 -45664 193859
24080 193859 493739 84643 112672 33818 265186 376611 562939 241130 -230465 -818165
24070 -818165 -956317 -672290 -298678 167403 112526 -590300 -797501 -284768 8049 155834
24060 155834 146226 363463 536099 515751 373822 384498 556352 598087 473362 551363 949240
24049 949240 885060 380031 305465 52291 -207605 -104905 -219908 -89210 81165 -35947
24039 -35947 -218846 -370571 -212073 -136768 -76235 128405 -114601 -105322 121235 515590
24029 515590 607053 511335 -686 -255411 -131535 -33489 235988 377367 401658 287244
24019 287244 -35617 -427344 -579394 -318084 216379 52724 -23 67863 -3128 -2360 184936
24008 184936 130832 93070 84371 24981 -93808 255920 463405 200042 286562 467028 249536
23997 249536 -50400 -74450 -60412 -146634 -170579 83065 -51863 -612272 -352066 -434051
23987 -434051 -706722 -883965 -860297 -1099938 -798103 -431543 -290559 -226419 88204 385139
23977 385139 127563 70802 -362241 -425396 67442 -212628 -709974 -773780 -716914 -683665
23967 -683665 -431095 -177558 -283229 -473566 -362985 -198096 -254171 -203934 -87948 -181421
23957 -181421 -276702 -248641 -803718 -761764 -413029 -290391 -254182 -152478 1319 184545
23947 184545 409488 315693 141151 496555 642395 813235 691770 299896 137914 83525
23937 83525 83676 -95013 189245 232602 96089 214633 210271 62638 -441116 -688113 -889946
23926 -889946 -529087 -396212 -336421 -162628 -116283 -265050 -47578 37885 152448 -43176
23916 -43176 -161627 190015 269797 223755 376274 215001 81983 134978 267657 528539
23906 528539 792407 706222 487567 364636 234614 -235093 -173684 -383547 -237968 -27412
23896 -27412 -297427 -357817 -73393 180612 144139 130134 -120300 -186963 -47795 88748
23886 88748 100979 -27100 -143163 -185502 -226968 -346012 -572560 -589945 -306773 263876
23876 263876 113382 -173318 -561925 -622038 -609438 -690528 -623703 -444164 -129300 -79141
23866 -79141 79788 391488 212914 36111 -19191 -340515 -173159 -27306 11 113826
23856 113826 111437 -166987 -56897 -106304 -165636 -447825 -431086 -133781 221110 393895
23846 393895 396344 400419 273963 381763 369606 408189 107107 -81106 52366 -178783 -118356
23835 -118356 47112 -194145 -429994 -299236 -136638 -305941 28916 43893 327732 498188
23825 498188 490553 523775 495534 115432 -320652 -595079 -504261 -31461 331699 77128
23815 77128 -2935 41968 -115231 -429213 -323091 -438399 -305173 -250476 -514131 -770549
23805 -770549 -666390 -496201 -159919 44569 -68112 -229292 -345874 -536154 -537860 -710034
23795 -710034 -788922 -887251 -790209 -485570 -246293 -17848 -201622 -160918 -293250 -208684
23785 -208684 -175808 -91545 -210863 -302343 -169752 114642 163240 255989 183880 374824 150933
23774 150933 179364 174410 248945 225083 365704 318263 117101 163600 87777 95118 -21328
23763 -21328 92022 199757 281792 432065 249235 430746 134741 -101528 -60919 39303
23753 39303 -166101 -14414 107333 -117952 5620 164619 36765 41400 -32565 106046
23743 106046 270112 228187 54198 132769 402026 711404 507770 403683 246698 122662
23733 122662 65530 202584 224678 120196 135850 239099 525238 201473 -114585 -286827
23723 -286827 -139880 9818 224677 212874 499368 402987 318942 489038 265136 115551
23713 115551 -5140 234887 89756 -17096 76927 137731 108901 -73559 87809 197999
23703 197999 234538 -13803 -88627 -403253 -523445 -253258 -299170 -261707 -202404 -175813 -14827
23692 -14827 130386 11069 -217528 -711327 -1004527 -925017 -547137 -294528 -165742 -85402
23682 -85402 -67014 136290 466380 181169 97075 188309 355165 476756 362661 252374
23672 252374 167059 -179215 -298474 -387410 -301745 -318301 -454189 -549842 -609019 -216531 -287081
23661 -287081 -460823 -548188 -426837 -58272 225447 -97329 -516142 24222 149226 -13768
23651 -13768 -89098 -158909 -735190 -856475 -719005 -721358 -632640 -11193 -77921 74417 53905
23640 53905 -101613 -161598 -330267 -544840 -699842 -584710 -256046 -16362 8350 194552
23630 194552 98630 13197 153287 -40133 -51084 461263 364355 124565 209414 171318 -276434
23619 -276434 -605221 -625883 -674575 -283417 -298252 -201943 -27007 90348 -85067 140847
23609 140847 206699 215585 206245 308078 260718 320061 115562 -15800 294161 343577 470302
23598 470302 333171 165009 -79051 -257303 -365616 -127358 266714 172436 129402 76953
23588 76953 413346 758919 877752 833027 835584 1075502 528949 166803 -89543 -25904
23578 -25904 141730 -75914 -235877 -201285 -161036 216649 488389 381085 221037 251349
23568 251349 116770 -3067 29052 -182807 -58513 -8440 -200879 -98823 -22933 -328292
23558 -328292 -97468 162026 252461 -56932 -12931 80987 386535 568520 884172 1203397
23548 1203397 832840 686612 262653 -191506 -170505 127649 10048 24482 27928 -106705
23538 -106705 -322686 -501235 -557196 -543262 -648762 -565004 -817302 -844697 -567257 -379014
23528 -379014 -463512 -340790 -394262 -244887 -429285 -180079 137570 429937 600974 313325
23518 313325 300026 309607 183878 -146387 -246049 -152332 -165188 -214708 113591 151196 -91766
23507 -91766 432621 925599 676717 215930 -19688 293114 242331 -91281 -478676 -778396
23497 -778396 -687002 -370549 -431444 -315091 -175529 73763 479567 265103 -119040 -236225
23487 -236225 -86165 183242 -135071 -335441 -264947 -292597 -268802 -72009 -18647 272008
23477 272008 583524 325963 26449 -1004 -12349 -196771 -263038 -448323 -515555 -315579
23467 -315579 -124138 293643 624682 439610 181141 -53485 -554117 -826159 -655960 -490669
23457 -490669 -576134 -465561 -320471 -182124 11721 666465 761522 -74871 -504771 -258177
23447 -258177 -263596 -574169 -726454 -478904 -434292 -314932 -188376 15797 -67376 -84703
23437 -84703 -230192 -246747 -143691 -212138 131772 323778 52630 -68633 -283518 -464972
23427 -464972 -375257 60102 -88023 -293829 -636121 -934817 -565272 -208876 -446164 -265060
23417 -265060 -142686 -353178 -442190 -338392 -200923 525856 931712 807970 450500 570123
23407 570123 479685 395388 225053 -108516 -90046 284789 591549 336851 -130192 -452297
23397 -452297 -235754 94924 168310 149365 175339 -52500 -117168 -26788 221611 288512 327836
23386 327836 476628 418203 202491 221892 333108 425569 184187 35809 110247 190933
23376 190933 356078 98723 13622 161026 219693 -240123 -791458 -843458 -610901 -523340
23366 -523340 -529260 -662185 -396160 76050 34774 -170728 214758 435713 217136 21157
23356 21157 97527 48803 97264 214664 74298 210784 324144 393658 375606 21509 -264967
23345 -264967 -169964 -168806 -299048 -521288 -566429 -205876 595626 958015 603497 625769
23335 625769 65546 -273449 -196079 -28956 -192438 -27560 241095 233929 143438 -110854
23325 -110854 -162866 -33856 23703 -84981 25990 117912 -193949 -377287 -226166 -133481
23315 -133481 -185002 -448792 -712993 -680171 -583819 -217794 -397458 -196342 -65681 -321137
23305 -321137 -369962 -334278 -80611 227363 -8857 -160593 158895 332043 311425 211354
23295 211354 137889 108584 -163953 -321345 -349659 -18555 358111 78654 -95834 -234158
23285 -234158 160231 416112 116187 259763 119278 207203 85324 92603 452669 745778
23275 745778 725770 370342 303853 75428 -219082 -234127 -238995 -109521 -79920 -195060 -504866
23264 -504866 -416415 -191682 -434191 -571375 -665240 -208306 87088 136652 207605 174875
23254 174875 522760 624381 457370 128134 -16124 53023 -54091 -385469 -340359 -63772
23244 -63772 -171330 -60994 -282 -27600 -185863 -295328 -239324 -220624 -216050 -218628 -194664
23233 -194664 -37740 -157145 -407094 -361443 172223 -2748 -248820 -78769 67745 159775
23223 159775 -343628 -464630 -349280 128327 151556 -22680 -335633 14008 493396 371401
23213 371401 310485 444522 671835 611704 355673 68667 26030 133462 297903 447518
23203 447518 610411 682686 581142 234363 -103295 -142516 -55258 308232 436918 415228
23193 415228 317393 -749 -71532 107562 267545 552785 525611 547846 288467 465135
23183 465135 633391 714848 628284 546283 593550 765270 763992 497497 158839 -246680 -723219
23172 -723219 -401611 87781 209703 93779 94272 236200 150746 -61067 -153578 -381094
23162 -381094 -324712 -354670 -32988 286966 -5397 -426060 -603086 -459205 -601869 -87840
23152 -87840 -61648 -156286 160068 189302 114262 19667 -272622 -387900 -179006 56383 20613
23141 20613 -301865 -435708 -695646 -489709 -93327 -149053 -41427 160846 383049 266483
23131 266483 124462 368604 128130 -423016 -472008 -402379 -297721 -354071 -337970 -398313
23121 -398313 -531061 -526692 -159431 54574 18053 -210577 -468651 -369578 -56412 113753
23111 113753 320769 474261 135667 214551 118191 -417501 -206606 29804 46282 332562
23101 332562 373078 136037 -23198 186714 10647 161783 573877 310059 -51504 -70111
23091 -70111 -466466 -333514 -99120 147470 483874 533802 157795 101501 462557 268169
23081 268169 88451 118740 376803 464317 494214 202103 250211 376876 128581 462364
23071 462364 577326 202564 -168635 -278930 -429357 -477095 -313613 -408320 -441735 -284709
23061 -284709 -173432 -188558 58208 116238 -123194 -350442 -226878 -39424 -209751 -29717
23051 -29717 282739 146756 144931 36251 -121860 -188207 -49805 64152 189077 354903
23041 354903 584214 714195 430669 715361 785669 582085 478947 338646 437468 255921
23031 255921 -15680 -370335 -330956 -230819 -135330 84258 135808 257669 158911 154070 437925
23020 437925 116972 -12959 181454 296553 367671 425511 391798 127365 73160 -48402
23010 -48402 -62043 -37604 73746 659830 489007 25569 -465300 -722890 -96269 -139704
23000 -139704 -195479 317786 533021 180081 -269041 -362463 -288357 -50382 -84452 -16056
22990 -16056 169843 20803 55024 -22649 125030 173866 46438 179123 114883 -21027
22980 -21027 85301 13507 -171448 -283493 -290728 -319460 -392300 -318022 -369045 -200767 -222951
22969 -222951 40077 -19621 212350 170824 -239571 -16352 28900 113714 -201822 -223695
22959 -223695 -104990 -374230 -378024 291349 338778 285918 322739 69855 116247 138571 194080
22948 194080 -107245 -555303 -455444 -216344 -78416 110997 136830 261787 220948 126481
22938 126481 130554 81517 495990 846753 416576 80407 244244 432755 321044 -206209
22928 -206209 -179645 52030 2823 -87990 -275050 44370 313838 345879 434405 218046
22918 218046 101456 271704 183385 397638 628631 549805 479231 270324 240710 151389
22908 151389 -179007 -165648 -335055 -599914 -912616 -761683 -417118 -343541 -498418 -464275
22898 -464275 -391834 -184352 258373 375062 427061 570559 472903 60965 5805 -109581
22888 -109581 -119731 75512 313729 386632 218415 406618 714803 630146 275067 181407
22878 181407 -3209 -69705 369377 353053 -35625 -258863 -208235 -80015 -84385 -219058
22868 -219058 1474 -66412 -212197 -245864 -67879 440929 574399 647141 607654 429656
22858 429656 569623 175101 -135364 351797 -50353 -239193 -192450 -88002 2592 158339
22848 158339 -76837 -456831 -560843 -259479 338265 534875 360666 275343 212911 212768
22838 212768 299818 139251 -19515 -338382 -460945 -1734 350502 491874 266691 -54422
22828 -54422 -417021 -352348 -388698 -183831 278498 303259 561812 660518 597725 565013 479626
22817 479626 526323 649279 752971 563043 23545 5028 272985 488463 489812 395295
22807 395295 78840 -73519 -22510 206999 74697 323200 50867 -419140 -245428 -53446
22797 -53446 41519 -73566 -386954 -419720 -354545 -342063 -204349 -125754 -249778 -227055 -208385
22786 -208385 -105450 -356913 -548645 -537685 -463246 -117602 86211 -368767 -572896 -761333
22776 -761333 -552209 -390386 -454735 -196548 20482 101058 215355 476975 101434 -43992
22766 -43992 73255 188307 371508 310174 126029 88844 63460 -153681 -399740 -468269
22756 -468269 -203840 79579 231195 947105 777155 250870 113186 175900 478353 416369
22746 416369 413054 112435 7478 178945 349856 454319 392219 142324 -481887 -449360
22736 -449360 -456450 -384069 -387631 -455334 -8195 252868 241170 387569 115687 -559683 -563688
22725 -563688 -350218 -152923 -3759 31899 136152 152056 271187 274155 376043 117144
22715 117144 -160669 -227169 -578436 -901846 -806131 -796360 -679116 -362809 -303837 -311006 -28103
22704 -28103 120743 241888 308126 179650 290226 614992 576573 585970 570433 319747 298648
22693 298648 138278 -102421 -125166 -269580 -378906 -593421 -519604 -26451 257942 142717
22683 142717 170721 124438 -440707 -407369 -140675 -233308 -154259 4323 -213091 -522617
22673 -522617 -447993 -94572 190582 397661 514666 221715 -284845 -628822 -586207 -433847
22663 -433847 -478238 -645971 -311206 -106699 11563 -60093 46586 -71531 102943 19724
22653 19724 -149932 -181453 -320512 -410447 -145707 124321 523494 270441 -119813 95805
22643 95805 8912 -67120 -254490 -207949 -7356 534192 1032895 938838 543681 312858
22633 312858 575491 309184 -137265 -58835 158339 75525 -231540 -32522 139631 67892
22623 67892 218193 321564 128385 37576 -18647 -310327 -288536 -92563 -122439 -121163 -253061
22612 -253061 -358674 -413721 -278922 -168923 21892 -177063 -439599 -515114 -198908 2517
22602 2517 646567 619000 404145 561529 729901 493125 294451 259514 162683 252605 128188
22591 128188 171729 73112 -1496 -24801 366 119176 16695 67875 124307 -88750 -416567
22580 -416567 -318028 107772 30417 -44471 -122898 -346856 -312810 -99533 21296 452467
22570 452467 622916 244287 -236653 -205944 -109479 -442307 -732442 -758986 -556203 -542975
22560 -542975 -394470 80154 136985 363131 394329 402617 302066 241564 76926 177052
22550 177052 127992 -249421 -633987 -391387 -202599 -201000 60249 233408 -29687 14365
22540 14365 247204 99317 582584 970859 818764 148832 -418721 -410269 59563 164223
22530 164223 141680 -382217 -529532 -9085 292605 268092 116008 68404 -174150 -228511
22520 -228511 -36934 -101940 -8585 239794 591629 533560 581409 312722 208153 316496
22510 316496 527543 728150 682899 446248 308170 139721 396874 669422 537144 584722
22500 584722 346750 399753 606501 556985 326055 285803 134193 -55981 -142424 265368
22490 265368 568680 193168 -4255 -353995 -253251 128955 225292 225619 -79319 -56954
22480 -56954 -92211 -145049 -89644 405833 563356 485370 329973 501578 451803 238109 88986
22469 88986 55903 -243508 -310479 50957 57978 226660 354964 325476 362318 457307 456461
22458 456461 645019 425387 141777 425471 457883 337344 150087 219932 191272 12288
22448 12288 -251103 -57533 287477 611039 696873 501836 390049 219690 387283 172146
22438 172146 -57228 125352 195793 57407 128037 314690 410193 589697 571601 364672
22428 364672 32866 59387 -124255 -275529 86866 517520 442804 497821 430831 500607
22418 500607 137670 -42343 196913 -39002 -354030 -419471 -315827 -7452 -368719 -572392
22408 -572392 -630512 -577689 -580546 -312415 46265 252774 464198 389508 328999 262918 106500
22397 106500 130740 52144 250298 70883 -275311 161503 482345 5112 -47562 68021
22387 68021 27120 73838 -40086 -71504 -288057 -338374 -173884 -130994 257698 520082 312618
22376 312618 4894 -404936 -547788 -471367 -196541 67642 -52384 -261504 -491538 -528960
22366 -528960 -301749 -124371 -389037 -134162 350910 505151 329856 133787 112700 -195563
22356 -195563 -414392 -423792 -599160 -679754 -623848 -273506 -190518 -108140 -147937 153410 92159
22345 92159 163788 348132 -87916 -502119 -343360 -43602 185220 539319 518574 260261
22335 260261 124805 37044 -406877 -450026 122454 239231 69531 -269044 -203712 -109522
22325 -109522 -262317 -469155 -659369 -644953 -105476 234078 321058 180079 -161633 -434946
22315 -434946 -305663 -281944 -368975 -262855 -205056 24151 145439 273354 455281 435845
22305 435845 489775 13685 -217652 -388079 -666251 -628133 -582512 -261887 50239 189770
22295 189770 153128 -341673 -896979 -1080008 -1011364 -303578 215782 535568 381823 48285
22285 48285 87817 418370 410644 179378 221309 -9486 54121 120166 410816 344897 -109204
22274 -109204 -236458 -93046 72711 -23025 -163098 219919 654795 730133 518104 392168
22264 392168 745864 488412 289562 298924 253396 681739 538847 227179 -40310 44933
22254 44933 357219 599252 426304 111893 565472 577623 279408 125018 -244651 -157945
22244 -157945 -225354 -237602 113011 401651 203801 -55605 -226412 -188416 -168512 202047
22234 202047 226959 -83913 -249958 37246 -30512 -141243 320730 456465 377061 203029
22224 203029 198609 163629 -130653 -150447 170038 222807 -218949 -427256 -471365 -734897 -575611
22213 -575611 -221638 -215778 -176253 -370458 -205585 143117 135384 93104 155391 19096 -80347
22202 -80347 -53046 79703 47 -165322 -206352 -127845 -100832 -134650 -203310 -597149 -759797
22191 -759797 -480982 -122079 -361991 -339222 -38319 -161772 -137924 236111 220852 -155373
22181 -155373 -358998 -618012 -503437 -255597 -290095 -507295 -349547 -122410 27870 163468
22171 163468 222394 1799 -338099 -393360 -326191 27763 -136371 -290695 -630001 -557843
22161 -557843 -428153 62616 253965 -25235 -74713 261502 295551 244300 148556 40351
22151 40351 -286711 -422018 -423880 -246896 -472106 -396011 -192209 27277 254207 56736
22141 56736 -40474 86970 245416 45672 -194393 26072 566358 579023 571428 734129
22131 734129 501253 309323 368735 452950 86565 -67640 83120 101373 338500 293422
22121 293422 -180233 -284543 -266488 -425145 -576159 -526863 -316394 -61070 -112240 -535666
22111 -535666 -525220 -704729 -600413 -354313 -232229 -209972 12374 -82191 93052 436980
22101 436980 458841 118256 -23053 -157788 -31195 68098 -144728 -312473 -94455 -92374
22091 -92374 -296467 -198655 -150455 -220514 -271015 -163882 -94487 -77126 335576 753350 801106
22080 801106 734488 45662 -424923 -440240 -244529 -520715 -702665 -606806 -460242 -315324
22070 -315324 -393799 -184770 -7216 149165 266053 548445 255923 203449 273710 146961
22060 146961 -5303 -252947 -344086 -104316 -149624 -488269 -57875 171183 81662 -101949
22050 -101949 224318 146240 -462970 -606532 -347934 -86766 -324952 -241211 64789 135127
22040 135127 63732 -319544 -158845 -378274 -409056 -186657 -84712 -285590 -261021 84754
22030 84754 94278 114772 277285 85518 -251528 -12918 114838 -205467 -67093 258088
22020 258088 120641 95938 246118 116403 -236318 -258644 -126531 95468 65930 244794
22010 244794 -77816 -298283 -126954 -256229 -73422 -175334 -339549 -128622 -430120 -125482
22000 -125482 -17651 -142899 -166896 58861 16656 -186148 -403587 -311485 -92123 -265886
21990 -265886 -317715 -325892 -30487 427040 348698 61760 96005 373478 438421 344498 199055
21979 199055 287968 160701 212805 569033 466458 376502 -167292 -213312 -376941 -560952
21969 -560952 -265308 42699 259794 111614 -207401 -447187 -524175 -304270 -276955 -342078
21959 -342078 -201935 21717 -10648 -202195 67375 -18796 -104470 57654 -292979 -163568
21949 -163568 196144 35180 -189670 -289881 -419572 -377104 -629084 -360921 -182946 -313877
21939 -313877 -519657 -726409 -456624 -72018 33848 -346640 -419035 -158177 40401 173638
21929 173638 157824 -5680 -79392 55441 173359 320875 184968 144506 -106209 -132264
21919 -132264 -174663 -54464 353448 159727 -13538 105939 107938 264769 396779 328093
21909 328093 -292207 -248700 -677699 -991038 -829303 -655627 -376692 -254814 72237 445188
21899 445188 255650 -311435 -96414 187906 -172598 -256216 -308823 -477597 -390523 -115830
21889 -115830 337006 566958 356951 85812 38124 141117 285812 318170 29881 -119650
21879 -119650 -124397 -258046 86299 -33352 -144771 130167 189830 41068 -9247 -74675
21869 -74675 53894 -42715 -10602 181604 73264 27267 -244307 7016 -73294 5381 -20026
21858 -20026 182184 475202 542271 332986 116265 -66692 -699067 -885525 -737477 -537178
21848 -537178 -20170 82256 -200917 98996 106455 -275440 -228342 -146954 66451 448850
21838 448850 653587 390173 45174 183428 67654 -243838 -173500 -241476 -31065 11233
21828 11233 -264023 -391875 -305827 -244187 124567 496402 547014 481079 127970 91792 -46479
21817 -46479 -194422 -234960 -95851 -251106 -334083 -453895 -318556 -272232 -31622 286716
21807 286716 217393 121652 460291 250633 -467050 -729627 -536555 -26443 205321 361247
21797 361247 508030 274713 -65659 -341906 -269507 85872 175043 236688 139648 246636
21787 246636 241930 214287 241632 -62680 -192857 -94953 64730 149607 -352509 -513015 -549251
21776 -549251 -613181 -258309 -143343 200702 252293 241003 -303740 -215274 476453 476149 372650
21765 372650 313456 30 265860 338891 328743 402971 319953 519766 485366 86374 -127782
21754 -127782 39142 186113 272654 137150 -147007 -177657 47703 338986 479953 524858
21744 524858 256906 -61876 -173333 -282684 -407618 -185289 -303843 -266418 -491348 -286010
21734 -286010 -265178 -162316 -10108 130907 -224230 -356100 -408416 -71557 435209 690686
21724 690686 617066 -21720 -33986 146409 -83527 -304656 -129644 242803 518618 353270
21714 353270 -103283 -244326 -196153 -362495 -205835 -262410 -323452 -549013 -578697 -237966
21704 -237966 -364280 -663979 -466590 -57789 -74303 -167452 76025 -115588 -374777 -434161
21694 -434161 -292905 -57035 -3144 -212346 -108646 82734 21562 140365 313340 -21205
21684 -21205 -196514 -67558 294062 639244 764214 747379 497584 165836 -494703 -348164
21674 -348164 -255472 -69409 -108647 -83565 111268 -380 -346437 -432027 -513393 -784777
21664 -784777 -983431 -976115 -722734 -314852 -47877 -309761 -626574 -255945 -223325 -91455
21654 -91455 44815 134066 158212 333435 502199 601879 367469 360689 232622 200913 -26487
21643 -26487 -152402 -500073 -395255 -468280 -411717 -105958 242182 462630 163226 -45976
21633 -45976 -13031 151927 201753 333001 712778 279163 -120097 -506301 -374863 29078
21623 29078 19756 -181201 -39341 99659 -101348 -275408 -44734 3945 29920 22495 92394
21612 92394 238669 88765 -315739 -49570 1092 -283256 -180850 -130813 -307361 -145598
21602 -145598 258388 162138 99534 546796 574463 247970 210745 105317 78036 108787 288874
21591 288874 -60973 -202028 -17255 367845 174287 -218398 -20903 -61797 3662 -61071
21581 -61071 -185880 -81602 -138345 -364036 -482874 -334572 126372 317426 75629 -548282
21571 -548282 -700052 -596904 -236672 46227 378225 492514 288452 -86862 -462915 -419649
21561 -419649 38279 -22948 -51163 342864 172356 -293868 -641569 -254706 -203311 -198872
21551 -198872 -211690 -486834 -373403 -18259 -144975 -243440 -380072 -398835 -616624 -666004
21541 -666004 -449551 -392521 -205554 -47266 19781 132951 531438 395156 112940 -162217
21531 -162217 -255455 -455183 -575203 18656 345428 389210 357599 30450 -1500 163450
21521 163450 60645 -366720 -270435 -190134 -282797 -492986 35441 492827 478053 592064
21511 592064 569656 523954 644720 573607 145268 -14802 24256 -300466 -11019 2845
21501 2845 -187493 -185244 -275824 -362328 -512405 -598709 -528509 -773812 -776000 -310309 -298026
21490 -298026 -428225 -716189 -744917 -520562 -203595 56428 -212234 -314897 -57898 -311920
21480 -311920 -368433 -246808 -134725 -29148 -131385 87786 -80498 -102816 -202144 -161281
21470 -161281 -10399 -20517 -192695 -144699 -67605 -114439 -154764 -296777 -477470 -487378 -550442
21459 -550442 -747108 -339360 -1930 209484 179479 207994 82580 256183 109695 -66698
21449 -66698 -469487 -376192 -266005 -186364 -620054 -549287 -439843 -218879 -11469 25218
21439 25218 150948 57646 48087 77420 89347 160236 220300 192815 202423 52558 -82493
21428 -82493 -428966 -780363 -813635 -590173 -502450 -284363 -348848 -242813 -57209 152808
21418 152808 91448 213574 90907 -38317 -2964 -257020 -787858 -751393 -386389 -73680
21408 -73680 -158916 -291150 -122591 -184531 -79195 117948 -76820 287532 931753 823179
21398 823179 725033 711130 744768 519412 116704 25140 -72908 -281480 -571885 -302604
21388 -302604 -30831 10113 -170547 -240002 -85490 -211973 -154595 -183571 -510984 -978105
21378 -978105 -957326 -872898 -612380 -324153 -276596 7435 36938 -216851 -507637 -410974
21368 -410974 -432306 -361592 -179792 217991 446359 622891 605699 647523 292100 103332
21358 103332 -3593 -507721 -652555 -473471 -613168 -604039 -433940 -332776 -496253 -545799
21348 -545799 -509723 -445447 -223466 86290 -30155 149811 334152 202166 90397 -330634
21338 -330634 -106328 77640 -52173 112139 52778 140184 368502 212093 255660 473196
21328 473196 381120 413050 198669 -57756 54113 423577 836873 908045 555380 161543
21318 161543 248168 299976 207404 115499 -6218 194207 117082 310119 507011 439327 568712
21307 568712 346433 412150 358771 386717 208355 149502 297794 250297 -106555 -290989
21297 -290989 30119 -157169 -251179 244555 817361 751790 546517 296000 174199 98384
21287 98384 -120775 -160172 -279505 -434968 -510329 -450578 -443979 -559467 -209518 98398 168264
21276 168264 100675 -29065 -64515 -44935 -365315 -556233 -167679 263714 -6455 -205806
21266 -205806 -149843 -45792 -59615 6186 -41789 149462 438361 707356 634358 203566
21256 203566 276298 670888 603960 231327 -156677 -365819 -253025 -118113 64377 171654
21246 171654 181305 84953 -104154 -176871 26656 58228 70189 123331 347308 76578 111378
21235 111378 198915 156448 -110245 -161996 -225317 -528146 -212066 112145 408724 437825
21225 437825 12691 -157625 -13604 -529549 -574876 -396739 -383143 -81752 -88203 123895
21215 123895 298273 429234 158034 106440 248828 349150 169746 -160215 164810 346808
21205 346808 374060 91983 187594 215988 438343 312756 13858 49885 29471 165226
21195 165226 -10654 -107275 -58488 -455160 -705865 -362012 -328762 -83094 -145217 103162
21185 103162 180199 -60984 -76906 -470021 -542111 -481957 -250597 67382 -8256 -315958
21175 -315958 -193881 41543 18863 -141656 -300571 -301827 -507417 -387008 90161 285203
21165 285203 -168058 -465288 -205816 47583 32095 61177 314534 483821 614172 310448
21155 310448 103303 25836 56513 221871 255737 -60095 -365349 -455940 -23750 304372
21145 304372 -75665 -346124 -415954 -830246 -924865 -776253 -458631 85014 272150 -218907
21135 -218907 -482591 -507232 -262567 -577978 -724583 -358502 -140440 76933 343142 394926
21125 394926 154 176165 392091 208792 259587 38161 31518 184308 212515 -220530
21115 -220530 -564215 -493381 -500568 -402309 -619365 -402544 -60437 442598 688596 208398
21105 208398 72154 235604 -166836 -251269 -174218 -57683 40253 191324 77035 -148357
21095 -148357 -493082 -809850 -691218 -332801 -278218 -69182 432595 411780 -79029 -201651
21085 -201651 -315720 -151280 -424987 -372378 -82056 137575 573162 279258 23996 -18641
21075 -18641 -401839 -400113 -71613 -28682 -27052 -107864 -232744 -560560 -570662 -184432 -57868
21064 -57868 57611 262904 169713 352601 260842 215643 52570 -11557 127621 80150 158635
21053 158635 200528 337447 130597 -252635 51914 310536 16493 123528 -198345 -166203
21043 -166203 -38172 97905 -132130 -121793 110937 228482 -186731 -338968 -178170 -21249
21033 -21249 -233357 153543 194946 -263933 -373049 -24193 241350 293792 244177 199237
21023 199237 32492 153328 -84215 -333404 -486935 -624702 -204886 -85133 -295587 -518891
21013 -518891 -596126 -274817 219001 602881 619280 -99366 -156581 -238120 -99064 27143
21003 27143 -283960 -375287 -316529 38628 33801 -42567 -174988 -106851 -141204 -12493 56998
20992 56998 -49302 -136639 45170 109296 346411 -71911 -191065 92625 561 -83662
20982 -83662 -86360 184507 95536 98542 119885 32054 -128256 -258543 -131049 -62635 -247344
20971 -247344 33680 -164616 -417867 -569437 -468817 -178489 16683 213328 376791 620444
20961 620444 802820 549587 157220 -87512 -30241 -249924 -448273 -335869 -233095 -30791
20951 -30791 -88765 -43916 -366533 -205938 -165439 202434 181371 807 -297881 -393337 -165863
20940 -165863 -272770 -178364 -5289 197046 281340 45106 182959 314103 134083 -428169
20930 -428169 -232128 41503 241445 -28594 -243892 1598 -7732 -33930 56085 -120666
20920 -120666 240757 360621 -203935 -363738 -296787 -441959 -99905 1551 5690 14256
20910 14256 200500 334426 189265 20643 -360835 -490933 -24304 98592 102170 323899
20900 323899 343558 292734 175321 220104 351513 249573 -81727 -382462 -494403 -348182
20890 -348182 -712693 -818209 -357092 75607 -45207 -67910 41740 -294135 -381635 -320888
20880 -320888 -215139 -214583 -438104 -540571 -408120 -265147 -164448 -31169 -21660 249486
20870 249486 493065 710611 496174 269994 152230 406972 351094 103367 -30088 -106836
20860 -106836 -325909 -91996 391057 502098 129845 -100816 -296013 -322245 -181730 -53873
20850 -53873 57286 15108 67808 138490 109329 185541 510905 546831 235931 60525 25118
20839 25118 222312 -89921 -381790 -744363 -857915 -508991 -204969 -227181 -306229 -227746
20829 -227746 -133314 -79898 -157258 -289360 -313406 -3926 122748 143377 -2901 -142978
20819 -142978 -19358 64171 281689 447262 179742 -88291 -61978 -247281 -132481 -384689
20809 -384689 -352216 -346291 -558095 -733946 -427070 93489 231272 228118 534268 683649
20799 683649 672846 186317 -81596 125790 -363436 -751899 -491433 -13429 219946 68847
20789 68847 -232437 -50190 58839 143820 158856 128334 -41949 -195119 -193722 -73060 142734
20778 142734 387632 171495 -306372 -675333 -673509 -682105 -350313 -11968 144803 -67956
20768 -67956 -215924 -787062 -608510 -388002 -294712 -460419 -409972 -417986 -213263 514388
20758 514388 436904 233928 48620 -65284 -60681 -31459 461897 443041 276914 336915 343107
20747 343107 69292 -131357 -332216 -229610 300977 746527 496899 232002 14692 -463694
20737 -463694 -594613 -419338 -243413 -62738 132768 279638 595834 523665 294592 269267
20727 269267 160408 -261804 -491936 -372915 -88562 -76176 70271 216129 230543 118867
20717 118867 -84393 -236060 -48417 300644 394092 151888 -63237 -191051 -443645 -504250
20707 -504250 -192564 18935 162755 -56487 -282637 -150797 297259 191064 394099 322955
20697 322955 295612 181123 52633 -198175 -323295 -154791 -331789 -534400 -734460 -617293
20687 -617293 -619587 -483560 -694041 -640396 -212046 -25065 -83860 147021 -202592 -203282 -149157
20676 -149157 -402120 -1074011 -324263 219085 353905 108613 -269610 -218827 -136016 60571
20666 60571 23075 -61285 -498359 -617006 -376572 -317055 -335754 -153714 -448122 -668562
20656 -668562 -808429 -504035 159667 137208 40973 227855 329073 445597 250643 464255
20646 464255 779991 1000333 807801 559814 645134 547942 361 -368698 -464824 -163998
20636 -163998 20518 339297 216630 -63770 -90728 36953 291279 369964 361347 166679
20626 166679 -46986 -115818 -220483 -288235 148826 348552 34497 -12281 -102819 5407
20616 5407 -35904 12341 188958 490006 287459 230600 36934 149372 271313 186507 324803
20605 324803 239409 142696 162898 218505 200136 32820 188374 55951 512 -222936 -346509
20594 -346509 -233054 -153696 -484072 -334175 164864 141230 83760 368134 264304 -446555
20584 -446555 -748069 -684099 -498699 -562427 -801439 -755775 -496722 -575420 -126151 195783
20574 195783 237366 369378 -178591 -553535 -88890 177505 -414647 -524644 -304927 -177325
20564 -177325 -55500 264555 506389 443351 533781 575026 34411 -148041 -267746 -591216
20554 -591216 -582041 -507530 -223890 -304 -347387 -521155 -564828 -567125 -452653 -67546 -160272
20543 -160272 -387932 -500845 -214190 86685 -285497 -199077 85282 56699 -292992 -229936
20533 -229936 199472 196261 30530 209254 232364 249324 -24174 -209195 -139853 82989
20523 82989 96092 -213669 -238799 -102434 -108376 -69934 358058 600693 597954 391938 -73756
20512 -73756 -514582 -249310 -393937 -125832 274700 309602 633046 592808 177182 -210220
20502 -210220 -89820 -306150 -495029 -565024 -569753 -412082 -280904 -502450 -823347 -699790
20492 -699790 -820053 -875937 -636091 -268239 -332175 -415319 -384968 -458105 -243868 -49182
20482 -49182 -90033 12875 -76752 -27381 506 -195402 -166965 -165677 -395075 -221708 -407324
20471 -407324 -521886 -225339 -113986 -34209 -372610 -592194 -631896 -534072 -213402 -73399
20461 -73399 37657 159266 150608 -35296 -279560 -359060 -245479 -170714 104402 484771
20451 484771 286402 33910 -170668 -76427 90354 253979 422304 647810 624182 320186
20441 320186 284187 31714 255118 450910 590747 403262 55407 -9295 463037 347804
20431 347804 125362 165676 133637 -157690 -341843 -194103 -169351 -131988 -155545 -25367
20421 -25367 296567 476027 563717 318161 16357 -2253 106718 596756 720232 489623
20411 489623 404084 232646 238516 176756 -32788 -590722 -652829 -277455 -56535 -185152
20401 -185152 -399888 -360594 -300220 49629 190795 223551 9335 29079 177437 84198
20391 84198 -156886 -357212 -283192 -258880 -75928 -81184 -84231 191053 -19088 -22616 -73500
20380 -73500 104718 -154257 -415747 -477889 -491288 -205058 -129391 126888 -162000 -111527
20370 -111527 -439349 -224130 -245426 -203663 -23895 -98765 -68265 61578 235204 -34246
20360 -34246 245120 -4919 -584660 -702903 -366224 -262628 60145 223510 -102638 -405444
20350 -405444 -401173 -652914 -509322 -365519 -312259 -516609 -171778 149652 87985 -72198
20340 -72198 -285390 -671915 -994703 -623587 2966 22295 -35854 10335 -203322 -354698
20330 -354698 -200289 321510 425905 -1873 -217986 -464736 -340837 -125654 110644 93701
20320 93701 -65533 -120232 -84434 184301 494338 66804 -438430 -401816 -80950 307180
20310 307180 185361 99570 -144332 -157485 202119 -8007 -421239 -335941 -87702 249898
20300 249898 515508 684368 547118 252894 49598 40802 -198968 -341329 -307116 -15882
20290 -15882 43239 -48017 -130071 16280 -50428 -232452 -299013 -172666 -19870 584753 479337
20279 479337 183488 107367 -29740 -242114 114640 -128452 -564963 -426326 -397428 -649455
20269 -649455 -654385 -753964 -476039 -487294 -463845 -342468 -250709 -251545 -230032 -319063 -319854 -518991
20257 -518991 -535420 -339107 66024 469871 248673 78639 -94142 206048 370889 263489
20247 263489 275405 296464 362769 379265 637539 772689 984892 621478 199831 200852 197516
20236 197516 54414 40584 168643 196340 -115561 -257297 -379056 -422554 -333442 -198736
20226 -198736 132453 281448 63654 198650 592551 491361 526513 315617 11999 -169615
20216 -169615 59719 31761 54033 123763 296475 630910 786662 201841 -230409 -315631
20206 -315631 -274900 -175436 180299 -132000 91437 94112 -2921 155450 90780 64548 18959
20195 18959 122195 182741 -162349 -111858 -192048 -486650 -811572 -664082 -330125 258582
20185 258582 237400 108867 -1547 -143820 -39376 11656 -83048 -223368 -124087 -444488
20175 -444488 -396175 -115481 -152288 -343606 -481053 -596611 -423941 -41389 -136316 -150428
20165 -150428 -57794 6996 -91079 222742 422880 169432 60246 3448 -130791 -269884
20155 -269884 -198082 -123930 335254 517368 443682 180812 100135 -300071 -578085 -334723
20145 -334723 -260934 -39542 2222 -448589 -454121 -47760 311769 552688 578289 662940 717418
20134 717418 496169 242916 347041 319765 950397 664151 281810 267587 348080 118757
20124 118757 133857 166540 91138 141080 541057 446508 334845 539563 589149 343764 187425
20113 187425 157525 -31195 9255 -49117 -134917 21821 -183683 -766399 -896083 -529408
20103 -529408 -531122 -675054 -684130 -546176 -218149 121424 98479 59333 -9154 236143 148887
20092 148887 700 226088 227532 -86976 -167445 -103252 86175 311031 337633 149920
20082 149920 212165 324067 319008 506639 359878 462403 475877 -46277 -192495 -81485
20072 -81485 -69735 -332259 -258345 51929 364156 347572 135676 142438 139310 97065 173255
20061 173255 400331 466283 458154 339691 104176 -252352 -221319 58577 149969 114205 -28985
20050 -28985 -558072 -382212 -389718 -409818 -460936 -460235 -602726 -314258 -298546 -103912 29470
20039 29470 154973 442045 602898 310469 26033 -85785 -36732 134797 -166607 -16112
20029 -16112 399715 349487 121608 -71250 -190550 -353973 -421877 -290910 -285500 -89568
20019 -89568 -40022 -212467 -217326 -462205 -390459 -326794 -112249 139880 221419 115074 105176
20008 105176 -200304 -407027 -303523 -168926 -324045 -420241 -176247 -9014 266736 406535
19998 406535 255824 -190654 -361954 -372311 -373144 -470313 -152226 71761 55253 -590791 -741859
19987 -741859 -317434 118920 -357162 -791868 -553712 -426102 -146396 149982 108890 76832
19977 76832 -169771 -77380 241046 -126403 -303751 -212753 -51045 88535 240751 74116
19967 74116 193074 191354 167127 170039 -80535 53695 -228243 -766399 -735414 -272810 -154233
19956 -154233 -258312 -405705 -260160 -216560 -244951 -515338 -253572 226024 53147 -128687
19946 -128687 -132781 -20260 -322700 -117297 126253 131420 109763 2574 -13948 345062 194195
19935 194195 -130628 -103116 -319518 -629729 -750186 -882713 -541018 -136603 180895 430344
19925 430344 356578 354435 342883 364031 130531 -408230 -483602 -234267 -361874 -280832 -82142
19914 -82142 -326594 -220550 -49869 -36389 -81215 277428 365427 81636 106435 171915 353553
19903 353553 211143 206823 266280 -93970 -192442 -466288 -649601 -742727 -662961 -654695 -323335
19892 -323335 -247847 -188717 174645 299743 -69317 -172902 -197218 -430917 -494446 -681967
19882 -681967 -623042 -752180 -320177 39871 61617 -212600 -554738 -624828 -90274 347104
19872 347104 99301 -6398 -652912 -483925 -338056 74814 544699 745641 662019 576345
19862 576345 634904 909818 855355 272262 -148486 -208834 -430648 -416179 -295301 -417877
19852 -417877 -193126 -141260 -292465 22796 38560 -41349 -79079 154248 27758 -93265
19842 -93265 -381748 -565385 -472266 -584891 -205250 406506 322879 212599 275537 137525
19832 137525 121849 6482 218472 718284 458780 378061 259899 203109 344425 526583
19822 526583 532965 537535 190723 394662 722213 659335 -93548 -644942 -503736 -247052
19812 -247052 -190711 -101035 -29457 190962 142964 88661 111088 166168 281679 128106 263471
19801 263471 -3868 -348616 -287686 -284778 -132890 172754 428136 476794 431130 -160504
19791 -160504 -244227 -109313 -273278 -38443 229679 169409 67201 -356288 -119673 598721
19781 598721 713909 243455 249796 445181 484699 449588 526826 408247 74805 128625 73003
19770 73003 -83035 -127256 -246170 -183785 -7317 -44550 5055 878 -87975 -235239 -136088
19759 -136088 -28970 -49030 -359277 -635497 -743793 -742573 -466307 -256890 -458165 -543012
19749 -543012 -294108 -349701 -466110 -303442 -224648 -546195 -638550 -185674 -256362 -225247
19739 -225247 341533 333440 256583 66303 -141559 43538 76038 251059 303012 241217 209648
19728 209648 286972 381525 136911 -8051 -8923 -415377 -336069 -113454 -148427 -343151 -593290
19717 -593290 -793982 -389890 -249069 12666 -90069 -278918 -577998 -656990 -395641 2272
19707 2272 -96346 -179181 117650 263250 -31809 -39660 -220038 -223612 25487 25019 233668
19696 233668 230919 187483 197761 4764 -338221 -475211 -337333 -416576 -780031 -611448
19686 -611448 -209712 -90512 73349 -44143 -160623 -65907 250428 -172220 78289 418486
19676 418486 345935 38866 -420521 -476957 113995 211105 284127 174643 -64294 -247229
19666 -247229 -250062 39155 -32851 -214253 -222187 19627 -63423 -138965 -174305 -204480 72562
19655 72562 -57173 -208748 165158 519253 887572 1000414 600677 158345 -111179 338674
19645 338674 163457 94464 426007 27592 -207909 -465585 -773760 -718372 -530045 -249764
19635 -249764 -238467 -348778 -151145 -119734 -452650 -643436 -693876 -768356 -989305 -849925
19625 -849925 -663696 -629480 -309622 -213585 -189663 315341 647773 98999 30867 -176719
19615 -176719 -240879 7377 108094 -132593 -543224 -770428 -538910 -316717 -85943 274930
19605 274930 149158 53801 -144204 -369551 -384523 -239533 -110004 -194461 10102 108044
19595 108044 276526 164211 -121640 -548408 -216258 -25915 -43339 339182 193480 -95785
19585 -95785 322884 114495 -158991 -486962 -441633 -82631 -256277 -710861 -487382 -373569
19575 -373569 -340607 -71179 142948 254941 255783 -33167 95035 245279 -20638 -151981
19565 -151981 -462492 -247286 89145 422113 430022 449758 142541 96556 276080 101708
19555 101708 -62781 -102692 47938 129292 277550 394783 212392 25518 -167192 48496
19545 48496 230597 115981 -30324 -276377 -318606 -64007 -129221 -125796 -75747 109190 -74085
19534 -74085 94007 53006 161044 265254 580178 463520 71833 -346475 -567134 -423524
19524 -423524 156691 512462 625500 790776 651138 609503 487376 294887 426384 300559
19514 300559 52360 28173 261443 341324 -18854 -99179 -57961 -120068 -447795 -422368 -118738
19503 -118738 300057 251347 106002 -175600 -251311 -81675 40680 -330219 -421013 -94276
19493 -94276 -174077 -493751 -590059 -375346 -192368 -358833 -604156 -753027 -585544 -239453
19483 -239453 -347928 -263393 -196797 -217643 5419 126720 -197839 -234085 -67756 -34513
19473 -34513 170864 149067 17313 -8124 260675 551654 535208 616429 553752 119668 86579
19462 86579 152254 284297 -16123 -129104 263572 270402 596722 659738 387613 -46501
19452 -46501 -339749 -446882 -289601 -171002 -210476 -359683 -278278 -183449 70076 335802
19442 335802 445424 534714 612949 483568 364147 176524 -14907 22373 106516 13278
19432 13278 431962 810004 781061 694547 580290 283142 64350 200694 21217 -80486
19422 -80486 -257998 -325881 -187674 -339152 -588854 -641942 -546159 -130625 201713 349524
19412 349524 432965 314738 52805 107499 260139 615927 239508 203492 99922 69528
19402 69528 266012 322329 206624 98604 332153 369483 447401 -42692 -115632 -44880 15592
19391 15592 417166 599588 492601 441187 63122 2769 24856 104003 -138748 -197120 -249667
19380 -249667 -225712 -100551 241266 512036 429820 299261 183626 17274 -306051 -62025
19370 -62025 263147 -75190 82874 222803 265172 -92677 -331370 -478650 -674495 -496331
19360 -496331 -417183 -38165 -95255 -356142 -97511 -91040 -423613 -839711 -777842 -875648 -549318
19349 -549318 -225239 -216366 -185081 21871 174837 136000 -238789 -107723 209436 27103
19339 27103 -8218 -237368 -567067 -895566 -669214 -125373 -18879 -526205 -391621 -413041
19329 -413041 -400922 -228028 -398703 -401767 -28957 166011 219902 134801 67789 268313 483373
19318 483373 91171 -236224 -206172 -39612 -23906 -555634 -815129 -700190 -492261 12615
19308 12615 -247059 -275464 -269195 -341301 -51485 -43171 -115637 -39185 210028 -7118 81830
19297 81830 349779 444468 293958 144222 31240 -61424 -2457 13700 58080 38402 -2547
19286 -2547 125001 549184 672401 622023 395135 188110 291860 173576 413860 517999
19276 517999 502321 279393 379653 338251 63607 -116592 319211 409214 269672 167280
19266 167280 191743 -70186 -37231 -316409 -34640 170031 113975 -134415 -287638 -326893
19256 -326893 -143785 139026 775116 770083 375098 265078 471099 804898 719555 549080
19246 549080 550775 707753 803387 1106455 1110664 1024469 1004186 949129 717542 165799 -142598
19235 -142598 -22311 -78899 -258437 64005 278414 304855 251799 387916 395234 599240
19225 599240 383084 246819 278807 319228 -21882 108229 283905 417465 461064 394562
19215 394562 405984 329561 47922 -249397 -218235 76992 463228 243523 160963 181319
19205 181319 56779 168898 332736 322102 347120 318664 57739 -157731 7454 124344
19195 124344 238457 377551 288078 593469 588510 494103 467035 301440 182917 241247 202295
19184 202295 128145 228125 421271 974013 1280968 1827188 2420553 2398332 1998539 1840375
19174 1840375 1465568 1287577 1113611 940944 604007 504562 556151 669562 672701 729436
19164 729436 825594 746796 688837 649835 329352 509576 782955 656565 564275 670490
19154 670490 381222 186014 363437 391529 33038 -215698 -205712 260777 684801 806841
19144 806841 1009711 902210 1083331 1577543 2431790 2754040 2707038 2288775 1565539 1423556
19134 1423556 1278649 931618 858260 709188 788270 672274 727654 674396 719966 546404
19124 546404 433551 649254 534122 548773 525587 490539 318497 416966 257823 76886
19114 76886 130361 160403 325154 243217 385017 275313 26076 -475790 -373777 105764
19104 105764 148694 -360646 -361982 89178 400423 615983 667945 659780 475009 484962 298315
19093 298315 257637 496710 704546 485270 137857 119895 132478 125334 77170 -85289 220657
19082 220657 621605 630752 470452 469099 -316645 -567728 -339409 -117317 28763 -22129
19072 -22129 247633 314315 222567 291102 87669 -264355 -33094 344814 231936 -27456
19062 -27456 181176 267463 185320 147910 298832 422999 257095 102932 -27060 -241881
19052 -241881 -102044 -107398 -481308 -495352 -319818 -227806 -262378 -42499 465407 676562
19042 676562 536820 266210 -104382 -218984 127170 106333 120831 45922 -189228 -179191
19032 -179191 -153998 -41484 25629 82916 143533 249412 254293 -163641 -588639 -442525 -542962
19021 -542962 -371901 -183623 -237480 -167288 -353963 -263055 -71720 82162 480126 496358
19011 496358 161311 63172 127440 120850 27256 -184590 -66272 316932 266293 165917 -238505
19000 -238505 -453631 -458570 -479562 -542786 73243 291175 116985 83055 96623 154891 108871
18989 108871 -54385 -164735 -322631 167378 750721 258065 126435 296965 615781 774565
18979 774565 838050 254520 -91099 -131797 -392637 -522832 -355145 -62830 -249019 -418670
18969 -418670 -155439 -110662 345135 516017 194508 7475 -22160 21298 -388796 -670671
18959 -670671 -550835 -300906 140762 316131 369126 -270414 -774919 -538069 -183954 7387
18949 7387 -181266 -253959 -237789 -351510 -432969 -590962 -532545 -209581 -82304 -118083 -100270
18938 -100270 -261776 -639264 -494754 254548 607600 438045 494243 533301 150695 -14963
18928 -14963 -91099 303838 487815 528749 789818 663902 445178 340619 352681 589148
18918 589148 824143 668144 86558 -42816 -140441 -344467 -43731 642112 657778 292972
18908 292972 237962 501017 500519 70928 -209995 -220533 -344205 -152898 198441 122038 -221077
18897 -221077 -356961 -107770 -89119 -289738 52059 233479 694554 363255 145157 254273
18887 254273 351839 -81499 -91547 107666 251422 288377 345162 351206 336349 145976 -95334
18876 -95334 -288229 -201411 -139843 -48924 13934 -26797 69147 412771 520681 701858 613058
18865 613058 746501 633456 358333 335843 510821 776156 840676 610715 375977 635502
18855 635502 939602 1032076 569937 257160 507932 334926 156519 127031 442901 267160
18845 267160 163356 184386 225487 63910 461188 573931 960783 688402 645100 743584
18835 743584 728126 523902 417096 479030 794778 742228 555099 701428 673018 787564
18825 787564 911329 709591 829533 949662 1016336 742561 241900 123880 -140197 -565834
18815 -565834 -521429 -317204 -356207 -503525 -482363 -66025 198426 363982 396402 283489
18805 283489 203027 163271 313871 245986 611148 631207 712015 531631 51510 -263805
18795 -263805 -288837 97366 485306 467825 397781 663430 353140 142039 -112747 -192844
18785 -192844 -397298 -315766 75629 156854 146703 269808 319047 318661 658715 1284292 1069647
18774 1069647 721552 648621 1212892 1922490 2478030 3111481 3260080 3106047 2692342 2180403
18764 2180403 1656950 1250767 822566 308233 -191816 -107293 -77557 -168756 -63753 86643
18754 86643 179973 274445 41225 -397530 -530464 -249079 41172 327745 406052 694347
18744 694347 544033 369701 438787 282969 584776 663524 641038 881399 634386 263811
18734 263811 324621 539030 624178 546665 720534 771191 950315 898946 682664 527755
18724 527755 267136 616145 1017346 838928 457394 432865 482195 458179 659328 783973
18714 783973 651948 464866 436037 436407 476573 716368 1114310 1073338 919594 890197 800525
18703 800525 658852 895379 1153578 1356845 1268869 1101887 853979 940465 933915 545576
18693 545576 462706 501032 572185 789382 822344 753188 646418 690535 476983 328404 315339
18682 315339 440257 677310 1019628 1129553 1304500 966304 645491 760388 887380 1218010
18672 1218010 1222503 1342078 1583911 1314945 1410186 1569657 1332086 1524065 1888406 1701330
18662 1701330 1581032 1682182 1848672 1968838 1984813 1731710 1546266 1503618 1713983 2333982
18652 2333982 2771539 2909167 3207318 3324302 3034376 3031601 3166686 4128372 4976349 4973183
18642 4973183 5105391 5425731 5030120 5044253 5128220 5345814 5631004 5495771 5952038 6357363
18632 6357363 6931551 7856339 8659624 9442838 10363778 11278604 12418458 13601101 15157367
18623 15157367 17154340 20061499 24079519 29485598 37812086 50679148 71313317 107052975
18615 107052975 167777377 257379655 355688400 417005256 423846113 377888453 283601857
18608 283601857 187777046 125634865 90676743 69512160 55135703 44964727 38453566
18601 38453566 34020430 30665465 28262944 26476125 25946874 25514766 24567318 23969831 23268461
18592 23268461 22621519 22870714 23287873 23075215 22416294 22268906 22985754 24446387 26931585
18583 26931585 30127150 34677780 40923677 49991004 63784903 85717620 123813567 189507562
18575 189507562 288254872 397868970 467663294 476979232 427402794 322571813 213187498
18568 213187498 141242951 99355390 74249715 58612931 47794509 39837515 34512030
18561 34512030 30879341 28097605 26276909 24917083 23830342 22546020 21019866 19291784
18553 19291784 17727037 15876481 14105870 13187009 12226651 11704193 11697883 11615438 12136629
18544 12136629 12907902 13761818 14033013 13315051 11749265 10226018 9042927 7893914 6892633
18535 6892633 6062834 5512672 5508647 5182453 5048512 5122989 4809006 4684635 4589589 4351270
18525 4351270 4087130 4040998 4189004 4014734 3658583 3490737 3460289 3143113 2966124 2859518
18515 2859518 2738869 2664923 2621805 2645656 2693868 2606831 2958810 3160331 3117311 3080013 3245097
18504 3245097 3359095 3391652 3514397 3450456 3239624 2768635 2321379 2092761 2210680 2134146
18494 2134146 2019329 1937494 2157741 2439854 2213682 2201662 2128803 1964318 2185283 1835120
18484 1835120 1295528 1202205 1112380 1263076 1498878 1415441 1126555 1275616 970058 457943
18474 457943 464979 561165 726562 825046 493217 477797 889491 1011177 972689 1348358 1528252
18463 1528252 1138620 988767 1123655 1020723 983126 939035 724384 860263 887601 1101733
18453 1101733 1058066 1405478 1434733 1081330 604154 879073 849415 624987 557975 911893
18443 911893 1047913 1091082 1071264 899214 444342 229894 356448 331668 294513 354637
18433 354637 519274 709381 720811 513478 461090 640101 654019 306615 288620 528220
18423 528220 776253 707299 359857 189102 476380 505192 660391 585886 654445 812854
18413 812854 1057954 760789 263793 146460 435575 557253 511817 361455 218144 11004
18403 11004 -432021 -470074 28165 98052 21000 262194 124667 -82180 -232161 -54212
18393 -54212 246482 212716 410512 509438 213205 240075 339246 1008870 1039175 1057638 998388
18382 998388 1019706 710774 137763 291981 543693 907951 927969 316411 307686 704530
18372 704530 519659 293589 619861 777033 620445 498457 634738 523325 505909 354185
18362 354185 587692 657974 862306 1143951 961469 679873 595077 397920 514621 415629
18352 415629 347615 -107246 106847 283120 242729 285245 74743 -106930 -161330 -191874
18342 -191874 241525 380183 189932 320512 652689 631186 719622 264518 -134838 -205313
18332 -205313 -217357 130601 221468 336216 571793 671107 431815 541362 909202 1127092
18322 1127092 974822 483662 215010 153275 429498 487494 198268 365553 595769 331637
18312 331637 196024 357920 108869 -188464 76133 222191 45760 73425 294447 235033
18302 235033 386755 40086 115295 -20883 -127675 -474229 -465150 -340790 -330357 -185270
18292 -185270 12644 -215997 -592850 -266063 -289456 -360872 -199996 61175 288152 382083
18282 382083 201216 -73355 -193206 -258866 -95268 -60669 -70939 249510 473302 326377
18272 326377 234196 208074 293762 372856 406760 519839 500637 376122 315970 438849 600168
18261 600168 663409 686698 413952 416380 591387 543556 301263 395130 561518 731153 850753
18250 850753 798878 696142 657741 775142 948526 731037 263861 -52188 191761 749651
18240 749651 1240821 1075635 1007398 1309505 1019638 483321 696489 1009930 657636 450732
18230 450732 251400 456890 683277 497126 476972 236153 397253 738999 636876 341306
18220 341306 332678 455881 466515 775002 798834 887544 921862 1368779 1184606 996605 899611
18209 899611 660044 695219 548614 690107 589098 605846 879978 1039421 960513 670602
18199 670602 559101 889716 955513 1202787 1192709 1261739 1171038 1017150 986659 984200 1129794
18188 1129794 1045311 342028 106554 579103 649771 736026 1166217 1395032 1725387 1528270
18178 1528270 1306763 1169346 1073767 1042735 722536 786041 672549 743674 746297 649596 743210
18167 743210 882210 884648 913187 934474 1081393 1374868 1430568 1537153 1906748 2176422
18157 2176422 2147689 1783700 1730996 1963640 2310000 2428496 2389797 2853440 2947420 2802843
18147 2802843 2772926 2821282 2709242 2642587 2524676 2656509 2940467 3460681 3614181 3408326
18137 3408326 3365633 3506380 3823251 4352486 4921795 5373806 5828526 6069742 6236364 7002229
18127 7002229 7936550 8875868 9786002 11455619 13401849 15415964 18021345 21528295 25973284
18118 25973284 32365697 41596222 55676914 79437717 121615787 193547150 297815185
18111 297815185 405621305 466066144 465269212 404729017 293376245 189514786 124269872
18104 124269872 87009694 64731290 50134922 40541694 33877715 29194482 26210714
18097 26210714 23867925 22055574 20222451 18749278 17527949 16274002 14443155 13125473
18089 13125473 12386778 11393230 10194694 9806675 9470310 8590699 7634250 7362926 7096364
18080 7096364 6745952 6158391 6064697 6087689 5776117 5665911 5337896 4767101 4336603 3977829
18070 3977829 3848676 3637141 4285272 4598915 4308270 3974475 3617394 3699334 3493361 3052009
18060 3052009 3059815 2967394 3170038 3134459 2894192 2539838 2342017 2369840 2752704 2620062
18050 2620062 2338945 2121358 2047430 2104761 2373647 2851853 3151117 3453518 3749336 3526744
18040 3526744 3485771 3225649 2688790 2451646 2105204 2121294 2041216 2078347 1791681 1635290
18030 1635290 1949160 2289272 2049595 1827935 1767154 1701849 1752278 1635068 1847830 2048894
18020 2048894 2011547 2018761 1788699 1400197 1538665 1604409 1477296 1578136 1922502 1975745
18010 1975745 2180244 2371815 2143733 2442937 3202414 3832556 4611609 4664596 4294473 3932443
18000 3932443 3564811 3190021 2540656 2308434 2127804 1721628 1612617 1740591 1950318
17991 1950318 2316069 2759132 3052056 2843124 2372388 2337052 2665853 2696229 2689454 3162187
17981 3162187 2787488 2471159 2595373 2962718 3215815 3462180 3834309 4268523 4935491
17972 4935491 5954797 6702772 6620568 6227064 5609328 5487329 5241780 5390967 5552340
17963 5552340 6274816 7028415 7920681 8771886 9470034 10070947 10238650 10303424 10517436 11384132
17953 11384132 13266200 14823966 16781126 19417472 22530498 26243816 31048704 37583364
17945 37583364 47388736 62541596 88171513 132850405 207302521 310848750 413109144
17938 413109144 467305817 462059291 398278504 288811839 190795665 129577532 93733297
17931 93733297 71383961 56534880 46932953 40314396 35659073 32306787 30366354 29928028
17923 29928028 29554385 28698619 27963466 27178253 25866088 24961112 24185125 23351857 22850518
17914 22850518 22731332 23249537 24346999 25621819 27645345 30931441 35263096 41131862
17906 41131862 49827084 63303533 85297052 123022088 186821215 277114083 368459518
17899 368459518 418277686 415027215 360249579 262692130 172942037 115870574 82774880
17892 82774880 62822643 49837080 40537270 34296578 30010612 27184649 24858553 23080604
17884 23080604 22154571 21257872 20012292 18651106 17295110 16182165 15451732 14401221
17876 14401221 13626541 12841371 11737625 10848495 9827600 9059112 8629466 8414688 8348124
17867 8348124 8477762 8561210 8506246 7634870 6507280 5798264 5762968 5968122 6141609 5635607
17857 5635607 5077632 4523435 3936014 4129415 4157427 4176022 4007264 3541060 3643361 3705096
17847 3705096 3495713 3066768 3158271 3153797 3156541 3077240 2923629 2767313 2411051 2193106
17837 2193106 2154444 1801446 1735182 1801015 1692033 1889652 1813918 1275100 1206242 1211536 1472091
17826 1472091 1714414 1789193 1698901 1552115 1693836 1523048 1633773 1509251 1443214 1659585
17816 1659585 1488138 1288199 1350629 1579704 1530888 1405243 1446149 1485217 1758013 1398520
17806 1398520 1197705 1148666 686262 432049 138031 89266 218446 172782 168886 582566
17796 582566 710186 715066 936556 461304 4354 1519 399366 883716 1394084 1457608
17786 1457608 1199756 391446 -87461 -24517 -104368 -3426 275566 371919 391306 517616
17776 517616 568827 748711 971535 970557 799925 929131 724032 165228 58055 188767
17766 188767 493951 184753 -61207 -80620 102097 299644 230229 328840 418796 548947
17756 548947 577551 183098 35208 281452 500946 623898 702645 690703 396961 378185
17746 378185 291760 347675 540406 423858 371703 170695 -8354 133854 199321 -43163
17736 -43163 101623 -73216 -155317 -8402 167764 87617 1559 597757 472536 167878
17726 167878 440064 750290 674475 403003 373552 407424 169800 103308 187651 27118
17716 27118 101560 336516 117380 131580 396726 328097 -3130 -83577 -103784 -378797 -179986
17705 -179986 -203980 -141125 -218276 -268559 -305274 -186075 -49950 83666 147317 -113259 -317513
17694 -317513 -15886 267300 137740 222709 -120856 -477462 -283177 -438297 -553282 -460772
17684 -460772 50169 185419 -61036 -368157 -587544 -192186 116791 248692 114015 40903
17674 40903 115687 256491 235209 5987 -143925 4718 267126 36928 -96709 125313
17664 125313 380576 452470 -72701 -520462 -23680 152828 247749 39435 74684 92968
17654 92968 352294 369482 203093 -5906 268847 338097 520050 851703 635144 384793
17644 384793 131524 391063 532609 753619 698542 288391 57953 -177793 -11365 271715
17634 271715 535170 219910 186531 241029 230160 104033 -2216 -18340 368584 142922
17624 142922 126189 92353 51059 186281 372591 548454 469288 181844 310770 201443
17614 201443 443770 331570 58279 84041 270943 114429 -63644 -268262 -352899 -149818
17604 -149818 236774 390535 238158 243519 370936 213134 320858 55264 -253421 -208968
17594 -208968 -297308 -104664 122227 478147 667107 900788 675748 425835 296439 -113194
17584 -113194 -431736 -484449 -401052 -134793 -489538 -503784 -389473 -447101 -523325 -660516
17574 -660516 -514153 -534227 -450815 -173327 111892 207143 35480 17884 89617 109806 291765
17563 291765 389974 290930 61564 140944 112733 33925 -217746 -208619 126031 49372 -76377
17552 -76377 -278699 -202739 -56575 -193625 -139056 -119021 74145 -71706 -196371 -42385
17542 -42385 305130 221542 128577 124762 154374 73808 572263 596676 322573 194167 34541
17531 34541 228521 83493 18386 2310 -31848 -189024 -199242 1619 151270 41247
17521 41247 248967 184771 -551800 -735466 -769505 -792271 -629946 -506068 -308696 -245394
17511 -245394 -366146 -399878 -251262 152691 154030 78324 187833 209872 -64520 -269782
17501 -269782 -59768 126117 -44198 -293955 -36559 175617 355177 534701 407775 -3556
17491 -3556 -339438 -454852 -429571 -488139 -508660 -558584 -837593 -929857 -774083 -378228 -215154
17480 -215154 -416119 -462736 -389392 -5384 255490 184018 360944 263658 206975 430458
17470 430458 442370 17593 -377902 -113990 -26736 -23613 -626 13097 394318 513562 59860
17459 59860 -149029 -306448 -201383 -178401 -118153 97343 192009 259543 325951 153182 261839
17448 261839 390244 879469 1647900 2212279 2734678 2620454 1906713 1379481 1149265 720263
17438 720263 547950 436728 721485 892605 793255 787696 649028 468046 173486 -75786
17428 -75786 -114223 -53236 129334 276458 209683 320887 194805 104575 177467 192198 304722
17417 304722 341867 140663 -258822 -250634 -127395 70560 439724 422453 251436 235745
17407 235745 138862 392353 482782 457444 265269 1534 -275539 -318101 9913 198467
17397 198467 244095 -55620 -140227 20772 109621 181472 202788 -123399 -169562 209429 90885
17386 90885 140984 100945 -237271 -505274 -145375 209301 238549 -316650 -449501 -349113
17376 -349113 -554029 -624427 -652610 -261745 246331 406914 275514 -38278 -196907 20080
17366 20080 203866 366969 426028 188967 130146 -92868 -262171 -261380 -210099 -5895 -14344
17355 -14344 155811 500188 490598 339027 748523 826629 280739 -284936 -433419 -494592
17345 -494592 -595756 -403959 -472406 -307807 41834 168044 11690 160741 250732 78914
17335 78914 -63558 65281 -111008 -190423 -44481 182809 263433 350969 477948 632336
17325 632336 798679 1472302 2476800 2626115 3103921 2916469 2151193 1242814 769040
17316 769040 684913 742345 874675 533770 717509 828688 668240 422908 261952 89647
17306 89647 78018 -270992 -477952 -225001 -40713 61457 40641 9664 454859 562337
17296 562337 275097 388529 212226 88794 297996 460798 739243 937994 1152770 862157
17286 862157 1031340 1673576 2341652 2616835 2569082 2082545 1628634 1074087 433450 194924
17276 194924 114982 -312425 -285451 178951 532467 304910 -52270 -483672 -116329 370171
17266 370171 402440 241035 157945 134349 147068 -44380 117761 157084 107982 479211 623615
17255 623615 368615 307522 272561 117113 -130025 -169153 7111 44295 -20760 -200746
17245 -200746 -302174 -467904 -323859 -102979 -127543 141586 106216 -142074 -332972 -677513
17235 -677513 -1116606 -923402 -531743 -533498 -418153 -278921 31155 367955 40539 216874
17225 216874 592270 355440 -75788 -86536 -186679 37417 -242719 -190607 -44736 -6130
17215 -6130 111995 17762 371222 590361 415028 314212 283411 505864 845382 608074
17205 608074 141593 -400280 -391038 -238862 -132564 -216634 -226287 125923 206453 163839 459752
17194 459752 375092 440 -366395 -507677 -226754 -19065 180640 126874 54844 -341627
17184 -341627 -240617 -337821 -261753 -164615 -161394 -348802 -107866 280419 165546 -34808
17174 -34808 -61845 197483 -7445 109342 40322 -49890 344516 216475 -233100 -322918
17164 -322918 -291344 -141462 183269 435645 30170 -517318 -756210 -911196 -676864 -274371
17154 -274371 -255182 -62177 -138961 -50737 94971 234474 759073 951834 775660 364954
17144 364954 281089 484734 353868 116416 420049 620119 609657 799334 1094075 834808
17134 834808 865921 626118 174766 11068 -36983 -156832 -311719 -288659 -380802 -346952
17124 -346952 -277818 -368223 -242245 209268 223350 383299 206270 206003 153353 97994 75869
17113 75869 14946 71846 -240019 -73111 -288254 -583021 -825150 -843526 -783754 -741430 -677481
17102 -677481 -282604 -157306 -167688 -112541 -70310 -135582 -318915 -78381 471067 546182
17092 546182 555419 590200 546988 650317 298916 82709 371148 854700 744716 575783
17082 575783 623203 546602 191626 185876 223380 328218 266578 224012 148488 143248 -83398
17071 -83398 -353265 -8403 592415 601740 160185 -200721 -238822 189504 435307 264757
17061 264757 -160151 57837 38123 -241882 121673 518496 411004 -17025 -159725 144336
17051 144336 92882 -565 97636 -31307 -219894 -467453 -508734 -513860 -100388 -16863 73670
17040 73670 221441 279965 -34835 -33511 141726 -9505 -314499 -401858 -120003 -118086 -434111
17029 -434111 -957021 -1099045 -1014898 -690330 -275546 91998 -90099 -400377 -439623 -702472
17019 -702472 -554445 -19426 -63134 -258621 -257530 -569448 -1051518 -548017 210442 352577
17009 352577 112806 134787 19749 -169182 73564 -61183 30589 498823 176218 -380643
16999 -380643 -327475 -304937 -180817 410161 676790 462682 43574 -234804 -25916 291494
16989 291494 105353 202421 153149 208403 -10312 19316 394529 199440 -410835 -388257
16979 -388257 -398633 -313118 -475504 -245721 -481014 -463276 -318112 -220942 20686 -98542
16969 -98542 -64306 536034 566521 450796 487168 329559 180270 628548 490841 279308
16959 279308 227495 166455 140611 216862 187211 396203 599749 402507 111992 126470 -1622
16948 -1622 -106636 -17565 -4956 249599 319329 22636 -340434 -122403 48646 -19392 -243962
16937 -243962 -409132 -543151 -618034 -273616 12375 560768 699957 472035 108437 -290682
16927 -290682 -143457 1558 80436 299389 448370 121223 323511 625481 665302 177439
16917 177439 18942 -64080 -6986 222287 15786 -91205 -143710 250171 367010 264544
16907 264544 285209 223962 -68292 4452 -234386 -193855 -186452 -158045 -310927 169181 358564
16896 358564 164526 -378350 -795984 -1006395 -772664 -394865 -540252 -704194 -976423 -591082
16886 -591082 -1463 127716 58713 38098 -28441 -78054 118854 147224 -135119 -403099
16876 -403099 -316124 -61009 67908 61353 -268462 -457148 -516165 -124662 198538 17067
16866 17067 -163892 -252996 -160638 -300984 -508951 -31801 56628 -197878 -414548 -318533
16856 -318533 30530 186409 90927 333229 535970 173487 22924 116460 395901 393525
16846 393525 176948 -4678 -128298 -25854 108777 68497 65360 164768 135229 39559 -200727
16835 -200727 -244296 -202787 -163551 -38417 -47609 -454915 -447684 -21104 108852 189429 334702
16824 334702 290899 114739 188715 165560 147033 94903 -36335 -79676 -279511 -254234 42952
16813 42952 -168704 -60693 -307916 -676649 -470901 -228020 -113458 -195673 -102155 442314
16803 442314 607835 298297 -235299 -280628 -64212 -158459 -434733 -84163 193036 368770
16793 368770 409959 445807 45223 -242293 -112777 -93322 -210333 -61306 -217223 -144168
16783 -144168 177594 83807 109719 217612 -146903 -491977 -601892 -573252 -425926 -216330
16773 -216330 -193818 -263166 -213196 -649522 -859972 -734653 -478083 -267594 7239 -121587
16763 -121587 -73388 -288097 -617375 -182726 -215591 -236596 -307926 -486164 -400590 -424560 -253101
16752 -253101 -248374 -66935 -299446 -537141 -488921 -394521 -88626 91658 85202 -140239 125202
16741 125202 97357 150720 204576 1330 -152019 -347968 -454261 -409778 -403539 -85065 -122755
16730 -122755 -602043 -268731 -51462 152400 89429 102204 195673 350475 457831 407540
16720 407540 84657 -332735 -220389 -164616 -436488 -353028 44603 174487 -111699 -651226
16710 -651226 -710540 -378592 87355 345594 30535 -247869 11807 215598 -49765 42082
16700 42082 309463 61335 -67204 -154031 -393521 -328852 -504525 -779315 -275563 103105
16690 103105 292543 314799 452161 122206 27352 -8806 47564 -129849 121544 67546
16680 67546 -479531 -638361 -116250 -6068 33288 -683944 -409204 -179484 3124 -8053
16670 -8053 -203663 -300438 -142363 -95053 -241697 -294224 -328774 -424062 -138923 -23740 -438110
16659 -438110 -569238 -535324 -706328 -613851 -404397 -433850 -521970 -879335 -833029 -703971
16649 -703971 -768032 -423518 -47283 379061 314328 84229 -405587 -506701 -268543 -452513
16639 -452513 -330017 -400086 -290829 61880 335090 532157 295157 228433 331222 221557
16629 221557 66313 57492 277979 480514 393707 -66118 -170235 -187703 -268150 -39102
16619 -39102 -90820 -184700 -231153 -109762 -97074 -72510 -162213 61893 428307 330067 33531
16608 33531 207100 211973 -274124 -278874 -13895 385580 328462 -159593 -413544 -74471 -168569
16597 -168569 -66720 -153326 -388271 -652408 -208187 265362 192820 -57786 -134183 -270166
16587 -270166 -409320 -136352 -290279 -143 56188 -178936 -85779 134999 -203144 -581149
16577 -581149 -472189 -1905 2395 -80409 283797 361712 156482 464245 178906 147052
16567 147052 -239702 -370641 -260929 -510996 -162514 436395 546020 -80370 -61972 240742
16557 240742 172295 -183862 -299106 -1163 281184 335121 426165 242180 -151418 -283004
16547 -283004 -211210 -321956 -443932 -207304 178256 209832 178368 -72761 -54097 63990
16537 63990 -25077 -46837 155472 227535 220962 -259950 -454875 -209669 39134 95217 -347698
16526 -347698 -307719 21620 -273916 -228033 -46943 96286 220188 -86713 -325204 -17003
16516 -17003 51136 31383 103789 298121 418342 541978 434461 565208 396168 251681
16506 251681 265448 257245 410986 408548 556528 472397 353741 266551 320421 198973 365132
16495 365132 112194 -191837 -725286 -764337 -242169 418256 328833 -79220 -339860 -243285
16485 -243285 -131171 -91119 86480 248976 472045 552203 217523 369050 473930 -3386
16475 -3386 -58085 374169 559537 437075 28508 -282770 -330540 -138912 288308 258819
16465 258819 217499 3263 9118 349796 274079 -34335 -371107 -318153 -128743 -83982 -232043
16454 -232043 -116429 233852 -82186 -713777 -449679 -235593 -102959 -17943 286818 39666
16444 39666 -375930 -297865 21374 301925 468703 622103 398939 98086 146966 118424
16434 118424 196038 130274 -225131 -242807 18091 -119624 9708 97558 -67728 -91681
16424 -91681 185581 19382 128493 430756 604063 707967 964240 877523 635001 853858
16414 853858 641980 261137 47677 -63650 -135510 -2117 -9458 -399364 -199756 -106044
16404 -106044 84709 107460 134189 542027 431403 506902 586882 452298 459964 456000 120093
16393 120093 372393 462832 376000 558089 641881 495869 450883 620868 573575 709759
16383 709759 571716 336128 234064 237125 404842 694908 480781 256131 140350 -217785
16373 -217785 -86764 266462 67513 -124161 -442723 -401034 -205049 -60194 -55709 -231043
16363 -231043 -99708 -188857 102349 145847 316219 31011 -30229 104247 -144507 -397712
16353 -397712 -439824 -140358 64258 202166 363914 417892 178312 38883 61771 294738
16343 294738 301249 411847 558777 418222 410607 350514 371689 172429 -78956 231524 307351
16332 307351 463970 252523 -6175 45632 -95750 -269005 -215717 148418 76854 1035
16322 1035 -139011 -79205 40752 81287 158958 238921 -74737 128576 -17998 -70884 -166664
16311 -166664 -264465 -522455 -527291 -607355 -499507 -446409 -98195 -6132 -310965 -272073 -474256
16300 -474256 -697363 -531771 -664189 -521185 -247370 40082 -245014 -253469 -223528 194054
16290 194054 466187 198458 260035 397821 11539 -139741 8234 -268352 -162460 -71166
16280 -71166 52045 -59629 -36690 76832 -120685 112743 99544 108631 92302 -94098 -166669
16269 -166669 -142661 347590 799731 465390 383464 328960 205657 -153831 -237841 -6101
16259 -6101 297536 545492 507960 450731 98495 -1595 24292 -165096 184368 419573
16249 419573 -234751 -981647 -891915 -671419 33713 285800 287300 452044 522221 246686
16239 246686 -296198 -476957 -757099 -612856 -329974 -19270 401385 391327 -150488 -254519
16229 -254519 -257267 -302568 -384978 -322110 -135469 -217429 -199231 -122738 -145643 -82790 -378004
16218 -378004 -816893 -918071 -562779 -304772 143327 229305 93731 56539 -146189 23238
16208 23238 120463 198550 358791 367811 145084 30968 -273396 -327433 41094 245701 168730
16197 168730 -117193 -244447 -284057 -459903 -422406 23838 326431 264983 5169 30329
16187 30329 475577 456059 177844 166111 83746 -399539 -582162 -375775 -225806 3121
16177 3121 518799 742313 466376 519560 154804 -412377 -670906 -469038 -3274 -4783
16167 -4783 -36160 72603 328686 26851 -209683 -247154 29600 -420434 -574861 -35212
16157 -35212 28639 -211896 -413418 -366460 -336468 -86573 206694 169719 137189 157722 -21766
16146 -21766 81925 87790 -66056 -1219 -54897 115577 596044 595579 292627 -87365 -129323
16135 -129323 -72527 -119348 -172381 -192767 -289127 -225499 -225596 -88892 -30430 116169 364734
16124 364734 419892 393318 410373 477043 623201 334232 -243469 -185842 -59950 152767
16114 152767 295074 319583 217263 63267 -322844 -444942 -273117 -46603 -238883 -333163
16104 -333163 47095 65020 -38942 -185019 -69120 34230 316828 363747 275298 -69217
16094 -69217 -238216 -254412 -428713 -426320 -464410 -586134 -540320 -439773 -537132 -629223 -495571
16083 -495571 138092 314852 35085 -32479 366129 366618 382703 556320 383019 260380
16073 260380 221907 65348 -147141 -48018 121526 313049 81325 -140893 -168374 -74443
16063 -74443 -429489 -428503 -237084 93463 16969 89482 -102738 -541056 -457271 -29808 287479
16052 287479 301129 385337 376628 236999 89285 576015 715084 389581 323130 48819
16042 48819 46119 117861 -79918 -128553 -7384 150137 239890 154960 394321 104311 -64837
16031 -64837 -30152 -325601 -370872 -413706 -487721 -222787 -3130 215081 400204 234210
16021 234210 114697 70136 -203119 -261584 -51476 -74766 -391429 -332541 -452101 -386618
16011 -386618 -447523 -286309 -48493 -83387 177369 211135 190976 -47129 118098 296671
16001 296671 411591 212760 268996 455249 447609 246660 227566 57771 -199457 -197966 -106802
15990 -106802 115003 134541 23601 48857 9015 3084 74058 -46388 228136 289217 348646
15979 348646 272409 152645 35603 -340891 -360437 -469196 -68871 275739 9031 204450
15969 204450 566018 436177 230284 133448 332795 547235 407734 197347 351573 418782
15959 418782 457476 393068 330792 90268 -229179 -213414 -63250 234618 386133 544274
15949 544274 198566 120484 -9326 162554 390089 217570 69522 160533 281289 86906
15939 86906 -81470 78853 -76937 -105787 167520 124408 -92788 -158693 -84858 -133454 -96981
15928 -96981 348916 503205 362232 -49923 15701 -263877 -284691 -165025 47636 248173
15918 248173 -10278 -181255 -137671 -19638 -152043 -346476 -316791 -227962 -446169 -197635
15908 -197635 -161423 97315 164857 655997 476912 76956 65522 346224 148865 255132
15898 255132 74951 414828 458717 304765 402698 467967 166748 81368 -212090 -450708
15888 -450708 -270606 152870 -16450 -334757 734 555920 487849 545409 304401 315361
15878 315361 369337 471472 412022 342280 333889 58822 16502 60485 223610 444780 139913
15867 139913 212149 457114 402418 456642 464685 37079 -365413 -561231 -272058 -275793 -543383
15856 -543383 -234247 159352 278555 49712 33302 -106073 -174309 -133725 -114832 -4477
15846 -4477 -219575 -298417 4542 157734 27825 155632 517246 332024 69339 191585
15836 191585 292615 577092 347438 236574 67444 36457 -67215 -285376 -306714 -374153
15826 -374153 -180542 -371477 -90552 42476 -91660 -370617 -462584 -278398 -329207 -302098
15816 -302098 -475757 -155517 -371120 -547400 -603655 -848399 -885052 -732677 -708011 -819862
15806 -819862 -768033 -398077 -120510 -128406 73537 -79327 -173653 -193764 -283267 -386777 -424344
15795 -424344 -427574 -325644 -56959 143838 229333 278983 334557 333325 250380 301152 172722
15784 172722 -78865 -107925 109077 126877 -134165 144455 -38561 -164492 6643 -209697
15774 -209697 -283273 -291293 -309604 -440642 -445246 -588486 -341047 208856 118009 -88612 -80590
15763 -80590 -80539 22066 187179 -542192 -735961 -654744 -293354 -174358 173572 4501 -139708
15752 -139708 -96481 243656 419744 392262 355443 151617 -184544 -145186 -319455 -366470
15742 -366470 -294835 -13780 39995 -508010 -319601 40298 120362 -7886 -155833 3537
15732 3537 176420 341852 457052 384191 -217755 -179879 129066 -45644 137447 151896
15722 151896 250206 349556 226761 -10708 -86370 21895 178592 -152733 -418875 -758133
15712 -758133 -809981 -492097 -403260 -348057 -480570 -528989 -342233 -179254 104920 412422
15702 412422 367332 295600 3955 -99406 -18411 -354975 -324724 -15567 22962 -351813
15692 -351813 -559520 -388027 -321729 -607012 -576458 -24302 15870 -74820 -558261 -693661
15682 -693661 -540459 -186970 219 -230745 -329018 -230201 -176533 30990 4310 -119364
15672 -119364 -92627 28165 403785 326019 180432 4733 76289 209174 543211 139174
15662 139174 -67322 52439 209666 172409 102049 305045 258937 40893 -14968 -36494
15652 -36494 -481706 -632777 -418072 -110412 -385782 -101563 405548 623993 685809 325587
15642 325587 7435 -280145 -531889 -383462 -158423 -239202 -324650 -224143 387968 556689
15632 556689 332530 -9239 -211257 -105511 -32035 -66416 -118427 -131642 46733 179865
15622 179865 90901 74882 -223627 -142777 29095 218251 149353 31255 18323 -298438
15612 -298438 -534861 -421678 -98748 123746 333537 202788 685885 561091 131949 -161548
15602 -161548 -437411 -682514 -479348 -68302 265736 -89028 -592566 -541865 214339 -146513
15592 -146513 -478377 -776930 -659506 -642413 -267708 -271797 -419724 -62634 -192966 -227823
15582 -227823 -77722 -161270 -14179 213334 7294 -40579 174729 -317843 -511547 -40520
15572 -40520 195577 223555 638275 681902 580053 241954 105551 -89543 -37438 46297
15562 46297 -90058 -32088 -75710 -674189 -1041493 -850405 -549396 -524537 -361840 -150364
15552 -150364 156078 168109 90365 21452 210472 470963 409777 16104 -116569 -120687 49456
15541 49456 -207405 -120874 -219271 -316731 -366878 -354212 -605587 -461411 37882 234132 250031
15530 250031 64818 -222084 -490046 -306703 -347684 -268947 -651339 -349196 -356814 -113990
15520 -113990 -183912 -196268 -293292 -849598 -656663 -239931 -67933 -376420 -631275 -549287
15510 -549287 -493177 -327990 -490965 -503742 -193311 -140074 -422473 -624551 -493040 -298853
15500 -298853 -375445 -584286 -961521 -733601 -318496 -82079 -41831 119427 258735 355146
15490 355146 343751 311687 344994 275615 -302765 -404712 -473256 -643590 -1113816 -1100261 -784638
15479 -784638 -551418 -112150 247191 29384 -230754 129072 136932 68727 -131110 -18277
15469 -18277 84005 12208 -185654 -549377 -319675 -199284 -88277 -134195 -640980 -513173
15459 -513173 -180911 -145070 -309939 -374059 -443432 -264810 -183475 39588 44349 -213821 -183558
15448 -183558 210122 121070 -34254 -102931 81948 642729 590845 560624 500974 445683 -58911
15437 -58911 -42590 33225 133636 22434 72813 180539 401023 455983 355550 447151 270182
15426 270182 499292 272796 -250593 -287549 -296319 -264714 -334374 -639003 -700265 -824947 -730779
15415 -730779 -491436 -358491 -235178 -42366 -95922 -484766 -469387 -430629 -286079 -340226
15405 -340226 -327225 -241985 -36202 98514 453806 364047 -170887 -326686 -179077 -421873
15395 -421873 -371845 -403536 -599488 -533519 -603384 -358486 -26221 -126933 -455383 -492578
15385 -492578 -507414 -465262 -104283 -122805 -86034 93972 295031 659018 420125 436516
15375 436516 318293 -106532 -48780 60882 34163 262684 3194 -30013 77211 14984
15365 14984 -235337 -100156 279571 298380 301912 393419 511247 350794 25852 -58020 -57331
15354 -57331 -148025 -283380 87167 182496 136172 30812 -264927 -513079 -735504 -548232
15344 -548232 -536259 -615045 -204941 327298 467669 80874 134627 299071 -40040 -94970
15334 -94970 -151690 130374 389225 -98019 -57222 150813 188196 204111 149967 217002 40328
15323 40328 179940 -244746 -340706 -391849 -565748 -447120 -430352 -505633 -592511 -416289 -326067
15312 -326067 -389509 -56599 -136530 -199837 -14212 -61943 -187188 -124299 -26607 -315862 -234825
15301 -234825 261926 89951 -311303 -244234 -182086 -132506 51643 296034 218653 125520
15291 125520 183990 93845 575995 821665 462783 96554 -47938 -59776 -78370 -146758
15281 -146758 145441 37411 -52092 -58343 -26071 -24452 -275580 -345336 81296 285270 258316
15270 258316 65947 34591 -39836 -112217 -272309 -107103 -58128 -255341 -165100 65575
15260 65575 316757 363771 350147 631489 491423 333917 319508 319770 298695 38629 -243792
15249 -243792 -147703 -271331 62109 145349 -139549 -138381 -89572 75393 137259 -129339 124903
15238 124903 182860 266304 284094 186468 24286 -135328 -272192 -322962 -379712 -403958 -160222
15227 -160222 -109435 69278 -206582 -445853 -189627 -55604 73761 121802 16265 -148215
15217 -148215 -79140 285354 276640 210444 358932 527150 649246 527478 257778 146331
15207 146331 95103 310978 237848 -41513 -135297 -162997 -133635 61092 366942 370347 300636
15196 300636 2061 -306588 -255410 -293786 -237130 -209014 -142018 -143990 -456969 -612729 242358
15185 242358 843405 688572 289803 67838 -45322 313766 611344 512971 -84252 -434665
15175 -434665 -513131 -412873 -344063 -209338 -235004 -93238 -27699 84530 -188605 -90463
15165 -90463 99547 315119 104424 -34554 -308483 -387927 -449998 -263497 -186165 -113659
15155 -113659 -301372 -403151 -303375 -498850 -354657 -414565 -349382 -306893 -530312 -276609
15145 -276609 134326 197207 104142 25856 -1981 -53617 95461 -91655 -342755 -285717 -315280
15134 -315280 -401609 -189976 -70502 151274 -74246 -447575 -713788 -468579 -273310 -275450
15124 -275450 -212596 -266596 -287399 51131 404384 281899 -51458 -197632 -280523 -91170
15114 -91170 -68048 -53145 157940 481705 842805 533459 266574 332939 482431 408015
15104 408015 470136 400137 298780 125897 -46314 -205020 -126732 -401471 -516375 -743789
15094 -743789 -632726 -327947 -318932 -362835 -700565 -850361 -585946 -386507 -104885 -15571
15084 -15571 -14559 -94392 -23435 -97146 129339 184586 103522 472126 47409 -78771 50672
15073 50672 -152725 -65435 25285 -17246 -234489 -648885 -598003 -452652 -571900 -502203 -165846
15062 -165846 -89637 -139067 -29985 357826 680020 854263 770907 332751 -6150 79989
15052 79989 -45754 33010 159596 159406 -221310 81891 153603 81306 65756 -50128 -220415
15041 -220415 -370363 -197441 -244099 -428068 72262 288072 14230 263754 144929 -490613
15031 -490613 -417928 129358 246941 152769 251860 443 -99872 -196336 -276407 -57992
15021 -57992 413876 379332 164791 27417 -54221 -132968 -344066 -418262 -215530 16118
15011 16118 -385232 -265140 113005 191876 400721 258585 -17376 -147930 180330 150171
15001 150171 49777 146526 49449 -8983 -270506 -287061 -240108 -22787 -42662 211329 409354
14990 409354 227227 187055 -55253 -227800 98956 35154 -241278 -445147 -352286 -254491
14980 -254491 -239124 -422923 -349690 -156135 -45121 90707 335580 188759 208220 -162410
14970 -162410 -243066 -431149 -750570 -739419 -302046 -371214 -424068 -183227 -270205 -80568
14960 -80568 240541 -68295 88296 173472 76483 -49837 -410282 -371314 58729 271313
14950 271313 58579 -70663 162034 171348 -242591 -454264 -377330 -197856 -283118 -308063
14940 -308063 -360855 -485154 -195362 -182027 -269549 -415739 -470364 -766383 -766842 -227073 -73821
14929 -73821 -280367 -10743 401709 215491 190371 547861 620040 336891 151541 119029
14919 119029 308762 436494 159845 -288659 -465086 -265689 6698 -186590 -167425 -117372
14909 -117372 -55040 91543 237913 437980 730837 744776 664089 440065 143209 314732
14899 314732 177889 198941 90111 230613 19993 -8181 3704 360813 332331 12410
14889 12410 -228050 -307677 9584 46619 27451 -300199 -282874 -164799 -174262 -127256 -90899
14878 -90899 -93269 44176 -198493 -256265 -17815 291409 362940 262853 317536 88573 -400723
14867 -400723 -508997 -714374 -951111 -506260 -450145 -400584 -273787 -317419 -98242 178060
14857 178060 -316108 -458840 -307754 -369614 -324263 -87587 -104060 152522 193746 263000
14847 263000 353505 581754 428550 304877 219307 216139 68993 20418 -241156 -384785
14837 -384785 -19018 27519 49690 194959 607956 807018 701851 259612 -122396 -21456
14827 -21456 303145 114713 -87722 333207 67890 -75776 204325 434165 349284 -255674
14817 -255674 -360073 -256037 -154681 114636 291777 186795 -32512 -213647 -105993 -163174
14807 -163174 39513 58586 66585 -8592 -271591 -711525 -427036 -109251 38281 -49431
14797 -49431 -103465 160436 93266 -14020 -91786 -378050 -344358 -313529 -47747 197832 52306
14786 52306 -416843 -467918 -84439 403778 757682 1304608 1033345 825722 706801 480486
14776 480486 603914 692837 420011 -4364 -99511 -174110 -201999 -117509 153560 202047 177052
14765 177052 -305896 -291662 242931 416296 522187 92667 -481190 -452782 -298024 -352905
14755 -352905 -654755 -478681 -221984 -137018 -403614 -477690 -348455 -178770 -178119 -59120
14745 -59120 -290031 -750355 -492713 -489775 -788034 -620572 -361962 -121162 141664 187732
14735 187732 188332 245711 82941 97736 -101543 -135854 -51985 -347003 -688781 -542494 -300318
14724 -300318 -88458 -155505 -75015 136757 228035 -34931 -332411 -290652 -186798 -186731 -476545
14713 -476545 -369608 -491324 -104748 186858 155084 55312 62935 158050 -41082 81811
14703 81811 -124129 -540952 -733782 -768492 -648262 -319633 -250882 163141 373646 293145
14693 293145 97715 -111906 -165771 180657 57195 103988 329888 460789 275031 99493
14683 99493 26691 231307 167947 81379 -21207 58080 -36921 -182662 141773 549982 396431
14672 396431 35574 121728 329311 282394 438445 482319 298775 116020 211928 244623
14662 244623 433764 212704 -188702 -323516 -438744 -293047 -226231 -203126 -266276 -416876
14652 -416876 -411596 -174654 40371 -60393 -276017 -465845 -870292 -744915 -629897 -503515
14642 -503515 -73106 214080 -39005 -229458 183722 387893 336438 403577 128285 -140758
14632 -140758 -188352 66013 248572 -175878 -315645 -408535 -63309 165730 236760 580396
14622 580396 595649 545902 518908 484274 422397 451267 375596 432385 150119 191750 270595
14611 270595 139658 68558 -202598 -55492 91553 -82244 -58081 69498 141911 180984
14601 180984 449838 484842 116947 -315791 -576309 -493647 -187559 -131434 -45829 18990
14591 18990 -168966 -209601 -19971 44890 -206579 -503735 -355579 -189445 -209518 -388772
14581 -388772 -586286 -518400 -411499 -319623 -202230 -4144 -44996 93109 120392 -177088
14571 -177088 -67432 -183437 -311283 -156880 327720 161332 262773 192050 297163 607173
14561 607173 525195 324936 209905 -80360 295520 725276 838144 622327 867471 827771
14551 827771 425054 80923 -212477 -288454 -129565 -129596 -205501 -350210 -110359 -226988 -166222
14540 -166222 -208619 -279709 -120227 28563 -82863 -441370 -334267 -111787 919 158438
14530 158438 155418 35308 136563 213250 -6889 -208970 206833 425842 424773 183746
14520 183746 260144 164182 55530 -203100 168805 390506 124661 318386 412069 211114
14510 211114 460957 306735 105961 505015 218234 -69325 -279242 -174624 -21435 76814
14500 76814 116918 -125158 8317 -115273 176629 273178 286604 205239 -107520 -278910
14490 -278910 -565931 -399717 2803 474531 473767 268425 435226 8736 -240321 -259560
14480 -259560 -724983 -949237 -364832 -33386 -172791 -12015 196767 117632 25221 348714
14470 348714 420368 413964 -195413 -432367 -252812 -56867 354886 267159 23034 252657
14460 252657 232693 180274 58033 -42946 565137 853313 996047 586770 166057 36320
14450 36320 -51324 43379 113076 60009 -165896 -72476 -25085 -102740 102244 162463 436329
14439 436329 192658 -144536 -137928 -323290 -495904 -412399 80937 14984 -265710 -425954
14429 -425954 -429944 -500726 -516043 -368759 -227247 124836 235107 198982 266951 277542 -230986
14418 -230986 -348821 -241853 -69855 476 -179839 -455010 -529598 -363920 -149890 153966
14408 153966 329378 465803 102698 -260290 -363570 -662789 -667225 -265043 -43947 -199357
14398 -199357 -185379 -285963 -252632 133486 369809 31539 230727 403026 300699 198358
14388 198358 -70497 217 59282 -292351 -339795 1061 -114856 -106374 -135026 -116934 -17737
14377 -17737 236403 475810 169470 -50249 300955 523451 472181 229001 375373 524809
14367 524809 461973 342747 -1905 -71705 -247009 -66781 -187794 -39017 -16901 356411
14357 356411 602076 1003287 981203 505515 -119505 109377 451308 431365 471108 316799
14347 316799 195542 136230 -178521 -22415 244595 242821 99298 368019 408987 -39481
14337 -39481 -456177 -241196 -87753 -141387 -313669 -86475 94913 -166904 -641127 -495750
14327 -495750 -166136 -146952 -101723 232796 343803 137734 -37829 -50457 -221468 -185063
14317 -185063 -30149 -318665 -160162 274670 90718 -227482 -315314 -43543 163705 431773
14307 431773 611124 199311 -186836 -465432 -565927 -492520 -412522 -460546 -244278 -47013
14297 -47013 -55622 -165482 -10299 -17745 331774 65481 -302060 152658 188796 142302 350968
14286 350968 271371 177790 10483 -426784 -661341 -566908 -55386 -2528 -82784 -85843 -298576
14275 -298576 -482370 -419312 -406098 -368617 -219402 -397664 -492404 -389341 11253 385631
14265 385631 60089 -113546 -84490 -30941 1820 -143431 -602395 -1015387 -1019834 -1078308 -815080
14254 -815080 -723811 -843409 -582653 -520963 -341941 -129348 -81073 35188 218143 222793
14244 222793 178537 -76058 12481 94265 -48211 -106155 -449647 -421881 -169558 21853
14234 21853 80248 196134 346671 267525 220847 -125565 -569295 -559724 -264614 -256326 -399264
14223 -399264 66795 425228 313072 297169 140828 159113 324310 229256 331546 315157
14213 315157 67957 206774 521528 204750 -220508 -449036 -552808 -605078 -427212 -236097
14203 -236097 -644659 -743613 -502204 -249428 -172323 2891 79153 462367 525151 168817
14193 168817 80234 -38810 111196 -7519 -334076 -582293 -310272 -89389 -208774 159472
14183 159472 381739 45934 -80143 -950 -451117 -133439 184948 -90036 -111895 114523
14173 114523 76290 -211447 -65783 122538 159758 -104374 -66074 -118833 129306 68041
14163 68041 365202 419776 -68320 -261037 -381411 -599099 -555016 -269206 357055 431137
14153 431137 428848 417730 512347 420723 394978 505086 233696 -51739 -197471 -64782 -36727
14142 -36727 -112646 -282853 -437150 -603428 -527791 -471928 -148994 215437 343758 111334
14132 111334 -15281 -141299 -397014 -192099 -210152 119180 203355 -7938 -58198 172806
14122 172806 -60420 -248256 -263940 -184798 -170823 256455 686442 588020 304961 283851
14112 283851 177927 22432 -28054 -17191 7994 237435 383181 127235 88517 271896
14102 271896 109245 73236 65766 -209657 -382997 -93096 185541 245388 28585 -59363
14092 -59363 12196 201140 315860 249952 343332 71446 126681 -15451 -269937 17021
14082 17021 377297 512930 267352 -55079 -168797 -363411 -680525 -645993 -206050 -76459
14072 -76459 -134432 -223274 -460755 -425466 -134123 -38511 162094 116629 -152650 -263061 104039
14061 104039 174005 259525 75242 178469 337409 -127071 -233165 46170 361945 275885
14051 275885 386847 502904 92945 -347736 -99488 89843 94880 39318 -538647 -681111
14041 -681111 -537516 -724738 -934527 -900727 -650905 -655174 -626395 -635287 -544835 -217771 -54367
14030 -54367 302259 534190 680428 289384 -194123 -295517 -181936 127711 375910 326439
14020 326439 334129 278438 -98721 -323484 64358 105046 -56892 -129933 86449 -24645
14010 -24645 -360283 -614967 -465472 -160235 -20172 30948 303023 333929 371160 -104145
14000 -104145 -294503 -306539 -646223 -550755 -341743 -399405 -426322 -453932 -281103 -464462
13990 -464462 -381461 -58096 290022 183894 157049 330300 518860 336846 -139559 -402532
13980 -402532 141433 408216 283749 328585 147311 191264 380183 260643 480789 481894
13970 481894 280534 -10346 -337854 -92292 416246 409913 435 -170744 -153302 124457
13960 124457 114132 -85341 244537 317271 529993 529409 860505 600366 667604 661739 437307
13949 437307 -209743 -126526 40697 115336 358365 150738 -164037 -436000 -864002 -827189
13939 -827189 -507110 -234730 160984 -12182 34896 441207 471711 330046 397696 557727
13929 557727 726187 613277 333922 -21800 -252301 -44664 119764 82817 73789 -236462
13919 -236462 -309951 -46501 247115 -100287 -119784 88632 199577 169692 521915 268761
13909 268761 188528 194099 280344 269178 78847 -255754 -100870 159605 154478 341396 729368
13898 729368 507782 46376 -283064 -117893 182146 393645 18057 -116433 113938 633013
13888 633013 422528 31200 193842 544987 586310 277981 115253 -60385 149378 -42655
13878 -42655 147708 276618 58049 -224243 -716541 -935434 -781764 -444739 -427035 -314237
13868 -314237 -423693 -216147 -88575 -83990 -199801 68861 -89542 -229400 -251075 -171089
13858 -171089 -173362 -265203 62637 431017 420515 485122 361004 177598 211611 -237032 -114456
13847 -114456 254723 43777 151700 171252 1145 -66999 48644 157932 116345 -130641
13837 -130641 77362 537065 602157 825475 414782 106674 -66293 -67436 -199243 -212567
13827 -212567 -238434 -270506 86459 89409 -37222 38269 3437 -138735 2334 270323 277552
13816 277552 233624 202641 -5257 -575600 -664291 -192799 -1598 -116344 -126667 -2802
13806 -2802 -230833 -87489 77655 -150773 -250313 -400976 -327403 -261027 -123605 -355914
13796 -355914 -328220 -116497 289377 690926 456137 121801 -208009 -143620 -73479 102697
13786 102697 -480 -363761 -326871 -165467 -235154 -387729 -430423 -454821 -786258 -761812
13776 -761812 -485236 53267 44876 -176917 -128974 -176348 -122959 121109 75555 245523 -59040
13765 -59040 -235948 -89307 -250268 -230059 69245 -69660 -233505 -256781 -14375 -104732
13755 -104732 -467715 -253788 -115197 -135226 19503 78013 -13638 -338115 -165525 -48794
13745 -48794 -81053 -317180 -616909 -854580 -706534 -338068 -155036 -96331 -220170 16888
13735 16888 -200257 -7750 -39212 140777 369835 116078 -413869 -812397 -590693 -255523
13725 -255523 236575 389153 171618 -141886 -271213 191182 612101 637237 711249 611435
13715 611435 474175 714224 400569 321808 665497 704768 625570 578706 465671 536267
13705 536267 182733 159276 207491 134708 -141 64392 -99637 -241126 -301295 70148
13695 70148 109598 -7230 -214372 -170319 62519 15315 -352486 -215655 -106833 13215
13685 13215 92517 -77613 319807 308588 206563 -111409 -185300 -13272 -85762 -39825 -132934
13674 -132934 -106458 163857 397841 235797 -16756 22268 262062 452250 680582 705016
13664 705016 350078 427890 512051 374498 -108678 -139370 -128664 345941 457470 194764
13654 194764 -158471 -365621 -362111 -168020 225276 -104318 -425710 -228673 -14618 43734
13644 43734 340493 546158 393597 76365 60708 -148236 -253732 -615964 -598773 -615933
13634 -615933 -154279 208398 75967 -138290 -344083 -209874 197392 82090 -64469 204500
13624 204500 275441 -119655 -246156 -285947 -13047 6900 86272 315012 405618 -47425
13614 -47425 -236462 -233155 -40472 -43253 -202460 -624884 -584076 -368800 -110103 -5590 -335903
13603 -335903 -767752 -630580 -575285 -629948 -518881 -472882 -275588 -356255 -594524 -405363
13593 -405363 -261233 -119298 -154135 -3678 391171 173630 106024 258068 311247 198539
13583 198539 130119 164380 -190842 -323708 -285183 -434969 -375813 -432617 -540652 -271044
13573 -271044 -82166 -76713 -6398 -102297 -191677 -100461 -388141 -600599 -582785 -484018 -264266
13562 -264266 -247741 -229669 -97831 31179 312108 -52980 -205022 173614 177282 213575
13552 213575 337954 167849 191175 244000 342900 488452 643439 387189 126117 219180
13542 219180 417382 322637 -124575 -339538 172011 102487 -17813 188954 -1880 -378750
13532 -378750 -19757 233502 376767 207399 119249 17393 -323477 -48897 116022 244912
13522 244912 88578 92283 -150636 -32060 304806 31379 -184712 -226554 -458231 -469477
13512 -469477 -450876 -366092 104256 132466 270520 327425 19963 151739 226264 291895 558893
13501 558893 628785 711064 1123697 1422340 1122546 799365 354836 -48330 245322 620179
13491 620179 370569 192158 214324 423340 690811 667411 398768 180597 -280528 -500585
13481 -500585 -353408 -235676 -338581 -120187 -221804 -158423 -355399 -206849 -260878 -290482
13471 -290482 25683 -51450 10609 176502 66463 -113189 -227597 -115907 -478034 -625379
13461 -625379 -596547 -591241 -62446 163590 226421 -3559 -149341 166641 357527 281307
13451 281307 -82407 -211373 -253105 -139115 -36562 237753 204145 -149276 -342200 -97666
13441 -97666 -88320 -154318 -97994 -211796 -578601 -441069 -82080 -36416 -145854 -403498 -320019
13430 -320019 -309197 -370468 -488236 -837288 -163044 451291 342003 137311 -11146 -328975
13420 -328975 -82055 237080 -18281 -211334 -215381 -37276 436707 98457 7362 -239665
13410 -239665 -687416 -581218 -340587 116147 -190956 -251326 -66015 -69441 -608074 -451689
13400 -451689 -195759 111157 -164909 -124186 52683 82313 95941 -82899 -13845 -13983 -162196
13389 -162196 -144953 -126415 -173131 -90761 -121838 -309323 -443821 -355107 -406163 -229049 -447887
13378 -447887 -342668 -123650 91470 -275832 -732229 -838912 -956120 -724024 -613368 -480850
13368 -480850 -395259 -476394 -274348 -196157 -392614 -578966 -172910 29953 173583 -124908
13358 -124908 -279307 -4357 201257 4508 -53593 19629 -218190 -337927 -175572 104192
13348 104192 -76155 -200168 -561540 -711263 -418863 -258197 -302447 -560127 -186702 273150
13338 273150 432421 292194 302047 438916 475051 60363 -218035 -113579 167786 -112342
13328 -112342 -89948 -153126 -294114 -218516 -174065 -167556 -437832 -143502 -27076 -349290 -188069
13317 -188069 -172503 -136933 -99059 -263709 -589415 -683652 -457391 -509682 -680271 -833297
13307 -833297 -672479 -643012 -481361 -90126 -175946 -134978 -114239 -20768 -44728 -485152 -414612
13296 -414612 -153122 -6728 -101702 -206429 -270066 -494747 -571861 -400248 -200663 -70621
13286 -70621 -19710 89804 163135 237378 -129625 -211492 39719 -534550 -987122 -826731
13276 -826731 -206119 -52867 -104532 234427 127483 198996 436781 269242 39108 260864
13266 260864 270228 -106027 125134 496951 341531 294648 -106211 -265295 -82120 -124007
13256 -124007 -135698 -92483 108467 79730 6827 -29233 -51991 87463 406328 267593 -404313
13245 -404313 -777985 -670204 -583887 -438412 -149602 67981 15507 -179156 -655820 -547047
13235 -547047 134476 -89216 -257026 -117743 -192226 -341944 -209658 -269956 -48897 275209
13225 275209 86595 -445298 -310452 -136331 59245 53843 -104328 79173 180246 229912
13215 229912 4906 -220083 -309320 -423685 -502604 -685898 -699356 -208428 -20260 -21445
13205 -21445 -243226 -254892 -159776 -85305 -266157 -427996 -27117 37863 87983 75970 -304734
13194 -304734 -661278 -874943 -777803 -681106 -666970 -186078 48724 26133 100825 254709
13184 254709 38567 -5225 151884 152209 177819 395255 -57503 -442119 -52058 -111526 -157807
13173 -157807 112363 148350 85177 -156552 -542098 -634413 -375084 -288579 -311813 -206827
13163 -206827 -21715 -97809 -234660 -68972 -62257 -334547 -376828 -88389 -142037 -193817 -249059
13152 -249059 -94509 -69579 -308331 -203355 246237 446120 384870 95826 -84078 -192117
13142 -192117 -425813 -358498 -557364 -367084 180478 18085 -246575 -437812 -338995 -156093
13132 -156093 -73579 170950 -11721 165460 128979 169986 -61005 -174901 -121880 -112383 115710
13121 115710 -235288 -399824 -276109 -99562 -53597 -15112 -97773 -184509 188208 352738
13111 352738 222287 233680 418734 194114 -49922 -121092 -450089 -315786 -338807 -654469
13101 -654469 -620563 -388316 -91488 57832 -98049 -93194 -32501 -247446 -544675 -498276
13091 -498276 -479023 -264488 -37487 151862 -80606 -624323 -935036 -708991 -671969 -709850
13081 -709850 -403566 -448413 -210468 -144597 -410917 -646841 -354451 -102711 -282981 -224887
13071 -224887 143331 22119 -176079 -370930 -449395 -428957 -511317 -48067 283795 135849
13061 135849 3215 -126917 7414 -121800 -141752 -12588 34158 -130743 -117501 169242
13051 169242 -66311 -288331 -197451 -40779 273349 236725 544824 527839 426257 81650
13041 81650 -139478 31780 -78022 -186021 -227484 -389715 -416824 -254720 -8747 187455
13031 187455 84271 140880 -158553 -683363 -881773 -682172 -191820 -125935 -451898 -174105
13021 -174105 267891 454866 584403 83244 182236 525598 593961 688844 833035 679956
13011 679956 457881 409573 705572 578380 489527 276275 122094 120349 151468 305973
13001 305973 -116741 -354151 -588665 -403652 -16268 395961 231542 -25037 -393861 -474700
12991 -474700 -314545 -22480 -278390 -148385 -60308 -209725 -115313 89167 405315 357026
12981 357026 377970 254363 250218 201958 -398785 -672548 -588075 -286483 -219466 -106136 -192968
12970 -192968 -80260 398352 335787 395742 213423 206101 92961 10451 119116 80704 113307
12959 113307 -22018 -183850 105869 412920 312605 -116653 -254201 -43465 -107662 -336975
12949 -336975 -235074 -205053 -279749 -626001 -460377 -193489 -347402 -225295 225880 320710
12939 320710 100291 -57020 17823 -245474 -159789 -197210 -109209 326313 305698 254223 101802
12928 101802 -80961 -7221 70840 309322 -53794 -101038 62580 -108342 -217465 -152945
12918 -152945 -293808 -191035 -71391 -214556 -314253 -118632 350968 431261 502660 476070
12908 476070 192992 -3770 14953 193317 314693 365634 430980 413188 340338 342817 78200
12897 78200 245764 150252 100901 337947 424272 273572 35860 -364056 -314356 207123
12887 207123 791964 724712 571152 221541 -103390 -82257 -229411 -72044 431755 107671
12877 107671 -117563 -253209 -220282 138331 475340 184628 -253194 -359610 -484015 -368496
12867 -368496 -112627 -296803 -286002 -311463 -402940 -372142 -522380 -554491 -320580 -131424
12857 -131424 -117640 -760174 -863795 -375165 -81734 199032 -37993 -111193 3110 210806
12847 210806 392021 471018 520119 302802 121739 82874 -294270 -264756 -161449 -307747
12837 -307747 -339885 -471361 -520012 -95097 -271766 -478373 -341575 -384507 -413605 -137877
12827 -137877 -59990 95174 230519 117741 91883 525752 604577 208922 5510 -178572
12817 -178572 32989 37024 43956 54695 35238 137985 -97458 -380197 -436514 -495182 -358625
12806 -358625 -336875 -69890 115311 -105869 -105956 239306 337103 348900 371953 437101 407458
12795 407458 -25292 -101382 107034 236905 87590 -273194 -287372 -43703 -223057 -277905
12785 -277905 -327037 -139555 -112249 -221134 -319493 -139543 -260473 -365618 -451134 -628897
12775 -628897 -524407 -194506 -129640 50394 -36634 -429606 -468655 -358739 -184490 -146091
12765 -146091 259684 466390 367098 131287 59653 31284 259460 676727 723759 395535
12755 395535 283534 466611 557947 280284 -284796 26471 -71081 -274805 -362387 -290379
12745 -290379 -161547 -307883 179436 311883 100971 -110855 -51220 193024 -148641 -315871
12735 -315871 238454 393310 425653 341511 500792 282229 50159 -182273 -277281 -341081
12725 -341081 -275256 -311584 93849 345297 148324 -5089 166903 180042 132662 132482 209197
12714 209197 290716 363605 115997 65188 164675 78190 48117 60540 77919 258393 527911
12703 527911 605678 428618 241496 205089 -91024 -156981 121843 70094 -386420 -507180
12693 -507180 -458819 -391320 -330542 -155146 21436 -111276 -38829 -19031 -110532 -294909 -138832
12682 -138832 -9578 -152376 -91625 759 -92590 -92055 -202726 -345797 -384381 -428780 -567062
12671 -567062 -441025 -81924 208395 260593 280378 110079 -239808 -414651 -557818 -544699
12661 -544699 -168697 -116897 -118692 -226426 1199 -85649 -110174 19798 183651 152323 270062
12650 270062 506596 512317 172204 -80099 -306359 -243903 -254028 -330400 -436150 -274364
12640 -274364 -258113 -361030 -556074 -419993 -277652 -276308 -358746 -257622 22448 38876
12630 38876 190303 307888 82296 -357978 -600109 -578590 -334375 -138210 -354608 -475495
12620 -475495 -397840 -142960 -338259 -77993 177550 101248 -215907 -249784 -478069 -439946
12610 -439946 -294171 -143261 24514 135755 154912 305676 311356 262660 492097 670877
12600 670877 834490 1149375 791877 394744 390665 696902 778429 331998 -209220 -528600
12590 -528600 -605126 -452487 -437735 -445653 -159294 -320168 -429723 45862 209119 152317
12580 152317 76275 69407 -65006 -146091 -68882 -463853 -333500 -262923 -112804 351774 466872
12569 466872 397477 493116 445027 482977 281494 25073 228351 37952 -277144 -79024
12559 -79024 46122 113864 -83161 -226677 149126 100959 -205817 76401 113221 230553
12549 230553 364091 308795 177325 288771 331310 344053 12763 205718 11839 -282344
12539 -282344 72099 351182 426429 178848 185438 255205 76851 291008 356945 -7376
12529 -7376 195755 145747 -47402 232708 314279 -151732 -191118 5394 266065 757902
12519 757902 559933 585565 748658 530953 346665 248172 92022 145406 138756 -16040
12509 -16040 -105284 -418779 -564928 -585341 -451943 -344168 21461 -44566 -249878 -404316
12499 -404316 -225570 -380693 -104927 -100363 -100120 178941 -62042 -415932 -425729 -284287 -259243
12488 -259243 79021 74977 70803 39168 74654 -66268 -254847 -542227 -512453 -353641 -323630
12477 -323630 -312528 -394201 -253129 -180200 78247 261565 31824 -380391 -190846 -75639
12467 -75639 -181200 -271340 24288 -33743 -92651 247557 500507 286286 400345 686766
12457 686766 404149 240021 110613 139513 457944 633680 541851 288236 85850 -113862
12447 -113862 -57685 -41894 192798 148407 -9333 199117 19324 -50918 -291835 -282253 -106402
12436 -106402 -206856 -21088 83870 -158062 -171905 -70894 144224 162556 277742 420201
12426 420201 219074 111778 73769 -43390 72268 -67375 -140507 31867 184478 381947
12416 381947 301789 162184 215890 -92797 -443750 -266551 177675 395350 180349 277589
12406 277589 28795 -190416 -281232 -412778 -455094 -661126 -795524 -636617 -189679 235372
12396 235372 203086 117152 -170671 -259680 -250008 -60772 -264866 -443390 -596949 -494673
12386 -494673 -266908 65888 6451 -157962 -170106 300813 34689 -1850 -162032 -401146
12376 -401146 -403146 -137185 -331293 -639000 -485233 -114838 -205770 -484163 -544325 -481975
12366 -481975 -711074 -658512 -485161 10951 89366 176477 185797 250372 67926 159708 43539
12355 43539 136950 542318 552210 215961 -45416 -217081 133111 218153 -205100 99812
12345 99812 613224 617402 403672 205693 34800 -89287 14523 92065 107342 -430719
12335 -430719 -1082069 -1177332 -638481 -475048 -541623 -543081 -196163 305083 334284 -49230
12325 -49230 -19113 37491 22509 241 -318756 -533017 -437910 -339978 -190295 -186940 -413700
12314 -413700 -249714 -96472 -7631 -224896 -118737 53383 118811 -27923 -212980 -87818
12304 -87818 -238001 119828 427384 98012 -118732 105111 50925 213684 132968 -339800
12294 -339800 -556912 -427938 4442 30768 383449 447654 375207 213095 268593 -3156
12284 -3156 -189749 10583 291895 154786 122967 563474 649346 391803 269603 180129
12274 180129 37329 159179 255225 438139 488737 458726 595372 407092 204645 260700
12264 260700 141956 -184518 -293361 -220140 -256081 -307656 -336455 -65560 336915 707402
12254 707402 455719 461799 87104 415704 822201 530484 409951 276168 427391 475842
12244 475842 137846 -12099 -67655 -96888 -61933 -51141 -183546 -317677 -456609 -330582
12234 -330582 -369465 -6283 33410 -206575 -80575 -32620 -444850 -349038 -381289 -529202
12224 -529202 -648903 -745582 -516395 -303094 -183593 -44111 52372 -26287 -147753 -250032
12214 -250032 -332917 -542145 -367525 -258369 -122502 275201 183670 -195524 109131 11677
12204 11677 -250494 -191635 -75004 -158536 -216307 -8598 108238 66860 96877 119007 -145857
12193 -145857 -193037 -57595 331194 570464 376072 -52476 -96905 89638 4143 231272
12183 231272 509265 368030 143186 -273121 -668201 -610939 -409280 -298761 -530922 -696679
12173 -696679 -746508 -951500 -721633 -161419 54793 -176144 -465283 -255629 -85150 -59802
12163 -59802 -271435 -165137 -190040 -337424 -541393 -723764 -891800 -815995 -404962 -236484
12153 -236484 -153143 -109093 -237695 -427385 -459505 -359614 -79703 -216141 -224879 -20877 240411
12142 240411 289578 158447 409757 449733 437475 275369 168969 563338 490199 -48880
12132 -48880 -264965 -16161 201386 -13214 -326224 -573826 -289577 -152807 -194348 -6510
12122 -6510 -60398 -308786 -657579 -619361 -350691 -163092 -87264 -168020 -403698 -418109 -416188
12111 -416188 -532736 -50267 218189 -47894 -172452 -65153 335472 373490 191857 -95702
12101 -95702 -74745 -116118 217678 440419 255028 85913 368220 337921 325218 334380 369641
12090 369641 245983 -110979 17009 233657 352393 190892 126283 -99422 1909 245720
12080 245720 160265 92887 86013 -84372 -232472 -252974 -192424 -360027 -427973 -281773 -76046
12069 -76046 320832 290753 153765 269307 193961 34521 -15440 29104 191309 188688 151126
12058 151126 352852 428747 49839 -179914 -76523 -488580 -388281 -141719 -308173 -287590
12048 -287590 -323803 -480213 -343889 -169805 55897 284144 649653 416606 248745 514236
12038 514236 835393 756956 228949 -299288 -369459 -69679 -65561 -157923 11893 325600
12028 325600 226976 138365 256012 423139 270711 -6738 -4544 2796 -388653 -413261 -312781
12017 -312781 -65656 213108 151038 112740 -369651 -597424 -526533 -661467 -649086 -453103
12007 -453103 -286187 18297 -97188 -15029 -27867 -236402 -178791 -53826 354334 561859
11997 561859 612213 274665 -95698 59591 180042 21961 -227127 -158294 175915 239744
11987 239744 189260 529004 736505 383009 3983 -88203 102418 33047 151861 169157
11977 169157 294719 408092 380424 415337 580673 189413 -136989 -465541 -156691 349959
11967 349959 202169 -134376 78349 3897 33714 -8383 104728 -6397 -323016 -285947
11957 -285947 80783 283871 140028 153743 101197 -48591 215415 -324622 -175012 -115516
11947 -115516 135444 -143609 -300767 -35074 228535 100023 -103651 -41736 167166 426498
11937 426498 205079 -129428 -554634 -573799 -42736 437530 339112 79014 -119837 -74058
11927 -74058 438219 621472 218930 -107157 -417151 -105582 -22258 -277445 -444172 -195521
11917 -195521 -22326 505012 51629 -74654 -117257 -314279 -562996 -690396 -741615 -693970
11907 -693970 -424643 -225738 -452782 -848298 -812467 -282362 168195 165744 332189 476783
11897 476783 372876 353545 61160 -82254 -39419 -131332 -44642 -40019 -171912 -421585 -262574
11886 -262574 71582 329339 446231 136316 -60287 -210100 -100509 -293536 -130360 -16879
11876 -16879 -13875 49529 433873 327644 292499 348043 187022 8505 -257541 -611267 -338203
11865 -338203 108025 215627 286053 333941 -36411 -146932 -62613 -207588 -220137 -373670
11855 -373670 -457633 -527776 -561925 -317438 136590 283898 87832 131561 408441 361217
11845 361217 250989 41326 -736 -111614 -285499 -337202 -110019 -422478 -488078 -40982
11835 -40982 2946 -211862 -169635 -68547 -107041 -194754 -367754 -142426 -372296 -287730 -174674
11824 -174674 7423 490738 966314 816028 244717 166950 308055 94697 119138 -87634
11814 -87634 -242116 -325575 -606571 -520831 -791304 -679123 -298054 -218745 -58297 -87332
11804 -87332 -299125 -36213 12872 -160075 -444228 -434362 -103171 338148 326379 -166867
11794 -166867 -171105 -324971 72706 246484 -63123 -34815 79054 431517 464418 197610
11784 197610 -3636 38596 63470 228608 251940 312616 405140 418064 253333 243405 15839
11773 15839 131957 41165 317867 362862 114627 -103616 -48441 78171 228207 200536
11763 200536 -80114 -10677 -171731 -206299 -290392 14132 255132 5939 -39099 117728
11753 117728 165148 54720 -137592 -314425 -297766 -59328 -74379 -17164 -166222 -416935
11743 -416935 -530678 -460309 -48424 87886 -116244 -379837 -473672 -282863 -4354 -138293
11733 -138293 -116451 297214 482462 67536 292829 462086 320201 97417 -420047 -600278
11723 -600278 -726699 -604262 48836 477831 432853 654211 662295 200968 56804 -39776
11713 -39776 15117 23119 26113 247665 398856 173469 -92806 -256353 -632378 -477298 -208360
11702 -208360 -321085 -421923 -471937 -511558 -313406 -6409 257427 239064 398531 531348
11692 531348 613224 480787 296437 308147 145156 107464 392426 520223 303879 78154
11682 78154 -206887 -142196 -306346 -123253 -228221 16003 340884 400121 -62163 -104303
11672 -104303 -170577 83953 169703 242300 239862 46345 113919 360466 124790 177477 151435
11661 151435 -208664 -177059 -61119 271230 571083 372358 326344 22487 35832 -71184
11651 -71184 80241 -6615 -204040 -195636 -88540 -308134 -472943 -664096 -389927 -99333
11641 -99333 -41417 78703 203607 -171878 -509581 -439026 -234149 -234485 -474631 -223336 -103908
11630 -103908 59445 221223 76780 -77006 175338 340642 221497 224939 98161 15650
11620 15650 219733 548873 579318 397988 64960 118143 145515 439568 326114 86369
11610 86369 51782 224684 134143 -67233 -197608 -18933 -54705 -189501 -304184 -391425
11600 -391425 -249919 -458733 -568472 -772072 -487559 -490432 -725663 -779642 -763266 -442764
11590 -442764 -386304 -52222 271661 360543 168207 -391896 -134352 272612 158226 172827
11580 172827 242743 -125235 -420711 -377630 -343271 -173106 10171 25953 -66131 -226513
11570 -226513 -216995 -211476 -225154 -69694 -112364 -85112 41623 -199477 -60414 93246 -53575
11559 -53575 -109142 210708 144634 -13135 90997 -82382 -60487 44826 227219 441532
11549 441532 574991 131333 -325383 -150105 76594 133188 332494 405337 387569 127928
11539 127928 112455 393893 267445 -20907 120390 34780 19738 -321363 -496332 -443702
11529 -443702 -318993 -220248 -160310 -417260 -164797 121348 204015 505650 467595 237967
11519 237967 522617 593085 667077 432377 254871 7245 -141461 198393 -166806 -527474
11509 -527474 -579619 -262780 98945 403361 394108 437956 515666 467512 81929 -201416 63176
11498 63176 468704 408933 321061 336455 287883 256224 66529 50611 -31118 -291563 -166679
11487 -166679 -208494 -87956 -221753 -402120 -438835 -630097 -432777 23335 221186 -22453
11477 -22453 -155976 -229588 -228372 -146516 332555 300264 -114547 39650 66235 26813 104428
11466 104428 436118 735879 734209 723060 479521 83337 61329 397954 587805 373532
11456 373532 263812 14032 13277 173155 96116 141565 154710 -71344 -169554 -209707 -157768
11445 -157768 240354 376375 79386 -244 -195335 -261403 22626 143580 78947 -108953
11435 -108953 -209391 112979 -31686 -212549 -202476 -4551 105915 66398 110907 250874
11425 250874 328871 -34031 -80998 -195282 -335922 -322891 -313218 -131885 267161 415002
11415 415002 152601 79442 385174 342828 376339 436828 272259 380219 650720 748538
11405 748538 657621 518946 42803 -52909 77309 -193513 -586190 -637582 -604259 -416760
11395 -416760 -129016 -66947 -377109 -501874 -817584 -744069 -542386 -221969 253198 241783
11385 241783 286098 256969 420677 132901 -89716 -60527 87439 65801 133876 -34552
11375 -34552 -162048 -518199 -599428 -293441 22380 289040 476584 618200 511561 40576
11365 40576 -216739 -406007 -428142 -736904 -651714 -151097 45579 37277 -242417 -346516
11355 -346516 -410319 -386517 -446883 -370683 -27371 -78397 -318977 -512087 -500504 -81881 205282
11344 205282 363638 535048 621912 445809 79403 14963 -284658 -323628 -333 -102286
11334 -102286 -219072 -263050 -560234 -210672 -125537 -142061 -520903 -383965 -627138 -969473
11324 -969473 -579488 -325920 86596 376113 465979 598883 482869 159876 264276 375200
11314 375200 346403 276849 309483 196333 81108 254805 -8505 -178522 -157959 129087
11304 129087 198117 20067 21342 -182850 -377184 -134963 -14783 197206 315598 169336
11294 169336 -275963 -344439 -163668 -115783 -30568 283076 351681 410569 -96752 -132281 31372
11283 31372 -231029 36081 27673 14337 193957 402387 297830 377397 484951 -67023
11273 -67023 -172583 -85811 46196 390132 513512 462709 20331 24831 247014 -130787
11263 -130787 -190254 121178 57776 -123796 -104667 -99575 -197340 -493500 -512651 -273092 -307900
11252 -307900 -76297 -188749 -602807 -401837 45719 73793 107262 447558 303468 474968
11242 474968 564644 258744 90636 140381 341654 585880 277072 -373776 -491658 -528057
11232 -528057 -514546 -331979 -187469 245423 396483 260207 177468 274100 99069 -204024
11222 -204024 -369167 -193429 -338684 -255935 -92719 -180255 -270353 -251864 -597097 -447663
11212 -447663 -287931 -395362 -188395 -141981 -91733 -120986 -214683 -61054 -59467 -240587 30586
11201 30586 254169 421050 200339 92833 375675 703941 593975 315506 96869 443174
11191 443174 669747 815929 591538 270421 500987 575462 441316 318593 -19890 295536
11181 295536 118624 -272530 -508403 -191942 -213 -212326 -175581 -57780 -265574 -753980
11171 -753980 -459997 -477902 -85340 209540 453087 471908 433183 440024 384791 -83571 -390582
11160 -390582 -317650 -197016 -217338 -174164 -337113 -471104 -547069 -308480 -396543 -365679 -417090
11149 -417090 -500802 -763540 -1034244 -994476 -778243 -567797 -401684 -338099 -290450 -393965
11139 -393965 -383347 -231995 -111065 -27592 249158 157258 130863 -20539 267648 549145
11129 549145 654378 676638 590249 314398 -55012 -169790 -7404 299661 464287 430106
11119 430106 -132592 -125873 161826 216335 431142 350938 203465 357808 197660 62602
11109 62602 -157703 -166951 130075 -7775 -243260 -345217 -326024 -219279 -337851 -427805
11099 -427805 -642882 -919632 -1152744 -962826 -757489 -781315 -689403 -582471 -414572 -238760
11089 -238760 34530 562283 386528 207584 178681 -9787 -80023 268792 369938 310225
11079 310225 40589 56694 195728 284333 127385 -85144 -98971 -291691 -166658 229640
11069 229640 52015 -360582 -421651 -543790 -339589 -195217 -350830 -767320 -683239 -736481
11059 -736481 -767300 -349408 -78229 -320598 -192037 -219509 -140577 -212405 -788673 -789370 -340147
11048 -340147 -10205 361244 542157 129297 -307878 -321213 -56020 316869 351665 -261917
11038 -261917 -376859 11257 151702 -112952 -491100 -607124 -551035 -502624 -412830 -45190
11028 -45190 37538 -483681 -335321 103449 234006 137872 227432 115661 -152753 -410896
11018 -410896 -210514 -159185 -288109 -454304 -385096 -371138 -110841 239007 326033 99957
11008 99957 47644 335991 344419 282231 -98232 -324026 -102965 -13694 279216 307430 291129
10997 291129 266239 33836 -135731 -316053 -571731 -375260 -793177 -814747 -537593 -216439
10987 -216439 -126011 -494901 -279700 -95512 -62748 55591 1733 -89397 -243689 -223966
10977 -223966 197799 537945 584564 661738 333336 -92782 -159999 -71947 -95952 -17968 53834
10966 53834 85008 403133 453551 215079 83578 -170585 -109495 -278985 -200739 -118427 -269685
10955 -269685 -538116 -472805 105035 348615 371785 353845 199521 116270 72891 188038
10945 188038 356577 252379 39484 118114 116563 114151 326206 433400 473263 215546 88918
10934 88918 12459 256232 477294 442820 578482 262640 -35322 -29695 -11375 477199 325338
10923 325338 284598 63368 214036 196335 420629 110257 -266183 -421996 -199845 -52858
10913 -52858 -158125 -458965 -637706 -476286 -129379 -29733 -274719 -82124 92147 -4086
10903 -4086 -127326 -248148 -594975 -723792 -406331 -190988 -289747 -365091 -185623 282565
10893 282565 220209 21302 -211248 -678706 -727637 -322141 199137 223655 -143962 -170414
10883 -170414 155216 441281 653309 478808 -45996 -399238 -499878 -70306 314534 696353
10873 696353 625478 428279 243913 263309 114151 -245115 -532544 -756927 -354280 131110
10863 131110 119064 62141 78960 126823 464655 373355 204920 -67925 -297821 -83958
10853 -83958 -204094 -285515 -354927 -479159 -289726 -285673 -222957 122142 141446 -207652 -168978
10842 -168978 -95555 67939 125876 131473 81894 -45187 -438057 -648749 -638017 -472476 -365038
10831 -365038 -145934 -133312 -52043 13696 314517 162094 22983 163234 -141248 -397640
10821 -397640 -86152 -70320 -94035 -42153 -423311 -959512 -772520 -399403 -252179 153422
10811 153422 535426 334401 -268412 -331049 -117706 54433 -262866 -414440 -237413 -265665
10801 -265665 27915 28089 63633 251006 332195 232737 222262 -133772 -135665 -30132 -204348
10790 -204348 -420193 -411871 -114063 182665 -144686 -197730 215170 439809 354920 259708
10780 259708 252570 262913 275792 34133 -67911 -7463 64795 -178039 -419417 -294207 -432183
10769 -432183 -502745 -316411 -54466 -95827 -79717 -56800 -312440 -351461 11031 108965 -279704
10758 -279704 -276491 -88722 -152240 -85063 -64317 -321158 -686471 -517001 -248445 140723
10748 140723 229096 -30016 -207780 -282974 -254623 -265958 -500921 -268545 -7740 -52812
10738 -52812 70553 605744 559726 437860 520857 488969 183781 91377 -212679 -133019 -142143
10727 -142143 -121803 -229635 -107850 190165 96259 75103 357129 549580 465280 74891
10717 74891 185308 255713 225320 -103236 -330648 -218965 -329888 -403848 -572848 -343923
10707 -343923 -15891 -208735 -173190 -325862 -511680 -101284 272654 557668 305422 436301
10697 436301 275007 -7636 -90277 290784 647345 687299 332011 124270 92923 -55218
10687 -55218 -115245 58398 -76833 -146944 -102589 -629618 -525334 -713 121898 -107541
10677 -107541 -47195 68471 31754 -386711 -418703 16633 135098 291209 341891 239824
10667 239824 66737 62399 20362 -132823 239260 367151 335043 179736 459397 484673
10657 484673 530505 124597 7046 62764 -27103 76948 68997 -132935 60694 150131 311944
10646 311944 734913 609051 373462 360138 459099 480833 461579 168171 -373322 -659346
10636 -659346 -356279 -74138 -112928 -259174 -113406 -55490 -27602 -321390 -340338 -287446
10626 -287446 -99797 -58834 -17881 -246180 -439382 -152608 -126804 -426943 -598378 -275002
10616 -275002 -25766 -84519 -43597 203925 575181 529166 313861 -208617 -258439 -216324
10606 -216324 -236303 -366747 -138993 174556 313602 -18966 4592 470619 619016 186911
10596 186911 -467609 -844604 -569338 -293765 -187751 -108590 -26190 113596 -33591 5444
10586 5444 -71709 -582766 -717609 -177102 243331 89620 -524550 -473406 -326964 -125163
10576 -125163 51002 284738 475001 650311 277550 287396 233610 167391 -17976 81368
10566 81368 501561 472872 196632 133935 5044 -53550 -64518 -4450 -209616 -155611 -142192
10555 -142192 -208575 -183259 -258613 -138890 -92383 -151035 -257161 -280259 -424847 -32781 412054
10544 412054 605011 479381 -12801 202107 434522 151103 57279 298244 252828 262202
10534 262202 191006 295549 584821 622891 374558 -126360 -446237 -346660 -119401 13156
10524 13156 -138931 -174529 82522 -56334 -6649 -85262 -71421 17031 -83589 121360 396089
10513 396089 529115 413391 106685 254834 222718 246807 79890 263647 404479 494478
10503 494478 250821 205500 101055 99877 191449 -49686 147193 86412 236039 343476
10493 343476 285467 389189 652377 592921 523838 510476 390847 412022 263214 143
10483 143 138782 87976 -83299 -93259 205743 60510 113199 230499 84668 133204 -127378
10472 -127378 -172167 -15016 42096 -191898 -287375 -132658 222074 250230 84215 71025
10462 71025 249195 139732 38868 46685 287490 510233 322250 153025 49189 58580
10452 58580 83358 248159 984959 1062141 816408 705070 288817 -47485 20388 248904
10442 248904 560648 612333 459977 129930 -212210 -133213 -19947 -58701 297926 284344
10432 284344 401705 312143 -132040 -176843 -81862 -461453 -131563 19106 315107 228893
10422 228893 211062 46969 69503 192052 251979 299725 213717 211596 139352 486123 803432
10411 803432 758088 495946 221665 -152767 -137913 -17180 -253508 -349656 -186128 53591
10401 53591 -120354 -333233 -420254 -738926 -924957 -1135395 -960628 -405084 -2479 181800
10391 181800 248728 63416 -111033 -95045 -66955 -223652 -298491 -402423 -349427 -455774
10381 -455774 -197069 -142068 -92090 -226689 -113966 -414198 -757376 -400792 164137 196016
10371 196016 -244044 -435973 -737689 -784546 -587687 -231470 -48638 -100058 -160808 -189748
10361 -189748 -393060 -190750 3378 -93922 33599 247377 324531 2685 271936 448705
10351 448705 1849 -51800 198914 719941 671032 896304 1138939 917106 986422 724996
10341 724996 320043 133673 180557 29611 -267980 -226005 -257086 -93946 -457694 -654980
10331 -654980 -469687 -271052 -451273 -659565 -290867 11553 303546 85745 100761 285969
10321 285969 30633 -333514 23697 339499 448522 183341 211052 283393 390388 275485
10311 275485 410130 360510 213933 -119876 -489216 -216477 382125 673811 763424 719405
10301 719405 170560 -350228 -467 277542 13215 -95554 24944 235745 54146 -13232
10291 -13232 -252025 -660128 -423476 -20527 137289 173363 114121 -111705 -507233 -939969
10281 -939969 -892847 -961894 -869357 -559924 -466904 -463010 -431694 -297597 -131486 -237940 -276096
10270 -276096 -433299 -221060 -177536 -420957 -591571 -392655 -184530 198811 606064 777789
10260 777789 940024 721282 449419 650317 521862 299791 246235 520805 838370 651453
10250 651453 172006 133185 327904 476472 406306 295934 62560 -80286 -91992 -47101
10240 -47101 62529 168640 86351 -367250 -414832 -507084 -254847 104833 203632 273453 176423
10229 176423 -20375 -284997 -135953 77886 158943 355212 661710 548079 392070 -9759
10219 -9759 -141853 -223654 43726 -74519 -114463 -255830 10520 297614 -64241 171564
10209 171564 352225 145289 -105598 -326004 -371948 -276091 -50873 -38799 13113 398467
10199 398467 313618 69937 -140537 -73330 146512 192367 294745 250125 259314 -123818 -209832
10188 -209832 -87565 -129197 -387780 -306201 -420562 -353029 132293 356186 101846 -84923
10178 -84923 -22314 21946 64186 -127412 -379188 -279901 -273911 -578823 -655335 -424849 -351850
10167 -351850 -337351 27342 407640 402626 432560 118708 -27448 -74538 -237696 -351178
10157 -351178 -293240 -284914 -582931 -783501 -638766 -404547 -214111 -358322 -125896 121843
10147 121843 16666 -63562 -30673 -25092 -66522 -303238 -127148 -109258 -40814 168471 213671
10136 213671 27414 257840 308693 -99520 -124048 134408 -133499 -143268 47417 206197
10126 206197 307897 241369 116596 -121488 -254195 -391766 29503 54219 29590 265600
10116 265600 456536 452432 395664 376047 -39869 208141 371920 189389 -316255 -517118
10106 -517118 -489606 -174182 54008 28749 220174 422600 198856 121576 226208 105456
10096 105456 83988 159432 -418351 -238539 27793 38407 389169 662980 657871 317963
10086 317963 24968 -501840 -411800 -204111 -191022 44343 396248 517873 350097 265596
10076 265596 258529 9642 -431978 -441658 -154867 -82423 23708 -22958 -103998 -299439 -673748
10065 -673748 -701242 -357853 -32504 449041 585053 497333 741567 956094 1520419 1983124
10055 1983124 2209768 2365527 2212879 1831782 1330594 741855 469262 346447 -23749
10046 -23749 34027 624158 442624 25981 -93204 131233 -20812 101950 240044 117122
10036 117122 18466 36706 130141 306593 315514 178328 114823 297659 -283669 -139465 -106984
10025 -106984 -184885 -512392 -294680 -61720 184334 106127 287767 436360 268746 260176
10015 260176 -67879 -184657 -143802 -130982 -224411 6377 -39547 178961 202761 -197081
10005 -197081 -348435 -423368 -169655 146112 5064 -324345 -349420 -51470 202509 -249006
9995 -249006 -135950 247953 351249 68097 111999 -93290 -223107 -455489 -743138 -618048
9985 -618048 -654708 -858682 -983941 -776502 -628662 -555407 -566605 -298185 -485284 -552588
9975 -552588 -471846 -336435 -261354 -188079 -99824 -72979 -229947 -380914 -367017 -142781 -79374
9964 -79374 -182240 -483479 -479993 -615900 -718026 -424074 -404102 -215052 -203263 -230504 -441749
9953 -441749 -612792 -566851 -165808 -314220 -759406 -729064 -625083 -244012 122155 246427
9943 246427 211099 299190 227921 -65204 144284 357025 203816 -149347 -302570 247749
9933 247749 524890 447939 240056 -140179 -140629 61232 183718 1476 -41409 -177899 -249630
9922 -249630 -309862 -423761 -508593 -617584 -758251 -602632 -113427 234866 87001 -158707
9912 -158707 -4834 171075 437213 489967 499803 180771 19439 -7496 43887 -11792 273858
9901 273858 499754 695230 681158 441872 83280 -154705 2816 75781 -33415 256518
9891 256518 255451 261160 -319401 -600828 -691769 -590604 -130016 156459 -179300 34513 336650
9880 336650 210984 -126501 215974 43115 -89911 27229 -63528 -52528 -46203 116666
9870 116666 356812 -264801 -519821 -496552 -319079 -174674 -350812 83013 561330 427832
9860 427832 -60216 -54625 94255 297009 712062 1119011 933067 386062 160813 109201
9850 109201 2398 -110124 -257834 24684 85621 40247 114939 42384 176715 303966
9840 303966 333072 341007 255679 473419 768276 398770 -77806 -42439 -233526 -353532 -595532
9829 -595532 -349420 -313982 -494968 -702919 -724873 -682434 -281452 1663 44416 167355
9819 167355 24342 -210723 61371 290538 362650 150553 -132132 69418 160353 -2403
9809 -2403 -131899 143503 360067 452861 543158 227745 139428 308310 172852 186907 144029
9798 144029 260741 473220 291792 -57175 223485 608216 697479 202261 -202511 -215923
9788 -215923 -73447 -152242 25885 296706 392425 345474 364107 421084 512940 661663 570081
9777 570081 482445 -8665 -455458 -335022 -193195 -114528 76390 396054 215175 16258
9767 16258 -131509 -257702 -546713 -573776 -490358 -211689 2989 101622 273880 681456
9757 681456 527658 603594 377042 278822 37439 -101940 256971 624764 473897 372627
9747 372627 312823 169281 -69731 99811 77677 11337 153447 575757 666516 589310 228036
9736 228036 -71266 -323150 -644 -139919 -223623 -44870 442834 191004 150252 -147900
9726 -147900 -321130 -587534 -385372 -322348 -103637 -54525 96285 171755 404746 536515
9716 536515 388705 51420 -3846 311607 554245 508280 401853 313752 6280 -328529
9706 -328529 -405271 -553346 -235142 -84273 -366128 -444091 -198577 -122077 -150812 -240063 -369207
9695 -369207 -328032 -329105 -396299 -512187 -452790 -426467 -88866 247216 19211 -346036 -119166
9684 -119166 -113869 79893 306191 461075 605182 579842 156124 -202961 -208249 23068 -40119
9673 -40119 -84657 -225091 -153212 -136305 5874 257481 555418 558876 457757 590027 359566
9662 359566 285220 -39895 -199319 269299 119686 360165 429877 32144 -142826 -188946
9652 -188946 -95973 12024 205049 344800 264942 -88485 -19009 23772 135501 -68885
9642 -68885 3578 303268 376076 257833 356111 -47803 -319552 -414726 -613086 -313593 188345
9631 188345 140933 56463 437825 642724 548675 -44480 -286782 -54533 -195724 -390844
9621 -390844 -309038 -387635 -196514 -50685 26695 218348 36558 166702 236949 18365
9611 18365 114178 441849 366910 275127 490094 408318 84146 76048 253649 466230 266772
9600 266772 227543 155058 391612 484005 628661 702368 846849 711281 136054 66156 65983
9589 65983 60459 -157739 -327565 -12524 169925 4025 191129 317782 -223266 -447035
9579 -447035 -312826 -373278 -30485 -100605 164141 571363 642744 420851 -143555 -388724
9569 -388724 -585069 -479867 -255308 -435095 -85495 -197550 -51213 281413 -41066 -102215
9559 -102215 -216931 -377843 -321380 -386818 -454023 -214490 -208867 -185790 -56358 150119 40521
9548 40521 53022 440609 301803 208540 251558 391231 277586 230806 641336 408938 331609
9537 331609 411188 3287 -560881 -606871 -481846 -233733 -40930 77048 80743 265149
9527 265149 -52491 78149 193991 228293 318818 194231 -216687 -513028 -749785 -484155
9517 -484155 -604378 -548936 -155969 -76053 -141712 -191328 -173424 -246869 -233337 -11817 194911
9506 194911 68872 220031 290940 146616 245505 94994 218174 324105 407406 47488
9496 47488 63285 258743 781698 432344 -113120 -108201 -240622 39547 296251 181985
9486 181985 54909 50885 -45584 -307643 77281 440154 653983 703415 616204 461518 568466
9475 568466 571927 389106 247640 471374 352670 -97629 -293230 -421193 -300082 -78470
9465 -78470 -17610 -66943 54993 355453 572442 322808 91291 -44462 206044 262539
9455 262539 248208 531680 444298 238035 119109 -215959 -220462 -186433 -599902 -783824 -604765
9444 -604765 -200725 -238538 -336342 -558724 -670881 -415021 -133523 -74947 6870 -220200
9434 -220200 -514909 -347621 -83660 -43012 6081 -361622 -774835 -425161 -41240 16159
9424 16159 63563 49584 218027 -1329 -358240 -280161 143215 47326 -2505 225103 124202
9413 124202 30219 85535 186058 136220 164325 -143690 -332669 -204012 -160956 15935 362896
9402 362896 550731 430146 171011 307408 459841 589429 762731 727466 506174 180879
9392 180879 83903 -214046 -357611 -449549 -102179 319806 542919 516993 209868 571285
9382 571285 385288 -96873 -460800 -292012 20490 154850 -7228 24194 230227 333131
9372 333131 281971 260850 686954 666165 342658 108825 -211901 -332240 144800 403400
9362 403400 253813 23264 -332813 -344906 162774 387900 152123 -169904 111413 309575
9352 309575 456963 92017 -107828 -45501 -53193 -19617 -35782 246895 543014 665728 331305
9341 331305 213114 150567 179468 210112 207042 -39980 -491995 -461685 52768 684615 762429
9330 762429 625956 666404 486989 531182 718482 717925 472725 734054 832436 614964 130492
9319 130492 209080 334700 267305 217806 248214 19254 77959 52180 -41095 271691 325224
9308 325224 -166533 76636 501565 594663 399471 84867 -27227 -47637 -186480 -232254
9298 -232254 -232835 -320100 11567 124373 242431 267971 698101 577481 509097 512801 333442
9287 333442 125407 133380 349768 317868 406468 291654 177875 -40161 -440057 -342539 27969
9276 27969 216453 -125577 -228687 -27854 -141640 -484007 -585354 -531143 -550601 -626976
9266 -626976 -464441 -303487 -322532 -500125 -117768 34977 -339571 -196460 -232002 -93960
9256 -93960 448834 476540 175073 470153 447899 -41214 -119624 255185 289893 331905 164334
9245 164334 289199 516473 747273 694272 325171 188326 269938 588106 980869 847737
9235 847737 521150 642479 521779 177202 336999 336787 20895 -55286 22795 10561 122336
9224 122336 168445 161368 263273 172419 200302 314589 367467 402053 206264 30843 220984
9213 220984 346154 746275 1044254 890143 1056533 1089252 588169 313417 562982 906062
9203 906062 1302003 1314431 949722 1191840 1110991 924396 349484 296679 587975 535401
9193 535401 1081724 974753 591003 345993 243138 3847 150639 486079 451515 44516
9183 44516 179609 706207 730640 915274 862529 331793 -508 378435 839269 956995
9173 956995 860193 475241 502181 586720 726070 581438 459230 660361 616987 458104
9163 458104 345531 417655 441757 313979 328773 444320 461491 441360 362213 122243 42463
9152 42463 213535 516340 618426 433134 326574 529158 246103 284790 668819 980341
9142 980341 954712 981488 1118588 903847 701521 538329 398749 247940 130777 221186
9132 221186 461554 518997 594872 511997 808937 865519 913589 1139848 1156479 1326514 1171379
9121 1171379 1030363 707827 944148 1259527 1572466 1607780 2025470 2187587 2054126 2039608
9111 2039608 2190885 2316297 2114114 2064746 1957035 2048473 2287092 2596587 2873434 2836544
9101 2836544 3096377 3194121 3534852 3743154 3604648 3593199 3967993 4536449 5200104 5507666
9091 5507666 6007588 7006270 8248173 9508688 10857738 12219673 14244071 16942169 21017578
9082 21017578 26225610 33625128 45492608 65062446 97023488 143988955 195965823
9075 195965823 232441774 240909944 220515034 173914458 120555451 81714745 57654954
9068 57654954 42486191 32605472 26032217 21640154 18527828 16282118 14280952 12710740
9060 12710740 11683478 10966624 9989212 9266804 8771220 7737882 6737515 6447167 6424336
9051 6424336 6123479 5504150 5278311 5169770 4987462 4335060 4048209 4021177 4214565 3703503
9041 3703503 3198242 2669077 2808881 2968632 3111035 2914513 2978911 2807749 2570456 2266787
9031 2266787 2084267 1900560 1690072 1596638 1215938 1281625 1526714 1688183 1436812 1165000
9021 1165000 1182856 1059726 1026453 1139868 1441458 1633369 1600712 1184833 937780 1173917
9011 1173917 1377681 1475662 1658965 1378680 1029461 1005821 941523 961736 995593 924466 965932
9000 965932 588974 556236 585206 838952 734122 882066 1003474 995805 774966 604768
8990 604768 466371 349269 359039 663743 798825 940797 996544 754591 708198 761481 580822
8979 580822 455271 151732 346974 805062 1111024 1034880 878849 1115210 1166423 738593
8969 738593 768815 947535 921621 355029 127009 106141 494499 582877 273541 307772 430555
8958 430555 359501 180690 -134001 109901 170620 121615 374657 535496 506984 755485
$$ [...]
##END NTUPLES=NMR SPECTRUM
##END=
