##TITLE=Analysis number 323802
Compound Code km
Project Code adrs
Chemist Name fudan
##JCAMPDX= 6.0         $$ Bruker NMR JCAMP-DX V2.0
##DATA TYPE= NMR SPECTRUM
##DATA CLASS= NTUPLES
##ORIGIN= Bruker BioSpin GmbH
##OWNER= nmr
$$ XWIN-NMR		Version 3.5
$$ Tue Nov  7 18:15:29 2006 GMT Standard Time (UT+0h)  MAYBRIDGE\nmr@NMR_250MHZ
##.OBSERVE FREQUENCY= 250.131544655141
##.OBSERVE NUCLEUS= ^1H
##.ACQUISITION MODE= SIMULTANEOUS (DQD)
##.ACQUISITION SCHEME= undefined
##.AVERAGES= 16
##.DIGITISER RES= 18
##SPECTROMETER/DATA SYSTEM= dpx250
##.PULSE SEQUENCE= zg30
##.SOLVENT NAME= CDCl3
##.SHIFT REFERENCE= (INTERNAL, CDCl3, 0, 16.522)
##AUDIT TRAIL= $$ (NUMBER, WHEN, WHO, WHERE, WHAT)
$$ ##TITLE= Audit trail, XWIN-NMR		Version 3.5
$$ ##JCAMPDX= 5.01
$$ ##ORIGIN= Bruker BioSpin GmbH
$$ ##OWNER= nmr
$$ C:\u/data/dgb/nmr/ADRS/2360/pdata/1/auditp.txt
$$ ##AUDIT TRAIL=  $$ (NUMBER, WHEN, WHO, WHERE, WHAT)
(   1,<2006-11-07 18:15:04.48 +000>,<MAYBRIDGE\nmr>,<NMR_250MHZ>,
      <created by zg, POWCHK disabled, PULCHK disabled
       configuration hash MD5:
       49 4B E0 1D 92 C2 6B 37 9F E6 65 BC 52 41 86 1D
       data hash MD5: 64K
       D5 B5 CF 15 67 CB 37 AE EA 31 BD 84 C4 60 C1 46>)
(   2,<2006-11-07 18:15:18.65 +000>,<MAYBRIDGE\nmr>,<NMR_250MHZ>,
      <Start of raw data processing
       ef LB = 0.3 FT_mod = 6 PKNL = 1 SI = 32K 
       data hash MD5: 32K
       BF 37 DF 3E 1F 01 2A 42 2B C6 9F 61 11 3B 2C DE>)
(   3,<2006-11-07 18:15:20.39 +000>,<MAYBRIDGE\nmr>,<NMR_250MHZ>,
      <apk 
       data hash MD5: 32K
       9F D8 F2 C3 D1 6C 0D DB 60 69 6D 0D DE 07 A4 82>)
(   4,<2006-11-07 18:15:21.25 +000>,<MAYBRIDGE\nmr>,<NMR_250MHZ>,
      <abs ABSG = 5 
       data hash MD5: 32K
       E5 15 57 A8 83 03 5E 22 7C 5F F1 3D AB 81 01 B4>)
$$ ##END=
$$ 
$$ hash MD5
$$ 6B 91 94 B8 10 FE 07 54 E9 BE 0A 25 D0 86 7E 78
##$RELAX= 
##$RELAX= 
##$RELAX= 
##$RELAX= 
##$RELAX= 
##$RELAX= 
##$RELAX= 
$$ Bruker specific parameters
$$ --------------------------
##$DU= <C:\u>
##$EXPNO= 2360
##$NAME= <ADRS>
##$PROCNO= 1
##$TYPE= <nmr>
##$USER= <dgb>
##$AMP= (0..31)
100 100 100 100 100 100 100 100 100 100 100 100 100 100 100 100 100 100 
100 100 100 100 100 100 100 100 100 100 100 100 100 100 
##$AQSEQ= 0
##$AQ_mod= 3
##$AUNM= <au_zg>
##$AUTOPOS= <32 >
##$BF1= 250.13
##$BF2= 250.13
##$BF3= 250.13
##$BF4= 250.13
##$BF5= 500.13
##$BF6= 500.13
##$BF7= 500.13
##$BF8= 500.13
##$BYTORDA= 1
##$CFDGTYP= 0
##$CFRGTYP= 5
##$CHEMSTR= <none>
##$CNST= (0..31)
1 1 145 1 1 1 1 1 1 1 1 1 1 1 1 1 1 1 1 1 1 1 1 1 1 1 1 1 1 1 1 1 
##$CPDPRG= <>
##$CPDPRG1= <>
##$CPDPRG2= <>
##$CPDPRG3= <>
##$CPDPRG4= <mlev>
##$CPDPRG5= <mlev>
##$CPDPRG6= <mlev>
##$CPDPRG7= <mlev>
##$CPDPRG8= <mlev>
##$CPDPRGB= <>
##$CPDPRGT= <>
##$D= (0..31)
0 1 0 0 0 0 0 0 0 0.06 0 0 0 0 0 0 0.0002 0 0 0 0 0 0 0 0 0 0 0 0 0 0 
0 
##$DATE= 1162923302
##$DBL= (0..7)
120 120 120 120 120 120 120 120 
##$DBP= (0..7)
150 150 150 150 150 150 150 150 
##$DBP07= 0
##$DBPNAM0= <>
##$DBPNAM1= <>
##$DBPNAM2= <>
##$DBPNAM3= <>
$$ [...]
##$SUBNAM7= <"">
##$SUBNAM8= <"">
##$SUBNAM9= <"">
##$SW= 20.6930455092707
##$SWIBOX= (0..15)
0 0 3 0 0 0 0 0 0 0 0 0 0 0 0 0 
##$SW_h= 5175.983436853
##$TD= 65536
##$TD0= 1
##$TE= 683.16
##$TE2= 300
##$TE3= 300
##$TEG= 300
##$TL= (0..7)
0 120 120 120 120 120 120 120 
##$TP= (0..7)
150 150 150 150 150 150 150 150 
##$TP07= 0
##$TPNAME0= <>
##$TPNAME1= <>
##$TPNAME2= <>
##$TPNAME3= <>
##$TPNAME4= <>
##$TPNAME5= <>
##$TPNAME6= <>
##$TPNAME7= <>
##$TPOAL= (0..7)
0.5 0.5 0.5 0.5 0.5 0.5 0.5 0.5 
##$TPOFFS= (0..7)
0 0 0 0 0 0 0 0 
##$TUNHIN= 0
##$TUNHOUT= 0
##$TUNXOUT= 0
##$USERA1= <user>
##$USERA2= <user>
##$USERA3= <user>
##$USERA4= <user>
##$USERA5= <user>
##$V9= 5
##$VALIST= <valist>
##$VCLIST= <CCCCCCCCCCCCCCC>
##$VD= 0
##$VDLIST= <DDDDDDDDDDDDDDD>
##$VPLIST= <PPPPPPPPPPPPPPP>
##$VTLIST= <TTTTTTTTTTTTTTT>
##$WBST= 1024
##$WBSW= 4
##$XGAIN= (0..3)
0 0 0 0 
##$XL= 0
##$YL= 0
##$YMAX_a= 532756
##$YMIN_a= -327774
##$ZGOPTNS= <>
##$ZL1= 120
##$ZL2= 120
##$ZL3= 120
##$ZL4= 120
##$ABSF1= 16.522
##$ABSF2= -4.171173
##$ABSG= 5
##$ABSL= 3
##$ALPHA= 0
##$AQORDER= 0
##$ASSFAC= 0
##$ASSFACI= 0
##$ASSFACX= 0
##$ASSWID= 0
##$AUNMP= <proc_1d>
##$AZFE= 0.1
##$AZFW= 0.1
##$BCFW= 0
##$BC_mod= 0
##$BYTORDP= 0
##$COROFFS= 0
##$CY= 12.5
##$DATMOD= 1
##$DC= 0
##$DFILT= <>
##$DTYPP= 0
##$F1P= 14.0000005364418
##$F2P= -0.99999901652339
##$FCOR= 0.5
##$FTSIZE= 32768
##$FT_mod= 6
##$GAMMA= 0
##$GB= 0
##$INTBC= 1
##$INTSCL= 1
##$ISEN= 128
##$LB= 0.3
##$LEV0= 0
##$LPBIN= 0
##$MAXI= 10000
##$MC2= 0
##$MEAN= 0
##$ME_mod= 0
##$MI= 0
##$NCOEF= 0
##$NC_proc= -3
##$NLEV= 6
##$NOISF1= 0
##$NOISF2= 0
##$NSP= 0
##$NTH_PI= 0
##$NZP= 0
##$OFFSET= 16.522
##$PC= 1
##$PHC0= -44.18624
##$PHC1= 12.94222
##$PH_mod= 1
##$PKNL= yes
##$PPARMOD= 0
##$PSCAL= 4
##$PSIGN= 0
##$REVERSE= no
##$SF= 250.13
##$SI= 32768
##$SIGF1= 0
##$SIGF2= 0
##$SINO= 400
##$SIOLD= 32768
##$SREGLST= <1H.CDCl3>
##$SSB= 0
##$STSI= 32768
##$STSR= 0
##$SW_p= 5175.98343685301
##$SYMM= 0
##$S_DEV= 0
##$TDeff= 65536
##$TDoff= 0
##$TI= <Analysis number 999999
Compound Code 99
Book Reference 9
Project Code 9>
##$TILT= no
##$TM1= 0
##$TM2= 0
##$TOPLEV= 0
##$USERP1= <user>
##$USERP2= <user>
##$USERP3= <user>
##$USERP4= <user>
##$USERP5= <user>
##$WDW= 1
##$XDIM= 32768
##$YMAX_p= 458505954
##$YMIN_p= -253081
$$ End of Bruker specific parameters
$$ ---------------------------------
##NTUPLES= NMR SPECTRUM
##VAR_NAME=  FREQUENCY,     SPECTRUM/REAL,   SPECTRUM/IMAG
##SYMBOL=    X,             R,               I
##VAR_TYPE=  INDEPENDENT,   DEPENDENT,       DEPENDENT
##VAR_FORM=  AFFN,          ASDF,            ASDF
##VAR_DIM=   32768,         32768,           32768
##UNITS=     HZ,            ARBITRARY UNITS, ARBITRARY UNITS
##FACTOR=    0.157963299565203, 1,           1
##FIRST=     4132.6476996994, 0,             0
##LAST=      -1043.33573715361, 0,           0
##MIN=       -1043.33573715361, -253081,     0
##MAX=       4132.6476996994, 458505954,     0
$$ Real data points
##PAGE= N=1
##DATA TABLE= (X++(R..R)), XYDATA
$$ [...]
22464 -79056 -31594 -29080 -1907 -28566 -25815 18529 14067 36326 3443 37158 16076 14864
22452 14864 10428 3663 14964 -26423 -49293 47107 51980 -19457 -26829 22262 -11360 -27185
22440 -27185 -18942 -2031 -20145 -48790 12249 24284 -64697 -75845 39590 75805 63609 41966
22428 41966 -11385 -30417 -25424 -76764 -63254 -24364 36798 42086 -24331 -65332 -9389 22390
22416 22390 28659 26034 48621 69147 126739 141990 177817 128999 46856 19502 19557 -29108 -9684
22403 -9684 6411 -12056 -21365 -39972 -35930 -23774 -10569 -41280 -50387 -94602 -168299 -253081
22391 -253081 -183409 -107336 -104690 -138009 -130704 -107976 -117582 -122766 -161711 -141824 -73959 -97495
22379 -97495 -130448 -136748 -144196 -63049 -44280 -52379 24249 588 -116287 -54400 -7019 -34016
22367 -34016 -21709 -40530 -139956 -143117 -43088 -1337 11135 -10793 -63139 -81300 15284 81732
22355 81732 49841 -5253 -27450 -34026 10476 45748 18842 50852 -15724 -8292 -2978 -50720
22343 -50720 -2085 34256 -36593 -100132 -117702 -144009 -77945 -50030 -97700 -36107 21038 -4019
22331 -4019 -21894 -13140 -74740 -30887 -41056 -79561 -70982 -27156 36516 18573 -27282 -5667
22319 -5667 18270 25109 13708 2865 -9876 -29903 -40001 -2606 -22742 -89825 -115716 -73325
22307 -73325 25989 73151 43836 -39565 -1560 20410 37949 14611 8140 -26161 -68886 -71773
22295 -71773 -89055 -107 19695 -40440 8891 23516 61157 62241 -17406 -50303 -42340 -40430
22283 -40430 -84240 -34828 -61853 -83715 -101791 -101717 1576 68109 83188 -7272 -2128 26618
22271 26618 22739 -7882 -33889 -17096 63115 69775 78107 114959 92150 52653 8449 25623
22259 25623 14122 5040 435 -13618 -43723 -61813 -26801 -14472 15367 60654 71611 8722
22247 8722 32763 32590 25597 14853 43866 37511 3234 -29367 -4427 3381 -59391 -102538 -51351
22234 -51351 70 16520 52653 87543 72648 8128 -10601 -44434 -17370 -3319 -67383 -110749
22222 -110749 -62717 -56482 -80903 -75123 -137894 -125494 -96267 -54121 -17888 -19544 -32240 -52797
22210 -52797 49229 81831 122768 27813 -53109 -68408 -93406 -43280 -4542 7271 -5052
22199 -5052 16630 19724 49831 81703 30492 -59420 -55148 -32886 -47911 -83895 -50884 -42615
22187 -42615 -32920 7972 45184 23176 73372 94939 32260 -15429 776 72691 108293 94057
22175 94057 86583 117003 145214 130079 101064 37807 -50103 -100174 -135882 -82022 -25380 -25399
22163 -25399 -68983 -45781 -52358 -24232 -11751 -35955 -8338 39843 -76457 -145049 -170125 -113353
22151 -113353 -71388 -41961 -35836 -40194 -5896 15368 1579 897 -26104 -149060 -165306 -119728
22139 -119728 -152085 -176909 -155723 -131002 -77823 -69489 -72823 -89318 -101934 -62067 -55055 -93355
22127 -93355 -67006 -6261 51465 81602 99317 113950 10818 -12763 9258 -9348 -26492
22116 -26492 -56293 -107296 -70972 -82752 -103842 -92299 -112155 -167828 -176529 -95245 -43199 33954
22104 33954 -4307 -77956 -34458 -51578 -87258 -49518 6034 -25448 15864 62860 28121 -4918
22092 -4918 40996 -17342 -107366 -106992 -95545 -51455 -23651 -68405 -88566 -116991 -45399 18660
22080 18660 69028 82681 58214 -31895 -105809 -113174 -141043 -87228 -56431 -96288 -34521 52356
22068 52356 32366 -13888 -44283 -11142 -9172 -1575 61722 129826 159592 172418 104652 -17345
22056 -17345 -47506 1372 8363 -16954 30885 33564 -60444 -46445 -60717 -66884 3446 68006
22044 68006 90272 47442 -14355 -8691 -3336 -36269 -46593 -62940 -64090 10347 15215 28735
22032 28735 35288 -7569 -29504 -71274 -110266 -81336 -78827 -56794 -33901 -50004 -22261 -66730
22020 -66730 -37626 7956 41854 44271 71755 102284 87424 58829 59740 63080 51796 49448 -5606
22007 -5606 -19974 -58953 -90201 -22110 -6970 -38009 -1724 38492 24105 -15154 -2968 -2253
21995 -2253 12358 -62974 -85806 -33390 20993 38192 6553 -56756 -92282 -53823 27551 9713
21983 9713 -45400 -85277 -34843 -42095 -52237 -102885 -150393 -84731 -39511 -16546 -17593 -57708
21971 -57708 -82232 -48134 5058 -767 -69791 -107540 -129469 -92828 -81450 -62179 -62110 -68412 -50009
21958 -50009 -69580 -27543 22937 -13856 -44939 -7851 73090 63097 -41295 -53157 -22708 18626
21946 18626 77451 -1993 3235 -50102 -95831 -140390 -156367 -159132 -108657 -62194 -13499 -15025
21934 -15025 31869 2810 16213 12967 51374 54908 93278 42950 14064 28573 -17882 -4167
21922 -4167 51081 36050 4671 -2973 -21749 -38708 -26859 -24285 9409 41494 -2942 -30913
21910 -30913 13644 3487 991 -32805 -96308 -125086 -119358 -38113 -58945 -55400 -47232 -29680
21898 -29680 32228 75987 64065 41888 4159 -56767 -83546 -61806 -69508 -115330 -89594 -55489
21886 -55489 -88693 -109942 -65288 11954 65624 39336 -13368 34654 55882 43150 443 -34886
21874 -34886 -95019 -95580 -76351 -127824 -155732 -154281 -137152 -106891 -79835 -97148 -103238 -98338 -84014
21861 -84014 -117866 -122228 -48716 -60241 -82009 -47946 -55873 -30173 -67723 -54485 33837 36658
21849 36658 -4093 -3686 15281 -5835 -56749 -48564 -31718 -14176 -52202 -53645 -71947 -106740
21837 -106740 -94273 -59221 -5609 -22175 943 53541 46105 18445 -27223 -65293 -25121 -50056
21825 -50056 -69716 -178222 -236899 -128571 -53140 -62639 -20529 -71366 -111329 -83254 -30086
21814 -30086 -46366 -66104 -75930 -65095 -84507 -28924 -43730 -18269 12729 51929 95583 87180
21802 87180 76221 42262 -5031 -51826 -54314 -11653 -5287 1 37974 88589 118568 121062
21790 121062 134070 88232 -2960 -7659 63032 51861 39292 45593 77712 -1820 -27152 -19786
21778 -19786 -34267 5218 18883 -31956 -8198 19718 -14199 -64526 -81097 -61301 12211 16631
21766 16631 -13180 7788 3206 -86498 -107035 -63289 6993 58699 99464 20389 -12727 -11264
21754 -11264 10493 -452 410 99158 78382 27090 6191 16370 -48650 -48309 -55799 -61644 -26677
21741 -26677 21886 80939 34162 17747 98354 109031 49451 61842 55340 -36861 -81537 -9378
21729 -9378 37015 28860 8828 41170 123990 177462 150820 124498 201561 238252 171325 106159
21717 106159 145664 141876 69816 22344 -10904 19170 47720 72164 14117 5169 57921 83951
21705 83951 76660 7575 -28095 21152 87186 98311 62615 -13154 -22726 49788 3134 -90519
21693 -90519 -108458 -97064 -44428 -16556 -114318 -99100 -42401 -41780 3023 -15218 9199 11003
21681 11003 -93922 -105188 -86938 -60972 -47186 -66394 2207 28241 42096 -15282 -83203
21670 -83203 -69849 -14226 2337 40496 30925 2869 669 -23580 -27036 -49041 -24939 67442
21658 67442 49537 69246 63301 65000 33677 -14226 -102935 -102082 -103029 -38207 51394 112155 93383
21645 93383 69192 70818 35678 -13809 -21165 9359 -71841 -92611 -106750 -57677 -82911 -115644
21633 -115644 -92628 -80959 -75277 -98098 -54441 -11573 -15474 -17381 -4068 3466 4886 29490
21621 29490 125392 105658 59749 -1071 -46676 -11702 73626 134737 42501 636 25442 14222
21609 14222 -51003 52985 85163 66022 42834 -70645 -29704 8348 2780 35745 66165
21598 66165 42042 -21191 -94800 -94833 -44220 -95169 -135525 -77702 23118 58554 57971 41945
21586 41945 -5708 24008 48563 17384 -9854 -11154 -77621 -115122 -108479 -61690 -46513 -20155
21574 -20155 -36611 -60530 -68115 -39785 -65088 -53814 5678 -18459 53153 108156 80300 108042
21562 108042 74333 -19085 -44571 -32195 -9861 -47136 -129116 -110911 -125847 -140962 -57618
21551 -57618 76522 98050 116514 148216 109198 33244 11724 986 16953 74536 69830 -19714
21539 -19714 -68763 -57543 -8792 -7262 -33778 -86238 -58286 3713 14037 -26289 -56780 -48712
21527 -48712 -89854 -66584 -78654 -80609 -25125 -3791 -12848 -43608 -42105 -21882 37015 -11574
21515 -11574 -66915 -72093 -66804 -54210 -30257 -417 42159 84910 56394 67808 37770 61316
21503 61316 66058 58518 77422 48899 -10785 -28415 -15317 -31277 -42406 1197 50376 81823
21491 81823 83641 85735 101454 37195 8058 -5251 -20471 -23084 -881 -49992 -138213 -157747
21479 -157747 -162314 -171130 -148363 -54907 4825 -83575 -73533 -23757 -27203 -33196 -16310 -2846
21467 -2846 -1006 10365 19153 3742 -11160 -16997 -31410 -88614 -118667 -104798 -87811 -17565
21455 -17565 -27187 -47452 24943 48919 61377 85109 59443 48218 66200 131737 41158 -67777
21443 -67777 -88770 -68677 -51667 -41944 9919 -6076 16041 8901 -89702 -138300 -98710 -43632
21431 -43632 -57877 -59932 -38124 39481 58936 2793 -75346 -109249 -154860 -76769 -39706 -95830
21419 -95830 -84707 -28528 31571 16023 -33971 54756 149486 136494 138378 96239 -25613 31769
21407 31769 30323 25393 -7249 -86269 -58082 -13920 -32770 -16821 -44942 -33872 -51366 -72696
21395 -72696 -112151 -80645 -66338 -23465 26174 59892 80266 22265 -16673 -80269 -107383 -74812
21383 -74812 -33374 -50030 -23862 24028 -22452 -49201 -59916 -110907 -69938 10403 -5799 -47361
21371 -47361 -81584 -39814 9930 14869 32352 87219 45911 23356 4474 -31030 -53858 -83314
21359 -83314 -90743 -141379 -135065 -55850 -48471 -56934 -65855 -132010 -127190 -155083 -163840 -151847 -134614
21346 -134614 -75087 -15318 5191 -24961 -97201 -71874 -5429 -6033 20340 -22320 -15303 38878
21334 38878 61514 -14397 -60234 -59940 -38844 -4986 -13000 -42016 -25823 -12030 53894 14698
21322 14698 -69542 -154205 -128409 -48384 -2829 50300 40041 32728 103118 76285 53082 -6164
21310 -6164 -27740 -45432 24568 4883 -39824 -71083 -75461 -94784 -98767 -80189 -55126 -18071
21298 -18071 -16008 -53390 -92530 -34007 3675 -20801 -12144 7802 -24892 -64206 -58824 -35976
21286 -35976 -57917 -21607 -32858 1333 1881 56297 24002 -39661 2446 23239 -17525 -136745
21274 -136745 -139004 -68477 -47146 -48633 -58506 -26242 -86538 -107427 -65366 -40485 -84256 -91022
21262 -91022 -56608 -41308 -63492 -117530 -176851 -151346 -69682 -1747 31757 -1894 -22678 6753
21250 6753 -23038 -7458 17179 -2538 -48615 -59983 -21867 -10320 -23139 -17435 8397 -18478
21238 -18478 -25047 -11449 20878 78993 67880 33353 8668 45479 2253 -56882 -64772 -9924
21226 -9924 -21523 -11691 30556 63876 19812 -64919 -81792 -45624 -53117 -88888 -103110 -119136
21214 -119136 -66340 -102397 -161597 -103568 -20837 9552 -25760 -17022 51055 29022 -16894 -26880
21202 -26880 -18917 -16417 46438 26882 -48305 -78364 -58148 -30460 -39814 -21904 -23163 56157
21190 56157 21894 36951 20036 -8075 26536 142329 134299 27672 -7288 3672 -24670
21179 -24670 -23894 -17636 -70679 -42565 22009 40187 40124 11440 -22566 -22137 5292 -11539 -33476
21166 -33476 -65584 -68765 -16290 -23250 -39416 -57352 -104363 -67551 -52592 -36942 7966 69498
21154 69498 52067 8798 -38447 -84431 -43478 6882 63724 77118 4158 -3330 -12742 -53952
21142 -53952 -68407 -2073 26430 -14314 -37643 22953 124688 185709 143724 94160 81133
21131 81133 43424 30962 44014 49660 65490 42189 43135 33348 92609 167170 143401 58378
21119 58378 12277 50718 22439 21429 40090 28115 76240 100972 77986 43386 5180 26554
21107 26554 7159 11356 35091 51572 57862 43650 30004 -20014 -89501 -105819 -119581 -131651
21095 -131651 -133033 -126334 -82977 -36222 -50863 -48347 -78103 -84900 -75057 -58435 -73001 -76162 -70347
21082 -70347 -104697 -69913 -69355 -29995 18705 -16302 -30272 10658 9698 9668 96423 127059 53999
21069 53999 -15696 -60370 -120829 -77075 -49913 -101474 -141104 -159001 -65666 -55712 -101996 -81697
21057 -81697 -50126 -58230 -10414 7607 48558 132939 54719 -2620 44871 11729 -40015 -77839
21045 -77839 -57613 4380 51794 -3566 -84470 -145113 -133389 -72362 16868 30179 -1708 7824
21033 7824 -18425 -63242 -119223 -140640 -47921 -39188 -53614 -58743 -116080 -87666 -40209 -16320
21021 -16320 -31905 -117658 -139937 -111545 -87263 32192 51031 -48939 -102011 -106714 -92844 -96788
21009 -96788 -121807 -89180 -19250 837 -34859 922 39100 36294 14190 18287 -5258 -9108
20997 -9108 34921 -13591 -100145 -71520 -75651 -61442 -59747 -89232 -60987 -47159 -12724 -40400
20985 -40400 -85664 -81639 -47929 -26303 -9009 -10359 -45128 -51992 -22950 -49531 -84778 -87625
20973 -87625 -139613 -65136 9593 -13871 42088 89292 55260 55144 82822 80363 19020 -40808
20961 -40808 -73011 -46702 4553 -19872 -49253 -46738 -53415 -16608 24954 48646 54204 119531
20949 119531 154642 77461 24016 15617 3956 4051 -4766 6607 -28503 -21065 18817 84951 56461
20936 56461 25914 -79058 -89161 -32405 105696 105041 82542 49424 32421 60603 35287 31097
20924 31097 -10279 -72099 -58104 4977 18613 28590 101895 137414 82491 54560 -32662 -83711
20912 -83711 -56649 -99821 -43878 -18287 9998 60775 51801 50426 55563 59103 30327 49766
20900 49766 42320 31016 62333 89321 50559 23024 26465 -1435 -69844 -43270 -38115 35840
20888 35840 1147 -62813 -92514 -98538 -99116 -49698 -31861 -2136 34336 16426 49660 69959
20876 69959 80951 9758 -73321 -45807 -16015 55795 52580 74650 55646 86461 139281 98899
20864 98899 39870 45086 99437 55667 -12321 -4127 -15694 -55637 -53938 -46048 -1432 68841
20852 68841 57702 16462 14480 88597 54288 27989 27449 -26412 -65055 -62085 -54670 -48344 -72564
20839 -72564 -89401 -140482 -183557 -182567 -126470 -142122 -150769 -97593 -82360 -123976 -88951 -17443
20827 -17443 20875 17169 -83203 -110034 -86561 29258 -22593 -75320 -62103 -55534 -38688 -14150
20815 -14150 -20341 -26219 -4049 -42880 -94542 -50751 -68650 -58848 -28362 -73102 -46715 53174
20803 53174 95111 107661 105118 109002 119403 190295 197219 174676 121693 103191 6916 -11422
20791 -11422 34090 8942 -134437 -99128 -9718 -41889 -54039 -56680 -35794 59476 85628 13289
20779 13289 3478 15038 25638 44573 78860 39289 -24476 -17048 -31965 -99966 -63361 -75806
20767 -75806 -52327 17 -19240 5213 7718 -29423 -17650 3301 18967 12969 37576 107392
20755 107392 108544 129850 29083 39374 79677 73383 134148 90287 99766 67558 -1242 -16488
20743 -16488 -18457 -27733 -31096 10689 25835 -14859 -99589 -92586 -84262 -81328 -53254 -36698 -22228
20730 -22228 30261 3621 -9509 2750 26096 -9389 -79069 -172552 -152393 -28446 32090
20719 32090 -3190 -37881 -42286 -7388 11978 27732 19820 -27260 -41502 -9279 1257 50753
20707 50753 82254 68615 -11594 -14232 -41654 -38410 -34532 -28961 18156 -12688 -121945 -100009
20695 -100009 1620 31796 51842 65596 55310 -5131 -72936 -25826 -93670 -102220 -72023
20684 -72023 -11236 11759 -16269 -29902 -39061 45435 103008 117849 41033 3700 37832 22967
20672 22967 13901 35095 78982 78850 64937 61008 3410 -65882 -69170 17276 12888 3649 -19987
20659 -19987 -49561 -65413 -24946 -41839 -37079 -852 30744 -15508 -1276 49538 11711 -48016
20647 -48016 -10108 60290 36641 35378 50165 5276 -15027 15572 8013 62937 109381 46603
20635 46603 9163 17760 60104 30037 -6743 -42191 -70685 -7496 -1838 1933 -37732 -21623
20623 -21623 -56592 -71248 -77112 -92949 -73899 -46687 18792 22812 -54031 -133771 -128246 -136157
20611 -136157 -116290 -70154 -51315 -61488 -120933 -89709 -77290 -23345 -8803 8890 15029 -192
20599 -192 -54300 -95886 -104694 -120489 -120606 -64717 7997 42151 77798 80498 86550 98581 64974
20586 64974 8648 -49471 -101046 -62096 -15320 13965 84717 50315 -16986 3292 54899 57194
20574 57194 -33532 -72481 -45870 -61415 -26852 -55554 -151442 -81940 -7494 -1788 -22812 52305
20562 52305 60847 2588 -80152 -67862 -20060 37632 32617 62495 52422 89842 61965 27773
20550 27773 -1697 -21092 11502 -17041 -6872 2695 -3201 -36004 -89822 -83999 -70407 -44171
20538 -44171 -70111 -39611 -10622 -84944 -117618 -94571 -109712 -101692 -42206 29655 56527 68034
20526 68034 78932 84545 48107 30790 -2222 -14326 -55058 -41634 -32476 9681 17700 3093
20514 3093 43910 19025 -12018 39589 76279 81474 56669 -60196 -84374 -30010 -27233 -24210
20502 -24210 -56483 -101916 -97258 -30349 66310 84982 65741 79594 78896 21373 19276 68594
20490 68594 15462 -9743 -104389 -118592 -111251 -62011 15625 78702 98180 96512 84547 50259
20478 50259 51382 38374 35821 48336 81826 109635 140744 84623 38784 -6026 -22346 -66080
20466 -66080 -93783 -39506 9428 23759 -5679 65815 106717 75946 51823 37846 30294 -13087
20454 -13087 -47306 -108373 -125611 -88696 -21823 -23126 -10721 -47944 -81359 -70775 -28420 28599
20442 28599 35585 43669 106438 54338 -56591 -56945 14933 -5949 -116961 -196133 -206448 -189023
20430 -189023 -128662 -29135 9148 -15658 3938 54068 -34837 -110741 -65756 -46957 -74525
20419 -74525 -27055 -24806 -15636 -6636 14578 52589 25896 11705 -17514 -37997 -44908 43319
20407 43319 128131 95087 57957 24667 18914 37678 6391 8810 10480 81176 10502 -79249
20395 -79249 -130411 -114372 -110906 -88344 -73206 -82204 -95445 -87967 -55381 -37829 -15692 19495
20383 19495 35513 52044 40871 67439 111393 111804 57644 -36802 -40423 51609 141379 195311
20371 195311 113783 48526 59377 84591 131591 79442 -7228 5330 44982 81816 107606
20360 107606 68081 33663 61541 73323 69532 72462 10662 53408 107751 134840 137405 108841
20348 108841 63347 114004 120316 41634 29947 -2359 1028 36262 34319 3578 -49893 -37215
20336 -37215 -64282 -34511 -27288 24257 29903 -23471 -19521 -27452 34600 52125 -60439 -44027
20324 -44027 16760 55319 88594 105236 101566 78506 89040 10135 23457 82180 62751 38269
20312 38269 -44121 -41663 55394 51679 26881 23866 -27837 -54280 -63121 -61245 45895 63603
20300 63603 91224 134451 172885 133222 40689 -72550 -73672 -88282 -107209 -109245 -85686 -24992
20288 -24992 43232 -992 -47532 -53491 -34075 36136 25871 -39530 26866 71716 69594 29887
20276 29887 -346 -59760 -93880 -78750 57292 85483 80276 115795 59915 46859 23267 97982
20264 97982 115718 128916 127414 151193 51671 -17881 -17540 -22669 -41775 -64262 -43359 -60465
20252 -60465 -63102 -22795 15349 20822 40347 53233 66381 66569 66740 124889 91947 98800 96619
20239 96619 56096 5289 38523 49639 87209 105212 57102 -14350 -9477 104544 125830 64385
20227 64385 26728 37277 70463 55095 17858 51460 142299 157290 127585 67823 18389 28195
20215 28195 39486 76693 40247 37040 133121 145071 107981 95397 130600 112894 41654 32943
20203 32943 103219 122711 133151 194858 219470 165281 168708 231887 227354 188278 157943 75610
20191 75610 106674 205088 185118 206240 183731 176128 187309 147906 136804 158411 179597 192656
20179 192656 212559 203257 225007 198184 200174 254749 251513 278543 309987 290248 242735 242863
20167 242863 241428 164056 145793 124066 151726 226967 204502 242965 270076 266671 259736 217512
20155 217512 138954 53822 56981 55754 63548 98428 107167 60393 56164 -920 4533 27767 11521
20142 11521 -13227 40687 56507 39026 63240 -11329 15952 5703 87348 118543 85044 65445
20130 65445 71696 101768 77455 56476 65037 38541 41306 93260 115146 68734 53741 65560
20118 65560 37038 38752 -19003 48122 97079 62305 14900 32825 92135 108723 111240 99597
20106 99597 43544 34316 6901 12197 59980 98589 98022 53485 3220 41402 74581 77065 59631
20093 59631 67342 140213 149860 140030 141890 116616 59186 87972 104110 25847 -25920 37906
20081 37906 29059 69496 82291 60235 57695 18275 -36701 -28346 -30203 -10065 6463 28140
20069 28140 61731 90778 54433 -61066 -49331 -47486 -24618 -81979 -87541 33518 96675 73851
20057 73851 59947 38270 -29284 -30319 -5270 23612 56312 15403 49793 40860 46440 110722
20045 110722 138500 125589 153000 195933 172294 96695 -20294 -53914 -8444 40948 34654
20034 34654 603 39910 113912 143825 98700 153249 172582 153128 257808 319543 261842
20023 261842 271549 292028 295458 243532 244747 210430 144271 101532 80311 13146 32842 87494
20011 87494 128147 181830 329603 350738 252693 195176 211143 178030 106824 88041 165648
20000 165648 191337 156037 105168 92653 99532 109310 116450 132581 124486 113813 145356 209076
19988 209076 213548 168052 149543 141671 79133 44475 101038 138138 160061 155330 215085 289904
19976 289904 261397 225328 225564 251754 316113 363909 426985 385947 268169 176266 82255 86067
19964 86067 128910 168357 155667 201656 271920 311283 335813 386074 385323 327653 344974 363245
19952 363245 290522 197027 154097 237299 194731 127142 68865 112913 151743 138260 203968
19941 203968 162242 145310 126235 174107 164375 125550 37823 55195 65544 -1522 -6314 59048
19929 59048 128929 84812 59750 129151 102240 103659 117283 129721 102029 70341 91162 114930
19917 114930 181143 209152 179118 182331 200757 177385 91448 78742 121815 142386 70173 16227
19905 16227 68288 81453 121164 159669 136854 84132 105710 63837 99531 152032 108382 62129
19893 62129 74079 66136 78767 189448 231535 198933 185584 192041 233236 94534 41738 29134
19881 29134 63699 124520 144205 115791 124241 119541 109020 144765 201271 232568 231429 160480
19869 160480 136023 108476 116350 88650 82433 114835 177033 215031 210593 220030 204031 230927
19857 230927 203679 175392 263137 283090 226916 311463 380304 281237 165144 155894 139751
19846 139751 120306 106361 142143 207723 196418 188868 206315 124346 140663 195871 176294 224154
19834 224154 196855 184642 209799 175200 159099 197260 210994 163986 173361 188487 189859 213268
19822 213268 222023 222588 279094 293535 327446 268327 188939 159951 153601 127317 84257 225631
19810 225631 344402 346442 308695 268870 297695 295133 256204 186840 141355 150799 171335 143819
19798 143819 105545 140919 177942 235798 260799 247544 283853 305467 313740 361177 298258 217828
19786 217828 216952 254414 256937 249318 228366 219266 293309 348696 326279 268023 318360 389603
19774 389603 408637 369488 371297 387137 431149 493430 483250 469074 410725 390357 345007 280688
19762 280688 276161 310482 325984 291727 267249 316098 367243 321236 286560 319654 329275 311094
19750 311094 283655 286024 322283 326893 421183 462839 482512 515898 545974 559938 489614 473641
19738 473641 487087 477741 449417 474640 473810 513958 583064 567782 445019 442391 390123 348067
19726 348067 316342 391474 470252 475962 450548 502423 534088 559351 591586 586935 603996 745366
19714 745366 758822 684346 671224 708842 731268 746826 656239 723778 704674 741336 806227
19703 806227 794060 790505 809648 832354 834050 852522 872828 902259 989397 1036615 1060444 1092711
19691 1092711 1193428 1305395 1407280 1430971 1440265 1417356 1384298 1346706 1431618 1583261 1748752
19680 1748752 1840931 1838861 1827224 1931772 2062399 2250763 2376851 2508095 2659824 2797332
19670 2797332 2964875 3120425 3180755 3385907 3632236 3906880 4118865 4401719 4860574 5354068
19660 5354068 5954281 6739952 7699096 8891450 10475374 12637582 15394088 18782463 22708499
19651 22708499 26772555 30321661 32621650 33347357 32352991 30080547 27557789 25669945
19643 25669945 24968881 25627071 27532291 30663835 34364673 37821310 40055293 40429778
19635 40429778 38667246 35087082 30594380 26243884 22782007 20341822 18776601 17971173
19627 17971173 17789061 18180391 19247961 21036969 23617859 27011238 30710832 34168412
19619 34168412 36600833 37373931 36426588 34084906 31117291 28500725 26985123 26883304
19611 26883304 28131813 30536031 33842058 37204210 39614581 40272538 38820792 35328243
19603 35328243 30554664 25637057 21234996 17758784 15149924 13090845 11572238 10391322
19595 10391322 9375133 8540870 7796846 7173772 6611234 6085218 5648062 5408797 5067090
19586 5067090 4736304 4415215 4184255 3987765 3839281 3705379 3609660 3403265 3157554 3001765
19576 3001765 2797288 2658890 2525129 2475008 2358434 2252488 2252439 2181574 2091370 2031495 1992084
19565 1992084 1946585 1874727 1829327 1811490 1723739 1591577 1508469 1504625 1498720 1478178 1399340
19554 1399340 1388965 1469353 1487719 1451913 1417216 1358858 1284922 1271963 1280024 1356356 1394441
19543 1394441 1461354 1432903 1448214 1506553 1585911 1645557 1692411 1773595 1860636 1976656 2084085
19532 2084085 2207384 2292296 2399942 2543448 2648986 2662511 2835392 3048106 3213806 3462322
19522 3462322 3685527 3958929 4346513 4820121 5317647 5872863 6703746 7850801 9361264
19513 9361264 11490105 14357971 18178608 22719159 27687563 32526731 36256842 38044037
19505 38044037 37961145 35973274 32490898 28841667 26008349 24520794 24589680 26103279 28601519
19496 28601519 31522867 34100730 35343742 34805208 32555776 28952650 24654029 20496950
19488 20496950 16895073 14212196 12244118 10868791 9771657 8944118 8336770 7858245
19480 7858245 7509682 7183757 6916196 6709188 6562339 6455045 6379561 6368055 6473304 6674455
19470 6674455 6879914 7136465 7515347 8161875 9031817 10209648 12050300 14630973 18056944
19461 18056944 22349708 27318322 32413865 36818067 39582557 40237319 38817098 35644676
19453 35644676 31745215 28337427 26073505 25274962 26165146 28340723 31229844 34068011
19445 34068011 35918414 36221491 34689485 31405414 26981217 22472131 18405754 15027753
19437 15027753 12496745 10629530 9275276 8226225 7385703 6753805 6220280 5743915 5238178
19428 5238178 4781051 4458727 4173261 3815632 3546477 3366215 3108357 2952607 2755894
19419 2755894 2457824 2281477 2162271 2028843 1882346 1721201 1632373 1483188 1352765 1319931
19409 1319931 1254503 1247916 1203901 1165673 1076519 977210 877624 842040 845733 817024 692082
19398 692082 554568 581771 634578 631441 652378 615367 556962 521639 507889 449787 401638
19387 401638 416540 443372 404716 392186 402324 408425 352061 348583 330743 304088 307885 281243
19375 281243 271461 204259 142418 198349 193843 203512 246017 258622 303158 243771 241410 315389
19363 315389 341021 312679 294916 242870 251356 208986 220415 288439 298099 283267 272226 231629
19351 231629 279860 272975 267104 225293 184568 131931 100379 117832 189002 198292 225534 154380
19339 154380 117517 95369 68433 26185 -788 50848 204659 219696 134385 143271 198301
19328 198301 237126 227659 168806 187511 175398 123546 113793 83844 55182 6161 35176 56356
19316 56356 49204 33481 -56579 -25333 -14268 -12776 -4099 -36094 -1114 23606 39218 58552
19304 58552 33924 -48580 -13965 79025 115450 74277 -10137 2233 -31086 -20843 59620 95598
19292 95598 78951 14291 18041 -2008 -66040 -108672 -109627 -111566 5686 97535 15975 -56357
19280 -56357 -51354 -60823 -46109 -13262 14312 19547 -26452 -36821 39468 28651 40220 26455
19268 26455 -9058 -22406 -24853 -27473 22387 27093 -30168 -25396 9628 78580 60494 31576
19256 31576 26775 15592 33799 111799 83148 80240 38232 62952 88830 111867 58503 -17426
19244 -17426 -56173 -49909 -48361 -15813 -12507 32546 13246 7510 -41870 -40492 -14545 -47582 -48098
19231 -48098 -650 37291 100161 46607 -26654 58735 18419 -28722 -24571 -30550 -71308 -42432
19219 -42432 17275 44047 64104 51431 19572 50855 87711 81668 67740 80147 138659 131717
19207 131717 116916 109293 114183 84720 -21094 5716 -6573 -83045 -94361 -87804 -36808 -29919
19195 -29919 -47806 -80196 -76782 -77484 -6179 10851 30550 14988 47094 97179 61287 60259
19183 60259 15936 -38404 -72135 -106651 -86031 -5812 43973 73039 36685 35357 51974 3968
19171 3968 7496 38304 22377 26642 26690 83019 -1268 -66266 -68683 -68565 -99614 -33280 -32189 26606
19157 26606 75653 65918 4344 -2990 -25283 -28907 -44397 -105521 -123346 -73252 -40319 -15068
19145 -15068 -4318 62651 105550 38151 -27662 -42596 -35691 6543 27876 35449 -4028 -31807
19133 -31807 1233 -38710 -98579 -61149 14469 -2717 -12939 8197 55838 54060 76529 136163
19121 136163 124086 6904 -40262 19580 84164 51974 19070 102847 92483 44188 -5795
19110 -5795 -3845 59920 70386 85683 39675 -59885 -54835 -25558 -17766 -24346 37448 70743 53756
19097 53756 17721 63075 81604 40026 91055 113314 112485 82435 164442 211035 257160 279194
19085 279194 195308 87831 35663 65817 130906 133114 103409 113646 125122 146703 255726
19074 255726 253333 205199 183005 167858 87835 17957 87856 174268 216191 187685 169424 247597
19062 247597 224948 195273 197014 162790 165232 233549 246279 186894 149331 66048 30458 99989
19050 99989 146170 171390 203128 193559 226684 271784 180074 143833 128271 75838 -27916 -46877
19038 -46877 5831 -58631 -42482 5472 6709 -38778 -15375 -16008 -26949 31479 46858 76375
19026 76375 55361 74988 83951 74276 95428 88114 64753 114126 108104 91093 60006 61690 61015
19013 61015 40154 -1647 -6774 -276 -8860 -34686 548 2706 23763 20282 60549 3233 -52775
19000 -52775 -77271 -49186 3938 39139 82558 177351 220713 181882 158462 161495 192052 261320
18988 261320 262413 214263 119523 65064 81770 130685 195593 265828 235833 187204 145120 110954
18976 110954 141455 202387 145690 165091 217230 207903 159683 102640 49163 20539 18127 21269
18964 21269 -15791 -24639 -51090 11544 82565 108391 86064 43924 -21254 6201 108072 100368
18952 100368 88084 -11131 -21567 8206 33656 23493 38007 88214 36590 26113 59380
18941 59380 57479 56268 139928 191861 267890 361721 358883 345970 271230 178688 108893 55130
18929 55130 61122 174162 201227 254667 252863 223946 198745 180360 112032 73707 81468 98277
18917 98277 136289 137892 76764 67619 46865 -35392 -38671 -86853 -60470 -27933 14493 29168
18905 29168 43924 39778 60491 41498 29964 3313 -23714 -36445 15538 60840 63024 59353
18893 59353 82218 76015 53754 32595 -19349 -73993 -77260 -80066 -55405 19506 -10198 -8592
18881 -8592 -20699 -13406 16853 49431 27599 -61468 -36526 -27933 -3070 -38818 -13824 56512
18869 56512 83826 65914 -35652 -85909 -68667 -41819 -23995 -36114 -23749 -69111 -57428
18858 -57428 -45840 -108522 -114575 -47881 723 56352 98078 111499 89348 65625 73063 55514
18846 55514 48228 -26773 -3082 40900 83342 131113 100813 32605 -9806 8639 50866 27295
18834 27295 -83143 -124982 -133562 -111826 -112596 -80973 -49495 8861 66122 33899 35947 8427
18822 8427 51113 105890 91394 130960 93257 114851 89471 73148 51740 11498 -25006 -82355
18810 -82355 -126849 -100042 -102978 -94554 -29671 84330 163679 145429 95853 46991 34681 47373
18798 47373 131908 59283 60668 126743 136360 147737 94313 74727 111400 110051 57521 4452
18786 4452 -23067 -25192 -14014 -43710 -66485 -11717 26858 52968 103796 150691 120178 117150
18774 117150 150954 243251 298862 314197 323654 387207 458094 459873 419506 335655 176372 72550
18762 72550 8091 -12882 -19007 8064 2260 -62461 -44774 31270 52050 10507 -75253 -56160
18750 -56160 -22520 -71794 -123071 -62686 16367 3510 -28426 -64448 -69789 -39113 -40675 -42392
18738 -42392 -23616 -51213 -22979 38416 110370 113157 84035 43786 24572 40998 -22008 -39668
18726 -39668 -10955 1619 18553 70303 82446 232 -42478 9528 33351 -8881 23813 33024
18714 33024 32521 29414 6130 26740 85967 76723 24357 34360 84114 102993 81524 2431
18702 2431 -60878 -86504 -2954 13352 48280 82184 136983 164750 181140 152748 106947 141672
18690 141672 92491 44554 54217 2352 11405 14016 -16173 -60034 -45724 -49001 -30335 -11351
18678 -11351 -31551 -18931 -13387 -6513 13272 -27123 36090 -15243 -7672 2936 26952 75252
18666 75252 97608 79121 68265 1789 -11134 -89257 -48043 32762 29463 -12903 -11595 16917
18654 16917 25496 -68459 -96485 -21084 47638 50915 17388 207 -42877 -6584 -53391 -12183
18642 -12183 39075 114851 130749 -30235 -121305 -11742 46834 11641 -14950 64414 42604
18631 42604 -15129 -31513 -21227 -14720 17941 9036 100232 120630 94607 31927 -32603 -25688
18619 -25688 7594 33721 45042 45502 -55888 -94131 -110689 -75199 3325 67072 34162 -938
18607 -938 13100 2120 -55653 -30993 24490 72106 88300 -29732 -57616 -31024 17584 -30260
18595 -30260 -50656 -36763 -27316 36672 69403 8821 -4512 -41237 24739 8366 28182 113294
18583 113294 161284 96580 47741 -4685 -50532 -2590 28751 -72747 -131245 -88603 -1367
18572 -1367 -20879 -13300 15791 60381 122044 131625 123307 31713 38322 36068 5257 41157 94745
18559 94745 162189 87197 7867 43237 37376 73887 43087 69545 77640 30822 20689 29835
18547 29835 69926 94787 130317 164884 189470 164827 106834 116457 71375 64826 66407 146473
18535 146473 189771 141616 80846 131516 154137 95049 16219 13451 45369 73087 161203 155157
18523 155157 153912 180359 133994 135711 131431 98755 111641 127718 121111 74046 65286 36149
18511 36149 33658 37766 -9755 -113546 -70004 -49925 74979 158898 140593 152117 130409 78772
18499 78772 32579 8181 47556 158716 144447 103066 88749 64615 7460 -52693 -41344
18488 -41344 44165 141862 146293 95958 48151 82852 50138 -7766 -53632 -76819 -52513 -45924
18476 -45924 -6406 30480 -27689 -30341 -38243 -13919 -566 3633 70665 115341 118759 73943
18464 73943 78301 156123 137979 58882 54092 -4576 -57410 -29552 53699 88459 58958 37850
18452 37850 8042 -6387 -18028 -28513 -4452 11277 -30395 -57746 -80504 -17510 13057 47910
18440 47910 -22477 -62479 30843 139021 147069 59453 13937 69411 112528 103241 62504 47504
18428 47504 -20736 -33868 52794 123384 45928 -537 53241 73035 70309 61424 108826 83076
18416 83076 56194 58401 22459 8976 -32517 54683 71917 82602 83952 115359 103405 86544
18404 86544 91452 131744 166739 115956 110633 93108 111215 80797 40772 8207 -9481 13470
18392 13470 19462 5399 34181 42176 85486 79996 54018 75246 24483 -24083 -624 34049
18380 34049 106232 104572 85426 88994 68258 63841 57469 138871 155334 119739 191805 243545
18368 243545 277680 286210 205386 181279 218137 245481 152424 148550 229831 276093 253175 219170
18356 219170 145443 120930 142322 124860 143353 147185 219592 259879 175333 142433 96739 28191
18344 28191 51936 63599 146120 187624 149805 153597 138554 116170 87309 1176 21257 69798
18332 69798 36703 15354 91167 125427 75402 25257 79749 169853 156317 130885 109515 97454
18320 97454 77193 81958 169827 179534 129826 124969 162439 214323 230045 224544 211278 176495
18308 176495 105411 73089 111646 132077 111541 144224 159743 129226 187610 227715 167376
18297 167376 167936 228086 209129 270041 362797 375676 295539 184798 112467 121842 151085 146018
18285 146018 112485 102602 97549 80323 70079 150413 210852 224056 212477 164461 106340 92741
18273 92741 143936 128785 117501 123677 188997 210687 200982 163679 133807 134683 208680 271078
18261 271078 263522 255546 274477 232941 149745 145263 99141 119786 175094 213633 222179 308206
18249 308206 352834 329566 309197 277073 264000 276505 314956 351777 306632 256948 277400
18238 277400 294488 274312 240716 196570 169701 201679 153428 126691 158543 124166 157336
18227 157336 269088 312782 287848 289028 328535 322376 254054 234500 225007 160435 162166 223858
18215 223858 233910 256958 290790 334013 363021 350452 323952 300626 332904 316167 304896
18204 304896 311273 329467 399917 446655 461318 407303 354331 337549 361585 399051 375641 297944
18192 297944 302574 274054 224691 255709 279017 306082 394009 424001 448590 433624 405340 420309
18180 420309 426410 401388 304372 271008 228805 180833 256654 295403 324856 408179 394132 410155
18168 410155 452385 419205 442478 459529 483351 449397 411230 422304 444944 504318 554878
18157 554878 600488 550473 586672 657886 651472 647670 657364 747262 803569 828152 893653 953782
18145 953782 899059 891764 889595 924903 983209 1028168 1065097 1242656 1326180 1362595 1405725 1546268
18133 1546268 1732011 1819782 1942044 2098997 2223213 2339279 2515565 2837835 3119891 3454663
18123 3454663 3973671 4636323 5451336 6423818 7764436 9536212 12060514 15641215 20632314
18114 20632314 27790424 37766645 49819872 60441453 66114135 66436755 61018191 49292925
18106 49292925 36154569 26689057 20502041 16408204 13640244 11730984 10229966 8930209
18098 8930209 7995429 7301771 6730631 6275028 5745964 5163597 4780976 4434070 4129339
18089 4129339 3802125 3443336 3161277 2925650 2690536 2464993 2321797 2137663 1983151
18080 1983151 1879322 1823985 1753955 1621194 1438636 1308366 1211065 1134162 1072261 1065466 1008639
18069 1008639 966949 962975 1009358 1017876 957059 864263 771486 802022 760760 661342 664607 644388
18057 644388 621506 624511 625780 597607 546628 542465 539738 557019 527647 496876 513592 481114
18045 481114 434832 455395 471952 496252 470282 460049 487706 466365 451655 430712 344487
18034 344487 284940 341512 392619 424135 411615 427993 412413 375927 392186 345463 276995
18023 276995 241006 253148 257061 250048 257625 305571 316187 310517 321373 401472 335847 311478
18011 311478 402394 460524 413540 358493 360381 358222 313078 301328 238351 192262 235716 288513
17999 288513 342806 334592 335102 280500 272807 261149 244961 250336 328313 374995 249639 236426
17987 236426 248276 242498 258555 272221 289695 262114 243989 186654 204535 268142 280791 353179
17975 353179 341470 255357 191309 153069 151300 190016 201830 206876 202537 207609 202623 199569 201119
17962 201119 219375 131370 111404 144425 233897 232465 159088 172191 209425 251334 233949 195319
17950 195319 183316 157041 184792 261985 215740 179352 226922 278682 266255 254763 224637
17939 224637 186134 166433 156583 180701 252111 285712 325590 341025 336131 303075 238413 216755
17927 216755 209314 263231 301885 254125 179022 144227 159443 190855 178360 222122 273157 269244
17915 269244 279838 212486 241552 295460 281802 215750 183324 227471 221084 171745 242510 302778
17903 302778 420864 362617 252297 244298 287247 270714 215538 237970 275332 225855 204509
17892 204509 216622 258500 249493 300775 283653 198408 168626 207639 207893 193802 196370 184427
17880 184427 218684 329346 374783 353124 313084 355072 330347 241589 286316 350782 303161
17869 303161 245994 231003 288023 355581 335524 325005 284524 240204 191222 165191 209296
17858 209296 307058 257401 199116 235721 268187 292222 317072 319618 332772 327133 353869 330990
17846 330990 294524 248470 255888 261719 263638 288980 276243 223295 227117 292875 319412 312344
17834 312344 342826 327613 298099 253803 269427 320092 301174 290596 293442 299961 302141 274465
17822 274465 265782 295720 367843 453750 391482 384316 384596 391197 439399 376923 352004 355096 354110
17809 354110 355661 344225 253275 241883 227319 318503 412572 368470 301558 357720 384388 398200
17797 398200 398958 318158 298865 341932 377066 328270 265213 255381 287174 238013 184364 111299
17785 111299 114537 136084 258121 327992 324217 318219 348962 376864 343656 237545 303878 335236
17773 335236 313578 251894 180133 186221 215631 274749 273270 271063 313912 353038 372610 323306
17761 323306 320173 322633 344896 343500 408179 385833 330518 302939 296623 319742 284437 250018
17749 250018 296969 308481 293806 393757 411577 364494 336222 323983 301749 331668 369570
17738 369570 359938 307078 316547 280210 273718 303959 235152 290473 325853 344165 267998 247499
17726 247499 241411 308153 390043 361069 351474 364991 414548 425874 406366 379512 307870 313492
17714 313492 303504 328241 338327 361609 374365 380802 386155 398589 371343 347402 330615 304474
17702 304474 337066 420176 369217 338430 375249 409317 415316 396252 353551 345935 381833 423007
17690 423007 417255 458717 461687 438801 460700 393136 353816 329852 383964 392469 381045 428649
17678 428649 447173 485834 505568 443338 394031 427322 472398 471484 555887 581256 520519 530778
17666 530778 543211 569812 546767 570259 569514 490704 449035 444030 472591 447595 424017 422714
17654 422714 461177 497100 506309 474947 399613 406058 432876 484255 431158 386737 376391 424906
17642 424906 453536 467656 489857 552653 575848 581765 579311 565215 618350 635303 578304 564761
17630 564761 480234 494943 490211 426555 411848 405077 434388 452009 429725 436903 523820 542638
17618 542638 489076 574226 630721 611549 576955 632765 706024 722376 693943 629247 607064
17607 607064 643225 626384 633571 615491 568951 597000 685587 724576 647897 603054 519105 457603
17595 457603 434278 459368 519504 559515 591355 591459 537349 560791 645739 721992 779763 765438
17583 765438 795555 767003 725871 665707 604600 520337 472902 489693 422523 414413 424097 473005
17571 473005 466588 430134 476072 524678 536479 544161 521118 505461 479629 472175 465998 403793
17559 403793 412230 476009 520415 572649 605661 552508 463771 501615 498665 521842 548521 522427
17547 522427 542045 600941 593933 567438 519505 581218 627583 620744 613836 586256 582012 569769
17535 569769 642618 673183 685522 606307 595491 654592 614121 618776 609345 604174 579421 563146
17523 563146 545330 519207 532155 480932 494481 504139 485495 537110 550371 548865 580744 608846
17511 608846 645847 671220 604666 577084 538702 622899 632922 625459 643449 659990 642284 661078
17499 661078 704288 702215 677823 672556 635486 615025 616869 643779 664087 707599 740566 722492
17487 722492 701465 654411 760680 749314 665947 653425 681499 728821 662856 629588 590741
17476 590741 654681 720299 757693 675080 669543 708564 720013 719972 697501 660987 666115 722035
17464 722035 742372 695488 676597 721864 735821 735187 741630 764908 800151 786125 737992 696493
17452 696493 691743 739628 813755 874853 894721 957233 1035994 1045580 1043102 1061716 983166 935864
17440 935864 854594 818830 779904 709512 688754 744099 783862 809877 799875 758797 698450
17429 698450 678871 657374 679177 678714 614762 575303 620301 646483 677308 772665 769077 764580
17417 764580 766622 718807 746952 770654 787671 853110 848347 790596 724866 743297 756025 739437
17405 739437 742039 759409 785417 826830 858160 801693 735629 805804 844279 790581 785040 760195
17393 760195 723414 695227 747464 786207 823565 809595 816246 858601 870912 870368 876457 873078
17381 873078 893013 861693 777350 802567 864194 868511 860754 875414 954340 991689 928022 962467
17369 962467 926517 895137 911928 902353 924296 996936 962433 882638 902339 827600 903955 974194
17357 974194 990800 955445 996362 956372 920487 844945 862883 931454 954957 1003302 971771
17346 971771 870804 817225 822372 838631 853630 836915 868493 926419 896706 928064 926207 973225
17334 973225 1002960 962942 963428 938259 896732 827933 874560 905098 835061 789009 799078 853160
17322 853160 908550 924078 932464 904343 926614 946062 1018560 1065201 1008583 1007424 988254 1007647
17310 1007647 1014673 1057649 1114585 1191301 1157709 1089103 1121303 1117580 1142037 1049847 1074857 1086482
17298 1086482 1076158 1160185 1174314 1141941 1090357 1118995 1138639 1159918 1203660 1249096 1266511
17287 1266511 1245069 1221304 1191784 1203544 1192699 1200491 1167186 1170881 1192013 1216036 1284710 1354477
17275 1354477 1332333 1240522 1248989 1273203 1287229 1272766 1245122 1210381 1202360 1257951 1203796 1288599
17263 1288599 1396112 1419461 1395949 1396127 1331164 1313734 1302471 1292401 1300305 1333633 1304660 1330947
17251 1330947 1398352 1416099 1387641 1371111 1339815 1308385 1330487 1330881 1327329 1377043 1431129 1438773
17239 1438773 1384654 1389637 1365509 1359785 1371423 1374014 1391850 1438452 1526886 1578567 1536517 1460448
17227 1460448 1496224 1532562 1495720 1468644 1504640 1568781 1557901 1521273 1517998 1491523 1481380
17216 1481380 1485909 1436423 1390411 1455469 1474384 1465300 1476224 1472435 1497246 1499901 1495946 1597258
17204 1597258 1612674 1578630 1562310 1595180 1646863 1742761 1835124 1874476 1882801 1873887 1810217 1709511
17192 1709511 1737160 1849000 1885783 1910835 1931855 1947324 1964015 1964037 1995041 1944465 1969641 2051033
17180 2051033 2068900 2066953 2036943 2119094 2117093 2120370 2134660 2176867 2141504 2131508 2200815 2323100
17168 2323100 2381121 2418362 2553926 2707139 2780603 2851517 2920803 2983385 3114328 3228019
17158 3228019 3351755 3508313 3602366 3745600 3930369 4158596 4428013 4728745 5186303 5707385
17148 5707385 6367889 7231267 8313072 9740273 11830297 14704832 18765797 24122103
17140 24122103 30450293 36425927 40202838 41025162 38817351 33343968 26421120 20818815
17132 20818815 16949658 14311556 12564690 11330947 10417726 9762997 9278523 8967190 8681094
17123 8681094 8528908 8450744 8483282 8648806 8947756 9376417 9960585 10712829 11839096 13556402
17113 13556402 15988158 19390359 24022278 29884392 35965404 40439071 42083118 40883005
17105 40883005 36450657 29896584 23961736 19833631 17188201 15573255 14654349 14231024
17097 14231024 14263810 14824743 16006825 17975940 20895267 25046730 30476799 36337171
17089 36337171 40782775 42474794 41411417 37236151 30629186 24457721 19960342 16843480
17081 16843480 14682438 13131049 11938126 11038740 10350079 9792320 9416894 9146455 8958522
17072 8958522 8867990 8886467 9039298 9305587 9703909 10260128 11051928 12310192 14245634
17063 14245634 17056778 20961632 26002339 31723568 36759852 39411904 39286313 36248329
17055 36248329 30362123 23876653 18918984 15463751 13093407 11440596 10204825 9197909
17047 9197909 8413536 7852835 7423685 7057810 6786234 6462269 6135535 5855483 5652488
17038 5652488 5517770 5349377 5116121 4930365 4801963 4632398 4421547 4234958 4053592
17029 4053592 3936993 3846461 3820097 3703899 3629268 3613089 3526250 3406737 3325801 3352618 3448173
17018 3448173 3504826 3459385 3434806 3335937 3308364 3271558 3213121 3098920 3076989 3065211 3030215
17007 3030215 2990894 2952157 2897388 2893805 2988469 3077528 3039089 3005674 2997747 3045836 3066109 3056043
16995 3056043 3042876 2950334 2897314 2860201 2870674 2966598 3026672 2996266 2958767 3014025 3066147
16984 3066147 3048143 3034830 2990416 2984740 2916084 2873401 2958956 3000305 3004689 3079053 3119975 3101518
16972 3101518 3111543 3088784 3036614 2968897 2989050 3062338 3087480 3101486 3136493 3150838 3133252
16961 3133252 3145419 3113296 3059478 3010593 3041674 3098424 3155838 3156777 3162600 3136458 3074508 3117710
16949 3117710 3140360 3099731 3059066 3111847 3134975 3145254 3138365 3147543 3160690 3209618 3288576 3221967
16937 3221967 3172487 3123178 3086740 3089771 3156903 3201658 3199906 3285535 3259482 3196894 3215131 3248129
16925 3248129 3252508 3299192 3342891 3385531 3378898 3362458 3358496 3375621 3393536 3420424 3436724 3462382
16913 3462382 3432330 3432398 3358423 3319877 3330625 3377906 3409682 3418341 3480490 3476424 3443465 3505255
16901 3505255 3556177 3552238 3501065 3500875 3479940 3469663 3463155 3464930 3434077 3475087 3542480 3547298
16889 3547298 3571668 3577592 3552353 3584176 3587461 3622883 3659256 3690082 3699061 3648215 3653929 3633293
16877 3633293 3652714 3697042 3695885 3648608 3703242 3740978 3714882 3699188 3744429 3719455 3719633 3770118
16865 3770118 3846384 3906926 3869533 3816763 3824862 3850044 3782512 3739412 3740865 3770477 3782638 3756100
16853 3756100 3710464 3817341 3916837 3930469 3911873 3932557 3919205 3950242 3944423 3945280 3971707 3998708
16841 3998708 4070620 4032379 3992130 3939152 3881266 3848785 3897697 3945069 3986734 3942505 3911216
16830 3911216 3878579 3904992 3958748 3958347 3925749 3901776 3869913 3948875 3957696 3988193 4012851 4099251
16818 4099251 4097491 4074229 4116814 4199079 4268571 4309675 4307587 4215970 4188947 4189265 4156299 4132074
16806 4132074 3984296 3990744 4081259 4061910 4040420 4095634 4100941 4081126 4129781 4122091 4116173 4096880
16794 4096880 4120611 4230043 4248888 4181330 4182289 4226607 4221949 4179068 4168026 4120493 4152173 4174784
16782 4174784 4171342 4136379 4161659 4237202 4227819 4184611 4210999 4223427 4207693 4165943 4176853 4218295
16770 4218295 4242426 4181162 4228086 4272147 4265797 4217040 4210676 4200741 4233085 4178355 4172734 4156882
16758 4156882 4192546 4232537 4238357 4219049 4176050 4139826 4158707 4193261 4171710 4148329 4144283 4115884
16746 4115884 4101531 4096640 4110947 4118672 4174784 4168713 4150395 4112841 4120402 4148072 4158856 4192881
16734 4192881 4169337 4177147 4166815 4191718 4212540 4292423 4325486 4288630 4283959 4339167 4323208 4266420
16722 4266420 4211344 4213086 4189825 4192329 4179296 4136709 4171919 4200618 4188389 4124029 4097248 4133737
16710 4133737 4206656 4224054 4160912 4176214 4106571 4074334 4092704 4136959 4183539 4177268 4149266
16699 4149266 4136705 4174505 4144390 4112646 4132672 4181022 4153825 4125656 4149863 4090059 4023665
16688 4023665 4054114 4033748 4025553 4038690 4087929 4081456 4009824 3907032 3880193 3927623 3958164
16677 3958164 3920582 3868193 3901096 3940140 3980665 4006211 4015473 4004028 3976158 3983716 3981674 3905107
16665 3905107 3847966 3866050 3884046 3931293 3904212 3856564 3897079 3934089 3940936 3947946 3963250 3883004
16653 3883004 3769558 3711123 3725412 3725865 3770603 3838154 3771810 3708362 3776874 3832663 3832492 3757842
16641 3757842 3740527 3729235 3763942 3862001 3857433 3777300 3726101 3804316 3753758 3769400 3766009 3730499
16629 3730499 3740882 3776606 3777416 3725270 3730140 3744815 3670548 3602291 3652860 3700514 3689042 3620869
16617 3620869 3589572 3624258 3653732 3656569 3595565 3573201 3550344 3563048 3669741 3784389 3825433
16606 3825433 3778691 3776083 3772404 3769107 3687270 3612817 3601254 3549790 3465996 3437376 3462997 3515643
16594 3515643 3567238 3556129 3537842 3512567 3540406 3463550 3418879 3496226 3522312 3510117 3441664
16583 3441664 3415448 3370427 3404124 3424768 3401707 3411810 3412875 3465318 3439281 3436534 3409788 3333064
16571 3333064 3258014 3232134 3172162 3124459 3138836 3108244 3114435 3186113 3225554 3227333 3244064 3253818
16559 3253818 3279526 3332753 3334838 3283643 3341191 3390452 3338520 3271082 3216028 3250746 3239247
16548 3239247 3185409 3122702 3009059 2994023 3031065 2991929 2936204 2893328 2853897 2826824 2899945
16537 2899945 2938163 3003790 3014055 3012321 2971172 2927707 2952480 3032608 3063824 3062538 3128483 3090184
16525 3090184 3056466 3031259 2959848 2903388 2859579 2885043 2898144 2806434 2732680 2657896 2699311
16514 2699311 2705566 2714612 2714814 2751161 2764376 2764495 2787548 2759875 2745965 2755760 2736798 2741436 2717880
16501 2717880 2674004 2600222 2595791 2574779 2587132 2630899 2594506 2527849 2513708 2454815 2468470
16490 2468470 2541567 2570803 2547579 2469316 2422062 2435965 2444700 2413791 2408661 2429958 2426134 2505857
16478 2505857 2514792 2467037 2478821 2378722 2349993 2411961 2364794 2384806 2367658 2361946 2367128 2331097
16466 2331097 2349775 2387718 2376296 2334086 2349403 2325133 2216327 2122753 2187125 2224375 2256308
16455 2256308 2341147 2397300 2346503 2261798 2192554 2149351 2166286 2113778 2056926 2139742 2153472
16444 2153472 2165240 2178347 2202826 2207624 2172374 2135928 2143587 2189839 2203588 2208014 2204167 2153979
16432 2153979 2092476 2028570 2098371 2088742 2039320 2007794 2006316 2006087 1991294 1933684 1947650 1986424
16420 1986424 2093219 2068785 2072696 2042355 2046217 1984320 1975310 1998615 1931726 1916253 1922287 1934902
16408 1934902 1952245 1980609 1939352 1928897 1921626 1911239 1902915 1847768 1852602 1825603 1811631 1811717
16396 1811717 1834461 1821485 1849680 1907500 1967953 1981395 1969762 1949205 1903897 1914885 1853543
16385 1853543 1805023 1777779 1780880 1814669 1810494 1764141 1756411 1712503 1707266 1681750 1665881 1696780
16373 1696780 1670343 1650111 1683878 1661628 1646622 1763417 1784163 1667161 1601599 1632982 1714296
16362 1714296 1701369 1641864 1666780 1683954 1654293 1566248 1583435 1652360 1619356 1623574 1586017
16351 1586017 1575294 1590749 1619834 1588068 1520320 1499893 1530577 1520677 1522854 1557774 1563557 1658108
16339 1658108 1670689 1651211 1578440 1522355 1493513 1488544 1541745 1505707 1538399 1555680 1563080 1550661
16327 1550661 1552896 1581019 1512806 1403944 1338605 1322152 1398747 1420254 1427367 1443990 1415549
16316 1415549 1378044 1360587 1343800 1309642 1311225 1374823 1397848 1339590 1299857 1289096 1328739
16305 1328739 1395824 1378732 1438001 1460234 1422471 1342416 1304920 1241407 1213853 1276990 1318602
16294 1318602 1315926 1260673 1244810 1254953 1255667 1262316 1230939 1226411 1195709 1168821 1211649 1257599
16282 1257599 1297996 1282197 1289452 1255793 1261310 1296423 1319311 1319828 1264804 1170491 1145129 1216319
16270 1216319 1204113 1198152 1137722 1186432 1321354 1361384 1299979 1308938 1288640 1237010 1198639
16259 1198639 1119138 1118265 1176422 1185714 1169957 1174943 1115129 1099169 1149549 1178911 1267427 1237272
16247 1237272 1210872 1176734 1159915 1163162 1170135 1104928 1089528 1115585 1141387 1126398 1161168 1087471
16235 1087471 1021474 1021627 1040516 1014185 978166 989924 1063731 1034454 1033883 1018908 1028555 1011621
16223 1011621 1007031 1035937 1060715 1007630 964596 1038348 1043008 1089209 1048462 1036683 1076390 994320
16211 994320 993862 1001351 1065511 1158063 1182919 1086771 938053 911244 932558 921027 879851 978292
16199 978292 975435 962314 969601 982355 961217 959156 874715 847885 949112 991342 932586 883613
16187 883613 941499 994846 992765 1010510 991445 976184 1000949 1036954 1046350 957814 891372 911186
16175 911186 960325 1011747 943600 922174 888155 843777 828605 861646 948480 944615 919915 928510
16163 928510 927037 850076 826767 860945 893696 884168 909005 924117 869242 867308 865928 865443 865855
16150 865855 788168 781707 877073 940584 820152 790137 830108 852632 843483 878760 922122 913894
16138 913894 888943 853588 849305 895677 891822 844805 822949 798838 831519 839726 797648 791484
16126 791484 774473 774355 762635 784613 786124 850261 908376 901108 853921 780355 765584 745742
16114 745742 730081 682202 674978 693588 715073 812378 853220 794627 745049 796246 898339
16103 898339 887292 773685 700510 686479 749001 738912 697634 710729 740609 750057 765622
16092 765622 767725 743705 708300 702827 673953 624173 669420 695857 688843 703998 732117 703216
16080 703216 735848 700199 579376 565441 547743 556918 559084 512407 541296 631821 647297 600417
16068 600417 594144 544363 543176 601715 692663 731563 749020 754984 703068 621427 683807 739588
16056 739588 715175 680063 683150 718825 693447 664164 610387 645625 674194 702483 716201 629874
16044 629874 583362 557591 556785 541251 604158 585852 603915 625071 666298 682016 671328 669302
16032 669302 616781 576388 567218 555998 536822 567440 549439 502977 514708 487480 468621 488198
16020 488198 544942 588486 631568 598401 608140 545985 512819 554019 504849 524585 512258 490012
16008 490012 503118 573572 587163 578083 602361 541552 464556 392401 411684 462199 527076 504585
15996 504585 474534 509381 538984 506166 479636 532287 589447 551159 479617 462233 473689
15985 473689 459402 454458 455391 501178 504421 494492 520432 502410 584470 607916 545382 479103
15973 479103 415529 449629 432490 468270 520887 497689 429561 430826 469082 473345 530584 491701
15961 491701 392359 377134 401660 442274 457384 495312 542275 520869 479250 524199 531244 548589
15949 548589 590236 600819 490063 476439 532901 545988 524051 540030 534720 490404 495267 432549
15937 432549 405304 473209 456945 407013 354605 373888 430869 422195 414124 456206 490423 507595
15925 507595 497325 536962 493919 461029 457844 490335 518985 442563 441229 469365 459155 416189
15913 416189 446848 443031 408702 425483 418780 358619 386902 401539 380782 399476 436114 451085
15901 451085 419650 419381 419953 423928 402671 399089 366909 441749 432423 367728 323133 360174 406858
15888 406858 419499 431717 421054 450989 447994 457850 457995 408338 398279 426514 393502 327246
15876 327246 316136 290694 344707 399067 427759 401463 411617 381794 389026 435719 459903 438645
15864 438645 487686 440881 447258 424637 350687 350494 384353 392815 360402 286439 320800 278313
15852 278313 293520 255349 236518 225518 223672 268047 339713 411748 376364 389514 330407 251957
15840 251957 294812 381115 391526 353546 319188 311856 315319 314874 297445 335281 299818 283049
15828 283049 417420 476537 508555 490929 425017 389789 364567 397531 465335 539810 492097
15817 492097 422821 374593 365353 320765 312475 290001 285648 317895 301496 274648 249420 247085
15805 247085 256360 302850 330974 286723 316782 382409 349795 304332 315232 376990 385559 355572
15793 355572 302234 286520 286618 297473 348676 307090 276047 323859 406366 437097 422090 474359
15781 474359 388464 313146 262039 288267 312406 345806 376323 316215 294896 355072 360592 306098
15769 306098 258533 267473 339739 363353 402376 337865 323203 314704 321053 366634 243414 172254
15757 172254 219920 198649 192960 173996 139447 178778 240045 209667 187150 293515 325097
15746 325097 302194 333365 331077 316950 292836 269956 280683 253111 228692 202322 171671 210578
15734 210578 262759 269125 273538 271421 304250 281618 273169 288775 272112 274361 231401 197658
15722 197658 172551 175196 311539 342667 274738 263015 225995 239946 274984 344057 344290 338523
15710 338523 389874 401061 443097 359360 293538 298414 222887 199247 271148 342707 345054 286414
15698 286414 298459 301752 313641 331457 361719 388821 364030 281265 286307 287709 317092 329065
15686 329065 339057 322951 299438 215931 190018 167009 135535 194055 263521 258110 224854 337790
15674 337790 367061 293514 310744 288845 260654 278945 294172 287215 278994 276415 271774 270481
15662 270481 301860 247354 162176 212371 305351 241035 229403 313578 320978 291574 194926 236971
15650 236971 272313 236211 200649 190674 193050 261791 359162 369429 317109 318681 354611 295658
15638 295658 220574 186198 181312 202886 204653 303828 387015 289568 239343 241411 248453 201260
15626 201260 202220 229433 247670 231785 240296 224515 219759 177489 162897 185500 255338 274075
15614 274075 252410 244245 270372 293644 305612 305941 345853 310372 281189 230837 238760 189271
15602 189271 229601 213483 218188 168421 207021 227969 178156 211517 273477 242092 165824 195164
15590 195164 215901 224908 200980 186087 155641 146398 152279 186024 196851 165231 197550 198241
15578 198241 156713 128651 163258 260930 266553 289933 276571 193367 121118 136760 139829 145781
15566 145781 99714 125013 158132 192403 211637 210869 131525 75470 171959 244589 217006 242896
15554 242896 250110 248753 228559 240166 329879 347033 309586 217179 242262 274763 220909 171504
15542 171504 188327 211373 248198 235542 215112 153757 171238 178945 257566 242028 192749 196958
15530 196958 200101 200220 130135 147589 211439 232460 203998 213778 202595 206553 296621 263009
15518 263009 252999 227313 199001 188938 189939 187746 204655 121549 142202 200324 208485 202838
15506 202838 129899 140946 181015 185634 238878 179165 104233 172044 173318 137862 115133 162435
15494 162435 191991 208232 211801 208213 233543 259445 298118 345787 323879 305584 214612 217606
15482 217606 163916 157226 137196 140082 139728 162507 186313 73608 5261 11174 76966 208704
15470 208704 233337 197733 235925 187357 109236 101133 96295 93007 75798 53455 65226 89178
15458 89178 55419 611 32189 61426 86091 28648 41319 37591 92254 157442 181824 180156
15446 180156 103688 100523 82016 59618 135938 131414 204250 247601 190054 187421 159343 209694
15434 209694 241874 187485 173221 214506 233213 214380 85808 59938 137289 135609 110790
15423 110790 85704 53938 70493 120298 102332 110706 183909 130595 77594 9615 27445 62362
15411 62362 66196 36952 57460 93716 168604 213400 259345 218690 132183 107415 140990 105102
15399 105102 50871 58574 56795 90612 158486 175316 168162 160873 147566 203200 217218 187883
15387 187883 162468 178702 135770 126191 151802 167456 64791 31683 43609 93964 114002
15376 114002 96228 76627 100873 147585 140701 118849 23705 -64889 -127235 -66719 -29276 70357
15364 70357 133800 117609 138926 226588 300067 265715 234441 202388 181460 84564 -11814 -1569
15352 -1569 92730 151547 144845 131401 187151 218615 164361 142157 130114 107084 67770 118671
15340 118671 127647 74352 62670 50873 53487 92201 156639 132949 145142 155209 145579 146746
15328 146746 105377 106367 104697 74470 77141 153267 231499 227282 216536 241104 171952 175820 176762
15315 176762 108993 98426 128125 148367 127774 120097 159813 121129 70789 127437 197428 169334
15303 169334 123561 98637 39779 60577 105676 112569 103376 52052 117436 124072 134911 179937
15291 179937 138594 104054 159238 158107 190291 169544 142134 127376 167514 179718 118096 98609
15279 98609 103142 76994 117815 203214 235288 196027 127298 110940 103236 93835 117877 135189
15267 135189 119014 84939 84573 98247 179737 169100 204447 251554 212178 125147 47837 85412
15255 85412 144002 140956 117697 72145 94323 122885 131446 109826 118072 187345 169683 162300
15243 162300 169620 103462 68597 79367 111708 162178 154721 51969 3148 29434 78626 108337
15231 108337 85879 62032 38030 23666 -26125 -14951 -10383 3057 -4896 49025 79019 135129
15219 135129 172545 186744 185492 138275 115917 51519 15749 43594 67695 88239 107335 70895
15207 70895 60474 137841 86908 32525 2136 64532 113248 116553 180739 242838 190318 155397
15195 155397 100506 119705 136498 125329 133915 106080 31724 -33868 14038 61306 88804 125088
15183 125088 153794 118642 134329 146461 166732 192809 139394 40119 -9531 -35565 -46411
15172 -46411 -36420 30192 64215 83266 96117 96719 137795 169377 216887 189961 187089 113858
15160 113858 99136 139119 123988 81889 64116 112313 103755 119483 93097 46542 67575 123145
15148 123145 53302 79991 144246 115951 83340 125891 163763 120363 74825 108491 50222
15137 50222 47186 98633 70013 12680 71748 110578 88614 83224 75755 126329 90147 39883
15125 39883 40276 21277 97846 152059 151513 56787 -12403 14466 -11968 -14879 -1537 -43473 -96921
15112 -96921 -79322 -77842 -47193 -15312 1935 17086 5750 50211 95289 109864 92059 100947
15100 100947 112838 97688 18520 -46027 -20854 79809 133115 150345 166280 156707 109887
15089 109887 22344 -23550 38779 155605 194842 156488 138576 150112 169895 85239 18597
15078 18597 15637 18988 69999 22599 -81847 -84470 -6917 53141 118081 92672 53657 77946
15066 77946 148945 139352 95537 44234 19034 89936 131860 116142 73167 7498 -10013 4612
15054 4612 36687 40128 -64270 -62857 -46754 -56699 -60850 -13910 28313 66245 36420 8197
15042 8197 86775 81737 100906 126733 119166 39740 14528 62402 59311 99971 140149 119298
15030 119298 126523 92627 36922 81803 120960 88939 79439 118514 143631 79175 29326 62339
15018 62339 81632 122410 146350 103591 43030 -8955 -27182 17509 -53623 -70512 -49665 -53086
15006 -53086 -53863 -65445 -51043 -23588 -25439 -13468 9878 41159 83203 40221 -16025 -98653
14994 -98653 -121281 -53357 -36710 -58183 -85101 20124 109836 92337 39829 -2854 5071 8382
14982 8382 -8219 -923 14333 -26470 -84113 -68637 40162 52616 32616 -973 -77059 -73905
14970 -73905 -15391 12268 65712 48559 45179 20675 6456 -11111 -47384 -59336 18852 102937
14958 102937 122475 89539 35412 7319 -22024 -18 -34157 -17974 6158 -18881 -18490 68
14946 68 -12083 -4583 59584 86909 -25513 -86170 -3748 7368 -18463 -11298 76261 138387
14934 138387 169816 127211 162013 173421 82284 21967 25330 -14039 26967 47953 43142 480
14922 480 16959 41697 50461 90888 122105 176715 186873 148285 103735 133697 122228 76114
14910 76114 144302 153105 182095 157337 95515 91888 114206 134030 145316 132923 117282 99093
14898 99093 112375 160600 84311 60809 91614 78159 95655 144293 116845 -42087 -58167
14887 -58167 81965 124196 95486 7101 -47127 -72155 -67326 -80782 -75110 -22224 -6828 -4500
14875 -4500 5169 72733 70290 27406 -14818 -5624 3011 15359 44804 11704 19977 1262 38289
14862 38289 71573 90740 46550 -30165 -34972 -14958 -20121 23049 17578 44650 56104 84107
14850 84107 117365 88122 74059 56329 26100 21335 -19630 -20315 -48947 -15802 -31239 -14934
14838 -14934 -64322 -17059 38543 27265 17406 -41062 4492 43079 8714 -15406 73766 127324
14826 127324 88851 40516 65480 68816 63066 77196 115926 48136 5673 11948 12597 -11009
14814 -11009 -11089 -61353 -96988 -98593 -76392 -52663 11058 44249 11037 -1285 -39294 -48486 -20417
14801 -20417 1392 9237 -9328 -82649 -91323 -32345 -43827 -42565 -35013 -97606 -62604 26141
14789 26141 37380 103724 90468 68659 113278 93430 49728 40316 35508 -2692 -50598 -63359
14777 -63359 -87982 -98259 -37325 -16753 -38196 -62249 -144773 -126433 -40457 -25826 1853 -66339
14765 -66339 -71597 -46689 20951 19056 1110 23612 2439 -24463 17667 -1687 -67699 -45238
14753 -45238 -40382 -16056 13778 -3904 98261 148260 131371 118148 150915 147902 109723 76136
14741 76136 112108 148256 51165 -16381 -2015 -7704 -14417 -6249 22311 37916 10992 45130
14729 45130 13073 -44791 -23863 29204 56789 50777 26334 53942 66256 105584 157461 158427
14717 158427 124712 31030 20513 86407 58932 61923 134090 103121 58369 51562 -15971 -98536
14705 -98536 -68085 -85588 -72341 -29643 -29928 -32670 -43355 -81512 -51533 -40238 -106758 -69308
14693 -69308 6645 68259 55204 20389 -23587 38102 72859 -3694 -51954 -81739 -139974 -57383
14681 -57383 52801 65048 31914 -1166 6153 67530 69801 67440 25267 14640 72887 75259
14669 75259 57214 -38703 -9589 -29863 -8479 48008 60080 54682 40502 -13807 9338 -10083
14657 -10083 -30363 -803 9532 13796 18817 -38109 -77353 -18706 10699 -25294 -36957 -44207
14645 -44207 -31497 -18272 27596 43736 49944 62159 88360 106544 99807 64226 45049 14609
14633 14609 -33514 -14350 41328 99484 52618 -25427 -39884 -28654 -83899 -54672 -39508 -28776
14621 -28776 380 18708 37176 59419 59037 64136 35956 39415 42128 9620 -72304 -73802 -137934
14608 -137934 -147846 -109441 -67319 -10323 -28437 -9704 -732 4329 -12945 -36233 -88842 -50507
14596 -50507 -16770 -61500 -45422 -86086 -101830 -41979 28536 62818 18685 43328 111371 82812
14584 82812 90886 109446 98373 82102 94819 86359 104822 50385 23986 9050 -9040 -20848
14572 -20848 -24017 26572 51706 -45829 -37336 3341 4046 23012 58036 65869 49728 44041 84823
14559 84823 33736 6815 31077 -8028 -32914 -23649 38645 20874 8605 26543 -6852 -30959
14547 -30959 -32394 -102705 -73200 -53375 -72284 -115358 -147171 -129438 -78315 -83102 -154014 -137305
14535 -137305 -52441 20152 -6214 -121323 -173931 -114219 -6076 48884 1001 -29506 -84209
14524 -84209 -28109 -16646 -5286 13620 14320 9312 45874 33324 -19026 -7318 5832 70023
14512 70023 64487 42206 22637 7773 -39905 -59593 11300 55826 70926 -7026 -42510 -35128
14500 -35128 -12295 18697 6492 42418 62196 36243 -1372 -51723 -76122 22273 80179 34429
14488 34429 35978 30712 60317 88851 40195 -6411 -26977 -39591 -44178 -49140 -52408 -23836 19711
14475 19711 33871 47564 49131 51322 5783 -18630 -38637 -37954 -31234 -53377 -15761 -39855 -9656
14462 -9656 54989 7815 27796 9510 -81878 -164714 -183750 -40747 -16963 -95464 -85898 -57759
14450 -57759 -86525 -19901 -6682 -12333 -2754 -20630 2616 16288 26144 -13199 -65814 -109356
14438 -109356 -104098 -69654 -65153 -86642 -51731 -56321 -97126 -71858 38078 61443 37041 -42238
14426 -42238 -92745 -63656 -70344 -63667 -87501 -27909 -19782 -65973 -68475 -116171 -95977 -30284
14414 -30284 -46782 -31006 -29429 -29749 30031 -32267 -62154 -41819 -85989 -144636 -171891 -100069
14402 -100069 -82159 -91062 -106429 -56766 -26497 -25556 19324 5176 -33213 -72911 -66305 -111305
14390 -111305 -95072 -82857 -31333 -49491 -70624 -42662 -9668 -29474 -6904 -59860 -89228
14379 -89228 -54059 -30749 -42998 -62213 -81903 -5999 -4529 -70062 -63088 -60377 -99017 -96307
14367 -96307 -94374 -90419 -112124 -95844 -71051 -29606 59969 100530 79280 48425 64021 47970
14355 47970 36774 68934 92324 45886 11214 16765 -42399 -38681 4230 65981 95407 5540
14343 5540 -35940 7943 -4226 6422 39837 30223 -46894 -43089 -52448 -25568 -15095 -36684
14331 -36684 -97606 -103313 -79623 -98006 -116770 -104653 -124037 -42406 27779 28393 23479 48221
14319 48221 13464 65064 59507 -7253 -36247 -36964 -64956 -92582 -82344 -21356 2263 -58503
14307 -58503 -46005 22667 -21536 -72747 -130127 -119210 -57608 754 -5447 -47582 -13231 25045
14295 25045 91301 80869 36259 -7271 867 27265 41861 -13469 -96343 -124389 -135157 -91486
14283 -91486 -68896 -50717 -23470 62065 27412 61510 71009 53035 57284 7826 -26515 -75265
14271 -75265 -70405 -82489 -121792 -109974 -108879 -132406 -84454 -17668 16179 13589 -57825 -58811 16367
14258 16367 72435 93495 61542 -16018 -30407 -73488 -91637 -21242 10915 5581 -37321 -19661
14246 -19661 -29251 -56771 -38639 -28149 -18659 -19107 44242 60597 -34757 -54152 28662 81812
14234 81812 5386 -32379 -27086 11657 -17704 -3575 -1235 -11294 -9990 -4657 49350 40756 -59705
14221 -59705 -58543 -34545 35028 91824 127227 114023 132658 148885 64957 14139 41768 90476
14209 90476 93505 84049 38368 -72566 -95252 -54841 -56200 -1046 -4642 -4135 28785 41958 9560
14196 9560 10670 7185 70677 70116 12589 31710 80188 52500 -44979 -111899 -167196 -157532 -131819
14183 -131819 -143644 -43131 -38902 -30810 26420 30179 42796 14999 -40259 -47300 -45151 22702
14171 22702 2827 -3948 29355 -12451 22944 40861 48213 124 -6466 43130 91225 96760
14159 96760 36188 -8529 -5764 3136 -43358 -44179 -29016 -17887 -51184 -90443 -86673 -159681 -168764
14146 -168764 -113349 -73141 -18985 35408 128530 122867 60671 -38330 -58565 -40469 3909 -60117
14134 -60117 -79634 -9269 59189 39450 -4117 -23342 -17024 -41946 -73018 -142702 -169755 -116842
14122 -116842 -84962 -130278 -120570 -91881 -59910 -74155 -49396 -13688 22857 56221 71426 100911
14110 100911 56208 -29916 -77006 -82804 -21260 -34005 -29809 2862 -3232 6233 44936 -19165
14098 -19165 -64752 -41475 -20828 -23905 -47486 -78954 -62633 -61437 -99843 -97437 -71232 -28838
14086 -28838 15735 28128 -8437 -13920 -17863 -35448 -85583 -112690 -70743 -51841 -28757 11432
14074 11432 -6957 -58492 -121555 -119497 -22045 -11129 -26192 -38351 -23286 -68641 -45791 -9294
14062 -9294 -64291 -106122 -108070 -52160 -4724 -61281 -89394 -39344 -36125 -39197 -42634 -91969 -91680
14049 -91680 -12645 4341 -53308 -118987 -160685 -168997 -135975 -122875 -82059 -45633 -39014 -40385
14037 -40385 67301 9513 -76001 -67767 -31946 -39945 -40898 -32575 -15701 -41632 -29843 -56982
14025 -56982 -75876 -94299 -143655 -70543 -34227 -115634 -163122 -109424 -62598 -68505 -81629 -21377
14013 -21377 14048 -24978 -67681 -61234 -27314 -4629 7601 45630 67010 102681 111052 99654
14001 99654 23395 -4587 -51422 -53855 29353 50027 5692 52994 18986 1163 -7199 -71823
13989 -71823 -67018 -2954 47134 57267 -39721 -49120 21196 50304 9326 -39996 -51329 -62061
13977 -62061 -86204 -63002 -69299 -48246 5390 -34503 -56777 -4630 -28794 -50488 11001 55201
13965 55201 58054 42501 51956 2252 -50117 -114715 -143955 -115958 -126426 -130470 -111265 -114153
13953 -114153 -132865 -141672 -109842 -36170 11381 -25296 -25023 -50618 -66936 -45493 18779 88620
13941 88620 64461 31767 25072 -46674 -88643 -72896 -57905 -68833 -50219 -56236 -40281 -7805
13929 -7805 -16024 -31562 -30486 -72267 -43462 -29034 -97835 -139332 -171982 -109474 -81009 -131512
13917 -131512 -140537 -89265 28031 36521 33550 46856 -24571 -461 20298 11061 -55822 -87929
13905 -87929 -60424 -74517 -65564 -52730 -73244 -50018 -57989 -55961 -93461 -119749 -84775 -101061
13893 -101061 -173322 -200199 -90216 -80054 -75665 -65237 -119486 -129212 -28177 56784 100896
13882 100896 71308 67025 75300 44357 81287 105683 30866 -37005 -120107 -87902 -97569 -29527
13870 -29527 -29452 -46811 -79710 -45479 -66351 -104148 -19337 -2609 -7513 -24927 -63383 -60998 -17057
13857 -17057 22383 85796 80119 -1628 -39605 5681 8062 -36128 -75360 -58881 -6035 -67580
13845 -67580 -39470 -36036 -44570 -54185 -48206 -73959 -36518 -29643 -28286 -51066 -90492 -49386 -63236
13832 -63236 -104498 -22123 40858 54515 -23533 -10392 -36985 -39089 -9162 36712 55614 19303
13820 19303 -66187 -32610 3526 18806 -14027 15410 26697 -5756 7426 -17792 -89418 -117536
13808 -117536 -81023 -84207 -57500 -26470 -10844 -38097 -58497 -58728 -87029 -94095 -53814 -57963
13796 -57963 -49938 -16373 13795 15913 -31465 -64070 -88776 -34915 -78478 -46243 1200 -28443
13784 -28443 19055 43561 54425 14806 80740 41205 -60429 -126726 -68712 -29258 811
13773 811 33929 52260 39540 467 18194 3948 9123 -14230 -55532 -20543 41804 18472
13761 18472 26260 9298 -36441 -45497 -44362 -76505 -33721 -26887 26397 66316 25490 2943
13749 2943 -16673 43904 78141 34034 -15715 4483 -18589 -25408 20991 -5247 27323 7095
13737 7095 -30947 -7119 -4310 -506 -1757 63994 105580 37324 -13031 -64266 -34920 -35197 -5975
13724 -5975 -35411 -13482 -59769 -19420 15639 -15081 -53479 -91007 -46255 9728 29976 18521
13712 18521 -39999 -130282 -105225 -131803 -121481 -43794 -19312 -20323 38623 76809 -17166 -40596
13700 -40596 -31830 -53977 -18652 31390 -7716 -4228 -25508 -10368 6819 -10027 -9662 -34262
13688 -34262 11195 15284 -52561 -50333 -48796 -90585 -52244 2004 30068 5211 20710 -3565
13676 -3565 3357 -72971 -88059 -17655 -34048 -715 1968 -38721 -54545 -78683 -59570 -62626
13664 -62626 11281 32856 9660 12065 50936 56351 40986 55281 112300 91894 12186 31397
13652 31397 35027 18760 -2871 15983 63229 40781 -38511 -30560 24823 -20267 4556 28377
13640 28377 -6334 48335 130679 114822 23559 9737 -11615 -20512 -40484 -92380 -69868 13617
13628 13617 13354 51278 27429 9471 -56758 -62792 6149 15357 -4216 -500 -13694 9467 -53090
13615 -53090 -65772 -50231 -42472 -14598 -42638 -43292 -52916 -69102 -272 11295 13836 -31159 -68495
13602 -68495 -23100 -49131 -118522 -83930 -42037 -23840 -13250 -54799 -82651 -2399 30186 49415
13590 49415 59208 22350 1942 16649 4085 -49236 -33122 -5848 -36455 -70468 -108699 -108502
13578 -108502 -162311 -148829 -57319 3657 15748 30862 7795 -12403 -27013 -15720 57669
13567 57669 -774 -34316 -52112 -116603 -91564 -68921 -81806 -190618 -226052 -138465 -11287
13556 -11287 -19082 -60794 -69872 -73343 -108851 -64960 -50951 -52487 -4612 -38818 -39846 -45932 -82644
13543 -82644 -140452 -126301 -42286 -6537 -40953 1968 45533 -28817 -84324 -84628 -43532 -1887
13531 -1887 -10914 4307 -13097 -25523 -80756 -82942 -20915 33387 51990 70194 48386 56014
13519 56014 56718 61770 59111 57426 3013 -11188 63302 75912 128161 185750 232064 200474 131387
13506 131387 78399 98832 85098 27429 -17176 -77942 -106010 -91268 -133353 -165597 -113116
13495 -113116 -72633 -56779 -63064 -61827 -72888 -117310 -65695 -49840 2865 -1970 -857 -26229
13483 -26229 -41369 -40761 -20297 -5777 -12750 -25541 -36536 -49030 -17798 -50575 -105852 -75464
13471 -75464 -90316 -89247 -63808 -24637 24897 31793 136477 194621 175998 200432 182750 173228
13459 173228 138331 49640 15138 -19446 2637 40184 -6030 16432 55088 -30623 -97898
13448 -97898 -123796 -82770 -108636 -20755 14571 -64765 -74862 -44740 -76477 -28947 -36698 -101719
13436 -101719 -76844 -49423 -29300 -57542 1022 22818 59128 33934 -36632 -14006 38526
13425 38526 -18527 25844 91372 24123 84712 50611 -10196 -29233 -14002 56645 82472 16919
13413 16919 -72831 -63874 -36703 -140365 -156408 -109686 -53463 -2457 49763 89623 76915 60936
13401 60936 55842 34841 82385 114645 100232 25902 -49496 -64939 -111718 -58404 -52496 -76152
13389 -76152 -38534 990 -51071 -72618 -53710 -6832 -8534 -46288 14461 73101 -13295 -35836
13377 -35836 18669 2728 -56429 -173876 -181237 -104441 -45135 -37082 -36110 -33906 -34261 26358 57217
13364 57217 10071 -22807 -50203 -43400 -81593 -73587 -19106 -5545 7553 17953 28549 34596
13352 34596 8909 -35827 -52794 -5055 -10689 -61226 -121967 -142955 -160045 -58293 -30776 14503
13340 14503 73551 74390 -46767 -42102 -2735 -6186 -3334 -54757 -125940 -114033 -70413 -3181
13328 -3181 -43996 -67111 -72757 -1637 82931 63528 64258 13439 -11137 -12929 6879 44092 86720
13315 86720 22377 19102 21847 12257 9036 -12813 -16164 11339 55379 32059 46795 93570 76276
13302 76276 61748 104774 -7969 -151190 -150836 -48073 -3167 50236 -5912 -23795 -9683
13291 -9683 14560 8958 -47730 -79267 -95773 -114299 -63033 3011 40881 86908 107204 62282
13279 62282 62235 44095 22695 18861 24759 861 76978 96550 19198 7032 68593 50093 82102
13266 82102 77627 32509 -7341 42612 -6843 -26476 -49590 -33268 7309 10578 74637 131954
13254 131954 56642 -6769 -48633 -99071 -43005 16144 33325 37261 60107 48190 36331 20878
13242 20878 88362 118184 103856 164243 256827 315671 344448 337442 425112 475231 487328 587706
13230 587706 811303 1127042 1575666 1954094 2240195 2344679 2261332 2039490 1633827 1186359
13220 1186359 922235 793417 712409 606634 448215 302457 272459 193452 172372 168749
13210 168749 146823 168693 114933 86154 96678 24337 56188 94827 39459 -17595 29327
13199 29327 90155 79830 -14784 -72322 -49229 -34369 -31379 -73146 -80026 13828 60049 54367
13187 54367 103360 90284 27815 -919 -30381 -51612 -6542 630 32959 -55412 -107177 -99354
13175 -99354 -22425 37218 35901 41987 53754 76899 11316 -13702 -5435 3704 30743 46634
13163 46634 50382 49728 6795 8942 31172 34600 -20082 -48874 -99767 -151692 -140694 -97259 -71739
13150 -71739 -32336 -70322 -70200 -82637 -125654 -62054 -85988 -2958 -9859 -62535 -33949 -41825
13138 -41825 -106064 -107733 -63018 -69273 -63091 -24959 -14689 -10826 19522 8351 -44541 -21228
13126 -21228 13940 75589 26389 27081 17546 -8462 -31199 -70426 -88937 -72328 -100674 -37085
13114 -37085 6658 31033 56579 11581 -7021 -37701 -61156 -112057 -73053 -52113 -60340 -56779
13102 -56779 1508 74699 108836 67126 107021 154489 110390 129927 73770 -23156 -79664 -77320
13090 -77320 -49212 -28401 11245 29945 82547 158657 123743 60812 79221 135591 162339 86268
13078 86268 36379 -11131 -21939 25393 13133 -3026 -16177 5130 41508 86647 49071 -7609
13066 -7609 6780 39160 18867 -5639 3463 25035 12547 -101545 -80642 -81228 -45397 -25960
13054 -25960 -7502 -2844 28434 -17847 -14060 27194 13082 -63016 -92375 -130358 -123945 -72636
13042 -72636 -111764 -112301 -109537 -139276 -66158 44819 53249 47109 13207 -8672 94397 90696
13030 90696 89053 195582 222821 161709 160893 218096 203370 145009 113589 94690 30252 -12306
13018 -12306 -71312 -7753 146603 320809 391205 307635 208298 191314 205045 138212 112047
13007 112047 119305 97963 71305 38537 -10091 1760 -35340 -30092 17667 35746 76803 127135
12995 127135 141026 116450 126814 90989 93644 55961 -20936 -32315 2116 2428 21749 -8002
12983 -8002 -1190 41780 59657 98664 95997 40235 31904 51425 69851 107104 82390 35344
12971 35344 16437 14984 21857 58278 70661 99085 161175 245506 331778 292953 245406 172903
12959 172903 190931 167583 187560 145521 133684 111568 78284 54514 56955 80600 127506 145741
12947 145741 128194 109365 66216 64327 66980 129726 135568 53457 4278 60268 150311 162508
12935 162508 138426 143774 190886 228679 249243 188121 128147 114313 121412 131081 151007 224274
12923 224274 233576 120701 56681 68353 184892 206698 170671 194221 143471 150718 161720
12912 161720 79249 -57726 -48862 13823 26979 137499 155848 138765 122114 155811 228381
12901 228381 277031 291256 328002 300342 284591 377651 406045 369291 354113 353633 337161 255049
12889 255049 277881 322860 420196 484877 571837 541267 479915 438298 358079 414214 396613
12878 396613 303018 290512 349540 472972 544492 541532 568061 582723 563179 512246 500894
12867 500894 534969 512191 538228 580281 598181 556223 515635 530941 553914 585332 601169
12856 601169 598011 602287 611949 566204 635038 642029 693558 731557 665895 638111 653096 674273
12844 674273 615083 607335 633132 681587 745169 770089 778534 824910 878878 989955 1085969 1136919
12832 1136919 1119139 1168128 1266997 1306823 1310908 1343820 1360331 1418345 1428308 1453371 1581787
12821 1581787 1713014 1718783 1742694 1765200 1881048 1985559 2078757 2062172 2120977 2294847 2489215
12810 2489215 2578712 2736217 2948366 3081239 3141415 3165300 3286046 3458340 3696271 3901991
12800 3901991 4113947 4357990 4555357 4823972 5090230 5407244 5761540 6113028 6522627
12791 6522627 6965883 7493744 8082616 8745723 9395792 10233025 11228037 12195668 13323917
12782 13323917 14735884 16385064 18186839 20419382 23257801 26641292 30669540 35492933
12774 35492933 41419798 48900089 58619365 72024366 91128940 118414094 157041607
12767 157041607 211032131 282226809 361768165 426801348 458505954 455197009 412243196
12760 412243196 332482531 250307499 189855379 149012172 121150812 101672019 87410443
12753 87410443 76513781 68161600 61715381 56344822 51524735 46999123 42877148 39334372
12745 39334372 36261039 33396750 30692030 28137112 25869150 23844045 22044458 20424158
12737 20424158 18946468 17601588 16426287 15328233 14282054 13349510 12528916 11723968
12729 11723968 10983394 10280808 9673109 9145561 8674540 8200630 7722729 7318525 6963091
12720 6963091 6681098 6435546 6164691 5900099 5696620 5439607 5195714 5059281 4845174
12711 4845174 4628752 4448266 4295229 4135278 3936617 3817891 3667626 3599477 3459407 3401549
12701 3401549 3299567 3213526 3077393 2955658 2847612 2765625 2671260 2602246 2557740 2485922
12691 2485922 2443524 2439949 2379416 2263999 2205107 2185169 2117374 2019525 1986916 1910932 1892126
12680 1892126 1931129 1857452 1734091 1700431 1635558 1586308 1573402 1557038 1496650 1552691 1546962
12669 1546962 1496243 1393874 1329526 1305138 1233759 1221246 1306986 1302821 1238049 1151626 1168140
12658 1168140 1114221 1154196 1111700 1113124 1159605 1177851 1111052 1115873 1063654 1006613 1043605 1003076
12646 1003076 884336 869207 889254 815152 794061 787585 794741 853712 856439 845814 829927 775591
12634 775591 674464 673934 716471 734603 678700 662655 680620 706588 690426 687438 688551 681670
12622 681670 666184 617854 608068 623552 664840 685769 654996 617417 630151 616990 585880 545357
12610 545357 521598 524396 538620 596722 599955 510708 453320 395746 349306 329994 397875 426610
12598 426610 442686 460946 407742 407227 329981 305640 305732 284704 218702 188355 251266 303833
12586 303833 314895 299863 319488 293400 242259 203741 242304 207417 203349 163668 94783 105401
12574 105401 184840 254643 227981 203153 207621 186134 165252 96823 55589 56583 133673 189789
12562 189789 244021 275345 289498 310142 327297 271675 232834 193794 189058 185868 191800 189949
12550 189949 228626 214559 258756 260442 153540 129572 165566 171014 156038 159273 112441 153220
12538 153220 139588 87693 54112 83165 75205 122880 190175 199879 243454 266235 276532 178503
12526 178503 64217 104011 202259 291719 263494 234733 173213 109737 178292 208684 253769
12515 253769 221087 201752 225832 314447 284338 291333 250146 151510 189155 294100 335919
12504 335919 324774 296868 229396 254731 199346 131671 126311 138239 90599 67955 104735 181695
12492 181695 196374 229391 208403 180461 103303 118985 144188 118231 73277 96528 123785
12481 123785 125674 110615 152157 201496 206916 198870 109681 57693 68386 61978 46484 -12674
12469 -12674 934 66727 99814 95854 78908 29846 67611 36516 -9608 3734 -27699 -27357
12457 -27357 -9818 -88392 -53352 -17074 -21129 -97063 -52480 21908 129729 102530 88004 78068
12445 78068 22681 -39063 -108467 -62238 14006 25075 62316 81870 79549 62067 22106 82691
12433 82691 138935 123413 70419 102064 89464 88131 -2391 -27957 20117 59759 88761 53610
12421 53610 54586 46396 123350 145043 171488 147180 121839 43289 44521 42027 26439 62648 90192
12408 90192 73956 126391 112149 113654 109671 128564 126382 151588 199513 185606 107316 66108
12396 66108 77442 55987 23114 21023 75174 82983 82639 58639 21594 58668 76682 133344
12384 133344 141655 134967 137434 105970 85012 22997 -9590 -93897 -128254 -64938 -19438 6367
12372 6367 73782 77637 61939 119799 160720 138109 88517 87037 108966 87660 64120 27213
12360 27213 -20483 51530 98712 92384 94819 44473 74889 129271 85468 57918 7812 45758
12348 45758 160845 172965 133598 108268 159100 93529 17888 -21738 25319 46925 87457
12337 87457 91346 139747 112442 133262 55064 -2034 15148 14921 35087 120837 144107 135296
12325 135296 135253 113734 136908 189812 208976 243551 221817 168558 128495 103416 86200 158676
12313 158676 187735 164253 169331 218307 295521 235482 222502 249525 238466 218517 268745 330460
12301 330460 401151 461555 612004 816384 1090207 1496967 1926959 2319170 2536862 2500162
12291 2500162 2267136 1823528 1438388 1051102 782333 684467 605124 535827 480327 439155
12281 439155 447176 448259 434091 393110 317966 296470 306590 259663 220685 226843 197315 195988
12269 195988 204580 205892 146344 114980 94125 82 71377 185388 105326 43403 24078 88003
12257 88003 54621 34441 60121 7091 -20303 14974 43973 50305 59984 93678 83788 70883
12245 70883 -16135 -75511 2925 67701 90723 73653 -1365 -4455 -5153 -31712 -19856 -2018
12233 -2018 28718 53553 97859 104658 60178 -27176 -27393 17959 10831 -2175 4577 -2181 -36994
12220 -36994 -68303 2975 28099 4455 4243 -48227 -51265 -72268 -29729 42957 66450 19178
12208 19178 -35403 -35323 -36038 51386 51144 51296 55391 49594 37697 59317 104674 87894 11113 -2271
12194 -2271 69452 62456 77921 81249 13370 33223 86286 138935 160480 29266 -78282 -135995
12182 -135995 -103672 -99722 -41589 -39792 -94350 -59204 -22029 -47703 -88839 -42739 11595 13235
12170 13235 -24381 -43041 -16991 5915 9680 -8669 12950 51675 18449 -3171 -2237 35497
12158 35497 62414 111530 81090 41735 -13391 53660 120894 97913 94850 93506 94261 122530
12146 122530 203852 195914 174150 168941 184305 244225 248006 308699 440001 539507 507685 520651
12134 520651 545780 462539 419720 375839 279931 200278 174741 179540 193402 203425 183539 101899
12122 101899 104785 109858 85728 16968 27640 35763 37901 -29970 -26299 21866 27331 11489 -6516
12109 -6516 9744 88241 131492 105296 90606 1342 -58260 86221 100229 101023 184048 163306
12097 163306 128890 61748 14085 83499 134593 129233 63310 50443 86092 92206 12700 -19122
12085 -19122 100308 159724 132664 30813 -1322 -67212 -95470 -92728 -78267 -38521 15093
12074 15093 85403 87342 14562 35654 38823 -878 -58115 -65597 -25717 -5025 65470 102214
12062 102214 114338 20043 -42056 -48133 -36721 37953 89071 27327 -47727 20581 35154 40659
12050 40659 64904 68008 9649 -29036 -97471 -52170 -13234 34881 2788 19931 28318 92852
12038 92852 59872 -30540 -70737 -27743 -17733 -18807 -15971 42399 63961 20409 -12660 19827
12026 19827 94756 61042 37600 25697 -21583 -45707 -5761 -24169 -90947 -66942 -33250 -18331
12014 -18331 68100 66675 24265 -10449 -102267 -180574 -128591 -41618 3217 37574 14996 -6685
12002 -6685 47251 100378 88291 31393 40879 33287 -68178 -132949 -121429 -103344 -41105 -31951
11990 -31951 -16501 15008 -12892 -98156 -32868 -29758 -51226 -38558 -80963 -181656 -231128 -195752
11978 -195752 -102902 -30860 -71698 -104320 -92731 -83055 -32824 -65865 -50933 -84347 -30894 -34408
11966 -34408 19046 69899 26595 -32513 18282 36446 17562 -41187 -29875 -37774 -41741 -41755 -66526
11953 -66526 -78774 -76882 28220 60299 50377 -34779 -35982 -13059 -63676 -91294 -56908 -14308
11941 -14308 26851 72300 54638 31299 49275 39356 63856 76579 102788 46329 -46021 -49590
11929 -49590 -64445 -54735 -33416 -39253 -85575 -117724 -180123 -176830 -137771 -97912 -34007 -32611
11917 -32611 -39777 -119232 -209930 -204608 -75189 67173 90582 41872 54302 12733 20639 -27792
11905 -27792 28439 22293 42125 36236 33317 -7812 4765 -43282 -82823 -53981 -9857 39299
11893 39299 37080 4144 -54146 -43718 -49955 -32338 37179 112062 157651 96767 -10624 -63823
11881 -63823 -63433 -39755 26248 48249 58813 -1424 -7361 -45772 -60957 -76480 -91508 -79369
11869 -79369 5824 -20081 -117059 -63656 -29206 -42709 -495 72093 53970 28669 -10247 -44087
11857 -44087 -26673 -23669 -59810 -73940 -57678 -68720 -71412 -70512 -49026 -99046 -21759 30875
11845 30875 -13034 52907 36338 -40186 -13743 23060 33566 -2202 -62845 -61976 -43202 -20234
11833 -20234 -11172 4497 -18198 -77398 -63914 -48807 -80449 -113354 -88823 -96249 -181595 -167059
11821 -167059 -83342 26539 60568 57540 -25174 -61278 -65674 -117457 -159183 -132137 -57003 -82434
11809 -82434 -73519 -61575 -97900 -121899 -147513 -101676 -17179 52567 86298 63580 22148 14662
11797 14662 54879 23967 -2992 -63008 -95122 -84112 -77478 -71900 -77058 -60021 -34559 -46316
11785 -46316 -34902 -102115 -116231 -60607 -16463 35013 26913 -49690 -81140 -2427 -46362 -137109
11773 -137109 -141796 -102230 -156623 -183310 -84542 -101853 -141151 -144298 -99842 -56403 -50318 -100757
11761 -100757 -126975 -138365 -121095 -71684 -36284 14270 15936 -63218 -29043 4398 -60520 -116338
11749 -116338 -88499 -71041 5962 5408 -58911 -7076 68396 130489 114740 60717 102800 113932
11737 113932 37403 -24501 -91148 -134149 -101327 -43275 -59407 -106640 -95741 -20515 -50020
11726 -50020 -92167 -38239 -40937 -74479 -115338 -81551 -31000 -17798 -23205 -60671 -120749 -15312
11714 -15312 15535 3939 91864 88127 48420 50893 43384 -33917 -53169 -44437 -46449 -44255 -36036
11701 -36036 -63721 -76674 -56947 -76851 -29561 -29381 -69035 19039 52749 26657 -69053 -73608
11689 -73608 -32382 30362 59469 -30558 -88179 -37550 -6723 11524 89509 57223 15833 37846
11677 37846 31767 3358 -16369 -44395 -32296 -47469 -75851 -137234 -106767 -122624 -176681 -122518
11665 -122518 -94878 -79286 -49175 -93573 -154022 -105685 -74835 -65368 -42727 -162868 -185213
11654 -185213 -91804 -95536 -67533 17688 53221 22885 15416 24842 -14939 -89215 -98551 -48907
11642 -48907 -72814 -41351 -123386 -173484 -129526 -88686 -115461 -221504 -173963 -109852 -165394
11631 -165394 -137711 -75049 -94295 -158297 -182832 -189817 -164567 -139141 -51799 -22370 -40499 13411
11619 13411 -21166 -17141 -25758 -19007 -22641 -41758 -55931 -13722 -20396 2533 2403 15578 -23293
11606 -23293 -21741 -82644 -69552 -11586 -48596 -105682 -88326 1810 40842 31820 41549 -14653
11594 -14653 9224 -32337 -27662 -41583 -11936 50795 73047 74677 42187 48865 8180 -10262
11582 -10262 2427 15589 -30941 -14071 18193 40480 39039 19114 75120 79506 29741 -54741
11570 -54741 -94312 -135994 -116200 -106584 -126323 -85843 -50027 -75911 -51118 -36526 -43986 -70826
11558 -70826 -132996 -66190 -68727 -82921 -90396 -47904 -69995 -99823 -148085 -192853 -167803 -124244
11546 -124244 -153617 -152420 -143084 -182013 -135395 -121654 -134862 -90837 -37383 34948 62353 51535
11534 51535 90180 170029 79860 60382 9860 -6717 73250 50659 16453 -19376 -69245 -53970
11522 -53970 -59135 -32126 -42993 -29307 12714 73579 55796 39592 36074 -17439 -31119 10907
11510 10907 60454 43822 -42130 -52941 -95838 -36010 14662 -41368 -40296 -16919 19398 92958
11498 92958 47327 -33463 -97155 -78331 -74143 81515 102767 46341 -16768 -35545 21058 69999
11486 69999 93054 33436 18532 -4286 5689 19813 49343 76260 82811 -19773 -47697 -17050
11474 -17050 45273 88591 48152 -40384 -47044 -80978 -94327 -135656 -116873 -49182 -61558 -98511
11462 -98511 -103107 -74408 -92098 -71824 -83785 -120297 -71071 -46511 -37948 -54989 -107199 -44316
11450 -44316 -27705 -94975 -72140 10788 33283 63004 63524 831 -14271 -1765 32756 36486
11438 36486 19761 -54322 -43363 10002 -17692 -56454 -111818 -90071 -83971 1658 23693 -22486
11426 -22486 21068 5045 -47203 -63801 -89790 -9363 -7312 -121031 -110029 -110165 -180897 -180147
11414 -180147 -75821 -53613 -72605 -48186 -45482 -69951 -120428 -124099 -77152 -28132 47817 83146
11402 83146 64309 34709 -21683 -56024 -54838 1661 41224 70697 96634 56953 45432 13239
11390 13239 -11962 33978 74541 70048 -15063 -54324 -55993 -26791 -48771 -1444 -8735 -17512
11378 -17512 29290 89312 119527 38887 -51378 -79956 -32279 -4020 -1959 -50939 -18683 730
11366 730 40426 63275 33265 76927 33163 -39345 -5561 43791 10578 -52641 -68959 -80433
11354 -80433 -27847 62832 137567 109925 76433 72441 102118 83653 41617 -45860 -70228 -38488
11342 -38488 -44398 -62836 -132664 -150193 -154697 -121408 -119904 -128837 -119592 -60037 -99510 -136992 -41087
11329 -41087 45529 72478 67740 -63832 -109521 -151378 -151336 -111007 -111322 -162028 -170594 -136122 -69363
11316 -69363 -4048 -3830 77605 143006 112529 81310 49996 -16014 -98622 -110220 -115878 -138816
11304 -138816 -108664 -96630 -133293 -180680 -86912 4067 56669 38642 -34132 -77117 -112621
11293 -112621 -73238 -53971 -56723 -54153 -106439 -135597 -89213 -64387 -30064 -88354 -126433 -64609
11281 -64609 51546 72365 54940 6016 -48622 -42853 2230 2756 -14462 -35851 -53800 -74277
11269 -74277 -66742 -73847 -79165 -67718 -77191 -50422 -4277 22168 12730 -15025 14098 66461 102900
11256 102900 15851 -29882 -39569 -50688 -44509 -49784 -58892 -31481 -43649 -47384 -16648 -63206
11244 -63206 -51764 -51218 -102690 -123463 -67185 -83953 -64692 -54421 -43523 -97441 -105705 -70029
11232 -70029 -13735 -4426 -78763 -143801 -121491 -25612 35021 21333 4451 -25516 -84758 -46640
11220 -46640 -60158 -77889 -93341 -39632 7632 -30192 -23510 -33055 -59402 -53428 -36254 -47606
11208 -47606 -14785 -58526 -15479 -7703 62749 53742 146 -66943 -107234 -99767 -144893 -79056
11196 -79056 -62078 -81461 -66872 -73213 -33166 -9679 -18993 -116095 -167867 -115383 -64723 -72288
11184 -72288 -76734 -2920 42379 -27534 -94236 -127266 -115615 -141060 -148668 -110685 -21795 -12926
11172 -12926 -39252 -59548 -78665 -57230 -52197 -61110 -82911 -52399 -5402 -26012 6947 100411
11160 100411 107540 80248 63905 27991 4529 49103 56885 13935 -18256 -35803 -46939 -146907
11148 -146907 -193734 -139993 -88921 -67992 -36660 16050 -19187 -98407 -45438 -3001 69209
11137 69209 33304 -4004 -94283 -182039 -166468 -64843 18361 36475 75168 8963 -56865
11126 -56865 -56345 -44934 21488 77128 -39459 -123118 24789 106107 57438 -9453 -37783 -35634
11114 -35634 -78741 -63718 -32271 12831 28726 -9639 -8442 -8156 -20121 -25467 8512 76032
11102 76032 130322 98634 32600 7063 19423 41091 88851 94509 112081 -6909 -117682
11091 -117682 -122692 -136894 -166403 -164943 -135573 -157868 -106720 -66366 -49195 -31403 -54053 -19983
11079 -19983 11900 45334 85120 83789 50234 34585 56613 13024 3364 27275 344 -27440
11067 -27440 -55059 -27979 -13590 -92338 -116359 -35757 39880 78474 77665 44393 34120 -515
11055 -515 -79710 -90274 -47148 -54395 -99986 -168275 -112613 -123246 -154323 -148040 -144235 -159225 -159583
11042 -159583 -116410 -166500 -182003 -83821 -40147 -3166 29013 -40096 -60803 -16375 26994
11031 26994 10824 -24170 -59158 -44676 -26922 17776 24299 2007 -25929 -22683 66036 105339
11019 105339 31312 -58531 -140160 -170219 -168417 -132083 -28552 43892 4628 4154 49684 47946
11007 47946 56140 53264 92636 15758 -25814 47260 86311 49351 32079 -3734 -45220 -104274
10995 -104274 -41039 17493 -44919 -101397 -56069 -45253 -75116 -48501 22302 41666 3042
10984 3042 -301 -13744 -35041 -53665 -53010 -118844 -55900 3143 -48555 -33090 -39287 -37382 -89965
10971 -89965 -96724 -58564 -105602 -63862 -57199 -106148 -152172 -93056 -62631 -92744 -112655 -45923
10959 -45923 -61484 -99665 -111490 -44311 -29270 57596 57366 69864 46866 -13845 31775 73268
10947 73268 55125 11691 -12007 17844 19850 -49641 -109878 -97965 -51107 -30208 -48663 -72611
10935 -72611 -74323 -87103 -118040 -135501 -137023 -133934 -128796 -169350 -109067 -45676 -43216 -127298 -86109
10922 -86109 -35183 24047 19923 -18148 -58960 -72650 -51351 -62096 -74044 -59503 -74498 -70546
10910 -70546 -24863 -69420 -80470 14147 52777 52736 27104 10600 -41318 -67003 -40871 -63977
10898 -63977 -52029 -67017 -114676 -118581 -122226 -90245 -54649 44105 36936 5916 -13950 -41191
10886 -41191 -106200 -100017 -135076 -155887 -104038 -57976 -41893 -82870 -85121 -78656 -8481 15880
10874 15880 7620 -18205 52013 46684 113283 123165 163040 145059 102554 81865 77312 61776
10862 61776 -27516 -52288 -27462 -31885 -64688 -44343 -31540 408 -17869 18321 66520 78949
10850 78949 16040 -6904 -61752 -70972 -45925 10320 -20943 -26032 -12007 34301 25717 -9621
10838 -9621 -44115 -27762 19450 -54727 -87453 -47748 -19903 12063 13733 28977 -32296 -46606
10826 -46606 -21223 4487 -44777 -80427 -63635 -56271 -38092 -9432 2047 -44753 -81408 -60243
10814 -60243 -91514 -102196 -94465 -111609 -150881 -108808 -93827 -54149 18902 36387 -2504 -51127
10802 -51127 -52934 -78880 -80781 -22368 -7676 -3150 -9652 -31723 -32336 -53732 -51370 -89675 -78183
10789 -78183 26064 37714 29785 -28730 -110154 -99905 -72878 -79142 -74093 -101667 -154716 -84020
10777 -84020 -61056 -34757 -24085 29018 44036 -35833 -53360 -39778 -26884 -19353 -74945 -97295
10765 -97295 -43302 11505 46615 81189 94766 63775 60441 73963 38494 9426 -18802 -79327
10753 -79327 5582 -16846 -99456 -79723 -73671 -105251 -61070 -94199 -195725 -206910 -233648 -206820
10741 -206820 -163175 -198668 -140445 -125837 -165756 -132861 -109166 -103701 -49510 51524 63360
10730 63360 23322 -55472 -106617 -78491 -10223 2375 -67754 -31737 -5827 -4294 -35142 -72615
10718 -72615 -95374 -105902 -130448 -107910 -88744 -40144 -41912 13885 25022 -72633 -122453 -138626
10706 -138626 -125684 -111570 -73490 -14677 -23075 -12871 -50378 -78113 -152015 -127538 -65726 12840
10694 12840 81545 15841 -34996 36971 138508 113042 54521 -7790 8599 -819 -67522 -103081
10682 -103081 -151852 -121090 -85951 -35767 -71556 -53771 -51408 -42443 -37713 -8935 5283 -48674
10670 -48674 -40380 14536 23495 -17648 -33353 -36972 -40543 -72889 -100504 -45960 -43425 -23874 -43483
10657 -43483 -19017 -60221 -100241 -20615 -10921 -32826 -64039 -113126 -76415 -42049 -7483 14944
10645 14944 -12560 -50731 -18562 1217 -24344 -20453 32242 18753 -10226 -73901 -138295 -100959
10633 -100959 -63381 -13757 -75351 -108983 -91878 -63744 26372 50039 53039 78313 147315 130510
10621 130510 78353 8100 7544 84136 62799 3880 -35837 -14525 31730 53904 20877 56421
10609 56421 77758 77998 35611 -35964 -120716 -130363 -88273 -24043 5776 18960 44635 75264
10597 75264 67279 67630 29038 22941 31096 -16114 -31784 -26808 38836 123460 89074 62867 70340
10584 70340 40015 13364 -61933 -139159 -136471 -78632 -38123 -12554 52244 61029 65490 82306
10572 82306 69864 11771 -19203 68517 64275 45678 56002 -6178 -17048 -29552 -84017 -63746
10560 -63746 -24847 -32804 -90501 -89985 -10147 44415 38339 -23022 -5228 4699 -47818 -67778 -88188
10547 -88188 -68159 -141690 -177580 -133752 -56047 -86204 -84318 -106578 -79565 -65458 -11983 23680
10535 23680 -17686 -58624 -109599 -176028 -166638 -86826 -75593 -85284 -1702 77890 43118 -17738
10523 -17738 -37764 -101751 -55038 -1768 54794 44692 -42003 -95025 -16519 50400 29361 51864
10511 51864 8922 -51070 -65150 -116005 -125285 -146236 -156020 -36436 24303 37197 40446 -12080
10499 -12080 -23426 6645 -12231 982 -38958 -77986 -39885 -44250 27475 38995 50030 -44548
10487 -44548 -72377 -106412 -114355 -106731 -74550 -56697 -70000 -44227 -12964 18504 -18520 -20496
10475 -20496 -7668 1324 16667 38215 -32661 -68211 -97832 -93730 -126094 -152827 -147494 -112659
10463 -112659 -101535 -99097 -73272 -38049 8753 10085 -28924 -74855 -78460 -49963 -12816 -15677
10451 -15677 -29098 -57156 -26874 6965 -3976 -14563 -6925 -13169 -36718 -106009 -67855 -36542
10439 -36542 -2974 55028 70857 22965 -71475 -67998 -60491 -11192 -10769 -34357 -15168 -36177
10427 -36177 -44518 51161 75512 4033 24273 6549 13945 19673 -18816 -41459 51237 13857
10415 13857 -44128 -35080 -39575 -51389 -15037 -57220 -48893 -25761 -72882 -145288 -116729 -45718
10403 -45718 33934 18678 -21835 -60245 -70427 -73970 -66660 -69037 -64592 -6171 -34217 3109
10391 3109 -5963 23776 19979 -18094 -77446 -84638 -27855 -1086 -21788 9032 6113 -39188 -57818
10378 -57818 -49933 -53381 -55975 5045 -41971 -22271 13590 -43284 -72537 -58841 14418 12498
10366 12498 -83891 -121069 -85892 -18737 7180 9707 39131 34899 -5627 -54968 -65516 -59029
10354 -59029 -30159 -15293 12197 -15338 -10422 25770 23917 -41216 -68085 -38090 -21907 -28789
10342 -28789 15132 44694 -12853 5231 94240 146948 67425 51724 59130 31637 16604 -9152
10330 -9152 8347 -41714 7882 83535 136521 96487 52455 92087 30971 3453 -17026 -44279
10318 -44279 -14725 30249 18457 72896 30973 14864 10608 18105 -69838 -72506 -47237 -19838
10306 -19838 -54975 -80328 -82397 -50518 -49566 -34923 -36010 -52096 -115841 -77914 -89230 -40738
10294 -40738 -51216 -71562 -26695 -12429 9633 -7146 -4907 -44513 -27548 26997 27130 -45766
10282 -45766 -9235 16766 -553 -12745 -58603 -60614 -80360 -38277 -20767 -9626 26162 70983
10270 70983 45791 -11487 10434 -43770 -79668 -85763 -66281 10278 694 -36851 -72774 -99751
10258 -99751 -127567 -138794 -85584 -39273 -35875 -90006 -84874 -55410 -16655 52353 33111 10120
10246 10120 -15556 -48778 -33463 -27608 -16587 -25733 16736 -19 39170 3010 -30325 -64413
10234 -64413 -53379 -72447 -87045 -76676 6505 61476 -777 -10229 32565 -11530 -97322 -63947
10222 -63947 -101191 -170684 -134882 -79331 -48210 -48084 -21021 14609 13178 -12527 -34256 23294
10210 23294 25757 25612 -28210 -100085 -150829 -160014 -51747 -4610 14844 65243 36519 -51314
10198 -51314 -48079 -50485 -57646 -13597 32867 83678 107914 45299 -29754 -26231 -35458 -60590 -9929
10185 -9929 6757 -34521 -125022 -154953 -80200 -13578 -79043 -102445 -67884 -33350 3153 62862
10173 62862 -14607 -74220 -70456 -23994 -32552 -43778 -101807 -123040 -43676 -20526 -57159 -133904
10161 -133904 -173747 -115101 -40134 42902 53226 35345 -26151 -25234 22114 -75 -25274 -42345
10149 -42345 -26873 -32376 37992 103374 -18790 -80718 -49412 -61993 -127904 -159658 -103069 -78053
10137 -78053 -24118 17241 -8834 -48070 -45499 -21034 75406 60204 22024 22522 49754 32261
10125 32261 47703 65750 13880 -23621 -37483 -61542 -6810 8829 47040 82716 25257 48739
10113 48739 -23057 -83243 -106150 -83343 -65194 -43364 -79361 -134250 -142972 -134065 -125752 -119421
10101 -119421 -125440 -148672 -116745 -3750 37962 -32010 -99150 -108584 -12384 53890 64983 14590
10089 14590 -77400 -38827 13658 -35906 -34750 11813 36566 25945 32864 27900 69536 86416
10077 86416 94867 61707 22476 23039 -19104 -16018 -67427 -81530 -31464 -50070 -111466 -116489 -63903
10064 -63903 -86147 -113628 -86723 -150144 -91608 -47263 -8017 -38519 -132412 -144951 -136125 -126400
10052 -126400 -97137 6238 -5429 -12657 -10185 -50576 -106786 -105889 -72938 -5545 27068 -25086
10040 -25086 -37980 -8921 -12156 19961 44908 9417 -57888 -88411 -125195 -101221 -223036 -216660
10028 -216660 -84333 -88041 -68689 -88714 -102887 -112695 -88474 -63917 -67859 -40770 -68201 -93546
10016 -93546 -129217 -85141 -57277 -32899 -92517 -103939 -87571 -64860 -80584 -46689 -28684 21712
10004 21712 52856 57075 15346 -10988 10384 26024 -87578 -140538 -55675 43860 18880 53990
9992 53990 74313 102274 84248 14160 -22375 -37587 -11885 16283 37536 -11632 -34991 -15546
9980 -15546 -2574 -8344 7360 -85547 -114874 -73485 -38534 -73800 -48253 13627 -14838 -70868
9968 -70868 -76030 -10838 -44316 -9214 39098 54478 19240 7410 8222 -55181 -60634 -36091 -38987
9955 -38987 -35908 -40674 -86865 -78560 -67240 -45252 -10743 51393 104958 99243 119713 100859 36000
9942 36000 20976 90039 85924 29334 36171 44330 2272 -60786 -39321 -3944 3285 -44683 -44913
9929 -44913 -20456 -2278 12788 1595 14740 19206 58194 58793 32738 15759 69212 117027
9917 117027 84742 45322 16091 -39429 -42331 -73537 -52032 -90246 -86251 -48288 -20251 -30821
9905 -30821 -37195 -58147 -65549 -37310 50739 89654 24878 8681 25635 48814 66439 65758 42203
9892 42203 25342 8987 -37073 -14464 -40587 -49611 31840 8044 10890 33765 -36030 -58671
9880 -58671 18485 55369 42301 33579 49392 12172 42687 50060 34774 26538 -7762 -44716
9868 -44716 -68137 -59308 -103059 -107155 -31175 11550 9924 -17951 -49807 -98336 -98952 -56278 -35885
9855 -35885 -18936 -11058 -29167 -131659 -96883 -56326 -28262 -79609 -25211 51554 23748 -2890
9843 -2890 8038 35 79578 99584 104863 26823 -5761 17001 55622 34613 6582 -10500
9831 -10500 13481 68022 66029 10072 -1046 -24559 27065 41803 33005 25278 45446 49738 103545
9818 103545 149981 118358 77145 58625 50409 13144 -22482 11430 26629 -66515 -112636 -130827
9806 -130827 -138521 -57047 -23 11629 9205 11943 -1899 7280 57475 87463 60407 59837 53017
9793 53017 -39240 -33253 -57 2025 5538 36398 5898 -32712 16257 6573 22781 35975 10100
9780 10100 26187 92289 102530 79391 40409 -5990 -27979 -53256 -51396 -36282 -34545 -57937
9768 -57937 -31443 -40007 -39131 -13376 12146 -28782 -66876 -67037 -38663 -2396 42966 20512 48999
9755 48999 9541 -24342 -8464 -7715 135 -1791 58873 35424 118390 118220 65317 8020 -5298
9742 -5298 37336 32197 27058 34628 9532 -39497 37428 146497 150827 76849 75223 89852 59021
9729 59021 -12135 17682 64744 30500 23858 31825 1444 53560 116008 138931 99429 91009
9717 91009 184805 207653 185961 90405 -5924 5090 38030 66983 104130 158261 48466 -38771
9705 -38771 -63465 21263 37795 61441 99865 116413 59198 20629 58399 71551 32254 42677
9693 42677 116839 54676 41263 -16154 -60700 -38546 33185 13494 12167 -11710 79735 197155
9681 197155 150927 153312 145396 125752 79836 56627 33180 50483 73147 23126 67474 59702
9669 59702 107653 118879 93156 113218 101777 -13706 -28293 -2950 45226 48154 56106 116639
9657 116639 108417 89567 60097 47983 119668 178675 174309 44850 -24362 -24222 -20134 -973
9645 -973 -19855 22453 -15142 14271 66523 153185 150107 170033 118222 102782 116757 150609
9633 150609 166154 90986 61519 28812 -49635 -16142 21117 16808 -3854 -7224 13186 6539
9621 6539 -908 87080 127634 199348 226108 209313 212199 177395 124744 84162 51447 42366 89483
9608 89483 83218 79902 194286 230599 187483 235523 230791 187196 164633 130398 118007 9950
9596 9950 20315 122099 107046 123881 147329 175498 153252 99399 5827 -6294 38734 76228
9584 76228 138293 165549 225738 191743 126104 93690 56751 65652 48012 117904 179612 236015
9572 236015 275353 281930 314618 315666 270530 270745 221477 168313 180990 230743 257745 319019
9560 319019 354732 292182 244118 267400 245325 196241 150331 166423 202122 216902 229855 251510
9548 251510 220962 270552 282050 301023 323761 367655 379020 441996 436347 395563 329796 292180
9536 292180 280120 337293 315512 343157 411068 459000 455568 487331 421405 407804 448839 484237
9524 484237 523820 551076 557453 634370 638729 552876 531130 525682 482928 504306 555664 525322
9512 525322 481949 496754 534044 548540 570426 606804 669594 734370 728806 697317 720489 676259
9500 676259 701940 753508 736009 818019 840954 753897 807644 894682 906191 882881 894661 868261
9488 868261 888089 923199 990865 1042155 1027526 1021816 1030381 1166587 1209977 1223602 1232877 1276168
9476 1276168 1391471 1458870 1476706 1438476 1423371 1528709 1629722 1697832 1767477 1818702 1796719
9465 1796719 1804182 1964575 2063570 2174468 2224828 2223095 2305822 2426144 2525897 2569128 2623274
9454 2623274 2765123 2952759 3075170 3160917 3216396 3289020 3394278 3545931 3712696 3821179
9444 3821179 3873795 4108978 4348161 4446077 4549854 4667029 4831357 5062382 5355822 5533567
9434 5533567 5698092 5985466 6197326 6383774 6569182 6709506 6860613 7057901 7310506 7525592
9424 7525592 7719396 7880539 7932748 7943649 8039905 8138330 8226200 8128644 8071029 7985654 7990131
9413 7990131 7990394 7907417 7822335 7694357 7585753 7541610 7424043 7263623 7056082 6801818 6579254
9402 6579254 6370033 6211737 6056167 5845973 5663048 5501868 5302350 5159074 5023335 4797039
9392 4797039 4639989 4560457 4455823 4282316 4122335 3933842 3757195 3613177 3540303 3506679
9382 3506679 3427967 3250917 3122578 3066839 2926663 2788972 2697669 2671676 2636827 2511654
9372 2511654 2400842 2286877 2246424 2269943 2266840 2206223 2145035 2015914 1920319 1808388 1758904
9361 1758904 1769684 1726693 1635272 1560312 1587667 1572452 1518823 1466714 1482810 1492258 1399938 1301615
9349 1301615 1254222 1158496 1177943 1176762 1168161 1160649 1099477 1040064 996961 1041057 1003694 908678
9337 908678 900886 951674 985699 994832 894582 840974 845671 838806 739746 775457 799389 826616
9325 826616 825474 744937 725653 714189 739493 673800 696906 648921 548926 559122 577220 540215
9313 540215 549928 597844 538136 457934 514591 550856 500526 470780 500794 510676 502986 450139
9301 450139 403101 430206 460694 534958 522533 464383 473824 527694 494455 434834 413491 433989
9289 433989 387149 343134 338788 396321 429798 460060 427430 346379 346513 383749 357037 377638
9277 377638 379486 381536 312795 320904 365022 388038 355359 336540 325464 274648 249565 259614
9265 259614 263774 288781 351417 336293 307334 313333 263926 234293 231435 228686 244244 245416 227054
9252 227054 206793 243873 202132 172858 177682 225115 274894 346083 311336 282919 279407 255079
9240 255079 225667 220850 216837 199286 196093 254909 274474 283642 268987 275547 250961 224405 171022
9227 171022 162819 103033 89102 130305 172584 172064 143903 110741 158846 178090 153889 177023
9215 177023 144791 112508 161318 179539 163726 111904 77439 135469 226349 173782 183037 261379
9203 261379 245232 161140 163844 189930 157790 135459 166633 182745 171311 179494 190590 145540
9191 145540 95988 24712 43037 53928 53523 116551 121373 103275 115690 126754 150690 116469
9179 116469 129250 152448 108406 146873 132070 167772 211998 196702 172213 137525 81415 167767
9167 167767 218650 227668 208264 227003 218301 188296 142532 150100 175315 145612 139415 137663 165842
9154 165842 194713 216928 232699 140317 111736 137585 134124 103404 133505 84678 -16112 5203
9142 5203 77487 68146 57123 47217 78300 80877 39485 6089 8172 56879 88660 83541 162503
9129 162503 289338 345990 282445 197626 199240 218350 190596 128592 82011 71888 76494 68449
9117 68449 71325 46276 20274 -14358 -8150 25606 88921 64666 19608 79905 102657 156568
9105 156568 153520 148250 107626 64509 87654 62706 713 -124485 -88821 20116 51612 49729
9093 49729 70724 83113 150003 204085 189180 127625 75787 45708 86972 117585 80679 39518
9081 39518 23655 89248 126620 113392 66524 57369 96233 172784 221804 231012 207696 215475
9069 215475 165305 93513 100646 53908 106575 134997 129278 116005 128345 166926 131611 100699
9057 100699 47325 2908 75161 129312 128163 92196 123683 167042 155384 132143 138407 151948
9045 151948 186871 125013 111951 157593 225739 199085 178096 142657 102447 140427 104302 78837
9033 78837 88047 98570 141270 145512 131236 145588 114221 136048 114473 101378 86704 77759
9021 77759 50747 12426 9987 29252 -13402 -516 55744 42094 26320 135238 132323 62975
9009 62975 68620 58085 72598 59954 58958 51295 35486 63794 76288 22897 -24038 4904 42145
8996 42145 -23844 -19081 19558 39149 127334 136355 75852 77504 120687 118866 66959 -15595 4187
8983 4187 63388 93753 63867 54646 41506 57081 121460 83119 51053 18455 19850 104786
8971 104786 136440 161020 146052 42411 -53387 12676 66930 89219 121263 134273 109648
8960 109648 47522 -4777 24205 68996 69342 72354 142621 154628 106853 62499 56872 1979
8948 1979 -72263 -54853 -50437 -51499 -51996 -50783 -44236 -31880 -57874 -51053 -39646 16492 20022 -29659
8934 -29659 -6797 33825 17252 -32732 -7881 21980 11923 9554 64079 124305 135503 110896
8922 110896 138491 107629 63719 74672 88592 55348 32606 -11890 20082 44316 82443 136083
8910 136083 87600 56804 56875 66021 65547 55013 30412 95618 41223 -27830 -38189 -67663 -49762
8897 -49762 -56982 2688 -10557 3721 5804 16583 -19717 -32047 -43377 -13733 4515 4402 -31005
8884 -31005 -2209 90000 95223 64388 222 -63068 -36468 73918 81779 63830 34953 60708
8872 60708 97327 143480 119977 86221 95629 69075 -9507 7274 29548 -8984 28848 69893
8860 69893 33035 37130 -1820 -7001 36695 55567 22822 -14118 30462 165227 129104 120940
8848 120940 148308 172793 190155 249134 154530 80441 116454 173703 141851 94436 90504 125358
8836 125358 201135 232460 193640 177445 97798 44911 34860 21581 50436 2852 24404 9728
8824 9728 -23126 -16427 33531 77328 92141 49052 6348 24406 -23677 -31822 12097 16237 -5652
8811 -5652 28597 129900 210745 246834 258661 253391 240207 256106 305177 453329 492278 474657
8799 474657 431187 368977 330410 252904 238467 119541 47619 41601 50527 51675 59739 75607
8787 75607 76625 68419 51429 112837 144639 135640 179104 198415 140583 88573 59672 25995
8775 25995 -25829 -19727 -23747 -50050 -65737 -13309 17099 -3167 52397 84495 83551 75422 76617
8762 76617 116721 95060 110968 170135 154424 181535 235960 298071 349137 307150 251104 266908
8750 266908 205469 180169 189908 202845 174537 126791 53692 92457 120125 91980 14402 -29556
8738 -29556 -9476 25342 44098 2822 27443 35981 -18205 -68017 -108262 -41333 -19490 -4254
8726 -4254 4418 -76308 -49228 -1010 27762 -24989 25549 -6781 -32734 -23188 40354 114699
8714 114699 95510 59336 38902 69425 81258 62993 72049 34148 28836 41038 66318 87369
8702 87369 52650 45843 -2725 45155 57278 44267 55676 57472 46517 78309 68726 38946
8690 38946 83996 140823 104469 86227 71404 27158 -59340 -27928 -27335 -67753 -56600 -9029
8678 -9029 68058 92888 56574 57423 6051 -10644 6927 38418 34335 122254 217989 135320 115303
8665 115303 122431 71769 54443 14048 31882 38455 42286 133415 141943 94873 42048 15716
8653 15716 24978 107576 204195 196387 238896 166997 124101 87728 42252 107504 218101 347542
8641 347542 327460 309075 253772 128046 90256 178038 202109 219114 199372 144997 132243
8630 132243 210507 144041 92072 124776 179063 235036 261199 251588 240537 253661 340184 358133
8618 358133 354657 313502 254502 240541 256980 297683 335203 397895 378868 372996 474333 449065
8606 449065 455026 448268 453895 465678 455669 448605 537189 646224 745194 789169 770410 854796
8594 854796 900238 1019351 1104502 1133600 1170655 1192524 1178873 1130884 1129816 1130379 1107451 1011598
8582 1011598 935352 796643 712711 605874 520075 498398 422534 384095 396518 383968 349521
8571 349521 324365 312561 314063 261764 210440 180221 307475 391604 358510 354431 328294 311230
8559 311230 326948 358617 307923 288733 282619 272132 236855 213814 258919 277276 284018 264240
8547 264240 283278 357600 319489 271030 284230 304334 273156 230041 259652 233973 190951 175533
8535 175533 204456 184234 177128 177898 271652 283806 315751 330314 267237 150219 142112 138036
8523 138036 126698 143797 232415 277337 264905 227826 236576 203750 169210 160449 160520 177392 176295
8510 176295 167147 165883 128622 109232 172194 226475 103486 77985 107652 144007 70789 7697
8498 7697 -54605 -23708 15323 71778 141373 113529 76546 44270 -35051 -36181 -16140 -13418
8486 -13418 424 33540 122846 107258 71035 56051 34842 4126 81824 193879 203937 229647
8474 229647 152408 106815 81335 103473 89926 91232 104031 50659 41849 33202 73723 128021
8462 128021 105638 149213 104183 5668 -34752 -45150 -71369 31803 83123 92646 65130 47648
8450 47648 40419 -38761 -34854 45626 124704 167813 152365 115679 39382 77823 103983 16866
8438 16866 -17194 -43806 -112838 -138164 -76764 5309 57955 78487 129585 179501 141727 98508
8426 98508 101845 59608 -4736 -21936 27903 33874 53934 14538 -43796 -1566 82699 16028
8414 16028 36559 73578 78227 154076 163302 89247 86062 76089 88329 74984 90066 67850 147251
8401 147251 226393 231954 191600 144951 59901 -1949 -30459 56859 108260 115919 103804 118048
8389 118048 195826 154990 65816 -13350 56688 130553 183273 84053 -26632 -41197 -14025
8378 -14025 -9345 -25925 -24307 39463 50645 19920 41687 85343 149065 164461 21129 -40414
8366 -40414 -19136 11947 35475 -16376 -102966 -156435 -161777 -71423 77045 100126 88758 90723
8354 90723 93965 75469 68634 114203 143733 30765 -68785 39524 75267 37845 67496 37251
8342 37251 48034 30565 16043 52036 150213 166597 107994 64789 29085 75277 92851 21704
8330 21704 19897 -20978 9210 53946 16348 2122 59994 12498 17719 34327 19261 -9826
8318 -9826 46009 56325 66478 81687 44749 -17932 -22195 -31660 -10011 -51292 -108025 -74748
8306 -74748 -79625 -84451 -22177 55200 76274 32919 114255 113249 93388 64725 91643 53295
8294 53295 17292 -25807 -15042 12487 -4054 59260 107862 90921 -11004 -124851 -69094
8283 -69094 50588 47309 20049 -42543 -75427 -26428 -1011 -25693 30541 39631 12394 27176
8271 27176 54122 12348 -35086 14545 30575 135977 103921 25552 -22968 -60077 -18750 10129
8259 10129 -39435 -49950 26660 16784 -42621 -57018 -80465 -92159 -44584 -12241 29416 47348
8247 47348 -6458 21711 29189 19317 21458 22825 20264 15486 -36057 -67572 -59480 -22596 -1371
8234 -1371 63502 63869 96495 92001 100547 121239 118915 146301 194815 221543 213481 189463 88079
8221 88079 47215 50376 -4340 -48786 -60251 -41767 8686 9637 -32135 -5546 -22600 -33302
8209 -33302 -57934 -2597 48998 -4377 -68518 -123038 -117067 -51325 29236 105252 114520 85570
8197 85570 17023 -29550 -123301 -137405 -107325 -131991 -97642 -86165 -116440 -139992 -133551 -68991
8185 -68991 -77145 -71186 -37134 -21816 -1306 69661 89962 -14028 -23701 17970 35923 42927
8173 42927 71655 42990 11696 1308 33490 35108 41881 -11278 -10863 25158 71879 131661 75269
8160 75269 2910 22381 5907 -8869 56254 64383 88367 65234 -9065 -41442 -59408 -11526
8148 -11526 -7768 -80364 -27263 90244 134011 82270 -28378 -62613 -116972 -119373 -9626 9575
8136 9575 -14060 -13463 65745 12807 -51038 -14517 41154 20941 -35731 -28284 -66320 -11044 23046
8123 23046 31765 19550 36538 52976 54286 9588 3793 55525 46319 3220 -29803 -50743 -21707
8110 -21707 39417 43242 78624 56910 -33999 -18674 47849 54454 80973 51767 -230 41953
8098 41953 -22862 -14863 19399 59019 53084 52042 62125 60942 27543 -44262 -103546 -30326 -18472
8085 -18472 -71243 -131756 -138533 -64794 9204 14585 9028 36920 65930 58608 1515 14513 49210
8072 49210 12768 -11846 52926 -18361 -35682 -32957 -19994 -8100 -33370 -99724 -19213 35144
8060 35144 19667 56328 -11480 -71771 -14553 47461 100705 119526 154760 170868 113218 117075
8048 117075 124515 28406 -594 38120 131229 190337 192079 161265 78548 52676 50898 -12084
8036 -12084 -33583 7612 17002 55837 99243 98000 72134 73590 53276 48767 85836 78686 -27485
8023 -27485 -221 -45900 -56128 13245 61002 99859 37765 18600 71477 130318 113190 84372
8011 84372 142194 88793 54319 139276 182194 138851 96937 108595 136765 183626 247658 237699
7999 237699 247488 240680 245366 202583 147113 164837 252498 354253 363653 320236 259609 186651
7987 186651 165980 170013 192846 194890 140560 121217 115038 110800 55684 162895 254448 271752
7975 271752 306071 196008 128666 139745 103621 116336 158242 174739 195328 185271 132669
7964 132669 88182 94529 211929 244966 183785 198169 152062 205336 251365 218095 152982 184313
7952 184313 228499 247370 248926 261194 295154 306073 238387 214862 163168 165563 158870 196172
7940 196172 211862 252341 239097 217413 200463 165510 212662 284016 237881 144072 128785 136777
7928 136777 104037 143182 180876 167352 151727 137809 176790 229846 169494 122687 135381 238255
7916 238255 346958 327180 197054 143929 199337 189958 188960 253502 297729 337117 333473 299739
7904 299739 215540 160230 165426 187867 245617 264766 217697 165400 190121 221595 180950 161539
7892 161539 148070 155905 153861 196180 179085 142130 123542 147921 142349 154336 140147 192395
7880 192395 209606 128060 82931 60596 157032 228539 164655 56758 43797 96252 159765
7869 159765 113637 84572 71345 149529 139127 113053 91232 41159 56741 67927 76783 39576
7857 39576 -3516 6494 41033 86408 84620 84793 138730 187002 205465 198034 147580 135392 89341
7844 89341 82795 132971 122501 109457 134558 184724 146052 92459 104036 30600 1394 -22437
7832 -22437 -37173 -46448 999 26901 17179 15809 73259 101170 165695 203057 173472 182250 137614
7819 137614 46279 67327 16527 46382 24566 24747 889 -48977 -52915 -19024 34510 90442
7807 90442 144110 88353 -2653 40454 110087 113923 43015 -7098 -16660 -19692 -34117 -35623 -72227
7794 -72227 -42342 -25539 2535 58526 117141 151762 45672 24118 -40337 -68328 -130769 -132688
7782 -132688 -19044 4122 -79806 -95027 -30246 13112 44963 35989 19341 61687 67369 28010
7770 28010 -39175 -61974 -56818 -59407 -80169 -26241 11394 27196 68089 89763 -23855 -80692
7758 -80692 -67548 -8520 24359 46542 103814 82743 55175 23178 49206 114831 135685 47496
7746 47496 36866 39852 47524 10880 4441 -24170 -44391 -72028 -34832 52329 136577 43314
7734 43314 -39771 24699 92823 74649 8133 -62271 -53393 -13021 17276 28079 31536 30871 79094
7721 79094 71029 52894 67838 32216 -59569 -73259 -37187 -30197 -45149 22460 24378 8236
7709 8236 -19080 3783 55055 45735 69981 32668 18404 -20552 -50806 11862 43115 37835
7697 37835 41481 20832 3227 353 2802 47479 54160 42118 47412 46542 62977 99853 146630
7684 146630 161538 124343 47654 5092 19811 60082 11291 -50286 -72612 -52765 -72619 -53881
7672 -53881 -18868 -32129 -82972 -81020 -67520 -9381 37841 -40896 -5262 -11611 -135800 -146448
7660 -146448 -99155 -78757 -73118 -29830 24656 31591 73683 146254 128337 147530 69120 3699
7648 3699 26046 -31023 -116127 -121374 -87149 -55853 -34777 -29348 -25330 10842 70779 52159 78378
7635 78378 94946 39872 -2425 -4721 12787 43998 22257 40472 27871 -67965 -68559 -9544
7623 -9544 655 -17697 -12429 6454 46304 75612 49554 36230 123673 167185 105629 45946
7611 45946 23124 -70537 -144063 -109856 -69302 -20983 -8796 -10873 23307 60978 40504 15953
7599 15953 -22801 -28863 -16381 -27642 -26005 6962 52640 50277 23961 13665 46588 49469 61863
7586 61863 18116 -35112 -25170 -15082 29278 53479 49709 43399 50177 25962 -10734 -35633 -9209
7573 -9209 -8240 -24229 -69018 11837 61849 53392 83529 66961 -12449 -55669 -108659 -106405 -694
7560 -694 33859 12380 -114291 -90016 -19055 -18813 7525 -1023 -76025 -114841 -61649 -43035 -17001
7547 -17001 27367 -35780 -66231 -32536 19840 34101 -24575 -24437 -13032 -14792 -14400 -17431 32874
7534 32874 56809 20445 6248 23585 58457 74598 62863 59847 34839 -38073 -65806 -14763
7522 -14763 13771 -1517 38645 41792 82445 135212 140839 143741 2391 -42994 -99731 -103748
7510 -103748 -99098 -79098 850 125140 85751 36335 18220 -49366 -58885 -50584 -15463 53854
7498 53854 66320 -38180 -66501 -100345 -111765 -59829 25207 61905 36553 64673 73190 45616
7486 45616 -34107 -69298 -84876 -99800 -58762 -25809 -6830 46860 84822 91571 68476 -13
7474 -13 -37569 62413 119119 82572 -1970 -72624 -101912 -88526 -101260 -69919 -12999 -35307
7462 -35307 -75753 -48526 -2514 -6607 25236 -11783 -22477 -44231 -26050 29599 23469 9830
7450 9830 46849 40522 -11951 -71625 -93894 -78562 -73751 -74153 -35801 -33148 -80098 -77692 -87984
7437 -87984 -84946 -94162 -177421 -151986 -98922 -70522 -76530 -127506 -52588 1864 44899 -17679
7425 -17679 -84474 -90811 -122746 -119350 -66355 -13687 15197 21520 -33150 -52741 -80013 -117381
7413 -117381 -71037 30288 26585 16685 20119 42365 63907 58736 104168 89892 33348 31971
7401 31971 -1943 -87768 -63076 -10896 6861 -33091 -34259 -22125 -8994 35337 75875 56185
7389 56185 -32534 -94000 -91891 -120176 -175371 -157721 -111796 -34641 -24171 -114999 -105968 -22616
7377 -22616 -75264 -122935 -87002 -81626 -92272 -126242 -99578 -39953 69166 83608 34718 489
7365 489 -72355 -161197 -124139 -79313 -86015 -10250 -18812 14592 -2316 -13539 10287 42364 -84978
7352 -84978 -126642 -83562 -24228 6153 74808 79340 40384 5659 -52368 -52171 -54733 -68421 -21179
7339 -21179 1680 10896 57355 28325 16853 96560 217518 181205 123514 162882 57422 40919
7327 40919 12630 -75503 -89694 -118238 -119951 -124475 -97695 -63887 -24612 -914 22227 7191
7315 7191 -12596 -5832 15481 23213 36531 54737 -10166 -54238 -57018 -70288 -38243 -17933 -76098
7302 -76098 -67130 -87134 -66440 -117302 -121798 -103819 -61514 -47400 -92327 -86688 -115381 -128982
7290 -128982 -125542 -114849 -49755 -25718 -49314 -70346 -58893 -73326 -65967 -107162 -160058 -90094
7278 -90094 -56232 -44752 -15189 24394 -13756 -34484 -25566 15279 58138 -12020 -51150 -89356
7266 -89356 -120063 -68434 -18321 7517 -10069 30845 56051 34515 39847 -13593 -52161 -19696
7254 -19696 6418 32766 -7363 -59031 -59251 21779 73734 -16928 -89998 -63377 -37037 -47965
7242 -47965 -32922 21246 31981 -6468 -43507 -11773 12608 33951 46862 51074 31012 38579
7230 38579 30370 -15776 -117651 -177684 -123151 -67835 -34428 17680 -1934 919 7332 122960
7218 122960 182767 156487 65378 -14442 23937 93085 76528 25325 -18236 4412 -1312 -41254
7206 -41254 -100302 -126035 -103199 -55537 -12356 -21472 50074 -34917 -99246 -68416 -65027 -6618
7194 -6618 57779 112899 146971 121775 31052 -43140 -142743 -85907 -23722 -41863 -39479 -77401
7182 -77401 -74119 -141507 -100692 -35588 -63029 -76342 -24475 9865 57071 85352 90624 93743
7170 93743 48493 -49589 -90338 -35446 24692 36158 -16604 -94744 -140175 -141180 -80809 -33929
7158 -33929 -51089 -95501 -113984 -88414 -97835 -77556 -18459 9830 25994 65037 82282 30649
7146 30649 -54354 -59404 -73928 -71098 -129895 -160758 -120851 -38660 40290 50920 55946 24830
7134 24830 -335 13810 32702 -25973 -31167 -25758 -9076 -45340 -101839 -130392 -111048 -65017
7122 -65017 -82363 -55079 -7963 8097 -12124 -7392 -56455 -63871 -63868 -40192 -34343 32670 71454
7109 71454 -36139 -113292 -453 53407 43943 54953 40705 -5435 3498 17258 -20500 -37929
7097 -37929 -133199 -153550 -64619 1660 33226 47715 106034 73257 89932 37431 -9867 -18022
7085 -18022 35780 76035 46019 37735 45220 -1483 -65176 -57306 495 46202 57958 63385 70145
7072 70145 37999 49794 62032 133330 134510 123392 102153 16910 -3641 24319 -12758 -30922
7060 -30922 -26655 -47278 -46313 -23637 77008 58872 -47536 -66740 45648 152997 131897 135317
7048 135317 36271 -60863 -81798 -40205 19680 2259 51200 116802 129901 103390 71686 38014
7036 38014 40095 29797 24222 45052 25474 -19152 -29165 -71943 -73826 11584 35755 30987 3901
7023 3901 -67390 -57571 -54117 -73070 -99067 -95501 -130011 -91455 -94937 -147428 -209739 -214541 -182284
7010 -182284 -181702 -168149 -169125 -132235 -116373 -76376 -71616 -80802 -57756 -19096 27234 64241 44155
6997 44155 92174 67505 -20966 -58793 -103819 -155335 -124384 -76744 -1440 8333 -4401 25772
6985 25772 1829 -108579 -139298 -15453 33341 84268 67929 6471 27415 -16608 -46880
6974 -46880 -14044 78436 73436 62030 66036 60976 58346 40781 -2518 39630 -9480 -29116 -57319
6961 -57319 -73499 -42441 -12507 -40114 62732 48746 34189 23773 -44834 -114591 -37465 7940
6949 7940 37000 66134 55400 32507 27554 -16568 -70464 -68393 -97784 -90273 -73899 -78005 -13439
6936 -13439 -25695 -13422 -8355 -20204 -46838 -62564 -64909 -28606 19220 44977 28336 55025
6924 55025 33090 48509 72783 46213 -15650 -24208 -8304 60759 97756 33397 -15713 64910
6912 64910 95578 57795 30905 -6613 -1440 40847 119119 86987 43715 42138 63649 24826
6900 24826 -3225 -22522 -75538 -49240 -38373 -33478 -53227 -33956 -23136 -51076 -65954 13977
6888 13977 47080 31679 41986 25660 37567 -4581 -44266 -113586 -209180 -164004 -78395 -98474
6876 -98474 -102296 -43557 14309 -42684 -52631 9740 -58593 -84568 -17580 35583 29640 8471
6864 8471 -79983 -40809 -52999 -51222 -35593 13433 13671 -63106 -73092 -39720 -59435 -39981 36963
6851 36963 30758 28476 47655 5147 -25993 -55520 -31421 -9627 -7889 -9320 -42659 -28586 14294
6838 14294 -28463 -43937 20894 67189 46464 47606 93843 112918 52730 -15080 6162 -5845
6826 -5845 -45518 -5612 6116 -46255 -30083 -14693 -6588 10794 -24157 -5120 -33368 -52692
6814 -52692 -42307 -32483 -32511 -18643 28433 49409 10322 -8487 25303 70685 22446 1452 -21866
6801 -21866 -7902 -31956 -21090 -20098 7502 -59749 -87774 -49558 47806 107756 62609 9687
6789 9687 -5226 4190 -10039 53417 61152 -12615 -49770 -18241 -7621 31139 22992 -16595 -12352
6776 -12352 -9283 2504 -77847 -114116 -42910 38478 67474 -30582 -85100 -91015 -155906 -218338
6764 -218338 -211240 -129490 -37160 14538 58888 26806 79088 188316 137614 115372 94699 23027
6752 23027 -36499 -64096 -72384 -76329 -106305 -129987 -88663 -48502 -43096 -53759 -16026 10241
6740 10241 37256 38414 22557 -20068 -46796 -26272 45456 40944 61660 68880 23186 2837
6728 2837 14522 26590 19300 21034 43413 6271 22908 -6585 27502 62760 94810 92235 46975
6715 46975 -8361 -32653 -7105 -17244 8142 24776 24664 33442 81698 47656 22129 -11727
6703 -11727 -30811 -92154 -103834 -28756 12634 -23303 -81966 -25850 25865 22692 -27622 817
6691 817 37088 33643 814 51741 74827 44287 -28646 -57137 -10970 -129327 -209591 -188606
6679 -188606 -92329 -52048 32368 122866 112014 99736 141787 142389 87623 90208 88416 47446
6667 47446 64413 57980 23048 5274 35878 -35168 -51652 -53169 7204 -1220 -5054 -40266 8673
6654 8673 -17206 -48731 -9645 -27204 23563 215 -26114 -23478 -27599 -54038 -53848 -74681 -112242
6641 -112242 -123176 -90693 -80049 -25478 36238 43205 -2700 -15653 -5422 59613 39524 -4129
6629 -4129 -17425 21814 38037 973 -52162 -95881 -117947 -81371 -65397 -33980 -20088 -59826
6617 -59826 -31527 -11662 2361 12358 -39991 -9482 -4738 10912 -20551 -86476 -127451 -73840
6605 -73840 -28948 38315 73860 80555 103703 115926 107451 55354 37561 16741 35738 4205
6593 4205 2007 42190 63077 105424 53957 11253 -50409 -49361 -40495 -5431 -15447 -16932 14934
6580 14934 7963 32270 -6276 -50184 -128244 -56901 121471 155872 78416 -55537 -111489 -78201
6568 -78201 -5090 26723 28412 9044 -32671 -63218 8580 43867 37141 19081 -12526 7610
6556 7610 -7383 -27484 9460 22834 -4755 -43152 -50067 -34006 -25956 -51294 -76483 -77955 5368
6543 5368 41418 -14919 -41299 1371 -61470 -154046 -117853 -113688 -121763 -89913 -92716 -70383 -35876
6530 -35876 -32036 -37621 -98147 -72307 -47001 -65200 -54964 -28542 -34405 -29764 34626 43975 -40013
6517 -40013 -80181 -97032 -78203 -43239 -29028 -31907 -52988 -17905 37091 118037 90128 55483
6505 55483 23847 -53473 -40398 -7416 15977 45959 17971 45988 -3605 -25313 28578 82735
6493 82735 48904 48619 60969 65151 69221 38225 39101 24879 41593 24859 -12312 -30572 -50518
6480 -50518 -88810 -69411 -32678 37735 -18362 -55671 -25668 -11470 74033 51928 87797 102411
6468 102411 50573 18790 -31496 -60313 -64248 -46521 -7541 77970 136902 82139 36153 15346
6456 15346 -8399 5474 -28708 -65257 -34769 -49774 -84701 -72288 -38520 -10582 -9534 -25097
6444 -25097 -118938 -104004 -113194 -90121 -34836 -13538 33408 79675 4296 -9976 -18170 -43295
6432 -43295 -25871 580 -60846 -71605 -24423 76860 70946 2398 -40858 -81364 -7793 77597
6420 77597 75979 51016 30943 3477 -66038 -73779 -151538 -169785 -153875 -51435 -1642 4772
6408 4772 23556 25526 -17014 -11152 -19168 -37194 8289 -38004 -10124 26789 -18174 -42909 -20364
6395 -20364 -64438 -76109 -52985 -9907 -33432 -67559 -30052 -39935 12303 8488 -24132 -21138
6383 -21138 3866 66033 37230 24945 16552 31436 29684 24842 39476 34162 -24978 -28409 -12601
6370 -12601 -43403 -18698 17837 -67101 -47624 -4632 22383 20549 -63830 -84493 -40518 -2258
6358 -2258 31490 12560 -43516 -53161 -123428 -117040 -89226 -118148 -89013 -19787 8174 -8384
6346 -8384 -20065 -44666 -41875 -25880 9183 29553 64873 96117 50263 -27559 -70651 -89160
6334 -89160 -97010 -29683 20110 -46140 -93866 -95561 -112122 -87032 -37069 -24573 3996 12362
6322 12362 -42834 -53215 -664 -6098 -26471 39230 59802 7873 -60916 -54762 -71826 -29173
6310 -29173 -51338 -73437 -4434 32950 32178 29729 28455 18892 4776 10012 -19825 -28384 15158
6297 15158 67091 27806 -1153 6873 41500 4794 -31473 -57156 -58020 -100032 -114988 -36207
6285 -36207 -15717 8718 -31667 -10447 22158 21076 -37912 -69331 -51013 -27335 10972 -8338
6273 -8338 60448 94123 83635 65017 55590 -2833 -55994 -75027 -92004 -117268 -145722 -127069
6261 -127069 -131608 -111718 -140024 -94375 4846 23793 31244 58291 56643 83058 20427 30358
6249 30358 46051 56003 42825 23727 80086 77247 69159 63749 30642 17941 83690 122009 45212
6236 45212 3316 -3213 7337 10207 -6551 -83294 -143153 -117186 -97292 -162876 -224898 -228811
6224 -228811 -228807 -175739 -104080 -21900 50316 110580 89677 41668 41260 83483 59386 2693 -31258
6211 -31258 -49530 -73444 -74946 -39963 -26595 -36608 -9035 9438 38328 41075 44068 141694
6199 141694 202502 148094 133983 137355 120735 63712 50815 64520 48811 114478 93335 -14779
6187 -14779 -58432 -45635 -104152 -40199 -24250 -39547 -18038 -19968 -31970 -59674 -21239 -17848
6175 -17848 -12121 -26905 -29382 63246 92082 35391 -8965 43712 36689 -23406 -72444 -138970
6163 -138970 -164957 -182118 -166781 -112665 -105602 -104743 -66938 -47109 -61463 -13954 -6557 -30954
6151 -30954 -22960 15955 10432 -384 3213 81167 119870 33225 -18980 -48936 17146 28592
6139 28592 -26220 -11633 -19148 -58058 -29846 -43945 -28606 20434 -21387 -9794 978 32184
6127 32184 79302 84796 65745 93977 82071 52836 70589 31952 53577 91235 41452 10035
6115 10035 30439 77562 83283 70232 6550 3187 14407 -21585 -63088 -71430 -99664 -17048
6103 -17048 86220 33657 -29056 -9912 40083 32233 35579 41281 16628 -41576 -16917 12233
6091 12233 65654 91172 52207 -36169 11806 -16542 -26019 -1429 23738 8045 68266 82396
6079 82396 88828 54021 -13476 30904 118112 82705 127646 125619 50777 41215 25940 -3966
6067 -3966 -15195 -38707 -73450 -6254 56549 76405 99410 73597 84431 104895 144658 63704
6055 63704 -13237 -36216 -74499 -95901 -61331 -16179 38993 94534 137333 116952 20513 -74037
6043 -74037 -141776 -104066 -71536 -39935 -61562 -91876 -84338 -99258 -40251 45855 84269 108554
6031 108554 83752 -24842 -31479 -2653 -8017 -17989 -50180 -59667 -32862 -22184 30858 75451
6019 75451 -2509 -56566 -33729 -47326 -93969 -34104 -1112 83306 52833 -15903 -82886 -53944
6007 -53944 -30332 -4410 -31906 21186 -8049 -73053 -49316 -43735 -97257 -45187 -1048 -2794
5995 -2794 -64294 -44662 5707 39222 37772 -4354 -83542 -137396 -82538 334 -4734 -49482
5983 -49482 -7502 -19628 -39381 34809 42782 26804 -22247 -23908 30423 -8294 -23907 -10567
5971 -10567 26863 33209 21783 -48154 -63220 -35109 -29377 -15982 -30198 -22185 -21844 52141 73430
5958 73430 4267 -17555 -4986 7313 71805 105008 69265 26569 33772 25859 -11178 -9948
5946 -9948 -48313 -52560 38010 76631 27440 -1743 6544 102031 110359 100083 91093 29564 -32486
5933 -32486 -42617 -31798 -28150 8761 58145 65820 23261 22938 29261 -10974 42027 115716 104727
5920 104727 40276 7863 22766 86402 69863 -34068 -60742 -37497 35275 106736 60246
5909 60246 60788 65800 64855 -6812 8941 21594 -362 19553 -18171 -14333 6786 -32231 -10140
5896 -10140 60270 40988 -51017 -106047 -78234 -12455 10273 -1709 -23005 -24883 -2705 -55344
5884 -55344 -115481 -58081 -32164 -22606 -9301 15289 17130 -97834 -103103 -86802 -71163 -19198
5872 -19198 -34723 -7281 -24698 -69724 -103570 -103294 -55458 -53753 -45412 -61920 -88926 -55164 -42992
5859 -42992 18068 23387 -23901 -79172 -85036 -104766 -150712 -130040 -144439 -102539 -66871 2868
5847 2868 -793 -51943 -13371 -32044 -112557 -61379 3948 -539 -18578 25926 89425 22542
5835 22542 -24773 -52168 -73158 -44210 -43841 -23922 -70567 -99470 -59920 -75400 -57800 -27008
5823 -27008 54739 128875 86170 -5759 -17159 -15709 -3293 85566 59509 -29077 -24622 -12415
5811 -12415 -20267 -44333 -57214 -92735 -91803 -69813 -28144 60597 75246 12801 -32511 -7092
5799 -7092 -14218 -25987 9673 -12918 -38712 15007 34402 24040 -26896 -53654 -99388 -61071
5787 -61071 -39787 -45814 -25985 20147 -29596 -52719 -47552 -550 47465 96486 139988 50249
5775 50249 -13866 -81651 -44079 -7453 -1980 -16292 7776 33636 41048 26017 -18353 7580
5763 7580 45366 74211 67371 44418 -26448 -138106 -101820 -41163 -2057 17533 44718 32612
5751 32612 10537 -57008 -51007 -43223 5440 22444 -15988 66233 82630 104312 116822 69807
5739 69807 30421 51221 38622 -61265 -81651 -40058 12885 -23202 -37119 -57401 -135356 -75020
5727 -75020 802 51159 56087 78034 83660 43054 36130 -16243 -118851 -141776 -126013 -19667
5715 -19667 29048 -512 -28532 -78515 -58264 -2177 -24866 -123792 -119791 -60284 -25046 14786
5703 14786 49497 61041 -40529 -51528 6796 -29510 -35015 -44650 -64502 -41236 11231 55997
5691 55997 3527 -24211 65911 62753 37989 -12710 30604 41030 40870 62930 32173 14082
5679 14082 29525 74366 23727 -660 -68364 -74897 -49839 -120946 -113971 -57539 -50730 -74876
5667 -74876 -88350 -72006 -617 33533 -13363 2393 57826 61567 24382 -87861 -66233 -17772
5655 -17772 -103922 -83191 -69738 -90797 -95551 -114653 -101974 -31345 -55616 -74734 -90364 8408
5643 8408 29653 39897 -7103 -59973 -29841 -23280 -92686 -24596 22410 -18337 -30230 35574
5631 35574 70778 76833 88287 146374 108553 85241 67182 15859 -23224 -38642 -42950 -23571
5619 -23571 20900 33229 -51835 -36065 34315 36517 -23556 -76345 -39021 20805 -29374 -13580
5607 -13580 463 -10032 1071 35619 -12643 -17440 -22565 -46538 -64528 -96946 -104903 -95517 -40691
5594 -40691 9671 50603 61795 50155 39147 19875 -4798 -23549 -27030 32334 100452 34680
5582 34680 -38023 -35798 -29137 -46222 19417 54277 37324 75319 31212 50033 23470 68039
5570 68039 29623 -30011 -15012 1322 -42959 -57032 -34288 -40833 -84139 -26518 -8418 46832
5558 46832 60453 44667 44604 105504 59754 -50215 -89647 -40759 15430 -14344 -47572 27914
5546 27914 56030 3514 -21239 -12709 10891 9030 -147 -26610 -3762 19954 65679 83886
5534 83886 49647 75157 103106 87102 11751 -722 -56136 -43402 -48695 -84814 -78791 -162336
5522 -162336 -235924 -205238 -114633 -30211 -24365 14388 42991 16945 -32396 -49206 -19584 -29037
5510 -29037 -7709 41668 21796 -21698 -23453 -70580 -16395 9983 7288 -56558 -53610 -131624
5498 -131624 -55798 3681 -3791 9834 15084 -427 -43997 -23745 -68316 -55609 -1464 24022
5486 24022 56358 60341 48599 -31152 -45726 22620 1886 29541 46214 57873 82716 48997
5474 48997 43751 21095 -7481 -54489 -30699 -33214 25623 78870 89939 -4827 -28589 17239
5462 17239 8681 2524 9502 38036 24064 -5029 11661 -54929 -108930 -69916 -108850 -112834 -69308
5449 -69308 15155 8255 -42836 -10981 52046 81127 -26147 -26121 21870 26977 -13827 -16564 8650
5436 8650 18929 59866 55193 -13982 33150 55710 37487 35869 85942 90878 65380 81419 12120
5423 12120 -38133 -74151 -48697 4200 -4646 -13827 -5404 -22602 -40342 -19041 -1019 -42793
5411 -42793 -30103 -42412 -36201 -79118 -92032 -79750 -115298 -109653 -113192 -102923 -127497 -151009
5399 -151009 -89036 -68524 -72875 -49006 -42705 -59624 -14026 69464 163315 142653 66589 47375
5387 47375 68292 62019 18563 85939 142042 81555 27537 -15188 -60987 -105502 -182345 -151374
5375 -151374 -1655 50605 1156 -61497 -100840 -98907 -45282 14579 73086 47780 1286 -35114
5363 -35114 21899 103651 96187 115108 126366 73388 -2530 423 18060 -18266 -43725 12772
5351 12772 56600 63892 64744 -30831 -65161 -9134 11388 28252 3968 -45198 -4491 66393
5339 66393 29098 -36566 -80984 -13386 31658 35589 21140 5126 31068 44190 32501 58447
5327 58447 28623 59332 24130 -77956 -75247 -36668 -8873 35400 87292 42286 23590 -34459
5315 -34459 -80098 -116113 -125318 -56145 -23385 -44291 -37256 -35338 -20685 69310 103091 -7988
5303 -7988 -14366 25073 28476 68417 -3473 -38022 8182 -6972 -32253 40562 158671 131168
5291 131168 132755 139547 161144 122446 75039 19688 -48320 -45558 -39859 -11157 23817 2850
5279 2850 -76355 -89742 -104946 -29063 27234 39767 31113 16973 931 5813 -59801 35855
5267 35855 76429 51018 -20695 -62733 -73479 -45430 33461 44400 34079 62630 104518 82961
5255 82961 -14695 -9373 -18158 50549 59168 -21523 -98517 -54590 7852 39487 -31160 -93475
5243 -93475 -42919 -33336 -84509 -103491 -37702 30482 64801 100183 74533 -24198 -28389 -48011
5231 -48011 -58648 -24044 61185 6305 25790 27965 32739 14677 8401 19777 -16397 -5674
5219 -5674 15851 6122 -74026 -85468 -13264 53414 41316 67407 85688 75675 38905 46974
5207 46974 26725 -14582 -51943 -82861 -29720 10354 9091 90935 133074 95300 23490 1217
5195 1217 14271 16439 45173 20733 -54015 -67412 -53701 4610 33806 137019 67089 23204
5183 23204 59054 68484 10772 -4963 -4821 -5943 -40052 -75235 -100231 -87423 -96857 -81674 11926
5170 11926 50258 74699 29853 -32226 -29272 -5527 -20928 75699 77862 41027 -11028 -65019
5158 -65019 -70773 -7820 -8055 -16022 27811 -32599 -94024 -111689 -46780 -31348 46769 153063
5146 153063 124854 34567 49642 137020 203368 207949 134385 38296 -25985 -38814 -35550 -27253
5134 -27253 -15715 7015 -1002 3548 -6554 45576 57346 -39574 -15453 -47904 -74699 -74955 -2086
5121 -2086 -8531 -6323 15404 21031 50404 46912 1979 12680 8469 -18082 -17520 37763 -3649
5108 -3649 5517 42295 36091 4146 9061 99325 109840 85064 58134 62113 61033 73781 128968
5095 128968 96223 12212 -29927 39662 71495 46712 68969 63626 25151 -3375 -16085 -8448
5083 -8448 -51340 -119882 -161636 -77766 -16016 7899 -52755 -29000 -73741 -131147 -32489 -1654
5071 -1654 59036 55024 9155 -18203 -77605 -101437 -17772 31133 30188 80518 139604 78771 28777
5058 28777 94380 96059 48936 -1999 -46737 -40709 -53697 -45959 -34061 -72309 -44108 -55838
5046 -55838 -69685 -56612 -52367 -69677 -75935 -39950 -39376 -64079 -49017 3254 69469 47274 -2177
5033 -2177 -43196 -52988 -17856 -46527 -38013 -8341 27063 80388 31734 33997 60803 76272 49440
5020 49440 66168 47425 1784 116953 172800 140517 45030 27770 14920 33450 90258 113646
5008 113646 126149 77067 98385 79979 48971 66480 -4469 -14697 -6877 49352 17334 38105
4996 38105 -8054 -66018 -52832 -30248 -41136 -40079 -16408 26173 42144 22730 26691 45682
4984 45682 44157 94404 81936 28740 18184 61216 79157 -12579 -58164 -36449 15478 42162
4972 42162 40649 44681 32097 -20036 -29711 -68699 -61152 -32693 -32889 -1212 10652 23099 29069
4959 29069 9712 30151 39311 -1273 -33874 -37003 -34124 -35373 13607 -65308 -98020 -48206 -61119
4946 -61119 -37796 -60822 -31132 18697 17278 -65720 -36325 30973 63088 86606 70284 68133
4934 68133 87505 38671 19158 64401 148353 82489 -48607 -69136 2710 -54022 -113750 -16444
4922 -16444 -56004 -68041 -20977 38024 98763 166375 124755 82384 101159 75339 101388 158705
4910 158705 93987 10087 -48672 -51693 -29596 17114 53808 38302 -38679 -61765 -65349 14590
4898 14590 10389 10570 -27745 20665 50285 87796 67334 47394 8892 36166 103942 82050
4886 82050 10939 3366 -2316 72243 90828 64572 41158 37764 16563 23749 9975 -47578 -33892
4873 -33892 34505 49770 51469 46842 -53274 -62295 23950 32868 -56429 -52998 -110767 -135525 -60687
4860 -60687 -98317 -93661 -92264 -99328 -116345 -129340 -127629 -81111 -53164 -77235 -68642 -77317 13752
4847 13752 114081 85211 -23425 -94342 -80944 -22318 16894 36340 17369 24621 68865 85432
4835 85432 116259 93784 23471 -15099 -38259 12461 11370 -2504 -18489 -24576 -38648 -76690
4823 -76690 33310 99574 88367 43590 34583 53915 56889 -9372 -97583 -4920 7990 -9770
4811 -9770 18028 60554 31693 -47827 -72229 -27385 -14992 -9397 33009 46730 91573 89505
4799 89505 7286 15486 -13587 -50721 -89271 -79754 -78966 -109851 -11279 117 -63596 -35108 -15949
4786 -15949 30547 76085 75783 -3220 -56627 -73289 -78351 -55734 -39474 -37348 -10887 -85668 -92940
4773 -92940 -69231 -84788 -47587 29589 11278 30954 45916 96336 58108 25835 53939 14245
4761 14245 -45012 -71530 -33868 72665 42748 -27896 -120065 -140776 -97740 -2802 29883 13585
4749 13585 8473 -16304 -1019 33651 -20186 -93083 -82509 39094 72519 12460 15740 66598
4737 66598 11936 -40222 -45211 -91035 -86341 -36126 -19577 45774 45524 34038 64887 61397 46411
4724 46411 39650 62545 112542 71873 50930 -15682 -41755 4076 62241 58045 15839 27318
4712 27318 64233 68654 86409 29648 -19313 16752 67239 48371 55632 24998 38451 72472
4700 72472 82757 64267 86888 50576 31166 26690 -15588 -31453 -29905 19868 28069 -62286
4688 -62286 -120538 -72389 -94828 -111555 -96024 -54537 15068 29911 -7071 11304 23696 3740
4676 3740 -47368 -26409 -24462 -80126 -99246 -145830 -62192 27596 -9174 -46649 -77551 -99005
4664 -99005 -114605 -105521 -114366 -89699 -102219 -115655 -89950 -85469 -21311 45485 36166 94397 140138
4651 140138 85268 61841 55507 11043 -52844 -131999 -112601 -92932 -50553 -17296 -10325 -5395
4639 -5395 -23425 -54312 -95089 -54234 -13921 -67573 -126436 -118273 -55962 -70040 -22679 1624
4627 1624 25546 27571 30955 46746 21220 591 -24480 -48179 -27274 -1907 4913 10420 8659
4614 8659 -10971 -38638 -33433 -43709 -43476 1313 21541 3490 -53748 -70239 -25711 -69194 -130382
4601 -130382 -135960 -104546 -114659 -142713 -125037 -103921 -127096 -107784 -83790 -66962 -47491 -44437
4589 -44437 -49150 -9535 -22430 43873 33205 -23076 -15291 16896 -32210 -70189 -31705 -53862
4577 -53862 -61449 -23203 -29012 5169 50837 46494 47546 62256 -519 -30585 -44553 20914 45121
4564 45121 -23510 -28476 45256 69441 8204 70028 91324 450 -30934 51882 66451 47100
4552 47100 102428 97781 -11559 -38743 39708 59312 78365 97326 52175 -19548 -88902 -133297
4540 -133297 -35897 4092 -35612 16454 29777 9577 39577 55235 21826 22549 52866 -52918
4528 -52918 -78353 6242 19121 -1367 -38489 -67870 -41758 42063 -5228 -13986 -31382 -48470
4516 -48470 -14213 -26844 -47840 -31702 -60447 -81950 -105979 -107430 -37116 -5457 29126 27555
4504 27555 -29424 -33032 3714 86066 66932 -4264 -40393 -111103 -80809 -42827 2114 4933
4492 4933 -9014 10699 -26718 -25914 38964 63365 74624 79218 102130 67616 37211 28329 91509
4479 91509 12833 -77270 -53056 8657 34588 46842 39063 -21461 -33885 -26556 -66460 -93483
4467 -93483 -32593 -13940 41886 21066 -14112 -45560 4475 75798 79500 106287 59179 21298
4455 21298 70435 109774 88627 36999 37869 36692 -8671 -93699 -120290 -55388 -84299 -51878
4443 -51878 13775 55974 29638 -6234 -16488 6439 34988 12046 -33082 2447 -9154 -46322
4431 -46322 -92244 -96308 -87680 28442 76292 76636 14408 16882 -2270 -10928 8989 39379 77353
4418 77353 91094 3360 -79188 -117064 -25256 13821 41677 53905 18956 1526 9877 -31942
4406 -31942 -135980 -204336 -200420 -70306 -101018 -80872 -2891 10285 -12424 -42798 -26765 -14560
4394 -14560 17546 8459 -49573 -66269 -105331 -128369 -129156 -91770 -87038 -36183 -23513 18064 92754
4381 92754 60849 7394 -3373 11691 -81563 -92324 -46923 -9215 23884 3988 11794 -18181
4369 -18181 -7540 30203 38554 -35862 -81153 -99840 -75322 -82818 -31427 21319 23195 65642
4357 65642 117792 67068 -49299 -40245 -41537 -80262 -104838 -113371 -170043 -179155 -98362 -53501
4345 -53501 4708 44626 35630 -6060 -113554 -184677 -200003 -82514 -18182 -73058 -99949 -94432
4333 -94432 -40264 26440 55876 -251 -61813 -54192 -25471 -29120 -5749 42949 50896 13748
4321 13748 -56177 -55507 -73592 -150002 -174339 -174696 -111473 -33902 -91890 -76467 -18086 64682 100428
4308 100428 73147 -20840 -52628 -99838 -117982 -9466 -42630 -143617 -144277 -112289 -97933 -104282
4296 -104282 -97446 -76415 -106045 -120619 -85995 -77210 11269 76457 133871 66776 -65913 4421
4284 4421 53626 60532 24707 -34855 -11378 -5590 -48050 -88940 -59830 8550 65554 64414 5815
4271 5815 2361 -29672 -28057 -53467 -25801 51097 42504 38202 44843 -1460 -84609 -150609 -95813
4258 -95813 -36976 -40935 -55472 -107226 -72584 -58854 -44738 60048 135202 82454 -37757 -34771
4246 -34771 -3443 -17173 -46658 -37391 99587 170734 55658 -68432 -67442 -39071 -3466 -63864
4234 -63864 -112124 -79014 16895 62559 -9406 -2066 -1862 82195 81980 85603 39385 -39726 -50829
4221 -50829 -102483 -152912 -77471 -47911 11835 -16830 -20338 50680 86552 80575 48478 69660
4209 69660 72595 16765 -69899 -73545 -98896 -52210 -13712 -11987 -44379 -57599 -73806 -122299
4197 -122299 -111355 -64186 19180 -6953 -1064 42373 44257 25048 -3404 -41683 -8001 -27217
4185 -27217 -37859 -53766 -11486 -9507 -63072 -89867 -63311 -11453 85235 94208 106179 57259
4173 57259 47763 -5334 -25071 -34312 -45513 -17149 -9155 20430 84945 90065 19257 14100 21540
4160 21540 38002 7644 -33464 -77577 -24421 40408 39651 -4971 -16760 -18835 -27513 -66954 -30329
4147 -30329 -59693 17518 45671 47408 27022 32596 57032 26378 -8833 -6049 43046 67909
4135 67909 72402 41583 -3505 -57407 -4837 9589 -33825 -34517 40235 97636 86858 -5565
4123 -5565 53027 65541 94421 53212 120192 192705 122583 78661 68057 35690 -834 -26346
4111 -26346 -65541 -53321 5804 55376 75086 83698 55598 -17284 -84606 -65476 -31906 -36322
4099 -36322 -12301 -9694 -31726 -53236 -73511 -44554 13218 -10380 -9390 -29936 -24659 -22560 20023
4086 20023 104031 130903 103035 68640 16773 29464 34179 38615 22286 28914 15695 -39551
4074 -39551 -22955 -45578 409 51310 83327 38507 64870 42686 22030 65941 54286 -32750
4062 -32750 -80238 -18659 34459 -37740 -109429 -71694 -8819 11876 76515 59075 -6638 -6962
4050 -6962 73226 95906 121319 87615 16635 -17280 -47137 20483 23636 -6461 32108 31566 14971
4037 14971 70820 90613 111613 100068 44908 -29396 -69802 -28776 19593 10410 -8159 7006
4025 7006 4221 -14536 -47400 -35548 -34731 -27507 -26784 -34440 -81284 -53077 47011 78492 51827
4012 51827 58922 101629 89600 109386 87450 -24436 -95388 -165146 -132218 -58942 -58631 -50191
4000 -50191 -10382 -18156 -12603 -98517 -128479 -111522 -29483 -23095 26638 50644 23742 -27112
3988 -27112 17557 14794 -42055 -86614 -108927 -66310 6083 67891 50986 -27413 -67595 -64860
3976 -64860 -14379 53632 89650 68351 58569 75115 56777 35902 50173 63853 -13083 21234
3964 21234 -18512 -41390 -81285 -101645 -68025 10308 63173 65653 24691 -14937 36085 82971
3952 82971 97878 77332 50363 80438 72823 42339 -37779 -39666 17657 39175 2269 -13533
3940 -13533 21072 61521 52044 27888 22827 52244 69941 30517 1973 -24267 -13297 -12653 -14749
3927 -14749 328 14385 -7674 -53196 -35013 -9445 -14036 -45753 -66499 11681 122883 113299
3915 113299 35297 -91893 -113394 -50222 -13947 16687 34167 20885 -46155 -51776 -18261 6511
3903 6511 60395 34439 -62117 -115224 -151178 -112231 -47347 -10642 -68215 -38318 -20886 -74002
3891 -74002 -97778 -131566 -101425 -104160 -86064 -158821 -94218 -3594 -28313 -46920 38610 92652
3879 92652 47274 -8684 52721 53437 18012 100899 162774 131445 107320 81142 96642 43720
3867 43720 -16976 -3092 -26855 -22463 -11459 6462 99193 93158 37045 -20647 -53732 15269
3855 15269 80751 83881 47792 30239 -35519 -31814 31264 40850 56498 25300 32496 19482 -28210
3842 -28210 -83629 -89639 -17710 5057 14460 9692 -3857 12434 -27643 13085 33731 17132
3830 17132 10496 48106 6685 -17558 6046 -8022 -7052 11504 56390 105936 88032 91296 63581
3817 63581 -21222 -44605 -2690 -19745 -21752 7683 -36808 -35625 46479 15022 12985 23611
3805 23611 80989 44429 -13575 -19766 -10864 38266 83744 106543 97914 67835 40316 32241 -9142
3792 -9142 -483 5639 1244 38582 69100 19981 -18687 8745 24110 17429 99302 99602 21388
3779 21388 -20162 -79912 -79929 -38698 -19822 -26286 -52121 -25457 28288 -33211 -20315 -21653 24080
3766 24080 -4042 32058 5981 18801 32175 -26596 -45613 14158 18944 -26305 -61867 -9152
3754 -9152 -3315 89411 75730 9064 19647 -1533 28664 2885 7390 14977 -13567 -50479 -39611
3741 -39611 -29866 -13639 12349 74474 106675 93659 59322 -6950 8783 37785 60267 36507
3729 36507 -1567 -23932 -42326 -97274 -20517 20859 -57662 -59368 -16648 -29072 -2816 -5552
3717 -5552 -26807 -55518 18096 60031 -8187 -68350 -54715 -55262 -48639 -96704 -40785 -8398 -34995
3704 -34995 -31722 69464 78054 62970 85534 91859 99671 161687 158000 70578 42994 52930 83465
3691 83465 41515 27808 -19202 20157 10456 -43769 -65744 -79495 -69993 21050 52675 -20246
3679 -20246 -55607 -42542 -101461 -101038 -104564 -37251 -51292 -74544 833 53092 63446 -29879
3667 -29879 -60461 -53813 -74421 -108499 -82515 -94954 -81398 -29068 -30260 32861 73918 98329
3655 98329 71352 28208 -9455 2994 17302 -14111 5627 -30422 -41188 -31196 -40365 63526
3643 63526 123305 158233 103719 66538 11987 -10243 -59069 -32817 -33376 -62865 -5406 14995
3631 14995 -28751 -51812 -69668 -43218 -59529 -47215 -38302 -34370 -20591 -2710 47037 80109
3619 80109 54846 13850 -3164 85847 99035 73444 104603 104996 83721 28373 -10731 33639
3607 33639 17286 -27300 4432 17210 -25959 -41689 51213 33167 41610 26889 -49328 -92753
3595 -92753 -54946 -48153 -67674 -50482 -71584 -85388 -29330 -15540 -65636 -100418 -112774 -138484
3583 -138484 -188992 -183657 -111294 -45958 19022 -16432 1634 58507 10558 -57878 -143764 -113899
3571 -113899 -97261 -55756 -59346 3934 47441 27640 21821 22428 46091 64344 56787 55182 -8468
3558 -8468 -42987 -26343 -36087 -69936 -74048 -106164 -88215 -58459 -38146 -34976 -12838 981 -21928
3545 -21928 -29872 -3180 75576 110354 117509 59219 -88720 -92834 2698 3296 11319 53202 131113
3532 131113 73212 40321 -23255 -73595 -65594 -23579 38335 52561 -18226 -45086 -98980 -86969
3520 -86969 -53868 -4953 -11255 14001 19691 27932 17652 15270 -23263 -5926 -26317 -72395 -70221
3507 -70221 -60980 -71618 -12701 24198 -39121 -52603 -55331 27578 18699 -93935 -107937 -46038
3495 -46038 -21530 -22630 27928 78297 87019 86087 60882 34924 -21972 -124059 -93489 -12298
3483 -12298 -7557 70372 100683 111388 126674 182518 69750 -34426 -24103 -14546 -51957 -56661
3471 -56661 -7264 20799 -11555 -7319 -21310 -61393 -103662 -92804 -28263 11478 -18263 -64884
3459 -64884 -88978 -27196 -76925 -99047 -63063 -85201 -59569 -16580 -23088 -101449 -98844 -4801
3447 -4801 -41788 -21782 6757 -51139 -93389 -82343 -32527 3047 32684 69822 66459 4523
3435 4523 -32200 -33844 11808 10415 13249 29073 79267 109767 42507 -14777 -62985 -145612 -114010
3422 -114010 -146509 -122295 -66523 -47353 -109366 -18835 11008 -24889 -40769 -54302 -78972 -96612
3410 -96612 -60341 -34971 17611 -5343 -68398 -98276 -116073 -129086 -95714 -14174 -15563 -88495
3398 -88495 -31024 37481 19429 -72850 -66996 11006 -14936 20599 68553 76088 137998 71664
3386 71664 10579 52603 33716 -6227 28008 26900 33475 21040 -1417 3429 -51133 -103110
3374 -103110 -17646 18111 29997 88872 81220 56673 1770 -39806 -45269 15833 36365 -21738
3362 -21738 -62991 -82724 -46718 48617 78707 65472 -26491 -119166 -82227 -7540 34369 -720
3350 -720 -1820 -8162 -6060 55882 63270 48379 -39555 -64132 -106008 -30417 55926 49581 80729
3337 80729 32097 -32671 -68352 -33902 -76947 -56596 -81827 -121600 -77679 -16868 -5087 50052
3325 50052 102467 72339 29132 46523 34518 -30361 -99569 -147726 -124699 -93537 -82573 -109026
3313 -109026 -88581 -48936 17216 158114 195109 155247 111086 50989 -41107 -18222 9708
3302 9708 27751 92369 57807 -18721 -68788 -81212 -67588 -44582 -40978 -26520 -12306 41186
3290 41186 154852 231761 155076 103429 58965 3615 71705 63647 91126 95541 161455 127974
3278 127974 87265 60405 -43374 -74719 -79904 -41258 16509 43047 40681 59703 15904 35292
3266 35292 21607 55465 86068 58011 109038 109940 106374 90293 81973 138476 152845 63334 9179
3253 9179 -29041 -67429 -61788 -110833 -177049 -130601 -97291 -87607 -47352 27394 49601 106034
3241 106034 131310 90394 35035 3461 26365 25785 -6734 13255 73207 63245 23580 12743
3229 12743 45654 57785 70310 113268 102765 36217 44063 21763 -53638 -101939 -101016 -161923
3217 -161923 -151479 -28638 32015 9178 -21208 -18119 -16612 -26297 -23996 1155 -8577 -27790
3205 -27790 12270 574 6850 7067 -73483 -77651 -53015 -85444 -19349 -16698 5009 40906 39681
3192 39681 -17734 -114640 -132323 -35474 2714 -13349 64995 104752 104565 36751 -54366 -129518
3180 -129518 -82879 -68056 -71717 -34344 -7487 -7871 -35898 -53472 13081 41056 40815 27633 34373
3167 34373 12205 -9680 43358 115870 126805 87019 8614 12570 -49658 -6906 52260 -10209
3155 -10209 23126 65223 16861 -44184 -51891 -35496 -60788 -28356 71507 115289 132955 142933
3143 142933 85927 -8834 -58398 -85134 -41854 53459 74299 86044 52415 -14399 -51436 -29297
3131 -29297 20031 40278 13179 -2029 -7911 -50450 -97890 -94384 -109488 -114423 -59179 -21836
3119 -21836 -50868 -8508 -2342 -21349 -8492 90896 122081 153233 180926 149960 46931 -78495
3107 -78495 -45864 -61046 -121106 -97208 -8900 19407 -38385 20718 34585 60458 100918 57179
3095 57179 -133 -10294 -57816 -112977 -55358 -25708 11178 21483 23861 -42719 -80204 -29125
3083 -29125 21519 11154 11289 -80396 -70970 66132 156104 152572 54907 -7201 -28419 -74065
3071 -74065 -2221 12107 -38131 -101303 -27539 28505 36859 57456 32433 46883 55911 24299
3059 24299 9661 58784 57673 81954 161429 143821 102086 80106 6366 28978 99020 56077
3047 56077 -3527 -78016 -136392 -117615 -94544 -102099 -118475 -52937 -839 -14749 -32038 -8113
3035 -8113 96 -22245 -68006 -11586 -26399 18039 49077 100209 86571 52815 -7832 989
3023 989 -12572 -91138 -32062 77613 51729 8448 81530 71991 6228 59486 96023 76895
3011 76895 71263 82494 60229 83359 136774 87075 64141 49153 -1267 -43013 -94001 17761
2999 17761 66124 42882 31354 28282 66421 20658 -40808 -1442 13141 -79689 -161562 -79576
2987 -79576 -14737 14057 4637 -11978 10071 96419 56519 54339 56243 21821 14218 91168 68361
2974 68361 44671 23765 39766 19745 -30337 -62939 -88307 -104761 -137686 -114785 -7765 -22029
2962 -22029 -4051 -87123 -114105 -109592 -142615 -169798 -128478 -90119 -61527 14618 48312 89720
2950 89720 108576 33178 -34187 28149 83718 97145 -1042 -39984 1727 31265 62050 -6637
2938 -6637 -63092 -107888 -166597 -100578 -45729 -67664 -76689 -42079 -23110 -54704 -67589 18616
2926 18616 50324 80150 7011 993 42862 28617 12405 22363 58878 34151 3954 6270
2914 6270 2434 -53182 -90928 -64650 -74853 -85810 -2771 30542 -25429 -64832 -14707 -1165
2902 -1165 11877 50313 -2876 -15221 -44513 -123395 -127781 -137526 -158108 -112042 -36934 -43114 -54766
2889 -54766 -33774 21096 18384 -38334 -69598 -132068 -85860 -12855 25598 -22854 -39300 65625
2877 65625 169999 128156 69384 74472 127582 125258 107346 112354 29600 -5272 33069 101531
2865 101531 151748 147361 245127 248736 142582 181639 159229 95613 62132 55141 41811 60525
2853 60525 -9021 -32827 -21759 -33987 -6208 -46010 -19132 28696 61149 70123 57664 40971
2841 40971 101245 26806 -40587 22634 72452 91400 90133 92508 63772 123712 115095 105464 61509
2828 61509 48344 51104 84119 136988 104013 62038 15241 54753 86259 22859 -51212 -22121
2816 -22121 -27361 45196 61890 49400 82928 89497 48796 -8525 -23688 43141 -39887 -82798
2804 -82798 -62773 -11059 19677 71068 8699 -62209 -110812 -64273 -1968 -39036 37709 95201
2792 95201 184861 212047 160097 104872 69565 49248 66778 68653 51886 64834 22722 -23776
2780 -23776 -53758 -21858 -5895 -39997 -43919 -22706 21793 -13828 7894 -9507 -28703 62819
2768 62819 21059 -91377 -67128 1126 19359 -67227 -107675 -68021 -114349 -86466 -44191 -17736
2756 -17736 -49050 -55521 -100072 -147386 -152009 -92098 -85935 -134672 -116310 -36463 66262 161234
2744 161234 135726 96076 25291 -3176 -7756 35018 47932 57743 90342 56396 -35934 -61445
$$ [...]
##END NTUPLES=NMR SPECTRUM
##END=
