##TITLE=Analysis number 324491
Compound Code km 10071
Project Code adrs
Chemist Name ugmt
##JCAMPDX= 6.0         $$ Bruker NMR JCAMP-DX V2.0
##DATA TYPE= NMR SPECTRUM
##DATA CLASS= NTUPLES
##ORIGIN= Bruker BioSpin GmbH
##OWNER= nmr
$$ XWIN-NMR		Version 3.5
$$ Thu Nov 23 11:01:20 2006 GMT Standard Time (UT+0h)  MAYBRIDGE\nmr@NMR_250MHZ
##.OBSERVE FREQUENCY= 250.131544655141
##.OBSERVE NUCLEUS= ^1H
##.ACQUISITION MODE= SIMULTANEOUS (DQD)
##.ACQUISITION SCHEME= undefined
##.AVERAGES= 16
##.DIGITISER RES= 18
##SPECTROMETER/DATA SYSTEM= dpx250
##.PULSE SEQUENCE= zg30
##.SOLVENT NAME= CDCl3
##.SHIFT REFERENCE= (INTERNAL, CDCl3, 0, 16.522)
##AUDIT TRAIL= $$ (NUMBER, WHEN, WHO, WHERE, WHAT)
$$ ##TITLE= Audit trail, XWIN-NMR		Version 3.5
$$ ##JCAMPDX= 5.01
$$ ##ORIGIN= Bruker BioSpin GmbH
$$ ##OWNER= nmr
$$ C:\u/data/dgb/nmr/ADRS/860/pdata/1/auditp.txt
$$ ##AUDIT TRAIL=  $$ (NUMBER, WHEN, WHO, WHERE, WHAT)
(   1,<2006-11-23 11:00:57.85 +000>,<MAYBRIDGE\nmr>,<NMR_250MHZ>,
      <created by zg, POWCHK disabled, PULCHK disabled
       configuration hash MD5:
       49 4B E0 1D 92 C2 6B 37 9F E6 65 BC 52 41 86 1D
       data hash MD5: 64K
       D3 53 DC 74 83 4D 3C 68 14 EF D8 F0 69 CE D0 F5>)
(   2,<2006-11-23 11:01:09.88 +000>,<MAYBRIDGE\nmr>,<NMR_250MHZ>,
      <Start of raw data processing
       ef LB = 0.3 FT_mod = 6 PKNL = 1 SI = 32K 
       data hash MD5: 32K
       48 DE 94 09 A1 E5 A7 1E F6 A9 2E 59 8C 0A 5E 8C>)
(   3,<2006-11-23 11:01:11.50 +000>,<MAYBRIDGE\nmr>,<NMR_250MHZ>,
      <apk 
       data hash MD5: 32K
       B0 80 49 01 D3 1D 3B B4 F1 54 BB 66 E2 FD BD 8D>)
(   4,<2006-11-23 11:01:12.25 +000>,<MAYBRIDGE\nmr>,<NMR_250MHZ>,
      <abs ABSG = 5 
       data hash MD5: 32K
       BB A5 37 22 95 18 8E 2D 5D 1C B9 85 9E 10 18 5F>)
$$ ##END=
$$ 
$$ hash MD5
$$ 55 E7 75 FB CD 90 6F 4C 58 40 0C 6D 55 D7 25 F0
##$RELAX= 
##$RELAX= 
##$RELAX= 
##$RELAX= 
##$RELAX= 
##$RELAX= 
##$RELAX= 
$$ Bruker specific parameters
$$ --------------------------
##$DU= <C:\u>
##$EXPNO= 860
##$NAME= <ADRS>
##$PROCNO= 1
##$TYPE= <nmr>
##$USER= <dgb>
##$AMP= (0..31)
100 100 100 100 100 100 100 100 100 100 100 100 100 100 100 100 100 100 
100 100 100 100 100 100 100 100 100 100 100 100 100 100 
##$AQSEQ= 0
##$AQ_mod= 3
##$AUNM= <au_zg>
##$AUTOPOS= <47 >
##$BF1= 250.13
##$BF2= 250.13
##$BF3= 250.13
##$BF4= 250.13
##$BF5= 500.13
##$BF6= 500.13
##$BF7= 500.13
##$BF8= 500.13
##$BYTORDA= 1
##$CFDGTYP= 0
##$CFRGTYP= 5
##$CHEMSTR= <none>
##$CNST= (0..31)
1 1 145 1 1 1 1 1 1 1 1 1 1 1 1 1 1 1 1 1 1 1 1 1 1 1 1 1 1 1 1 1 
##$CPDPRG= <>
##$CPDPRG1= <>
##$CPDPRG2= <>
##$CPDPRG3= <>
##$CPDPRG4= <mlev>
##$CPDPRG5= <mlev>
##$CPDPRG6= <mlev>
##$CPDPRG7= <mlev>
##$CPDPRG8= <mlev>
##$CPDPRGB= <>
##$CPDPRGT= <>
##$D= (0..31)
0 1 0 0 0 0 0 0 0 0.06 0 0 0 0 0 0 0.0002 0 0 0 0 0 0 0 0 0 0 0 0 0 0 
0 
##$DATE= 1164279656
##$DBL= (0..7)
120 120 120 120 120 120 120 120 
##$DBP= (0..7)
150 150 150 150 150 150 150 150 
##$DBP07= 0
##$DBPNAM0= <>
##$DBPNAM1= <>
##$DBPNAM2= <>
##$DBPNAM3= <>
$$ [...]
##$SUBNAM6= <"">
##$SUBNAM7= <"">
##$SUBNAM8= <"">
##$SUBNAM9= <"">
##$SW= 20.6930455092707
##$SWIBOX= (0..15)
0 0 3 0 0 0 0 0 0 0 0 0 0 0 0 0 
##$SW_h= 5175.983436853
##$TD= 65536
##$TD0= 1
##$TE= 683.16
##$TE2= 300
##$TE3= 300
##$TEG= 300
##$TL= (0..7)
0 120 120 120 120 120 120 120 
##$TP= (0..7)
150 150 150 150 150 150 150 150 
##$TP07= 0
##$TPNAME0= <>
##$TPNAME1= <>
##$TPNAME2= <>
##$TPNAME3= <>
##$TPNAME4= <>
##$TPNAME5= <>
##$TPNAME6= <>
##$TPNAME7= <>
##$TPOAL= (0..7)
0.5 0.5 0.5 0.5 0.5 0.5 0.5 0.5 
##$TPOFFS= (0..7)
0 0 0 0 0 0 0 0 
##$TUNHIN= 0
##$TUNHOUT= 0
##$TUNXOUT= 0
##$USERA1= <user>
##$USERA2= <user>
##$USERA3= <user>
##$USERA4= <user>
##$USERA5= <user>
##$V9= 5
##$VALIST= <valist>
##$VCLIST= <CCCCCCCCCCCCCCC>
##$VD= 0
##$VDLIST= <DDDDDDDDDDDDDDD>
##$VPLIST= <PPPPPPPPPPPPPPP>
##$VTLIST= <TTTTTTTTTTTTTTT>
##$WBST= 1024
##$WBSW= 4
##$XGAIN= (0..3)
0 0 0 0 
##$XL= 0
##$YL= 0
##$YMAX_a= 377332
##$YMIN_a= -628357
##$ZGOPTNS= <>
##$ZL1= 120
##$ZL2= 120
##$ZL3= 120
##$ZL4= 120
##$ABSF1= 16.522
##$ABSF2= -4.171173
##$ABSG= 5
##$ABSL= 3
##$ALPHA= 0
##$AQORDER= 0
##$ASSFAC= 0
##$ASSFACI= 0
##$ASSFACX= 0
##$ASSWID= 0
##$AUNMP= <proc_1d>
##$AZFE= 0.1
##$AZFW= 0.1
##$BCFW= 0
##$BC_mod= 0
##$BYTORDP= 0
##$COROFFS= 0
##$CY= 12.5
##$DATMOD= 1
##$DC= 0
##$DFILT= <>
##$DTYPP= 0
##$F1P= 14.0000005364418
##$F2P= -0.99999901652339
##$FCOR= 0.5
##$FTSIZE= 32768
##$FT_mod= 6
##$GAMMA= 0
##$GB= 0
##$INTBC= 1
##$INTSCL= 1
##$ISEN= 128
##$LB= 0.3
##$LEV0= 0
##$LPBIN= 0
##$MAXI= 10000
##$MC2= 0
##$MEAN= 0
##$ME_mod= 0
##$MI= 0
##$NCOEF= 0
##$NC_proc= -4
##$NLEV= 6
##$NOISF1= 0
##$NOISF2= 0
##$NSP= 0
##$NTH_PI= 0
##$NZP= 0
##$OFFSET= 16.522
##$PC= 1
##$PHC0= 164.756
##$PHC1= 5.027519
##$PH_mod= 1
##$PKNL= yes
##$PPARMOD= 0
##$PSCAL= 4
##$PSIGN= 0
##$REVERSE= no
##$SF= 250.13
##$SI= 32768
##$SIGF1= 0
##$SIGF2= 0
##$SINO= 400
##$SIOLD= 32768
##$SREGLST= <1H.CDCl3>
##$SSB= 0
##$STSI= 32768
##$STSR= 0
##$SW_p= 5175.98343685301
##$SYMM= 0
##$S_DEV= 0
##$TDeff= 65536
##$TDoff= 0
##$TI= <Analysis number 999999
Compound Code 99
Book Reference 9
Project Code 9>
##$TILT= no
##$TM1= 0
##$TM2= 0
##$TOPLEV= 0
##$USERP1= <user>
##$USERP2= <user>
##$USERP3= <user>
##$USERP4= <user>
##$USERP5= <user>
##$WDW= 1
##$XDIM= 32768
##$YMAX_p= 296093342
##$YMIN_p= -66432
$$ End of Bruker specific parameters
$$ ---------------------------------
##NTUPLES= NMR SPECTRUM
##VAR_NAME=  FREQUENCY,     SPECTRUM/REAL,   SPECTRUM/IMAG
##SYMBOL=    X,             R,               I
##VAR_TYPE=  INDEPENDENT,   DEPENDENT,       DEPENDENT
##VAR_FORM=  AFFN,          ASDF,            ASDF
##VAR_DIM=   32768,         32768,           32768
##UNITS=     HZ,            ARBITRARY UNITS, ARBITRARY UNITS
##FACTOR=    0.157963299565203, 1,           1
##FIRST=     4132.6476996994, 0,             0
##LAST=      -1043.33573715361, 0,           0
##MIN=       -1043.33573715361, -66432,      0
##MAX=       4132.6476996994, 296093342,     0
$$ Real data points
##PAGE= N=1
##DATA TABLE= (X++(R..R)), XYDATA
$$ [...]
24075C0173k1765n654O283N228j6784M632O766k970k541l854P07J4773R817j9469
24061E342r044L947j9547j0229K058L708Q708K83r849P899M237p225m398P942
24047a6168P954J2170Q243K084n88p920j2734k3774k5027l262L1864J8151p316
24034a6323N73J250P363m84P635q04j4605P34J7027J0088q062j3572m322R528
24020c974p545o318L782J1158P465M37r342N953Q358O882R279L400m827j7385
24006G323J353j9589m408K7912K271k0713O047K2997k0121j9767J0997P90J2287
23993G379O143j5352j4106M558K2279M758j8675r452R02J5418J393j7232k869
23980a4856L74j0931J4663K0084M953k737l9788m994K4188p246n619J5438J2266
$$ y = [30173, 8408, 2754, 9037, 14265, -2519, 2113, 8879, 5909, 3368, -486, 221, 14994, 24811, 5342, -3702, 245, -19302, -29531, -27473, -23765, -15057, -14774, -24623, -16724, -12487, -19712, -24110, -16168, -8214, 3956, 12199, 14283, 13695, 5775, -6959, -30733, -55760, -59022, -27158, -9007, -16323, -15750, -14500, -7137, -7621, 14, -790, -15395, -14661, 2366, 12454, 4392, -9180, -13502, -3974, -11519, -17837, -14055, -2897, 4568, 5005, -4337, 1616, 9974, 16856, 26135, 29535, 24708, 7323, 8676, -10913, -15321, 12591, 14862, -5851, 196, 23193, 3072, -16695, -5698, -4908, 7379, 13522, -1830, -15936, -11378, 10901, 15659, -3016, -12468, -11566, 3852, 5245, -11987, -14856, -14482, -25413, -10750, 9334, 14287, 11550, -28238, -33232, -9044, -16290, -21909, -6471, 5795]
23967E795J4860m20r957O541q322r774J2917q008n608J0395J0763K155J5198J357
23953C7892k2163l929M044J2319r585j8088K503J2255p3j404j7484n705N343M097
23939B2m577n203R279O597m114Q167O132J3021n386k4381m228K144j562q292j402
23924a3783j5435J1885J5387l608J1056J3858M414l035r882o046M687n990k2693
23911a9185L009J0862O727M272L395j6249l636q202p874J4265r735R52L1468o607
23897C462k070J2279m064j4124P189m213k263N325J421j0730j839Q233J0054j0411
23883a751N921P212j5710j774j0041M995M521N435L342J6787j5565k5791l278
23870b5697J6193J2461l43K218r853J406q900j1856M672M965P985K131J0804N793
$$ y = [5795, 20655, 20235, 10278, 16819, 8497, -1277, 11640, 3632, -1976, 8419, 19182, 21337, 36535, 37892, 15729, 11800, 15844, 28163, 18578, 490, 2993, 15248, 15175, 13771, -3713, -9418, -4075, 22, -4555, -9758, -479, 6118, 2004, 10171, 16303, 29324, 23938, -443, -4671, -2527, -4089, -12381, -13783, -29218, -17333, -1946, -5554, 5502, 19360, 23774, 20739, 10857, 4811, 9498, 3508, -19185, -16176, -5314, 1413, 5685, 9080, -7169, -10805, -19007, -26881, -12616, -22351, -21399, 10069, 3462, 1392, 13671, 9607, -4517, 2672, -1541, -3804, 1521, 2942, -7788, -9627, -1394, 8660, -1751, 4170, 11382, -4328, -6102, -16143, -11148, -6627, -1192, 2150, 18937, 3372, -22419, -25697, -9504, 2957, 2614, 4832, -5021, -3615, -12515, -24371, -19699, -14734, -6749, -4618, 6186, 11979]
23856A1979j1199m906R642K247j270j5069n061J0916J9085L300k483l070K688
23843A6799R223L818m743k4642k8073K088Q580K298J605j1979J3779K2252j5003
23830c998m14R859k5069j2750o009J4672J3824P891L738P698j5614j0326J4846
23817a652J6851K1828M372k8054P089P741j6381r964K1127J4892R32j1985l2446
23804e650k6056Q059K902Q168P366K0142J897p600o308n511l628j3145J4494L801
23790a069n346J2540M256j821o416j5500o710k0694Q819K0615O761q248L751M215
23776d847P575k718r604j368j2128j00L1232M411o090M632k941O445p314Q67p096
23761I56k7923O487K996K149N028J1898N509j2685j177n055Q003J8921K125k4150
$$ y = [11979, 780, -4126, 5516, 7763, 6493, -8576, -13637, -2721, 16364, 19664, 17181, 14111, 16799, 26022, 29840, 25097, 455, -27618, -25530, -16950, -14652, -13047, -25026, -11247, 11005, -3998, -4412, 5447, -19622, -32372, -38381, -23709, -9885, -1994, 1744, 9442, -6172, -16498, -1652, 15199, 37027, 41399, 13345, 20434, 28175, 11794, 1830, 22957, 37849, 38781, 26796, -5650, -31706, -23647, -20745, -12577, -5211, 14931, 16828, 9228, 2920, -2591, -6219, -19364, -4870, -1069, -6415, 6125, 10381, 8560, 2144, -13356, -20066, -40760, -31941, -11326, -4565, -12813, -9062, -4847, 2728, 10, -9594, -10962, -23090, -23190, 8042, 12453, 6363, 10995, 8054, 14499, 7185, 8052, 956, -26967, -20480, -17484, -15335, -10307, 1591, 7100, -5585, -6762, -11817, -3814, 15107, 17232, -6918]
23747f918j0372K5000P722O166o070K556o958n118J7764J1288j8727N872Q384
23734C0589k9018j1027Q014K611N839J695Q922Q08r627q039O799J8291J3266p723
23720C1400j2981o198o800j4133n996N964J6469L84k7631k3420K6024j833l954
23707b2705R173J2100n326J2240J0951M443k174m611J329l956j3116J734r642
23694i560m413R135J1968j0792p601J0435K004k0098M233K2883j865j0851k656
23681g178J0211J437J916N618M349k24r390M785j4819L678J3509R883K31j1133
23667A2873l757M622o694K1055m257N527j0628j7236l233P27J7012K755L852q892
23653A3726o702M620M144k305j0069j8521p702J45J2302K882j4964m849K143l874
$$ y = [-6918, -17290, 7710, 15432, 21598, 15528, 18084, 11126, 6008, 23772, 35060, 16333, 22205, 30589, 1571, -9456, -1442, 1169, 7008, 8703, 17625, 18433, 8806, 767, 7566, 25857, 39123, 31400, 18419, 12221, 5421, -8712, -14708, -8744, 7725, 8109, -19522, -42942, -16918, -18751, -22705, -13532, -1432, -6758, 5482, 16433, 20876, 18702, 14091, 15420, 11464, -1652, 82, -9560, -13973, -4838, 7130, -3662, -11263, -828, 1176, -18922, -14689, 8194, 6329, -4522, -7178, 3033, 4470, 6386, 12004, 16353, 16129, 6739, 11524, -3295, 383, 13892, 23775, 24006, 12873, 9116, 13738, 7044, 28099, 23842, 29369, 18741, 1505, -1728, -1001, 16011, 18766, 22618, 13726, 7024, 11644, 15788, 13483, 3414, -15107, -22809, -22664, -10362, -7480, -22444, -27293, -25150, -29024]
23639b9024K0313O165J942r052k4259J954J2684O605L224J1791L886L632j425
23626H436j2172j5923J5447q417j652J2094j0159r946J1901J5108N319q064L36
23613B308J2818j5877n665J2782r82o141j0299j0160L715N826j743o04k314L424
23599a2912J3479P280j564r70j1704o722N885J6161m147O242M116O181q936m676
23585G713l862o44r033J23p614J536K5483M030j1866j4906M499l062J8800K608
23571A3805O213j1663p573M160o335k3202J2168L2676q076k1561q602P554k670
23558a3106m315N837J8194J2039P88l225o740L878j75L487o090k31J4842J317
23544B6500L582J2361j8259l4263j596J0713p59M733K342j1683j5966m622K010
$$ y = [-29024, -8711, -2546, -604, -9656, -33915, -31961, -19277, -12672, -9448, 2343, 6229, 9861, 8436, -3736, -19659, -4212, -12629, -14281, -2187, -12346, -22292, -10391, 4717, 10036, 1972, 2308, 15126, -751, -6416, 6366, 5384, -757, -11056, -21216, -17501, -11675, -13418, -14022, -16336, -12912, 567, 7847, 6283, 5313, -6391, -13113, -7228, 8933, 4786, 11028, 15144, 21325, 12389, 7713, 3851, 3207, -5826, -5703, -13317, -11781, 13702, 17732, 5866, -9040, -4541, -7603, 11197, 13805, 20018, 8355, 782, 4942, -1393, -24595, -12427, 20249, 12173, -9388, -17990, -10436, -13106, -17421, -11584, 6610, 18649, 19437, 16212, 9472, 13350, 13175, 16662, 10572, 10341, 25183, 26500, 30082, 42443, 24184, -10079, -11675, -962, -1721, 3012, 5354, -6329, -22295, -26917, -24907]
23531b4907O702L945L521j0922j4198K092J0337K3579M364K486j4207l631J0267
23518e72Q579j5587l570J3131n206n731P392l250m199j1162P907l103q357P981
23504a5747N729l915K335O615J063J441l067j3750K556m820J83O72o209K4116
23490b798J7708K808j325k1166j0486j3951p867l969M753K4968K516q157r540
23477b6506J7621o444k1914l802J6297J8139J6944N353P843M053p346n531o393
23464H314K14N433L909q492p511l980J2225J5305M26o530k6437k4516n370l999
23450d1009J399P403K003K229J8101J0120K2037M010j5655m253J449K760l473
23437G121m499R660O266n532j2591K407l444m804Q416J9803n352k243k4460O33
$$ y = [-24907, -18205, -14260, -10739, -21661, -35859, -33767, -23430, 149, 4513, 6999, -7208, -10839, -572, 8007, -7580, -11150, 1981, -3225, -8956, -1564, -4814, -9013, -20175, -12268, -15371, -23728, -15747, -10018, -13933, -11598, -4983, -3920, -2479, -5546, -19296, -16740, -21560, -21377, -20705, -26914, -2798, 14910, 17718, 16393, -4773, -15259, -29210, -37077, -41046, -36293, -11325, -8809, -16966, -26506, -8885, -15329, -37243, -41045, -24748, -6609, 10335, 15688, 23531, 27584, 20238, 14707, 8314, 8528, 13961, 17870, 9378, 1867, -2113, 10112, 25417, 25843, 19313, -7124, -31640, -37010, -41009, -39610, -32207, -30204, -27975, -9874, 246, 22283, 26293, 10638, 6385, 7834, 10594, 7121, 2622, 12282, 18548, 13016, 425, 2832, -612, -5416, 3000, 22803, 17451, 15208, -9252, -8619]
23423h619J2677L96j0038P95N985q402k057l907P357J749O788l02J1999J1682
23409B6103k2786l001J3202r413k7272L484o661p750J3439K753j0268j4136k127
23396d4433J8750r12J6515J6396j8775n278j0893K909J3031L878J309P964J1659
23383A2120M728p855j799k264p216K3450J8530p20k244l166r885q242j3295K43
23369B385r78O062K302j5942K745N877M325K178j229j3700k272J7238o095K879
23355E775j45n092p168j9474K12J7630P302R775M968m621j3831j9005J0735Q248
23341d691K519q771l140o350o398n913p048p788J0355N007l264R266K0679J9334
23327A3797K0182l664r694n184M671k6383m992M01j2087J3572K5128J3863j6231
$$ y = [-8619, 4058, 4454, -5584, -4789, 1196, -7206, -9263, -13170, -5813, -4064, 2724, 2422, 14421, 26103, 3317, 316, 13518, 4105, -23167, -19683, -26344, -34094, -20655, -17902, -28170, -42306, -44433, -25683, -26595, -10080, 6316, -12459, -17737, -28630, -25721, -12690, -8812, -7503, 461, 12120, 16848, 8993, 7194, 4930, -2286, 21164, 39694, 38974, 36730, 33564, 23679, 15437, 2142, 2385, 1407, 7469, 9771, -6171, -3426, 2451, 6776, 8954, 7725, -5975, -8247, 8991, 2896, 5775, 5630, 538, -6630, -26104, -25892, -8262, -960, 8815, 13783, 9162, -4669, -23674, -12939, -4691, -2172, -10943, -14083, -20433, -26831, -32744, -39792, -47580, -37225, -32218, -35482, -26216, -5537, 13797, 33979, 30315, 20621, 15437, 20108, -6275, -11267, -10866, -22953, -9381, 15747, 29610, 13379]
23314A3379j8638j550L971k70o248N020n873n652o26L465J2391J1j2766l703K2286
23299E197q241q74j712K349p352k5403L74N202O595K3974J4369k497o944m333
23285G04J2058l952n879j1974L256J740R815j4380n038K182j0295O631J1331J5485
23271A1684j831q425P27L456p222j9507P2Q423M383J5464R800j0330j6995J1545
23257A244l837k721j982j4760N483J6963p072o599J1729p113o329l506R01j055
23243a8654j3971m441J6533M610O655J9319n424N489J2981Q30q988p165k0284
23230a2510k586P116n169m949r859L806m669k506p184J2026m925Q799J1084N945
23216e581P206n583l858J6460Q934k728K556n617n081p590M450J6458K52N61q213
$$ y = [13379, -5259, -6809, -2838, -3108, -9356, -4336, -10209, -15861, -16487, -13022, -631, -620, -13386, -17089, 5197, -3044, -3918, -5630, -3281, -10633, -36036, -35662, -30460, -23865, 109, 14478, 11981, 5037, 704, 12762, 8810, 2931, -9043, -5787, -4047, 5768, -8612, -13650, -11468, -21763, -15132, -3801, 11684, 9853, 1428, 2155, 5611, -1611, -21118, -21046, -12623, -8240, 7224, 17024, 6694, -10301, 1244, -2593, -5314, -7296, -22056, -16573, 390, -6682, -13281, -1552, -8665, -14994, -18500, -17599, -18654, -32625, -37066, -20533, -15923, -9268, 10051, 4627, 10116, 23097, 23927, 14939, 7774, -12510, -15096, -7980, -13149, -18098, -27957, -24151, -28820, -31326, -38510, -26484, -31409, -22610, -11526, -5581, 1625, -3958, -7816, 8644, 17578, 14850, 17406, 11789, 6708, -882, 3568, 20026, 20278, 20839, 12626]
23201A2626l797r873o122K852J0041K880j206k129J4081p240j2111J747M210k780
23187C179K535Q37J741m588j8375p779n686J3765j4726n83K5300O054j2653n355
23173a6334K1168L478l686J602K024n82l456k1370P205J8337J0415K1172m816
23160C5157k1141l453l845L51m329j2730j822n710j494J906L592O823k958o614
23146a6267J775J172P259M151J824J3297J09k0183j9102J0865J5409p416P389
23133B82K0710L606j2240n459J031k605j6320R41L438j5527o883J0538o26j4715
23119c3829J0084J1262K2364N612j2365j2493k523J399J8067N647o499k142n21
23106D063k0679o36J8251J8816M237k7009q255J0257O007j437O073J8403J454
$$ y = [12626, 8829, -1044, -7166, -4314, 5727, 8607, 7401, 5272, 19353, 12113, 2, 1749, 5959, 3179, 5714, 6551, 8292, 3704, -14671, -22450, -28136, -14371, -29097, -29680, -4380, 1674, -10979, -16334, 4834, 8312, 4626, 6228, 8252, 7670, 4214, -17156, -9951, 8386, 18801, 39973, 35157, 14016, 10563, 6718, 7069, 2740, -9990, -11812, -17522, -19016, -17110, -13518, -6695, -9653, -16267, -14492, -13320, -6061, -1910, -86, 13211, 13320, -6863, -25965, -15100, 309, -7107, 282, 20992, 24598, 12358, 6899, 7930, 5325, -10995, -10054, -6616, -22143, -29026, -18488, -19114, -33829, -23745, -12483, 9881, 15493, 3128, -9365, -11888, -10489, 7578, 13225, 6726, 4584, 4063, -16616, -17252, 999, 19815, 24052, -2957, -11212, -955, 5052, 3615, 9688, 28091, 29545]
23093B9545r385j4610o418m483r242J6779Q305n88j476k161O030O482M07l66m240
23078A4579n105q004P471J9510p545r697J2211N458j6549k0727j4335Q494J0793
23065c446J6634J7912q919m128J5029k920q671j73J489k4663r826N262j957j6010
23051b4387J2620J7403q648Q636J2771k50k9333j0343n137K1086J5153R415J0002
23038B8988n3k3398n678J2686J0768N292m796j4263n050K226L002J441k1286k7602
23024c7723J4367O276R176J662r056J6375J1205k4249M969K493L840l784J997
23011b452J7000K0717p071j6461J0N865k71M636m22j5112j1913r157J0463J5491
22997A1323j1609l776p189L730q186l036J2749K380J0417M924j1338j0882j539
$$ y = [29545, 20160, 5550, -868, -5351, -14593, 2186, 10491, 9903, 8427, 6266, 12296, 18778, 19185, 18819, 14579, 9474, 1470, 8941, 28451, 20906, 11209, 23420, 28878, 12329, -8398, -22733, -14239, -3446, 13188, 31100, 22181, 18053, 33082, 30162, 21491, 21318, 22807, -1856, -11682, -6420, -8377, -24387, -11767, 5636, -3012, 5624, 18395, 18145, -11188, -21531, -26668, -5582, 9571, 18986, 28988, 28935, 5537, -141, 12545, 23313, 28605, 23809, 9546, 4496, 6722, 9724, 11165, -10121, -37723, -23356, -17080, -7904, -6242, -15298, 1077, 12282, -11967, -6998, -4505, -665, -4449, -2452, 14548, 35265, 28194, 11733, 11743, 17608, 17337, 21973, 21551, 6439, -5474, -14631, -4168, 11323, -286, -4062, -11251, -7521, -15707, -18743, -5994, -3614, 6803, 11727, 389, -10493, -12032]
22984a2032J3234O251m754l371k06J1905J628k045J0472P754j2750j9179P961
22971D868Q449K293p161j8807k3278k542K2053J5340o053p475j5099O001K7222
22958E811P038k1825j6713J1212R135J6422j3849l423m542m879k818j0921K317
22945b7035O619n296O489R390N970j6351k739J7438l352K098m149J6282N098p242
22931C220k0312j4184J5642J5923P722k7177j7013J447N761J5332q693n18J2943
22918i907K330j1069M936R204l443J751j3071q731K345J4255O552j335K1610J9309
22904C4736K62j3608k1667n266K783Q149O60l688l426o977p219J1530J9921p3
22890A6117j0546m62J8810L153j7414m0755p536j927j006J2902K084Q119K1411
$$ y = [-12032, 1202, 7453, 2699, -672, -878, 11027, 12655, 10610, 21082, 28836, 16086, -3093, 4868, 13317, 15610, 8449, -10358, -33636, -36178, -14125, 1215, -4838, -12313, -27412, -21411, 5811, 12849, -8976, -25689, -14477, -5342, 11080, -2769, -6192, -10734, -15613, -18431, -29352, -27035, -20416, -25712, -19223, -9833, -3863, -20214, -22953, -5515, -8867, -6769, -10918, 5364, 10462, 3220, -17092, -31276, -15634, 289, 8011, -19166, -36179, -34732, -28971, -13639, -22332, -22850, -9907, -7577, -18646, -13710, -4506, -7949, -6198, -19269, -28000, -25655, -11400, -4848, -6183, 15427, 34736, 34998, 21390, -277, -5543, -2760, 5389, 6049, 2361, -1065, -8042, -15261, -3731, 16190, 16117, 5571, 5109, 23919, 27072, 9658, -31097, -38633, -40560, -41566, -28664, -26580, -18461, 2950]
22877B950j00M103J431j2790j7913l816K257J5085Q213n118J466p12n069p965
22863a7978r715o493N373R041J3843K5572M096j8344k6263N396L977J2840K0209
22850B1554Q842j2721j9922k0714j2422O422K2218j766j7770J0743L221j8474
22838c0789M025Q337J0987M148J2720K398o461j548j1597r14J9758O965K113l205
22824A6937J6293l919l1844o089K3632j478j5615q842L435L473k809j1098O06
22811a7318O83M636K5632R344p256k7090J9375M107k881j2021j8165Q538J6881
22798D465K16K871o651p291P507P162j511P900J0744j531k52m223j0077n794k7455
22783b3920n83L0066J907q211q600N058o374J10J3747j1864P676J6441O41r814
$$ y = [2950, 2850, 6953, 8384, -4406, -22319, -26135, -23878, -8793, -580, -5698, -4232, -4944, -10013, -17978, -27693, -34186, -28813, -19772, -5929, 19643, 23739, 5395, -20868, -15472, -11495, 1345, 21554, 30396, 17675, -2247, -22961, -35383, -28961, -6743, -8509, -26279, -15536, -12315, -30789, -26764, -18427, -7440, -3292, 9428, 11826, 5365, 3817, -7780, -8694, 11064, 18029, 20142, 16937, 33230, 29311, -2533, -8622, 15010, 13532, -2083, -10925, -7490, -4017, -6826, -17924, -17318, -16635, -11999, 13633, 22977, 15721, -11369, 8006, 12113, 9232, -2789, -20954, -12416, 4465, 4681, 7552, 901, -6390, 1117, 8279, 6768, 14668, 25412, 23881, 23629, 19406, 9329, 3535, -23920, -24503, 5563, 7470, -741, -9341, -4283, -10657, -10547, 3200, -8664, -988, 15453, 16094, 6280]
22769F280k7800n3N721j854o527J4115Q247J1687m921j2903n88O798j1718J291
22755a2225l565J315K474K097J1402J71O196j2496n626P04N310r053r512J9742
22741c066J7106k381J71O620j0047o216o368p509k514r60O76M906P331q368j48
22726a0767Q631R210j0442k2743K198R127P800k06j0839R026j765N031j2825j6676
22712c5240k872P033J0845J9696R064j5452j376j5N638K0655O007j4506k1748
22699a2271q008M431J8763N591j7236k185M619L726o817l572j872Q530J7670J9004
22685C0373O076k0004p716m731m601p685N073J5908J1388j3516p145r477J70r817
22671a5704M650q754m865J6718R381j975r45Q36J4085N256j5605j5193O238k59
$$ y = [6280, -21520, -21573, -15852, -17706, -24233, -10118, -1871, 9816, 4895, -8008, -8596, -1798, -13516, -12225, -15790, -14475, -12001, -9904, 1498, 1669, 7865, -4631, -10257, -9553, -4243, -13296, -22808, -3066, 14040, 11659, 11830, 18450, 8403, 2187, -4181, -11690, -14204, -15164, -14488, -9582, -2251, -10619, -10767, -2136, 7074, -3368, -26111, -23913, -14786, -6986, -7192, -18031, -9005, -10770, -5739, -18564, -35240, -38112, -31079, -20234, -538, 8526, -6926, -8302, -8317, -2679, 17976, 23983, 9477, -12271, -20279, -15848, 2915, 8506, -8730, -10915, -6296, -2570, -9387, -12959, -14831, -6301, 11369, 30373, 36449, 16445, 8729, 3998, -603, -8288, -3215, 12693, 24081, 10565, 3420, -6057, -5887, -15704, -11054, -19808, -24673, -7955, 1426, -549, -1494, -658, 13427, 18683, 3078, -12115, -5877, -6136]
22657f136L26K922j415J1079O637J355k18j5938q313J256K217L922q097N835P896
22642C328o452p153O973J6269Q938o49p31p863r107n964o005o300p677J9486n89
22627c496p588j6409p613J4926R520J7944J1320j3183j4300Q552J1070q242m887
22614b386r309r436J1869m461j0936p151n478J2536M676Q382k0248j9916J7467
22601c4391P170m770j772R538K357M203L776q347J7667R557N341O110j0361o312
22587b34q112J1575J0438J4621M634k8541j9755J7453J0250K277n945l744p598
22574b681k913k161O226o390m583P86J6571K2478M245j3639j0189L53J0110m980
22560A3233j7122k1228R970J7011n709p325j4567m053J3463J3838M024j4636k62
$$ y = [-6136, -5810, -2888, -4303, 6776, 13413, 14768, 14550, -1388, -9701, -8445, -6228, -2306, -10403, -4568, 3328, -3124, -10277, -3304, 12965, 21903, 21254, 20523, 12660, 3553, -2411, -8416, -14716, -22393, -2907, -3496, -11084, -27493, -35106, -20180, -10660, 7284, 18604, 5421, -8879, -327, 10743, 2501, -2386, -11695, -21131, -9262, -13723, -24659, -31810, -37288, -24752, -20076, -11694, -31942, -51858, -34391, -27221, -31991, -33763, -24225, -21868, -17665, -13889, -22236, -4569, 4988, 10329, 16439, 6078, -234, -8346, 3229, 13667, 28288, 32922, 4381, -15374, 2079, 12329, 14606, 8661, 4917, -2681, -5594, -7755, -1529, -7919, -12502, -11716, 4855, 27333, 31578, 17939, 7750, 8103, 18213, 13233, -3889, -25117, -15147, 1864, -3845, -11170, -25737, -29790, -16327, -2489, 1535, -13101, -13363]
22547a3363R763q898M311K0797J2466o018j1599m176J2744M308l191Mq945K810
22533A1013J0184o379j5649O661m605P503o587k1539l94m620L155J2697k409j266
22519a2235j0446M297m635K653J177L705J5022Q618j1598j6187j0623k399j94
22506c2845m469L798N451J1881K401j855J723l609j1457K1116J3054J5485r09
22493A9765q398P265p93n619P739k1125p618J818Q801J7401N475r77P254j487
22479B9501j4009j8966j4292K920P568K315p271k48O026Q343l605K185o324J5421
22465I564j1251p608K0271n4L652l635k037k666j55r5m540J1883r129j9576l157
22450a8533J9011J6901J2308O503j7573o923M087k550p307J179q366o435J2436
$$ y = [-13363, -3600, -12498, -8187, 12610, 25076, 19058, 7459, 3283, 16027, 20335, 17144, 17148, 8203, 11013, 21197, 14818, -831, 5830, 1225, 8728, 2141, -19398, -19792, -24412, -21257, -8560, -10969, -12235, -22681, -18384, -23019, -20366, -19189, -15484, -462, 8156, -3442, -19629, -30252, -32651, -32845, -37314, -33516, -28065, -16184, -13783, -15638, -13915, -17524, -28981, -7865, 5189, 20674, 19765, 11367, 18632, 17839, 12220, 19959, -1166, -8784, -6966, 1835, 19236, 24711, 23734, 30988, 29501, 15492, -3474, -17766, -14846, -7278, -4963, -12234, -12482, -6456, 1887, -1718, 467, -5857, 9564, -1687, -9295, 10976, 10922, 14574, 10939, 8902, 6236, 6081, 5986, 1446, 13329, 4200, -15376, -18533, 478, 17379, 29687, 36190, 18617, 11694, 15781, 13231, 5924, 7103, -1263, -7698, 4738]
22437D738m859o457Q641j2807n303K574n479k012O992R372J1834R222L348k464
22423A7340o264O858L395n928J2462q985j3849j4653j5293K405O074P115K763
22410f560j4036j1662p8K9141K2690j6872j7516N543k244Q968J3219J8375q746
22397B0222k0154q601J969J9687N057l00j5963Q799l008j3586j8885o417J567
22384b9613p320n773J5841m274k60J8385M911J013r81N839o078j1136l20K145
22370a7621J851q431j4800P087R081J8397Q667p540o62J1169P485q897Q745Q883
22356B3414K465j0734n849N664J097k2837j4822J0321l843o760n040J782K1099
22343d043N928k1654k1909j1072j940O969R802J8856J2049Q501R417j2345p4k1222
$$ y = [4738, -121, -6578, 2063, -10744, -16047, -13473, -18952, -20964, -13972, -4600, 7234, 16456, 19804, 17340, 11076, 17934, 21329, 15401, 27863, 18878, 5029, -9624, -24917, -22512, -16438, -9323, -6560, -20596, -32258, -32336, -3195, 19495, 2623, -14893, -9350, -11594, -2626, 10593, 28968, 20222, 68, -8533, -6564, 13123, 18180, 17880, 1917, 10716, 7708, -5878, -24763, -31180, -29613, -36933, -42706, -26865, -31139, -31399, -13014, -8103, -7090, -8071, -2232, -8310, -19446, -19766, -17621, -15770, -24201, -39001, -31914, -22833, -4436, 4231, -3309, -3971, 7198, 14683, 5786, 14531, 23414, 25879, 15145, 9296, 14960, 16057, -6780, -21602, -11281, -15124, -21884, -26924, -25142, -4043, 1885, -19769, -41678, -52750, -54690, -47721, -37919, -19063, -7014, 1487, 10904, -1441, -1515, -22737]
22329b2737k701J8607J4360k299j0208O363L384l544K886n663j3622J4594O512
22316E932n465q019P306J0j443p599M595N674j7216l185j1428R89J8381o322j294
22301a9084J6532o165p941j3087j2432n047R561J2656p83J3888J632P901j7606
22288a9975o425j952p550M034Q107M874m333n347J8922K1227L235j1534o072m0
22274b829m319l652J0393M492j3645j1708J1142J4825m394k1376M077J989j4293
22261b9298o621J6356K4892P545p48P884N489J96o221J33q845m559j5445j5700
22247b4942o728Q973J0268P494J522j045J2584J2483p81r089l708q35k892j0238
22233f934q767M352N400j692R928j5059k287M581J590K1468r660j06q18j0057
$$ y = [-22737, -25438, -6831, 7529, 5230, -4978, 1385, 4769, 1225, 4111, -1552, -15174, -580, 5932, 467, -7552, -246, -236, -1679, -9278, -4683, 991, -16225, -19410, -30838, -29849, -11468, -17790, -19084, -2552, -8717, -16658, -29745, -42177, -47224, -37663, -25007, -25790, -11902, -10270, -2369, -19975, -26400, -28352, -35902, -31868, -23761, -18887, -23220, -28567, -9645, 11582, 14817, 3283, -2789, -2829, -7148, -10800, -407, 4085, -9560, -21268, -10126, 4699, 305, -21071, -16994, -15005, -29298, -35919, -19563, 5329, 12874, 12126, 20010, 25499, 25695, 19474, 19607, 10762, 6203, -9242, -24942, -31670, -22697, -12429, -4935, -3413, -4458, 8126, 20609, 19828, 10739, 7031, 6196, 3304, -6934, -15701, -11349, -5949, -7641, 2287, -12772, -15059, -10478, -8888, 12580, 2920, 2814, 1996, -8061]
22219h061n57q036j667p19M094M76n609K815J920n856j999j1466J3101L2745N167
22204A6348k2404j2940R794O930m686K3735p236j945n87J995k224k490P625k387
22190I528j8650j4723q11J898k388M698L427J712J2983j2674N229J8169P888O21
22176A6907r092k916o151n579k223k535k7122n432J0450J5822J7946l475j455
22163d855K653O72J4604m545j4519N706J75p872j475M415N556O956P586Q714q890
22148A4881j6455k757J7041K4545l669j106o035q680J3590j4615m352j5419K10
22135b821K91O596p921q663j369j1420O353J5843j1523n915J3791J1611J3516
22122A8369K13j6101q706L740k757j81j798o70N38l47k2742k280K5963L272J1256
$$ y = [-8061, -8618, -16654, -18321, -19040, -14946, -14470, -20079, -17264, -15344, -21200, -23199, -34665, -21564, 11181, 16348, -6056, -18996, -9202, -2272, -6958, 16777, 9541, 7596, 7009, 9004, 6780, 4290, 11915, 9528, -9122, -23845, -24656, -22758, -25146, -20448, -17021, -15309, -2326, -15000, -9771, 8398, 16286, 16907, 7815, 4899, -1252, -6831, -9054, -11589, -38711, -44143, -33693, -17871, 75, -3400, -4855, -2202, -1530, 13074, 8529, -5990, -284, -109, -7981, -9456, -5041, 515, 7471, 15057, 23771, 14881, -1574, -4331, 12710, 37255, 33586, 32480, 26445, 17765, 31355, 16740, 12388, -3031, -2821, -2530, 4066, -3855, -12518, -13887, -25307, -18954, -3111, -14634, -20549, -6758, 4853, 18369, 18582, 2481, -6225, -2485, -5242, -5423, -7221, -7891, -7353, -7700, -30442, -32722, -6759, -3487, 7769]
22107G769j2995K610J0762j8985j4313O339J0863k610m232m901n800J0035J1370
22094d088P143K015O167P470P204R72j7859p207K087J666p635j0820j3370J2184
22080a4071J4055J3225P835l029j7902j0083P75m889m377L852N815J378J7851
22067A0435R101j6494j7276q797Q085P477J2434m83n529m9k291j3369Q847J691
22053f218M92n480q723q761J6198J798j1082m446M607K6439L303j724Q425L711
22039A8539p455K268O098J1644K739k1688j2454m645J326r40j0569P74j287j6108
22025c1758j0570J4099J1648J1363J1596L858J495O391m837l704j0092N697L955
22012I141j2237l265R788j1272j8849L579J2159J1873J9504j3879l801O139J866
$$ y = [7769, -5226, -2616, 8146, -10839, -25152, -18813, -7950, -10560, -14792, -19693, -25493, -15458, -4088, 3055, 5070, 11237, 18707, 25911, 26883, 9024, 1817, 3904, 5570, -2065, -12885, -26255, -14071, -16, 13209, 21044, 18015, 113, -9970, -9195, -14084, -18461, -14609, -8794, -7416, 10435, 19536, 3042, -14234, -23031, -14946, -7469, 4965, 4482, -1047, -1096, -3387, -16756, -7909, -6218, -5726, -11206, -19929, -28690, -12492, -10694, -21776, -26222, -21615, 4824, 8127, 6403, 14828, 18539, 11084, 13352, 19450, 31094, 33833, 12145, -309, -4954, -3628, -4568, -15137, -14363, -15650, -31758, -42328, -28229, -16581, -5218, 6378, 10236, 11731, 18122, 13285, 9581, -511, 5186, 9141, -3096, -6361, 3427, -7845, -26694, -23115, -10956, 917, 20421, 6542, 2741, 8880, 10746]
21999A0746o386k7751j739Q230L28M779K185j5049M506J9704P441q698K461m730
21985c973r364O616J1291m95j839j4808n578j808K432P082m406o998P809N383
21971h656j2046q142J0277J3288L214o327J645J1411L178j375L778l567r031r528
21957a1881J3496J6503q598m157K261J840k0196J4093R788k0565j0081j132j0994
21944b9623J4055q43P66J9082J5994n211r800M874l483q458j1287m198P067P93
21930a0272J3923q511O207O144l274Q265j7023m707N702J5098L047j620p87J0017
21916B2209m961k2553n526r464Q231J1644O778j406J2431L640J153n525k0427
21903c776q766j393J8961Q191R935n428j2228r38J8294J1975r739j1076j2555
$$ y = [10746, 4360, -23391, -25130, -16900, -16572, -11793, -9608, -24657, -20151, -447, 6994, -1704, 757, -3973, -13337, -6721, 4570, 4075, 2236, -12572, -18150, -19958, -17526, -10444, -14850, -21848, -14039, -8656, -20702, -28844, -18567, -5279, -2065, -8392, -6747, 4664, 7842, 6467, 10245, 6678, -2353, -11881, 1615, 18118, 9520, 5363, 7624, 9464, -10732, 3361, 13149, -7416, -17497, -18629, -29623, -15568, -16411, -15645, 3437, 19431, 14220, 4420, 9294, 5811, -2647, -13934, -18132, -11065, -10272, 3651, -4860, 1347, 7491, 4217, 12482, -4541, -9248, -3546, 11552, 14599, 12979, 12192, 22209, 17248, -5305, -10831, -20295, -12064, -420, 6358, 4952, 17383, 21023, 22176, 16651, -3776, -12542, -13935, 5026, 13217, 23152, 17724, 5496, 4558, 22852, 34827, 25088, 14012, 1457]
21890A457j3342k0493R928L4324J1525l326m902P195n546j3210P463j2232j6733
21877a7892M709l073o542Q742R818M367p036j8077K429J3827k467N091j481j1753
21863a9338Q543J8943o678j0646J4113J959j8549q721k867R598L340J0625J7983
21850A8305r075k055m930k142O746n752j470N496MJ7015p156k5404J0142J1771
21836A1495Q71k1773p698r737j1443r3J9607J9288r550J13J7526J6615M758n760
21822B4219j09k1275L607P94O334R400q12K655Q554j4727j9692j1218P340N879
21808I49K299O190N57p462p398q260J446n800J083O580J1674n67k0974R686J8677
21793H680j8247j4227R84J9227J3013r468j7661J3910O902J171N52L430r195k412
$$ y = [1457, -11885, -32378, -22450, 11874, 23399, 20073, 15171, 22366, 16820, 3610, 11073, -1159, -17892, -13183, -16256, -22798, -14056, -4238, 129, -6907, -24984, -22555, -8728, -11195, -6104, -7585, -19338, -10795, 8148, 1470, -9176, 4937, 6896, -11653, -20374, -23241, -13643, -10303, 322, 18305, 9230, 7175, 2245, 103, 6849, 1097, -373, 5123, 5127, 22142, 14986, -10418, -276, 11495, 12366, -9407, -17105, -26842, -38285, -38378, -18771, 517, -9033, -8920, 8606, 25221, 29979, 24219, 24110, 2835, 6442, 7236, 13570, 22970, 22158, 24813, 33367, 18640, -1052, -12270, -4930, 949, 3248, 9438, 9995, 2533, -4865, -13125, -11679, -17479, -16396, -9816, 1858, 1291, -19683, -9997, 8680, -9567, -23794, -22810, -3583, 9430, -38, -17699, -3789, 3113, 4284, 4836, 8266, -929, -3341]
21779c341n539k387j2364Q362J6581Q703J532l206r710J208R400j069L645r58
21765A0857j1168Q04l958R034J7103j473k4975l953p70n993k346R275K552P6q211
21750a3146O83J4128J5237o587L35j800j1305J1143L639p753l519J428j0232J849
21736e900R220J0817N465M659r744K091p228N747m909L299O804p422N587m606
21722A3880o473j4358j6668r297J878R459N296J2649r656k473m351J5534j649
21709f229K964L668j2779M947J3427P910K723R625O825n570j6226j3070j1447
21696a3232P406k656k778J5471R23j4150J3334j048m61J4340J4152r542j7155
21683D604k244m259o421k583R249J5698j344q428l43J6396Q894j2253o673j0502
$$ y = [-3341, -8880, -11267, -23631, -15269, 1312, 10015, 11547, 8341, -1369, -161, 9239, 8170, 11815, 10857, -311, 493, -3465, 5569, 22672, 21199, -3776, -7729, -8499, -14492, -16838, -7563, -5011, -4935, -13146, -12463, 1665, 16902, 10315, 10650, 8850, -2455, 8688, 12327, 4574, 1055, 2483, -7749, -5900, 3320, 14137, 19602, 24261, 14517, 16608, 9380, 15127, 10218, 13517, 20321, 12899, 18486, 13880, 7407, -6951, -23619, -32916, -31038, -21579, -16283, -3634, -13290, -15763, -20114, -4580, -6229, -3265, 403, -12376, -7429, 5998, 13908, 16631, 26256, 33081, 27511, 11285, -1785, -13232, -5826, -8482, -11260, 4211, 5134, -9016, 4318, 3270, 2809, 17149, 31301, 21759, 4604, 2360, -1899, -8320, -10903, -1654, 14044, 12700, 4272, 3929, 20325, 29219, 16966, 10293, -209]
21669b09j1955j5088K487K3964N473r061j4338k6464j4874J1022J9601j155k29
21656c0826O290J7920q322j1975J469Q78Q876K2932J0071m658k4603M35J04p736
21642a9145J7693J6553l457j3064m456n06L368Q414j1779K018k616n971o712j7069
21628c6729N887J4796J7298J405j5622n025J0233J5781k912r335Q020N365r996
21615h34k549K459m526L805J354j8559p447O125J0698J943o452P248j0931J162
21601a6504J6057J4993R273j7590j0736p956j0329o912J7411K0107J822r693j0555
21588a0612k890J924J0924K813l377J1368p12j7994n844O326P539J0430J895Q028
21574A9818l580j0655j982j0115M2M797M488j3698r371J0902J6775p974j408k920
$$ y = [-209, -12164, -27252, -24765, -801, 4672, -4389, -18727, -45191, -60065, -49043, -29442, -30597, -30826, -24536, -6616, -14938, -26913, -25444, -24566, -15690, 7242, 17313, 12655, -11948, -11513, -11409, -19145, -1452, 15101, 11644, -1420, -5876, -6382, -3014, 5400, -6379, -4361, -6977, -12948, -19660, -36729, -30842, -16046, 1252, 2657, -12965, -17990, -7757, 8024, 5112, -4223, 3797, 9162, -834, -3383, -924, -5450, -1645, -291, -18850, -26297, -20172, -9474, -7531, -13983, -6735, -17666, -16504, -447, 14546, 23819, 6229, -4507, -12463, -22792, -29704, -12293, 7814, 9636, -57, -10612, -13502, -11578, -654, 2159, -1218, 10150, 9438, -8556, -14400, -8074, -535, 9895, 11790, 19818, 16238, 5583, 3601, -6514, -6472, -1675, 2813, -10885, -20256, -9354, 7421, -553, -1961, -4881]
21560d881M876N579o467q484q199Q20J4225l544P268L6j180P87j739n615N369
21545a149k330Q113J0105j3081j0371p930O951j3223j1232o286J1080K1335l888
21532a1906J175l721k493M673L064m726j8831J3960J7848j399N475J373J2597
21519A7089K0373j6010k6960j4981L135M852R114l359L823K756L648L695r458
21506b283j8476j5911k1264J0660J1959J3587K2121K714l080o410R64r292k890
21493a7601J0697J8257J3009J212Q701j2999k3263o853J3582J5757k961j3947
21481C591k466K3761j0059j4029K611J754k909j0769k0726J2960J5266N521M404
21468H910k883J929J3909Q059j0390O984j1545j1082r303J4694n70j8502J5215
$$ y = [-4881, -5, 5574, -893, -9377, -17576, -16756, -2531, -6075, 1193, 1229, 49, 836, -903, -6518, -1149, -3479, 4634, 14739, 1658, -8713, -16643, -9692, -22915, -34147, -40433, -29353, -8018, -11906, -10731, -14452, -16945, -12272, -9208, -13934, -32765, -18805, -957, -2356, 3119, 4492, 17089, 37462, 21452, -5508, -20489, -17354, -12502, -3388, -6747, -2924, -168, 3480, 7175, -2283, -20759, -36670, -57934, -47274, -35315, -21728, 393, 3107, 27, -6383, -5419, -14711, -17601, -6904, 11353, 24362, 25574, 34275, 21276, -1987, -8840, 4742, 20499, 17538, 3591, 1125, 24886, 14827, 798, 3409, 5163, 2254, -8515, -29241, -16281, -1015, 4506, 8910, 6027, 7956, 21865, 29924, 19534, 26518, 14973, 3891, -5412, 9282, 8712, -9790, 5425]
21455E425J9029J88j3645k280n017p295j419J1901P544n060j6587p439Q293q742
21441a5104R751L725R355r760j0182M823J0346P626m778p80r520J217K690O799
21427F208m691j1626J0352p672k0923M429O001p3r296J582Q10M275j651J3018
21413i257J4217K921k506j4973M386P421R149l254j8716o819n195n745J4207Q081
21399f083l765q100P772O539Q170L912O951j3776j4999M10m910Q124J5188j625
21385C808j546l663o530j610l985O98j3792o404J46r32l016R488Q024L309q503
21370b4508j0535M511N964J8252j120l191p276O215M737j0366P425l62O121k814
21356f947o50o250m010j989R913J4742R769j7412p842r684M872J258P439J2112
$$ y = [5425, 24454, 24642, 10997, 8717, 3700, -3595, -5014, 6887, 14431, 9371, -7216, -14655, -6362, -15104, -5353, -1628, 7727, -2033, -12215, -7392, 2954, 10580, 5802, 5022, -4498, -3281, -591, 6208, 1517, -10109, 243, -7429, -28352, -23923, -17922, -17995, -27291, -25709, -24899, -20624, -22275, -9257, 4960, 7881, 5375, -9598, -5212, 2209, 11358, 8104, -10612, -17431, -22626, -28371, -14164, -6083, -9848, -17948, -10176, -3637, 4533, 8445, 15396, 1620, -13379, -12969, -17879, -9755, 5433, 3808, 2262, -1401, -7931, -9541, -13526, -12828, -26620, -33024, -32878, -33810, -36826, -27338, -19314, -16005, -24508, -35043, -30532, -24568, -6316, -7436, -10627, -17903, -11688, -6951, -17317, -9892, -10254, -4133, -6947, -7597, -13847, -17857, -19846, -9933, 4809, 14578, -2834, -10676, -20360, -15488, -14230, -6791, 5321]
21342E321j353r732l701R6J0120k985m829l310R343P828p459L147J3014j6612
21328a112l794M859J8000o227P687Q573j0335j4930j5907j0027J4216m993L402
21315a0588j365J3085L182j5843J1142K683r739N378J6707O26j168j261j1290
21302A549n353k0018n143Q515j236Q546Q844K208l008O152m405J0524j9158j3952
21288b5935P472j380k030K3005J774k2499j4227J2213J2583J7522p359n702K315
21275b248k6852j0335J4030n59k962n068R146O396P177J3541l723n466K484K273
21261b166p55J2231l031p037N156L509L054m954k441j0970Q31J1478n381n11J3775
21246A2788R8o1K191j590j4068j9416k4306O104J7600Q379J2172L827P392M054
$$ y = [5321, 3968, -5764, -9465, -9369, 751, -2234, -7063, -10373, -1030, 6798, -661, 2486, 15500, -1112, -4906, -47, 17953, 11726, 19413, 27986, 17651, 2721, -13186, -23213, -8997, -13990, -10588, -11953, 1132, 4314, -11529, -387, 2296, -7443, -2065, 14642, 15268, 14100, 12839, 1549, -3804, -23822, -28965, -20450, -21686, -13140, -4296, -2088, -5096, 1056, -3349, 7175, -11983, -25935, -18463, -19843, -21873, 1132, 2906, -19593, -33820, -21607, -9024, 8498, 1139, -4563, -2248, -29100, -39435, -25405, -25964, -28926, -33994, -24848, -18452, -11275, 2266, -1457, -6923, -4439, -2166, -2921, 9310, 6279, -758, 4398, 7907, 10961, 6007, 3566, -7404, -6573, 4905, -476, -987, 12788, 12886, 12825, 15016, 13426, -642, -20058, -44364, -38260, -20660, -12281, -109, 3718, 11110, 15164]
21232A5164p725J917R035n464L203m108q500J138p16j367K957L044P495k0909
21218d836j9355j1170J0497J4075k337P548R854o673j0232l81J29N183P275J1473
21204A1050r115j1937j949J888n8q126k3727L861R235J6326M799J219j187n944
21190a3665p423k469J2382J6648q860p977O200j709K3789q229j5790K458r99O675
21176A031P521k6121J882L110j388L589K465j2813K026j2116P804J0758K748Q189
21162a315J5309J2600K80k5593k0000N987J5007k433N040o087J1974Q668p750
21149A1687j0696r975m71M940K269J0219N022j0724j5054J0173J02q904r125Q489
21135a2048P861K963l603J4453J2637J1713l685o265J5299m443k3895k6652j7764
$$ y = [15164, 7439, 9356, 18391, 12927, 16130, 12022, 3522, 4660, 3944, 2577, 5534, 8578, 16073, -4836, -24191, -35361, -24864, -10789, -13126, -5578, 4276, -2397, -12629, -13010, -12881, -7698, -423, 11050, 1935, -10002, -11951, -10063, -10121, -18247, -41974, -38113, -28878, -12552, -7753, -6534, -7721, -13665, -21088, -23557, -11175, 5473, -3387, -11364, -5164, -6873, 16916, 8687, -7103, -4645, -5644, 1031, 8552, -17569, -15687, -12577, -13965, -10376, -7911, -20724, -18698, -30814, -23010, -12252, -9504, -1315, 13994, 26594, 26874, 1281, -18719, -12732, 2275, -158, 4882, -1205, 10769, 19437, 11687, 991, -8984, -9455, -4515, -2246, 7973, 12995, 2271, -12783, -2610, -2508, -11412, -20537, -12048, -4187, -1224, -4827, 9626, 22263, 33976, 30291, 24026, 39325, 34882, 10987, -15665, -33429]
21122c3429M069j0639o637K2443P733k827N116j4529P581J6881K031Q58k737j3906
21108a7992Q77L314J485m623L015K3203n05j5198L653P128J315M865n49J897r481
21093B404j2343k4463P221J9353J0228j172N667M237K332m43j557j0015L915j1737
21079f373m684R713j417J0780Q606q07l211n580j6984O551p646q110P88r952k4133
21064e2459l504J1558P752J3294k778J0004m487J384P510M137Q669N397r738K04
21050c057j343P523k774k5983m360m178K603N669o714J3701J1735r281N094N894
21036e471O146J2093j7535m598o960j0460J5785J8434q562j0792n934l926l963
21023b5743J207K2500K359l510P772R759j1300L679K391K958k615n155m445n380
$$ y = [-33429, -29360, -39999, -46636, -24193, -16460, -19287, -14171, -28700, -21119, -4238, -2207, -1349, -4086, -17992, -17115, -13801, -12316, -16939, -13924, 9279, 8774, -6424, -2771, 4357, 5672, 10537, 9988, 11885, 2404, -9939, -34402, -27181, -7828, 2400, 1228, 6895, 11132, 13464, 13021, 11464, 1449, 5364, -6373, -11057, -1344, -2761, 8019, 16625, 15818, 12607, 7027, -9957, -3406, -11052, -19162, -18374, -28326, -52459, -55963, -44405, -36653, -23359, -26137, -16133, -20620, -19236, -11726, -7589, 1080, 6477, -3261, -3057, -4400, 3123, 349, -25634, -29994, -34172, -31569, -25900, -32614, -18913, -7178, -16459, -11365, -5471, 675, 12768, -4767, -9365, -16325, -26785, -11000, 7434, -1128, -11920, -17854, -21780, -25743, -24536, -2036, 323, -3187, 4585, 14344, 3044, 6723, 9114, 12072, 9457, 4302, -143, -5523]
21009e523K516N980m022O236o313j0570l360j2535J3154J6068M867N183r274O144
20995H551p250k70J1436Q907l745q154m781l396l090M278k644m26J8413l349L455
20980A7935j4640n237j7771j2754J3886K4364J1324q228K49P373J1381k1203j0820
20967d141j8483p490K0014o608o371J3126J895j4300O008M530K507m691n308J713
20953a7599l348j4513k756K5713J0732j3753j2747K913P478R051o25j1093m511
20940b5058J2296J947j6958j1822J1876O403R118M801M325j7161j5331o254j1218
20927e3036R149J3895q060L012R986J0715j802J7462J9239J1373j8245q268j4795
20914i375j4265L204J2433J3055J9731j1561N39O430o181j1821M868o58j7479
$$ y = [-5523, -3007, 2973, -1049, 5187, -1126, -11696, -15056, -27591, -14437, 1631, 6498, 11681, 2407, 8551, 1301, 1031, 12467, 21374, 17629, 9475, 4694, 1298, -1792, 2486, -158, -584, 17829, 14480, 17935, 3295, -1942, -19713, -32467, -18581, 5783, 17107, 8879, 9128, 16501, 27882, 6679, -4141, -22624, -30114, -10100, -16708, -23079, -9953, -8058, -22358, -16350, -11820, -9313, -14004, -19312, -17599, -20947, -35460, -38216, -12503, -1771, -15524, -28271, -25358, -17880, -8829, -9454, -20547, -25058, -12762, -10815, -27773, -39595, -27719, -21316, -12198, -7397, -3072, -20233, -35564, -41818, -53036, -43887, -29992, -38052, -35040, -25054, -14339, -16141, 1321, 20560, 31933, 13688, 5420, -9375, -23640, -20436, -8003, 5052, 24783, 13222, 13761, 20191, 14010, 2189, 7057, 6399, -11080]
20901a1080p584M225O496L411k915Q044N579j5311l764Q990M114q891k648J930
20887i404M314n026O976j1975r229k26J3236K8259m635M259K3608O873j1048k346
20873C3636j4548p277q77k436o378k53n437p801j0093r275J4372Q895o311m772
20859a8555K91J9202J1694o685j5197k3480m183J6444K334p350J1220P344K952
20846c969o688K0677j712q60M860j2235j8485o637J0547k80L125L009o137o838
20832b1623R569j156j487J828p313L138O485P976m11N665j4814O58Q749J0529
20818G793O871j0424k2202o549R649o71m459Q504K0013Q467K673j802q226j8684
20804i047N262J1430O319M440o257j2664j1725j3403r98J529J2532m23O341o862
$$ y = [-11080, -18664, -14439, -7943, -4532, -7447, 597, 6176, -9135, -12899, -3909, 205, -8686, -11334, -9404, -5090, -10116, -3140, -15115, -24344, -24570, -11334, 16925, 12290, 16549, 40157, 47030, 35982, 33636, 19088, 11811, 10934, 8498, 2120, 1867, -3570, -11371, -21464, -30739, -16367, -7472, -13783, -18555, -18264, 938, 12632, 5947, -9250, -32730, -36913, -20469, -18135, -25485, -14265, -6921, -3969, -10657, 10020, 8308, 7448, 12308, 73, -18412, -25049, -14502, -14782, -11657, -8648, -14785, -21623, -12054, -13210, -14697, -12869, -20182, -17044, -10559, -2583, -2994, 2671, -12143, -11485, -2736, 7793, 14664, 4240, -17962, -24511, -14862, -15533, -19992, -11488, 8525, 16992, 19665, 17863, 9637, -9047, -3785, 7645, 13964, 18404, 12147, -517, -12242, -25645, -26643, -25114, -12582, -13005, -6664, -13526]
20790a3526j432J8387L007r090m063l672q693p690l661J8070N34K207M742J0135
20776E255j4923j282j6335L237O539Q323j1915M840K0396J0958r385n159J9907
20763B0456K063m760k117q658l703N783p964j3971p314j623j764J5430M858j39
20749c423K721K524j1150j4084M514K1007j403k970n914p036K925J6560m362j8415
20735a8506K07N761J6486J815K4738k21l4845j3492J6871p454n382j5159K756
20722b6425O290n300K0090K3341j1663n717o78N225K854k72P012K964l020k0049
20708e348n275L928j5897N709J8515R566Q273J2129j5565j4532j3031n250n331
20695b2109Q892J4069Q749j6475j172n038o885K525N809P903o397J1134K664j1443
$$ y = [-13526, -14958, 3429, 6436, -2654, -6717, -10389, -19082, -26772, -30433, -12363, -11829, -9622, -4880, 5255, -9668, -10950, -27285, -24048, -17509, -9186, -21101, -16261, 4135, 15093, 5708, 549, 20456, 22519, 17759, 15642, 6984, 3281, 9064, 1100, -12871, -20185, -21808, -23572, -8142, -3284, -3423, -702, 1822, -9328, -23412, -18898, 2109, 706, -2264, -8178, -15214, -12289, 4271, -91, -18506, -18299, -12538, 3948, 5763, 30501, 30280, -4565, -18057, -1186, -8640, -14022, -29181, -26425, -20135, -25435, -5345, 17996, 6333, 616, -62, 5163, 8017, 7745, 14757, 17721, 14701, -5348, -10623, -6695, -22592, -16883, 1632, 11198, 19471, 31600, 16035, 1503, -11528, -16778, -22109, -13217, 852, 9601, -6874, -8046, -13084, -19969, -17444, -11635, -3732, -10129, 1005, 3669, -7774]
20681g774j2076J1846l250K232N127R711j1953M24k492j0606R317n587r187J3425
20667a0843k288M800k35k015Q401J0874m875j2065Q152J7996m43j2080m641j5147
20653a4409r314J7205M129J4570j521l620o254q7l763J468O494J0433R113j1633
20639A2811q015k2660k732n985J5662N703r700P839P923L455K943L21O636M944
20625A9145n701l693R570L16O508j2157j5506O632Q974R516k838j9723r201O695
20611a463J7195o988j1925q08j8958k268O447N2J4430J4707m33R673O195k5370
20597D86j52J2898q098J2067R093j7089R030Q312k8706j1475j546J0854J1400
20584G074L583j0459J1648J0280j4785n151J32q857P710J0652k216K17j3523q981
$$ y = [-7774, -19850, -8004, -11254, -9022, -3895, 5816, -6137, -5713, -8205, -18811, -9494, -15081, -24268, -10843, -13131, -8331, -8566, -10581, -2180, 8694, 3819, -8246, -94, 17902, 17459, 5379, 738, -14409, -23723, -6518, -2389, 12181, 10660, 7040, 786, 699, -3064, -1596, 4898, 15331, 24444, 12811, 4796, -17864, -20596, -26581, -10919, -5216, -14916, -7077, 846, 4301, 7244, 7565, 14201, 19145, 13444, 9751, 19321, 19637, 26145, 13988, -1518, 5114, 14088, 23604, 20766, 1043, -8158, -1463, 15732, 8744, -3181, -3989, -22947, -25215, -18768, -18716, -4286, 10421, 9988, 19661, 25856, 486, 334, 13232, 5134, 17201, 26294, 9205, 18235, 26547, -2159, -13634, -15180, -4326, 7074, 10657, 198, 11846, 22126, 7341, 2190, 2322, -6535, 1175, 11827, 9611, 9828, -3695, -12676]
20570a2676j333J095K981J892L094J6332J0931j155j9389m139M131j686J751N755
20556G584J2750K4j2130j891l533k570o67O225n280o391R8R81p089n39J192l200
20540a4436J345R577N069J5537j551j613J0325Q165r894j6255q288P135K747N020
20526A2883J1895j3688j147k50n094l419q471K769R130R064o188M942j9416r708
20512a6698r95j731K954J4884J2403j2542j0212Q657m370K458k463P638J2616
20499A2599k362j5248j0855j03n533Q636J2072J2830J1570Q455P93Q637n904j4597
20485B0990j5135j4145n976J2479o893p078m753O151j699J5120J3175k26n849
20472F161j2461K869q692p432M786l045L980O301O11m10J2178M833K954j7908
$$ y = [-12676, -14009, -12914, -9933, -8041, -4947, 11385, 22316, 21161, 1772, -2367, 1764, 78, 1829, 7584, 20334, 20358, 8228, 6337, 2804, 234, -433, 5792, 512, -5879, -5781, -4800, -11889, -12428, -11236, -14436, -13091, -3514, 1555, 17092, 15541, 13928, 24253, 32418, 22524, 6269, -2019, 5116, 7863, 12883, 24778, 11090, 9943, 9693, 4599, 1180, -7291, -4522, 4608, 13672, 7484, 12426, -6990, -16698, -17693, -19424, -16470, -1586, 10817, -1725, -11937, -3280, -7650, -5192, -7655, -17, 12599, 10237, -5011, -15866, -15969, -21502, -12866, -794, 12036, 23606, 32061, 32854, 41491, 35587, 20990, 5855, -8290, -14266, -1787, -8680, -15758, -20511, -14360, -16059, -939, 12236, 12010, 6161, -6300, -3431, -12123, -19555, -14769, -17814, -13834, -7533, -6922, -7332, 4846, 9679, 12633, -5275]
20458e275k8319j3786M251J4180J7802Q41O39m798n247j5171K015J0341R633j0393
20444b3287r183J4524P222K2174k54j6933r763K546r68m947J2320Q22p466r746
20430b2939P027p700l894L689N373K1889R288j3453k648K751j323L770j9410L723
20416a3857l849R305n457q753L846K3612K4432l550l789j337n584Q307j114j4179
20402H033k0846j4067R049K0593k244J631Q598o059p968o69K8747r341p910N908
20388A3455M896R95l636j2499j7229n952j0242J114O134J7163J6474n637j6566
20375a1530J4428J4588J8091J230k0615j1813m08k1523r030K4562K1766J1749
20363C1495q958k5508k1115N311M970k182J7684J2086Q200J671L926k2134k898
$$ y = [-5275, -33594, -47380, -43129, -28949, -11147, -10306, -9667, -14465, -19712, -34883, -32868, -22527, -12894, -23287, -32470, -17946, -10724, 11450, 11196, -5737, -15500, -12954, -13922, -18869, -6549, -5727, -13193, -22939, -15912, -23612, -27506, -23817, -18444, 3445, 12733, -720, -3368, -617, -1940, 1830, -17580, -13857, -17706, -8401, -13858, -22611, -18765, 4847, 29279, 25729, 21940, 20603, 15019, 23326, 22212, 8033, -12813, -26880, -17831, 2762, 518, 2149, 10747, 4688, -3280, -3949, 24798, 15457, 7547, 13455, 18351, 19346, 15710, 3211, -14018, -19970, -30212, -29098, -22964, -5801, 10673, 5036, -11530, 2898, 17486, 35577, 36807, 16192, 4379, 3971, -17552, -26582, -2020, 19746, 31495, 22537, -2971, -24086, -18775, -13805, -15987, 1697, 13783, 21983, 23654, 27580, 5446, 2548]
20350B548P947R966r826j9731o871J0004L763J106o130j3250j5971p27J9021K4719
20336F568R576r535q439q778J9988k569p889j363j3599R519K4708r603J352j7222
20322g286J497J7091j689o762j973L884P849r338k312j8591N54p096J0293R753
20308d126J3668j899j1999k147J2445R809K642n153M547j1091k4895Q015J8717
20295H533R865p286j0632J682J0258j731l87j0644Q02K977j86o091J158Q764J180
20280H262P406m727j1016Q024J4208J8471j3349j7511r539j6207q414J784J3322
20267i286J1813N83N558j732J738K063J128o575o378M37j5745j7535l2501J1501
20253e4931J9096J1490R616Q31K037Q712Q460m764l353q330P591M821k0137J9386
$$ y = [2548, 10495, 20461, 10635, -9096, -15967, -5963, -2200, -1094, -7224, -20474, -36445, -37172, -18151, 6568, 16144, 6609, -1830, -10608, 9380, 6811, -1078, -2441, -16040, -6521, 18187, 8584, 9936, -7286, -5789, 11302, 9613, 2851, 878, 4762, 12611, 3273, 961, -17630, -17076, -24172, -13879, -4126, 9542, 7643, -4356, -6503, 5942, 15751, 18393, 13240, 17787, 6696, -18199, -10184, 8533, 18398, 11112, 480, 2162, 12420, 10689, 10302, -342, 460, 3437, 3251, -2840, -1682, 7082, 8262, 15668, 10941, -75, 7949, 22157, 40628, 27279, 9768, 229, -15978, -24392, -22608, -9286, 2527, 3110, 8668, 6936, 8674, 10737, 11865, 5290, -1088, -651, -16396, -33931, -66432, -54931, -35835, -24345, -14729, -13898, -11861, -3149, 5311, 547, -2806, -11136, -3545, 1276, -18861, 525]
20239E25J6196O769j4036n940N81l163m814L161l628k560j3279m67M721J5711
20225b23o60K799K777J519K357j573j3849j3930K3071j659j0203l681J0599M942
20211B286Q173m804j499J791m721J1117M031j0043j5390j1651J3848M244K647
20198B9Q414J609l946j0981J2590Q58k8978j7293m34J6429M587m891M063J014
20184a6930K5846J0610j5997K386p892k6145M972q994l302m604J3613M733J2085
20171i619n175J186K391r196J363K6597L2926M332k0947j5955l039o584N260m79
20157C061j1527Q443p080j2427O945J2029k816k923j4571r494J7038J3980P25
20144A383K1809j1295j4289r271n973o009k839p841j469J7207M980J792m800J0455
$$ y = [525, 16721, 23490, 9454, 3514, 4095, 932, -3882, -721, -4349, -6909, -20188, -20655, -15934, -223, -883, 1916, 4693, 6212, 8569, 6996, -6853, -20783, 2288, 629, -9574, -13255, -2656, 2286, 10459, 5655, 4156, 5947, 1226, 12343, 16374, 6331, -9059, -20710, -6862, -2618, 29, 8443, 10052, 6106, -4875, 7715, 8573, -20405, -37698, -38132, -21703, -17116, -22007, -17944, -16930, 8916, 19526, 3529, 5915, -1977, -28122, -23150, -32144, -35446, -40050, -26437, -21704, -9619, -14794, -13608, -11217, -20413, -19050, 7547, 40473, 44805, 23858, 7903, 4864, -1720, 3540, 3061, -8466, -23, -7103, -19530, -12585, -556, -3372, -6295, -20866, -30360, -13322, 658, 1383, 23192, 11897, -2392, -11663, -17636, -23645, -26484, -34325, -35794, -18587, -13607, -11815, -16615, -6160]
20130f160J1374L53p6J1802j436o104J2100j0341o186R082K716J261O047K09j0444
20115A4197J1958J129j2706k3637q757K613J0872R144j8024j7049K1113K2084
20103A2937p286m488n176Q32k513m023o754K668J5407J8103J3307j3931l077n780
20089A0226P130m369q97J646k49m738p426j9196m143O670k1j1207K4275J6849
20075A4550j4701j8090J0929O029j1233j3876R487J2339r384J979P295k1261J823
20062b4114J7818J1579j348n519k581q546j2491N625J2971K1144j99o860k684
20049D795q548N973m076O642j1314j6452N386J0240J2837l217l705m919p717P109
20035f966L931n580j2047K144R794K519J0906P738j2764j8239j1989l568j241
$$ y = [-6160, 5214, 5567, 5491, 17293, 15857, 9753, 21853, 11512, 5326, 14408, 17124, 18385, 24432, 24641, 14197, 26155, 27284, 14578, -9059, -17816, -15203, -4331, 4813, -13211, -30260, -9147, 12937, 5651, 1163, -4013, -3181, -5694, -9717, -16471, -13803, 1604, 19707, 33014, 19083, 16006, 10226, 17356, 12987, 12090, 13736, 13487, 8749, 1323, -17873, -22016, -15346, -15367, -26574, -2299, 14550, -151, -18241, -7312, -1283, -12516, -26392, -16905, -4566, -13950, -11971, -4676, -25937, -24114, -6296, 5283, 3935, -1584, -4165, -12711, -25202, -19577, -6606, 14538, 14339, 7479, 4795, -3753, 2220, -1856, 4786, -6528, -22980, -17594, -7354, 5483, 2266, -1439, -6358, -14075, -6966, -3035, -8615, -20662, -18518, -8724, -6205, 4701, 12439, -325, -18564, -30553, -34121, -35362]
20022c5362R476J1497j6155K618K0426K3184j3593l990j015r863J0051p78j5305
20009a8809l432J0609Q196K146p446J198j031Q046q380r385K2858R353k5071k5892
19995c7040Q956J3015P221J7259M705l333m929k149N014K030J881n022j0258K320
19981c30R284Q700j0511p25j823k6245O74K7070L7556j745l6748q061k50K696
19967d58O514K436j1960M22R56j696O062k504j49r796J3843Q963n273p904m179
19952d723J6443N563N72l715J0129l113j2026k5625J9688J6104L600r368m072
19939I457j976r352j94j626o423j474J771P326J340n367J7800R658j4682j6900
19925a0642J1829N812j7598j1079J9422L299p290k247P408L275p405j1414k0939
$$ y = [-35362, -25886, -14389, -30544, -27926, -7500, 15684, 2091, -1899, -2914, -12777, -2726, -3504, -18809, -22241, -11632, -3436, -1290, -8736, -7538, -8569, -523, -8903, -18288, 4570, 13923, -11148, -37040, -28084, -15069, -7848, 9411, 14116, 10783, 5854, 3705, 8719, 10749, 12630, 7608, -2650, -330, 8954, 17654, 7143, 6418, 4595, -21650, -20976, 6094, 43650, 41905, 5157, -2904, -3154, -458, 6056, 8492, -3468, -3046, -2090, -3786, 2276, -228, -377, -10173, 3670, 12633, 7360, -544, -4723, 11720, 17283, 17855, 14140, 24269, 21156, 9130, -16495, 3193, 19297, 22897, 13529, 9457, 7481, -1871, -2065, -3691, -10114, -11588, -9817, -2491, -1151, -6518, 11282, 20940, 6258, -10642, 1187, 6999, -10599, -21678, -2256, 1043, -6247, -8494, -1086, 2189, -5216, -16630, -37569]
19912c7569m023O030J5270O372J3123rp100J457M285j2261j0626J7184l60O975
19898a252J4380j701K389L795L301p670J199k525k90p163m986L548p269L773J3527
19883A3056P113q153j1326m933L442M259P003M463N985j2345j8591j4421M597
19870a9851j713r09j515J9296K6203L69k239J7752m154j3469j0040J529j288q323
19856A648k3437O990K4165J5884L846p659n002J81r398q667k52r029k136P877
19842d989L509R035k807j4549q990l095K2701N656j8733j807n114J8085l42q252
19828i692J2466J0373j8401k9426J3445L2776K562o446k2152j3361j4540l199
19816d5595K8990K0280J2588L536j1092k101r31l317P290j4864j3057J1913K8531
$$ y = [-37569, -41592, -35562, -20292, -13920, -797, -806, -7906, -6449, -2164, -14425, -25051, -7867, -8227, -1252, 13128, 11427, 13816, 17611, 20912, 13242, 14441, 11916, 11626, 4463, -523, 3025, -4244, -471, 13056, 20169, 12016, 690, -4243, -801, 3458, 10461, 14924, 20909, 8564, -10027, -24448, -19851, -21564, -22473, -23988, -4692, 21511, 21880, 19641, 37393, 33239, 19770, 9730, 11259, 9971, 1648, -21789, -14799, 9366, 25250, 29096, 21437, 16435, 16616, 7218, -1449, -1701, -10730, -12866, -4989, -1480, 7555, 4748, -9801, -18791, -21886, 815, 6471, -12262, -14069, -19183, -1098, -1440, -9692, 2774, 13147, -5254, -34680, -21235, 11541, 14103, 7657, -14495, -27856, -42396, -45595, -16605, 3675, 16263, 19799, 8707, 6606, 5675, 2358, 9648, -5216, -18273, -6360, 22171]
19803B2171p107m402P572j6394L027R863R848N667p544j1027K778n346N262j6218
19789a850Q352M173n931J781P605J008p774n817P201j1721j1553n928J7970P607
19775E123l41j581L483J1397J0093Q763m075q238j3468j7339l563L617k924j527
19761a0580M163j915J8167P100J2945J3429j6819j5310R021K254k0147m428P803
19748E683Q889j8481q328L448L816p787K862J0441j430q276q183K277J143q11
19734a4737J067L598O609P395j591K984J4410J0513n130n398p038j7206r799J0808
19720c515k227L905N754R251j4154r372K323j472J0611o949j419M455P895n441
19706c55Q463j1580o801J2438J822j0045n130p872J1232j81L287J4621L43J7796
$$ y = [22171, 15064, 10662, 18234, 1840, 4867, 14730, 24578, 30245, 22701, 11674, 14452, 9106, 14368, -1850, 6502, 10675, 4744, 6525, 14130, 15138, 7364, 1547, 8748, -2973, -14526, -20454, -2484, 5123, 4782, 3201, 6684, 18081, 28174, 36937, 32862, 24624, 11156, -6183, -9746, -6129, -9053, -10580, -6417, -8332, 9835, 16935, 29880, 43309, 26490, 11180, 20201, 22455, 2308, -2120, 5683, 14572, -3909, -12237, -8789, -4973, -12760, -9898, 543, -887, -9163, -17346, -15069, -13926, -14737, -13670, -10072, -3463, 3932, 2341, 5325, 19735, 30248, 25118, 19720, 12682, -4524, -14323, -3515, -5742, -1837, 3917, 13168, -986, -10358, -8035, -9507, 1104, -5845, -7264, -2809, 5086, -355, 8108, -3472, -10273, 2165, 3987, -6058, -11188, -19060, -7828, -8009, -4722, 9899, 10242, 28038]
19692B8038n611j7559j2315r93L330J371m558K116k391K095p751J3597J1555o621
19678D303j4739m841k707J51J1230K4512j191N724n672P576l351j0605P995N323
19664B3708j495j2044j1522K779J2814L534k0975j3693k2324K030O442K1018P740
19651a988j2246n933K295J5181L682j4012P965R764p837j913J3134N290j014j3268
19637i00j4836j706K0388J9123J2465P553l2018r759J1557N937p364q559K4807
19624B6688R119j753j256j2508m688J2470J541k4427j3062l788K879K486j861
19611h160J1108J5202J1912O828j5931j1102m116J755M480R506J5782l261k4485
19598I518r93j2119P158l923J6607M958n381j9007J0190J8843J790j9379k253
$$ y = [28038, 22427, 4868, -7447, -8440, -5110, -3739, -8297, -6181, -8572, -6477, -14228, -631, 10924, 4303, -10436, -15277, -17984, -17833, -6603, 17909, 16718, 22442, 16770, 24346, 20995, 10390, 18385, 23708, 22213, 10169, -1353, 1426, 14240, 17774, -3201, -16894, -39218, -37188, -30746, -9728, -1988, -14234, -20167, -17872, -2691, 991, -13021, -5056, 4708, -3129, -5042, 8092, 13382, 12368, -900, -15736, -17442, 2946, 22069, 34534, 42087, 10069, 310, 11867, 17804, 10440, 1881, 26688, 35807, 34054, 32798, 20290, 15602, 28072, 29613, 5186, -7876, -11664, -8785, -6299, -8160, 2948, 18150, 30062, 36890, 20959, 9857, 5741, 7496, 11976, 21482, 37264, 34003, 9518, 8525, -3594, 3564, -359, 16248, 21206, 15825, -3182, 7008, 25851, 27641, 8262, 6009]
19585F009J108p767R876R630j046n287k3615r109N218J6897O872O525N145q620
19571A1836M664n99j7853q279J953N051R550J8841N542l744n673j8436L227o781
19557g01k0502P165J9730R965j9059j1517j1946l234o778N778K5153K5357J9144
19544C8555P686l755r154k1896r19K032J1024j8504j5815L738K232K0984Q416
19531B4624o025j623K0067j4518j2421j8580k5533R154J5789j0772j0118O40K5574
19518c742K0474k2855j9453R24m272P799o123q196K5532J7067l262o377J47p940
19504a0277o908l583k150j2072J7476J426j716K265Q178K3908J1818l663J240
19491B5942j5450n737N310j1226Q37n941n403J4146J3749p611L599J1317J0221
$$ y = [6009, 7117, -650, 9226, 18856, 17810, 12523, -11092, -20201, -14983, 1914, 8786, 15311, 20456, 11836, 16500, 15901, -1952, -10231, -8278, -3227, 6323, 25164, 30706, 26962, 21289, 2853, 6080, -701, -21203, -14038, 5692, 15657, -3402, -14919, -26865, -30099, -36877, -31099, -5946, 19411, 38555, 46241, 42486, 33332, 11436, 10517, 12549, 23573, 5069, -10746, -7008, -4776, 16208, 24624, 18599, 16976, 37043, 22525, 10104, -8476, -34009, -24855, -9066, -19838, -29956, -29316, -3742, 16732, -6123, -25576, -24652, -28924, -21125, -27248, -35444, -9912, 7155, 3893, -2484, -2337, -10277, -17185, -20768, -22918, -34990, -17514, -16088, -17804, -15539, -7361, 16547, 28365, 24702, 25942, 10492, 4755, 10065, -1161, -324, -6265, -11668, 2478, 16227, 8616, 12215, 23532, 33753]
19478C3753j1400j419j4830j0660j4624K144K1242J3311L981L478j2604K197q176
19465F393J09j6480O664J2703J2734j0734J642l80r355K2751M1913J491M415R537
19451H3403k6759l221j2041j3972q983q400J458l281J8576J7620k0415j4456j2225
19438b696J4629J741j2668j6508Q058J3333N655O907K696l859j7609n566P009
19425A122L15J168O507j1891l031J0378j6647m905J3478J6775L964j3041J1562
19412A5754K8373j5639o690o049q669J3141R745j723J22j9387J401P210M624j166
19398B1047Q150J6035N959P609r780k0031j3897n048p228j343J082q83K416R515
19384A3603M586j0277L866R321q262r020r085N862K6067N409k565j6108n308r751
$$ y = [33753, 22353, 20934, 6104, -4556, -19180, -17036, 4206, 17517, 21498, 24976, 12372, 14569, 6393, 6502, -9978, -3314, 9389, 22123, 11389, 13031, 12651, 3296, 26047, 67960, 69451, 73866, 83403, 56644, 53423, 41382, 27410, 18427, 10027, 11485, 8204, 26780, 44400, 23985, 9529, -2696, 11933, 13674, 1006, -15502, -7444, 5889, 11544, 18451, 21147, 17288, -321, -5887, 1122, 1437, 2605, 9112, -2779, -5810, 4568, -12079, -16984, -3506, 13269, 17233, 4192, 15754, 44127, 28488, 21798, 15749, 7080, 20221, 29966, 28243, 28365, 8978, 10379, 17589, 22213, 21047, 29197, 45232, 51191, 58800, 49020, 28989, 15092, 10044, 2816, 1473, 2555, 1672, 4088, 13603, 18189, 7912, 11778, 21099, 12837, 3817, -5268, 594, 26661, 32070, 29505, 13397, 8089, -1662]
19370a662J6933J101K76L242k902P618R242j7844j6425R378P260j6339q146J999
19356f269r966J8404q470k3387J1848J6203p7p706p780l29O282k897j507L828
19342a1823J3461P763o040j097J593M076l875m749j953K258J1796N95q848j29
19328C028N744Q916N414K595L327Q291q210l3350K352l756J5304J1989J0491q128
19314B4007j0865R13N38Q33J679o870l699l65o827j5543R636N491J779j595j907
19299b795j1828r708k722J3183O868R114R644P117N067J405J940m438q127k3174
19285h454j0701N289R724j484l144P262j6177N115P551l881n045J0796J672J2763
19271A1286K5068q830j6214r842j0230R883J1604j3899j4616M120K308J1844J8707
$$ y = [-1662, 15271, 16372, 16648, 19890, 16988, 24606, 33848, 16004, -421, 8957, 16217, -122, -8268, -6269, -16235, 2169, -6301, -29688, -17840, -1637, -1714, -9420, -17200, -17529, -11247, -14144, -15651, -11823, 1638, 9401, 3361, 2264, 3857, 7933, 4058, -691, -2644, -386, 11410, 12005, 3157, 3028, 8772, 17688, 23102, 25697, 29024, 37315, 29105, -4245, -1893, -5649, 9655, 21644, 32135, 24007, 13142, 14055, 14593, 15426, 17105, 10235, 6536, 6171, -656, -16199, -6563, -1072, 707, -888, -2795, -14623, -24331, -27053, -13870, -7002, 2112, 11756, 18873, 23940, 25345, 27285, 22847, 14720, -8454, -19155, -13866, -4142, -5626, -8770, -1508, -17685, -12570, -5019, -8900, -13945, -3149, -1477, 11286, 36354, 27524, 11310, 1468, -8762, 1121, 12725, -1174, -15790, -11670, -9362, 2482, 21189]
19258B1189K298j9784k1370R721n373j1227J420J4853J1580O139k2866k649J3986
19245b083K307M671Q464M576l680j1212o793K0761J0346L224L475J3820P109j8240
19231C6745r342L108q688k6839O56K0995q885r034l516J07K23K1979J0899K119
19217C0527P673r817j0060J3521q71M494m122Q314K089k2061j7733q1J9246J2073
19203C3192o428R723n263j1974p893j741J5880r210N40P671P497l304j1818k3922
19189g050L21K6439J5804k399n336O185M767j4739o545k165k108n029m458p48
19175B939J3124Q511k748P259j117n081J7850L545k2858p059O158J6953K358j5919
19161B3915k6968o631K601K5967R446n806P158j1746j958J72R859N944J4891j7414
$$ y = [21189, 23487, 3703, -17667, -7946, -13319, -24546, -23126, -8273, 3307, 9446, -13420, -16069, -2083, 224, 4895, 13359, 17935, 14255, 3043, -3750, 17011, 27357, 30581, 34056, 47876, 54985, 36745, 27403, 30511, 21823, -5016, -4360, 16635, 7750, -1284, -4800, -4693, -4470, 17509, 28408, 30527, 38200, 28383, 18323, 31844, 30973, 35467, 31345, 39659, 41748, 19687, 1954, 1873, 21119, 33192, 26764, 36487, 31224, 19250, 11357, 9616, 25496, 16286, 16826, 24497, 31994, 28690, 16872, -7050, -6729, 19710, 35514, 33115, 27779, 33964, 38731, 23992, 17447, 15282, 13174, 8145, 3687, 2939, 16063, 24574, 21826, 29085, 27968, 22887, 40737, 44282, 21424, 14365, 20523, 37476, 39834, 23915, -3053, -9684, -7083, 18884, 28330, 22524, 29682, 17936, 15978, 16150, 26009, 31953, 46844, 29430]
19147B9430j3854j1052J5290J940k4985N248L0482J317o962m4j6770r65o164q683
19133e772J0234O542p401k355J2690k84j2417L607J063K820K297J5935O459j5676
19119A7742j2884L336J3186P785p668N265M873j0150O282J2660R441O784j2703
19106D3949j8200O613K0985k242j1892j7881j8254q684N777N981J469oL989N083
19092A6687J1304M878j9516j0936L824P244J368n211R699O959q001o830j1278
19079A91n636N276k690j333j0612J4280K3837K538j644L519k135p065P263k593
19065B3196o368K732J3150j1815j1789n026p225p230Q598Q907L847R208J4486
19052C4671J3738j4417j9463k470r847R836N085J1677j0475j8165N003J0757J2457
$$ y = [29430, 15576, 4524, 19814, 21754, -3231, 2017, 32499, 33816, 26854, 26810, 10040, 9075, 2911, -5772, 4462, 11004, 3603, 1248, 13938, 13654, 1237, 4844, 5907, 8727, 11024, 26959, 33418, 17742, 4858, 8194, 21380, 29165, 21497, 26762, 31635, 21485, 27767, 40427, 49868, 56652, 43949, 25749, 32362, 53347, 51105, 39213, 21332, 3078, -5606, 171, 6152, 7621, 7615, 11604, 16687, 27991, 32869, 13353, 2417, 6241, 13485, 14853, 9642, 19341, 26300, 18299, 11469, 191, -5445, -169, -2859, -4192, -14804, -524, 23313, 25851, 24207, 27726, 25591, 18526, 25789, 23196, 16828, 19560, 32710, 20895, 9106, 4080, -3145, -10375, -1777, 7130, 10977, 20185, 34671, 48409, 33992, 14529, 12059, 2212, 12048, 17133, 28810, 18335, 170, 5173, 15930, 28387]
19039B8387J3059J3670J323j3936j9603k130k623p916L986P165K739M598j1455
19026A7264j3864p518J4937N028j069N619P947J7171o619o847j193j0543n149
19013A5164m072l143k3058r140P827J4229P837p65P260N456J1847j6906k2674
19000a0138R639R158Q831J0518j2678j0123j088K3264L5352o338j6014j6036L914
18987B8261N543q628o505P410J069J2791o348j4007K984N286j3708j1053J3939
18974A7034J027j0984j2855P536K4926Q560j2560r35J5224m65j3162j1460m534
18961G352Q415N995P523J0013M863j2179j1376K916P620K3216l670j4718j0050
18948B5920r293Q266K589r574j142P12j2268P358K6360N438k588r744j1179n999
$$ y = [28387, 41446, 55116, 56439, 42503, 22900, 20770, 18147, 10231, 14217, 21382, 24121, 28719, 17264, 3400, -4118, 10819, 15847, 14778, 20397, 28344, 45515, 38896, 32049, 30856, 20313, 15164, 11092, 7949, -15109, -24249, -16422, -2193, 5644, 4879, 12139, 17595, 29442, 12536, -10138, -499, 8659, 17490, 28008, 15330, 5207, 4119, 27383, 62735, 56397, 40383, 24347, 28261, 33804, 25176, 18671, 26081, 27150, 39941, 33593, 19586, 22570, 27856, 14148, 3095, 17034, 18061, 7077, -5778, 1758, 26684, 35244, 22684, 21749, 36973, 36508, 23346, 11886, 7352, 15767, 21762, 29285, 39298, 44161, 31982, 20606, 23522, 31142, 54358, 50688, 35970, 25920, 16627, 24893, 27482, 17908, 16766, 17478, 5210, 12568, 38928, 44366, 41778, 32034, 20855, 14856]
18934A4856Q357r314J162J79K769l110J670p561J0574l508j681J1646o9m981l705
18919A7284J5202p086k818L052j986j0281K247j5352L156K9878m206j7681O424
18906A7833J3089n623j778J8714J3389J6041L801q165j8025j6150J9847O237j2083
18893D7127r850J3964m74j3865o205J1770Q859M578j2138l166r143p661O442K1149
18879E1387o756j2003Q980r017m295o936j487k137m856k564J927K4611K722j3199
18865B6377N268N924j0891j7530Q812K2889K0385L819q883j7753R622K427j9800
18852C0666R379N666j0094n413p443J3736J2808L03j2138l669N579r477j8419
18839A1484k702j0307j0728M855K5713J4732J4598N763j636q108j0199j1596K446
$$ y = [14856, 23213, 13899, 15061, 15240, 18009, 14899, 16569, 9008, 19582, 16074, 14393, 26039, 25970, 20989, 17284, 32486, 25400, 22582, 25634, 23648, 13367, 15614, 262, 3418, 33296, 29090, 11409, 17833, 30922, 25299, 23521, 42235, 55624, 71665, 75466, 67301, 49276, 33126, 52973, 59210, 47127, 37277, 51241, 50767, 36902, 30697, 42467, 51326, 55904, 43766, 40600, 31457, 23796, 30238, 51387, 44631, 32628, 41608, 32591, 28296, 21360, 19873, 17736, 12880, 10316, 12243, 36854, 39576, 26377, 31645, 37569, 26678, 9148, 17960, 40849, 61234, 65053, 56170, 38417, 48039, 50466, 30666, 40045, 45711, 35617, 30204, 22761, 36497, 49305, 49608, 37470, 33801, 39380, 29903, 11484, 8782, -1525, -12253, -7398, 18315, 33047, 47645, 53408, 51772, 43664, 33465, 21869, 24315]
18826B4315r050J6445o330n171L58n45J0726o25O001k272j3787q407l035K8355
18812C6978n262k624j2642O910m656j6662O780K877N523K3274N059j5948m052
18799B5555j2565j1762J2377L409R864N320J3450L489r57J3620q129k6198o01
18786B6872m42J613R862K0323L269r036l832M012K305N706j6319J0123J3590n268
18772F2778R252K4368K1325M3122L3842L378k8535k9184j3093o014j837o174p205
18759A06023L096j1245L630j7031k0912j6793r125N010K336J7066l406M57J2910
18746G2016R590j907q714j2190j539K312J5907k457j0879R146p13p895q489J149
18732E5337r03j9441n618N172N851j5653k257J8078M255P537j853L504J2222j9873
$$ y = [24315, 15265, 31710, 25380, 20209, 20567, 20022, 30748, 30123, 36124, 33852, 20065, 11658, 8623, 36978, 31716, 29092, 16450, 23360, 18704, 2042, 8822, 11699, 17222, 40496, 45555, 29607, 25555, 12990, 1228, 13605, 17014, 26878, 32198, 45648, 49137, 48180, 61800, 53671, 27473, 26872, 26430, 28043, 37905, 58228, 61497, 52461, 48629, 52641, 54946, 60652, 44333, 54456, 68046, 62778, 72030, 96398, 117723, 160845, 194687, 198065, 169530, 140346, 127253, 121239, 119402, 113228, 106023, 109119, 97874, 101504, 84473, 63561, 46768, 37643, 42653, 44989, 62055, 58649, 59106, 72016, 81606, 79699, 70985, 58795, 57256, 59568, 75475, 73018, 62139, 71285, 70572, 62677, 54188, 55337, 54434, 34993, 29375, 34547, 40398, 24745, 22488, 40566, 44821, 52358, 50505, 54009, 66231, 46358]
18718D6358j0754o106J288R867M221J3309J067j9821q238J3143n808q32J4057
18705E1751J1595J3687J928j1583J2057J7501P277j6902j236J9738J8910J4766
18693A39489j0965k0465j6049M809J1923J3442K2616q586l5563j373J1745L525
18681A14548j3080p861Q986M76j1504p592p781n200L470m432m189J0184m698Q30
18667G2157j3409J1660J2516N081o940j082m631O712j3276R599J8303J1730j8189
18654I0231j1517J5604K5113J5574J3690k655l610r06K6112J0215J9857M0331
18642B38039N8960P4613Q2439Q4135Q3909O6110M1064r155n8406r2887q3241o6794
18630D18786l7711l3469j9270J6653L6259N4408J00645J17164R1188N1168J8018
$$ y = [46358, 35604, 29498, 30786, 40653, 44874, 58183, 59250, 39429, 31191, 44334, 38526, 37694, 51751, 63346, 77033, 78961, 67378, 79435, 96936, 104213, 87311, 86075, 105813, 124723, 139489, 128524, 108059, 92010, 96819, 108742, 122184, 144800, 136214, 100651, 99278, 111023, 114548, 101468, 93607, 102593, 103069, 91565, 83973, 76192, 70992, 74462, 70030, 65841, 76025, 71327, 72157, 58748, 70408, 82924, 88005, 81065, 79983, 75352, 82064, 68788, 78387, 96690, 108420, 90231, 78714, 94318, 119431, 135005, 148695, 146040, 142430, 141524, 167636, 177851, 197708, 238039, 296999, 371612, 454051, 538186, 622095, 688205, 729269, 720114, 661708, 568821, 485580, 418786, 381075, 347606, 328336, 344989, 381248, 435656, 536301, 653465, 744653, 795821, 813839]
18619H13839j5981n6087m0343j8500k2824l9777o5920q3042q5766n8263n1605
18608B75731k0547j4217k6252k0216l926J1826P008K2221L8272K5203J9415L6363
18596C50881L4060K0431k0621k6641k8968j0502L718p995j6347J7924M1410M1880
18584C99230O6185J14083J17735R6647M6507J4399k9984o4094l9356n01J6289
18573G37140L0965J9540j4738j7753n824J1376J1964k12l9868r5789r5466q2773
18561D58562n8677l1364k0294j2126r536l43j6179r473l0029l4000o668l660o824
18548B19389r901j4318L28j2701j9038J9036Q034p696q155j3348j6106J6381j0842
18535A51063m139J334M30J4322m41k25p478j2290k6319M186R66P071j802q147
$$ y = [813839, 797858, 741771, 701428, 682928, 660104, 620327, 554407, 471365, 385599, 327336, 275731, 255184, 240967, 214715, 194499, 190573, 202399, 209407, 231628, 269900, 295103, 314518, 350881, 384941, 405372, 384751, 358110, 329142, 318640, 322358, 314363, 298016, 315940, 357350, 399230, 465415, 579498, 697233, 793880, 840387, 854786, 824802, 760708, 721352, 720851, 737140, 768105, 787645, 772907, 755154, 749330, 760706, 772670, 772458, 732590, 636801, 541335, 458562, 399885, 368521, 348227, 336101, 326565, 326222, 310043, 300570, 270541, 236541, 229873, 226213, 219389, 209488, 195170, 195498, 182797, 163759, 182795, 190829, 183133, 174978, 161630, 145524, 161905, 151063, 146924, 148258, 148688, 163010, 162569, 162344, 154866, 142576, 116257, 120443, 121409, 128480, 126678, 118531]
18521A18531Q11O15L81N114J3370m210mo87j1218l747J0012n684K6946K1668P668
18506A79566q012N822Q09J549j5289m155j7714k676o357J0514P911j451j2258
18493A38259O113o63J538j1382j395k485J4626k0548n069R959k196j4021q477
18480A04259R009j1263j0317K586J404p979K1097J9628l451p971J8466O686p56
18467A41398o123n205n144l42m235M956J6716l476K031K0359Q901K3365J2157
18454B05358j2136q352p301p815l976O766k267J6420M556o377J950J2737O644
18441B06207J321J857O243k598L09J6637K4749L4792Q862J3390O651J3609L3582
18428C65611L7037K8100M7302N8822M6285K0376J8781J1436J8583j2459j4630
$$ y = [118531, 119342, 119957, 120338, 125452, 138822, 134612, 134608, 133921, 122703, 118956, 128968, 123284, 150230, 171898, 179566, 171554, 177376, 178185, 179734, 164445, 160290, 142576, 139900, 133543, 144057, 151968, 150517, 138259, 144372, 143709, 145247, 133865, 132470, 129985, 144611, 124063, 118994, 128953, 126757, 112736, 104259, 113268, 102005, 91688, 94274, 95678, 87699, 108796, 128424, 124973, 117002, 135468, 142154, 141398, 135275, 130070, 124926, 124584, 120349, 125305, 142021, 138545, 140576, 160935, 169836, 193201, 205358, 193222, 184870, 177569, 169754, 165778, 172544, 170277, 186697, 191253, 184876, 186826, 199563, 206207, 207528, 209385, 215628, 213030, 213339, 229976, 254725, 289517, 298379, 311769, 318420, 332029, 365611, 402648, 430748, 478050, 536872, 583157, 603533, 622314, 633750, 652333, 639874, 625244]
18417F25244j2640N472K0671L0676J1598J2722K1479J5491J1308k6895o4717n4555
18405E95854l9551l9722l2554j0685k0531K93p549R830O11j4420j6698l2066k3225
18392C69587k2002q696j331p590j2491J1617J2593r366n598L2427K9915L1105
18380D20170K4774J9156N6491N7147M9986M5522K3774M5895P4556Q5912O4229
18369I67612N1770N4321L4254J0926j7299j1292n1362p9012p4727m8616k6067
18358H10508p465J1966K3141L2572N1460L0549k6216m8513m1979m9000o2204o6262
18346F58557o9212q6084p8413l9286j7957j3698m88n683L254J3741J736j4237
18334C52230m56K1039o137j9648K534J2956R811J5385J9169o112j8934l783L308
$$ y = [625244, 612604, 618076, 638747, 669423, 681021, 693743, 715222, 730713, 742021, 715126, 650409, 595854, 556303, 516581, 484027, 473342, 452811, 453104, 445555, 455385, 455996, 441576, 424878, 392812, 369587, 347585, 338889, 337558, 329968, 317477, 329094, 341687, 332321, 326723, 359150, 389065, 420170, 444944, 464100, 520591, 577738, 627724, 673246, 697020, 742915, 817471, 903383, 967612, 1019382, 1073703, 1107957, 1118883, 1101584, 1090292, 1038930, 959918, 885191, 836575, 810508, 803043, 815009, 838150, 870722, 922182, 952731, 926515, 878002, 836023, 787023, 724819, 658557, 589345, 503261, 424848, 385562, 367605, 353907, 353419, 347736, 350990, 364731, 366467, 352230, 351774, 372813, 366676, 347028, 349562, 362518, 372329, 387714, 406883, 400771, 381837, 378054, 381362]
18321C81362J1627R302J2651R119K2465M3562M5243K5744J5817J8017L1k2570
18309E72370k4829k1222k0688k2090l3238j314K4810P611j38q200k1514k0326
18297D31232j8976j2481K215P338j0039m657J880L0420O885k8819j0131k4044
18285C70823j7473j6459j8834q264J182l018J6848L4587K8218K7302L516j8053
18273D00375J1090J5987j8768r599M943J7318J4748K7235L8580M7105L3483K6897
18261F09394K1927K0669K4642J8392P039q99J2687K8173M2538M4545N8844R9146
18249I87097J32288R4595Q2724J29666K01008K64864K31917J07004k8044j11082
18239B092037j01221o242L1191m8899j64388k05872j92218j21891o6572m2019
$$ y = [381362, 392989, 402291, 414942, 424061, 446526, 490088, 535331, 561075, 576892, 594909, 594940, 572370, 547541, 526319, 505631, 483541, 450303, 448989, 473799, 481410, 481272, 473072, 451558, 431232, 412256, 399775, 401990, 409328, 399289, 394632, 396512, 426932, 433817, 404998, 394867, 370823, 353350, 336891, 318057, 309793, 310975, 307957, 324805, 359392, 387610, 414912, 418428, 400375, 411465, 427452, 408684, 399085, 404028, 421346, 436094, 463329, 501909, 549014, 582497, 609394, 631321, 651990, 676632, 695024, 702063, 701164, 713851, 742024, 784562, 829107, 887951, 987097, 1119385, 1213980, 1296704, 1426370, 1627378, 1892242, 2124159, 2231163, 2203119, 2092037, 1990816, 1984574, 2015765, 1966866, 1802478, 1596606, 1404388, 1282497, 1215925, 1173906]
18229A173906j5989M7981J13547J51983J29481Q7093r05o3465j11174j11415q5060
18218A315983m7234n0537m0107l2453r064K7450M1940P6948Q5907J04708J63442
18207A636983K62758K93361K95326K35764M9480r4792j15327m8504M0189J24463
18197B679701J76760K24102K81144L36422M57515P42206J204578J910747K717393
18188A0730568L331096L236754K096391L95712j115773k092111k164047j527248
18180A2891342o66857j51265j2013K32788N59401R48540J153290J165138P78370
18171A6898734J93736l33688j050113j625982j769247j655870j424306j092251
18163H141013p48473m94664l47183l03365k78589k20024j68888j04458k8676L8652
$$ y = [1173906, 1157917, 1205898, 1319445, 1471428, 1600909, 1688002, 1687097, 1623632, 1512458, 1401043, 1315983, 1268749, 1218212, 1178105, 1145652, 1136588, 1164038, 1205978, 1282926, 1368833, 1473541, 1636983, 1899741, 2193102, 2488428, 2724192, 2773672, 2678880, 2563553, 2515049, 2555238, 2679701, 2856461, 3080563, 3361707, 3698129, 4155644, 4897850, 6102428, 8013175, 10730568, 14061664, 17298418, 19394809, 19790521, 18674748, 16582637, 14418590, 12891342, 12224485, 12073220, 12061207, 12293995, 12853396, 13801936, 14955226, 16120364, 16898734, 17092470, 16758782, 15708669, 14082687, 12313440, 10657570, 9233264, 8141013, 7392540, 6897876, 6550693, 6247328, 5968739, 5748715, 5579827, 5475369, 5446693, 5485345]
18153E485345P0342M2098J4966P1148R0945J47472K17866K74854K78839K87199
18143F981074K66829K36694K04521K09825K40650L31849M72628O36692Q67635
18134A0448397J220747J656877K138876K536555K610256K128347J081069j96189
18126B3624935r50840r63559l29022O35469J622588K704229M246911O805556J1123991
18117D8520258J7250326K4353910K9437334K8991125K2407241J0048856j449454
18110A79559596j0345841j7082014k3834220k5222637k1285268j3725070n924759
18103F2139787K32403M209361N254999L239437j511006o393528r351747r666328
18095D8153378p997317n655383l484768j937824j003840o56201o40792n78978
$$ y = [5485345, 5555687, 5597785, 5612751, 5683899, 5774844, 5922316, 6140182, 6415036, 6693875, 6981074, 7247903, 7484597, 7689118, 7898943, 8139593, 8471442, 8944070, 9580762, 10448397, 11669144, 13326021, 15464897, 18001452, 20611708, 22740055, 23821124, 23624935, 22674095, 21710536, 21381514, 22016983, 23639571, 26343800, 30590711, 37396267, 48520258, 65770584, 90124494, 119561828, 148552953, 170960194, 181009050, 179559596, 169213755, 152131741, 128297521, 103074884, 81789616, 68064546, 62139787, 62372190, 66581551, 71836550, 75075987, 73564981, 67171453, 57819706, 48153378, 40156061, 34500678, 31015910, 29078086, 28074246, 27418045, 26777253, 26198275]
18087B6198275m31584k36462p1133M8404J98737L69404N74615R92390J864556
18078B9507202L377743N601810Q421687J1217422J2458367J0716310N689214j133495
18070H5856260o106231p512847n140318l91577N900358J3754394K3597185L4682069
18062A44639293M3649173M7071959L9422341K1310576l865843k9517577m5454523
18055B17255399m9107075m1925556l0312204j9456084j1576333o556017l403983
18048E4918147j158402P34661K185939K515579J220293j796427m940656o652822
18040D7026312o393150m790493l027524j836260j294871j268639j443702j589124
18032B5382549j630438j599527j658340j685789j589627j372554j105081q39151
$$ y = [26198275, 25766691, 25530229, 25459096, 25507500, 25706237, 26075641, 26650256, 27642646, 29507202, 32884945, 38486755, 46908442, 58125864, 70584231, 81300541, 86989755, 85856260, 79750029, 72237182, 67096864, 66705287, 72605645, 86360039, 109957224, 144639293, 188288466, 235360425, 274782766, 296093342, 292227499, 262709922, 217255399, 168148324, 126222768, 95910564, 76454480, 64878147, 58322130, 54918147, 53759745, 54494406, 56680345, 59195924, 60416217, 58619790, 53679134, 47026312, 40633162, 35842669, 32815145, 30978885, 29684014, 28415375, 26971673, 25382549, 23752111, 22152584, 20494244, 18808455, 17218828, 15846274, 14741193, 13902042]
18024A3902042o02977m14266l05071l01305l40871l77055m18851m00478l76270
18015A0364898l57637l97582l93147l35030k76876k23296j19036j2912L5984M5455
18005H330821R920n8590q5743j63105k46162k83629l11042k79697k33195j94258
17995F485320j53010r9897p0940o240M3775P0030N5060L2567m6642j27542j69667
17984F012814j81585j40872j10589r2492q8023o2984l4362R449j89p3122j09440
17973E128605r3853m7989J5397P2932J66245K52636K91771L50686M11434M33749
17963F981613L88665L10503J75999N3183o0202j05367r0257l9060O6822K01501
17953G883400L63378M46988M81853M48193L87639L57113L38004L40853L12898
$$ y = [13902042, 13299065, 12884799, 12579728, 12278423, 11937552, 11560497, 11141646, 10741168, 10364898, 10007261, 9609679, 9216532, 8881502, 8604626, 8381330, 8262294, 8249382, 8285366, 8330821, 8340741, 8282151, 8196408, 8033303, 7787141, 7503512, 7192470, 6912773, 6679578, 6485320, 6332310, 6232413, 6161473, 6155233, 6199008, 6269038, 6324098, 6356665, 6310023, 6182481, 6012814, 5831229, 5690357, 5579768, 5487276, 5399253, 5336269, 5301907, 5311356, 5311167, 5238045, 5128605, 5034752, 4986763, 5002160, 5075092, 5241337, 5493973, 5785744, 6136430, 6547864, 6981613, 7370278, 7680781, 7856780, 7909963, 7849761, 7744394, 7654137, 7615077, 7681899, 7883400, 8246778, 8693766, 9175619, 9623812, 10011451, 10368564, 10706568, 11047421, 11360319]
17944A1360319J91826O5550m2813r7242j81677j47018m2108J10999L26743N89230
17934A2133809R99291J533167K241982L067183L773901M161065M029569L830316
17926C5770283L487099K233016M81673k03230J3917O72526K101236M899811R543631
17917E8999962J5650181K2193380K7816339L0406718L0371750K8833748K2039292
17910B36311370Q337697m483859j4029398k2616727k7592778k7740132k4429398
17903A23756775j8834602j2289529o317053k108413k8273Q09945J71688k789987
17895H2370551n889635p324113p676915p859931p447811o287809m692945l297196
17887C1894196k331041j749117j401766j158667q55448n39703k45269M0316M03414
$$ y = [11360319, 11552145, 11617695, 11574882, 11477640, 11295963, 11148945, 11106837, 11217836, 11544579, 12133809, 13133100, 14666267, 16908249, 19975432, 23749333, 27910398, 31939967, 35770283, 39257382, 41490398, 41972071, 41768841, 41782758, 42455284, 44556520, 49456331, 58999962, 74650143, 96843523, 124659862, 155066580, 185438330, 214272078, 236311370, 244649067, 240165208, 226135810, 203519083, 175926305, 148186173, 123756775, 104922173, 92632644, 86315591, 84207178, 84178905, 84988850, 85160538, 82370551, 76480916, 69156803, 61479888, 53619957, 46172146, 39884337, 35191392, 31894196, 29563155, 27814038, 26412272, 25253605, 24398157, 23858454, 23613185, 23653501, 24056915]
17878B4056915R36899J661684K671445L868975M925256N534443N393660N107853
17870E4157130M636250K923537L92696o06035K40213J931562M271581P539608
17862G5486542J0921815J4114688J6476495J4953800R524623N646885J917277
17855A49042125o853429j4317019j6770756j6440319j6041498j4431851j1583779
17848E2603474q043236n055316l094061j888391j177736p68735n02026m93384
17840C1580589j106790j779287k009498j972794j952202j891733j716225j459537
17832A7692523j214037j020180r00791p88004o90127o09139n37756n08857m97692
17823A0925940m57570m50216m65417m23524m19993l40049k81976k41038k24860
$$ y = [24056915, 24993814, 26655498, 29326943, 33195918, 38121174, 43655617, 49049277, 54157130, 58793380, 61716917, 62109613, 61503578, 61743791, 63675353, 67946934, 75486542, 86408357, 100523045, 116999540, 131953340, 141477963, 147124848, 149042125, 142188696, 127871677, 111100921, 94660602, 78619104, 64187253, 52603474, 44560238, 39504922, 36410861, 34522470, 33344734, 32575999, 32073973, 31580589, 30473799, 28694512, 26685014, 24712220, 22760018, 20868285, 19152060, 17692523, 16478486, 15458306, 14557515, 13769511, 13079384, 12470245, 11932489, 11423632, 10925940, 10468370, 10018154, 9552737, 9129213, 8709220, 8369171, 8087195, 7846157, 7621297]
17814G621297j86783j26674p5659o8259l0091k5347p8683j28697j77824k02390
17804F520890j66814j18960o278J20744K63964M29755N75005O93364P35993O46152
17794I693815M18927M5072l67310o87995q49326q84119p82662o37374m75748l14783
17784E158497j97442r3020m4078r951l6489j08360j85916k58377k81827k63554
17774C679483k28214k03606j76035j42251j07674q9528r5437q8827p6496o6993
17764B404422m1582k5121j7041l195j3664q523K2936L9882M6508O7992O0380L8469
17752B571463J6294l6075o4247o7730n7864M033P1339J65455K58435L26622L23391
17741C511116K82394J68923J3920j55894l21438l99529m13456l60146k65622j97945
$$ y = [7621297, 7434514, 7307840, 7232181, 7163922, 7133831, 7108484, 7029801, 6901104, 6723280, 6520890, 6354076, 6235116, 6228838, 6349582, 6613546, 7043301, 7618306, 8311670, 9047663, 9693815, 10112742, 10157814, 9790504, 9102509, 8253183, 7369064, 6586402, 5949028, 5473280, 5158497, 4961055, 4868035, 4823957, 4814006, 4777517, 4669157, 4483241, 4224864, 3943037, 3679483, 3451269, 3247663, 3071628, 2929377, 2821703, 2732175, 2636738, 2547911, 2471415, 2404422, 2362840, 2337719, 2320678, 2317483, 2303819, 2295296, 2318232, 2358114, 2404622, 2472614, 2532994, 2571463, 2587757, 2551682, 2487435, 2419705, 2361841, 2365874, 2437213, 2602668, 2861103, 3187725, 3511116, 3793510, 3962433, 3976353, 3820459, 3499021, 3099492, 2686036, 2325890, 2060268, 1862323]
17731A862323j39152r8629q9172p1129m6974l8379m8043k9334k6055n6739p7258
17720A141459o0404o4433m7661m2593l6303k6482j3972J1549N314p579J6478j01
17708H75272r636j4449m427j0721k6758l7912k7550k4916j5612l5765j2397m5
17696F55084j3485j1096k1382j5521r694L0m620N967j3590k3344r695J3119n32
17683E51241l2293l3271j1685N749J2425P072p057j2858k3328n132n032j2443
17671D33388j9693j4138j5618j2770n109j269n322j940j4504J557K3339O849j7533
17658C57237q203N273K512J0664n519j3452q222j2839j0503l330N214M349l067
17645C20114j8795q583k429R418n063j7406K266P2j0053j2416j7777j242J2389
$$ y = [1862323, 1723171, 1624542, 1535370, 1464241, 1417267, 1378888, 1330845, 1301511, 1275456, 1218717, 1141459, 1081055, 1016622, 968961, 926368, 890065, 863583, 849611, 861160, 866474, 858895, 875373, 875272, 865636, 851187, 846760, 836039, 809281, 771369, 743819, 718903, 703291, 667526, 655129, 655084, 641599, 630503, 609121, 593600, 583906, 583936, 579316, 585283, 571693, 548349, 538654, 551773, 551241, 518948, 485677, 473992, 479741, 492166, 499238, 492181, 479323, 455995, 450863, 445831, 433388, 413695, 399557, 383939, 371169, 366060, 364791, 359469, 357529, 343025, 344582, 367921, 374770, 357237, 349034, 354307, 356819, 367483, 361964, 348512, 340290, 327451, 316948, 313618, 318832, 323181, 320114, 301319, 292736, 290307, 299725, 294662, 277256, 279522, 279594, 269541, 257125, 239348, 238106, 250495]
17632B50495r16l682l458J91K1404M899k3497m209k243p661O02J718J7783m248
17618B47178q137N326P128j942k934J674L101J8942R862q456j2626m005Q835k627
17604B61319J816O421j5221P020L7388K9053L4250K5634J2896N7360P4908P3814
17592F06658P3169M5495j7071m4247n8984j2589J0517M9731P4910L6998L3181
17581G97768J6433Q487K7917J0834k5485m8769q7368r8024q6892p5511l8277n532
17569C95581O270J3824J2070J3918r460k7953n0311m8042k9641k7576k8631o135
17557B13914m572j50k541k453k5422l307M983R662M941L8767M3666N0430L0347
17544C58265K4435K6251Q563N471R056M4026M4517L8888K5457J7900J0662l8228
$$ y = [250495, 249579, 245897, 242439, 242630, 264034, 268933, 245436, 241227, 238984, 231323, 231925, 233643, 251426, 247178, 239041, 244367, 251495, 249553, 246619, 248293, 251394, 270336, 280198, 271742, 259116, 255111, 263946, 261319, 263135, 269556, 254335, 261355, 298743, 327796, 362046, 387680, 400576, 457936, 532844, 606658, 679827, 725322, 708251, 664004, 605020, 592431, 602948, 652679, 727589, 764587, 797768, 814201, 822688, 850605, 861439, 835954, 787185, 699817, 601793, 514901, 439390, 401113, 395581, 401851, 415675, 427745, 441663, 432203, 404250, 353939, 305897, 276256, 248680, 220049, 213914, 209342, 209192, 206651, 204198, 178776, 175469, 180452, 190114, 195055, 233822, 277488, 327918, 358265, 382700, 408951, 417514, 422985, 432041, 476067, 520584, 559472, 584929, 602829, 613491, 575263]
17532E75263m9490m3250l7614m8215m5128j8565O137L2677N1209M8476M7472K4452
17520E43424j7480k4630n4598n7087n1671o7097m9521l9045k5861j9189j2798
17509A24447l199n062j2186j2077j3249n845L43o591P973J4396l437o357j0361
17496F8795K6894J3702R84k413r969j6687r848R863q76k7657r890o339R344J3988
17482E9891O289K845J1512o040l496n220o685r451o983J1263O452O699R8k5402
17468D1772r961m762M265R399J2391J0182M86K2339Q429k1938m775m503l527j2427
17454D7370j0719M778j6321p431K4394K7514Q365o789J3371K7206L9279K1004
17442A72021J4561k7442k2169j6796j7974k552q777m853M070J0353K7901J2143
$$ y = [575263, 525773, 482523, 444909, 396694, 351566, 333001, 339138, 371815, 423024, 471500, 518972, 543424, 525944, 501314, 446716, 389629, 337958, 270861, 221340, 182295, 156434, 137245, 124447, 121248, 116186, 104000, 91923, 78674, 72829, 73172, 66581, 74554, 88950, 85513, 79156, 68795, 95689, 109391, 110375, 107962, 97993, 81306, 71458, 81321, 80445, 52788, 42898, 36559, 45903, 59891, 66180, 69025, 80537, 74497, 71001, 65781, 59096, 49645, 42662, 53925, 60377, 67076, 67174, 41772, 31811, 27049, 31314, 40713, 53104, 63286, 63772, 86111, 94540, 72602, 67827, 63324, 59797, 47370, 36651, 41429, 25108, 17677, 42071, 69585, 77950, 71161, 84532, 111738, 151017, 172021, 186582, 159140, 136971, 120175, 102201, 99649, 90872, 86019, 90089, 100442, 128343, 140486]
17430A40486j5672N468J0103l858j2868J9641L8039J4782K3618N1239N7720O2362
17418C91060N5997N8340M9270L4386J1039J23m480O751K8088M6314L7821J1752
17406G26461J3665J5248J829r270k228m3126o4996p9634o2002m8478n9753p5276
17394C12440l7662j1740n693r880Q370L651j3406J2966k457j5180j3579j7384
17382B10446k4793k9333k3665q329r283n624J2982K4617k289K2093M3676N2498
17370B62996M4455M6719N9519O5605N9161K2359J4869K6210Q756J5763K786l8590
17358E90608o9334m5992n3956n2443k7926j4585K1108M2385L4785M8336L2708
17347E05694L4961K6818k853p136m7799p6709o0964n4860n8725l6817l8492k1171
$$ y = [140486, 124814, 130282, 140385, 136527, 123659, 143300, 181339, 196121, 219739, 270978, 328698, 391060, 447057, 505397, 554667, 589053, 600092, 600215, 595735, 602486, 630574, 676888, 714709, 726461, 740126, 755374, 757203, 747933, 745705, 702579, 637583, 557949, 495947, 447469, 387716, 312440, 274778, 263038, 257345, 247465, 255835, 259486, 246080, 259046, 256589, 241409, 227830, 210446, 185653, 156320, 132655, 124326, 115043, 109419, 122401, 147018, 144729, 166822, 210498, 262996, 307451, 354170, 413689, 479294, 538455, 560814, 575683, 601893, 610649, 626412, 629198, 590608, 521274, 475282, 421326, 368883, 340957, 326372, 347480, 389865, 424650, 472986, 505694, 540655, 567473, 564620, 557484, 509685, 432976, 372012, 317152, 258427, 221610, 183118, 161947]
17335A61947n932k1444l7298n331j3185n75j1790K655J6975l818j661N321q318
17322G7546J061p677Q86j1694l4133j0024j1178m431J329K709J876K4337m778
17309B5829j3065J056J7207J4744o270r807o18K3385J5290n631j3518J73K656
17296E1431M951j6289r938N23q701j0031J32J0391K848K508p929m198J0942J0578
17282C7218k596j4011P443O034j1924m298M07k941o115R529J7979j0261o311n341
17268A4812q229J461J6867o05k0512k0467P989K1995j0713j5228l377o129K7417
17255E281K2439R136n421J0125J2599j4177k7580j8731o179K594J6475J0479o696
17242A0344J8039K2999r190j0342k29J0266j2867r649o157L019M852J3569M088
$$ y = [161947, 156015, 134571, 97273, 91942, 78757, 78182, 66392, 69047, 86022, 82204, 80543, 85864, 77546, 78607, 70930, 71816, 60122, 25989, 15965, 4787, 356, 1685, 4394, 6270, 30607, 25829, 12764, 13820, 31027, 45771, 39501, 29694, 29076, 52461, 67751, 62120, 48602, 48775, 51431, 56382, 40093, 30155, 30678, 21977, 11946, 12078, 22469, 25317, 27825, 19896, 15698, 26640, 37218, 34622, 20611, 28054, 34088, 22164, 17866, 18273, 15332, 9217, 18746, 36725, 26464, 20153, 14812, 6583, 8044, 24911, 24306, 3794, -16673, -8684, 13311, 2598, -12630, -16007, -22136, 5281, 27720, 36856, 31435, 41560, 54159, 39982, 12402, -6329, -12508, -9914, 6561, 17040, 10344, 28383, 51382, 42192, 31850, 31621, 41887, 29020, 19371, 13214, 16233, 21085, 34654, 38742]
17229C8742k960r878j819P857o343j1347p040m545l72p951J6896m777j6563J67
17215i933r301R863P68j2021j7438k288J726Q696J8536R74K565j0776p372L506
17201b2495J5767j998Q307K5374M75l626K0J0177q224l0699n301Q039j1308L616
17187a1876N562M2J355J706N137K0292L289K832j812j0314J912q83j0078j6355
17173i191J676J7594J6503P620k0648K492J458K105J9744q262k0969q35j3201
17160c914j3446o133n74J3805l983Q230n704j5302O571J0716K3961M555k5554
17147f772L570K1322j0703j5944r106N833J424k4557j287J3265j088J1288J0768
17134a987l012q637R156l700j0105O179L334Q164j939J340p501n18o104Q055J0098
$$ y = [38742, 35782, 25904, 24085, 31942, 25599, 14252, 7212, 2667, 2295, -5656, 11240, 6463, -10100, -9933, -19234, -9371, -8603, -20624, -38062, -40350, -38624, -29928, -11392, -10418, -7853, -18629, -26001, -22495, -6728, -8726, -419, 24955, 25430, 21804, 21824, 32001, 23777, -6922, -12223, -4184, -15492, -11876, -6314, -6272, -4917, -3211, 1926, 22218, 25507, 28339, 26527, 16213, 18125, 17242, 7164, -9191, -7515, 10079, 26582, 34202, 13554, 16046, 17504, 19609, 39353, 31091, 10122, 9287, -3914, -17360, -23493, -24067, -10262, -14245, -6015, -11719, -27021, -20450, -9734, 14227, 18782, -6772, -3202, 18120, 7417, -8527, -17633, -11800, -10376, -34933, -36220, -22955, -24043, -12755, -1987, -4999, -13636, -4480, -8180, -18285, -12106, -8772, -608, -2547, -1207, -8708, -9226, -15330, -7275, 2823]
17119B823j0351r375m845K5590K5774J795j9291j4890M627N816J116n51j3269
17106e031k1989L240L0744l270j3960L509N805J3321J1096p493N858l429N040
17093B3441M378j7760m628j0544K041L841O195K4362k335j5724n294j048J751
17080H676m910l35N010p157l271l247n70j5767R766O899n502j114j0653N949j2734
17065b8960l3376J727K9402J3531J707J6061M211j1164q534m608j1913L578J6094
17052a2244L360l828O992q985J130J5628J0482L252l907k461o913o737J1305k250
17038D824K214j975k534m667r937k612l317n163j0992R450K033P213r5M143J5458
17023D043l88j3504K141N749P025K56k422p487K891k183N022j4619o056J869Q774
$$ y = [2823, -7528, -16903, -21748, 3842, 29616, 31411, 12120, -2770, 1857, 7673, 8789, 8238, -5031, -27020, -23780, 6964, 3694, -10266, -6757, -952, 12369, 23465, 15972, 21830, 18401, 23441, 27819, 10059, 5431, -5113, -3072, 769, 6964, 31326, 28991, 13267, 7973, 6925, 8676, 3766, 3431, 8441, 1284, -1987, -5234, -5804, -21571, -11805, -4906, -10408, -11522, -22175, -16226, -28960, -62336, -60609, -31207, -17676, -15969, 92, 4303, -6861, -15395, -20003, -31916, -28338, -12244, -8884, -12712, -5720, -14705, -13575, 2053, 12535, 15787, 11880, 9419, 2506, -4231, 7074, 4824, 7038, 5063, 2529, -2138, -12075, -14687, -18004, -23167, -34159, -24709, -22676, -15463, -15558, -11415, 4043, 3655, -9849, -7708, -1959, 5066, 5322, 2900, -4587, -1696, -3879, 1143, -13476, -19532, -17663, -8889]
17008h889j1389N239P002q241j8441j898J0526R570J7710K365M655J8421J4196
16995D0826M901j8697j0347j1165q651r280J2597M227N64J17k1672O184j2443
16982b2839K864P662Q454m595o911J494J562p773O11j841m235K705k737O361j364
16967b0582K172O285Q551l36P048Q097n8l331n802j7960o538J3980M195K952j1516
16952a2843m922Q249J3277K716r563K411K964k801r615k748M755l125L188K43
16938g814p339Q66P600J5757O118m602n935N883J767l40p815j7723k4053j548
16924c9178J6533N052l481J5166R443m55m543J537m539R047n020j003l772o885
16910a2098r349M445J941k50k652n412J5230R191N149R612N211j1410j614j0437
$$ y = [-8889, -20278, -15039, -8037, -16278, -34719, -36617, -26091, -16521, 1189, 3554, 8209, 26630, 40826, 45727, 27030, 16683, 5518, -3133, -12413, 184, 4411, 4975, 5092, -16580, -10396, -22839, -19975, -12313, -3859, -8454, -15365, -13871, -12309, -20082, -19471, -21312, -25547, -22842, -25579, -19218, -20582, -18410, -12125, -3574, -3910, 3138, 11235, 11177, 7846, 2044, -15916, -22454, -8474, -4279, -1327, -12843, -17765, -9516, 3761, 6477, -3086, -675, 2289, -512, -10127, -12875, -8120, -11245, -8057, -7814, -15153, -14287, -6687, 9070, 15188, 10586, 4651, 10534, 12301, 11961, 4146, -13577, -37630, -39178, -22645, -17593, -21074, -5908, 3535, 3080, -1463, 74, -4465, 4582, -438, -1441, -5213, -12098, -21447, -17002, -15061, -15311, -17963, -23375, -8145, 1046, 6195, 15807, 21018, 9608, 7994, -2443]
16896b443l697J6970Q596m856m561J2654l858Q987k7458q436K90Q472Q116N99
16882I375m992J241k106J074J1188r655j9526o070m948N320J183p143J269Q244
16868a5546J013j4301r1L237l935N734K5750J2866m798l902J0179J8600j0528
16855B4278j4519q70O219j0087j1669J9551j8p951Q172N871M383n695r406j4781
16841f522J7150J5515j4315r233j2257M809r224J818L34q902J2095J6042j469
16828E841m286l921P97J2144o368q252J3268M634r246j4663J2350j1839j0943
16815b0484O910P435K6744J4141r218k6045j9191N156P213J5301J2651j0464p891
16802B258l059R686m481m42j006M365l148k5851O99l311L819J0640j3872j910
$$ y = [-2443, -6140, 10830, 19426, 14570, 10009, 22663, 18805, 27792, 334, -8102, -7812, 660, 8776, 9375, 4383, 5624, 3518, 4592, 15780, 6125, -13401, -19471, -24419, -19099, -17916, -25059, -23790, -15546, -14533, -28834, -28925, -25688, -29623, -23889, 1861, 14727, 9929, 6027, 16206, 34806, 24278, 9759, 8889, 15108, 5021, -6648, 12903, 12885, 4934, 13106, 18977, 23360, 17665, 8259, -6522, 10628, 26143, 11828, 2595, -9662, -4853, -14077, -12259, -11925, -20827, -8732, 7310, 5841, 1555, -2366, -1569, 10575, 4207, -4045, 9223, 13857, 4611, -10052, 2298, -9541, -20484, -13574, -6139, 20605, 34746, 25528, -517, -19708, -14552, -7339, 7962, 20613, 10149, 2258, -801, 8885, 4404, 3962, 2956, 7321, 4173, -21678, -20979, -24290, -20471, -9831, -23703, -25613]
16788b5613J1436J4658P905j9182M683J2666N51j609K782P124j8717o580p904
16775a7800j5175M809J9683P836J3982K836R7j7154j7037J2386K1040J6054j7702
16762A3855n174q035N325o370J2953Q318r384k2182j3031k169N158L8J2055kj0275
16747a8920K056J3085J1795q499j9699R115J9196J031J235n203J2230r648J368
16734I142J3681j1909j1899j0035k0065n629J7910J5218J6963J980n433L302M363
16721A7589j7064j7438k686j2659L623J189J8276R046M655N839j5448j3587j4846
16708c3511P720J9792r150j2782J5414J2076L6j6582n209P901O764l819J842J977
16694g531L381o730J0651j7n704j954j33j8066l806J1850k985O000J3806k481
$$ y = [-25613, -14177, 481, 8386, -10796, -6113, 6553, 7104, 5495, 8277, 15401, -3316, -9896, -17800, -32975, -28166, -8483, -647, 13335, 16171, 16268, -886, -17923, -5537, 15503, 31557, 13855, 8681, 646, 5971, -399, 12554, 20872, 11488, -10694, -23725, -25894, -20736, -20698, -8643, -8645, -18920, -16864, -3779, 8016, -483, -20182, -11067, 8129, 9160, 10395, 5192, 17422, 7774, 9142, 22823, 10914, -985, -11020, -31085, -36714, -18804, -3586, 13377, 15357, 9924, 13226, 17589, 525, -16913, -19599, -32258, -28635, -27446, -9170, -124, 4531, 10370, -5078, -18665, -33511, -25791, -5999, -15149, -27931, -12517, -441, -405, -16987, -22196, -14295, -7531, -11350, -9508, -7531, -4150, -10880, -229, -246, -5950, -7904, -8037, -26103, -29909, -18059, -21044, -15044, -1238, -3719]
16680c719j7307o431J4252N334j143R499p814j3953Q027J2365K973o185N248O114
16666G260k1612p616L139J5401K7525J0668o349r89o258J0128N878r446j3548
16653A4181p266n255m097J598m905j514r700J6190q215l789P02J3372R589n734
16639E157n545J981J1022R026j1965R736j6766j9249k894K801O781k159q241M887
16625a5428L771m236L683Q08O262L027o377M401M910k806l645o379m410k348K1249
16610B482P326j2230k2056j7279J2892J2524N387o763l55j017J2037N642p878
16597i288r952M108J142j291L959k6789l847J6629R028L085J5465n447j747R47
16583c998l885J4006J578j4161k3880j9757R137K5410K1527j4391j2204P852O720
$$ y = [-3719, -21026, -27457, -13205, -7871, -9014, 485, -7329, -21282, -13255, -890, 2083, -4102, 1146, 7260, -14352, -21968, -18829, -3428, 24097, 34765, 28416, 27427, 21169, 31297, 37175, 27729, 14181, 6915, 1660, -2437, -839, -5744, -7258, -16958, -768, -8983, -12772, -12070, 1302, 10891, 5157, -388, 1593, 12615, 21641, 9676, 19412, 2646, -16603, -19497, -16696, -9915, -12074, -20315, -15428, -11657, -15893, -12210, -11402, -5140, -2113, -8490, -4089, 821, -1985, -5630, -12009, -16419, -18767, 2482, 9808, -2422, -24478, -41757, -28865, -16341, -10954, -17717, -18072, -19089, -7052, -1410, -9288, -19240, -15132, -13990, -15281, -11322, -38111, -41958, -25329, -16301, -13216, 2249, -3198, -4945, -3998, -7883, 6123, 7701, -6460, -30340, -50097, -40960, -15550, 5977, -8414, -20618, -12766, -6046]
16570f046Q740j1138o268R695q148j5048M199N115K7029J4944k7438j5388o299
16557b6051Q896K0587R728R055K190j4867j6084k139k034J3577n044J490k412
16544c108m087o079o852Q737R628j0139P92J0261N402O873N218m539q657j033
16530B417J774n841K807O07K456l546P189j0217l770j9545n917J4221N958M407
16516g000Q814k197j7988J5740j428j0139j523q20R062j2782K992O181m497n000
16502b0585K3P304M275n315J934M511N801N46L833N332N56j0036p216n007j5515
16487b9559L03q292p194n877L947K0744N677Q735J2474M081o770o940j6333l476
16473b8480R806O125J1264J803l388J356q271j862J580n606k2006j4440K363J2561
$$ y = [-6046, 2694, -8444, -14712, -5017, -13165, -28213, -24014, -18899, 8130, 23074, -4364, -19752, -26051, -17155, 3432, 13160, 22215, 24405, 9538, -6546, -8685, -10719, 2858, -2186, -696, -3108, -7195, -13274, -20126, -11389, -1761, -11900, -11108, -847, 4555, 11428, 16646, 12107, 3450, 2417, 4191, -1650, 1157, 1764, 4220, 674, 7863, -2354, -6124, -25669, -31586, -17365, -11407, -7000, 1814, -383, -18371, -2631, -4059, -14198, -15721, -16541, -7479, -20261, -17269, -11088, -15585, -20585, -20562, -13258, -8983, -14298, -12364, -7853, -2052, -1506, 2327, 7659, 8215, -1821, -9037, -14044, -29559, -29256, -37548, -44742, -50619, -46672, -25928, -20251, -11516, 958, 5039, -1731, -8671, -25004, -28480, -18674, -12549, -1285, 518, -2870, -1514, -9785, -11647, -10067, -15673, -37679, -52119, -49756, -37195]
16459c7195J8300k932j5811p594J6422J8144J2482j1030j9024R978J6755J0439
16447H934P987o472r036j8331K687j4736M664J7777P033m794J6639j5657k3566
16434b6871j1602J1476O175j09j6160q579J6191K3969M061m818k237k161k574
16421a3239J5866Q566k2808k4337J4625J2524m433K27p04j4092j784K415K0320
16408f854J3800j5086k7423N240j0361L942K3064J0201K329L747o040J9762j4435
16395A886k5517N018Q55J903n222J7342N835j5687j2372K228Q434R134k620K091
16381f692J8737R665o440m691r441j2805l018J9789K683k493J2777j1138j2589
16368e656P398P00k276M693m150j3376j3392J5155j4937n210R574J3548j2918
$$ y = [-37195, -18895, -21827, -37638, -45232, -28810, -10666, 1816, -9214, -28238, -18260, -1505, 8934, 16921, 10449, 1413, -16918, -14231, -28967, -24303, -6526, 507, -4287, 12352, -3305, -26871, -38473, -26997, -20822, -20931, -37091, -45670, -29479, -5510, -1449, -6267, -8504, -10665, -13239, 2627, 11193, -11615, -35952, -21327, -8803, -13236, -13009, -13713, -27805, -29589, -27174, -6854, 6946, -8140, -35563, -30323, -40684, -36742, -13678, -3477, -1148, 2599, -3441, 16321, 1886, -23631, -18613, -17758, -15855, -21077, -3735, 2100, -13587, -25959, -23731, -15297, -6163, -8783, -6692, 12045, 21710, 15270, 10579, 1138, -11667, -14685, 5104, 7787, 5294, 18071, 6933, -5656, 1742, 2442, 166, 4859, 709, -12667, -26059, -10904, -25841, -31051, -21477, -7929, -20847]
16355b0847J967J0886K957N36m596O598J588k0574j5447j4170J3322J3279q14
16342b5315Q751K776n620m914P438K521K381J2234j7736j7454Q479N638M475o139
16328b2485k799O896k1378k555Q707O452J3013K1935j1618p822N122K918m169
16315g783q073j0365j73O61K141M048J4472p054m865N085r725j5794N912O930
16301b4583K608j096L090j1308J1675r09M768O411n8j2515o192O045J385Q239
16287a2440J1844J0388P66K791L543L16J0364J6045j5993j2642j4395j518p484
16274h415j2537Q135j9311o727J5563J636K249N083p518r336m729Q737J583j116
16260b6703M818R09Q389J0422q64J962k963p634Q895J1169l040K656j614R91j2235
$$ y = [-20847, -18880, -7994, -5037, -4501, -9097, -2499, -911, -21485, -36932, -51102, -37780, -24501, -25315, -16564, -13788, -19408, -24322, -16884, -14363, -11982, 252, -17484, -34938, -26459, -20821, -16346, -22485, -25284, -18388, -39766, -42321, -33614, -27162, -14149, 7786, -3832, -11654, -6532, -3614, -7783, -15856, -26221, -26394, -25733, -23592, -19544, -5072, -12126, -16991, -11906, -21631, -37425, -31513, -24583, -21975, -23071, -19981, -31289, -19614, -20523, -15755, -9344, -9402, -21917, -28109, -22064, -20679, -12440, -596, 9792, 10558, 13349, 16892, 17208, 27572, 43617, 27624, 14982, 587, -931, -8415, -20952, -12817, -32128, -38855, -23292, -21656, -19407, -14324, -21842, -31178, -35907, -27170, -25587, -26703, -21885, -20976, -12587, -2165, -3029, -1067, -4030, -11664, -2769, 8400, 5360, 8016, 6402, 7393, -4842]
16245d842j1889R015J349M910J0849j9042j3153K261o133n688J3153J2478k736
16232i468M704O165L305N872l550j9172M118M365r039N546l93j4640R52o96l433
16217b5364K0469J2072J146J0519j3948l3616Q253J5741j0124J423R132J0113
16205E816n918q198k639j1430q600J7190O768J7149p809k1235l009J6306J3740
16192H131o834q878p709p225p077K244J4176N234p600m078m483J1635J1522Q068
16178G126n166r78J756j8882N407P590j2769j0088j323N965L32J4581n604j6323
16164b8376m572J3180Q139j554L932J6680J3666j0735j1488r124n228j5992K067
16151b9405Q41j1786P870J7995K6565R646r530r41r47q513j0093J003L810J5033
$$ y = [-4842, -16731, -7716, -6367, -1457, 9392, -9650, -22803, -20542, -26675, -32363, -19210, -6732, -9468, -4764, 1401, 4706, 10578, 7028, -12144, -8026, -3661, -12700, -7154, -7547, -22187, -21235, -21931, -25364, -4895, 7177, 8323, 18842, 4894, -28722, -20469, -4728, -14852, -13429, -4297, 5816, -102, -8300, -10939, -22369, -30969, -13779, -7011, 10138, 2329, -18906, -21915, -5609, 8131, 1297, -7581, -15290, -22515, -29592, -27348, -13172, -7938, -15538, -19616, -24099, -12464, -942, 7126, 1960, 982, 2738, -16144, -10737, -3147, -15916, -26004, -27327, -21362, -21030, -6449, -12053, -28376, -32948, -19768, -11629, -13183, -9251, 7429, 21095, 10360, -1128, -10252, -15480, -31472, -29405, -28564, -40350, -32480, -14485, 12080, 21726, 12196, 11255, 10308, 1795, -8298, -7295, -3485, 11548]
16137A1548k342j6634L947j928R313L303r666k5441m49R147k283j575p249j9193
16123d9502O91R100J0809O132N708l290J051o269P09l004O245K7130J2666j5504
16109B672k3210P246n453n319k926J587J0312J2187j2445m532N281R321N487k4177
16095b3969j2726K2537J9233m625q46J0204o378M819j264k940J3692J0433j8802
16082I368k1684o602Q979m325m626N579J3346k32j801J220j5860j3314M489J4098
16068a1365L687l460l49p328q299J1103J9218R6j744k170j2525n045L591l395
16054a7985p519j3869N092J8861J8048J2475j1222k8064j60J600o049P726k48
16041b1314Q225Kn731J4378O429P122O534l840j2591r160p625j0468k2311l49
$$ y = [11548, 9206, -7428, -3481, -5409, 3904, 7207, -2459, -27900, -28349, -19202, -21485, -23060, -30309, -49502, -48811, -39711, -28902, -22770, -17062, -20352, -19301, -25570, -24861, -27865, -21620, 5510, 18176, 2672, -20538, -13292, -18745, -24064, -26990, -25403, -15091, -2904, -15349, -19881, -14600, -5279, 208, -23969, -36695, -14158, 5075, 450, -396, 9808, 3430, 8249, 6985, 4045, 17737, 28170, 9368, -12316, -18918, -9939, -14264, -18890, -13311, 35, -197, -1998, -778, -16638, -29952, -25463, -11365, -7678, -11138, -11487, -18815, -27114, -16011, 3207, 3303, 1559, -611, -13136, -18181, -14590, -17985, -25504, -39373, -34281, -15420, 2628, 15103, 3881, -24183, -24343, -22743, -28792, -21066, -21314, -13089, -13087, -18818, -4440, 1989, 9111, 15645, 11805, -786, -9946, -17571, -28039, -50350, -50699]
16027e0699J7673K3587m211k1530M249J9757K667k189M017j8966l803J0956J4042
16014d450k384n920P534l202J2773M995j5788j7465Q835j1821j994J8962K630
16001g295P392K62n73k4948q123J5294J8583o58R0j5171j39j30K95Q375r069j3516
15985b9331j9578j10o33K1178N781k240k99K233L717Q247m662j6084m738O467
15971c0052R751j2534Q136J8366j844p974k882l177R097N580J7142p77j1378j4366
15957a6912l18K972n644j2238K6979M951j4152k1749j1876J2966n283O52J2619
15944b7033J4643m926n790J6042O749q838j2940K0800K758l1331k034P651l432
15931b7681R636J0454n51k3650K666J2999P909J0899l132j8645j0295J9212l982
$$ y = [-50699, -33026, -9439, -13650, -35180, -30931, -11174, -8507, -10696, -6679, -25645, -29448, -18492, -4450, -6834, -12754, -5220, -8422, 4351, 9346, -6442, -23907, -15072, -26893, -28887, -9925, -7295, 97, 359, -214, -25162, -33285, -17991, 592, -66, 24, -15147, -15286, -15416, -15121, -6746, -15815, -29331, -48909, -49019, -49652, -28474, -22693, -24933, -25232, -22999, -19282, -11035, -15697, -31781, -36519, -30052, -20301, -32835, -24699, -6333, -8177, -16151, -19033, -22210, -13113, -7533, 9609, 8832, -2546, -16912, -17230, -14258, -19902, -32140, -5161, -210, -14362, -36111, -47987, -35021, -40304, -39652, -27033, -12390, -17316, -23106, -7064, -315, -9153, -22093, -1293, 1465, -29866, -31900, -24249, -27681, -18045, -7591, -8142, -31792, -29126, -16127, -8218, 2681, -451, -19096, -29391, -10179, -14161]
15918a4161P49N552j428j0817J78R212n918l901J0084J6304M008j4412j0976M547
15904a0979o288J0018J1745j546o210l462K2009J1972j8118k1199R435P656q033
15891c000k132j3875M815M215j1201J4212L531Q449p922p294r812L347R024J4810
15877G167j7543P653R988o446j1898j12l403m294m070j2111k0599M490J3497N010
15863c2671j1885J7428K823M463j504r150J7335l593q550L184O568P336P005l472
15849d683j219Q708j1541j8850K928L3990J0098N558k0862j3253J375p259l119
15836a8129k0794j350N464J7174K0236m42k298J4429J1658j4728k0635m06Q762
15823a059J2315O052r939k1927k1723p540J2608O763o725J129r935P143K523o336
$$ y = [-14161, -13412, -7860, -9288, -20105, -19927, -10715, -16633, -20534, -10450, 5854, 9862, -4550, -15526, -10979, -17267, -7249, 4496, 2950, -3260, -6722, 15287, 27259, 9141, -12058, -2623, 5033, -3000, -5132, -19007, -14192, -9977, -21178, -6966, -3435, 5014, -2908, -10202, -20014, -16667, -7643, 7167, -10376, -2723, 7265, 819, -11079, -11191, -14594, -18888, -22958, -35069, -55668, -51178, -37681, -32671, -44556, -27128, -24305, -19842, -21346, -30496, -13161, -16754, -25304, -22120, -15552, -8216, -1211, -4683, -5902, 2806, -8735, -27585, -24657, 9333, 19431, 24989, 4127, -9126, -7751, -15010, -18129, -38923, -40273, -34809, -17635, 2601, 2159, -139, 14290, 25948, 11220, -9415, -9821, -1059, 11256, 17308, 7369, -14558, -36281, -43821, -31213, -24450, -31175, -30046, -39981, -32838, -30315, -36651]
15809c6651K0346M648n006o469O713n207O710J0614J7107j4085k2925N081P050
15796a2074J6699J2804j3365j1301q055p673m70p740P072j4004J6677K1302R451
15783I323q955Q026Q827j4156j4939q398j0615j0515K1741K2363J5450n73P945
15770B5524j9936k6511L874J0574O491r16l034J0773M659j046j29m384N428J545
15756A2912o490k3464R16J0574J5236r027j2874P305J1283J4728o651o37n734
15743H077k0342q801j3243R75J0308J1041L076J2064j383k061j2523J2046K590
15730A824p027p822k149l081O11j0263l579M288L912K902m844k108J0530R743
15716g063K715p371R571J431J042P636N162j4613l127Q58O17Q630q313j4926m205
$$ y = [-36651, -16305, -11657, -16663, -23132, -16419, -21626, -14916, -4302, 12805, -1280, -24205, -19124, -12074, 4625, 17429, 4064, -7237, -15292, -22965, -23435, -31175, -24103, -38107, -21430, -128, 9323, 368, 8394, 17221, 3065, -11874, -20272, -30887, -41402, -19661, 2702, 18152, 17579, 25524, 5588, -20923, -17049, -6475, 16, -900, -3934, 6839, 11498, 10452, 10323, 5939, 11367, 12912, 6422, -17042, -16126, -5552, 9684, 657, -12217, -4912, 6371, 21099, 14448, 13811, 8077, -12265, -21066, -34309, -33334, -23026, -11985, -8909, 3155, 1772, -289, -12812, -766, 1824, -5203, -13025, -15174, -18255, -17644, -27907, -31486, -27198, -23286, -20384, -25228, -27336, -16806, -7063, -4348, -11719, -2148, -717, 325, 7961, 13123, -1490, -4617, -3759, -3142, 5488, -2825, -17751, -21956]
15701b1956N035K2689P653L24k2748k7533o460K4766K2477P64j652L768m631j5740
15687a3244J1220J5413o489q776j3105o262o157P842J530J2182L227p56M226K055
15673B906J399m54N723P173j2390j4433l214L750K645q868M564o558p422K12m044
15658b9011J1323k391K603m047N159K393k3849q656N179J5310J6785J5533n000
15645A331L820k559j2377k0253Q481p999J3272N924k110j5963O175Q945J7358
15632D045j2690j372N318J4843j6763o994J5270O838k0563o570P627L982m186
15619a1215j4476q314J693J0867l523j2473J7241L934k056j365M481J0921j603
15606e888Q51J4884J8853o319j4267M57j002J3324m796j4030l679k340j0559q017
$$ y = [-21956, -16921, 5768, 13421, 13745, -9003, -36536, -42996, -18230, 4247, 5011, 3359, 7127, 2496, -13244, -2024, 13389, 6900, -1876, -14981, -21243, -27400, -19558, -18028, -5846, -2619, -3375, 851, 2906, 4305, 3851, 9574, 16747, 4357, -10076, -13290, -9540, -6895, -15763, -11199, -17757, -25179, -24967, -29011, -17688, -20079, -17476, -21523, -16364, -13971, -37820, -46476, -41297, -25987, -9202, 6331, 1331, 5151, 2592, -9785, -30038, -21557, -29556, -16284, -10360, -12470, -28433, -22258, -13313, 4045, -8645, -10017, -4699, 10144, -6619, -13613, 1657, 8495, -12068, -18638, -11011, -7029, -11215, -25691, -34005, -32312, -21445, -24968, -37441, -20200, -16266, -18322, -19687, -15206, -4285, -5888, -5037, 9847, 28700, 22381, 8114, 8571, 7569, 20893, 16097, 2067, -1612, -3952, -14511, -22528]
15592b2528L471n597l978M601m070j372Q655J1370J9746l307k787r728Q824j9930
15578a6630J520j4730n318j1023N477J5588l834J1376J7776k059n134J2989l406
15565B592O196j8732R315R89j5045J503P051l927r057M968M013o68M062p141P192
15550f689j615j1441q348K3099j1688l072K3549j415k9930J1268N632n267J2727
15537c190K8264k221k6282r454R770o288N296Q168M927r065j6423j4882o211O012
15523c1579j6970J8505R077j2622J0083J3809j1139q184J0012K0825j4181j4834
15511b7198j0544l100J7719Q091j00q547o372K3j0305L162K2301K4070n251j3411
15497i462M770p910q672J560p603p715N431k239R293P441K549j7674j0693J1988
$$ y = [-22528, -19057, -24654, -28632, -24031, -28101, -29473, -20818, -9448, 10298, 6991, 4204, -5524, 3300, -16630, -15110, -29840, -35158, -46181, -40704, -25116, -28950, -17574, 202, -1857, -6991, 5998, 2592, 8788, -9944, -629, 360, -14685, -13182, -6131, -10058, -19115, -14147, -10134, -10802, -6740, -13881, -6689, -8304, -19745, -28093, -4994, -16682, -19754, 3795, 2380, -27550, -16282, -10650, -15917, -3190, 25074, 22853, -3429, -12883, -3113, -9401, -4105, 4063, 8990, -75, -16498, -31380, -37591, -31579, -48549, -30044, -20967, -33589, -23506, -9697, -20836, -29020, -19008, 1817, -12364, -27198, -37742, -40842, -23123, -15032, -15132, -23679, -30051, -30028, -40333, -37171, -14870, 9200, 3949, -9462, -4692, -12602, -21274, -19714, -27317, -35032, -29601, -31840, -22547, -15106, -12557, -30231, -40924, -28936]
15483b8936J4610o119p358L081K5954J3743N810J5472J540j3713n118m210q010
15470F746j4905n134k57Q659J282j6219n459J4722K497m420j1574J744Q757K0177
15456F616j4516N99J4804J639j0047l855L913Q382r603q747k36l243j9827L231
15442c0890O832Q667J294r647r123L800N231P644J9425J5070p526j0866p054L386
15428c757P792N199o794q568K386r575l239J8162j2469l5778j112J8252J4380
15415a5121J6784r595O248P450L434j2675j3842n012P005O506m04L952M384o144
15401g030j4269R21j729p210P476o129K908K9115K2586j5662n686l348K88n571
15387c340l483j2887k676j5204p367J6087O953P440J2254j4652j4749q614j7450
$$ y = [-28936, -14326, -20445, -27803, -24722, 1232, 14975, 20785, 36257, 37797, 24084, 18966, 14756, 6746, -8159, -13293, -13550, -4891, -3609, -19828, -25287, -10565, -8068, -12488, -24062, -22318, -13561, 6616, -7900, -7301, 7503, 9142, -905, -4760, -847, 7535, -2068, -10815, -11051, -14294, -34121, -30890, -24058, -15391, -14097, -23744, -32867, -29067, -23836, -16192, 3233, 18303, 10777, -89, -7143, -3757, 4035, 9234, 2440, -6128, -3742, -13317, -16556, 1606, -10863, -46641, -47753, -29501, -15121, 1663, -7932, -1684, 5766, 9200, -3475, -17317, -22329, -15324, -8818, -9222, -5270, -886, -7030, -21299, -20378, -22107, -29317, -21841, -27970, -25062, 4053, 26639, 10977, 5291, 1943, 2231, -3340, -6823, -19710, -22386, -37590, -44957, -28870, -21917, -14477, -2223, -16875, -31624, -40238, -57688]
15374e7688K7134K7523l197P737q420k4573Q186q667J5318k803j3560J4904J1369
15361f737j3264q69K799Q208J2403j3413j9456J523K198j0614r266J877K2133
15348b2478J4671j8572m198l458L61O871R003N994N067P285K0939j938J969j5452
15334F064o182q080q613l58P610Q237o56j372r545J1720l308p997o665j0667J2122
15319a7690o191l897R509K746O597Q485j2343K388j2682j0442K325J0785j425
15306b1835L835m864J7866j154P98l770k184l031j9497l889K212J2410j6168M494
15292c4777l976q002j566O229K4568Q410k927q547j0175L177N420k870P433J8702
15278A099L811R435j0783j7210Q000j665q993k327J6362j0942n372Q045M106N166
$$ y = [-57688, -30554, -3031, -6228, 1509, -6911, -31484, -23298, -31965, -16647, -19450, -33010, -18106, -6737, -20001, -20870, -18071, -9863, 2540, -10873, -30329, -28806, -26608, -37222, -46488, -44611, -22478, -7807, -26379, -30577, -34035, -33674, -26803, -17800, -11806, -6739, 546, 21485, 19547, 21516, 6064, -118, -8198, -16811, -17169, -9559, -1322, -1978, -3350, -12895, -1175, -4483, -12480, -19145, -29812, -17690, -23881, -27778, -18269, -15523, -8926, -441, -12784, -10396, -23078, -33520, -31195, -20410, -21835, -18000, -22864, -4998, -6152, -5354, -9124, -11308, -14339, -33836, -37725, -35513, -23103, -39271, -34777, -38753, -46755, -48321, -42092, -17524, -9114, -12041, -20588, -30763, -27586, -22166, -25036, -17603, 1099, 4910, 14345, 3562, -13648, -5648, -7313, -16306, -18633, -2271, -13213, -18585, -10540, -6434, -1268]
15264a268J1937R40j2458p984j475R787M126n776j4819K791o739j4068K01Kl441
15249c8244Q261Q008j0785N229O381J6436O750q036p804J0057j2642r784L246
15236b2927j794K73P466J3514L423n261L352O892J3116p922j4932J0377J907k124
15222E360L779j8234j7890m496J4715J5036K176M735p62j7091r232N642O893q927
15208a8296N902r101Q247J8903L016L586j3504j9065j3928L270J8524J479J857
15195i110j542j1342j4729O838K2068Q71r795j42l480O36q361q053K638j252m171
15180c8926J643R431J562l463K2541J2367j7221k7427K876O790k287P571O9L820
15166b0654j0144K432M984J4729j1780j8436m917k466J2405L332k0997K50J4608
$$ y = [-1268, 10669, 11609, -849, -8833, -10308, -521, 3605, -2171, -16990, -14199, -20938, -35006, -34805, -34803, -38244, -29983, -21975, -32760, -27531, -21150, -4714, 2036, -6000, -13804, -3747, -16389, -26173, -22927, -24721, -24448, -16982, -3468, -45, -5306, -1954, 4938, 18054, 10132, -4800, 5577, 7484, 5360, 9139, -9095, -26985, -31481, -16766, -1730, 446, 5181, 4419, -12672, -21904, -16262, -9369, -18296, -12394, -21495, -13248, 5655, 8671, 12257, -1247, -20312, -34240, -30970, -12446, -10967, -9110, -10652, -21994, -36723, -29885, -7817, -6946, -16741, -16883, -20363, -19727, -28088, -36141, -33503, -34755, -38926, -37283, -27852, -26290, -29753, -7212, 5155, -12066, -39493, -36617, -29827, -32114, -24543, -24474, -20654, -30798, -28366, -23382, -8653, -20433, -38869, -43786, -46252, -33847, -30515, -51512, -51262, -36654]
15153c6654J7551M297R706n522j4983L392M888Q382K5617q947l416P409k180j4076
15139d536p147j4351k951j984J311O310P442O959n147N351M750M317M721p453
15125b408p972N017J57L793O978P42m311j8496j0941M5m70J0647P956K0913p574
15110D076k0332j2351R294J2384K200J1940O380j1066j1264M389J1655J2260j8616
15097I49j6177l098K94n512J3851k330r735R10j2592p111J3668Q13K539l269p219
15082c4019J1133K1586J462k4763r743R717R98O557J2230J1900j6830j3749R99
15069b2522J0767k3K103n984K674N441p04n057j4656L519L489O770N092o837j2497
15054b8425q42O899K257J632o840J397k60j5904k032J2549K0466M047m999M085
$$ y = [-36654, -19103, -14806, -5100, -10622, -25605, -22213, -17325, -8943, 16674, 7727, 4311, 11720, 9540, -4536, -11683, -26034, -28985, -30969, -29658, -23348, -15906, -8947, -14094, -8743, -3993, 324, 5045, -2408, -10380, -5363, -5206, -1413, 5565, 6307, 1996, -16500, -27441, -27396, -27866, -17219, -9263, 11650, 4076, -16256, -28607, -19313, -6929, -4729, 7211, 13591, 2525, -8739, -4350, 7305, 19565, 949, -15228, -18326, -18032, -23544, -9693, -12023, -21758, -20848, -33440, -40551, -26883, -26070, -23531, -26800, -34019, -22886, -1300, 162, -24601, -34344, -24627, -23629, -17072, -4842, 7058, -9772, -23521, -22522, -11755, -11778, -9675, -15659, -12985, -7544, -8248, -13305, -27961, -24442, -20953, -14183, -9091, -15928, -28425, -29267, -22368, -20111, -18479, -25319, -23922, -24182, -40086, -42118, -29569, -9103, -5056, -10055, -5970]
15040e970q522l98l473p667N582j523o859R546L644J0056K629p25m951r045J1680
15025e996R153K175j5987j055K853l729O043j3061m043J1936O450Q671P420M576
15011A5406m575J488J773l207l040j9175r289N159J4828j5160j6644r00o535K551
14997c7320N155Q311L176J0910r485K437K199m230P893j2223K555P196J4169J8516
14983A9259m978j3202R73m68j722J864P331K681L4j3156r824k269R566n417L22
14968i006M736o216J1662J0142L88r266j3051p871P548K528L858o203l1J7105
14954F323r582j8665K287N27j7480p928R783j579o746J3375K5275j9970j4870
14941c9250J1734K7452Q601k7459j3084J1628o996J348m889m588L803O530J3457
$$ y = [-5970, -14492, -14890, -18363, -26030, -20448, -21971, -28830, -19284, -15640, -5584, -2955, -3680, -8631, -17676, -5996, 3157, 5332, -10655, -11710, -8857, -12586, -6543, -19604, -23647, -11711, -5261, 3410, 10830, 15406, 10831, 12319, 14092, 10885, 7845, -11330, -20619, -15460, -632, -15792, -32436, -33336, -39871, -37320, -32165, -23854, -20678, -9768, -19253, -16816, -14617, -18847, -10954, -23177, -20622, -13426, 743, 19259, 14281, 1079, 2052, 1584, -138, 1726, 9057, 11738, 11772, -1384, -11208, -13477, -3911, -9328, -9006, -4270, -10486, 1176, 11318, 11706, 2440, -10611, -18482, -10934, -8406, -4548, -10751, -10782, 6323, -3259, -21924, -19637, -19110, -36590, -44518, -34735, -36314, -43060, -29685, -4410, -24380, -39250, -27516, -64, 8537, -18922, -32006, -20378, -27374, -26026, -30915, -35503, -31700, -25170, -11713]
14928a1713O124J799l053K359m749J5463J408k5212j7900J4425L577n14j8798
14915c6784J946J4508K3751l638j3072J600j175r273qO454L874k2996m717J1095
14901b8435J9435J3984J3169j4007j0828J0077j489j2906k045p443n460p38O800
14888a9886q256r719m944K225K1070R847o572j398O836R077j3146j6633l901l124
14874c8524q419O059N929O741J6056N624j1686L449n613P743Q791q206l029k286
14860a7371j192N220q993q826J594m262j0972l805p01K7267L4606n010j9263p987
14846a9695j242J4725L342J8879r38m611m932n627p544R896K023m033m461Q293
14832D075J631r048m793R039M293j1001l886o402q946K615j065Q157q591l080
$$ y = [-11713, -5589, -3790, -6843, -4484, -9233, 6230, 7638, -17574, -35474, -21049, -17472, -17986, -36784, -34838, -20330, 3421, -217, -13289, -11689, -12864, -22137, -22145, -15691, -11817, -34813, -39530, -28435, -9000, 4984, 18153, 4146, -6682, 3395, 1906, -11000, -13045, -20488, -25948, -26686, -19886, -28142, -37861, -42805, -40580, -19510, -9663, -16235, -17633, -10797, -1720, -14866, -31499, -35400, -38524, -46943, -40884, -34955, -28214, -12158, -6534, -18220, -14771, -20384, -12641, -3850, -12056, -15085, -17371, -18563, -13343, -22336, -31162, -29568, -33830, -44802, -48607, -49308, -22041, 12565, 7555, -11708, -19695, -20937, -6212, -2870, 16009, 15071, 10460, 5528, -99, -7643, 2253, 4276, 243, -4218, 4075, 5706, -3342, -8135, 904, 5197, -5804, -9690, -16092, -25038, -22423, -23488, -15331, -23922, -27002]
14818b7002M518Q746Q487J535o089k0559m42K3412m687p682k52N614o846k806
14804b4053r80J6959K2000N484o414o039j8992p178j880J1284p57P754O735k870
14790A053O85R132o80o425j48j482j3552j8330o570J7542J9298R978R973L334
14776B3808r62j23J157q015k4765j2904M216Q51O065P743N939j067k7316k1347
14762d6720K1156J4942J7328Q878k2865j3628K15j2388j5611K1017J1541L733
14750a2402K759k288j2777j3269L29Q717j0458M296Q47l496r64K6693J4137k6803
14736b4679r051M009n552j0341Q63J5871Q275J078j178R055n642k045Q845K924
14722g568l098k300j4645k0783O506Q058P179J7752L754m889L567k661j6096Q491
$$ y = [-27002, -22484, -13738, -5251, -3716, -9805, -30364, -30806, -7394, -12081, -19763, -20015, -14401, -21247, -24053, -25033, -8074, 13926, 19410, 12996, 6957, -12035, -19213, -21093, -9809, -10566, -2812, 3923, 1053, 1738, 10870, 10190, 3765, 3617, 2135, -11417, -29747, -36317, -18775, 523, 10501, 20474, 23808, 22846, 22723, 23880, 15865, -8900, -21804, -17588, -16737, -10672, -2929, 3010, 1943, -25373, -46720, -25564, -10622, 6706, 15584, -7281, -20909, -20694, -33082, -48693, -27676, -16135, -12402, -9643, -11931, -24708, -37977, -37648, -28931, -39389, -35093, -34246, -37742, -38706, -12013, 2124, -24679, -33730, -29721, -35273, -45614, -44751, -28880, -20605, -19527, -20705, -11650, -17292, -19337, -10492, -7568, -10666, -12966, -27611, -48394, -41888, -33830, -26651, -8899, -5145, -10034, -6467, -9128, -25224, -16733]
14708a6733O746j2419J804P646J0422k777L680n581J6546j333j939P796k82j1570
14694B006l078N351k354J640O254q361j3204j2308R478J6758q273j6082R572J4111
14680A510J275p842r736l828N914J0688J884j3442M072N50j9245m081k398j894
14666c6573N705J4649o034O146m693j908K0361R167j1110j280J8068K660J475
14653A6633K102J0865m632n756k9064j8408P815K4224j6593k0948J2957J1506
14641i299j7880R994K7157p009o272m395J400J7554j053k0084k681R442j3471
14628a6597R649L083l810r587q178J6493K1270l440j3612J3061K1856N596j0593
14615B5191j4786r242r876K618j2730M159J6659n275j2407j2288M325P242L198
$$ y = [-16733, -9987, -22406, -20602, -12956, -2534, -5311, -1631, -7212, 9334, 8001, 6062, 13858, 13576, 2006, -1072, 4279, 1925, 3565, 9819, 1458, -11746, -24054, -14576, 2182, -6091, -22173, -12601, 1510, 2785, -5057, -14793, -18621, -12707, -2019, -135, -13577, -9505, -8955, -28200, -32281, -34679, -36573, -30868, -16219, -22253, -16107, -20800, -22708, -2347, 6820, -4290, -5570, 12498, 15158, 16633, 18735, 29600, 24968, 19212, -9852, -28260, -20445, 3779, -12814, -33762, -20805, -9299, -27179, -17185, 9972, 2963, -3309, -7704, -6304, 11250, 10197, -9887, -12568, -3126, -16597, -6948, -3865, -7675, -17262, -25440, -8947, 12323, 8883, -4729, 8332, 30188, 35784, 25191, 10405, 1163, -8713, -6095, -18825, -14666, 1993, -3282, -15689, -27977, -23652, -16410, -13212]
14602a3212k694k695J5564p375j6842k229J7610M365J189m632Q590j393m906j6604
14588b5264j2370J0616J9120j0826p107M280o643J3240K125k857L340j176J6262
14575B740Q902j0253j144j716r289N145m208J3275Q014q100n954J0927K40l899
14561D680p525r182M515K656k279J0916l338j1473Q083K45k18j5573r043J653
14547b5883J6424K214P76m203p118j1049o818P082K2972L766K396N808j4697j2986
14533b1316R676m822j0098m538N820R18K442M894J0329Q656R53o638P4P699j673
14518B376k3844j597K4325ON815O738j1155K245M729r519j92q163j3242M79p0
14503b1069k801J5069N408j8446J4819O035Q665M711M327m891k0926r148J2860
$$ y = [-13212, -15906, -18601, -3037, -10412, -27254, -29483, -11873, -7508, -6319, -10951, -2361, -3754, -8660, -25264, -37634, -27018, -7898, -18724, -25831, -21551, -28194, -14954, -12829, -15686, -12346, -13522, 2740, 11642, 1389, 245, -1471, -10760, -5615, -9823, 3452, 11466, 3366, -2588, 8339, 8579, 4680, -2845, -12027, -7512, -4856, -7135, 3781, 443, -11030, -2947, -2702, -2920, -18493, -27536, -25883, -9459, -7245, -6469, -10672, -17790, -28839, -35657, -28575, -5603, -1837, 559, 6367, -8330, -21316, -11640, -16462, -26560, -31098, -25278, -24360, -21918, -17024, -6695, 1961, 2914, -3724, -3650, 4049, 2376, -21468, -23065, 1260, 1266, 7081, 13819, 2664, 4909, 9638, 119, -73, -8236, -21478, -20999, -21069, -23870, -8801, -3393, -21839, -7020, -985, 7680, 12391, 16718, 11827, -9099, -18247, -5387]
14490e387J6824j0294m863K82Q101m380j337Q386J2028O596j7989j0689M646q209
14476f285M544J0302j5366J001n178o385M235j7893j2941P954j356p843L005J5736
14462b6470k635K3116K8286j900j0586j9437j1823J9406J6288J1328l107N201
14450B7667M715n565k4932j4340K0682M882J936K24R617l898j0497R94J430j0474
14436B441n175R342n647K6357j0907k1274O680P810o890l729P829J7337J837J577
14422B7588j3814m839j208j0403P945m127o665J826J7623L699j3838n40L506l515
14408C238l742R879J310n419J2652k684J4512M765k480n295j4444k7167p979L27
14394b2527K489j101R985j1884k33N167J8657R093p308M374Q979m99J8849q841
$$ y = [-5387, 11437, 1143, -3720, -3438, 4663, 283, -1054, 7332, 19360, 25956, 7967, -2722, 1924, -6285, -1741, 8561, -6805, -5804, -10982, -17367, -13132, -31025, -43966, -36012, -37368, -45211, -42206, -26470, -29105, -5989, 22297, 20397, 9811, -9626, -21449, -2043, 14245, 25573, 22466, 27667, 32382, 26817, 1885, -12455, 8227, 13109, 15045, 15269, 24886, 20988, 10491, 11485, 12915, 2441, -2734, 6608, 961, 27318, 16411, -4863, 1817, 9627, 2737, -992, 6837, 24174, 26011, 27588, 13774, 8935, 7727, -2676, 5269, 1142, -5523, -3697, 13926, 17625, 3787, 3247, 6753, 3238, -504, 9375, 10685, 5266, 17918, 15234, 29746, 34511, 32031, 26736, 12292, -14875, -22854, -22527, -20038, -21139, -11154, -23038, -23271, -18104, 553, 9646, 2338, 6712, 15691, 15192, 34041, 25200]
14380B5200k5142k864J2167N826M267q896j1371j5235J0287J0192M990j3664n598
14367i841p084m283p409K356K3630j844k2122Q547K5614n094k0321k859J0472
14354a0238N882P343o748j7902n540J5774N130m949n134j0612Q737N193k674m425
14340b0163P058N620M567M569j029r74O724P454k404k1040k996J5133J4572j9720
14326b629q903o007k056J8321K595o157Q202j0784k496R381L296J325p207N97
14312b522M357O299n399j017j0513n274P726j5295n553K327o609n38k461R756
14298b4716k659k525O110L57O409r607k88R661l22M487J4036o103r181j3018K0542
14283f817M205n309o006j0318r537o105M082J5329J0852l55Q370J1710J3642m23
$$ y = [25200, 58, -2806, 9361, 15187, 19454, 10558, -813, -16048, -5761, 4431, 9421, -4243, -9841, -16925, -21208, -28617, -26261, -2631, -4475, -26597, -18050, 7564, 2470, -17851, -20710, -10238, -4356, 2987, -3761, -21663, -27203, -11429, -6299, -11248, -16382, -26994, -18257, -13064, -15738, -20163, -13105, -7485, -2918, 1651, 622, -352, 6372, 13826, 11422, -9618, -12614, 2519, 17091, -2629, -11532, -17539, -19595, -1274, 1321, -4836, 3366, -7418, -9914, -533, 2763, 4088, -3119, -2522, 1835, 8134, 2735, 1718, -8795, -14069, -6343, -21638, -27191, -24864, -31473, -32011, -34472, -24716, -27375, -29900, -23790, -23433, -17024, -26631, -26919, -17258, -17580, -13093, 943, -5160, -14341, -27359, -6817, -2612, -7921, -13927, -24245, -33782, -39887, -35805, -20476, -9624, -9979, -1609, 10101, 23743, 23320]
14269B3320m680q101m625P174p712o832L515K1888j4047r598j982j2477R401M118
14255f38j6020l784J8796J5666O682M511o794j1840J9145r898n674p038J4640
14242A7754l86p303j386J463j362J1589J1798l773k7114q187L834P285J222j264
14228D170o722n780L089o79j6973J5097o39K1116O556l998q750j4982o42l287
14214a2424J2539J6557J3345P725k081p736j8444m944j862O843M020j292O500
14201A8746j5501j75Q167r587k464R071K284k1472r112J2253O204Q059q148k8922
14187c0597J0364J1458m030j0595j6283J2731J7168L842M304n785J4498j327j0120
14174d372M272r359N200k641j0727K11Q885L72O287j5396P149m618L787J2919
$$ y = [23320, 18640, 10539, 5914, 13088, 5376, -1456, 2059, 23947, 9900, 302, -1680, -14157, -4756, -638, -16658, -20442, -1646, 14020, 20702, 25213, 18419, 6579, 25724, 15826, 10152, 3114, 17754, 17368, 10065, 8679, 10142, 8780, 20369, 32167, 28394, 1280, -6907, -3073, 4212, 5434, 4170, -2552, -8332, -5243, -5922, -22895, -7798, -8437, 12679, 19235, 15237, 6487, -8495, -9137, -12424, 115, 16672, 30017, 37742, 35661, 27925, 9481, 4537, 2675, 9518, 13538, 12246, 18746, 3245, 3070, 11237, 1650, -814, 8257, 10541, -10931, -20043, -7790, -1586, 6473, -1675, -30597, -20233, -8775, -12805, -23400, -39683, -26952, -9784, -5942, -1638, -7423, 7075, 5748, -4372, -100, -9459, -4259, -6900, -17627, -17416, -8531, -8159, -1872, -17268, -10119, -14737, -10950, 1969]
14160A969J3464l790m496o321N688k766j2635o051J5418K0896j966j5726o399
14147b715o535O25j776N72m805J0821J0590j1567j3956O866R460K490j533J0890
14133I427L150j0555N581L898P01L229J0737P56K359R675j4051j5102o129Q919
14119A2595o902j332p891q864J4712K4624j2601r425M890P427J2359p057p807
14106A4728N210J422K845n289k4531k325K1014J1375j4555M597K8552m258j4638
14093B4147N041q49J2850j6449j6809Q763L119M552J0548j0054m087n41N269l580
14079B1920o572j492P036Q8O901m550N634J7733L875j0708p89P646j0322j1003
14065B5397n607L700K643P26J835N102q72k145n533q617K3665j603J46J6766J6103
$$ y = [1969, 15433, 11643, 7147, 826, 6514, 3748, -8887, -14938, 480, 21376, 19410, 3684, -2715, -9250, -8625, -10401, -9829, -14634, -3813, 6777, -4790, -18746, -11880, -2420, 70, -1463, 9427, 12577, 2022, 7603, 11501, 12202, 15431, 26168, 26924, 29283, 38958, 24907, 9805, 3676, 12595, 5693, 4361, -3530, -12394, 2318, 26942, 14341, 4916, 9806, 17233, 29592, 22535, 14728, 19938, 21360, 24205, 18916, -5615, -7940, 13074, 24449, 9894, 14491, 43043, 38785, 24147, 29188, 28339, 41189, 24740, 7931, 16694, 19813, 24365, 34913, 24859, 20772, 20231, 25500, 21920, 15348, 13856, 20892, 20980, 27881, 23331, 28965, 46698, 50573, 39865, 39076, 46722, 36400, 25397, 19790, 23490, 26133, 26859, 28694, 33796, 32924, 30779, 25246, 16629, 40294, 38691, 38837, 55603, 71706]
14050G1706J291o277M72j588N605P259l876J3341l520M617J5678j738o839Q094
14036A04225M493J2026m216L985L257j232Q72K5082J1491o759q632R874K0497
14023A74963K1252R445J2253K4187L6242L2731L0213K4595M4189L9884J9520L4581
14011E04055L4520O9761Q0945O9999R9630J13983J16756J34617J57904J93404
14001A575574K25930K60521K90884L41958L66261L58489L67489L38025K85103
13992D410234K26618J58192P5262j0305p6486j30688j57125j86387j85831j74553
13982C948931j56556j44871j19899q7662q1537p5112m0250j6995j986M828K3415
13971C252306N3553J00144J22587J32342J15104J34575J98038K25119K15835J99879
$$ y = [71706, 72997, 66720, 67192, 65604, 71209, 78468, 74592, 87933, 84413, 89030, 104708, 102970, 96131, 104225, 108718, 120744, 116528, 120513, 123770, 122538, 123410, 148492, 159983, 153224, 144592, 154466, 174963, 196215, 205660, 217913, 242100, 278342, 311073, 341286, 365881, 410070, 449954, 469474, 504055, 538575, 608336, 689281, 759280, 858910, 972893, 1089649, 1224266, 1382170, 1575574, 1801504, 2062025, 2352909, 2694867, 3061128, 3419617, 3787106, 4125131, 4410234, 4636852, 4795044, 4870306, 4860001, 4783515, 4652827, 4495702, 4309315, 4123484, 3948931, 3792375, 3647504, 3527605, 3439943, 3358406, 3283294, 3243044, 3226049, 3224063, 3228891, 3252306, 3305859, 3406003, 3528590, 3660932, 3776036, 3910611, 4108649, 4333768, 4549603, 4749482]
13961D749482J78520J37685P2629J7893o3044j63376k37456l03503l60752l63815
13951C664263l39807l27312l13292k84063k64625k23118j78819j77629j42336
13942A413262j21514j06452q0783q6184r9442o7591m4820o3163m2172m6841k9890
13931F24410l3958m0903k4600j6898j7194j1522l5361l2600j0737n215m285m9317
13919C41820k5345j3874p872j0676j610n132o109j3300q453P86j0944j3024r816
13906B16451j1136J068O690l265k0325q019q444q879j5784m186M803J5781O937
13893A71692j1706j9131j3883r091m495M854J0198q945J785j0364j5149Q045j726
13880A02084j70J397j589m209j9372r32J1421m166m543j702J1114k933k346L625
$$ y = [4749482, 4928002, 5065687, 5138316, 5156209, 5093165, 4929789, 4692333, 4388830, 4028078, 3664263, 3324456, 2997144, 2683852, 2399789, 2135164, 1912046, 1733227, 1555598, 1413262, 1291748, 1185296, 1104513, 1018329, 918887, 851296, 806476, 743313, 701141, 654300, 624410, 590452, 549549, 524949, 508051, 490857, 479335, 443974, 411374, 400637, 395422, 391137, 341820, 316475, 302601, 294729, 284053, 282443, 277311, 271202, 257902, 249449, 250235, 239291, 226267, 216451, 205315, 206383, 213073, 209808, 189483, 181464, 173020, 164141, 148357, 144171, 148974, 164755, 171692, 159986, 140855, 126972, 117881, 113386, 118240, 128438, 119493, 121278, 110914, 95765, 103810, 102084, 101914, 103311, 101722, 97513, 78141, 77209, 88630, 84464, 79921, 78219, 89333, 86400, 84054, 87679]
13866H7679P62l4084m164K080p886J0824K0259j442q591r226N174k4474j4389
13853B2522L0687J5058k869j3543q515K059M225o066N159K557N326n123P896P59
13839F0132k2904j3380J4427J3223L824L607j0787N80m247m358n763J361J2327
13826D8042k0542j359J6589j2261J809j539j0377J644K0801m26j8122m077q834
13813A1348k1603P612J5039J288J3195J764p959n271r679j5847L187l269O197
13800c998J274M819N967J1207j6407j6143J605Q510m875M761J6169J3463n426
13787B0926j7224q068O012J085J2828j1798q694M969l699j751m032J4258R408
13774A4220J8120K4530M724m764J1194J7337o37j8366J5578n658k9574k6048j2917
$$ y = [87679, 88441, 54357, 50193, 52273, 44387, 55211, 75470, 74028, 65437, 56211, 61385, 36911, 22522, 53209, 68267, 65398, 51855, 43340, 45399, 49624, 43558, 48717, 51274, 56600, 51477, 59373, 60132, 37228, 23848, 38275, 51498, 55322, 58929, 48142, 48722, 44475, 40117, 34354, 35715, 48042, 27500, 26141, 42730, 30469, 32278, 30739, 20362, 22006, 42807, 42381, 24259, 20182, 11348, -10255, -2643, 12396, 13684, 26879, 28643, 20684, 15413, 5734, -10113, -6926, -10195, -3998, -2724, 2095, 8062, 19269, 2862, -13281, -11676, -3166, -8041, -3280, 12889, 26352, 20926, 3702, -4366, 1646, 2731, 15559, 3761, -4933, 36, -3663, -5414, -9446, 4812, 14220, 32340, 56870, 61594, 56830, 68024, 85361, 84724, 66358, 81936, 76278, 46704, 20656, 7739]
13761G739k775R52J3675R460j5902q016L975J4554j310k316j5383j0457K421p854
13747a1237m781n733K554J7130j84j870O63J776n778M496P429Q35o157l364M463
13732B42l403K668j5690k706K4895n61j0211j3886n399K3517q985j8200O620J3709
13718g390J1475j478o37J6397J1862q780j0408q426k607J741J4800l850k807j4041
13704d149j2758R563J3283J0394R62o289n481M4j1331J3795J2447M203M936K991
13690C2610j578R769j2104j1900o436J4709l202r867j5423J98r87J0102J3422
13677A9313l431k709j4472q58J4984J3950n114k0809j0284Q943M689n391K175
13664I86j2939j2788J722J4420Q033J373P995r556r835R326m625k1238q804R846
$$ y = [7739, 4964, 5916, 19591, 29051, 13149, 5133, 9108, 23662, 22352, 20036, 4653, -5804, -3383, -11237, -16018, -21751, -19197, -2067, -2251, -4121, -3458, -1682, -7460, -2964, 4465, 5300, -857, -4221, 242, -3161, -493, -16183, -18889, 6006, 5445, -4766, -18652, -24051, -534, -9519, -27719, -21099, -7390, 4085, 2607, 1970, 18367, 30229, 21449, 11041, 2615, 8, 1749, 16549, 12699, 9892, -4149, -16907, -7344, 5939, 16333, 17295, 11006, 5525, 5569, -5762, 8033, 20480, 24683, 29619, 32610, 31032, 40801, 28697, 16797, 10361, 25070, 21868, 12001, -3422, -3224, -4211, 5891, 19313, 15882, 13173, -1299, -2157, 12827, 26777, 21663, 854, -9430, -487, 4202, -1189, 986, -11953, -24741, -23019, -8599, -566, 807, 8802, -754, -10589, -1263, -5888, -27126, -35930, -26084]
13650b6084K4753J424Q709k057q463j035N186Q467l911j8929j7740P097J0776
13637a1807N055J0237j5638k064M735m303o839K0083Q441o532J7894K917J0287
13624C2466p778j0726J0189J1553J583j2675j0600J573Q047L192k4782r478q796
13611a6232k481L947K667o511N883L579M641K731r056n556j0927N049J5046j0010
13597a7230q724l022J0618J4492J2593k240q063k986m23J827J5602K5837m826
13584C3455k2000o197P271J9332j0952k1960n344j369n697n088J6344J515j5201
13571a5891j0394J3158J3230j562m134K293j5845R280k652j6845o379P064J0413
13558a8264J4850K182n456N685J6012K2588j697m540j6358r15j5395o389m459
$$ y = [-26084, -1331, 93, 8802, 6745, -1718, -2753, 2433, 10900, 6989, -11940, -29680, -22583, -11807, -6752, 3485, -12153, -14217, -9482, -13785, -20624, -541, 7900, 1368, 19262, 22179, 32466, 24688, 13962, 24151, 35704, 37287, 24612, 14012, 15585, 23632, 26824, 2042, -7436, -16232, -18713, -14766, -12099, -18610, -12727, -9148, -4507, -1776, -10832, -16388, -27315, -22266, -7220, -17230, -25954, -28976, -18358, -3866, 8727, 6487, -1576, -4562, -4985, -3158, 12444, 38281, 33455, 11455, 5258, 12529, 31861, 20909, -1051, -6395, -7764, -13461, -18549, -2205, -690, -15891, -26285, -13127, 103, -1459, -5593, -3300, -19145, -9865, -12517, -29362, -35741, -28677, -18264, -3414, -1232, -6688, -1003, 15009, 37597, 35900, 31360, 15002, 14087, -1308, -7697, -12156]
13545a2156Q312K0974Q755j993k371Q88o868j5573J2248Q088j0627J252J0905
13532B1834J2469Q396k413K618m938n943j5955j2876J542p573R325J7087Q427
13519C2000j8698R297J011J3043K12j8849m969k377J2388j7652R113J3637J946
13506C0102j1315J2641J8725m697k0442J7268j485k4772j4213r056R60K849o037
13493i472k901M22K562P878j7110o7Q798J116o821j1235l426Q632L688J4329M5
13478c562N604L965K797q269n20k634r722J5239o254r485m706M732M582L526J4161
13463I454J936n584q520k214J2330n356Q606J5889k239P578J5879j676j8387j4313
13449A3383q057J9536k893k9860n913J0994J6224P983j2346J443K2663j6788j1236
$$ y = [-12156, -3844, 17130, 25885, 23892, 21521, 22409, 15541, -32, 12216, 20304, 9677, 10929, 21834, 34303, 42699, 40286, 42904, 37966, 32023, 16068, 3192, 4734, -2839, 6486, 23573, 32000, 13302, 22599, 23610, 36653, 36865, 18016, 13047, 10670, 23058, 5406, 14519, 28156, 30102, 18787, 31428, 50153, 45456, 25014, 42282, 40797, 16025, 1812, -7244, -6284, -3435, -9472, -12373, -11951, -9389, -1511, -18621, -18688, -9890, -8774, -15595, -26830, -30256, -21624, -17936, -3607, -3562, 2042, 6007, 8804, 535, 15, -2619, -12341, 2898, -3356, -12841, -17547, -12815, -8233, -4707, 9454, 11390, 5806, -2714, -4928, 7402, 2046, 10652, 26541, 24302, 31880, 47759, 46083, 27696, 13383, 5326, 24862, 21969, -7891, -13804, -2810, 13414, 21397, 9051, 10494, 33157, 16369, 5133]
13436E133P391j625M89k507o709K95O800l263l311o212K378K014p405O291K2033
13421B1792J6379r813k3052j6308N849q26J0826k134j7254R318J2836j38L039
13408A0514k371M618K5344l583k3820k5973k1454K2781J8025m094Q320O974n619
13395I662n454J233J8408J0723J914j4425j4282O726N514J2018k391M885J1432
13382D5963j4226j5640j4216r258L359M621J3669O476j7644k7108O187P149R039
13369a629J5664k983J542j505j0296O768k162J854q920N294J4073J6578K0200
13356E4478j7561k0703j8726m413J28q506J4194J5439K246j0596n309J8718J4050
13343C3439j6912n028j5368Q899L188q308l691M866o338Q900k139K934Q106J4510
$$ y = [5133, 12524, 10899, 11388, 8881, 2172, 2467, 9267, 6004, 2693, -3519, -1141, 873, -6532, -241, 21792, 38171, 28358, 5306, -11002, -5153, -5979, 4847, 2713, -14541, -5223, 7613, 7475, 10514, 8143, 12761, 38105, 34522, 10702, -15271, -36725, -13944, 4081, -13, 8307, 15281, 9662, 4208, 5441, 23849, 34572, 36486, 22061, 7779, 14505, 20019, 32037, 29646, 34531, 45963, 31737, 16097, 1881, -7377, -4018, 603, 14272, 20748, 3104, -24004, -17817, -10668, -1629, 14035, 11052, 12594, 11089, 793, 7561, 5399, 7253, -1667, 3627, 17700, 34278, 54478, 36917, 16214, -2512, -6925, -6797, -15303, -1109, 14330, 16576, 5980, 671, 19389, 33439, 16527, 11499, -3869, 5030, 8218, -90, -3781, 1085, -5253, 3647, 1508, 4442, 12548, 27058]
13329B7058M315k4770j1690j3665P673J0994Q032J1522M620q344J417M025n97
13316B0590o369Q194j190j3931j0750n280J5141M046Q695j1896K279J0250l730
13303A6049q609p63N218M482j0028N357r206k1383n740O217J0655m297J1487J6566
13289A6005K225j1862j799P081J3361l412j2359r258J1399N839J1025k742k1806
13276C697m376O437r100n591O587P590J0805o091j3594L352K50n680N711J4634
13262A4631J0157j3863k676O099k199j460j9218j0178J9430J6030R876k459r93
13249B3177O396J0497j5868j5594k995M267l307m304M768l362q682K542r305m560
13235a6330M329j1810K886K985M836M689J0110j09m47j1089J0898K4079M255k7043
$$ y = [27058, 31373, 6603, -5087, -18752, -11079, -85, 7947, 19469, 24089, 15745, 17162, 21187, 20590, 14221, 22415, 21225, 7294, -3456, -8736, 6405, 10451, 19146, 7250, 9529, 19779, 16049, 7440, 6677, 11895, 16377, 6349, 11706, 2500, -18883, -24623, -18406, -7751, -12048, -561, 16005, 18230, 6368, 4569, 11650, 25011, 21599, 9240, -18, 11381, 17220, 28245, 25503, 3697, -679, 5758, -3342, -8933, -2346, 5244, 16049, 9958, -3636, -284, -34, -5714, -3, 14631, 24788, 10925, 8249, 14348, 12149, 10689, -8529, -18707, 723, 16753, 26629, 24170, 23177, 29573, 40070, 24202, 8608, 5613, 9880, 6573, 2269, 7037, 3675, -5007, -2465, -11770, -16330, -12001, -23811, -20925, -17940, -13104, -8415, 1695, 1586, 1139, -9950, 948, 25027, 29282, 2239]
13221B239l680L682o342J6545J7212j2230r204N964k223j0112J0630l32J1454
13208B3603J3329R063l454O900n015k0749k0507k268k110M302m334K082L815L101
13194G758P694l644j29P202r388m688J1629j600k0537R986J7136R37J723J665
13180B5744O918n902j2964J0898Q326O16j2073k4843k0760J3639J1592O856J5179
13167B3226O110m143q879j2418j764R418K889R987o008n816M620j005m648J956
13153A3525L295r222M168J4035Q354J8980l320j2786j175j4988k6877M5J2721
13140F755k507K141l793m318n161J471Q471r436N574m971J9928J2419J627J870
13126C0070k890m59N599r114k1239j8511J2341J4055l128L232O933l78r579J4337
$$ y = [2239, -1441, 2241, -4101, 12444, 29656, 17426, 8222, 14186, 11963, 1851, 12481, 12149, 23603, 36932, 45995, 42541, 49441, 44426, 23677, 3170, 902, -1208, 3094, -1240, 842, 4657, 7758, 15452, 11808, 11679, 18881, 9493, 4805, 16434, 14834, -5703, 4283, 21419, 22356, 24079, 25744, 32662, 26760, 13796, 24694, 33020, 33636, 21563, -3280, -24040, -10401, 1191, 8047, 23226, 29336, 25193, 16314, 3896, 2132, 11550, 14439, 24426, 18418, 12602, 17222, 16217, 11569, 13525, 16820, 7598, 11766, 25801, 34155, 53135, 49815, 37029, 35854, 20866, -6011, -5966, 6755, 4248, 6389, 2596, -1722, -6883, -5412, 3059, -6377, -803, -5774, 14154, 26573, 28200, 30070, 27180, 26721, 32320, 23206, 1967, -16544, -4203, 9852, 6724, 9956, 16889, 16511, 6932, 21269]
13112B1269M149j1214O664r791K781O695J3463m005k384j9807n398J4625R323
13099B6370j872j7167o576p381J9163n873o504J1801P455M178O790l465j7455
13086I464j905N84P916J0581k891m437n000o71K275r894m446R367K9829m703k0494
13071A5575q020J5990L800R428J0790k248q952k5726j0883J4179m391J1509n165
13058A5886p189R76K1081N524L442n067j0033n444J3065J194K491L574k521P166
13044D4145P555m457j4445k068j834J8405K2530J2097j8966l6520m763P929K7450
13031E7058J4722Q786j6259q848r047L094l220j3993L248L611J3050R799o499
13018E5502m828J376L674M873l3R317R960r093J590J6203J2621P807K854R23J2896
$$ y = [21269, 25418, 14204, 20868, 11077, 13858, 20553, 34016, 30011, 27627, 7820, 2422, 17047, 26370, 24498, 7331, 755, -6626, 12537, 6664, 160, 11961, 19416, 23594, 30384, 26919, 9464, 7559, 8143, 16059, 26640, 23749, 19312, 14312, 13641, 15916, 6022, 1576, 10943, 40772, 36069, 15575, 7555, 23545, 27345, 36773, 47563, 45315, 36363, 10637, -246, 13933, 9542, 21051, 15886, 8697, 9673, 30754, 36278, 39720, 34653, 24620, 19176, 32241, 33435, 35926, 39500, 36979, 44145, 51700, 47243, 32798, 30730, 28896, 47301, 69831, 81928, 62962, 26442, 21679, 29608, 57058, 71780, 80566, 64307, 55459, 46412, 49506, 46286, 32293, 35541, 39152, 52202, 62001, 55502, 50674, 52050, 55724, 60597, 60564, 69881, 79841, 70748, 72338, 88541, 101162, 108969, 111823, 112746, 125642]
13003A25642J2198O101j3555o599R943j3436O680J8861N6o709k0703j5459n632
12990I7388J7974J2489J5358O228K331l407K3890K1790j4396k1236J5407R97l613
12977A71200K391j3989J4538K3877O902r322m33r600K745O168l780j0646Q895
12964A88946J4777P633K3135R574L070J1358K99K701l716o586P810k117l163J3240
12950B66961K953j5063m59o268k394p677q017m220L252J5083M839k0628j2663
12937B15699J5414l324L670L70l187M789J0549R542k720j071J5841J2429J4272
12924B92273j3831k793J1684j770Oj0647P281J4055q391j7586R289J3637o327
12911B86880N548o052n511J645r913q901n962P829m492o826J239J1633O172k001
$$ y = [125642, 137840, 143941, 130386, 123787, 133730, 120294, 126974, 145835, 145891, 139182, 118479, 103020, 97388, 115362, 127851, 143209, 149437, 151768, 148361, 172251, 194041, 179645, 158409, 173816, 174813, 171200, 173591, 159602, 174140, 198017, 204919, 195597, 195164, 185564, 188309, 194477, 190697, 180051, 188946, 203723, 211356, 234491, 244065, 247135, 258493, 258792, 261493, 257777, 251191, 259001, 256884, 253721, 266961, 269914, 254851, 254392, 248124, 245730, 238053, 230036, 225816, 229068, 244151, 248990, 228362, 215699, 231113, 227789, 231459, 231829, 228642, 233431, 243980, 253522, 250802, 249731, 265572, 278001, 292273, 278442, 275649, 287333, 285563, 285569, 274922, 282203, 296258, 287867, 270281, 279570, 293207, 286880, 292428, 286376, 280865, 282510, 272597, 263696, 257734, 265563, 261071, 254245, 255484, 267117, 273289, 271288]
12897B71288o493j8588p433O184k925P749n245R063L0400R339N54K4679K2281
12884C40853R261j1242l510L0015L7379J7107j5745R30J0030r165Q092L0049M185
12871D48239j5540l050K978m553K0117K0866P114L556l790M197K463K6177L6870
12858E45644J2075L240J8968J4386K257m365k0341m644p185N688m419p464j7781
12845E36059Q894L691M940K5991L990m044J4762K1313L0220n72p059k683l247
12832F32255O884J3842q121k2980L71K430j1893k559m003m041P522P848k1890
12819E95665k5718j1453j4617k1410l3049j0835o967j3512o398j4416o466m623
12807D26201j6178J322J2270K421Q310L261J4357J2644J6480K9914L1437L9701
$$ y = [271288, 264795, 246207, 238774, 244958, 242033, 249782, 244537, 253600, 284000, 293339, 293893, 318572, 340853, 350114, 338872, 335362, 365377, 402756, 419863, 404118, 405048, 415078, 405913, 414005, 444054, 448239, 432699, 429649, 432627, 428074, 448191, 469057, 476171, 479727, 475937, 480134, 482597, 508774, 545644, 557719, 560959, 579927, 594313, 596570, 592205, 571864, 567220, 560035, 565723, 561304, 553840, 536059, 544953, 548644, 553584, 579575, 583565, 579521, 594283, 615596, 645816, 645244, 638185, 635502, 632255, 639139, 652981, 644860, 621880, 622251, 624681, 612788, 610229, 606226, 602185, 609707, 617555, 595665, 569947, 558494, 543877, 522467, 489418, 478583, 471616, 458104, 451706, 437290, 430824, 426201, 410023, 411345, 423615, 426036, 434346, 437607, 451964, 464608, 481088, 511002, 542439, 582140]
12795E82140L8745N1882M1244N3210N5400O5394Q1183Q1092N1420K8561K0982
12784A151253J5584k2480m8136o1189n1412o7932p4921q3578q0230p6892m6595
12773E53472l9779k6893k4330l5933m2771l3765j7301l292j6124j0967k1572j8614
12761B62131k2281M000J0125m203k1550j4919p362r757j666K625m673m696O610
12748A94384J0047J2191P298k285n263O688K828J961m30J3081J501K920O722m398
12734B47245K576K0343J5596J2927K2498J2256M340K5532K3638K5942J3673L451
12722D30017M956L524r093R034K0388o030k4384R236K2455J0120R461K9m913j2417
12708D62383p062K478K6203J8006j0272N867J3854j192J2226K018k760K0930K8707
$$ y = [582140, 620885, 672767, 714011, 767221, 822621, 888015, 969198, 1050290, 1101710, 1130271, 1151253, 1166837, 1144357, 1096221, 1035032, 983620, 915688, 840767, 757189, 676959, 600067, 553472, 513693, 486800, 462470, 426537, 383766, 350001, 332700, 329408, 313284, 302317, 280745, 262131, 239850, 243850, 253975, 249772, 228222, 213303, 205941, 196184, 194518, 197143, 192470, 187774, 194384, 204431, 216622, 223920, 221635, 216372, 223060, 225888, 227849, 227419, 240500, 242001, 244921, 251643, 247245, 249821, 270164, 285760, 298687, 321185, 333441, 337781, 363313, 386951, 412893, 426566, 430017, 434973, 438497, 429404, 438438, 458826, 452796, 428412, 437648, 460103, 470223, 479684, 479713, 474800, 462383, 455321, 457799, 484002, 502008, 491736, 497603, 511457, 510265, 522491, 524509, 521749, 542679, 571386]
12695E71386J8958K0271K3300K2852J5521J1970Q198K5796K8509N90L475J9654
12683G70480J7989O090R988K7405L1075J0256O609q941r981q871j1396n535j6877
12670H18291k2623n38J6484n664j1056q519r170q435k913L165J5576J6119O101
12657H06818K713L6239K1722J0135P588L055q507K1635L3375K2503J0474j5919
12645I51831k6581k3910k3027j3032k2369l3030j6656n564J2876K05j9611k6545
12633G54587j1827k161n242l2339l8395o625N159k3204l016j2331j1872L869n267
12620F11336j8780J556M107o651O836J247j0739J8945q361J5877Q020j2242N284
12607F16435J2013R791k320l916q094r392l4551j8146k2075j6204j0074j3417
$$ y = [571386, 590344, 610615, 633915, 656767, 672288, 684258, 692456, 718252, 746761, 747351, 750826, 770480, 788469, 794559, 804547, 831952, 863027, 873283, 879892, 870951, 860970, 852099, 840703, 835168, 818291, 795668, 795130, 811614, 805950, 794894, 786375, 777205, 768770, 765857, 769022, 784598, 800717, 806818, 809531, 845770, 867492, 877627, 885215, 888270, 879763, 901398, 934773, 957276, 967750, 951831, 925250, 901340, 878313, 865281, 842912, 809882, 793226, 787662, 800538, 800743, 781132, 754587, 742760, 740599, 735357, 703018, 664623, 657998, 663157, 639953, 636937, 624606, 612734, 616603, 611336, 592556, 594112, 598219, 591568, 598404, 599651, 588912, 607857, 599496, 615373, 623393, 611151, 616435, 628448, 638239, 635919, 632003, 623909, 614517, 579966, 561820, 539745, 523541, 513467, 500050]
12595E00050j2194j3364j4564o837n391j2586j9323J1610J4673m829M356J5454
12583D57055q022k6305j9075k364Q005o014N377Q990N831R504n920R94J625O922
12569D36603R336K7569J7206N911J3935K029j5319j0061j8700l700J3341K2325
12557E00475L705P373P826N416j905O347J3927J1J1400J5634o181J1989J7589
12544E93606J9085K2402J0679J5558M141J4843K1369J8806O891j1294J2829P610
12532G36525l925m953M4145K0005J3l616M490J146J1879K6563K5585N739j473
12519H62123J5251K3742l141M374M869J2326L5838L0745K4945P527L4100L3194
12507A085893K7115K0008J9832J9422P211J2556J2170J2942O746J2252J4112J1519
$$ y = [500050, 487856, 474492, 459928, 453091, 447700, 435114, 415791, 427401, 442074, 437245, 441601, 457055, 449033, 422728, 403653, 401289, 409294, 403280, 408657, 417647, 423478, 432982, 427062, 428056, 429681, 436603, 445939, 473508, 490714, 496625, 510560, 512589, 497270, 487209, 468509, 464809, 478150, 500475, 504180, 511553, 519379, 524795, 522890, 529237, 543164, 543175, 554575, 570209, 564028, 576017, 593606, 612691, 635093, 645772, 661330, 665471, 680314, 701683, 720489, 727380, 716086, 728915, 736525, 732600, 727647, 771792, 791797, 791810, 788194, 792684, 793830, 805709, 832272, 857857, 863596, 862123, 877374, 901116, 897975, 902349, 907218, 919544, 955382, 986127, 1011072, 1018599, 1052699, 1085893, 1113008, 1133016, 1152848, 1172270, 1179481, 1192037, 1204207, 1217149, 1223895, 1236147, 1250259, 1261778]
12495A261778K5713K0024L1504J8885J9692K9167M2982N0061M5011M2127N5600
12484A642544O1610N2351N7357N3612O8110P9545P5292P8235R3330R2805J00511
12473B455302J07023J35372J28886J30068J41686J68226J98152J95138K02577
12464C862430K25446K54634K66941K90385L57114L99832M36573M83910N37520
12455G114785N89548O53300P30947Q15793Q97914J001855J110585J220108J346992
12446A5481827J464528J585800J732259J853015J959434K038030K077156K068495
12438C0260544K046620K001981J927009J833529J704627J527461J375039J234411
12430D3911221J095313R34675Q32442P19188O16299N30816M40076L42335K28364
$$ y = [1261778, 1287491, 1307515, 1339019, 1357904, 1377596, 1406763, 1449745, 1499806, 1544817, 1586944, 1642544, 1704154, 1756505, 1813862, 1867474, 1935584, 2015129, 2090421, 2168656, 2261986, 2354791, 2455302, 2562325, 2697697, 2826583, 2956651, 3098337, 3266563, 3464715, 3659853, 3862430, 4087876, 4342510, 4609451, 4899836, 5256950, 5656782, 6093355, 6577265, 7114785, 7704333, 8357633, 9088580, 9904373, 10802287, 11804142, 12914727, 14134835, 15481827, 16946355, 18532155, 20264414, 22117429, 24076863, 26114893, 28192049, 30260544, 32307164, 34309145, 36236154, 38069683, 39774310, 41301771, 42676810, 43911221, 45006534, 45941209, 46773651, 47492839, 48109138, 48639954, 49080030, 49422365, 49650729]
12421D9650729J33759K1573q1236j91494k93928l88544m33492m52412m29910l52079
12411D7182966k30495l1092K20891M82785Q08003J169457J536045J894063K234117
12402E5266740K583254K885714L072911L238694L317452L303548L230523L073418
12394G9972254K817846K544299K241093J942833J646243J353143J060963P97714
12386I4376388N84818L44934J28489j20176l52610o39412r36494j244936j578596
12377I0562405j913132k237086k536158k822479l013703l150571l192696l131039
12369F8565541k989226k768483k525093k212236j880175j502192j118657p59959
12361E2809520m57507j50185Q9259K80627M23019N17784N59674N40080N00914
$$ y = [49650729, 49784488, 49806061, 49724825, 49533331, 49239403, 48850859, 48417367, 47964955, 47535045, 47182966, 46952471, 46921379, 47142270, 47625055, 48433058, 49602515, 51138560, 53032623, 55266740, 57849994, 60735708, 63808619, 67047313, 70364765, 73668313, 76898836, 79972254, 82790100, 85334399, 87575492, 89518325, 91164568, 92517711, 93578674, 94376388, 94961206, 95306140, 95434629, 95314453, 94961843, 94322431, 93385937, 92141001, 90562405, 88649273, 86412187, 83876029, 81053550, 78039847, 74889276, 71696580, 68565541, 65576315, 62807832, 60282739, 58070503, 56190328, 54688136, 53569479, 52809520, 52352013, 52201828, 52291087, 52571714, 52994733, 53512517, 54072191, 54612271, 55113185]
12352E5113185M21094L31485K38062J27390J7953p5285j46881k45356l70142m69811
12342E4941694n77762o95143q43830r91688j180710j357036j526682j694212j860815
12333D4213816j998522k094423k181549k238109k208180k177147k103207k011553
12325B7201126j884786j772315j649596j530727j389921j269677j171837j059658
12317A5472609r56304q80289q05801p31895o68113o10866n50330n10773m85174
12308I273064m40862m11870l76546l38171l09716l06951k91651k67982k27444
12299F301871k11156k12616k07309k04418j84634j75900j79074j73432j40026
12290D613306j34418j48755j40489j18831j34830j26841j03800r4966r0761r6023
$$ y = [55113185, 55534279, 55865764, 56103826, 56231216, 56249169, 56173884, 56027003, 55781647, 55411505, 54941694, 54363932, 53668789, 52824959, 51833271, 50652561, 49295525, 47768843, 46074631, 44213816, 42215294, 40120871, 37939322, 35701213, 33493033, 31315886, 29212679, 27201126, 25316340, 23544025, 21894429, 20363702, 18973781, 17704104, 16532267, 15472609, 14516305, 13636016, 12830215, 12098320, 11430207, 10819341, 10269011, 9758238, 9273064, 8832202, 8420332, 8043786, 7705615, 7395899, 7088948, 6797297, 6529315, 6301871, 6090715, 5878099, 5670790, 5466372, 5281738, 5105838, 4926764, 4753332, 4613306, 4478888, 4330133, 4189644, 4070813, 3935983, 3809142, 3705342, 3610376, 3519615, 3423592]
12280C423592r0554r0364q4697r7542r1828q8227q5699o5560n4074m3185n5083
12269B576779o3610n4184p0601n6423m5288m5744m9030n0992o3263m7927k5956
12258B003761n0658m8317l5795l1174l1295l4371l7592k4726m0516o3084m6629
12247A559604j7731j1721l1240l4902l2466l3233k5581k6108k3313j8066j1957
12236A293286k7834n1381l9550q719j4561j3295k6670j3532j4656m441J8352N902
12224A102901j3009J8222N0062M3206O0057L6452j6515n8343r5361r1469m9304
12213I86899m2018l7350l4267j1348r804l0727k6648k5867k5303m332N050R13
12201G45198n319r019K3829K6206J1555k2388k3985L371J7727K2851K5179M1063
$$ y = [3423592, 3333038, 3242674, 3157977, 3060435, 2968607, 2880380, 2794681, 2729121, 2675047, 2631862, 2576779, 2513169, 2458985, 2388384, 2331961, 2286673, 2240929, 2191899, 2140907, 2077644, 2029717, 2003761, 1953103, 1904786, 1868991, 1837817, 1806522, 1772151, 1734559, 1709833, 1669317, 1606233, 1559604, 1541873, 1530152, 1498912, 1464010, 1431544, 1398311, 1372730, 1346622, 1323309, 1305243, 1293286, 1265452, 1214071, 1174521, 1165802, 1151241, 1137946, 1111276, 1097744, 1083088, 1078647, 1096999, 1102901, 1089892, 1108114, 1158176, 1201382, 1261439, 1297891, 1281376, 1223033, 1127672, 1036203, 986899, 944881, 907531, 873264, 861916, 852112, 821385, 794737, 768870, 743567, 739235, 744285, 745198, 739879, 730860, 754689, 780895, 792450, 770062, 746077, 749448, 767175, 790026, 815205, 856268]
12189H56268M2720K6638j6981l4832n4621n4823m6799o3828m6842l7402m2543
12178E26955k7613j5641P964J0883k327J887k0439l8628j5850K096j3987m040
12166D11260K0107L9065M1685M7816L5648J6066L356j9032o3213o6115m7666k7719
12154C91258j4916j2701j1876P291J6080O423K0401L6729K8961L4639M2232K5199
12142E69720k5402n0147l6420n4932m4471l5516l5360k4725j6144j7909J279m834
12130B25139j6933M713K5851n780j6869k4066P03p854p600L147J2938N223k119
12117A96493M110L0078K0845l461l3j0395m111K6556M8503N2003P3392Q6309J17555
12104F37844J14295O2774J872p4852j18472j23015r4940n4497k5741l0859k5797
$$ y = [856268, 898988, 925626, 908645, 873813, 819192, 764369, 717570, 653742, 606900, 569498, 526955, 499342, 483701, 491665, 502548, 500221, 502108, 481669, 443041, 427191, 429287, 415300, 411260, 431367, 470432, 512117, 559933, 595581, 611647, 615003, 595971, 532758, 466643, 418977, 391258, 376342, 363641, 351765, 359056, 375136, 381559, 401960, 438689, 467650, 502289, 544521, 569720, 544318, 494171, 457751, 402819, 358348, 322832, 287472, 262747, 246603, 228694, 229973, 225139, 208206, 212919, 238770, 232990, 216121, 192055, 192758, 184904, 177304, 180451, 193389, 198612, 196493, 200603, 230681, 251526, 248065, 248032, 237637, 233526, 260082, 308585, 360588, 433980, 520289, 637844, 752139, 814913, 816785, 741933, 623461, 500446, 405506, 351009, 325268, 294409, 268612]
12093B68612p498J321k0534l4127j7078Q487j0518k5251p794j326l2248r354J9216
12080A31908q446j693q073j8772P811J0336N69J31k065J0362j0959J9353J7013
12067A47475L2315N4046N8322N0127M0091K4912n241m6846p4715m8652k4649l2690
12055A74495l7804k5201j1078J567j2638p933l66j7733j2175P992L843R028j942
12042G0055l504r30K171J1658J0248j5700k4945m080J0931j7037o762P4N496l971
12028C3704n440K831N910k325o20K3992R6j5730j411l603j533J2081l877N280
12014D9355O864n568J696N772p023j2135J733J2018J2675P194L777K673J1944
12001I0975L897J380m69M519M669L218M737J2945J1722Q796P748M219J237K4380
$$ y = [268612, 261114, 262435, 241901, 207774, 190696, 199183, 188665, 163414, 155620, 154294, 122046, 112692, 131908, 123462, 121769, 113696, 94924, 102735, 113071, 113640, 113771, 111706, 122068, 111109, 130462, 147475, 179790, 233836, 292158, 342285, 382376, 407288, 402047, 355201, 280486, 231834, 207185, 174495, 136691, 111490, 100412, 101979, 89341, 81408, 81042, 63309, 51134, 59126, 62969, 71997, 70055, 66551, 65621, 67792, 79450, 89698, 73998, 49053, 44973, 55904, 38867, 32105, 32179, 37675, 33704, 28264, 31095, 37005, 34680, 34060, 58052, 58148, 42418, 41007, 37404, 35871, 47952, 44075, 49355, 56219, 50651, 52347, 58119, 51096, 38961, 40694, 52712, 65387, 72581, 76358, 79031, 90975, 94872, 96252, 95783, 100302, 104971, 108189, 112926, 125871, 137593, 146389, 154137, 158356, 159593, 183973]
11987A83973K5614J5723K4153J0195O703r344j0403O267K4261k69J1403J5118
11975C03394J1226O616n147j965p938m43Q775R01m847q041p457Q00p593K621m334
11960B86568q362k3807j134R556J3513J8924J0610o764R221K0883K4391K5963
11948C79562J1033J5431J2797J6726O358J6184M1774J1625L99R51J0728J388n834
11935E19122K4325J6884j9388j7076l438K1804j1710L157K61j3589l0132m002
11923D86218l20r590k8204l1334j7284k0224j1013k5943j2994J498j3084o301
11911C11425p212q403l847q891J357n387o07J5003P053j3075n092R393O274J062
11897B99053q569n654Q814J574k676P650L203j5438k1541J589J2038j4141K833
$$ y = [183973, 209587, 225310, 249463, 259658, 266361, 257017, 246614, 252881, 277142, 276873, 288276, 303394, 314620, 321236, 316089, 314124, 306186, 305743, 314518, 315419, 310572, 302531, 295074, 295874, 288281, 290902, 286568, 278206, 254399, 253265, 262821, 276334, 295258, 305868, 299104, 308325, 329208, 353599, 379562, 390595, 406026, 418823, 435549, 441907, 458091, 499865, 511490, 511889, 512840, 523568, 524956, 519122, 543447, 560331, 540943, 523867, 520429, 542233, 530523, 533680, 533941, 520352, 490220, 486218, 485898, 476308, 448104, 416770, 399486, 379262, 368249, 342306, 329312, 330810, 317726, 311425, 304213, 295810, 291963, 283072, 284429, 279042, 278435, 293438, 300491, 287416, 282324, 291717, 297991, 299053, 290484, 284830, 293644, 295218, 292542, 300192, 303395, 287957, 266416, 268005, 280043, 265902, 268735]
11884B68735j882o561j5856k9340k3137k3532o227q814o821m82M810j2913j720
$$ y = [268735, 266853, 260292, 244436, 215096, 191959, 168427, 162200, 153386, 146565, 146083, 150893, 137980, 136260]
$$ [...]
##END NTUPLES=NMR SPECTRUM
##END=
