##TITLE=Analysis number 324500
Compound Code km 10095
Project Code adrs
Chemist Name ians
##JCAMPDX= 6.0         $$ Bruker NMR JCAMP-DX V2.0
##DATA TYPE= NMR SPECTRUM
##DATA CLASS= NTUPLES
##ORIGIN= Bruker BioSpin GmbH
##OWNER= nmr
$$ XWIN-NMR		Version 3.5
$$ Thu Nov 23 14:39:56 2006 GMT Standard Time (UT+0h)  MAYBRIDGE\nmr@NMR_250MHZ
##.OBSERVE FREQUENCY= 250.131544655141
##.OBSERVE NUCLEUS= ^1H
##.ACQUISITION MODE= SIMULTANEOUS (DQD)
##.ACQUISITION SCHEME= undefined
##.AVERAGES= 16
##.DIGITISER RES= 18
##SPECTROMETER/DATA SYSTEM= dpx250
##.PULSE SEQUENCE= zg30
##.SOLVENT NAME= DMSO
##.SHIFT REFERENCE= (INTERNAL, DMSO, 0, 16.522)
##AUDIT TRAIL= $$ (NUMBER, WHEN, WHO, WHERE, WHAT)
$$ ##TITLE= Audit trail, XWIN-NMR		Version 3.5
$$ ##JCAMPDX= 5.01
$$ ##ORIGIN= Bruker BioSpin GmbH
$$ ##OWNER= nmr
$$ C:\u/data/dgb/nmr/ADRS/930/pdata/1/auditp.txt
$$ ##AUDIT TRAIL=  $$ (NUMBER, WHEN, WHO, WHERE, WHAT)
(   1,<2006-11-23 14:39:14.20 +000>,<MAYBRIDGE\nmr>,<NMR_250MHZ>,
      <created by zg, POWCHK disabled, PULCHK disabled
       configuration hash MD5:
       49 4B E0 1D 92 C2 6B 37 9F E6 65 BC 52 41 86 1D
       data hash MD5: 64K
       04 1C DC 71 C0 8C 6E 6C 60 A9 48 57 B7 15 AE C0>)
(   2,<2006-11-23 14:39:33.62 +000>,<MAYBRIDGE\nmr>,<NMR_250MHZ>,
      <Start of raw data processing
       ef LB = 0.3 FT_mod = 6 PKNL = 1 SI = 32K 
       data hash MD5: 32K
       75 7B C7 42 26 04 71 D2 71 95 C5 8A 1D 58 9B 3B>)
(   3,<2006-11-23 14:39:38.65 +000>,<MAYBRIDGE\nmr>,<NMR_250MHZ>,
      <apk 
       data hash MD5: 32K
       6B 32 2F E8 E7 55 A1 91 EE BF 16 29 E9 5F 9F 93>)
(   4,<2006-11-23 14:39:40.15 +000>,<MAYBRIDGE\nmr>,<NMR_250MHZ>,
      <abs ABSG = 5 
       data hash MD5: 32K
       2B 84 4F 44 A9 21 F8 AF 4D CF 75 5C 4E 4D F7 9A>)
$$ ##END=
$$ 
$$ hash MD5
$$ 49 C6 02 2A 81 46 9F 98 C0 07 7B 64 0C A8 F2 4B
##$RELAX= 
##$RELAX= 
##$RELAX= 
##$RELAX= 
##$RELAX= 
##$RELAX= 
##$RELAX= 
$$ Bruker specific parameters
$$ --------------------------
##$DU= <C:\u>
##$EXPNO= 930
##$NAME= <ADRS>
##$PROCNO= 1
##$TYPE= <nmr>
##$USER= <dgb>
##$AMP= (0..31)
100 100 100 100 100 100 100 100 100 100 100 100 100 100 100 100 100 100 
100 100 100 100 100 100 100 100 100 100 100 100 100 100 
##$AQSEQ= 0
##$AQ_mod= 3
##$AUNM= <au_zg>
##$AUTOPOS= <13 >
##$BF1= 250.13
##$BF2= 250.13
##$BF3= 250.13
##$BF4= 250.13
##$BF5= 500.13
##$BF6= 500.13
##$BF7= 500.13
##$BF8= 500.13
##$BYTORDA= 1
##$CFDGTYP= 0
##$CFRGTYP= 5
##$CHEMSTR= <none>
##$CNST= (0..31)
1 1 145 1 1 1 1 1 1 1 1 1 1 1 1 1 1 1 1 1 1 1 1 1 1 1 1 1 1 1 1 1 
##$CPDPRG= <>
##$CPDPRG1= <>
##$CPDPRG2= <>
##$CPDPRG3= <>
##$CPDPRG4= <mlev>
##$CPDPRG5= <mlev>
##$CPDPRG6= <mlev>
##$CPDPRG7= <mlev>
##$CPDPRG8= <mlev>
##$CPDPRGB= <>
##$CPDPRGT= <>
##$D= (0..31)
0 1 0 0 0 0 0 0 0 0.06 0 0 0 0 0 0 0.0002 0 0 0 0 0 0 0 0 0 0 0 0 0 0 
0 
##$DATE= 1164292751
##$DBL= (0..7)
120 120 120 120 120 120 120 120 
##$DBP= (0..7)
150 150 150 150 150 150 150 150 
##$DBP07= 0
##$DBPNAM0= <>
##$DBPNAM1= <>
##$DBPNAM2= <>
##$DBPNAM3= <>
$$ [...]
##$SUBNAM7= <"">
##$SUBNAM8= <"">
##$SUBNAM9= <"">
##$SW= 20.6930455092707
##$SWIBOX= (0..15)
0 0 3 0 0 0 0 0 0 0 0 0 0 0 0 0 
##$SW_h= 5175.983436853
##$TD= 65536
##$TD0= 1
##$TE= 683.16
##$TE2= 300
##$TE3= 300
##$TEG= 300
##$TL= (0..7)
0 120 120 120 120 120 120 120 
##$TP= (0..7)
150 150 150 150 150 150 150 150 
##$TP07= 0
##$TPNAME0= <>
##$TPNAME1= <>
##$TPNAME2= <>
##$TPNAME3= <>
##$TPNAME4= <>
##$TPNAME5= <>
##$TPNAME6= <>
##$TPNAME7= <>
##$TPOAL= (0..7)
0.5 0.5 0.5 0.5 0.5 0.5 0.5 0.5 
##$TPOFFS= (0..7)
0 0 0 0 0 0 0 0 
##$TUNHIN= 0
##$TUNHOUT= 0
##$TUNXOUT= 0
##$USERA1= <user>
##$USERA2= <user>
##$USERA3= <user>
##$USERA4= <user>
##$USERA5= <user>
##$V9= 5
##$VALIST= <valist>
##$VCLIST= <CCCCCCCCCCCCCCC>
##$VD= 0
##$VDLIST= <DDDDDDDDDDDDDDD>
##$VPLIST= <PPPPPPPPPPPPPPP>
##$VTLIST= <TTTTTTTTTTTTTTT>
##$WBST= 1024
##$WBSW= 4
##$XGAIN= (0..3)
0 0 0 0 
##$XL= 0
##$YL= 0
##$YMAX_a= 408886
##$YMIN_a= -288202
##$ZGOPTNS= <>
##$ZL1= 120
##$ZL2= 120
##$ZL3= 120
##$ZL4= 120
##$ABSF1= 16.522
##$ABSF2= -4.171173
##$ABSG= 5
##$ABSL= 3
##$ALPHA= 0
##$AQORDER= 0
##$ASSFAC= 0
##$ASSFACI= 0
##$ASSFACX= 0
##$ASSWID= 0
##$AUNMP= <proc_1d>
##$AZFE= 0.1
##$AZFW= 0.1
##$BCFW= 0
##$BC_mod= 0
##$BYTORDP= 0
##$COROFFS= 0
##$CY= 12.5
##$DATMOD= 1
##$DC= 0
##$DFILT= <>
##$DTYPP= 0
##$F1P= 14.0000005364418
##$F2P= -0.99999901652339
##$FCOR= 0.5
##$FTSIZE= 32768
##$FT_mod= 6
##$GAMMA= 0
##$GB= 0
##$INTBC= 1
##$INTSCL= 1
##$ISEN= 128
##$LB= 0.3
##$LEV0= 0
##$LPBIN= 0
##$MAXI= 10000
##$MC2= 0
##$MEAN= 0
##$ME_mod= 0
##$MI= 0
##$NCOEF= 0
##$NC_proc= -5
##$NLEV= 6
##$NOISF1= 0
##$NOISF2= 0
##$NSP= 0
##$NTH_PI= 0
##$NZP= 0
##$OFFSET= 16.522
##$PC= 1
##$PHC0= -45.0436
##$PHC1= 3.633411
##$PH_mod= 1
##$PKNL= yes
##$PPARMOD= 0
##$PSCAL= 4
##$PSIGN= 0
##$REVERSE= no
##$SF= 250.13
##$SI= 32768
##$SIGF1= 0
##$SIGF2= 0
##$SINO= 400
##$SIOLD= 32768
##$SREGLST= <1H.DMSO>
##$SSB= 0
##$STSI= 32768
##$STSR= 0
##$SW_p= 5175.98343685301
##$SYMM= 0
##$S_DEV= 0
##$TDeff= 65536
##$TDoff= 0
##$TI= <Analysis number 999999
Compound Code 99
Book Reference 9
Project Code 9>
##$TILT= no
##$TM1= 0
##$TM2= 0
##$TOPLEV= 0
##$USERP1= <user>
##$USERP2= <user>
##$USERP3= <user>
##$USERP4= <user>
##$USERP5= <user>
##$WDW= 1
##$XDIM= 32768
##$YMAX_p= 533003932
##$YMIN_p= -594148
$$ End of Bruker specific parameters
$$ ---------------------------------
##NTUPLES= NMR SPECTRUM
##VAR_NAME=  FREQUENCY,     SPECTRUM/REAL,   SPECTRUM/IMAG
##SYMBOL=    X,             R,               I
##VAR_TYPE=  INDEPENDENT,   DEPENDENT,       DEPENDENT
##VAR_FORM=  AFFN,          ASDF,            ASDF
##VAR_DIM=   32768,         32768,           32768
##UNITS=     HZ,            ARBITRARY UNITS, ARBITRARY UNITS
##FACTOR=    0.157963299565203, 1,           1
##FIRST=     4132.6476996994, 0,             0
##LAST=      -1043.33573715361, 0,           0
##MIN=       -1043.33573715361, -594148,     0
##MAX=       4132.6476996994, 533003932,     0
$$ Real data points
##PAGE= N=1
##DATA TABLE= (X++(R..R)), XYDATA
$$ [...]
17090f6036j61844o760R1762k4283R9178Q816q4886j69145j8878R5131O6530M4360
$$ -66036 -227880 -234640 -142878 -167161 -67983 -59167 -144053 -313198 -332076 -236945 -170415 -126055
17078a26055M5820O4448n729O4975m8409k14031K7747K26757l645o3697o0176
$$ -126055 -80235 -15787 -21516 43459 -4950 -218981 -191234 35523 31878 -31819 -91995
17067i1995J51074n7115j80182L7925O1243J4478J88747j08408j88184L6798J18676
$$ -91995 59079 1964 -178218 -140293 -79050 -64572 124175 15767 -172417 -135619 -16943
17056a6943R2676J83284j31810j42442r3778J913J53893p3389j06681j31571p7554
$$ -16943 75733 259017 127207 -15235 -109013 -107100 46793 -26596 -133277 -264848 -342402
17045c42402M9551J33058q407J67822q0946k52953Q0983K7736p0005l1563K08609
$$ -342402 -292851 -159793 -168200 -378 -81324 -334277 -253294 -225558 -295563 -327126 -118517
17034a18517J08455j9234p3722n8845J9326k0164J19903J10557J00363j49140
$$ -118517 -10062 -29296 -103018 -161863 -142537 -162701 -42798 67759 168122 18982
17024A8982j9070n029P2071K4091m3576j30372n1746J29865J00479L737j02674
$$ 18982 -88 -5117 66954 91045 47469 -82903 -134649 -4784 95695 99432 -3242
17013c242n4203J7516M7650J66379o6378j2915J0190j53551R845L1567o7742k4995
$$ -3242 -57445 -39929 7721 174100 107722 94807 104997 -48554 -38709 -7142 -74884 -99879
17001i9879J38564L897l7600k21130M0782N6076K25347J24185j05210q1911j58147
$$ -99879 38685 42582 4982 -216148 -175366 -119290 106057 230242 125032 43121 -115026
16990a15026l3773N3129m039o4544J2610K839J31882j05399J4099p4054o732K13370
$$ -115026 -148799 -95670 -99709 -164253 -151643 -148804 -16922 -122321 -108222 -182276 -189008 24362
16978B4362J38184j10025j91472N8379J25295o1067j43117K03952R8075l3520
$$ 24362 162546 52521 -138951 -80572 44723 -16344 -159461 44491 142566 109046
16968A09046J7517n5154j85982j3393Q5204O4966L7126J8416J9790m7569k0978
$$ 109046 126563 71409 -114573 -127966 -42762 22204 59330 77746 97536 49967 28989
16957B8989k2846M5373j30901K0034q8008P4082K9305J5045k41448j9606K30403
$$ 28989 6143 51516 -79385 -59351 -147359 -73277 -43972 -28927 -270375 -289981 -59578
16946e9578J9613n4709o1237P6752K1360o2286l4925n9256M3391J86416J0325
$$ -59578 -39965 -94674 -155911 -79159 -57799 -120085 -155010 -214266 -170875 15541 25866
16935B5866q4678Q9622O0053j35376o8715K3908j61516q4353O5056M6429J9073
$$ 25866 -58812 30810 90863 -44513 -113228 -89320 -250836 -335189 -270133 -223704 -204631
16924b04631Q7007J27326j09985m5208J58074N2533r5958J04578p4133l7955L9923
$$ -204631 -117624 9702 -100283 -145491 12583 65116 -30842 73736 -397 -38352 1571
16913A571J21675k6061q0235j52854n460L8054J05564O2670m4091j17749l8826
$$ 1571 123246 97185 16950 -135904 -141364 -103310 2254 64924 20833 -96916 -135742
16902a35742p5045K04009P7727R9094O3397j81888j51457r943J0478k981J04438
$$ -135742 -210787 -6778 70949 170043 233440 51552 -99905 -109848 -99370 -102351 2087
16891B087j2615o8941O5010Q7483j33396K992r8246k6520N8706J63561K1451o1258
$$ 2087 -10528 -79469 -14459 73024 -60372 -57380 -155626 -182146 -123440 40121 61572 314
16879C14M4649J82283J26876j26848L860j7864j20735k06524m9341l1437K01809
$$ 314 44963 227246 354122 227274 231134 213270 92535 -113989 -163330 -194767 7042
16868G042j01132Q4235K52204L7133k4336j40193j33180P0685k25050j72422Q3491
$$ 7042 -94090 -9855 242349 279482 255146 114953 -18227 52458 -172592 -345014 -261523
16857b61523L2203K32235m8685j29154J7154M9353l9703J06314O3286l3323m5151
$$ -261523 -229320 2915 -45770 -174924 -157770 -108417 -148120 -41806 21480 -11843 -56994
16846e6994N216k7437N6486N3220j50587p6300K0781M6213J86494J01745o6993
$$ -56994 -51778 -79215 -22729 30491 -120096 -196396 -175615 -129402 57092 158837 91844
16835I1844k9556J11018n0154j63322j73317L3664q9042j00853J4159J16952L437
$$ 91844 62288 173306 123152 -40170 -213487 -179823 -268865 -369718 -355559 -238607 -235170
16824b35170Q0895J05794K5842n5754M3459J11862k3432j72866q139O4929k220
$$ -235170 -154275 -48481 -22639 -78393 -34934 76928 53496 -119370 -127509 -62580 -64800
16813f4800P9016K24933R4073o2915j18452P002o4174k11656k8453R2597J9681
$$ -64800 14216 239149 333222 270307 151855 158857 94683 -116973 -145426 -52829 -33148
16802c3148q5976p5916r422P7900k6844R0631N1031J27619k5314j89248r8268
$$ -33148 -119124 -195040 -204462 -126562 -153406 -62775 -11744 115875 90561 -98687 -196955
16791a96955O9717j4076q1308m5657j16581o9201J59022P8902K58433J48359j75300
$$ -196955 -127238 -141314 -222622 -268279 -384860 -454061 -295039 -216137 42296 190655 15355
16780A5355k28934j15628O617J52140P3149P023P3052R6084n861P4639J39108
$$ 15355 -213579 -329207 -322590 -170450 -97301 -90278 -17226 78858 72997 147636 286744
16769B86744r740q1942q9008r875J370j93531j96795R8001O4378Q1713J64773
$$ 286744 277004 195062 106054 96179 97549 -95982 -292777 -194776 -130398 -48685 116088
16758A16088M2511o198j5617n4926o0900j37933j08069q599j07197m042J00756
$$ 116088 158599 152401 136784 81858 20958 -116975 -225044 -233643 -340840 -344882 -244126
16747b44126J96320J6709q7672k1562J51584J80515j76355k78886L8459J72602
$$ -244126 -47806 -31097 -118769 -140331 11253 191768 15413 -263473 -225014 -52412
16737e2412R4985m7950M0889J18395L034j56700m4309J4881J13989O578m3376
$$ -52412 42573 -5377 35512 153907 156941 241 -44068 -29187 84802 91380 48004
16726D8004J46946k8177j89120J1904P306l093O3420q1659q3892o4531J7721l2360
$$ 48004 194950 166773 -22347 -10443 -3137 -6230 57190 -24469 -108361 -172892 -155171 -187531
16714a87531J02909p0491J37703N3579j47856r3922n030J9412n774k5284J83771
$$ -187531 -84622 -155113 -17410 36169 -111687 -205609 -210639 -191227 -197001 -222285 -38514
16703c8514O1124r7177l6381k2329p6827l912r6669J0169K08449J06017K1810
$$ -38514 22610 -74567 -110948 -133277 -210104 -214016 -310685 -300516 -92067 13950 35760
16692C5760j07410L80r8289j24347P6341L2393K20841L7814r3179j4051m4338
$$ 35760 -71650 -71270 -169559 -293906 -217565 -185172 35669 73483 -19696 -33747 -78085
16681g8085J06784J11765q4445k55696j54285K14568j3619q1535P014r1344Q9975
$$ -78085 28699 140464 56019 -199677 -353962 -139394 -153013 -234548 -227534 -318878 -228903
16670b28903M0041J03678O9885O769m4118j47746R3658J49139j28565m8894J56282
$$ -228903 -188862 -85184 -15299 -8530 -52648 -200394 -106736 42403 -86162 -135056 21226
16659B1226j4839k48509n1783J07877R5306p4377k35619r38J33155P1590k6701
$$ 21226 6387 -242122 -293905 -186028 -90722 -165099 -400718 -401656 -268501 -196911 -223612
16648b23612q9184Q1790P1804J24761k6735j03114M907j6872n4024O8339J31994
$$ -223612 -312796 -231006 -159202 -34441 -61176 -164290 -159383 -176255 -230279 -161940 -29946
16637b9946k1338q7599L99j17797j19920J36509J12463o5463K9089J19720q5820
$$ -29946 -51284 -138883 -138484 -256281 -376201 -239692 -127229 -192692 -163603 -43883 -129703
16626a29703j05057r512l3376N1428o7076j03352J7489K13889Q7613l5190J03738
$$ -129703 -234760 -244272 -277648 -226220 -293296 -396648 -379159 -165270 -77657 -112847 -9109
16615i109Q394J62748j76850K2264P1200o1049l7773j07903N9996q2634r7558
$$ -9109 -715 162033 -14817 7447 78647 17598 -20175 -128078 -68082 -150716 -248274
16604b48274O2381j9388l6656j04165j3534n8504K11588K5582N1416J09481j20273
$$ -248274 -185893 -205281 -241937 -346102 -359636 -418140 -206552 -180970 -129554 -20073 -140346
16593a40346L8075M9968M6288n1132j62573m8206J41654J85470J4353r1101j27675
$$ -140346 -102271 -52303 -6015 -57147 -219720 -267926 -126272 59198 73551 -17550 -145225
16582a45225J5027M1066J04408n1642o9110J42948L0387j60567k95204m4269P4455
$$ -145225 -130198 -89132 15276 -36366 -105476 37472 67859 -92708 -387912 -432181 -357726
16571c57726q0451J41487m9945n4400K80780L6676j28176l2600J72562J15978
$$ -357726 -438177 -296690 -346635 -401035 -120255 -83579 -211755 -244355 -71793 44185
16561D4185M8492j28623p0342j8653j1547Q0115M3101K32172r1991j60022J12264
$$ 44185 92677 -35946 -106288 -124941 -136488 -56373 -13272 218900 126909 -33113 79151
16550G9151J14396j89095J0027J01918q6946O4121j56803M722n7590j9846P9781
$$ 79151 193547 4452 14479 116397 29451 93572 -63231 -58509 -116099 -135945 -56164
16539e6164J45965j07665l2241J15241j02950K1642J00131M578O2393L2342j21231
$$ -56164 89801 -17864 -50105 65136 -37814 -16172 83959 88537 150930 183272 62041
16528F2041j26414p5970N7622J70939m5381j58993K3913Q544m9026J51573R5393
$$ 62041 -64373 -140343 -82721 88218 42837 -116156 -92243 -83699 -132725 18848 114241
16517A14241N1013q8853j8434m4697k9968K6379N6424K0785p2429k1323J7833
$$ 114241 165254 76401 57967 13270 -16698 9681 66105 86890 14461 -6862 10971
16506A0971o3879j90414j35576J61105N5092p1459J20679Q6906J45851J32043
$$ 10971 -52908 -243322 -378898 -217793 -162701 -234160 -113481 -26575 119276 251319
16496B51319R126j08471j66065j74378j34683L4434J52045r9644K3531M4658Q3607
$$ 251319 260445 151974 -14091 -188469 -323152 -288718 -136673 -236317 -212786 -168128 -84521
16485h4521Q9123K4034j6049N2409p3734j21006J04655J14293P2463J16540o2314
$$ -84521 4602 28636 12587 64996 -8738 -129744 -25089 89204 161667 278207 215893
16474B15893m4161q7665n0220K1634j79995r9218O5541J50351Q412M7374m8130
$$ 215893 171732 84067 33847 55481 -124514 -223732 -158191 -7840 572 47946 -184
16463a84l9367q4125L5419j2790J41247M085Q9484J5418j01072j64544j29561
$$ -184 -39551 -123676 -88257 -101047 40200 44285 133769 149187 48115 -116429 -245990
16452b45990P3064K65441P7898J43548J6661j21081j48451K7531n2156n5213j01117
$$ -245990 -172926 92515 170413 313961 330622 209541 61090 88621 36465 -18748 -119865
16441a19865j12341L8005J11755k4843j10981O7582j4743R0623M9447P0180m2292
$$ -119865 -232206 -194201 -82446 -107289 -218270 -150688 -165431 -74808 -25361 44819 2527
16430B527M5807O4163p3894o86j07487j6740J2208o1740J26602n747j6256j40781
$$ 2527 48334 112497 38603 37917 -69570 -86310 -74102 -135842 -9240 -14987 -31243 -172024
16418a72024j29554R9994K36258j35810j52721J75499J74280k7783p7585J89645
$$ -172024 -301578 -201584 34674 -101136 -253857 -78358 95922 68139 -9446 180199
16408A80199J35701j83889l7119k4452n2637m2804p8773K8956J85863O5374j35350
$$ 180199 315900 132011 94892 70440 17803 -25001 -103774 -74818 111045 176419 41069
16397D1069K6599o9133l8175j60631q6513L319J24883j1616j15797O7887l6426
$$ 41069 67668 -1465 -39640 -200271 -286784 -283465 -158582 -170198 -285995 -218108 -254534
16386b54534J4409P3317M0695J50567j24987k7653Q6245N4484n3611m5291O2587
$$ -254534 -240125 -166808 -126113 24454 -100533 -128186 -41941 12543 -41068 -86359 -23772
16375b3772K28393q7089J8604P508j95385j18689K2752p0671r0662J68597J10765
$$ -23772 204621 117532 136136 143644 -51741 -170430 -147678 -218349 -309011 -140414 -29649
16364b9649l490r0298n5405j9917J10613J21974q4016J34430L1514m9375J10813
$$ -29649 -33139 -123437 -178842 -198759 -88146 33828 -50188 84242 115756 66381 177194
16353A77194J4962j00699j27345q5864M6067K4812p9904m8409L2788L0004k5117
$$ 177194 192156 91457 -35888 -121752 -75685 -50873 -130777 -179186 -146398 -116394 -141511
16342a41511L7230o8773j9680K37356j00079j71225o8858p2820l1526j18715J69670
$$ -141511 -104281 -173054 -192734 44622 -55457 -226682 -295540 -368360 -399886 -518601 -348931
16331c48931J29983l3937K4078Q0495P6637k6283q7778r6215J4669N7773L0902
$$ -348931 -218948 -252885 -228807 -148312 -71675 -97958 -185736 -281951 -267282 -209509 -178607
16320a78607m7495l9543r4907N5692J32465j8687k208K9270J06789J699j30348
$$ -178607 -226102 -265645 -360552 -304860 -172395 -191082 -193290 -164020 -57231 -55532 -185880
16309a85880L9000L722j9829J06508O2376J8183k5074j0305q2580p3234J3971
$$ -185880 -146880 -143158 -162987 -56479 5897 24080 -994 -11299 -93879 -167113 -153142
16298a53142N2751J45017J114o4805r5104R8322n43j18223J1124r411Q3568p2058
$$ -153142 -100391 44626 45740 -19065 -114169 -15847 -16390 -134613 -123489 -132900 -49332 -121390
16286a21390R1266j6163j5234L9430k1860r5358q4713j00541J48643O1220L9927
$$ -121390 -30124 -46287 -61521 -22091 -43951 -139309 -224022 -324563 -175920 -114700 -74773
16275g4773R109L5760o4391j35699p1362J37233L5992Q1252j8394k24671o2205
$$ -74773 -65664 -29904 -94295 -229994 -301356 -164123 -128131 -46879 -65273 -289944 -352149
16264c52149k9988Q5236N169J30351J27809J40769p3218j03175j24052O0501J00643
$$ -352149 -382137 -296901 -291732 -161381 -33572 107197 33979 -69196 -193248 -132747 -32104
16253c2104n9759M0914l834r167j00502L7273M7735n7691J23756p4594o1552M8033
$$ -32104 -91863 -50949 -54783 -63950 -164452 -127179 -79444 -137135 -13379 -87973 -149525 -101492
16241a01492k946j93204q7013J96079J4907l5216L5421J4457j8660l438N1335
$$ -101492 -104438 -297642 -384655 -188576 -173669 -208885 -173464 -159007 -177667 -181105 -129770
16230a29770j11791j71512J51317K08557n4108l1928P8676J65521j4805j68994
$$ -129770 -241561 -413073 -261756 -53199 -107307 -139235 -60559 104962 90157 -78837
16220g8837N5501M5098j09414q303J92673j2566P2606Q8538M304r4897j86013
$$ -78837 -23336 21762 -87652 -95955 96718 84152 156758 245296 249600 154703 -31310
16209c1310j24164q3362J13736K18681J37643j47996j19207p7043o0264M5072
$$ -31310 -155474 -238836 -125100 93581 231224 83228 -35979 -113022 -173286 -128214
16199a28214K36278R470n0820J08057l0604l4186k7185Q8944j22373N9008J21773
$$ -128214 108064 117534 66714 174771 144167 109981 82796 171740 49367 108375 230148
16188B30148l2322Q045k69057l97824R676J99593O2666j45436O3107P2315o1895
$$ 230148 197826 205871 -63186 -461010 -451334 -251741 -189075 -334511 -271404 -199089 -260984
16177b60984N2843M4372R6477r067r0737J33434J49485K3846j53257J4497J65120
$$ -260984 -208141 -163769 -67292 -76359 -167096 -33662 115823 139669 -13588 909 166029
16166A66029M9644l4702j05693j6253J86888J30098O291j84867j88155P261M7216
$$ 166029 215673 180971 75278 59025 245913 376011 382302 197435 9280 16541 63757
16155F3757J0357L8594p887j06449q052J68893P7305j17172m5304P6973M306p3242
$$ 63757 74114 112708 104821 -1628 -9680 159213 236518 119346 74042 151015 155321 82079
16143H2079l8434l4667O4149o2182p6258j64821j65244O5909N7695J03924K82281
$$ 82079 43645 8978 73127 10945 -65313 -230134 -395378 -329469 -271774 -167850 114431
16132A14431Q0195k41720n5783L0073j19712K85389L38217j03517j31916j90362
$$ 114431 194626 -47094 -102877 -72804 -192516 92873 431090 327573 195657 5295
16122E295q4822J51544M641o1473P4288J50131O81k41763L149p4263P82j8151
$$ 5295 -79527 72017 76658 15185 89473 239604 240285 -1478 1671 -72592 -71810 -89961
16110h9961m8037o3093O4003Q1243o9422J40209K42222k3698j33143r6667p1979
$$ -89961 -137998 -201091 -137088 -55845 -125267 14942 257164 233466 100323 3656 -68323
16099f8323j9995K1327K3784k9829M7046K1946j4079K530j05520J92782R7582
$$ -68323 -88318 -66991 -43207 -73036 -25990 -4044 -18123 -15593 -121113 71669 169251
16088A69251m4866j33947m5426j59497N5199L0779m3090Q296J32471J43701L5692
$$ 169251 124385 -9562 -54988 -214485 -159286 -128507 -171597 -163301 -30830 112871 148563
16077A48563k86o7949j22093m0179j19496Q3843K7866j1256j44985p4128N1956
$$ 148563 148277 80328 -41765 -81944 -201440 -117597 -89731 -100987 -245972 -320100 -268144
16066b68144L8550J7973J28710p2135O4871J57702l6575k4004J9957J1803q2821
$$ -268144 -229594 -211621 -82911 -155046 -90175 67527 30952 6948 26905 38708 -44113
16055d4113r4831J82300n9270k8893q9885j94931L930J47750J71166J1779p6043
$$ -44113 -138944 43356 -15914 -44807 -134692 -329623 -325693 -177943 -6777 5002 -71041
16044g1041K5428j9159K2847j44124j42558L7898J83877j18432n7951o7314J67854
$$ -71041 -45613 -64772 -41925 -186049 -328607 -290709 -106832 -225264 -283215 -350529 -182675
16033a82675J80296j55820j71119l3948J42988J8527O4894J12561m932j92431
$$ -182675 -2379 -158199 -329318 -363266 -220278 -201751 -136857 -24296 -29228 -221659
16023b21659j17135m2317J06468J21994J2306J94360J60552j62106n195k2560
$$ -221659 -338794 -381111 -274643 -152649 -140343 54017 214569 52463 47268 24708
16013B4708j31459l0575j9231N2732J17890o6197j53192J5224j9213J55175J38802
$$ 24708 -106751 -137326 -156557 -103825 14065 -52132 -205324 -190100 -209313 -54138 84664
16002H4664L8743o9291l4340K3357K3802k6330P4448j42346j02974m7240J7973
$$ 84664 123407 54116 19776 43133 66935 40605 115053 -27293 -130267 -177507 -159534
15991a59534P8339o8422k2166j20349P6283J25252L0699o5523j4833O4200L0590
$$ -159534 -81195 -149617 -171783 -292132 -215849 -90597 -59898 -125421 -140254 -76054 -45464
15980d5464J57058J08327l2980O1933q6091j2384M9027j21430L2937K5358M6572
$$ -45464 111594 219921 186941 248874 162783 150399 199426 77996 110933 136291 182863
15969A82863j42019j27104n0835j36184n5588Q8820J07803j56202o0208j2065
$$ 182863 40844 -86260 -137095 -273279 -328867 -240047 -132244 -288446 -348654 -360719
15959c60719M1871k9050J89137j02661O069J40054P0154j1445o44l8311r3001
$$ -360719 -318848 -347898 -158761 -261422 -255353 -115299 -45145 -56590 -57234 -95545 -188546
15948a88546j51332o6309R7289J01480j51876k3085K03114L9570j38162m4059
$$ -188546 -339878 -406187 -308898 -207418 -359294 -382379 -179265 -139695 -277857 -321916
15938c21916J78697M8954j2538m8715K1278p8449L2964n645j2265J29149k888
$$ -321916 -143219 -94265 -106803 -155518 -134240 -212689 -179725 -185370 -197635 -68486 -71374
15927g1374J01353O8749m7799K2267J30841O4292k90052j30678J00396L8495M5852
$$ -71374 29979 98728 50929 73196 204037 268329 -21723 -152401 -52005 -13510 32342
15916C2342j39303n7111k352O9546L2559Q4073p8865J1492P1452L0895J01238
$$ 32342 -106961 -164072 -166424 -96878 -64319 19754 -59111 -47619 23833 54728 155966
15905A55966K8713n2497r1797j61055k4949J04370R2446j74782j0004R4732P2882
$$ 155966 184679 132182 40385 -120670 -145619 -41249 51197 -123585 -133589 -38857 34025
15894C4025N0275k1007o7235P2968j57157j83232O0147M3729j01936L8274J99054
$$ 34025 84300 63293 -3942 69026 -88131 -271363 -211216 -167487 -269423 -231149 -32095
15883c2095J6278l0943p1360m5897o3242Q9271J23795M2174P7566k07568k66051
$$ -32095 -15817 -46760 -118120 -164017 -227259 -137988 -14193 27981 105547 -102021 -368072
15872c68072L2016l1882j2110p5572L6739J94617J92773J31463l5560j23660R334
$$ -368072 -336056 -367938 -380048 -455620 -418881 -224264 -31491 99972 64412 -59248 -49914
15861d9914O0230j1575r8748r9694P9927L17739J7495j58992q4816Q5621J2220
$$ -49914 10316 -1259 -100007 -199701 -119774 197965 215460 56468 -28348 57273 69493
15850F9493r8801K1757k7040m92J01306j04016j48577P0108J03110O0598j61998
$$ 69493 -29308 -7551 -34591 -35083 66223 -37793 -186370 -116262 -13152 47446 -114552
15839a14552q2954k5465J24170p662J14611l8006p6434R4258P3806j6736n1435
$$ -114552 -197506 -222971 -98801 -106463 8148 -29858 -106292 -12034 61772 45036 -6399
15828f399o7938k124n8227l2270J6242J57743p819m7134k13363P2044K13317L2227
$$ -6399 -74337 -76461 -134688 -166958 -150716 7027 -792 -47926 -261289 -189245 24072 56299
15816E6299M525j00063k9603j44393m5301J49191J80317p8720j07842j40993j15804
$$ 56299 60824 -39239 -68842 -213235 -258536 -109345 70972 -7748 -115590 -256583 -372387
15805c72387O4894J62797j6302o6855j7024J43702m5718l3816j26183Q5482J51683
$$ -372387 -307493 -144696 -160998 -227853 -244877 -101175 -146893 -180709 -306892 -221410 -69727
15794f9727K11337j02250J167Q5676J19010O8399k1312j62881k5201j4138l5251
$$ -69727 141610 39360 40527 126203 245213 313612 292300 129419 104218 90080 54829
15783E4829M190M3510m3909J13818o5979j45800K9626K02258L4194R9346j3658
$$ 54829 59019 102529 58620 172438 106459 -39341 -9715 192543 226737 326083 312425
15772C12425j3481l1709k32518k77345j35472K25468J93096J12648m7310O7199
$$ 312425 298944 267235 34717 -242628 -378100 -152632 40464 153112 105802 173001
15762A73001Q9379K58202K16620n7468K0342n2639j01089k58177k75108j55464
$$ 173001 262380 520582 737202 679734 700076 647437 546348 288171 13063 -142401
15752a42401j7586j5689R2253L2981o0446O3425J91560Q9672L4458k24762j02801
$$ -142401 -159987 -175676 -83423 -50442 -110888 -47463 144097 233769 268227 43465 -59336
15741e9336O1402R1503r6784k7862j34094p353J10996m7047j61622r965J66724
$$ -59336 2066 93569 -3215 -31077 -165171 -172524 -61528 -108575 -270197 -280162 -113438
15730a13438J06868j6825j38490K3650J34890j7174q8579q5315m6925J98315O0209
$$ -113438 -6570 -23395 -161885 -138235 -3345 -20519 -109098 -194413 -241338 -43023 17186
15719A7186r5249J29966n7902j22766n4983J3895M0552K48748J03474P5657j18800
$$ 17186 -78063 51903 -5999 -128765 -183748 -169853 -129301 119447 222921 298578 179778
15708A79778r73m5287j80727j52766j16362K2045N3985j1411j3711J3416J09980
$$ 179778 178805 133518 -47209 -199975 -316337 -294292 -240307 -251718 -265429 -252013 -142033
15697a42033R5217R7150P19j19825R2140j86836j82467p8666J18607K0332J50187
$$ -142033 -46816 50334 51053 -68772 23368 -163468 -345935 -424601 -305994 -285662 -135475
15686a35475P1255l6248j7993L8691Q004n4010J21034L662l979N9669J30782j53212
$$ -135475 -64220 -100468 -118461 -79770 -71766 -125776 -4742 -1080 -5059 54610 185392 32180
15674C2180j72813Q475m6169P5186M6110L3576P178R3661L2421j49730J971n8009
$$ 32180 -140633 -132158 -178327 -103141 -57031 -23455 -16277 77384 109805 -39925 -37954 -95963
15662i5963j16949J42872N9851r7799J6068l8113l2391K4314j0202r0938l1317
$$ -95963 -212912 -70040 -10189 -107988 -91920 -130033 -162424 -138110 -148312 -239250 -270567
15651b70567K02699L09900l8419M3641J87329m7424l9212j16190j90144p2898
$$ -270567 -67868 242032 203613 247254 434583 387159 347947 231757 41613 -31285
15641c1285N6683m2002k64319j75554M3569K47471l9996O3791l0998L0110k1175
$$ -31285 25398 -16604 -280923 -456477 -412908 -165437 -205433 -141642 -172640 -142530 -163705
15630a63705M3692J7344r6128l367N3733o7809J71469J09972j03580j5703o8318
$$ -163705 -120013 -102669 -198797 -202164 -148431 -216240 -44771 65201 -38379 -54082 -122400
15619a22400m0459J01184K8864r91L4092m15j3108r4701m4304R2559K11430J10289
$$ -122400 -162859 -61675 -32811 -33802 290 -125 -13233 -107934 -152238 -59679 151751 262040
15607B62040r9237p4516j27439n0414Q6710j52941R135M6135n8691M785J10221
$$ 262040 162803 88287 -39152 -89566 -2856 -155797 -146662 -100527 -159218 -154433 -44212
15596d4212R6670j1463j0623j0515K8777m9393M5589N4937l7374n9499j48966
$$ -44212 52458 40995 30372 19857 48634 -759 44830 99767 62393 2894 -146072
15585a46072J12188j00024j48962R151R5684J10476J25076j8667j74101l1792
$$ -146072 -33884 -133908 -282870 -273719 -178035 -67559 57517 38850 -135251 -167043
15575a67043J01761M0540j3701P2478n2311l8922O812O2482J61085N935q6437
$$ -167043 -65282 -24742 -38443 34035 -18276 -57198 -50386 12096 173181 179116 92679
15564I2679k09054j07079q4212L9677N6057k534k15106j4526R7472K94836L6688
$$ 92679 -116375 -223454 -307666 -267989 -211932 -214466 -429572 -444098 -346626 -51790 -15102
15553a5102L8571J11180L6402J4761j07841r5403J2477l4569J6279k04450p4427
$$ -15102 23469 134649 171051 185812 77971 -17432 -4955 -39524 -23245 -227695 -302122
15542c02122o3743L03244J96492j6140r6601K904L6950m6959J6676j4031j01912
$$ -302122 -365865 -62621 133871 117731 21130 24034 60984 14025 30701 16670 -85242
15531h5242O3634J25096P9097L09j17577j6750r1842J82303J30702j72447k30776
$$ -85242 -21608 103488 182585 182894 65317 48567 -43275 139028 269730 97283 -133493
15520a33493L8911J42367n5510J20514p8467k13453r2929O8560J15796Q585j14804
$$ -133493 -94582 47785 -7725 112789 34322 -179131 -272060 -203500 -87704 -79119 -193923
15509a93923J50232M4150p8294L9759j06578Q5210J18090O2657j66095j97801
$$ -193923 -43691 459 -77835 -38076 -144654 -59444 58646 121303 -44792 -242593
15499b42593j20602M890J16272J58647K737J174k38585j16211K27575K64313j8479
$$ -242593 -363195 -358305 -242033 -83386 -80649 -79475 -318060 -434271 -206696 57617 39138
15488C9138O1915M8733j71726k5000J7011r1425P1867O2742j89931r5567K04657
$$ 39138 101053 149786 -21940 -46940 -29929 -121354 -49487 13255 -176676 -272243 -67586
15477f7586Q9041j72990N9514K36647J6002J3620J09609m8681j24170m6178j39155
$$ -67586 21455 -151535 -92021 144626 160628 174248 283857 235176 111006 64828 -74327
15466g4327j09447k1245J06067L10533N3866K4285P1534o7346j50663N8608J7542
$$ -74327 -183774 -205019 -98952 211581 265447 289732 361266 293920 143257 201865 219407
15455B19407j22770M7144J96328p4126j22520J8864n9877J16525j31006r6553
$$ 219407 96637 143781 340109 265983 143463 162327 102450 218975 87969 -8584
15445h584O9691J11698r0490K6855l7263k25270j53997J74909K20662k3117J9499
$$ -8584 61107 172805 82315 109170 71907 -153363 -307360 -132451 88211 65094 84593
15434H4593j3476J54422L5206k53257j70678o8679M6101N4102R7953O1974P1938
$$ 84593 71117 225539 260745 7488 -163190 -231869 -185768 -131666 -33713 28261 100199
15423A00199l5021j9689L8848P9796j33609j46248K9066J04244N2197p889k72451
$$ 100199 65178 45489 84337 164133 30524 -115724 -86658 17586 69783 61894 -210557
15412b10557p7315J20012J53865O4108J4652j00013J21161j0304r4398p2192N4443
$$ -210557 -287872 -167860 -13995 50113 64765 -35248 85913 75609 -18789 -90981 -36538
15401c6538K2641k8820j23975J45311P0379p0439K6731R3482l911R0949N647j40742
$$ -36538 -13897 -42717 -166692 -21381 48998 -21441 5290 98772 94861 185810 191457 50715
15389E0715m4945m6975q2422L9947O5131r4603J1795M7294m2224K4200K10959
$$ 50715 5770 -41205 -123627 -83680 -18549 -113152 -101357 -54063 -96287 -72087 138872
15378A38872j1850j28704j04581n1019j57817J5099L37863K32685Q9812J1226
$$ 138872 127022 -1682 -106263 -157282 -315099 -300000 37863 270548 360360 371586
15368C71586j52887L7649J307l0077K1374J0837J65666j58330j05439p416l7516
$$ 371586 218699 256348 257655 227578 248952 259789 425455 267125 161686 154270 116754
15357A16754j12260J10697J49519n7231k47072j54985O9413P8018O9889j9570
$$ 116754 4494 115191 264710 207479 -39593 -194578 -125165 -47147 22742 3172
15347C172k4594j71755J30065R518J0452J62793J12871j3025K0547L390P0019
$$ 3172 -21422 -193177 -63112 -53594 -43142 119651 232522 219497 240044 243434 313453
15336C13453j18141k42222j57913m1924R3219N3155O5272l1491L1850O1564L8959
$$ 313453 195312 -46910 -204823 -246747 -153528 -100373 -35101 -66592 -34742 26822 65781
15325F5781o0706K2912K2169p1366j8004k12534j11655l2423M884M3912K11533
$$ 65781 5075 27987 50156 -21210 -39214 -251748 -363403 -395826 -390942 -347030 -135497
15314a35497Q9412M1651J0239j45292K6540J29400p506r3143J4448K8226P0040
$$ -135497 -46085 -4434 5805 -139487 -112947 16453 8947 -84196 -69748 -41522 28518
15303B8518M4377K6986n4012o2836j36454L382K1553p7109j37676K69704K24948
$$ 28518 72895 99881 45869 -16967 -153421 -150039 -128486 -205595 -343271 -73567 151381
15292A51381J60658j62360l42173N4735J37919J23007o4703j95648N878N6403
$$ 151381 312039 149679 -192494 -137759 160 123167 58464 -137184 -131306 -74903
15282g4903j8587p3202P9200P0127J3042O4351j941M4121r5565j98532m5865Q5245
$$ -74903 -93490 -166692 -87492 -17365 -4323 60028 58087 102208 6643 -191889 -237754 -152509
15270a52509J70141k8693J1366J85768J22440K3163q7374j02045j01381J1699
$$ -152509 17632 -11061 305 186073 308513 331676 244302 142257 40876 52575
15260E2575p3525K08325J5523n633p8880N281P9560l5478j37903q0430l4760L7144
$$ 52575 -20950 187375 202898 197265 118385 123666 203226 167748 29845 -50585 -85345 -48201
15248d8201J39130R1061j86899p871N2732O7140L8759J26453j0821j71604j80694
$$ -48201 90929 181990 -4909 -12780 39952 107092 145851 272304 261483 89879 -90815
15237i0815N9692O0598j17224K1182J03396L9892r4883n2654k707J25918K3664
$$ -90815 -31123 29475 -87749 -66567 36829 76721 -18162 -70816 -73523 52395 76059
15226G6059o9422Q1764Q85m8120m2886k7215r3858Q259P2904J14693p1246K9919
$$ 76059 6637 88401 89286 41166 -1720 -28935 -122793 -114534 -41630 73063 1817 31736
15214C1736R850J09769R84j52023j48669R7073n0514J7008K25574K00407j67601
$$ 31736 41586 151355 152339 316 -148353 -51280 -101794 -84786 140788 341195 173594
15203A73594k2874m774m0804k1793k3275n4737K33276l7978L8065l0417p4143
$$ 173594 150720 145946 105142 83349 60074 5337 238613 200635 238700 208283 134140
15192A34140j05666j74842J06492J80189P399n7321O9023K6429m7104j13832P0655
$$ 134140 28474 -146368 -39876 140313 147712 90391 159414 185843 138739 24907 95562
15181I5562J4412L6972L6507j49419K1274N4507k7528J49473P0429j97536j1248
$$ 95562 109974 146946 183453 34034 55308 109815 82287 231760 302189 104653 93405
15170I3405M9477P6356K19853O0587k06852j10083M8208j5952O5126m4232J31473
$$ 93405 142882 219238 439091 499678 292826 182743 230951 214999 280125 235893 367366
15159C67366o8690P4362J74715n8430M8489P9020J3596j92838q1551M7612j11674
$$ 367366 298676 373038 547753 489323 537812 616832 630428 437590 356039 403651 291977
15148B91977n3763k9808J27254L0335m4987J06505J49151J23256R5638J20287
$$ 291977 238214 208406 335660 365995 321008 427513 576664 699920 795558 915845
15138I15845L7064J01171P8323J4490O6326J35853K6846k2320M4167Q6090J80503
$$ 915845 952909 1054080 1132403 1146893 1213219 1349072 1375918 1353598 1397765 1483855 1664358
15127A664358L08201R8975K29564J80775J19835L72771N56795N18519L28311N48138
$$ 1664358 1972559 2071534 2301098 2481873 2601708 2974479 3531274 4049793 4378104 4926242
15117D926242O32974O30195O75127P55588N82970L94128K97643R1470J6503k08756
$$ 4926242 5559216 6189411 6864538 7620126 8203096 8597224 8894867 8986337 9002840 8794084
15107H794084l43235k83050j13572k08972l39256k23271L0104J4884R0726M0523
$$ 8794084 8450849 8167799 8054227 7845255 7505999 7282728 7312832 7327716 7418442 7458965
15097G458965K38597L18718M79668Q06073J012999R97831J056438J276118J368124
$$ 7458965 7697562 8016280 8495948 9302021 10315020 11312851 12369289 13645407 15013531
15088A5013531J370022J227707Q28777M57985K29087o1290m41938p53006j041910
$$ 15013531 16383553 17611260 18440037 18898022 19127109 19065819 18623881 17870875 16828965
15079A6828965j205625j142255r70183r94259p33726o90282p22729n07060j83811
$$ 16828965 15623340 14481085 13510902 12516643 11782917 11092635 10369906 9862846 9679035
15070I679035j27851n3209J69851K80329M02526N11794O67174O95730Q12862P34305
$$ 9679035 9551184 9497975 9667826 9948155 10350681 10862475 11529649 12225379 13038241 13772546
15060A3772546Q60649O46226J54639j44850j98142k02271m28417n38921m47941
$$ 13772546 14633195 15279421 15434060 15289210 15091068 14888797 14460380 13921459 13473518
15051A3473518r2359L8294K30067N00445O68514R44856J186850J146033J247742
$$ 13473518 13381159 13419453 13649520 14149965 14818479 15763335 16950185 18096218 19343960
15042A9343960J201113R20029N17131L36911j46743k41692n43442r08174q00467
$$ 19343960 20545073 21465102 21982233 22319144 22172401 21930709 21387267 20479093 19678626
15033A9678626o19623o13487n95303n12435l11489k8171K24332J64357O22780
$$ 19678626 19059003 18445516 17850213 17337778 17026289 16998118 17222450 17386807 18009587
15024A8009587Q60163J018471J496247J823467K128875K371259K452958K474017
$$ 18009587 18869750 19888221 21384468 23207935 25336810 27708069 30161027 32635044
15016C2635044K480883K067998J588856P32919j92202j042778j756924k266025
$$ 32635044 35115927 37183925 38772781 39505700 39313498 38270720 36513796 34247771
15008C4247771k246314k392957k224921k121307j804949j611275j406926j063358
$$ 34247771 32001457 29608500 27383579 25262272 23457323 21846048 20439122 19375764
15000A9375764p13799l39477k64811k60936K13292N10145P06056R55297J103685
$$ 19375764 18661965 18322488 18057677 17796741 18010033 18520178 19226234 20181531 21285216
14991B1285216J046206J070740R31893M90126J63729j61722n88454j035655j247808
$$ 21285216 22331422 23402162 24334055 24824181 24987910 24826188 24237734 23202079 21954271
14982B1954271j316266j259363j254829r64019q42612p02312k63759j91736Q2992
$$ 21954271 20638005 19378642 18123813 17159794 16317182 15614870 15351111 15159375 15242367
14973A5242367l43J07606J93727K26197Q9317J9183J19999m22260m60477m68565
$$ 15242367 15242024 15349630 15543357 15769554 15858871 15878054 15998053 15575793 15115316 14646751
14963A4646751p28234q36640n41772l83128m43272l61947j25714j7026P7258J27496
$$ 14646751 13918517 13081877 12540105 12156977 11713705 11351758 11226044 11209018 11286276 11413772
14953A1413772K79918M83064O77262R44795P91648P09939J083764J030916R87732
$$ 11413772 11693690 12176754 12854016 13798811 14590459 15300398 16384162 17415078 18402810
14944A8402810J182130R55763N49152J5582m69305q44238j069063j136139r89488
$$ 18402810 19584940 20540703 21089855 21105437 20636132 19791894 18722831 17586692 16597204
14935A6597204j005881j104784j181686j002615o70603o29635m71699m77842m01787
$$ 16597204 15591323 14486539 13304853 12302238 11631635 11002000 10530301 10052459 9650672
14926I650672m5919K55011J60616J74231J76733K24617L86254L09503J76070J04894
$$ 9650672 9604753 9859764 10020380 10194611 10371344 10595961 10982215 11291718 11467788 11572682
14916A1572682j69067k20952k76137l38794n54269o18706o02818o68444p38851
$$ 11572682 11403615 11182663 10906526 10567732 10013463 9394757 8791939 8123495 7384644
14907G384644q74755o65100l75199m09437m78508l75381l19627j48869j94352
$$ 7384644 6509889 5844789 5469590 5060153 4581645 4206264 3886637 3737768 3543416
14898C543416j65089j36007r2442j54932k88117j30494j44122j72133n321k2209
$$ 3543416 3378327 3242320 3149878 2994946 2706829 2576335 2432213 2260080 2254759 2232550
14888B232550j48110p3772O1758n2725O3045p5884k9855r8061j06570j06467j69238
$$ 2232550 2084440 2010668 2072426 2019701 2082746 2006862 1977007 1878946 1772376 1665909 1496671
14877A496671k9006R410j39620k3072j67345j3120j4705j13972k70109J5110J40531
$$ 1496671 1467665 1477075 1337455 1314383 1147038 1133918 1119213 1005241 735132 750242 890773
14866H90773J23767M0036M5809J2094o867j00579M6281R2167j10471n1725M1793
$$ 890773 1014540 1054576 1100385 1112479 1105612 1005033 1051314 1143481 1033010 981285 1023078
14855A023078N5323o8308l5787j29611j87850J71957J01526N8675m9790J895k0957
$$ 1023078 1078401 1010093 974306 844695 656845 828802 930328 989003 939213 941108 920151
14844I20151o8460j14777n5240L5048J1674m4391Q845k2734l9741J7069o6426
$$ 920151 851691 736914 681674 716722 728396 684005 692850 670116 630375 647444 581018
14833E81018m6370k05321j86038Q4669J17457O2834J55225P5112j1560P0992K1705
$$ 581018 534648 329327 143289 227958 345415 408249 563474 638586 627026 698018 719723
14822G19723j01247j80542j01997l6618k4773K828N0907J43808K13369o3153j45671
$$ 719723 618476 437934 335937 299319 274546 277374 328281 472089 685458 622305 476634
14811D76634j58865p9899p5386J4744N9469N1788K4986r1868J98628L3777k44536
$$ 476634 317769 237870 162484 177228 236697 288485 313471 221603 420231 454008 209472
14800B09472k28966J08999Q9233O9975K7426L1982j83384n7070j9317J89816J22637
$$ 209472 -19494 89505 178738 248713 276139 308121 124737 67667 48350 238166 360803
14789C60803j38020j90338p9789J32842L2824j7622o9000k5781q1334l1294M0083
$$ 360803 222783 32445 -47344 85498 118322 100700 31700 5919 -75415 -106709 -66626
14778f6626O8736j2303j4337K17395K01006J02459j36687p5602p2563p7937j17363
$$ -66626 2110 -10193 -24530 192865 393871 496330 359643 284041 211478 133541 16178
14767A6178j1897m8175j06977J4470J62103J42791q113o8896L8616j18294j47015
$$ 16178 4281 -43894 -150871 -136401 25702 168493 160380 91484 130100 11806 -135209
14756a35209n2065k6053O2096R0601k3734l5839J8616J13470J98917m0287k69608
$$ -135209 -187274 -213327 -151231 -60630 -84364 -120203 -101587 11883 210800 170513 -99095
14745i9095j43338L8668K963K3948P889J00511J70365j37903j47370P7446J29005
$$ -99095 -242433 -203765 -200802 -176854 -168965 -68454 101911 -35992 -183362 -105916 23089
14734B3089N3027L5348K3980N934M3575j9056o284j59036j88190J79049O485J37431
$$ 23089 76116 111464 135444 141378 184953 165897 159613 577 -187613 -8564 -2079 135352
14722A35352j2882p2944k02330l9355k5161Q6749P5732K251J6324r4570j10505
$$ 135352 122470 49526 -152804 -192159 -217320 -130571 -54839 -52588 -36264 -130834 -241339
14711b41339J4191K44642m8148p3950J20040M0661p6269P9888J35287n733j09489
$$ -241339 -227148 17494 -30654 -104604 15436 56097 -20172 59716 195003 189270 79781
14700G9781j0973L8431j71280j7428O0333O6820K3126n6746J29042J70832N6319
$$ 79781 68808 107239 -64041 -81469 -21136 45684 68810 12064 141106 311938 368257
14689C68257j38509j01302j3896N3143j35120N2204p0967p73N5221R813r89M3564
$$ 368257 229748 128446 114550 167693 32573 84777 13810 13037 68258 78071 77082 120646
14677A20646k1553k3246R2946J87397k31715j35161o4350j15456O9908J8218J8862
$$ 120646 99093 75847 168793 356190 124475 -10686 -75036 -190492 -120584 -102366 -83504
14666h3504O6609J999J8286j84280l1773J05139k8745J09255N7239J49838N201
$$ -83504 -16895 -14896 3390 -180890 -212663 -107524 -136269 -27014 30225 180063 185264
14655A85264j32550n8355K10314k084k2333J71639m5924j38087q3163j59601k8044
$$ 185264 52714 -5641 204673 202589 180256 351895 305971 167884 84721 -74880 -102924
14644a02924o1510Q776m6752m0608Q8348N392J07412M7514K12457N5136q1711
$$ -102924 -164434 -155658 -202410 -243018 -154670 -149278 -41866 5648 218105 273241 191530
14633A91530o916R4427J4746n469j24296k0650N7049J0432Q537q1822j16957n1000
$$ 191530 184614 279041 293787 288318 164022 143372 200421 210853 219390 137568 20611 -30389
14621c0389j17384O4816n6980R7456P1568k4254j5964j0738P0606j6927J1965
$$ -30389 -147773 -82957 -139937 -42481 29087 4833 -11131 -21869 48737 31810 43775
14610D3775J03569J2130k12962R563O8995J3060J35791K5843k04269j14889r2146
$$ 43775 147344 159474 -53488 -43925 25070 38130 173921 199764 -4505 -119394 -211540
14599b11540J12996Q1240O4052J47454Q4269j50173k33867n4606k1698j6105J62573
$$ -211540 -98544 -17304 46748 194202 278471 128298 -105569 -160175 -181873 -197978 -35405
14588c5405Q5450J02665Q1132j03028o4645n9733j12324J04239j08442r3158M4070
$$ -35405 50045 152710 233842 130814 66169 6436 -105888 -1649 -110091 -203249 -159179
14577a59179J82777J97917P9283J8359r1666j75536J00247P449j46839j69822
$$ -159179 23598 221515 300798 319157 227491 51955 152202 159651 12812 -157010
14567a57010p374R5637n6557L6948N6246j1060N2573r4883r1303Q8789j370P9755
$$ -157010 -164384 -68747 -125304 -88356 -32110 -43170 9403 -85480 -176783 -87994 -89364 -9609
14555i609l1201J1962N0539J52962N267j45784O3093M0706j75800k1585R5434
$$ -9609 -40810 -28848 21691 174653 179920 34136 97229 137935 -37865 -59450 35984
14544C5984J34160J43685j6667q5704m9068m9223k98312o7968j3500J35969J89071
$$ 35984 170144 313829 297162 211458 162390 113167 -185145 -253113 -266613 -130644 58427
14533E8427n8459L2205O9453J03594J24859l658M0041p4671k74607j61527J78751
$$ 58427 -32 32173 101626 205220 330079 326421 366462 291791 17184 -144343 34408
14522C4408J66784J3796L2235n6635k04298k6110o1919J22787k2710r5662l0435
$$ 34408 201192 214988 247223 190588 -13710 -39820 -101739 21048 -1662 -97324 -127759
14511a27759o2861j69763P1253J34397R00m7088M5605Q8277k2720O1758j24959
$$ -127759 -190620 -360383 -289130 -154733 -153833 -200921 -155316 -67039 -89759 -28001 -152960
14500a52960l3852O2392j12850L847Q4184q518P6254J07290Q8002L42m0264Q3428
$$ -152960 -186812 -124420 -237270 -233423 -149239 -157757 -81503 25787 113789 114131 73867 157295
14488A57295j23533j19623J12936R8164P5368j2501q358k2374o3816r8754r7827
$$ 157295 33762 -85861 27075 125239 200607 188106 179748 157374 93558 -5196 -103023
14477a03023k9514j74850n7583K03264J49977J68856M1837j14495j0809p5963
$$ -103023 -132537 -307387 -364970 -161706 -11729 157127 198964 84469 73660 -2303
14467b303p3120J6530J41452p5759o3557p0800o4416J93254N5698m1103j06243
$$ -2303 -75423 -58893 82559 6800 -56757 -127557 -191973 1281 56979 15876 -90367
14456i0367k755K2368p042R4994J77759n4966o6333m2056k3599o0338J9924n6508
$$ -90367 -93122 -70754 -77796 17198 194957 139991 73658 31602 8003 -52335 -32411 -88919
14444h8919j43723j70785J51561K78461J3320j71513J4253Q6613Q9541Q5173j01776
$$ -88919 -232642 -403427 -251866 26595 39915 -131598 -117345 -30732 58809 143982 42206
14433D2206K1105L12603P2608j76577q4077M566j66046r1645p6991R0284R0152
$$ 42206 63311 375914 448522 271945 187868 192434 26388 -65257 -142248 -51964 38188
14422C8188r233o2830k9586q8179Q3368O1815J30633L5321m661N4590j04607o4932
$$ 38188 28955 -33875 -63461 -151640 -68272 -6457 124176 159497 154836 209426 104819 39887
14410C9887l6113L1776L2820m9446L7189J0402J37999N0716o6862j40019l7584
$$ 39887 3774 35550 68370 18924 56113 66515 204514 255230 188368 48349 10765
14399A0765J0577r2157m4676k7984K11286L7445P9186k226l18290j67999J98406
$$ 10765 21342 -70815 -115491 -143475 67811 105256 184442 182216 -136074 -304073 -105667
14388a05667L8040j35842J4935J67798n3630l0715N6919P0200L9769J125K611
$$ -105667 -67627 -203469 -188534 -20736 -74366 -105081 -48162 22038 61807 62932 65543
14377F5543q1132j73272L8018l6533k3391J769q6463P3470O986n5880j6851j74844
$$ 65543 -15589 -188861 -150843 -187376 -210767 -208998 -295461 -221991 -215005 -270885 -287736 -462580
14365d62580K6221J54484K35595L10193j27704k00652p8418J7507O7581j19201
$$ -462580 -436359 -281875 -46280 263913 136209 -64443 -142861 -125354 -57773 -176974
14355a76974p1760l8365j06855N1504L4378J10860J05761J44788J32849j92348
$$ -176974 -248734 -287099 -393954 -342450 -308072 -197212 -91451 53337 186186 -6162
14345f162q3486K6221Q3031Q5630j31911o3196n9754j14288P7096L2297K639L7374
$$ -6162 -89648 -63427 19604 105234 -26677 -89873 -149627 -263915 -186819 -154522 -151883 -114509
14333a14509L7513k9495q751l3897o8053p2005J56195O4590j35173j23394n3876
$$ -114509 -76996 -106491 -115242 -149139 -217192 -289197 -133002 -68412 -203585 -326979 -380855
14322c80855R8461K35881N1197J4389k01609j4776J15592M9546J14782K4031O1107
$$ -380855 -282394 -46513 4684 19073 -182536 -197312 -81720 -32174 82608 106639 167746
14311A67746r238R9538l6609k10931j4425L0313j98607K0135J83372N2519n048
$$ 167746 158508 258046 221437 10506 -3919 26394 -172213 -152078 31294 83813 78765
14300G8765q2746k2988j73352j62061J9967N2255n389J86018L21317P2686k8432
$$ 78765 -3981 -26969 -200321 -362382 -342415 -290160 -295549 -109531 211786 284472 256040
14289B56040l19669j26662J57217N8268L6811O7866p8520k06161j30463m7716
$$ 256040 -63629 -190291 -33074 25194 62005 129871 51351 -154810 -285273 -332989
14279c32989O7995L5906O4684R1679K5876J18035m0450j11065j3097q051J0698
$$ -332989 -264994 -229088 -164404 -72725 -46849 71186 30736 -80329 -93426 -101477 -90779
14268i0779R5446j8020J88154q4764j50425n3899M1667l3078K6147J61639M4988
$$ -90779 4667 -13353 174801 90037 -60388 -114287 -72620 -105698 -79551 82088 127076
14257A27076j04968n7189L981J06212j24802Q5595J03654J12740p4815L109N7572
$$ 127076 22108 -35081 -31100 75112 -49690 35905 139559 252299 177484 180593 238165
14246B38165j14944j48632j81647l8529J35294j12471N7896J70628J8535l8687
$$ 238165 123221 -25411 -207058 -245587 -110293 -222764 -164868 5760 24295 -14392
14236a4392j41966j46424k0832n0934O9066O8203M168j53647l626k6155J61499
$$ -14392 -156358 -302782 -323614 -374548 -305482 -237279 -233111 -386758 -390384 -416539 -255040
14225b55040K06465k4408j01846q9798N3430j49531m6728R7783J44168J10584
$$ -255040 -48575 -72983 -174829 -264627 -211197 -360728 -407456 -309673 -165505 -54921
14215e4921Q0207O7606r0403L3512O3279r9921k4489K2258r8701k05250M093J19354
$$ -54921 25286 92892 2489 36001 99280 -641 -25130 -2872 -101573 -306823 -302730 -183376
14203a83376L7962j4111o1897L9996M8611n2985r3240j57307j6198J11457J67315
$$ -183376 -145414 -159525 -221422 -181426 -132815 -185800 -279040 -436347 -452545 -341088 -173773
14192a73773j5640K85026J42293j28079n4574p7298j5682P1809N0835j8385j89789
$$ -173773 -189413 95613 237906 109827 55253 -22045 -37727 34082 84917 66532 -123257
14181a23257M5805J18251m368k03813n8165r038N9326j6670O7000Q2008r8702
$$ -123257 -77452 40799 36431 -167382 -225547 -234585 -175259 -191929 -124929 -42921 -141623
14170a41623l8518J52635M6131K6110J16202K3555r5117q798L2517j8334K4776
$$ -141623 -180141 -27506 18625 44735 160937 184492 89375 80577 113094 94760 119536
14159A19536q2035l0955P5499j0874M0837j89615m9243j61687r5795k5115Q369
$$ 119536 37501 6546 82045 71171 112008 -77607 -126850 -288537 -384332 -409447 -401078
14148d01078P6499J74648L8744J2063J09264O3530j03283r3988Q4865M95M8064
$$ -401078 -324579 -149931 -111187 -99124 10140 73670 -29613 -123601 -38736 -38241 9823
14137I823O0290q2958j5787R6779n6665m329J16208p046n9490J52978o9795j46193
$$ 9823 70113 -12845 -28632 68147 11482 7153 123361 116315 56825 209803 140008 -6185
14125f185J30985J11678j58291q1705J24358l9681j19927Q3881J26225K4595j32283
$$ -6185 124800 236478 78187 -3518 120840 81159 -38768 45113 171338 195933 63650
14114F3650k44376j78188K00830K00965m7638j34609M7929J31851M8887r7758
$$ 63650 -180726 -358914 -158084 42881 -4757 -139366 -91437 40414 89301 -8457
14104h457j64771J03877r50o0299p4921q524P2347Q5504N4782o6828m4973N9508
$$ -8457 -173228 -69351 -70301 -130600 -205521 -214045 -141698 -56194 -1412 -68240 -113213 -53705
14092e3705O7894Q2488j0385Q1579n7135l6083L0995j0609j7132j04286M605q0222
$$ -53705 14189 96677 86292 167871 110736 74653 105648 95039 77907 -26379 -21774 -101996
14080a01996l5057J03783J65471N2345j13308l32794j94233M9809J25834K14055
$$ -101996 -137053 -33270 132201 184546 71238 -261556 -455789 -405980 -280146 -66091
14070f6091M9784k9053Q964K8004P216j00406M7161R4930j33819k4714J6440j45380
$$ -66091 -16307 -45360 -36396 -8392 -1176 -101582 -54421 40509 -93310 -118024 -101584 -246964
14058b46964o2688R2426J70912L8641J9175J36619j02464O730J578j23322j74650
$$ -246964 -309652 -217226 -46314 -7673 11502 148121 45657 52387 53965 -69357 -244007
14047b44007m3138J8237J54227J10783K33923J29830K7952K9673j91701j73502
$$ -244007 -287145 -268908 -114681 -3898 230025 359855 387807 417480 225779 52277
14037E2277j10903L0953n8449m7685m5093P7074J31426j5487j31977J15592K56294
$$ 52277 -58626 -27673 -86122 -133807 -178900 -101826 29600 14113 -117864 -2272 254022
14026B54022L1668r7449O9260n625j70740n3190j03110j82517P2142N8601L0670
$$ 254022 285690 188241 257501 251876 81136 27946 -75164 -257681 -185539 -126938 -96268
14015i6268J50497J6361N5081J0553R4886q3625p6662J14739K82624L0429k61523
$$ -96268 54229 70590 125671 136224 231110 147485 70823 185562 468186 498615 237092
14004B37092j46138k01562j02766J3791N2529l5074P1979K2117L6744R2396n3849
$$ 237092 90954 -110608 -213374 -199583 -147054 -182128 -110149 -88032 -51288 41108 -12741
13993a2741n6893M0944M6313k9034j08811j6212j6000K8233j2555J69181Q7197
$$ -12741 -69634 -28690 17623 -11411 -120222 -136434 -152434 -124201 -136756 32425 119622
13982A19622M2503J46156R6210j30237j82408j68191j3437M3323K27404o062N4224
$$ 119622 162125 308281 404491 274254 91846 -76345 -89782 -46459 180945 174883 229107
13971B29107P5967J0313j36317o2621J27025J71226P0327J03055o4081j92064
$$ 229107 305074 315387 179070 116449 243474 414700 485027 588082 524001 331937
13961C31937k23492p6392n8135m8016J72374O8495k4079j17108J03768J33608
$$ 331937 108445 32053 -26082 -74098 98276 166771 142692 25584 129352 262960
13951B62960m928J30244o251J62408r3111j60353p6532q7260j64743j8705J24089
$$ 262960 258032 388276 382025 544433 451322 290969 214437 127177 -37566 -56271 67818
13940F7818J0487J37397M9233m1804m4798K1625K16131o6903j03967o4778p5351
$$ 67818 78305 215702 264935 223131 178333 199958 416089 349186 245219 180441 105090
13929A05090K783L9887k918J79278P5299j38656j28156m265o801O7767J2674n3353
$$ 105090 107873 147760 144842 324120 399419 260763 132607 128342 121541 189308 201982 148629
13917A48629N8135o2218K561j06639j69056N6091n6069L8211K32188O6398o2988
$$ 148629 206764 144546 147107 40468 -128588 -72497 -128566 -90355 141833 208231 145243
13906A45243P7694l1360K5995K8051R707p4169M7841l8137j57793k11693L1479
$$ 145243 222937 191577 217572 245623 255330 181161 229002 190865 33072 -178621 -147142
13895a47142J42338l2719K07218J75628j78813j13514r0829J8224J5784j25241
$$ -147142 -4804 -37523 169695 345323 166510 52996 -37833 -19609 -3825 -129066
13885a29066L0550O9974r4951R5032J18497K14796N8202n2411n9292j13188j08224
$$ -129066 -98516 -28542 -123493 -28461 90036 304832 363034 310623 251331 138143 29919
13874B9919r1475J148N9423m6922o3914J9496j17693K24205Q5860j06370j2476
$$ 29919 -61556 -60408 -985 -47907 -111821 -92325 -210018 14187 100047 -6323 -18799
13863a8799L5848L2901n9497q9258o8741r122L1585P0788q394P4683M5641m6403
$$ -18799 17049 49950 -9547 -98805 -167546 -176668 -145083 -74295 -82689 -8006 37635 -8768
13851h768M7976J9587l6133J0549n5522l8264R5165O2717K32876M1683l142j02887
$$ -8768 39208 58795 22662 33211 -22311 -60575 34590 97307 330183 371866 368724 265837
13839B65837j60430q9654k73849J3778J86260J20251J85538j41403j42895R8121
$$ 265837 105407 15753 -258096 -244318 -58058 62193 247731 106328 -36567 61554
13829F1554q9732O007R9752m8638j53568q7861M0908J29529k2346o7868k39367
$$ 61554 -28178 -22171 77581 28943 -124625 -212486 -171578 -42049 -64395 -132263 -371630
13818c71630Q2025K36903N4793N5830r7j18895M0092o6573J66951Q9675L1634
$$ -371630 -289605 -52702 2091 57921 57824 -61071 -20979 -87552 79399 169074 200708
13807B00708j7991m3529l8606N164p5141p8588J13748l7996k29123k3653O0726
$$ 200708 182717 139188 100582 105746 30605 -47983 65765 27769 -201354 -225007 -164281
13796a64281O1655J02187q3106R1532P9175O873k6360J3955o6749p804R3894l0960
$$ -164281 -102626 -439 -83545 7987 87162 94035 67675 81630 14881 7077 100971 70011
13784G0011J61414K2498q3584j17411j14455o744j2574m8090L1154L8501J6928
$$ 70011 231425 253923 170339 52928 -61527 -68271 -80845 -128935 -97781 -59280 -42352
13773d2352j21011n70P818p7854n6328J49626J94220m5229n2108o5181k7136Q053
$$ -42352 -163363 -163933 -156115 -233969 -290297 -140671 53549 8320 -43788 -108969 -136105 -128052
13761a28052j3069J13043p2472k7730N1979K178K6721m6522p8598J13984p796
$$ -128052 -141121 -28078 -100550 -128280 -76301 -74123 -47402 -93924 -172522 -58538 -66334
13750f6334l8337n877O8400L1373k9191j99689q0481p0233l267L7839J71034M5773
$$ -66334 -104671 -110548 -42148 -10775 -39966 -239655 -320136 -390369 -393636 -355797 -184763 -138990
13738a38990J06323q7902J46928O8808n264j67884M2380j39763m4491P6319K40661
$$ -138990 -32667 -120569 26359 95167 89903 -77981 -35601 -175364 -219855 -143536 97125
13727I7125K04576r1211j11369k02354j50961n0834K9985J33213J58341K5825
$$ 97125 301701 210490 99121 -103233 -254194 -305028 -275043 -141830 16511 42336
13717D2336k06130j82578K380P0104M3168J27476m9640J6828J51213J19870r3181
$$ 42336 -163794 -346372 -343992 -273888 -230720 -103244 -152884 -136056 15157 135027 41846
13706D1846k3620j02004J51214P7551j15065Q850O6121n3650j20068J69462o5689
$$ 41846 18226 -83778 67436 144987 29922 38772 104893 51243 -68825 100637 34948
13695C4948j41886K5769Q8573k2903j19666L6880M7726j02765L1985K08943J03893
$$ 34948 -106938 -81169 7404 -15499 -135165 -98285 -50559 -153324 -121339 87604 191497
13684A91497j91533k33148J2415K9909J04152K12668J63075k43627j28281L2461
$$ 191497 -36 -233184 -220769 -190860 -86708 125960 289035 45408 -82873 -50412
13674e0412O6708n4960J76206p1737n4707O0786J06986P6886J9039k06912p0263
$$ -50412 16296 -38664 137542 65805 11098 71884 178870 255756 274795 67883 -2380
13663b380j5080j16764q0144K9437K54506O6161k18615l077j04320m2416L24166
$$ -2380 -17460 -134224 -214368 -184931 69575 135736 -82879 -85956 -190276 -232692 91474
13652I1474j19259q2063J77892o1224j69552J26426P461Q5901K2609k114j02135
$$ 91474 -27785 -109848 68044 6820 -162732 -36306 -28845 57056 79665 77551 -24584
13641b4584J18568L6478J7010N2513J2576q7235j64405M4864N3646J1205m7264
$$ -24584 93984 130462 147472 199985 212561 125326 -39079 5785 59431 70636 23372
13630B3372o8152R8595N619R2454j0111j09082M549j53679m0944P9380l1976M1455
$$ 23372 -44780 53815 59434 151888 141777 32695 37244 -116435 -157379 -77999 -109975 -68520
13618f8520Q5451n2044K0246J23415k9267n851m059O2113j5668N4846n1276j7517
$$ -68520 16931 -35113 -14867 108548 79281 73430 69371 131484 115816 170662 119386 101869
13606A01869p5679O1370k687M4769J0244m5804N449M6721p2535n6913J7657R0350
$$ 101869 26190 87560 84873 129642 139886 94082 99531 146252 73717 16804 34461 124811
13594A24811P8084M9410L4949m920K4575k01540o9598p3465J75280K59575J38841
$$ 124811 202895 252305 287254 282334 306909 105369 35771 -37694 137586 397161 536002
13583E36002k4974o7107k64552j26093J32103L7275K803r7641J49848N9103K3973
$$ 536002 511028 443921 179369 53276 185379 222654 225457 127816 277664 336767 360740
13572C60740j05713K63783J55013p3469l20704o9041J70979K21092L8473j80872
$$ 360740 255027 518810 673823 600354 279650 210609 381588 602680 641153 460281
13562D60281k1548P9913q3469p9558l464J7950P0894j18950r229J87046O5208
$$ 460281 438733 518646 435177 355619 352155 370105 440999 322049 312820 499866 565074
13551E65074o0287J7708O735J9296J38484K02407k86390j11015N3060j11169j49693
$$ 565074 504787 522495 529230 548526 687010 889417 603027 492012 545072 433903 284210
13540B84210k2338R6174j12478r1761l7585J02213R3036J35223o5847k7928j05987
$$ 284210 261872 358046 245568 153807 116222 218435 311471 446694 380847 352919 246932
13529B46932r4901N4750R2278R2998k93265m6142j00698J16642P0195P6268M7438
$$ 246932 152031 206781 299059 392057 98792 52650 -48048 68594 138789 215057 262495
13518B62495j21076m5682J1828k5671n997M8866j32178j8749N7628L8063o44J29368
$$ 262495 141419 95737 107565 81894 75897 124763 -7415 -26164 31464 69527 68883 198251
13506A98251J2983p7852k4064p8065j35519J66300K29740Q1184p0229p4130k3590
$$ 198251 211234 133382 109318 31253 -104266 62034 291774 372958 302729 228599 205009
13495B05009J01625P7985j56267j51549N1020q5980N6438Q0006n835j831j06200
$$ 205009 306634 384619 228352 76803 127823 41843 98281 178287 172452 170621 64421
13484F4421r6437N6448J05937j28055R829K5957L2973r7565o7339R5435J5833
$$ 64421 -32016 24432 130369 2314 12143 38100 71073 -26492 -93831 1604 17437
13473A7437l7036J22797J24013l7372j52860j1387O7611k29638j03695M5479L0394
$$ 17437 -19599 103198 227211 189839 36979 25592 93203 -136435 -240130 -194651 -164257
13462a64257J1199Q7646L9007J67959J90242M0841k6768j75538j16843m1832M5192
$$ -164257 -153058 -65412 -26405 141554 331796 372637 345869 170331 53488 11656 56848
13451E6848J06216M09j10734P4381j15429j64300l3978m1416o3221Q7828J6585
$$ 56848 163064 163473 52739 127120 11691 -152609 -186587 -228003 -291224 -203396 -186811
13440a86811N5661j7772L9496R2913J76181q6143j32729q4878J14141J05748j11648
$$ -186811 -131150 -148922 -109426 -16513 159668 73525 -59204 -144082 -29941 75807 -35841
13429c5841o0840P919K0483j50873q9372J25277L54909K0694l3745J13648j17910
$$ -35841 -96681 -88762 -68279 -219152 -308524 -183247 171662 192356 158611 272259 154349
13418A54349k18456q6158K73566P254L3536m9636j24320o1426K6587R020j25766
$$ 154349 -64107 -150265 123301 130555 164091 114455 -9865 -71291 -44704 -35684 -161450
13407a61450J02255R4300J24856j99181r5062N6706o4364L7429m4885M8676P3895
$$ -161450 -59195 35105 159961 -39220 -134282 -77576 -141940 -104511 -149396 -100720 -26825
13396b6825Q2889R4718r5432m2253k0673N82J1487K7679j0088Q701r2981o2381
$$ -26825 56064 150782 55350 13097 -7576 -6994 4493 32172 22084 30785 -62196 -124577
13384a24577q28j14603N4706K19242R116n7772j22397r9826p9773p4189J14001
$$ -124577 -125405 -240008 -185302 33940 43056 -14716 -137113 -236939 -316712 -390901 -276900
13373b76900J61872J43648j70994Q9156J10062l5623J28139j7314k95262j2504
$$ -276900 -115028 28620 -142374 -53218 56844 21221 149360 132046 -163216 -175720
13363a75720K6815J6086R0086J30707L898k40526k59998J54580M65R3300N7793
$$ -175720 -148905 -132819 -42733 87974 91872 -148654 -408652 -254072 -253607 -160307 -102514
13352a02514k215o4592P1606o175j6365J79697J7216N7515j16029j89781j43661
$$ -102514 -104729 -169321 -97715 -103890 -120255 59442 76658 134173 18144 -171637 -315298
13341c15298J88899N3864j06091l8584j18992L5615K9710L0779O9392K24002K2335
$$ -315298 -126399 -72535 -178626 -217210 -336202 -300587 -270877 -240098 -170706 53296 75631
13330G5631k4621k7613k02597n9896m661J4739l1477m652J08138O8430L972j35770
$$ 75631 51010 23397 -179200 -239096 -243757 -229018 -260495 -265147 -157009 -88579 -84607 -220377
13318b20377R3971L7671l5786K4867j14979j59053k2955K96475O2777L4139j17643
$$ -220377 -126406 -88735 -124521 -99654 -214633 -373686 -396641 -100166 -37389 -3250 -120893
13307a20893K11458K0428j6592J99194J25354j9531j41733q1861l8217l8042j97948
$$ -120893 90565 110993 94401 293595 418949 399418 257685 175824 137607 99565 -98383
13296i8383j65219J98047J9189k35679j5072R2255k2884J79575J10947m0991M7384
$$ -98383 -263602 -65555 -46366 -282045 -297117 -204862 -227746 -48171 62776 21785 69169
13285F9169Q7019j21611k2362J41326l267j5368r9549P4212O1521k09283k12737
$$ 69169 156188 34577 12215 153541 150274 134906 35357 109569 171090 -38193 -250930
13274b50930K40145k5608j0032J22448j19993r3640J37458K3117M3539j12619
$$ -250930 -10785 -36393 -46425 76023 -43970 -137610 -152 22965 66504 -46115
13264d6115O4210K27928j54585j36828J4547l3653O5239O4296k40508k6858J74250
$$ -46115 18095 246023 91438 -45390 -30843 -64496 743 65039 -175469 -202327 -28077
13253b8077m8132o6718K3712N2375J2644j08953J45045O7722r3568N4208J14737
$$ -28077 -76209 -142927 -119215 -66840 -54196 -163149 -18104 49618 -43950 10258 124995
13242A24995J95758J6555m2329Q3095j40189j23786P005r3025L7089j61527o8492
$$ 124995 320753 337308 294979 378074 237885 114099 121104 28079 65168 -96359 -164851
13231a64851j70014m5603L549J75771J51070J21963O1884k3097j78236n1982M0722
$$ -164851 -334865 -380468 -376919 -201148 -50078 71885 133769 110672 -67564 -119546 -78824
13220g8824K59586R4068l8358N9262L8015N8635k63336p7691P946k86221p2753
$$ -78824 180762 274830 236472 295734 333749 392384 129048 51357 59303 -226918 -299671
13209b99671J29965n324M1834Q9174m4662J6981J18020J53145j51657r4286P2263
$$ -299671 -169706 -175030 -133196 -44022 -88684 -71703 46317 199462 47805 -46481 25782
13198B5782J24757r7659p3522J39343J00496o9799l4862p8367l9285n1211J6083
$$ 25782 150539 52880 -20642 118701 219197 149398 114536 36169 -3116 -54327 -38244
13187c8244p7198j0160P2981n1797k63798L1198J72979K62561Q9088k02185R8207
$$ -38244 -115442 -125602 -52621 -104418 -368216 -337018 -164039 98522 187610 -14575 83632
13176H3632J13241J19096J39022j24939j64849k6212R5892P7307J43524r0552
$$ 83632 196873 315969 454991 330052 165203 138991 234883 312190 455714 365162
13166C65162j02450j15489l7849K05395r3069m4997J14923J04907j13569j55169
$$ 365162 262712 147223 109374 314769 221700 176703 291626 396533 282964 127795
13156A27795J11358P1657M0917m2602L1618j18154j74348q0563R232J02731q2864
$$ 127795 239153 310810 351727 309125 340743 222589 48241 -32322 -23090 79641 -3223
13145c223R2750O17o7390n4241J15766K0879j27421p2285J88515J06653L6284
$$ -3223 89527 90144 22754 -31487 84279 105158 -22263 -94548 93967 200620 236904
13134B36904l3602j77504k3292N9967j5830o9304J90756O1521K3331M8647R7326
$$ 236904 203302 25798 2506 62473 46643 -22661 168095 229616 252947 301594 398920
13123C98920j66641k47073L9598L0091K0957K9134M9991J82711J56401k5971k04719
$$ 398920 232279 -14794 24804 54895 75852 104986 154977 337688 494089 468118 263399
13112B63399k00254K1673l6750Q0957q1430k0215O1260o4175Q3476Q6684j58003
$$ 263399 63145 84818 48068 129025 47595 27380 88640 24465 107941 194625 36622
13101C6622J10714k4290L8547L5768o5541j06913j51031M2857J63564O0409j40441
$$ 36622 147336 123046 161593 197361 131820 24907 -126124 -83267 80297 140706 265
13090B65k6052Q6695J11456p2810n4424J3355j88685k1021J0915j12877j06370
$$ 265 -25787 60908 172364 99554 45130 58485 -130200 -151221 -140306 -253183 -359553
13079c59553j8939J60358N1303Q7339J25969j17014N4893J06011r5333j46301
$$ -359553 -378492 -218134 -166831 -79492 46477 -70537 -15644 90367 -4966 -151267
13069a51267n5504J20966R7338J91274j50143k52898o5322N7478J05922M8128
$$ -151267 -206771 -85805 11533 202807 52664 -200234 -265556 -208078 -102156 -54028
13059e4028O1826O3351N5113j09770j22847N2807M1390j49279N3199Q2807K7017
$$ -54028 7798 71149 126262 16492 -106355 -53548 -12158 -161437 -108238 -25431 1586
13048A586j0940q092m0005L3245j21391k6988K407J14039l6826j6943j3898l5149
$$ 1586 -9354 -17446 -57451 -24206 -145597 -172585 -170178 -56139 -92965 -109908 -123806 -158955
13036a58955J36112K63745j88455m8332M7406O3992J69246j47182K1579J29870
$$ -158955 -22843 240902 52447 4115 51521 115513 284759 137577 159156 289026
13026B89026j04723O3349j52884l7708O7814q781j06096N1732J0977m0621L5060
$$ 289026 184303 247652 94768 57060 124874 116093 9997 61729 72706 32085 67145
13015F7145O5484M6255j49106j06104K03875L0381q121j02370m9083j87270M5940
$$ 67145 132629 178884 29778 -76326 127549 157930 149809 47439 -1644 -188914 -142974
13004a42974J74345J22259M8224j74757r1638j2620l7195j055K1431J72084o9909
$$ -142974 31371 153630 201854 27097 -64541 -77161 -114356 -115411 -93980 78104 8195
12993H195j41656O0716J39615J42800j00125j26390k3374M6217J21925j1826k20141
$$ 8195 -133461 -72745 66870 209670 109545 -16845 -40219 5998 127923 116097 -104044
12982a04044j78686M1373l0322J38387o4254Q5745J35745J1245r60k15993k75287
$$ -104044 -282730 -241357 -271679 -133292 -197546 -111801 23944 35189 34229 -181764 -457051
12971d57051J71886K21209J96387k3343J49015k2009j58576k476O5359K151r2221
$$ -457051 -285165 -63956 132431 109088 258103 236094 77518 75042 140401 142552 50331
12960E0331R6989J64518n9303n7052o0769k6995p9740j46165j270m7622N9365
$$ 50331 147320 311838 252535 195483 134714 107719 27979 -118186 -119456 -167078 -107713
12949a07713J24356J77008n52m5543o9005p6317o5611J38381K30082K6821k8190
$$ -107713 16643 193651 193099 147556 78551 2234 -63377 75004 305086 331907 303717
12938C03717j6792p0362o2107l323M6082r9155m2266Q3066j03133P6777N393j32789
$$ 303717 286925 216563 154456 151133 197215 98060 55794 138860 35727 112504 117897 -14892
12926a4892m3887P6813M96m9297J01600R3686l6081j08372J4309K6634m9239j03131
$$ -14892 -58779 18034 18530 -30767 70833 164519 128438 20066 34375 61009 11770 -91361
12914i1361K4107m4469M7055k5221K6155O8057r2673o0145L3088M0316J43532
$$ -91361 -67254 -111723 -64668 -89889 -63734 4323 -88350 -148495 -115407 -75091 68441
12903F8441O9483J43268k7419j19402j81714L594R9957j36419j03587J80067J98845
$$ 68441 137924 281192 253773 134371 -47343 -43749 56208 -80211 -183798 -3731 195114
12892A95114j19739l812q3874j97370O5920r3804J60012J54933R212n1631N5682
$$ 195114 75375 71563 -12311 -209681 -143761 -237565 -77553 77380 86592 34961 90643
12881I0643O5164q9522j030Q6320j6738j2391J8427J11047j5643k2521j2927J45381
$$ 90643 155807 66285 65255 151575 134837 122446 140873 251920 236277 213756 200829 346210
12869C46210n4436K4052Q432k7876r4259K2524P0413m1104j26370p7847j44831
$$ 346210 291774 315826 324258 296382 202123 224647 295060 253956 127586 49739 -95092
12858i5092k5710J81664J62715m4805n6563J4563L1400o9864k602p0418j20875
$$ -95092 -120802 60862 223577 178772 122209 136772 168172 98308 95706 25288 -95587
12847i5587m3753n6991P1780k5395K2879q358k2569M5018J7642n4449L7401M4728
$$ -95587 -139340 -196331 -124551 -149946 -127067 -135425 -157994 -112976 -95334 -149783 -112382 -67654
12835f7654M5909k9985k08348m8341q0928J95812J41496J26055J17969Q208N8305
$$ -67654 -21745 -51730 -260078 -308419 -389347 -193535 -52039 74016 191985 200193 258498
12824B58498q5197o3918p3736L059K1003j9023j20258N609Q0110o3422J9393l4045
$$ 258498 173301 109383 35647 38706 59709 40686 -79572 -73963 6147 -57275 -37882 -71927
12812g1927j01376j34737M748K33010M577m439J34325P5563n4390r737q0370L4823
$$ -71927 -173303 -308040 -303292 -70282 -65705 -70144 64181 139744 85354 75617 -4753 30070
12800C0070Q3787j08832j26900O4598J55002o4732n6118j1231n7892n9973l0078
$$ 30070 113857 5025 -121875 -57277 97725 32993 -23125 -34356 -92248 -152221 -182299
12789a82299o3988n9436K1289L7227K0773n8949R576R1548J76373J65428n6897
$$ -182299 -246287 -305723 -284434 -247207 -226434 -285383 -275807 -184259 -7886 157542 100645
12778A00645j58615J3648O8202M7232n0415P1606n876Q7932J05202r1601K6901
$$ 100645 -57970 -44322 23880 71112 20697 92303 86427 174359 279561 187960 214861
12767B14861k24895r1716K31936J12786l1403j4846p2337m5933K3945j17534q5661
$$ 214861 -10034 -101750 130186 242972 211569 196723 124386 78453 102398 -15136 -100797
12756a00797j26616j23323L8432P0932J09510j5490J32459J32476n8197j0734
$$ -100797 -227413 -350736 -312304 -241372 -131862 -147352 -14893 117583 59386 48652
12746D8652L1808j17911j4534R1501J16794K309M671O317p4369K1289j96351k6676
$$ 48652 80460 -37451 -51985 39516 156310 158619 163290 169607 95238 116527 -79824 -106500
12734a06500J28799l7390n800J04091j20710m9726R6167r1669M2536r1731M8472
$$ -106500 22299 -15091 -20891 83200 -37510 -87236 8931 -82738 -40202 -131933 -83461
12723h3461J06845J73993J16665J93r3612p4448O5034j0746l4716r3345Q0368
$$ -83461 23384 197377 314042 314235 220623 146175 211209 200463 165747 72402 152770
12712A52770M5709L6786J62358O9788j3266j82339j22733o8890r0505R5858P9667
$$ 152770 198479 235265 397623 467411 454145 271806 149073 80183 -10322 85536 165203
12701A65203N5285r6908j25861J7791r6608P7798J56625L9682P2990L6973p7961
$$ 165203 220488 123580 -2281 15510 -81098 -3300 153325 193007 265997 302970 225009
12690B25009O6919M125J63507r4409j40350J09159l4804o2897K9729L7248N9948
$$ 225009 291928 296053 459560 365151 224801 333960 299156 236259 265988 303236 363184
12679C63184j32889M981N0727q6850J17776K5188j13494m1596K42615P6458n6795
$$ 363184 230295 235276 286003 199153 316929 342117 228623 187027 429642 506100 449305
12668D49305J13786R9071P816n6005q7076j22882j01311k6629R1601O7916j03492
$$ 449305 563091 662162 669978 613973 526897 404015 302704 276075 367676 435592 332100
12657C32100J73195J48446K7793J05487L3628j48265o4138J2694k634J5303j25152
$$ 332100 505295 653741 681534 787021 820649 672384 608246 620940 618306 633609 508457
12646E08457Q4899m1489j1582L2703o8788j00834K20762K30359N9350r4938k41850
$$ 508457 593356 551867 540285 572988 504200 403366 624128 854487 913837 818899 577049
12635E77049j14262J34413J62199R7610R9465j32361j38215K0329o102j65359
$$ 577049 462787 597200 759399 857009 956474 824113 685898 706227 700125 534766
12625E34766j77330J38297J16755l4808N0712M9145j68274J9129O9291M7215M9943
$$ 534766 357436 495733 612488 577680 628392 677537 509263 528392 597683 644898 694841
12614F94841J08522M0692j42463q8894n3777O1817J45699m1272Q3916K8057j8846
$$ 694841 803363 844055 701592 612698 558921 620738 766437 725165 809081 837138 818292
12603H18292K3753J36060m7269j1861j4199n2566m1593m2101n8368J04083n8400
$$ 818292 842045 978105 930836 918975 904776 852210 810617 768516 710148 814231 755831
12592G55831n353O7314j12681j73449l7640m9166J02408O1448q2265j36446o5396
$$ 755831 750478 817792 705111 531662 494022 444856 547264 608712 526447 390001 324605
12581C24605R6392m8272m8530M1422R9241L221M8581n1863n4103K5890R5653k1898
$$ 324605 420997 372725 324195 365617 464858 468079 516660 464797 410694 436584 532237 510339
12569E10339K8373R3385j45572Q7384J32830J84865N4987j44432k0785j472o9980
$$ 510339 538712 632097 486525 573909 706739 891604 946591 802159 781374 779902 709922
12558G09922O3895k070R3187M6006o9215J9914j08005o3548j08556K2429J15653
$$ 709922 773817 771747 864934 910940 841725 861639 753634 690086 581530 603959 719612
12547G19612n2181k35676q8702N3141j37121P0906O5853k4752O4703J5329J13406
$$ 719612 667431 431755 343053 396194 259073 329979 395832 371080 435783 451112 564518
12536E64518p6059k4681K8101J7145l4833m2526J21804P052j2861j11729j42269
$$ 564518 488459 463778 491879 509024 474191 431665 553469 560521 547660 435931 293662
12525B93662J38184o2005j26137l3076l5529o7459q7307r2843Q050J83696J45173
$$ 293662 431846 369841 243704 210628 175099 107640 20333 -72510 -64460 119236 264409
12514B64409O1400j47300J49160J54805k4361q3098R1654J20213j35715k02947
$$ 264409 325809 178509 327669 482474 458113 375015 466669 586882 451167 248220
12504B48220j86268m5843J8193J53799P6602o6893j88221J79874J49648j9591
$$ 248220 61952 16109 34302 188101 264703 197810 9589 189463 339111 319520
12494C19520o6109k8611M5328j35981j28908J05507N7901Q3092K7413o4210L4939
$$ 319520 253411 224800 270128 134147 5239 110746 168647 251739 279152 214942 249881
12483B49881P4124O1720j3657j59100p4184k8365K39890J17800j1807J01j7411
$$ 249881 324005 385725 372068 212968 138784 110419 350309 468109 456302 456403 438992
12472D38992k18795P0991O2366m256O5841P0809j77333k05083J01521R6465L195
$$ 438992 220197 291188 353554 349298 415139 485948 308615 103532 205053 301518 304713
12461C04713p6216p9226p0384Q4663J49567Q8797j21757m5204l7323P40M7867
$$ 304713 228497 149271 78887 163550 313117 401914 280157 234953 197630 198370 246237
12450B46237k4402O4826p9427j25940Q0320J55802J0583J21618p2744N7253J55153
$$ 246237 221835 286661 207234 81294 161614 317416 327999 449617 376873 434126 589279
12439E89279k9999J18215O9060n3735l7175N059K3134K1469j49367K68k4573p5012
$$ 589279 559280 677495 746555 692820 655645 660704 683838 705307 555940 556208 531635 456623
12427D56623j6878J45444R3467j09148k31090p5764J20532P2287n7059o8321J47536
$$ 456623 439745 585189 678656 569508 338418 262654 383186 455473 398414 330093 477629
12416D77629J76807J62907J03654j05325j17583o5324p4111o7209j13556n0121
$$ 477629 654436 817343 920997 815672 698089 632765 558654 491445 377889 327768
12406C27768K24707K91435O9356j18131k54330l6575k4371O7073m1382j4700l6245
$$ 327768 552475 843910 913266 795135 540805 504230 479859 546932 505550 490850 454605
12395D54605L239L1793J04870j3644M8852j835o3359j37256R2903Q865O5676K16666
$$ 454605 457844 489637 594507 580863 629715 627880 564521 427265 520168 529033 594709 811375
12383H11375Q1234M1128Q6463J04911p5197o9388O1161k8385k58485k1106J01882
$$ 811375 892609 933737 1020200 1125111 1049914 980526 1041687 1013302 754817 733711 835593
12372H35593o5543j67007J4969J56925K6001M6211M3435L3259P3717k8477k46442
$$ 835593 770050 603043 618012 774937 800938 847149 890584 923843 997560 969083 722641
12361G22641k44261K15797J70471Q3021O7195r586j34177K6639m6272o8748k04654
$$ 722641 478380 694177 864648 947669 1014864 1005278 871101 897740 851468 782720 578066
12350E78066Q1124J61801l6956l5968r4358Q8053L1761P1526k3646j32166J05575
$$ 578066 659190 820991 784035 748067 653709 741762 773523 845049 821403 689237 794812
12339G94812j3749J4267J77400j9680r2983J15996k583M2825J51350l9062q0807
$$ 794812 781063 795330 972730 953050 860067 976063 973480 1016305 1167655 1128593 1047786
12328A047786o2411M0252k33283M9558R299K45756L0066R1568L9988r8917o3271
$$ 1047786 985375 1025627 792344 841902 851201 1096957 1127023 1218591 1258579 1159662 1096391
12317A096391Q8372n5347j56915n5535K26864J19526p9451q1566R8705R7707j44417
$$ 1096391 1184763 1129416 972501 916966 1143830 1263356 1183905 1102339 1201044 1298751 1154334
12306A154334j21064O7746P2531j11194o419O3321n5924Q590J43268J61150J5803
$$ 1154334 1033270 1101016 1173547 1062353 1055934 1119255 1063331 1071921 1215189 1376339 1392142
12295A392142j7150q6407j15656N9545J12597J52490J02136M1784j94449j50958
$$ 1392142 1374992 1288585 1172929 1232474 1345071 1497561 1599697 1641481 1447032 1296074
12285A296074J69702R989q9715n093J640J1033J7826j718k9451J17664J50053
$$ 1296074 1465776 1475765 1386050 1380957 1382597 1393630 1411456 1409738 1380287 1497951 1648004
12274A648004l1314r0352m8504j5567m608j69505P9436J32689K28860J36966J0253
$$ 1648004 1616690 1526338 1477834 1462267 1457659 1288154 1367590 1500279 1729139 1866105 1876358
12263A876358n213J870L2818K09585J56799l9329o3556j12940J16385J87820j6013
$$ 1876358 1871145 1873015 1905833 2115418 2272217 2232888 2169332 2056392 2172777 2360597 2344584
12252B344584O4922J28903K53J14060J09711J73250K12163J65654P6669K20920
$$ 2344584 2409506 2538409 2538662 2652722 2762433 2935683 3147846 3313500 3390169 3611089
12242C611089J61863K59677K95993J40113M7946J65030L69830L42563M75717L86874
$$ 3611089 3772952 4032629 4328622 4468735 4516681 4681711 5051541 5394104 5869821 6256695
12232F256695L22855M56705K86444M13842P06062O06296O27923P86741Q02902
$$ 6256695 6579550 7036255 7322699 7736541 8442603 9048899 9676822 10463563 11266465
12223A1266465R40871J057944J202123J327606J412114J301512J341164J420083
$$ 11266465 12207336 13265280 14467403 15795009 17207123 18508635 19849799 21269882
12215B1269882J287889J310283J183273J037233Q90487Q21258P25332P24287O80680
$$ 21269882 22557771 23868054 25051327 26088560 26979047 27800305 28525637 29249924 29930604
12206B9930604O21175Q53823P15018Q95558R88662J201471J239668J090434J458986
$$ 29930604 30551779 31405602 32120620 33016178 34004840 35206311 36445979 37536413 38995399
12197C8995399J571665J658760J667232J690278J681324J832732J454647J340730
$$ 38995399 40567064 42225824 43893056 45583334 47264658 49097390 50552037 51892767
12189E1892767J148032N41492J11922K7276l47747o44685q99852j225027j355939
$$ 51892767 53040799 53582291 53694213 53721489 53373742 52729057 51829205 50604178 49248239
12180D9248239j532530j390487j315167j161807j026215j054271q13237n21929
$$ 49248239 47715709 46325222 45010055 43848248 42822033 41767762 40954525 40432596
12172D0432596n19150m05447k08356q6351k15771j04798j41091n21132n28972
$$ 40432596 39913446 39507999 39299643 39213292 38997521 38892723 38751632 38230500 37701528
12163C7701528n98713p29098p27791q83757j064871r77116j100509j075160j212480
$$ 37701528 37102815 36373717 35645926 34762169 33697298 32720182 31619673 30544513 29332033
12154B9332033j109897r01643p94655r57856o66695n18671l92928n0736J63971
$$ 29332033 28222136 27320493 26525838 25567982 24901287 24382616 23989688 23938952 24102923
12145B4102923L78621N52914O11558P01469J050393J229581J283840J434046J553611
$$ 24102923 24481544 25034458 25646016 26347485 27397878 28627459 29911299 31345345 32898956
12136C2898956J572314J686195J779999J702847J592743J327800J072508J073276
$$ 32898956 34471270 36157465 37937464 39640311 41233054 42560854 43633362 44706638
12128D4706638J215764J162516Q88037Q23972N37615O09976O95055Q55861Q26088
$$ 44706638 45922402 47084918 47972955 48796927 49334542 49944518 50639573 51495434 52321522
12119E2321522R40382J345835J489153J517190J911503J904397J895861K050842
$$ 52321522 53261904 54607739 56096892 57614082 59525585 61429982 63325843 65376685
12111F5376685K099910J933690J661794J375739J110714P78558K58074k43233
$$ 65376685 67476595 69410285 71072079 72447818 73558532 74337090 74595164 74351931
12103G4351931o05062r49453j328082j853640j883775k067000k202972k086055
$$ 74351931 73746869 72797416 71469334 69615694 67731919 65664919 63461947 61375892
12095F1375892j868614j795129j532117j523712j473930j185034r58718o74315
$$ 61375892 59507278 57712149 56180032 54656320 53182390 51997356 51038638 50364323
12087E0364323q36822q70445q04852q45833j048399j066964r45877j328804j410140
$$ 50364323 49527501 48657056 47852204 47006371 45957972 44891008 43945131 42616327 41206187
12078D1206187j554644j713950j822990j757610j809755j892200j962898j929479
$$ 41206187 39651543 37937593 36114603 34356993 32547238 30655038 28692140 26762661
12070B6762661j904169j696991j470017j261761j116415j169369j222168q28164
$$ 26762661 24858492 23161501 21691484 20429723 19313308 18143939 16921771 16093607
12062A6093607q31458r16299o63281n87304n99109m58605m25207m04436n07933
$$ 16093607 15262149 14345850 13682569 13095265 12496156 12037551 11612344 11207908 10699975
12053A0699975m74127k32679l74916l81757m04437l97867k06445j52789k29452
$$ 10699975 10225848 9993169 9618253 9236496 8832059 8434192 8227747 8074958 7845506
12044G845506l36724j09728k06511k26304k6316j7302j11750J557k61645j79280
$$ 7845506 7508782 7399054 7192543 6966239 6939923 6922621 6810871 6812428 6550783 6371503
12034F371503j29009n008q8854k41530k30642q132J16590k9601Q718j5663j5651
$$ 6371503 6242494 6237486 6148632 5907102 5676460 5668328 5784918 5755317 5764035 5748372 5732721
12023E732721n3765j03126J7294o7438j27812J65223r9689l01272j06640J32242
$$ 5732721 5678956 5575830 5593124 5525686 5397874 5563097 5463408 5162136 5055496 5187738
12013E187738k3932K5691M079P5327n1265p3427K1121N2087R7579M3437M4288
$$ 5187738 5163806 5189497 5193576 5268903 5217638 5144211 5165332 5217419 5314998 5358435 5402723
12002E402723J95868J68649J47620p7864l2620k1694J84366J64471N7639J43905
$$ 5402723 5598591 5767240 5914860 5836996 5804376 5782682 5967048 6131519 6189158 6333063
11992F333063J6715J88987R9647J68492J69684J94246K97624K16350K89059Q7933
$$ 6333063 6349778 6538765 6638412 6806904 6976588 7170834 7468458 7684808 7973867 8061800
11982H061800P4208K33520J55077K18611N07618M65761L47324N30797Q12283M55761
$$ 8061800 8136008 8369528 8524605 8743216 9250834 9716595 10063919 10594716 11406999 11862760
11972A1862760M48056P10041O23199Q96855R18631R13563J045991J322548J272980
$$ 11862760 12310816 13020857 13644056 14540911 15459542 16373105 17419096 18741644 20014624
11963B0014624J550012J637903K041765K414118K575520L261186L917348M481399
$$ 20014624 21564636 23202539 25244304 27658422 30233942 33495128 37412476 41893875
11955D1893875N596611P033575Q705144J1119547J4761157J9529073K6537927
$$ 41893875 47490486 54524061 63229205 74348752 89109909 108638982 135176909
11948A35176909L6771119N0256913O5467376P6430422P5609666O0009192L3282335
$$ 135176909 171948028 222204941 287672317 364102739 439712405 499721597 533003932
11941E33003932m01713l5908106o3973630p5626122p1288792n8323945m4103599
$$ 533003932 532602219 496694113 432720483 357094361 285805569 227481624 183378025
11934A83378025l2781456k4531463j8918643j4681028j1631845r305439p583760
$$ 183378025 150596569 126065106 107146463 92465435 80833590 71528151 63944391
11927F3944391o205278n300025m508980l874349l308885k693892k460018k322563
$$ 63944391 57739113 52439088 47930108 44055759 40746874 38052982 35592964 33270401
11919C3270401j889431j413969j399654j342807j236010j271661j161408j053641
$$ 33270401 31380970 29967001 28567347 27224540 25988530 24716869 23555461 22501820
11911B2501820j081825j118730r30389p99775q91440p33094o76765n89821n86533
$$ 22501820 21419995 20301265 19370876 18571101 17679661 16946567 16269802 15679981 15093448
11902A5093448n18604n09412n80740n73113l64461l32616m06523k81042m41796
$$ 15093448 14574844 14065432 13484692 12911579 12547118 12214502 11807979 11526937 11085141
11893A1085141k89365l34554l08195l90885l33714m32370k98698j26971j13441
$$ 11085141 10795776 10461222 10153027 9762142 9428428 8996058 8697360 8570389 8456948
11884H456948j19292k74928r8268j65327k22304r5953k15448j46694j52157j74697
$$ 8456948 8337656 8062728 7964460 7799133 7576829 7480876 7265428 7118734 6966577 6791880
11874F791880o0362j70058l75732k87576M6452M013m9016m7340j51622r5680r9068
$$ 6791880 6731518 6561460 6185728 5898152 5944604 5948617 5899601 5852261 5700639 5604959 5505891
11863E505891M2695l4890q5322k63311o0061O8044l8313p0690j25298j95163K1517
$$ 5505891 5548586 5513696 5428374 5165063 5105002 5173046 5134733 5064043 4938745 4743582 4765099
11852D765099j47844K9379L1567j48638m8154O8352r7998j16899k539J01488k35817
$$ 4765099 4617255 4646634 4678201 4529563 4481409 4549761 4451763 4334864 4332325 4433813 4197996
11841D197996j30481m6488K3857J43310l8609R1497J3392q40j65619k158l8006
$$ 4197996 4067515 4021027 4044884 4188194 4149585 4241082 4254474 4253634 4088015 4085857 4047851
11830D047851k0570J61352N1557r484j53475k3047K30650K41381K35009M0744
$$ 4047851 4027281 4188633 4240190 4230706 4077231 4054184 4284834 4526215 4761224 4801968
11820D801968j65893J3338L9424M5515K48558R582k04572j71224l2396q6497m0552
$$ 4801968 4636075 4649413 4688837 4734352 4982910 4992492 4787920 4616696 4584300 4497803 4457251
11809D457251j7014J5574J664K1018L7212K26063J53550k2128o5920J15341K95096
$$ 4457251 4440237 4455811 4457475 4478493 4515705 4741768 4895318 4873190 4807270 4922611 5217707
11798E217707K3635N7979J36690J74917L00769K57003k1137k0754K21149J29764
$$ 5217707 5241342 5299321 5436011 5610928 5911697 6168700 6147563 6126809 6347958 6477722
11788F477722R1082J53389J00556K38886L46659K44838L30892M26993J65304L77050
$$ 6477722 6568804 6722193 6822749 7061635 7408294 7653132 7984024 8411017 8576321 8953371
11778H953371M67957K50134K88003N27294N70771M33333O60159N34822O13127
$$ 8953371 9421328 9671462 9959465 10486759 11057530 11490863 12151022 12685844 13298971
11769A3298971O41387O55569O37400O59574P49305Q92428R25638R22587R07826
$$ 13298971 13940358 14595927 15233327 15892901 16642206 17534634 18460272 19382859 20290685
11760B0290685R30930Q42859R15738R98781Q48093Q71445P71908O20452Q08146
$$ 20290685 21221615 22064474 22980212 23978993 24827086 25698531 26470439 27090891 27899037
11751B7899037O99866N32722M10828M57460K97763L22451M43302L43120K54228
$$ 27899037 28598903 29131625 29542453 29999913 30297676 30620127 31063429 31406549 31660777
11742C1660777L73333L56998K93130J37817K30322K60702K61810Q8693o6345j83130
$$ 31660777 32034110 32391108 32684238 32822055 33052377 33313079 33574889 33663582 33597237 33414107
11732C3414107k57175j90385k76498k44786l81941n46289n75715q15560q76731
$$ 33414107 33156932 32966547 32690049 32445263 32063322 31517033 30941318 30125758 29249027
11723B9249027o86977r16911p86060m84899o57555q28373o70356m72800m68517
$$ 29249027 28562050 27645139 26859079 26374180 25716625 24888252 24217896 23745096 23276579
11714B3276579m49926n14402l56412k55780n45548l52043k61764j20848R3763
$$ 23276579 22826653 22312251 21955839 21700059 21154511 20802468 20540704 20419856 20513619
11705B0513619N2777j9048J12342J68078L11637J24072K36831L81466L63366M58638
$$ 20513619 20566396 20547348 20659690 20827768 21139405 21263477 21500308 21881774 22245140 22703778
11695B2703778O80408P07921Q22907Q19341R79758R49618R44180J154197J285097
$$ 22703778 23384186 24092107 24915014 25734355 26714113 27663731 28607911 29762108 31047205
11686C1047205J396993J260318J122989J312805J459613J577556J700819J615421
$$ 31047205 32444198 33704516 34827505 36140310 37599923 39177479 40878298 42493719
11678D2493719J689584J528882J361268J256074J113454J078689J059111Q25801
$$ 42493719 44183303 45712185 47073453 48329527 49442981 50521670 51580781 52406582
11670E2406582P33688O65120O74517L87104L43470L23729L28157K68792J91843
$$ 52406582 53140270 53805390 54479907 54867011 55210481 55534210 55862367 56131159 56323002
11661E6323002J15044J21153J04904j6176p6086l55230l31061k79556l58648k75719
$$ 56323002 56438046 56559199 56664103 56647927 56571841 56216611 55885550 55605994 55247346 54971627
11651E4971627n54060r08049j232754j212838j162283j222104j541368j676024
$$ 54971627 54417567 53509518 52276764 51063926 49901643 48679539 47138171 45462147
11643D5462147j601394j523023j585749j541805j295635j397129j379852j407586
$$ 45462147 43860753 42337730 40751981 39210176 37914541 36517412 35137560 33729974
11635C3729974j400116j261267j036255j079280r73213j025528q77722q94610
$$ 33729974 32329858 31068591 30032336 28953056 27979843 26954315 26076593 25181983
11627B5181983p36909o86513o75727n67865o77793l64544l21703m81506l52944
$$ 25181983 24445074 23758561 23082834 22514969 21837176 21472632 21150929 20669423 20316479
11618B0316479k18469q3096k1776L1622k52437k66361j661K11048L79158L57414
$$ 20316479 20098010 20014914 19993138 20024760 19772323 19505962 19504301 19715349 20094507 20451921
11608B0451921K41915J84073L25571M49849N06554N05465O24447N25570M55472
$$ 20451921 20693836 20877909 21203480 21653329 22159883 22665348 23289795 23815365 24270837
11599B4270837M51633O09001M81080N60175N50627N90994N76108L76802M31431
$$ 24270837 24722470 25331471 25812551 26372726 26923353 27514347 28090455 28467257 28898688
11590B8898688K67258K40772l9916l4818J3327L792r9099j93015j79054n223k5750
$$ 28898688 29165946 29406718 29366802 29331984 29345311 29349103 29250004 29056989 28877935 28872712 28846962
11579B8846962j6006k8365k74414k98311l86204l86664k43451k99360o02362n67411
$$ 28846962 28830956 28802591 28528177 28229866 27843662 27456998 27213547 26914187 26311825 25744414
11569B5744414p25409p03829o20351o98849p22344p88964n73115o67033r58225
$$ 25744414 25019005 24315176 23694825 22995976 22273632 21484668 20911553 20244520 19286295
11560A9286295p66727r02013q61757p48263o51075o83621p08323o48125p24239
$$ 19286295 18519568 17617555 16755798 16007535 15356460 14672839 13964516 13316391 12592152
11551A2592152o83883m27198n04019m34248k28894l77884m91446m35808k52246
$$ 12592152 11908269 11481071 10977052 10542804 10313910 9936026 9444580 9008772 8756526
11542H756526k47260k87185m94363k88104k06759j60131j27358k11487k78178
$$ 8756526 8509266 8222081 7727718 7439614 7232855 7072724 6945366 6733879 6455701
11533F455701j54381j13998k37992k17024j60695j14016j33495k80386k25060
$$ 6455701 6301320 6187322 5949330 5732306 5571611 5457595 5324100 5043714 4818654
11524D818654L4625j16474k07106l26909n4802K5960j15057Q0735Q0091k02208
$$ 4818654 4853279 4736805 4529699 4202790 4147988 4173948 4058891 4139626 4219717 4017509
11514D017509j48592j10120l5636q8104j81735k32593M9009J67734j16570m1161
$$ 4017509 3868917 3758797 3723161 3635057 3453322 3220729 3269738 3437472 3320902 3279741
11504C279741J18587j4952j98614l56270J1177P5705K6018J14939k17836j16611
$$ 3279741 3398328 3383376 3184762 2828492 2839669 2915374 2941392 3056331 2838495 2721884
11494B721884P5819m3194r1079m9950j04185r4316k22788r819J07260N0633l303
$$ 2721884 2797703 2754509 2663430 2613480 2509295 2414979 2192191 2182372 2289632 2340265 2336962
11483B336962j364J13528j08196j64999j8043L274P8650j14061k97706j0933m4866
$$ 2336962 2335598 2449126 2340930 2175931 2157888 2161162 2239812 2125751 1828045 1817112 1772246
11472A772246m534o1060K0519j8017j21188Q6375m2019j78594P1611J12736j06350
$$ 1772246 1767712 1706652 1727171 1709154 1587966 1674341 1632322 1453728 1525339 1638075 1531725
11461A531725l5409P1895K2422o2198j54741j16151Q0250Q6544j37028k12411
$$ 1531725 1496316 1568211 1590633 1528435 1373694 1257543 1337793 1424337 1287309 1074898
11451A074898R3033K18498o2354j9642q1432j07276n1182j62091j8621K0009j8330
$$ 1074898 1167931 1386429 1324075 1304433 1223001 1115725 1064543 902452 883831 903840 885510
11440H85510K29136J13906m6066l1134j02288j41436o6138K3668J39025J18471
$$ 885510 1114646 1228552 1182486 1151352 1049064 907628 841490 865158 1004183 1122654
11430A122654k1218Q387M8437j19609n8054l7300n9576q953J8880m7862L6462
$$ 1122654 1101436 1109823 1158260 1038651 980597 943297 883721 874768 893648 845786 882248
11419H82248J54941Q4207n7291j44450k8827j2773j02437p6604J04251J27170
$$ 882248 1037189 1121396 1064105 919655 890828 878055 775618 699014 803265 930435
11409I30435L0360p8937r5044j0853q677P9108k62195k01057K2552L0410P9092
$$ 930435 960795 881858 786814 775961 767284 846392 584197 383140 405692 436102 515194
11398E15194P059R3864Q6722j06755l6173j35921J777J4485j03707K504J68247
$$ 515194 522253 616117 702839 596084 559911 423990 425767 440252 336545 339049 507296
11387E07296J11054j36211j53461O2180O5812K9351O5039j7788m8994Q2682k2373
$$ 507296 618350 482139 328678 390858 456670 486021 551060 533272 484278 566960 544587
11376E44587j08216j29047o1767p3182J15524P0900j84026P1086R0064L2514J15811
$$ 544587 436371 307324 245557 172375 287899 358799 174773 245859 335923 368437 484248
11365D84248l0147J24774l0491o2082r2420m0915J39614j1922j25543N9866j61540
$$ 484248 454101 578875 548384 486302 393882 352967 492581 480659 355116 414982 253442
11354B53442q9311K03179R863j32063P8774O8029o3520o929K0406J06085L3300
$$ 253442 164131 367310 377173 245110 323884 391913 328393 321464 341870 447955 481255
11343D81255J2072l267P1065j23810j66806L2453r9334R9383K66902m5684P500
$$ 481255 493327 490060 561125 437315 270509 302962 203628 303011 569913 524229 531729
11332E31729Q6676m4650k1223j85481p9859Q1820N0747K5344O7293J03412J0723
$$ 531729 618405 573755 552532 367051 287192 369012 419759 445103 512396 615808 626531
11321F26531q3138l9745o0867J35884j08182j01969P622j14504p5689J63749J31987
$$ 626531 543393 503648 442781 578665 470483 368514 376136 261632 185943 349692 481679
11310D81679q637N5319M3764M1019r5894Q2468J44912J09310k53200j27577o4944
$$ 481679 473042 528361 572125 613144 517250 599718 744630 853940 600740 473163 408219
11299D08219L8760J5924O7541k04829j9879R6868l720l5L2787R7820O641p8220
$$ 408219 446979 462903 530444 325615 305736 402604 398884 398849 431636 529456 536097 457877
11287D57877m1299p3681J9399m3103J34268p2593j22299J18115N7987P0814k9921
$$ 457877 416578 342897 362296 319193 453461 380868 258569 376684 434671 505485 475564
11276D75564j85376n2568J6923N7456l7632P4240j43069K7418J09490N8677n453
$$ 475564 290188 237620 254543 311999 274367 348607 205538 232956 342446 401123 395670
11265C95670j634J56047l8353j03649l1438j5772J7336Q5047J22813m6511k53478
$$ 395670 394036 550083 511730 408081 376643 360871 378207 463254 586067 539556 286078
11254B86078j93609l2574J77380J93070J58613j38674k29676j4024J55180j25447
$$ 286078 92469 59895 237275 430345 588958 450284 220608 206584 361764 236317
11244B36317l7128N0664R8288j42872j4798J13131m8128k34815K3564J26919J91629
$$ 236317 199189 249853 348141 205269 190471 303602 255474 20659 44223 171142 362771
11233C62771J00345K0295L8562J35027o025k18490j1251k2677r038p5098r847
$$ 362771 463116 483411 521973 657000 650975 432485 421234 398557 389519 314421 304574
11222C04574J7552q7154J31194J37752K98834R6030j23161j82097l3951j2718
$$ 304574 322126 234972 366166 503918 802752 898782 775621 593524 559573 546855
11212E46855n9100r3997N1515K02704M8347j16414k4688J66571l1294k48823j35256
$$ 546855 487755 393758 445273 647977 696324 579910 555222 721793 690499 441676 306420
11201C06420N2387R4640J73438L5832j30329j00911r9706P9563J10230Q2828j6418
$$ 306420 358807 453447 626885 662717 532388 431477 331771 411334 521564 604392 587974
11190E87974l7128K0007l8526m9927j07086J25182Q9905r1257j32843k6106P3087
$$ 587974 550846 570853 532327 482400 375314 500496 590401 499144 366301 340195 413282
11179D13282R8255L7606Q7999Q9742k4266o6692j04989o749O4147J00869j69127
$$ 413282 511537 549143 637142 726884 702618 635926 530937 524188 588335 689204 520077
11168E20077j44676L529K4188q0148k7348n8658J32189Q9216L979j5247M9943
$$ 520077 375401 378930 403118 322970 295622 236964 369153 458369 462348 447101 497044
11157D97044J15474l4160J58619o5551n1756M2498J4066J65062j13758j40976
$$ 497044 612518 578358 736977 671426 619670 662168 676234 841296 727538 586562
11147E86562J9543N9909J20000N1314l4760L5383n6058l24695j52877J88274K35188
$$ 586562 606105 666014 786014 837328 802568 837951 781893 457198 304321 492595 727783
11136G27783l6577Q7749L2795j33484j87595M7079J34187k9559O6278O8342q943
$$ 727783 691206 778955 811750 678266 490671 537750 671937 642378 708656 776998 768055
11125G68055L864o3021j9093O4356N7775R3541k3515L54298K35076N4830p6521
$$ 768055 771919 708898 689805 754161 811936 905477 881962 1236260 1471336 1526166 1449645
11114A449645j35172l6508J19042J06271J42931P1212J57080K00695J51839J01328
$$ 1449645 1314473 1277965 1397007 1503278 1646209 1717421 1874501 2075196 2227035 2328363
11104B328363Q4299J26356L70418K54595K75107K36916N7660p4465j85703j94544
$$ 2328363 2412662 2539018 2909436 3164031 3439138 3676054 3733714 3659249 3473546 3279002
11094C279002k64357j63106m6860J19231k30200l58763l52592j12746j04241r7235
$$ 3279002 3014645 2851539 2804679 2923910 2693710 2334947 1982355 1869609 1765368 1668133
11084A668133O751j42026j14951o5178j40548l6949Q6520j0817q538j32561j94426
$$ 1668133 1674884 1532858 1417907 1352729 1212181 1175232 1261752 1250935 1242397 1109836 915410
11073I15410o0947j12392R7712l2115O2484K03330N3616j92569j37042P7598J4836
$$ 915410 854463 742071 839783 807668 870152 1073482 1127098 934529 797487 875085 889921
11062H89921J39055p5794j07659p3150k4814j12332O8847K6187J20311J64163
$$ 889921 1028976 953182 845523 772373 747559 635227 704074 730261 850572 1014735
11052A014735p1126J8398J85997j29094k32950R7085J11529M2149k4370P2446
$$ 1014735 943609 962007 1148004 1018910 785960 883045 994574 1036723 1012353 1084799
11042A084799R3388P605R6330m2398m3392L5778J18570p3995r5459j76970J19548
$$ 1084799 1178187 1185792 1282122 1239724 1196332 1232110 1350680 1276685 1181226 1004256 1123804
11031A123804K97975q928k10868K8138R3454J33155K14766M1779m2520k2799j1877
$$ 1123804 1421779 1412851 1201983 1230121 1323575 1456730 1671496 1713275 1670755 1647956 1636079
11020A636079j58666k00111j37830K5513o0850Q0148J02626j5772P0116P2339
$$ 1636079 1477413 1277302 1139472 1164985 1104135 1184283 1286909 1271137 1341253 1413592
11010A413592j00340j40062k19311j8683J84409j45159r7983j8002n2176M6567
$$ 1413592 1313252 1173190 953879 935196 1119605 974446 876463 858461 806285 852852
11000H52852o8885Q7853N9819P4490j62235k13797J1555J34871L3877J24621J07169
$$ 852852 783967 871820 931639 1006129 843894 630097 641652 776523 810400 935021 1042190
10989A042190j04573l7177p3735K1507l5619q3092J388J44068o6852J0164l0968
$$ 1042190 937617 900440 826705 848212 812593 729501 730889 874957 808105 818269 787301
10978G87301j48592j177N61N0205J55140J24489l0432l9310M8298q172K031j18700
$$ 787301 638709 637532 638093 688298 843438 967927 937495 898185 946483 938311 940342 821642
10966H21642L4722J62072l1576j86099j37554n7001o8462n6646n1481M4361J3685
$$ 821642 856364 1018436 986860 800761 663207 606206 537744 481098 429617 473978 487663
10955D87663J28937P7035l6228o2320J26518o4081q0658j40900L3215P1425K04491
$$ 487663 616600 693635 657407 595087 721605 657524 576866 435966 469181 540606 745097
10944G45097r377j28108l5560N6551J75255R0053q2904K8442J35793O0344j37219
$$ 745097 735720 607612 572052 628603 803858 893911 811007 839449 975242 1035586 898367
10933H98367j84509m7828K1971J1361K6532l4392J18473J6180q7084n2284M9232
$$ 898367 713858 666030 688001 699362 725894 691502 809975 826155 739071 686787 736019
10922G36019N7385l0824K664L8311J36585l0751p8676N0018J7249l8045o1402
$$ 736019 793404 762580 765244 803555 940140 909389 830713 880731 897980 859935 798533
10911G98533j42944P3028p1211o0512J66145J0910R799o1248p9961j12293q3834
$$ 798533 655589 728617 657406 596894 763039 773949 783748 722500 642539 530246 446412
10900D46412Q0239K52559J07759L9778o6165l8153R479j75913j18227l8631m1172
$$ 446412 526651 779210 886969 926747 860582 822429 831908 655995 537768 499137 457965
10889D57965J12188J03778l3856m5669P267j012J34331Q2229j15388R961O5525
$$ 457965 570153 673931 640075 594406 601673 600661 734992 817221 701833 711794 777319
10878G77319q5476J08100J80446j82671o3519J19646J88212Q9870r7343P5669
$$ 777319 691843 799943 980389 797718 734199 853845 1042057 1131927 1034584 1110253
10868A110253p8512L7425J59507K8898j11771L5567O3891Q5077j94797k0577J26906
$$ 1110253 1031741 1069166 1228673 1257571 1145800 1181367 1245258 1330335 1135538 1114961 1241867
10857A241867J15347J4908L8345l697J6144L8723J32243M0171p6648j31748J5658
$$ 1241867 1357214 1372122 1410467 1406770 1422914 1461637 1593880 1634051 1557403 1425655 1441313
10846A441313J09723p4990p078Q652p8030j33165O6956J42466L5509R059K21281
$$ 1441313 1551036 1476046 1468968 1477620 1399590 1266425 1333381 1475847 1511356 1520415 1741696
10835A741696J51972o6265j44478J22317Q0482j12676l8412N8770K8749j87021
$$ 1741696 1893668 1827403 1682925 1805242 1885724 1773048 1734636 1793406 1822155 1635134
10825A635134q837J19699N2123O5212j7541l6860j00460P6377M6238R5427n7266
$$ 1635134 1626297 1745996 1798119 1863331 1845790 1808930 1708470 1784847 1831085 1926512 1869246
10814A869246j41905m4331L6474j089K1601j33299L8859J18317J45714M1621l10786
$$ 1869246 1727341 1683010 1719484 1718395 1739996 1606697 1645556 1763873 1909587 1951208 1640422
10803A640422k28543J35334o2649k1446K43518J21612p585J04564Q8807j74749
$$ 1640422 1411879 1547213 1484564 1463118 1706636 1828248 1820663 1925227 2014034 1839285
10793A839285J36402K6586J06425J54032j25076P1888K09680K1380k8628K06121
$$ 1839285 1975687 2002273 2108698 2262730 2137654 2209542 2419222 2440602 2411974 2618095
10783B618095J55503l5506K0141J13976R4188J21020O7126J33808J45121L44017
$$ 2618095 2773598 2738092 2758233 2872209 2966397 3087417 3154543 3288351 3433472 3777489
10773C777489J67035J23292K72648L35093J73698K74525N34141L01513L03885
$$ 3777489 3944524 4067816 4340464 4675557 4849255 5123780 5657921 5959434 6263319
10764F263319M94386N94648N36819P86435R87145R27878R73376J063138R45893
$$ 6263319 6757705 7352353 7889172 8675607 9662752 10590630 11564006 12627144 13573037
10755A3573037P89828O01432N98678J93478j27253k13314j36902m40406m64117
$$ 13573037 14362865 14964297 15562975 15756453 15629200 15415886 15278984 14838578 14374461
10746A4374461m55977o08952k77782l19666m35697k76321N310K57589J88808J05037
$$ 14374461 13918484 13309532 13031750 12712084 12276387 12000066 12005376 12262965 12451773 12556810
10736A2556810M59677O01516O31655O34163O60559O93435O53938N52612L92568
$$ 12556810 13016487 13618003 14249658 14883821 15544380 16237815 16891753 17444365 17836933
10727A7836933L07397K61437j71378l07078n14030m93161p31510o93771q59717
$$ 17836933 18144330 18405767 18234389 17927311 17413281 16920120 16188610 15494839 14635122
10718A4635122p57424o19485p20546o41394n31696n45360m07151k23704j65363
$$ 14635122 13877698 13258213 12537667 11896273 11364577 10819217 10412066 10188362 10022999
10709A0022999k13367k30672L229o2180n0183r748n293K05495J43750K39571L50940
$$ 10022999 9809632 9578960 9582189 9520009 9469826 9460078 9454785 9660280 9804030 10043601 10394541
10698A0394541L33032M88736M37732N01411N19985N92986P64833R29885R74931
$$ 10394541 10727573 11216309 11654041 12155452 12675437 13268423 14033256 14963141 15938072
10689A5938072J099814J138599J409451J659851J764694J643501J665200J821430
$$ 15938072 17037886 18176485 19585936 21245787 23010481 24653982 26319182 28140612
10681B8140612J583258J505332J467462J264656J277822J309780J002079J010785
$$ 28140612 29723870 31229202 32696664 33961320 35239142 36548922 37551001 38561786
10673C8561786Q49624P12401P89063R05830P16713M52381L28367J84921j59460
$$ 38561786 39411410 40123811 40912874 41818704 42535417 42987798 43316165 43501086 43341626
10664D3341626j96579l18666n31388m93236q7777m4826q4798J19744M01907M78764
$$ 43341626 43145047 42826381 42294993 41801757 41713980 41669154 41584356 41704100 42106007 42584771
10654D2584771M00958L71112M46232M44677J06074J03876J77611K2546j54519
$$ 42584771 42985729 43356841 43803073 44247750 44353824 44457700 44635311 44657857 44503338
10645D4503338l84202q36754l80904m84700o49282n86943p87805r85338r09770
$$ 44503338 44119136 43282382 42901478 42416778 41767496 41180553 40392748 39407410 38497640
10636C8497640j099740j073444r41080j083494r51856p68527n51243j59847M06940
$$ 38497640 37397900 36324456 35383376 34299882 33348026 32579499 32028256 31868409 32275349
10627C2275349J003990J330116K240082L408444M667466N744828O924673P613625
$$ 32275349 33279339 34609455 36849537 40257981 44925447 50670275 57594948 65208573
10619F5208573P258840N881747M377732K670410J137126R94434K106155M416728
$$ 65208573 72467413 78349160 82726892 85397302 86534428 87528862 89635017 94051745
10611I4051745P317092J0941812J3905604J4762023J3176932J0199567N976939
$$ 94051745 101368837 112310649 126216253 140978276 154155208 164354775 170331714
10604A70331714J226718k383371l704039j798000K476351P745597J2637784J5950558
$$ 170331714 171558432 169175061 165471022 163673022 166149373 173894970 186532754 202483312
10596B02483312J6299900J3184218P668522M04231p111722j2706225j4712924
$$ 202483312 218783212 231967430 239635952 240040183 232928461 220222236 205509312
10589B05509312j3007971q897775l704879O99382L673281M415412K542184q62902
$$ 205509312 192501341 183603566 179898687 180598069 184271350 188686762 191228946 190366044
10581A90366044n363232r837867j2523642j2867946j1276791q088134m884933
$$ 190366044 185002812 175164945 162641303 149773357 138496566 130408432 125523499
10574A25523499k143706n63762k21736r73160k372307m384993o438659p613497
$$ 125523499 123379793 122816031 122594295 121621135 119248828 114863835 108425176 100811679
10566A00811679p762908p442858o808393n897675n285520m702108m174069l848234
$$ 100811679 93048771 85605913 78797520 72899845 67614325 62912217 58738148 54889914
10558E4889914l592152l290547k985284k978696k776770k628466k192035j825767
$$ 54889914 51297762 48007215 45021931 42043235 39266465 36637999 34445964 32620197
10550C2620197j925918j781324j563069j183967j167420j078584q08999p78204
$$ 32620197 30694279 28912955 27349886 26165919 24998499 23919915 23110916 22332712
10542B2332712p57372o73080n07941o08232n19611k71375k45121k48328l11822
$$ 22332712 21575340 20902260 20394319 19786087 19266476 18995101 18749980 18501652 18189830
10533A8189830J9013J23761J10356J92675K91718M88537N37238N86745P73043
$$ 18189830 18208843 18332604 18442960 18635635 18927353 19415890 19953128 20539873 21312916
10524B1312916P28684Q86933R21563J016189J052472R75006N13729L56031K6659
$$ 21312916 22041600 22928533 23850096 24866285 25918757 26893763 27407492 27763523 27790182
10515B7790182k78820m81670p97202r79725j044943r54072j033187r76595r49308
$$ 27790182 27511362 27029692 26232490 25252765 24207822 23253750 22220563 21243968 20294660
10506B0294660p49376m30722m74900l79177j84186m4553K39722L72237L91218
$$ 20294660 19545284 19114562 18639662 18260485 18076299 18031746 18271468 18643705 19034923
10497A9034923N58585N41690M67962M14348O77672M26705N0107l8020l25931n06076
$$ 19034923 19593508 20135198 20603160 21017508 21695180 22121885 22171992 22133972 21808041 21301965
10487B1301965n59160p23507j080084j083933j307542j421398q67401r61312q50954
$$ 21301965 20742805 20019298 18939214 17855281 16547739 15126341 14258940 13297628 12446674
10478A2446674q43620q15615n79212n58181n04506n57172l61813l94326k16762
$$ 12446674 11603054 10787439 10208227 9650046 9145540 8588368 8226555 7832229 7615467
10469G615467k16501k54557m84883k76895k28933k62740k44425j43524k18204
$$ 7615467 7398966 7144409 6659526 6382631 6153698 5890958 5646533 5503009 5284805
10460E284805k55832J9090j11193k80578k19783j86599q8948o9948L6391j2373
$$ 5284805 5028973 5048063 4936870 4656292 4436509 4249910 4160962 4091014 4127405 4115032
10450D115032j65828p9464j65193r7783j01141k07494j7006m5207k38444j82468
$$ 4115032 3949204 3869740 3704547 3606764 3505623 3298129 3281123 3235916 2997472 2815004
10440B815004j35733J51J72034J36810j4071r5381r0388K9958q8188M8953j91713
$$ 2815004 2679271 2679422 2851456 2988266 2974195 2878814 2788426 2818384 2730196 2779149 2587436
10429B587436j01516n2078J9298K3158m6254l2730Q3297j12553j70450J24650
$$ 2587436 2485920 2433842 2453140 2476298 2430044 2397314 2480611 2368058 2197608 2322258
10419B322258R5000K5977m3706r9137r0133j40123r4487M7063j625n2827L870
$$ 2322258 2417258 2443235 2399529 2300392 2210259 2070136 1975649 2022712 2021087 1968260 1972130
10408A972130K3980K27677n6439j71187j9822R0892O1593j24402j26135k1214
$$ 1972130 1996110 2223787 2167348 1996161 1976339 2067231 2128824 2004422 1878287 1857073
10398A857073J50183p4018m8758n1266j00296K46484L8910p3963k3003K01083
$$ 1857073 2007256 1933238 1884480 1833214 1732918 1979402 2018312 1944349 1921346 2122429
10388B122429P4216k88055j53226J1419M837R9457M800K0023r7905J14049J98489
$$ 2122429 2196645 1908590 1755364 1766783 1771620 1871077 1875877 1895900 1797995 1912044 2110533
10377B110533l5302j84824R9656K24956L6270j8726r3859P6952J90606o1188n2013
$$ 2110533 2075231 1890407 1990063 2215019 2251289 2232563 2138704 2215656 2406262 2345074 2293061
10366B293061l2129J59284J07471k7610j3372M6269k3808R1181k2635N4908K3880
$$ 2293061 2260932 2420216 2527687 2500077 2486705 2532974 2509166 2600347 2577712 2632620 2656500
10355B656500M8965J02258K56819O4844k8844J30559J7607P420J75926N9090K32890
$$ 2656500 2705465 2807723 3064542 3129386 3100542 3231101 3248708 3256128 3432054 3491144 3724034
10344C724034J43153K58691K31814o0194M2005K07575K70403M44457L39452L42058
$$ 3724034 3867187 4125878 4357692 4297498 4339503 4547078 4817481 5261938 5601390 5943448
10334E943448K48209L49540N44273M70642N52400O04325Q09249P96384P36225
$$ 5943448 6191657 6541197 7085470 7556112 8108512 8712837 9522086 10318470 11054695
10325A1054695J002499R73430Q69014R72764J166591J160742J054286J044481
$$ 11054695 12057194 13030624 13899638 14872402 16038993 17199735 18254021 19298502
10317A9298502J178164J157989J134549J033063J058811J255302J290312J317646
$$ 19298502 20476666 21634655 22769204 23802267 24861078 26116380 27406692 28724338
10309B8724338J278867J450619J684886J539266J527614J551137K077420K073326
$$ 28724338 30003205 31453824 33138710 34677976 36205590 37756727 39834147 41907473
10301D1907473J981856K214943K253844K352185J985098J744361J604560J246938
$$ 41907473 43889329 46104272 48358116 50710301 52695399 54439760 56044320 57291258
10293E7291258R41727P79578N66039O15926M52183L65709o7191J31376J21177
$$ 57291258 58232985 59012563 59578602 60194528 60646711 61012420 60945229 61076605 61197782
10284F1197782m5052j11464P4207N4813J56850J19853J31260N79688P96432O62990
$$ 61197782 61152730 61041266 61115473 61170286 61327136 61446989 61578249 62157937 62954369 63617359
10274F3617359N31723M50070L79757K77016j01725k14074m79337q47832j012969
$$ 63617359 64149082 64599152 64978909 65255925 65154200 64940126 64460789 63612957 62599988
10265F2599988j237382j476392j479168j493248j741099j828144j597251j933326
$$ 62599988 61362606 59886214 58407046 56913798 55172699 53344555 51747304 49813978
10257D9813978j912913j682243j576071j329508j356470j329220j205378j146361
$$ 49813978 47901065 46218822 44642751 43313243 41956773 40627553 39422175 38275814
10249C8275814j044703r06758j067945j000794q63221q40453o37982n19624m79879
$$ 38275814 37231111 36324353 35256408 34255614 33392393 32551940 31913958 31394334 30914455
10240C0914455m30266l25165l52274m48132l44764l40962n12695m86227k13488
$$ 30914455 30484189 30159024 29806750 29358618 29013854 28672892 28160197 27673970 27460482
10231B7460482j81493j53372q0007R3287L7775Q2437K73037N75814M78028N26425
$$ 27460482 27278989 27125617 27045610 27138897 27176672 27259109 27532146 28107960 28585988 29112413
10221B9112413P17253O33706O27390P69062R52860J009109J121370J042472J178306
$$ 29112413 29829666 30463372 31090762 31859824 32812684 33821793 34943163 35985635 37163941
10212C7163941R79328R72191J133257J038455Q21494O34022N32519M80726L10515
$$ 37163941 38143269 39115460 40248717 41287172 42108666 42742688 43275207 43755933 44066448
10203D4066448J39474n8636k04952l62501l39321l04858m13926n34095l17313
$$ 44066448 44205922 44147286 43942334 43579833 43240512 42935654 42521728 41987633 41670320
10194D1670320j95363l0681L4690k3257K28278j8716K0276J61250m6572m3138
$$ 41670320 41474957 41444276 41478966 41455709 41683987 41665271 41685547 41846797 41800225 41757087
10184D1757087j72174j27132k29682k83319m64274p92467j042506j051142j058255
$$ 41757087 41584913 41457781 41228099 40944780 40480506 39688039 38645533 37594391 36536136
10175C6536136j160016j220302j327888j268269j491215j354364j057002r36179
$$ 36536136 35376120 34155818 32827930 31559661 30068446 28714082 27657080 26720901
10167B6720901r74096j058891r34091q38988p85374p33705o89070p63745o97580
$$ 26720901 25746805 24687914 23753823 22914835 22129461 21395756 20706686 19942941 19245361
10158A9245361p27353o73536p45696p31952n74038p84222p99031q67618p98655
$$ 19245361 18518008 17844472 17098776 16366824 15792786 15008564 14209533 13341915 12543260
10149A2543260o68042p49088o51114m46130l03611l48056p80796p87396m30176
$$ 12543260 11875218 11126130 10475016 10028886 9725275 9377219 8596423 7809027 7378851
10140G378851k87148k72360k54679k78998k67709j83960m3078o7207l14337l58382
$$ 7378851 7091703 6819343 6564664 6285666 6017957 5833997 5790919 5723712 5409375 5050993
10130E050993k91082l0992k25787j52204j28131r7180o5572l5269p044j95396
$$ 5050993 4759911 4728919 4503132 4350928 4222797 4125617 4060045 4024776 4017732 3822336
10120C822336j10596k68977k00921m3442j36096j09781j18140m6975k23110q5675
$$ 3822336 3711740 3442763 3241842 3198400 3062304 2952523 2834383 2787408 2564298 2478623
10110B478623J49044r306J22488N7361n4014j87110j31739j114o0636k2943j62253
$$ 2478623 2627667 2618361 2740849 2798210 2744196 2557086 2425347 2424233 2363597 2340654 2178401
10099B178401k3123J973j81051P810L03346l0827k44259j3148J50773n7529j41357
$$ 2178401 2155278 2157251 1976200 1984010 2287356 2256529 2012270 1999122 2149895 2092366 1951009
10088A951009j77635o8710J07711n7846J538K1122j58023L9170J54642r1200j14426
$$ 1951009 1773374 1704664 1812375 1754529 1756067 1777189 1619166 1658336 1812978 1721778 1607352
10077A607352j46042q4101Q8018J00320j01309R0399j754O97r7940j54106J42273
$$ 1607352 1461310 1377209 1465227 1565547 1464238 1554637 1552883 1553580 1455640 1301534 1443807
10066A443807L340p7661M1395l6139o0912J8631N0653N5349K8778J18477p1651
$$ 1443807 1447147 1369486 1410881 1374742 1313830 1332461 1383114 1438463 1467241 1585718 1514067
10055A514067o0028j00352j33230j05408j20219L9767J62234N4720L226L5155
$$ 1514067 1454039 1353687 1220457 1115049 994830 1034597 1196831 1251551 1254777 1289932
10045A289932j06734m0424P9233Q8755m2860N7319K3689K618m0404K501N9657
$$ 1289932 1183198 1142774 1222007 1310762 1267902 1325221 1348910 1351528 1311124 1313625 1373282
10034A373282R763q6468P741n5102m9716j41295j41351K19377L0882j20299J921
$$ 1373282 1383045 1296577 1304318 1249216 1199500 1058205 916854 1136231 1167113 1046814 1048735
10023A048735O605J546k0187l6650J37526J14158R404k21276p5707N1018J47336
$$ 1048735 1055340 1056886 1036699 1000049 1137575 1251733 1261137 1039861 964154 1015172 1162508
10012A162508o1635k11267p9848K5315o6271P7351l3809O340n608j6536j38986
$$ 1162508 1100873 889606 809758 835073 768802 846153 812344 818684 813076 796540 657554
10001F57554J15422O0623j17965p1408M3498L356P6803Q8649k4055O0011p3896
$$ 657554 772976 833599 715634 644226 687724 691080 767883 856532 832477 892488 818592
9990H18592N1396l1716j803q9529P746J04259Q5960L5775Q706j76853k97327Q2783
$$ 818592 869988 838272 836469 746940 754686 858945 944905 980680 989386 812533 515206 597989
9978E97989J8856j27911j2561J22671L167n4404l0750k1532p6424K0919P9571
$$ 597989 616845 488934 476373 599044 602211 547807 517057 495525 419101 440020 519591
9967E19591k9871k2003O003J31322j22487j42491J36792J46025Q7543j162M9944
$$ 519591 489720 467717 473720 605042 482555 340064 476856 622881 710424 709262 759206
9956G59206j33056j50684j01809n9540R7273o8215o0585J32761K03441k314r908
$$ 759206 626150 475466 373657 314117 411390 343175 282590 415351 618792 616478 606570
9945F06570m7619m5623R2992m7043k4505r9660L1236M1126K472k3691J95053K03916
$$ 606570 558951 513328 606320 559277 534772 435112 466348 507474 509946 486255 681308 885224
9933H85224o3431k0347k8345l1450j02241j10152l9124L799P3739K4874j59912
$$ 885224 821793 801446 773101 741651 639410 529258 490134 493933 567672 592546 432634
9922D32634k31432J02889K18281n1528o9386j46225o8784J1040J66088J75513
$$ 432634 201202 304091 522372 470844 401458 255233 186449 197489 363577 539090
9912E39090j18144l6112R7187j6157k00932Q099R0853J2795L5157Q6580l0566
$$ 539090 420946 384834 482021 465864 264932 273031 363884 376679 411836 498416 467850
9901D67850K0254J88744Q6976o4494m8298k49464L5787K17394r5381k37961J35361
$$ 467850 488104 676848 763824 699330 651032 401568 437355 654749 559368 321407 456768
9890D56768p4164j30051l2598k1379m5414P538M9131J53486K54407Q8429o3535
$$ 456768 382604 252553 219955 198576 153162 160700 209831 363317 617724 706153 642618
9879F42618j0827j5417J04063J6112j08365k45524j80122Q3081J85695P0671Q744
$$ 642618 631791 616374 720437 736549 628184 382660 202538 285619 471314 541985 550729
9868E50729m097N8043J3634m3856m9458p223P1102k6778q0496k02933K9717J83991
$$ 550729 546632 604675 618309 574453 524995 517772 588874 562096 481600 278667 308384 492375
9856D92375R8116j55335j55604P9507N4351j160K3652J68232Q7218k40J0290N2034
$$ 492375 590491 435156 279552 359059 413410 412250 435902 604134 691352 691112 701402 753436
9844G53436p6796k3830j52822r8589P3940J47904J7351n1331N9508L2525r4983
$$ 753436 676640 652810 499988 401399 475339 623243 640594 589263 648771 681296 586313
9833E86313m7470o7134j51884n160N9542N3440N5071K0662J8073k37851k13165
$$ 586313 538843 471709 319825 314665 374207 427647 482718 503380 521453 283602 70437
9822G0437K6659K27808J82416l3811j5564r73j5380N7285l5800l3200j38964n1182
$$ 70437 97096 324904 507320 473509 457945 456972 441592 498877 463077 429877 290913 239731
9810B39731K71100j6085k53353j23045N6076J561o5668j88059N8164L10679J37228
$$ 239731 510831 494746 241393 118348 174424 175985 110317 -77742 -19578 291101 428329
9799D28329K7948L5677J55620J78043j17462m4251M3593J86595k61294j83714
$$ 428329 456277 491954 647574 825617 708155 663904 707497 894092 632798 449084
9789D49084j43490j68290M6770P3709J11934L9054K5165K58865J1267r0045k3294
$$ 449084 305594 137304 184074 257783 369717 408771 433936 692801 704068 614023 590729
9778E90729n923l040l8596M3990Q0579k3838k5902n9552j81316J692N4279N495
$$ 590729 584806 581766 543170 587160 667739 643901 617999 558447 377131 378823 433102 438597
9766D38597J4841Q2218r1451m6127j02409m3550J40240K3917j1563K7607K07171
$$ 438597 453438 535656 444205 398078 295669 252119 392359 416276 404713 432320 639491
9755F39491j22821j4888P3478K6167N4440K5632r4983m6043q3098o2398k6678
$$ 639491 516670 501782 575260 601427 655867 681499 586516 540473 457375 394977 368299
9744C68299j01242M3467n3369n5325J41861k4751j4152J7189K0911O7832q9767
$$ 368299 267057 310524 257155 201830 343691 318940 304788 321977 342888 410720 320953
9733C20953o6449Q2696J07850m5543n9641n6749l7062k5337p0784J03385K1291
$$ 320953 254504 337200 445050 399507 339866 283117 246055 220718 149934 253319 274610
9722B74610k12321j6293L678l6223k2994K11515M4579M0036K1027j17268j8258
$$ 274610 62289 45996 49674 13451 -9543 201972 246551 286587 307614 190346 172088
9711A72088k008J92436J34430j00839k26658o2500j6714J20113J6461r9804O3191
$$ 172088 170080 362516 496946 396107 169449 106949 90235 210348 226809 127005 190196
9700A90196j2279j43671j186r919l6001Q708J06566O6623k99231j01858K74111
$$ 190196 177917 34246 33060 23141 -12860 -4152 102414 169037 -130194 -232052 42059
9689D2059K77579J03831j33764k62523j50342Q6455O4286J13433J88774M3969
$$ 42059 319638 423469 289705 27182 -123160 -36705 27581 141014 329788 373757
9679C73757p716j08459Q2982J90774j52352j75402k23715J2950k1298L8038M6731
$$ 373757 366041 257582 340564 531338 378986 203584 -20131 -7181 -28479 9559 56290
9668E6290q6536J5017J66460J3815M89L5143L8258N4473Q6295j3195J8919L3002
$$ 56290 -30246 -15229 151231 165046 165535 200678 238936 293409 379704 366509 385428 418430
9656D18430q32J38232J49851M4786k3424j9532l8817j03360k22658j28126N6768
$$ 418430 417598 555830 705681 750467 727043 707511 668694 565334 342676 214550 271318
9645B71318J4766q3766N2667M9556p8663L3103j12992j47403N6952J04220p0906
$$ 271318 286084 202318 254985 304541 225878 258981 145989 -1414 55538 159758 88852
9634H8852r7647K881q3589Q3456L7910k4307j03909n2763j2464J95092m0447j35670
$$ 88852 -8795 -5914 -89503 -6047 31863 7556 -96353 -149116 -161580 33512 -6935 -142605
9622a42605j10673Q525R3631K12112J26626L5179r4434k17392o2212m0743L994
$$ -142605 -253278 -244753 -151122 60990 187616 222795 128361 -89031 -151243 -191986 -187992
9611a87992K08406N91j45082n5116K6478J56219m8476m7689J1100M9800q112q462
$$ -187992 20414 21005 -124077 -179193 -152715 3504 -44972 -92661 -81561 -31761 -39873 -48335
9599d8335l8046l3454o9415k1811K3269N9563m7180j3758j14180l2736J39234
$$ -48335 -86381 -119835 -189250 -211061 -187792 -128229 -175409 -189167 -303347 -336083 -196849
9588a96849M0148m0534J21111K4225o858j76716l2852K3741K93195J79548m1117
$$ -196849 -156701 -197235 -76124 -51899 -58757 -235473 -268325 -244584 48611 228159 187042
9577A87042j46095k41196R366J19941K22963M6977k4535K05794K6689j82139j16425
$$ 187042 40947 -200249 -190883 -70942 152021 198998 174463 380257 406946 224807 108382
9566A08382j89525o9473J70119p4549p1419P1571J38566p2751l8874J03654j02604
$$ 108382 -81143 -150616 19503 -55046 -126465 -54894 83672 10921 -27953 75701 -26903
9555b6903j03707l7125J60761M2991m8939k6860K338r1148k1600L711J46974J76879
$$ -26903 -130610 -167735 -6974 36017 -12922 -39782 -37444 -128592 -150192 -146481 493 177372
9543A77372j9038j13532M9704K36696K1305J3791m5268k09643l1542N2230m9514
$$ 177372 158334 44802 94506 331202 352507 366298 321030 111387 79845 132075 82561
9532H2561j28788M4373J8289M6429O5963k0570J04883q466p5837J83866k2831
$$ 82561 -46227 -1854 16435 62864 128827 108257 213140 204674 128837 312703 289872
9521B89872q2119R3606m2276k29561q7032L3373o4683J03379K2822j19710K6698
$$ 289872 207753 301359 259083 29522 -57510 -24137 -88820 14559 37381 -82329 -55631
9510e5631J37190M409J5043r6758l649j641n7284o5429J46326M2552K15744J34946
$$ -55631 81559 85968 101011 4253 604 -1037 -58321 -123750 22576 65128 280872 415818
9498D15818r1398l28q7788j74547M2077J1683J1529Q1656K5167R803o9304K7649
$$ 415818 324420 324092 236304 61757 103834 115517 127046 208702 233869 243672 174368 202017
9486B02017N6716j72624m3786J14902k6673l0069J54528J39271R7355M5640M4091
$$ 202017 258733 86109 42323 157225 130552 100483 255011 394282 491637 537277 581368
9475E81368j56214L5832K613p4994p0423j32915P9565N108j16528O1970n3089
$$ 581368 425154 460986 463599 388605 318182 185267 264832 269940 153412 215382 162293
9464A62293n1531M6614J9569Q8822p6255J1329o2166J0298K8633P5452J90338
$$ 162293 110762 157376 176945 265767 189512 200841 138675 148973 177606 253058 443396
9453D43396L5617l6108j2716O4424J3159J22278l4034o8729j64998k4189o2374
$$ 443396 479013 442905 430189 494613 507772 630050 596016 527287 362289 338100 275726
9442B75726N3862J15852l2911q1635J46042l1519m5014o61p9064N1041j2088M7352
$$ 275726 329588 445440 412529 330894 476936 445417 400403 399742 320678 371719 359631 406983
9430D06983J53192J48526Q1394Q2932j13470j87247L5982M0100p6779n3234P7264
$$ 406983 560175 708701 790095 873027 759557 572310 608292 648392 571613 518379 595643
9419E95643M1455Q3405J66946K356k0554N8525j02753N7242Q500j97698K9783
$$ 595643 637098 720503 887449 889805 869251 927776 825023 882265 890765 693067 722850
9408G22850J06902N9474J86630O1946r0600j5249q6331L0443J72340Q6643j35334
$$ 722850 829752 889226 1075856 1137802 1047202 1031953 945622 976065 1148405 1235048 1099714
9397A099714k34024j26681L8065j3065Q5459K075J52581R4696L9946L1965M1127
$$ 1099714 865690 739009 777074 764009 849468 851543 1004124 1098820 1138766 1170731 1211858
9386A211858n3897n7879K8738L107j72745k76611Q3861J31201P7428O5942J1692
$$ 1211858 1157961 1100082 1128820 1131927 959182 682571 766432 897633 975061 1041003 1052695
9375A052695J0428o1071Q556m9827J7630L0177m2381j58270n2472l1487l7347
$$ 1052695 1063123 1002052 1010608 960781 978411 1008588 966207 807937 755465 723978 686631
9364F86631J2526P8556n4242j21997o9340N3577l047O643j9369j07237Q8775R2124
$$ 686631 699157 777713 723471 601474 532134 585711 582664 589307 569938 462701 551476 643600
9352F43600o8202j05964q2867O792n9213j01957j7242R9627n419q8962J60259
$$ 643600 575398 469434 386567 393359 334146 232189 214947 314574 309155 220193 380452
9341C80452J6950j67800l6263R2115Q0688J88111n5535r9326j89341J93330R0476
$$ 380452 397402 229602 193339 285454 366142 554253 498718 399392 210051 403381 493857
9330D93857j93253j82198j770J33270k9162J95102N287m8756J17164Q2436o9098
$$ 493857 300604 118406 116636 249906 220744 415846 421133 372377 489541 571977 502879
9319E02879o9980P3305j16188p8418K276j61171J29672l1484j32075J8483J69801
$$ 502879 432899 506204 390016 311598 313874 152703 282375 250891 118816 137299 307100
9308C07100k22431j0036j11484J02916O372j892n2982J84359P1164m0090K5265
$$ 307100 84669 74633 -36851 66065 72437 70545 17563 201922 273086 232996 258261
9297B58261m5041j56012o8061N5899j22187r770q9847J22349K00041J18294j2652
$$ 258261 213220 57208 -10853 45046 -77141 -86911 -176758 -54409 145632 263926 251274
9286B51274m7015M1752l1109j96787P0485J77417q3420k36125J8542m2557m0814
$$ 251274 204259 246011 214902 18115 88600 266017 182597 -53528 -34986 -77543 -118357
9275a18357R988Q6765M3002j5127J1121O9003J42171k8544l5795m6485r0889l8888
$$ -118357 -108369 -21604 21398 6271 17392 86395 228566 200022 164227 117742 26853 -12035
9263a2035j0224R1653K7297R7560n5147L6087J97888J6646j65336l20523j15922
$$ -12035 -22259 69394 96691 194251 139104 175191 373079 389725 224389 -96134 -212056
9252b12056K05407P9287M8165J31195K34757r2619m2974O8023O2821k02016k89074
$$ -212056 -6649 72638 120803 251998 486755 394136 351162 419185 482006 279990 -9084
9241i084Q8284o6402q2190O6425J10829P8916L5111M1375l6859k1621r0724j17084
$$ -9084 79200 12798 -69392 -2967 107862 186778 221889 263264 226405 204784 114060 -3024
9229c024j23610n1529L8898j2949m5068J3980l2231M6085K67769J61555k7079
$$ -3024 -126634 -178163 -139265 -152214 -197282 -183302 -215533 -169448 98321 259876 232797
9218B32797q1486k2096k8223R823l9577n9114J07331k268p9465n2155p9609K7786
$$ 232797 151311 129215 100992 110815 71238 12124 119455 117187 37722 -14433 -94042 -66256
9206f6256M8263P956J46474l0698Q359N8568L6495j36834q6694M3983N8639j33241
$$ -66256 -17993 -10037 136437 105739 114098 172666 209161 72327 -14367 29616 88255 -44986
9194d4986J7540L20105N1854N1066q5126j50693l928m5111L4626N6054j615j52149
$$ -44986 -27446 292659 344513 395579 310453 159760 155832 110721 145347 201401 199786 47637
9182D7637j32767N2957P4304o2438K8143M8986M9155M1075r1373r341r8572M716
$$ 47637 -85130 -32173 42131 -20307 7836 56822 105977 147052 55679 46338 -52234 -47518
9170d7518J26442j836p8514j81169n5276J76325J76613O988n2930p6830O9312
$$ -47518 78924 77088 -1426 -182595 -237871 -61546 115067 122055 69125 -7705 61607
9159F1607j34746j09382J28415R0107O2970k36931o1229l5259q3140n459l6274
$$ 61607 -73139 -182521 -54106 36001 98971 -137960 -199189 -234448 -317588 -323047 -359321
9148c59321j627O0438K69799Q8874L1567p8102o0031K7899j32719R2485J18311
$$ -359321 -360948 -300510 -30711 58163 89730 11628 -48403 -20504 -153223 -60738 57573
9137E7573o2663p0801n6655J63815J39573J5441M7247O2198J29139Q355k36125
$$ 57573 -5090 -75891 -132546 31269 170842 186283 233530 295728 424867 433222 197097
9126A97097r2345O9378M4953j6686J4599j57762j03489j59876K7886J59976J83668
$$ 197097 104752 174130 219083 202397 216996 59234 -44255 -204131 -176245 -16269 167399
9115A67399R0309k8491k43812j68629K08048K01353Q3624k18301j05308m5126
$$ 167399 257708 229217 -14595 -183224 24824 226177 309801 91500 -13808 -58934
9105e8934k6414J1334q4658k2758O4442l7082k4277j5362J13552K421j71273J695
$$ -58934 -85348 -74014 -158672 -181430 -116988 -154070 -178347 -193709 -80157 -77736 -249009 -247314
9093b47314J36769M5677O3401l5886o4575q4473n2954O9107j0860r091O4209J64299
$$ -247314 -110545 -64868 -1467 -37353 -101928 -186401 -239355 -170248 -181108 -190199 -125990 38309
9081C8309P3474L843M2109Q1435l7704j20179p8702q4912k41567m5483L4917J90559
$$ 38309 111783 115626 157735 239170 201466 81287 2585 -82327 -323894 -369377 -334460 -143901
9069a43901N6768l0494P4556L8605L8149P558r1249m8489J57925J5853K7146j41734
$$ -143901 -87133 -117627 -43071 -4466 33683 41241 -50008 -98497 59428 75281 102427 -39307
9057c9307l17514j1709O5117L2362M7853Q4795J97012R8054r57j89869j20621
$$ -39307 -356821 -368530 -303413 -271051 -223198 -138403 58609 156663 155706 -34163 -154784
9046a54784L722K46800J49057l4169j89733J30190J73868j45615j42420j08916
$$ -154784 -151062 95738 244795 210626 20893 151083 324951 179336 36916 -72000
9036g2000k3377L281J55418L5533M1742N7087j8647p835o210k5307k5115m2570
$$ -72000 -95377 -92096 63322 98855 140597 197684 179037 171202 164992 139685 114570 72000
9024G2000o8697j3300n3653P0628J22052k028L5693j03821l0233l1957Q9320j49343
$$ 72000 3303 -9997 -63650 6978 129030 127002 162695 58874 28641 -3316 86004 -63339
9012f3339m9548p2497j07870Q6223q137K8890P9943K35931j02595j47573n5182
$$ -63339 -112887 -185384 -293254 -207031 -215168 -186278 -106335 129596 27001 -120572 -175754
9001a75754M5831N9423J43274n6501k81972J6013J02576J31984n6993k35454l2937
$$ -175754 -129923 -70500 72774 16273 -265699 -249686 -147110 -15126 -72119 -307573 -340510
8990c40510J73052K4515j84624L7341J54198Q4597Q0085K2163o6555k0830j17034
$$ -340510 -167458 -142943 -327567 -290226 -136028 -51431 28654 50817 -15738 -36568 -153602
8979a53602k1024k4981J81841l6657j04159j01709J33252J54747K34200M5217
$$ -153602 -174626 -199607 -17766 -54423 -158582 -260291 -127039 27708 261908 307125
8969C07125k1681m6364j02933j51434j98083K88503L20490l9345j79766k40575
$$ 307125 285444 239080 136147 -15287 -213370 75133 395623 356278 176512 -64063
8959f4063K5478M6229k657j05849o5459J05147R7383J26436K38008J2874k95620
$$ -64063 -38585 7644 4987 -100862 -166321 -61174 36209 162645 400653 413527 117907
8948A17907k54806M8162N1335r4243O6708P3023n7428n7803J39946J64575j01527
$$ 117907 -136899 -88737 -37402 -131645 -64937 8086 -49342 -107145 32801 197376 95849
8937I5849j46206j8147l1634j1020O9507q4645k32513J04994J17641O5813J20159
$$ 95849 -50357 -68504 -100138 -111158 -41651 -126296 -358809 -253815 -136174 -70361 49798
8926D9798K59522j65471j79596j1588Q2470O7191L3194r9256j18168r0861K63556
$$ 49798 309320 143849 -35747 -47335 35135 102326 135520 36264 -81904 -172765 90791
8915I0791K21918J16336j56568l9620Q853m0059P4190j04241l0871L3148K3176
$$ 90791 312709 429045 272477 232857 241710 201651 275841 171600 140729 173877 197053
8904A97053R9619j8954j40410q0811J06561j5794O6144k25603k01122P9670J00251
$$ 197053 296672 277718 137308 56497 163058 147264 213408 -12195 -213317 -133647 -33396
8893c3396Q0717R603J82369L0219q5985n2477r1706q4039N5101L3838k943P2227
$$ -33396 47321 56924 239293 269512 183527 131050 39344 -44695 10406 44244 41301 113528
8881A13528O1985l9574k3215j82392q5559J41908K16111N6540r8791p803r7284
$$ 113528 175513 135939 112724 -69668 -155227 -13319 202792 259332 160541 152738 55454
8870E5454j57992j04874l5919K00862J05058L8100o805o4344k10185P6515K67137
$$ 55454 -102538 -207412 -243331 -42469 62589 100689 93884 29540 -180645 -104130 163007
8859A63007J14676l776k16242m5016Q5829N3098k648j08988j11620m4597n5753
$$ 163007 277683 273907 57665 12649 98478 151576 148928 39940 -71680 -116277 -172030
8848a72030J21067L6838L5630p0165K5470L0274L7727J5498j07125l5529K04944
$$ -172030 -50963 -14125 21505 -48660 -23190 7084 44811 60309 -46816 -82345 122599
8837A22599j44472n1537p1317j15922Q188O4742J28908J79234j04649n9538K11241
$$ 122599 -21873 -73410 -144727 -260649 -252461 -187719 -58811 120423 15774 -43764 167477
8826A67477Q0422j01342j082J10197q954P1199O5630J32073r2012j42692k23462
$$ 167477 247899 146557 145475 255672 246718 317917 383547 515620 423608 280916 57454
8815E7454j07611Q7906j5979n3395k2392R391k0233K2745n9945p1234J70175m8053
$$ 57454 -50157 37749 21770 -31625 -54017 -44626 -64859 -42114 -102059 -173293 -3118 -51171
8803e1171M053p9937O562O6942M7824J10877J45309p8573p5852q641j25581j36808
$$ -51171 -47118 -127055 -120493 -53551 -5727 105150 250459 171886 96034 87393 -38188 -174996
8791a74996J9471l2198j48039L3530J98562N6797o0213L226k2561j84245J63259
$$ -174996 -155525 -187723 -335762 -302232 -103670 -46873 -107086 -103860 -126421 -310666 -147407
8780a47407R1073j0016J04175J48841q8823j83086l8042J8201O9063J6729N7183
$$ -147407 -56334 -66350 37825 186666 97843 -85243 -123285 -105084 -36021 -19292 37891
8769C7891j53514m7815M0390q6258M9630R8722K18339J9179M5378m4835n9801
$$ 37891 -115623 -163438 -123048 -209306 -159676 -60954 157385 176564 221942 177107 117306
8758A17306j938L9186J10040L0320r4473n8943M4922k5308L8589Q7975m5030j31559
$$ 117306 115368 154554 264594 294914 200441 141498 186420 161112 199701 287676 242646 111087
8746A11087K352j52276P2607K11487p0616k76715n0265N2486j4283J48221q7084
$$ 111087 113439 -38837 33770 245257 174641 -102074 -152339 -99853 -114136 34085 -52999
8735e2999O0363O1970P317J77224O3082j79744j21026n6280K4043O5511j43206
$$ -52999 7364 69334 76651 253875 316957 137213 16187 -40093 -16050 49461 -93745
8724i3745J6820J41339O9093q6512P472J93128r4040j15420j93827O3443J75414
$$ -93745 -76925 64414 133507 46995 54467 247595 153555 38135 -155692 -92249 83165
8713H3165p4050R4039k0904r4278k9178J851J57035o1784R7625P793o4591l4746
$$ 83165 9115 103154 82250 -12028 -41206 -39355 117680 55896 153521 161314 96723 61977
8701F1977O0385j22045n6478O8208J8191L6480P7192o3851j28486Q5393J39021
$$ 61977 122362 317 -56161 12047 30238 66718 143910 80059 -48427 36966 175987
8690A75987m6488r5250j33099r1836K8497j3967j40586J25855J14240K9673M8780
$$ 175987 129499 34249 -98850 -190686 -162189 -176156 -316742 -190887 -76647 -46974 1806
8679A806k7098q234j2212N58j09375m8386R3178O2661R1890O9473q2101n5893
$$ 1806 -25292 -33526 -45738 -45180 -154555 -202941 -109763 -47102 44788 114261 32160 -23733
8667b3733q4355j06842o9146J23000O3750k7252l7822J06806M4813J60696K6241
$$ -23733 -108088 -214930 -284076 -161076 -97326 -124578 -162400 -55594 -10781 149915 176156
8656A76156j79717p7902K8069O1459j21974M3696o1224q6657k5481J22789L20719
$$ 176156 -3561 -81463 -53394 8065 -113909 -70213 -131437 -218094 -243575 -120786 199933
8645A99933o6151K6448O5658j04533m4156M2267k5843R830L4819j20L318j09801
$$ 199933 133782 160230 225888 121355 77199 119466 93623 103453 138272 138152 141470 31669
8633C1669K0930L4501n6464J5496K94938q4996j61342K5844j2085j50399J6138
$$ 31669 52599 87100 30636 46132 341070 256074 94732 120576 108491 -41908 -25770
8622b5770K01766k3637n6294m9027j80334p1125j2226l8976R4587K13270J13156
$$ -25770 175996 152359 96065 47038 -133296 -204421 -216647 -255623 -161036 52234 165390
8611A65390M6813j42451M3714m2098j81406j05047P2839K1321J0496j406Q3365
$$ 165390 212203 69752 113466 71368 -110038 -215085 -142246 -120925 -110429 -111835 -28470
8600b8470J41817k3624j38543k251K6811p8604j7664Q3890n3918R5399o4088j61307
$$ -28470 113347 89723 -48820 -51071 -24260 -102864 -120528 -36638 -90556 4843 -59245 -220552
8588b20552r1496J60744J61714j25915j49982J93948J52651Q6973J10492r6568
$$ -220552 -312048 -151304 10410 -115505 -265487 -71539 81112 168085 278577 182009
8578A82009J25307j292q7588O9607j38487j67227p8985J00178j3147J32536K16589
$$ 182009 307316 306024 218436 288043 149556 -17671 -96656 3522 -9625 122911 339500
8567C39500m6330j86745j04253J02917J67269j10815m00033L4420J15203R7580
$$ 339500 293170 106425 2172 105089 272358 161543 -238490 -204070 -88867 8713
8557H713R2255J5213j5984Q4515k9936q8381j66722Q1136J31656J7900J95124
$$ 8713 100968 116181 100197 184712 154776 66395 -100327 -19191 112465 130365 325489
8546C25489O3335k79746n7917J03323O3890j71196j350j117k2307M0216j65809
$$ 325489 388824 109078 51161 154484 218374 47178 45828 44711 22404 62620 -103189
8535a03189o054J4842o1718r371O9488P5982M2258O9280J27188l132n8616j96311
$$ -103189 -109243 -94401 -156119 -165490 -96002 -20020 22238 91518 218706 215574 156958 -39353
8523c9353P4623L8823N1364m5318j8317M5882j56229m20859K5093Q6178R5718
$$ -39353 35270 74093 125457 80139 61822 107704 -48525 -469384 -444291 -358113 -262395
8512b62395O8706J0858k8005Q5745J1349r3155k6086J1126n7416R1431l9438K51774
$$ -262395 -193689 -182831 -210836 -125091 -113742 -206897 -232983 -221857 -279273 -187842 -227280 24494
8500B4494J60879M9792O8160j52633j29162n6350j15184j9278J44509j6354K693
$$ 24494 185373 235165 303325 150692 21530 -34820 -150004 -169282 -24773 -41127 -38434
8489c8434j7569k37569q7487J58880P4512o6109K9828P1276N9900N3407L7541
$$ -38434 -56003 -293572 -381059 -222179 -147667 -213776 -183948 -112672 -52772 635 38176
8478C8176j49175k265K50645R8432j42789q1316n6597O4879J35800L8740J02978
$$ 38176 -110999 -113264 137381 235813 93024 11708 -44889 19990 155790 194530 297508
8467B97508n5638K0919l4594q1452j23121o6134K0060M3596R6073J08619L488
$$ 297508 241870 262789 228195 146743 23622 -42512 -22452 21144 117217 225836 229324
8456B29324r1788r4985J29173O7567L1585J33386o5085p8105m9127j94785K98
$$ 229324 137536 42551 171724 239291 270876 404262 339177 261072 211945 17160 17458
8445A7458J27121R1064P1148Q228N7234j15616K794J95900m6470J16184K0972
$$ 17458 144579 235643 306791 315019 372253 256637 259431 455331 408861 525045 546017
8434E46017j94959j87188j33608k5504k2866o6930j36819j30998J18049J95139
$$ 546017 351058 163870 30262 4758 -18108 -85038 -221857 -352855 -234806 -39667
8424c9667J45597J13359m5273p9297k7767r2565J35714K37467j44610k95845N7586
$$ -39667 105930 219289 174016 94719 66952 -25613 110101 347568 202958 -92887 -35301
8413c5301Q8548o5977k2520j50098Q5358L5168J04200j05924M0844J31658j5145
$$ -35301 53247 -12730 -35250 -185348 -99990 -64822 39378 -66546 -25702 105956 90811
8402I0811n1616l2804J3186M9231p7402j34274j22727J35283J18385J74833O2757
$$ 90811 39195 6391 19577 68808 -8594 -142868 -265595 -130312 -11927 162906 225663
8391B25663j48069p7319L8948q387J72709J00558k50509j34961J10203P1633J0319
$$ 225663 77594 275 39223 30836 203545 304103 53594 -81367 28836 100469 110788
8380A10788J3359r2367j61748j19018J52740J57528K09096K35194r9577j81094
$$ 110788 124147 31780 -129968 -248986 -96246 61282 270378 505572 405995 224901
8370B24901m7373L3998R9447j0090o6564p8823p6089r6766o5340K301j5292o744
$$ 224901 177528 211526 310973 300883 234319 155496 79407 -17359 -82699 -80398 -95690 -102434
8358a02434N1921q1857R8219Q1186N6297M4305l6785R3531J1512r5937N4823J41408
$$ -102434 -50513 -132370 -34151 47035 103332 147637 110852 204383 215895 119958 174781 316189
8346C16189P5401r4997j07040O1986j12770o8715Q0138N284j46261J2896M8618
$$ 316189 391590 296593 189553 251539 138769 70054 150192 155476 9215 22111 70729
8335G0729Q3402j7063J23942J07918J1233O3505o2808j42101j39272J5232R0937
$$ 70729 154131 137068 261010 368928 380161 443666 380858 238757 99485 114717 205654
8324B05654n3780j66858j44838R3799Q9340j12568M6318J16740O6242j14608j40667
$$ 205654 151874 -14984 -159822 -66023 23317 -89251 -42933 73807 140049 25441 -115226
8313a15226P1311J19198r6538j203J17266P2938k8746J07996m9323j32975J24095
$$ -115226 -43915 75283 -21255 -22458 94808 167746 139000 246996 197673 64698 188793
8302A88793J38135M1802j6118M0382R1156J17771N9974K29122J96000J71934L95379
$$ 188793 326928 368730 352612 392994 484150 601921 661895 891017 1087017 1258951 1654330
8291A654330R94494J243441J488182J646591J355305R23665L86534p11337j810409
$$ 1654330 2648824 3892265 5380447 7027038 8382343 9306008 9692542 8981205 7170796
8282G170796k004779j663502j094443o56451l71727j37811q1271q7647j00464
$$ 7170796 5166017 3502515 2408072 1751621 1379894 1242083 1160812 1073165 972701
8273I72701k9737O6074j19281j65823J2904O7677l9289r8856m6005P5629J8491
$$ 972701 942964 1009038 889757 723934 736838 804515 765226 666370 620365 695994 714485
8262G14485R8634j12924n3020J70043K62169J41637J91691J15498J49727M67840
$$ 714485 813119 700195 647175 817218 1079387 1221024 1412715 1528213 1677940 2145780
8252B145780R11082J295821J819940J687202J236553N94252p1862j063686j837193
$$ 2145780 3056862 4352683 6172623 7859825 9096378 9690630 9618768 8555082 6717889
8243F717889j592921j297109q30434n51901n43669l10186k55402j54771j28135
$$ 6717889 5124968 3827859 2997425 2445524 1901855 1591669 1336267 1181496 1053361
8234A053361N7782k35856j11647L8465q5985j0403o0967j12246J3459M5072L6424
$$ 1053361 1111143 875287 763640 802105 716120 705717 644750 532504 545963 591035 627459
8223F27459Q7753o5522l44578j4153O5450m8587L6441J69006n8096j56534M1452
$$ 627459 715212 649690 305112 290959 356409 307822 344263 513269 455173 298639 340091
8212C40091l2331j71759k05364K5141J46175l4646j66168J39871K6895J5747q3364
$$ 340091 307760 136001 -69363 -44222 101953 67307 -98861 41010 67905 83652 288
8201B88N8543J46091L9160j21949J13503J06088P8001j1108J9145K8897j60463
$$ 288 58831 204922 244082 122133 235636 341724 419725 408617 427762 456659 296196
8190B96196k8809J2873j84299m2925k5735J23706Q0989k19551P0333J00406n81
$$ 296196 267387 280260 95961 53036 27301 151007 231996 12445 82778 183184 182603
8179A82603n8953j56895M5767Q4760j50788M0027M2223j11464r9353J12909r0199
$$ 182603 123650 -33245 12522 97282 -53506 -13479 28744 -82720 -182073 -69164 -159363
8168a59363j01752J09236J88294L431j04194J1739P5016O8141k585j07830N6367
$$ -159363 -261115 -151879 36415 39846 -64348 -52609 22407 90548 87963 -19867 36500
8157C6500O4724j05918p9760m644K7805N7024Q7910j33815o1817j30789o3361
$$ 36500 101224 -4694 -84454 -89098 -61293 -4269 83641 -50174 -111991 -242780 -306141
8146c06141K071q8183O4709K68363R7854j42525r5957J35494K2546j6311r6117
$$ -306141 -304070 -392253 -327544 -59181 38673 -103852 -199809 -64315 -41769 -58080 -154197
8135a54197J16644J12089L5513J34388J46789l1677p9015L2445o2422J8640j03508
$$ -154197 -37553 74536 110049 244437 391226 359549 280534 312979 250557 269197 165689
8124A65689j30470l7919O4675K86311k5384n3376m6125q4267J85511J7529q4664
$$ 165689 35219 -2700 61975 348286 322902 269526 223401 139134 324645 342174 257510
8113B57510Q860j64571k3572j62831m8206R6627j45249J11369J46759J3817J8612
$$ 257510 266370 101799 78227 -84604 -132810 -36183 -181432 -70063 76696 90513 109125
8102A09125M5976j7196m8050j0537o8963K4685k6618L9823o8856r9598L6823K6022
$$ 109125 155101 137905 89855 79318 10355 35040 8422 48245 -20611 -120209 -83386 -57364
8090e7364P0711P6388Q315l7173j09102r0841L551j14359J06531J55133n6458
$$ -57364 13347 89735 98050 60877 -48225 -139066 -135515 -249874 -143343 11790 -44668
8079d4668J3676l9906P9670J59257Q1684o8677k1983J05481J7797j17229l2005
$$ -44668 -30992 -70898 8772 168029 249713 181036 159053 264534 282331 165102 133097
8068A33097j52217j1569J8560q034j6264M0919r7215K6059K27926J91029N848
$$ 133097 -19120 -30689 -12129 -20163 -36427 4492 -92723 -66664 161262 352291 358139
8057C58139k53867j24780j02291M3026m8687K9451J36329K0205N3647q5761j3412
$$ 358139 104272 -20508 -122799 -79773 -128460 -99009 37320 57525 111172 25411 11999
8046A1999K762M9425P6778r1239j45791O1615L067Q1425J17365J45179N9498j39650
$$ 11999 14761 64186 140964 49725 -96066 -34451 -31384 50041 167406 312585 372083 232433
8034B32433j78779K2653m2798P1441k6616j34607m9324j83482L6357K09552M3913
$$ 232433 53654 76307 33509 104950 78334 -56273 -105597 -289079 -252722 -43170 743
8023G43R0579l619j54585q409P3749k9989n7164n463o363k0534k073J2791J09968
$$ 743 91322 87703 -66882 -75291 -1542 -31531 -88695 -94158 -100521 -121055 -123128 -110337 -369
8010c69K195k4315R5250M5259M9304q2970N1830P6343J13612N9918j40832m8745
$$ -369 1826 -22489 72761 118020 167324 84354 136184 212527 326139 386057 245225 196480
7998A96480j44304j64156K9713J38501L6535m5357J17414j45076m5600L4055M859
$$ 196480 52176 -111980 -82267 56234 92769 47412 164826 19750 -25850 8205 13064
7987A3064r2233j7023K33100J54550j20010j66196j63130J38739N0994P9723K6852
$$ 13064 -79169 -96192 136908 291458 171448 5252 -157878 -19139 31855 111578 138430
7976A38430j2124j7800K5993k556J4342q3504j71414j01985j677Q3728L6143j20817
$$ 138430 126306 108506 134499 131943 146285 62781 -108633 -210618 -212295 -128567 -92424 -213241
7964b13241j42515q342K19061K06574j6636q5870O2189m9415o6419J21027l1173
$$ -213241 -355756 -364098 -145037 61537 44901 -40969 21220 -28195 -94614 26413 -4760
7953d760o8189m5258j4504J99395r1509K1835M8218M1858K4961M6498J28125J1660
$$ -4760 -72949 -118207 -132711 66684 -24825 -2990 45228 87086 112047 158545 286670 298330
7941B98330q9159P3926N1742j56267j60160Q3564m6005M4082p623J37601M512
$$ 298330 209171 283097 334839 178572 18412 101976 55971 100053 92430 230031 234543
7930B34543p1196Q0102r571j49095q9982o9906M9970K2860L5482J21416k3057
$$ 234543 163347 243449 233878 84783 -5199 -75105 -25135 -2275 33207 154623 131566
7919A31566n1102O2983N9696j88876r7093o2253m7774O8440J17593L1412J5396
$$ 131566 80464 143447 203143 14267 -82826 -145079 -192853 -124413 -6820 24592 39988
7908C9988Q622q9390J76113O7381j27202J1171R0782J2497r1058R2335O5440j04282
$$ 39988 48610 -40780 135333 202714 75512 86683 177465 189962 98904 191239 256679 152397
7896A52397p5226m9926j30496q9230R4334J25596N1830j09647L9171J58366J011
$$ 152397 77171 27245 -103251 -192481 -98147 27449 79279 -30368 8803 167169 168180
7885A68180j0696k3212m2833j16785j35883O7627R5690k2676n4389j32041j9622
$$ 168180 157484 134272 91439 -25346 -161229 -93602 2088 -20588 -74977 -207018 -226640
7874b26640J8299O6914M9961J16633l5745L46o5402j21702o6298O2664J90358
$$ -226640 -208341 -141427 -91466 25167 -10578 -10232 -75634 -197336 -263634 -200970 -10612
7863a0612l2697j4129k69035o7358O3914J90343O3966j74859J29080O7472R8692
$$ -10612 -43309 -57438 -326473 -393831 -329917 -139574 -75608 -250467 -121387 -53915 44777
7852D4777O4385j05494j95751N3179M2866m5326q9100p2875L8231J17142L0243
$$ 44777 109162 3668 -192083 -138904 -96038 -141364 -230464 -303339 -265108 -147966 -117723
7841a17723j95479P65Q2478J2195J72085J20775J81945N591j15822k30413N1993
$$ -117723 -313202 -312437 -229959 -217764 -45679 75096 257041 262632 146810 -83603 -31610
7830c1610M6565j71500j06155J87534J79501k007m8854q4129M5552K0208N768
$$ -31610 14955 -156545 -262700 -75166 104335 102328 53474 -30655 14897 35105 40873
7819D0873k7176l9578l9110K5671l1522o5141J03519Q5399j9612J40411J08537
$$ 40873 13697 -25881 -64991 -39320 -70842 -135983 -32464 52935 33323 173734 282271
7808B82271k06751j04649R869o7958k2941r633j07339r7369o1138K11825P7262
$$ 282271 75520 -29129 -19260 -87218 -110159 -119792 -227131 -324500 -385638 -173813 -96551
7797i6551j22468j4786J18130j37461p4530Q8261k2184J59644J20373M5294k301
$$ -96551 -219019 -233805 -115675 -253136 -327666 -239405 -261589 -101945 18428 63722 61421
7786F1421P6809P5828K0053l0340r1695o5257n1737j01184l4287l8899L9642o6079
$$ 61421 138230 214058 234111 203771 112076 46819 -4918 -106102 -140389 -179288 -139646 -205725
7774b05725J05152N0643J17635M3325j0709j22014P4552P794l1743j2192l3131
$$ -205725 -100573 -49930 67705 111030 100321 -21693 52859 60653 28910 16718 -16413
7763a6413L918j27499m816J65767L3940l1366n3486k5713k2792J56701Q2295l377
$$ -16413 -12495 -139994 -144810 20957 54897 23531 -29955 -55668 -78460 78241 160536 157159
7751A57159j9635n6002J65946r7435p0535o5483K78041P9376r1757j4083k09114
$$ 157159 137524 81522 247468 150033 79498 14015 292056 371432 279675 265592 56478
7740E6478o9078j11313o4350M0265M2064R8902o9224M4238L4418k1025Q8898o5365
$$ 56478 -12600 -123913 -188263 -147998 -105934 -7032 -76256 -32018 2400 -18625 70273 4908
7728D908j57741o0481o9301K8901O2792K630o3170J33875k2425j52950P4869l8903
$$ 4908 -152833 -213314 -282615 -253714 -190922 -188292 -251462 -117587 -140012 -292962 -218093 -256996
7716b56996J51101J45420r6128j00339q5121k0762n9694M5014J35108K23429r8842
$$ -256996 -105895 39525 -56603 -156942 -242063 -262825 -322519 -277505 -142397 81032 -17810
7705a7810j60138m9199l9341J64853R8651q6056j89N813N8816r440m206k358M0952
$$ -17810 -177948 -227147 -266488 -101635 -2984 -89040 -89229 -83416 -24600 -34040 -38246 -40604 348
7692C48O6344J5755q6656l2628L7856k2752o696l6860J61066n404O394J491Q369
$$ 348 66692 82447 -4209 -36837 1019 -21733 -28429 -65289 95777 90373 96767 98258 106627
7679A06627p0649j43488J6962J93455N2852K8280r1341j37367j72105P912K39266
$$ 106627 35978 -107510 -90548 102907 155759 184039 92698 -44669 -216774 -208862 30404
7668C0404J13301J23551o1520J6009r9781k15464n4843J06174J44077J11297O0403
$$ 30404 143705 267256 205736 221745 121964 -93500 -148343 -42169 101908 213205 273608
7657B73608O2431j99567j76696L274n7390j3660j8853J16920J5808R5740p9510
$$ 273608 336039 136472 -40224 -36950 -94340 -108000 -126853 -9933 5875 101615 22105
7646B2105R3602K16748L0285l0270j54023q2137j66952j74697k10166J76948K8655
$$ 22105 115707 332455 362740 332470 178447 96310 -70642 -245339 -455505 -278557 -249902
7635b49902J45612J94044k1006l8606R0618p7153j12553j69039k3350R6920Q4137
$$ -249902 -104290 89754 68748 30142 120760 43607 -68946 -237985 -261335 -164415 -80278
7624h0278J03647J3097L9686J39305n2292J4539N5703n2331o5305j07623j03501
$$ -80278 23369 36466 76152 215457 163165 177704 233407 181076 115771 8148 -95353
7613i5353o9079M5341k9792r755P8725O0053O2071O8454j10024J4177M1328j89426
$$ -95353 -164432 -119091 -148883 -158638 -79913 -19860 42211 110665 641 14818 56146 -133280
7601a33280k9430P6993K03878r313j78671k42854P6329L9317M3939Q0658k5600
$$ -133280 -162710 -85717 118161 108848 -69823 -312677 -236348 -197031 -153092 -72434 -98034
7590i8034j07692n407O5039P3281J04142J41744N8403j78766j68437j0742K7840
$$ -98034 -205726 -211133 -146094 -72813 31329 173073 231476 52710 -115727 -126469 -98629
7579i8629J20436q3089q8204j02647k3307J70960J31070R9809J47338j40761l527
$$ -98629 21807 -61282 -149486 -252133 -275440 -104480 26590 126399 273737 132976 129449
7568A29449k3119j46212l5759J00879N4402j77354j44453P8405O6821J05747L1780
$$ 129449 106330 -39882 -75641 25238 79640 -97714 -242167 -163762 -96941 8806 40586
7557D0586k917j67300r2449k1594p3008J52407j22510q7331K35264K51309N2917
$$ 40586 37669 -129631 -222080 -243674 -316682 -164275 -286785 -374116 -138852 112457 165374
7546A65374j83671j08483R9774r066J04199j24736j09008M201l6376p2164m368
$$ 165374 -18297 -126780 -27006 -36072 68127 -56609 -165617 -161416 -197792 -269956 -274324
7535b74324J21826J80023J1758j35218k4037p6086L2191K8757L7911K3635J55350
$$ -274324 -152498 27525 39283 -95935 -119972 -196058 -163867 -135110 -97199 -73564 81786
7524H1786J56481P1364j80537M749J5192r9986j60316p2095Q8510R0032J51051
$$ 81786 238267 309631 129094 133843 149035 49049 -111267 -183362 -94852 -4820 146231
7513A46231n8595j23491o8605n5150q4908N9429K06929K6806j68224J05895K44645
$$ 146231 87636 -35855 -104460 -159610 -244518 -185089 21840 48646 -119578 -13683 230962
7502B30962O5896l1284l1345P9283P589o3331j19039J2756j5969j86796p1927
$$ 230962 296858 265574 234229 313512 321101 257770 138731 151487 135518 -51278 -123205
7491a23205O2461Q7159q905Q1281J13436r2798m7268L8721k8964J2578O7649l3325
$$ -123205 -60744 26415 17510 98791 212227 119429 72161 110882 81918 94496 162145 128820
7479A28820J15375J40337o6359k01287j88604j52895J09114J14737j16425P2415
$$ 128820 244195 384532 318173 116886 -71718 -224613 -115499 -762 -117187 -44772
7469d4772O4553J56784J79732o0855m4666k43425j07494j3040m1970J27986J7477
$$ -44772 19781 176565 356297 295442 250776 7351 -100143 -113183 -155153 -27167 -9690
7458i690k3298J12124R2327j93659L3133P5764J30955J08581k01286j10294N8845
$$ -9690 -32988 79136 171463 -22196 10937 86701 217656 326237 124951 14657 73502
7447G3502n3468j17957n484J50119n3500o2977Q8118Q8512O8626j09849o7803
$$ 73502 20034 -97923 -103407 46712 -6788 -69765 18353 106865 175491 65642 -2161
7436b161j61717J90948J52702n9659j03155J75048o4519j50555j8935j41301l3721
$$ -2161 -163878 27070 179772 120113 16958 192006 127487 -23068 -42003 -183304 -217025
7425b17025J45317J823J1201n9007m2762o2425J46989L966O2337j02495J97R9022
$$ -217025 -71708 -69885 -58684 -117691 -160453 -222878 -75889 -71923 -9586 -112081 -111884 -12862
7413a2862J40127J53304J27550o3263j82526j9730L6596r56k70133n7326K10598
$$ -12862 127265 280569 408119 344856 162330 142600 179196 178240 -91893 -149219 61379
7402F1379J48596M8190M5163Q9032j41685j34179n7508j3077j31469m3972N1204
$$ 61379 209975 258165 303328 392360 250675 116496 58988 45911 -85558 -129530 -78326
7391g8326J19607N367j04786O2801L0332L1018j3370R3809n0720j94525K2790
$$ -78326 41281 46648 -58138 4663 34995 66013 52643 146452 95732 -98793 -76003
7380g6003J3551k7176m6660j64706p4691J37652J42654O1641n4007j2943M9787
$$ -76003 -62452 -89628 -136288 -300994 -375685 -238033 -95379 -33738 -87745 -100688 -50901
7369e0901j09413M9357O9347J28226j4372n8127J2256q19L8476O5121o6299j64521
$$ -50901 -160314 -110957 -41610 86616 72244 14117 26373 25554 64030 129151 62852 -101669
7357a01669L979K4190o966J78699L1100J14319L6287j08652j43483j28262j14880
$$ -101669 -97690 -73500 -80466 98233 129333 243652 279939 171287 27804 -100458 -215338
7346b15338R6811J06341k9169J7103r7667j19617L060O8346R4458K45981P4172
$$ -215338 -118527 -12186 -41355 -24252 -121919 -241536 -238476 -170130 -75672 170309 244481
7335B44481J21n0947m6469K459J30113P15j31587p8401l1341k1737Q4593j97815
$$ 244481 244602 193655 147186 149645 279758 280473 148886 70485 39144 17407 102000 -95815
7323i5815o0377O0951J02424q042q6077K6175k8002m7788J20239m8686Q444Q743
$$ -95815 -156192 -95241 7183 -859 -86936 -60761 -88763 -136551 -16312 -64998 -56554 -47811
7311d7811Q2692M1789J08611J44382k4789n9826j59752N2088N7906n0625r7059
$$ -47811 34881 76670 185281 329663 304874 245048 85296 137384 195290 144665 47606
7300D7606j50762K7544N0753p7349K8487l4971k7700J24942j31490j48618j1750
$$ 47606 -103156 -75612 -24859 -102208 -73721 -108692 -136392 -11450 -142940 -291558 -303308
7289c03308k2372j7435J44614J9187L4245r4918R2527n1066J24947J44154j34233
$$ -303308 -325680 -343115 -198501 -179314 -145069 -239987 -147460 -198526 -73579 70575 -63658
7278f3658j16406j38626N2268p2877K26695J00472M698J02381q7546p3834M4200
$$ -63658 -180064 -318690 -266422 -339299 -112604 -12132 -7434 94947 7401 -66433 -22233
7267b2233P3673o7506q9300O1490M7940J87397J21328j0503J1667k09150k23614
$$ -22233 51440 -16066 -105366 -43876 4064 191461 312789 302286 313953 104803 -118811
7256a18811r27O3778l5125n3866J3968J21825L9547k6513o1966p7781l4997J18451
$$ -118811 -119738 -55960 -91085 -144951 -130983 -9158 30389 3876 -58090 -135871 -170868 -52417
7244e2417J11752O481O0326N5775n0205n6693j79043j6150O5360J4009m1908j20185
$$ -52417 59335 65816 126142 181917 131712 75019 -104024 -120174 -54814 -40805 -82713 -202898
7232b02898n7715O7476k12619m7659P6953N0748J43336J69884k5181j17032l6688
$$ -202898 -260613 -193137 -405756 -453415 -376462 -325714 -182378 -12494 -37675 -154707 -191395
7221a91395J59345R6971J42126q3476M967M5045n3070j56429N5952n0452P381
$$ -191395 -32050 64921 207047 123571 128538 173583 120513 -35916 20036 -30416 -23035
7210b3035j36195j53082n002R6346M3080j4404P5683J83661n3013r6764j9549
$$ -23035 -159230 -312312 -317314 -220968 -177888 -192292 -116609 67052 14039 -82725 -102274
7199a02274N5575j05984q010J04937Q6147O5722o7451n2538J3074m6647j89783
$$ -102274 -46699 -152683 -160693 -55756 30391 96113 28662 -23876 -10802 -57449 -247232
7188b47232P0061L8293J42035K2529j18985r3221J29616r2843Q3737J25363j9053
$$ -247232 -177171 -138878 3157 25686 -93299 -186520 -56904 -149747 -66010 59353 40300
7177D0300L3936j14726M2140P4539J8999n7780O975o8031r9783M7142J47891J45805
$$ 40300 74236 -40490 1650 76189 95188 37408 44383 -23648 -123431 -76289 71602 217407
7165B17407j34995j61463J2061O7853J96252l8648o5811k06852k51317J67410
$$ 217407 82412 -79051 -66990 863 197115 158467 92656 -114196 -365513 -198103
7155a98103j00683k4497q4449P0855J91474J24242k53622J7863J16344J28857
$$ -198103 -298786 -323283 -407732 -336877 -145403 -21161 -274783 -256920 -140576 -11719
7145a1719k0184o7245j65393o9590R2904L9635L1735j8421J64614j9109J10589
$$ -11719 -31903 -99148 -264541 -334131 -241227 -201592 -169857 -188278 -23664 -42773 67816
7134F7816J10498l7320M4564j11939R242k3101l4506o1965J10874J12498P0232
$$ 67816 178314 140994 185558 73619 82861 59760 25254 -36711 74163 186661 256893
7123B56893k4270j39845j06163J7098J10366J40099p5268j09847j11596M3322
$$ 256893 232623 92778 -13385 3713 114079 254178 178910 69063 -42533 789
7113G89j1924n3013P2904Q5267J19604l5500q3771j1754J58156k4910r1415j21326
$$ 789 -11135 -64148 8756 94023 213627 178127 94356 82602 240758 215848 124433 3107
7101C107N7006M6235L3709L9601k27376N2979o8286O3095M3573P2438k4709j44179
$$ 3107 60113 106348 140057 179658 -47718 5261 -63025 70 43643 116081 91372 -52807
7089e2807l9895j30735j01138J24407P5863P4100O7567n2616m8559J02448R0898
$$ -52807 -92702 -223437 -324575 -200168 -124305 -50205 17362 -35254 -83813 18635 109533
7078A09533R4172P8715j32571M4189o8934q8691j56451p8695J6580R9137M5454
$$ 109533 203705 282420 149849 194038 125104 36413 -120038 -198733 -182153 -83016 -37562
7067c7562P7418j20218p7399J7593j4375K66738J70623j4106j5829j27086j19870
$$ -37562 39856 -80362 -157761 -140168 -154543 112195 282818 268712 252883 125797 5927
7056E927J0332M2192J15286j4005r6054K3132j17636J25540N0448j31085j1782
$$ 5927 16259 58451 173737 159732 63678 86810 -30826 94714 145162 14077 2295
7045B295J27142N8946j25223q4609L0057J25400J19716p2363l10742j20838J03614
$$ 2295 129437 188383 63160 -21449 8608 134008 253724 181361 -129381 -250219 -146605
7034a46605J74232R4166K2771P4208m8093k76575j24010o6853J24629N6857K00021
$$ -146605 27627 121793 144564 218772 170679 -105896 -229906 -296759 -172130 -115273 84748
7023H4748M9292j09048j20802j01672M4519m6460J7048P0804J81271J38863R7929
$$ 84748 134040 24992 -95810 -197482 -152963 -199423 -182375 -111571 69700 208563 306492
7012C06492j64669J5287q5992j14653K1767L9031J31306m5272k66795m3298J81741
$$ 306492 141823 157110 71118 -43535 -21768 17263 148569 103297 -163498 -206796 -25055
7001b5055O2771k4199r0426K3538m4694j14182P8922P7269k00468m1755J54410
$$ -25055 37716 13517 -76909 -53371 -98065 -212247 -133325 -56056 -256524 -298279 -143869
6990a43869O5749J80703n638P5994j16160j3573j67502q6171n0929J24475l1313
$$ -143869 -78120 102583 96945 172939 56779 43206 -124296 -210467 -261396 -136921 -168234
6979a68234n5904m0949N0432M812O7454m694m9479J83287M5345j10390J3417k2066
$$ -168234 -224138 -265087 -214655 -209843 -142389 -147083 -196562 -13275 32070 -78320 -64903 -86969
6967h6969j50044K9066O7157K2845J82788N8621k8266j02625J9248J38626M7167
$$ -86969 -237013 -207947 -140790 -117945 64843 123464 95198 -7427 11821 150447 197614
6956A97614r2297k416m9595j32181q7722p7977n2699l1750J08749O0502L9829
$$ 197614 105317 102901 53306 -78875 -166597 -244574 -297273 -329023 -220274 -159772 -119943
6945a19943J26009R6248J2590j0392j23468l1460k5243p9493n343O6278q5103
$$ -119943 6066 102314 114904 104512 -18956 -50416 -75659 -155152 -160495 -94217 -179320
6934a79320k11269J19201J37148j0713j0106J17996K16856M0190j24308j09225
$$ -179320 -390589 -271388 -134240 -144953 -155059 -37063 179793 219983 95675 -13550
6924a3550N4480J5374L1411L065q4029K8772j86343k71354j1302J03692J28347
$$ -13550 40930 56304 87715 90780 6751 35523 -150820 -422174 -433476 -329784 -201437
6913b01437J59675J37453j00788P4771P8482J15763q555r572k02249k09262n5546
$$ -201437 -41762 95691 -5097 69674 148156 263919 255364 245792 43543 -165719 -221265
6902b21265R1768J84722N8699j08433L0453J38334N8922L2735p0753q0171r6318
$$ -221265 -129497 55225 113924 5491 35944 174278 233200 265935 195182 115011 18693
6891A8693P3458K58l4186R1412J75200q0776j45731M9667o4100j98998n7846O4928
$$ 18693 92151 92409 58223 149635 324835 244059 98328 147995 83895 -115103 -172949 -108021
6879a08021n8811J08311J66562K5387K5467j10444j35405k25940J06460J07404
$$ -108021 -166832 -58521 108041 133428 158895 48451 -86954 -312894 -206434 -99030
6869i9030L3519O0976M2609n1285L5924j4254j62022n2431J48181L5107r179J59935
$$ -99030 -65511 -4535 38074 -13211 22713 8459 -153563 -205994 -57813 -22706 -31885 128050
$$ [...]
##END NTUPLES=NMR SPECTRUM
##END=
