##TITLE=Analysis number 324064
Compound Code mo 00292
Project Code adrs
Chemist Name fudan
##JCAMPDX= 6.0         $$ Bruker NMR JCAMP-DX V2.0
##DATA TYPE= NMR SPECTRUM
##DATA CLASS= NTUPLES
##ORIGIN= Bruker BioSpin GmbH
##OWNER= nmr
$$ XWIN-NMR		Version 3.5
$$ Tue Nov 14 12:41:15 2006 GMT Standard Time (UT+0h)  MAYBRIDGE\nmr@NMR_250MHZ
##.OBSERVE FREQUENCY= 250.131544655141
##.OBSERVE NUCLEUS= ^1H
##.ACQUISITION MODE= SIMULTANEOUS (DQD)
##.ACQUISITION SCHEME= undefined
##.AVERAGES= 16
##.DIGITISER RES= 18
##SPECTROMETER/DATA SYSTEM= dpx250
##.PULSE SEQUENCE= zg30
##.SOLVENT NAME= CDCl3
##.SHIFT REFERENCE= (INTERNAL, CDCl3, 0, 16.4505)
##AUDIT TRAIL= $$ (NUMBER, WHEN, WHO, WHERE, WHAT)
$$ ##TITLE= Audit trail, XWIN-NMR		Version 3.5
$$ ##JCAMPDX= 5.01
$$ ##ORIGIN= Bruker BioSpin GmbH
$$ ##OWNER= nmr
$$ C:\u/data/dgb/nmr/ADRS/320/pdata/1/auditp.txt
$$ ##AUDIT TRAIL=  $$ (NUMBER, WHEN, WHO, WHERE, WHAT)
(   1,<2006-11-14 12:40:36.03 +000>,<MAYBRIDGE\nmr>,<NMR_250MHZ>,
      <created by zg, POWCHK disabled, PULCHK disabled
       configuration hash MD5:
       49 4B E0 1D 92 C2 6B 37 9F E6 65 BC 52 41 86 1D
       data hash MD5: 64K
       B2 A6 71 FC C7 10 61 AC 3A 71 C6 7A 28 53 2E 95>)
(   2,<2006-11-14 12:40:54.86 +000>,<MAYBRIDGE\nmr>,<NMR_250MHZ>,
      <Start of raw data processing
       ef LB = 0.3 FT_mod = 6 PKNL = 1 SI = 32K 
       data hash MD5: 32K
       21 CF 79 B3 44 51 C1 AD 7A 1D 1F 48 21 98 3E BE>)
(   3,<2006-11-14 12:40:59.48 +000>,<MAYBRIDGE\nmr>,<NMR_250MHZ>,
      <apk 
       data hash MD5: 32K
       83 73 81 7F C9 1A D3 5A D0 18 C7 02 BF 15 BA 24>)
(   4,<2006-11-14 12:41:00.95 +000>,<MAYBRIDGE\nmr>,<NMR_250MHZ>,
      <abs ABSG = 5 
       data hash MD5: 32K
       B0 EA D4 FF 15 CA 42 0B 08 B1 80 41 F7 7C 25 51>)
$$ ##END=
$$ 
$$ hash MD5
$$ D0 0F 2A 62 FA 64 AC 38 00 CF D2 B9 A5 A4 D3 06
##$RELAX= 
##$RELAX= 
##$RELAX= 
##$RELAX= 
##$RELAX= 
##$RELAX= 
##$RELAX= 
$$ Bruker specific parameters
$$ --------------------------
##$DU= <C:\u>
##$EXPNO= 320
##$NAME= <ADRS>
##$PROCNO= 1
##$TYPE= <nmr>
##$USER= <dgb>
##$AMP= (0..31)
100 100 100 100 100 100 100 100 100 100 100 100 100 100 100 100 100 100 
100 100 100 100 100 100 100 100 100 100 100 100 100 100 
##$AQSEQ= 0
##$AQ_mod= 3
##$AUNM= <au_zg>
##$AUTOPOS= <35 >
##$BF1= 250.13
##$BF2= 250.13
##$BF3= 250.13
##$BF4= 250.13
##$BF5= 500.13
##$BF6= 500.13
##$BF7= 500.13
##$BF8= 500.13
##$BYTORDA= 1
##$CFDGTYP= 0
##$CFRGTYP= 5
##$CHEMSTR= <none>
##$CNST= (0..31)
1 1 145 1 1 1 1 1 1 1 1 1 1 1 1 1 1 1 1 1 1 1 1 1 1 1 1 1 1 1 1 1 
##$CPDPRG= <>
##$CPDPRG1= <>
##$CPDPRG2= <>
##$CPDPRG3= <>
##$CPDPRG4= <mlev>
##$CPDPRG5= <mlev>
##$CPDPRG6= <mlev>
##$CPDPRG7= <mlev>
##$CPDPRG8= <mlev>
##$CPDPRGB= <>
##$CPDPRGT= <>
##$D= (0..31)
0 1 0 0 0 0 0 0 0 0.06 0 0 0 0 0 0 0.0002 0 0 0 0 0 0 0 0 0 0 0 0 0 0 
0 
##$DATE= 1163508034
##$DBL= (0..7)
120 120 120 120 120 120 120 120 
##$DBP= (0..7)
150 150 150 150 150 150 150 150 
##$DBP07= 0
##$DBPNAM0= <>
##$DBPNAM1= <>
##$DBPNAM2= <>
##$DBPNAM3= <>
$$ [...]
##$SUBNAM7= <"">
##$SUBNAM8= <"">
##$SUBNAM9= <"">
##$SW= 20.6930455092707
##$SWIBOX= (0..15)
0 0 3 0 0 0 0 0 0 0 0 0 0 0 0 0 
##$SW_h= 5175.983436853
##$TD= 65536
##$TD0= 1
##$TE= 683.16
##$TE2= 300
##$TE3= 300
##$TEG= 300
##$TL= (0..7)
0 120 120 120 120 120 120 120 
##$TP= (0..7)
150 150 150 150 150 150 150 150 
##$TP07= 0
##$TPNAME0= <>
##$TPNAME1= <>
##$TPNAME2= <>
##$TPNAME3= <>
##$TPNAME4= <>
##$TPNAME5= <>
##$TPNAME6= <>
##$TPNAME7= <>
##$TPOAL= (0..7)
0.5 0.5 0.5 0.5 0.5 0.5 0.5 0.5 
##$TPOFFS= (0..7)
0 0 0 0 0 0 0 0 
##$TUNHIN= 0
##$TUNHOUT= 0
##$TUNXOUT= 0
##$USERA1= <user>
##$USERA2= <user>
##$USERA3= <user>
##$USERA4= <user>
##$USERA5= <user>
##$V9= 5
##$VALIST= <valist>
##$VCLIST= <CCCCCCCCCCCCCCC>
##$VD= 0
##$VDLIST= <DDDDDDDDDDDDDDD>
##$VPLIST= <PPPPPPPPPPPPPPP>
##$VTLIST= <TTTTTTTTTTTTTTT>
##$WBST= 1024
##$WBSW= 4
##$XGAIN= (0..3)
0 0 0 0 
##$XL= 0
##$YL= 0
##$YMAX_a= 408132
##$YMIN_a= -334762
##$ZGOPTNS= <>
##$ZL1= 120
##$ZL2= 120
##$ZL3= 120
##$ZL4= 120
##$ABSF1= 16.45051
##$ABSF2= -4.242662
##$ABSG= 5
##$ABSL= 3
##$ALPHA= 0
##$AQORDER= 0
##$ASSFAC= 0
##$ASSFACI= 0
##$ASSFACX= 0
##$ASSWID= 0
##$AUNMP= <proc_1d>
##$AZFE= 0.1
##$AZFW= 0.1
##$BCFW= 0
##$BC_mod= 0
##$BYTORDP= 0
##$COROFFS= 0
##$CY= 12.5
##$DATMOD= 1
##$DC= 0
##$DFILT= <>
##$DTYPP= 0
##$F1P= 14.0000005364418
##$F2P= -0.99999901652339
##$FCOR= 0.5
##$FTSIZE= 32768
##$FT_mod= 6
##$GAMMA= 0
##$GB= 0
##$INTBC= 1
##$INTSCL= 1
##$ISEN= 128
##$LB= 0.3
##$LEV0= 0
##$LPBIN= 0
##$MAXI= 10000
##$MC2= 0
##$MEAN= 0
##$ME_mod= 0
##$MI= 0
##$NCOEF= 0
##$NC_proc= -5
##$NLEV= 6
##$NOISF1= 0
##$NOISF2= 0
##$NSP= 0
##$NTH_PI= 0
##$NZP= 0
##$OFFSET= 16.45051
##$PC= 1
##$PHC0= -46.3795
##$PHC1= 1.156069
##$PH_mod= 1
##$PKNL= yes
##$PPARMOD= 0
##$PSCAL= 4
##$PSIGN= 0
##$REVERSE= no
##$SF= 250.130017881434
##$SI= 32768
##$SIGF1= 0
##$SIGF2= 0
##$SINO= 400
##$SIOLD= 32768
##$SREGLST= <1H.CDCl3>
##$SSB= 0
##$STSI= 32768
##$STSR= 0
##$SW_p= 5175.98343685301
##$SYMM= 0
##$S_DEV= 0
##$TDeff= 65536
##$TDoff= 0
##$TI= <Analysis number 999999
Compound Code 99
Book Reference 9
Project Code 9>
##$TILT= no
##$TM1= 0
##$TM2= 0
##$TOPLEV= 0
##$USERP1= <user>
##$USERP2= <user>
##$USERP3= <user>
##$USERP4= <user>
##$USERP5= <user>
##$WDW= 1
##$XDIM= 32768
##$YMAX_p= 440066270
##$YMIN_p= -585128
$$ End of Bruker specific parameters
$$ ---------------------------------
##NTUPLES= NMR SPECTRUM
##VAR_NAME=  FREQUENCY,     SPECTRUM/REAL,   SPECTRUM/IMAG
##SYMBOL=    X,             R,               I
##VAR_TYPE=  INDEPENDENT,   DEPENDENT,       DEPENDENT
##VAR_FORM=  AFFN,          ASDF,            ASDF
##VAR_DIM=   32768,         32768,           32768
##UNITS=     HZ,            ARBITRARY UNITS, ARBITRARY UNITS
##FACTOR=    0.157963299565203, 1,           1
##FIRST=     4114.76636671807, 0,            0
##LAST=      -1061.21707013494, 0,           0
##MIN=       -1061.21707013494, -585128,     0
##MAX=       4114.76636671807, 440066270,    0
$$ Real data points
##PAGE= N=1
##DATA TABLE= (X++(R..R)), XYDATA
$$ [...]
16312A20708P1287j1271j04861K9846O5866M1198r4118r7610l7676K8931J26386
16301A38686N0336M1965o8146j0210Q3639L0278n4795r7655j70618k1391J65146
16290H7235k2066j25736j30253J03682P7166l3780K1657o8083R3892O204j66178
16279a56260j03884r2178K1229P1531N6507J85994K0006n5835O7423R4236Q0755
16268A89524l7469m5883K9294o1217j37647p4511j824J0608J28368j15047J07541
16257h263J28580k5196q7789N1275J3915r2701j8157j01J15024N9209K8970q3685
16245H1081o1514Q4694N1621m0653k3988r1443K1419J73626J059l2603Q65q4321
16233G9843q4143o3796L651j0502j9120P8097L0800k22055P9004J65944O2976
$$ plain form
16312 120708 191995 180724 75863 105709 171575 212773 118655 21045 -16631 12300 138686
16301 138686 189022 230987 162841 152631 236270 266548 211753 114098 -56520 -77911 87235
16290 87235 65169 -60567 -190820 -87138 -9972 -43752 -22095 -90178 3714 9918 -156260
16279 -156260 -260144 -352322 -331093 -259562 -203055 -17061 2945 -52890 14533 108769 189524
16268 189524 152055 106172 135466 74249 -63398 -137909 -139733 -129125 -757 -115804 -8263
16257 -8263 120317 95121 7332 58607 72522 -20179 -38336 -38437 76587 135796 164766 81081
16245 81081 19567 104261 155882 115229 91241 -202 21217 194843 195902 163299 164164 79843
16233 79843 -4300 -68096 -64445 -74947 -94067 -15970 14830 -207225 -128221 37723 100699
16222A00699J2147j02868l6419p2382n7303O4931J09129L7550K4728r8397r6155
16211a14340J1785O9032J27481M015q9403j00304J2788n446q4279Q9375Q0966
16200A670M9804l8659J0603K5186K3339n3153n3010J04592J3397r6090J1072m505
16188e754J31982K982N572J15294o9197j56629L0006j6983j44151q2227P1685
16177a17420l7505n0951m27J78265R2811P4881j7412r5220n6798j05952l3848
16166a69576J66796L3890j29587l822K0652k4318M7330M8464J23403J19494j31791
16155A00935k35798l015P0931j0273j13198N9653R8309J02677q2934l7919j7449
16144f8081L9217M0297l2019j7106k7781K1971L2982L9959J02690j1140j81712
$$ plain form
16222 100699 112846 9978 -26441 -98823 -156126 -91195 17934 55484 80212 -18185 -114340
16211 -114340 -102555 -33523 93958 97973 8570 -91734 -78946 -84392 -168671 -79296 1670
16200 1670 51474 12815 23418 48604 71943 18790 -34220 70372 83769 -12321 -1249 -5754
16188 -5754 126228 129210 134782 250076 180879 24250 54256 37273 -106878 -189105 -117420
16177 -117420 -154925 -205876 -206303 -28038 64773 139654 122242 27022 -29776 -135728 -169576
16166 -169576 -2780 31110 -98477 -102299 -81647 -105965 -58635 -10171 113232 232726 100935
16155 100935 -134863 -137878 -66947 -77220 -190418 -130765 -32456 70221 -12713 -50632 -68081
16144 -68081 -28864 11433 -20586 -37692 -65473 -43502 -10520 29439 132129 120989 -60723
16133f0723L6628r5284m9100R3467L7810j6999L3057J59241l2799r5047o838Q4571
16121H7984l0613N6517m091n6518n1917Q8103J35477k1064o1872j56269j8578
16110c2841K1167J63035J11957M8038j43533r7093j07078l8358j3300k2301j56271
16099b66578L0408R2441j60306M949J61566K20243n5656j27555N338K34812j16545
16088B3117j83339J7613N9990J32557J06275q9528j29642j32577P7819j1668k4652
16077a54035R1721K8060m8801L2344n4661n8701o965M7196J99097K28036j34818
16066A68473j66457M8444J47041P7387j5164m4278n5992j6981o3933k31037L138
16055a49359M1388N82R2190p4039J945N3263j32485k8818J22091J00823L1684
$$ plain form
16133 -60723 -24095 -119379 -168479 -75012 -37202 -54201 -21144 138097 105298 10251 3413 87984
16121 87984 57371 113888 109797 53279 1362 89465 224942 203878 142006 -14263 -32841
16110 -32841 -11674 151361 263318 311356 167823 70730 -36348 -74706 -88006 -110307 -266578
16099 -266578 -236170 -143729 -304035 -299086 -137520 82723 27067 -100488 -95150 139662 23117
16088 23117 -160222 -142609 -82619 49938 156213 66685 -62957 -195534 -117715 -129383 -154035
16077 -154035 -62314 -34254 -83055 -50711 -105372 -164073 -171038 -123842 75255 303291 168473
16066 168473 2016 50460 197501 274888 259724 215446 159454 142473 78540 -152497 -149359
16055 -149359 -107971 -107389 -15199 -89238 -87293 -34030 -166515 -195333 -73242 27581 59265
16044E9265L3505J8153n1010j3672n6945K2313j40411o735m8402O0077R4025N0647
16032B0810O5799J38968O0420q5085q0484O9048L8829p6175l6358L1930Q3056
16021B30758p0777O1568J44646k26386j57208O0987M0721J6341n5830k0063o8012
16010d3255j4749J17429K8635p9050N5639R4326n8977j12318R7151j01442r6717
15999a13328l2272r1509M2964j5234J1284J33382M0119j4028r941k3947j2654
15988h5164k3137P2487J19979j14919K1648J67407j007N235p1893k9621J9584
15977H0599q638r1826P0851J85423L0548m4680j05957K2878P033l7675r4134l7738
15965b3316p7563r5564j9216N1492O0964R4557q4368n9125J14537J48057N1430
$$ plain form
16044 59265 92770 110923 59913 46241 -10704 11609 -128802 -135537 -183939 -123862 -29837 20810
16032 20810 86609 225577 285997 200912 120428 189476 228305 152130 115772 147702 230758
16021 230758 159981 221549 366195 139809 -17399 43588 84309 100650 44820 24757 -43255
16010 -43255 -58004 59425 88060 9010 64649 158975 99998 -12320 84831 -16611 -113328
15999 -113328 -145600 -237109 -194145 -209379 -198095 -64713 -24594 -38622 -48563 -72510 -85164
15988 -85164 -108301 -35814 84165 -30754 -9106 158301 157294 162529 90636 61015 80599
15977 80599 71961 -19865 50986 236409 266957 222277 116320 139198 146231 108556 14422 -23316
15965 -23316 -100879 -196443 -215659 -164167 -103203 -8646 -93014 -152139 -37602 110455 161885
15954A61885m2235l3118j01345p2991j131o1397K9610m330K16797l9735q3668
15943c1658j04000M855P384q7749O4287J54420j892j54349q2140N0819M0601j07465
15931b46887P0186K27805J51253J9055m3118j03293r3771J0344j5808q8927l7650
15920a50811Q6543J35640O5076j08358O2699R3407r7443j79509J8809L764j70883
15909b41066n1534J19918J05655l0219o500Q233R2364O3295l5885q7321K1668
15898d1392N4318N0003P3272j52470r0230J62992J17990n6265j13152j2933n2308
15887f0175m8118p9872J99063R7741j34651n4449j8192K8677P2087k7774j15829
15876a41492J29193J41475r4677j74079k4520p384P649O5755n3516L0803J35310
$$ plain form
15954 161885 119650 86532 -14813 -87804 -88935 -150332 -120722 -125052 91745 52010 -31658
15943 -31658 -135658 -130803 -123419 -211168 -146881 7539 5647 -148702 -230842 -180023 -139422 -246887
15931 -246887 -176701 51104 202357 221412 178294 75001 -18770 -8426 -24234 -113161 -150811
15920 -150811 -64268 71372 136448 28090 90789 184196 86753 -92756 -73947 -70183 -241066
15909 -241066 -292600 -172682 -67027 -97246 -103746 -95513 -3149 60146 24261 -63060 -41392
15898 -41392 12926 62929 136201 -16269 -106499 56493 174483 118218 5066 -7867 -60175
15887 -60175 -108293 -188165 10898 108639 -26012 -80461 -98653 -69976 2111 -25663 -141492
15876 -141492 -12299 129176 34499 -139580 -164100 -171484 -163835 -98080 -151596 -120793 14517
15865A4517J49492O127j02020j6881Q1899j8199j02346J34j43824R2235N1279
15854A2413K7229R0874r1963L4926K35339k0056j69668o6473n3015o4790j19994
15843a85178K6145J50411M8598r932J8015p466q6293P0801L5880p8879P3853J26083
15831A82038j18716k29126m5537J41394o6360J8519P6683M2714l764K5884M6565
15820G0294p4991j67519J7702r7098N4777J07294J45203j0159j21393J56423M3404
15809A23937k9033O8519j633k2528L6464Q1550j45916r5035K06590R1371j84443
15798A29843j23576j5942N4750M886o7639L9526j2732j01o243j488j0819o1923
15786g1458l274m0900p7140r249o8203K4711O6793L0811J25675J41629j2185j03062
$$ plain form
15865 14517 164009 170136 68116 51235 133134 114935 12589 12723 -131101 -38866 12413
15854 12413 39642 130516 38553 73479 308818 288762 119094 52621 -394 -65184 -185178
15843 -185178 -159033 -8622 39976 30044 48059 40593 -45700 25101 60981 -17898 55955 182038
15831 182038 63322 -165804 -211341 -69947 -136307 -117788 -41105 1609 -2155 23729 70294
15820 70294 -4697 -172216 -154514 -251612 -196835 -89541 55662 45503 -75890 80533 123937
15809 123937 94904 163423 161790 139262 175726 257276 111360 16325 222915 314286 129843
15798 129843 6267 -9675 45075 49961 -17678 21848 9116 9015 2772 1284 -9535 -71458
15786 -71458 -74732 -115632 -192772 -202021 -270224 -245513 -178720 -147909 -22234 119395 107210 4148
15774D148m5705k3426k4101p4414P0526M0970q1302j03128j35398j4049J68612
15763b17267J91342l4780p5768J20094L1339l3373K7681N0391r0315l7425N3530
15752a4551l1288m6756J1225J9821j5974O2982L3181p3341o8246r4712L2344K3878
15740a61437o9279K3699O8296P693j39901L2889L9741O8017K0468N4793K9684
15729b5337J38857R407L3193j6983K909L0205j36402j98825J0260K1488P1415
15718e9813Q8399j2137m487j7965Q7238j5835M7382k3122M089J36601p585p2191
15706A50574O1767L3322P535k28809j92753M8358l6642J4083M5331M6460L738
15695d7036r3066r0174M3063K39401J34121Q894j30013n5926J0591p9660l9658
$$ plain form
15774 4148 -41557 -64983 -89084 -163498 -92972 -52002 -133304 -236432 -371830 -385879 -217267
15763 -217267 -25925 -60705 -136473 -16379 14960 -18413 9268 59659 -30656 -68081 -14551
15752 -14551 -45839 -92595 -81370 -61549 -77523 -14541 18640 -54701 -122947 -217659 -185315 -161437
15740 -161437 -230716 -207017 -138721 -131028 -270929 -238040 -198299 -130282 -109814 -55021 -25337
15729 -25337 113520 122927 156120 139137 142046 172251 35849 -162976 -152716 -131228 -59813
15718 -59813 28586 16449 11962 -6003 81235 65400 112782 89660 93749 230350 222765 150574
15706 150574 212341 245663 253198 24389 -168364 -120006 -156648 -142565 -97234 -50774 -47036
15695 -47036 -140102 -230276 -187213 52188 186309 195203 65190 9264 19855 -59805 -99463
15684i9463K7550l5923J7885N2225n806m1697k0382n6412J2009Q6162K8533m3575
15672g8894P6816J2961O9915p404j44906j6815j03067j06422R6888J52677J05425
15661E7174L2539j15560o1410j29524J13188J15249N7453M2943j18056J4618J25729
15650A34343j08604j12228k6597J31934M1090l5829O6116J8257j05169P7813P8233
15639A59359j16795k24538o9799j01430M4619K31313K22440N8518m7738K7479
15629A83428j99438o31N3465j0071l3641l9473o1382K1414l029M5941j00518Q4468
15617e9467N9109k488O416L6692J36962N6304j07527p8929p5622M484n334j19480
15605a48880M1371J40078N2512M0130p8100M3646R365j89210M8824m4688j20757
$$ plain form
15684 -99463 -71913 -107836 -89951 -37726 -43532 -85229 -105611 -162023 -150014 -63852 -35319 -78894
15672 -78894 -2078 10883 80798 73394 -71512 -88327 -191394 -297816 -200928 -48251 57174
15661 57174 89713 -25847 -87257 -216781 -103593 11656 69109 112052 -6004 8614 134343
15650 134343 25739 -86489 -113086 18848 59938 24109 90225 108482 3313 81126 159359
15639 159359 42564 -181974 -251773 -353203 -308584 -77271 145169 203687 155949 183428
15629 183428 -16010 -16641 36824 26753 -6888 -46361 -107743 -86329 -89358 -43417 -143935 -59467
15617 -59467 -358 -2846 3570 40262 177224 233528 126001 47072 -28550 -24066 -29400 -148880
15605 -148880 -107509 32569 85081 125211 47111 90757 100122 -89088 -40264 -84952 -205709
15594b05709m613J64164R7893n116k9280n9169l0022J12764k8442L2564Q9775
15583A34809m0599M8793M0991N204K6816J90478L2213n6428j12841j99423q9984
15572a9971J65665n2474o4467L6583n1823p8777M7418Q2735p7524M6689j1383
15561B2671Q5006P8947m5329j98784m7577K34j89626n8616Q9964p9697j1265K79391
15549g4681M5414M6754O5669j4246J58803N1573R9232n9374M8293p8373q0802
15538B08262j31665l1523n0931N3971k5947j89712k2625J18190J7992j28087p536
15527a89611J60672R2300n4839o1494k5269j309J67480O6809j28985k597j4038
15516I119l6917k3247q3009j36624L8549P6926K1367N0063J21783J11826j0359
$$ plain form
15594 -205709 -210322 -46158 51735 46619 17339 -41830 -71852 40912 12470 45034 134809
15583 134809 94210 143003 183994 189198 216014 406492 438705 382277 269436 70013 -19971
15572 -19971 145694 93220 28753 65336 13513 -65264 -17846 64889 -12635 34054 22671
15561 22671 107677 186624 141295 -57489 -105066 -104832 -294458 -353074 -263110 -342807 -354072 -74681
15549 -74681 -29267 17487 83156 68910 227713 279286 378518 319144 367437 289064 208262
15538 208262 76597 45074 -5857 48114 22167 -167545 -190170 -71980 -53988 -182075 -189611
15527 -189611 -28939 63361 8522 -52972 -78241 -79550 87930 154739 25754 23157 9119
15516 9119 -27798 -51045 -134054 -270678 -232129 -155203 -133836 -83773 38010 149836 139477
15505A39477j86568j03828M2967j0693o663Q6077K4472o3963m64l5249J1894Q8070
15493a4471k7463M9861o2820j10964Q3820K00243L0919p3913K08181j8427j30608
15482A34358k64469Q147J24094L0380O4941N2218O9589m2989m9661L367j11717
15471A8258l1423M6640R4084j21707M1867J04382N2125j27561o4240J6230k1261
15460G394o9575j2611M4358L1048N4954k3239j75337r3253J73981J15441N5387
15449A08548r3821j8953j23034J16281l6653j38501k0849n982L6432P1662k742
15438a07612J9928J5779p844q3185p7376N7580J22427P4800P5390j32102l8750
15427h0965j6939L1508l233o3418K3594K01660M4674N2620m0160r7789j22805
$$ plain form
15505 139477 -47091 -150919 -107952 -118645 -125308 -39231 -14759 -78722 -79186 -114435 -102541 -14471
15493 -14471 -41934 7927 -54893 -165857 -82037 118206 149125 75212 283393 264966 134358
15482 134358 -130111 -121964 2130 32510 97451 149669 219258 176269 126608 129975 18258
15471 18258 -13165 33475 127559 5852 47719 152101 204226 76665 12425 28655 7394
15460 7394 -62181 -74792 -30434 614 55568 32329 -143008 -236261 -62280 53161 108548
15449 108548 14727 -4226 -127260 -10979 -47632 -186133 -206982 -212964 -176532 -104870 -107612
15438 -107612 -87684 -71905 -79749 -162934 -240310 -182730 -60303 14497 89887 -42215 -80965
15427 -80965 -97904 -66396 -69629 -133047 -109453 92207 136881 189501 149341 51552 -71253
15416g1253J7066M9946o6914r6275k3090O373j7330J8788Q5692Q0899o5709p9717
15404a61524k2879J43088O7878j31085l054J08154N1325l7736q4573n3116M0957
15393h2565Q7891o0874n031o513L8682J4412L4059J2305j9749N5503l3636o0064
15381b5580p4681r478n7845k0335J90500k2243n2716j43951J1739Q5177J16413
15370c000m8343m614l7250N8706L7910O5091K8630j9547j01936j84198J37481
15359g1070P4339j12418o5341J8235j9546l2484J19899R5779n8599j91600M7591
15348a95215J03566O0524R9702Q7481j46860Q658M3301n6603q3629O2989r7099
15337a13185L2070O6731j14982k6101J0450P4754o103j7620M2559L4255j37991
$$ plain form
15416 -71253 -54187 -4241 -71155 -167430 -190520 -184147 -201477 -182689 -96997 -16098 -81807 -161524
15404 -161524 -184403 -41315 26563 -104522 -107576 578 51903 14167 -70406 -123522 -82565
15393 -82565 5326 -55548 -60579 -67092 -28410 -13998 20061 32366 12617 68120 34484 -25580
15381 -25580 -100261 -109739 -167584 -187919 2581 -19662 -72378 -216329 -204590 -119413 -3000
15370 -3000 -51343 -55957 -93207 -34501 3409 68500 97130 77583 -24353 -208551 -71070
15359 -71070 3269 -109149 -174490 -156255 -175801 -208285 -88386 7393 -51206 -242806 -195215
15348 -195215 -91649 -31125 68577 156058 9198 17856 61157 4554 -79075 -16086 -113185
15337 -113185 -81115 -14384 -129366 -155467 -145017 -70263 -76366 -93986 -51427 -17172 -155163
15326a55163m0751R1003p382l4204O9614J79103o3891p2512j0552q6412J62820
15315C1673J7461N4561j33875j00569J85423J05267J6781J23616r8768n4011j42130
15304E429n7502j519O076J25034J2514j3051q240k4855O910q0887m4593K61966
15292A87282J46852k766o6721j32872J0882K36199J06573J888j48054j67364r5613
15281G6286k14001j27955J38548K8721j07179j5622J51840J9950m361k5941m3402
15270a23116R8841J35854j9971j75486j70050M4573J06377Q9515n5119L1900n7665
15259i4347m8939m0169O0603O8669K2725J25000M9249k8257l1137k8799j01253
15248d6655J5596r1368l5719M398Q0340n2781j55914O3352J66491J88946k0020
$$ plain form
15326 -155163 -195914 -104911 -112293 -146497 -76883 102220 38329 -34183 -44735 -131147 31673
15315 31673 49134 103695 -30180 -130749 54674 159941 176722 300338 201570 147559 5429
15304 5429 -52073 -53592 -47516 77518 90032 76981 68741 43886 50796 -30091 -74684 187282
15292 187282 334134 331368 264647 131775 142657 378856 485429 487317 339263 171899 76286
15281 76286 -137715 -265670 -127122 -98401 -205580 -221202 -69362 -49412 -53773 -79714 -123116
15270 -123116 -24275 111579 91608 -83878 -253928 -209355 -102978 -13463 -68582 -36682 -94347
15259 -94347 -143286 -183455 -122852 -54183 -31458 93542 142791 114534 83397 54598 -46655
15248 -46655 -31059 -122427 -158146 -153748 -73408 -126189 -282103 -218751 -52260 136686 116666
15237A16666k16055J47179J37090L5930K9217j28587p3868J05447n8788j07171
15227a2940N3410q8362k4154N5048l3040N9374Q3098k86191K7940P6179N9459
15216c0179o8105j06800M3810R2743N1004J27657P3345j29921N8400r4682N4674
15205G1946M6508p8264l6282o37n9851M7498R6034J03747r260j05914J7619m0206
15193E2938j12123n0560l9076O1640j4838J07872M8819j18543l2907n4813j28710
15182b80301l8872J33134J02397n1156L0973R8502P0571q8255K5019L4410j19858
15171h3436J24110R1585o9834j82415j15630P1185L2169J12535J89287O1320M6080
15160B76956r4231j00436j33048o0055R9741O9731r6567l2447o0408L3319R5823
$$ plain form
15237 116666 -99389 47790 184880 220810 250027 121440 47572 153019 94231 -12940
15227 -12940 40470 -47892 -72046 -16998 -50038 9336 92434 -193757 -165817 -89638 -30179
15216 -30179 -98284 -205084 -161274 -68531 -17527 110130 183475 53554 111954 17272 71946
15205 71946 118454 40190 3908 3271 -56580 -9082 86952 190699 181439 75525 93144 52938
15193 52938 -59185 -109745 -148821 -87181 -102019 5853 54672 -63871 -96778 -151591 -280301
15182 -280301 -319173 -186039 -83642 -134798 -103825 -5323 65248 -23007 2012 36422 -83436
15171 -83436 40674 132259 62425 -119990 -235620 -164435 -132266 -19731 169556 230876 276956
15160 276956 182725 82289 -50759 -110814 -11073 58658 -37909 -70356 -130764 -97445 -1622
15149a622J5188n8132p4519j1385j9195O6205J97536J17142q9592l0284O8341
15138A79683L4453K640l9524k24743o0676K7856m0554J06737J55060m1001j46139
15127d6208P063r1251l8878j10332j05794J66355J52225j55809L9227J68371N2573
15116C7542j22222j28752O9693J01111n3694k5876P6882P1886j17292j48900J19081
15105a20541J65505Q1028m1629P715m6186j48209L6903J35816L0770l4021o3597
15094C554j4543j16662r792J6451p8151L6874J22882o4458j57711o9848r3279
15083d24683J44487J28218J0408Q7539R0324J6354O5744o8299n6968l8659L4042
15072a1493m0503m6839j26790m8510J51985P3194n0156q3056J40493l3734m3627
$$ plain form
15149 -1622 13566 -44566 -119085 -130470 -149665 -83460 114076 231218 141626 111342 179683
15138 179683 214136 216776 177252 -47491 -108167 -80311 -120865 -14128 140932 99931 -46208
15127 -46208 -39145 -130396 -169274 -279606 -385400 -219045 -66820 -222629 -183402 -15031 37542
15116 37542 -84680 -213432 -143739 -42628 -96322 -122198 -45316 26570 -90722 -239622 -120541
15105 -120541 44964 125992 84363 92078 45892 -102317 -65414 70402 101172 67151 3554
15094 3554 -10989 -127651 -137443 -120992 -199143 -162269 -39387 -103845 -261556 -331404 -424683
15083 -424683 -280196 -151978 -141570 -54031 36293 52647 118391 50092 -6876 -45535 -11493
15072 -11493 -51996 -98835 -225625 -274135 -122150 -48956 -99112 -182168 -41675 -75409 -119036
15061a19036O7322n435o9879N0239J74583J826j44083J50568J10435k0370j41400
15050E4770j29119o2832o2059J09851J0590m1880J5759K3946J04604J11573j0981
15039A24222k3062N8879J52661M0425p2024n2658L653N0332j20252J875j40832
15028B3219m1486J41002k0970K8599j6763J8616N6523N1093O8397M4909q5601
15017B67538j05611k3625m851O0391J19911J20396O1285J35585K73357K44367
15007A148743N40953O89154J055096J629999K081447K065863J528580q34800k638191
14998G266844k268859j573765j082959p84217m34272k97486j77945N9832o165
14989G01008j35854l6242k08035j12386N8158K9973l9905K2259Q6323J8508J4808
$$ plain form
15061 -119036 -51714 -57149 -127028 -76789 97794 99620 -44463 106105 216540 196170 54770
15050 54770 -74349 -137181 -199240 -89389 -78799 -120679 -104920 -80974 23630 135203 124222
15039 124222 101160 160039 312700 353125 281101 228443 232096 282428 162176 164051 23219
15028 23219 -18267 122735 101765 130364 113601 132217 188740 239833 308230 353139 267538
15017 267538 161927 138302 133451 193842 313753 434149 495434 631019 904376 1148743
15007 1148743 1689696 2378850 3433946 5063945 7145392 9211255 10739835 9905035 7266844
14998 7266844 4997985 3424220 2341261 1557044 1122772 825286 647341 707173 701008
14989 701008 565154 528912 320877 208491 266649 296622 256717 278976 365299 383807 398615
14978C98615j68144J6179l6552j30276N8586J12210k5405K068J5600k3443j41101
14967G8337q5375m4508J10741R2339L2682j8495M9752j9426n8600K3897L1823
14956A93167j49477j25293J05133J4579n9057O2958J85662K0151J7877j0143o0496
14945A95061j51540k6983Q0563K8345j23745j42764j1319J16689R1848N3760J18467
14934B28382M1725r2459r5757n8937j12153p2275L6344R0385q741o6218O5892
14923d3812N2968k4514P1483O154M436Q4134k918O9345k0512N2852p558l0463
14911B11595q3696r1386l2614k20170P7178J01627K03932R0010m9780k21910k35243
14900b50457K2316K0766M6629q0137j03235Q4076J78308O5536Q074l7422O949
$$ plain form
14978 398615 230471 246650 210098 79822 138408 250618 225213 227281 242881 219438 78337
14967 78337 -7038 -51546 59195 151534 184216 165721 215473 196047 137447 161344 193167
14956 193167 43690 -81603 23530 38109 -20948 42010 227672 247823 265700 255557 195061
14945 195061 43521 16538 97101 125446 1701 -141063 -152382 -35693 56155 109915 228382
14934 228382 270107 177648 81891 22954 -89199 -161474 -125130 -34745 -43486 -109704 -43812
14923 -43812 9156 -15358 56125 62279 66715 150849 147931 217276 196764 249616 242058 211595
14911 211595 127899 36513 3899 -216271 -139093 -37466 166466 256476 206696 -15214 -250457
14900 -250457 -228141 -207375 -160746 -240883 -344118 -260042 -81734 -16198 -8124 -45546 -38597
14889c8597O6983N9986Q0120o0794m6191j1072o133o7482n0111l6105j33124l4360
14877b76880J248L6814N0181J35720J23951n3981r9581K6192r1989L5206J14403
14866A284O2495j12142o088J232O7296k0215J15251j08731j22092m943J01844
14855b4809J41442O8821q4085n8818o6243m610N2912l3033r9343m6323Q5451K37845
14843A69207J49921j82967k6035J4094n6921j4506K8058L3203K9064l1239j93329
14832h1450l4870N4332Q8362m6314J9684M8456o5057j3592J01745O4082k18372
14821h2994l5634K45191Q5842j84882j00839K20202o5578j40969q2299r7417K9741
14810b09636R4570K7892R8624P4434j98630j45033J03312J66723P8405Q690o6765
$$ plain form
14889 -38597 28386 88372 168492 107698 61507 50435 44302 -23180 -73291 -109396 -242520 -276880
14877 -276880 -275632 -238818 -188637 -52917 71034 17053 -82528 -56336 -148325 -113119 1284
14866 1284 63779 -48363 -54451 -53219 14077 -6138 109113 382 -121710 -126653 -24809
14855 -24809 116633 185454 101369 42551 -23692 -28302 24610 -8423 -107766 -154089 -68638 169207
14843 169207 319128 136161 110126 124220 67299 52793 80851 114054 143118 111879 -81450
14832 -81450 -116320 -61988 26374 -19940 -256 48200 -16857 -30449 71296 135378 -82994
14821 -82994 -118628 126563 212405 27523 -73316 146886 81308 -59661 -141960 -239377 -209636
14810 -209636 -115066 -87174 11450 85884 -112746 -257779 -154467 12256 90661 99351 32586
14799C2586J1451N5071o2982p4421l4655M6175m1993k44162Q4400m819M1593O9065
14787a22691N410j02978J18457K43311M2430m9473j20000k15146L6452j00897
14777b65125j56258J45213K22649J58632q854r3015p1812N681P1235R1854j851
14766I8349j36829p3985O7238K528L6225J633j17055O0648p7392j6214J7605P7274
14754e9975o2969m1309N1128M9401K8758O2699J23327p997k93395r6311L0538
14743b16105J89508J10352m1917n0594p1444m2398O1931P6745m8839J75094N5974
14732A98307l0591r1706N2450O0363r9814O2677J18709j44859j49298m1285L2694
14721c2353j3980L7399J27117J1897J4048L427M2128Q2883R816K0141o3089j15998
$$ plain form
14799 32586 44037 99108 36126 -38295 -72950 -26775 -68768 -312930 -228530 -233349 -191756 -122691
14787 -122691 -117281 -220259 -101802 141509 183939 134466 14466 -200680 -164228 -265125
14777 -265125 -421383 -276170 -53521 105111 96257 3242 -68570 -62889 8346 100200 98349
14766 98349 -38480 -112465 -45227 -42699 -6474 -4841 -121896 -61248 -138640 -154854 -137249 -59975
14754 -59975 -122944 -164253 -113125 -63724 -34966 27733 151060 143063 -150332 -246643 -216105
14743 -216105 -26597 83755 41838 -8756 -80200 -122598 -60667 16078 -32761 142333 198307
14732 198307 167716 76010 128460 188823 89009 151686 270395 125536 -23762 -65047 -32353
14721 -32353 -46333 -8934 118183 130080 144128 147555 189683 272566 282382 302523 239434 123436
14709A23436j10757o8758n6718L5982J35073j8565J1040N7223j5711q151j05380
14698b1286k4918O3788l0157j10707m9190Q7950J24583j11220l4024J43699N5395
14687I3913r3243p8780M5877L7522K03014R9701j2493l6783j93502j05430K9027
14676a1177k7983o8739j8388L1683L8461l2775p2047j27050o437K02366J74600
14665H2514m5911l6028N7877p3324j95800l2383M5458P4553K7111P1103k9756
14654e4586K7993J06427k8120k1442o9263N4584p1450o8979J42796J41487k7248
14643A32199m4323j32642p9455R2885p4536r5781J00687K5590K9496l1862J1612
14632f6130P5672J44438P8965L9785r6802r0976p071j1272j41773l0317P8979
$$ plain form
14709 123436 12679 -56079 -112797 -76815 58258 39693 50733 107956 92245 84094 -21286
14698 -21286 -46204 17584 -12573 -123280 -172470 -84520 40063 -71157 -105181 38518 93913
14687 93913 670 -78110 -32233 5289 208303 308004 295511 258728 65226 -40204 -11177
14676 -11177 -39160 -107899 -126287 -94604 -56143 -88918 -160965 -288015 -294452 -92086 82514
14665 82514 36603 575 58452 -14872 -210672 -243055 -197597 -123044 -95933 -24830 -54586
14654 -54586 -26593 79834 51714 30272 -38991 15593 -55857 -124836 17960 159447 132199
14643 132199 87876 -44766 -124221 -31336 -105872 -201653 -100966 -75376 -45880 -77742 -66130
14632 -66130 9542 153980 232945 272730 175928 84952 77881 66609 -75164 -105481 -26502
14621b6502O2919l2397l275N5565l8201Q8582Q013j57910P6443L1581N0010o6686
14609D8142j08149o5488J5272J39346J38241J27557K3574J27076P9882j50157
14599C75296o5522j30404M2387q9792o8868N2780o5125j32171p1005J02683J19280
14588F9539k9314q7446L4848j3940L5512j0370m7602j3574k2590O0704K9396Q8495
14576I3658o2717M1148L7001N137q4204j72190q5931r497n708J56212J8238q7992
14564a56845J37250O1163n0074o0434M641k9266P0180L8579q8111k0617m2663
14553a36197J50892P6262N3602j27439j29740j21382o728R0263J27929J179R767
14542a1592n3354J9457P9611j2144M9398k2991k7078q8009n5366P1821M7078K7450
$$ plain form
14621 -26502 36417 4020 745 56310 18109 106691 114704 -43206 33237 64818 114828 48142
14609 48142 -60007 -125495 -110223 29123 167364 294921 318495 445571 525453 375296
14599 375296 309774 179370 221757 131965 63097 115877 50752 -81419 -152424 -49741 69539
14588 69539 40225 -47221 -12373 -26313 9199 -1171 -48773 -62347 -84937 -24233 5163 93658
14576 93658 30941 72089 109090 114227 30023 -142167 -228098 -237595 -243303 -87091 -68853 -156845
14564 -156845 -19595 41568 -8506 -68940 -64299 -93565 -23385 15194 -72917 -93534 -136197
14553 -136197 14695 90957 144559 17120 -112620 -234002 -240730 -150467 -22538 -21359 -11592
14542 -11592 -64946 -45489 34122 21978 71376 48385 21307 -66702 -122068 -50247 -3169 24281
14530B4281n518r2506K6682M991m355l742L1091j1910J2775n197J5969j52900
14518a60339J0840j1977l0166k164J01593P0465K7683l9306n8061l7514L2975
14507i5971K20771l9321n6277k1802l2761M4259J72458K7129j58402q2146r500
14496c1563R4467j09781p6050J27202K75M8865j8258j53633k7371o877J63489
14485A0765J46610k4018o1451m9680J47244R2281n9763q1471j00160K8160Q0271
14474A28788m1158n2853R6105j1240J63598L9292j07332q5076p3405M785n6916
14463D588j03553k0656R0298P1160o5438j21510J53139N2950j8466j87065q654
14452a53207R7795m2398j06610J68640J35432P472o7963m8414k423L4074q7964
$$ plain form
14530 24281 18763 -73743 -47061 -42070 -46425 -50167 -19076 -30986 -18211 -23408 -7439 -160339
14518 -160339 -149499 -161476 -191642 -193806 -92213 -21748 5935 -33371 -91432 -128946 -95971
14507 -95971 124800 85479 29202 7400 -25361 18898 191356 218485 60083 -22063 -31563
14496 -31563 62904 -46877 -122927 4275 4550 53415 35157 -118476 -145847 -152724 10765
14485 10765 157375 133357 71906 22226 169470 261751 201988 120517 20357 48517 128788
14474 128788 87630 34777 130882 119642 283240 322532 215200 130124 56719 61504 4588
14463 4588 -98965 -119621 -29323 41837 -23601 -145111 8028 60978 42512 -144553 -153207
14452 -153207 -55412 -97810 -204420 -35780 99652 107124 39161 -9253 -11676 22398 -65566
14441f5566n109J29482P8900M0304j49803j62425Q4501J45405k2392m1947N0506
14430H1856R863q7391l6101K7163P3788M1855J06310n4582j37085r358J36514
14419A52832m4853q3655k01877J29849J74089P3865P1950m1172k2466l9808j18145
14408E0609k167L7996N7083l057j12199n1771l3767M5590L6204q016J4623p5500
14396d4372l4037p8167O8052r056O7496j39027j05244M1461R2726L914J52527
14385A6273J48307P6427J5214q3164j4165j78331l1786j925q7357O4165N4445
14374b1897j6394j4573j5963L313K2391K7169j26670J3369O8355o439l8857J54363
14362D8167J5773q2637M2765O4352j0387o8504m6519J08718o629o3461n705J52245
$$ plain form
14441 -65566 -70675 58807 137707 178011 28208 -134217 -49716 95689 73297 31350 81856
14430 81856 91719 4328 -31773 -4610 69178 111033 217343 162761 25676 16318 152832
14419 152832 107979 24324 -177553 -47704 126385 200250 272200 231028 208562 168754 50609
14408 50609 48442 86438 143521 140464 28265 -23506 -57273 -11683 24521 16505 31128 -44372
14396 -44372 -78409 -156576 -88524 -97580 -30084 -169111 -274355 -232894 -140168 -136254 16273
14385 16273 164580 241007 256221 173057 158892 -19439 -51225 -53150 -140507 -76342 -21897
14374 -21897 -38291 -52864 -68827 -65514 -43123 -15954 -142624 -129255 -60900 -67339 -106196 48167
14362 48167 63940 -18697 24068 88420 78033 9529 -36990 71728 65099 1638 -4067 148178
14350A48178M3674m9521k32073j02441J89020K0107q1358K6062J98645Q3770p4937
14339A69126q0835q424O4943J11460J37963L3352J21849M2023j51821n1680O1359
14328D49315j53359k65029J8624K395L5409j06233O48J32268j31518j48810j7252
14317a83542L3816M1790R8902j5269l802L7147N434m3090q6564Q9852P2798n9205
14305a1733q7911J15549Q1023O1990P393o1919k8473O897N9373P8224j66244p2325
14293a8156q2815J883J5015N4242J48493r434j66213k573N5203J89811K3102m1512
14281A67046j24104r1831l8447j8503N8518J28713L8051K8651k6368j5573K8370
14270A34523j3549l0766M9601P7549l4257p728j53933k52343K9949P4567N8141
$$ plain form
14350 148178 191852 142331 -89742 -192183 -3163 16944 -64414 -38352 160293 244063 169126
14339 169126 88291 79867 144810 256270 394233 427585 549434 591457 439636 387956 449315
14328 449315 295956 30927 49551 51946 87355 -18878 -18230 114038 -17480 -166290 -183542
14317 -183542 -149726 -107936 -9034 -24303 -28105 9042 14476 -28614 -115178 -25326 47472 -11733
14305 -11733 -99644 15905 96928 158918 166311 104392 75919 82816 142189 220413 54169 -18156
14293 -18156 -100971 -99088 -84073 -29831 118662 109228 -56985 -59558 -4355 185456 208558 167046
14281 167046 42942 -48889 -87336 -105839 -47321 81392 119443 148094 121726 106153 134523
14270 134523 120974 90208 139809 217358 183101 175373 21440 -230903 -200954 -126387 -68246
14259f8246p2695m3519J8451m874Q5323Q7092M2226P314J6960l5940p5374N4997
14247A1715L2182j2965k4738J41573Q1892j73624j10145J24066J30356O1238r6678
14236A64872P223J431P1014R721j63256p4631j77962P8924j0366J60651J0931
14225G8552M9181Q8746R1594m8092P7226j38132l2021Q8986j39790m1427J20630
14214A95453O4820n5755O8429l3336K7804J06891m7824o4190j03267p2483j45854
14203e9312j17121J28282J99284K2370m7694j02581m5226o2575k5373l203K3720
14192h9429J60120J46646r7217O1090M8008j32953q8379R980K1861l8912j5688
14181a4873K2015P6791M3440J18050J2769q9977p7197p3341k5996J8565L2419
$$ plain form
14259 -68246 -140941 -184460 -166009 -170883 -85560 1532 43758 51072 68032 32092 -43282 11715
14247 11715 43897 30932 6194 147767 229659 56035 -54110 69956 200312 261550 164872
14236 164872 172095 173526 244540 254261 91005 16374 -161588 -82664 -93030 67621 78552
14225 78552 127733 216479 308073 259981 337207 199075 167054 256040 116250 74823 195453
14214 195453 260273 204518 272947 239611 267415 374306 326482 262292 159025 86542 -59312
14203 -59312 -176433 -48151 151133 173503 125809 23228 -21998 -84573 -109946 -113149 -89429
14192 -89429 70691 217337 120120 181210 229218 96265 7886 17866 39727 815 -14873
14181 -14873 7142 83933 127373 245423 258192 168215 91018 17677 -8319 10246 42665
14170D2665q609O8754J2591P6411K7899K1172N1864m4824k20600n4317J6079J217
14158i698O0020j07124m6902J4888p5402J07138J33575O9527n5671m7678p1701
14147b9028K7063J34782J24917j06748k5914J16946k2058j49314q7431N5117M0361
14136G8693n373q7733J1340l3252j13781k4836J04842M4642P6834L5410j61819
14125g5033j0124O8080J15783J31374N6373l7280j53036p3073m6383j186K993
14114b1512l3139J71141J30932L6521j10588r6861j63522j53748Q4430J49132
14104g214R6291p4492n5734j7150L9973K6802j27604J2130J81404k6943j13852
14093f6389l9095k0538j5123L5225Q8435o768K7886J04328l8210j26859J59712
$$ plain form
14170 42665 34056 102810 115401 191812 219711 240883 292747 247923 27323 -26994 -10915 -9698
14158 -9698 50322 -56802 -103704 -88816 -164218 -57080 76495 146022 90351 42673 -29028
14147 -29028 -1965 132817 257734 150986 125072 242018 219960 70646 -16785 38332 78693
14136 78693 73320 -14413 -3073 -36325 -150106 -174942 -70100 -25458 51376 86786 -75033
14125 -75033 -85157 -17077 98706 230080 286453 249173 96137 23064 -23319 -24505 -21512
14114 -21512 -54651 116490 247422 283943 173355 76494 -87028 -240776 -156346 -7214
14104 -7214 89077 14585 -41149 -58299 -18326 8476 -119128 -106998 74406 47463 -66389
14093 -66389 -105484 -126022 -141145 -105920 -17485 -24253 3633 107961 69751 -57108 102604
14082A02604L5060j64788r4628P112J06566J31954K2727m1806J52396n3636j14100
14071H9461L3701k3516m3709m0470O6213J28502p5189l4125L9773j22103q4069
14060f5531P9752N4731J23096J08479j14679k59725n9190K93645J43617j67423
14050A36772j49446L129L1645R3552k9692L606Q2053M431J07958k4034o3313J7548
14038B14209Q42o7941j37071P1171Q9519p3772q3314l1428M3280J66431R5749
14027B87675r7389j51353P5450J62144j5847j24092q982M1956n5468j6243m2274
14016E5577J67965R6869n743L0362j09646j36791P0793J29328M2004m1415j30868
14005A68435j56700M634p6284P6808K79891N7818n2840k3495j59349q5241R050
$$ plain form
14082 102604 137664 -27124 -121752 -114640 -8074 123880 146607 104801 257197 203561 89461
14071 89461 123162 99646 55937 15467 81680 210182 134993 100868 140641 18538 -65531
14060 -65531 14221 68952 192048 300527 185848 -73877 -133067 160578 304195 136772
14050 136772 -12674 -9545 22100 115652 85960 89566 171619 176050 284008 259974 196661 214209
14038 214209 215051 147110 10039 81210 170729 96957 13643 -17785 25495 191926 287675
14027 287675 190286 38933 114383 276527 260680 136588 127606 169562 114094 97851 55577
14016 55577 223542 320411 314668 345030 235384 98593 169386 298714 340718 299303 168435
14005 168435 11735 16369 -59915 16893 296784 354602 301762 278267 118918 33677 42727
13994D2727q4839p7086j38388J01225J51556O0369J11014K2135M950o6280J335
13983A28718n1905j64375Q532l668k9767Q830R1488K8359J07502L7790q0005L546
13971H5045J9924N4860n6459k2368N1161m580P409J61150j22217j53932M4161
13960F4154l8104P8709Q8806j7140J88616N9638j29004j63186k6323j4061j82042
13949h9937N676O9599J19754J14278N8376M3326j13302q881l8562o5971k042p5536
13937A6778o5690j30567J49086P9221l4112M9922k8178m5910J17262R5235o5727
13926A37320L7430J3493K2710k5305k3290m6053J1453P2127q8482l338J04227
13915B12292j06989j33559K1707O2911N0536q9622J9524L9849J02823n2915j48520
$$ plain form
13994 42727 -42112 -119198 -257586 -156361 -4805 55564 166578 188713 193663 127383 128718
13983 128718 76813 -87562 -79030 -82698 -112465 -103635 -12147 16212 123714 161504 81499 85045
13971 85045 104969 159829 103370 81002 132163 127583 134992 296142 173925 19993 64154
13960 64154 26050 104759 193565 176425 365041 424679 295675 132489 106166 92105 -89937
13949 -89937 -84261 -14662 105092 219370 277746 321072 207770 198889 160327 94356 92314 16778
13937 16778 -48912 -179479 -30393 48828 14716 64638 36460 -9450 107812 203047 137320
13926 137320 174750 188243 210953 185648 162358 116305 127758 199885 111403 108065 212292
13915 212292 105303 -28256 -6549 56362 106898 17276 36800 76649 179472 126557 -21963
13904b1963n3821J353J12036k0064o5776P3654K07240M3469l6812k1026M7129
13893B65419m8131m6190j32927l5683P9747J8802k8591J83582J09543j06196l9092
13882B20283r0338j38234O9031J69925k9113n5930J52998J10296j81187k07222
13872B0509p4376l9878K6369n750j8659P6733p7601M3995J13565Q0753o458j35008
13860D194L4530J62422M0801P1779M1372j47404j70519J7106R0137K875J05125
13849B52418Q1108j26828j85863J28464N0144O1118l8067j7177J7032o732K0013
13838B35630K6959L681q6435Q3394j5447p686r2306q6865J4875P2783J81944Q6987
13826D17514j3120M191L8181q4337l37r1886p5567q6178J32028L3668N5601n6279
$$ plain form
13904 -21963 -75784 -74431 37605 17541 -48235 25419 232659 276128 239316 218290 265419
13893 265419 217288 171098 38171 2488 82235 101037 72446 256028 365571 259375 220283
13882 220283 129945 -8289 60742 230667 201554 145624 298622 408918 227731 20509
13872 20509 -53867 -93745 -67376 -73126 -91785 -15052 -92653 -48658 64907 145660 139202 4194
13860 4194 38724 201146 241947 313726 355098 207694 37175 54281 144418 147293 252418
13849 252418 333526 206698 20835 149299 199443 260561 222494 205317 222349 215617 235630
13838 235630 262589 266270 179835 263229 247782 240096 147790 60925 75800 148583 330527 417514
13826 417514 404394 408585 446766 362429 362092 270206 194639 108461 240489 274157 329758 273479
13814B73479p1623J32765L1765J8281L3930o8686j07729q3557k7594m8379O5445
13803A48097N8814p8845o383M0077p8402o4897M1619L0235o6873K18539J43j31375
13791A10749l6924r689J6073K509k4697p5687K3977L3848J30337M3002m986L4617
13779B43129n2206j54703q5211J40819Q991M4224J55312K7533l1327O9462j9246
13768C46777k35459q5967N9583O1386J04161J2890p1334L5753m787j45315K1213
13757I8901K3476O5801J75991J23190p7522o3421o6999q2247j02676O0553Q0727
13746B35774O878Q9932J21950J35102K5271m6178j27571J43631r8227j18432j52908
13735B15222k7992q163o981R9795J2529n456k5266l5057O1326K894j8684k5884
$$ plain form
13814 273479 201856 334621 366386 384667 418597 349911 242182 158625 131031 82652 148097
13803 148097 206911 128066 121683 161760 83358 18461 60080 90315 23442 241981 242124 110749
13791 110749 73825 64136 80209 82718 58021 -17666 6311 40159 170496 213498 208512 243129
13779 243129 190923 36220 -48991 91828 100819 145043 300355 327888 296561 366023 346777
13768 346777 111318 25351 84934 146320 250481 263371 192037 227790 223003 77688 98901
13757 98901 122377 188178 364169 487359 409837 346416 279417 197170 94494 155047 235774
13746 235774 242652 332584 454534 589636 614907 568729 441158 584789 486562 368130 215222
13735 215222 187230 179067 172086 271881 284410 278954 253688 218631 279957 282851 264167 238283
13723B38283r7815k3374k8694j6522J24793J17101N9048J28054j5604p9874j47546
13712B57850l9958J39326K1529n5486Q5647k9776j5637J43344q5233p8120J0709
13701C54195j1031j41030K5202J64941R8472j4811k6380j1023l0965n667n4721
13690C47182j11909J3145M8069q45K7014J65031q774L4860Q6092J5451Q367K1588
13678F45271n5302j29718p5057n449j42029r6726J40073N6395l1700K00214J4425
13667E20397j83265j56274L3561P3197q9081q636L5865r594R2534Q0317l1368
13656C57653P4283L1343M5682M5577n1596p6448J9347M7288o26Q012k5985M1061
13644E15591J7647j9307j08350m3127r6457j958J16887N5651p3315J04480R170
$$ plain form
13723 238283 140468 117094 88400 71878 196671 313772 372820 500874 485270 405396 257850
13712 257850 217892 357218 378747 323261 408908 379132 363495 506839 421606 343486 354195
13701 354195 343164 202134 227336 392277 490749 475938 449558 438535 407570 401903 347182
13690 347182 235273 248418 296487 295642 322656 487687 478913 513773 599865 615316 623683 645271
13678 645271 589969 460251 385194 379745 237716 140990 281063 337458 305758 505972 520397
13667 520397 337132 180858 214419 287616 198535 189899 225764 216170 308704 389021 357653
13656 357653 431936 463279 508961 554538 502942 426494 445841 493129 492503 500515 474530 515591
13644 515591 533238 513931 405581 362454 265997 264039 380926 436577 363262 467742 476912
13633D76912l1907l3608p3304P3111J26182N7598l5040o9708r1792j12206m6121
13622B40117k5906o740n7164l6183l2529k2401J02666M9122K5052J35494n0166
13611C21362p6115M7786R2744Q0817p864L2027j04011m0594L1211l778r9147J4925
13599B89363J04971Q0695m8025k64316j03473Q0330Q2743Q4773l030r7236K6234
13588B33029P3779k7519N3580k3018J2988O1576M3050Q3280o0228p5504n3335
13577C21678q028N160J65996L0012n9382J3625L7828j36572j28827J0682J17731
13566C69903R0957K9176K1156R8814L2218p3903j37132n9928O6107r3335j23539
13555B20494M708O0020j00119q4141J16714J14598m3075j8109K2830L2937J39209
$$ plain form
13633 476912 445005 411397 338093 411204 537386 594984 559944 490236 398444 286238 240117
13622 240117 214211 207471 150307 114124 81595 59194 161860 210982 236034 371528 321362
13611 321362 245247 293033 385777 466594 458730 490757 386746 346152 377363 373585 274438 289363
13599 289363 394334 475029 427004 162688 59215 139545 222288 307061 304031 206795 233029
13588 233029 306808 279289 332869 309851 322839 384415 427465 510745 450517 375013 321678
13577 321678 313650 318810 484806 514818 455436 469061 506889 370317 241490 252172 369903
13566 369903 460860 490036 511192 610006 642224 568321 431189 371261 437368 344033 220494
13555 220494 225202 285222 185103 100962 217676 332274 289199 271090 293920 326857 466066
13544D66066J87103J6504p2083j12015R2417j27574J1676K6097j7865q9173j5050
13533C66103J94877Q1559N4232q4268n1127l5765l1354j14582j9779J08070J68358
13522F36324j14685o9097K588N3688j8752N4188R778M9793j28821o5927q2594
13511C26483K5455K46811j3824j03926r9483K4183J64355K6174K1034p2925j65526
13500C78811j1224K00730J42652o8582l5176J7147q036q6471J90831j479j14962
13489F04241M2468K7533N8522n6389k16912q7517M9266n8868J14023n2483P2103
13478D95987P4934R3220j4358l590K4208j6808J31851k0343j16273J3436q2490
13467E79774o1509R4929L8168l0059k7382j1688P4426k6690k2976M9051J75974
$$ plain form
13544 466066 653169 669673 597590 485575 577992 450418 462094 488191 470326 381153 366103
13533 366103 560980 642539 696771 612503 561376 525611 494257 379675 359896 467966 636324
13522 636324 521639 452542 455130 508818 490066 544254 554032 603825 475004 409077 326483
13511 326483 351938 598749 584925 480999 381516 405699 570054 596228 617262 544337 378811
13500 378811 367587 568317 710969 642387 607211 624358 616322 529851 720682 719203 604241
13489 604241 646709 674242 732764 676375 459463 371946 421212 362344 476367 423884 495987
13478 495987 570921 664141 649783 646193 670401 653593 785444 765101 648828 662264 579774
13467 579774 518265 613194 651362 621303 593921 582233 656659 629969 606993 656044 832018
13456H32018o494m2975J4947P9472j33839j64858M6990n0375o7823j44557P987
13445C70493J72566q809K3700J1546j6230J1510J15433N4209m6597k0160k1836
13434F45825N3944o4288j37633K3790N1646R5900Q6714K8388l4768P631K7192
13423G84341n3715o0815N4268O4540k1803j49545j7211N0754M5806M432Q73K2005
13411G23930Q7113J1936p4634l4320Q8285J13003o1958j1312j35685j08814Q9617
13400F87161L2386J8427J34726Q0157o9251n1595j39068j2478R1300N0740n1702
13389G70803n7641j9232N8785P0323p0712j04250R5782R4034L5189k2355n5844
13378G94882M9383p6333O0419K7968j46489J9347K4516J52995R9959j04331j61525
$$ plain form
13456 832018 825524 782549 797496 876968 743129 578271 625261 574886 507063 362506 370493
13445 370493 543059 534250 557950 569496 553266 564776 680209 734418 687821 667661 645825
13434 645825 699769 635481 497848 521638 573284 669184 755898 784286 749518 757149 784341
13423 784341 730626 669811 724079 788619 766816 617271 600060 650814 696620 701052 701925 723930
13411 723930 811043 822979 748345 714025 802310 915313 853355 842043 706358 597544 687161
13400 687161 719547 737974 872700 952857 883606 832011 692943 680465 771765 822505 770803
13389 770803 713162 693930 752715 823038 752326 648076 743858 837892 873081 850726 794882
13378 794882 844265 767932 828351 856319 709830 729177 753693 906688 1006647 902316 740791
13367G40791L1809J81754n6686j14218j0416K48778J29986n8593q3496q0864R4315
13356A023160J98925J03269n2545r6687m0764J9943n0392o3552R496L8691L6458
13345A126002Q0629P784j3180n1396P2532J37139N4668p2128k7199L4679n7024
13334A292506j21778O3482J05896L285j2453O0928J82571O2456q2192P6860q5701
13323A545860j64108j6309L7549n5176M255J26340M3219p0743j23592j50982J5368
13312A191681O2495M9123o709P7287P8013l7770n9626o3107M9780R365J7021J56844
13300A524397K3277O5378j2330M8962k6169N4287O7880J68993L1642l8357j1185
13289A896775p5608k25280N0358Q2953j6267m9776J50048J47596N4041R8901N1579
$$ plain form
13367 740791 772600 954354 897668 783450 773034 1021812 1151798 1093205 1009709 928845 1023160
13356 1023160 1222085 1325354 1272809 1176122 1135358 1155301 1104909 1041357 1050853 1089544 1126002
13345 1126002 1206631 1214415 1201235 1149839 1222371 1359510 1414178 1342050 1314851 1349530 1292506
13334 1292506 1170728 1234210 1340106 1343391 1330938 1391866 1574437 1636893 1554701 1631561 1545860
13323 1545860 1381752 1365443 1402992 1347816 1352071 1478411 1521630 1450887 1327295 1176313 1191681
13312 1191681 1254176 1303299 1296590 1373877 1451890 1414120 1354494 1291387 1341167 1350532 1367553 1524397
13300 1524397 1547674 1613052 1600722 1649684 1623515 1677802 1745682 1914675 1946317 1907960 1896775
13289 1896775 1821167 1595887 1646245 1729198 1712931 1663155 1813203 1960799 2014840 2113741 2165320
13278B165320Q0345k8256p0943j27168m1592m5733k8693l276J6935P1603o0038
13267A928504J04875m9829N5170O0445k0006O1145Q5525R4381j14512J4097m2216
13256B177579r2169O257o2015q856J55786N497O4492J6119m3734Q9361J46225
13245B454542J2594l6274M7750K8741l0698K4875Q2884m2488P3647J92724N6189
13234B864486j52019j01776N1089l5829p4103K5802k0216m9257O2081L9174j6094
13223B593338R6621M166R451K00625Q5627L1436N7356K12367J53980L7904o8534
13212C414337k121J8418r6823k7617O0419l0712n0635P2685J9430J08663M7231
13201C533275n6379k3006J26939K04035J00404N1768J43895K6360j8344l9095
$$ plain form
13278 2165320 2245665 2217409 2146466 2019298 1977706 1931973 1903280 1900004 1916939 1988542 1928504
13267 1928504 2033379 1983550 2038720 2099165 2079159 2140304 2225829 2320210 2205698 2219795 2177579
13256 2177579 2085410 2091667 2029652 2020796 2176582 2182079 2246571 2262690 2218956 2308317 2454542
13245 2454542 2467136 2430862 2478612 2507353 2476655 2501530 2584414 2541926 2615573 2808297 2864486
13234 2864486 2712467 2610691 2661780 2625951 2551848 2577650 2557434 2508177 2570258 2609432 2593338
13223 2593338 2689959 2694125 2703576 2904201 2989828 3021264 3078620 3290987 3444967 3482871 3414337
13212 3414337 3412216 3430634 3333811 3306194 3366613 3335901 3285266 3357951 3377381 3486044 3533275
13201 3533275 3476896 3453890 3580829 3784864 3885268 3937036 4080931 4107291 4088947 4049852
13191D049852L6060k0179R5139N5535K4659J57321R6879l8630L8195n9698Q7207
13180D522340J91486J44532j04223j27068J6778K19363K78406R5722n4827p2271
13170E110238P1521J57798K7569M4751J57481J16823R9177n030J51816J90189
13160F122333K3793r3596l64R708J59980J36421R0115K90647J22690l8980p935
13149F814812j1853m132K31009K15615K26891N4755K05189J90695K23614J54727
13139H301322Q1262O7879j9038k0671J98948J39349K39898M18380K72809J41597
13129I821735j9676r5856J55571K30378L00681L79357J59418N7176Q4922K29486
13119A1303192L87218K58689J03207J9609M81181M56040M23685J88947K13848
$$ plain form
13191 4049852 4085912 4065733 4160872 4216407 4241066 4398387 4495266 4456636 4494831 4435133 4522340
13180 4522340 4713826 4858358 4754135 4627067 4643845 4863208 5141614 5237336 5182509 5110238
13170 5110238 5181759 5339557 5367126 5411877 5569358 5686181 5785358 5780328 5932144 6122333
13160 6122333 6146126 6052530 6052166 6061874 6221854 6358275 6448390 6739037 6861727 6822747 6814812
13149 6814812 6802959 6798827 7029836 7245451 7472342 7527097 7732286 7922981 8146595 8301322
13139 8301322 8382584 8450463 8431425 8410754 8609702 8749051 8988949 9407329 9680138 9821735
13129 9821735 9802059 9706203 9861774 10092152 10392833 10772190 10931608 10988784 11073706 11303192
13119 11303192 11690410 11949099 12052306 12071915 12553096 13009136 13432821 13621768 13835616
13110A3835616J66290L06444L71494K50084K50324L10703K76876J77011K04230
13101A6149072L85960L11994L44840M42195K61008K81445L16841M14805K96854
13092A9205014L95042L68201K07246K26155L41141M65610L85515M06459L21173
13083B2321556K87121K88661M45409M30807M02352N41794M68929M87681M48365
13074B6122675L67487L81474L40202N46869K99878L28012M03722K79940L14296
13065B9384555L92599M69260L44885L64249N02653L85598L44634L24848K92470
13056C2805751L73587N40252M28104L52524L95189M82225M57327J84035K25148
13047C6244142L12152L80622K01362J34979J65798K55034K94888K61284J32469
$$ plain form
13110 13835616 14001906 14308350 14679844 14929928 15180252 15490955 15767831 15944842 16149072
13101 16149072 16535032 16847026 17191866 17634061 17895069 18176514 18493355 18908160 19205014
13092 19205014 19600056 19968257 20175503 20401658 20742799 21208409 21593924 22000383 22321556
13083 22321556 22608677 22897338 23342747 23773554 24175906 24717700 25186629 25674310 26122675
13074 26122675 26490162 26871636 27211838 27758707 28058585 28386597 28790319 29070259 29384555
13065 29384555 29777154 30246414 30591299 30955548 31458201 31843799 32188433 32513281 32805751
13056 32805751 33179338 33719590 34147694 34500218 34895407 35377632 35834959 36018994 36244142
13047 36244142 36556294 36936916 37138278 37273257 37439055 37694089 37988977 38250261 38382730
13038C8382730Q9661J52462J75983P5708J71179J52010J17674Q9718J45555J17089
13028C9669769J60858R4099K3513J44720p6082j06576j69490M2949R3045M0522
13018C9917327j21269j53144l2401p0668j8032j93944m2691j58618j30991l23041
13008C8672528l39106k80861j69298j90261k93643k99783k83302k80611k41568
12999C6294095k36782m84468l13180l09913m17398l69857l95048k55232l58945
12990C3153272k12705m56977n03294k22641k33341k30577l79937n14422m78381
12981B9920997m98350n31394l07458k17638l73674n31117n53683m24591l83905
12972B6099187k81925k26483m35638l63664l78574l99804m86311m02486l52777
$$ plain form
13038 38382730 38472391 38624853 38800836 38876544 39047723 39199733 39317407 39407125 39552680 39669769
13028 39669769 39830627 39924726 39948239 40092959 40016877 39910301 39740811 39783760 39876805 39917327
13018 39917327 39796058 39642914 39610513 39539845 39521813 39327869 39285178 39126560 38995569 38672528
13008 38672528 38333422 38052561 37883263 37693002 37399359 37099576 36816274 36535663 36294095
12999 36294095 36057313 35572845 35259665 34949752 34532354 34162497 33767449 33512217 33153272
12990 33153272 32940567 32483590 31980296 31757655 31524314 31293737 30913800 30399378 29920997
12981 29920997 29422647 28891253 28583795 28366157 27992483 27461366 26907683 26483092 26099187
12972 26099187 25817262 25590779 25155141 24791477 24412903 24013099 23526788 23124302 22771525
12963B2771525k76772k94586m14814k54334k70639m18293m73186l80813k32054
12954A9756034k90462m41869m92277l83989k29461k33113l10357l19833l49381
12945A6705292j23872k28506k12291l17794l95101l58310k77083j06181k49913
12936A4436241j05267j31574j83157k4528j36065l79723m14396m22187l19208
12927A2320136k90433k38975k17227j12235j25461j36436k50614k93206k54602
12918A0400947m2686m5862j57691j28790k09350k17542l7999k25353l20192l24370
12908H691112j54598O568R3808j53794k91463q9937m8344j38496j12893K6041
12898G828004j48544o0251l4014j40685j92814q9915l680j35741j20385j0832
$$ plain form
12963 22771525 22494753 22200167 21785353 21531019 21260380 20842087 20368901 19988088 19756034
12954 19756034 19465572 19023703 18531426 18147437 17917976 17684863 17374506 17054673 16705292
12945 16705292 16581420 16352914 16140623 15822829 15427728 15069418 14792335 14686154 14436241
12936 14436241 14330974 14199400 14016243 13991715 13855650 13475927 13061531 12639344 12320136
12927 12320136 12029703 11790728 11573501 11461266 11335805 11199369 10948755 10655549 10400947
12918 10400947 10358261 10312399 10154708 10025918 9816568 9599026 9561027 9335674 9015482 8691112
12908 8691112 8536514 8543082 8636890 8483096 8191633 8101696 8053352 7914856 7801963 7828004
12898 7828004 7679460 7619209 7585195 7444510 7251696 7161781 7158101 7022360 6901975 6891143
12888F891143K7692p4790p6880r6656j75967j45213n7985j42803j91196j96258
12878E761087j0346m0749q8768j48416n4146n4844M0860N0268l6353j25305l0356
12867E262932p2563M932j72226j13788N2328J70184K4035k67044j33305j22224
12857D633261r5054J02978l4765k3537j88470q7920o0465n9094R8296O1604m6625
12846D300209n8283j9826j28402j36075J187O2706j02859p2252n3003O0121Q697
12835C862220j29631J6938j59254j2474L3713q835r7987q2216K2649K44571L2115
12824C721809j13285j12961m8108r7302j6803J86155j21389p3598l1990N2510
12814C345038R495Q885l4259q7582m1576J92078J93230Q068K53j59820n4833q3299
$$ plain form
12888 6891143 6918835 6844045 6767165 6670509 6494542 6349329 6291344 6148541 5957345 5761087
12878 5761087 5750741 5709992 5621224 5472808 5418662 5363818 5404678 5454946 5418593 5293288 5262932
12867 5262932 5190369 5195301 5023075 4909287 4961615 5131799 5155834 4888790 4755485 4633261
12857 4633261 4538207 4641185 4606420 4582883 4394413 4306493 4246028 4186934 4285230 4346834 4300209
12846 4300209 4241926 4222100 4093698 3957623 3958810 4021516 3918657 3846405 3793402 3853523 3862220
12835 3862220 3732589 3749527 3590273 3577799 3611512 3602677 3504690 3422474 3445123 3689694 3721809
12824 3721809 3608524 3495563 3447455 3350153 3333350 3519505 3398116 3324518 3292528 3345038
12814 3345038 3354533 3363418 3329159 3241577 3200001 3392079 3585309 3593377 3593630 3433810 3378977 3295678
12802C295678j82754j28333J2922m0839L6229p4524j41167j1806r701O6539J31643
12791B953887Q5594J27380J48226P1903m0019K0054Q5613J4639j05134j05878
12781C256265j33826r0969j71683n2645K19937n9378j48257q9225j23698p6102
12771B530419O9651J3687m6237j6386K9969J39342R5856O4895Q5142j40538k66166
12760B559634j82252P5325m7618j43494Q1871N5998J5400N8155q4176p0821R6869
12749B414891M8642n1884j22116j51111j58191j12955J47565J25289M0198q263
12739B172065P9063l0047r4532l1333P0972O6590j16680K5995J31408m194j43848
12728B125459P4110K6896j85590K2430N1258j33562q4124O687k1472n087O5410
$$ plain form
12802 3295678 3112924 2984591 2997513 2956674 2992903 2918379 2777212 2765406 2755705 2822244 2953887
12791 2953887 3039481 3166861 3315087 3386990 3346971 3367025 3452638 3467277 3362143 3256265
12781 3256265 3122439 3031470 2859787 2807142 3027079 2967701 2819444 2730219 2606521 2530419
12771 2530419 2600070 2613757 2567520 2551134 2581103 2720445 2816301 2881196 2966338 2825800 2559634
12760 2559634 2377382 2452707 2405089 2261595 2343466 2399464 2414864 2473019 2388843 2318022 2414891
12749 2414891 2463533 2411649 2289533 2138422 1980231 1867276 2014841 2140130 2180328 2172065
12739 2172065 2251128 2221081 2126549 2095216 2166188 2232778 2116098 2142093 2273501 2269307 2125459
12728 2125459 2199569 2226465 2040875 2063305 2114563 1981001 1896877 1903564 1882092 1877005 1942415
12717A942415O8911M4489L9135r5988o2981j22213p80j527J06348n1040n8643
12706A808126j3305Q8244j9108j7181P8991l6681n3497M5439o5146n0174r7604
12695A668104j02074j07095p8422J44571J35335R7119L5500n811n3529p9417l9167
12684A615114k4722J51316p3778p7748K9107p30p6731j65709K0761J04300J01260
12673A602440Q1255M1545j22822M1962n0971j03761j26010L1571k0725n1059J8049
12662A341474N8333q8137R8694n9891n2708J9271M7534R7271N7536o8460j54864
12651A296053j6743M1794k9735o1534J72598l2756m6229p4872m1496K5284K5755
12640A258119Q8266k7792m2565m3214N5485K3460O7371k3857J28587P691l00O8483
$$ plain form
12717 1942415 2011326 2055815 2094950 1998962 1935981 1813768 1812988 1811461 1917809 1866769 1808126
12706 1808126 1794821 1883065 1863957 1846776 1925767 1889086 1835589 1881028 1815882 1765708 1668104
12695 1668104 1566030 1458935 1380513 1525084 1660419 1757538 1793038 1787227 1733698 1654281 1615114
12684 1615114 1590392 1741708 1667930 1590182 1619289 1618559 1541828 1376119 1396880 1501180 1602440
12673 1602440 1683695 1725240 1602418 1644380 1593409 1489648 1363638 1395209 1374484 1323425 1341474
12662 1341474 1399807 1311670 1410364 1350473 1297765 1317036 1364570 1461841 1519377 1450917 1296053
12651 1296053 1279310 1321104 1291369 1229835 1402433 1369677 1323448 1248576 1207080 1232364 1258119
12640 1258119 1346385 1318593 1276028 1232814 1288299 1311759 1379130 1355273 1483860 1491551 1491251 1559734
12628A559734r6277k6059o6270m3525P9662Q4327K1743m5956O6958O0912N6714
12617A651963j20804j20607n5260j0352N7045R2336J5205j04284L9875j29187
12607A315930q412R766q0725m978J78985O9262o6787L781K2833p4498L847m7686
12595A321318J43907n1284n9741Q6323Q9681l7049j7733L1986j3483K1350l9374
12584A475901k28396p7961J65613J18160n544r7966o3195j60909j76294k8043
12574I21366M7991K35019L240p6871J56972O0939q1004j22162l0855J86712P9003
12563A380350l3788J13408J8145j13750K6528N7789M6109q7750j28461J3123m0743
12552A250960P6800l406j9347p3773L6306m885n6276j9079q3776k5173R1088N8707
$$ plain form
12628 1559734 1463457 1437398 1371128 1327603 1407265 1491592 1513335 1467379 1534337 1595249 1651963
12617 1651963 1531159 1410552 1355292 1344940 1401985 1494321 1509526 1405242 1445117 1315930
12607 1315930 1307518 1317284 1236559 1231581 1410566 1479828 1413041 1416822 1439655 1365157 1369004 1321318
12595 1321318 1465225 1413941 1354200 1440523 1530204 1493155 1475422 1507408 1493925 1515275 1475901
12584 1475901 1247505 1169544 1335157 1453317 1447773 1349807 1286612 1125703 949409 921366
12574 921366 969357 1204376 1207616 1130745 1287717 1348656 1267652 1145490 1114635 1301347 1380350
12563 1380350 1346562 1459970 1478115 1364365 1390893 1448682 1494791 1407041 1278580 1291703 1250960
12552 1250960 1327760 1324354 1305007 1231234 1267540 1262655 1206379 1187300 1103524 1078351 1169439 1228146
12540A228146K0862M800j77560j50713J69421J24669l4088J31639p7819q4342
12530A155015P1113O0353K4938n3329q2861j81684m3318m7176J8845J44016J01720
12519A167632j5906j01794J8558Q1170J58978O8772Q4333j06546P993J2503j30070
12508A245623K6185N564M2976l3915L5958J56471j29698j95152J10004Q3368j6199
12497A331185j05292m8560J4050O2583L7222n2402j08646q7813P6718Q3322j57630
12486A044737j9588J48354o746J1679M5300R1497O5218p2464p4509p4272j16321
12475A042885R5873P427o8042m7644N6540J25955n5301J4795O8097J4467J20315
12464A375367Q4479K2374p6129j43536r1297Q6809p5711m7800O2811l0029J41801
$$ plain form
12540 1228146 1249008 1253808 1076248 925535 1094956 1219625 1185537 1317176 1239357 1155015
12530 1155015 1226128 1286481 1311419 1258090 1175229 993545 950227 903051 921896 1065912 1167632
12519 1167632 1151726 1049932 1068490 1149660 1308638 1377410 1461743 1355197 1363190 1375693 1245623
12508 1245623 1271808 1277372 1320348 1286433 1322391 1478862 1349164 1154012 1264016 1347384 1331185
12497 1331185 1225893 1177333 1191383 1253966 1291188 1238786 1130140 1042327 1119045 1202367 1044737
12486 1044737 1025149 1173503 1166757 1178436 1223736 1315233 1380451 1307987 1233478 1159206 1042885
12475 1042885 1138758 1146185 1078143 1030499 1087039 1212994 1157693 1172488 1240585 1255052 1375367
12464 1375367 1459846 1482220 1406091 1262555 1171258 1258067 1182356 1134556 1197367 1167338 1309139
12453A309139k7205r3332q2012N4171R1159J59315l1020n7992j35867K3559J4347
12442A224262N743N4846m5177Q5224m509r5061k00414o1918L5084k2141j9791
12431I56148K85015J19024r9268J1922J4295K8246P0986J47800K6366q4993p0270
12420A405271J20840j35181j35939L2586n133o1658p4346N7208l7754M6447j05969
12409A106372n4967o8376J83700N3139q7185r8776K16663Q7438J9219J2026L639
12398A372892r4616p6767J4850J07194n0856Q8874N3930j22892N2583J7990L9796
12387A402978P6042J5790N5245O013r0112L5270l4748p5768p9160L8413N65j16707
12375A233821j844L0143J37157N3042O6486n8236j80035j28383k0262K8142K5770
$$ plain form
12453 1309139 1281934 1188602 1106590 1160761 1251920 1411235 1380215 1322223 1186356 1209915 1224262
12442 1224262 1230005 1284851 1239674 1324898 1320389 1225328 1024914 962996 998080 975939 956148
12431 956148 1241163 1360187 1260919 1272841 1287136 1315382 1386368 1534168 1560534 1475541 1405271
12420 1405271 1526111 1390930 1254991 1287577 1282444 1220786 1146440 1203648 1165894 1212341 1106372
12409 1106372 1051405 983029 1166729 1219868 1132683 1033907 1250570 1338008 1357227 1369253 1372892
12398 1372892 1278276 1201509 1216359 1323553 1272697 1361571 1415501 1292609 1345192 1363182 1402978
12387 1402978 1479020 1494810 1550055 1556068 1465956 1501226 1466478 1390710 1311550 1349963 1350528 1233821
12375 1233821 1231977 1262120 1399277 1452319 1518805 1460569 1280534 1152151 1131889 1160031 1185801
12364A185801L4770K04823J34282L2237p648R1562n7744q4194J6696r1933Q507
12353A467159J446J1138M5729J04261q3380n1848n6770j33760m136R1051R5627
12342A486517j13580O8058R1849P664K1794Q3375j05386n5298M5548N3596J0755
12331A594892j30679J47309J01845m3865n6917M1664J41482J13134M4342J3852
12321A967059o2370p1403J1990p3202q5396o5250l441J43529J08772r0047j01619
12310A678622J3438l4139n096R2416j4793j3029p6920L6399J15045K20441Q7529
12299B099913q9764r05l0105j22208R3254M4002J1445m8010o187l9510q6177j29185
12287A696563j39824P9102J77957J55457O3727j69931j825J38375O9190o3545
$$ plain form
12364 1185801 1220571 1425394 1559676 1591913 1584265 1675827 1618083 1533889 1550585 1458652 1467159
12353 1467159 1468605 1479743 1525472 1629733 1546353 1494505 1437735 1303975 1299839 1390890 1486517
12342 1486517 1372937 1440995 1532844 1540508 1562302 1645677 1540291 1484993 1530541 1584137 1594892
12331 1594892 1464213 1611522 1713367 1669502 1612585 1654249 1795731 1908865 1953207 1967059
12321 1967059 1904689 1833286 1845276 1772074 1686678 1621428 1617987 1761516 1870288 1780241 1678622
12310 1678622 1692060 1657921 1652825 1745241 1730448 1717419 1640499 1676898 1791943 2012384 2099913
12299 2099913 2010149 2009244 1979139 1856931 1950185 1994187 2005632 1957622 1951435 1911925 1825748 1696563
12287 1696563 1556739 1635841 1813798 1969255 2032982 1863051 1861226 1999601 2068791 2005246
12277B005246k8528j13609M3170n874M223Q8420r365P385K0488N1650P39r8553
12265A965392o2704k9660K1338K5375R1972P9078r9645o879M5958j74J11538R4826
12253B236415n4292J0406k9446n4584P8686M3828k1182J15757l919l036r3965
12242B224668p6751k1920J29803K2844j8811L2865r3434k5047L6183Q7202K5326
12231B322928M3437K2746q8037j97984J3666O7994l2214P7701J22744j0023K5759
12220B368717J05930j0523j16413j84603q4371R1704K7044J29355J32137j6311
12210B442666j2347r572q6382l662J33164K2378Q013N7170q1629q829Q8495K11396
12198B760861J27732q0427j04419j55877K0464P278L6662Q2825K38618J33990
$$ plain form
12277 2005246 1976718 1863109 1906279 1900405 1904628 1993048 1983683 1991068 2011556 2063206 2063945 1965392
12265 1965392 1902688 1873028 1894366 1919741 2011713 2090791 1991146 1984267 2030225 2030051 2141589 2236415
12253 2236415 2182123 2192529 2163083 2108499 2187185 2231013 2209831 2325588 2321669 2318633 2224668
12242 2224668 2147917 2125997 2255800 2278644 2259833 2292698 2199264 2174217 2210400 2297602 2322928
12231 2322928 2366365 2389111 2301074 2103090 2116756 2184750 2152536 2230237 2352981 2342958 2368717
12220 2368717 2474647 2464124 2347711 2163108 2078737 2170441 2197485 2326840 2458977 2442666
12210 2442666 2430319 2420747 2334365 2330703 2463867 2486245 2494258 2551428 2469799 2460970 2549465 2760861
12198 2760861 2888593 2808166 2703747 2547870 2568334 2575612 2612274 2695099 2933717 3067707
12188C067707j3770j61743q3406j31505M6181O0257l3298R2575l1512l6951J30343
12177B904878N8818J04030m8941r122k6580j2117n3356L5535J83110J03226l6304
12166C203177r2011o280J36424K9776O5433J05863R949L5359J6966j60952L5999
12155C379703N6853n226K4448J2475j33004L5739j1193K19797Q8969l277J36242
12144C801526Q0449r2549r336P9187O0029l4017n8707n5526M5352j01203j10423
12133C604782j8966J94132Q4536Q6580J6684l7714q6639J24032J13053K9695m7538
12122D062637N1098K02510Q4500n9502n5316O6828R4549J14820J21736M5844q747
12111D720957R795k1239J7423L9529R2552q2449L0174J62377J7730j3057r4591
$$ plain form
12188 3067707 3053937 2892194 2808788 2677283 2723464 2783721 2750423 2842998 2811486 2774535 2904878
12177 2904878 2963696 3067726 3018785 3009663 2983083 2970966 2917610 2953145 3136255 3239481 3203177
12166 3203177 3111166 3104886 3241310 3271086 3336519 3442382 3452331 3487690 3504656 3343704 3379703
12155 3379703 3436556 3431330 3455778 3468253 3335249 3370988 3359795 3579592 3668561 3665284 3801526
12144 3801526 3881975 3789426 3780090 3859277 3919306 3885289 3826582 3771056 3816408 3715205 3604782
12133 3604782 3585816 3779948 3864484 3951064 3967748 3930034 3843395 3967427 4080480 4110175 4062637
12122 4062637 4113735 4316245 4400745 4341243 4285927 4352755 4447304 4562124 4683860 4729704 4720957
12111 4720957 4730752 4709513 4726936 4766465 4859017 4776568 4806742 4969119 4986849 4973792 4879201
12100D879201P5470l788R773J16119P9530R1598k6968o1874k0798q1214N0873
12089E107922J22334o0011K04610P3320o1804l3681J54071R3501J7675K756P0584
12078E691277M8690Q9818J74335O9384J84817k1939j49673o1819O451n956P7267
12067F102652P2151L5048r5862J10554J04402R6008J27891N5936Q2314J25635
12057F816729R918P0357P271j0320M633J0481M4425P132R2884N08N8080J87380
12045G299478J25090J03238K29659j9066l342P8868N1583P3409Q9201K631R6466
12034H127215P4221J19963K12126K32094L384j466O9351J18350O553N0472m9447
12023H962816P538J54105K54326R9854J73431J1093o7775M1770K18425Q4842M9406
$$ plain form
12100 4879201 4954671 4950883 4960656 5076775 5156305 5247903 5220935 5159061 5138263 5057049 5107922
12089 5107922 5230256 5170245 5374855 5448175 5386371 5352690 5506761 5600262 5617937 5620693 5691277
12078 5691277 5739967 5829785 6004120 6073504 6258321 6236382 6086709 6024890 6031341 6025385 6102652
12067 6102652 6174803 6209851 6113989 6224543 6328945 6424953 6552844 6608780 6691094 6816729
12057 6816729 6826647 6897004 6904275 6893955 6898588 6909069 6953494 6960626 7053510 7054018 7112098 7299478
12045 7299478 7424568 7527806 7757465 7738399 7735057 7813925 7865508 7938917 8028118 8030749 8127215
12034 8127215 8201436 8321399 8533525 8765619 8769003 8767537 8836888 8955238 8961791 9012263 8962816
12023 8962816 8970354 9124459 9378785 9478639 9652070 9663163 9595388 9637158 9855583 9940425 9989831
12012I989831J92908N9886J30845R8812O7822J62826J74727j0294N3611J916K48558
12001A1171448K27143K50594J40956N4247p773K59744J20887J33285P9651K00404
11991A2630586K36604J99808N8684J70821Q9838J34898J43321Q8993J86879J86044
11981A4126476K45125K21700J21412J04214O4493L09664K88005R4873K39052J14851
11971A5929865J60749K52988K10885K60203L76680K50076K24442L64633L32277
11962A8362798K19397J95256K95132J19172J84573K63318L17530K81608L21671
11953B0560455L36066L59506K25404K33681L64605M00713M57535L18501L56394
11944B3612860L48572K37150L24792L60858N30674M40898M45856K93684M79542
$$ plain form
12012 9989831 10182739 10242625 10373470 10472282 10540104 10702930 10877657 10867363 10920974 10922890 11171448
12001 11171448 11398591 11649185 11790141 11844388 11836615 12096359 12217246 12350531 12430182 12630586
11991 12630586 12867190 13066998 13125682 13296503 13386341 13521239 13664560 13753553 13940432 14126476
11981 14126476 14371601 14593301 14714713 14818927 14883420 15193084 15481089 15575962 15815014 15929865
11971 15929865 16090614 16343602 16554487 16814690 17191370 17441446 17665888 18030521 18362798
11962 18362798 18582195 18777451 19072583 19191755 19376328 19639646 19957176 20238784 20560455
11953 20560455 20896521 21256027 21481431 21715112 22079717 22480430 22937965 23256466 23612860
11944 23612860 23961432 24198582 24523374 24884232 25414906 25855804 26301660 26595344 27074886
11935B7074886N54450N73235L67670K14389M47616N66705M78141M80459N26835
11926C1284386O64801N89963N77479N08963N20708N26754N24367P19883N33266
11917C6450570N58486O51348O74264P28134O58715N82246O44867P31680R16118
11908D2596428P48638P75171P49876P47617P07132P70888Q04126Q83527Q18887
11899D9602290P14785P85704Q05935Q73804R36783Q10729P51326P85932R55775
11890E7023063J103294J102361R62336P41776R02960R71532R62630R26347Q90981
11881F5587280R43582J020256R52519R75232Q18682Q07853Q36748Q35185Q70022
11872G3647359P85402O19139P66891O31707O24029Q09539O48838N69140O13522
$$ plain form
11935 27074886 27629336 28202571 28570241 28784630 29232246 29798951 30277092 30757551 31284386
11926 31284386 31949187 32539150 33116629 33625592 34146300 34673054 35197421 35917304 36450570
11917 36450570 37009056 37660404 38334668 39062802 39721517 40303763 40948630 41680310 42596428
11908 42596428 43345066 44120237 44870113 45617730 46324862 47095750 47899876 48783403 49602290
11899 49602290 50317075 51102779 51908714 52782518 53719301 54530030 55281356 56067288 57023063
11890 57023063 58126357 59228718 60191054 60932830 61835790 62807322 63769952 64696299 65587280
11881 65587280 66530862 67551118 68503637 69478869 70297551 71105404 71942152 72777337 73647359
11872 73647359 74432761 75051900 75818791 76450498 77074527 77884066 78532904 79102044 79715566
11863G9715566L89265M16152N28519M77885L55978L91440K79746J64288M8850
11854H2767689J7296o0128J40438l4928j46491k5245o5740k05669l69598k61729
11844H1755895l80318l73292m48638n89992o25790n70663n54290o27869m71865
11835G7113178m06964q77463q35540p71826p69372q27538p94495q91592p57154
11826G0181234q41727q17978q88706j079371r75753r66360q76886q20968r88507
11817F1924978q48497r20745r18938r61161r09100r36120r39020q61309r01426
11808E3728662q73041o92781p58420q44401q79748p19407p63469r28636q06707
11799D6462052p55399p51086q53109q63225p27531p35995p73710o25408n37233
$$ plain form
11863 79715566 80104831 80520983 81049502 81527387 81883365 82274805 82554551 82718839 82767689
11854 82767689 82784985 82724857 82865295 82830367 82683876 82658631 82592891 82387222 82017624 81755895
11844 81755895 81375577 81002285 80553647 79963655 79337865 78767202 78212912 77585043 77113178
11835 77113178 76706214 75828751 74993211 74221385 73452013 72624475 71829980 70938388 70181234
11826 70181234 69339507 68521529 67632823 66553452 65577699 64611339 63734453 62913485 61924978
11817 61924978 61076481 60155736 59236798 58275637 57366537 56430417 55491397 54630088 53728662
11808 53728662 52855621 52162840 51404420 50560019 49680271 48960864 48197395 47268759 46462052
11799 46462052 45706653 44955567 44102458 43239233 42511702 41775707 41001997 40376589 39839356
11790C9839356n31589o27306o24186o23287o52903p38924m61952n49600n96945
11781C4432664o42410o28994p12518n74795m96610l51745k32090m65244n34993
11772B9793265l77523n50453m98774n03358n21304m23399n04246m98058l22246
11763B5593904l33415m17165k97067l82991l94963k56292l68901l75922k51732
11754B2515456k38272k96188m88733m21977k16292l08427k33217l63013l09662
11745A9639675k50956k38505k68310k83222l35862l31654j66623j74664j87023
11736A7402856k08559l16575k95239M0579L3256k78775l75838k28538l67995l49113
11726A5056059j40787j27119k69907l7252j63751j77102n8582j69765k04971j29931
$$ plain form
11790 39839356 39307767 38680461 38056275 37432988 36780085 36041161 35579209 35029609 34432664
11781 34432664 33790254 33161260 32448742 31873947 31377337 31025592 30793502 30328258 29793265
11772 29793265 29415742 28865289 28366515 27863157 27341853 26918454 26414208 25916150 25593904
11763 25593904 25260489 24843324 24546257 24163266 23768303 23512011 23143110 22767188 22515456
11754 22515456 22277184 21980996 21492263 21070286 20853994 20545567 20312350 19949337 19639675
11745 19639675 19388719 19150214 18881904 18598682 18262820 17931166 17764543 17589879 17402856
11736 17402856 17194297 16877722 16582483 16623062 16656318 16377543 16001705 15773167 15405172 15056059
11726 15056059 14915272 14788153 14518246 14480994 14317243 14140141 14081559 13911794 13706823 13576892
11716A3576892k55320j58293k39314k36613j35429q4911j10502j01472j51187
11707A2103851k98464k17332j25466m616r6859p8376j90725j28138k69555k04523
11697A0489797k0308j4033j47351j84349p2909j73426l4566p556p2809m3639L4884
11686I753735k41605k53813j23825j0603j36024j19058l099l1502l9906L5757
11676H830057r468Q5393q1506j09593j3186j25376j24713m8115p6904k77196j03423
11665G945970R1318J2277j7894O8111K16561k1539k0413O3068J77852J26098R8351
11654H739760J5888l2911r2144K9419J89224Q3662M480M8779n9643j08480j45687
11643H672347k25961l17188m4141j8269q4595N800N9223K4402k4857j40411j80068
$$ plain form
11716 13576892 13321572 13163279 12923965 12687352 12551923 12467012 12356510 12255038 12103851
11707 12103851 11805387 11588055 11462589 11457973 11361114 11282738 11092013 10963875 10694320 10489797
11697 10489797 10469489 10455456 10308105 10123756 10050847 9877421 9842855 9835299 9762490 9718851 9753735
11686 9753735 9512130 9258317 9134492 9123889 8987865 8868807 8865708 8834206 8794300 8830057
11676 8830057 8820589 8905982 8824476 8714883 8701697 8576321 8451608 8403493 8326589 8049393 7945970
11665 7945970 8037288 8049565 8031671 8099782 8316343 8294804 8274391 8337459 8515311 8641409 8739760
11654 8739760 8755648 8722737 8630593 8660012 8849236 8932898 8937378 8986157 8926514 8818034 8672347
11643 8672347 8446386 8129198 8085057 8066788 7982193 7987993 8047216 8071618 8046761 7906350 7726282
11632G726282m4840L1052k4127j20349j4257P3821K3209Q0819o9943o1343j29734
11621G470590l7829l6169k05836l02840j09813j82549k29714j95968k72940n2456
11611E844476j34222j91160p2065j3299k49510j62060j0626l4654K9127M5571
11601E051578j70785k00404j05833r6867r2647l6967J29618O8823L6801n7449
11591D525868l0945l9424j28854o3932p8412k1551M4545N5954j04443o4425L0685
11580D125066J5974l3104m6836l0129j4345j06835q3005q7642R06m8590q0175
11569C611285j47754J44465K55221R8921j27943n0477j87374k17651k10092k015
11559C166586R0548M4111J06429O3500J0096o8956P4515L5512m1923j33517p9594
$$ plain form
11632 7726282 7681442 7712494 7688367 7568018 7553761 7627582 7650791 7731610 7661667 7600324 7470590
11621 7470590 7432761 7396592 7190756 6887916 6778103 6595554 6365840 6169872 5896932 5844476
11611 5844476 5710254 5519094 5447029 5433730 5184220 5022160 5011534 4976880 5006007 5051578
11601 5051578 4880793 4680389 4574556 4477689 4385042 4348075 4477693 4546516 4583317 4525868
11591 4525868 4494923 4455499 4326645 4262713 4184301 4162750 4207295 4263249 4158806 4094381 4125066
11580 4125066 4141040 4107936 4061100 4030971 4016626 3909791 3826786 3739144 3740050 3691460 3611285
11569 3611285 3463531 3607996 3863217 3962138 3834195 3783718 3596344 3378693 3168601 3166586
11559 3166586 3257134 3301245 3407674 3471174 3481270 3412314 3486829 3522341 3480418 3346901 3267307
11548C267307N994O707o4005m1847M7325o4997n4741l8518N1994j8878J2366k7005
11536C081702p3147o2850K7750J27777o2141N9836j8233J05734k4188m7387j26120
11525B988733J6535J12341m7950j28398K12501O5088p2655r0112j03541O253q2688
11514B876107j30782p0769k537R1907J08151n4159L0675J08479J2037p2193N5436
11503B952352l8954q8290r3273l3938Q2052J4676n7384k5648J3455j48801j32142
11492B444105J55487J07069l9295M7497p7935M3268r3307J5429J09435J3640O7455
11481B792848l4844j24724j02024K4556N0510O3033M3641M9890M7050J21531q3015
11470B848452j56157j38835o4196K5915Q4741M881J50848J08462J2596n2657j05916
$$ plain form
11548 3267307 3273301 3280008 3216003 3174156 3221481 3156484 3101743 3063225 3115219 3096341 3108707 3081702
11536 3081702 3008555 2945705 2973455 3101232 3039091 3098927 3080694 3186428 3162240 3114853 2988733
11525 2988733 3005268 3117609 3069659 2941261 3153762 3218850 3146195 3056083 2952542 2958795 2876107
11514 2876107 2745325 2674556 2672019 2763926 2872077 2817918 2848593 2957072 2969109 2896916 2952352
11503 2952352 2913398 2825108 2731835 2697897 2779949 2794625 2737241 2711593 2725048 2576247 2444105
11492 2444105 2599592 2706661 2667366 2714863 2636928 2680196 2586889 2602318 2711753 2725393 2792848
11481 2792848 2758004 2633280 2531256 2555812 2606322 2669355 2712996 2762886 2809936 2931467 2848452
11470 2848452 2692295 2553460 2489264 2515179 2599920 2604801 2755649 2864111 2876707 2824050 2718134
11459B718134o0609j16820j4106n8712j1039J45984O4961R4473O8352p4869n5369
11448B700380j04768j15404N221J58008J01817P9194j35853k25508j4665l0025
11438B418397j875j44052j05061k043k6569m891N8766R5989K8771j2844n3858
11427B250730r9822p552j6770K6369J0309L8806O2060P6317R7659J23436N4493
11416B616035j3031p6656j103m4670p0731j37675j82255o9681l5961R462K8359
11405B022093J44144J67846J27095j00146r7361L709n5736J6586M7892j5796j0859
11394B249467M3330r2552R9477J39512m415j33295j58249j61178J00710K26648
11384B309455P6691l5391n2044q0351j02861O7741N4374J78229k1253j91729Q6453
$$ plain form
11459 2718134 2657525 2540705 2526599 2467887 2456848 2602832 2667793 2762266 2830618 2755749 2700380
11448 2700380 2595612 2480208 2485429 2643437 2745254 2824448 2688595 2463087 2448422 2418397
11438 2418397 2416522 2272470 2167409 2165366 2138797 2133906 2192672 2288661 2317432 2304588 2250730
11427 2250730 2150908 2143356 2126586 2152955 2163264 2202070 2264130 2340447 2438106 2561542 2616035
11416 2616035 2603004 2526348 2525245 2480575 2409844 2272169 2089914 2020233 1984272 1993734 2022093
11405 2022093 2166237 2334083 2461178 2361032 2263671 2267380 2211644 2228230 2276122 2260326 2249467
11394 2249467 2292797 2200245 2299722 2439234 2434819 2301524 2143275 1982097 2082807 2309455
11384 2309455 2386146 2350755 2298711 2218360 2115499 2183240 2237614 2415843 2394590 2202861 2289314
11373B289314j4174J1878j1569O6457k4733K6850K3007L5343P525K16148P966
11362B634012N2689J35743p1271j47067j0978J44428N7836P1714m8786q7558J7434
11351B748196J57036P1487R3609q4790Q7977O5437k08480m8680N7798P1415J23419
11340C134424j9153j9059L1511N1647R1348O8550L0615p8421J132m324j59879
11329C128391N1671J69277J40493j19299N3102J86449J5403J1165O0238P1060
11319C767950R9127M0556J1873M9792m3483j4796M445J57352J09414J46328J15801
11308D444359J50637N3402J16875O7512q0979r2161o5117k6082J17192R2292n9508
11297D718422k3354J90496J88775J57549J46630J52518J83119J48922N3364K06744
$$ plain form
11373 2289314 2275140 2287018 2275449 2341906 2317173 2344023 2367030 2402373 2409898 2626046 2634012
11362 2634012 2686701 2822444 2751173 2604106 2593128 2737556 2795392 2867106 2818320 2730762 2748196
11351 2748196 2905232 2976719 3070328 2985538 3073515 3138952 2930472 2881792 2939590 3011005 3134424
11340 3134424 3115271 3096212 3127723 3179370 3270718 3339268 3369883 3291462 3292594 3288270 3128391
11329 3128391 3180062 3349339 3489832 3370533 3423635 3610084 3625487 3636652 3696890 3767950
11319 3767950 3867077 3907633 3919506 3969298 3925815 3911019 3915464 4072816 4182230 4328558 4444359
11308 4444359 4594996 4648398 4765273 4832785 4751806 4659645 4594528 4568446 4685638 4777930 4718422
11297 4718422 4695068 4885564 5074339 5231888 5378518 5531036 5714155 5863077 5916441 6123185
11287F123185J18869K56635K15255J22010N8897J62969K39871K49303K91941Q9519
11277G928454K76339J62620J66870K93997L50561M63149K29017L22591M57445
11268A0651043N14142M33415N77579O04966N00566N68127O09749O36630P83001
11259A5879218Q20524P10687Q06095J224504J299402J457632J492797J464493
11251B5155352J715187K046308K174898K248767K630237L041392L517019L922697
11243D6451857M435975M992778N671808O690126P740602Q600997R825677J1467996
11235A05877816J3314938J5305396J7489904K0015858K2621791K5141453K7286571
11228B47053727K9164077L0167355K9927335K8389284K5273762K0846074J5445449
$$ plain form
11287 6123185 6242054 6498689 6713944 6835954 6894851 7057820 7297691 7546994 7838935 7928454
11277 7928454 8204793 8367413 8534283 8828280 9178841 9641990 9871007 10193598 10651043
11268 10651043 11165185 11598600 12176179 12781145 13281711 13849838 14459587 15096217 15879218
11259 15879218 16699742 17410429 18216524 19441028 20740430 22198062 23690859 25155352
11251 25155352 26870539 28916847 31091745 33340512 35970749 39012141 42529160 46451857
11243 46451857 50887832 55880610 61552418 68242544 75983146 84584143 94409820 105877816
11235 105877816 119192754 134498150 151988054 172003912 194625703 219767156 247053727
11228 247053727 276217804 306385159 336312494 364701778 389975540 410821614 426267063
11221D26267063R761324M037883j012277n192261p957371r241776r948798r882793
11213C96830994r078199p715890o263183m750343k909749r33629R74050K752617
11205C68906668M602523O176668P710860Q907787R599960R813853Q991761P353233
11197D32063313M714508Q69254m146956r703241j5475647k0441633k4745187k7604371
11189C35530040k8920693k9168548k8163035k6225408k3961208k1400360j8977058
11182A58713730j6861666j4835715j2869992j1233696r654698q448406p535580
11175G7273977o715051n724774m933108m440745l881137l558134l119140k748361
11167D2153527k426654k322684k160820j943597j742065j591425j506055j373054
$$ plain form
11221 426267063 436028387 440066270 439053993 433861732 425904361 416662585 406713787 396830994
11213 396830994 387752795 380036905 373773722 369023379 366113630 365180001 366154051 368906668
11205 368906668 373509191 379685859 387396719 396304506 405904466 415718319 424710080 432063313
11197 432063313 436777821 437647075 433500119 423796878 408321231 387879598 363134411 335530040
11189 335530040 306609347 277440799 249277764 223052356 199091148 177690788 158713730
11182 158713730 141852064 127016349 114146357 102912661 93257963 84809557 77273977
11175 77273977 70558926 64834152 59901044 55460299 51579162 48021028 44901888 42153527
11167 42153527 39726873 37404189 35243369 33299772 31557707 29966282 28460227 27087173
11159B7087173j415437j289847j195373j062514j048722j016724q94170p77455
11151A8386931n56402p64294p72353p26653n69415m50242m16189o05033o63912
11142A2862438n65464k89037m02860n97565l91932k96542m22995k48598j41448
11133I505997k11532l49450l27605l10934k59040k10700j83095l0393o2342R946
11123G570852j16297j42556m8355j36879k96774l21817k50710k85679l18883k33123
11113E419779k77863j9689J0173j38228j77313k18714j42756Q0243l4525p1758
11103D429349k06257j48906M3308q8060r1511n6002n6842p7438l5194j74892r1861
11092C445694M6693M569p5336j2939p8869l598K6790j52426j90651k7334n6168
$$ plain form
11159 27087173 25671736 24381889 23186516 22124002 21075280 20058556 19164386 18386931
11151 18386931 17830529 17066235 16293882 15567229 14997814 14547572 14131383 13526350 12862438
11142 12862438 12296974 12007937 11605077 11007512 10615580 10319038 9896043 9647445 9505997
11133 9505997 9294465 8945015 8617410 8306476 8047436 7836736 7653641 7623248 7560906 7570852
11123 7570852 7454555 7311999 7263644 7126765 6829991 6508174 6257464 5971785 5652902 5419779
11113 5419779 5141916 5122227 5132400 4994172 4816859 4598145 4455389 4535632 4501107 4429349
11103 4429349 4223092 4074186 4117494 4029434 3937923 3881921 3825079 3747641 3712447 3537555 3445694
11092 3445694 3492387 3496956 3421620 3408681 3329812 3326214 3353004 3200578 3009927 2982593 2926425
11081B926425j22450o7895N08N2734k3221j27290r2002j14577P435o5156L1914
11070B406425Q4489l4828j3047j46373p1691O3075o8165K0198J06455j76791l09338
11059A860409k17020q0047K44o5876j79988p3188l4589q9760L7809L9493J30126
11048A327613M996M5268J6593j84660P530O0267R1134K6478n0326k9253j63100
11037A152540Q3168n1343j97577k9347K9038j28796k4141K6262o2434j45427M3343
11026F95286J28380N674K0287k5147L6782o084j37415j37964l0106N1982J55121
11015G56796J31839n0032j11248k9325R9882K0882O9701r4847J04808K79082L13820
11004A491358K20767K05021k1142j46715l15531l87798k41388L976n1252o1667
$$ plain form
11081 2926425 2803975 2736080 2736588 2789322 2766101 2638811 2546809 2432232 2439667 2374511 2406425
11070 2406425 2490914 2456086 2443039 2296666 2224975 2288050 2219885 2240083 2346538 2169747 1860409
11059 1860409 1643389 1563342 1563586 1497710 1317722 1244534 1209945 1120185 1157994 1197487 1327613
11048 1327613 1332609 1377877 1394470 1209810 1217340 1277607 1368741 1395219 1344893 1315640 1152540
11037 1152540 1235708 1184365 986788 957441 986479 857683 833542 859804 797370 651943 695286
11026 695286 823666 829340 849627 824480 861262 855178 717763 579799 549693 601675 756796
11015 756796 888635 838603 727355 698030 797912 818794 888495 793648 898456 1177538 1491358
11004 1491358 1712125 1917146 1896004 1749289 1433758 1045960 804572 808548 757296 695629
10994F95629n8897K223n1066p7832m7419j3526k5679J20070L5679j20745j73300
10983B85137Q6584J18037r4082k2769O041L967r4224J21805l5718K0296p4222
10972C20852r7661P6505J20478L4097o9724P1681J6706o4055o9400m4577p9615
10961B15287O417J15123J16419m3511q9996J72159K2919p9474j51212L6203J34601
10950D54935j0824j6355j10796o7698L0429Q4200L5641k0368m9605J32721L1968
10939D94248j24689R0012P1856P1595k25104o9142R455K961J3239j54383j50129
10928B9919j4843Q3888R9947n2495M1326R8759P151p3461j4497n4493q7884J27084
10916A90401K78743N4155r8199Q326J01989q5179q4394J3779M9245N6466m0825
$$ plain form
10994 695629 636732 638955 587889 510057 462638 449112 423433 543503 579182 458437 285137
10983 285137 371721 489758 395676 372907 378948 382915 288691 410496 374778 395074 320852
10972 320852 223191 299696 420174 454271 384547 456228 472934 408879 339479 294902 215287
10961 215287 221704 336827 453246 409735 319739 491898 514817 435343 284131 320334 454935
10950 454935 444111 427756 316960 249262 279691 363891 399532 379164 329559 462280 494248
10939 494248 369559 459571 531427 603022 377918 308776 318231 321192 334431 180048 29919
10928 29919 15076 98964 198911 146416 187742 286501 293652 220191 205694 151201 63317 190401
10916 190401 469144 523299 425100 433426 535415 450236 365842 379621 428866 485332 444507
10905D44507p5156n1242k0619l3685l1933j10466j9550J54730J40759m8707M57
10894C49095J08117q5166k86076J0032J98994j9577M5536N7164l7352o6080m0574
10883B34113j3873j04486j06917N3771R3950k0285K6086K17139J9657j56405K5902
10872B68652L2087L7229j8539m2241L5822M2925k8356O6653M6003Q5164J5350
10861E40749k539j24650P0963P1867j20420N9333m6077j30870q5885L0612L5120
10850B98203j17690n223Q2812O60p6713q307j7154j10410M8353J29707N6372Q103
10838B88713r5433l5852j43954L1280M4877N8128P1556N215N1367n2554j1107
10827B12236o0582L8586J3628j33536j9779O9645J79970M4385m3982l5948r4118
$$ plain form
10905 444507 369351 318109 297490 263805 231872 121406 101856 256586 397345 348638 349095
10894 349095 457212 372046 85970 96002 294996 275419 320955 378119 340767 274687 234113
10883 234113 220240 115754 8837 62608 156558 136273 162359 379498 399155 242750 268652
10872 268652 300739 337968 319429 277188 313010 355935 327579 394232 440235 525399 540749
10861 540749 538210 413560 484523 556390 435970 495303 449226 318356 232471 263083 298203
10850 298203 180513 175290 258102 258762 182049 173742 156588 46178 94531 224238 280610 288713
10838 288713 193280 157428 13474 44754 89631 147759 219315 224530 275897 223343 212236
10827 212236 151654 190240 203868 70332 50553 120198 300168 344553 300571 264623 170505
10816A70505K2362J01330j1058j77560j6128J80674J87717q7955L286M6199J13757
10805E33129q8308Q7280J26869M6905K3407m8232J14218M0571K22358L17939K63961
10794A640097J07631K02907J08334m3411J20271R7303J95268J28694M3073j21614
10784B478553o9018O5728O9517j8306j63189n1885o9741R4190K3058r2679K4352
10773B290580O1734j59156K6331j21894O0566j24J06525L4967j5168M5567K1542
10762B351470J37292P2827j04403j14618k17633j55663j24862j49884j53216j06139
10752A435171k81216j46527J5899L8655j84912j3124j24704k43155j40518l3568
10742C22001n3188j0015J49561J5888r4102O787l2113m1515r66K4089K7458J107
$$ plain form
10816 170505 192867 294197 283139 105579 89451 270125 457842 369887 373173 419372 533129
10805 533129 444821 532101 658970 705875 729282 681050 795268 835839 1058197 1376136 1640097
10794 1640097 1747728 1950635 2058969 2015558 2135829 2233132 2428400 2557094 2600167 2478553
10784 2478553 2409535 2475263 2544780 2526474 2363285 2311400 2241659 2335849 2358907 2266228 2290580
10773 2290580 2352314 2193158 2219489 2097595 2158161 2158037 2264562 2299529 2284361 2329928 2351470
10762 2351470 2488762 2561589 2457186 2342568 2124935 1969272 1844410 1694526 1541310 1435171
10752 1435171 1153955 1007428 1023327 1061982 877070 863946 739242 496087 355569 322001
10742 322001 268813 258798 408359 424247 330145 336932 304819 263304 262338 286427 313885 314992
10730C14992j03049K8350J19071l7588j4465L0375k3933j00279l4030k6190R5656
10719B48910k1445J06757J83547M716k0600L3429j15805r2410o9004j47576k2485
10708H8034O0472j7962j48342m4804K2137P3897K0781L6742P0335O259K1010l0608
10696A57951n8453Q4354j9032m7507P6657j08614J1784k2511P804q981j57979
10685h4527J30189K0995p8136r114J14169k7587K0692J74895r521q4824Q2974
10674B50205o5041j38111m4594o3331m6784N2k2246J84592Q2646j15092r6923
10663g4627p1616j03088J6468Q4632m3420o6891J49307Q1627k7688p221O0492
10652b025J85510J19170m8137j3629Q238q7082j58261J9975J66306P0854r405
$$ plain form
10730 314992 211943 240293 359364 321776 307311 337686 313753 213474 179444 153254 248910
10719 248910 227465 334222 517769 522485 501885 535314 419509 327099 258095 110519 88034
10708 88034 148506 130544 -17798 -62602 -40465 33432 54213 90955 161290 167549 188559 157951
10696 157951 99498 183852 164820 117313 193970 85356 97140 74629 82433 73452 -84527
10685 -84527 45662 66657 -11479 -20593 93576 65989 86681 261576 252055 167231 250205
10674 250205 185164 47053 2459 -60872 -107656 -107604 -129850 54742 137388 22296 -74627
10663 -74627 -146243 -249331 -232863 -148231 -191651 -258542 -109235 -27608 -55296 -62517 -2025
10652 -2025 183485 302655 254518 240889 249127 162045 3784 23759 190065 260919 251514
10641B51514J05431p6988r9190p3593j01082J1735m5242P9224R2881j6368K5660
10630A53982l7136L6749k5901k51784K8556N8645J34624P3742p594m1624n0900
10619G1359J32894Q3084m264q9042R6136L5110j284j08150R71J6309j03125J10745
10607B40743M3709m4305j36119n492L0302J3107l3834q291J34295K4788j24994
10596A33909k12735j52681J29042p69N4561Q4755O3242O3235j29389j79068q2320
10585b28218P0432N7209J9807O0328K4315J1885q2331k6946J476J39742P8173
10574A25872J13683M9821n2421m914n6280j79974k4185o0065P2172R9260l1261
10563E1708O3940j2011p3602o9850r8283K9014R8312R706M2650Q9475M4194m8471
$$ plain form
10641 251514 356945 279957 180767 107174 6092 17827 -27415 51809 144690 128322 153982
10630 153982 116846 153595 127694 -124090 -95534 -36889 97735 171477 163883 122259 71359
10619 71359 204253 287337 283073 194031 290167 325277 323993 215843 216814 233123 129998 240743
10607 240743 284452 240147 104028 98536 128838 141945 108111 99820 234115 258903 133909
10596 133909 -78826 -231507 -102465 -103234 -48673 36082 99324 162559 33170 -145898 -228218
10585 -228218 -157786 -100577 -80770 -20442 3873 15758 -66573 -93519 -92043 47699 125872
10574 125872 239555 289376 236955 232041 175761 -4213 -28398 -88463 -16291 82969 51708
10563 51708 115648 103637 30035 -39815 -138098 -109084 -10772 -1066 41584 131059 175253 126782
10551A26782l0161j9083n7429L9995M7344r1233l066J39475o3456p611J5625o9758
10539B7424l052J9796p9109m2083N6513q0914j0375J57400N7937J48110n236j51950
10527I4461m6972p2083J1557O1022K6114P666J17301P4591k28839j74640j04514
10516b34336J61810K03842M3227j24416m7216O2241p8419j24555M8950R3812P4282
10505G9222J11613q2321j2373R3072K4731O3172k625j39234j29194j08320N5429
10494d6828p0635J2961J31396R4607n7050N0503p7844j59984o2857L4739P8088
10483g2904M8840Q4753K5J2532l6508L4074O5590j39799l6605j5596R5246l6651
10471B997q6279O7870L7340J40374K1441p6682o2995L4238O5600m7691j06136
$$ plain form
10551 126782 96621 77538 20109 60104 107448 16215 13149 152624 89168 81557 97182 27424
10539 27424 24372 44168 -34941 -77024 -20511 -101425 -111800 45600 103537 251647 246411 94461
10527 94461 47489 -24594 -13037 47985 74099 81765 199066 273657 44818 -129822 -234336
10516 -234336 -72526 131316 174543 50127 2911 65152 -13267 -137822 -88872 4940 79222
10505 79222 190835 108514 96141 189213 213944 277116 274491 135257 6063 -102257 -46828
10494 -46828 -117463 -104502 26894 121501 64451 114954 37110 -122874 -185731 -150992 -72904
10483 -72904 -24064 60689 60714 73246 36738 70812 136402 -3397 -40002 -55598 39648 2997
10471 2997 -83282 -15412 21928 162302 183743 107061 44066 78304 143904 96213 -9923
10460i923j62819l5022K3059J11807J84453L7157j49826k4463L2033n1546N2211
10449G121J7757q2837O0764m498M3286O3435K143p4847K7453J89108r9039j60778
10437a0932j20373P8671j710M9134J23327L8749l8483L2339j4963k1112k22730
10426a08083m5894J47452k9438j02096o4338m8223J9454O1497Q5279p5481J6566
10415a43305J5273O5926o173J05039N7357p5581j22651k0422m5437J14306N8677
10404C009k0414l2282J4362J05307l029Q4552M6648n1058o958j30811j54868j2037
10392a57579J43709m817k3542J75654M4079p848m5113j37613J12266J04169j27969
10381G5396j37200K3407N6422R1194J08430j00004p7515r6365J12505J04099P43
$$ plain form
10460 -9923 -172742 -207764 -184705 -72898 111555 148712 -1114 -25577 6456 -45090 7121
10449 7121 24878 -57959 2805 -1693 41593 105028 107171 32324 59777 248885 149846 -10932
10437 -10932 -131305 -52634 -54344 -5210 118117 156866 118383 150722 135759 114647 -108083
10426 -108083 -153977 -6525 -35963 -138059 -202397 -250620 -231166 -169669 -84390 -159871 -143305
10415 -143305 -128032 -62106 -68279 36760 94117 18536 -104115 -124537 -169974 -55668 3009
10404 3009 -17405 -49687 -35325 69982 66953 151505 198153 147095 140137 9326 -145542 -157579
10392 -157579 -13870 -18687 -42229 133425 177504 169656 124543 -13070 99196 203365 75396
10381 75396 -61804 -38397 18025 109219 217649 117645 40130 -56235 56270 160369 161112
10370A61112Q3685N5963j02681j87286K2501l140k0553j94k3952m1032P093j4062
10358f2546J34648m2241N1632O4181m641j3849J698q6687J77999K27525J04404
10347E52123l1682l4524K02955M41639K99598K19210P3279J12128K00432J33742
10337B168900Q8523K7911p6814k51361k65839k90451k67317j91101r8329k75634
10327E68488k63767j64663k0609J9747J71234J09439L3270r5080j04408k7730
10317B25921J89489N9478m6431p7612j2161l019k2639r6700O1244M9939n8673
10306B68836k1118J4114L1561P0030q213k3328n357r7476r8776N8284j4885j2787
10294A60885R4396j42773O6801K0666p9202j10170M0039m0752N036J6085Q620
$$ plain form
10370 161112 244797 300760 198079 10793 33294 30154 9601 9407 -14545 -55577 -48484 -62546
10358 -62546 72102 29861 81493 145674 141033 127184 128882 42195 220194 447719 552123
10347 552123 520441 485917 688872 1130511 1430109 1649319 1722598 1834726 2035158 2168900
10337 2168900 2257423 2285334 2208520 1957159 1691320 1400869 1133552 942451 844122 568488
10327 568488 304721 140058 119449 139196 310430 419869 453139 358059 253651 225921
10317 225921 415410 474888 428457 350845 338684 335665 313026 216326 277570 327509 268836
10306 268836 247718 261832 293393 363423 355210 331882 326525 229049 130273 188557 173672 160885
10294 160885 255281 112508 179309 199975 120773 10603 50642 9890 14926 31011 39631
10283C9631J67831L8530j9806J9163L577o0663o9425Q2989j11628j68156j3613
10272i1570K9452l5749N4527o0664J34757L1621k1549r0876q327j00800m1194
10261b00372R9500P8821N9575J32748m2523j17220j9069l5975k3857N1433J2163
10250d776n3885J04660p7608k8116K9098J0914M1069J20916L9161j9646o8138
10239I3649m003m0174J34041p3661l6021r5422L4762K1772n253l0970k2900L8821
10227A4641Q633n9487R6174J17051q0305j72484j40186M5438N4232L6359J05573
10216B5639N7787k7317K9781k2988p5233M9800R3080k9681N1266k7033p4777N870
10204E6194j2158j8750n7638j0727J22539m0924p9931k3341n5363M7733J58110
$$ plain form
10283 39631 207462 245992 226186 245349 248926 188263 118838 201827 90199 -77957 -91570
10272 -91570 -62118 -97867 -43340 -104004 30753 62374 40825 -50051 -58378 -159178 -200372
10261 -200372 -100872 -22051 37524 170272 127749 10529 -8540 -44515 -68372 -16939 -4776
10250 -4776 -58661 45999 -31609 -59725 -30627 -19713 21356 142272 181433 161787 93649
10239 93649 89646 49472 183513 109852 73831 -21591 13171 34943 29690 -1280 -24180 14641
10227 14641 23274 -36213 59961 177012 96707 -75777 -215963 -170525 -116293 -79934 25639
10216 25639 83426 56109 85890 62902 -12331 37469 130549 100868 152134 125101 50324 56194
10204 56194 44036 25286 -32352 -43079 79460 38536 -41395 -64736 -120099 -72366 85744
10193H5744n498m2386Q5422l0830j2170N8619l9443L977q9976j8436R531O9286
10181G3840q514o7384p8588j2327M2377J32939N5494k880J3539M443r9681n901
10169D7357L8868L2712l4870p6644j07876P2026M6138r0363l4452R850K1105J55685
10157G9536O1300p7644l9073k2230j76664M0048O3132j34517N8312J54847J78232
10146A85279K1908o2761N096R5196N1430J5913j33690J07302q3647j08187l5336
10135E8503p3176O6339j0971J66107o0699j63986J8842J11295l1636j63798j39984
10124b23164P0884J46506O2874K551j9063o6719O0104m3491m2823o025K6323j3013
10112d5056P8711o4625M9054O51O9660l5576l8721k7873r864o515m1825J45877
$$ plain form
10193 85744 80246 37860 123282 92452 80282 138901 99458 103435 13459 -4977 4554 73840
10181 73840 65326 -2058 -80646 -92973 -50596 82343 137837 134957 148496 152939 53258 47357
10169 47357 86225 118937 84067 7423 -100453 -28427 17711 -72652 -107104 -97254 -76149 79536
10157 79536 140836 63192 24119 1889 -174775 -134727 -71595 -206112 -147800 7047 185279
10146 185279 207187 144426 149522 244718 296148 312061 178371 285673 202026 93839 58503
10135 58503 -14673 51666 40695 206802 146103 -17883 959 112254 80618 -83180 -223164
10124 -223164 -152280 -5774 57100 59651 40588 -26131 33973 -9518 -52341 -58366 -32043 -45056
10112 -45056 33655 -30970 18084 18735 88395 52819 14098 -13775 -23639 -30154 -71979 73898
10100G3898J38819P9527J6660r2904j29959p3936M342J51471k1831r7778M881
10089E3190o5107q7665M3902N8553r2668l4888p7305o5488O2078O7883J70503
10078C2988J54186K0523p3508p4369J09088J4883q8254n9433Q2914p692k1796
10067H9530o3063L3055J06757n5953l6734o7849k6561N3401J0805l3501j41286
10056a31399K092N0682K3113P302j0354J16643L4781q5022p6979K6671l1671j2851
10044h6992o9632J87996K02658n2692j46448K9657j4095n1650N1628n1234p3080
10033g3884L4925M9606q2763k2329R542J11800J27575l4356q1823r4725p8657
10022a35089J08013J0085n6975q0013r6142P8895Q4611L7589K4109j09651r059
$$ plain form
10100 73898 212717 292244 308904 216000 86041 12105 16447 167918 146087 48309 53190
10089 53190 -11917 -99582 -55680 2873 -89795 -124683 -201988 -267476 -205398 -137515 32988
10078 32988 187174 207697 134189 59820 168908 183791 95537 36104 119018 111326 89530
10067 89530 26467 59522 166279 110326 73592 5743 -20818 32583 43388 9887 -131399
10056 -131399 -129307 -78625 -55512 -48210 -58564 58079 92860 7838 -69141 -42470 -74141 -86992
10044 -86992 -156624 31372 234030 181338 34890 64547 50452 -1198 50430 -804 -73884
10033 -73884 -38959 10647 -72116 -94445 -84903 26897 154472 120116 38293 -56432 -135089
10022 -135089 -27076 -16991 -73966 -153979 -250121 -171226 -86615 -49026 -24917 -134568 -143627
10011a43627L2266J28630P5033j5159j29471J176J24515j00421k617K8527n6876
10000e8024P9979K1004n4071j43440J0951P8424j0420M0522J45106P4565j19400
9989F5196j81848P9648J17800R8295p216n1966r9222j68906l5931K56229O1391
9978A33470k5466L9334m5615N7906L1168r7146P0158p8908m9845P311Q3657J3934
9966A39958o3421n5833O7813K6422j25729r4337K4441k5240R2612J05363j0477
9955H1572J19780J62938R3788j15785j13664m4963q8140q988j57391l4944J19670
9944A3873J22478J50269o1545r936J7791k6763p1812N8797P4987k1698o5682K814
9932A83573M1448q3732o3367k2552j7273J9751l834k648q5859J582k1627P7820
$$ plain form
10011 -143627 -111361 17269 92302 77143 -52328 -51152 73363 -27058 -29675 -1148 -58024
10000 -58024 21955 42959 -11112 -154552 -143601 -65177 -75597 -35075 110031 184596 65196
9989 65196 -116652 -37004 80796 179091 171875 119909 20687 -148219 -184150 72079 133470
9978 133470 108004 147338 101723 159629 190797 93651 163809 84901 35056 42367 126024 139958
9966 139958 76537 20704 88517 114939 -10790 -105127 -80686 -105926 -13314 92049 81572
9955 81572 201352 364290 458078 342293 228629 183666 95526 86538 -70853 -105797 13873
9944 13873 136351 286620 225075 215139 232930 206167 134355 193152 268139 246441 180759 183573
9932 183573 225021 141289 77922 55370 38097 57848 54014 51366 -34493 -32911 -54538 23282
9920B3282J26338M4309J14274j48644p5168Q773j01935l3858M9843j4005j2043
9909a8834k1072R337R5844J39642Q8381J07230L08067J15369J74690K00121R36
9898A199711k49023k12313l5212l03709k04429J32416q0226p8873n2514k9464
9888H6364p6763j7008N7923J7037m5944r3654J57344p821j0314j25376j8137Q7342
9876A0993J80262o1838N184m5447p869q3130Q645R5547J17588O1312n6396j47557
9864G7294O2790J62044p0401n5078m3455J65171k2790p4516o5905M0436k9836
9853A45754j37104j9376P7382O104k6080N747J13375M4572l5734N5409j21383
9842A08666j16951J0366j04561j8738O5952Q0718N4532J69067M6649o5667r0666
$$ plain form
9920 23282 149620 193929 308203 159559 84391 93164 -8771 -42629 7214 -6791 -18834
9909 -18834 -39906 -30569 65275 204917 293298 400528 708595 823964 998654 1198775 1199711
9898 1199711 950688 738375 703163 399454 195025 327441 247215 168342 115828 86364
9888 86364 9601 -7407 50516 67553 21609 -72045 85299 77478 67164 -58212 -76349 10993
9876 10993 191255 129417 134601 89154 81285 -1845 6800 102347 219935 281247 224851 77294
9864 77294 140084 302128 231727 176649 133194 298365 275575 201059 135154 175590 145754
9853 145754 8650 -10726 66656 72760 46680 52427 165802 210374 174640 230049 108666
9842 108666 -8285 2081 -102480 -121218 -55266 25452 79984 249051 295700 230033 139367
9831A39367j70977J6732R6343J02597p682K8439P6496J1466j77624j06682J59382
9820A67857j19787k0130J08633Q3442j05245k66286p9878m3643O6239Q7928k69
9809a21139K532J81739N8252k2831q2457n7899J66951R3070O9835k7230j05796
9798A55027k13326n8878N2104N7056m2449N4489O7786j99102m1223J67291J15742
9787A14517P1662O725n6935j36758j42628l3284l806L5911R5799J38102J76480
9776B65785p5804k9335k5389j44851l0686J07009l5308l0039o3745j92N7644L3265
9764B8354O3571q4074M4462K032o007O2371J02186m8059j54595q1913N1007J93839
9752A73174R3158K8399P5017L291j27018O2454k5029O2120k1032p9666j07343
$$ plain form
9831 139367 -31610 -14878 81465 184062 176380 204819 281315 292781 115157 8475 167857
9820 167857 48070 27940 136573 220015 114770 -151516 -231394 -275037 -208798 -120870 -121139
9809 -121139 -118607 63132 121384 98553 16096 -41803 125148 218218 288053 260823 155027
9798 155027 -58299 -117177 -65073 -8017 -50466 4023 71809 -127293 -168516 -1225 114517
9787 114517 186179 192904 135969 -789 -143417 -176701 -180507 -144596 -48797 89305 265785
9776 265785 189981 160646 135257 -9594 -40280 66729 31421 1382 -62363 -62555 -4911 28354
9764 28354 91925 7851 52313 54345 48338 110709 212895 164836 10241 -71672 -20665 173174
9752 173174 266332 294731 369748 373039 246021 308475 283446 345566 324534 244868 137525
9741A37525k3724k8218j03353Q3208Q2439m6666O1608n5664j52347m7040m0468
9730a32700P3818J19003J01144k462N3739M8796j58802O7381R0819p7381j83173
9719A82M9153O4462o7455n4412Q8798n3097j83100m0921K01603K01464N0672j52066
9707A05283m47N4500J49380m3917j74520j3629n2495R3754O9033k2290J2234L9811
9695B16697m6313r5256J9802n134J4334n5868q6155K7382L096P471P9789J4099
9683I3944J13285q4589l1288j1765k7952M531K06872L132r0020j30470O3681J01046
9671B10407J60726n69q9546K6118m645l9467o1070P9613j18529r600j01065n4285
9659a912q0893j05620J98187J62690R754k1187j09912J26040J94345M4214j45137
$$ plain form
9741 137525 113801 85583 -17770 65438 147877 101211 162819 107155 -45192 -92232 -132700
9730 -132700 -58882 60121 161265 158803 212542 261338 102536 169917 260736 183355 182
9719 182 49335 113797 46342 -8070 80728 27631 -155469 -196390 5213 206677 257349 105283
9707 105283 104836 159336 308716 264799 90279 76650 24155 117909 186942 164652 176886 216697
9695 216697 170384 75128 94930 89796 104130 48262 -37893 -10511 -7415 56 79845 93944
9683 93944 207229 122640 91352 79587 51635 56166 263038 266170 176150 45680 109361 210407
9671 210407 371133 370564 281018 307136 302491 263024 201954 281567 163038 153438 52373 -1912
9659 -1912 -82805 -188425 9762 172452 182206 161019 51107 177147 371492 415706 270569
9648B70569j39668o5599J09264m3133j05736R2309J05071L1531l634o5194R9973
9637B85753q2521m465P0806j05729j38012r3164q618M2939R4183M0670P0665l9047
9625A33460n0416L1196N4478J02036O9326j0621k29644o8732m2275Q4230N0036
9614A23074R5913J00422M8661R608l3080o83J35569M7260n7089j74229n9459p0560
9602A65407K2506J33109l6748K9196l0424L2339k8335j45621J3855L9581r2724
9591A02141j9574j2818K7846o1443P4759J13537K2331K9713J42570l0397m1985
9580C46680K2512l0551q5442K9049m0473J00376J42837q8921j57347o8560p2509
9569I7651M409L1721J14359J17007j52237k6408L5175l8392k8271J09945L8116
$$ plain form
9648 270569 130901 65302 174566 131433 25697 118006 223077 254608 250974 185780 285753
9637 285753 203232 198767 269573 163844 25832 -67332 -75950 -33011 61172 101842 172507 133460
9625 133460 83044 114240 168718 270754 340080 329459 99815 31083 -11192 73038 123074
9614 123074 218987 319409 368070 377678 344598 343915 479484 526744 469655 295426 235967 165407
9602 165407 187913 321022 284274 313470 283046 315385 287050 141429 155284 194865 102141
9591 102141 82567 69749 97595 36152 110911 224448 246779 276492 419062 388665 346680
9580 346680 369192 338641 253199 282248 241775 342151 484988 396067 238720 170160 97651
9569 97651 102060 133781 248140 365147 212910 186502 221677 183285 155014 264959 303075
9558C03075m6128J4502P6241l9603j77462K2611O6752M525j4277J11833j5013
9547C07056j7148M8753o1842l4850J40175J77397O1234n9186m3636l1917r6022
9536C90014o1508K3771j17994k1547p0261n9983J93933J03193n8859n3078N5379
9525C23060J4318J14151j39962o7535J17865P8203J845m0933j36465q6267M9407
9514B27687J40284L1631p1460l191K8237l6050J7304L3711j495j09285j05213
9503A52160Q8261J19344L9824k2959o007r0479R9802L9228n0J1422k0435m6772
9491C63339Q408j2587R0375k7990N4456J0936N921m8609J2395K4624O3268J22079
9479F66615k4723K8754P9833o2035m5679k6948j90691n5787P7437l6174N9296
$$ plain form
9558 303075 256947 271449 347690 308087 130625 153236 219988 224513 210236 322069 307056
9547 307056 289908 338661 276819 241969 382144 559541 620775 561589 517953 486036 390014
9536 390014 328506 352277 234283 212736 142475 82492 276425 379618 320759 267681 323060
9525 323060 337378 451529 311567 244032 361897 440100 441945 401012 264547 178280 227687
9514 227687 367971 399602 328142 324951 353188 317138 334442 368153 366658 257373 152160
9503 152160 240421 359765 399589 376630 370623 280144 379946 419174 419124 430546 410111 363339
9491 363339 371747 359160 449535 421545 476001 486937 492858 444249 456644 481268 544536 666615
9479 666615 641892 670646 750479 688444 642765 615817 425126 369339 446776 410602 469898
9468D69898O2961j24598r0652K00193L1455j06355j07442O3985K8248o8166J4679
9457C74206L2992j4005J08797Q5214K3874k9941Q6448P185q3500j18220j35314
9446C37736K9537J82474N1401P4635q8361J299j7872J05029j7151j83221n9832
9435D15674P1426j2826N1600J60969L5911q2145K23596L7112r1786l8668R0519
9424H61382k8165L7121P3296Q5104J02742j2427k20704k11474R4508L459j24710
9413F60132l2710J77461J71592K0059M3476M456j77828j01239l0201j03076J5497
9402F47619R0019m5364j169q8093n477J76017J1756L1917j4682R1416J27735j62516
9390H59178j34038O292k1753L7287L2782Q4745J01248o2230o359M757l5063o0185
$$ plain form
9468 469898 532859 408261 317609 517802 549257 442902 335460 399445 427693 359527 374206
9457 374206 407198 393193 501990 587204 611078 581137 667585 674770 591270 473050 337736
9446 337736 367273 549747 601148 675783 587422 588721 570849 675878 658727 475506 415674
9435 415674 487100 474274 525874 686843 722754 640609 864205 901317 809531 770863 861382
9424 861382 833217 870338 943634 1028738 1131480 1119053 898349 686875 781383 784842 660132
9413 660132 627422 804883 976475 996534 1040010 1044466 866638 765399 735198 632122 647619
9402 647619 737638 692274 691105 603012 597535 773552 785308 817225 802543 893959 1021694 859178
9390 859178 725140 731432 709679 746966 779748 864493 965741 903511 897152 901909 866846 806661
9378H06661Q998K7736J2577N8989j2296J8709j06856o8526J25998Q6265J60495
9367A118750J83688j92656k55184Q457J56134J91002J47742Q2931q2777j46839
9357A211248j77032j04115J1077k0613P1362J91909Q2506K5863n98L2749m2672
9346A281684P6590m2039j01622L2155r0576j1687J31761Q9638J7775M6039P2193
9335A501911J9481l1664P3485J34840J89388q3052k1139k7277n3033J8759P6352
9324A798051n2942Q64K2820M6265p4931J78405L3600N1311Q1936j1128k70476
9313A803775l063O9265J1164O6964p8188j02643L1491P1133J58138R84j47464
9302A881556J9274K42804N0250N111o0687Q2626p4617q365J90895K58166p3856
$$ plain form
9378 806661 815659 843395 855972 914961 902665 921374 814518 745992 871990 958255 1118750
9367 1118750 1302438 1109782 854598 863055 1019189 1210191 1357933 1440864 1358087 1211248
9357 1211248 1034216 930101 941178 920565 991927 1183836 1266342 1292205 1291607 1324356 1281684
9346 1281684 1358274 1316235 1214613 1246768 1156192 1144505 1276266 1365904 1383679 1429718 1501911
9335 1501911 1521392 1489728 1563213 1698053 1887441 1804389 1783250 1755973 1702940 1721699 1798051
9324 1798051 1745109 1745973 1768793 1815058 1740127 1918532 1952132 2003443 2085379 2074251 1803775
9313 1803775 1800712 1869977 1881141 1948105 1869917 1767274 1798765 1869898 2028036 2029020 1881556
9302 1881556 1900830 2143634 2193884 2198995 2138308 2220934 2146317 2137952 2328847 2587013 2513157
9291B513157j84616P6703l2360q6703J82001J57298P1513j11054R913Q0718p4633
9280B601937K4624p785L9153M5209K29271K6220O7180J31362l1814J16813L4326
9269C276496m9727o2091N3018J22159J06408N6480J82123Q1557j79219o4645O2243
9258C584802Q9723l6266L1429l2677J00205J70300P1237R9464K534P5565R2777
9247D249093Q0677R0998J27066O2698L7077L0273O0015J4313N7751K11666M1908
9236E063535p3430K6711L2804r799J00773J61907N21R9163J27727P1029Q931N7167
9224E667039J53727L3991o3118q053K30847O9557M4052O3642L777J55239J00390
9213F451090J70076P2778m4605M5968J32392Q0761N9070O1782J09222J47630O8110
$$ plain form
9291 2513157 2328541 2405244 2372884 2286181 2468182 2625480 2696993 2585939 2595852 2676570 2601937
9280 2601937 2626561 2618776 2657929 2703138 2932409 2958629 3025809 3157171 3125357 3242170 3276496
9269 3276496 3226769 3164678 3217696 3339855 3446263 3502743 3684866 3766423 3587204 3522559 3584802
9258 3584802 3674525 3638259 3669688 3637011 3737216 3907516 3978753 4078217 4080751 4156316 4249093
9247 4249093 4329770 4420768 4547834 4610532 4647609 4677882 4737897 4752210 4809961 5021627 5063535
9236 5063535 4990105 5016816 5049620 5039821 5140594 5302501 5303022 5402185 5529912 5600941 5609872 5667039
9224 5667039 5820766 5854757 5791639 5783586 6014433 6083990 6128042 6191684 6195461 6350700 6451090
9213 6451090 6621166 6693944 6649339 6695307 6827699 6908460 6967530 7029312 7138534 7286164 7354274
9202G354274P929L8423k0105Q7777J18357R5830j0579k7039o339J48486J12621
9191G899635L8783o9132N1104J36445M398n9260O7706J28658J62752o9389j57662
9180H134038l3111J8995o375j00189m1656j8843K4128L9391p7033j07984k9747
9169G801614L1976J0396q4017j54786o5526q7925p4877r2419r803O7687r3876
9158G248444o4707J47489o2457j61390j10406l4290J833q2149k79479k24340k4801
9147F353747L5577K1659j31719j01250o3197k80099m0304K7170j0711q5389j81113
9136E544371n8654j3269l0211q7465k1546l3518j31914n9505j46430m1099Q49
9125D921609Q434l0211j21154q0815n2918j42515r4519j21266L8726Q134k7059
$$ plain form
9202 7354274 7362203 7400626 7380521 7468298 7586655 7682485 7671906 7644867 7638528 7787014 7899635
9191 7899635 7938418 7869286 7920390 8056835 8061233 8001973 8069679 8198337 8361089 8291700 8134038
9180 8134038 8100927 8119922 8113547 8013358 7971702 7952859 7976987 8016378 7939345 7831361 7801614
9169 7801614 7833590 7843986 7759969 7605183 7539657 7451732 7376855 7284436 7274633 7342320 7248444
9158 7248444 7183737 7331226 7268769 7107379 6996973 6962683 6964516 6882367 6602888 6378548 6353747
9147 6353747 6389324 6410983 6279264 6178014 6114817 5834718 5794414 5821584 5810873 5725484 5544371
9136 5544371 5485717 5472448 5442237 5354772 5333226 5299708 5167794 5108289 4961859 4920760 4921609
9125 4921609 4930043 4899832 4778678 4697863 4644945 4502430 4407911 4286645 4325371 4333505 4306446
9114D306446j07118K8778j47503Q009K3881j14280p1640j30787p5563L0136N3415
9103C803774l3882k08041k1078j58474p6933j32550q0511J3371k8942r068J7330
9092C084996m109p6948j76793j01744J23976q4865j75817j9986j2873L8597j5171
9081B579263J33837M9120k6056j56772k4478j63316k08554O5498m7073q8722K7785
9070B140532j05040N0617J8730L6473j23116o9389L4495O0278L8914j4205j46333
9059A921956j3287R3631p2805j08242n8840j08561j03319J75199J54708k2736
9049A857704n8986J8353J23927r2676j21661j23602j19857k8128o1193j21090
9039A272791l7172J13886P909q4969O0474L1357j3316J0617J0149j287L8524p800
$$ plain form
9114 4306446 4199328 4228106 4080603 4088612 4112493 3998213 3926573 3795786 3720223 3750359 3803774
9103 3803774 3769892 3561851 3540773 3382299 3305366 3172816 3092305 3105676 3076734 3067666 3084996
9092 3084996 3080887 3003939 2827146 2725402 2849378 2764513 2588696 2568710 2555837 2594434 2579263
9081 2579263 2713100 2762220 2736164 2579392 2554914 2391598 2183044 2248542 2201469 2112747 2140532
9070 2140532 2035492 2086109 2104839 2141312 2018196 1948807 1983302 2043580 2082494 2068289 1921956
9059 1921956 1908669 2002300 1929495 1821253 1762413 1653852 1550533 1725732 1880440 1857704
9049 1857704 1798718 1817071 1940998 1848322 1726661 1603059 1483202 1455074 1393881 1272791
9039 1272791 1235619 1349505 1357414 1272445 1332919 1364276 1350960 1361577 1371726 1370439 1408963 1401163
9027A401163j77695k1093k2840J9359J18138L2191l4591j81071O4862K4165j04600
9016A117988k9720n8904m7559J27998L8501m6764n6320P3262l4562n7391K907
9005A029436L9015m4969n465l834j7281n8122M1660M7356O7485k1297o4926j55230
8993H53828k3877J23992L5761P6607j53914j72361q710Q3189J72390j0776j53961
8982H22168r6715K704L5943j8690p3470K6548o5148K3898R0232N9300k6539l5596
8970G44635j11225M1833J78123J83685m7406p9436n0375j70002k5860m5939R323
8959F27356N7077l650K2824j39491L3182J23918m0924l1808j8201j00831l2076
8948D97376j09182P3676K2798L8273l0062j04160K9780N1626R1281l9973j28974
$$ plain form
9027 1401163 1223468 1202375 1179535 1198894 1317032 1349223 1314632 1133561 1198423 1222588 1117988
9016 1117988 1088268 1029364 981805 1109803 1148304 1101540 1045220 1118482 1083920 1026529 1029436
9005 1029436 1068451 1023482 1018017 1014183 996902 938780 980440 1027796 1095281 1073984 1009058 853828
8993 853828 829951 953943 989704 1066311 912397 740036 731326 814515 986905 976129 822168
8982 822168 725453 728157 764100 745410 671940 698488 633340 657238 747470 806770 780231 744635
8970 744635 633410 675243 853366 1037051 989645 910209 859834 689832 663972 618033 627356
8959 627356 684433 680783 703607 564116 597298 721216 680292 648484 630283 529452 497376
8948 497376 388194 461870 484668 522941 492879 388719 418499 470125 561406 521433 392459
8937C92459J00026J41101k6722j08347J12856J57348p550k53829K0232N4516J00842
8926F82932O5425n8415o7724J1480r837m9763O1226o4761N4915q4427m2298J56910
8914F55663K5288o3803j3783p9914m8594O2887J27943J64351J39748r513r3765
8903H66508o058k6624P3072J71817J90039K87005K95877M48641K42517J27427
8893B670221k25060m59489m48315j80225j84633j74866j70916J8183K6931j53112
8883G18719j56440K6705J38436j07283n3419M9014p2646n7592Q0500m9231j31971
8872C84792m8514P3584N4867r652J38252Q5745j95125r2997o409n3707r6954k4758
8860B09124P267J29823N0824J0297L904O8720M4547j16909p7794R643k3218J715
$$ plain form
8937 392459 492485 633586 606864 498517 611373 768721 761171 507342 527574 582090 682932
8926 682932 748357 689942 622218 633698 623861 574098 635324 570563 625478 541051 498753 655663
8914 655663 680951 617148 603365 523451 474857 537744 665687 830038 969786 960273 866508
8903 866508 860450 833826 906898 1078715 1268754 1555759 1851636 2300277 2542794 2670221
8893 2670221 2445161 1985672 1537357 1357132 1172499 997633 826717 844900 871831 718719
8883 718719 562279 588984 727420 620137 566718 615732 543086 485494 565994 516763 384792
8872 384792 336278 409862 464729 455077 593329 679074 483949 390952 384543 330836 233882 209124
8860 209124 216391 346214 397038 407335 411239 479959 524506 407597 329803 339446 316228 317943
8848C17943K5198q7281j51998N7084R6546L07R2178J4901N6078p3260q6746Q2024
8836C42974p1941J05229J03253o9883L3670m2031r9043k7974r3927p9833J25659
8825B26153j4901P9605j52410j18668J19864o0716j53224J06808J19573k939J19770
8814B68915Q1265K9769r2744p3368K42107K4610o5726L1483l2975O3717n0446
8803D26607o1156o4848R0848q7662L117l8199k9188J7091j4937K4071J2547Q9662
8791C67953M4698O878o9943R7316R288r273R820k9255O6239K87m2526j13774q1900
8778B55808L1031N2424K7022p6246k04532j22493K2581R0519P0312J72883P9519
8767C98828K2353J5323j0576j48294m9886P7377j5043K7072R8817Q2713j30799
$$ plain form
8848 317943 343141 255860 103862 160946 257492 257799 349977 364878 420956 347696 260950 342974
8836 342974 271033 376262 479515 409632 443302 401271 302228 274254 180327 100494 226153
8825 226153 211252 290857 138447 19779 139643 78927 -74297 32511 152084 149145 268915
8814 268915 350180 379949 287205 213837 455944 480554 414828 446311 413336 477053 426607
8803 426607 365451 300603 391451 303789 306906 268707 239519 256610 241673 265744 278291 367953
8791 367953 412651 419529 349586 446902 456190 446917 456737 427482 493721 494008 451482 337708 255808
8778 255808 286839 339263 366285 290039 85507 -36986 -14405 76114 146426 319309 398828
8767 398828 421181 436504 425928 277634 227748 305125 290082 317154 415971 498684 367885
8756C67885j26556j1297L4060M4413J19289j04076n2989R7037k0703r5522p9030
8745A72511Q0738m9531m23P4238j28361n3258Q2645J8920j9985j997j31075L798
8733D8220j328O8916R7310K35284J13379r1906L0677r5724j56929o106K48122
8722D89915n4581j26834p5736K4146K57212K12287q5782j01021n9621m0660j80683
8711B58642r4157l2976k0745o1797l5493l8947P0717P2953J35407k8297j78930
8700D6377K0033R9924j51781J20346K19404m242j00539l8234j18614l0175J4284
8689G6783q2901K4995J0454J9230P5129J35554r3780n9207M6733J44248L5910
8678C33148m3306j96708m5178M0244R0742J94003K88125n0021k01321N0736j17350
$$ plain form
8756 367885 241329 230032 264092 308505 427794 323718 270729 367766 347063 251541 172511
8745 172511 253249 203718 203295 277533 149172 95914 178559 197479 177494 175497 44422 48220
8733 48220 46892 115808 213118 448402 561781 469875 500552 404828 247899 241793 489915
8722 489915 435334 308500 232764 256910 514122 726409 640627 539606 479985 439325 258642
8711 258642 164485 131509 110764 48967 13474 -25473 45244 118197 253604 225307 46377
8700 46377 66410 166334 14553 134899 354303 350061 249522 211288 92674 62499 76783
8689 76783 -6118 18877 29331 48561 123690 259244 165464 106257 152990 297238 333148
8678 333148 289842 93134 47956 88200 178942 372945 661070 611049 409728 460464 343114
8667C43114j5875J4254j1550J5179M0671p2039l2061r127L9119R5823R3624M4831
8655E45963j7878l5310M1718o065j7417j2360Q8212j53887l1197J18268J2012
8644E32059J52317O6081L900J58344K13856O3277j39498k16051n7729L1097j13756
8633F93897M4642J48761j03362p1288j40190k0693n6050M3131O3409l0809K7955
8622E99403M0566m2918p6250O7367J15914Q0516J84649P0408O799P38m6280j8580
8610I82332L1428m3185J29503K11985J44224M8498K48587K46767J55866J6297
8600B172302M2891J86131J71368J85153K67312K76026L31030L26433K23307P4940
8590D256893q5999j32015m11943k61131m43497n70284m22740k34679k76263k00572
$$ plain form
8667 343114 327239 341493 329943 345122 385793 313754 281693 272566 311685 407508 501132 545963
8655 545963 528085 492775 534493 528428 511011 498651 586863 432976 401779 520047 532059
8644 532059 684376 750457 754357 912701 1126557 1189834 1050336 834285 776556 807653 693897
8633 693897 738539 887300 783938 712650 572460 551767 495717 538848 602257 571448 599403
8622 599403 639969 597051 520801 588168 704082 784598 969247 1039655 1046454 1047192 1000912 982332
8610 982332 1013760 970575 1100078 1312063 1456287 1504785 1753372 2000139 2156005 2172302
8600 2172302 2215193 2401324 2572692 2757845 3025157 3301183 3632213 3958646 4181953 4256893
8590 4256893 4170894 4038879 3626936 3365805 2922308 2352024 1929284 1694605 1418342 1217770
8580A217770o0378r8491p9552o5445o0491p5215R404q3257r6855j29776K8179
8569E05893P3219P6448j01336L8788R8867j08841j86772J8706j38602k41175k8924
8558F271K15611J02749R7447r6510J3387L3963j35581Q254J27026M5096m9438
8547C68275o0408p274J09766Q2304o321j01982k1751L9551L2583M7749N1588N4421
8535E88501m1777k4487q6526l0273j22914r0901K14r3419o1905Q8366j8719Q65
8523A07025p0462J07811J88752n6606p7471p3696j326Q5788K7524l6980L6332
8512B36691r9952q031M2362J1292j44823j42010K377J09443J5356J8891o9595
8501b7999l4220m2580p8057K41529Q2716P3026n3685r1249k8401l1891J5850k2812
$$ plain form
8580 1217770 1157392 1058901 979349 913904 853413 778198 787602 704345 607490 477714 505893
8569 505893 579112 655560 554224 593012 691879 583038 396266 414972 276370 35195 6271
8558 6271 221882 324631 422078 325568 338955 372918 237337 245591 372617 417713 368275
8547 368275 307867 300593 410359 492663 486342 384360 362609 402160 434743 482492 534080 588501
8535 588501 546724 522237 435711 405438 282524 191623 191837 98418 36513 124879 106160 107025
8523 107025 36563 144374 333126 276520 199049 125353 124027 209815 237339 200359 236691
8512 236691 136739 128708 171070 182362 37539 -104471 -102094 7349 22705 41596 -27999
8501 -27999 -62219 -104799 -182856 58673 141389 214415 160730 69481 41080 9189 25039 2227
8489B227J09075K47919O9991r0181j09339r5405j58701J09380J57723j06521j56724
8478b0556m069K7961K1096K6959L6645p0427J78179J46790j4379o5693r3453p3529
8466I5524J25181l0571j41769q7505J58738o2379l1959K5889j37955R7173K4388
8455C4755Q6829J0852p3837R6457M652n0917r8663J0559k3665J08387L2743N7634
8443A95786O100j00292N7224n2715J90627M2913p9120q5602R041p5923O8965j07090
8431F9914j1632O9350j06425k8816R9961o0108n5946K3945M5199L2817l6008P2351
8419A14602o2746j4573K0499L1674J5176J7127R5208o1619l6538n3938L5272J0455
8407A10599j14379l72K6716O1689K0092N7162p9290Q840p5313n8823M8169J33491
$$ plain form
8489 2227 111302 359221 429212 339031 229692 134287 -24414 84966 242689 136168 -20556
8478 -20556 -24625 3336 24432 51391 88036 17609 195788 342578 328199 262506 169053 95524
8466 95524 220705 190134 48365 -39140 119598 57219 25260 51149 -86806 10367 34755
8455 34755 121584 132436 58599 155056 159708 108791 10128 20687 -2978 105409 138152 195786
8443 195786 201886 101594 158818 106103 296730 339643 260523 174921 183962 108039 177004 69914
8431 69914 58282 127632 21207 -7609 92352 32244 -23702 243 45442 78259 42251 114602
8419 114602 51856 37283 57782 89456 104632 121759 216967 155348 118810 64872 100144 110599
8407 110599 -3780 -4152 22564 84253 104345 161507 82217 91057 15744 -43079 5090 138581
8395A38581j1760j2778p225j56810M3468J62303P134m7657O765n3127o8968L438
8383C364N863J6813P3611j44669J38J60223O191j02958O066J28834J0308j9939
8371A43845p8881n7525k7763J2580J22279M337q7095K1064J3557N692k2188p5338
8359b5436l4690j57605L2515L2160j9890K7931M9166N7515K5035J36025L6011
8348A58737L3298k6278j13046Q5789J62915R4057N279j95006j23975l3334P0408
8337A18844n7040l292K8722O6847J296l666j04516M4183L1258j37364R1j7927
8325c2564o9847l5847o7414J8106k1632M1031J40570J68182N3842l3418M2772
8314B03781J12965j02561n3785k27457l0901J33920Q9658o446j38065J3871J20850
$$ plain form
8395 138581 126821 114043 106818 -49992 -6524 155779 162913 115256 122021 68894 -74 3364
8383 3364 9227 26040 99651 -45018 -44880 115343 121534 18576 24642 153476 163784 143845
8371 143845 64964 7439 -20324 -7744 114535 118872 31777 52841 66398 72090 49902 -25436
8359 -25436 -60126 -217731 -185216 -153056 -172946 -145015 -95849 -38334 -13299 122726 158737
8348 158737 192035 165757 52711 138500 301415 395472 400751 205745 81770 48436 118844
8337 118844 61804 58512 87234 154081 155377 151711 47195 91378 122636 -14728 -14637 -32564
8325 -32564 -102411 -138258 -205672 -187566 -209198 -168167 -27597 140585 194427 161009 203781
8314 203781 316746 214185 160400 -67057 -97958 35962 125620 119174 -18891 -5020 115830
8303A15830M8644N4325p3072j42267o3673l9964M742N2815k297o9189M177l7776
8291a47705n2177k2312L8640k7143N9533p2698P7821J61230N6943l8419l8765
8280e052L9707k9904j53580p1655Q7848K3820J13650J15439o8295r4120m5649
8269h7791K7047n7387L8375J33921Q958n675J11028J55682Q1833k41328j33126
8258C1537J1785j9422J04439R1421o7750j28668K07l8759l5581Q1347M9182M6124
8246A25862m9033Q048r7263m2598N6136J01808M5980J723l2808q0822r7089j27660
8234a87716J3790R6663O8714p3000j5699P1977N405m8599L0197J16971k2172M8966
8222A05497J18717J07320q2713j76260j15765n6757j1404l849l3761q9875n3033
$$ plain form
8303 115830 164474 218799 145727 3460 -60213 -100177 -95435 -42620 -44917 -114106 -109929 -147705
8291 -147705 -199882 -222194 -183554 -210697 -151164 -223862 -146041 15189 72132 33713 -5052
8280 -5052 34655 4751 -148829 -220484 -132636 -108816 4834 120273 51978 -42142 -87791
8269 -87791 -60744 -118131 -79756 54165 63123 57448 168476 324158 405991 164663 31537
8258 31537 43322 23900 128339 219760 152010 23342 23549 -15210 -50791 30556 79738 125862
8246 125862 76829 84877 -12386 -54984 1152 102960 148940 150663 117855 37033 -60056 -187716
8234 -187716 -173926 -77263 -8549 -81549 -97248 -25271 -19866 -68465 -38268 78703 56531 105497
8222 105497 224214 331534 248821 72561 -43204 -99961 -111365 -115214 -148975 -238850 -291883
8211b91883J46426Q2003Q4019J08280J7700j14552m1095k0274j38503J51092M2165
8200B5378R263J07207l3954o9987l1459j30042N7737N8378r318p7802l2138q2253
8188b08990O9573J59352M01R466p6743N1221J7596k7757l9081l0003j40697q2150
8176b97812K4089Q1148J83760R2761j3525j0985O9413M4895j02256j13852M0156
8165b208k1090k6588j0579l0410K7952r6240J42682J06923j36595p1687k5942
8154a43782r7679j1429L06398O1482l4715j36394R670R8676J157j40854k7243
8143a14713J10519m2964p587j6053O5670l8518k6809K0930J30590O9469n5226
8132I5308n4902k5405Q8279k5932m442j987p734l7280q1330M9904r535r475k0012
$$ plain form
8211 -291883 -145457 -63454 20565 128845 146545 31993 -9102 -29376 -167879 -16787 25378
8200 25378 34641 141848 107894 37907 6448 -123594 -65857 -7479 -16797 -94599 -126737 -208990
8188 -208990 -139417 19935 20336 29802 -46941 4280 21876 -5881 -44962 -74965 -215662 -297812
8176 -297812 -273723 -192575 -8815 83946 70421 59436 128849 173744 71488 -42364 -2208
8165 -2208 -23298 -49886 -60465 -90875 -62923 -159163 -16481 90442 -46153 -117840 -143782
8154 -143782 -241461 -252890 53508 114990 80275 -56119 -46449 52227 53384 -87470 -114713
8143 -114713 -4194 -47158 -54745 -70798 -5128 -43646 -70455 -49525 81065 150534 95308
8132 95308 40406 15001 103280 77348 72906 70919 63185 25905 -55425 -5521 -15056 -24531 -44543
8119d4543M1384O3465R1246J66425o422L1969J8492m6622j22352n8888l2010o7074
8107C5070o5455J205L1275K3550K456j28456M6743k8786L4483J36304M1971p8758
8095E1602M0003J30444K0415j61811n2774J21156n164n3206r9207k7096l5851
8084g1489J0237n0803P3229o5587O9560J61594R2169j35784j25481l9255O7617
8073a3993o112j22732p7054N0580L4203N2269J08508K5515j19282Q4478P5319
8062I1699J3448j3673n1788Q2787N7821j04311q0146j32359M9227j4500L910j013
8050i8898Q4429m3781J33933Q2906j7471P0974q0816k1616N0060R3251m8465J7847
8038B22353n8099q7044o5999J0316m1598R2369j0983k3583O8952M0960p5915q9069
$$ plain form
8119 -44543 -3159 60306 151552 317977 311555 343524 362016 315394 193042 134154 102144 35070
8107 35070 -30385 -29180 2095 25645 28101 -100355 -53612 -82398 -47915 88389 130360 51602
8095 51602 91605 222049 242464 80653 27879 149035 143871 90665 -8542 -35638 -71489
8084 -71489 -61252 -112055 -38826 -104413 -34853 126741 218910 83126 -42355 -81610 -13993
8073 -13993 -20105 -142837 -219891 -169311 -135108 -82839 25669 51184 -68098 16380 91699
8062 91699 105147 91474 39686 122473 180294 75983 -4163 -136522 -87295 -101795 -97885 -98898
8050 -98898 -14469 -58250 75683 158589 141118 212092 131276 109660 159720 252971 204506 222353
8038 222353 164254 77210 11211 21527 -20071 72298 61315 37732 106684 147644 71729 -17340
8026a7340L7695J6208J5602l0860j9904J44956N6160m9463j45502M6101K14031
8015B67684k6747j0087J34991j3013N9392J26961K2044l4236j95944p3241P956
8004B65760R9603J25376J33976J01594M3857P0426K4424n5071p1591j61717j54949
7993D21688n230M1986p4055j70370N2289r183J14594j05692J3894O7847p7321
7982B70447O9063l061p0445j534L2225p5721q3925O5896L6847J05743k7662j24667
7970A93206j09759O8985Q9693J3244J3926O6017M0204N387j6219k0819O757k7630
7958C22992l4581J9702J97480N6883O9536J75815m0192n1172j89316j80888r8318
7947B47941l5232N4251J19764n9045q3436J11313N8623j11642k4772J45435K9316
$$ plain form
8026 -17340 20355 36563 52165 21305 1401 146357 202517 153054 7552 53653 267684
8015 267684 240937 230850 365841 352828 412220 539181 561225 526989 331045 257804 265760
8004 265760 365363 490739 624715 726309 770166 840592 865016 809945 738354 576637 421688
7993 421688 416458 458444 384389 214019 266308 257125 371719 266027 279921 347768 270447
7982 270447 339510 336449 266004 264470 296695 220974 137049 202945 239792 345535 317873 193206
7970 193206 83447 152432 242125 255369 269295 335312 375516 380903 364684 343865 350622 322992
7958 322992 288411 308113 505593 562476 632012 807827 767635 716463 527147 346259 247941
7947 247941 212709 266960 386724 327679 244243 355556 414179 302537 277765 423200 452516
7936D52516j64825o4531L2250Q8577K6780P935o2057p1938k6872r8302r8191R5307
7924A16649M329Q0252l5424J85771N7397l1656N9899k7022j22624j08206k8171
7913A51194J11927K8178R9518k2670J0422j14355j30549l6580J47209q3887l0743
7902A29664o9796J2299M6659M5727Q8053K4450M9407J7041j34159o2314o5362
7891H1669P4380J44354r9034j30540P6435l3481k0449j00506P895p686n7137j15219
7879a79319K1288J21727K8244J8076J31019J58999p9802n8024k8708j95477n1793
7868a13770L2691P3028R2545M1064J6515m5083p1148m2648O5780J8882J15978
7857A83834P6534R991l1451j87128n7266O162j79923J6629K5606L9013k3887j1586
$$ plain form
7936 452516 287691 223160 255410 343987 370767 378702 316645 244707 217835 119533 21342 116649
7924 116649 120978 201230 165806 351577 408974 377318 437217 410195 287571 179365 151194
7913 151194 263121 291299 390817 368147 378569 264214 133665 97085 244294 160407 129664
7902 129664 59868 72167 118826 164553 252606 277056 326463 343504 209345 147031 81669
7891 81669 156049 300403 201369 70829 147264 113783 93334 -7172 723 -6963 -64100 -179319
7879 -179319 -158031 -36304 -8060 10016 141035 300034 220232 162208 133500 -61977 -113770
7868 -113770 -81079 -8051 84494 125558 142073 96990 25842 -16806 48974 67856 183834
7857 183834 260368 270359 238908 51780 -5486 676 -179247 -162618 -137012 -97999 -121886 -133472
7845a33472N5536J71097P7972o4969j28706n2799m1097J07560K766J0518m324
7834H2j05603J23410J15044L1899q2444m4655l8084m42J18610M0772o7113p9271
7822A2205n8612O166k4046j7088K09956m8214j36861J18461P8408q2290j9021
7811C9064m1163L1339K01606p5322k56084P9941K9669q7636N2640K0783J3883
7800H720M29k8491J10152L6321q6228o8726j17992l3048n4125m0847k793J28955
7788a47673J88734k13759o3987J22115M938N6199q4477p7947J07276K7588N265
7777g5728l3000J49595N0621r7312N1857M2126m2393j61691l0151j2327Q3843
7766g4560M6253P1561N922L776J14575J03094q8726k6168o3117N1902R1608r1313
$$ plain form
7845 -133472 -77936 93161 171133 106164 -22542 -75341 -116438 -8878 -6112 4406 82
7834 82 -105521 17889 132933 164832 82388 37733 -351 -793 117817 158589 91476 12205
7822 12205 -46407 -40241 -64287 -81375 128581 80367 -56494 61967 140375 58085 39064
7811 39064 -2099 29240 230846 155524 -100560 -20619 9050 -78586 -25946 -5163 8720
7800 8720 9149 -19342 90810 127131 40903 -27823 -145815 -178863 -232988 -273835 -276628 -147673
7788 -147673 41061 -172698 -236685 -114570 -109632 -53433 -137910 -215857 -108581 -80993 -75728
7777 -75728 -108728 40867 91488 -5824 46033 88159 45766 -115925 -146076 -158403 -74560
7766 -74560 -28307 43254 49176 52952 167527 270621 181895 155727 92610 144512 236120 144807
7754A44807j93533L409k6909L2723N1870l2976j70198j21028J04613P3763N3294
7743h0165J43421j09994k0010J48600J5314J40851l8025n9068k3384q1410j52601
7732a16471j31268O4956L7715m8961N4436O3373J13673R2919M36K93n8872j16990
7720d4761j2295m8667J20879m083Q672p4870M3278J0443l9767n3806J0281R4036
7708I340P0021k7419l4854J3984K407K1403Q7327L0667J2757k44288k5503n329
7696h9487j3645R1358o500j08281q6199j359K6059p4320P9125R3941j501J7335
7684g3474l3090K7831m462L5881L8175j00311j77787n1793R551K0329J86054N0904
7672g2192l5976R2744L6390q6288j9255R5740P660q042j5318O3162R3642O7233
$$ plain form
7754 144807 -48726 -45317 -72226 -39503 12367 -20609 -190807 -311835 -207222 -133459 -80165
7743 -80165 63256 -46738 -66748 81852 97166 238017 199992 140924 117540 36130 -116471
7732 -116471 -247739 -182783 -145068 -194029 -139593 -76220 37453 130372 130808 131101 72229 -44761
7720 -44761 -57056 -105723 15156 11073 19745 -55125 -11847 -1404 -41171 -94977 -84696 9340
7708 9340 79361 51942 17088 31072 33479 54882 142209 172876 185633 -58655 -84158 -89487
7696 -89487 -103132 -11774 -18274 -126555 -212754 -214113 -188054 -262374 -183249 -89308 -90809 -73474
7684 -73474 -106564 -78733 -83195 -47314 -9139 -109450 -287237 -339030 -329479 -309150 -123096 -72192
7672 -72192 -108168 -15424 20966 -65322 -84577 11163 18823 10781 -4537 58625 152267 219500
7660B19500J9464p385L9416n3002n2544l2550r3317p3646K6069l1142M1796k5252
7648b2593L8588j9181Q1142P6881k6796n1048o5754j48512J39418P7239l1030
7637D8354r612M9332R9520j0946j38474j51576n1276M2708J48751O6217j0583
7626H2415o2061R938K0248J05920q2628j20040M0363p1948Q2431Q4726K4954j45913
7614c1595k25963P7468O0095j5359M7978l5974K9868j57382j05246m5032J44901
7603b56241K88762Q972j61407l7428l8554o3711L4947L3466M0165P1247P569J29883
7591E7670q3327p8334J9537p7593r1255J63404J77980j18999r7523J8543M3569
7580f6328O2015P3095j31708j59218m0407M0566J07855O1671j61488j12201J43157
$$ plain form
7660 219500 238964 231579 270995 217993 165449 132899 39582 -34064 -7995 -39137 2659 -22593
7648 -22593 15995 -3186 77956 154837 128041 76993 11239 -137273 2145 79384 48354
7637 48354 38742 88074 187594 176648 38174 -113402 -164678 -121970 26781 92998 82415
7626 82415 20354 30292 50540 156460 73832 -46208 -5845 -77793 4638 89364 114318 -31595
7614 -31595 -257558 -180090 -119995 -135354 -87376 -123350 -93482 -250864 -356110 -401142 -256241
7603 -256241 32521 41493 -119914 -157342 -195896 -259607 -224660 -191194 -151029 -79782 -72213 57670
7591 57670 -25657 -103991 -84454 -162047 -253302 -89898 88082 -30917 -128440 -109897 -66328
7580 -66328 -4313 68782 -62926 -222144 -262551 -221985 -114130 -52459 -213947 -326148 -182991
7569a82991j2545o7655J71550J44730J8751j12184j97859J13903j2407R35P4236
7558f1536R0077q8002j10427M7600J99313p3166k4212R5216m0759j42322K2193
7547h6025O9074J06777l948j81420L6054K22968k8742k22875j33584M2325Q3851
7536i5545k2083m0864k1357o4575J73031O7775l8559m118K4101j05655J3454n0439
7524a64834l0809N3580j4007l6322Q9350o9195j80889L409J07972J87746J2355
7513d1644m6156q4581Q5162p323j0010p0683n0073Q6237R3821o8341R5962K32684
7501B15055j6112k95455j10662J4698j49795J80446K28466m8169L3888l017j7555
7490C1788j36928j45498k1446O1506N9776P5921k3502p8141j30341J2553J19797
$$ plain form
7569 -182991 -195536 -263191 -91641 53089 71840 -40344 -238203 -124300 -136707 -135772 -61536
7558 -61536 28541 -59461 -169888 -122288 77025 3859 -20353 74863 34104 -108218 -86025
7547 -86025 -16951 89826 85878 -95542 -59488 163480 134738 -88137 -221721 -179396 -95545
7536 -95545 -117628 -158492 -179849 -244424 -71393 -3618 -42177 -46295 -22194 -127849 -114395 -164834
7524 -164834 -195643 -142063 -156070 -192392 -103042 -172237 -353126 -349717 -241745 -53999 -41644
7513 -41644 -87800 -172381 -87219 -94542 -104552 -175235 -225308 -139071 -45250 -113591 -17629 215055
7501 215055 198943 -96512 -207174 -192476 -342271 -161825 66641 18472 52360 49343 31788
7490 31788 -105140 -250638 -272084 -210578 -150802 -74881 -98383 -176524 -306865 -294312 -174515
7479a74515Q7688l5871k45139J8210J71104J31283O6739J50898n1878j9486N6761
7468A55794j33586j16244k9929J36370M8645j8171m5535J23133Q1403j38163j17414
7457e3697p8024R1786r8483m1380M8552N6686Q0561O5409r9812p0368o5638L1135
7445a33273M0457q0304l7828N139R7321N8255j59435J2176J03345N5794n5819
7434i4172j35294j751k4617M1437M9232p2500o4265M8063R0067N2611J14151J54785
7422A57747n5776j74244M1288J01449k9415r201j775j14549m3861M0738k3128
7411a10727K5945n7876K1435J41827n4700j00218l2211M763j6721j35014N0757
7400b62740M3135J1250J30653O9589o7023j1713n6570j4108J53184J21859j7398
$$ plain form
7479 -174515 -86827 -122698 -367837 -349627 -178523 -47240 19499 170397 118519 99033 155794
7468 155794 22208 -94036 -123965 12405 61050 42879 -2656 120477 201880 63717 -53697
7457 -53697 -131721 -39935 -138418 -179798 -131246 -74560 6001 71410 -28402 -98770 -164408 -133273
7445 -133273 -92816 -173120 -210948 -205809 -108488 -50233 -209668 -197492 -94147 -38353 -94172
7434 -94172 -229466 -231217 -255834 -214397 -165165 -237665 -301930 -253867 -163800 -111189 2962 157747
7422 157747 101971 -72273 -30985 70464 41049 31848 30073 -84476 -128337 -87599 -110727
7411 -110727 -84782 -142658 -121223 20604 -34096 -134314 -166525 -161762 -178483 -313497 -262740
7400 -262740 -219605 -208355 -77702 -8113 -75136 -86849 -143419 -157527 -4343 117516 100118
7389A00118j91014k12204j4300l0200J52207O7248L2076J20288p1036N3262J22097
7378A28542R247J1606j18678M9759P58j04617Q4053Q832j41417j9703R728p1651
7366a53541l4942P2260L2744N3107N5845p0110l3280l3825M0871j1018R9863m4367
7354b6393K89J73214M7567k54226k2673J93078J2630n3711k1435o6403j15290
7343a33353l3482J93655J04570m2657k76891n0772n6452m4257m8877j212J48006
7332b41722L8750k6781O8414N6010Q1211K9200j24172M5238O508L7619J40029
7321A10304m4122j18906J9578m5688m7218m1137k5207L314o931J6241K7620j4769
7309a66921Q8024N5451p2495j4049K0833K7634k0266N7996J6155j9345K312j07579
$$ plain form
7389 100118 -90896 -303100 -317400 -347600 -195393 -128145 -96069 24219 -46817 6445 128542
7378 128542 137789 149395 30717 80476 81234 -23383 60670 69502 -71915 -91618 -81890 -153541
7366 -153541 -188483 -116223 -83479 -30372 25473 -44637 -77917 -111742 -70871 -81889 17974 -26393
7354 -26393 -26104 147110 194677 -59549 -82222 110856 123486 69775 48340 -18063 -133353
7343 -133353 -166835 26820 131390 88733 -188158 -238930 -295382 -339639 -388516 -389728 -241722
7332 -241722 -202972 -229753 -161339 -105329 -24118 5082 -119090 -73852 -67344 -29725 110304
7321 110304 66182 -52724 -33146 -78834 -126052 -167189 -192396 -189082 -196013 -179772 -152152 -166921
7309 -166921 -78897 -23446 -95941 -109990 -89157 -61523 -81789 -23793 -7638 -26983 -24671 -132250
7297a32250l6620J12131P52j58470Q7713P0607j05657o9063J5354P6788m1934
7286a80649N7260J10771J44822J00321j66501j29806R0060Q636J29320j50625
7276A3609l7610J49485j733n2147m3260N3800k3028j28632j26243n4024J52747
7265i7036R2014p4026J3693L8786p8717r795M3474O5617R1069N4036J03005K6790
7253B68910j10569j38849M671J4202N0886l4992k63892p8440J35343M8526L3489
7242g0715m4184m6218J8652K1841O7616j05231m8088K20047L5682n2555k2835
7231b5988l3709p5242l4440j9061M4759j26060k4867N7903K06079l5632j19422
7220a85680J54342J7522L8340O993r0564J0492n2390k2507P4394j998K1859j194
$$ plain form
7297 -132250 -168870 -56739 -55987 -214457 -126744 -56137 -161794 -230857 -215503 -138715 -180649
7286 -180649 -123389 -12618 132204 232525 66024 -63782 26278 34914 164234 13609
7276 13609 -24001 125484 123751 71604 28344 82144 59116 -69516 -195759 -249783 -97036
7265 -97036 -5022 -79048 -65355 -26569 -105286 -115081 -71607 -5990 85079 139115 242120 268910
7253 268910 158341 19492 24163 38365 89251 54259 -209633 -288073 -152730 -104204 -70715
7242 -70715 -114899 -161117 -142465 -120624 -53008 -158239 -206327 13720 49402 -3153 -25988
7231 -25988 -59697 -134939 -169379 -188440 -143681 -269741 -294608 -236705 -30626 -66258 -185680
7220 -185680 -31338 -13816 24524 31517 -59047 -48555 -100945 -123452 -49058 -51056 -29197 -30391
7208c0391K9356q5207K0673L3696k7670j29190j11542P5135J72952J30051m2183
7197C5680k5388J10266k12112o2751J62186N012j8529N3718l4418k0079J12684
7186A06269p691j12758k17603J43886R5816K0752l9710l8365n1166j28549r934
7175b39053r3516j62933M5913J58173K6030J39951M7617k44096n8459J7363P6775
7164b86235J39198J16967k2107O4673N1918k256Q7190P5712j00626o1074p9070
7153a5710K2673N485l7454k3067L8543j4467k9573j2656l033k777p7248o2062
7141b11346R1N3335J18649J067J05773l6782j23362j04942N5689J95476r8503
7130d4855j21121K9350K6239K9670N0521n9890j4738M3302K7085J1861K3649J834
$$ plain form
7208 -30391 -1035 -86242 -65569 -31873 -59543 -188733 -300275 -225140 -52188 77863 35680
7197 35680 10292 120558 -91554 -154305 7881 12893 -5636 48082 13664 -6415 106269
7186 106269 98578 -14180 -231783 -87897 7919 28671 -11039 -49404 -100570 -229119 -239053
7175 -239053 -332569 -495502 -449589 -291416 -265386 -125435 -77818 -321914 -380373 -363010 -286235
7164 -286235 -147037 -30070 -52177 12496 64414 62158 149348 225060 124434 63360 -15710
7153 -15710 6963 12448 -25006 -48073 -9530 -23997 -53570 -66226 -69259 -72036 -149284 -211346
7141 -211346 -211255 -157920 -39271 -38204 67569 30787 -92575 -197517 -141828 53648 -44855
7130 -44855 -165976 -136626 -110387 -80717 -30196 -90086 -104824 -61522 -34437 -22576 1073 2907
7118B907k058r6277q0406K8273O8586L1196o384O7227L885j0522j982l0321l7936
7105f3812r8592p3888O1620M3605m1955l9J90112R3432P7534P1604j6120n9892
7093A83609j76145r9837m2508J27492J27815J23044K725q1325o2076J31381j29726
7082A04449j64810m5407J00365J03745J9036j0631O8835J19181P0202j40746j82133
7071D2086P9619P5990k5385l077r5416N6959M670m8491j13119k0178r0214K702
7059a33854K35965J31484j3994j8957j37182j13888j16079M1680j0127r8433J8474
7048b14911R2498r9998l7549M1396J31825L825L3003r8417j60380p4087k5595
7037d08390Q9282J6494p6086O1341N8201O2903J65989N1280j47004q4138M1136
$$ plain form
7118 2907 849 -95428 -175834 -147561 -78975 -47779 -54163 13064 16949 6427 4445 -25876 -63812
7105 -63812 -162404 -236292 -174672 -131067 -173022 -173061 17051 110483 188017 259621 243501 183609
7093 183609 7464 -92373 -134881 -7389 120426 243470 246195 164870 102794 234175 104449
7082 104449 -60361 -105768 -5403 98342 117378 106747 175582 294763 364965 224219 42086
7071 42086 121705 197695 172310 169233 73817 130776 135446 86955 -26164 -46342 -136556 -133854
7059 -133854 102111 233595 219601 200644 63462 -50426 -166505 -124825 -134952 -233385 -214911
7048 -214911 -122413 -222411 -259960 -218564 -86739 -82914 -49911 -148328 -308708 -382795 -408390
7037 -408390 -319108 -302614 -378700 -317359 -259158 -196255 -30266 21014 -125990 -210128 -168992
7026a68992j19802p850O7475M3648j7186N5014J25123o839K061p379Q250L695
7014b2782O4950j39684L4970J67856L9654j19568j00124j68173Q0444K08198P0350
7003A16091p2287j28231K9J58677M6631n6568m4186j920K7941M2304O1604j66352
6991a6267q3767J27112j04433K2064J00052p1366r5421j0398j8985P6784Q6803
6980A2178R7879K6300p0364j44577k4643J00389n1933j03017Q7684N2303j7418
6969c5219k2479K0479P4286m8857l549K0572p2629N1256N238l6696j20637N8419
6957a09816J82429r0655o6040P9P0900p9548q8956M5175J25593J70146k4735n5381
6945G9191P3220r338J1500Q6323j38435k02354L8702R9505L1082k6888O3465J2649
$$ plain form
7026 -168992 -288794 -296644 -229169 -185521 -202707 -147693 -22570 -29409 -27348 -34727 -26477 -22782
7014 -22782 42168 -97516 -62546 105310 144964 25396 -74728 -242901 -162457 45741 116091
7003 116091 43804 -84427 -84398 74279 120910 64342 20156 18236 46177 88481 150085 -16267
6991 -16267 -100034 27078 -77355 -55291 44761 -26605 -122026 -132424 -151409 -74625 12178
6980 12178 110057 136357 65993 -78584 -103227 -2838 -54771 -157788 -70104 -17801 -35219
6969 -35219 -57698 -37219 37067 -11790 -15339 5233 -67396 -16140 -10902 -47598 -168235 -109816
6957 -109816 72613 -18042 -84082 -84003 -13103 -92651 -181607 -136432 -10839 159307 134572 79191
6945 79191 152411 143073 154573 240896 102461 -99893 -61191 38314 69396 42508 105973 118622
6933A18622r6514L7650K086O642m5711o4162n1573m0720N8566p954L2799R529
6921d0740O9333J25739J46849j46812j85197j2115O7088j6972J00481K4696p1081
6910F1269J4460k1267r9404k7077J00356J8287K3179K7787r5112p2279q1j17101
6898a86983l1189j06307K5038P1476l8505R2028m9193j9036J3725J1730R2307
6887a24909j2694p1188l1421M1825L2992N0604R6462k1423J7287O7923n6770j69351
6875a80663j50494N8714K41351O1781K1874J21658j08624j08581o5864q0783J4181
6864a75450j521P9196J09455P3740o9967r8398j4851R5557n2354q0141m5496l5954
6852b16184J01732M7882Q951j08306p2001J03598O6977m1874M8228P0163K3982
$$ plain form
6933 118622 22108 59758 61844 68486 22775 -41387 -92960 -133680 -75114 -83068 -50269 -40740
6921 -40740 28593 154332 301181 154369 -30828 -42943 24145 7173 107654 132350 61269
6910 61269 75729 54462 -44942 -72019 28337 46624 69803 97590 2478 -69801 -69882 -186983
6898 -186983 -218172 -324479 -299441 -227965 -266470 -174442 -223635 -242671 -228946 -217216 -124909
6887 -124909 -137603 -208791 -240212 -198387 -165395 -114791 -18329 -39752 -22465 45458 -11312 -180663
6875 -180663 -331157 -272443 -31092 30689 52563 174221 65597 -42984 -108848 -189631 -175450
6864 -175450 -176971 -97775 11680 85420 15453 -82945 -97796 -2239 -54593 -134734 -180230 -216184
6852 -216184 -114452 -66570 -57619 -165925 -237926 -134328 -67351 -109225 -60997 9166 33148
6841C3148j14782K0965Q3348J43416J6461o2697j8395n0190j6009K5285m8470
6830A2080l2391j20043l8339N29P6197J5398l6218m1167L9489l8941J12072k1561
6818g2895R1546M5785r9238J8705J60266N3924p7012j1470K7821M2056L6545O9041
6806B85074j83254j73262r064M8067N5197M458j0085q703K98k1317J4064J2063
6794A3536j26782k1882N6634J40465l9090j7561o1722K087Q6640l3657j1687m2511
6782e5530Q5478J2572p4543N1544q0716j6242P3964N0955M1020j02438j15548
6771a29484N3343J2312M8185O304K8869p8743n528L8478M3924q0302r053N6580
6759a5115K1616J34287L8000J06108q3092o2509N6738j1629l1286O6680K1401
$$ plain form
6841 33148 -81634 -60669 22679 166095 182556 119859 101464 51274 35265 60550 12080
6830 12080 -20311 -140354 -178693 -178164 -101967 -86569 -122787 -163954 -124465 -163406 -51334 -72895
6818 -72895 18651 64436 -34802 -16097 144169 198093 121081 109611 137432 179488 216033 285074
6806 285074 101820 -71442 -80506 -32439 22758 27216 17131 8428 8726 -12591 1473 13536
6794 13536 -113246 -135128 -78494 61971 22881 5320 -56402 -54315 32325 -1332 -13019 -55530
6782 -55530 29948 42520 -32023 19521 -61195 -77437 -3473 47482 88502 -13936 -129484
6771 -129484 -76141 -63829 -15644 -9340 19529 -59214 -64742 -26264 17660 -62642 -71695 -15115
6759 -15115 6501 140788 178788 284896 201804 139295 196033 184404 153118 219798 241199
6748B41199l9081j8513Q128j1908K6794m0871J1551m3414J6954j0135k1718M5752
6736A64738K03204Q9000O4940j27385j23210J40896l6978q6910J09940L1494J14767
6725E44496J76355K84150M61355M68642O49069O13326M20338J04954n35512q44666
6715B342507p31897m59370m44025k79624N3554k5422k2636J2873j30289j71667
6705A44004j35784k5126K2063J8866M6621L191J9067l7750J67743J7950k5569
6694B15276r9928p8115n6653m7888M9398L9269r456o005o166m5384o8804m3604
6682a58060N2674J9911o1354j1425k1065K1759P7164N0306P7447N4975J4424l1455
6670H5301n4373J39029J19443l6569k29063j12819K6574p7109M6121K6115p8007
$$ plain form
6748 241199 202118 183605 191733 179825 206619 165748 177299 133885 150839 140704 118986 164738
6736 164738 367942 456942 521882 394497 271287 412183 375205 288295 398235 429729 544496
6725 544496 720851 1005001 1466356 1934998 2584067 3197393 3617731 3722685 3187173 2342507
6715 2342507 1610610 1151240 707215 427591 481145 455723 433087 445960 315671 144004
6705 144004 8220 -16906 5157 24023 70644 73835 92902 55152 222895 240845 215276
6694 215276 115348 37233 -19420 -67308 -17910 21359 11903 5898 -268 -45652 -114456 -158060
6682 -158060 -105386 -85475 -146829 -158254 -179319 -157560 -80396 -30090 47357 102332 116756 85301
6670 85301 30928 169957 289400 252831 23768 -89051 -62477 -139586 -93465 -67350 -145357
6659a45357M902L6734K8785L1396N7997j10225o106J09511O7623P9410o0079L7491
6647A32082K9340o6837j20929o1802q8670K3935J00815j03942j03916Q1813P6375
6636a01736j5834L1677K0568Q5402k2988N9590M7694J44461q6500k05401j20990
6625a64057j11942M5428L5893J07027l3619Q3798O0645k6997P965l364o113L2718
6613B7382j4216Q231J3856m739p5454M2395n1614M4400j8434k5305k8698p3558
6601a55754P0048R5775J9584K3049m5643k2840n4119m4015J8531k6649Q6201J76899
6589A41067k2234q7724o1478r8668K9307J70555J12414o7760j03031k43540o5264
6578b96356k9880K5118P8622J6867M0321J12183Q1926j40762j06564J95457J19648
$$ plain form
6659 -145357 -140455 -103721 -74936 -43540 14457 -95768 -101874 7637 75260 154670 94591 132082
6647 132082 161422 94585 -26344 -88146 -176816 -152881 -52066 -156008 -259924 -178111 -101736
6636 -101736 -117570 -85893 -65325 20077 -2911 56679 104373 248834 162334 -43067 -164057
6625 -164057 -275999 -230571 -194678 -87651 -121270 -37472 23173 -3824 4141 777 -5336 27382
6613 27382 13166 21397 35253 30514 -44940 -2545 -54159 -9759 -28193 -53498 -82196 -155754
6601 -155754 -85706 10069 29653 52702 7059 -15781 -69900 -113915 -95384 -122033 -35832 141067
6589 141067 118833 31109 -30369 -129037 -99730 70825 183239 115479 12448 -231092 -296356
6578 -296356 -326236 -301118 -222496 -205629 -165308 -53125 28801 -111961 -218525 -23068 96580
6567I6580j14311j50494m020q4464j74574K9053J83104J24451J54918R02j22531
6556f1386j44743R86J06156J6704p5484O2897L5297r730J42410k6391q5767j63925
6544b02976r2876J52461R1270O1966J3999m4098O3885r3724k1885J9379l1347
6533h3946N6013J43349O4967r1872P7870m5171j40422r1155l3714J4934P1249
6522e7898R6050O3865k8523n1638j2539j9328q9037j04060j656J01282J27521
6511B4039K9991r8136M4904j39614j26578N5726J40417N4044k1805j73986O2196
6500a48802J48330J6600P2741M0155n6398l0293p5513N6819M4926j8856q8932
6489c9223J6428O2M4819P209j31012L547Q1601m3968P3079J5588J6370j20203
$$ plain form
6567 96580 -17731 -168225 -172245 -256709 -431283 -402230 -219126 -94675 60243 61145 -61386
6556 -61386 -206129 -205143 -98987 -82283 -157767 -94870 -59573 -69303 73107 46716 -39051 -202976
6544 -202976 -295852 -143391 -52121 9845 23844 -20254 43631 -50093 -71978 -52599 -83946
6533 -83946 -27933 115416 180383 88511 166381 121210 -19212 -110367 -144081 -129147 -57898
6522 -57898 38152 102017 73494 21856 9317 -10011 -99048 -203108 -204764 -103482 24039
6511 24039 54030 -44106 798 -138816 -265394 -209668 -69251 -15207 -37012 -210998 -148802
6500 -148802 -472 16128 88869 129024 72626 42333 -33180 23639 68565 49709 -39223
6489 -39223 -22795 -22733 22086 29295 -101717 -98170 -16569 -60537 12542 28130 44500 -75703
6477g5703n3929R735Q4780J5265R544N131K2815r5639j41013R7549P7533J1282
6465c2650m2404p7585o4487O4523M9875j09293Q3298M0353O5163O3520j01113
6454f0800j23369l4608J43208L3193O4623N5320n937P7009l2483k5000p9753l0511
6442a9108N9612q7897M9079n7241n0663J8361J05940J0528L4836M7678m8785q3357
6430b1017j63983k03638J4096j4935J52474J52884p4507q8854L9643M4615Q9263
6419g3959N3208M3384Q0239Q6843K9237j31658m9778J5386J5194l9233l554j23204
6407i7895P652j05890k7145M6191J5321O0177M1019J10190O905r3432M6789J60125
6395A70007Q0192j66141p9288K5021L9914J6886j41098n8589j2252L1606J10860
$$ plain form
6477 -75703 -129632 -119897 -35117 -19852 -10308 -5177 17638 -78001 -219014 -121465 -43932 -32650
6465 -32650 -75054 -152639 -217126 -152603 -102728 -212021 -128723 -88370 -23207 40313 -60800
6454 -60800 -184169 -218777 -75569 -42376 22247 77567 71630 148639 116156 91156 11403 -19108
6442 -19108 40504 -47393 1686 -55555 -106218 -87857 18083 28611 63447 111125 62340 -21017
6430 -21017 -185000 -388638 -374542 -389477 -237003 -84119 -158626 -247480 -207837 -163222 -73959
6419 -73959 -20751 22633 102872 189715 218952 87294 37516 52902 68096 28863 25309 -97895
6407 -97895 -90243 -196133 -223278 -177087 -161766 -101589 -60570 49620 56525 -36907 9882 170007
6395 170007 250199 84058 4770 29791 69705 86591 -54507 -113096 -125348 -93742 17118
6384A7118K9469j13679j03686N6384J99443O4443P5470k0075j59514k8219k8408
6373a1254m2584j8466Q708j8776M7858M0534l2145o3410M9881O4538j08205j03679
6361a87000J64197o9391p4944R3119l5094j0295O4302O7410m0950l7334P2962
6350F982j9429o3874r0755J3808J26470L9446r985r1961M2638M449L6635l679
6338i255L2830M801j10372M7117o1324j10480L1911j01331j00991M1766N2309
6327b83019J60853J17167q9317P8837P5955r6810j19487J08940L7801n3716k2039
6316h4835J8718J12650J61246j40826k64307M7533N2783r7367r3059J20467J34485
6305c2512j02257j35537O9934o501L6208Q0748j3380m4254K6135J4569O8809o0020
$$ plain form
6384 17118 46587 -67092 -170778 -114394 85049 149492 224962 204887 45373 17154 -11254
6373 -11254 -53838 -72304 -63596 -82372 -34514 6020 -26125 -89535 -39654 24884 -83321 -187000
6361 -187000 -22803 -92194 -167138 -74019 -109113 -119408 -55106 12304 -28646 -65980 6982
6350 6982 -12447 -76321 -167076 -153268 -26798 12648 2663 -89298 -46660 -42211 -5576 -9255
6338 -9255 23575 28376 -81996 -34879 -96203 -206683 -174772 -276103 -377094 -335328 -283019
6327 -283019 -122166 -4999 -94316 -15479 60476 -36334 -155821 -46881 -9080 -62796 -84835
6316 -84835 -66117 46533 207779 66953 -197354 -149821 -97038 -194405 -287464 -166997 -32512
6305 -32512 -134769 -270306 -200372 -206873 -170665 -89917 -103297 -147551 -121416 -106847 -38038 -98058
6293i8058o9794j6960Q5192o8801O0378j21902j25574K37004K55257j285J5003
6282A50460q5184n505m8826m4410K2713P5641L3409k9865o050l5867j0920j2400
6270C196L0133o0756q8308J33697L6175K169O5845L6362p8485m2928k9172o5911
6258e7983n5550N8511N0143J40746Q001j82898j71975j6959N0670R9255N0993
6247b7046Q2737j524O1350l4271j63553n0581q1508m984O5006R0651K6254o8284
6235a05753o4108J7661O5503n4613m7218l0183L8819J05905k587K4966Q6334M8767
6223H3493m8806o8829J6076J0312L1799J42994j4742n4072j20666m5193L7570
6212c0064J26126m3509q0551K5512Q6156r929J00221n6974K1087n8462o1574J5115
$$ plain form
6293 -98058 -167852 -184812 -99620 -168421 -108043 -229945 -355519 -118515 136742 135457 150460
6282 150460 65276 59771 10945 -33465 -10752 64889 98298 68433 62383 26516 15596 3196
6270 3196 33329 -27427 -115735 17962 54137 56306 122151 158513 80028 37100 7928 -57983
6258 -57983 -113533 -55022 -4879 135867 143868 -39030 -211005 -227964 -177294 -78039 -27046
6247 -27046 55691 54167 115517 81246 -82307 -132888 -214396 -219380 -154374 -63723 -37469 -105753
6235 -105753 -169861 -152200 -86697 -141310 -188528 -218711 -179892 -73987 -76574 -51608 34726 83493
6223 83493 34687 -34142 -18066 -7754 24045 167039 152297 98225 -22441 -67634 -30064
6212 -30064 96062 52553 -27998 -2486 83670 73741 173962 116988 138075 79613 18039 33154
6200C3154N311p0031J25776O191n8464n9883p5898l5488K5798k1565P0997P8000
6188B3898L6657Q3148j79461p4063j03772L0460Q8256L4886m0549J38047K9702
6177F7209p0465k2519n0638q6711o1259n0326M5130J32261k9350l9770N1225J13819
6165a394p1703j97966N1791J0370J4810P833N1546l3638J03998P6886j10159J1561
6153h6065O5403m0098r0998j027P0031J19099K0024N0326j8076J42647p3023j33677
6141B4566r0298k6782j11263m1050J1520O3391j0878m9459j48244Q8467J29662
6130a60368M6264L433k392n8062j8318J06737O261l3578m479N2173k3323Q6105
6118D53j4402k1270o9738j45136M1688J10294m724M3039M1919n2266m7126o321
$$ plain form
6200 33154 38465 -31566 94210 100401 41937 -17946 -93844 -129332 -103534 -125099 -54102 23898
6188 23898 60555 143703 -35758 -109821 -213593 -183133 -94877 -59991 -100540 37507 67209
6177 67209 -3256 -25775 -76413 -163124 -224383 -274709 -229579 -97318 -126668 -166438 -115213 -1394
6165 -1394 -73097 -271063 -219272 -208902 -194092 -186259 -134713 -168351 -64353 12533 -97626 -86065
6153 -86065 -20662 -60760 -151758 -152785 -82754 36345 56369 106695 88619 231266 158243 24566
6141 24566 -65732 -92514 -203777 -244827 -233307 -169916 -180794 -230253 -378497 -290030 -160368
6130 -160368 -114104 -110671 -113063 -171125 -189443 -82706 -76445 -110023 -114502 -62329 -85652 453
6118 453 -13949 -35219 -104957 -250093 -208405 -98111 -102835 -59796 -17877 -70143 -117269 -123590
6106a23590P6507J09928M6673j47463j42392j061k0379J28848J82463k5851n917
6095G7766l7817j04975j59851M0028J34461j1804k1563L3406M6944k9740n1563
6084h4708j16245J980P8851n2342J1451J75140J39278j18658p9215L6983q733
6073a6218o1987O8853K5469m8234l4775N8978K2065N4613J57525j62252K3994
6062H8031j16185j55012j6005k0192p857L4986M7546K3241K1684R205j8987K5804
6050h3741K13522j10891j50081j6298M621k2233j0684J09531o6375P8930O6645
6039A2946n3895o2041R5105l107j30391P6545J46645l3238l0746k6336J16114
6028A07601N8104r9241k0798K5300q5414j6513l287r675l9718r5734j61188K5529
$$ plain form
6106 -123590 -47083 62845 109518 -37945 -180337 -181398 -201777 -72929 109534 83683 77766
6095 77766 39949 -65026 -224877 -184849 -50388 -62192 -83755 -50349 -3405 -33145 -84708
6084 -84708 -200953 -198973 -120122 -172464 -161013 14127 153405 34747 -44468 -7485 -16218
6073 -16218 -78205 -9352 16117 -32117 -66892 -7914 14151 68764 226289 64037 88031
6062 88031 -28154 -183166 -199171 -219363 -227220 -192234 -144688 -121447 -99763 -90558 -109545 -83741
6050 -83741 129781 18890 -131191 -147489 -142868 -165101 -175785 -66254 -132629 -53699 12946
6039 12946 -40949 -102990 -7885 -10992 -141383 -64838 81807 48569 17823 -8513 107601
6028 107601 165705 66464 45666 70966 -14448 -30961 -34248 -43923 -83641 -179375 -340563 -315034
6016c15034J38438K12876m3049j8174M6061M4779J1076p5386j22598M2543L5372
6005d3096J03338K9705M0736j11269q1744j30242j8513J53217p0394j29100j65674
5994d23036J9063J47296J59486R5677Q8148M4580j4438k6593P827M2716J49779
5983B90505j05597j70525p2297K0516q0471P685k9546n2212j339r5901p318K9113
5971b67387M9662R9969L0144R7846l9367o9300r3509l7489K7034Q6441K13163
5960I7207K09428l1024j34216o1261L4319L4348P5498l8676k02668j34832m4351
5949a96228j7838j6029j7788J50609N6378o2012K5073J27296j06773q9777N1947
5938i5142P7254m325l1995j1391Q9278j10657j15039j07454L6818K11169Q7240
$$ plain form
6016 -315034 -176596 36280 -6769 -24943 21118 65897 76973 1587 -121011 -78468 -43096
6005 -43096 60242 89947 130683 19414 -62330 -192572 -211085 -57868 -128262 -257362 -423036
5994 -423036 -403973 -256677 -97191 -1514 86634 131214 116776 90183 98010 140726 290505
5983 290505 184908 14383 -57914 -37398 -117869 -110184 -139730 -191942 -193281 -289182 -296500 -267387
5971 -267387 -217725 -117756 -87612 10234 -29133 -98433 -191942 -229431 -202397 -115956 97207
5960 97207 306635 275611 141395 80134 114453 148801 224299 185623 -17045 -151877 -196228
5949 -196228 -214066 -230095 -247883 -97274 -40896 -102908 -77835 49461 -57312 -147089 -95142
5938 -95142 -17888 -22213 -54208 -65599 23679 -86978 -202017 -309471 -272653 -61484 25756
5927B5756m8394k6319J60140m5433k4436j09940N8589J30428q5666j31243r7070
5916a93588l9751J28169J29874N8113l6348j498k4797M1395k056j32499L8142
5905c4844J0680J3637l4235l2202j72674j81701J64191K30469J01645j38153j19256
5894a92443o864M6318j0226q1362P18J0111J5333J5278R1123P6581K02467L4356
5882B01390j56625j11110P6040Q4492J52414J18280j38160M4876J75593n3604
5872C93586r1043j70677q6007N0978kp1994J20991K0661j40521l8476N1108k6671
5860A1933j6800L3798K8458m4523P0182L469j15333j09804L6424J4l0785L2183
$$ plain form
5927 25756 -22638 -48957 111183 65750 41314 -68626 -10037 120391 34725 -96518 -193588
5916 -193588 -233339 -105170 24704 82817 46469 44971 20174 61569 59513 -72986 -34844
5905 -34844 -24164 -10527 -44762 -76964 -249638 -431339 -267148 -36679 64966 -73187 -192443
5894 -192443 -199307 -152989 -163215 -244577 -243859 -233748 -218415 -203137 -112014 -35433 167034 201390
5882 201390 44765 -66345 9695 94187 246601 364881 226721 271597 447190 393586
5872 393586 302543 131866 45859 96837 96835 24841 145832 166493 25972 -12504 38604 11933
5860 11933 -4867 28931 57389 12866 83048 86517 -28816 -138620 -102196 -102182 -132967 -100784
$$ [...]
##END NTUPLES=NMR SPECTRUM
##END=
