##TITLE=Analysis number 324297
Compound Code mo 00359
Book Reference 499/144/8
Project Code adrs
Chemist Name stuartg
##JCAMPDX= 6.0         $$ Bruker NMR JCAMP-DX V2.0
##DATA TYPE= NMR SPECTRUM
##DATA CLASS= NTUPLES
##ORIGIN= Bruker BioSpin GmbH
##OWNER= nmr
$$ XWIN-NMR		Version 3.5
$$ Fri Nov 17 12:42:15 2006 GMT Standard Time (UT+0h)  MAYBRIDGE\nmr@NMR_250MHZ
##.OBSERVE FREQUENCY= 250.131544655141
##.OBSERVE NUCLEUS= ^1H
##.ACQUISITION MODE= SIMULTANEOUS (DQD)
##.ACQUISITION SCHEME= undefined
##.AVERAGES= 16
##.DIGITISER RES= 18
##SPECTROMETER/DATA SYSTEM= dpx250
##.PULSE SEQUENCE= zg30
##.SOLVENT NAME= CDCl3
##.SHIFT REFERENCE= (INTERNAL, CDCl3, 0, 16.522)
##AUDIT TRAIL= $$ (NUMBER, WHEN, WHO, WHERE, WHAT)
$$ ##TITLE= Audit trail, XWIN-NMR		Version 3.5
$$ ##JCAMPDX= 5.01
$$ ##ORIGIN= Bruker BioSpin GmbH
$$ ##OWNER= nmr
$$ C:\u/data/dgb/nmr/ADRS/600/pdata/1/auditp.txt
$$ ##AUDIT TRAIL=  $$ (NUMBER, WHEN, WHO, WHERE, WHAT)
(   1,<2006-11-17 12:41:29.80 +000>,<MAYBRIDGE\nmr>,<NMR_250MHZ>,
      <created by zg, POWCHK disabled, PULCHK disabled
       configuration hash MD5:
       49 4B E0 1D 92 C2 6B 37 9F E6 65 BC 52 41 86 1D
       data hash MD5: 64K
       7C 15 A9 D5 0E DD 70 9A 38 6D 57 FC C4 4F AB F5>)
(   2,<2006-11-17 12:41:52.10 +000>,<MAYBRIDGE\nmr>,<NMR_250MHZ>,
      <Start of raw data processing
       ef LB = 0.3 FT_mod = 6 PKNL = 1 SI = 32K 
       data hash MD5: 32K
       E7 92 F1 AA 78 0C A3 E2 FB E5 EE 5E 95 DD 08 B9>)
(   3,<2006-11-17 12:41:56.92 +000>,<MAYBRIDGE\nmr>,<NMR_250MHZ>,
      <apk 
       data hash MD5: 32K
       E7 51 70 99 60 25 90 12 93 B3 FF 9C C0 3B 99 B4>)
(   4,<2006-11-17 12:41:58.60 +000>,<MAYBRIDGE\nmr>,<NMR_250MHZ>,
      <abs ABSG = 5 
       data hash MD5: 32K
       27 90 61 70 E9 19 8E B6 15 8A 7D 79 5A 9B 55 9F>)
$$ ##END=
$$ 
$$ hash MD5
$$ DE 01 5C 02 26 FC 65 A7 45 65 63 73 C1 DC 3D EF
##$RELAX= 
##$RELAX= 
##$RELAX= 
##$RELAX= 
##$RELAX= 
##$RELAX= 
##$RELAX= 
$$ Bruker specific parameters
$$ --------------------------
##$DU= <C:\u>
##$EXPNO= 600
##$NAME= <ADRS>
##$PROCNO= 1
##$TYPE= <nmr>
##$USER= <dgb>
##$AMP= (0..31)
100 100 100 100 100 100 100 100 100 100 100 100 100 100 100 100 100 100 
100 100 100 100 100 100 100 100 100 100 100 100 100 100 
##$AQSEQ= 0
##$AQ_mod= 3
##$AUNM= <au_zg>
##$AUTOPOS= <30 >
##$BF1= 250.13
##$BF2= 250.13
##$BF3= 250.13
##$BF4= 250.13
##$BF5= 500.13
##$BF6= 500.13
##$BF7= 500.13
##$BF8= 500.13
##$BYTORDA= 1
##$CFDGTYP= 0
##$CFRGTYP= 5
##$CHEMSTR= <none>
##$CNST= (0..31)
1 1 145 1 1 1 1 1 1 1 1 1 1 1 1 1 1 1 1 1 1 1 1 1 1 1 1 1 1 1 1 1 
##$CPDPRG= <>
##$CPDPRG1= <>
##$CPDPRG2= <>
##$CPDPRG3= <>
##$CPDPRG4= <mlev>
##$CPDPRG5= <mlev>
##$CPDPRG6= <mlev>
##$CPDPRG7= <mlev>
##$CPDPRG8= <mlev>
##$CPDPRGB= <>
##$CPDPRGT= <>
##$D= (0..31)
0 1 0 0 0 0 0 0 0 0.06 0 0 0 0 0 0 0.0002 0 0 0 0 0 0 0 0 0 0 0 0 0 0 
0 
##$DATE= 1163767288
##$DBL= (0..7)
120 120 120 120 120 120 120 120 
##$DBP= (0..7)
150 150 150 150 150 150 150 150 
##$DBP07= 0
##$DBPNAM0= <>
##$DBPNAM1= <>
$$ [...]
##$SUBNAM7= <"">
##$SUBNAM8= <"">
##$SUBNAM9= <"">
##$SW= 20.6930455092707
##$SWIBOX= (0..15)
0 0 3 0 0 0 0 0 0 0 0 0 0 0 0 0 
##$SW_h= 5175.983436853
##$TD= 65536
##$TD0= 1
##$TE= 683.16
##$TE2= 300
##$TE3= 300
##$TEG= 300
##$TL= (0..7)
0 120 120 120 120 120 120 120 
##$TP= (0..7)
150 150 150 150 150 150 150 150 
##$TP07= 0
##$TPNAME0= <>
##$TPNAME1= <>
##$TPNAME2= <>
##$TPNAME3= <>
##$TPNAME4= <>
##$TPNAME5= <>
##$TPNAME6= <>
##$TPNAME7= <>
##$TPOAL= (0..7)
0.5 0.5 0.5 0.5 0.5 0.5 0.5 0.5 
##$TPOFFS= (0..7)
0 0 0 0 0 0 0 0 
##$TUNHIN= 0
##$TUNHOUT= 0
##$TUNXOUT= 0
##$USERA1= <user>
##$USERA2= <user>
##$USERA3= <user>
##$USERA4= <user>
##$USERA5= <user>
##$V9= 5
##$VALIST= <valist>
##$VCLIST= <CCCCCCCCCCCCCCC>
##$VD= 0
##$VDLIST= <DDDDDDDDDDDDDDD>
##$VPLIST= <PPPPPPPPPPPPPPP>
##$VTLIST= <TTTTTTTTTTTTTTT>
##$WBST= 1024
##$WBSW= 4
##$XGAIN= (0..3)
0 0 0 0 
##$XL= 0
##$YL= 0
##$YMAX_a= 570571
##$YMIN_a= -485801
##$ZGOPTNS= <>
##$ZL1= 120
##$ZL2= 120
##$ZL3= 120
##$ZL4= 120
##$ABSF1= 16.522
##$ABSF2= -4.171173
##$ABSG= 5
##$ABSL= 3
##$ALPHA= 0
##$AQORDER= 0
##$ASSFAC= 0
##$ASSFACI= 0
##$ASSFACX= 0
##$ASSWID= 0
##$AUNMP= <proc_1d>
##$AZFE= 0.1
##$AZFW= 0.1
##$BCFW= 0
##$BC_mod= 0
##$BYTORDP= 0
##$COROFFS= 0
##$CY= 12.5
##$DATMOD= 1
##$DC= 0
##$DFILT= <>
##$DTYPP= 0
##$F1P= 14.0000005364418
##$F2P= -0.99999901652339
##$FCOR= 0.5
##$FTSIZE= 32768
##$FT_mod= 6
##$GAMMA= 0
##$GB= 0
##$INTBC= 1
##$INTSCL= 1
##$ISEN= 128
##$LB= 0.3
##$LEV0= 0
##$LPBIN= 0
##$MAXI= 10000
##$MC2= 0
##$MEAN= 0
##$ME_mod= 0
##$MI= 0
##$NCOEF= 0
##$NC_proc= -4
##$NLEV= 6
##$NOISF1= 0
##$NOISF2= 0
##$NSP= 0
##$NTH_PI= 0
##$NZP= 0
##$OFFSET= 16.522
##$PC= 1
##$PHC0= -47.93448
##$PHC1= 19.24043
##$PH_mod= 1
##$PKNL= yes
##$PPARMOD= 0
##$PSCAL= 4
##$PSIGN= 0
##$REVERSE= no
##$SF= 250.13
##$SI= 32768
##$SIGF1= 0
##$SIGF2= 0
##$SINO= 400
##$SIOLD= 32768
##$SREGLST= <1H.CDCl3>
##$SSB= 0
##$STSI= 32768
##$STSR= 0
##$SW_p= 5175.98343685301
##$SYMM= 0
##$S_DEV= 0
##$TDeff= 65536
##$TDoff= 0
##$TI= <Analysis number 999999
Compound Code 99
Book Reference 9
Project Code 9>
##$TILT= no
##$TM1= 0
##$TM2= 0
##$TOPLEV= 0
##$USERP1= <user>
##$USERP2= <user>
##$USERP3= <user>
##$USERP4= <user>
##$USERP5= <user>
##$WDW= 1
##$XDIM= 32768
##$YMAX_p= 468245075
##$YMIN_p= -416272
$$ End of Bruker specific parameters
$$ ---------------------------------
##NTUPLES= NMR SPECTRUM
##VAR_NAME=  FREQUENCY,     SPECTRUM/REAL,   SPECTRUM/IMAG
##SYMBOL=    X,             R,               I
##VAR_TYPE=  INDEPENDENT,   DEPENDENT,       DEPENDENT
##VAR_FORM=  AFFN,          ASDF,            ASDF
##VAR_DIM=   32768,         32768,           32768
##UNITS=     HZ,            ARBITRARY UNITS, ARBITRARY UNITS
##FACTOR=    0.157963299565203, 1,           1
##FIRST=     4132.6476996994, 0,             0
##LAST=      -1043.33573715361, 0,           0
##MIN=       -1043.33573715361, -416272,     0
##MAX=       4132.6476996994, 468245075,     0
$$ Real data points
##PAGE= N=1
##DATA TABLE= (X++(R..R)), XYDATA
$$ [...]
25051A36531L2415m3553l676j00390O4854N7060m1972K8933N1842j03476j03540
$$ 136531 168946 125393 121717 21327 86181 143241 101269 130202 182044 78568 -24972
25040b4972M6311J927o9427q127l5362K822O1674o9463m7691n0223r058L1379
$$ -24972 21339 23266 -46161 -54288 -89650 -86828 -25154 -94617 -142308 -192531 -201589 -170210
25028a70210m09K3134Q1940J1297p1567K7986J46160J858j59933o0076P2971K330
$$ -170210 -170619 -147485 -65545 -54248 -125815 -97829 48331 50189 -109744 -169820 -96849 -94519
25016i4519k5421Q0068J06199k2648m2809l0018m7651J0004R466N7732m6646n334
$$ -94519 -119940 -39872 66327 43679 870 -29148 -76799 -66795 -57329 403 -46243 -51577
25004e1577n0092k193K2640J1709Q312P9152K1197r2333J01927K5271j08907l5787
$$ -51577 -101669 -103862 -81222 -69513 -61201 17951 39148 -53185 48742 74013 -34894 -70681
24992g0681n1548Q3215J03156R5369m2691j8025m6361K7373r9277m5020j12432
$$ -70681 -122229 -39014 64142 159511 116820 98795 52434 79807 -19470 -64490 -176922
24981a76922j23405J58887J53465J09775N5486m359J4978j51894R486L0353n3458
$$ -176922 -300327 -141440 12025 121800 177286 172927 187905 36011 45497 75850 22392
24970B2392o8727m4504R97o447L3590J9661M8632q913p8479K3434J2381J5712
$$ 22392 -46335 -90839 -89842 -96289 -62699 -43038 5594 -3319 -81798 -58364 -45983 -30271
24958c0271m4216l1844P3039R39j0950k4786N6815J19711L5270M7091j06150j25811
$$ -30271 -74487 -106331 -33292 -32353 -43303 -68089 -11274 108437 143707 190798 84648 -41163
24946d1163o731j318L6411R8460P351l3236J8027o0482K4909N8427o0322M7863
$$ -41163 -47894 -49212 -12801 85659 93010 59774 77801 17319 42228 100655 40333 88196
24934H8196N4494q5639j43752J12258R9472M0083p2186l8576m2659q3291m3203
$$ 88196 142690 57051 -86701 25557 125029 165112 92926 54350 11691 -71600 -114803
24923a14803P6649O6321M017K0529q581m8186J4087q9776n5128l2959P4066O6783
$$ -114803 -38154 28167 32184 52713 44132 -4054 10033 -79743 -134871 -167830 -93764 -26981
24911b6981J68726N5115r7615p5043m4786l6037m1779L8725Q1240m3185o6665
$$ -26981 141745 196860 99245 24202 -20584 -56621 -98400 -59675 21565 -21620 -88285
24900h8285Q6555p5163K341J91500j9811o9772j0010o3119M0573N8861j07681
$$ -88285 -1730 -76893 -74552 116948 97137 27365 17355 -45764 -5191 53670 -54011
24889e4011j34982K553Q00O3600Q3970J14539L7841n9486k2190M307J1499j3279
$$ -54011 -188993 -186440 -185640 -122040 -38070 76469 114310 54824 32634 36941 48440 35161
24877C5161p7344J6590n8602q5299n060n2492K0469O5483o404J49105M2125l0663
$$ 35161 -42183 -25593 -84195 -169494 -174554 -227046 -206577 -141094 -147498 1607 43732 13069
24865A3069M3049j710J0126o1473K1750O2071K2580n3598L5605J828j01803j36099
$$ 13069 56118 54408 64534 3061 24811 86882 109462 55864 91469 93297 -8506 -144605
24853a44605l3368k7283Q0764N5355J12154L5265q0591l3556j4749K6201N8518
$$ -144605 -177973 -205256 -124492 -69137 43017 78282 -2309 -35865 -50614 -24413 34105
24842C4105K8653K4499r1007q1687J93751J04411q9209j32893p3391k3720M8460
$$ 34105 62758 87257 -3750 -85437 108314 212725 123516 -9377 -82768 -106488 -58028
24831e8028K0121q690J21094N2650p7476n8082J2573r7589l1240Q6419R8377L1312
$$ -58028 -37907 -46597 74497 127147 49671 -8411 4162 -93427 -124667 -38248 60129 91441
24819I1441m9845l4349n9940n7113j2884l4590J7817L4386R8702l2001L0076Q0320
$$ 91441 41596 7247 -52693 -109806 -122690 -157280 -139463 -105077 -6375 -38376 -8300 72020
24807G2020q060j6257o3911L7332J43375J1958P3620m3559r6949n7424p3734Q7377
$$ 72020 63960 47703 -16208 21124 164499 176457 250077 206518 109569 52145 -21589 65788
24795F5788J0217m3817M516r18R5415q158p3538j22418m8684k8382j6738P6297
$$ 65788 76005 32188 36704 35786 131201 123043 49505 -72913 -121597 -149979 -166717 -90420
24783i0420M9048p665n0186J10042N4431J3498O373L6819o1155m8190L9418M4611
$$ -90420 -41372 -49037 -99223 10819 65250 78748 85121 121940 60785 12595 52013 96624
24771I6624Q5441J9617r2804p1659p7293j21623J7136N3509n5298p4328l7765
$$ 96624 182065 201682 108878 37219 -40074 -161697 -144561 -91052 -146350 -220678 -258443
24760b58443j06384R1297J47594J3662K2161K4265j309o58o3270R521L1957j8717
$$ -258443 -364827 -273530 -125936 -112274 -90113 -65848 -67157 -67815 -131085 -121564 -89607 -108324
24748a08324n3098J06528j7432q9565R3768P9668K1431n2827K9515P2189K2059
$$ -108324 -161422 -54894 -72326 -161891 -68123 11545 32976 -19851 9664 81853 103912
24737A03912l2179p2652l9706M033n2406r292K4032k7398o2939N3967k6126R5106
$$ 103912 71733 -919 -40625 -36592 -88998 -98290 -74258 -101656 -164595 -110628 -136754 -41648
24725d1648P4620J2726L3182J6846k6915m4244J9028n1144M7909k1237J17690
$$ -41648 32972 45698 78880 95726 68811 24567 43595 -7549 40360 19123 136813
24714A36813N5276n8912k4012k3630K0650l2650r9547R4860l8689N740M103N420
$$ 136813 192089 133177 109165 85535 106185 73535 -26012 68848 30159 35899 40002 45422
24702D5422j24184J0668j6523j210J04192J17344M2552k9035K9714n9231j6686
$$ 45422 -78762 -68094 -84617 -85827 18365 135709 178261 149226 178940 119709 103023
24691A03023l4825j56765m6170J3752J13444L0187n6216j9168m5542m9008L7338
$$ 103023 68198 -88567 -134737 -120985 -7541 22646 -33570 -52738 -98280 -147288 -109950
24680a09950m5204J4713j969M5898P6949m1057o2942J05624R1041r0506j39696
$$ -109950 -155154 -140441 -142410 -96512 -19563 -60620 -123562 -17938 73103 -17403 -157099
24669a57099O9354P4855J72640k418j48123Q626N0028m3140l1667J3770N5404
$$ -157099 -87745 -12890 159750 157332 9209 17835 67863 24723 -6944 6826 62230
24658F2230m3114n4015L2036O3612m340q0195P667M6158N2872m1512n4633P130
$$ 62230 19116 -34899 -2863 60749 56409 -23786 -16119 30039 82911 41399 -13234 -6104
24646f104j8183n6055l4537J8987M0440J58314k9040q6572j9789N1919K1047p7217
$$ -6104 -24287 -80342 -114879 -95892 -55452 102862 73822 -12750 -32539 19380 40427 -36790
24634c6790Q6475J01386j3595l0848o4730o8341P1790o7902j7915K7048m1623
$$ -36790 49685 151071 137476 106628 41898 -26443 45347 -22555 -40470 -13422 -55045
24623e5045Q94q245P1603R5964R6144j0073j49784n1468k3606M8322P9708j09743
$$ -55045 -54151 -62396 9207 105171 201315 191242 41458 -10010 -33616 14706 94414 -15329
24611a5329p4050j0842J1320J18006K1819j197l7448J5256L1809m2735n1157Q5627
$$ -15329 -89379 -100221 -88901 29105 50924 49727 12279 27535 59344 16609 -34548 51079
24599E1079J6092o7231l3425J51615k6494q1266J7488k8094m9869R065O737N2251
$$ 51079 67171 -60 -33485 118130 91636 10370 27858 -236 -50105 -41040 -34303 17948
24587A7948J2884q090Q84R9010J04447m4346l5985j10589K8625K3078L5115j6395
$$ 17948 30832 22742 23626 122636 227083 182737 146752 36163 64788 87866 122981 106586
24575A06586l6894o4683O2587M0993p8515j41859p382K8184L3444J10591L4795
$$ 106586 69692 5009 67596 108589 30074 -111785 -119167 -90983 -57539 53052 87847
24564H7847n6753j0356j3071n4135K8477R369L8237L0818R091o740k4675p0213
$$ 87847 31094 20738 7667 -46468 -17991 -8622 29615 60433 69524 62784 38109 -32104
24552c2104J7172P5585K2950J0274K3434N8248p3236m7965N2589o5227M4829k2992
$$ -32104 -14932 60653 83603 93877 117311 175559 102323 54358 106947 41720 86549 63557
24540F3557j0801o4810l797P9046k6337j44601q7091R5029r350k3092P1415J19071
$$ 63557 52756 -12054 -15851 63195 36858 -107743 -194834 -99805 -109155 -132247 -60832 58239
24528E8239M6037j0940k1218M5078l723o7613l3741l3894K4380M0450N017o579
$$ 58239 104276 93336 72118 117196 113473 45860 12119 -21775 2605 43055 48072 41493
24516D1493k1171o125K5565k4408N0255r1159j97232l9796M8777Q3632O9535L8758
$$ 41493 20322 14197 39762 15354 65609 -25550 -222782 -262578 -213801 -130169 -60634 -21876
24504b1876m3634l1855O177m3220n2473M3300J54855J6413j3213n4466L4891O7999
$$ -21876 -65510 -97365 -91188 -134408 -186881 -143581 11274 27687 14474 -39992 -5101 62898
24492F2898m9128K3140N8936o155o1481j46794K7419L4132Q2279N2886n5338J00048
$$ 62898 13770 36910 95846 89691 28210 -118584 -91165 -57033 25246 78132 22794 122842
24480A22842K4624o1080m2529L8646l3005J3629o855Q7724l3413p5160K6417l4863
$$ 122842 147466 86386 43857 82503 49498 63127 56272 143996 110583 35423 61840 26977
24468B6977L7403L6979m0197M6603N9075M0381l3059r276J8920l7566j20960M565
$$ 26977 64380 101359 61162 107765 166840 207221 174162 164886 183806 146240 25280 29845
24456B9845j8157R5733j0732n7072l2284J7134M2811k3818n5814l989J4613P2743
$$ 29845 11688 107421 96689 39617 7333 24467 67278 43460 -12354 -16343 -1730 71013
24444G1013J01558q8970K1280n604K6322K0108k8031j04348q4476n156o5520p0606
$$ 71013 172571 83601 104881 99277 125599 145707 117676 13328 -71148 -76304 -141824 -212430
24432b12430L8555P5047M1929p007k7961O4330N3933l951l064l6935j0840l8191
$$ -212430 -173875 -98828 -56899 -63906 -91867 -27537 26396 22445 19381 -17554 -28394 -66585
24420f6585p1535n6469O3117O6958o801J6267K4177N1312J65363J4439o7502K7526
$$ -66585 -138120 -194589 -131472 -64514 -71315 -55048 -30871 20441 185804 200243 132741 160267
24408A60267n9667k4973l3808m8724n0350M1830q775L474K9290j0595m5379l0245
$$ 160267 100600 75627 41819 -6905 -57255 -15425 -24200 -20726 8564 -2031 -47410 -77655
24396g7655O0869P2537l2152Q285M2129J2147J02245K8177l4902m4179m4480O7419
$$ -77655 -16786 55751 23599 31884 74013 86160 188405 216582 181680 137501 93021 160440
24384A60440o9469m3765M685J1016M675o3028P6575k4708o542q6154m9672k1843
$$ 160440 90971 47206 51891 62907 67582 4554 81129 56421 49879 -36275 -85947 -107790
24372a07790N5370l5592o8196O7863L2823n510K8932r878K9224m324Q0692J32673
$$ -107790 -52420 -88012 -156208 -88345 -55522 -61032 -32100 -41978 -12754 -17078 63614 196287
24360A96287P7790j57062l4841N1118J2494j25101n1346M5317l2973L4655L6923
$$ 196287 274077 117015 82174 133292 145786 20685 -30661 14656 -18317 16338 53261
24349E3261m2146l5322M5991L816o5779M5747m3045m8728K9037L2021k9109q1440
$$ 53261 11115 -24207 21784 25600 -40179 5568 -37477 -86205 -57168 -25147 -54256 -135696
24337a35696p898L0632J6933l121M1514P1026L9650M7594J107m4634k3041p65
$$ -135696 -143594 -112962 -96029 -99150 -57636 13390 53040 100634 101741 57107 34066 33301
24325C3301n8827N8995P5261j13389l3618J1762j22923M566M3873K3401j5856
$$ 33301 -25526 33469 108730 -4659 -38277 -26515 -149438 -144872 -100999 -77598 -93454
24314i3454J08363j370J2891N0591j5050j14635j15353J9243l3817J1987J13024
$$ -93454 14909 13539 26430 77021 61971 -52664 -168017 -148774 -182591 -170604 -57580
24303e7580R4182p0132p7986l5807K1043M5739O4645K5165k9238m4423j1214P4323
$$ -57580 36602 -33530 -111516 -147323 -126280 -80541 -15896 9269 -19969 -64392 -75606 -1283
24291a283Q0265L2697J4394q0201J554m8147Q131J4404P459l383K3896J7333R743
$$ -1283 78982 111679 126073 45872 47426 -721 7410 21814 29273 25890 49786 67119 76862
24278G6862l1395r5087r9671N353J70238R395M376l7019j18983J9114m5166J2618
$$ 76862 45467 -49620 -149291 -143938 26300 35695 40071 3052 -115931 -96817 -141983 -129365
24266a29365J07305K1674O5580L5152l4014K1710J4610J400o0043l6159M6927
$$ -129365 -22060 -386 65194 100346 66332 88042 102652 104052 44009 7850 54777
24255E4777M4482j3049p5349m8040q8337l8707Q3547O9145O0224r5244K7826Q0563
$$ 54777 99259 86210 10861 -37179 -125516 -164223 -80676 -11531 48693 -46551 -18725 61838
24243F1838O3282N221P1452q8251j14846n4117N0790p6141l9835K8779M4139o9991
$$ 61838 125120 130341 201793 113542 -1304 -55421 -4631 -80772 -120607 -91828 -47689 -117680
24231a17680K7968M7139n9682K4866M5537k083P393J5507K3990M9174L360o735
$$ -117680 -89712 -42573 -102255 -77389 -31852 -33935 -26542 -11035 12955 62129 65489 58754
24219E8754O4805L0613j58737m1001O1432j0385l5951M7220o934j7298L2710K9159
$$ 58754 123559 154172 -4565 -45566 15866 5481 -30470 16750 9816 -7482 25228 54387
24207E4387n6794l9775L7903j09275R2123L6595n1939M935L3588Q3287L2128n0067
$$ 54387 -2407 -42182 -4279 -113554 -21431 15164 -36775 -31840 1748 85035 117163 67096
24195F7096l2928J10217O1509k0428j59509l2427L5597O7863q420J1163r6981
$$ 67096 34168 144385 205894 185466 25957 -6470 29127 96990 88570 99733 2752
24184B752m3992J02895m2724n1973J2458N4976l1554j27485l2144N9349N6128
$$ 2752 -41240 61655 18931 -33042 -20584 34392 2838 -124647 -156791 -97442 -41314
24173d1314M247j3918O9112O684M0803K1463p2096P6590k0760j10577J15119M6129
$$ -41314 -37067 -50985 18127 24811 65614 87077 14981 91571 70811 -39766 75353 121482
24161A21482j34961j1711r8035K061p369K7338Q7409J8037n6652n9285J2348Q2075
$$ 121482 -13479 -25190 -123225 -121164 -128533 -101195 -13786 4251 -52401 -111686 -99338 -17263
24149a7263k737m5733l9l5617r312L0704L9993M9204q4997J8650l8101l7731j2251
$$ -17263 -20000 -65733 -65772 -101389 -110701 -79997 -40004 9200 -75797 -57147 -95248 -132979 -145230
24136a45230K9058l1518J5080J8229K7541M8188L1750J53779Q4747j38340n4880
$$ -145230 -116172 -147690 -132610 -114381 -86840 -38652 -6902 146877 231624 93284 38404
24125C8404j10972j07276N3234k6268L0272m5746J4666N7894l3926K8175J10140
$$ 38404 -72568 -179844 -126610 -152878 -122606 -168352 -153686 -95792 -129718 -101543 8597
24114H597L5781q6409p9874p4225L6328O9114Q6312m2989M292O3208k786L8035
$$ 8597 44378 -42031 -121905 -196130 -159802 -90688 -4376 -47365 -43073 20135 17349 55384
24102E5384l6920r565P0102M8893Q7j21294j04755J32119L1386n0700m3505p9965
$$ 55384 18464 8899 79001 127894 127981 6687 -98068 34051 65437 14737 -28768 -108733
24090a08733k9961r203O1174Q7344l8667J7905j0618j6724p6275j5330L8762M3113
$$ -108733 -138694 -147897 -86723 621 -38046 -20141 -30759 -47483 -123758 -139088 -100326 -57213
24078e7213J4564n1553q7296J7133M0638J4885P6193J47032k3262o3634L6334
$$ -57213 -42649 -94202 -181498 -164365 -123727 -108842 -32649 114383 91121 27487 63821
24067F3821m3294j01005K2791O835p318L7273Q4865l2084j33030O4431k067j11181
$$ 63821 20527 -80478 -57687 -50852 -58170 -20897 63968 31884 -101146 -36715 -38782 -149963
24055a49963M0519Q4648O6141J07812K7589j02948p9739o3956K5157J6304m2195
$$ -149963 -109444 -24796 41345 149157 176746 73798 -5941 -69897 -44740 -28436 -70631
24044g0631m1066L5838K7205j34661N8090N7031J07768l3048j09375k8677M8508
$$ -70631 -111697 -75859 -48654 -183315 -125225 -68194 39574 6526 -102849 -131526 -83018
24033h3018M2783j11450j07246k1483N4015M2558P1167L3359J01985L4913o3884
$$ -83018 -40235 -151685 -258931 -280414 -226399 -183841 -112674 -79315 22670 57583 -6301
24022f301J229K5454P139L1615l6653p5534m6349l5510K6180N7040n4245l4590
$$ -6301 -5072 20382 27521 59136 22483 -53051 -99400 -134910 -108730 -51690 -105935 -140525
24010a40525J7727m316K112M6966J04833J7364Q8467k8090r7508p9525K1928P4129
$$ -140525 -122798 -127114 -125002 -78036 26797 44161 132628 104538 7030 -72495 -50567 23562
23998B3562K622p9929l479p684l4192j7958k2076P8120j5613r6011l2619l797
$$ 23562 26184 -53745 -57224 -64908 -99100 -117058 -139134 -61014 -76627 -172638 -205257 -209054
23986b09054Q0472m8456l9329Q8263J27682P9418r8105n3648L1176J5601K8046
$$ -209054 -128582 -177038 -216367 -128104 -422 78996 -19109 -72757 -41581 -25980 2066
23975B066j3987q2960n9629O9136Q5449J16511M8855k7791k4364K9041j37717
$$ 2066 -11921 -94881 -154510 -85374 75 116586 165441 137650 113286 142327 4610
23964D610l9517K6604j8544o165m2785N6811K3481n8693l1448q056J7630j4394
$$ 4610 -34907 -8303 -26847 -33012 -75797 -18986 4495 -54198 -85646 -93702 -76072 -90466
23952i0466P0090k806p5790n5279O2347R0440Q8962j22280o7328j6888K9103N6159
$$ -90466 -20376 -23182 -98972 -154251 -91904 -1464 87498 -34782 -102110 -118998 -89895 -33736
23940c3736P7702J9086m1680l4313q4481M1840M4165o1314m2849M740L9783Q8696
$$ -33736 43966 63052 21372 -12941 -97422 -55582 -11417 -72731 -115580 -110840 -71057 17639
23928A7639M7148k3509N7414k0266j22216L0485J5304l759m7328M5660K9177n2850
$$ 17639 64787 41278 98692 78426 -43790 -13305 1999 -1760 -49088 -3428 25749 -27101
23916b7101Q0014p7632l7285m3221N5392O6096l9937k0519M7230M5166P7520o8423
$$ -27101 52913 -24719 -62004 -105225 -49833 16263 -23674 -44193 3037 48203 125723 57300
23904E7300j18154k9083N2040l9148l0372p068P607J35545J10766K4548j22704
$$ 57300 -60854 -89937 -37897 -77045 -107417 -114485 -106878 28667 139433 163981 41277
23893D1277j17060l7687P0723J33202j951n3592q7693N1937L8777k8673k8874
$$ 41277 -75783 -113470 -42747 90455 88504 34912 -52781 -844 37933 9260 -19614
23882a9614M2692R68J2200L545N7121r606L5593n8448j20727m8342N3876P1649
$$ -19614 23078 24046 36246 39791 96912 87306 122899 64451 -56276 -104618 -50742 20907
23870B0907M466o209q6927M0691M0125o890O0284o8306m0500o7562J6353M3030
$$ 20907 25373 19164 -67763 -27072 13053 6163 66447 -1859 -42359 -109921 -93568 -50538
23858e0538L1218K750l9395P695J31727j14285j9598P4647l8595p8021N8414J87770
$$ -50538 -19320 -16570 -55965 -48270 83457 -30828 -50426 24221 -14374 -92395 -33981 153789
23846A53789J4129j45128m0665O4918p1161o4532K0018j8012r825n0834N4244
$$ 153789 167918 22790 -17875 47043 -24118 -88650 -68632 -86644 -96469 -147303 -93059
23835i3059J90339N0459M4035p7355j39303m9187J06902P1764l2131J9833q7402
$$ -93059 97280 147739 191774 114419 -24884 -74071 32831 104595 72464 92297 4895
23824D895m5748r25q0225r567R1137P648j9704J7263K5749K2653j7482Q398L8218
$$ 4895 -40853 -41778 -122003 -131570 -40433 -32785 -52489 -35226 -9477 13176 -4306 4092 42310
23811D2310P273K1753p1878k9573M6599l261M2113j6160r3801r3372p4591R2082
$$ 42310 49583 71336 -542 -30115 16484 13223 55336 39176 -54625 -147997 -222588 -130506
23799a30506J55491K0100K7636N3373j77179l3284j4177J25334K5264K0406j0184
$$ -130506 24985 45085 72721 126094 -51085 -84369 -98546 26788 52052 72458 62274
23788F2274j11646N2950M7906n3580k7804K5345P0372j3947N2962m0053n3560
$$ 62274 -49372 3578 51484 -2096 -29900 -4555 65817 51870 104832 64779 11219
23777A1219J7112P253j8085O7351M4762K7520n7644o0952Q111n1749m8581m3394
$$ 11219 28331 35584 17499 84850 129612 157132 99488 38536 46647 -5102 -53683 -97077
23765i7077L9847P8418N414o7370k1415o7403q8747o2925M4317k276q042O4039
$$ -97077 -57230 21188 26602 -40768 -62183 -129586 -218333 -281258 -236941 -239217 -247259 -183220
23753a83220M2709J45310K4067m4639o1250n8451O5190P4248l4755j33099M3548
$$ -183220 -140511 4799 28866 -15773 -77023 -135474 -70284 3964 -30791 -163890 -120342
23742a20342R5063J23999j0897r4020L5863M9340P403m4336N7156R1451j5184
$$ -120342 -25279 98720 87823 -6197 29666 79006 86409 42073 99229 190680 175496
23731A75496j02117n2655N3801k563K2947K8913o7141m2728j4291l7327Q0844
$$ 175496 73379 20724 74525 71962 94909 123822 56681 13953 -338 -37665 43179
23720D3179J2918N7191J9130j7818n0644k11486r1334q207P027M4272j2678J15479
$$ 43179 56097 113288 132418 114600 63956 -147530 -238864 -247071 -240044 -195772 -208450 -92971
23708i2971O2875m6904p2815m0980m5375k6986J39981P8297P2994Q0183J2788
$$ -92971 -30096 -77000 -149815 -190795 -236170 -263156 -123175 -44878 28116 108299 121087
23697A21087k3495J3986l7854j30905j27127K2704M5984J780o6214m6765J95900
$$ 121087 97592 111578 73724 -57181 -184308 -161604 -115620 -113840 -180054 -226819 -30919
23686c0919J5878r0568j5581k1426O1082M2673J00598j18952j86030k5624L1573
$$ -30919 -15041 -105609 -121190 -142616 -81534 -38861 61737 -57215 -243245 -268869 -237296
23675b37296P0284O5819n5189j1837M1302J1048R0653J00156K8140k8044p765
$$ -237296 -167012 -101193 -156382 -168219 -126917 -115869 -25216 74940 103080 75036 67271
23664F7271m2257l1948K0296k549J46881K9097j21271p8741J7483k2012l0285
$$ 67271 25014 -6934 13362 10813 157694 186791 65520 -13221 4262 -17750 -48035
23653d8035j7098J90552R1835k0734m9537j4669l4415J9415j1456r6079m0852
$$ -48035 -65133 125419 217254 196520 146983 132314 97899 117314 105858 9779 -31073
23642c1073j05594j9148J03839N5630J0605j8562k3058J44842J06907q4584l9300
$$ -31073 -136667 -155815 -51976 3654 14259 -4303 -27361 117481 224388 139804 100504
23631A00504j4469M1574n1498m6171l1602k5928P416m6059p8529P0082P102k5678
$$ 100504 86035 127609 76111 29940 -1662 -27590 -20174 -66233 -144762 -74680 -67578 -93256
23619i3256R3895J2773o0319l037m202l3785K3836L9248l2687n5165n418Q5946
$$ -93256 639 13412 -46907 -49944 -54146 -87931 -64095 -24847 -57534 -112699 -118117 -32171
23607c2171R1000R6688L2535Q4639q5366n5286j8139J4616K0026l0488k1856n9314
$$ -32171 58829 155517 188052 272691 187325 132039 113900 128516 148542 118054 96198 36884
23595C6884M053m0304p5935k0558J27107J16196j2720q5736k1393M076l545m9546
$$ 36884 40937 633 -75302 -95860 31247 147443 134723 48987 27594 31670 28125 -21421
23583b1421k929O33l1483o8871j1253P2653M6081k5698o4185N3865m0486P3195
$$ -21421 -24350 -23717 -55200 -124071 -135324 -62671 -16590 -42288 -106473 -52608 -93094 -19899
23571a9899O2236k956l2033q3466o1418P78M031R2898J1989j9443R0967o7436
$$ -19899 42337 39381 7348 -76118 -137536 -136758 -132727 -39829 -27840 -47283 43684 -23752
23559b3752j46169L3832J3130N3100Q9975L3032n6108l9069J9059R0607L4783
$$ -23752 -169921 -136089 -122959 -69859 20116 53148 -2960 -42029 -22970 67637 102420
23548A02420p8308n5930N7987J0217o9990n620p972j3583l5760K0899q945N7932
$$ 102420 24112 -31818 26169 36386 -33604 -39224 -47196 -60779 -96539 -75640 -84585 -26653
23536b6653K2924M4066o3468j38564L2487J52476j791j4206J0743l4160L6935
$$ -26653 -3729 40337 -23131 -161695 -129208 23268 21477 7271 18014 -16146 20789
23525B0789j4261m4248p2405j664J5330N3917o1342j10265L8157P7505M4415j6942
$$ 20789 6528 -37720 -110125 -111789 -96459 -42542 -103884 -214149 -175992 -98487 -54072 -71014
23513g1014r5410M2003R4627J23441j06576j30105m3881K0843Q7466o898m1673
$$ -71014 -166424 -124421 -29794 93647 -12929 -143034 -186915 -166072 -78606 -85504 -127177
23502a27177j0466k9337M0936P1403K0835N4300l6473n3301j22910r7600L113
$$ -127177 -137643 -166980 -126044 -54641 -33806 20494 -15979 -69280 -192190 -289790 -286677
23491b86677J46586Q1555J1487m0445J1230P6283N731k8693j8492N2128L8357
$$ -286677 -140091 -58536 -47049 -87494 -76264 19 5750 -22943 -41435 10693 49050
23480D9050k2739L2228q709K7126p7378q5389M1261j6913Q7136Q2044n4399q1882
$$ 49050 26311 58539 49830 76956 -422 -85811 -44550 -61463 25673 107717 53318 -28564
23468b8564p0566M6848M5081O5854l8515n5523p1334p3581J8622K0036P2464M7320
$$ -28564 -99130 -52282 -7201 58653 20138 -35385 -106719 -180300 -161678 -141642 -69178 -21858
23456b1858K7814R0907M2877L2416p9944j32378m4431K9884K951J9574K3745O742
$$ -21858 5956 96863 139740 172156 92212 -40166 -84597 -54713 -51762 -32188 -8443 -1701
23444a701o6605q9700Q3504P9977j06024p3430N4541k9378K3335L9119j0526M4093
$$ -1701 -68306 -158006 -74502 5475 -100549 -173979 -119438 -148816 -125481 -86362 -96888 -52795
23432e2795K0691P2423L8791j39013M8449m1232l2879O6092M4097l294l1884k8512
$$ -52795 -32104 40319 79110 -59903 -11454 -52686 -85565 -19473 24624 21330 -10554 -39066
23420c9066J0634J06387K3818j7646J9071k8942N4309k7331m9431o6255L9596
$$ -39066 -28432 77955 101773 84127 103198 74256 128565 101234 51803 -14452 25144
23409B5144p633J30751m2j06345o2782l8752L0652k2786j8611J4510Q2586j7480
$$ 25144 17511 148262 148220 41875 -20907 -59659 -29007 -51793 -70404 -55894 26692 9212
23397I212j1540j974m6381J782M3673l1610J0113Q6607K9411q5945K4558Q0593
$$ 9212 -2328 -4302 -50683 -48901 -5228 -36838 -26725 59882 89293 3348 27906 108499
23385A08499j00853j7755j2348j53061l1139N7826M4683P4132J21465M0508j36067
$$ 108499 7646 -10109 -22457 -175518 -206657 -148831 -104148 -30016 91449 131957 -4110
23374d110j04922M4491k4707k6651K1048n3809j31392j11543Q7591R5700R7044
$$ -4110 -109032 -64541 -89248 -115899 -94851 -148660 -280052 -391595 -304004 -208304 -111260
23363a11260n843P5009M6162k7450M4463O8866Q7911m4757o1235L7376p4768p8944
$$ -111260 -117103 -42094 4068 -23382 21081 89947 177858 133101 71866 109242 34474 -44470
23351d4470k3357O5414p1379k2706Q352P9646l4471j6041K5978m65M587q6935
$$ -44470 -67827 -2413 -73792 -96498 -88146 -8500 -42971 -59012 -33034 -33499 -28912 -115847
23339a15847K8008P9755L7019K7721n7584q2848M1Q5234O7456J2320N8620l9562
$$ -115847 -87839 -8084 28935 56656 -928 -83776 -83735 1499 68955 81275 139895 100333
23327A00333L9365p540p6332o3086j1139k7802J5510J15133n7676n1731j3191
$$ 100333 139698 132158 55826 -7260 -18399 -46201 -30691 84442 26766 -24965 -38156
23316c8156n3509J06514J27030m4709j21446J499J43111j5134q7524n8023J8375
$$ -38156 -91665 14849 141879 97170 -24276 -22777 120334 105200 17676 -40347 -21972
23305b1972L3137q520R059K3505j07539j10509n977J0949M308M1071r405J06388
$$ -21972 11165 2645 11704 35209 -72330 -182839 -188816 -177867 -173559 -132488 -141893 -35505
23293c5505N3653R9147P048m1217j6032l3974m2664l6118k2842m776j4242o2286
$$ -35505 18148 117295 124343 83126 67094 33120 -9544 -45662 -68504 -73280 -87522 -149808
23281a49808R9554P4264n9336j4627K2963J4343J8763K4983J6942J5536K6622
$$ -149808 -50254 24010 -35326 -49953 -26990 -12647 6116 31099 48041 63577 90199
23270I0199o4713Q246j2244r2956j03426n71J5538O5476Q7502Q3465J2976L5297
$$ 90199 25486 33732 21488 -71468 -174894 -175465 -159927 -94451 -6949 76516 89492 124789
23258A24789M7538J144n3156j11667l7578L2868P3002N5533P8982j27444j06388
$$ 124789 172327 173471 120315 8648 -28930 3938 76940 132473 211455 84011 -22377
23247b2377k3931N2771Q4391M8666L0644l9966j3651j18912j00193Q3805j9199
$$ -22377 -46308 6463 90854 139520 170164 130198 116547 -2365 -102558 -18753 -37952
23236c7952j9194n7296P5211P1167m2824N2472j09496r1455O0172O7992j3726
$$ -37952 -57146 -114442 -39231 31936 -10888 41584 -67912 -159367 -99195 -31203 -44929
23225d4929p7327K2717P7025l471L260J03529L0351j3274L9323n834L643K3709
$$ -44929 -122256 -99539 -22514 -25985 -22725 80804 111155 97881 137204 131370 135013 158722
23213A58722o7535l8050j937p089l8051j2647m9524k35R191m5133M7116k5796
$$ 158722 91187 53137 51200 44111 6060 -6587 -56111 -56346 -47155 -92288 -45172 -70968
23201g0968M6759J0626k0882q590J08647K5889n3329j28903n516J34997M501m8296
$$ -70968 -24209 -13583 -34465 -43055 65592 91481 38152 -90751 -96267 38730 43231 -5065
23189e065J3216m154O676l7502Q7624M381o3709n2493m2366O5047j7380p6125
$$ -5065 8151 3997 10673 -26829 60795 65176 1467 -51026 -93392 -28345 -45725 -121850
23177a21850M2283P8605R5851M0702K4857n2579r7960p1214m7450n3883J7393
$$ -121850 -79567 -962 94889 135591 160448 107869 9909 -61305 -108755 -162638 -145245
23166a45245J2354n160O070J50281J41304R7812n7212Q996k8992j49675p9523
$$ -145245 -132891 -138051 -131981 18300 159604 257416 200204 209200 180208 30533 -48990
23155d8990j5287k3476N3952L9620m7259K9587L5179R6482L5892k4564K232L169
$$ -48990 -64277 -87753 -33801 5819 -41440 -11853 23326 119808 155700 131136 133368 136537
23143A36537R8381J6744n4465j8014l8048n5008o098q4722m2097L9162L3589J7574
$$ 136537 234918 251662 197197 179183 141135 86127 80029 -4693 -46790 -7628 25961 43535
23131D3535J9448P2261P5690l0278n8162r628j11474m4569L1384o1464m7178L085
$$ 43535 62983 135244 210934 180656 122494 112866 1392 -43177 -11793 -73257 -120435 -117350
23119a17350k861L7853l803J00348M6430k6069n8270R105k0324o7195Q0364L1167
$$ -117350 -120211 -82358 -86161 14187 60617 34548 -23722 -14617 -34941 -102136 -21772 9395
23107I395n9955n2872o7392n7830J16067J74074J2280L4373P5752m7918j21257
$$ 9395 -50560 -103432 -170824 -228654 -112587 61487 73767 108140 183892 135974 14717
23096A4717q5348k2374m6408J12102M3919p4039l4025p2519L8430N6575K2916
$$ 14717 -70631 -93005 -139413 -27311 16608 -57431 -91456 -163975 -125545 -68970 -46054
23085d6054Q8709J01176J2307k6389O9273K6860j17627p4039R7458N8008j03697
$$ -46054 42655 143831 156138 129749 199022 225882 108255 34216 131674 189682 85985
23074H5985p8468p9058o3896m7750N1981O7501Q1646L6425J4286P1282m616j11853
$$ 85985 7517 -71541 -135437 -183187 -131206 -63705 17941 54366 68652 139934 135318 23465
23062B3465m5868M30J06543j9973j09576k7438n4294p7240Q9868N9526J15122
$$ 23465 -22403 -21973 84570 64597 -44979 -72417 -126711 -203951 -114083 -54557 60565
23051F0565l5846m5902L0309Q523M9880m798K4951m6360j4209L3230n4975p4868
$$ 60565 24719 -21183 9126 17649 67529 62731 87682 41322 27113 60343 5368 -69500
23039f9500l1505O1103n399p0218j5301N2059J03309n1576p2899J8527L9643j4797
$$ -69500 -101005 -39902 -45301 -115519 -130820 -78761 24548 -27028 -99927 -81400 -41757 -56554
23027e6554k8073O1986J41874j34708j42336M055P7052J8644J2823J22105J30438
$$ -56554 -84627 -22641 119233 -15475 -157811 -153756 -76704 -58060 -45237 76868 207306
23016B07306o1587j16286p1061M2288o5968r6335k3469l4654O3095O3045J3195
$$ 207306 145719 29433 -41628 660 -65308 -161643 -185112 -219766 -156671 -93626 -80431
23005h0431l9524M4522N4487K5509K2977l2250n7015j3756P3274K1325r805J4682
$$ -80431 -119955 -75433 -20946 4563 27540 -4710 -61725 -75481 -2207 19118 9313 23995
22993B3995L7053r9404l910l4952M7773J17100k2244j34818n1277L9992J20523
$$ 23995 61048 -38356 -42266 -77218 -29445 87655 65411 -69407 -120684 -80692 39831
22982C9831O7383N662R9825j5967p6020M3582j40253p1475l840N2704O9532J6644
$$ 39831 107214 112876 212701 196734 120714 164296 24043 -47432 -51272 1432 70964 87608
22970H7608m4432q7111P6788J14935M5650j49644j33778k1101Q3390N913o6857
$$ 87608 43176 -43935 32853 147788 193438 43794 -89984 -111085 -27695 -21782 -88639
22959h8639P9515J39855j4288J03986j11434p6878j948J3682j0633k5267p3140
$$ -88639 -9124 130731 116443 220429 108995 32117 30169 43851 33218 7951 -65189
22948f5189M0446P9092K83j2410m1823n2705p8441N5262Q1742O3810K8568l3079
$$ -65189 -24743 54349 54632 42222 399 -52306 -130747 -75485 6257 70067 98635 65556
22936F5556M5685q2820n1825J1141Q9924k2934r6812o464q156O5757R6677J1660
$$ 65556 111241 28421 -23404 -12263 77661 54727 -42085 -48549 -56705 9052 105729 117389
22924A17389N0995p000p7894p6255m6547N2494r1854k9133M8072N1157M4217n3355
$$ 117389 168384 161384 83490 7235 -39312 13182 -78672 -107805 -59733 -8576 35641 -17714
22912a7714j0031p3503J5972L4648j00470m309J6994M7255O091L198M8547J127
$$ -17714 -27745 -101248 -85276 -50628 -151098 -155407 -138413 -91158 -85067 -81869 -33322 -32195
22900c2195j2231K1388l5060L4837N2910m81q4146L5533o0085k5263M2562j603
$$ -32195 -44426 -23038 -58098 -23261 29649 29168 -54978 -19445 -79530 -104793 -62231 -63834
22888f3834n3107J1108N6176M9093l2659m0366N2465j1541N9312m8451j11409
$$ -63834 -116941 -105833 -49657 -564 -33223 -73589 -21124 -32665 26647 -21804 -133213
22877a33213k7777N2924j3863R8983Q2965J4168m4548n5060R949O6200J1302j609
$$ -133213 -160990 -108066 -121929 -22946 60019 74187 29639 -25421 -15472 50728 62030 60421
22865F0421l4116p7668j1436K0237K7064P2781m6447m3086k5668j9937J7483O2587
$$ 60421 26305 -51363 -62799 -42562 -15498 57283 10836 -32250 -57918 -77855 -60372 2215
22853B215J0329L0203k1987P825j3046j41964j08631L6797j7896J03790J3645
$$ 2215 12544 42747 20760 28585 15539 -126425 -235056 -198259 -216155 -112365 -98720
22842i8720o3575J25666M5079p9134J499N4397j8172N1271M1888L8700M322n0962
$$ -98720 -162295 -36629 8450 -70684 -69185 -14788 -32960 18311 60199 98899 103221 52259
22830E2259K9080K9766J9341m1750J5689j9928r3515l2971n0302q6112P3629J32251
$$ 52259 81339 111105 130446 88696 104385 84457 -9058 -42029 -92331 -178443 -104814 27437
22818B7437M7713l4565m5422n1599q9284k6625L5375K6091K691K6147n6434K282
$$ 27437 75150 40585 -4837 -56436 -145720 -172345 -136970 -110879 -108188 -82041 -138475 -136193
22806a36193L4899L7588R7527R866m0590K5343j0526k3535O8610Q7207N426P1541
$$ -136193 -101294 -63706 33821 43687 3097 28440 17914 -5621 62989 150196 155622 227163
22794B27163M7621J8778m5978j31288j28860n3823K6176q013j09474m1758R1937
$$ 227163 274784 293562 247584 116296 -12564 -66387 -40211 -48224 -157698 -199456 -107519
22783a07519J25272M6537J9232k3491J3361m1152L5218R0667m6808q3484K80K0606
$$ -107519 17753 64290 83522 60031 73392 32240 67458 158125 111317 27833 28113 48719
22771D8719J9664m4071n2900r6470j0747P9649J688l3222J37103J5848L9028l0141
$$ 48719 68383 24312 -28588 -125058 -135805 -56156 -54468 -87690 49413 65261 104289 74148
22759G4148N5404q2700o6696R3870k8633m9072L508m7185N0599O222n2933M283
$$ 74148 129552 46852 -19844 74026 45393 -3679 -171 -47356 3243 9465 -43468 -39185
22747c9185K9881L0564P8793M7597j00029j02343J9151j1633O0057M3780m0793
$$ -39185 -9304 21260 100053 147650 47621 -54722 -35571 -47204 12853 56633 15840
22736A5840l8142o3091L3615O0495m7025m9629J4681R0156M0904j8577r0832o4334
$$ 15840 -22302 -85393 -51778 8717 -38308 -87937 -73256 16900 57804 39227 -51605 -115939
22724a15939J0468J5899L5616J80995P8172j30172j91067o5893l7134P4065O2207
$$ -115939 -105471 -89572 -53956 127039 205211 75039 -116028 -181921 -219055 -144990 -82783
22713h2783j369J9540M0250k4735K2672M8983L413L2331o0755P589k8913j2397
$$ -82783 -84152 -64612 -24362 -49097 -26425 22558 25971 58302 -2453 5136 -23777 -36174
22701c6174M541p1812n7261Q6209R410k4342M7158K3140q974r444J132J22147
$$ -36174 -31633 -103445 -160706 -74497 -65087 -89429 -42271 -19131 -28105 -37549 -36417 85730
22689H5730M5246p8914m7137r3395q7685K2844J02991N6207j02126l1029j0082
$$ 85730 130976 52062 4925 -88470 -176155 -153311 -50320 5887 -96239 -127268 -137350
22678a37350j2060O9462J99976J654J6988n3119k6676o478k2554J9580J4040o6250
$$ -137350 -149410 -79948 120028 121682 138670 85551 58875 52397 29843 49423 63463 -2787
22666b787l7990L3873N6528j2486p2182P5059J10488K9080o9319n5M387j07790
$$ -2787 -40777 -6904 49624 37138 -35044 40015 150503 179583 110264 110209 114596 6806
22654F806r7178q0819Q8678J13108M4117J2149Q249P9666k3013m0281j01466q6189
$$ 6806 -90372 -171191 -82513 30595 74712 86861 95110 174776 151763 111482 10016 -76173
22642g6173K5513j5637j06786O6476M8514k1696j43212J6778N4312L3613q5291
$$ -76173 -50660 -66297 -173083 -106607 -58093 -79789 -223001 -206223 -151911 -118298 -203589
22631b03589p1368l8529Q0164N2241R2763Q71M3920J1166j06193L9118Q8854J4659
$$ -203589 -274957 -313486 -233322 -181081 -88318 -87447 -43527 -32361 -138554 -99436 -10582 4077
22619D077j5337J2781J1513N5379Q4202k5260q3519J7084r6752p2324J03644R919
$$ 4077 -11260 1521 13034 68413 152615 127355 43836 60920 -35832 -108156 -4512 5407
22607E407J6613j9127k2777q0335q4400K4695L9041J34915j8010p8070R3942j4922
$$ 5407 22020 2893 -19884 -100219 -184619 -159924 -120883 14032 -3978 -82048 11894 -3028
22595c028m4087L5101j7659O3877j7582r3328r7835n3491J16510Q4775J31468
$$ -3028 -47115 -12014 -29673 34204 16622 -76706 -174541 -228032 -111522 -26747 104721
22584A04721L9937N7831j65077o9925q0585o8620L2629N5711l1023K290p8349
$$ 104721 144658 202489 37412 -32513 -113098 -181718 -149089 -93378 -124401 -122111 -200460
22573b00460j11724n2114J0197J04161J21839J14033k6886l7131n927q7445K6439
$$ -200460 -312184 -364298 -354101 -249940 -128101 -14068 -40954 -78085 -84012 -171457 -145018
22562a45018J42708R9040r6206p677J3878N3233N7882J6633j01240n5550K4509
$$ -145018 -2310 96730 524 -7153 6725 59958 117840 134473 33233 -22317 2192
22551B192m2607J25645K6720p8650l7601n5775K58L1912P2550M3728L5845m1988
$$ 2192 -40415 85230 111950 33300 -4301 -60076 -59818 -27906 44644 88372 124217 82229
22539H2229l136O05p2812K0523M4199l6630L3294P9495r1692J8292m453q2391
$$ 82229 79093 79698 6886 27409 71608 34978 68272 147767 56075 74367 69914 -12477
22527a2477n0338m6573J9366n7195l8242Q2333J9044k6658k955J0126L3643N9488
$$ -12477 -62815 -109388 -90022 -147217 -185459 -103126 -84082 -110740 -113695 -103569 -69926 -10438
22515a0438O8577J9481j06153j8338q1403k3364M6583l4484l0839J29425P7030
$$ -10438 58139 77620 -28533 -46871 -128274 -151638 -105055 -139539 -170378 -40953 36077
22504C6077k3520P41q5601j73720L1929K4363P2589Q214k6694L041J5911R0848
$$ 36077 12557 13298 -72303 -246023 -214094 -189731 -117142 -108928 -135622 -132581 -116670 -25822
22492b5822L1042k506J3163J9439O3212m6097q2634n7519P077l5249l570J33319
$$ -25822 5220 2714 15877 35316 98528 52431 -30203 -87722 -80645 -115894 -119464 13855
22480A3855J4769q7708o3942j0453K7797L1405P9457o7262Q8870j4445p6664j14308
$$ 13855 28624 -59084 -123026 -133479 -105682 -74277 5180 -62082 26788 12343 -64321 -178629
22468a78629L4639R5770J03902J6117J0032l136K6667l5901N0661N3099R2629
$$ -178629 -143990 -48220 55682 71799 81831 78695 105362 69461 120122 173221 265850
22457B65850r4559n8741j7370l5170O1281J00807l0973j29843j34967K8477J07753
$$ 265850 171291 112550 95180 60010 121291 222098 191125 61282 -73685 -45208 62545
22446F2545K392O2677q2571r9519K2019l9014J817k3391p385m219P3903Q9098
$$ 62545 64937 127614 45043 -54476 -32457 -71471 -69654 -93045 -100430 -104649 -30746 58352
22434E8352N618r7679q5539j8329Q6546J43127K560M939n5326m4890J17685N6338
$$ 58352 63970 -33709 -119248 -137577 -51031 92096 94656 99595 44269 -621 117064 173402
22422A73402N883K1037N2469R610K6219l4846o8133j61053n8694K2519L534o3152
$$ 173402 179285 200322 252791 262401 288620 253774 185641 24588 -34106 -11587 -8053 -71205
22410g1205n3430O6579N277j03012p1603O2775P441J7157n257K7125R3278J01224
$$ -71205 -124635 -58056 -52779 -155791 -227394 -164619 -157178 -140021 -145278 -118153 -24875 76349
22398G6349J7464M2678m0922o0700L2733j1051o2288O6053O7369j5435M1811J07484
$$ 76349 93813 136491 95569 34869 67602 56551 -5737 60316 127685 112250 154061 261545
22386B61545O0670K758r4602r5604q3450K01J7135m3940l1169O0443P4807n6425
$$ 261545 322215 324973 230371 134767 51317 51518 68653 24713 -6456 53987 128794 72369
22374G2369o3518K2420N2191j0444p534k0915q6910l4465k7251m4377p3576R74
$$ 72369 8851 31271 83462 73018 65484 44569 -42341 -76806 -104057 -148434 -222010 -221036
22362b21036O3222N2166O7607J0217J0323N7666K3257r8210p4999P8196k7694
$$ -221036 -157814 -105648 -38041 -27824 -17501 40165 63422 -34788 -109787 -31591 -59285
22351e9285m941k8921J4766P5539K1025K9568r6000N716P9035N4456M470j8533
$$ -59285 -64226 -93147 -78381 -2842 18183 47751 -48249 -42533 36502 90958 95428 76895
22339G6895k4023j18735K0928K8167L7293q5899P7159J1695j05774p5539m0321
$$ 76895 52872 -65863 -44935 -16768 20525 -65374 11785 23480 -82294 -157833 -198154
22328a98154Q8786M2632k313o7277p8688N4171J9140o0131P557L034N6589N5690
$$ -198154 -109368 -66736 -69049 -136326 -215014 -160843 -141703 -201834 -194277 -191243 -134654 -78964
22316g8964K8506J4807J1376j17999J9199N6522O4472K2316r833L6670j32975
$$ -78964 -50458 -35651 -24275 -142274 -123075 -66553 -2081 20235 10402 47072 -85903
22305h5903j10817l2400P89O021k3684R7815J69468K7864k6093J7244K1075L3970
$$ -85903 -196720 -229120 -228331 -222310 -245994 -148179 21289 49153 23060 40304 61379 95349
22293I5349l4918J7169n4518j55003j4203J28652k9173P7655m0983k5896J07826
$$ 95349 60431 77600 23082 -131921 -146124 -17472 -46645 31010 -9973 -35869 71957
22282G1957k3451j67949N0288M1413Q24O0086L6932N9269l2274q7895K1068m9818
$$ 71957 48506 -119443 -69155 -27742 -26918 33168 70100 129369 97095 9200 30268 -19550
22270a9550m2178P0232R8159J9871r1945j22610J05486j0413p2595O4494p75n2751
$$ -19550 -61728 8504 106663 126534 34589 -88021 17465 7052 -65543 -1049 -1824 -54575
22258e4575j5117K4558J6778l2454K8289R3865k538m2690n2294K0255r0681r8513
$$ -54575 -69692 -45134 -28356 -60810 -32521 61344 58806 16116 -36178 -15923 -106604 -205117
22246b05117Q4099Q053L9596J34469R6800M2711n749o2631j62355r4396j3636
$$ -205117 -121018 -112965 -73369 61100 157900 200611 194862 132231 -30124 -124520 -138156
22235a38156P1388M3260J6133K3783J15888R9096j09893j37841o4277m128j0926
$$ -138156 -66768 -23508 -7375 16408 132296 231392 121499 -16342 -80619 -84747 -95673
22224i5673L713Q7576o4246p3545l4337J40730k349K2674N794j23550j09450P8180
$$ -95673 -91960 -4384 -68630 -142175 -176512 -35782 -38131 -15457 -9663 -133213 -242663 -164483
22212a64483L587N3154J51964J16015N1679j1537o7811m5700j15661j4381n3151
$$ -164483 -160896 -107742 44222 160237 211916 200379 132568 86868 -28793 -43174 -96325
22201i6325j02864L8079J04193n4772j4072N20M1675N1422m2688J0680l8866J1070
$$ -96325 -199189 -161110 -56917 -111689 -125761 -125241 -83566 -32144 -74832 -64152 -103018 -91948
22189i1948L3862K1376k4963q5314J8865j5452N8650J14362J4534K2150L3233
$$ -91948 -58086 -36710 -61673 -146987 -128122 -143574 -84924 29438 43972 66122 99355
22178I9355J0857Q7070n8515r4786L0660o8693m2609k6196O8941j2282L7891K640
$$ 99355 110212 197282 138767 43981 74641 5948 -36661 -62857 6084 -6198 31693 34333
22166C4333N2420M882n5445r5601M94R292N9816N2647l4539L9331q90m8130q9064
$$ 34333 86753 91635 36190 -59411 -58917 -49625 10191 62838 28299 67630 66740 18610 -70454
22153g0454r5218J14469J8610Q199M8252j02663o9966J0470K1587l820O1119J2486
$$ -70454 -165672 -51203 -32593 -24394 23858 -78805 -148771 -138301 -116714 -120534 -59415 -46929
22141d6929k5723L9658N3584M894o6313Q661J64138j3664j52568p2422k709O779
$$ -46929 -72652 -32994 20590 25484 -40829 -32168 131970 118306 -34262 -106684 -109393 -102614
22129a02614L0448O6523J9863O793O7925m9714j31697l7596J9339n873j07560
$$ -102614 -72166 -5643 14220 21013 88938 39224 -92473 -130069 -110730 -116603 -224163
22118b24163O0206N4643J36649R3093n8272p1912J3629n1371N011j18295j9821
$$ -224163 -163957 -109314 27335 120428 62156 -9756 3873 -47498 -42487 -160782 -180603
22107a80603P7713J47332k950K5634m6431j8051Q5937P9020o1420q5991l0692
$$ -180603 -102890 44442 41492 67126 20695 2644 88581 167601 106181 20190 -10502
22096a0502K9004P4919J04745M0504n0144j49981q3110n152k4335P88N5635J27861
$$ -10502 18502 93421 198166 238670 188526 38545 -44565 -49717 -74052 -73264 -17629 110232
22084A10232j8502k9016L6906o0544k8836J35325K8351o3451Q774j5191l0656
$$ 110232 91730 62714 99620 39076 10240 145565 173916 110465 119239 104048 73392
22073G3392P2798q938o2649j1144K6656k8323l6021o5651m0506Q50J24322L9895
$$ 73392 146190 137252 74603 63459 90115 61792 25771 -39880 -80386 -79536 44786 84681
22061H4681k8482J2746m205l7442o0377J2608j2080Q417o415n3466L5823L0550
$$ 84681 56199 68945 64740 27298 -33079 -20471 -32551 -24134 -30549 -84015 -48192 -17642
22049a7642m3046L814l1897J6471R2103k0867l3926N4106k6337p4388J33192j9655
$$ -17642 -60688 -56874 -88771 -72300 19803 -1064 -34990 19116 -7221 -81609 51583 31928
22037C1928P734Q808P4732o3060q4866k9162o8226k3079L1775M2918j0648J1113
$$ 31928 39662 48470 123202 60142 -24724 -53886 -122112 -145191 -113416 -70498 -81146 -70033
22025g0033q3091j23429M8423P6432P7998n0723m5401j3507M3332P4033m0589
$$ -70033 -153124 -276553 -228130 -151698 -73700 -124423 -169824 -183331 -139999 -65966 -106555
22014a06555K3039K1400J10852N4704O7663J0406p1929Q0737l7603n2341m9962
$$ -106555 -83516 -62116 48736 103440 171103 181509 109580 190317 152714 100373 50411
22003E0411j00659l7855P447o5399J9001J43342k6770L2014O169j23080j32819
$$ 50411 -50248 -88103 -80656 -146055 -127054 16288 -10482 21532 27701 -95379 -228198
21992b28198R6620M4937J5194M7471L5284O906l8181j3148M3322l5739r9327J7371
$$ -228198 -131578 -86641 -71447 -23976 11308 18214 -19967 -33115 10207 -25532 -124859 -107488
21980a07488l7675m0874J67645K8179K9400M0765j1833K5391o3489m2834K4437
$$ -107488 -145163 -186037 -18392 9787 39187 79952 68119 93510 30021 -12813 11624
21969A1624O945K5007L670m619Q3802j6288L1614m3890n8358n5242k6193j4224
$$ 11624 18569 43576 47246 42627 126429 110141 141755 97865 39507 -15735 -41928 -56152
21957e6152j1813N5552R5573J0814m0504P6157Q2881o1737j03005j07544K3770
$$ -56152 -67965 -12413 83160 93974 53470 129627 212508 150771 47766 -59778 -36008
21946c6008M6667O0027m6835n3290o932l3032p325N0677K8515K0625L4111K8852
$$ -36008 10659 70686 23851 -29439 -36371 -69403 -76728 -26051 2464 23089 57200 86052
21934H6052r7788L3830P0465q1272q140j490M5570l6102L5867N454p4955k9125
$$ 86052 -11736 22094 92559 11287 3147 1657 47227 11125 46992 52446 -22509 -51634
21922e1634q658O647J02204M4104l421j13806J22140P334n6693k1279M2613P156
$$ -51634 -60292 -53645 48559 92663 89242 -24564 97576 104910 48217 26938 69551 76707
21910G6707q8586r1145k0756N9776n2720r831J7893O9104L6355O2317K0999r4365
$$ 76707 -11879 -103024 -123780 -64004 -116724 -126555 -108662 -39558 -3203 59114 80113 -14252
21898a4252n1744M1757k1368j14155p9776k9092l6564P2974K04241J30820K8764
$$ -14252 -65996 -24239 -45607 -159762 -239538 -268630 -305194 -232220 -27979 102841 131605
21887A31605p3351r0217o0401N5926j3437N94J18659N749k4215m1201J9113J2441
$$ 131605 58254 -31963 -92364 -36438 -49875 -49281 69378 75127 50912 9711 28824 41265
21875D1265P1611n502p6032q344k2538l027O570j1607o6783N9147n6759j2214
$$ 41265 112876 107374 31342 22998 460 -2567 4003 -7604 -74387 -15240 -71999 -84213
21863h4213M9974P1188N7365q799k8698q6191j08827Q806J24620N8704o2223j628
$$ -84213 -34239 36949 94314 85515 56817 -29374 -138201 -129395 -4775 53929 -8294 -9922
21851i922O9252N793j9428p5668m1299L8346K9640k534O5773N8921l4083j31855
$$ -9922 59330 65123 45695 -29973 -71272 -32926 -3286 -5820 59953 118874 84791 -47064
21839d7064j00345J22409Q9935j8209K7142J00569p7155j40898n4073M7937m7214
$$ -47064 -147409 -25000 64935 46726 73868 174437 97282 -43616 -97689 -49752 -96966
21828i6966o5193R0903N2144m085K100J03122N9341j05847k0877l3048L1782m0150
$$ -96966 -162159 -71256 -19112 -23197 -21097 82025 141366 35519 14642 -18406 13376 -26774
21816b6774L7138J9215p496j3745J046j70120j23347R4487K06526Q1096J4665
$$ -26774 10364 29579 22083 8338 9384 -160736 -284083 -189596 16930 98026 112691
21805A12691j355j03833L70K1655M7262r3523j7497J8422l1558l1330L2552J05733
$$ 112691 111336 7503 7873 29528 76790 -16733 -34230 -15808 -47366 -78696 -46144 59589
21793E9589J15507j6918l7059l9598j26289j07093r6420J29612J26984l3195m6818
$$ 59589 175096 158178 121119 81521 -44768 -151861 -248281 -118669 8315 -24880 -71698
21782g1698J15244R4488n6547q7789n0252J06160R3907P0245n9662R258o5004
$$ -71698 43546 138034 81487 -6302 -56554 49606 143513 213758 154096 163354 98350
21771I8350o5760n1326k5656q6094J5948O2140L4240n5146L9239J11232l5525
$$ 98350 32590 -18736 -44392 -130486 -114538 -52398 -18158 -73304 -34065 77167 41642
21760D1642j04280l094r9830j2581M8650O9524j4498K789K8324K7651O9116R0400
$$ 41642 -62638 -65732 -165562 -178143 -129493 -59969 -74467 -71678 -43354 -15703 53413 143813
21748A43813N5512p0563p6843p3800l0380M8977q6668K8913J2322j466j06490
$$ 143813 199325 128762 51919 -21881 -52261 -3284 -89952 -61039 -48717 -50183 -156673
21737a56673j00985J32956Q4379k5560K6244J92638P1290p7358O898O351p5433
$$ -156673 -257658 -124702 -40323 -65883 -39639 152999 224289 146931 153829 160180 84747
21726H4747l4125J7979n8205k6162j142l4240P3238L9807l8703j8869N0910k4513
$$ 84747 50622 68601 10396 -15766 -16908 -51148 22090 61897 23194 4325 55235 30722
21714C0722j2592O822Q7978k5011J1285L5437j5206k7810l9545M1838n2875q4383
$$ 30722 18130 24952 112930 87919 99204 134641 119435 91625 52080 93918 41043 -43340
21702d3340m7789Q5140K3105l9904k8300M9678N8368P4602j14847n8676K8550
$$ -43340 -91129 -5989 17116 -22788 -51088 -1410 56958 131560 16713 -41963 -13413
21691a3413K9024N5283r638m6111K0681j6318q9988p6770j516m0824m740P5174
$$ -13413 15611 70894 61256 15145 35826 19508 -70480 -147250 -148766 -189590 -194330 -119156
21679a19156n728o3260J9178P2774N8052p3004J8016R7172Q6060K2716o8680L2276
$$ -119156 -124884 -188144 -168966 -96192 -38140 -111144 -93128 4044 90104 112820 44140 76416
21667G6416J9802J04771J11520j48923j22216K1842M6744n6844p2470K983P8093
$$ 76416 96218 200989 312509 163586 41370 63212 109956 53112 -19358 -16375 61718
21656F1718O1783J35368Q7554p8582j12811k8761n6360l4827J24169k7206j10316
$$ 61718 123501 258869 346423 267841 155030 126269 69909 35082 159251 132045 21729
21645B1729n2160J5570L9471m9215J5999N058r538M338l5548j270R9596P3278
$$ 21729 -30431 -14861 24610 -24605 -8606 -3548 -13086 -8748 -44296 -45566 54030 127308
21633A27308L4251j60711j2207K5479N5875j6078k9407N2523L5911j10844r8334
$$ 127308 161559 848 -11359 14120 69995 53917 24510 77033 112944 2100 -96234
21622i6234M6563O3556R0235J8426M5300o9962k7115k3876l3015N2964J4818R338
$$ -96234 -49671 13885 104120 122546 167846 97884 70769 46893 13878 66842 81660 90998
21610I0998R9777Q5860m2149k06106j11710J00871Q209p5730r2729n4454J700
$$ 90998 190775 276635 234486 28380 -83330 17541 25750 -49980 -142709 -197163 -195463
21599a95463j4904L7655K3701O1380j2330j01294J0396J56044J18765R7247m746
$$ -195463 -210367 -172712 -149011 -87631 -99961 -201255 -190859 -34815 83950 181197 176451
21588A76451q3128K0125K9330p752K2318Q221p8651j38747k4626l0221N9093J21483
$$ 176451 93323 113448 142778 135026 157344 165565 86914 -51833 -76459 -106680 -47587 73896
21576G3896O801o8767p9796P0629P3066p8152o5161M7110J22110k1060m3782R023
$$ 73896 80697 11930 -67866 2763 75829 -2323 -67484 -20374 101736 80676 36894 45917
21564D5917L0450L8065m3260p9913j0249M9131R0826k7006j26356l4885m7937
$$ 45917 76367 114432 71172 -8741 -18990 30141 120967 93961 -32395 -67280 -115217
21553a15217J6310Q884n0083n8157p5946J9951k754O4350J21783m91R883P7796
$$ -115217 -98907 -90023 -140106 -198263 -274209 -254258 -257012 -192662 -70879 -71370 -61487 16309
21541A6309m5513N8007N6530J0911m2303L7485l8853l82m41M3298K9212n1388
$$ 16309 -29204 28803 85333 96244 53941 91426 52573 52191 51750 95048 124260 72872
21529G2872n9119l8644o2088j13082N0813J48531K9644l1011N035j4287j0750
$$ 72872 13753 -24891 -86979 -200061 -149248 -717 28927 -2084 2951 -11336 -22086
21518b2086O2628k2459j0322k3579K2902J9737R0026p5911N1514J8510Q4069l9557
$$ -22086 40542 18083 7761 -15818 7084 26821 116847 40936 92450 110960 195029 155472
21506A55472n1201q4944r8802N5847J7521n9851r5018j3078N9201R2004L6545
$$ 155472 104271 19327 -79475 -23628 -6107 -65958 -160976 -174054 -114853 -22849 13696
21495A3696L5585m3951K1141Q4140O793L6856K3658q9924p6779J1778J08244K2342
$$ 13696 49281 5330 26471 110611 117404 154260 177918 87994 11215 22993 131237 153579
21483A53579k6451j39582M6878P6995l5239P5354Q4826k1200p7286j22318j61586
$$ 153579 127128 -12454 34424 111419 76180 151534 236360 215160 137874 15556 -146030
21472a46030J18749O1430P2259j4040j10986o4159P4783O9513p859q0382q0859
$$ -146030 -27281 34149 106408 92368 -18618 -82777 -7994 61519 53660 -26722 -107581
21461a07581K5294J9658J6329m1941q2182o7344N5432j969O3594L8822o146l334
$$ -107581 -82287 -62629 -46300 -88241 -170423 -237767 -182335 -184304 -120710 -81888 -88034 -91368
21449i1368K3631N3390M4153P990l5378K772m9982K7623J14996Q0202p1026j2740
$$ -91368 -67737 -14347 29806 37796 2418 5190 -44792 -17169 97827 178029 107003 94263
21437I4263r9392j1927r642o6037n204K2960l229L475J2285n3073n5589P603j04501
$$ 94263 -5129 -17056 -26698 -92735 -97939 -74979 -78208 -74733 -62448 -115521 -171110 -163507 -268008
21424b68008j3777O8939l0108J6943J13198N03j7614Q6351J32702k8799j35881
$$ -268008 -281785 -212846 -242954 -226011 -112813 -112310 -129924 -43573 89129 60330 -75551
21413g5551l3812O697P8098o9936R5575P343p2340q690n543j2622J13303J09643
$$ -75551 -109363 -102666 -24568 -94504 1071 8414 -63926 -72616 -78159 -90781 22522 132165
21401A32165M452n1191J1805k2264k8077K792n2417j01260l8447Q0962k3857o71
$$ 132165 136617 85426 97231 74967 46890 49682 -2735 -103995 -142442 -61480 -85337 -86008
21389h6008l2678N0517J7675K2576O2847p862M3706O2288L4135m4674p7288j1621
$$ -86008 -118686 -68169 -50494 -27918 34929 27067 70773 133061 167196 122522 45234 33613
21377C3613J5617M386q9233n3111r343j8994P5875K6415N8160N232J8664N7286
$$ 33613 49230 53616 -35617 -88728 -98071 -117065 -41190 -14775 43385 48617 67281 124567
21365A24567j5935m932o1676m8593L3384M5775n9737m4449o9483R812R1429O3933
$$ 124567 108632 103700 42024 -6569 26815 72590 12853 -31596 -101079 -91267 162 64095
21353F4095p0181l0685l0710P8023J34302J6195k6947p6339k2356r0m3989J0595
$$ 64095 -6086 -36771 -67481 10542 144844 161039 134092 57753 35397 35307 -8682 1913
21341A913P5346p2291n5640m830k2252j6085j7302j3384J17742O4322n4593n6826
$$ 1913 77259 4968 -50672 -55502 -77754 -93839 -111141 -124525 -6783 57539 2946 -53880
21329e3880N4216P9328L5516N4854L2548k2767k04l1382m0138l7396k0488l0677
$$ -53880 336 79664 115180 170034 202582 179815 179611 148229 108091 70695 50207 19530
21317A9530M5521k4546O0880R7169l9845m5608M3669M0206K6040l8613j31903
$$ 19530 65051 40505 101385 198554 158709 113101 156770 196976 223016 184403 52500
21306E2500k3238O5878k963n248R716J9811O4881o8863k2849M0620n0835o0741
$$ 52500 29262 95140 92177 86929 96645 116456 181337 112474 89625 130245 79410 18669
21294A8669M0087o358j12165K5374N6813k5187M6568P1875r0711m4934Q2034N4054
$$ 18669 58756 52398 -59767 -34393 22420 -2767 43801 115676 24965 -19969 62065 116119
21282A16119J04957j11822q3420K7939j36707o1054O7224J21048Q0073O1591p0107
$$ 116119 221076 109254 25834 53773 -82934 -143988 -76764 44284 124357 185948 115841
21271A15841p3926j7776M6869O5041N037j9221l5468p6270k7910J0803O6477M3360
$$ 115841 41915 24139 71008 136049 141086 121865 86397 10127 -17783 -6980 59497 102857
21259A02857m1030j3814M5704M3499r4799n9857J19209N0369Q1395R314n8768
$$ 102857 61827 48013 93717 137216 42417 -17440 101769 152138 233533 242847 184079
21248A84079p8075j4735J9189o0119j8404L0693K7540m0558q6740r712N9764J7297
$$ 184079 106004 91269 110458 50339 31935 62628 90168 49610 -37130 -46842 12922 30219
21236C0219J7578j70601M288Q3444J04937o4453j27048N4438J3581L6229Q8076
$$ 30219 47797 -122804 -118516 -35072 69865 5412 -121636 -67198 -53617 -17388 70688
21225G0688L1938P9535j9927n2524k0401R073k1525k785m1154j4023N9970M9763
$$ 70688 102626 182161 162234 109710 89309 98382 76857 74072 32918 18895 78865 128628
21213A28628m1095j29627r0291L4827R3122Q187n2670K5412Q8304J8915j15565
$$ 128628 87533 -42094 -132385 -97558 -4436 3751 -48919 -23507 64797 83712 -31853
21202c1853n2106P0075o8887M0229j5823J78303R4759q7130l1690L8031J07380
$$ -31853 -83959 -13884 -82771 -42542 -58365 119938 214697 127567 95877 133908 241288
21191B41288n883k9803j35085k3712q389k1191j03514n5858Q85L2944M0201J6697
$$ 241288 235405 205602 70517 46805 38416 17225 -86289 -142147 -141262 -108318 -68117 -51420
21179e1420j9465j4189m7456L908q989N8278R3561N7783m8473n7267l6848j44974
$$ -51420 -70885 -85074 -132530 -128622 -137611 -79333 14228 72011 23538 -33729 -70577 -215551
21167b15551P42j9316J0745J26005J55592J29624j07895o0934j4644O7222J2752
$$ -215551 -214809 -234125 -223380 -97375 58217 187841 79946 19012 4368 71590 84342
21156H4342K5858j7289J8010p3987k9345j3241n2487k8607P2086p0977j30165
$$ 84342 110200 92911 110921 36934 7589 -5652 -58139 -86746 -14660 -85637 -215802
21145b15802K0161J12942L9361o8860l7500P1379J08559L5633p188o5093n8468
$$ -215802 -195641 -82699 -43338 -112198 -149698 -78319 30240 65873 58685 -6408 -64876
21134f4876K2259P1957N513J12338k7264l0531M0452r6690j32934N1043J57816
$$ -64876 -42617 29340 34853 147191 119927 89396 129848 33158 -99776 -48733 109083
21123A09083J28276p3844J6049M9048o3943j19115Q885k9516o429N7377k5382
$$ 109083 237359 163515 179564 228612 164669 45554 54439 24923 18494 75871 50489
21112E0489Q273o4672q8901K2685j0910J47103K2218k0777k6380j8339k6742K4743
$$ 50489 58762 -5910 -94811 -72126 -83036 64067 86285 65508 39128 20789 -5953 18790
21100A8790P2819N2878q4471j27530k5542J3386P5157R0957L7971m3344K2014
$$ 18790 91609 144487 60016 -67514 -93056 -79670 -4513 86444 124415 81071 103085
21089A03085q0040J6212l4283K9703j7660j6232j2159O2803L4534k7526l2294
$$ 103085 23045 39257 4974 34677 17017 785 -11374 51429 85963 58437 26143
21078B6143K4291L4319r9934j13041J13412m193l0217J10649K5467p4853j01108
$$ 26143 50434 84753 -15181 -128222 -14810 -19003 -49220 61429 86896 12043 -89065
21067h9065Q6696J12603P5189O1058j8735l5674j6065l3978n0028L6123J0057
$$ -89065 -2369 110234 185423 246481 227746 192072 176007 142029 92001 128124 138181
21056A38181L5799l292k7783j6372k9229o494m0470M3469q6352L52L2980R536
$$ 138181 173980 170688 142905 126533 97304 90810 50340 93809 7457 7809 40789 50325
21044E0325K9803l5072K3741J27312P8597j25600p0918p8233R8406K0089o1566
$$ 50325 80128 45056 68797 196109 274706 149106 78188 -45 98361 118450 56884
21033E6884p4872K4630l2662J8014L7386l074l2834N7153N942k8086j17256L8480
$$ 56884 -17988 6642 -26020 -8006 29380 26306 -6528 50625 56567 28481 -88775 -50295
21021e0295P9908M3944P3084R231K2217l8399N3928K0921q6656r3278J9887P0468
$$ -50295 29613 73557 146641 155872 178089 139690 193618 214539 127883 34605 54492 124960
21009A24960l0822O2284j14r9834J6591k728L6825M4730o3500l4347O5698k6877
$$ 124960 94138 156422 156308 56474 73065 70337 107162 151892 88392 54045 119743 92866
20997I2866r4817R0661P9034m353l7604m8214l0512j02264p7979m819N5325P9277
$$ 92866 -1951 88710 167744 163391 125787 77573 47061 -55203 -133182 -138001 -82676 -3399
20985c399Q0259l8851m1477j03188N2025R7726K4235m1263Q0351J54190j9440
$$ -3399 76860 38009 -3468 -106656 -54631 43095 67330 26067 106418 260608 241168
20974B41168j23659o4060J17431m2884r7885q7887k7003J36665J81970o91o474
$$ 241168 117509 53449 170880 127996 30111 -57776 -84779 51886 233856 233165 226691
20963B26691j33958j06612J4629N2815J6297l7286o4141m6716P965l429J1580
$$ 226691 92733 -13879 750 53565 69862 32576 -31565 -78281 -70316 -73745 -62165
20952f2165j1138J0517j3085Q512P8352k8650P4164o3152o0624k7814K0148L7942
$$ -62165 -73303 -62786 -75871 -67359 10993 -17657 56507 -6645 -67269 -95083 -74935 -36993
20940c6993k747n0045M9809P0582K4676j10635j23069R8044J16095k2835k1413
$$ -36993 -39740 -89785 -39976 30606 55282 -55353 -178422 -80378 35717 12882 -8531
20929h531j8120L3567m9550l3364Q292K4034j553K5750K8791K602O4406R8703
$$ -8531 -26651 6916 -42634 -75998 -67706 -43672 -45225 -19475 9316 11918 76324 175027
20917A75027p4233k553p849q7126l5773J6860m890J05759k8553O2729K04123l2967
$$ 175027 100794 98241 90392 3266 -32507 -15647 -20537 85222 56669 119398 323521 290554
20905B90554r2280q1982K0317P837j17173j59124k9481O2400o7037o34K2038J36734
$$ 290554 198274 116292 136609 144446 27273 -131851 -161332 -98932 -165969 -166603 -144565 -7831
20893g831P6271m6141n119q9022K8305L4628K2483O3981M0807l5388K7032N0295
$$ -7831 68440 22299 17180 -71842 -43537 -8909 13574 77555 118362 82974 110006 160301
20881A60301k7608o406n4841j0613J3239l1628r9944o534k129P1220J14536r6624
$$ 160301 132693 126287 71446 60833 74072 42444 -57500 -64034 -66163 5057 119593 22969
20869B2969j21504Q6533k2295j07392K5818J09593J533J8955o4560N4493O4031
$$ 22969 -98535 -12002 -34297 -141689 -115871 -6278 -4745 14210 -50350 4143 68174
20858F8174j3253k4039r4766q46O2360P250o8070L4297l6119l5518l4061j2582
$$ 68174 54921 30882 -63884 -64730 -2370 4880 -63190 -28893 -65012 -100530 -134591 -147173
20846a47173K837K3572O4705J1546M1713L5512j5435J3039P2459L2706j37299
$$ -147173 -144336 -120764 -56059 -44513 -2800 32712 17277 30316 102775 135481 -1818
20835a818j32166O9056P3056j6417N467K7225N1866J0056J1580J6910n0069l581
$$ -1818 -133984 -64928 8128 -8289 -2822 24403 76269 86325 97905 114815 64746 61165
20823F1165o496o0892O6887L2594n5883N918r6987m1522J39739J62851K7362q8621
$$ 61165 54669 -6223 60664 93258 37375 43293 -53694 -95216 44523 207374 234736 146115
20811A46115M055K9223o9870n7274k0549L6045J0220K1829J8701M7149K8986O2471
$$ 146115 150170 179393 109523 52249 31700 67745 77965 99794 118495 165644 194630 257101
20799B57101l7570j43370j24098k5467j3134M7422N9627l0220M04n4224o1936
$$ 257101 219531 76161 -47937 -73404 -86538 -39116 20511 -9709 -9305 -63529 -125465
20788a25465m6639L431K7329M3440J7121K1007P6707J01884L8166j27483J7757
$$ -125465 -172104 -168673 -141344 -97904 -80783 -59776 16931 118815 156981 29498 47255
20777D7255p4413l0891O2282L2958m0492R036p0675Q738K5609N3057J3707m417
$$ 47255 -27158 -58049 4233 37191 -3301 5735 -64940 -56202 -30593 22464 36171 31754
20765C1754J5090J506m1940m2512N6551N4562p6420J9019L1863N3604p8862o2282
$$ 31754 46844 48350 6410 -36102 20449 75011 -1409 17610 49473 103077 24215 -38067
20753c8067m9242n150M3541P268j1610M6430k6248J2597m5972k1657M7591O5186
$$ -38067 -87309 -92459 -48918 -41650 -53260 -6830 -33078 -20481 -66453 -88110 -40519 24667
20741B4667l9178j49960K8603K2484N8671R6721M6536O45o2402N5821J0281q108
$$ 24667 -14511 -164471 -135868 -113384 -54713 42008 88544 89189 26787 82608 92889 84781
20729H4781j05442J24859L8706N9270m6820m1067M161Q386J2842r4848j9426O9550
$$ 84781 -20661 104198 142904 202174 155354 114287 118448 126834 139676 44828 25402 94952
20717I4952M6342L6673m4730O177j821K3903L5568q8211j40043K9599p830L8820
$$ 94952 141294 177967 133237 139414 137593 161496 197064 108853 -31190 -1591 -9421 29399
20705B9399r998j05081N6194J4613P9504J0588l4179O5475L7015q1808R268L3206
$$ 29399 19401 -85680 -29486 -14873 64631 75219 41040 106515 143530 61722 70990 104196
20693A04196l7967k7640J0373j1444r2916p5872J04021O0156j105l4348M8634
$$ 104196 66229 38589 48962 37518 -55398 -131270 -27249 32907 31802 -2546 46088
20682D6088J1341l5187O811J06635k9714p7583k0338k039k0177M1205m9010p2040
$$ 46088 57429 22242 29053 135688 105974 28391 8053 6014 -14163 27042 -21968 -94008
20670i4008m04R7245K6119N4791L3672j5623n859o664k2094J5356N0969p9019
$$ -94008 -94412 2833 28952 83743 117415 101792 95933 89269 67175 82531 133500 54481
20658E4481p1970O35L4457J02150M0058o0443r9708l2662J5839R1433J08143J2953
$$ 54481 -17489 -16854 17603 119753 159811 99368 -340 -33002 -17163 74270 182413 195366
20646A95366r0532L3033l3229n0771k7130R356K3543L9455n8008J693J3186r3673
$$ 195366 104834 137867 104638 53867 26737 36093 59636 99091 41083 42776 55962 -37711
20634c7711J313O5074J8746o3363N7318O5010j39174j22001L2038J79423j7805
$$ -37711 -36398 28676 47422 -15941 41377 106387 -32787 -154788 -122750 56673 38868
20623C8868k0840N1392k8232M0796m8981N352J22125m0455l9589j2003P0416L0372
$$ 38868 18028 69420 41188 81984 33003 38355 160480 120025 80436 68433 138849 169221
20611A69221q909J9966p4785k9210M8144N6515K3365o5767n4592K3568J5552j4278
$$ 169221 160312 180278 105493 76283 124427 180942 204307 138540 83948 107516 123068 108790
20599A08790j1234p6021j22592k0749M6317O6474j7494n494J07737J2667j8415
$$ 108790 97556 21535 -101057 -121806 -75489 -9015 -26509 -32003 75734 88401 69986
20588F9986J3608M4760P718N4508M5753j9198r1771J2261k8101N3014r419j51
$$ 69986 83594 128354 136072 190580 236333 217135 125364 137625 109524 162538 153119 152968
20576A52968j8742r2354M5009N0219l0382j04356k7317K8796L6358L9774P6823
$$ 152968 134226 41872 86881 137100 106718 2362 -24955 3841 40199 79973 156796
20565A56796l1444j58467r4558R9815m018J01759P3143J1672p923r9551o4573
$$ 156796 125352 -33115 -127673 -27858 -31876 69883 143026 154698 146775 47224 -17349
20554a7349p3377n4866N7313P1879N1408l4410l2869M5316j3250L2434N8432L673
$$ -17349 -90726 -145592 -88279 -16400 35008 598 -32271 13045 -205 32229 90661 94334
20542I4334j7652J3729p1823j7673J8507q8931n5806K5121j29292N1106J43712
$$ 94334 76682 90411 18588 915 19422 -69509 -125315 -100194 -229486 -178380 -34668
20531c4668r534L6474m7569J9950j9383p473L5690P3174M9438J7859j3655m4673
$$ -34668 -44202 -7728 -55297 -35347 -54730 -62203 -26513 46661 96099 113958 100303 55630
20519E5630p5804p9337j3449M6451O9993Q1714j31494j0440L4792Q2079P8067
$$ 55630 -20174 -99511 -112960 -66509 3484 85198 -46296 -56736 -21944 60135 138202
20508A38202j00085K9677N8197P0455K1571K3596q1828p5085m1469K7496k148
$$ 138202 38117 67794 125991 196446 218017 241613 159785 84700 43231 70727 68579
20497F8579j1557K5394R2566M4636l6704n766L8371M023Q1964n6810o7520r2285
$$ 68579 57022 82416 174982 219618 182914 177148 215519 219542 301506 244696 177176 84891
20485H4891j41903M549Q0550L0179j3347Q0452n3540p6975J5380K5600L7870r1345
$$ 84891 -57012 -52463 28087 58266 44919 125371 71831 -5144 10236 35836 73706 -17639
20473a7639J8195k9198n2323m2662Q503P7428M2968K7027J5689m9350P387k916
$$ -17639 556 -28642 -80965 -123627 -115124 -37696 5272 32299 47988 -1362 6025 3109
20461C109K8772K6718o174J8260J682k9090O9277M0075K7022j23289o3313j3109
$$ 3109 31881 58599 52425 70685 72367 43277 112554 152629 179651 56362 -6951 -20060
20449b0060Q448l2027j8834L5032L6269J258n0010L2497M7836n957l0598J07280
$$ -20060 -11612 -43639 -62473 -27441 8828 10086 -39924 -7427 40409 34452 3854 111134
20437A11134Q3148J3378L2354k100q9661J2142M2410J5454m6241o8723q3724m2917
$$ 111134 194282 207660 240014 237914 148253 160395 202805 218259 172018 103295 19571 -23346
20425b3346J04412J28488O7005m2594j7470r6833p5700M6194J779J6890l5060
$$ -23346 81066 209554 276559 233965 216495 119662 43962 90156 91935 108825 73765
20414G3765K6363L2140k5667L2460R5402m428q8844j08043P022m5639K5629N2279
$$ 73765 100128 132268 106601 139061 234463 230035 141191 33148 40170 -5469 20160 72439
20402G2439q735j7901P203l1646j3250P2735M2969k5035n253L478j3657R2765
$$ 72439 63704 45803 53006 21360 8110 80845 123814 98779 93526 97004 83347 176112
20390A76112r5100j08311K0406O5362l4079J12006J1095o6915q2980J6961K8100
$$ 176112 81012 -27299 -6893 58469 24390 136396 147491 80576 -2404 14557 42657
20379D2657L7889N8038o6649K4278Q664j4583J0431n68j2772m2856k9891M240
$$ 42657 80546 138584 71935 96213 104877 90294 100725 100157 87385 44529 14638 18878
20367A8878J05728O7965j23483p2525l4770L2609J04093M054n7809P749Q6377
$$ 18878 124606 192571 69088 -3437 -38207 -5598 98495 102549 44740 52489 138866
20356A38866L9348J2476J2288k1850j5866Q563o8240o0292P8635M1650j32015
$$ 138866 178214 190690 202978 181128 165262 173825 105585 45293 123928 165578 33563
20345C3563L59M6494M6793k5109l3834k0190M8595J6273M4091K3559n5228N4444
$$ 33563 33922 80416 127209 102100 68266 48076 96671 112944 157035 180594 125366 179810
20333A79810q122q401J01669O1p1746n6423k5124O6096r930n4433q694P4690M272
$$ 179810 171688 163287 264956 265017 193271 136848 111724 177820 167890 113457 104763 179453 183725
20320A83725l3852o5365J1608J3694M4999o0223j02882p2055M1254Q8306J2952
$$ 183725 149873 84508 96116 109810 154809 94586 -8296 -80351 -39097 49209 62161
20309F2161l5746m6901J9465J02372M6777p8556k3123N079J2108r0532k5459P2929
$$ 62161 26415 -20486 -1021 101351 148128 69572 46449 51528 63636 -26896 -52355 20574
20297B0574J00925p3789N9505o580j14458K1499J16650J2201R9806R6376m2350
$$ 20574 121499 47710 107215 100635 -13823 7676 124326 136527 236333 332709 290359
20286B90359m2306N9392p0759r5991m1103o4737l6751O4959J34587N945l5460
$$ 290359 248053 307445 236686 140695 99592 34855 -1896 63063 197650 203595 168135
20275A68135m7981k801R487o1578j48450J29195J0829j14722l6538P7097O7647
$$ 168135 120154 117353 126840 65262 -83188 46007 56836 -57886 -94424 -17327 50320
20264E0320J2272O4146O1753R1k6746P3591q8712j05040M9548q6320p2449J52697
$$ 50320 62592 126738 188491 188582 161836 235427 146715 41675 91223 4903 -67546 85151
20252H5151L5126q6050K405M896n1772k866p3763p394P6976Q752M1371P606j07841
$$ 85151 120277 34227 36632 41528 -10244 -13110 -86873 -94267 -17291 -8539 32832 40438 -67403
20239f7403j5928J02620R9221N7802N209k8379n0428k8154O056M5349q3181J4975
$$ -67403 -83331 19289 118510 176312 181521 153142 102714 74560 80616 125965 42784 57759
20227E7759O6991j8152K1551O8576j9214M5960Q8717l6670j60940q8927P8224
$$ 57759 124750 106598 128149 196725 177511 223471 312188 275518 114578 25651 103875
20216A03875J05144n9291m0123O8670K1534L2041m6198k306O2822M844l0847M6545
$$ 103875 209019 149728 109605 178275 199809 231850 185652 183346 246168 251012 220165 266710
20204B66710q0329o3727r6325l2256O2567l7659Q1737Q4781J5961j2979m8359
$$ 266710 186381 122654 26329 -5927 56640 18981 100718 185499 201460 188481 140122
20193A40122N5971O3861o2j0827j00914j2351Q1984K6838K5181p4501j07086k8039
$$ 140122 196093 259954 259892 249065 148151 135800 217784 244622 269803 195302 88216 60177
20181F0177R025K8011N587M1629o3786L9063L787Q8502j9241J30435N3550q8372
$$ 60177 69202 97213 102800 144429 80643 119706 123493 211995 192754 323189 376739 288367
20169B88367q7414j12017k9763J6830O3274O5779M1587J090O6756K4937P8039
$$ 288367 200953 88936 59173 76003 139277 205056 246643 247733 314489 339426 417465
20158D17465J9499L9162P5976R508N8597J11019N9184K8772J68332J67337J16419
$$ 417465 436964 476126 552102 561610 620207 731226 790410 819182 987514 1154851 1271270
20147A271270L4042n1193q2224M8546l9716L6167O0284m370N4800p5j00491o3797
$$ 1271270 1305312 1254119 1171895 1220441 1180725 1216892 1277176 1272806 1327606 1327531 1227040 1163243
20135A163243L6973Q3120n1168l7269N7259j1340J18400J63781M892j06626j74569
$$ 1163243 1200216 1283336 1232168 1194899 1252158 1240818 1359218 1522999 1527891 1421265 1246696
20124A246696l6170O4320M3336R0725P1358J7337J65380L35233J08003j71388
$$ 1246696 1210526 1274846 1318182 1408907 1480265 1497602 1662982 1998215 2106218 1934830
20114A934830j95370j13749j42810r1141l4838L1969j17713o3645m302k1289k2685
$$ 1934830 1739460 1625711 1482901 1391760 1356922 1388891 1271178 1207533 1203231 1181942 1159257
20103A159257O5345q4912j72939j81410j22592r7106m5241L3935O3422r698r629
$$ 1159257 1224602 1139690 966751 785341 662749 565643 520402 554337 617759 608061 598432
20092E98432q4379m8062R6214J01106p2152p0428R3222M5980j4296O6025J66078
$$ 598432 514053 465991 562205 663311 591159 520731 613953 659933 645637 711662 877740
20081H77740K51057J95418Q6774p1550R149N4821p1925r3591M0901k3838m017
$$ 877740 1128797 1324215 1410989 1339439 1348588 1403409 1331484 1237893 1278794 1254956 1250939
20070A250939J52256J88159j4041j76330p6731M8187l2630k10150k12672p7207
$$ 1250939 1403195 1591354 1577313 1400983 1324252 1372439 1339809 1129659 916987 839780
20060H39780o1590n174o1431j05644j6671r9608p1964j24529o5906J3942Q4745
$$ 839780 778190 773016 711585 605941 589270 489662 417698 293169 227263 241205 325950
20049C25950P9948l136O065r064M3671k4282r093k0693l1810k1710J2313K6229
$$ 325950 405898 402762 408827 399763 443434 419152 410059 389366 357556 335846 348159 374388
20037C74388M1523l7567l2267O3019n519r0315R2979O0464J54245K47265K21601
$$ 374388 415911 378344 346077 409096 403577 313262 406241 466705 620950 868215 1089816
20026A089816k9473j00324j02259j89115j242R9732k7365p8723J77351K33331
$$ 1089816 1060343 960019 857760 668645 667403 767135 739770 661047 838398 1071729
20016A071729M6991q9568m5735j55455j66254j48832p2226L9675q533L6932L450
$$ 1071729 1118720 1029152 983417 827962 661708 512876 440650 480325 471792 508724 512174
20005E12174n3106j04276j01775K4478J9095o4925Q2032K6568m9220p0131o3363
$$ 512174 459068 354792 253017 277495 296590 231665 313697 340265 291045 220914 157551
19994A57551J5001M8608n3285n9613O5937J795K9895J56413J41684j08116m4398
$$ 157551 172552 221160 167875 108262 174199 175994 205889 362302 503986 395870 351472
19983C51472o493K6946R6464j7953o9481n5028P5210M7708P696q4977r8177j01562
$$ 351472 344979 371925 468389 450436 380955 325927 401137 448845 456541 371564 273387 171825
19971A71825O3539M3459O6402L1927k7674l9393L2265j317m4978O3029R2619j6984
$$ 171825 235364 278823 345225 377152 349478 310085 342350 341033 296055 359084 451703 434719
19959D34719j7661j7945n3497L8014J1939O449O0N0859M8707m1809r8904P394
$$ 434719 417058 399113 345616 383630 395569 402018 402078 452937 501644 459835 360931 368325
19947C68325q4408J2989R1429N2374j0404n1535M6910L7539j35683k0047J05374
$$ 368325 283917 296906 388335 440709 430305 378770 425680 463219 327536 307489 412863
19936D12863j8344l1876L6259L9507j34224r6259M9965L9159m6639J54365J93714
$$ 412863 394519 362643 398902 438409 304185 207926 257891 297050 250411 404776 598490
19925E98490M3788p7977j6905j2680j04602j01558p115L7496J00523j9782n0726
$$ 598490 642278 564301 547396 534716 430114 328556 321441 358937 459460 439678 388952
19914C88952l512n81L1827o4589k9521M5417N1535L6127r6197m2736Q3001O4623
$$ 388952 385440 384859 416686 352097 322576 367993 419528 455655 359458 316722 399723 464346
19902D64346m0292J08164R3048o991j4850k1717N2430j714j22340j61896l3969
$$ 464346 424054 532218 625266 618275 603425 581708 634138 632424 510084 348188 314219
19891C14219M7888l7995M0531P2269j04117R8165o1793Q3643M2915q2487j191
$$ 314219 362107 324112 364643 436912 332795 430960 369167 452810 495725 413238 412047
19880D12047K6667M07j3438P8161j4245n1465K8758K0523j2482J1364J5237n0612
$$ 412047 438714 439121 425683 503844 489599 438134 466892 487415 474933 486297 501534 450922
19868D50922j8135N871M4650j946K0700K3545q2350P1781Q0994j24123k7368K0656
$$ 450922 432787 438658 483308 481362 502062 525607 443257 515038 596032 471909 444541 465197
19856D65197p154Q1706M4746J9360l5655o1916M834P7696K9691L2014N8753M801
$$ 465197 458043 539749 584495 603855 568200 506284 511118 588814 618505 650519 709272 714073
19844G14073L7371Q5205N1130N709l8794p1489O918j4794m3547m5525j4813N6177
$$ 714073 751444 836649 887779 893488 854694 783205 790123 775329 731782 686257 671444 727621
19832G27621K143N71Q745r9691j5839P124m7793j1341K9934J12934J42207K2427
$$ 727621 729764 730335 739080 639389 623550 630674 582881 571540 601474 714408 856615 879042
19820H79042m0009J44873l3937p0383q3883l0554J7675O0143J5940q8312r8730
$$ 879042 839033 983906 949969 879586 795703 765149 782824 842967 858907 770595 671865
19809F71865O3982M2940P7576J5356N7537p6653n188Q0959m7021J01203J30648
$$ 671865 735847 778787 856363 871719 929256 852603 847415 928374 881353 982556 1113204
19798A113204J81988R493r4901j46109P2111R0203m5342j36757P5879O3707O6757
$$ 1113204 1295192 1304685 1209784 1063675 1135786 1225989 1180647 1043890 1119769 1183476 1250233
19787A250233J12022k253j04273j04206r4585q7330j0882q13n355M9032l147O76
$$ 1250233 1362255 1360002 1255729 1151523 1056938 969608 958726 957913 952558 1001590 998443 999119
19775I99119o6830n7248j36919o8320m8242K4312M3906j16974o1398R7980N2323
$$ 999119 932289 875041 738122 669802 621560 645872 689778 572804 511406 609386 661709
19764F61709k8073M8679M5249n1369K963J15909q984L217J19829J05349P7274
$$ 661709 633636 682315 727564 676195 679158 795067 786083 789300 909129 1014478 1091752
19753A091752m433O1553Q1310k5651l1068q3406l764k5366k7265m2475p3372R2325
$$ 1091752 1087319 1148872 1230182 1204531 1173463 1090057 1086293 1060927 1033662 991187 917815 1010140
19741A010140J52330m4795J8095L5042k5385O1396J01o7521l2458K6177k7625
$$ 1010140 1162470 1117675 1135770 1170812 1145427 1206823 1206924 1139403 1106945 1133122 1105497
19730A105497o2176k8652J4945j8217o8757k4279J31723Q1876j7901L8101M2528
$$ 1105497 1043321 1014669 1029614 1011397 942640 918361 1050084 1131960 1114059 1152160 1194688
19719A194688n6073j5295J51363k5683k6653N5414R4499P3209p58Q6980L647m3779
$$ 1194688 1138615 1123320 1274683 1249000 1222347 1277761 1372260 1445469 1444711 1531691 1535338 1491559
19707A491559J17971N1600q4146j4054p8207J09134L3845K091Q4002O289N0944
$$ 1491559 1609530 1661130 1576984 1562930 1484723 1593857 1627702 1629793 1713795 1720084 1771028
19696A771028j3098o7631k6001L7119J11247J43268P6016P9322L1611K1101M9898
$$ 1771028 1757930 1690299 1664298 1701417 1812664 1955932 2031948 2111270 2142881 2163982 2213880
19685B213880q9295m7393o6998j20201K7102R6873n432N7875K2436k1332Q1026
$$ 2213880 2124585 2077192 2010194 1889993 1917095 2013968 2008536 2066411 2088847 2067515 2148541
19674B148541P6471M2868J17322K0625K47528J50424O8527P7210M1539O1967N578
$$ 2148541 2225012 2267880 2385202 2405827 2653355 2803779 2872306 2949516 2991055 3053022 3058600
19663C058600Q5696J23028M0041J4967L429J05466P6067P0475N436n1318J7071
$$ 3058600 3144296 3267324 3307365 3322332 3325761 3431227 3507294 3577769 3583205 3531887 3548958
19652C548958n6278n7260q4061J7816L7597J93091P9709P1338R2164J39638J38352
$$ 3548958 3492680 3435420 3351359 3369175 3406772 3599863 3679572 3750910 3843074 3982712 4121064
19641D121064n7976J8579J33913K21099M8138J91907K19579J06374J95445K01218
$$ 4121064 4063088 4081667 4215580 4436679 4484817 4676724 4896303 5002677 5198122 5399340
19631E399340K23762K85021K42206K83631K65312K39142L10959L06192K23505
$$ 5399340 5623102 5908123 6150329 6433960 6699272 6938414 7249373 7555565 7779070
19622G779070K67570N05859N01727N72657N74605M31410K06101L15895N02634
$$ 7779070 8046640 8552499 9054226 9626883 10201488 10632898 10838999 11154894 11657528
19613A1657528O82216O52161P93651J016539J382736J588492J774643K121959
$$ 11657528 12339744 12991905 13785556 14802095 16184831 17773323 19547966 21669925
19605B1669925K786705M148853O198221R468092J4930493K1891124K3324048P606819
$$ 21669925 24456630 28605483 34803704 44271796 59202289 81093413 104417461 112024280
19597A12024280j2449744j5058406r278331m191292k395M925269J1874938K1857162
$$ 112024280 99574536 84516130 75237799 71046507 71044112 75969381 87844319 109701481
19589A09701481L5120287M3723508K4480816k0473153l8625898k8993047j9171945
$$ 109701481 144821768 188545276 213026092 192552939 153927041 124933994 105762049
19582A05762049j3186891q291775l687002P75750N227893R375617J2635055J3226882
$$ 105762049 92575158 84283383 80596381 81372131 86600024 95975641 108610696 121837578
19574A21837578R188070L161303R87025L971705J0052705J7864161K5644370L0214163
$$ 121837578 131025648 134186951 135173976 139145681 149198386 167062547 192706917 222921080
19566B22921080K6751813J6504056O329606l790696j6416604k4817205k4234540
$$ 222921080 249672893 266176949 272506555 268715859 252299255 227482050 203247510
19559B03247510j8147434j0554761l083623K965405N616112M513842L544986L326063
$$ 203247510 185100076 174545315 171461692 174427097 180043209 184557051 188102037 191428100
19551A91428100j251610l963599K568961J4479619K9803215M9933909O8965766
$$ 191428100 190176490 186212891 188781852 203261471 233064686 282998595 351964361
19544C51964361O3524118K5355743P562853J7898080J939920l4397374l6378893
$$ 351964361 415488479 440844222 448407075 466305155 468245075 433847701 397468808
19537C97468808j1362360J2914358K6341836K3615528L806277l0716063n9701309
$$ 397468808 386106448 399020806 425362642 448978170 452784447 422068384 362367075
19530C62367075o1928161n0751179l9323739k9913925k1627888j4495804r544087
$$ 362367075 300438914 249687735 210363996 180450071 158822183 144326379 134782292
19523A34782292q344524j0364041j1972038j1218192r253059p665778o418123
$$ 134782292 126437768 116073727 104101689 92883497 83630438 75964660 69546537
19516F9546537n102210m036745l237141k917260k421089j954666j654618j294602
$$ 69546537 64444327 60407582 57170441 54253181 51832092 49877426 48222808 46928206
19508D6928206p33297l06019K67055Q99630J520455K736299M764407Q018632J3338140
$$ 46928206 46194909 45888890 46155945 47055575 48576030 51312329 56076736 64095368 77433508
19499G7433508K2137350L4965310M4473638K7531795j7275598l8091588k9559214
$$ 77433508 99570858 134536168 179009806 206541601 189266003 151174415 121615201
19492A21615201j9616983j3561132q403833k642253M333338J3073973K1633589
$$ 121615201 101998218 88437086 80033253 77391000 81724338 94798311 116431900
19485A16431900J9210760m375688k4769718k3262573j6190446j2004795r268444
$$ 116431900 135642660 131266972 106497254 83234681 67044235 55039440 45770996
19478D5770996p063121n216464l919976l057147k330069j818127j293347j031095
$$ 45770996 38707875 33491411 29571435 26514288 24184219 22366092 21072745 20041650
19470B0041650r07906q86414q12130q68048q92836r61325r22264o39291o33684
$$ 20041650 19133744 18247330 17435200 16567152 15674316 14712991 13790727 13151436 12517752
19461A2517752n63444k96288j97516l54352n00765m36834n11220m76870m33726
$$ 12517752 11954308 11658020 11460504 11106152 10605387 10168553 9657333 9180463 8746737
19452H746737m14232l66291j39463k79135k81616j60143l13753j54236j64970
$$ 8746737 8332505 7966214 7826751 7547616 7266000 7105857 6792104 6637868 6472898
19443F472898k54539k20209j47616q9507j59228j59257p1421j0657p9718j44051
$$ 6472898 6218359 5998150 5850534 5761027 5601799 5442542 5371121 5360464 5280746 5136695
19433E136695j70594k03400j76523J0884o8748j03564j97655j37599j65736j49126
$$ 5136695 4966101 4762701 4586178 4597062 4528314 4424750 4227095 4089496 3923760 3774634
19423C774634j50883o3240J4005j31031j51779q4784L4840R6782M9767j31620
$$ 3774634 3623751 3560511 3574516 3443485 3291706 3206922 3241762 3338544 3388311 3256691
19413C256691k06636m5979P6791m72m9896j57231p3126o5608n5028j18881j15505
$$ 3256691 3050055 3004076 3080867 3080395 3030499 2873268 2800142 2734534 2679506 2560625 2445120
19402B445120j3274r2500j17064j18171j54183n0094p0980K8351l7231m7500q4888
$$ 2445120 2431846 2339346 2222282 2104111 1949928 1899834 1828854 1857205 1819974 1772474 1687586
19391A687586j6518J6876k2644r0606r4631O28o1018p9542M3654P7126m3832n5264
$$ 1687586 1671068 1687944 1665300 1574694 1480063 1480691 1419673 1340131 1383785 1460911 1417079 1361815
19379A361815M3489k0176r4811o6004n3525m2621q0125k5657j5963n5705O6703
$$ 1361815 1405304 1385128 1290317 1224313 1170788 1128167 1048042 1022385 1006422 950717 1017420
19368A017420l9060R0129j231m0954p9709j2688P0176K9126l5742M400L3950k8229
$$ 1017420 978360 1068489 1067258 1026304 946595 933907 1004083 1033209 997467 1001867 1035817 1007588
19356A007588l5376o9900N849m4305j77917m9256J26485j25482j513O0215p686
$$ 1007588 972212 902312 908161 863856 685939 636683 763168 637686 636173 696388 688702
19345F88702q8093k6863J998Q1823p135m7545j3327J5671m3837k8949l5616j340
$$ 688702 600609 573746 575744 657567 650432 602887 589560 605231 561394 532445 496829 495489
19333D95489K8819p7436o8992L2509Q0770j00558L558N5566q0333m3373m3827
$$ 495489 524308 446872 377880 410389 491159 390601 394159 449725 369392 326019 282192
19322B82192R288L5366l1863K4332L3826R7818R459K8879J3257j4072j10435m9373
$$ 282192 291480 326846 294983 319315 353141 450959 460418 489297 502554 488482 378047 328674
19310C28674r491O6872n9762n1456l7079J3728J3044o7714M079N0075K8926K0694
$$ 328674 319183 386055 326293 274837 237758 251486 264530 196816 200895 250970 279896 300590
19298C00590J7292j8716j15145P268O6078j06185K0203J86502L0509n2746n3243
$$ 300590 317882 299166 184021 191289 257367 151182 171385 357887 388396 335650 282407
19287B82407p3182n6134k6752K5464j3445p143l2156M1087M1995j1954M0659m4998
$$ 282407 209225 153091 126339 151803 138358 131215 99059 140146 182141 170187 210846 165848
19275A65848j30685j5938p7456l0206R8642N0062M6947k4323L4829J55014N422
$$ 165848 35163 19225 -58231 -88437 10205 60267 107214 82891 117720 272734 278156
19264B78156m4254n2154o2552K7693j1954k6163l9052L9367n3667O0477l8391
$$ 278156 233902 181748 119196 146889 134935 108772 69720 109087 55420 115897 77506
19253G7506j08475N2030R1650l3774m9380n6759k5569j8996O42m088q33n1880
$$ 77506 -30969 21061 112711 78937 29557 -27202 -52771 -71767 -71125 -75213 -76046 -127926
19241a27926k3867J39298J5351n7703N9110l4743r6789j4480M430J0297Q9212
$$ -127926 -151793 -12495 2856 -54847 4263 -30480 -127269 -141749 -137319 -127022 -37810
19230c7810j06535m8099K1939N5220q3589m7282k6847J17277N3618j1901p0319
$$ -37810 -144345 -192444 -170505 -115285 -198874 -246156 -273003 -155726 -102108 -114009 -184328
19219a84328Q9890O014r5598J509J24850R3398j09922o9482K6990N7588k8795
$$ -184328 -94438 -88424 -184022 -182513 -57663 35735 -74187 -143669 -116679 -59091 -87886
19208h7886l4626R6357l7171L6347Q3575J03117l2942l0017o320m5121j6164K3866
$$ -87886 -122512 -26155 -63326 -26979 56596 159713 126771 96754 90434 45313 29149 53015
19196E3015M8568l7763O3O4719J15834p7902m4121j6074r9522k5671q926R9925
$$ 53015 101583 63820 63883 128602 244436 166534 122413 106339 6817 -18854 -27780 72145
19184G2145n1323m4840L8272m9235k9064J06804J55199K1959J10433J53419J02316
$$ 72145 20822 -24018 14254 -34981 -64045 42759 197958 219917 330350 483769 586085
19173E86085J91994O0875J6366J91388J27688Q2311J255q3496r7924M5701j06662
$$ 586085 778079 838954 855320 1046708 1174396 1256707 1257962 1174466 1076542 1122243 1015581
19162A015581k11136k13818j28710j06879p6536J7156K0513o7451p6862J4035
$$ 1015581 804445 590627 461917 355038 278502 295658 316171 248720 171858 185893
19152A85893M1387m7891M074J178j5887J8630m8822m4582q40P4837J52645J74057
$$ 185893 227280 179389 183463 184641 168754 187384 138562 93980 93140 167977 320622 494679
19140D94679K27568J91567J02600J09155P8207N665j6814p9445r8897j25056j19063
$$ 494679 722247 913814 1016414 1125569 1203776 1209441 1192627 1113182 1014285 889229 770166
19129G70166m8171j08784j90770j42664R218N153K593o4035j30274j04218m7273
$$ 770166 721995 613211 422441 279777 288995 294148 296741 232706 102432 -1786 -49059
19118d9059L756K5158J05204J29196j14016j34558j9113P4004M0984K0088J0840
$$ -49059 -45303 -20145 85059 214255 100239 -34319 -53432 20572 61556 81644 92484
19107I2484l8645p8307O9656J06976n1274j47817m0237O4063n4804k3567J03701
$$ 92484 53839 -24468 45188 152164 100890 -46927 -87164 -23101 -77905 -101472 2229
19096B229k5301M9614K645R0200J5125p1927j30686J0073P328j6070J7271p1287
$$ 2229 -23072 26542 29187 119387 134512 62585 -68101 -58028 -50700 -66770 -49499 -120786
19084a20786n1221L8612N9365O2492J3918k8907j5728J29011l7757q2318N3786
$$ -120786 -172007 -133395 -74030 -11538 2380 -26527 -42255 86756 48999 -33319 20467
19073B0467M708m5447J1500J01303Q6707K7644J0673K1Q6434M3038J0036J55727
$$ 20467 25175 -20272 -8772 92531 179238 206882 217555 217576 304010 347048 357084 512811
19061E12811J81972N5281j16724q2179j26218q4522m3270j9052Q5643O0801J36169
$$ 512811 694783 750064 633340 551161 424943 340421 297151 278099 363742 424543 560712
19050E60712J93412K635p5781j41295r3239m9316p0079p0408K7012k9009o4764
$$ 560712 754124 756759 680978 539683 446444 397128 327049 256641 283653 254644 189880
19039A89880o5654j64089l0612N3202O9568M4432p6085j7060k2705J62482J27046
$$ 189880 124226 -39863 -70475 -17273 52295 96727 20642 3582 -19123 143359 270405
19028B70405n5571n8303l1603P5809o817o861k496l7672M5912P3343J26504J00789
$$ 270405 214834 156531 124928 200737 193920 187059 184563 146891 192803 266146 392650 493439
19016D93439R9036J13088J69610K26464J10311m7715m8067k2367p7762j38785
$$ 493439 592475 705563 875173 1101637 1211948 1164233 1116166 1093799 1016037 877252
19006H77252q0690L382K0882P7366K13583J61880r0808j04661N1286J22469K1420
$$ 877252 796562 799944 820826 898192 1111775 1273655 1182847 1078186 1129472 1251941 1273361
18995A273361j48392k33536r3480O2004M1763J26617N1488J8541j1056j11656
$$ 1273361 1124969 891433 797953 859957 901720 1028337 1079825 1098366 1087310 975654
18985I75654j8424p335K8255M2975J0159n1966J18405J0294o3473l8530l8113
$$ 975654 957230 949895 978150 1021125 1031284 979318 1097723 1108017 1044544 1006014 967901
18974I67901J20680K4703j46838L3306l9070n0463n0809j4874l8728n0130N8589
$$ 967901 1088581 1113284 966446 999752 960682 910219 859410 844536 805808 755678 814267
18963H14267Q3679K35629L25211K53300k9454n6426j15698j52334q7749J11085
$$ 814267 897946 1133575 1458786 1712086 1682632 1626206 1510508 1358174 1270425 1381510
18953A381510J04532Q4037M3007J72432J72180K2284k25011j57241k32631j32416
$$ 1381510 1486042 1570079 1613086 1785518 1957698 1979982 1754971 1597730 1365099 1232683
18943A232683l6584r9128j53517r3472p7868k7528r7067j53609o1636m6713j61983
$$ 1232683 1196099 1096971 943454 849982 772114 744586 647519 493910 432274 385561 223578
18932B23578n4479J2154j9455q493L2883K4041L5219n0110K0406L9274k2874q8936
$$ 223578 169099 181253 161798 153305 186188 210229 245448 195338 215744 255018 232144 143208
18920A43208o6897m2461M132k3972R4988L580K5161n9222k3419R3366P9546p0647
$$ 143208 76311 33850 37982 14010 108998 112578 137739 78517 55098 148464 228010 157363
18908A57363l2005k5873l2021o6519r3249L8073N0814M7470L5612l4679p8947
$$ 157363 125358 99485 67464 945 -92304 -54231 -3417 44053 79665 44986 -33961
18897c3961m0521K6811k4401q035o554K5145J06653L0991q1098L4300J1770M7127
$$ -33961 -74482 -47671 -72072 -80107 -86661 -61516 45137 76128 -4970 29330 41100 88227
18885H8227r2903j11347J13749J44632l7505r677J6827p5816L5231J0927K1951
$$ 88227 -4676 -116023 -2274 142358 104853 95176 112003 36187 71418 82345 104296
18874A04296N8037k3995m5256p684m2710k9855j8420l2098K1633O0935Q0931k1781
$$ 104296 162333 138338 93082 85398 42688 12833 -5587 -37685 -16052 44883 125814 104033
18862A04033j14529p3898N4804R6566j6184m9296K1498q7016j35224j326L2512
$$ 104033 -10496 -84394 -29590 66976 50792 1496 22994 -64022 -199246 -200572 -168060
18851a68060K6666J100J35558P0082j1996K648M3180l4002o192l335O4127L8220
$$ -168060 -141394 -140294 -4736 65346 53350 55998 99178 65176 58984 55649 119776 157996
18839A57996J6266K883p4131j07942q3424K937l7521J8418J59130N9112n8494
$$ 157996 174262 177145 103014 -4928 -88352 -85415 -122936 -104518 54612 113724 55230
18828E5230q8807m2510K0938n1454J1788P5911j7346j6711P1200J11052j32342
$$ 55230 -33577 -76087 -55149 -106603 -94815 -18904 -36250 -52961 18239 129291 -3051
18817c051j08972n4981m8618M1616j1522L4486n2723j3887Q7578N8539m101N1137
$$ -3051 -112023 -167004 -215622 -174006 -185528 -151042 -203765 -217652 -130074 -71535 -75636 -24499
18805b4499j7691p755n1297j43033O0019Q0775J8924k7079J54912O0458j23444
$$ -24499 -42190 -49945 -101242 -244275 -184256 -103481 -84557 -111636 43276 103734 -19710
18794a9710j49828N1251N0905Q6957N4110O2986k7861l0095k1910J7788O3363
$$ -19710 -169538 -118287 -67382 19575 73685 136671 108810 78715 56805 74593 137956
18783A37956j2385m9049K3139l3968l0162n181K0582K5972L0595k2863K7051J46593
$$ 137956 125571 76522 99661 65693 35531 30350 50932 76904 107499 84636 111687 258280
18771B58280J00938R7778J84833K20576m5795k34292j86219j57452r3118m9523
$$ 258280 359218 456996 641829 862405 816610 582318 396099 238647 145529 96006
18761I6006n7801p2903Q182J753j9950K3793k8767L738J47254K543N6968k5632
$$ 96006 38205 -34698 -26516 -24763 -44713 -20920 -49687 -45949 101305 103848 160816 135184
18749A35184j04677p1459L3400N3211p9748N307L2140r0184j5293Q6420O7273
$$ 135184 30507 -40952 -7552 45659 -34089 -28782 3358 -86826 -102119 -15699 51574
18738E1574M8208m2459j3569o8184o9402L6268M4513k81l6220l8962J0823l3729
$$ 51574 99782 57323 43754 -24430 -93832 -57564 -13051 -13332 -49552 -88514 -77691 -111420
18726a11420j9746m4293J5109M454k241K9215K9828J3514K6753M8794O6666N1090
$$ -111420 -131166 -175459 -160350 -155896 -158137 -128922 -99094 -85580 -58827 -10033 56633 107723
18714A07723L2895p3417p1484j707k9297N1204L669j1961l221p609j9963j6887
$$ 107723 140618 67201 -4283 -5990 -35287 15917 19586 7625 4404 -3205 -23168 -40055
18702d0055L2492J1919k6101l2093M44J6438K5668N6494o5217p2035R4236M5461
$$ -40055 -7563 4356 -21745 -53838 -53394 -36956 -11288 45206 -20011 -92046 2190 47651
18690D7651j38841m0449J2699j8988l7786Q098Q9913O800j0422o9154k7142J10192
$$ 47651 -91190 -131639 -118940 -137928 -175714 -167616 -77703 -70903 -81325 -150479 -177621 -67429
18678f7429O0410J0654j5504L0229j1762O1566R47j68068l9631Q358L8171L4821
$$ -67429 -7019 3635 -11869 18360 6598 68164 69111 -98957 -138588 -130230 -92059 -57238
18666e7238m7232M5214N6956p3446o6950O9343N0765r775R768L2094J0896M309
$$ -57238 -104470 -59256 -2300 -75746 -142696 -73353 -22588 -32363 -22595 9499 20395 24704
18654B4704n0365j0443L5582O678P372k6502j0192J0251N3506j0716M1092L9613
$$ 24704 -25661 -36104 -522 6156 13528 -12974 -23166 -12915 40591 29875 70967 110580
18642A10580k2452r0343j24673l411P5445K4112J41941k6128j2427M2234l6170
$$ 110580 88128 -2215 -126888 -130299 -54854 -30742 111199 85071 72644 114878 78708
18631G8708j4161q6364m872M4028L5140n935J0531Q5226N989j24031j62120r547
$$ 78708 64547 -21817 -26689 17339 52479 46544 57075 142301 148290 24259 -137861 -147408
18619a47408j1567M9442K9208M1057K640o4468j00999l0372j497J45883P5565
$$ -147408 -158975 -109533 -80325 -39268 -36628 -101096 -202095 -232467 -233964 -88081 -12516
18608a2516L8163k8536L756m3295l3921P080P4027K5584l533m017k9268J0456
$$ -12516 25647 -2889 867 -42428 -76349 -69269 4758 30342 26809 22792 -6476 3980
18596C980M1412q1165n9871P460R5075P2235L0749N342M7342Q4133J30896J67035
$$ 3980 45392 -35773 -95644 -88184 6891 79126 109875 115217 162559 246692 377588 544623
18584E44623J40952k3615j66196r9163K0723j00674J63089K81853K51945J62444
$$ 544623 685575 661960 495764 396601 417324 316650 479739 761592 1013537 1175981
18574A175981j75443k79190j71400j35555j00464m65J68687J86764R6555q7580
$$ 1175981 1000538 721348 549948 414393 313929 313464 482151 668915 765470 677890
18564F77890j37654r1107n0981j42847j7303N8432r1360j38899R8080M0249J98306
$$ 677890 540236 449129 398148 255301 237998 296430 205070 66171 164251 204500 402806
18553D02806J91668J26846J50770p7869k33203j39160M9829o515n866J13080K48438
$$ 402806 594474 721320 872090 794221 561018 421858 471687 465172 459306 572386 820824
18542H20824J92414J29659p117k44546k57073j13638l9068k9732J04507K12652
$$ 820824 1013238 1142897 1135780 891234 634161 520523 481455 451723 556230 768882
18532G68882L2220j38164j70535m2474P1942j33884r2335j15772n8385P5039p588
$$ 768882 801102 662938 492403 449929 521871 387987 295652 179880 121495 196534 188946
18521A88946m9617o873j6712m617J5532O3671n2755n5721R8811P3162r7665j48065
$$ 188946 139329 132456 115744 111127 126659 190330 137575 81854 180665 253827 156162 8097
18509H097q7256l7026J00094L9044J19577l4668j50499j44111J7741O3061k0277
$$ 8097 -79159 -116185 -16091 22953 142530 107862 -42637 -186748 -169007 -105946 -126223
18498a26223J22982J2372r1572p6269M3558J60544j8376o5123o1619p7048Q1718
$$ -126223 -3241 9131 -82441 -158710 -115152 45392 27016 -38107 -99726 -176774 -95056
18487i5056k2548K8831j931m9563j01126L1380J30457Q9548K7773J4357J05267
$$ -95056 -117604 -88773 -90704 -140267 -241393 -210013 -79556 9992 37765 52122 157389
18476A57389j5833o8676M3074O9378j15785n9549M0673P009m1967j9106M6745
$$ 157389 141556 72880 115954 185332 69547 9998 50671 57680 15713 -3393 43352
18465D3352l1772k4957N8790J14560o4673q5902j16585J7720J08883J2010m5844
$$ 43352 11580 -13377 45413 159973 95300 9398 -107187 -89467 19416 31426 -14418
18454a4418k7673K6253Q5248r1394M3006M9140l9104K9984n129q1213r1905N8125
$$ -14418 -42091 -15838 69410 -21984 21022 70162 31058 61042 55913 -25300 -117205 -59080
18442e9080K7970m382o4281K1236R6045J0685o5081K1321M7540M5096p2879o510
$$ -59080 -31110 -35492 -99773 -78537 17508 28193 -36888 -15567 31973 77069 4190 -2320
18430b320J14165q362J0463L1767o0918K8798Q316l5491p9147k0658J7611o059
$$ -2320 111845 103483 113946 145713 84795 113593 121909 86418 7271 -13387 4224 -1835
18418a835l8819n2473k3760M7276k1086K3920l8414J04989K0775j9941N6105L4432
$$ -1835 -40654 -93127 -116887 -69611 -90697 -66777 -105191 -202 20573 632 56737 91169
18406I1169l467n2495l1230J18157l7062m7009j27769J9983k7588K168J28219
$$ 91169 87702 35207 3977 122134 85072 38063 -89706 -69723 -97311 -95143 33076
18395C3076Q4294M4995p2293p3617L3967K4117M2742L7259o3846n2277n8955M8490
$$ 33076 117370 162365 90072 16455 50422 74539 117281 154540 90694 38417 -20538 27952
18383B7952L0455m6000j25997P3428J19314L5421r765n0443K4191N0126j03559
$$ 27952 58407 12407 -113590 -40162 79152 114573 104808 54365 78556 128682 25123
18372B5123o5937L9930J8563o4978J39452P1010n7504j7751M0058k3456m8023
$$ 25123 -40814 -884 17679 -47299 92153 163163 105659 87908 127966 104510 56487
18361E6487o7879r0652L3195J05522J5040r6622K3905O6869q571n1123k5478J23869
$$ 56487 -11392 -102044 -68849 36673 51713 -44909 -21004 45865 37294 -13829 -39307 84562
18349H4562J52047l7059j26687o9354r103n6340K695K1621J715j478l9283p6025
$$ 84562 236609 199550 72863 3509 -5594 -61934 -59239 -37618 -35903 -37381 -76664 -152689
18337a52689J4830R4941K45M4137R1746k6680j04175N9013l0344m9676L8220N3334
$$ -152689 -137859 -42918 -42673 1464 93210 66530 -37645 21368 -8976 -58652 -20432 32902
18325C2902k6253k1700O1640J25902o2902n6743o4673j27032j1892j5581R7593
$$ 32902 6649 -15051 46589 172491 109589 52846 -11827 -138859 -150751 -166332 -68739
18314f8739M6418J2852P1780l8812p6996j371J07974Q1169k0764n6437o1041M8446
$$ -68739 -22321 -9469 62311 23499 -53497 -54868 53106 134275 113511 57074 -3967 44479
18302D4479J1822K7562p5823L3927N963n745N0121o3636Q850P3474J85470J97762
$$ 44479 56301 83863 8040 41967 47930 42185 92306 28670 37520 110994 296464 494226
18290D94226J39971J63818J39647Q7454L8688N5990n6964r1631N8893R8339L1837
$$ 494226 634197 798015 937662 1025116 1063804 1119794 1062830 971199 1030092 1128431 1160268
18279A160268m4990Q6634n2663j84879k15159k11349m3745K20098K65499K24138
$$ 1160268 1115278 1201912 1149249 964370 749211 537862 494117 714215 979714 1203852
18269A203852P6458o8637m8012j2524p2863j40999k982J44990P0908K4942L7224
$$ 1203852 1280310 1211673 1163661 1151137 1078274 937275 934293 1079283 1150191 1175133 1212357
18258A212357p4804k14234j47431j37969j37723m9617Q189n2578m8413j7346j49126
$$ 1212357 1137553 923319 775888 637919 500196 450579 458768 406190 357777 340431 191305
18247A91305n1931M7424R8237K1459k9755j6329j19186o1360J1043O0444m9182
$$ 191305 139374 186798 285035 306494 276739 260410 141224 79864 90907 151351 102169
18236A02169J026K9228p857K9245q927N6186j1023k0132m8692k2757o6530K0083
$$ 102169 103195 132423 124566 153811 144884 201070 190047 169915 121223 98466 31936 52019
18224E2019n791J6245O6712K9122o7723k2826J22501J06058L5186j22676k707
$$ 52019 46228 62473 129185 158307 90584 67758 190259 296317 331503 208827 206120
18213B06120J26110j2020L1708O228L7936J76600L17166J62474r4278j41339j33927
$$ 206120 332230 320210 351918 358146 396082 572682 889848 1052322 958044 816705 682778
18202F82778j59145o2641k2863j6545P9098J31466J25811J80883K46399P2865
$$ 682778 523633 460992 438129 421584 500682 632148 757959 938842 1185241 1258106
18192A258106l43372j49398r507j9959p3632q6478p2462N2563J0558P2539J13260
$$ 1258106 914734 765336 755829 735870 662238 575760 503298 555861 566419 638958 752218
18181G52218M5322k2026o1171j06413r300p0033j4292Q8003J62242J05788R5137
$$ 752218 797540 775514 714343 607930 598630 528597 514305 602308 764550 870338 965475
18170I65475P8907Q4603R5545O1259J53761J55982J93379n830j87109j86769q9449
$$ 965475 1044382 1128985 1224530 1285789 1439550 1595532 1788911 1783081 1595972 1409203 1319754
18159A319754p2748m6730p8059m3020O3483Q5019m3673q2315P20J0695P8330J16273
$$ 1319754 1247006 1200276 1122217 1079197 1142680 1227699 1184026 1101711 1102431 1113126 1191456 1307729
18147A307729O0785J97870P1386o7280q5176q729k0928p6537P8735l0857o3630
$$ 1307729 1368514 1566384 1637770 1570490 1485314 1476585 1455657 1379120 1457855 1426998 1363368
18136A363368O9922M7530J79280J70078J81454K89594M13686M82506L25954K30376
$$ 1363368 1433290 1480820 1660100 1830178 2011632 2301226 2714912 3197418 3523372 3753748
18126C753748K06471L11923L93835M87975O92828Q62104J123563J650512K154916
$$ 3753748 3960219 4272142 4665977 5153952 5846780 6708884 7832447 9482959 11637875
18117A1637875L061766M373513O367418R757043J6195596K7467551M1441068L8858407
$$ 11637875 14699641 19073154 25440572 35197615 51393211 78860762 120301830 159160237
18109A59160237l359858l8215519l2696479k0848649j4857563j1662799q913261
$$ 159160237 155800379 117584860 84888381 64039732 49182169 37519370 28606109
18102B8606109o363934m476301l047755k202108j652589j240592r28682p49342
$$ 28606109 22242175 17765874 14718119 12516011 10863422 9622830 8694148 7944806
18094G944806n04747n45032n16529m86324m83695m02147m35776l02852k73445
$$ 7944806 7440059 6895027 6378498 5892174 5408479 5006332 4570556 4267704 3994259
18085C994259k05072k30814k16489j40000j01925l9771k10199k29117j48412j32274
$$ 3994259 3789187 3558373 3341884 3201884 3099959 3060188 2849989 2620872 2472460 2340186
18075B340186l5952q4932q3869m2179j51626j69331r0617m7187k7064m9275J700
$$ 2340186 2304234 2219302 2135433 2093254 1941628 1772297 1681680 1634493 1607429 1558154 1559854
18064A559854j45922o2523k841m9760l940n7249M9702m8098J8162J0552J3064
$$ 1559854 1413932 1351409 1348568 1298808 1294868 1237619 1287321 1239223 1257385 1267937 1281001
18053A281001j25883j80560o7455j6552L3785m3677o499N0070M7750k3284m4588
$$ 1281001 1155118 974558 907103 890551 924336 880659 874160 924230 971980 948696 904108
18042I04108j08925j19878j3484N2189J6147o1724j04012j2545r664k4507J36431
$$ 904108 795183 675305 661821 714010 730157 668433 564421 551876 542212 517705 654136
18031F54136R993j5303N0605p0657n7115J1815k0765l7428q1155l2080O6025L463
$$ 654136 664129 648826 699431 628774 571659 583474 562709 525281 444126 412046 478071 481534
18019D81534j04498P9484k1379K2208m5201J0874j34018J5404k424n0262o4933
$$ 481534 377036 456520 435141 457349 412148 423022 289004 304408 301984 251722 186789
18008A86789m3447N0710K7667k1439J9393J29836o0984j9906N8101l572p0146
$$ 186789 143342 194052 221719 200280 219673 349509 288525 268619 326720 323148 253002
17997B53002M2536O9965j9019m5484j68015L5003P6833L6990l6463O1591k4338
$$ 253002 295538 365503 346484 301000 132985 167988 244821 281811 245348 306939 282601
17986B82601R819K6881j53315R221L9295J69597R9517J9787m4213m1928M4163
$$ 282601 292420 319301 165986 175207 214502 384099 483616 503403 459190 417262 461425
17975D61425q8891l5181k4265M9905K9558r2193L8207M591q7901j8820P053q5656
$$ 461425 372534 337353 313088 362993 392551 300358 338565 343156 255255 236435 243488 157832
17963A57832K051l8644M5777j6433r613L0336Q7725L2535r226K7744j6146N0420
$$ 157832 159883 121239 167016 150583 140970 171306 259031 291566 282340 310084 293938 344358
17951C44358k2939k7049k3762n770p7870m0446R1288M0059J6346O2792K7126J0366
$$ 344358 321419 294370 270608 264838 186968 146522 237810 277869 294215 357007 384133 394499
17939C94499l424P6233K9723L9427L4046p6575j15417q553k5120o6597J1120P9370
$$ 394499 391075 467308 497031 536458 570504 493929 378512 369959 344839 278242 289362 368732
17927C68732J29853P6794n1645p1986o8745M4028p858l0811k7123n4562r5532
$$ 368732 498585 575379 523734 451748 383003 427031 419173 388362 361239 306677 211145
17916B11145M5357j2402o2963N4384O5957M80l95q2221k093R7251K0496j12698
$$ 211145 256502 244100 181137 235521 301478 301958 301563 219342 217249 314500 334996 222298
17904B22298k7448Q7017k375n7077M302l2994L7846L8063Q571K8044O5641j1284
$$ 222298 194850 281867 279492 222415 226717 193723 231569 269632 278203 306247 371888 360604
17892C60604p0556k0675K4182Q2852J5718p4284l2447L576n3808m388K9332J0405
$$ 360604 290048 269373 293555 376407 392125 317841 285394 288970 235162 230774 260106 270511
17880B70511m8900j7167k0226K752K9914K7137p6237M5712j9712n0419o0246p8252
$$ 270511 221611 204444 184218 186970 216884 244021 167784 213496 193784 143365 83119 4867
17868D867l1105K5653J44116L0515l8621K2470K6831J7375J225J66038J18645
$$ 4867 -26238 -585 143531 174046 135425 157895 184726 202101 203326 369364 488009
17857D88009o9141l3839l8254l0173p2936K26n0365l0092K8578L0764M979L2786
$$ 488009 418868 385029 346775 316602 243666 243892 193527 163435 192013 222777 227756 260542
17845B60542N8618j6518L6476J3929j81563m9176R349K4631K8945k8882m6927
$$ 260542 319160 302642 339118 353047 171484 122308 131657 156288 185233 156351 109424
17834A09424j2009l031O5511J33436J9634j04356q2082l4591Q910N725j3397j3655
$$ 109424 97415 94384 159895 293331 312965 208609 126527 91936 100846 106571 93174 79519
17822G9519M7722P5027n5077k2829N0195k1928o739N4487j6789J318m9376P7521
$$ 79519 127241 202268 147191 124362 174557 152629 145890 200377 183588 184906 135530 213051
17810B13051J44459P4983k1848l724O1151M8040Q6531l8389j59350j20732J1630
$$ 213051 357510 432493 410645 406921 468072 516112 602643 564254 404904 284172 295802
17799B95802Q1916p1174R44k366m5336j7526k5465O0073Q2722J9181J8117l6699
$$ 295802 377718 306544 307488 305122 259786 242260 216795 276868 359590 378771 396888 360189
17787C60189n8438j0090r6955O7584J1223j8679O6157J11823L5236k6844r629
$$ 360189 301751 291661 194706 262290 273513 254834 320991 432814 468050 441206 431577
17776D31577j3505j6941J53134L4298O5321N3866r750n7506J0629P1667Q4334
$$ 431577 418072 401131 554265 588563 653884 707750 698000 640494 651123 722790 807124
17765H07124J1591r0465M5974Q618J32957N7354o5523m3207r941L2928K3498m1363
$$ 807124 818715 728250 774224 782842 915799 973153 907630 864423 854482 887410 910908 869545
17753H69545M9654K7464m5699p6925o2332R9341J06508O2478O786L8930m947N6315
$$ 869545 919199 946663 900964 824039 761707 861048 967556 1030034 1036820 1075750 1070803 1127118
17741A127118O2935l1532m3855R8658M6082m0659m60O6796q10J322j4983M2964
$$ 1127118 1190053 1158521 1114666 1213324 1259406 1218747 1218287 1285083 1284273 1285595 1270612 1313576
17729A313576O1483J09876J23526j2985J07588N5625J5732M0060M2211o2413L1538
$$ 1313576 1375059 1484935 1608461 1595476 1703064 1758689 1774421 1814481 1856692 1794279 1825817
17718A825817J35672J22360K10838K87679K44364K96920L16734J29444n6458p6474
$$ 1825817 1961489 2083849 2294687 2582366 2826730 3123650 3440384 3569828 3513370 3436896
17708C436896r0354k1900J88897K13012K22646J60207K31466L64481M94767N76301
$$ 3436896 3346542 3324642 3513539 3726551 3949197 4109404 4340870 4705351 5200118 5776419
17698E776419M27771K85460M03792M97310P35592J056031J346655J575607J782949
$$ 5776419 6204190 6489650 6893442 7390752 8126344 9182375 10529030 12104637 13887586
17689A3887586K253587L100871M446751O373036R248548J4286304K2982188L4053621
$$ 13887586 16141173 19242044 23688795 30061831 39310379 53596683 76578871 110632492
17681A10632492L5666711R301648k3488400k7732531j8983262j2366471p633420
$$ 110632492 146299203 155600851 132112451 104379920 85396658 73030187 65396767
17674F5396767l379303J343415P148591J5771143K7305662L5151342K0109153
$$ 65396767 62017464 63360879 70509470 86280613 113586275 148737617 168846770
17667A68846770j6251143l1819641k4875338j7538117j3317592j0113238p402757
$$ 168846770 152595627 120775986 95900648 78362531 65044939 54931701 47528944
17660D7528944n025120l276444j359652M24693J982223L701107N784203R240834
$$ 47528944 42503824 39227380 37867728 38292421 40274644 43975751 49759954 59000788
17652E9000788J5278125K3299385K9825756K2332785l396908k1434676j9693633
$$ 59000788 74278913 97578298 127404054 149736839 146339931 124905255 105211622
17645A05211622j2601648o747375j757072L659302J1041101K1741513L4349072
$$ 105211622 92609974 85862599 84105527 87764829 98805930 120547443 154896515
17638A54896515L7602296J6891072m971468j044719K954494j4081401l1618679
$$ 154896515 192498811 209389883 204418415 203373696 206328190 192246789 160628110
17631A60628110l0766852k2620133j6131409j1160739o390492j967386K440546
$$ 160628110 129861258 107241125 91109716 79948977 73558485 71591099 74031645
17624G4031645P721500J5712427K5895126L0148069J2037705j9349150k9153633
$$ 74031645 81753145 97465572 123360698 153508767 165546472 146197322 117043689
17617A17043689k2204898j5940158j2339658r416419o716390m466152k603682
$$ 117043689 94838791 78898633 66558975 57142556 50426166 45960014 43356332
17610D3356332r32650J097460L230828N657301R218398J5770523K5827786L3206888
$$ 43356332 42423682 43521142 46751970 52409271 61627669 77398192 103225978 136432866
17602A36432866K0480791j2927084k8302790k1956106j4244334r507384n522128
$$ 136432866 156913657 143986573 115683783 93727677 79483343 69975959 64453831
17595F4453831j286033L421197R969627J9620932K9635530K6372727l189419k9070282
$$ 64453831 63167798 66588995 76558622 96179554 125815084 152187811 148998392 119928110
17587A19928110k7707496j9177207j3960915j0957731q431662o447184m930327
$$ 119928110 92220614 73043407 59082492 48124761 39693099 33245915 28315588
17580B8315588l597507k534870j874964j394740j291965j212875r91090q01498
$$ 28315588 24718081 22183211 20308247 18913507 17621542 16408667 15417577 14616079
17572A4616079o70201p94567q73640p15505n88611o04850m86237m70524l45759
$$ 14616079 13945878 13151311 12277671 11562166 10973555 10368705 9882468 9411944 9066185
17563I066185l04183l34229k20328j10099j88274n09131l51339k85459l59726
$$ 9066185 8762002 8427773 8207445 8097346 7909072 7399941 7048602 6763143 6403417
17554F403417k68808j34498k01905k06478j41265j63791k75737k23469j55853
$$ 6403417 6134609 6000111 5798206 5591728 5450463 5286672 5010935 4787466 4631613
17545D631613j76752p2418j67899j33500J00520k2515j82292m9673r0333p4679
$$ 4631613 4454861 4382443 4214544 4081044 4181564 4159049 3976757 3927084 3836751 3762072
17535C762072j20209j59378r0640k5075q0846j61490k40605l1419j03939j10504
$$ 3762072 3641863 3482485 3391845 3366770 3285924 3124434 2883829 2852410 2748471 2637967
17525B637967o828q4557o0310P1472J0334m6356q7012j17841j40973q3355r623
$$ 2637967 2631139 2546582 2486272 2557744 2568078 2521722 2434710 2316869 2175896 2092541 2082918
17514B082918l9913n0990j24639m5308K1648K8391O4333q2552n1945n1575j26112
$$ 2082918 2043005 1992015 1867376 1822068 1843716 1872107 1936440 1853888 1801943 1750368 1624256
17503A624256k4768j2553j92845o9358Q4174K5606J05775o0489j17552j46949
$$ 1624256 1599488 1586935 1394090 1324732 1408906 1434512 1540287 1479798 1362246 1215297
17493A215297N5440R7780J20091J02603r7895q1090r9053j42491M6184m9456m1254
$$ 1215297 1270737 1368517 1488608 1591211 1493316 1412226 1313173 1170682 1216866 1167410 1126156
17482A126156M4345o2874J3083N2071K8020M442j409q341o2889L3207Q9827o6963
$$ 1126156 1170501 1107627 1120710 1172781 1200801 1205243 1203834 1195493 1132604 1165811 1255638 1188675
17470A188675p4649K5831m5104n8645p2845r5119J3m6665J3477N9139O457k1817
$$ 1188675 1114026 1139857 1094753 1036108 963263 868144 868157 821492 834969 894108 900565 878748
17458H78748J6929j15664o3691J01881J10390M3889k3641r6136k5121N6042k0877
$$ 878748 895677 780013 716322 818203 928593 972482 948841 852705 827584 883626 862749
17447H62749P5305L6456J92338K99362J18854k26930k19610k46452r5590j35311
$$ 862749 938054 974510 1166848 1466210 1585064 1358134 1138524 892072 796482 661171
17437F61171j30683O4448Q9190p8780l1024k9454l4399J01763R83m7805p4635
$$ 661171 530488 594936 684126 605346 574322 544868 510469 612232 613215 565410 490775
17426D90775L5666J404k545l242p5346m0296N0433O9223m6994r1451R672J1319
$$ 490775 526441 527845 525300 522058 446712 406416 456849 526072 479078 387627 397299 408618
17414D08618K7858j6154n4483J15219o6790l6558j4310j384M5183j242k9843j06781
$$ 408618 436476 420322 365839 481058 414268 377710 363400 362016 407199 405957 376114 269333
17402B69333m7762K981P5148l1847p861N3454l5532q062j1072K417j2789J21726
$$ 269333 221571 224552 299700 267853 259992 313446 277914 269852 258780 261197 248408 370134
17390C70134K8795K6148o8519n5758k9301q10Q820O0922k6850r5927J0602J4845
$$ 370134 398929 425077 356558 300800 271499 270689 279509 340431 313581 217654 228256 243101
17378B43101O6517Q164j7625J6810n2200q0078r8804l9973o9289J8008Q8943R7169
$$ 243101 309618 317782 300157 316967 264767 184689 85885 45912 -23377 -5369 83574 180743
17366A80743Q678q853j926k3462k6725j1413l3756o8607K8492J07299J22387P646
$$ 180743 189421 180568 178642 155180 128455 117042 83286 14679 43171 150470 272857 280503
17354B80503M9843J5284j07429l6239n465l8466l1328M4965N0131P116j2479j26710
$$ 280503 330346 345630 238201 201962 196497 158031 126703 171668 221799 228915 216436 89726
17342H9726O175L40P991O1288K7902K5353j24694o1647O2022o0501K3081P9897
$$ 89726 95901 96241 104232 165520 193422 218775 94081 32434 94456 33955 57036 136933
17330A36933K0012j19322j9378n1260o5618L2666q4056m004P5158N1119n8701
$$ 136933 156945 37623 18245 -33015 -98633 -65967 -150023 -154027 -78869 -27750 -86451
17319h6451O8133J66532R532j7746n9027k5387P2540k3860o5910o323n6394n3204
$$ -86451 -18318 148214 157746 140000 80973 55586 128126 104266 38356 32033 -24361 -77565
17307g7565M5655M297O7439J11695r5580K8312n0157n3618M0231J11839q072p6897
$$ -77565 -31910 -27613 39826 151521 55941 84253 34096 -19522 20709 132548 124476 47579
17295D7579l5490J3852j8971j6903R311J06588k2209J4842L1104k9017l2715O4975
$$ 47579 12089 25941 6970 -9933 -622 105966 83757 98599 129703 100686 67971 132946
17283A32946L8940r5283n6731L3436j9806O5318m923L3907J6242j52188j42739
$$ 132946 171886 76603 19872 53308 33502 98820 93897 127804 144046 -8142 -150881
17272a50881N6246Q6718n2709k7034N7586J2969O0078n3484P2964J6446q3697
$$ -150881 -94635 -7917 -60626 -87660 -30074 -17105 42973 -10511 62453 78899 -4798
17261d798K0305M3449o6892j72228J05046R8299L7276K5014J0914j2489J312L9457
$$ -4798 15507 58956 -7936 -180164 -75118 23181 60457 85471 96385 83896 85208 124665
17249A24665k498r682k024p7099k9559k8231k3722m9379O9190P9228Q3438M7407
$$ 124665 122167 112485 110461 33362 3803 -24428 -48150 -97529 -28339 50889 134327 181734
17237A81734n011r7765n6117n4038n1174J2944O1472j5320N4668R0285M5754o649
$$ 181734 176723 78958 22841 -31197 -82371 -69427 -7955 -23275 31393 121678 167432 160783
17225A60783l1525P9093n931M1808j4526k097j44116j12747j6270m3664P0175
$$ 160783 129258 208351 202420 244228 229702 227605 83489 -29258 -45528 -89192 -19017
17214a9017o2612N1527o052K5759J42883J09545N2970j37283j50247K906J78122
$$ -19017 -81629 -30102 -36154 -10395 132488 242033 295003 157720 7473 10379 188501
17203A88501N9160q6639o5667p486O1437l452p9424r03r034M1355L0048P0838
$$ 188501 247661 161022 95355 87869 149306 145854 66430 65527 56493 97848 127896 198734
17191A98734M7215p3124j0246o9512j3609j2993R9777J5790l8751j24614K9053
$$ 198734 245949 172825 162579 93067 79458 66465 166242 182032 143281 18667 47720
17180D7720K8645l7262K055l6511j78402P0544P1849K3359k7094K2150J33591
$$ 47720 76365 39103 41158 4647 -173755 -103211 -31362 -8003 -35097 -12947 120644
17169A20644l952q2912L5868R2887q55n3142l7270p705K6211n0437L9159J68305
$$ 120644 116692 33780 69648 162535 161680 108538 71268 63563 89774 39337 78496 246801
17157B46801n6455j10178q4194m265J09455R8689P7836J71992J73370J59833o0143
$$ 246801 190346 80168 -4026 -8291 101164 199853 277689 449681 623051 782884 722741
17146G22741k32289o9087j838J8861M4005k2372m2683J931K24139K69532J27278
$$ 722741 490452 421365 419527 438388 482393 460021 417338 419269 643408 912940 1040218
17135A040218K0244j66463j91930k12334j75342k5877q0648m9816P6956O8023
$$ 1040218 1060462 893999 702069 489735 314393 288516 207868 158052 235008 303031
17125C03031m012o1727p7756R9682J73938J70100J30514J13580m209j45273k5460
$$ 303031 299019 237292 159536 259218 433156 603256 733770 847350 843141 697868 672408
17114F72408p294p2858q6262j14758q8845M6776J00627K3451j3006J7494K81974
$$ 672408 665114 592256 505994 391236 302391 349167 449794 473245 460239 477733 759707
17103G59707L18381K18204K450j9759j74935j99204q9634j01243j1644j3792P3811
$$ 759707 1078088 1296292 1298742 1278983 1104048 904844 815210 713967 702323 688531 762342
17092G62342J00508j0481Q0751j1258o9049j02605j61310j26438k7372J8429m8382
$$ 762342 862850 852369 933120 921862 852813 750208 588898 462460 435088 453517 405135
17081D05135j7745o1688n8893M6946J0428P749K0309M772N4277J82135K17127
$$ 405135 387390 325702 266809 313755 324183 331932 352241 357013 411290 593425 810552
17070H10552J79894J8204j63135j77469m3013p6517Q0606l6525r7153Q834K7467
$$ 810552 990446 1008650 845515 668046 625033 548516 629122 592597 495444 504278 531745
17059E31745J73774J55878Q8763j47072j46015q0182k34161j46483R6869n0622
$$ 531745 705519 861397 950160 803088 657073 576891 342730 196247 293116 242494
17049B42494j25512R9574M8812L3581M9493n1792j8099K9160l8606q1875k8000
$$ 242494 116982 216556 265368 298949 348442 296650 278551 307711 269105 187230 159230
17038A59230K9506n056j1513K4758P135o4076k3809q4159k2331Q4087j3474L3998
$$ 159230 188736 183680 172167 196925 204060 139984 116175 32016 9685 93772 80298 114296
17026A14296Q1755j18959j27247M7791M8695k4157N7716K1413O7197M0387o0436
$$ 114296 196051 77092 -50155 -2364 46331 22174 79890 101303 168500 208887 148451
17015A48451q0752r3738j3977n1700R8288O1088j0374j6691N7517J14739n0485
$$ 148451 67699 -26039 -40016 -91716 6572 67660 57286 40595 98112 212851 162366
17004A62366l4614m2304j650o3476L3936L6307N0535m9027j23854K3092J0837
$$ 162366 127752 85448 83798 20322 54258 90565 141100 92073 -31781 -8689 2148
16993B148m5290p7653N9897J11244k304j0666L265j1106n2314L6243o5738o4325
$$ 2148 -43142 -120795 -60898 50346 48042 37376 40641 29535 -22779 13464 -52274 -116599
16981a16599o8037Q0324J25925J34753N9048j6487o4927j29477o2632m0871o0315
$$ -116599 -184636 -104312 21613 156366 215414 198927 134000 4523 -58109 -98980 -159295
16970a59295r099Q0478N7831L4620J8684O324o4821J15451K9014l593J6368r4856
$$ -159295 -168394 -87916 -30085 4535 23219 29543 -35278 80173 109187 105594 121962 27106
16958B7106O8286K6521M0067N4233n5223j19170P084o2552L313j1292L2229O6891
$$ 27106 95392 121913 161980 216213 160990 41820 48904 -13648 -10335 -21627 10602 77493
16946G7493P0501p0357M7218M6100J9899p4434m6868o5157M4031M792q6379k4058
$$ 77493 147994 77637 124855 170955 190854 116420 69552 4395 48426 53218 -33161 -57219
16934e7219J02428J51007n8285o1684r2702j29467l4632p89J15693J6676q9974
$$ -57219 45209 196216 137931 76247 -16455 -145922 -180554 -181343 -65650 -48974 -138948
16923a38948L4100p490M3660R9316P1188N93j17030o1501l0172K4289J9083J2907
$$ -138948 -104848 -112338 -68678 30638 101826 102419 -14611 -76112 -106284 -81995 -62912 -50005
16911e0005J2247n9868j8257P2298M76M011P9883L9134q8733p3521K0665Q4852
$$ -50005 -37758 -97626 -115883 -43585 -43109 -39098 40785 79919 -8814 -82335 -61670 23182
16899B3182N6809m5011l613Q914r2002j11318J0745R0242K4584k5958L3889J52370
$$ 23182 79991 34980 31367 40281 -51721 -163039 -152294 -62052 -37468 -63426 -29537 122833
16887A22833M5241J5899m465l0969j06387J2068j9667k6576n8221J8003K6020
$$ 122833 168074 183973 179508 148539 42152 54220 34553 7977 -50244 -32241 -6221
16876f221l342k1039j0923P9372N3539K5352j16273o0140Q5674J6075n2682P8505
$$ -6221 -9563 -30602 -41525 37847 91386 116738 465 -59675 25999 42074 -10608 67897
16864F7897J5312k0242J289J0874l4825J9796J3106n4361p1070J6706k7927M5286
$$ 67897 83209 62967 64256 75130 40305 60101 73207 18846 -52224 -35518 -63445 -18159
16852a8159O9302n3953o6214j5507J01037L0147l9746n5445J477l0806N125O4388
$$ -18159 51143 -2810 -69024 -84531 16506 46653 6907 -48538 -47061 -77867 -72742 -8354
16840h354l6765j0169L4684L9305O2133j52268l4448j03170L7193J34417P7239
$$ -8354 -45119 -55288 -20604 18701 80834 -71434 -105882 -209052 -171859 -37442 39797
16829C9797L5078L9636k6343r5971j68596k4789M6711K02874O3822l6674L9225
$$ 39797 74875 114511 88168 -7803 -176399 -201188 -154477 48397 112219 75545 114770
16818A14770j690j6421j3908k3098j6622n4167j26757K9173R3684j5440k0794
$$ 114770 113080 96659 82751 59653 43031 -11136 -137893 -108720 -15036 -30476 -51270
16807e1270k8155m8620p1040J36001Q6297l0471N87M6291L8997O5759L7786q3990
$$ -51270 -79425 -128045 -199085 -63084 23213 -7258 -6671 39620 78617 144376 182162 98172
16795I8172m1299j0353M279p6951n0753n0497Q308k198L1955K5695K12961J7213
$$ 98172 56873 46520 50799 -26152 -76905 -127402 -119094 -121292 -89337 -63642 149319 166532
16783A66532o1389r516n6474p0225Q953N7831M4722L38q5486m4822k0608K6696
$$ 166532 105143 95627 39153 -31072 -22119 35712 80434 80772 -4714 -49536 -70144 -43448
16771d3448J09588M6601p8667m3093j6836n97J9646J18529m6565k6114J15559
$$ -43448 66140 112741 34074 -9019 -25855 -26452 -6806 111723 65158 39044 154603
16760A54603l2557m8783m8289m2524j21453q6788Q7986J00691L1140K9134j197
$$ 154603 122046 73263 24974 -17550 -139003 -225791 -137805 -37114 -5974 23160 21963
16749B1963m11r802P6469j0444o5627O9119Q0651M5557j44319p4139K3090Q6306
$$ 21963 21552 11750 88219 77775 12148 81267 161918 207475 63156 -10983 12107 98413
16737I8413P3325l3936r5267Q51k5255k2731q3601Q2116K9720j360P0814P4460
$$ 98413 171738 137802 42535 43386 18131 -4600 -88201 -6085 23635 22275 93089 167549
16725A67549k7783r032r3711q6750P2484O944K7872K2747n9194n6989j5599J8757
$$ 167549 139766 130734 37023 -49727 22757 29701 57573 80320 21126 -35863 -51462 -32705
16713c2705M3798L0280r0432j2000R6173P7095Q237j14240l5002j8811j7261l7538
$$ -32705 11093 41373 -49059 -61059 35114 112209 120446 6206 -28796 -47607 -64868 -102406
16701a02406L8193M2342L3903p7071p8680J08216J18282J05858j2564j57609l3212
$$ -102406 -64213 -21871 12032 -65039 -143719 -35503 82779 188637 176073 18464 -14748
16690a4748J20728q4253p0298n509P8241L4793p5371J01745k6526J8848m0097
$$ -14748 105980 21727 -48571 -54080 24161 58954 -16417 85328 58802 77650 37553
16679C7553o5444j3205o124K1708j1219L1160j9703Q8165J17743k3514p0731j06967
$$ 37553 -27891 -41096 -47220 -25512 -36731 -5571 -25274 62891 180634 157120 86389 -20578
16667b0578j11701O45K6873J15117J07782K358K2845N6620n0706j7281m0503j2335
$$ -20578 -132279 -131634 -104761 10356 118138 120496 143341 199961 149255 131974 91471 79136
16655G9136j5234L0785r5876o0922J20018N356n7688k5143n3861J4500K1184K8701
$$ 79136 63902 94687 -1189 -62111 57907 63263 5575 -19568 -73429 -58929 -37745 -9044
16643i044m6514m4191M5855j4045N2103m9498n0560K566J5066k0330J32269Q7285
$$ -9044 -55558 -99749 -53894 -67939 -15836 -65334 -115894 -113328 -98262 -118592 13677 100962
16631A00962N0057j41291l0332j00791k8053J33890P354o2159o698m491q3780
$$ 100962 151019 9728 -20604 -121395 -149448 -15558 -8204 -70363 -77061 -81552 -165332
16620a65332j70Q1253R2061l1699k6798L4157L4128q0690N163o1621o3698j5050
$$ -165332 -165502 -84249 7812 -23887 -50685 -16528 17600 -63090 -57927 -119548 -183246 -198296
16608a98296J5206j746q7237N0210J45679R6950k3559l9182K2743l0726n0579
$$ -198296 -183090 -184836 -272073 -221863 -76184 20766 -2793 -41975 -19232 -49958 -100537
16597a00537J04336k927K834N9429M7956p1686j10549q5988L4112J08735Q6879
$$ -100537 3799 872 3706 63135 111091 39405 -71144 -157132 -123020 -14285 72594
16586G2594J9212o5099L9630M3955m3204K3274J25203N9820j9666o5992O606j9233
$$ 72594 91806 26707 66337 110292 67088 90362 215565 275385 255719 189727 196333 177100
16574A77100j97255r3871K2378L4394m0091M2846L4118n8446N7735Q8651J517
$$ 177100 -20155 -114026 -91648 -57254 -97345 -54499 -20381 -78827 -21092 67559 69076
16563F9076o9014l6797K519J772P3072M6352K9782P81q9993l4122q4192m2749
$$ 69076 62 -36735 -34216 -32444 40628 86980 116762 117543 27550 -6572 -90764 -133513
16551a33513R0862M8710J6870k4392p5394N4953L7446m0035n9598l066P433N6730
$$ -133513 -42651 6059 22929 -1463 -76857 -21904 15542 -24493 -84091 -87157 -79724 -22994
16539b2994M6445l532O6528j41281K2356N0656r8641j9109l11o7607K1984J33734
$$ -22994 23451 19919 86447 -54834 -32478 18178 -80463 -99572 -99883 -167490 -145506 -11772
16527a1772N2725n770M7354j1268p72o324m4154k2216O968N0531Q4758Q5954k3394
$$ -11772 40953 35183 82537 71269 70497 64173 20019 -2197 4771 55302 140060 226014 202620
16514B02620m5284o4980j28012O1437J7813N3209M9839o7413q7006m5157n394
$$ 202620 157336 92356 -35656 25781 43594 96803 146642 79229 -7777 -52934 -58328
16503e8328m4491j9405N1160N7123m2536N3822o0008m6153O0068O7331Q4811r6448
$$ -58328 -102819 -122224 -71064 -13941 -56477 -2655 -62663 -108816 -48748 18583 103394 6946
16491F946j11147n8939J14587P4788K5896O3150j10108n8118O4008J5848K3473
$$ 6946 -104201 -163140 -48553 26235 52131 115281 5173 -52945 11063 26911 50384
16480E0384N5272o1451k0983O5978J15743L2697n7171m3495k583j9656j06066
$$ 50384 105656 44205 23222 89200 204943 237640 180469 136974 134391 114735 8669
16469H669q2115J4772j6939j6170N7637j128K4507M0524J05102N224l5965m3800
$$ 8669 -73446 -58674 -75613 -91783 -34146 -35274 -10767 29757 134859 140083 104118 60318
16457F0318o1863j477r851L977K4938l6598r4154j1007n898J27478K6015k3396
$$ 60318 -1545 -3022 -12873 -8896 16042 -20556 -114710 -125717 -131615 -4137 21878 -1518
16445a518L7241O2853M3084O2499L2049j3211K1371N9584p6958o5777l8194j4379
$$ -1518 35723 98576 141660 204159 236208 222997 244368 303952 226994 161217 123023 108644
16433A08644j10125n1032O317j1567Q1271j23092M6092J79177L4458l3213n0396
$$ 108644 -1481 -52513 -46196 -57763 23508 -99584 -53492 125685 160143 126930 76534
16422G6534o0652Q4698O6339o9784L0380P1073j25814j11354M6917J37465j1512
$$ 76534 15882 100580 166919 97135 127515 198588 72774 -38580 8337 145802 134290
16411A34290j00190j2904J1787Q2387j24463q1393K9711J39461k649q512n2191
$$ 134290 34100 21196 32983 115370 -9093 -90486 -60775 78686 76037 67525 15334
16400A5334n713K9129P2280K2324P429N7837j38436p2225o3695r3263Q9780R0119
$$ 15334 9621 38750 111030 133354 140783 198620 60184 -12041 -75736 -168999 -79219 10900
16388A0900R5591p4492q2604J5701l2498J7891Q4535M7956L2723j56940M093O1664
$$ 10900 106491 31999 -50605 -34904 -67402 -49511 35024 82980 115703 -41237 -37144 24520
16376B4520J9645J643p2387l9041o3912N4473k2501p7376k9329K8839J213J77383
$$ 24520 44165 45808 -26579 -65620 -129532 -75059 -97560 -174936 -204265 -175426 -174213 3170
16364C170K7902K5032L9873J3049l4571J5977p9615R3304o0925p6123R135m117
$$ 3170 31072 56104 95977 109026 74455 90432 10817 104121 43196 -32927 -23792 -27909
16352b7909P208J1269l3646J3038k8563j1141K859o6178O1650J08937m2484j05409
$$ -27909 -20701 -9432 -43078 -30040 -58603 -69744 -66885 -133063 -71413 37524 -4960 -110369
16340a10369j14188J60947M1840J7762O2474Q4325R758o4044j24095L2234J5760
$$ -110369 -224557 -63610 -21770 -4008 58466 142791 152549 88505 -35590 -3356 12404
16329A2404J65909Q9479O1926j12899o3856j2830o7675q5759N1481Q4316N3972
$$ 12404 178313 267792 329718 216819 152963 140133 72458 -13301 38180 122496 176468
16318A76468M689j63891o4233J71386j0502o5113j33564j26814O1279O9409K0348
$$ 176468 181157 17266 -46967 124419 113917 48804 -84760 -211574 -150295 -80886 -60538
16307f0538l5542K1551p157r5998Q2800J28128l6457j9621K227P2203R1814N876
$$ -60538 -96080 -74529 -81686 -177684 -94884 33244 -3213 -22834 -20607 51596 143410 149286
16295A49286n3362m8129m2926l5886p0104L313M1915J6981L5960J6999r2567l7648
$$ 149286 95924 47795 4869 -31017 -101121 -97808 -55893 -38912 -2952 14047 -78520 -116168
16283a16168J0657P7862O1985q4299j934N4588N2355j4893m7691k1046M569L3553
$$ -116168 -105511 -27649 34336 -49963 -51897 2691 55046 40153 -7538 -28584 -24015 9538
16271I538P6124k7889k3758j5181k4416k5084J3261M9229j05233P7398Q3040O3124
$$ 9538 85662 57773 34015 18834 -5582 -30666 -17405 31824 -73409 3989 87029 150153
16259A50153N586j39077J1667J07509k7927K8270k5607j35195l7350M545K9625
$$ 150153 155739 16662 28329 135838 107911 136181 110574 -24621 -61971 -57426 -27801
16248b7801R937L8145M5675O0005q3668j57567K5093J13497N8560L4668k6745
$$ -27801 -17864 20281 65956 125961 42293 -115274 -90181 23316 81876 116544 89799
16237H9799m2612j4988K3745o2704n1213Q6951K9018p32m3317o39Q9664k0401
$$ 89799 47187 32199 55944 -6760 -57973 28978 57996 57264 13947 13308 102972 82571
16225H2571k0300M1287l9666J1277k3540L0848K618n691l5297O667O0110o0577
$$ 82571 62271 103558 63892 75169 51629 82477 85095 79404 44107 50774 110884 50307
16213E0307Q390j01344p499J1219m3506N3969J1175R4025O678p5319J834O7143
$$ 50307 58697 -42647 -50146 -38927 -82433 -28464 -17289 76736 83414 8095 9929 77072
16201G7072M0314l2981q577N7354n2259o8779j27339n1630m784K6249Q9500O3461
$$ 77072 117386 84405 75828 133182 80923 12144 -115195 -166825 -171609 -145360 -55860 7601
16189G601k5906k3962m207q469L396M4050m2925K5421M4543j4257q3083p2976
$$ 7601 -18305 -42267 -46474 -54943 -51547 -7497 -50422 -25001 19542 5285 -77798 -150774
16177a50774N840O3648K6362j2606j2836n9444P0676K6196N0895L3967j486o228
$$ -150774 -144934 -81286 -54924 -67530 -80366 -139810 -69134 -42938 7957 41924 40438 34210
16165C4210k2759K6642j8522p0472J30987L6884j0559l1787l0269K1807L5580
$$ 34210 11451 38093 19571 -50901 80086 116970 106411 74624 44355 66162 101742
16154A01742m5032n1035j2428r8696j05638M4968N4319J42357J3728N6712O4913
$$ 101742 56710 5675 -6753 -105449 -211087 -166119 -111800 30557 44285 100997 165910
16143A65910K7883j1892m6930l4083o5797n4377Q4872Q8677L8456r6374J6612
$$ 165910 193793 181901 134971 100888 35091 -19286 65586 154263 192719 96345 112957
16132A12957O7969q7080p7494m6602K3905k7017o6645Q3351j3892j3886O7386
$$ 112957 180926 93846 16352 -30250 -6345 -33362 -100007 -16656 -30548 -44434 22952
16121B2952P0883J8025p8082l0939J1621M8856j2944l2038n2510p109M9815m0504
$$ 22952 93835 111860 33778 2839 14460 63316 50372 18334 -34176 -41285 8530 -31974
16109c1974R926K6448l4128j0034L0106J05906l7285r4694Q796J03L4981l3771
$$ -31974 -22048 4400 -29728 -39762 -9656 96250 58965 -35729 -26933 -26830 8151 -25620
16097b5620M0673m316j5761n5839j338J2232J00492j1584j2015o1150k6524j7945
$$ -25620 15053 10737 -5024 -60863 -62201 -49969 50523 38939 26924 -34226 -60750 -78695
16085g8695j3223n651Q246K4672N358m1978K0939Q9939m683Q837r8428J10918
$$ -78695 -91918 -97569 -89323 -64651 -59293 -101271 -80332 9607 4924 13761 -84667 26251
16073B6251O8220j98360j10377k3691O6448J4895O9408M3029l2313k0867m2490
$$ 26251 94471 -103889 -214266 -237957 -171509 -156614 -87206 -44177 -76490 -97357 -139847
16062a39847K0109J17714O9689p1821Q836n4305m8468m3051O8731j4340J1570
$$ -139847 -119738 -2024 67665 -4156 4680 -49625 -98093 -141144 -72413 -86753 -75183
16051g5183j7586O3659k1909K2757j8415j557Q499k9199Q3593k2521j07639J0270
$$ -75183 -92769 -29110 -51019 -28262 -46677 -48234 -39735 -68934 14659 -7862 -115501 -105231
16039a05231P3026L4860k305J8571k6515o6447J3619O1044M6970N8160L9104n4617
$$ -105231 -32205 2655 350 18921 -7594 -74041 -60422 622 47592 105752 144856 90239
16027I0239n4869r4865j16773J7759N0313M0244O6697M6099J0646o8069p646M8314
$$ 90239 35370 -59495 -176268 -158509 -108196 -67952 -1255 44844 55490 -12579 -20225 28089
16015B8089O4014j6558p3012o765o0775J4016J3002M6582O2328k9622m4018P4917
$$ 28089 92103 75545 2533 -4232 -65007 -50991 -37989 8593 70921 41299 -2719 72198
16003G2198q112n2894k19p1405L6360p880m002M330m2949l9628Q8611J78383K7814
$$ 72198 64086 11192 10973 -60432 -24072 -31952 -35954 -31624 -74573 -114201 -25590 152793 180607
15990A80607j40204R124k9164o5329J7614R2761O9028K2957j5967j11251k7886
$$ 180607 40403 49527 20363 -44966 -27352 65409 134437 157394 141427 30176 2290
15979B290K048l9977o29R352J5128N9322O5172Q870P1987j7465Q913L821q6016
$$ 2290 4338 -35639 -36268 -26916 -11788 47534 112706 121576 193563 176098 185011 188832 102816
15966A02816j33227m6521l019J12513k0123j8393J8373k5129l0405M814O3968
$$ 102816 -30411 -76932 -79951 32562 12439 -5954 12419 -12710 -43115 -38301 25667
15955B5667l0871j1202O9803J55261J1337p9404L909k222j9958k4410q787P5693
$$ 25667 -5204 -16406 53397 208658 219995 140591 144500 142278 122320 97910 89123 164816
15943A64816j051L5272r678l414k0693k9716L4313L321m6351J3564r378n7778
$$ 164816 163765 199037 189359 185945 165252 135536 169849 173170 126819 140383 131005 73227
15931G3227p5788j16909J7470J95707M5859p0125o839P3676J7371o9715l4451
$$ 73227 -2561 -119470 -102000 93707 139566 69441 62602 136278 153649 83934 49483
15920D9483l6943n1495l2711m9848j17308J26385O3542k364n2030K0855r27j6772
$$ 49483 12540 -38955 -71666 -121514 -238822 -112437 -48895 -51259 -103289 -82434 -83361 -100133
15908a00133M3730J37121k3980k1172p4015n3189K4086k7619m8798J8941k3512
$$ -100133 -56403 80718 56738 35566 -38449 -91638 -67552 -95171 -143969 -125028 -148540
15897a48540j2402N074j8239j6772P0121M9675L0069j4915J0805J15052P2956
$$ -148540 -160942 -155868 -174107 -190879 -120758 -71083 -41014 -55929 -45124 69928 142884
15886A42884n1214J1636p4195j71364n78M0168L3532R2802R0571j14184m3393
$$ 142884 91670 103306 29111 -142253 -142831 -102663 -69131 23671 114242 58 -43335
15875d3335m6748j1079J0375P9611Q206M654m8427l9524O9690k4415p4297M7548
$$ -43335 -90083 -101162 -90787 -11176 -2970 1684 -46743 -86267 -16577 -40992 -115289 -67741
15863f7741N491k8992R9006J4623n2026n5573n7636p828L9213P118J19530K8295
$$ -67741 -62250 -91242 7764 22387 -29639 -85212 -142848 -150676 -111463 -104345 15185 43480
15851D3480p1160j26503k4952J02779L6057K080J797N7787m1127k9485j00443
$$ 43480 -27680 -154183 -179135 -76356 -40299 -38219 -36422 21365 -19762 -49247 -149690
15840a49690K3085p4464L8143L0798L4303L5987K4821R1431Q7823l8390n1785
$$ -149690 -126605 -201069 -162926 -132128 -97825 -61838 -37017 54414 142237 103847 52062
15829E2062l9045o974O8883m4863P2678R4093l8665j07898j3259M2700K5648m503
$$ 52062 13017 6043 74926 30063 102741 196834 158169 50271 37012 79712 105360 100857
15817A00857P0477k8896j3020J9044n2109m1586R680j3069M8603o701q451L5076
$$ 100857 171334 142438 129418 148462 96353 54767 64447 51378 99981 93280 84829 119905
15805A19905k7463m9717m4942J857O5391M1360K003M2621o5900j52858m8361l5632
$$ 119905 92442 42725 -2217 -360 65031 106391 108394 151015 85115 -67743 -116104 -151736
15793a51736O3352J2149m047R2318J0965q6558R2611L7885k9165m209r2258n8032
$$ -151736 -88384 -76235 -80282 12036 23001 -63557 29054 66939 37774 33565 -58693 -116725
15781a16725O8799M1402l1381K7313K5593m4744m0289J4851o6947L1947N4522
$$ -116725 -47926 -6524 -37905 -10592 15001 -29743 -70032 -55181 -122128 -90181 -35659
15770c5659r0622L6829L5603l1239k8017j6077j6317Q6740M9089O2072m5585j06548
$$ -35659 -126281 -89452 -53849 -85088 -113105 -129182 -145499 -58759 -9670 52402 6817 -99731
15758i9731j694J14052l9438q4555L9006P8238L584j03027L3945R7592L9814l8305
$$ -99731 -101425 12627 -26811 -111366 -72360 5878 9462 -93565 -59620 37972 77786 39481
15746C9481j7055j8222J32M6593Q2168n7130n4316o8926J4994Q9651m9231k8885
$$ 39481 22426 4204 4336 50929 133097 75967 21651 -47275 -32281 57370 8139 -20746
15734b0746n3278r5000k0889J20026O1037M1795r094o5554K4819r689l1863J7906
$$ -20746 -74024 -169024 -189913 -69887 -8850 32945 23851 -41703 -16884 -26573 -58436 -40530
15722d0530N4907O8901M9542k4940r2602j34457L5085N7543n8405J1019j7625
$$ -40530 14377 83278 132820 107880 15278 -119179 -84094 -26551 -84956 -73937 -91562
15711i1562k1792m0208J08936O7122J8922M2874j3571O2793K5091q9632j2221
$$ -91562 -113354 -153562 -44626 22496 41418 84292 70721 133514 158605 68973 56752
15700E6752N3351J04995j07553j08650N696R9809K7186n9414j07039P432n905
$$ 56752 110103 215098 107545 -1105 4591 104400 131586 72172 -34867 -27435 -33340
15689c3340M8001L9229p4349O4355J2741M6900j4107n2147j5843O2512n2101r3713
$$ -33340 14661 53890 -20459 43896 56637 103537 89430 37283 21440 83952 31851 -61862
15677f1862n8387m9621O3872P7459P163r6746p752n970k5056J8495Q964m2798
$$ -61862 -120249 -169870 -105998 -28539 -21376 -118122 -125874 -131844 -156900 -138405 -129441 -172239
15665a72239m0630K4800N2896M9696J2091o9368k5861o7719L3031O669M3060L3494
$$ -172239 -212869 -188069 -135173 -85477 -73386 -142754 -168615 -236334 -203303 -196634 -153574 -120080
15653a20080K2825K9785L0522Q7929K3701o1889N3941l7451l6050O3811N1940
$$ -120080 -97255 -67470 -36948 50981 74682 12793 66734 29283 -6767 57044 108984
15642A08984j17251q2888N9399r668n8283M5831M0566K2488n3956q5693r8537
$$ 108984 -8267 -91155 -31756 -41424 -99707 -53876 -13310 9178 -44778 -130471 -229008
15631b29008J59990J57531j34587n4327L2505L014J03085j020j1492J7290n7839
$$ -229008 -69018 88513 -46074 -100401 -67896 -64882 38203 37183 25691 42981 -14858
15620a4858J08328M563l1800K2906l8086o2405J09502N6708L0867j02326Q712
$$ -14858 93470 98033 66233 89139 51053 -11352 98150 154858 185725 83399 92111
15609I2111N36l7800p2913k4012M1180P0477Q0352m8292m5264o6543Q0168J3774
$$ 92111 92647 54847 -18066 -42078 -898 69579 149931 101639 56375 -10168 70000 83774
15597H3774o3823K8893K4670N7896j980L5258p4884n198K909O2602j6359P0792
$$ 83774 19951 48844 73514 131410 129430 164688 89804 84606 87515 150117 133758 204550
15585B04550Q7953l3023j05416j04503n3081p8990J39896n8542r7042k36J00826
$$ 204550 292503 259480 154064 49561 -3520 -82510 57386 -1156 -98198 -98434 2392
15574B392n590M7468K3415n4468l0793L4756K1157M3131o1370k28L7281n3107
$$ 2392 -3198 44270 67685 13217 -17576 17180 38337 81468 20098 19870 57151 4044
15562D044n145K1782m7252N4485J7138p5829J04289L7097j6690r3832p797M1209
$$ 4044 -1101 20681 -26571 27914 45052 -30777 73512 110609 93919 87 -7710 33499
15550C3499N4354J41794l8728r4631j20090N705M2463N0629r3393q0261J16606
$$ 33499 87853 229647 190919 96288 -23802 -18097 24366 74995 -18398 -98659 17947
15539A7947M1330m4800J3614q0306k7532N2112M5003L5980j3954p0798l0162Q9657
$$ 17947 59277 14477 28091 -52215 -79747 -27635 17368 53348 39394 -31404 -61566 28091
15527B8091N5892J3681L8528m8557p0224j08268l6015P5894J4287O0198N7k746
$$ 28091 83983 97664 136192 87635 17411 -90857 -126872 -50978 -36691 23507 23564 20818
15515B0818q622Q901P7496l5136P3722m7652n0279r661q3207n525J9832P4324
$$ 20818 12196 21097 98593 63457 137179 89527 39248 29587 -53620 -59145 -39313 35011
15503C5011J3040j9823l2866K0083Q4116q3964N0167N8130L9877o3410n4152o3996
$$ 35011 48051 28228 -4638 15445 99561 15597 65764 123894 163771 100361 46209 -17787
15491a7787n4640J07535N1367k7554L9822k2453r0725j58116J4965P0592J48141
$$ -17787 -72427 35108 86475 58921 98743 76290 -14435 -172551 -157586 -86994 61147
15480F1147p3529l4648P082j337J03819R9814o5358q9026m558l3372l7369J21631
$$ 61147 -12382 -47030 -39948 -41285 62534 162348 96990 7964 3406 -29966 -67335 54296
15468E4296L6578j41215Q045k7367p0500q0658O9486J49298N8270L787J048l4043
$$ 54296 90874 -50341 -42296 -69663 -140163 -220821 -151335 -2037 56233 60020 61068 27025
15456B7025j8083O5872K49n3476k230L7873k4189q0326k2195M4868L0984q1209
$$ 27025 8942 74814 75063 21587 19357 57230 33041 -47285 -69480 -24612 6372 -74837
15444g4837m2282M3885K7910r1879k1263m121j09238K1838N1481J4775R1932P5005
$$ -74837 -117119 -73234 -45324 -137203 -158466 -162587 -271825 -249987 -198506 -183731 -91799 -16794
15432a6794l2961Q1254L2440r0635r8008k1260R8742K8797P8370O1208p8377r6664
$$ -16794 -49755 31499 63939 -26696 -124704 -145964 -47222 -18425 59945 121153 42776 -53888
15420e3888r0293p3520P0963J10490p9118K004K3194J53034L4599L9917n4046
$$ -53888 -144181 -217701 -146738 -36248 -115366 -113362 -90168 62866 97465 137382 83336
15409H3336p8832k7325K9117o281l4213R5796O7216j9863l2227O8498M5248o7331
$$ 83336 4504 -22821 6296 15 -34198 61598 128814 108951 76724 145222 190470 123139
15397A23139n3250j1287r6300l4615P7292o472L833n5524m5744R3450j073M58
$$ 123139 69889 58602 -37698 -72313 4979 -1493 2340 -53184 -98928 -5478 -6551 -6093
15385f093M2785R1764j1977n9022n624p2082j33998p9937R3317J27997q1441L8117
$$ -6093 36692 128456 116479 57457 51833 -20249 -154247 -234184 -140867 -12870 -94311 -56194
15373e6194L4667Q9020O1887l8857r9335k5369m004J42170l5121j7799n635j04732
$$ -56194 -21527 67493 129380 90523 -8812 -34181 -38185 103985 68864 51065 45430 -59302
15361e9302r0809k467Q2813M7263l3548j33420m4109M3478O4703N0J23091o3055
$$ -59302 -150111 -152578 -69765 -22502 -56050 -189470 -233579 -190101 -125398 -125348 -2257 -65312
15349f5312R181K9587n8722M2550M9310n2105j9326k8084M1317R2936P635K2277
$$ -65312 -56131 -26544 -85266 -42716 6594 -45511 -64837 -92921 -51604 41332 48967 71244
15337G1244J745J420m7413O0924k2570K8202L9590M9436o8665j16513n9873o6086
$$ 71244 72989 74409 26996 87920 65350 93552 133142 182578 113913 -2600 -62473 -128559
15325a28559j3904P1029l9320j2035J01838N948m0590M4667Q7772K4416k2896
$$ -128559 -142463 -71434 -110754 -122789 -20951 -15003 -55593 -10926 76846 101262 78366
15314G8366l0485n69j1201M2640m9974K5402k3876n4064k4520J35642P610j27069
$$ 78366 47881 47312 36111 78751 28777 54179 30303 -23761 -48281 87361 94971 -32098
15302c2098N9672M8604j11080m0548L3579q804J33790k0431r9130K6397Q763l341
$$ -32098 27574 76178 -34902 -75450 -41871 -50675 83115 62684 -36446 -10049 -1286 -4627
15290d627l5365J167M2300K7512k7560j2909l5239J55K5747P4485j1211K3016
$$ -4627 -39992 -38825 3475 30987 3427 -9482 -44721 -44566 -18819 55666 44455 67471
15278F7471K012j7596l8484k3420k353p2025J08647O196j26080j2433Q169N8770
$$ 67471 69483 51887 13403 -10017 -12370 -84395 24252 30448 -95632 -108065 -99896 -41126
15266d1126j4952o2948M4456r6152p7878J98087N5643k6435p4491J2093P2510
$$ -41126 -56078 -119026 -74570 -170722 -248600 -50513 5130 -21305 -95796 -83703 -11193
15255a1193J6575o3159m9414j0071q8399K5889J48816J05659m6348M8941k8541
$$ -11193 5382 -57777 -107191 -117262 -205661 -179772 -30956 74703 28355 77296 48755
15244D8755J5846K5039q2193J7517j751l3803m5865k6895J6512N5207N6717l975
$$ 48755 64601 89640 7447 24964 23213 -10590 -56455 -83350 -66838 -11631 45086 41111
15232D1111q8991n1578k5589k140n1031l5902M2385K44076J9900J0229J6386J3014
$$ 41111 -47880 -99458 -125047 -127187 -178218 -214120 -171735 72341 92241 102470 118856 131870
15220A31870K8730O695k4986j30511j43597q225K4810J7159M7603N3837L4314
$$ 131870 160600 167295 142309 11798 -131799 -140024 -115214 -98055 -50452 3385 37699
15209C7699O0883k4842p9593q4831L216N0534O7576J7509o3038o1296o5213o6086
$$ 37699 98582 73740 -5853 -90684 -87468 -36934 30642 48151 -14887 -76183 -141396 -207482
15197b07482l4843o5675m8533N2839R8806J36963M5431K2360J4107O0631n4316
$$ -207482 -242325 -308000 -356533 -303694 -204888 -67925 -22494 -134 13973 74604 20288
15186B0288r5223M4618Q2940J4968Q4143m2280p5231K8781j8144q4166M0386M7581
$$ 20288 -74935 -30317 52623 67591 151734 109454 34223 63004 44860 -39306 1080 48661
15174D8661K3460o7396p870J7642O2725J07758o8768j01749n1575K2560N2641
$$ 48661 72121 4725 -3145 14497 77222 184980 116212 14463 -37112 -14552 38089
15163C8089m2293p470K9357l797J12025R0909j10289r7019m8111p9015J10512
$$ 38089 -4204 -11674 17683 13886 125911 216820 106531 9512 -38599 -117614 -7102
15152g102j4003O97l8610p717L3996j3047j1831p277J10071k7208q3251l6028
$$ -7102 -21105 -20408 -59018 -66735 -32739 -45786 -57617 -64894 45177 17969 -65282 -101310
15140a01310r6219k6957j7435m5735N7111Q3030p4320K9491M2272p079p1550j089
$$ -101310 -197529 -224486 -241921 -287656 -230545 -147515 -221835 -192344 -150072 -157151 -228701 -229790
15128b29790m0574P7183J03824N5079P21n0502L8507J40147l0983p8136M3111
$$ -229790 -270364 -193181 -89357 -34278 -33557 -84059 -45552 94595 63612 -14524 28587
15117B8587p020j13249j02337l3255J22141N4019R0310L492q9509j4329o4534
$$ 28587 21567 -91682 -194019 -227274 -105133 -51114 39196 42688 -46821 -61150 -125684
15106a25684l3109l5563O261J02489K8084K7485M0337k3507k7331J12310J0105
$$ -125684 -158793 -194356 -188095 -85606 -57522 -30037 10300 -13207 -40538 71772 81877
15095H1877k8868o9774M5190m8271P696j1106P3718q0828o0722L2764n0744j0427
$$ 81877 53009 -16765 28425 -19846 -12150 -23256 50462 -30366 -91088 -58324 -109068 -119495
15083a19495l0351O7495Q9947N5157J1348j7011n6945P2041M242l3611M0599R1717
$$ -119495 -149846 -82351 7596 62753 74101 57090 145 72186 76428 42817 83416 175133
15071A75133j0792j039j13390j57582n080j8966k672Q9485P7006l0491K2242p2189
$$ 175133 164341 163302 49912 -107670 -112750 -131716 -134388 -44903 32103 1612 23854 -48335
15059d8335m0538l2974M961J6157J02464L8662j00716l2335m2760l4923O1412
$$ -48335 -88873 -121847 -116886 -100729 1735 40397 -60319 -92654 -135414 -170337 -108925
15048a08925J81547J05112j70703j80536K7309J59792O2418N2680r6902r1981
$$ -108925 72622 177734 7031 -173505 -146196 13596 76014 128694 31792 -60189
15038f0189Q834n6973l8643L2845O6007j020J1869m3314L6831K0497J01709p0165
$$ -60189 -51355 -108328 -146971 -114126 -48119 -49139 -37270 -80584 -43753 -23256 78453 8288
15026H288l2430K2840j0381M7000q3083m4585P2302P6931j9697n4808l5895j8283
$$ 8288 -24142 -1302 -11683 35317 -47766 -92351 -20049 56882 37185 -17623 -53518 -71801
15014g1801Q5503K6407J10969j045m0491n6996j32395l3207L2915P9688N286r2097
$$ -71801 13702 40109 151078 150033 109542 52546 -79849 -113056 -80141 -453 4833 -87264
15002h7264Q518M8012L8663k3793O0580p6196O3334J2274q0730L6520L0355o494
$$ -87264 -78746 -30734 7929 -15864 44716 -31480 31854 44128 -36602 -82 30273 23779
14990B3779N1732K8785k8459m1955Q970N5399J6495j12005P55N9866M0077M8621
$$ 23779 75511 104296 75837 33882 42852 98251 114746 2741 3496 63362 103439 152060
14978A52060l916j31092l6025o0835N352M2636J0668J5655L0424p6020J7720N6794
$$ 152060 148144 17052 -18973 -79808 -74456 -31820 -21152 -5497 24927 -51093 -33373 23421
14966B3421K2398L117q6639m8404N8113j2417j8999L6104j7496J08108J31150
$$ 23421 45819 48936 -37703 -86107 -27994 -40411 -59410 -23306 -40802 67306 198456
14955A98456M3328l9453o0699j23697m8083N535k7825k1920M2034l9497q5664
$$ 198456 241784 202331 141632 17935 -30148 -24613 -52438 -74358 -32324 -71821 -157485
14944a57485j4206J0705J5587O2352N1993l6216M8135K2850l406K0215q2539P304
$$ -157485 -171691 -160986 -145399 -83047 -31054 -67270 -19135 3715 309 20524 -62015 -54711
14932e4711R5800P7070Q7102q1915j41093L1134K0226j2372Q3960M2568j08008
$$ -54711 41089 118159 205261 123346 -17747 13387 33613 21241 105201 147769 39761
14921C9761k5410k0566N0956K8295J6993p3225q5036J7748K1023j12588O9199
$$ 39761 14351 -6215 44741 73036 90029 16804 -68232 -50484 -29461 -142049 -72850
14910g2850J32208J8837n7019k0448o7704j4410M8748L2876n3150K3549M9531
$$ -72850 59358 78195 21176 728 -66976 -81386 -32638 238 -52912 -29363 20168
14899B0168j8574m1097K0084J18464j35873j11619L3722J5484r6385O6546J66414
$$ 20168 1594 -39503 -19419 99045 -36828 -148447 -114725 -99241 -195626 -129080 37334
14888C7334P2634o6333J3075k6693M1787M6856k514j5300n2027l9364L3527L8992
$$ 37334 109968 43635 56710 30017 71804 118660 116146 100846 48819 9455 42982 81974
14876H1974j25404r2683J4189M2418l2329k7280l4597N5395M8983o9747K4252
$$ 81974 -43430 -136113 -121924 -79506 -111835 -139115 -173712 -118317 -69334 -139081 -114829
14865a14829N6676M7635P1556J4818p6466j7976o2899Q77J32245M9379p5186O8162
$$ -114829 -58153 -10518 61038 75856 -610 -18586 -81485 -80608 51637 101016 25830 93992
14853I3992M0124j01918j0716k3808j3255j4010R1629l5281k0052r992p0782j0168
$$ 93992 134116 32198 21482 -2326 -15581 -29591 62038 26757 6705 -3287 -74069 -84237
14841h4237J2383r334Q919R2465J6328L2069K2703m7564M0291l017p3839m7310
$$ -84237 -71854 -81188 -72269 20196 36524 68593 91296 43732 84023 81006 7167 -40143
14829d0143m5857r822Q2595l4184M1368l5626L8782L7378l6508q4535M2136k7159
$$ -40143 -86000 -95822 -13227 -47411 -6043 -41669 -2887 34491 -2017 -86552 -44416 -71575
14817g1575J1432N0477J470N5817M7253r7603q2979K4679J09492M8681k9854q3192
$$ -71575 -60143 -9666 -8196 47621 94874 -2729 -85708 -61029 48463 97144 67290 -15902
14805a5902n4412M9244M3117P8890j927m5624Q136r4726P7461O437k9899k7511
$$ -15902 -70314 -21070 22047 100937 99010 53386 61522 -33204 44257 50694 20795 -6716
14793f716N2811j4231p0403N8429J6726m8778q2636M1923N6488J40028l6971p2080
$$ -6716 46095 31864 -38539 19890 36616 -12162 -94798 -52875 3613 143641 106670 34590
14781C4590l4473q9547j0958q5409m4025J5620J8286m2924L7871j1869P0461N1435
$$ 34590 117 -89430 -100388 -185797 -229822 -214202 -195916 -238840 -200969 -212838 -142377 -90942
14769i0942K7177R532m3766R9001K0187o7634n454k0129n9118K1654R2013L1048
$$ -90942 -63765 -54233 -97999 1002 21189 -46445 -51899 -72028 -131146 -109492 -17479 13569
14757A3569j03641l3207P7400O2172q1266p321M9629p2295l6728k0882P4602K9308
$$ 13569 -90072 -123279 -45879 16293 -64973 -72294 -22665 -94960 -131688 -152570 -77968 -48660
14745d8660J3574n9039P7037O7718K0182k9641M157l1420m279n8928j57563m7943
$$ -48660 -35086 -94125 -17088 50630 70812 41171 45328 13908 9629 -49299 -206862 -254805
14733b54805J32752R0684P83J46199K7847m1775j22654m6722o6666L3690O1065
$$ -254805 -122053 -31369 -30586 115613 143460 101685 -20969 -67691 -134357 -100667 -39602
14722c9602j9138k844l399M0070o529k6188K3767K0527K6613N5050j07243M4699
$$ -39602 -58740 -61584 -64983 -24913 -31442 -57630 -33863 -13336 13277 68327 -38916 5783
14710E783P6418N0030J2872p8114l2900n6740p2267n7790M5238M4532P5655j17071
$$ 5783 82201 132231 145103 66989 34089 -22651 -94918 -152708 -107470 -62938 12717 -104354
14698a04354m0493Q2499P8152O2516r9501n6284J14738J34233j2007q9612r4951
$$ -104354 -144847 -62348 15804 78320 -21181 -77465 37273 171506 159499 69887 -25064
14687b5064K902k6530j5107q3176l1781L3811O9203Q4524J5754J6113j04M7060
$$ -25064 -22162 -48692 -63799 -146975 -178756 -144945 -75742 8782 24536 40649 40545 87605
14675H7605K686p7160o8924R04P7697J8079P6343R0207l1471q6461m7685k3202
$$ 87605 90291 13131 -55793 -54889 22808 40887 117230 207437 175966 89505 41820 18618
14663A8618n3033k6544J4591K0458j7698k11749M705R8758J03943k8145L119p0155
$$ 18618 -34415 -60959 -46368 -25910 -43608 -255357 -250652 -151894 -47951 -76096 -72977 -143132
14651a43132j26298O2500Q3526J0862J28254J06431l4743m8917n3222M3031m6015
$$ -143132 -269430 -206930 -123404 -112542 15712 122143 87400 38483 -14739 28292 -17723
14640a7723q552M8718L8088K1156n3929M865k8480J2106M5294l3365o1094L1471
$$ -17723 -26275 22443 60531 81687 27758 32623 4143 16249 61543 28178 -32916 -1445
14628a445M3813n8512o8446n9462O4830N332k6521k0856N1795O1994n4129J16400
$$ -1445 42368 -16144 -84590 -144052 -79222 -73890 -100411 -121267 -69472 -7478 -61607 54793
14616E4793j156o3369M1609j25093k1254m567J19113J28569O0175j63991j80630
$$ 54793 53637 -9732 31877 -93216 -114470 -119037 76 128645 188820 24829 -155801
14605a55801j8143Q3369Q1825M050L4884l9725l0410K5914q4456j6580L7600m1221
$$ -155801 -173944 -90575 -8750 -4700 30184 -9541 -39951 -14037 -98493 -115073 -77473 -118694
14593a18694K4330J24555N0640n5348R615N443J794m5652J5865R3483L8820j87240
$$ -118694 -94364 30191 80831 25483 35098 40541 42335 -3317 12548 106031 144851 -42389
14581d2389j46822P6202L4400J0313l6183L64j12168J30391k6379l8874M7593
$$ -42389 -189211 -113009 -78609 -68296 -104479 -104115 -216283 -85892 -112271 -151145 -103552
14570a03552J46802j6598k8Q9107j7014q2187j18173L1594J17374L7977o85M420
$$ -103552 43250 26652 26624 115731 98717 16530 -101643 -70049 47325 85302 84617 89037
14558H9037K6663k2655n4847O8695M2038O7400J0756j56028m7410P7717L6280
$$ 89037 115700 93045 38198 106893 148931 216331 227087 71059 23649 101366 137646
14547A37646J5133L0156J2610l2318m9599j0774l5081O483N3788j5845j19409
$$ 137646 152779 182935 195545 163227 113628 102854 67773 74256 128044 112199 -7210
14536g210L596L5715j716n7354M4213J30361m3273J8838K722l0347Q4903J7392
$$ -7210 -3614 32101 30385 -26969 17244 147605 104332 123170 125892 95545 180448 197840
14524A97840j41688J8578K4036q0766l2474j535M5662Q2567k1594k488l1147l5241
$$ 197840 56152 74730 98766 18000 -14474 -16009 29653 112220 90626 88138 56991 21750
14512B1750n4255n1974M4549M6807J8553L7732j1915n0820n686p2168j6285M7684
$$ 21750 -32505 -84479 -39930 6877 25430 63162 51247 427 -5259 -77427 -93712 -46028
14500d6028j495k6049l3564P8347m1680r6891m9842l2193K2599j0124O9352Q9539
$$ -46028 -47523 -73572 -107136 -28789 -70469 -167360 -217202 -249395 -226796 -236920 -167568 -78029
14488g8029Q3004R0381p814m0913P13R205Q7753N2743o76o797n7834m5865k4340
$$ -78029 4975 95356 87542 46629 47342 56547 144300 197043 196367 189570 131736 85871 61531
14475F1531K500J8844P2851q615m1532q7016o3853J7407J1312j4965R7150l9469
$$ 61531 64031 82875 155726 147111 105579 18563 -45290 -27883 -16571 -31536 65614 26145
14463B6145M0904p8708q1342m1128q2103j5213j0229O4306Q3477N4876K6536Q799
$$ 26145 67049 -11659 -93001 -134129 -216232 -231445 -241674 -177368 -93891 -39015 -12479 -3680
14451c680j27561j029k1651J4916n1262J1867M9417J7059j7958K9087K7535N8132
$$ -3680 -131241 -132270 -153921 -139005 -190267 -178400 -128983 -111924 -129882 -100795 -73260 -15128
14439a5128O6156M1958n0298n1924p494n870k3113j3967J0355j9909O4957M3640
$$ -15128 51028 92986 42688 -9236 -16730 -22600 -45713 -59680 -49325 -69234 -4277 39363
14427C9363P6414L3239m0308j3699m1329n7313j4624l6215k4331k2395n3581J19451
$$ 39363 115777 149016 108708 95009 53680 -3633 -18257 -54472 -78803 -101198 -154779 -35328
14415c5328K7412o1309K6010L7043j8901K3279J829o6044M1697Q8350m2732J5364
$$ -35328 -7916 -69225 -43215 -6172 -25073 -1794 35 -66009 -24312 64038 21306 36670
14403C6670j2040l7025O6662K2085m6988n3396q6366n1445J6572O6216j8849r472
$$ 36670 24630 -12395 54267 76352 29364 -24032 -110398 -161843 -145271 -79055 -97904 -107376
14391a07376m8976j1582K7070J15722l2743p8615M7783M6514m480j24622q3611
$$ -107376 -156352 -167934 -140864 -25142 -57885 -136500 -88717 -42203 -46683 -171305 -254916
14380b54916M2113R4940N0708j5712q200k0593M6077Q3329M8111n4335o9513M091
$$ -254916 -212803 -117863 -67155 -82867 -91067 -111660 -65583 17746 65857 11522 -57991 -53900
14368e3900L6970j2559o0235j5124p5091r6239R8164J14903J53344L907n6758
$$ -53900 -16930 -29489 -89724 -104848 -179939 -276178 -178014 -63111 90233 94140 37382
14357C7382j21669M4662n2490m807R8919J3058j2096K5410L2769J1380j36374
$$ 37382 -84287 -39625 -92115 -96922 1997 15055 2959 28369 61138 72518 -63856
14346f3856k4796K5138K5545L1154k7695q0694J2950p1202J901J60012J23383
$$ -63856 -88652 -63514 -37969 -6815 -34510 -115204 -102254 -173456 -171555 -11543 111840
14335A11840k4782k1638p6691L2197j7097o3706l2609J6573O4290N6222m770j5756
$$ 111840 87058 65420 -11271 20926 3829 -59877 -92486 -75913 -11623 44599 39829 24073
14323B4073j24194O4056O6072k5050j6224n9887p2465m3126L3766L7252j1810
$$ 24073 -100121 -36065 30007 4957 -11267 -71154 -143619 -186745 -152979 -115727 -127537
14312a27537P625L0516O1755K5309m2911p7065K6497j6835O8406N8655k9977o9697
$$ -127537 -119912 -89396 -27641 -2332 -45243 -122308 -95811 -112646 -44240 14415 -15562 -85259
14300h5259k2544n1838r706l8039j4479J8938N8128J38415K7773p8086j24275
$$ -85259 -107803 -159641 -169347 -207386 -221865 -202927 -144799 -6384 21389 -56697 -180972
14289a80972N5591R387p0263l4849M9619M8355N9591l8263r0722L563O4180M2103
$$ -180972 -125381 -115994 -186257 -221106 -171487 -123132 -63541 -101804 -192526 -188963 -124783 -82680
14277h2680J6283k2413n179j0308j8689j0529J4599l4523N0063O9224J08551m2503
$$ -82680 -66397 -88810 -93989 -104297 -122986 -133515 -118916 -153439 -103376 -34152 74399 31896
14265C1896K3149L4198j26860l941q029Q081P743L3635P0904L8392p1648m5873
$$ 31896 55045 89243 -37617 -41558 -49587 -41506 -33763 -128 70776 109168 37520 -8353
14253h353l616m4436j18311n1709M3931R4903M2318J02039N4092l7497L1392M3917
$$ -8353 -11969 -56405 -174716 -226425 -182494 -87591 -45273 56766 110858 73361 104753 148670
14241A48670o9102O45p8515j18533M6188k3806M4282j6749M2165K0058J0623o4149
$$ 148670 79568 80213 1698 -116835 -70647 -94453 -50171 -66920 -24755 -4697 5926 -58223
14229e8223K3989L0862o1353o0772l2890M0329P1825j3070K7452j461p5946P4577
$$ -58223 -34234 -3372 -64725 -125497 -158387 -118058 -46233 -59303 -31851 -33312 -109258 -34681
14217c4681J35195q1620m8534J6681P6370q1214r8261K6989j1906P6348l7390
$$ -34681 100514 18894 -29640 -12959 63411 -17803 -116064 -89075 -100981 -24633 -62023
14206f2023N721J2174j40226M1211P1309l9366j5388L6813J1077p0396k767R1099
$$ -62023 -56302 -44128 -184354 -143143 -71834 -111200 -126588 -89775 -78698 -149094 -151861 -60762
14194f0762P6705p0890p5096N6888N2935K7393J16997o928q3534j5600J07230
$$ -60762 15943 -54947 -130043 -73155 -20220 7173 124170 117242 33708 18108 125338
14183A25338m7425l8189j11294K9932J37327N5713N4516l2695j10634j66270M9118
$$ 125338 77913 39724 -71570 -41638 95689 151402 205918 173223 62589 -103681 -54563
14172e4563m4070o4287M8159O8855O1173L882n6573M367R6748o6475l9344j4596
$$ -54563 -98633 -162920 -114761 -45906 15267 19149 -37424 -33057 63691 -2784 -42128 -56724
14160e6724J3953M6839L2578N9885j2219q1839p6864P6798L1342j7204r4596q7719
$$ -56724 -42771 4068 36646 96531 84312 2473 -74391 2407 33749 16545 -78051 -165770
14148a65770m7782J43846O9401q1578j6109J13796K5671P435K203n564J21839
$$ -165770 -213552 -69706 -305 -81883 -97992 15804 41475 48910 51113 45549 167388
$$ [...]
##END NTUPLES=NMR SPECTRUM
##END=
