##TITLE=Analysis number 324589
Compound Code mo 07767
Book Reference 451/185
Project Code adrs
Chemist Name evam
##JCAMPDX= 6.0         $$ Bruker NMR JCAMP-DX V2.0
##DATA TYPE= NMR SPECTRUM
##DATA CLASS= NTUPLES
##ORIGIN= Bruker BioSpin GmbH
##OWNER= nmr
$$ XWIN-NMR		Version 3.5
$$ Mon Nov 27 11:54:11 2006 GMT Standard Time (UT+0h)  MAYBRIDGE\nmr@NMR_250MHZ
##.OBSERVE FREQUENCY= 250.131544655141
##.OBSERVE NUCLEUS= ^1H
##.ACQUISITION MODE= SIMULTANEOUS (DQD)
##.ACQUISITION SCHEME= undefined
##.AVERAGES= 16
##.DIGITISER RES= 18
##SPECTROMETER/DATA SYSTEM= dpx250
##.PULSE SEQUENCE= zg30
##.SOLVENT NAME= CDCl3
##.SHIFT REFERENCE= (INTERNAL, CDCl3, 0, 16.522)
##AUDIT TRAIL= $$ (NUMBER, WHEN, WHO, WHERE, WHAT)
$$ ##TITLE= Audit trail, XWIN-NMR		Version 3.5
$$ ##JCAMPDX= 5.01
$$ ##ORIGIN= Bruker BioSpin GmbH
$$ ##OWNER= nmr
$$ C:\u/data/dgb/nmr/ADRS/1150/pdata/1/auditp.txt
$$ ##AUDIT TRAIL=  $$ (NUMBER, WHEN, WHO, WHERE, WHAT)
(   1,<2006-11-27 11:53:42.26 +000>,<MAYBRIDGE\nmr>,<NMR_250MHZ>,
      <created by zg, POWCHK disabled, PULCHK disabled
       configuration hash MD5:
       49 4B E0 1D 92 C2 6B 37 9F E6 65 BC 52 41 86 1D
       data hash MD5: 64K
       D4 A2 82 92 14 E6 AC 7A 7B 7A 43 07 1D B7 7C B1>)
(   2,<2006-11-27 11:53:59.19 +000>,<MAYBRIDGE\nmr>,<NMR_250MHZ>,
      <Start of raw data processing
       ef LB = 0.3 FT_mod = 6 PKNL = 1 SI = 32K 
       data hash MD5: 32K
       4B 73 63 84 5A 0B 53 B0 BD 51 EC E7 4C 3D B9 AF>)
(   3,<2006-11-27 11:54:01.70 +000>,<MAYBRIDGE\nmr>,<NMR_250MHZ>,
      <apk 
       data hash MD5: 32K
       B2 99 55 77 27 F1 05 6C 1A 0F A1 D4 FB 0D 51 C2>)
(   4,<2006-11-27 11:54:02.48 +000>,<MAYBRIDGE\nmr>,<NMR_250MHZ>,
      <abs ABSG = 5 
       data hash MD5: 32K
       C4 1B 81 14 BA 92 05 4C 23 D4 19 14 9C D7 41 45>)
$$ ##END=
$$ 
$$ hash MD5
$$ E5 BD 01 B4 15 A8 C9 8A C5 2C BD 03 22 C0 A4 34
##$RELAX= 
##$RELAX= 
##$RELAX= 
##$RELAX= 
##$RELAX= 
##$RELAX= 
##$RELAX= 
$$ Bruker specific parameters
$$ --------------------------
##$DU= <C:\u>
##$EXPNO= 1150
##$NAME= <ADRS>
##$PROCNO= 1
##$TYPE= <nmr>
##$USER= <dgb>
##$AMP= (0..31)
100 100 100 100 100 100 100 100 100 100 100 100 100 100 100 100 100 100 
100 100 100 100 100 100 100 100 100 100 100 100 100 100 
##$AQSEQ= 0
##$AQ_mod= 3
##$AUNM= <au_zg>
##$AUTOPOS= <48 >
##$BF1= 250.13
##$BF2= 250.13
##$BF3= 250.13
##$BF4= 250.13
##$BF5= 500.13
##$BF6= 500.13
##$BF7= 500.13
##$BF8= 500.13
##$BYTORDA= 1
##$CFDGTYP= 0
##$CFRGTYP= 5
##$CHEMSTR= <none>
##$CNST= (0..31)
1 1 145 1 1 1 1 1 1 1 1 1 1 1 1 1 1 1 1 1 1 1 1 1 1 1 1 1 1 1 1 1 
##$CPDPRG= <>
##$CPDPRG1= <>
##$CPDPRG2= <>
##$CPDPRG3= <>
##$CPDPRG4= <mlev>
##$CPDPRG5= <mlev>
##$CPDPRG6= <mlev>
##$CPDPRG7= <mlev>
##$CPDPRG8= <mlev>
##$CPDPRGB= <>
##$CPDPRGT= <>
##$D= (0..31)
0 1 0 0 0 0 0 0 0 0.06 0 0 0 0 0 0 0.0002 0 0 0 0 0 0 0 0 0 0 0 0 0 0 
0 
##$DATE= 1164628420
##$DBL= (0..7)
120 120 120 120 120 120 120 120 
##$DBP= (0..7)
150 150 150 150 150 150 150 150 
##$DBP07= 0
##$DBPNAM0= <>
##$DBPNAM1= <>
$$ [...]
##$SUBNAM7= <"">
##$SUBNAM8= <"">
##$SUBNAM9= <"">
##$SW= 20.6930455092707
##$SWIBOX= (0..15)
0 0 3 0 0 0 0 0 0 0 0 0 0 0 0 0 
##$SW_h= 5175.983436853
##$TD= 65536
##$TD0= 1
##$TE= 294.16
##$TE2= 300
##$TE3= 300
##$TEG= 300
##$TL= (0..7)
0 120 120 120 120 120 120 120 
##$TP= (0..7)
150 150 150 150 150 150 150 150 
##$TP07= 0
##$TPNAME0= <>
##$TPNAME1= <>
##$TPNAME2= <>
##$TPNAME3= <>
##$TPNAME4= <>
##$TPNAME5= <>
##$TPNAME6= <>
##$TPNAME7= <>
##$TPOAL= (0..7)
0.5 0.5 0.5 0.5 0.5 0.5 0.5 0.5 
##$TPOFFS= (0..7)
0 0 0 0 0 0 0 0 
##$TUNHIN= 0
##$TUNHOUT= 0
##$TUNXOUT= 0
##$USERA1= <user>
##$USERA2= <user>
##$USERA3= <user>
##$USERA4= <user>
##$USERA5= <user>
##$V9= 5
##$VALIST= <valist>
##$VCLIST= <CCCCCCCCCCCCCCC>
##$VD= 0
##$VDLIST= <DDDDDDDDDDDDDDD>
##$VPLIST= <PPPPPPPPPPPPPPP>
##$VTLIST= <TTTTTTTTTTTTTTT>
##$WBST= 1024
##$WBSW= 4
##$XGAIN= (0..3)
0 0 0 0 
##$XL= 0
##$YL= 0
##$YMAX_a= 462646
##$YMIN_a= -470463
##$ZGOPTNS= <>
##$ZL1= 120
##$ZL2= 120
##$ZL3= 120
##$ZL4= 120
##$ABSF1= 16.522
##$ABSF2= -4.171173
##$ABSG= 5
##$ABSL= 3
##$ALPHA= 0
##$AQORDER= 0
##$ASSFAC= 0
##$ASSFACI= 0
##$ASSFACX= 0
##$ASSWID= 0
##$AUNMP= <proc_1d>
##$AZFE= 0.1
##$AZFW= 0.1
##$BCFW= 0
##$BC_mod= 0
##$BYTORDP= 0
##$COROFFS= 0
##$CY= 12.5
##$DATMOD= 1
##$DC= 0
##$DFILT= <>
##$DTYPP= 0
##$F1P= 14.0000005364418
##$F2P= -0.99999901652339
##$FCOR= 0.5
##$FTSIZE= 32768
##$FT_mod= 6
##$GAMMA= 0
##$GB= 0
##$INTBC= 1
##$INTSCL= 1
##$ISEN= 128
##$LB= 0.3
##$LEV0= 0
##$LPBIN= 0
##$MAXI= 10000
##$MC2= 0
##$MEAN= 0
##$ME_mod= 0
##$MI= 0
##$NCOEF= 0
##$NC_proc= -3
##$NLEV= 6
##$NOISF1= 0
##$NOISF2= 0
##$NSP= 0
##$NTH_PI= 0
##$NZP= 0
##$OFFSET= 16.522
##$PC= 1
##$PHC0= 221.4534
##$PHC1= 7.297224
##$PH_mod= 1
##$PKNL= yes
##$PPARMOD= 0
##$PSCAL= 4
##$PSIGN= 0
##$REVERSE= no
##$SF= 250.13
##$SI= 32768
##$SIGF1= 0
##$SIGF2= 0
##$SINO= 400
##$SIOLD= 32768
##$SREGLST= <1H.CDCl3>
##$SSB= 0
##$STSI= 32768
##$STSR= 0
##$SW_p= 5175.98343685301
##$SYMM= 0
##$S_DEV= 0
##$TDeff= 65536
##$TDoff= 0
##$TI= <Analysis number 999999
Compound Code 99
Book Reference 9
Project Code 9>
##$TILT= no
##$TM1= 0
##$TM2= 0
##$TOPLEV= 0
##$USERP1= <user>
##$USERP2= <user>
##$USERP3= <user>
##$USERP4= <user>
##$USERP5= <user>
##$WDW= 1
##$XDIM= 32768
##$YMAX_p= 383507920
##$YMIN_p= -103326
$$ End of Bruker specific parameters
$$ ---------------------------------
##NTUPLES= NMR SPECTRUM
##VAR_NAME=  FREQUENCY,     SPECTRUM/REAL,   SPECTRUM/IMAG
##SYMBOL=    X,             R,               I
##VAR_TYPE=  INDEPENDENT,   DEPENDENT,       DEPENDENT
##VAR_FORM=  AFFN,          ASDF,            ASDF
##VAR_DIM=   32768,         32768,           32768
##UNITS=     HZ,            ARBITRARY UNITS, ARBITRARY UNITS
##FACTOR=    0.157963299565203, 1,           1
##FIRST=     4132.6476996994, 0,             0
##LAST=      -1043.33573715361, 0,           0
##MIN=       -1043.33573715361, -103326,     0
##MAX=       4132.6476996994, 383507920,     0
$$ Real data points
##PAGE= N=1
##DATA TABLE= (X++(R..R)), XYDATA
$$ [...]
$$ plain form
16471 -8582 22519 33469 -177 -9397 -21531 -36918 -20084 -2484 -26739 -45479 -52388 -56292
16459 -56292 -53132 -34791 -15268 3406 -1773 -3454 -8855 -25007 -9123 18429 49551 35381
16447 35381 25978 10609 -17897 -19718 -10964 -13580 -4979 33845 25976 40725 47386 18825 -5030
16434 -5030 -31230 -30386 -2408 14545 31386 29716 22645 29105 26713 -1975 14104 9618 -14804
16421 -14804 -40239 -32167 4608 8047 -303 -11343 -6075 5229 2011 8952 -5841 -12691 -22353
16408 -22353 -15670 -36948 -37118 -16864 -18917 -16211 2685 3368 51 -11778 -32646 -13272 6655
16395 6655 3335 -3829 3332 2776 13103 26641 21656 14404 8569 14022 26612 15832 -3595 -7684
16381 -7684 10162 20386 11930 -11184 -84 -9550 -7886 14773 28831 25516 18519 15406 -9118
$$ packed form
16471h582L1101J0950l3646r220j2134j5387J6834J7600k4255j8740o909l904
16459e6292L160J8341J9523J8674n179j681n401j6152J5884K7552L1122j4170
16447C5381r403j5369k8506j821Q754k616Q601L8824p869J4749O661k8561k3855
16434e030k6200Q44K7978J6953J6841j670p071O460k392k8688J6079m486k4422
16421a4804k5435Q072L6775L439q350j1040N268J1304l218O941j4793o850r662
16408b2353O683k1278j70K0254k053K706J8896O83l317j1829k0868J9374J9927
16395F655l320p164P161n56J0327J3538m985p252n835N453J2590j0780j9427m089
16381g684J7846J0224q456k3114J1100r466J664K2659J4058l315o997l113k4524
$$ plain form
16368 -9118 -22937 -32197 -3217 6338 -6076 -35419 -51588 -20344 10681 4790 -1327 -22831 -36653
16355 -36653 -24295 6477 -13557 -35904 -52892 -62833 -49171 -49031 -22978 1145 7274 -4299
16343 -4299 -14795 16335 37818 36851 34379 39554 17404 -5174 -2491 -12817 -19660 11854 409
16330 409 -3154 -2490 -30652 -32350 12380 27188 3862 -18129 -5030 15148 6959 9043 7144
16317 7144 11070 11155 3584 -15520 1395 12965 6220 -11194 -8880 -18456 -12108 -1176 8701 -11688
16303 -11688 -19767 -14621 -18975 -9459 -13244 7029 6279 4366 -1859 4870 27486 33228 37951 23415
16289 23415 -3330 -6145 -2838 -25900 -45614 -58168 -36607 -5682 17075 3971 -1228 -27792
16277 -27792 -45938 -39885 -20885 -23229 -31538 -30114 -43418 -57583 -50883 -41102 -10448 -27762 -29982
$$ packed form
16368i118j3819r260K8980R555j2414k9343j6169L1244L1025n891o117k1504j3822
16355c6653J2358L0772k0034k2347j6988r941J3662J40K6053K4123O129j1573
16343d299j0496L1130K1483r67k472N175k2150k2578K683j0326o843L1514j1445
16330D09l563O64k8162j698M4730J4808k3326k1991J3099K0178q189K084j899
16317G144L926Q5p571j9104J6915J1570o745j7414K314r576O348J0932R877k0389
16303a1688q079N146m354R516l785K0273p50j913o225O729K2616N742M723j4536
16289B3415k6745k815L307k3062j9714j2554K1561L0925K2757j3104n199k6564
16277b7792j8146O053J9000k344q309J424j3304j4165O700R781L0654j7314k220
$$ plain form
16264 -29982 -450 18147 20887 24187 10943 540 2582 -26405 -37451 -37350 -23866 -15097 -16312
16251 -16312 -23533 -6672 -12391 4288 20444 9849 -2272 -13031 -11858 -15146 7158 32028
16239 32028 30611 10426 -5442 -9080 -18748 -26568 -3599 12299 6087 5216 -2426 975 -16275
16226 -16275 -30418 -21793 -890 23734 34271 39534 32611 8955 -14257 -3665 15019 26272
16214 26272 5425 -20434 -32171 -29226 -13911 2873 4121 6904 11460 -8528 -43321 -66028
16202 -66028 -61642 -28621 5321 -9247 -29059 -8758 -13738 -16449 -19663 -20276 13505 23531 18946
16189 18946 13714 24043 15631 12522 5971 2743 11187 10484 -5790 -14490 -423 466 -8472 -3125
16175 -3125 11045 13646 -2479 7260 2817 17507 5508 -30811 -34714 -11152 -2179 -4722 1070
$$ packed form
16264b9982K9532J8597K740L300j3244j0403K042k8987j1046J01J3484Q769j215
16251a6312p221J6861n719J6679J6156j0595j2121j0759J173l288K2304K4870
16239C2028j417k0185j5868l638r668p820K2969J5898o212q71p642L401j7250
16226a6275j4143Q625K0903K4624J0537N263o923k3656k3212J0592J8684J1253
16214B6272k0847k5859j1737K945J5315J6784J248K783M556j9988l4793k2707
16202f6028M386L3021L3942j4568j9812K0301m980k711l214o13L3781J0026m585
16189A8946n232J0329q412l109o551l228Q444p03j6274q700J4067Q89q938N347
16175c125J4170K601j6125R739m443J4690j1999l6319l903K3562Q973k543N792
$$ plain form
16162 1070 -4510 -1756 -32129 -31190 -38276 -51195 -40682 -10706 -129 5302 6462 279 4208 -3553
16148 -3553 -4023 3754 -16216 13324 11539 3066 9571 30857 58782 38350 1246 -21075 -20620
16135 -20620 -18700 -34588 -33691 -25337 8561 4376 -4333 3324 13663 24394 25010 9401 1653 9564
16121 9564 1199 -1794 -1303 -18979 -22656 -25720 -19987 -15227 2440 32481 2597 -15340 6968
16108 6968 26795 21146 26938 32210 33174 -2047 -8589 -8985 -4796 -27208 -10262 -8612 -6270 -11426
16094 -11426 -17591 -15930 3337 10737 -551 -35160 -43816 -40622 656 2578 -14477 -29557 -35623
16081 -35623 -12938 -18816 -25635 -35286 -8748 36031 33070 -3991 -19179 -13635 -16006 -22471 -22081
16068 -22081 -1475 22151 5966 -12509 -9860 -13508 -19049 -4954 14091 2150 12996 12135 1700
$$ packed form
16162A070n580K754l0373R39p086j2919J0513K9976J0577N431J160o183L929p761
16148c553m70P777j9970K9540j785q473O505K1286K7925k0432l7104k2321M55
16135b0620J920j5888Q97Q354L3898m185q709P657J0339J0731O16j5609p748P911
16121I564q365k993M91j7676l677l064N733M760J7667L0041k9884j7937K2308
16108F968J9827n649N792N272R64l5221o542l96M189k2412J6946J650K342n156
16094a1426o165J661J9267P400j1288l4609q656L194M1278J922j7055j5080o066
16081c5623K2685n878o819r651K6538M4779k961l7061j5188N544k371o465L90
16068b2081K0606K3626j6185j8475K649l648n541J4095J9045j1941J0846q61j0435
$$ plain form
16055 1700 -26146 -28369 -28917 -29996 -5377 -2517 15652 31795 18259 20669 14810 -14 -13856
16042 -13856 -14793 -10859 -4661 -9159 -34062 -29820 -32979 -44067 -30734 -20263 -26604 -5347 -11108
16029 -11108 -21795 -28843 -14955 -2268 -10699 -41899 -33103 -23029 -19690 -25117 -23989 -33495 -33718
16016 -33718 -9320 3354 -6317 8261 7973 14928 22555 20291 15586 -18485 -36962 -29153 -33801
16003 -33801 -23164 -11105 14656 15734 22838 -6981 -41966 -37496 -50522 -39284 -18881 5357
15991 5357 11900 4877 2647 -797 -15148 -31909 -40024 -6078 5353 1868 3992 -10648 -28302
15978 -28302 -36861 -29350 -19958 -16341 -24546 -42275 -23331 -8102 -11621 -3607 -13932 -31605 -22409
15965 -22409 -6553 -15607 -18690 -16466 587 8676 34992 25818 27505 23250 3882 -13631 -5069
$$ packed form
16055A700k7846k223n48j079K4619K860J8169J6143j3536K410n859j4824j3842
16042a3856r37L934O198m498k4903M242l159j1088J3333J0471o341K1257n761
16029a1108j0687p048J3888J2687q431l1200Q796J0074L339n427J128r506k23
16016c3718K4398J2674r671J4578k88O955P627k264m705l4071j8477P809m648
16003c3801J0637J2059K5761J078P104k9819l4985M470j3026J1238K0403K4238
15991E357O543p023k230l444j4351j6761q115L3946J1431l485K124j4640j7654
15978b8302q559P511R392L617q205j7729J8944J5229l519Q014j0325j7673R196
15965b2409J5856r054l083K224J7053Q089K6316r174J687m255j9368j7513Q562
$$ plain form
15952 -5069 18197 29451 8083 -2024 21562 -6483 -29558 -11016 15230 31251 39862 32890
15940 32890 20432 19676 1055 -1698 -2148 5731 7916 18040 -1413 -16303 -23530 -26577 -11738
15927 -11738 7069 13722 23091 23270 3981 13148 14086 13722 15282 28352 48305 54826 13161 -3246
15913 -3246 661 30872 29092 21112 -2523 -12432 -20045 -20480 -28089 -15536 -994 -14923 -5484 -16434
15899 -16434 -41665 -21162 -1613 6170 18380 34020 23986 32788 21202 5200 18314 3947
15887 3947 -14954 -8271 3458 1979 -17877 -14395 -30594 -37733 -18498 -18664 -10781 -7281 -26266
15874 -26266 -34661 -28718 3082 4481 -24303 -42296 -60232 -48128 -7069 -8879 -19644 -23118 -15043
15861 -15043 130 22832 43454 45215 48648 14115 -6556 -7388 1046 5046 6211 9750 -1625
$$ packed form
15952e069K3266J1254k1368j0107K3586k8045k3075J8542K6246J6021Q611o972
15940C2890j2458p56j8621k753m50P879K185J0124j9453j4890p227l047J4839
15927a1738J8807O653R369J79j9289R167R38l64J560J3070J9953O521m1665j6407
15913c246L907L0211j780p980k3635r909p613m35p609J2553J4542j3929R439j0950
15899a6434k5231K0503J9549P783J2210J5640j0034Q802j1586j6002J3114j4367
15887C947j8901O683J1729j479j9856L482j6199p139J9235j66P883L500j8985
15874b6266q395N943L1800J399k8784j7993j7936J2104M1059j810j0765l474Q075
15861a5043J5173K2702K0622J761L433l4533k0671q32Q434M000J165L539j1375
$$ plain form
15848 -1625 26605 35829 29450 9441 -31338 -41833 -37099 -24573 -13215 -140 6002 10721 -13305
15835 -13305 -20968 5183 34207 17071 -7037 -35592 -20982 -564 -36926 -46251 -43606 -25926
15823 -25926 -7646 11822 23331 20134 32928 22333 12344 14822 10847 14235 3245 -7314 -3476
15810 -3476 5252 8812 62 14386 29235 20582 10580 6666 210 -20560 -17651 -3706 -4220 -4200
15796 -4200 -13873 -489 -19475 -24628 1020 33202 32950 19853 -553 -6437 15942 6588 1855
15783 1855 -9734 5553 6131 -17052 -42440 -5670 26422 30505 25607 15333 6841 -20527 -17081
15770 -17081 -6694 19100 39474 14126 -803 34488 55752 33287 18051 22357 22335 29622 15460
15757 15460 -4291 10713 18681 12576 -4534 7910 21017 43588 49269 21205 -1332 -14681
$$ packed form
15848a625K8230R224o379k0009m0779j0495M734J2526J1358J3075O142M719k4026
15835a3305p663K6151K9024j7136k4108k8555J4610K0418l6362r325K645J7680
15823b5926J8280J9468J1509l197J2794j0595r989K478l975L388j0990j0559L838
15810c476Q728L560q750J4324J4849q653j0002l914o456k0770K909J3945n14K0
15796d200r673J3384j8986n153K5648L2182k52j3097k0406n884K2379r354m733
15783A855j1589J5287N78k3183k5388L6770L2092M083m898j0274q492k7368L446
15770a7081J0387K5794K0374k5348j4929L5291K1264k2465j5236M306k2P287j4162
15757A5460j9751J5004P968o105j7110J2444J3107K2571N681k8064k2537j3349
$$ plain form
15745 -14681 -8928 -238 4628 -8029 -7273 -1711 -18957 -43786 -38624 -32134 -4863 7975 -16208
15732 -16208 -37540 -38151 -1556 -19293 -15309 -26940 -35733 -35700 -37586 -29980 -18911 -11272 9287 32326
15718 32326 23332 6451 805 -11641 22291 43523 21549 13900 16264 30472 5651 -9804
15706 -9804 9763 16746 -1703 -41 2211 -8318 -29044 -42208 -12107 -27232 -43792 -37104 -26063
15693 -26063 -12382 8623 -1899 -28453 -20295 -683 1477 -4297 -16947 -20014 -11034 -10225 -13245
15680 -13245 -6555 5528 11141 -18113 -26647 -14081 -3990 18093 20759 41575 47729 65241 71482
15667 71482 46462 25363 18938 24597 11752 50657 64500 32357 42699 32136 12677 -5817
15655 -5817 7873 20125 1964 -10478 -23863 -10233 19439 25580 -18167 -24934 -44757 -44023 -13008
$$ packed form
15745a4681N753Q690M866j2657P56N562j7246k4829N162O490K7271J2838k4183
15732a6208k1332o11L6595j7737L984j1631q793L3j886P606J1069P639K0559K3039
15718C2326q994j6881n646j2446L3932K1232k1974p649K364J4208k4821j5455
15706i804J9567O983j8449J662K252j0529k0726j3164L0101j5125j6560O688J1041
15693b6063J3681K1005j0522k6554Q158J9612K160n774j2650l067Q980Q09l020
15680a3245O690J2083N613k9254q534J2566J0091K2083K666K0816O154J7512O241
15667G1482k5020k1099o425N659j2845L8905J3843l2143J0342j0563j9459j8494
15655e817J3690J2252j8161j2442j3385J3630K9672O141m3747o767j9823P34L1015
$$ plain form
15642 -13008 372 3679 35256 45761 23953 8297 17694 23417 6535 9143 23508 11600
15630 11600 -23218 -17450 1636 13365 35133 34246 8694 6294 1281 -7423 -6492 -12406 -5419 6975
15616 6975 31766 10201 -3774 5402 14089 25809 9928 -14430 -12676 11367 44042 37627 26388
15603 26388 16718 5653 1890 17556 19319 8108 24121 35986 25368 19931 17238 8522 30230
15590 30230 29727 22086 45179 45021 34959 8921 11524 16509 -6421 -21108 -21670 -29080 -29095 -4289
15576 -4289 6328 -9995 -8992 17634 11433 6386 10186 10495 -3370 -18918 -16934 -8152 21676
15563 21676 30519 20116 5048 -6054 11639 19453 7010 10583 26355 11569 2008 34506
15551 34506 46425 25761 -2839 -3001 -9445 -12580 -9160 -27990 -28608 -4247 7118 -15704 -20709
$$ packed form
15642a3008J3380L307L1577J0505k1808j5656R397N723j6882K608J4365j1908
15630A1600l4818N768J9086J1729K1768q87k5552k400n013q704R31n914O987J2394
15616F975K4791k1565j3975R176Q687J1720j5881k4358J754K4043L2675o415j1239
15603B6388r670j1065l763J5666J763j1211J6013J1865j0618n437k693q716K1708
15590C0230n03p641K3093j58j0062k6038K603M985k2930j4687n62p410j5K4806
15576d289J0617j6323J003K6626o201n047L800L09j3865j5548J984Q782K9828
15563B1676Q843j0403j5068j1102J7693P814j2443L573J5772j4786r561L2498
15551C4506J1919k0664k8600j62o444l135L420j8830o18K4361J1365k2822n005
$$ plain form
15538 -20709 -10179 -4840 -14531 -13334 15636 20165 9236 -8086 -9798 4840 16631 11954 2076
15525 2076 4024 2239 -19640 -14292 -8040 1289 33816 18994 -15465 -16646 -1861 -16366 -10465
15512 -10465 5066 280 -5093 -35398 -48246 -35795 -16938 12578 30888 32038 31362 34074 18743
15499 18743 24033 7536 -7465 -8355 -8567 6195 17817 -2984 15929 17541 14388 706 11183
15486 11183 4929 -11072 -15013 -1091 -9400 -6491 -3898 -18905 -18412 -25822 -36479 -25374 -10616
15473 -10616 2968 14661 5261 -23100 -23797 -4198 5365 9552 24219 7397 -21171 -11831 101
15460 101 14871 25322 30289 44727 48837 46121 12523 9879 42493 27466 11809 8955 14794
15447 14794 -3074 -21500 -24743 -11427 -35031 -19476 -5397 -4490 3427 8727 8093 -4331 8712
$$ packed form
15538b0709J0530N339r691J197K8970M529j0929j7322j712J4638J1791m677r878
15525B076J948j785k1879N348O252R329L2527j4822l4459j181J4785j4505N901
15512a0465J5531m786n373l0305j2848J2451J8857K9516J8310J150o76K712j5331
15499A8743N290j6497j5001q90k12J4762J1622k0801J8913J612l153j3682J0477
15486A1183o254j6001l941J3922q309K909K593j5007M93p410j0657J1105J4758
15473a0616J3584J1693r400k8361o97J9599R563M187J4667j6822k8568R340J1932
15460A01J4770J0451M967J4438M110k716l3598k644L2614j5027j5657k854N839
15447A4794j7868j8426l243J3316k3604J5555J4079R07P917N300o34j2424J3043
$$ plain form
15434 8712 16569 9460 -9440 -5809 -14551 -7270 7426 18598 6812 -8458 -24914 -6000 21813
15421 21813 17050 22434 51079 69452 43829 19350 -2120 -5986 -2860 90 25804 26359 7817
15408 7817 19444 27644 32227 24495 22741 29883 -10390 -14148 5622 17373 17291 23752 26577 8135
15394 8135 5774 746 -15995 -27203 -23915 -25656 -20003 -3568 28143 38624 31330 36627 34983
15381 34983 47176 42591 20041 19524 11827 3031 11751 4690 14298 14416 28270 69673 79366 39778
15367 39778 24807 -908 -23709 -27309 -17154 4425 36013 57221 47638 40592 533 -15563
15355 -15563 -17693 -37012 -30097 8041 7455 -8872 -22439 -37205 -43164 -37607 -27775 -25632 -28229
15342 -28229 -33627 -48934 -31383 -27252 -47659 -55093 -40968 -14965 -321 8543 13424 5918 19752
$$ packed form
15434H712P857p109j8900L631q742P281J4696J1172j1786j5270j6456J8914K7813
15421B1813m763N384K8645J8373k5623k4479k1470l866L126K950K5714N55j8542
15408G817J1627Q200M583p732j754P142m0273l758J9770J1751q2O461K825j8442
15394H135k361n028j6741j1208L288j741N653J6435L1711J0481p294N297j644
15381C4983J2193m585k2550n17p697q796Q720p061R608J18J3854M1403R693l9588
15367C9778j4971k5715k2801l600J0155K1579L1588K1208r583p046m0059j6096
15355a5563k130j9319O915L8138n86j6327j3567j4766n959N557R832K143k597
15342b8229n398j5307J7551M131k0407p434J4125K6003J4644Q864M881p506J3834
$$ plain form
15329 19752 22381 13622 5792 6546 20360 24034 25658 37932 31855 25380 5598 10540 20590 17941
15315 17941 11192 6803 -12600 -6405 7182 -5779 -19162 -23388 -15649 16132 10587 -4693 -20217
15302 -20217 -44402 -52067 -31047 -26781 -19564 -4713 5363 16051 -1153 -18755 -14838 -23366 -23272
15289 -23272 -22314 -44311 -45785 -13757 -7907 -23730 -28158 -25383 9856 20022 11786 25148 34129
15276 34129 20167 15567 6578 14168 8620 -25681 -27264 -18734 -4688 4718 10460 -661 9451
15263 9451 25076 47964 51361 64455 54390 15073 -2310 21626 32917 33153 26757 32107 26189
15250 26189 20454 13339 18516 25139 25168 9699 -22988 -36857 -24451 -1910 7736 5501 13881 10457
15236 10457 -3098 -6031 16960 33545 45958 34 -5265 395 16678 -6737 -35931 -38432
$$ packed form
15329A9752K629q759p830P54J3814L674J624J2274o077o475j9782M942J0050k649
15315A7941o749m389j9403O195J3587j2961j3383m226P739L1781n545j5280j5524
15302b0217k4185p665K1020M266P217J4851J0076J0688j7204j7602L917q528R4
15289b3272R58k1997j474L2028N850j5823m428K775L5239J0166q236J3362Q981
15276C4129j3962m600q989P590n548l4301j583Q530J4046R406N742j1121J0112
15263I451J5625K2888L397J3094j0065l9317j7383K3936J1291K36o396N350n918
15250B6189n735p115N177O623K9j5469l2687j3869J2406K2541R646k235Q380l424
15236A0457j3555k933K2991J6585J2413m5924n299N660J6283k3415k9194k501
$$ plain form
15224 -38432 -14740 -19889 -42100 -34179 -15976 5796 6142 12712 25608 12428 -10923 14901 30666
15211 30666 18806 -1801 -7157 2093 4423 7800 25319 16515 -7093 -17321 -14082 6497 22581
15198 22581 14948 13318 4251 43128 78286 83288 66257 36738 17525 13064 -19337 -13404 19884
15185 19884 24978 31320 40734 17273 784 5963 14169 3982 19321 39176 35246 25431 13464
15172 13464 12762 2665 -20735 -39696 -35784 -18636 -9542 -18779 -22173 -30544 -46157 -30871 17546
15159 17546 36030 44582 37254 40030 15480 9468 12971 16014 17408 5569 26699 28520 11869
15146 11869 14111 19513 21104 -5079 -31649 -23487 -17202 -2467 -10823 -27122 -22907 -30367 -12201
15133 -12201 8880 -9947 -5706 5116 -17226 -18129 12713 30343 41951 22778 -19475 -18988 20312
$$ packed form
15224c8432K3692n149k2211P921J8203K1772L46O570J2896j3180k3351K5824J5765
15211C0666j1860k0607n356R250K330L377J7519q804k3608j0228L239K0579J6084
15198B2581p633j630r067L8877L5158N002j7031k9519j9213m461l2401N933L3288
15185A9884N094O342R414k3461j6489N179Q206j0187J5339J9855l930r815j1967
15172A3464p02j0097k3400j8961L912J7148R094r237l394q371j5613J5286M8417
15159A7546J8484Q552p328K776k4550o012L503L043J394j1839K1130J821j6651
15146A1869K242N402J591k6183k6570Q162O285J4735q356j6299M215p460J8166
15133a2201K1081j8827M241J0822k2342r03L0842J7630J1608j9173m2253M87L9300
$$ plain form
15120 20312 36886 12623 4543 18193 933 -23868 -785 7421 -3952 -11423 -20756 -10638
15108 -10638 15282 13521 12055 -11226 -25974 -19366 2432 35246 41837 38643 22006 15487 23477
15095 23477 39228 30099 13512 7074 -18184 -415 6482 14381 18482 24498 14950 7135 7511 25318
15081 25318 45384 28064 8033 3936 -6066 -12605 -31898 -26648 -25076 -24151 -15330 -17986 -40640
15068 -40640 -56108 -59018 -30260 -13860 -3079 -13434 -31649 -23086 4152 13336 25962 38518
15056 38518 -7963 -13874 4267 -1064 -11461 5833 18145 21548 11952 -2951 -5069 -4226 3231
15043 3231 5473 36633 39927 30361 30003 14411 -26354 -22807 413 14081 19793 17932 9304 814
15029 814 -2381 16081 18310 23531 22187 9845 -1622 -8128 -4033 -828 -36493 -22698 -664
$$ packed form
15120B0312J6574k4263q080J3650j7260k4801K3083Q206j1373p471r333J0118
15108a0638K5920j761j466k3281j4748O608K1798L2814O591l194j6637o519P990
15095B3477J5751r129j6587o438k5258J7769O897P899M101O016r548p815L76J7807
15081B5318K0066j7320k0031m097j0002o539j9293N250J572R25Q821k656k2654
15068d0640j5468k910K8758J6400J0781j0355j8215Q563K7238R184J2626J2556
15056C8518m6481n911J8141n331j0397J7294J2312L403r596j4903k118Q43P457
15043C231K242L1160L294r566l58j5592m0765L547K3220J3668N712j861q628q490
15029H14l195J8462K229N221j344j2342j1467o506M095L205l5665J3795K2034
$$ plain form
15016 -664 -4120 -14750 7150 9697 9891 936 4648 24070 27616 26876 35661 33791 35778 59861
15002 59861 59250 57846 38152 22681 8718 -10380 -23475 -16506 259 1659 10621 17502 13404
14989 13404 34191 17152 9421 568 -1685 -15773 -47129 -65970 -33612 7559 -10787 -27612
14977 -27612 -23986 -22348 -13020 -11118 8495 22173 7433 -11070 -13725 -13874 -21263 -3854 35995
14964 35995 60691 39001 6648 -2259 19910 41930 37419 37147 25257 -1660 2340 5425 2563
14951 2563 14229 236 -16525 -15259 -3355 8862 -7036 8963 11696 -22263 -57327 -56417 -42374
14938 -42374 -16767 3318 -24947 -46991 -7808 9323 25324 7360 6754 13378 34079 17060
14926 17060 -8228 -18595 -7275 1744 4442 23008 37337 50758 35566 19065 17671 37639
$$ packed form
15016f64l456j0630K1900K547J94q955L712J9422L546p40Q785j870J987K4083
15002E9861o11j404j9694j5471j3963j9098j3095O969J6765J400Q962O881m098
14989A3404K0787j7039p731q853k253j4088l1356j8841L2358M1171j8346j6825
14977b7612L626J638R328J902J9613J3678j4740j8503k655j49p389J7409L9849
14964C5995K4696k1690l2353q907K2169K2020m511k72j1890k6917M000L085k862
14951B563J1666j3993j6761J266J1904J2217j5898J5999K733l3959l5064R10J4043
14938d2374K5607K0085k8265k2044L9183J7131J6001j7964o06O624K0701j7019
14926A7060k5288j0367J1320R019K698J8566J4329J3421j5192j6501j394J9968
$$ plain form
14914 37639 59361 64304 33380 19837 14334 -3804 -14327 914 2556 14690 20223 19130 6696
14901 6696 -608 1542 714 -13925 -14435 6803 25780 38498 34675 33610 55956 53126 32812 29556
14887 29556 45076 55718 57139 38172 13632 2177 23383 43162 57390 54829 45506 41554
14875 41554 28544 18061 13359 25953 40479 34540 20635 -3455 -12215 -301 11960 13796
14863 13796 41397 29609 35897 39908 25140 1266 -14203 -12580 28509 43868 25532 31502
14851 31502 27802 46511 45880 19311 -1396 -13523 -11446 5706 18140 29220 38195 22958 -2177
14838 -2177 29263 63664 53619 33389 23837 10426 24603 18840 22720 14990 16779 15101 17851
14825 17851 -617 -152 -5747 3809 15252 13881 2947 13887 7600 -5177 18396 14060 13523
$$ packed form
14914C7639K1722M943l0924j3543n503j8138j0523J5241J642J2134N533j093j2434
14901F696p304K150q28j4639n10K1238J8977J2718l823j065K2346k830k0314l256
14887B9556J5520J0642J421j8967k4540j1455K1206J9779J4228k561r323l952
14875D1554j3010j0483m702J2594J4526n939j3905k4090q760J1914J2261J836
14863A3796K7601j1788O288M011j4768k3874j5469J623M1089J5359j8336N970
14851C1502l700J8709o31k6569k0707j2127K077J7152J2434J1080Q975j5237k5135
14838b177L1440L4401j0045k0230r552j3411J4177n763L880p730J789j678K750
14825A7851j8468M65n595R556J1443j371j0934J0940o287j2777K3573m336n37
$$ plain form
14812 13523 27798 21043 32646 39333 30061 22711 36128 59719 59554 61397 68410 49268 29913
14799 29913 27258 61028 89389 101383 88652 121609 130628 141562 147715 165926 227828 332160
14787 332160 520859 745696 1009745 1268556 1474665 1546983 1430698 1183369 890426 625768
14777 625768 412794 285826 221407 178620 134059 112970 124225 143430 136938 127113 111834
14766 111834 104459 107753 101378 89877 64407 33838 35530 61060 87222 92920 63512 52878
14754 52878 35616 -332 3531 38665 53386 45968 56118 55073 55691 52632 48999 39592 52174
14741 52174 54342 61576 73447 98829 99408 100528 96516 101508 110740 143971 172671 225074 284514
14728 284514 348192 472555 672012 941043 1213099 1473205 1687012 1788581 1747704 1556326
$$ packed form
14812A3523J4275o755J1603O687r272p350J3417K3591j65J843P013j9142j9355
14799B9913k655L3770K8361J1994j2731L2957R019J0934O153J8211O1902J04332
14787C32160J88699K24837K64049K58811K06109P2318j16285k47329k92943k64658
14777F25768k12974j26968o4419m2787m4561k1089J1255J9205o492r825j5279
14766A11834p375L294o375j1501k5470l0569J692K5530K6162N698k9408j0634
14754E2878j7262l5948L863L5134J4721p418J0150j045O18l059l633r407J2582
14741E2174K168P234J1871K5382N79J120m012M992R232L3231K8700N2403N9440
14728B84514O3678J24363J99457K69031K72056K60106K13807J01569m0877j91378
$$ plain form
14718 1556326 1275878 1016662 766457 542448 391177 296730 234935 180637 151221 156317
14708 156317 142502 118796 116450 132079 152303 138230 146095 128414 84409 53670 51511 55411
14696 55411 55211 45989 27144 44592 61992 61242 83133 86053 55084 35051 63457 70074 65434
14683 65434 67807 83583 82916 81421 84489 57626 37974 62189 71332 73226 72037 72101 85326 81747
14669 81747 90946 105270 130040 164201 192914 243348 252108 251876 254965 260803 284032 304141 376831
14656 376831 467657 613380 835378 1178363 1737867 2514878 3477582 4484793 5238164 5488675
14646 5488675 5132334 4292086 3236350 2264127 1527913 1055739 783334 596582 482160
14637 482160 405749 347803 310994 272280 277786 306920 286206 237549 209592 190602 151106 123053
$$ packed form
14718A556326k80448k59216k50205k24009j51271r4447o1795n4298k9416N096
14708A56317j3815k3706k346J5629K0224j4073P865j7681m4005l0739k159L900
14696E5411k00r222j8845J7448J7400p50K1891K920l0969k0033K8406O617m640
14683F5434K373J5776o67j495L068k6863j9652K4215R143J894j189O4J3225l579
14669H1747R199J4324K4770L4161K8713N0434Q760k32L089N838K3229K0109P2690
14656C76831R0826J45723K21998L42985N59504P77011R62704J007211P53371K50511
14646E488675l56341q40248j055736r72223p36214m72174k72405j86752j14422
14637D82160p6411n7946l6809l8714N506K9134k0714m8657k7957j8990l9496k8053
$$ plain form
14625 123053 91588 88329 100223 105327 75677 74159 75513 73633 48643 38855 40831 56728 67217
14612 67217 63384 46310 26458 52386 67638 51120 30626 23339 20687 24158 22855 6612 15684
14599 15684 21961 37012 34053 47447 48181 10662 -304 12838 30052 51038 65520 70949 73375
14586 73375 72093 59390 40933 18797 44372 57710 55433 63696 58960 77091 64603 41109
14574 41109 35211 26842 14447 -11823 1385 40003 46601 55498 69922 81591 83621 63988 54364
14561 54364 64846 48912 68677 93292 86570 61383 65425 70606 55772 55961 38991 5645 7534
14548 7534 36440 47562 51743 50474 64998 74183 74616 87944 112008 117704 143278 122488 106430
14535 106430 111110 125041 125516 135688 144518 143059 157192 153465 149487 163263 168825 168333 184122
$$ packed form
14625A23053l1465l259J1894N104k9650j518J354j880k4990r788J976J5897J0489
14612F7217l833j7074j9852K5928J5252j6518k0494p287k652L471j303j6243R072
14599A5684O277J5051k959J3394P34l7519j0966J3142J7214K0986J4482N429K426
14586G3375j282j2703j8457k2136K5575J3338k277Q263m736J8131j2488k3494
14574D1109n898q369j2395k6270J3208L8618O598Q897J4424J1669K030j9633r624
14561E4364J0482j5934J9765K4615o722k5187M042N181j4834J89j6970l3346J889
14548G534K8906J1122M181j269J4524R185M33J3328K4064N696K5574k0790j6058
14535A06430M680J3931M75J0172Q830j459J4133l727l978J3776N562m92J5789
$$ plain form
14522 184122 202586 202625 210997 203307 178050 148452 144447 153656 151474 130239 131444 96461 68118
14509 68118 57792 62384 41697 17369 43041 60150 64554 94528 96368 83442 69792 79269
14497 79269 82345 80056 91053 140346 153946 151663 125898 113501 121600 131700 132064 138464 153282
14484 153282 157239 178494 197617 254487 320192 360322 384994 385089 347358 294904 238431 195181
14472 195181 186424 183442 189390 168951 157286 169046 162525 155671 146999 114166 101520 124738 123234
14459 123234 107765 112130 93440 66841 81825 81288 71706 66815 77956 116653 115666 108804 111204
14446 111204 158747 165561 154940 165573 188424 201375 219370 227067 244864 240902 218090 233130
14434 233130 228951 239479 240040 231114 200283 191980 179442 156627 138818 128288 142126 158671
$$ packed form
14522A84122J8464L9Q372p690k5257k9598m005R209k182k1235J205l4983k8343
14509F8118j0326M592k0687k4328K5672J7109M404K9974J840j2926j3650R477
14497G9269L076k289J0997M9293J3600k283k5765j2397Q099J0100L64O400J4818
14484A53282L957K1255J9123N6870O5705M0130K4672R5l7731n2454n6473m3250
14472A95181q757k982N948k0439j1665J1760o521o854q672l2833j2646K3218j504
14459A23234j5469M365j8690k6599J4984n37r582m891J1141L8697r87o862K400
14446A11204M7543O814j0621J0633K2851J2951J7995P697J7797l962k2812J5040
14434B33130m179J0528N61q926l0831q303j2538k2815j7809j0530J3838J6545
$$ plain form
14422 158671 177354 202340 212047 224598 243706 264211 280385 274135 293346 320990 388880 444410
14410 444410 496469 560034 637120 654472 622248 542798 413697 262938 133182 54462 1755
14399 1755 -3660 12553 43135 103962 180667 213232 227638 227674 215082 213008 189993 163501 147595
14386 147595 125303 90455 79115 94817 103467 95145 118581 128648 126431 142417 141615 120032
14374 120032 102554 113680 143549 142571 135972 159625 174461 185965 177688 175390 213370 241001
14362 241001 251329 267003 271793 268094 268825 284537 297061 279408 265248 260196 293687 316647
14350 316647 301301 314814 338804 344147 323544 317367 331930 326727 313091 323838 348859 370771
14338 370771 380679 406888 442414 479358 517718 541552 571645 588297 606024 621854 650355 653991
$$ packed form
14422A58671J8683K4986R707J2551J9108K0505J6174o250J9211K7644O7890N5530
14410D44410N2059O3565P7086J7352l2224p9450j29101j50759j29756p8720n2707
14399A755n415J6213L0582O0827P6705L2565J4406L6j2592k074k3015k6492j5906
14386A47595k2292l4848j1340J5702Q650q322K3436J0067k217J5986q02k1583
14374A20032j7478J1126K9869r78o599K3653J4836J1504q277k298L7980K7631
14362B41001J0328J5674M790l699P31J5712J2524j7653j4160n052L3491K2960
14350C16647j5346J3513K3990N343k0603o177J4563n203j3636J0747K5021K1912
14338C70771R908K6209L5526L6944L8360K3834L0093J6652J7727J5830K8501L636
$$ plain form
14326 653991 637101 641392 646739 653551 683602 710197 718636 748543 787891 849522 913593 953908
14314 953908 1005303 1031631 1042215 1076229 1127783 1190185 1295841 1397764 1490279 1588020 1716561
14303 1716561 1845993 1977609 2128391 2293601 2507307 2760658 3095584 3525703 4106748
14294 4106748 4892455 5936639 7281793 8812037 10357589 11753548 12889759 13754434
14286 13754434 14612615 15862071 18049242 21913297 28473397 39137202 55910809 81577904
14278 81577904 119334101 170537517 229714071 285846883 327436803 343537792 330754475
14271 330754475 292888114 238297049 181023562 131105797 91801525 64532230 47483631
14264 47483631 36943927 30168235 25695988 22708278 20660804 19115262 17792347 16418226
$$ packed form
14326F53991j6890M291N347O812L0051K6595Q439K9907L9348O1631O4071M0315
14314I53908N1395K6328J0584L4014N1554O2402J05656J01923R2515R7741J28541
14303A716561J29432J31616J50782J65210K13706K53351L34926M30119N81045
14294D106748P85707J044184J345154J530244J545552J395959J136211Q64675
14286A3754434Q58181J249456K187171L864055O560100J0663805J6773607K5667095
14278H1577904L7756197N1203416N9176554N6132812M1589920J6100989j2783317
14271C30754475l7866361n4591065n7273487m9917765l9304272k7269295j7048599
14264D7483631j0539704o775692m472247k987710k047474j545542j322915j374121
$$ plain form
14256 16418226 14835678 13112667 11377289 9750413 8308216 7093232 6163943 5426844
14248 5426844 4863567 4397725 3986734 3655053 3332368 3075778 2821159 2628398 2459498
14239 2459498 2320228 2198547 2054462 1900887 1769986 1668294 1571248 1474434 1400668 1330879
14229 1330879 1268958 1269043 1293788 1366483 1443167 1505740 1550579 1596960 1577696 1496381 1379434 1218410
14217 1218410 1050725 898026 776501 678650 609195 576327 579298 554499 530254 537657 543520
14206 543520 544969 532617 523718 521006 488279 433626 413735 403393 402976 394142 385973 367733 348881
14193 348881 367719 389102 392950 380049 352996 332318 319120 300554 247100 209596 218892 243867
14181 243867 243167 207752 213938 218253 226342 211439 198842 209917 211907 205638 201388 172147 157988
$$ packed form
14256A6418226j582548j723011j735378j626876j442197j214984r29289p37099
14248E426844n63277m65842m10991l31681l22685k56590k54619j92761j68900
14239B459498j39270j21681j44085j53575j30901j01692r7046r6814p3766o9789
14229A330879o1921Q5K4745P2695P6684O2573M4839M6381j9264q1315j16947j61024
14217A218410j67685j52699j21525r7851o9455l2868K971k4799k4245P403N863
14206E43520J449j2352q899k712l2727n4653j9891j0342m17q834q169j8240j8852
14193C48881J8838K1383L848j2901k7053k0678j3198j8566n3454l7504R296K4975
14181B43867p00l5415O186M315Q089j4903j2597J1075J990o269m250k9241j4159
$$ plain form
14168 157988 169922 185015 219807 223033 189723 177092 184259 186312 223657 216098 174574 143459
14156 143459 138308 144529 149183 170270 211769 271206 336048 386046 457372 505003 503479 476817
14144 476817 421061 350036 276004 172296 71403 10907 -14382 -27721 -42637 -51565 -34682
14133 -34682 -29222 -6560 12469 8700 -790 -5518 2882 19851 30043 42542 49716 56094 38938
14120 38938 29909 12313 -27681 -23525 -12644 -29717 -31633 -21094 -8271 -2609 -27232 -47870
14108 -47870 -46127 -44099 -56818 -72038 -48749 -24131 -10977 5010 -253 -7428 12192 26964
14096 26964 19403 23730 34871 53994 70906 69179 33459 -5141 -16817 -9819 -3989 -17827 -31678
14083 -31678 -26323 -31769 -30746 -11353 4989 -12552 -29729 -23852 -12864 -4656 -31079 -13071 -5384
$$ packed form
14168A57988J1934J5093L4792L226l3310j2631P167K053L7345p559m1524l1115
14156A43459n151O221M654K1087M1499N9437O4842M9998P1326M7631j524k6662
14144D76817n5756p1025p4032j03708j00893o0496k5289j3339j4916q928J6883
14133c4682N460K2662J9029l769r490m728Q400J6969J0192J2499P174O378j7156
14120C8938r029j7596l9994M156J0881j7073j916J0539J2823N662k4623k0638
14108d7870J743K028j2719j5220K3289K4618J3154J5987n263p175J9620J4772
14096B6964p561M327J1141J9123J6912j727l5720l8600j1676O998N830j3838j3851
14083c1678N355n446J023J9393J6342j7541j7177N877J0988Q208k6423J8008P687
$$ plain form
14070 -5384 -7502 9577 24017 51698 48879 40855 39078 32394 18119 25912 17442 6777 13429
14057 13429 16799 35737 43112 68448 70363 54048 30001 18006 3710 17054 51652 55808
14045 55808 44984 52950 58327 57310 51743 50836 60998 44023 45744 49261 18803 18767 34960 34543
14031 34543 41323 66879 44184 47345 71770 78921 78207 88409 81772 62085 79757 95060 112014
14018 112014 113491 125582 110890 96114 79048 40710 29905 29889 -1551 -9838 2813 11111 9757
14005 9757 16989 17087 35059 30224 18908 2980 7558 18573 12039 4216 31860 22913 22849 31842
13991 31842 16025 -6236 -3797 -17114 -6917 10800 10189 25092 54845 38342 -6213 -5955 10493
13978 10493 26197 31739 38952 40902 30384 23965 20717 -687 -4085 10299 2433 5927 1666
$$ packed form
14070e384k118J7079J4440K7681k819q024j777o684j4275P793q470j0665O652
14057A3429L370J8938P375K5336J915j6315k4047j1995j4296J3344L4598M156
14045E5808j0824P966N377j017n567r07J0162j6975J721L517l0458l6J6193m17
14031C4543O780K5556k2695L161K4425P151p14J0202o637j9687J7672J5303J6954
14018A12014J477J2091j4692j4776j7066l8338j0805j6l1440q287J2651Q298j354
14005I757P232R8J7972m835j1316j5928M578J1015o534p823K7644q947o4Q993
13991C1842j5817k2261K439j3317J0197J7717o11J4903K9753j6503m4555K58J6448
13978A0493J5704N542P213J950j0518o419l248k1404l398J4384p866L494m261
$$ plain form
13965 1666 14603 7342 -10160 -8530 16270 27278 37008 48486 43591 31356 18329 46492 33362
13952 33362 5770 18850 19520 27941 57728 47517 14414 13117 40461 39793 18666 22774 32890
13939 32890 42926 38239 29739 6786 27127 58716 62243 67099 63549 79963 81834 89672 78206
13926 78206 89128 72050 22263 -11571 -21329 -20787 16184 28551 20377 4220 28635 42471
13914 42471 25694 18554 33202 30305 48235 29402 24949 30169 9491 -5002 -490 -32 -7714
13901 -7714 -15098 -20087 -22662 -26611 -6209 10949 22705 29788 15575 10535 14916 -15707 3582
13888 3582 18494 -4263 -15080 -708 -2048 5735 26518 25094 16150 6110 -205 12498 37186
13875 37186 45408 10126 -23033 -17662 -10478 16776 40907 52798 55473 34362 2940 3379 -4864
$$ packed form
13965A666J2937p261j7502J630K4800J1008R730J1478m895j2235j3027K8163j3130
13952C3362k7592J3080O70Q421K9787j0211l3103j297K7344o68k1127M108J0116
13939C2890J0036m687q500k2953K0341L1589L527M856l550J6414J871P838j1466
13926G8206J0922j7078m9787l3834r758N42L6971J2367q174j6157K4415J3836
13914D2471j6777p140J4648k897J7930j8833m453N220k0678j4493M512M58p682
13901g714p384m989k575l949K0402J7158J1756P083j4213n040M381l0623J9289
13888C582J4912k2757j0817J4372j340P783K0783j424q944j0040o315J2703K4688
13875C7186Q222l5282l3159N371P184K7254K4131J1891K675k1111l1422M39q243
$$ plain form
13862 -4864 -24487 -55687 -40539 -29841 -34864 -16731 -13600 -14133 -10332 -7882 -6889 -8081 3542 1065
13848 1065 -5030 -2983 5251 22929 38890 43828 31225 26909 28023 44745 63121 76728 63271
13835 63271 39671 41885 73624 91396 94278 94397 111837 132567 199145 318152 418035 599221
13823 599221 851093 1138787 1413816 1606482 1700820 1686002 1574645 1350157 1058252 772925
13813 772925 545510 396203 298395 243634 197005 164360 152404 125022 109542 107048 74126
13802 74126 67613 52180 37298 39589 29331 20567 2417 7366 -2794 -21358 -6797 16231
13790 16231 40495 45545 52859 32985 4887 10609 6938 32577 29851 24196 5303 -16342 -9416
13777 -9416 -13265 -25958 -26459 -10682 -28757 -31760 -8012 5945 17284 14189 3368 -15519 -3451
$$ packed form
13862d864j9623l1200J5148J0698n023J8133L131n33L801K450R93j192J1623k477
13848A065o095K047Q234J7678J5961M938j2603m316J114J6722J8376J3607j3457
13835F3271k3600K214L1739J7772K882J19J7440K0730O6578J19007R9883J81186
13823E99221K51872K87694K75029J92666R4338j4818j11357k24488k91905k85327
13813G72925k27415j49307r7808n4761m6629l2645j1956k7382j5480k494l2922
13802G4126o513j5433j4882K291j0258q764j8150M949j0160j8564J4561K3028
13790A6231K4264N050P314j9874k8098N722l671K5639k726n655j8893k1645O926
13777i416l849j2693n01J5777j8075l003K3748J3957J1339l095j0821j8887J2068
$$ plain form
13764 -3451 21706 48606 46400 16872 21555 9044 3519 12191 39534 39137 12636 -28031 -53238
13751 -53238 -52389 -25374 -21715 -17245 13230 44936 38809 21507 22641 24005 18478 1379 -9987
13738 -9987 -11657 7819 28815 21349 5593 -9447 -7817 -1481 16908 27079 32587 36431 16940
13725 16940 -9613 5960 27449 35905 40777 40233 36216 36957 18779 -23024 -26220 -18150 -13769 -1243
13711 -1243 23415 29816 22760 28985 24253 4206 -1132 -9780 -24348 -20052 -17476 9998 30619
13698 30619 37931 31560 29347 13424 10543 26182 24536 26726 -3437 -33773 -50623 -41000 -40570
13685 -40570 -22114 -4644 -2140 25364 22745 23062 42277 41580 26855 19522 32147 34122 21729
13672 21729 6145 2719 18739 22795 13498 13165 15574 5186 -3710 22763 29231 -6312 -10249
$$ packed form
13764c451K5157K6900k206k9528M683j2511n525Q672K7343l97k6501m0667k5207
13751e3238Q49K7015L659M470L0475L1706o127j7302J134J364n527j7099j1366
13738i987j670J9476K0996p466j5756j5040J630O336J8389J0171N508L844j9491
13725A6940k6553J5573K1489Q456M872n44m017P41j8178m1803l196Q070M381J2526
13711a243K4658O401p056O225m732k0047n338q648j4568M296K576K7474K0621
13698C0619P312o371k213j5923k881J5639j646K190l0163l0336j6850R623M30
13685d0570J8456J7470K504K7504k619L17J9215o97j4725p333J2625J975j2393
13672B1729j5584l426J6020M056r297l33K409j0388q896K6473O468l5543l937
$$ plain form
13659 -10249 -17016 -9409 -13823 4955 -8789 -294 17793 -16176 -942 20102 24797 26804 36941
13646 36941 29028 14970 -6303 -13626 4028 -1917 -8484 -6459 -11822 1300 42638 26154 25259
13633 25259 20166 6394 12783 1748 -4786 -9209 -8857 -9754 -13955 -9068 4118 23002 41179 41245
13619 41245 23506 9790 25545 45819 31810 -9205 -16150 -28502 -44853 -50615 -57997 -59432
13607 -59432 -47541 -31308 -28816 -34177 -22987 -9314 10160 10444 8289 8073 -11668 -11038 4112
13594 4112 15152 17481 3878 16013 21638 5185 5021 26863 11731 -18756 -22578 -14328 -6866
13581 -6866 -5476 -5564 -4010 512 -11237 -29432 -15952 -3461 14993 238 6478 3166 -1720 -384
13567 -384 -3908 -10338 -1937 1051 -6141 -26630 -19122 4691 -6170 1524 -8265 -5184 -12796 -16364
$$ packed form
13659a0249o767P607m414J8778j3744Q495J8087l3969J5234K1044M695K007J0137
13646C6941p913j4058k1273p323J7654n945o567K025n363J3122M1338j6484q95
13633B5259n093j3772O389j1035o534m423L52q97m201M887J3186J8884J8177O6
13619D1245j7739j3716J5755K0274j4009m1015o945j2352j6351n762p382j435
13607e9432J1891J6233K492n361J1190J3673J9474K84k155k16j9741O30J5150
13594D112J1040K329j3603J2135N625j6453j64K1842j5132l0487l822Q250P462
13581f866J390q8J554M522j1749j8195J3480J2491J8454j4755O240l312m886J336
13567c84l524o430Q401K988p192k0489P508K3813j0861P694r789L081p612l568
$$ plain form
13553 -16364 -25170 -16388 -15294 -23209 -5080 -5402 15455 6885 7811 7160 441 -27484 -12690 20846
13539 20846 10516 -4418 -6062 -166 1348 4475 1638 -22973 -18422 -10534 -4754 -856 5939 -3614
13525 -3614 1015 16507 17644 20636 45338 28556 30180 34295 6518 -587 7975 17485 -9960
13512 -9960 -3265 15656 16344 -8363 -26374 1706 9873 13153 19308 31034 43344 30516 13809
13499 13809 12192 11318 11623 3235 -7305 -3419 7307 13873 32419 68680 76683 71939 51355 34623
13485 34623 35159 19022 667 9059 22093 26896 19773 18530 19496 19978 23051 23867 14602 -9369
13471 -9369 -25527 -13527 9431 17680 33085 22356 -17007 -9733 5398 34349 36184 37384 25553
13458 25553 19681 31381 26830 33240 27118 25575 30945 12859 2274 -7599 -5212 -10336 -19311 -18846
$$ packed form
13553a6364q806Q782J094p915J8129l22K0857q570R26o51o719k7925J4794L3536
13539B0846j0330j4934j644N896J514L127k837k4611M551P888N780L898O795r553
13525c614M629J5492J137K992K4702j6782J624M115k7777p105Q562R510k7445
13512i960O695J8921O88k4707j8011K8080Q167L280O155J1726J2310j2828j6707
13499A3809j617q74L05q388j0540L886J0726O566J8546L6261Q003m744k0584j6732
13485C4623N36j6137j8355Q392J3034M803p123j243R66M82L073Q16r265k3971
13471i369j6158J2000K2958Q249J5405j0729l9363P274J5131K8951J835J200j1831
13458B5553n872J1700m551O410o122j543N370j8086j0585r873K387n124q975M65
$$ plain form
13444 -18846 -9954 31842 22190 1431 4225 11690 -2849 9443 11107 -4699 -35941 -17443 -5418
13431 -5418 -15560 -19313 -13066 -2364 -346 9476 21281 1411 2152 -174 -16661 -35147 -41431
13418 -41431 -32800 -24564 -30963 -19458 35458 49056 54023 42477 15537 30295 17835 7062
13406 7062 3186 26169 43854 22110 14924 18805 6585 -7596 2203 1186 -9198 -20920 -22358
13393 -22358 -24910 -23986 -15224 -14050 4596 -2385 3505 15222 22372 27809 24713 40220 26373 30655
13379 30655 13792 3473 -5847 -3513 -5205 6096 18115 40664 45674 30794 11856 19273 11389
13366 11389 30935 38185 46847 13832 2303 -10131 17902 37554 28229 19683 4440 1343 -16007
13353 -16007 -20359 -15108 -25215 -5349 -6797 -3587 -19405 -19217 -5275 -1397 10181 1395 -723
$$ packed form
13444a8846Q892M1796r652k0759K794P465j4539J2292J664j5806l1242J8498J2025
13431e418j0142l753O247J0702K018R822J1805j9870P41k326j6487j8486o284
13418d1431Q631Q236o399J1505N4916J3598M967j1546k6940J4758j2460j0773
13406G062l876K2983J7685k1744p186L881j2220j4181R799j017j0384j1722j438
13393b2358k552R24Q762J174J8646o981N890J1717P150N437l096J5507j3847M282
13379C0655j6863j0319r320K334j692J1301J2019K2549N010j4880j8938P417p884
13366A1389J9546P250Q662l3015j1529j2434K8033J9652r325q546j5243l097j7350
13353a6007m352N251j0107J9866j448L210j5818J88J3942L878J1578q786k118
$$ plain form
13340 -723 -20668 -38299 -34405 -22371 -34053 -25840 -20709 -21187 4801 4010 1761 11417 5892 1162
13326 1162 -21409 -31022 -24710 -33196 -13512 -2323 -6092 2198 13243 13504 5169 -8044 -12030 -20623
13312 -20623 -18718 -7881 11836 -2113 -99 -3219 -21759 1893 32672 42181 19428 9002
13300 9002 18606 21437 18281 20666 33684 42300 48162 37028 16808 -10173 -21854 9885 31618
13287 31618 21277 29505 40656 23712 12399 26042 33560 16699 18087 5132 -17561 -10823
13275 -10823 1025 1271 -8824 -1577 -2933 -10697 -19622 -11586 4770 -6084 -21210 -24306 -17907
13262 -17907 -20626 -23582 -25132 -13331 -19358 -25640 -32289 -31832 -24809 -36803 -24551 7853 12299 9044
13248 9044 3831 680 19646 2137 333 4294 -4619 -14849 -11463 10082 -2938 -13049 -11453
$$ packed form
13340g23j9945j7631L894J2034j1682Q213N131m78K5988p91k249R656n525m730
13326A162k2571r613O312q486J9684J1189l769Q290J1045K61q335j3213l986q593
13312b0623J905J0837J9717j3949K014l120j8540K3652L0779R509k2753j0426
13300I002R604K831l156K385J3018Q616N862j1134k0220k6981j1681L1739K1733
13287C1618j0341Q228J1151j6944j1313J3643P518j6861J388j2955k2693O738
13275a0823J1848K46j0095P247j356p764q925Q036J6356j0854j5126l096O399
13262a7907k719k956j550J1801o027o282o649M57P023j1994J2252L2404M446l255
13248I044n213l151J8966j7509j804L961q913j0230L386K1545j3020j0111J596
$$ plain form
13235 -11453 7797 7093 -26730 -45455 -35958 -39054 -14530 -17475 -14212 -30826 -44507 -29954 -18425
13222 -18425 -15315 -17700 -4314 -15316 1149 6571 -11100 -15448 -7285 1147 1215 -16432 -29446
13209 -29446 -18548 7933 8738 -18573 -11193 17797 26789 33798 31750 29900 31052 19339 -6429
13196 -6429 -18869 -31047 -35903 -25541 -19810 -8797 -11873 -12327 1408 -3646 -14748 -13687 -8958
13183 -8958 -15904 -26257 -22908 -4795 13394 30592 4879 -31150 -42972 -28615 -9517 2256
13171 2256 795 -7270 -13109 -10186 -25209 -34076 -39438 -32905 -22986 -1589 12981 24932 18228 -9689
13157 -9689 -25750 23 27942 53056 49357 16155 459 8611 4211 -15027 -20756 265 -3924
13144 -3924 -8406 -5354 16738 21719 31762 19397 848 -8432 -7085 -1281 -28868 -27635 -5668
$$ packed form
13235a1453J9250p04l3823j8725R497l096K4524k945L263j6614j3681J4553J1529
13222a8425L110k385J3386j1002J6465N422j7671m348Q163Q432O8j7647j3014
13209b9446J0898K6481Q05k7311P380K8990Q992P009k048j850J152j1713k5768
13196f429j2440j2178m856J0362N731J1013l076m54J3735n054j1102J061M729
13183h958o946j0353L349J8113J8189J7198k5713l6029j1822J4357J9098J1773
13171B256j461q065n839K923j5023q867n362O533R919K1397J4570J1951o704k7917
13157i689j6061K5773K7919K5114l699l3202j5696Q152m400j9238n729K1021m189
13144c924m482L052K2092M981J0043j2365j8549r280J347N804k7587J233K1967
$$ plain form
13131 -5668 -3516 2395 -13665 -28011 -12852 2453 -18863 -14450 5563 19816 29646 27937 35094
13118 35094 29056 -1659 -19251 -23800 -20579 -20392 -16074 -19851 -15340 -11542 -27838 -15364 -16998 -24924
13104 -24924 -7177 -1370 -3848 -20849 -31897 -44642 -37847 -11769 -4690 2642 15359 -9501 -21993
13091 -21993 -24504 -24749 -27470 -35532 -29650 -17774 -17856 -3684 18286 32734 47165 47058 45267 44385
13077 44385 36085 16775 -1099 -6728 -8930 -17887 -15698 -15246 -17893 -17217 -11777 -4645 24489 20154
13063 20154 4630 6273 4258 10620 13830 492 -9051 -25084 -26883 -8056 15330 13688 -4837
13050 -4837 -11615 -13858 -24609 -27488 -5880 -15408 -25203 -23245 -7997 -11285 -23146 -17548 3707
13037 3707 -1070 -22446 -29454 -7149 16827 6143 6926 -17265 -24340 -14825 -8505 -7105 -10762 -11442
$$ packed form
13131e668K152N911j6060j4346J5159J5305k1316M413K0013J4253R830j709P157
13118C5094o038l0715j7592m549L221J87M318l777M511L798j6296J2474j634p926
13104b4924J7747N807k478j7001j1048j2745O795K6078P079P332J2717k4860j2492
13091b1993k511k45k721q062N882J1876q2J4172K1970J4448J4431j07j791q82
13077D4385q300j9310j7874n629k202q957K189M52k647O76N440P132K9134m335
13063B0154j5524J643k015O362L210j3338r543j6033j799J8827K3386j642j8525
13050d837o778k243j0751k879K1608r528r795J958J5248l288j1861N598K1255
13037C707m777k1376p008K2305K3976j0684P83k4191p075R515O320J400l657o80
$$ plain form
13023 -11442 20304 9102 -7792 -12683 -9262 12781 5944 -25203 -14178 16155 21357 -1823
13011 -1823 1328 11063 24120 30052 20413 28344 42089 61323 56319 28621 29841 21381 33254
12998 33254 11521 -19095 -14751 10962 -10602 -16629 -1285 11312 28681 18565 -2725 -13162
12986 -13162 48 6976 15426 40401 45085 22264 -15881 -27505 -1300 -1271 13315 -727 -16754
12973 -16754 -5607 -16504 -34677 -59020 -56661 -50146 -41907 6249 34345 28631 18637 11171 -7183
12960 -7183 -15702 -13829 -27132 -21099 -12169 -7501 16078 15529 -9091 -17130 -16591 11187 17794 11756
12946 11756 3022 -7109 -2257 5216 18686 26401 26039 27321 24186 25297 27299 22788 -32334 -41235
12932 -41235 -10466 12334 24666 10987 -11602 -22178 -20518 -29661 -19534 -21889 -28033 -11603
$$ packed form
13023a1442L1746j1202j6894m891L421K2043o837l1147J1025L0333N202k3180
13011a823L151R735J3057N932r639P931J3745J9234n004k7698J220q460J1873
12998C3254k1733l0616M344K5713k1564o027J5344J2597J7369j0116k1290j0437
12986a3162J3210O928Q450K4975M684k2821l8145j1624K6205K9J4586j4042j6027
12973a6754J1147j0897j8173k4343K359O515Q239M8156K8096n714r994p466j8354
12960g183q519J873j3303O033Q930M668K3579n49k4620q039N39K7778O607o038
12946A1756q734j0131M852P473J3470P715l62J282l135J111K002m511n5122q901
12932d1235L0769K2800J2332j3679k2589j0576J660r143J0127k355o144J6430
$$ plain form
12920 -11603 17862 18924 -1340 6286 9309 765 -16138 -19022 -15021 -4826 -9552 -3822 8456
12907 8456 5618 9394 -5801 -23033 -20185 -9308 7126 4916 -2871 -2362 -12697 8304 16746
12894 16746 -9189 -15373 -22244 -26402 -19961 -37911 -48140 -48146 -64622 -74208 -36239 -33182 -29480 10264
12880 10264 26283 17718 13873 8544 -7774 -10556 -1439 16316 31907 60725 43233 19215 25756
12867 25756 7148 -5955 10111 5477 -13012 -16744 -20825 -13601 -30325 -62743 -58005 -56291 -56532
12854 -56532 -37956 -27617 -50129 -52262 -40789 -13365 -7092 12661 29350 26047 11636 13089
12842 13089 4233 4304 15734 4992 -22294 -16280 -3031 -18382 -29195 -18503 -10169 -8058 -10470
12829 -10470 -34644 -11287 12853 -2811 -21342 -28661 -13810 -10135 -45030 -56934 -32217 -12043
$$ packed form
12920a1603K9465J062k0264P626L023q544j6903k884M001J0195m726N730J2278
12907H456k838L776j5195j7232K848J0877J6434k210p787N09j0335K1001Q442
12894A6746k5935o184o871m158O441j7950j0229oj6476r586L7969L057L702L9744
12880A0264J6019q565l845n329j6318k782R117J7755J5591K8818j7492k4018O541
12867B5756j8608j3103J6066m634j8489l732m081P224j6724l2418M738J714k41
12854e6532J8576J0339k2512k133J1473K7424O273J9753J6689l303j4411J453
12842A3089q856P1J1430j0742k7286O014J3249j5351j0813J0692Q334K111k412
12829a0470k4174K3357K4140j5664j8531p319J4851L675l4895j1904K4717K0174
$$ plain form
12817 -12043 -5659 6791 -7368 -26987 -24364 -26203 -35602 -29762 -29551 -18863 -5822 -6066 6839
12804 6839 15117 1134 1388 -763 -23902 -19318 -7382 -14929 -2366 -4106 -7980 -2334 12881 -1692
12790 -1692 -8388 9950 3199 -13607 -4617 27207 36741 43246 34597 24666 9523 -13757 -20900
12777 -20900 -24110 -32495 -16279 -14505 -6808 5093 12120 -7363 -24860 -26744 -16498 -6142 -45611
12764 -45611 -74680 -63164 -42697 -35199 -13690 3156 -9944 -4218 -11455 -10932 -5024 12631 -2767
12751 -2767 -17806 -3942 8198 -7898 -21967 -19244 -12903 -6266 12831 15422 19859 12130 -4624
12738 -4624 -14907 1165 918 19206 41953 51218 37361 34008 25177 -1894 -6513 -15734 -7636
12725 -7636 -6065 -13418 -522 8947 6449 -2564 -8625 -10716 -40521 -44990 -8642 32014 52110
$$ packed form
12817a2043O384J2450j4159j9619K623j839r399N840K11J0688J3041k44J2905
12804F839Q278j3983K54k151k3139M584J1936p547J2563j740l874N646J5215j4573
12790a692o696J8338o751j6806Q990L1824R534O505q649r931j5143k3280p143
12777b0900l210q385J6216J774P697J1901P027j9483j7497j884J0246J0356l9469
12764d5611k9069J1516K0467P498K1509J6846j3100N726p237N23N908J7655j5398
12751b767j5039J3864J2140j6096j4069K723O341O637J9097K591M437p729j6754
12738d624j0283J6072k47J8288K2747R265j3857l353q831k7071m619r221Q098
12725g636J571p353J2896R469k498r013o061k091k9805m469L6348M0656K0096
$$ plain form
12712 52110 23433 13571 17137 16126 -1189 -13523 -436 36949 46754 46005 36763 8600 -11536
12699 -11536 -14826 -13928 -37295 -26495 -22256 -28909 -42816 -35541 -27130 -30975 -20126 1327 16617
12686 16617 33996 31034 22644 15576 -3203 -16169 2594 14350 13503 9663 -7841 -9156 9442
12673 9442 -14078 -11079 -9358 -6285 -12158 14994 10886 -37500 -44566 -45699 -44646 -44741 -31573 15378
12659 15378 21277 -1052 -6781 -12811 -16041 -36600 -33483 -20437 -3449 -11717 -23863 -19681 -6179
12646 -6179 -483 -1406 -1713 22659 38026 23179 10704 22780 16234 6231 19657 42471 47940
12633 47940 9902 -22992 -30228 -25448 -21745 -24028 -5518 -1221 5341 13277 22929 17150 -14916
12620 -14916 -26536 -8533 17928 28593 43725 19612 8339 -13342 -30117 -1692 -4919 -15916
$$ packed form
12712E2110k8677r862L566j011j7315j2334J3087L7385R805p49r242k8163k0136
12699a1536l290Q98k3367J0800M239o653j3907P275Q411l845J0849K1453J5290
12686A6617J7379k962q390p068j8779j2966J8763J1756q47l840j7504j315J8598
12673I442k3520K999J721L073n873K7152m108m8386p066j133J053r5J3168M6951
12659A5378N899k2329n729o030l230k0559L117J3046J6988q268j2146M182J3502
12646f179N696r23l07K4372J5367j4847j2475J2076o546j0003J3426K2814N469
12633D7940l8038l2894p236M780L703k283J8510M297O562P936R652n779l2066
12620a4916j1620J8003K6461J0665J5132k4113j1273k1681j6775K8425l227j0997
$$ plain form
12608 -15916 -16386 -21200 -20245 -17215 -6800 -5612 -4023 23731 39854 40615 16824 11060 19415 -2561
12594 -2561 -10188 14 3151 35670 52511 40270 19372 3671 3034 21991 38354 59218 64862
12581 64862 52673 75105 122959 144711 101608 78700 54790 31520 46359 41258 21086 19820
12569 19820 11829 26064 28518 6441 15542 33156 14771 13236 10789 -5909 -17657 -45959 -49816
12556 -49816 -42999 -15762 6185 3886 -5699 3226 9621 4700 -7189 -1006 4615 -14887 -22384
12543 -22384 -13211 -38867 -41121 -47731 -36996 -51694 -19968 -24128 -29137 -5647 5992 -1861 -20675
12530 -20675 -33982 -16601 -99 -211 -11456 -16207 -13922 -34316 -36114 -22776 -37215 -34869 -42799
12517 -42799 -27800 -31147 -37399 -43550 -35118 -10722 17611 24281 -2065 -13370 -14540 -19275 -40004
$$ packed form
12608a5916m70m814R55L030J0415J188J589K7754J6123P61k3791n764Q355k1976
12594b561p627J0202L137L2519J6841j2241k0898j5701o37J8957J6363K0864N644
12581F4862j2189K2432M7854K1752m3103k2908k3910k3270J4839n101k0172j266
12569A9820p991J4235K454k2077R101J7614j8385j535k447j6698j1748k8302l857
12556d9816O817K7237K1947k299r585Q925O395m921j1889O183N621j9502p497
12543b2384R173k5656k254o610J0735j4698L1726m160n009K3490J1639p853j8814
12530b0675j3307J7381J6502j12j1245m751K285k0394j798J3338j4439K346p930
12517d2799J4999l347o252o151Q432K4396K8333O670k6346j1305j170m735k0729
$$ plain form
12504 -40004 -36443 -14817 -10552 -19787 -28272 -9437 -24199 -37549 -26856 -1286 8754 3628 7021
12491 7021 -6485 -14640 -3743 -14907 -20443 -6604 25852 27812 -1169 -24962 -27102 -30996 -28266
12478 -28266 -8478 -14896 -4437 -18421 -24310 -20572 630 -3540 -9251 6783 836 11623 9975
12465 9975 5879 36871 52429 36762 31997 -5032 -31545 -29318 -5920 13799 3296 -8314
12453 -8314 -33436 -20954 -22357 -24919 -5418 -10204 12191 16938 19847 -7933 -15826 -19678 -27855
12440 -27855 -47341 -61985 -54898 -30304 -17790 8910 -162 -3189 31880 33173 1349 -13755
12428 -13755 1958 39866 34098 15827 -12458 -11943 -16695 -25745 -22723 -30380 -21152 -11325 -14169 -18670
12414 -18670 -15275 -17920 -41106 -30225 -16885 -23867 -22204 -12155 -2005 -9852 -12672 -19794 -13332
$$ packed form
12504d0004L561K1626M265r235q485J8835j4762j3350J0693K5570J0040n126L393
12491G021j3506q155J0897j1164n536J3839L2456J960k8981k3793k140l894K730
12478b8266J9788o418J0459j3984n889L738K1202m170n711J6034n947J0787j648
12465I975m096L0992J5558j5667m765l7029k6513K227K3398J9719j0503j1610
12453h314k5122J2482j403k562J9501m786K2395M747K909k7780p893l852q177
12440b7855j9486j4644P087K4594J2514K6700r072l027L5069J293l1824j5104
12428a3755J5713L7908n768j8271k8285N15m752r050L022p657R228R827k844m501
12414a8670L395k645k3186J0881J3340o982J663J0049J0150p847k820p122O462
$$ plain form
12401 -13332 -5473 26663 22873 9658 17416 16475 5996 7367 942 -12637 -27159 -11327 4878
12388 4878 -6803 -14679 -32681 -8754 -27697 -42378 -38939 -18847 -3788 -10771 -1039 8189 -9807
12375 -9807 -17696 -2130 6907 24496 24867 11956 -16471 -25041 -15083 -4051 -17435 -11656 -9543
12362 -9543 2925 10230 16624 6723 -3549 -20760 -17363 -19318 -5262 9897 30710 48428 31691
12349 31691 13476 -8463 -11740 -7182 -17709 -22402 -18458 -11944 -16207 2097 19952 7143 155
12336 155 14074 34247 40137 25762 27916 22208 4762 -9736 -19848 -19669 -7913 20851 43290
12323 43290 42731 27260 3132 -4677 7325 19086 33573 45529 40376 19944 19206 7138 3356
12310 3356 -5427 -2221 -5810 -1718 -9361 -40549 -20584 12000 -12210 -10595 -8111 6061 12737
$$ packed form
12401a3332P859L2136l790j3215P758r41j0479J371o425j3579j4522J5832J6205
12388D878j1681p876j8002K3927j8943j4681L439K0092J5059o983R732R228j7996
12375i807p889J5566R037J7589L71j2911k8427q570R958J1032j3384N779K113
12362i543J2468P305O394r901j0272j7211L397j955J4056J5159K0813J7718j6737
12349C1691j8215k1939l277M558j0527m693L944O514m263J8304J7855j2809o988
12336A55J3919K0173N890j4375K154n708j7446j4498j0112J79J1756K8764K2439
12323D3290n59j5471k4128p809J2002J1761J4487J1956n153k0432p38j2068l782
12310C356q783L206l589M092p643l1188J9965L2584k4210J615K484J4172O676
$$ plain form
12297 12737 -12368 -41209 -19929 -7758 -29339 -47647 -34885 -24074 -16521 -2958 1727 -16253
12285 -16253 -7769 3854 -11460 -14227 8850 -9892 -14574 3140 7035 -6441 -40407 -62296
12273 -62296 -33208 -29046 -39121 -26134 -15518 12858 23977 24782 23429 944 -13028 2162
12261 2162 12814 1855 22161 39638 50875 36827 34300 23134 26721 15716 18206 31341
12249 31341 47413 46518 35565 22617 38888 12906 1355 13498 8371 -4797 9410 24576
12237 24576 30454 24024 15815 -647 6896 16969 8860 -13387 -25147 -19131 -8991 -13079 -20622
12224 -20622 -10688 -13859 2916 14809 -7345 9910 -4890 -10960 7573 526 -4819 -11695 -3073
12211 -3073 -3077 18224 15938 14513 11834 12126 11173 6470 6806 23502 -344 -31228 -63558 -54428 -18184
$$ packed form
12297A2737k5105k8841K1280J2171k1581j8308J2762J0811P553J3563M685j7980
12285a6253Q484J1623j5314k767K3077j8742m682J7714L895j3476l3966k1889
12273f2296K9088M162j0075J2987J0616K8376J1119Q05j353k2485j3972J5190
12261B162J0652j0959K0306J7477J1237j4048k527j1166L587j1005K490J3135
12249C1341J6072q95j0953j2948J6271k5982j1551J2143n127j3168J4207J5166
12237B4576N878o430q209j6462P543J0073q109k2247j1760O016J0140m088p543
12224b0622R934l171J6775J1893k2154J7255j4800o070J8533p047n345o876Q622
12211c073mK1301k286j425k679K92r53m703L36J6696k3846l0884l2330R130L6244
$$ plain form
12196 -18184 -4353 972 -2958 -15008 -36132 -19187 23319 30082 9660 -13369 -13372 -17910 -21507
12183 -21507 -14279 -24588 -7784 -7545 -2001 -26647 -46939 -31198 -17420 -20105 -35147 -8631 -573
12170 -573 8047 84 60 -16264 -28420 -31897 -16852 -10632 6774 18897 -2010 -10049 -31004 -45916
12156 -45916 -34269 -29396 -15022 -20565 -23055 -28922 -35711 -35335 -39685 -58761 -44658 -24843 -17215
12143 -17215 -8560 -2717 19384 29124 28614 17905 -3339 -5439 -14468 -11936 -10478 -47786 -36385
12130 -36385 -45967 -46065 -41771 -3426 22457 2045 -15560 -19449 4092 17659 18197 46142 52154
12117 52154 55941 51707 24730 -7043 3799 9658 -20902 -5722 15129 25654 30163 23041 22402
12104 22402 -564 -39305 -53288 -54557 -49529 -42566 -27414 -8749 5261 2138 -18215 -34564
$$ packed form
12196a8184J3831N325l930j2050k1124J6945M2506O763k0422k3029lm538l597
12183b1507P228j0309J6804K39N544k4646k0292J5741J3778k685j5042K6516Q058
12170e73Q620p963k4j6324j2156l477J5045O220J7406J2123k0907q039k0955j4912
12156d5916J1647M873J4374n543k490n867o789L76m350j9076J4103J9815P628
12143a7215Q655N843K2101R740n10j0709k1244k100r029K532J458l7308J1401
12130c6385r582r8M294L8345K5883k0412j7605l889K3541J3567N38K7945O012
12117E2154L787m234k6977l1773J0842N859l0560J5180K0851J0525M509p122o39
12104B2402k2966l8741j3983j269N028O963J5152J8665J4010l123k0353j6349
$$ plain form
12092 -34564 -23858 -3378 9408 4444 -8033 1963 -13994 -34061 -41356 -43298 -27221 -11459
12080 -11459 14943 14337 -12051 -24103 -11323 -2817 -7686 -16728 -16777 17625 49763 32481 16088
12067 16088 -6327 -6802 -441 -9123 5766 -4793 -29117 -20631 -10809 -2890 -22184 -30433 -13446
12054 -13446 4233 5186 -2603 -16666 -35079 -29172 -33732 -33285 -14957 6353 3943 -1294 10213
12041 10213 27429 -84 -20166 -5777 -3896 -10815 16571 25705 3490 -430 -5548 28795 35912
12028 35912 12110 -5262 17456 25022 24753 7625 -10014 -31860 -14482 -3808 -13992 -5602
12016 -5602 3449 10493 19983 2778 -34366 -25031 -11797 -20166 -6853 15360 28177 38247 12956
12003 12956 1403 -16538 -26253 -9925 8519 5957 -1466 -13520 -10468 834 -1216 -2323 -20097
$$ packed form
12092c4564J0706K0480J2786m964j2477R996j5957k0067p295j942J6077J5762
12080a1459K6402o06k6388j2052J2780Q506m869r042m9L4402L2138j7282j6393
12067A6088k2415m75O361q682J4889j0559k4324Q486R822P919j9294q249J6987
12054a3446J7679R53p789j4063j8413N907m560M47J8328K1310k410n237J1507
12041A0213J7216k7513k0082J4389J881o919K7386R134k2215l920n118L4343P117
12028C5912k3802j7372K2718P566k69j7128j7639k1846J7378J0674j0184Q390
12016e602R051P044R490j7205l7144R335J3234q369J3313K2213J2817J0070k5291
12003A2956j1553j7941r715J6328J8444k562p423j2054L052J1302k050j107j7774
$$ plain form
11990 -20097 -20996 -29532 -22833 -9847 -32907 -18535 4483 -1767 -25459 -36407 -23944 -40398 -58676
11977 -58676 -29857 -13100 -19724 2311 21179 9531 -2957 2472 -258 -15884 -13182 -30880
11965 -30880 -8097 23952 29288 12602 -3578 3635 1892 5106 8197 19720 6711 2146 -7145
11952 -7145 -26881 -32388 -15862 -21875 184 24848 15494 -9962 -21263 -14843 1788 -10345 -34481
11939 -34481 -50656 -32266 -16335 -13299 2667 32905 26049 10043 20449 17038 22728 8872
11927 8872 1778 -2084 1924 -3695 7586 -1147 -28287 -47209 -41123 -15113 -5260 -8938 -10068 3028
11913 3028 23621 30115 28105 25876 21660 41847 44687 12501 11021 3612 -7128 -23007 -37450
11900 -37450 -44099 -3823 15895 -4755 -19646 -11391 -25971 -20569 2735 -279 -12591 -25117
$$ packed form
11990b0097q99q536O699J2986k3060J4372K3018o250k3692j0948J2463j6454j8278
11977e8676K8819J6757o624K2035J8868j1648j2488N429k730j5626K702j7698
11965c0880K2783L2049N336j6686j6180P213j743L214L091J1523j3009m565r291
11952g145j9736n507J6526o013K2059K4664r354k5456j1301O420J6631j2133k4136
11939c4481j6175J8390J5931L036J5966L0238o856j6006J0406l411N690j3856
11927H872p094l862M008n619J1281q733k7140j8922O086K6010R853l678j130J3096
11913C028K0593O494k010k229m216K0187K840l2186j480p409j0740j5879j4443
11900c7450o649M0276J9718k0650j4891Q255j4580N402K3304l014j2312j2526
$$ plain form
11888 -25117 -23814 2485 18264 25236 46129 30017 4715 5592 15054 10532 -9147 11448 13248
11875 13248 1656 -1571 -1433 -11631 -10248 -16479 -17780 -11023 4047 7147 11334 -11498 -27067
11862 -27067 -18984 -11023 -15108 -46005 -25166 9325 30494 29600 38497 16816 6575 33421 45658
11849 45658 37048 13942 2017 13441 33439 18517 -2600 -10329 -24620 -27442 3845 -62
11837 -62 -12171 -21611 -4048 -3070 -7617 -22047 -33092 -4790 -5418 9220 12485 1724 -10923 -13529
11823 -13529 -7504 2544 -3639 -2218 -11668 -17168 -29652 -23815 -35093 -40899 -27119 -23127 -19804
11810 -19804 -32685 -60812 -47544 -32918 -29277 -20080 -30525 -35546 -26652 -11915 -2038 9409 3153
11797 3153 4765 16411 7251 5280 9500 26911 13486 -1736 -17303 6104 16624 3501 -1562
$$ packed form
11888b5117J303K6299J5779O972K0893j6112k5302Q77R462m522j9679K0595J800
11875A3248j1592l227J38j0198J383o231j301O757J5070L100M187k2832j5569
11862b7067Q083P961m085l0897K0839L4491K1169q94Q897k1681j0241K6846J2237
11849D5658q610k3106j1925J1424J9998j4922k1117p729j4291k822L1287l907
11837f2j2109r440J7563R78m547j4430j1045K8302o28J4638L265j0761j2647k606
11823a3529O025J0048o183J421r450n500j2484N837j1278n806J3780L992L323
11810a9804j2881k8127J3268J4626L641R197j0445n021Q894J4737R877J1447o256
11797C153J612J1646r160j971M220J7411j3425j5222j5567K3407J0520j3123n063
$$ plain form
11784 -1562 9435 -7262 -31607 -12575 17055 28502 24820 14394 -2115 4472 31023 28086
11772 28086 18329 20611 44837 42691 28060 27322 7591 -27722 -24962 4652 3389 -280 -2082
11759 -2082 -10385 -8804 -24961 -21175 -27664 -27921 8423 2045 -18394 -10202 2892 6174 3253 -4513
11745 -4513 -11329 -18385 -15995 -13928 -8024 10859 34706 33216 28793 21875 10693 -3863 -25580
11732 -25580 -36728 -14213 1654 -3788 -25593 -32936 -35166 -25148 -267 11235 -26103 -31334
11720 -31334 -18230 -30827 -21128 -25367 -49229 -41393 1321 59171 70711 48037 28712 19590
11708 19590 23760 36671 34310 49856 60883 54628 38194 30124 9791 7438 30376 33591 18968
11695 18968 17561 27622 23810 43176 57481 49537 25563 11217 310 13344 25680 19067
$$ packed form
11784a562J0997j6697k4345J9032K9630J1447l682j0426j6509O587K6551k937
11772B8086r757K282K4226k146j4631p38j9731l5313K760K9614j263l669j802
11759b082q303J581j6157L786o489k57L6344o378k0439Q192J3094L282k921p766
11745d513o816p056K390K067N904J8883K3847j490m423o918j1182j4556k1717
11732b5580j1148K2515J5867n442k1805p343k230J0018K4881J1502l7338n231
11720c1334J3104j2597R699m239k3862P836M2714N7850J1540k2674j9325r122
11708A9590M170J2911k361J5546J1027o255j6434q070k0333k353K2938L215j4623
11695A8968j407J0061l812J9366J4305p944k3974j4346j0907J3034J2336o613
$$ plain form
11683 19067 12961 12463 30124 21516 7876 4517 9833 24296 30041 27378 47166 62305 73102
11670 73102 38611 21303 30327 8360 2650 -1000 -5421 -2240 2256 25223 18708 -14561 -13523
11657 -13523 -3855 25531 39742 31708 23551 -3880 15669 38542 26326 14983 -14338 -34507
11645 -34507 -36485 -25807 -33484 -41818 -10045 -3897 -2316 -5979 -7351 -8338 -15317 1477 25065 27087
11631 27087 27652 19240 14384 17985 2606 -333 11892 17737 29153 7010 -11313 26114 22983
11618 22983 29195 40180 7098 -16872 -1385 4254 -11249 -7673 -3655 -7955 7525 -5850 -8066
11605 -8066 962 -300 -18229 -45369 -40995 -59259 -54556 -32071 -31522 -19261 -14247 -1778 22501
11592 22501 24053 -691 -24469 -32504 -15352 -29635 -54992 -28312 -21642 8659 6150 -19036
$$ packed form
11683A9067o106m98J7661q608j3640l359N316J4463N745k663J9788J5139J0797
11670G3102l4491j7308R024k1967n710l650m421L181M496K2967o515l3269J038
11657a3523R668K9386J4211q034q157k7431J9549K2873j2216j1343k9321k0169
11645c4507j978J0678p677q334L1773O148J581l663j372r87o979J6794K3588K022
11631B7087N65q412m856L601j5379k939J2225N845J1416k2143j8323L7427l131
11618B2983O212J0985l3082k3970J5487N639j5503L576M018m300J5480j3375k216
11605h066R028j262j7929k7140M374j8264M703K2485N49J2261N014J2469K4279
11592B2501J552k4744k3778q035J7152j4283k5357K6680O670L0301k509k5186
$$ plain form
11580 -19036 -17193 -23712 -9097 9222 -648 11776 27171 11011 4665 -22558 -17719 -4309 3326
11567 3326 13380 6877 5258 14448 8387 -14923 8984 13636 -2506 -27651 -16356 12283 25137
11554 25137 15734 -8389 -17829 -15034 6777 23991 21367 21926 34542 17333 -15867 -33749 -15204
11541 -15204 4131 -293 11631 4160 -26804 -21259 -21146 -30341 -30625 -47539 -55267 -39000 -35298 -17369
11527 -17369 -14348 -748 -2322 -30474 -35314 -20850 -14038 -13763 11903 27052 16903 23286 48641
11514 48641 63217 18904 -29674 -41093 -8142 -10655 -15602 -2937 7916 17084 22507 32823
11502 32823 9282 10856 1271 -5469 -8106 1452 28275 3687 -16946 -21454 -20099 -26441 -38444
11489 -38444 -20851 -18416 -12066 14420 45227 48296 31480 16901 1214 -1825 6897 3907 -3600
$$ packed form
11580a9036J843o519J4615J8319r870J2424J5395j6160o346k7223M839J3410P635
11567C326J0054o503j619R190o061k3310K3907M652j6142k5145J1295K8639J2854
11554B5137r403k4123r440K795K1811J7214k624N59J2616j7209l3200j7882J8545
11541a5204J9335m424J1924p471l0964N545J13r195k84j6914p728J6267L702J7929
11527a7369L021J3600j574k8152m840J4464O812K75K5666J5149j0149O383K5355
11514D8641J4576m4313m8578j1419L2951k513m947J2665J0853R168N423J0316
11502C2823k3541J574r585o740k637R558K6823k4588k0633m508J355o342j2003
11489c8444J7593K435O350K6486L0807L069j6816j4579j5687l039Q722k990p507
$$ plain form
11476 -3600 2257 5672 5041 -9570 -4485 -31638 -49257 -49154 -24407 -24159 -38733 -23365 -11965 -18400
11462 -18400 -6903 9782 17050 7883 -6745 12466 11167 -2837 -10622 1585 23996 10222
11450 10222 183 511 2473 -14550 -9949 -17812 -7475 18805 31588 21290 17789 28626 9449
11437 9449 -9291 -1339 -2748 4679 -13268 -17296 -27305 -22467 -13164 -11511 1206 778 -21801 -27645
11423 -27645 -21688 3702 42042 32547 22343 13343 7251 -10927 2641 6075 8207 16864 5905
11410 5905 1717 -6385 -4577 -16180 -21669 -8759 28425 26372 5870 -3612 -2343 -9007 -25677
11397 -25677 -46687 -46584 -40840 -35786 -14340 15840 30820 35841 43926 5 -17070 -3360 -387
11384 -387 6565 29252 38108 45908 34560 265 -7478 -22686 -7654 -8139 -3154 15323 29104
$$ packed form
11476c600N857L415o31j4611N085k7153j7619J03K4747K48j4574J5368J1400o435
11462a8400J1497J6685P268r167j4628J9211j299j4004p785J2207K2411j3774
11450A0222j0039L28J962j7023M601p863J0337K6280J2783j0298l501J0837j9177
11437I449j8740P952j409P427j7947m028j0009M838R303J653J2717m28k2579n844
11423b7645N957K5390L8340r495j0204r000o092j8178J3568L434K132Q657j0959
11410E905m188q102J808j1603n489J2910L7184k053k0502r482J269o664j6670
11397b5677k1010J03N744N054K1446L0180J4980N021Q085m3921j7075J3710K973
11384c87O952K2687Q856P800j1348l4295p743j5208J5032m85M985J8477J3781
$$ plain form
11371 29104 26171 23767 -5138 -4329 8289 16366 5114 -28990 -19164 10061 9225 30029 24648
11358 24648 15353 18139 17662 10851 16110 14895 24400 11366 11940 17000 -2496 -8006 -20924 -24653
11344 -24653 -12731 -21017 -23862 -17064 4980 1458 -19640 -35253 -31328 -8175 -4009 -1431 3174
11331 3174 -4110 -31917 -42074 -42081 -34283 -25692 3434 9942 2216 -962 -6334 -17856 193 3978
11317 3978 11890 4125 5672 -2048 -16447 -14936 -8017 -11619 -4542 15638 2361 -27215 -23650 -17556
11303 -17556 -25379 -9010 9900 7849 -9027 -30297 -27875 -28816 -12682 6861 7676 -6716 6314
11290 6314 6282 -10280 -29265 -29942 -30963 -12436 1151 2404 23735 23105 11121 7157 4904 5710
11276 5710 5511 13645 29713 49468 23716 10462 12149 6227 3052 1518 -7887 -33005 -41713 -33837
$$ packed form
11371B9104k933k404k8905Q09J2618Q077j1252l4104R826K9225q36K0804n381
11358B4648r295K786m77o811N259j215R505j3034N74N060j9496n510j2918l729
11344b4653J1922q286k845O798K2044l522k1098j5613L925K3153M166K578M605
11331C174p284k7807j0157pP798Q591K9126O508p726l178n372j1522J8049L785
11317C978P912p765J547p720j4399J511O919l602P077K0180j3277k9576L565O094
11303a7556p823J6369J8910k051j6876k1270K422r41J6134J9543Q15j4392J3030
11290F314l2j6562j8985o77j021J8527J3587J253K1331o30j1984l964k253Q06
11276E710j99Q134J6068J9755k5752j3254J687n922l175j534r405k5118q708P876
$$ plain form
11262 -33837 -27789 -17559 -12717 -29462 -25877 -20850 -29300 -17692 11223 22993 37361 29482 37173
11249 37173 28183 1754 11941 16745 -2811 19794 35271 23058 30462 33102 36429 41162 48867
11236 48867 22557 27659 34114 38702 29224 3790 7774 18607 30659 17160 9136 10947 27191
11223 27191 17927 3146 -9446 -7412 -3396 7060 -6967 -27279 -19099 -10723 5375 -15467 -18260
11210 -18260 -18253 -923 8849 4522 -7868 -19868 -3392 2139 -1678 -785 -8577 12427 28846 22098
11196 22098 28546 14059 -4167 23322 25097 27342 26397 30782 55630 26849 10016 -5754 -17424
11183 -17424 4736 23459 -5183 -27312 -37259 -26242 2874 16942 14015 10611 28642 17914
11171 17914 19397 9920 -2206 2047 -13646 -7353 -3814 15002 23788 25786 21561 23799 14481 -12591
$$ packed form
11262c3837O048J0230M842j6745L585N027q450J1608K8915J1770J4368p879P691
11249C7173q990k6429J0187M804j9556K2605J5477j2213P404K640L327M733P705
11236D8867k6310N102O455M588r478k5434L984J0833J2052j3499q024J811J6244
11223B7191r264j4781j2592K034M016J0456j4027k0312Q180Q376J6098k0842k793
11210a8260PJ7330R772m327j2390j2000J6476N531l817Q93p792K1004J6419o748
11196B2098O448j4487j8226K7489J775K245r45M385K4848k8781j6833j5770j1670
11183a7424K2160J8723k8642k2129r947J1017K9116J4068k927l404J8031j0728
11171A7914J483r477j2126M253j5693O293L539J8816Q786J998m225K238r318k7072
$$ plain form
11157 -12591 1202 5424 -598 16560 3925 -13155 9443 12376 1833 11471 17418 18784 5
11144 5 -20871 -11775 -11761 -10248 -14246 -2236 3258 -2150 15202 24457 20020 15766 16881 4550 6450
11129 6450 22132 25635 34192 40020 28921 176 -12887 -1622 7695 124 11370 10061 -3576
11116 -3576 -13439 1221 12916 30124 19772 -19608 -41605 -22678 19652 20154 -8128 -20602
11104 -20602 -5033 -15323 -20153 14831 26775 24284 -11030 -22480 -20448 -28854 -15537 206
11092 206 -3991 316 15480 -5213 -116 19566 -9578 -9760 -29054 -19048 8377 22122 14395
11079 14395 -17474 -16285 3302 16375 11665 7315 41100 45340 16736 -1319 -26346 -17182 -10294
11066 -10294 -2734 -1591 12731 7523 -1474 5995 16606 16388 19809 46888 28327 31761 16379
$$ packed form
11157a2591J3793M222o022J7158j2635j7080K2598K933j0543R638N947J366j8779
11144Ek0876R096J4J513l998J2010N494n408J7352R255m437m254J115j2331J900
11129F450J5682L503Q557N828j1099k8745j3063J1265R317p571J1246j309j3637
11116c576r863J4660J1695J7208j0352l9380k1997J8927M2330N02k8282j2474
11104b0602J5569j0290m830L4984J1944k491l5314j1450K032q406J3317J5743
11092B06m197M307J5164k0693N097J9682k9144j82j9294J0006K7425J3745p727
11079A4395l1869J189J9587J3073m710m350L3785M240k8604j8055k5027R164O888
11066a0294P560J143J4322n208q997P469J0611k18L421K7079j8561L434j5382
$$ plain form
11053 16379 -6953 -4183 2523 25765 51385 63490 46670 21938 13189 17370 33355 33243 20804
11040 20804 15541 18169 28865 44931 53561 46859 20966 -10498 -24659 -15986 -4711 -27763 -31879
11027 -31879 1597 8571 16665 20306 36802 35581 28117 27840 42101 25401 15003 10045 -9353
11014 -9353 10820 16591 9708 5904 11511 29924 22623 10454 -8194 -9587 -8770 6924 33087
11001 33087 41599 48189 43877 31397 15551 -303 14471 21376 -796 -24719 -27194 -3554 -227
10988 -227 -1948 4247 23517 44258 19302 17949 24449 48352 48267 37066 29195 29431 26408 11651
10974 11651 10070 20762 36425 16939 16247 5713 8480 24098 22082 7286 -17942 -17749 -17025
10961 -17025 -19245 -24768 -23301 5122 35235 43741 35463 34624 39121 29949 26233 5754 1643 18855
$$ packed form
11053A6379k3332K770O706K3242K5620J2105j6820k4732q749M181J5985j12j2439
11040B0804n263K628J0696J6066Q630o702k5893l1464j4161Q673J1275k3052m116
11027c1879L3476O974Q094L641J6496j221p464k77J4261j6700j0398m958j9398
11014i353K0173N771o883l804N607J8413p301j2169j8648j393Q17J5694K6163
11001C3087Q512O590m312j2480j5846j5854J4774O905k2172k3923k475K3640L327
10988b27j721O195J9270K0741k4956j353O500K3903q5j1201p871K36l023j4757
10974A1651j581J0692J5663j9486o92j0534K767J5618k016j4796k5228J93P24
10961a7025k220n523J467K8423L0113Q506q278q39M497r172l716k0479m111J7212
$$ plain form
10947 18855 23409 51823 41375 1095 -17877 -2416 15607 19880 26873 24417 21813 172 -12400
10934 -12400 -16136 -7261 10130 6316 24858 16004 35129 28320 -4064 -11648 -6296 -27634 -24805
10921 -24805 -4110 12688 31860 27713 16520 31188 44107 45084 52897 46549 50832 23409 4946
10908 4946 20021 26530 38977 36824 13698 -1852 -114 -6400 511 10555 20331 45309 29050
10895 29050 22430 16972 29024 15911 -608 -5085 -10679 -5176 29670 42268 19939 1241 13939
10882 13939 12851 21861 25140 29850 11450 657 -15848 1552 22070 38794 26134 22985 12348
10869 12348 2211 14607 1283 -6526 -19392 -8022 18513 38424 12646 -2498 14217 14505
10857 14505 9974 16305 18825 15152 15007 8901 -11660 14509 55217 62694 33640 29901 23288 35870
$$ packed form
10947A8855M554K8414j0448m0280j8972J5461J8023M273O993k456k604k1641j2572
10934a2400l736Q875J7391l814J8542q854J9125o809l2384p584N352k1338K829
10921b4805K0695J6798J9172m147j1193J4668J2919R77P813o348M283k7423j8463
10908D946J5075O509J2447k153k3126j5550J738o286O911J0044R776K4978j6259
10895B9050o620n458J2052j3113j6519m477n594N503L4846J2598k2329j8698J2698
10882A3939j088R010L279M710j8400j0793j6505J7400K0518J6724j2660l149j0637
10869A2348j0137J2396j3324p809j2866J1370K6535J9911k5778j5144J6715K88
10857A4505m531O331K520l673j45o106k0561K6169M0708P477k9054l739o613J2582
$$ plain form
10843 35870 42811 47530 37464 40344 13719 12802 11425 24583 43140 80171 121710 155363 138718
10830 138718 83309 81951 110177 136462 178443 228008 303828 413576 558415 765840 1035913
10819 1035913 1297793 1525536 1794228 2031999 2122005 2077558 2047243 1980709 1762902 1433059
10809 1433059 1146506 955135 791786 611690 466955 380096 306991 244545 220297 207430
10799 207430 185336 159140 123456 120034 117672 100252 112607 105116 106994 117023 111239 112460 102509
10786 102509 87654 86052 70687 60478 49980 66584 76367 76629 85400 76304 72503 52989 58870
10773 58870 56335 50142 44398 32622 34165 41217 57844 61229 87063 65959 52374 46765 41073
10760 41073 57606 74980 60753 25743 -3275 1013 18674 22732 6705 11880 14501 40162
$$ packed form
10843C5870O941M719j0066K880k6625r17j377J3158J8557L7031M1539L3653j6645
10830A38718n5409j358K8226K6285M1981M9565P5820J09748J44839K07425K70073
10819A035913K61880K27743K68692K37771R0006m4447l0315o6534k17807l29843
10809A433059k86553j91371j63349j80096j44735q6859p3105o2446k4248j2867
10799B07430k2094k6196l5684l422k362j7420J2355p491J878J0029n784J221r951
10786A02509j4855j602j5365j0209j0498J6604R783K62Q771r096l801j9514N881
10773E8870k535o193n744j1776J543P052J6627L385K5834k1104j3585n609n692
10760D1073J6533J7374j4227l5010k9018M288J7661M058j6027N175K621K5661
$$ plain form
10748 40162 67280 59595 41288 22493 16233 -2013 -12541 -18581 -7587 13307 41692 21462
10736 21462 6885 4016 -3822 16592 42003 47166 42951 48000 30862 16460 19672 23888 17284
10723 17284 16704 14936 7482 -21730 -10522 21681 38250 32256 57189 54419 35630 10129 14531
10710 14531 26913 27129 19961 14247 24484 21968 16719 14752 20663 9319 -8167 4622 -13352
10697 -13352 -12524 18095 25551 28530 35509 50604 68861 66125 70377 85181 88701 90020 94159 105742
10683 105742 94224 100155 86239 90868 105782 116554 112911 112269 116485 120776 156069 181928 202842
10670 202842 192532 168508 165519 172976 167394 180921 179109 172277 180079 204699 178039 164879 162303
10657 162303 131880 111365 93900 53421 43019 45499 34217 41105 60991 36289 25971 24650
$$ packed form
10748D0162K7118p685j8307j8795o260j8246j0528o040J0994K0894K8385k0230
10736B1462j4577k869p838K0414K5411N163m215N049j7138j4402L212M216o604
10723A7284n80j768p454k9212J1208L2203J6569n994K4933k770j8789k5501M402
10710A4531J2382K16p168n714J0237k516n249j967N911j1344j7486J2789j7974
10697a3352Q28L0619P456K979O979J5095J8257k736M252J4804L520J319M139J1583
10683A05742j1518N931j3916M629J4914J0772l643o42M216M291L5293K5859K0914
10670B02842j0310k4024k989P457n582J3527j812o832P802K4620k6660j3160k576
10657A62303l0423k0515j7465m0479j0402K480j1282O888J9886k4702j0318j321
$$ plain form
10645 24650 17499 32316 41670 82444 83655 88275 101786 116174 94660 83060 99100 110191
10633 110191 117492 121389 126877 127566 115062 101596 119492 108043 73312 69535 88873 86489 85773
10620 85773 98998 102939 83096 54916 64390 108289 135263 162969 167468 142900 139220 144663 159553
10607 159553 165858 157347 144243 152888 164927 146642 138179 167296 171800 161824 149111 159696 169796
10594 169796 169005 142628 125742 142538 143360 136574 140362 148077 158989 183262 187100 209847 222257
10581 222257 243306 280513 290519 289189 282576 275399 259952 270248 291758 263258 242541 243092
10569 243092 226755 210115 201117 196616 224381 234600 252068 276769 330121 365201 377233 384147
10557 384147 398857 388407 390503 421486 483701 519071 520391 477231 428944 393274 330265 237467
$$ packed form
10645B4650p151J4817R354M0774J211M620J3511J4388k1514j1600J6040J1091
10633A10191P301L897N488O89j2504j3466J7896j1449l4731l777J9338k384p16
10620H5773J3225L941j9843k8180R474M3899K6974K7706M499k4568l680N443J4890
10607A59553O305q511j3104Q645J2039j8285q463K9117M504r976j2713J0585J0100
10594A69796p91k6377j6886J6796Q22o786L788P715J0912K4273L838K2747J2410
10581B22257K1049L7207J0006j330o613p177j5447J0296K1510k8500k0717N51
10569B43092j6337j6640q998m501K7765J0219J7468K4701N3352L5080J2032O914
10557C84147J4710j0450K096L0983O2215L5370J320m3160m8287l5670o3009r2798
$$ plain form
10545 237467 148843 79873 46540 13429 -6315 3277 50336 88455 95949 135054 206302 231374
10533 231374 211406 193980 177490 171300 167253 147150 139061 133706 111573 84357 87602 116859
10521 116859 141495 140808 128332 173798 178910 181254 198150 198661 192388 211367 234586 252794 275157
10508 275157 318028 364057 386724 463285 560112 671310 843030 1086468 1307943 1496325
10498 1496325 1683170 1844281 1961836 1984971 1918365 1760961 1573982 1369829 1137764 898915
10488 898915 718147 590977 526722 493425 486213 514767 548783 568016 589600 607315 642872
10477 642872 681337 682627 688246 699237 704575 741237 756372 806419 839802 859216 885862 899156
10465 899156 930067 968994 992637 1070762 1122624 1164058 1205477 1256641 1311128 1371473 1461713
$$ packed form
10545B37467q8624o8970l3333l3111j9744R592M7059L8119P494L9105P1248K5072
10533B31374j9968j7426j6490o190m047k0103q089n355k2133k7216L245K9257
10521A16859K4636o87j2476M5466N112K344J6896N11o273J8979K3219J8208K2363
10508B75157M2871M6029K2667P6561R6827J11198J71720K43438K21475J88382
10498A496325J86845J61111J17555K3135o6606j57404j86979k04153k32065k38849
10488H98915j80768j27170o4255l3297p212K8554L4016J9233K1584J7715L5557
10477F42872L8465J290N619J0991N338L6662J5135N0047L3383J9414K6646J3294
10465H99156L0911L8927K3643P8125N1862M1434M1419N1164N4487O0345R0240
$$ plain form
10454 1461713 1534557 1611456 1699680 1839788 2046214 2294602 2563396 2833462 3121228 3455181
10444 3455181 3837758 4250358 4706226 5273011 5981220 6839957 7826030 8967509 10245912
10435 10245912 11466046 12711484 14093118 15512707 16927623 18679310 21150900 24732698
10427 24732698 30306020 39125943 52866352 73761027 104644222 147048399 195233565
10420 195233565 238907309 283001401 335521154 375744935 383507920 374871155 370907666
10413 370907666 357408964 315875532 259079307 211019520 175090879 141790667 107195230
10406 107195230 77594317 57770601 45582967 37890919 32783930 29088032 26166225
10399 26166225 23789449 21845247 20013041 18093311 16231275 14591540 13124880 11676202
$$ packed form
10454A461713P2844P6899Q8224J40108K06426K48388K68794K70066K87766L33953
10444C455181L82577M12600M55868N66785P08209Q58737R86073J141479J278403
10435A0245912J220134J245438J381634J419589J414916J751687K471590L581798
10427B4732698N573322Q819923J3740409K0894675L0883195M2404177M8185166
10420A95233565M3673744M4094092N2519753M0223781P762985q636765l963489
10413C70907666j3498702m1533432n6796225m8059787l5928641l3300212l4595437
10406A07195230k9600913j9823716j2187634p692048n106989l695898k921807
10399B6166225k376776j944202j832206j919730j862036j639735j466660j448678
$$ plain form
10391 11676202 10267861 9094389 8182161 7465516 6906676 6571707 6512744 6739029 7150084
10382 7150084 7567650 7879546 8159356 8499776 8807951 8783754 8397966 7624749 6810964 6068856
10372 6068856 5340310 4576483 3764909 3098037 2649774 2351964 2134777 1959061 1831741
10363 1831741 1714343 1618693 1505363 1398740 1336108 1274100 1229815 1192013 1136028 1074679 1052423
10352 1052423 1024857 972220 932445 887929 873271 846900 844464 827191 817899 787073 739901 716789
10340 716789 677070 625140 604613 579155 579337 596102 586236 548886 525789 503133 494516 476843
10328 476843 445686 423631 433883 425463 408742 406357 392697 385428 394503 421324 445044 434673
10316 434673 416709 436401 434320 419401 416574 415613 427142 417297 405931 396350 384330 375347 351099
$$ packed form
10391A1676202j408341j173472r12228p16645n58840l34969n8963K26285M11055
10382G150084M17566L11896K79810L40420L08175k4197l85788p73217q13785p42108
10372F068856p28546p63827q11574o66872m48263k97810k17187j75716j27320
10363A831741j17398r5650j13330j06623o2632o2008m4285l7802n5985o1349k2256
10352A052423k7566n2637l9775m4516j4658k6371k436j7273r292l0826m7172k3112
10340G16789l9719n1930k0527k5458J82J6765r866l7350k3097k2656q617j7673
10328D76843l1157k2055J0252q420j6721k385j3660p269R075K6821K3720j0371
10316D34673j7964J9692k081j4919k827r61J1529r845j1366r581j2020q983k4248
$$ plain form
10303 351099 333724 308980 303500 320565 344922 351495 350668 349941 376161 437227 502165 548521 590667
10290 590667 622704 658320 657524 604990 544550 493201 438236 344529 253106 168306 92196 44225
10278 44225 22291 -4494 -25169 -14174 -16818 -15605 -2703 12800 33440 61486 47418 23192
10266 23192 18267 38504 25918 12081 -20111 -23148 -7658 12976 -25412 -48271 -46927 -38755
10254 -38755 -33384 -21467 -7359 -11100 4255 17222 9264 -919 9797 2692 929 1135 -390
10241 -390 19559 25754 9675 18152 16592 18302 36716 32571 40259 26948 20878 14217 2614 4836
10227 4836 -5820 -8284 -12920 14632 25178 19656 35016 41826 32330 36338 35515 35488 31785 32652 26254
10212 26254 53826 90853 95825 80418 72597 56906 55667 51516 64686 47542 53811 64500 63390
$$ packed form
10303C51099j7375k4744n480J7065K4357O573q27p27K6220O1066O4938M6356M2146
10290E90667L2037L5616p96n2534o0440n1349n4965r3707r1423q4800p6110m7971
10278D4225k1934k6785k0675J0995k644J213J2902J5503K0640K8046j4068k4226
10266B3192m925K0237j2586j3837l2192l037J5490K0634l8388k2859J344Q172
10254c8755N371J1917J4108l741J5355J2967p958j0183J0716p105j763K06j525
10241c90J9949O195j6079Q477j560J710J8414m145P688j3311o070o661j1603K222
10227D836j0656k464m636K7552J0546n522J5360O810r496M008q23k7l703Q67o398
10212B6254K7572L7027M972j5407p821j5691j239m151J3170j7144O269J0689j110
$$ plain form
10199 63390 53782 38649 27593 24383 19036 38462 39928 37160 50789 39462 39944 45902 80549
10186 80549 100566 107955 127154 125361 129521 109668 91340 96201 97445 74077 77118 99087 100516
10173 100516 90233 98009 108330 100716 135943 152078 128964 88134 78858 89588 88447 78083
10161 78083 76114 90953 95154 91013 95574 95309 88861 73505 49451 46303 41654 54238 55323 63597
10147 63597 44162 28061 44944 76454 84212 92485 98798 74520 43174 49857 65652 65712 66980
10134 66980 74801 79802 80908 93112 80918 54990 52274 57170 56769 54509 32234 38572 29288 37762
10120 37762 18556 21760 40374 41479 64304 63001 64860 68731 44627 47171 44874 38740 17873
10107 17873 36524 41371 34309 45136 44032 45712 72047 77579 98881 91452 75409 71351 65690
$$ packed form
10199F3390r608j5133j1056l210n347J9426J466k768J3629j1327M82N958L4647
10186H0549K0017P389J9199j793M160j9853j8328M861J244k3368L041K1969J429
10173A00516j0283P776J0321p614L5227J6135k3114m0830r276J0730j141j0364
10161G8083j969J4839M201m141M561k65o448j5356k4054l148m649J2584J085Q274
10147F3597j9435j6101J6883L1510P758Q273O313k4278l1346O683J5795O0J268
10134F6980P821N001J106J2204j2194k5928k716M896m01k260k2275O338r284Q474
10120C7762j9206L204J8614J105K2825j303J859L871k4104K544k297o134k0867
10107A7873J8651M847p062J0827j104J680K6335N532K1302p429j6043m058n661
$$ plain form
10094 65690 32750 27320 17004 35850 50539 48907 29533 24264 26065 42265 50514 62511 49011
10081 49011 47676 74834 72660 60073 64093 68913 69573 76068 65634 68255 71783 67465 57988 49216
10067 49216 65403 31981 -460 -20727 -16937 15482 36584 51353 76876 104092 162459 140687
10055 140687 72390 41117 19938 20824 2149 -7346 -8722 -8676 3153 -14122 -17338 -17338 -1713 7285
10041 7285 12031 27889 34877 38255 28265 39656 60942 76421 67607 67221 85866 104487 110093
10028 110093 117926 129868 141929 151953 174314 195680 250804 303959 391579 508633 715739
10017 715739 972730 1220850 1462009 1742143 1988503 2108117 2105202 2071845 2024744 1863344
10007 1863344 1574402 1250005 1031815 847811 665807 504050 392077 296022 220696 198885
$$ packed form
10094F5690l2940n430j0316J8846J4689j632j9374n269J801J6200Q249J1997j3500
10081D9011j335K7158k174j2587M020M820O60O495j0434K621L528m318r477q772
10067D9216J6187l3422l2441k0267L790L2419K1102J4769K5523K7216N8367k1772
10055A40687o8297l1273k1179Q86j8675r495j376M6J1829j7275l216%J5625Q998
10041G285M746J5858O988L378r990J1391K1286J5479q814l86J8645J8621N606
10028A10093P833J1942J2061J0024K2361K1366N5124N3155Q7620J17054K07106
10017G15739K56991K48120K41159K80134K46360J19614k915l3357m7101j61400
10007A863344k88942l24397k18190j84004j82004j61757j11973r6055p5326k1811
$$ plain form
9997 198885 191380 144549 134593 134542 126829 109090 93660 103725 118763 107143 110279 90679 80884
9984 80884 80765 62933 61588 42331 24069 29168 6144 6648 41200 58288 58743 59448 58383 50617
9970 50617 53610 42583 32306 47867 50552 41632 42631 47091 61030 50964 53823 51939 32915
9957 32915 34892 33404 47615 36642 31484 21795 11450 15806 19516 3899 -7354 13808 37170
9944 37170 49850 26922 24858 19329 27787 14668 4441 -2478 -23210 -14047 -6295 9274 8391
9931 8391 779 -22064 4996 16916 1579 -2061 9010 6378 8871 31519 46911 43681 27737
9918 27737 18032 -5500 8382 28632 24485 -2115 6241 16188 7125 -1421 -1579 -3517 -3302 -10871
9904 -10871 10321 17165 34097 43767 24746 40141 40016 15285 -4904 6088 3493 -10375 -17585
$$ packed form
9997A98885p505m6831r956n1p713j7739j5430J0065J5038j1620L136j9600r795
9984H0884j19j7832j345j9257j8262N099k3024N04L4552J7088M55P05j065p766
9970E0617K993j1027j0277J5561K685q920R99M460J3939j0066K859j884j9024
9957C2915J977j488J4211j0973n158r689j0345M356L710j5617j1253K1162K3362
9944C7170J2680k2928k064n529Q458j3119j0227o919k0732R163P752J5569q83
9931H391p612k2843K7060J1920j5337l640J1071k632K493K2648J5392l230j5944
9918B7737r705k3532J3882K0250m147k6600Q356R947r063q546j58j938K15p569
9904a0871K1192O844J6932R670j9021J5395j25k4731k0189J0992k595j3868p210
$$ plain form
9891 -17585 -7768 -10932 -817 9029 3243 7350 32429 29967 35363 52555 67065 69949 54423
9878 54423 33633 35595 35743 13742 -2561 -16908 -13343 -8227 -20925 -40216 -30721 3835 -8353
9865 -8353 -16257 -13628 -23696 -42531 -35203 -14474 -3594 12174 15143 11404 -9722 -29053 -27786
9852 -27786 -13140 -1240 -4846 -6156 -14100 -8171 2731 7597 -370 -4658 20179 33630 6671
9839 6671 -10983 2361 -9246 -32593 -24562 568 9299 27591 35561 32639 -2316 -23225 -18921
9826 -18921 2344 23168 23605 12184 5125 18228 -1519 1581 -11669 -21959 -34284 -17519 -11815
9813 -11815 -5645 14262 -4094 -9238 -5530 -4266 -5409 -18724 -19899 -25696 -25042 -16850 -15219 -9865
9799 -9865 -34823 -22589 9378 14296 11519 742 -3436 10978 33540 25266 -3894 -17033 -11277
$$ packed form
9891a7585R817l164J0115R846n786M107K5079k462N396J7192J4510K884j5526
9878E4423k0790J962J48k2001j6303j4347L565N116j2698j9291R495L4556j2188
9865h353p904K629j0068j8835P328K0729J0880J5768K969l739k1126j9331J267
9852b7786J4646J1900l606j310p944N929J0902M866p967m288K4837J3451k6959
9839F671j7654J3344j1607k3347Q031K5130Q731J8292P970k922l4955k0909M304
9826a8921K1265K0824M37j1421p059J3103j9747L100j3250j0290j2325J6765N704
9813a1815O170J9907j8356n144L708J264j143j3315j175n797O54Q192J631N354
9799i865k4958J2234L1967M918k777j0777m178J4414K2562q274k9160j3139N756
$$ plain form
9786 -11277 -14198 -19552 -19628 -12015 7194 41007 58239 51164 33733 17562 14872 13229 20695 43337
9772 43337 37698 1317 15003 2787 -18261 20 4735 9362 11872 -9638 -21836 23610 27389
9759 27389 -11667 -35729 -37868 -44035 -32710 -18220 -4008 10884 25229 5282 -9587 -22633
9747 -22633 -29486 -14428 -11025 4653 -11840 -24031 -18526 -19 20227 27960 29356 9525 -10150
9734 -10150 -17297 -20279 -21398 -14761 -2373 4605 -735 -7585 -2190 -8697 -22287 -28269 -12522 29254
9720 29254 29885 116 -5954 10272 19651 9087 2184 -2962 -2266 3209 8850 8211 38344 42851
9706 42851 37130 26981 25209 32230 32288 29179 18971 5000 9702 -4189 -884 9800 3206 6343
9692 6343 -182 -13437 -18830 2564 -6875 -40759 -50093 -49450 -36388 -20134 2724 10409 12901 20142
$$ packed form
9786a1277k921n354p6P613J9209L3813J7232p075j7431j6171k690j643P466K2642
9772D3337n639l6381J3686j2216k1048J8281M715M627K510k1510j2198M5446L779
9759B7389l9056k4062k139o167J1325J4490J4212J4892J4345j9947j4869j3046
9747b2633o853J5058L403J5678j6493j2191N505J8507K0246P733J396j9831j9675
9734a0150p147k982j119O637J2388O978n340o850N395o507j3590n982J5747M1776
9720B9254O31k9769o070J6226R379j0564o903n146O96N475N641o39L0133M507
9706D2851n721j0149j772P021N8l109j0208j3971M702j3891L305J0684o594L137
9692F343o525j3255n393K1394r439l3884r334O43J3062J6254K2858P685K492P241
$$ plain form
9678 20142 16626 4379 7606 15773 -1647 -19085 -18483 -12249 -18721 -8318 15597 22713 11914
9665 11914 -7718 -18388 -30929 -26780 -21969 -9698 5980 24710 10600 583 -295 -1879 -8011
9652 -8011 11241 11627 28781 26503 -3924 -19986 3748 23364 12208 -13342 -11827 29807 38868
9639 38868 32138 18482 39772 54819 56494 44912 18839 -2271 7619 7139 12495 10107 -7121
9626 -7121 -17293 2738 13359 21839 14704 11385 -6823 20185 34439 16139 -386 -22384 -34698
9613 -34698 -48737 -49058 -11627 12680 7320 -4980 6185 19727 4561 -6466 -7298 -28546 -17915
9600 -17915 -10963 -20881 -30600 -31908 -26879 -9153 -951 -11635 -1365 -6860 -20913 -8790 19408
9587 19408 11499 -6685 -20756 4178 28463 49553 41777 33859 30414 20607 17374 4879 -16382
$$ packed form
9678B0142l516j2247L227Q167j7420j7438O02O234o472J0403K3915P116j0799
9665A1914j9632j0670j2541M149M811J2271J5678J8730j4110j0017q78j584o132
9652h011J9252L86J7154k278l0427j6062K3734J9616j1156k5550J515M1634R061
9639C8868o730j3656K1290J5047J675j1582k6073k1110R890m80N356k388j7228
9626g121j0172K0031J0621Q480p135l319j8208K7008J4254j8300j6525k1998j2314
9613c4698j4039l21L7431K4307n360j2300J1165J3542j5166j1027q32k1248J0631
9600a7915O952r918r719j308N029J7726Q202j0684J0270n495j4053J2123K8198
9587A9408p909j8184j4071K4934K4285K1090p776p918l445r807l233j2495k1261
$$ plain form
9574 -16382 -29413 -51380 -58036 -39650 -571 7013 -14045 -4638 7763 -2243 -18253 -24209 -22134
9561 -22134 -35347 -20129 -4070 8146 -15223 -34893 -30948 -27372 -31340 -23067 -5041 5190 26806
9548 26806 19891 5712 -24918 -14896 425 1283 4856 8650 32965 40609 35227 45978 49667
9535 49667 31272 31051 33729 2553 -13942 -10538 -10220 -8523 5951 13220 12056 -12060 -19496 -37612
9521 -37612 -52633 -48526 -29640 -27740 -23423 -45219 -45119 -14312 17178 16486 23845 18527 17775 24049
9507 24049 29040 2485 8171 13497 25461 23225 15828 31433 48101 52348 38459 -7904 -54715
9494 -54715 -62406 -29493 -4870 32228 19951 11026 1699 5274 26860 29318 9420 -10531 -19569
9481 -19569 -29246 -41852 -53506 -49284 -41229 -34016 -825 15423 4044 -7757 1606 21494 20014
$$ packed form
9574a6382j3031k1967o656J8386L9079P584k1058R407J2401j0006j6010n956K075
9561b2134j3213J5218J6059J2216k3369j9670L945L576l968Q273J8026J0231K1616
9548B6806o915j4179l0630J0022J5321Q58L573L794K4315P644n382J0751L689
9535D9667j8395k21K678l1176j6495L404L18J697J4474P269j164k4116p436j8116
9521c7612j5021M107J8886J900M317k1796J00L0807L1490o92P359n318p52O274
9507B4049M991k6555N686N326J1964k236p397J5605J6668M247j3889m6363m6811
9494e4715p691L2913K4623L7098j2277q925r327L575K1586K458j9898j9951r038
9481a9569r677j2606j1654M222Q055P213L3191J6248j1379j1801R363J9888j480
$$ plain form
9468 20014 1186 15755 30185 12632 36920 49525 39948 19626 31478 30111 36706 42267 30810
9455 30810 6263 14313 26050 17202 7093 -3331 -25064 -39698 -47610 -52851 -55905 -34633 -36410
9442 -36410 -34752 -5632 18921 18048 29046 27538 29810 34810 43226 45772 21529 15319 24910 10063
9428 10063 15100 10934 10861 28643 27339 4724 -5343 224 24076 36517 47385 51945 42234 44098
9414 44098 24492 40607 35859 27594 1857 -41259 -44947 -23079 2611 40420 35131 36392 39058
9401 39058 23443 13066 5184 13329 41478 39596 8683 -16479 -32168 -42882 -16582 -29320
9389 -29320 -40728 -44511 -27046 2362 8123 4277 11454 13526 16014 6933 -16488 15087 27116
9376 27116 16246 -6686 -34765 -34942 -13984 -15194 9247 18352 -8474 10528 12580 26987 34149
$$ packed form
9468B0014j8828J4569J4430j7553K4288J2605r577k0322J1852j367O595N561j1457
9455C0810k4547Q050J1737q848j0109j0424k1733j4634p912n241l054K1272j777
9442c6410J658K9120K4553q73J0998j508K272N000Q416K546k4243o210R591j4847
9428A0063N037m166p3J7782j304k2615j0067N567K3852J2441J0868M560r711J864
9414D4098j9606J6115m748q265k5737m3116l688K1868K5690L7809n289J261K666
9401C9058j5615j0377p882Q145K8149j882l0913k5162j5689j0714K6300j2738
9389b9320j1408l783J7465K9408N761l846P177K072K488r081k3421L1575J2029
9376B7116j0870k2932k8079j77K0958j210K4441R105k6826J9002K052J4407P162
$$ plain form
9363 34149 35520 27870 6144 -6425 -17602 -20819 -25971 -14514 23496 20796 9932 17878 34970
9350 34970 11734 107 9787 15998 31341 50883 30434 4234 -11826 -12596 13368 19595 14505
9337 14505 18367 13693 18874 30569 3615 -8906 9823 18962 11455 4695 2554 2421 16894 17113
9323 17113 972 -21584 -1333 20633 2475 13308 10016 -12366 -5171 -5698 -5161 -727 9139
9310 9139 23802 16749 10490 13562 27192 39605 32837 27711 18117 -9866 -5956 8349 15974 32009
9296 32009 34418 32297 41361 37229 36157 50191 60498 42980 4496 14508 27304 14170 -1348
9283 -1348 15285 22958 -1464 -1301 -12796 -12765 -5726 519 4125 2884 20650 40995 31158 28167
9269 28167 15368 1883 17187 27631 29297 -2618 -8750 24336 14928 857 -6605 7924 -14932
$$ packed form
9363C4149J371p650k1726j2569j1177l217n152J1457L8010k700j0864P946J7092
9350C4970k3236j1627R680O211J5343J9542k0449k6200j6060p70K5964O227n090
9337A4505L862m674N181J1695k6954j2521J8729R139p507o760k141j33J4473K19
9323A7113j6141k2556K0251K1966j8158J0833l292k2382P195n27N37M434R866
9310I139J4663p053o259L072J3630J2413o768n126r594k7983L910J4305P625J6035
9296C2009K409k121R064m132j072J4034J0307j7518l8484J0012J2796j3134j5518
9283a348J6633P673k4422J63j1495L1P039O245L606j241J7766K0345r837k991
9269B8167j2799j3485J5304J0444J666l1915o132L3086r408j4071p462J4529k2856
$$ plain form
9256 -14932 -18069 -3778 6287 -7373 -33131 -20869 -31951 -47199 -15392 11379 31117 -2553
9244 -2553 -29651 -25074 -18815 -5449 142 3011 -14786 -14663 -12976 -20720 -10851 -4541 13163 7263
9230 7263 19780 13876 -14633 -10036 2997 -17116 -35055 -31836 -42036 -27718 -8904 -1127 2535
9217 2535 10819 7416 1131 14477 25417 44782 60520 36469 6496 -8259 7212 22653 56616
9204 56616 54024 28880 13147 185 18445 40112 22261 -16564 -9328 24363 21592 18500 12552
9191 12552 23403 5604 131 11771 22496 25251 13413 -5771 -7315 10623 18290 5764 11550
9178 11550 32469 22364 30347 53152 52422 70944 62675 68896 86137 78458 64494 64095 78217
9165 78217 77499 87606 95123 109706 111680 104454 106145 98094 73777 74749 100249 100216 136832 148909
$$ packed form
9256a4932l137J4291J0065j3660k5758J2262j1082j5248L1807K6771J9738l3670
9244b553k7098M577O259J3366N591K869j7797J23J687p744R869O310J7704n900
9230G263J2517n904k8509M597J3033k0113j7939L219j0200J4318J8814P777L662
9217B535Q284l403o285J3346J0940J9365J5738k4051k9973j4755J5471J5441L3963
9204E6616k592k5144j5733j2962J8260K1667j7851l8825P236L3691k771l092n948
9191A2552J0851j7799n473J1640J0725K755j1838j9184j544J7938P667j2526N786
9178A1550K0919j0105P983K2805p30J8522q269O221J7241p679j3964l99J4122
9165G8217p18J0107P517J4583J974p226J691q051k4317R72K5500l3L6616J2077
$$ plain form
9151 148909 152890 137019 154240 149927 169937 192670 219195 215228 206950 243400 296595 332210
9139 332210 380226 417273 441970 487644 563106 666762 740918 856258 1009358 1190718 1384931
9128 1384931 1701345 2084604 2540916 3136475 3810270 4580751 5412017 6170287 6691599 6769067
9118 6769067 6387558 5645157 4787108 3980308 3298024 2716617 2266252 1907589 1637955 1408763
9108 1408763 1223408 1069014 958209 844011 752520 694589 618391 555310 504256 460795 427303
9097 427303 367152 325090 316578 315636 300035 294185 274925 260388 233522 209787 176363 158852
9085 158852 139816 133787 150311 154150 148058 139327 125796 152174 149298 140467 117071 89282 109439
9072 109439 102624 71870 60428 55722 52793 47540 57198 57935 66753 73671 96725 86615 85942 95374
$$ packed form
9151A48909L981j5871J7221m313K0010K2733K6525l967q278L6450N3195L5615
9139C32210M8016L7047K4697M5674P5462J03656P4156J15340J53100J81360J94213
9128A384931L16414L83259M56312N95559O73795P70481Q31266P58270N21312P7468
9118F769067l81509p42401q58049q06800o82284n81407m50365l58663k69634k29192
9108A408763j85355j54394j10805j14198r1491n7931p6198o3081n1054m3461l3492
9097D27303o0151m2062q512r42j5601n850j9260j4537k6866k3735l3424j7511
9085A58852j9036o029J6524L839o092q731j3531K6378k876q831k3396k7789K0157
9072A09439o815l0754j1442m706k929n253R658P37Q818O918K3054j0110o73R432
$$ plain form
9058 95374 92974 87806 67809 48016 57974 64813 64831 68145 51855 42456 33819 17887 12459 10978
9044 10978 38211 40414 41883 24614 13009 -19869 24884 32338 42387 41757 33637 16974 5007
9031 5007 -11581 -19333 -9376 25582 58930 65766 51902 21349 4838 -9484 -19887 -11948 -21680
9018 -21680 -16212 19319 43163 27738 9667 -115 10875 23085 31845 19106 35832 56258
9006 56258 43186 21982 -907 -16596 -39810 -50640 -41422 -41418 -24983 -2905 -915 -22007 -9318
8993 -9318 15440 3073 497 -3268 19689 28614 11772 -21330 -32213 -45036 -41982 -27830 -13485
8980 -13485 1262 -11047 -8058 -4803 -610 -15610 -16792 5905 -10848 -27540 -1249 -5849 3236
8967 3236 9531 13130 2519 2198 -8164 -6771 12148 17874 20071 36106 33581 33507 15471 2684
$$ packed form
9058I5374k400n168j9997j9793R958O839J8L314j6290r399q637j5932n428j481
9044A0978K7233K203J469j7269j1605l2878M4753P454J0049o30q120j6663j1967
9031E007j6588p752R957L4958L3348O836j3864l0553j6511j4322j0403P939r732
9018b1680N468L5531K3844j5425j8071r782J0990J2210Q760j2739J6726K0426
9006E6258j3072k1204k2889j5689k3214j0830R218MJ6435K2078J990k1092J2689
8993i318K4758j2367k576l765K2957Q925j6842l3102j0883j2823L054J4152J4345
8980a3485J4747j2309K989L255M193j5000j182K2697j6753j6692K6291m600R085
8967C236O295L599j0611l21j0362J393J8919N726K197J6035k525p4j8036j2787
$$ plain form
8953 2684 9545 5340 6776 -5583 4520 -21967 -17132 11768 22770 17329 4404 -549 -4572
8940 -4572 -19603 -30465 909 2067 -1601 667 13988 26531 28883 35021 11001 -11003 -15219
8927 -15219 -21675 21491 39756 33841 25666 27420 29077 25812 10604 17489 34354 42035 28354
8914 28354 36328 39834 38793 45191 57929 77400 64803 37492 24054 26076 57345 76723 72733
8901 72733 85906 101930 109194 125979 147753 184435 217277 255617 284600 302394 302469 348043 403445
8888 403445 477771 570172 695484 920941 1230962 1673470 2359463 3344752 4715988 6554737
8878 6554737 8675807 10070951 9066198 6522773 4385391 3029226 2214912 1681391 1340780
8869 1340780 1113507 927580 769763 652120 572881 513573 450500 383425 338759 316024 283697
$$ packed form
8953B684O861m205J436j2359J0103k6487M835K8900J1002n441j2925m953m023
8940d572j5031j0862L1374J158l668K268J3321J2543K352O138k4020k2004m216
8927a5219o456M3166J8265n915q175J754J657l265j5208O885J6865P681j3681
8914B8354P974L506j041O398J2738J9471j2597k7311j3438K022L1269J9378l990
8901G2733J3173J6024P264J6785K1774L6682L2842L8340K8983J7794P5M5574N5402
8888D03445P4326R2401J25312K25457L10021M42508O85993R85289J371236J838749
8878F554737K121070J395144j004753k543425k137382j356165q14314n33521l40611
8869A340780k27273j85927j57817j17643p9239n9308o3073o7075m4666k2735l2327
$$ plain form
8858 283697 258159 240292 208603 184287 139101 137264 161124 149548 124577 114395 120653 121922
8846 121922 102430 92338 92846 83256 93320 113709 105168 74198 57910 52901 73583 62752 54032
8833 54032 29817 7185 24410 33947 20408 10587 24611 12770 10304 25335 15359 29636 26298
8820 26298 17353 1574 14756 18100 18126 12493 28114 41927 27691 9415 22244 22963 7124
8807 7124 -21658 -4079 16973 5281 -11915 9926 19674 14689 4159 -14134 -23766 -2315 26812
8794 26812 37085 40817 38395 32170 19906 3787 -5337 -9175 3131 20152 22573 29213 48944
8781 48944 40587 49815 42968 12271 6050 16659 17033 962 -37538 -47658 -30274 2978 32322
8768 32322 25186 -4131 -5001 -16278 -33512 -35282 -16451 2186 19224 16502 40931 21898 -135
$$ packed form
8858B83697k5538j7867l1689k4316m5186j837K3860j1576k4971j0182O258J269
8846A21922j9492j0092N08r590J0064K0389q541l0970j6288n009K0682j0831q720
8833E4032k4215k2632J7225R537j3539r821J4024j1841k466J5031r976J4277l338
8820B6298q945j5779J3182L344K6n633J5621J3813j4236j8276J2829P19j5839
8807G124k8782J7579K1052j1692j7196K1841R748m985j0530j8293r632K1451K9127
8794B6812J0273L732k422o225j2264j6119r124l838J2306J7021K421O640J9731
8781D8944q357R228o847l0697o221J0609L74j6071l8500j0120J7384L3252K9344
8768C2322p136k9317q70j1277j7234j770J8831J8637J7038k722K4429j9033k2033
$$ plain form
8755 -135 -618 212 8153 -1211 3414 8248 -13682 -24026 -12280 -9119 428 -1897 -18476 -24259 -5822
8740 -5822 5147 208 -3672 -1719 954 11724 23647 27671 31931 6670 -30170 -43606 -27184
8727 -27184 -16311 -25358 -143 21243 17283 15861 6396 -14552 -30243 -16312 -20978 -1416 3861
8714 3861 3151 -386 18854 36483 36423 31961 43459 57855 22534 -7485 -5304 -7639 -3953 -22295
8700 -22295 -23286 -26274 -29853 -2679 5712 17335 -4100 9235 5663 22005 41124 40137 40699 38287
8686 38287 9817 -1228 14493 8707 -6884 -5275 -15977 -53391 -49961 -54772 -36859 -6326 10076
8673 10076 5709 12419 11290 -7910 -15215 3361 8125 4850 13117 14511 1227 -17377 -29958
8660 -29958 1750 40736 35847 9735 14843 27908 10070 -1681 2823 16156 27853 47971
$$ packed form
8755a35m83Q30P941r364M625M834k1930j0344J1746L161R547k325j6579n783J8437
8740e822J0969m939l880J953K673J0770J1923M024M260k5261l6840j3436J6422
8727b7184J0873r047K5215K1386l960j422r465k0948j5691J3931m666J9562N277
8714C861p10l537J9240J7629o0m462J1498J4396l5321l0019K181k335L686j8342
8700b2295r91k988l579K7174Q391J1623k1435J3335l572J6342J9119r87N62k412
8686C8287k8470j1045J5721n786j5591J609j0702l7414L430m811J7913L0533J6402
8673A0076m367O710j129j9200p305J8576M764l275Q267J394j3284j8604j2581
8660b9958L1708L8986m889k6112N108J3065j7838j1751M504J3333J1697K0118
$$ plain form
8648 47971 44943 49747 63810 45556 12480 13423 20969 20910 17853 33654 44738 17888 -6243 -24765
8634 -24765 -30905 11580 37627 62841 57402 10792 12047 -8909 3884 27789 13792 24876
8622 24876 40959 25165 37836 61240 56626 32067 43259 35678 28071 3903 -5996 11256 11021
8609 11021 25106 24728 24947 34876 35278 11783 18122 20280 24647 28602 -8819 -25474 -24492 -15258 -21270
8594 -21270 -40428 -10246 21810 12932 -14345 -15971 18300 41084 28252 22379 23932 23891 12836
8581 12836 13889 -17718 -35674 -22508 -23262 -36005 -28667 -6797 -15468 -11197 -408 -13371 -23044
8568 -23044 -9142 1115 -24402 -22014 -9388 18673 18853 19900 25686 28062 26096 11978 -15646
8555 -15646 -40801 -54721 -44741 -22039 -39050 -62321 -46531 -19388 9441 16182 15723 12665 21976
$$ packed form
8648D7971l028M804J4063j8254l3076R43P546n9l057J5801J1084k6850k4131j8522
8634b4765o140M2485K6047K5214n439m6610J255k0956J2793K3905j3997J1084
8622B4876J6083j5794J2671K3404m614k4559J1192p581p607k4168r899J7252k35
8609A1021J4085l78K19R929M02k3495O339K158M367L955l7421j6655R82R234o012
8594b1270j9158L0182L2056q878k7277j626L4271K2784j2832n873J553m1j1055
8581A2836J053l1607j7956J3166p54j2743P338K1870q671M271J0789j2963r673
8568b3044J3902J0257k5517K388J2626K8061J80J047N786K376j966j4118k7624
8555a5646k5155j3920R980K2702j7011k3271J5790K7143K8829O741m59l058R311
$$ plain form
8542 21976 962 -17657 -18101 -30324 -36645 -30880 -21589 -1510 -3423 12162 -5462 -2168 -10200
8529 -10200 -15356 -505 -1550 -12568 -4410 -12068 -20616 -18428 -15829 -28457 -35961 -14324 36
8516 36 19150 5206 -216 29281 25221 20689 11555 19220 5202 21907 28223 -4874 -9049 -18952
8502 -18952 -19668 -18854 -5818 19573 22231 26840 17798 16655 -3565 -19048 -3907 -13407 -2900 -34087
8488 -34087 -40856 -22905 1373 16495 16863 22346 26442 58274 50083 5453 -7756 -7945 -16663 -4773
8474 -4773 6711 12584 5245 -8436 -16044 -17336 3321 23191 28839 15868 -2923 -6719 -9367
8461 -9367 -24592 -22712 -11412 -6658 14759 18675 22239 31589 12769 16349 20098 2481 -17929
8448 -17929 -23876 10226 5066 -7855 -12909 -6616 -4553 -12582 -16420 -22094 -19329 -17124 -5765 11446
$$ packed form
8542B1976k1014j8619m44j2223o321N765R291K0079j913J5585j7624L294q032
8529a0200n156J4851j045j1018Q158p658q548K188K599j2628p504K1637J4360
8516C6J9114j3944n422K9497m060m532r134P665j4018J6705O316l3097m175r903
8502a8952p16Q14J3036K5391K658M609r042j143k0220j5483J5141r500J0507l1187
8488c4087o769J7951K4278J5122L68N483M096L1832q191m4630j3209j89q718J1890
8474d773J1484N873p339j3681p608j292K0657J9870N648j2971j8791l796k648
8461i367j5225J880J1300M754K1417L916L564R350j8820L580L749j7617k0410
8448a7929n947L4102n160j2921n054O293K063q029l838n674K765K205J1359J7211
$$ plain form
8434 11446 -6231 -16868 -33088 -31941 -34147 -47222 -45816 -22264 -17905 -36528 -20576 24908 56809
8421 56809 57829 34723 19066 14841 -7936 -18327 -33091 -27869 5639 21555 36881 28091 15614
8408 15614 -13880 -14070 -24772 -10843 6857 7266 35596 39301 39455 20574 21133 18804 8340 -11037
8394 -11037 -14901 -30498 -26250 -7943 -4090 -8394 -7570 -10244 -12295 -26116 -37261 -46269 -8629 24839
8380 24839 12502 -12191 -28071 -30301 -650 -6772 -15530 -16283 -49802 -64566 -63409 -27905 6019
8367 6019 10937 7558 -6777 -8104 4535 6145 26380 15179 18007 5764 -22299 -31852 -30069
8354 -30069 -7232 -12028 -1348 561 -13231 12454 37247 32264 29357 24089 3948 18537 -13076
8341 -13076 -22135 -26543 -45238 -36177 -17954 -16082 -23840 -23381 -21941 -29794 -28838 -7707 -8238 -11617 -3842
$$ packed form
8434A1446j7677j0637j6220J147k206j3075J406K3552M359j8623J5952M5484L1901
8421E6809J020k3106j5657m225k2777j0391j4764N222L3508J5916J5326q790j2477
8408A5614k9494j90j0702J3929J7700M09K8330L705J54j8881N59k329j0464j9377
8394a1037l864j5597M248J8307L853m304Q24k674k051j3821j1145r008L7640L3468
8380B4839j2337k4693j5880k230K9651o122q758p53l3519j4764J157L5504L3924
8367F019M918l379j4335j327J2639J610K0235j1201K828j2243k8063r553J783
8354c0069K2837m796J0680J909j3792K5685K4793m983k907n268k0141J4589l1613
8341a3076r059m408j8695R061J8223J872p758M59J440p853R56K1131n31l379P775
$$ plain form
8326 -3842 -29722 -51194 -24184 -37244 -27516 -4717 5649 15217 6767 4926 21465 13792 -20391
8313 -20391 -27603 -23035 -10028 -5853 -1191 15087 14068 16693 22378 24822 16759 8077 8411 9626
8299 9626 34466 33975 44656 35029 16228 -1230 -13214 -26344 -37106 -42659 -25402 -11433 -12942
8286 -12942 773 -18194 -7673 28118 46052 54215 37270 12253 -3913 -38000 -43695 -38776
8274 -38776 -48142 -33570 -11332 7255 8977 2180 -23689 1519 -16892 -35396 -36664 -27681 -36601
8261 -36601 -30728 -30120 -43254 -48468 -34206 -20364 -12655 -23344 -18625 -9430 -7055 -7861 -3452 1038
8247 1038 11345 10002 -7399 -13021 -7017 237 -13907 -22351 -23109 5823 18858 25564 3877 12293
8233 12293 14074 -12920 -32147 -18110 -16232 -12496 14094 9463 -23919 -50834 -42507 -27789 -24782
$$ packed form
8326c842k5880k1472K7010j3060R728K2799J0366R568q450j841J6539p673l4183
8313b0391p212M568J3007M175M662J6278j019K625N685K444q063q682L34J215
8299I626K4840m91J0681r627j8801j7458j1984j3130j0762n553J7257J3969j509
8286a2942J3715j8967J0521L5791J7934Q163j6945k5017j6166l4087n695M919
8274c8776r366J4572K2238J8587J722o797k5869K5208j8411j8504j268Q983q920
8261c6601N873O08j3134n214J4262J3842P709j0689M719R195K375q06M409M490
8247A038J0307j343j7401n622O004P254j4144q444p58K8932J3035O706k1687Q416
8233A2293J781k6994j9227J4037J878L736K6590m631l3382k6915Q327J4718L007
$$ plain form
8220 -24782 -15282 -31085 -46842 -7363 22961 12378 2737 10807 -1615 -3153 11104 13073 -2798
8207 -2798 -26803 -12201 3367 9940 29665 22424 24364 25712 1470 14503 34516 28550 9762
8194 9762 -22 -8694 -7073 -3157 -19609 -16445 7690 9176 1826 21228 1058 -28606 -28684 -10268
8180 -10268 11631 -2397 -8839 -9515 -14397 -4961 12271 21251 6774 2638 4656 4348 -3295 -9007
8166 -9007 -6602 -2058 -3869 -8509 -11987 -22026 -11887 8879 17913 16151 17657 -1309 -3391 1080
8152 1080 29865 21367 -8484 -33240 -6057 19279 -4325 -5765 -8460 -13128 -24566 -29349 -27061
8139 -27061 -7287 19555 32606 26504 -7655 -24138 -4612 31241 33322 43368 35866 14245
8127 14245 21547 -483 -15352 -916 -6567 2486 -4549 -22032 -21823 -27554 -12826 -8474 -3026 3172
$$ packed form
8220b4782R500j5803j5757L9479L0324j0583r641Q070j2422j538J4257J969j5871
8207b798k4005J4602J5568O573J9725p241J940J348k4242J3033K0013n966j8788
8194I762r784q672J621L916j6452L164K4135J486p350J9402k0170k9664p8J8416
8180a0268K1899j4028o442o76m882R436J7232Q980j4477m136K018l08p643n712
8166i007K405M544j811m640l478j0039J0139K0766R034j762J506j8966k082M471
8152A080K8785q498k9851k4756K7183K5336k3604j440k695m668j1438m783K288
8139b7061J9774K6842J3051o102l4159j6483J9526L5853K081J0046p502k1621
8127A4245P302k2030j4869J4436n651R053p035j7483K09n731J4728M352N448O198
$$ plain form
8113 3172 -21532 -8098 -6295 -24506 -42335 -35788 -40432 -40995 -35372 -30331 -39221 -28952 -15324 -18486
8099 -18486 -29599 -21999 -2309 6218 -1159 -1344 -8102 835 11024 25776 25199 -639 -7804 -7876
8085 -7876 -4494 -16893 -12346 -20394 -7619 14104 22941 27300 -2263 -12954 -1116 12589 9408
8072 9408 10303 3527 -21105 2177 6217 12208 -4126 -13262 -46103 -30817 -20736 -22342 -20715 2423
8058 2423 -16349 -41718 -30700 -25435 -39602 -50691 -47537 -56505 -44268 -36665 -46628 -35769 -29881
8045 -29881 -26401 4069 21316 -11564 -33146 -48280 -38113 -10048 -13922 -20028 1363 16451
8033 16451 10606 14513 9633 25646 8259 2468 5911 9505 -3054 -19982 -40335 -43265 -17130
8020 -17130 -6657 -18072 -28472 -27994 -30387 -21230 -21345 -24096 -17027 -2021 6627 9402 24113 16023
$$ packed form
8113C172k4704J3434J803j8211j7829O547m644n63N623N041q890J0269J3628l162
8099a8486j1113P600J9690Q527p377j85o758Q937J0189J4752n77k5838p165p2
8085g876L382j2399M547q048J2775K1723Q837M359k9563j0691J1838J3705l181
8072I408Q95o776k4632K3282M040N991j6334r136l2841J5286J0081j606J627K3138
8058B423j8772k5369J1018N265j4167j1089L154q968J2237P603r963J0859N888
8045b9881L480L0470J7247l2880k1582j5134J0167K8065l874o106K1391J5088
8033A6451n845L907m880J6013j7387n791L443L594j2559j6928k0353k930K6135
8020a7130J0473j1415j0400M78k393R157j15k751P069J5006Q648K775J4711q090
$$ plain form
8006 16023 25519 37633 32577 7608 7842 12275 6549 -5168 -5371 17012 46153 39650 25931 22882
7992 22882 36792 54275 41900 50953 33797 -3797 -19121 -20377 -23261 -6505 -11747 -7346 -8533
7979 -8533 -7514 10400 18112 25440 21020 8774 8228 21076 29541 6845 -13218 4108 14152
7966 14152 8343 -10832 13188 37460 25216 17188 40772 46388 13792 18331 19640 21589 48664
7953 48664 26460 21902 39338 34292 26053 10293 435 -29732 -40957 -37295 -27970 -27822 -28735 -2865
7939 -2865 10639 7419 6874 10728 15439 7444 7887 19136 14044 7565 21545 7184 -9789 -10998
7925 -10998 -12276 -22935 -11145 2565 -8599 -9911 -2248 3756 9071 -2992 -6160 15895 30389
7912 30389 29588 43756 40517 18185 4326 12546 22391 22563 15665 -4009 -8926 -4345 -5571 -13597
$$ packed form
8006A6023R496J2114n056k4969K34M433n726j1717k03K2383K9141o503j3719l049
7992B2882J3910J7483j2375R053j7156l7594j5324j256k884J6756n242M401j187
7979h533J019J7914P712P328m420j2246n46J2848Q465k2696k0063J7326J0044
7966A4152n809j9175K4020K4272j2244q028K3584N616l2596M539J309J949K7075
7953D8664k2204m558J7436n046q239j5760r858l0167j1225L662R325J48r13K5870
7939b865J3504l220n45L854M711p995M43J1249n092o479J3980j4361j6973j209
7925a0998j278j0659J1790J3710j1164j312P663O004N315j2063l168K2055J4494
7912C0389q01J4168l239k2332j3859Q220R845J72o898j9674m917M581j226q026
$$ plain form
7898 -13597 -17254 -11560 -1310 11088 6052 10696 20587 8599 26567 43130 56173 40164 14657
7885 14657 5001 -5019 -15403 -21700 -20474 -3962 -6774 6107 3428 -10857 -6659 12328 -9281
7872 -9281 -7184 -2080 7631 25499 14372 19991 -4174 -14772 -10379 -11411 -11549 6618 11788 16554
7858 16554 10717 -966 -1458 -4511 -3443 -16850 -42976 -76219 -61895 -42299 -19575 -8130 -7176
7845 -7176 -28064 -68391 -64042 -29477 -19365 -16683 9033 897 -22044 -27120 -9110 3283 9301
7832 9301 11254 1042 4921 1688 -2226 -5648 -9613 -33864 -20615 -12375 -7271 -25563 -30210 -11910
7818 -11910 -17232 -19498 -25258 -33854 -20523 -37956 -25471 -16430 -15897 -15949 13989 39957 38680 38693 51934
7803 51934 39438 39579 23317 17979 17804 8717 6405 -2808 501 1038 24147 33540 22721 27738
$$ packed form
7898a3597l657N694J0250J2398n036M644R891j1988J7968J6563J3043j6009k5507
7885A4657r656j0020j0384o297J226J6512k812J2881k679j4285M198J8987k1609
7872i281K097N104R711J7868j1127N619k4165j0598M393j032j38J8167N170M766
7858A6554n837j1683m92l053J068j3407k6126l3243J4324J9596K2724J1445R54
7845g176k0888m0327M349L4565J0112K682K5716q136k2941n076J8010J2393O018
7832I301J953j0212L879l233l914l422l965k4251J3249Q240N104j8292m647J8300
7818a1910n322k266n760q596J3331j7433J2485R041N33n2K9938K5968j277J3J3241
7803E1934j2496J41j6262n338j75r087k312r213L309N37K3109R393j0819N017
$$ plain form
7789 27738 18616 -668 -16820 -21198 -17946 9054 25091 24102 19407 3108 9476 1225 1507 10836
7775 10836 1943 2166 -13584 -19990 -15372 -4188 3425 32883 41285 17392 5770 -2141 35157
7762 35157 34267 30310 24903 32397 32714 22966 30348 53404 31709 21411 22146 26124 8117 -4262
7748 -4262 -10491 -8468 -9265 5522 16165 21749 33657 68374 65875 36297 -6740 -17925 -4735
7735 -4735 -2290 1569 21910 19097 -3970 2451 8208 18130 21431 30194 18008 7863 26342 23207
7721 23207 -391 -2491 11272 12607 -894 4231 3953 -15565 -19415 -24698 -27260 -323 5301 5134
7707 5134 -5452 -24967 -30257 -28179 -14953 15031 7299 7690 21909 14085 17442 3193 -19425
7694 -19425 -46191 -38270 -34726 -31274 -19557 3117 8232 -5224 6885 -4450 -17433 -23417 -3927
$$ packed form
7789B7738r122j9284j6152m378L252K7000J6037r89m695j6299O368q251K82R329
7775A0836q893K23j5750o406M618J1184P613K9458Q402k3893j1622p911L7298
7762C5157q90l957n407P494L17r748P382K3056k1695j0298P35L978j8007j2379
7748d262o229K023p97J4787J0643N584J1908L4717k499k9578m3037j1185J3190
7735d735K445L859K0341k813k3067O421N757R922L301Q763j2186j0145J8479l135
7721B3207k3598k100J3763J335j3501N125k78j9518l850n283k562K6937N624j67
7707E134j0586j9515n290K078J3226K9984p732L91J4219p824L357j4249k2618
7694a9425k6766P921L544L452J1717K2674N115j3456J2109j1335j2983n984J9490
$$ plain form
7681 -3927 19128 -5861 -36630 -17447 8251 14901 -10088 -12453 -3092 13333 10816 4799 21948
7668 21948 17087 9954 -6930 -32686 -29195 -34774 -24728 -5276 2404 3855 -19867 3382 17452
7655 17452 7300 23398 9633 9362 1866 12347 9170 -823 2992 10453 -9294 -43018 -39766
7642 -39766 -28602 -26513 -30357 -13565 -27626 -25672 -35189 -34652 -14879 17528 -1237 -15461 -4976
7629 -4976 7405 9170 -9967 -29566 -20140 -4777 -9604 -14070 6966 29340 25762 -9131 -16050
7616 -16050 -1443 -23387 -7743 4611 3640 -2140 -26643 -35578 -25802 -12028 -3760 -23029 568
7603 568 2796 -6570 -16085 -44856 -70622 -69081 -43585 -15445 -1370 -7553 5387 17140 2780
7590 2780 -104 13112 8882 6526 10182 16960 893 -1801 13234 24699 32823 32129 16033 9366
$$ packed form
7681c927K3055k4989l0769J9183K5698O650k4989k365R361J6425k517o017J7149
7668B1948m861p133j6884k5756L491n579J0046J9452P680J451k3722K3249J4070
7655A7452j0152J6098j3765k71p496J0481l177r993L815P461j9747l3724L252
7642c9766J1164K089l844J6792j4061J954r517N37J9773L2407j8765j4224J0485
7629d976J2381J765j9137j9599R426J5363m827m466K1036K2374l578l4893o919
7616a6050J4607k1944J5644J2354r71n780k4503q935R776J3774Q268j9269K3597
7603E68K228r366r515k8771k5766J541K5496K8140J4075o183J2940J1753j4360
7590B780k884J3216m230k356L656O778j6067k694J5035J1465Q124o94j6096o667
$$ plain form
7576 9366 -12000 -25564 -20104 -10164 -7204 1917 612 -16415 -28042 -21538 -1319 -3974 4411 5537
7562 5537 -2807 8880 14918 24106 22687 13352 17248 30317 264 -17154 -7679 10318 21636
7549 21636 17797 -6204 1087 4241 -3372 -9913 -19550 -739 -3906 -27193 -36889 -35117 -28114 -30690
7535 -30690 -36092 -37194 -30057 5779 14685 24281 18344 32207 42557 14988 5728 -11515 -686
7522 -686 7345 4067 -1654 -6862 -11160 18415 20191 2619 9856 9558 -20101 -16172 -204 12111
7508 12111 16311 15887 23183 28076 14983 13188 10962 -3044 -1324 11031 13055 12401 -8647 -14774
7494 -14774 -30611 -47091 -50811 -30954 -19420 -5425 4262 -10426 -22641 -13095 2966 7229 18474
7481 18474 20244 587 -717 14247 7487 -1074 -3666 10139 8916 -13182 -1811 17063 29527
$$ packed form
7576I366k1366j3564N460R940K960R121j305j7027j1627O504K0219k655Q385J126
7562E537q344J1687O038R188j419r335L896J3069l0053j7418R475J7997J1318
7549B1636l839k4001P291L154p613o541r637J8811l167k3287r696J772P003k576
7535c0690n402j102P137L5836Q906R596n937J3863J0350k7569r260j7243J0829
7522f86Q031l278n721n208m298K9575J776j7572P237k98k9659L929J5968J2315
7508A2111M200m24P296M893j3093j795k226j4006J720J2355K024o54k1048o127
7494a4774j5837j6480l720J9857J1534J3995R687j4688j2215R546J6061M263J1245
7481A8474J770j9657j304J4964o760q561k592J3805j223k2098J1371J8874J2464
$$ plain form
7468 29527 38428 43628 27174 13157 19868 13962 31437 27374 11999 -7173 -11343 -21097 -16648
7455 -16648 -13736 -21978 -18800 -23301 -7855 -4981 -32068 -27640 -46895 -40548 -47714 -36840 -20563
7442 -20563 -16339 -11886 -11811 -15728 -29534 -43239 -17971 10908 19597 11173 17608 -2951 -21351 -10280
7428 -10280 24374 29446 -1744 -15044 -2483 13273 7109 -1114 3195 -6666 -12779 10110 28738
7415 28738 11762 9949 14253 -6691 -20869 -43863 -41279 -26478 -26833 -17115 -15274 -19042 -10527 -4554
7401 -4554 864 15792 11012 3275 17923 16053 19632 23014 21935 -7790 -17344 1742 5000 10550
7387 10550 -8283 -15796 -12350 10305 19399 14221 2261 11173 773 -22210 -29536 -28895 -27930 -12161
7373 -12161 -16120 -22419 538 6989 4297 42677 52825 41350 20007 6179 -3006 -12472 -20678
$$ packed form
7468B9527Q901N200j6454j4017O711n906J7475m063j5375j9172m170r754M449
7455a6648K912q242L178m501J5446K874k7087M428j9255O347p166J0874J6277
7442b0563M224M453P5l917j3806j3705K5268K8879Q689q424O435k0559j8400J1071
7428a0280L4654N072l1190j3300J2561J5756o164q223M309r861o113K2889J8628
7415B8738j6976j813M304k0944j4178k2994K584J4801l55R718J841l768Q515N973
7401d554N418J4928m780p737J4648j870L579L382j079k9725r554J9086L258N550
7387A0550j8833p513L446K2655R094n178j1960Q912j0400k2983p326O41R65J5769
7373a2161l959o299K2957O451k692L8380J0148j1475k1343j3828r185r466q206
$$ plain form
7360 -20678 2249 37812 44482 28161 13385 23705 22704 17852 -4055 4803 -3060 -9373 -17226
7347 -17226 -6662 -13949 -7820 -6522 4985 13157 16942 18843 18193 3182 -19344 -3344 14926
7334 14926 3787 -848 -8613 -8453 -7471 -1081 -17612 -12055 -12912 -3537 -6536 -11414 3480 7629 18526
7319 18526 -13297 -23906 -16702 10810 23715 8000 6564 15054 -377 -26320 -25800 -32747 -27144
7306 -27144 -2510 -122 -5377 -13638 -10612 14408 17317 19752 -3879 -22269 -11590 809 6083
7293 6083 40633 11488 -7441 -23620 -28323 -9405 -23610 -39357 -38487 -34743 -33467 -32928 -3142
7280 -3142 -9841 -18708 -383 14436 28630 38495 28233 747 1612 9648 -9695 -10387 -20357 -29274
7266 -29274 -26470 -3015 29730 35831 23780 11580 11649 32168 29178 10655 10711 -479 -580 -5005
$$ packed form
7360b0678K2927L5563O670j6321j4776J0320j001m852k1907Q858p863o313p853
7347a7226J0564p287O129J298J1507Q172L785J901o50j5011k2526J6000J8270
7334A4926j1139m635p765J60R82O390j6531N557q57R375k999m878J4894M149J0897
7319A8526l1823j0609P204K7512J2905j5715j436Q490j5431k5943N20o947N603
7306b7144K4634K388n255q261L026K5020K909K435k3631j8390J0679J2399N274
7293F083L4550k9145j8929j6179m703J8918j4205j5747Q70L744J276N39K9786
7280c142o699q867J8325J4819J4194R865j0262k7486Q65Q036j9343o92r970q917
7266b9274K804K3455L2745O101j2051j2200O9K0519k990j8523N6j1190j01m425
$$ plain form
7252 -5005 -5402 1800 5624 9922 5524 -4226 -7116 -13131 -19333 -8632 6078 -14248 -29450 -12990
7238 -12990 -6385 -18792 -38303 -22917 -34584 -31342 -30276 -14557 -22324 -25086 -19309 -20199 -17340 -2455
7224 -2455 8055 9796 9044 27530 40673 34009 12719 -7427 -8136 16692 28478 27460 14914
7211 14914 11712 18757 25761 5780 -19391 -6977 -1716 -23529 -29407 -18488 410 -3196 11646
7198 11646 -7106 -39956 -55837 -28487 -6437 6863 33177 25933 6933 11935 -3568 -788
7186 -788 -21768 -29282 -18503 -25828 -28154 -22169 -25131 -42404 -19663 -14298 -26932 -28380 -11807 -7514
7172 -7514 -8097 -13060 -13298 -11737 -18323 -17707 -14295 -12162 -939 460 -7940 -15255 -45216 -34374 -19990
7157 -19990 -2321 20680 41327 68571 43482 14174 -5746 -20764 -17271 784 3069 -2838
$$ packed form
7252e005l97P202L824M298m398r750k890o015o202J0701J4710k0326j5202J6460
7238a2990O605j2407j9511J5386j1667L242J066J5719p767k762N777q90K859J4885
7224b455J0510J741p52J8486J3143o664k1290k0146p09K4828J1786j018j2546
7211A4914l202P045P004j9981k5171J2414N261k1813n878J0919J8898l606J4842
7198A1646j8752l2850j5881K7350K2050J3300K6314p244j9000N002j5503K780
7186g88k0980p514J0779p325k326N985k962j7273K2741N365j2634j448J6573M293
7172g514n83m963k38J561o586O16L412K133J1223J399q400p315k9961J0842J4384
7157a9990J7669K3001K0647K7244k5089k9308j9920j5018L493J8055K285n907
$$ plain form
7145 -2838 -3288 -22535 -9501 -3845 -7128 -4762 -9223 -22906 -5829 3321 29726 43831 23086
7132 23086 7311 19715 23604 23993 18852 28868 19928 8633 -2852 -7149 4188 12785 11884 3697
7118 3697 6582 14863 809 -25100 -14187 -6862 -15453 -4811 -5333 -14665 -14691 601 7249 -6755
7104 -6755 7085 12213 -12334 -41284 -24472 -4101 -8505 -12904 15249 39927 11213 7755 6155
7091 6155 8983 6625 6544 8887 11971 8889 -181 -22803 -43981 -30932 -15412 -23758 -17180 -31680
7077 -31680 -38425 -37587 -28427 -15657 -6243 -19934 -47019 -82010 -59965 -39639 -9046 4451 3475
7064 3475 -4343 -6625 1969 2564 2980 9184 23783 43311 31113 23345 -8668 -6591 -7900 -7014 -10416
7049 -10416 -12218 -1019 12994 8128 -17681 -17058 -14588 7176 13929 -805 -9910 -6516 2843 6474
$$ packed form
7145b838m50j9247J3034N656l283K366m461j3683J7077R150K6405J4105k0745
7132B3086j5775J2404L889L89n141J0016q940j1295j1485m297J1337Q597r01q187
7118C697K885Q281j4054k5909J0913P325q591J0642n22r332k6J5292O648j4004
7104f755J3840N128k4547k8950J6812K0371m404m399K8153K4678k8714l458j600
7091F155K828k358q1K343L084l082r070k2622k1178J3049J5520q346O578j4500
7077c1680o745Q38R160J2770R414j3691k7085l4991K2045K0326L0593J3497r76
7064C475p818k282Q594N95M16O204J4599J9528j2198p768l2013K077j309Q86l402
7049a0416j802J1199J4013m866k5809O23K470K1764O753j4734r105L394R359L631
$$ plain form
7035 6474 13910 8198 -4673 -15239 5385 12459 12497 3236 24526 31356 36199 21909 -5434 -17769
7021 -17769 -27825 -3844 28821 23639 5705 -182 -9132 -9634 8098 9082 -2591 -27079 -27455 -741
7007 -741 -12469 -15562 -25590 -9928 -2888 -20434 -9766 18177 18186 -1098 -12807 -23706 -35450
6994 -35450 -46362 -33841 -14526 -22657 -37879 -46770 -63927 -62830 -76603 -67734 -70643 -35876 -9436
6981 -9436 -10301 2155 10088 14375 6557 7486 16644 23489 18973 1944 -22555 -25639 1962 6229
6967 6229 -37719 -46417 -25855 -937 -1376 9179 15014 9322 -9323 -6344 9839 46636 60992
6954 60992 32868 16767 10775 -21179 -26627 -44399 -52697 -70600 -50943 -32101 -7625 -15223 -20160
6941 -20160 -19359 -15721 -14785 -38740 -34057 -22168 -10642 10907 726 9756 -2251 -16686 -7297
$$ packed form
7035F474P436n712j2871j0566K0624P074L8r261K1290O830M843j4290k7343j2335
7021a7769j0056K3981L2665n182j7934n887q950n02J7732R84j1673k4488l76K6714
7007g41j1728l093j0028J5662P040j7546J0668K7943Rj9284j1709j0899j1744
6994c5450j0912J2521J9315q131j5222q891j7157J097j3773Q869k909L4767K6440
6981i436q65J2456P933M287p818R29R158O845m516j7029k4499l084K7601M267
6967F229m3948q698K0562K4918m39J0555N835n692j8645K979J6183L6797J4356
6954F0992k8124j6101n992l1954n448j7772q298j7903J9657J8842K4476p598m937
6941b0160Q01L638R36k3955M683J1889J1526K1549j0181R030j2007j4435R389
$$ plain form
6928 -7297 15034 20610 14678 20153 30297 21479 -3786 -8032 -16219 -22911 -29959 -32211 -13772 -28545
6914 -28545 -32035 -28404 -25209 -8652 -6008 -29856 -18307 -1572 -8001 -37927 -31418 -6297 14158
6901 14158 15024 -8050 -17987 -18545 -2587 16202 4139 -11297 -14652 -36768 -62574 -71669 -27371
6888 -27371 -9232 -16216 -12848 7854 25622 25187 4329 -7313 -18846 -57445 -60246 -33337 -29599
6875 -29599 -9546 14202 19372 2625 3256 -833 -1039 3586 21094 14927 4443 -5184 -6317 -21924
6861 -21924 -32355 -18938 -8290 -7062 -8598 -8039 -5624 1091 -9048 -22543 -9242 -9066 -26069
6848 -26069 -12188 19254 6670 -42542 -45618 -32110 -26383 -11572 2259 9230 14336 4123 -19643
6835 -19643 7639 541 -9632 -5074 11617 14480 5358 10219 -670 9814 -942 -14352 -5732
$$ packed form
6928g297K2331N576n932N475J0144q818k5265m246q187o692p048k252J8439j4773
6914b8545l490L631L195J6557K644k3848J1549J6735o429k9926O509K5121K0455
6901A4158Q66k3074r937n58J5958J8789j2063j5436l355k2116k5806r095M4298
6888b7371J8139o984L368K0702J7768m35k0858j1642j1533l8599k801K6909L738
6875b9599K0053K3748N170j6747O31m089k06M625J7508o167j0484r627j133j5607
6861b1924j0431J3417J0648J228j536N59K415O715j0139j3495J3301J76j7003
6848b6069J3881L1442j2584m9212l076J3508N727J4811J3831O971N106j0213k3766
6835a9643K7282p098j0173M558J6691K863r122M861j0889J0484j0756j3410Q620
$$ plain form
6822 -5732 2399 -8987 -2700 2338 22680 18579 11894 2112 3584 23549 31280 17806 -9099 -28911
6808 -28911 -36997 -18542 3717 -13251 125 6459 -9033 -15711 -21259 -22235 -25661 -24068 -795
6795 -795 343 -10800 -4261 6809 -2050 -10412 -4276 -12570 -47324 -37923 -21103 -19485 -34449 -29235
6781 -29235 -10311 -14303 1511 16347 39872 23409 7254 -34576 -40395 -24140 9606 -9950
6769 -9950 -9182 -10540 -32840 -41444 -15982 -8885 -16506 -5440 24003 50015 41950 6527 10414 3492
6755 3492 -10170 -24038 -37311 -83005 -81212 -67530 -38336 -15111 12979 10437 -15106 -12197 8334
6742 8334 8204 3377 -6981 8878 18542 19897 20963 32640 23370 7969 -3748 7069 22108
6729 22108 11325 6847 -11715 5554 16218 22880 34839 41292 23418 1635 4680 -3721 -9477
$$ packed form
6822e732Q131j1386O287N038K0342m101o685r782J472J9965P731j3474k6905j9812
6808b8911q086J8455K2259j6968J3376O334j5492o678n548r76l426J593K3273
6795g95J138j1143O539J1070q859q362O136q294l4754R401J6820J618j4964N214
6781b9235J8924l992J5814J4836K3525j6463j6155m1830n819J6255L3746j9556
6769i950P68j358k2300q604K5462P097p621J1066K9443K6012q065l5423L887o922
6755C492j3662j3868j3273m5694J793J3682K9194K3225K8090k542k5543K909K0531
6742H334j30m827j0358J5859R664J355J066J1677r270j5401j1717J0817J5039
6729B2108j0783m478j8562J7269J0664O662J1959O453j7874k1783L045q401n756
$$ plain form
6716 -9477 -5986 10797 6224 9296 3712 2160 16166 8193 17517 5149 -11966 -8397 16800 11356
6702 11356 3805 -18799 -39690 -16785 10472 1228 -8851 -8696 -13542 -20596 -20367 -28372 2145 23152
6688 23152 22845 19873 28721 8451 -4594 -10988 -842 -5110 -7522 -43115 -57894 -49197 -39420 -35824
6674 -35824 -5670 20162 24862 26003 27133 25876 52074 36025 3643 -1256 11297 9226 12065
6661 12065 -4306 11210 13057 436 -3916 7753 18449 25202 21053 -2035 -13053 -17219 -39416
6648 -39416 -35538 -22266 -7049 -21439 -12400 -3110 -26912 -37515 -58488 -61078 -40546 -53652 -75669
6635 -75669 -59169 -49877 -46743 -55624 -38320 -20641 -6978 16662 16424 12749 -14959 -6946 7641
6622 7641 -2479 352 -11346 -33067 -28133 -22609 -24338 -25318 -49346 -53407 -22751 -10577 -17744 -33499
$$ packed form
6716i477L491J6783m573L072n584j552J4006p973R324j2368j7115L569K5197n444
6702A1356p551k2604k0891K2905K7257r244j0079J55m846p054K29q005L0517K1007
6688B3152l07k972Q848k0270j3045o394J0146m268k412l5593j4779Q697R777L596
6674c5824L0154K5832M700J141J130j257K6198j6049l2382m899J2553k071K839
6661A2065j6371J5516J847j2621m352J1669J0696O753m149k3088j1018m166k2197
6648c9416L878J3272J5217j4390R039R290k3802j0603k0973k590K0532j3106k2017
6635g5669J6500R292L134q881J7304J7679J3663K3640k38l675k7708Q013J4587
6622G641j0120K831j1698k1721M934N524j729r80k4028m061L0656J2174p167j5755
$$ plain form
6608 -33499 -25422 -7768 12571 3228 3607 10668 20774 15182 3330 -17009 -32511 -27122 -22305
6595 -22305 -3158 12739 7348 -4765 -8156 -15688 -18690 -22657 -10803 7098 4190 14372 30840
6582 30840 40188 20997 3007 7205 20341 1719 -2794 -10187 -15762 -1787 12650 6876 6270
6569 6270 -4166 2912 -2829 -7320 -51353 -48751 -38505 -23744 39982 92804 80038 50129 23154
6556 23154 -2740 -36421 -22735 -36696 -53881 -54375 -34682 -16354 -27849 -41617 -31243 -22830
6544 -22830 -28877 -20788 -11556 -13578 -12461 -18814 -26521 -9169 2859 4541 -4181 16306 2989 -21135
6530 -21135 -28413 -12092 -11996 4195 8297 11118 32902 10962 -73 4428 10401 -1645 -12604
6517 -12604 -26242 -28486 -2442 1781 -7576 -11083 -5952 -28383 -17691 -22170 -19331 -13123 -26523
$$ packed form
6608c3499Q077J7654K0339r343L79P061J0106n592j1852k0339j5502N389M817
6595b2305J9147J5897n391j2113l391p532l002l967J1854J7901k908J0182J6468
6582C0840R348j9191j7990M198J3136j8622m513p393n575J3975J4437n774o06
6569F270j0436P078n741m491m4033K602J0246J4761O3726N2822j2766k9909k6975
6556B3154k5894l3681J3686j3961j7185m94J9693J8328j1495j3768J0374Q413
6544b2830o047Q089R232k022J117o353p707J7352J2028J682q722K0487j3317k4124
6530b1135p278J6321R6J6191M102K821K1784k1940j1035M501N973j2046j0959
6517a2604j3638k244K6044M223r357l507N131k2431J0692m479K839O208j3400
$$ plain form
6504 -26523 -26370 -36541 -45867 -32414 -38632 -28632 -11546 -47054 -53938 -44976 -23132 -28289 -44161
6491 -44161 -38730 -33400 -19463 17205 22443 11651 10663 -1131 -23943 -22541 -26078 -7223 -10735
6478 -10735 -18610 -25525 -22882 -11811 8768 2260 -12583 -4143 12425 4796 -19163 -48038 -70211
6465 -70211 -64495 -43291 -36527 -35708 -40162 -39556 -50569 -25477 -1841 12282 -5767 -30357 -30260 -46181
6451 -46181 -29159 -13190 -15080 -18327 -27567 -22105 -19325 -4185 -3878 -22001 -39716 -35878 -19909
6438 -19909 -19142 -10099 -4525 -12835 -18925 -6209 10216 3996 -3211 -29886 -34115 -48503 -48766 -24412
6424 -24412 -10848 -5436 2278 7507 -4029 -18618 -7967 -7352 -42582 -61029 -51853 -45552 -18013
6411 -18013 -14358 -23575 -6098 3527 -12372 -22884 -11800 -10921 -12526 12436 15086 9621 16664 29216
$$ packed form
6504b6523J53j0171r326J3453o218J0000J7086l5508o884Q962K1844n157j5872
6491d4161N431N330J3937L6668N238j0792r88j1794k2812J402l537J8855l512
6478a0735p875o915K643J1071K0579o508j4843Q440J6568p629k3959k8875k2173
6465g0211N716K1204O764Q19m454O06j1013K5092K3636J4123j8049k4590R7j5921
6451d6181J7022J5969j890l247r240N462K780J5140L07j8123j7715L838J5969
6438a9909P67R043N574q310o090J2716J6425o220p207k6675m229j4388k63K4354
6424b4412J3564N412P714N229j1536j4589J0651O15l5230j8447R176O301K7539
6411a8013L655r217J7477R625j5899j0512J1084Q79j605K4962K650n465P043J2552
$$ plain form
6397 29216 33048 33958 22280 14028 22975 36594 19728 6471 6175 -3023 -18451 -11582 -893 13397
6383 13397 2367 -12845 -17006 -10661 -94 8246 268 -4986 -16850 -36117 -47235 -26165 6092
6370 6092 16989 16499 23566 16412 11838 24516 28772 12581 22049 51385 42485 30031 16011 21149
6356 21149 3366 14537 32291 15014 -9150 -2762 -6415 -18727 -18983 -18196 -22939 -1566 -1047 8784
6342 8784 11436 12330 16664 20043 24552 2756 -25124 -7325 3402 -21124 -30772 -25887 -4193 13553
6328 13553 27451 36569 16798 -8065 -9192 -20200 -20065 -22388 -22760 -12172 -19127 -28946 -29165 -45352
6314 -45352 -33675 -45548 -14122 1122 -1263 18181 30768 36818 14918 -16136 -190 -17818
6302 -17818 -3080 5444 -15840 -30123 -13715 -1386 3925 4669 11239 29721 16816 -4985 -20348
$$ packed form
6397B9216L832R10j1678q252Q947J3619j6866j3257k96r198j5428O869J0689J4290
6383A3397j1030j5212m161O345J0567Q340p978n254j1864j9267j1118K1070L2257
6370F092J0897m90P067p154m574J2678M256j6191R468K9336q900j2454j4020N138
6356B1149j7783J1171J7754j7277k4164O388l653j2312k56P87m743K1373N19R831
6342H784K652Q94M334L379M509k1796k7880J7799J0727k4526r648M885K1694J7746
6328A3553J3898R118j9771k4863j127j1008J35k323l72J0588o955r819k19j6187
6314d5352J1677j1873L1426J5244k385J9444J2587O050k1900l1054J5946j7628
6302a7818J4738Q524k1284j4283J6408J2329N311P44O570J8482j2905k1801j5363
$$ plain form
6289 -20348 -12481 11473 34159 22422 -1748 -9801 -559 -6214 -3229 1441 -2377 -5898 -12234 -1322
6275 -1322 9512 12497 1832 -6958 3620 2031 -27103 -50120 -15549 -11076 -28033 -45322 -47800
6262 -47800 -62139 -31828 16915 32563 42574 33536 20201 -16028 -41735 -36763 -17856 4638
6250 4638 13735 6739 -2650 -11916 -11432 -14866 -19186 -28860 811 -616 -7434 -10120 -26591 -27764 -13774
6235 -13774 -7936 10809 -9170 -23027 -24497 -35406 -35711 -15869 7079 44688 59514 52279 22736
6222 22736 -8598 -16990 -484 14688 -4152 -13221 -15139 3494 26603 21302 11438 5053 -6927
6209 -6927 -8139 3277 16245 14066 -3256 -8530 -24858 -14894 -21107 -37819 -39442 -12020 -22578
6196 -22578 -18768 -19875 -43591 -61736 -26071 3312 39898 45545 4655 -958 -8341 -196 -11644
$$ packed form
6289b0348P867K3954K2686j1737k4170q053R242n655K985M670l818l521o336J0912
6275a322J0834K985j0665q790J0578j589k9134k3017L4571M473j6957j7289k478
6262d7800j4339L0311M8743J5648J0011r038j3335l6229k5707M972J8907K2494
6250D638R097o996r389r266M84l434m320r674K9671j427o818k686j6471j173J3990
6235a3774N838J8745j9979j3857j470j0909l05J9842K2948L7609J4826p235k9543
6222B2736l1334q392J6506J5172j8840r069j918J8633K3109n301r864o385j1980
6209f927j212J1416J2968k179j7322n274j6328R964o213j6712j623K7422j0558
6196b2578L810j107k3716j8145L5665K9383L6586N647m0890n613p383Q145j1448
$$ plain form
6183 -11644 -654 -3720 -8941 -9751 -21571 -14483 -17857 -16995 -16038 -12038 -16056 -13944 -9780 -10327 -19442
6168 -19442 -17840 -4896 -11028 3246 -7618 -21612 4297 16825 21445 24242 16888 7733 -27035
6155 -27035 -19350 -5058 3283 18961 30231 35496 6064 -1941 10946 35017 47393 61451 36416
6142 36416 -30477 -62884 -34982 -13455 -20795 -40341 -18971 -8122 -9975 -16200 -12383 -7627 12864
6129 12864 15849 -15684 -36040 -16079 24641 15133 6409 3042 -8646 1444 11229 16971 -3486
6116 -3486 -6616 9966 -15326 -3273 4183 -18847 -12190 3317 7805 19265 12188 1528 12595
6103 12595 11498 16245 -3262 -27252 -30468 -45264 -42804 -25370 -38881 -27422 -4487 22582 28856
6090 28856 12711 -17215 -26593 -18811 -31086 -34361 3531 11768 4380 3187 2227 -6154 -15940 -18036
$$ packed form
6183a1644J0990l066n221q10j1820P088l374Q62R57M000m018K112M164n47r115
6168a9442J602J2944o132J4274j0864j3994K5909J2528M620K797p354r155l4768
6155b7035P685J4292Q341J5678J1270N265k9432q005J2887K4071J2376J4058k5035
6142C6416o6893l2407K7902K1527p340j9546K1370J0849j853o225L817M756K0491
6129A2864K985l1533k0356J9961M0720r508q724l367j1688J0090R785N742k0457
6116c486l130J6582k5292J2053P456k3030O657J5507M488J1460p077j0660J1067
6103A2595j097M747j9507k3990l216j4796K460J7434j3511J1459K2935K7069O274
6090B8856j6145k9926r378P782j2275l275L7892Q237p388j193r60q381r786k096
$$ plain form
6076 -18036 -35575 -41796 -22614 1302 26859 12689 -19790 -30067 -4584 -3765 -14835 -25169
6064 -25169 -17119 -8860 -1052 -12222 -38732 -26157 16346 24113 9154 12454 8629 15324 49856
6051 49856 43815 21311 7829 -21643 -25649 -7351 22800 13416 -31781 -41678 -46274 -40123 -15382
6038 -15382 -5452 -10018 -14936 -9196 -4474 -39263 -11512 23015 14358 28616 34269 42188 24302
6025 24302 -12890 11191 32653 1790 -11640 -7904 -12847 -43886 -37920 -15761 1501 4459 1151
6012 1151 28165 31357 1288 13287 -3393 -5584 -24523 -1733 31126 39880 9110 -4651 -14596
5999 -14596 -595 17033 13948 1452 7192 15340 3619 -15323 -16225 -50937 -51333 -26660 -7243
5986 -7243 -7817 -19033 -26632 -21359 -7909 12979 32161 36502 40104 6817 -18982 -65157 -68987
$$ packed form
6076a8036j7539o221J9182K3916K5557j4170l2479j0277K5483Q19j1070j0334
6064b5169Q050Q259P808j1170k6510J2575M2503P767j4959L300l825O695L4532
6051D9856o041k2504j3482k9472m006J8298L0151r384m5197r897m596O151K4741
6038a5382R930m566m918N740M722l4789K7751L4527q657J4258N653P919j7886
6025B4302l7192K4081K1462l0863j3430L736m943l1039N966K2159J7262K958l308
6012A151K7014L192l0069J1999j6680k191j8939K2790L2859Q754l0770j3761r945
5999a4596J4001J7628l085j2496N740Q148j1721j8942r02l4712l96K4673J9417
5986g243n74j1216p599N273J3450K0888J9182M341L602l3287k5799m6175l830
$$ plain form
5973 -68987 -38325 -36675 -38107 -12512 -27807 -9093 -765 -15168 -5912 -12101 2296 17352 -2689
5960 -2689 1729 -11181 -29486 -51465 -64112 -48623 -20644 153 1636 -15864 -8562 -15765 -19566
5947 -19566 -7192 -2740 -10484 -8929 3504 2452 -2175 19970 23807 17157 31680 42715 29740
5934 29740 18975 2672 -22216 -19351 -12202 -3791 29729 28289 24690 16747 14842 8253 -1124 -20994
5920 -20994 -28492 -26995 -46824 -39397 -28048 -20631 6434 37269 13213 -18549 -21854 -43107 -60059
5907 -60059 -48286 -24015 -12856 8097 -21595 -43897 -36694 -55803 -43389 -20448 -7485 -10464
5895 -10464 -14409 -30805 -32569 -50487 -64582 -38440 -12739 -16936 -24226 -26383 -17434 -12285 11587
5882 11587 22934 1625 747 -2343 -23586 -16514 -2604 12108 177 -17845 -31415 -34618 -20611
$$ packed form
5973f8987L0662J650j432K5595j5295J8714Q328j4403R256o189J4397J5056k0041
5960b689M418j2910j8305k1979j2647J5489K7979K0797J483j7500P302p203l801
5947a9566J2374M452p744J555J2433j052m627K2145L837o650J4523J1035j2975
5934B9740j0765j6303k4888K865P149Q411L3520j440l599p943j905o589r377j9870
5920b0994p498J497j9829P427J1349P417K7065L0835k4056l1762l305k1253j6952
5907f0059J1773K4271J1159K0953k9692k2302P203j9109J2414K2941J2963k979
5895a0464l945j6396j764j7918j4095K6142K5701m197p290k157Q949N149K3872
5882A1587J1347k1309q78l090k1243P072J3910J4712j1931j8022j3570l203J4007
$$ plain form
5869 -20611 -25619 -21073 -1003 18068 -3274 -10093 -9142 -23526 -38423 -56479 -45319 -36514 -26689
5856 -26689 -2484 22393 10451 -10556 -18707 4372 8532 9961 7274 -12974 -23874 -35982 -28454
5843 -28454 -11945 -7366 -36556 -40966 -45098 -37237 -15900 12570 23731 17873 30647 30150 30099 26356
5829 26356 29076 28481 11128 -14213 -15397 -6544 21378 24757 14213 -6760 -7298 -13405 -17621 -15159
5815 -15159 3787 15106 -1697 -12263 -19987 -24729 -31499 -23283 -8638 -6944 -5008 4252 8114
5802 8114 -13258 -22453 -21456 -9130 -3827 -16010 -32007 -33144 -1161 15125 24210 7918 -22586
5789 -22586 -26373 -19238 -2719 70 15919 30353 29257 24564 -3391 -27035 -28160 -22486 -16262
5776 -16262 15420 17870 19662 10098 -18733 -28067 -9530 -18372 -29034 -23745 -8127 1514 14785
$$ packed form
5869b0611n008M546K0070J9071k1342o819R51j4384j4897j8056J1160Q805R825
5856b6689K4205K4877j1942k1007q151K3079M160J429k687k0248j0900j2108P528
5843b8454J6509M579k9190m410m132P861K1337K8470J1161n858J2774m97n1l743
5829B6356K720n95j7353k5341j184Q853K7922L379j0544k0973n38o107m216K462
5815a5159J8946J1319j6803j0566p724m742o770Q216J4645J694J936R260L862
5802H114k1372r195R97J2326N303j2183j5997j137L1983J6286R085j6292l0504
5789b2586l787P135J6519K789J5849J4434j096m693k7955k3644j125N674O224
5776a6262L1682K450J792r564k8831r334J8537q842j0662N289J5618R641J3271
$$ plain form
5763 14785 11341 -20026 -644 38152 48553 24143 10428 -3258 7362 20199 19443 12971 11044
5750 11044 11506 13368 11495 -832 -2095 4630 14098 30628 19035 -1041 -38624 -68555 -63162
5737 -63162 -43747 -26571 -33075 -53061 -64144 -33885 3460 -7445 -10089 7472 -8435 -18217
5725 -18217 -22489 -22178 -23172 -27739 -27918 -25738 -11458 -13356 -7699 2281 13237 -7833 -16891 -5984
5711 -5984 18094 26796 30108 45075 47568 39857 41170 47599 4551 -15221 -17957 -26196 -51845 -49209
5697 -49209 -26033 -11993 -19068 -22992 -16032 -20598 -16359 -27010 -45279 -35837 -35329 -32473 -12260 51
5683 51 2340 13309 40268 19821 17786 10537 9990 20427 12549 1674 19361 20042 -13945 -37782
5669 -37782 -11077 -2711 -8863 -17881 -11237 -14463 2085 8831 4384 -8816 -12349 -6105 -19766 -38172
$$ packed form
5763A4785l444l1367J9382L8796J0401k4410j3715j3686J0620J2837p56o472j927
5750A1044M62J862j873j2327j263O725R468J6530j1593k0076l7583k9931N393
5737f3162J9415J7176o504j9986j1083L0259L7345j0905k644J7561j5907r782
5725a8217m272L11r94m567j79K180J4280j898N657R980J0956k1070r058J0907
5711e984K4078Q702L312J4967K493p711J313O429m3048j9772k736q239k5649K636
5697d9209K3176J4040p075l924O960m566M239j0651j8269R442N08K856K0213J2311
5683E1K289J0969K6959k0447k035p249n47J0437p878j0875J7687O81l3987k3837
5669c7782K6705Q366o152r018O644l226J6548O746m447j3200l533O244j3661j8406
$$ plain form
5655 -38172 -47206 -21436 -17124 -26480 -36846 -54363 -59142 -62318 -48899 -34681 -6237 32616 34000
5642 34000 30377 36227 13952 -11000 -5519 4671 11667 9512 8985 12202 23831 490 -8279 14281
5628 14281 18549 26634 32369 49039 21915 7503 -6982 -3003 17259 -4780 -29900 -21387 17711
5615 17711 26901 28978 9753 4028 -632 3191 -9033 -15723 -799 14233 5495 -8075 -7536 -10580
5601 -10580 -16581 -4221 6759 -20486 -31938 -55738 -39135 -24963 -14031 -13423 -1382 22063
5589 22063 42970 21658 -29366 -27024 -13479 9636 2631 -675 15394 18002 18166 -4427 -28545
5576 -28545 -12854 -3486 23006 7927 -2341 553 15715 17473 -7417 -1913 11783 2868 -741
5563 -741 12016 -11196 -43144 -52988 -58083 -35133 -13328 -19178 -34585 -25468 -7575 -9215 -15266
$$ packed form
5655c8172r034K5770M312r356j0366j7517m779l176J3419J4218K8444L8853J384
5642C4000l623N850k2275k4952N481J0190O996k155n27L217J1629k3341q769K2560
5628A4281M268Q085N735J6670k7124j4412j4485L979K0262k2039k5120Q513L9098
5615A7711R190K077j9225n725m660L823j2224o690J4924J5032q738j3570N39l044
5601a0580o001J2360J0980k7245j1452k3800J6603J4172J0932O08J2041K3445
5589B2063K0907k1312n1024K342J3545K3115p005l306J6069K608J64k2593k4118
5576b8545J5691R368K6492j5079j0268K894J5162J758k4890N504J3696q915l609
5563g41J2757k3212l1948r844n095K2950K1805n850j5407R117J7893j640o051
$$ plain form
5550 -15266 5264 -11841 -27244 686 31947 30583 3531 -6761 3472 9882 17437 3320
5538 3320 -8880 9665 32544 38187 39879 31458 38180 23209 11891 19445 25602 6409 3186
5525 3186 16566 41 -11417 -4989 23625 24275 23061 21341 -13471 -33270 -26275 -27396 -612
5512 -612 491 -1350 -5477 -10156 -7812 2988 45667 53881 35747 10548 8706 19593 21729 15291
5498 15291 21595 1645 -6120 -13706 -1813 24582 6489 -27476 -43197 -41337 -35281 -49571 -61099
5485 -61099 -30493 39 -16559 -20441 -4872 5135 7713 -23970 -37902 -25025 -32055 -16448
5473 -16448 -4436 -4441 -27054 -24982 -25386 -19603 -13189 -4642 -419 -8145 -17056 -27245 -19004 9690 27633
5458 27633 22780 30133 19136 -3890 -5041 -13366 -4286 12921 5084 1128 14187 12707 -9264
$$ packed form
5550a5266K0530j7105j5403K7930L1261j364k7052j0292J0233O410P555j4117
5538C320j2200J8545K2879N643J692q421O722j4971j1318P554O157j9193l223
5525C186J3380j6525j1458O428K8614O50j214j720l4812j9799O995j121K6784
5512f12J103j841m127m679K344J0800M2679Q214j8134k5199j842J0887K136o438
5498A5291O304j9950p765p586J1893K6395j8093l3965j5721J860O056j4290j1528
5485f1099L0606L0532j6598l882J5569J0007K578l1683j3932J2877p030J5607
5473a6448J2012nk2613K072m04N783O414Q547M223p726q911j0189Q241K8694J7943
5458B7633m853P353j0997k3026j151q325R080J7207p837l956J3059j480k1971
$$ plain form
5445 -9264 3255 7212 24326 24659 584 -595 -1136 17715 8925 -14620 -32246 -39391 -25274 -11961
5431 -11961 -28156 -16239 7328 3916 -26155 -14735 -949 -31946 -45025 -29373 -22420 -15340
5419 -15340 -12106 -23948 -23839 -13209 -2884 7881 17518 22317 31234 17534 4736 -8088 -18282
5406 -18282 -20621 -4890 -7788 -5962 8000 -4186 -31097 -21924 -25179 -31328 -19647 -22239 -20713
5393 -20713 -5556 -20150 -16725 -11571 -20524 1485 36625 57788 62622 46195 41851 17744 -8589
5380 -8589 10043 23237 19525 328 -26717 -10624 6596 11569 -30913 -45492 -54719 -35744 -14328
5367 -14328 -20292 -22824 -34989 -33688 -16011 -2230 -12743 -22499 -1873 8917 -6378 5372 26218
5354 26218 21419 1208 2514 17366 18814 6503 12790 18923 21059 16548 3942 10353 9641 -3140
$$ packed form
5445i264J2519L957J7114L33k4075j179n41J8851q790k3545j7626p145J4117J3313
5431a1961j6195J1917K3567l412l0071J1420J3786l0997j3079J5652O953P080
5419a5340L234j1842J09J0630J0325J0765R637M799Q917j3700j2798j2824j0194
5406a8282k339J5731k898J826J3962j2186k6911R173l255o149J1681k592J526
5393b0713J5157j4594L425N154q953K2009L5140K1163M834j6427m344k4107k6333
5380h589J8632J3194l712j9197k7045J6093J7220M973m2482j4579r227J8975K1416
5367a4328n964k532j2165J301J7677J3781j0513r756K0626J0790j5295J1750K0846
5354B6218m799k0211J306J4852J448j2311O287O133K136m511j2606O411p12j2781
$$ plain form
5340 -3140 -1281 9684 27115 14253 -6589 -9057 -4969 -10909 26376 54206 9492 -35926 -27683
5327 -27683 -2758 11044 27400 25948 6769 1935 18797 23673 15647 10808 -1431 -13708 -32199
5314 -32199 -36421 257 9298 1270 -4095 -15222 -15291 -16727 -20697 -16876 -31150 -50070 -35477 -22669
5300 -22669 -13705 -18476 -10007 15735 21016 2261 -14585 -30856 -32139 -59256 -40411 -19519 -11530
5287 -11530 -22856 -9043 -6855 13614 17499 637 2547 29768 21751 -584 8156 13608 12153
5274 12153 8783 4461 1319 -2882 2403 9914 391 6122 8491 -6449 -11182 -12515 -11769 9924
5260 9924 8542 -12549 -17054 -21115 -16391 -11924 -3937 1485 -9737 -26590 -8113 3283 -6392 -2041
5246 -2041 -11252 3920 -1006 -36861 -39974 -42167 -45947 -39391 -346 17782 13623 15654 6371 7423
$$ packed form
5340c140J859J0965J7431j2862k0842k468M088n940L7285K7830m4714m5418Q243
5327b7683K4925J3802J6356j452j9179m834J6862M876q026m839j2239j2277j8491
5314c2199m222L6678R041q028n365j1127o9j436l970L821j4274j8920J4593J2808
5300b2669Q964m771Q469K5742N281j8755j6846j6271j283k7117J8845K0892P989
5287a1530j1326J3813K188K0469L885j6862J910K7221q017k2335Q740N452j455
5274A2153l370m322l142m201N285P511r523N731K369j4940m733j333P46K1693
5260I924j382k1091m505m061M724M467P987N422j1222j6853J8477J1396r675M351
5246b041r211J5172m926l5855l113k193l780O556L9045J8128m159K031r283J052
$$ plain form
5232 7423 16320 43802 49255 33124 42371 33615 27064 -3144 -1925 -4356 599 -2984 -6156 13064
5218 13064 21711 10323 -7015 -5554 -16259 -3968 -3470 -10513 -3506 17082 26253 7749 10138
5205 10138 -2509 19723 24758 -2647 -11543 -1242 15516 43699 30322 31495 38619 54228 67837
5192 67837 43100 7557 -19436 -24691 -22986 -24235 -5568 5757 -1964 -5076 -8245 -10124 -24716
5179 -24716 -12334 18708 23696 26169 11926 4011 4925 -14578 -15891 -5447 14672 20705 28032
5166 28032 40505 22466 17119 32098 18482 31135 28269 11991 -5307 -24849 -40815 -38492
5154 -38492 -19203 1643 16273 15054 16343 7587 13348 5099 -4739 1037 3568 -8487 3948
5141 3948 3594 -90 -17624 -10759 -13832 -28224 -45044 -46231 -24669 -3582 -14785 2076 28101
$$ packed form
5232G423Q897K7482N453j6131R247q756o551l0208J219k431M955l583l172J9220
5218A3064Q647j1388j7338J461j0705J2291M98p043P007K0588R171j8504K389
5205A0138j2647K2232N035k7405q896J0301J6758K8183j3377J173P124J5609J3609
5192F7837k4737l5543k6993n255J705j249J8667J1325p721l112l169j879j4592
5179b4716J2382L1042M988K473j4243p915R14j9503j313J0444K0119O033P327
5166B8032J2473j8039n347J4979j3616J2653k866j6278j7298j9542j5966K323
5154c8492J9289K0846J4630j219J289q756N761q249r838N776K531j2055J2435
5141C948l54l684j7534O865l073j4392j6820j187K1562K1087j1203J6861K6025
$$ plain form
5128 28101 48143 40795 29108 25704 22727 12100 3452 -4370 2511 -2238 -5372 -2976 -7865 -2212
5114 -2212 -14285 11956 12171 5096 -1442 -552 9757 -22053 -28127 -34842 -43621 -34028 -21533 8231
5100 8231 2241 -679 20670 5510 -12242 -18019 1308 40017 58126 43582 34102 27256 22220
5087 22220 11344 14170 23451 23461 8928 -6046 -12403 9101 2718 -19874 -9284 -16827 -24169 -18022
5073 -18022 -23683 -26702 -19466 -16490 -8067 -24726 -36738 2101 35020 27889 20145 -4677 -5255 -12245
5059 -12245 -25619 -27564 -21860 2574 5735 10290 13950 20696 8753 4776 17524 16147 1611
5046 1611 -13911 -31863 -30998 4415 15112 12406 -10540 -15149 5060 -7613 -4149 5007 -12867
5033 -12867 -38413 -20269 9137 11493 6607 19457 18603 10699 -10057 -25311 -10915 8792 26475
$$ packed form
5128B8101K0042p348j1687l404k977j0627q648p822O881m749l134K396m889N653
5114b212j2073K6241K15p075o538Q90J0309l1810o074o715q779R593J2495K9764
5100H231n990k920K1349j5160j7752n777J9327L8709J8109j4544r480o846n036
5087B2220j0876K826R281J0j4533j4974o357K1504o383k2592J0590p543p342O147
5073a8022n661l019P236K976Q423j6659j2012L8839L2919p131p744k4822n78o990
5059a2245j3374j945N704K4434L161M555L660O746j1943l977J2748j377j4536
5046A611j5522j7952Q65L5413J0697k706k2946m609K0209j2673L464R156j7874
5033a2867k5546J8144K9406K356m886J2850q54p904k0756j5254J4396J9707J7683
$$ plain form
5020 26475 27293 8171 29741 30508 34481 36339 37013 33768 9709 -4131 -1303 -8761 3422 22854
5006 22854 30434 31452 9035 -20418 -28440 -22752 -10327 -8041 -11436 -1565 -3073 3094 -8801 -13963
4992 -13963 4512 16173 27531 10602 -14431 -39225 -43945 -48284 -31921 -30829 -3891 -5050 -876
4979 -876 6001 -1111 -4672 -10456 4856 2753 -9868 -11286 -4069 7581 -12679 -16304 -4329 -15822
4965 -15822 -17407 -19015 -14156 -40138 -63376 -59938 -54929 -54050 -45586 -30004 -12059 1081 20414
4952 20414 25138 10812 -6408 -6268 1689 -13342 -37575 -20575 9944 23020 3949 -5354 178
4939 178 3499 12883 7390 13 1333 -8276 -15226 -29140 -25062 -15843 7383 31977 19852 24769
4925 24769 16729 22102 12070 -24412 -21388 16705 25102 14048 312 4748 -14971 -26530 -30597
$$ packed form
5020B6475Q18j9122K1570P67L973J858O74l245k4059j3840K828p458J2183J9432
5006B2854P580J018k2417k9453q022N688J2425K286l395R871j508O167j1895n162
4992a3963J8475J1661J1358j6929k5033k4794m720m339J6363J092K6938j159M174
4979h76O877p112l561n784J5312k103j2621j418P217J1650k0260l625J1975j1493
4965a5822j585j608M859k5982k3238L438N009Q79Q464J5582J7945J3140J9333
4952B0414M724j4326j7220J40P957j5031k4233J7000L0519J3076j9071r303N532
4939A78L321R384n493p377J320r609o950j3914M078R219K3226K4594j2125M917
4925B4769q040N373j0032l6482L024L8093Q397j1054j3736M436j9719j1559m067
$$ plain form
4912 -30597 -28608 -9339 272 -8291 -9845 3110 4679 36979 23658 -4027 -29210 -31747 -25820
4899 -25820 -3630 10758 20866 26403 30859 14505 16151 32143 40084 26616 16214 12954 17709
4886 17709 26446 21936 158 -9113 5005 9824 -2436 -20198 -15497 -22796 -42094 -39550 -24462
4873 -24462 -3899 16403 26461 28208 43280 49965 41671 31092 11425 -3261 13024 19178 13297
4860 13297 17354 5049 -10935 -19649 -18162 -14916 3266 12932 -4237 -13028 -13246 -12047 -24077 -4072
4846 -4072 -16949 -11230 6053 4009 22219 45394 36950 2065 -19764 -24134 -22786 8812 26073
4833 26073 11006 23103 46600 52891 50706 54100 43641 37129 19017 17126 1376 -10609 -16818
4820 -16818 -20172 -11065 2521 -4212 15523 18342 27461 42582 45961 22340 5390 6043 8455 29672
$$ packed form
4912c0597J989J9269R611q563j554J2955J569L2300j3321k7685k5183k537N927
4899b5820K2190J4388J0108N537M456j6354J646J5992P941j3468j0402l260M755
4886A7709Q737m510k1778r271J4118M819j2260j7762M701p299j9298K544J5088
4873b4462K0563K0302J0058J747J5072O685q294j0579j9667j4686J6285O154n881
4860A3297M057j2305j5984q714J487L246J8182R666j7169q791k18J199j2030K0005
4846d072j2877N719J7283k044J8210K3175q444l4885k1829m370J348L1598J7261
4833B6073j5067J2097K3497O291k185L394j0459o512j8112j891j5750j1985o209
4820a6818l354R107J3586o733J9735K819R119J5121L379k3621j6950O53K412K1217
$$ plain form
4806 29672 41720 31271 40447 33684 17126 17314 11876 -23117 -25193 -5448 -8072 -17343 -6454
4793 -6454 -11206 16591 39619 38530 27872 17314 -12290 -21406 -8955 10374 12768 19852 34534
4780 34534 28703 18169 -8651 -10801 -11729 -1738 -16165 -23655 -20182 -3786 14435 20752 3050
4767 3050 -24057 -28271 -7339 -7281 -41511 -60572 -60136 -48570 -34928 -26945 -27932 -8170 14099 16909
4753 16909 -2211 -13950 -20140 5249 16032 1952 -8385 -27143 -38871 -2129 774 -17176
4741 -17176 -4997 -10716 -17460 -7126 8348 -15953 -4721 3435 13484 36884 46860 39500 8611
4728 8611 -6884 -30153 -36077 -4666 15051 20914 7979 5352 -11302 -26026 -21941 -4845 5018
4715 5018 38225 47714 43295 19904 19249 22829 27252 31981 12736 -15042 -1219 28675 29520 16083
$$ packed form
4806B9672J2048j0449R176o763j6558J88n438l4993k076J9745k624r271J0889
4793f454m752K7797K3028j089j0658j0558k9604r116J2451J9329K394P084J4682
4780C4534n831j0534k6820k150r28R991j4427p490L473J6396J8221O317j7702
4767C050k7107m214K0932N8l4230j9061M36J1566J3642P983r87J9762K2269K810
4753A6909j9120j1739o190K5389J0783j4080j0337j8758j1728L6742K903j7950
4741a7176J2179n719o744J0334J5474k4301J1232Q156J0049K3400R976p360l0889
4728H611j5495k3269n924L1411J9717N863j2935k627j6654j4724M085J7096R863
4715E018L3207R489m419k3391o55L580M423M729j9245k7778J3823K9894Q45j3437
$$ plain form
4701 16083 21186 15756 33714 33415 -12073 -21812 -22464 -27201 -33052 -40611 -40530 -45916 -36284 -12391 19797
4686 19797 48742 53706 37955 34569 33825 9747 12386 -3086 15021 16024 8378 -7544 -1484
4673 -1484 -12855 0 28416 16240 25049 29262 7821 8432 28854 28431 21169 32226 46135
4660 46135 37773 22089 5435 39641 52278 47609 34114 16288 11875 6565 -32175 -30291 -7926
4647 -7926 1905 -6589 -22052 -21690 -5767 -18118 -38727 -16992 -2267 152 1750 5638 -1483 -3187
4633 -3187 -2383 14196 46820 71549 66759 41653 29234 10480 -580 -5207 3557 -3270 9617
4620 9617 33560 24865 29837 28732 7932 -6705 10955 6398 -15111 -27410 -37325 -35738 -36206 -13925
4606 -13925 -27953 -23402 -15083 -11114 -28736 -31449 -17351 19736 6990 -27374 -35143 -29551 -24718
$$ packed form
4701A6083N103n430J7958k99m5488r739o52m737n851p559Q1n386R632K3893L2188
4686A9797K8945M964j5751l386p44k4078K639j5472J8107J003p646j5922O060
4673a484j1371J2855K8416j2176Q809M213k1441O11K0422m23p262J1057J3909
4660D6135q362j5684j6654L4206J2637m669j3495j7826m413n310l8740J884K2365
4647g926R831q494j5463L62J5923j2351k0609K1735J4725K419J598L888p121j704
4633c187Q04J6579L2624K4729m790k5106j2419j8754j1060m627Q764o827J2887
4620I617K3943q695M972j105k0800j4637J7660m557k1509j2299r915J587m68K2281
4606a3925j4028M551Q319L969j7622k713J4098L7087j2746l4364p769N592M833
$$ plain form
4593 -24718 -15561 -688 3017 1566 -3493 -5109 -17696 -13118 8885 12437 18459 9572 15017 12239
4579 12239 6556 -14630 -9852 34218 70903 70144 22642 -1813 -2528 895 -8470 -10928 23 5407
4565 5407 -3782 -32516 -15072 -3014 -18571 -17309 -5644 5961 4228 15096 26870 18307 15029
4552 15029 10547 8051 3806 -7036 -36184 -59000 -29358 -4201 -19578 -28474 -25888 -21062 -13380
4539 -13380 -14428 12185 23961 32758 50221 60259 47277 24069 29173 42273 33996 30271 30719
4526 30719 23417 47240 19575 10883 22687 22744 9639 20780 11673 9897 26551 26836 7487 -11314
4512 -11314 -33235 -39935 -19828 -6195 937 6519 -121 14152 17020 5698 11897 -10891 -32393
4499 -32393 -45826 -38860 -34179 -45250 -67682 -78955 -49375 -27705 -25044 -17298 6077 17646 17497
$$ packed form
4593b4718R157J4873L705j451n059j616j2587M578K2003L552O022q887N445k778
4579A2239n683k1186M778M4070L6685p59m7502k4455p15L423r365k458J0951N384
4565E407r189k8734J7444J2058j5557J262J1665J1605j733J0868J1774q563l278
4552A5029m482k496m245j0842k9148k2816K9642K5157j5377q896K586M826P682
4539a3380j048K6613J1776Q797J7463J0038j2982k3208N104J3100q277l725M48
4526C0719p302K3823k7665q692J1804N7j3105J1141r107j776J6654K85j9349j8801
4512a1314k1921o700K0107J3633P132N582o640J4273K868j1322O199k2788k1502
4499c2393j3433O966M681j1071k2432j1273K9580K1670K661P746K3375J1569j49
$$ plain form
4486 17497 28482 22538 -829 -24987 -18483 -21293 -13007 -5765 -5564 -2070 -6471 -16530 -14851 -24268
4472 -24268 -34560 -26151 -29477 -49527 -50143 -35384 -502 25857 -11921 -19394 -4491 1878 5689
4459 5689 21790 20477 2313 -17582 -1964 -4643 -10019 -9777 -13325 -25215 -30586 -30891 -23785 8436
4445 8436 45371 -1367 -37197 -16806 -1585 1331 -8130 34190 54710 50402 34140 20201 42526
4432 42526 34973 40900 32737 21253 24554 52262 48881 50234 42330 43615 46059 40896 15275 -15841
4418 -15841 -15142 13560 27479 25165 -2662 -26034 -15134 -7434 -5978 -24617 -17048 -4396 -14336
4405 -14336 -20916 -12608 -8127 4032 -2839 -25132 -19714 6738 18036 3607 -15941 -20784 -14557
4392 -14557 30807 63423 57419 47335 42941 38136 -2285 2723 37179 41449 14409 16245 20010
$$ packed form
4486A7497J0985n944k3367k4158O504k810Q286P242K01L494m401j0059J679r417
4472b4268j0292Q409l326k0050o16J4759L4882K6359l7778p473J4903O369L811
4459E689J6101j313j8164j9895J5618k679n376K42l548j1890n371l05P106L2221
4445H436L6935m6738l5830K0391J5221K916r461M2320K0520m308j6262j3939K2325
4432D2526p553N927q163j1484L301K7708l381J353p904J285K444n163k5621l1116
4418a5841O99K8702J3919k314k7827k3372J0900P700J456j8639P569J2652r940
4405a4336o580Q308M481J2159o871k2293N418K6452J1298j4429j9548m843O227
4392a4557M5364L2616o004j0084m394m805m0421N008L4456M270k7040J836L765
$$ plain form
4379 20010 16098 -11987 -22968 -8895 -21865 -5768 7946 13116 6109 254 25947 36234 27343
4366 27343 21537 28740 23131 5537 -29557 -32224 -17833 -67 15437 21568 22209 19033 13656 4031
4352 4031 -1623 -19375 -22198 -10776 5807 12224 22246 13606 -25915 -40240 -29008 -616 7099
4339 7099 -23186 -21531 -31191 -39191 -33447 -7864 7926 -3576 -11943 -7743 -2642 -14287 -27816
4326 -27816 -39344 -22031 -6084 -2501 -1510 2740 -4348 -17960 -12547 3433 -5563 8176 15226
4313 15226 25143 22381 6714 -408 22266 7757 -3734 -3488 -2167 1784 20458 11661 -8457
4300 -8457 -15234 -37925 -62056 -55821 -52815 -32137 -20603 -38005 -28745 -32465 -28185 -14500 -14518 20883
4286 20883 25234 30150 15402 15843 20398 31259 11398 -16925 -8943 -2349 -23862 -19641 -37023
$$ packed form
4379B0010l912k8085j0981J4073j2970J6097J3714N170p007n855K5693J0287q891
4366B7343n806P203n609j7594l5094k667J4391J7766J5504O131O41l176n377r625
4352D031n654j7752k823J1422J6583O417J0022q640l9521j4325J1232K8392P715
4339G099l0285J655r660q000N744K5583J5790j1502q367M200N101j1645j3529
4326b7816j1528J7313J5947L583R91M250p088j3612N413J5980q996J3739P050
4313A5226R917k762j5667p122K2674j4509j1491K46J321L951J8674q797k0118
4300h457o777k2691k4131O235L006K0678J1534j7402R260l720M280J3685j8L5401
4286B0883M351M916j4748M41M555J0861j9861k8323P982O594k1513M221j7382
$$ plain form
4273 -37023 -54689 -49364 -23650 -3122 13393 -1933 3485 18914 2235 -18248 -22109 -13031 -34582
4260 -34582 -46177 -44507 -20730 -2695 -168 -1171 7412 -7908 -21724 -52458 -28179 -7856 -10966
4247 -10966 -28784 -37599 -50084 -53790 -25502 -9546 3792 8058 -7764 -2794 -11231 -14863 -11175
4234 -11175 -8387 -3585 13085 -1047 -6008 -3480 -4074 -9963 -3669 -9837 3969 25886 39467 40025
4220 40025 15110 -7870 -11149 4518 18383 22726 18585 -3583 12700 13530 16076 58468 81761
4207 81761 82075 65981 69258 47364 2804 7106 20897 9764 11257 25486 9241 1270 -14157
4194 -14157 -40461 -35489 -38600 -45685 -27470 -9610 -31871 -10585 -662 -2538 -10742 16587 12219
4181 12219 11110 24955 9967 3977 6571 -2648 -10741 -13262 -16997 2719 21 -8281 1439 4574
$$ packed form
4273c7023j7666N325K5714K0528J6515j5326N418J5429j6679k0483l861R078k1551
4260c4582j1595J670K3777J8035K527j003Q583j5320j3816l0734K4279K0323l110
4247a0966j7818q815j2485l706K8288J5956J3338M266j5822M970q437l632L688
4234a1175K788M802J6670j4132m961K528n94n889O294o168J3806K1917J3581N58
4220D0025k4915k2980l279J5667J3865M343m141k2168J6283Q30K546M2392K3293
4207H1761L14j6094L277k1894m4560M302J3791j1133J493J4229j6245p971j5427
4194a4157k6304M972l111p085J8215J7860k2261K1286R923j876q204K7329m368
4181A2219j109J3845j4988n990K594r219q093k521l735J9716k698q302R720L135
$$ plain form
4167 4574 37070 20501 4698 12205 -2005 -773 962 11705 11208 6136 -23862 -34607 -372
4154 -372 12749 -808 -11635 -4167 7191 7362 8761 -4649 -10901 -10580 -7070 -13042 -35776 -13399
4140 -13399 11473 13583 19983 27955 -2004 -29755 -27100 -7405 2842 -8678 -17588 -13628 -13916
$$ packed form
4167D574L2496j6569j5803P507j4210J232J735J0743m97n072k9998j0745L4235
4154c72J3121j3557j0827P468J1358J71J399j3410o252L21L510n972k2734K2377
4140a3399K4872K110O400P972k9959k7751K655J9695J0247j1520q910L960k88
$$ [...]
##END NTUPLES=NMR SPECTRUM
##END=
