##TITLE=Analysis number 324038
Compound Code mo 07847
Project Code adrs
Chemist Name fudan
##JCAMPDX= 6.0         $$ Bruker NMR JCAMP-DX V2.0
##DATA TYPE= NMR SPECTRUM
##DATA CLASS= NTUPLES
##ORIGIN= Bruker BioSpin GmbH
##OWNER= nmr
$$ XWIN-NMR		Version 3.5
$$ Tue Nov 14 09:08:33 2006 GMT Standard Time (UT+0h)  MAYBRIDGE\nmr@NMR_250MHZ
##.OBSERVE FREQUENCY= 250.131544655141
##.OBSERVE NUCLEUS= ^1H
##.ACQUISITION MODE= SIMULTANEOUS (DQD)
##.ACQUISITION SCHEME= undefined
##.AVERAGES= 16
##.DIGITISER RES= 18
##SPECTROMETER/DATA SYSTEM= dpx250
##.PULSE SEQUENCE= zg30
##.SOLVENT NAME= CDCl3
##.SHIFT REFERENCE= (INTERNAL, CDCl3, 0, 16.4553)
##AUDIT TRAIL= $$ (NUMBER, WHEN, WHO, WHERE, WHAT)
$$ ##TITLE= Audit trail, XWIN-NMR		Version 3.5
$$ ##JCAMPDX= 5.01
$$ ##ORIGIN= Bruker BioSpin GmbH
$$ ##OWNER= nmr
$$ C:\u/data/dgb/nmr/ADRS/70/pdata/1/auditp.txt
$$ ##AUDIT TRAIL=  $$ (NUMBER, WHEN, WHO, WHERE, WHAT)
(   1,<2006-11-14 09:08:10.12 +000>,<MAYBRIDGE\nmr>,<NMR_250MHZ>,
      <created by zg, POWCHK disabled, PULCHK disabled
       configuration hash MD5:
       49 4B E0 1D 92 C2 6B 37 9F E6 65 BC 52 41 86 1D
       data hash MD5: 64K
       71 FE 23 46 7E 4D 40 14 2D CF F0 32 E8 84 DA 8F>)
(   2,<2006-11-14 09:08:23.00 +000>,<MAYBRIDGE\nmr>,<NMR_250MHZ>,
      <Start of raw data processing
       ef LB = 0.3 FT_mod = 6 PKNL = 1 SI = 32K 
       data hash MD5: 32K
       B8 1C EC F6 AD BC 3E 33 54 F3 FF 72 62 A5 D0 5A>)
(   3,<2006-11-14 09:08:24.62 +000>,<MAYBRIDGE\nmr>,<NMR_250MHZ>,
      <apk 
       data hash MD5: 32K
       E5 EC 0B 64 D4 74 8E 81 AE 09 C7 0B 3D BF 60 56>)
(   4,<2006-11-14 09:08:25.37 +000>,<MAYBRIDGE\nmr>,<NMR_250MHZ>,
      <abs ABSG = 5 
       data hash MD5: 32K
       45 87 98 EB 13 F4 2C B3 BA 97 22 57 BD CA D9 6A>)
$$ ##END=
$$ 
$$ hash MD5
$$ 1F D6 B7 D7 CA C0 CF E1 C3 F7 FB B8 BA BE 66 0F
##$RELAX= 
##$RELAX= 
##$RELAX= 
##$RELAX= 
##$RELAX= 
##$RELAX= 
##$RELAX= 
$$ Bruker specific parameters
$$ --------------------------
##$DU= <C:\u>
##$EXPNO= 70
##$NAME= <ADRS>
##$PROCNO= 1
##$TYPE= <nmr>
##$USER= <dgb>
##$AMP= (0..31)
100 100 100 100 100 100 100 100 100 100 100 100 100 100 100 100 100 100 
100 100 100 100 100 100 100 100 100 100 100 100 100 100 
##$AQSEQ= 0
##$AQ_mod= 3
##$AUNM= <au_zg>
##$AUTOPOS= <8 >
##$BF1= 250.13
##$BF2= 250.13
##$BF3= 250.13
##$BF4= 250.13
##$BF5= 500.13
##$BF6= 500.13
##$BF7= 500.13
##$BF8= 500.13
##$BYTORDA= 1
##$CFDGTYP= 0
##$CFRGTYP= 5
##$CHEMSTR= <none>
##$CNST= (0..31)
1 1 145 1 1 1 1 1 1 1 1 1 1 1 1 1 1 1 1 1 1 1 1 1 1 1 1 1 1 1 1 1 
##$CPDPRG= <>
##$CPDPRG1= <>
##$CPDPRG2= <>
##$CPDPRG3= <>
##$CPDPRG4= <mlev>
##$CPDPRG5= <mlev>
##$CPDPRG6= <mlev>
##$CPDPRG7= <mlev>
##$CPDPRG8= <mlev>
##$CPDPRGB= <>
##$CPDPRGT= <>
##$D= (0..31)
0 1 0 0 0 0 0 0 0 0.06 0 0 0 0 0 0 0.0002 0 0 0 0 0 0 0 0 0 0 0 0 0 0 
0 
##$DATE= 1163495288
##$DBL= (0..7)
120 120 120 120 120 120 120 120 
##$DBP= (0..7)
150 150 150 150 150 150 150 150 
##$DBP07= 0
##$DBPNAM0= <>
##$DBPNAM1= <>
##$DBPNAM2= <>
##$DBPNAM3= <>
$$ [...]
##$SUBNAM8= <"">
##$SUBNAM9= <"">
##$SW= 20.6930455092707
##$SWIBOX= (0..15)
0 0 3 0 0 0 0 0 0 0 0 0 0 0 0 0 
##$SW_h= 5175.983436853
##$TD= 65536
##$TD0= 1
##$TE= 683.16
##$TE2= 300
##$TE3= 300
##$TEG= 300
##$TL= (0..7)
0 120 120 120 120 120 120 120 
##$TP= (0..7)
150 150 150 150 150 150 150 150 
##$TP07= 0
##$TPNAME0= <>
##$TPNAME1= <>
##$TPNAME2= <>
##$TPNAME3= <>
##$TPNAME4= <>
##$TPNAME5= <>
##$TPNAME6= <>
##$TPNAME7= <>
##$TPOAL= (0..7)
0.5 0.5 0.5 0.5 0.5 0.5 0.5 0.5 
##$TPOFFS= (0..7)
0 0 0 0 0 0 0 0 
##$TUNHIN= 0
##$TUNHOUT= 0
##$TUNXOUT= 0
##$USERA1= <user>
##$USERA2= <user>
##$USERA3= <user>
##$USERA4= <user>
##$USERA5= <user>
##$V9= 5
##$VALIST= <valist>
##$VCLIST= <CCCCCCCCCCCCCCC>
##$VD= 0
##$VDLIST= <DDDDDDDDDDDDDDD>
##$VPLIST= <PPPPPPPPPPPPPPP>
##$VTLIST= <TTTTTTTTTTTTTTT>
##$WBST= 1024
##$WBSW= 4
##$XGAIN= (0..3)
0 0 0 0 
##$XL= 0
##$YL= 0
##$YMAX_a= 457141
##$YMIN_a= -313957
##$ZGOPTNS= <>
##$ZL1= 120
##$ZL2= 120
##$ZL3= 120
##$ZL4= 120
##$ABSF1= 16.45526
##$ABSF2= -4.237913
##$ABSG= 5
##$ABSL= 3
##$ALPHA= 0
##$AQORDER= 0
##$ASSFAC= 0
##$ASSFACI= 0
##$ASSFACX= 0
##$ASSWID= 0
##$AUNMP= <proc_1d>
##$AZFE= 0.1
##$AZFW= 0.1
##$BCFW= 0
##$BC_mod= 0
##$BYTORDP= 0
##$COROFFS= 0
##$CY= 12.5
##$DATMOD= 1
##$DC= 0
##$DFILT= <>
##$DTYPP= 0
##$F1P= 14.0000005364418
##$F2P= -0.99999901652339
##$FCOR= 0.5
##$FTSIZE= 32768
##$FT_mod= 6
##$GAMMA= 0
##$GB= 0
##$INTBC= 1
##$INTSCL= 1
##$ISEN= 128
##$LB= 0.3
##$LEV0= 0
##$LPBIN= 0
##$MAXI= 10000
##$MC2= 0
##$MEAN= 0
##$ME_mod= 0
##$MI= 0
##$NCOEF= 0
##$NC_proc= -5
##$NLEV= 6
##$NOISF1= 0
##$NOISF2= 0
##$NSP= 0
##$NTH_PI= 0
##$NZP= 0
##$OFFSET= 16.45526
##$PC= 1
##$PHC0= -48.97474
##$PHC1= 25.73808
##$PH_mod= 1
##$PKNL= yes
##$PPARMOD= 0
##$PSCAL= 4
##$PSIGN= 0
##$REVERSE= no
##$SF= 250.130016693043
##$SI= 32768
##$SIGF1= 0
##$SIGF2= 0
##$SINO= 400
##$SIOLD= 32768
##$SREGLST= <1H.CDCl3>
##$SSB= 0
##$STSI= 32768
##$STSR= 0
##$SW_p= 5175.98343685301
##$SYMM= 0
##$S_DEV= 0
##$TDeff= 65536
##$TDoff= 0
##$TI= <Analysis number 999999
Compound Code 99
Book Reference 9
Project Code 9>
##$TILT= no
##$TM1= 0
##$TM2= 0
##$TOPLEV= 0
##$USERP1= <user>
##$USERP2= <user>
##$USERP3= <user>
##$USERP4= <user>
##$USERP5= <user>
##$WDW= 1
##$XDIM= 32768
##$YMAX_p= 390894759
##$YMIN_p= -1066859
$$ End of Bruker specific parameters
$$ ---------------------------------
##NTUPLES= NMR SPECTRUM
##VAR_NAME=  FREQUENCY,     SPECTRUM/REAL,   SPECTRUM/IMAG
##SYMBOL=    X,             R,               I
##VAR_TYPE=  INDEPENDENT,   DEPENDENT,       DEPENDENT
##VAR_FORM=  AFFN,          ASDF,            ASDF
##VAR_DIM=   32768,         32768,           32768
##UNITS=     HZ,            ARBITRARY UNITS, ARBITRARY UNITS
##FACTOR=    0.157963299565203, 1,           1
##FIRST=     4115.95428918039, 0,            0
##LAST=      -1060.02914767262, 0,           0
##MIN=       -1060.02914767262, -1066859,    0
##MAX=       4115.95428918039, 390894759,    0
$$ Real data points
##PAGE= N=1
##DATA TABLE= (X++(R..R)), XYDATA
$$ [...]
27533E3464j70657k21348j75332O4008J52821j31832J8823K63512M7759J10824
27523A2042l9051M2923r6315K4504J24979o6149k49960K70821l7906o8589J11038
27512B8337M2655K43832n0767l92975l31435L89614L07725N8146r8562k42780
27502d6210k45301j51478J0668M06387L92281k19966k54342J39306J59033l2846
27492A57532j68408l2124J27552O5064q0990j95473J11958j03900M7796J79706
27482A08713K5412j82147J52900n4682j31318J25978K76246p7156j01213j51992
27472i259l30530p6578N00697J23352k21918l92270j78916R2879J2355j2107K31282
27461b61013J79597R189k66374q2331r951L45230J88287k6666m2152j04241J86690
$$ plain form
27533 53464 -117193 -338541 -513873 -449865 -297044 -428876 -410053 -146541 -98782 12042
27523 12042 -27009 15914 -80401 -55897 69082 2933 -247027 23794 -14112 -82701 28337
27512 28337 70992 314824 264057 -128918 -460353 -70739 236986 295132 196570 -46210
27502 -46210 -291511 -442989 -432321 -25934 366347 146381 -107961 31345 190378 157532
27492 157532 -10876 -43000 84552 149616 68626 -126847 -14889 -118789 -70993 108713
27482 108713 134125 -48022 104878 50196 -81122 44856 321102 243946 142733 -9259
27472 -9259 -339789 -416367 84330 207682 -14236 -406506 -585422 -492543 -480188 -492295 -261013
27461 -261013 -81416 -72227 -338601 -420932 -430883 -85653 102634 75968 33816 -70425 116265
27450A16265J21800m9487r0639N4312N4271r4824k4743j72927l6792P8045J16218
27439G1499R4385k12804j28930K94460Q9349o9171Q6658P2570n6429k4593j32991
27428H4003k27221N4936L0599J54231J40005j43196k93043J51344P5905k60105
27418b32542j98907K71694l8379j20206J96979L9913l5147J74974M1611J22598
27408B22588k61829m012J26415j58315k8912n7300N2392j3247j26343j01780L6915
27397c13428K4937l0700l6849J27019k08858m7790K7714r7534m3157K4996J33189
27386d40461K63767K11061M25194p456k56061j50154N2564L51316K5741l11789
27376A63722p6967N0609j71305l22245k68115J55960K13264J34892l33925k18203
$$ plain form
27450 116265 238065 188578 97939 152251 206522 111698 86955 -85972 -122764 -44719 71499
27439 71499 165884 -46920 -175850 118610 207959 138788 225446 298016 241587 216994 84003
27428 84003 -143218 -88282 -57683 96548 236553 93357 -199686 -48342 27563 -232542
27418 -232542 -431449 -159755 -198134 -318340 -121361 -81448 -116595 58379 99990 222588
27408 222588 -39241 -43253 83162 -75153 -104065 -161365 -108973 -122220 -248563 -350343 -313428
27397 -313428 -288491 -319191 -356040 -229021 -437879 -485669 -457955 -555489 -598646 -573650 -440461
27386 -440461 -176694 34367 459561 452105 196044 45890 98454 449770 475511 163722
27376 163722 86755 137364 -33941 -356186 -624301 -468341 -255077 -120185 -454110 -672313
27366f72313J93904K9597o4611M5847N9299k40270R1628J46704J70664j50936
27356c90487J03597J67845J52358J6678K4689J1188O8937K28791R3138k36572
27346B40162o8581k13227l43604L0326p7270o3911P910L60918J57213j29569l000
27335a02633Q1463J36737J05463L5001j08218j77134j08671Q0651J2226l0159
27325g5274K71238k14654k45585r091M8751o9694n2356L44478L75422o5697j30866
27314A76672R3959j66507O7814K71230k66213j15549J20929O8957l1153j47902
27304G2237Q1271j19175r3276k72772K16160M66484L6325Q1042k86839j86843
27294e386p7519j94764J5492k05472J35364K57244r5755l2347N011n3172J24454
$$ plain form
27366 -672313 -478409 -448812 -513423 -467576 -408277 -648547 -556919 -410215 -239551 -390487
27356 -390487 -286890 -119045 33313 49991 74680 85868 154805 383596 476734 240162
27346 240162 171581 -41646 -385250 -354924 -432194 -496105 -488195 -127277 29936 -99633 -102633
27335 -102633 -21170 115567 221030 256031 147813 -29321 -137992 -57341 -45115 -75274
27325 -75274 195964 -18690 -264275 -273366 -224615 -294309 -346665 -2187 373235 307538 176672
27314 176672 270631 104124 171938 443168 176955 61406 182335 251292 220139 72237
27304 72237 153508 34333 -58943 -331715 -115555 350929 387254 468296 181457 -5386
27294 -5386 -82905 -277669 -262177 -467649 -332285 -75041 -170796 -203143 -198132 -251304 -126850
27283a26850k2057L7950J27571k22567q4106J0448M0030J1704J98752M8809k48962
27272b29278k4253J73254l086p6774K13079J7967j28195j14257J34615L14350
27262B77422M3263j25352j0824j09959k60274j54166j8416O3088K03058K76020
27252A83860m6782O196J6277J80909k69514m31604j93097N8186K67156L16664
27242H8251n9266L8439n6523j01140K08354m7534k21377Q7767l6172J50985J76832
27231B28616k01583j03976j9960j24602j13296M53831O6248k8789P0041R437j55565
27220H0402l017K7641j17326l1803N3574P058j16556j58623J963m5196n7378j34347
27208d93608j04968K06669L38058k8769q7967J89525J04998n2794j21303j03141
$$ plain form
27283 -126850 -148907 -110957 16614 -205953 -290059 -279611 -239581 -227877 -29125 19684 -229278
27272 -229278 -253531 -80277 -83363 -160137 52942 70909 -57286 -171543 -36928 277422
27262 277422 320685 195333 184509 74550 -185724 -339890 -358306 -295218 -92160 183860
27252 183860 137078 143274 159551 340460 70946 -360658 -553755 -495569 -228413 88251
27242 88251 28985 67424 10901 -90239 118115 70581 -150796 -63029 -99201 51784 228616
27231 228616 27033 -76943 -96903 -221505 -334801 119030 185278 156489 226530 235967 80402
27220 80402 77385 105026 -12300 -44103 9471 16529 -100027 -258650 -256687 -301883 -359261 -493608
27208 -493608 -598576 -391907 -53849 -82618 -170585 18940 123938 71144 -50159 -153300
27198a53300L812o2404O7288K70955k2305r7450k04627q8443J8276J32842j22049
27187b57405N6531J79808j77531L9419L80998k51758k80835o7344j19503N1162
27177d46458j17740O5818J70469m7489J78981K92996J85201J77809j31601j49730
27167A78256k23819j49673J75304J23027p8933j25058P335J16712J93824j68492
27157D8483R9838L11888k19921q9968R6025Q0207O0799K07811K07806k03408m35640
27146A63920l03614o4222J29712J08010j2909k27662k1836Q6077k7780K58386
27136H8082N0449j92230l05978Q0834J08325q9417O0492J55550Q8054j1415K76500
27125C09246L353l64216k6309K53794m4970j58758k62675j46709K17331R0244
$$ plain form
27198 -153300 -149488 -211892 -144604 126351 104046 6596 -198031 -286474 -268198 -135356 -257405
27187 -257405 -200874 -21066 -198597 -159178 221820 -29938 -310773 -378117 -497620 -446458
27177 -446458 -564198 -498380 -327911 -375400 -196419 96577 281778 459587 327986 178256
27167 178256 -45563 -195236 -19932 103095 24162 -100896 -93561 23151 216975 48483
27157 48483 148321 460209 240288 150320 246345 326552 387351 595162 802968 599560 163920
27146 163920 -139694 -203916 -74204 33806 20897 -206765 -228601 -142524 -170304 88082
27136 88082 138531 -53699 -359677 -278843 -170518 -259935 -199443 -43893 44161 32746 309246
27125 309246 312599 -51617 -77926 175868 130898 -27860 -290535 -437244 -219913 -129669
27115a29669J42627j3653J34356K13448k77090l66175j40579J22414L28514r3796
27105g9603j97240K69689K90950p7102l25465j36635J51290J70821K04788j01633
27095A69860K35418k7332j34213l0167N5257l24063M3401J45246r6617j4607j5361
27084F822O0357J39132k06916j32216K2574J10784N6760j05645k22722J43541
27074a27529n0332p333J70409L42859J46217O5300l7323k07492k71454o6017k9146
27063g1841k46538j19685K8525J94520J07610O4639k0535K25337J4399j97495
27053b1064j57953L34876K77418k27143j61616J35428o7090j40320N236M436L17425
27042B99633O6299k0381j60798j54522P5413l3300m5074o5744l0493K1607L9769
$$ plain form
27115 -129669 12958 -695 133661 347109 70019 -296156 -436735 -314321 14193 -79603
27105 -79603 -276843 -7154 283796 206694 -118771 -255406 -104116 66705 271493 169860
27095 169860 405278 377946 243733 213566 268823 -55240 -11839 133407 36790 22183 6822
27084 6822 67179 206311 -605 -132821 -110247 537 57297 -48348 -271070 -127529
27074 -127529 -177861 -185194 -14785 328074 474291 539591 502268 294776 23322 -42695 -71841
27063 -71841 -318379 -438064 -409539 -215019 -107409 -42770 -63305 162032 176431 -21064
27053 -21064 -179017 155859 433277 206134 44518 179946 112856 -27464 -22228 -17792 299633
27042 299633 365932 345551 184753 30231 105644 72344 27270 -38474 -68967 -47360 -7591
27031g591J38572k54751J58164R1641l9192J88363M9349j16673n8395j75014J07528
27020H2001r3900n7839k76865l27099L0099n805L16297M2659j7342q7210p5841
27009d70845L30503L80801o5722m9846k14503L80132N4944R6395k27911p3698
26999A40250j0074J68677J51238J41270J94898L8542l44827j42913j59286J14019
26989B91794N5012o7167m98334R2747K33174J91255k34090R0013L927L983j17596
26978D4718k6235J16913j88075j95285K51168J81838J17515O4982p699j96227
26968A63613n2736k19534m24125P4481M50761J24385j27826Q7264j8418q6913
26958b9048J76172m0984m12871p8037L17819R3167j26239J32341M12991p6936
$$ plain form
27031 -7591 130981 -123770 34394 126035 86843 275206 324555 207882 149487 -25527 82001
27020 82001 -11899 -69738 -346603 -673702 -643603 -649408 -333111 -290452 -307794 -395004 -470845
27009 -470845 -140342 240459 174737 124891 -89612 290520 345464 441859 213948 140250
26999 140250 130176 298853 450091 591361 786259 824801 479974 337061 177775 291794
26989 291794 346806 279639 -218695 -125948 107226 298481 64391 154404 158331 162314 44718
26978 44718 18483 135396 -52679 -247964 3204 185042 302557 367539 359840 163613
26968 163613 110877 -108657 -532782 -458301 -7540 116845 -10981 76283 57865 -29048
26958 -29048 147124 106140 -306731 -384768 -66949 26218 -100021 32320 445311 368375
26948C68375j72616J993l71327O0611J66257J01223N6182L8031K32453L894l49469
26937A35607k02375k51878R7735P3833j00174O876O0988j1273R3551o0801o475
26926a64386J09847J00743o3625k71365J181o5650K4085K68831J34208l21143
26916b47274r5886j2707M4778j07182J05323J74118n2696M9141j49251j03024
26906c94660M5538O5016r4918K32523J90653K45575K57527J29729j29170r9773
26896D48040L2482j21676j54772j74207k56342j20970J27870K22593K06010k47115
26886c8087k9792J88057k50707N2839J66896L442k76367m387o0653K3977J63567
26875f1215J25852j37027j29471l6170J58762R2594n3920l53153K17230J23688
$$ plain form
26948 368375 195759 197752 -173575 -112964 53293 154516 210698 248729 481182 485076 135607
26937 135607 -66768 -318646 -220911 -147078 -247252 -240376 -179388 -190661 -97110 -157911 -164386
26926 -164386 -54539 46204 -17421 -288786 -287605 -353255 -329170 -60339 73869 -247274
26916 -247274 -343160 -355867 -311089 -418271 -312948 -138830 -191526 -142385 -291636 -394660
26906 -394660 -349122 -284106 -379024 -146501 44152 289727 547254 676983 547813 448040
26896 448040 480522 358846 204074 29867 -226475 -347445 -219575 3018 209028 -38087
26886 -38087 -67879 120178 -130529 -77690 89206 92648 -183719 -188106 -248759 -224782 -61215
26875 -61215 64637 -72390 -201861 -238031 -79269 13325 -40595 -393748 -176518 -52830
26865e2830M8913q4889O8256p3194j38222j78573M2750K34975J28001k71537k63284
26854e39634K3466K89305M540j92834J62637K81614m7368k0972k01395m6151k2920
26843c09712J6867K05599K0246P9153k92825q1870J42903J7166m9435j26683j83897
26832e62488j23716J49101J13275K32246L88083O3334l09206R1137K55264P9621
26822C76651j92592m11813l0325K10608P6166J74855K00073k44595j74821J59173
26812A43380O1071J15903m3795j94773O6884K48547K21988M2778m77471n8379
26802A26133M7810M6170J03744P4362j68220l31837J655K58524r9327j57261l7741
26791a35988K09751q2984l59152j06339K51139k01998M2022M54077K27419l21641
$$ plain form
26865 -52830 -3917 -88806 -20550 -93744 -231966 -410539 -367789 -132814 -4813 -276350 -539634
26854 -539634 -516168 -226863 -222323 -415157 -252520 29094 -18274 -39246 -240641 -286792 -309712
26843 -309712 -292845 -87246 -67000 12153 -280672 -362542 -219639 -202473 -251908 -378591 -562488
26832 -562488 -686204 -537103 -423828 -191582 196501 259835 -49371 41766 297030 376651
26822 376651 184059 -227754 -258079 -47471 28695 203550 403623 159028 -15793 143380
26812 143380 204451 320354 276559 81786 148670 397217 619205 661983 184512 126133
26802 126133 173943 220113 323857 398219 229999 -101838 -100183 158341 59014 -98247 -135988
26791 -135988 73763 -9221 -368373 -474712 -223573 -425571 -383549 70528 297947 -23694
26781b3694K4120K87790k05097N3801r3241j87571k15384P6744K18208J0291l4780
26770h8813P0443K08132o7281j47543K30258j06685J09121k75187n4420j81060
26760c03035l47174J5275L27579K49542j1440J9801J52207N8786k77951j90760
26750c07170j29613L62977K18193n118J80511o298J98437R6830k63162j27930
26740B17657r8839r3510j59682o4710J31327O8202J0530J84631k3985M4371j74618
26729D1374j28698j47763j17002O5635J81761R2823k33325r5727J99458J14396
26719b7068J73827L21473k5822m8259j65152k54136j058O7576p7489j34788k6991
26708a97887J16595P2911J23102j26088j78196O7007J47355Q0428R0857K02807
$$ plain form
26781 -23694 426 288216 83119 136920 43679 -143892 -359276 -282532 -64324 -54033 -88813
26770 -88813 -18370 189762 122481 -25062 205196 98511 207632 -67555 -121975 -303035
26760 -303035 -650209 -634934 -307355 -57813 -69253 -49452 102755 161541 -116410 -307170
26750 -307170 -436783 -73806 144387 139269 319780 313482 511919 608749 345587 217657
26740 217657 118818 25308 -134374 -199084 -67757 445 10975 195606 171621 215992 41374
26729 41374 -87324 -235087 -352089 -286454 -104693 -11870 -245195 -340922 -141464 -27068
26719 -27068 146759 468232 442410 394151 228999 -25137 -26195 41381 -36108 -170896 -197887
26708 -197887 -81292 -8381 114721 -11367 -189563 -122556 24799 105227 196084 398891
26698C98891J43825L5382k11539n98693k7242Q5927M0022L11148L86436m9291
26688E14866m53456k21420j20614L43410J77912q666n7971l6936J27734L6375
26678C01234l66418J50497J62146k08341m7680j83007P0694J48176J3746j78958
26668a37911l638N128O9301p0674p9851M26275k0380k86072k04726M763P2189
26657b25596K66443K1620R5538o969M9561K0226O8676J38917o5607j47070j75986
26646C9753N4625J1986j21527j37425n4011J84235m2072J08530j51780K9145J30046
26635E1505J91172j31184k20281j84489m92548M3405J61562K8508l6103N6881
26625e31572K53294L39487j42381l04899j81646J87447L6279O7546Q0317K79581
$$ plain form
26698 398891 542716 578098 366559 -232134 -259376 -173449 -133427 177721 564157 514866
26688 514866 61410 -160010 -280624 62786 240698 232032 174061 137125 264859 301234
26678 301234 -65184 85313 247459 39118 -8562 -191569 -120875 27301 41047 -137911
26668 -137911 -141549 -136421 -67120 -137794 -217645 208630 188250 -97822 -302548 -297785 -225596
26657 -225596 40847 62467 158005 151036 200597 220823 289499 428416 362809 215739 39753
26646 39753 94378 106364 -15163 -152588 -206599 -22364 -64436 44094 -107686 -78541 51505
26635 51505 242677 111493 -108788 -293277 -785825 -742420 -580858 -552350 -588453 -531572
26625 -531572 -278278 61209 -81172 -386071 -567717 -380270 -343991 -276445 -196128 83453
26615H3453p7730J45602J24369k48966l70159r1562O2673J39231Q2859j05195
26605b55425k6932M44376J00197J1763N0769l0668n27972P3003J33266J25337
26595I7714j48727o511J37178q4789M6631J44486J47577j62907j07085j14044
26585e0477k22789n1725l2661l6594L42625M61957k81061j91274j05532k97756
26575d65287J79034J43255J2806J77293o4020j87395k24132j59598J31356J68823
26565b87865P0306J75277J74010k31304k11242j3576J05367M3816j46652J10651
26555b11212j31178j48289J1455l962L38299k31054q0688L60219K58034j793N0298
26544B10129j58120o0118k9344j17161L2748k42847j80870k29946M75775J56700
$$ plain form
26615 83453 5723 151325 275694 26728 -343431 -434993 -372320 -233089 -150230 -255425
26605 -255425 -282357 162019 262216 273979 324748 294080 -233892 -160889 -27623 97714
26595 97714 -51013 -57524 79654 -5135 41496 185982 333559 170652 63567 -50477
26585 -50477 -273266 -324991 -357652 -394246 -51621 410336 129275 -61999 -167531 -465287
26575 -465287 -286253 -142998 -130192 47101 -16919 -204314 -428446 -588044 -456688 -287865
26565 -287865 -217559 -42282 131728 -99576 -310818 -324394 -219027 -175211 -321863 -211212
26555 -211212 -342390 -490679 -479224 -483186 -144887 -375941 -456629 -96410 161624 159831 210129
26544 210129 52009 -8109 -37453 -154614 -121866 -364713 -545583 -775529 -299754 -143054
26534a43054R4530K13691k86926j73391j60407n9014J00974J00993l84K92335
26524b0653p6201j40254K23533q708j95565J38112L4518R1711l0495r2075K2712
26513e3365l7889j0879j50104J16867L11535j78642k77896n0223M6102N5781M02215
26502A73502J0106j06088p494j99106j20396j20723J36652O4273j35017r1284
26492c95575R6316J49009l878l1403p3274j70276j33873J61579J45852R7505j15386
26481b73404Q9539N5231j43860j72979K08869P6333o3305j74105K9117J46879
26471b21685j35343M7652K99194Q8186J34158L3094k79834O3125K55578k2535
26461B61590k09076j22579J2300k9137p9060N1277o8707p164O490L31903N774
$$ plain form
26534 -143054 -48524 165167 -121759 -295150 -455557 -514571 -413597 -312604 -312988 -20653
26524 -20653 -96854 -237108 -13575 -22283 -217848 -79736 -45218 46493 15998 -76077 -53365
26513 -53365 -91254 -102133 -252237 -135370 176165 -2477 -280373 -330596 -284494 -228713 173502
26502 173502 183608 77520 70026 -129080 -249476 -370199 -233547 -169274 -304291 -395575
26492 -395575 -299259 -150250 -154128 -185531 -258805 -429081 -562954 -401375 -255523 -158018 -273404
26481 -273404 -183865 -128634 -272494 -445473 -236604 -160271 -223576 -397681 -368564 -221685
26471 -221685 -357028 -309376 -10182 78004 212162 245256 -34578 28547 284125 261590
26461 261590 52514 -70065 -57765 -86902 -165962 -114685 -183392 -190556 -184066 147837 153611
26450A53611m43989k01345j84265L4581K19351K86212L66542J07874k0739m1454
26440B76379j13191L7593N3348p2904j39348N929j12081R4750J92174R5255q4342
26429B33562j19037k07875l44053l63029n0270J50149J94537K13126k1908J43106
26419a71692J51603m9443K4463k10437k7500K62188K90200N5997J2191n2698k87165
26408b293k32247R0240K64585j59331j39795k06303J59695K99609N798J20654
26398B00612M9562l44693k46346q4424J30733N9612Q5641J04567P3790r4044L742
26387f1248J37911R8264l94276j25400K26248P992J34742J46002J80972j9711
26377C31496J66784k18688j95445J86742J5400N3169p3348O4225J94318k66305
$$ plain form
26450 153611 -290378 -491723 -675988 -641407 -422056 -135844 230698 338572 317833 276379
26440 276379 163188 200781 254129 181225 41877 47806 -64275 30475 222649 317904 233562
26429 233562 114525 -93350 -437403 -800432 -850702 -700553 -506016 -292890 -314798 -171692
26419 -171692 -20089 -69532 -45069 -255506 -283006 -20818 269382 325379 337570 284872 -2293
26408 -2293 -234540 -144300 120285 -39046 -178841 -385144 -225449 74160 79958 200612
26398 200612 250174 -94519 -340865 -425289 -294556 -234944 -149303 -44736 29054 -64990 -61248
26387 -61248 76663 174927 -219349 -344749 -118501 -110509 24233 170235 351207 331496
26377 331496 498280 279592 84147 270889 286289 339458 266110 330335 524653 258348
26367B58348q6123p7522l2549J9000J44447j44017k02664J39821K5094j14276
26357g0441J27162m4641J56816j26670j4408q2749l42999l23099J46028M38437
26347a36564J48916J9017J81712k98887j73654L04618j7160j5917k49052q1367
26337c18338L91089K61114L1755j9052j41959p4673l15155M90l7551n1466J17862
26326a55884K75510K76220p5566j61878k25973j38701q4999M5371p8167J11662
26316b12405P0035J4575p8097k03102n9112L13321L6179j63973k98084J96441
26306c84222K89457L17528m4120k50921j88233l50345m7347K93644J91622J6449
26296a56488J99842J35501L0930k18443L6910l3070j37535j17212k27496O2846
$$ plain form
26367 258348 172225 94703 62154 81154 225601 81584 -121080 18741 43835 -70441
26357 -70441 56721 12080 168896 42226 27818 -54931 -397930 -721029 -575001 -136564
26347 -136564 12352 31369 213081 -85806 -259460 45158 27998 12081 -236971 -318338
26337 -318338 72751 333865 365620 346568 204609 129936 -185219 -184729 -222280 -273746 -155884
26326 -155884 119626 395846 320280 158402 -67571 -206272 -291271 -245900 -324067 -212405
26316 -212405 -142370 -127795 -205892 -408994 -468106 -154785 -118606 -282579 -580663 -384222
26306 -384222 -94765 222763 178643 -72278 -260511 -610856 -658203 -364559 -172937 -156488
26296 -156488 43354 178855 209785 -8658 28252 -4818 -142353 -259565 -487061 -424215
26286d24215K42376K7781k48779o945M2333N7105k20834k21851j15986Q5704J76088
26275f07223L47705L30749K19235k25472P2988N0408J60430K34927N6925m45892
26265A94780k35399J17459k2238J06058M3989J40436m4657l5560j2386j54364
26255I8118j50954Q6246j76279j62008m0651j57254J06048K85444P4102K13226
26245A76038m6149j60760o4330k48195K72385J65252r811j33767j80491J15998
26235a13830J43382K5656n3247K9824J52816O6984j4353L9566j85063m6298p907
26224C7530M8663j1572Q385j80112j7439K89351o6840k59032j08715J34213L42688
26213B17120Q2471O6183j16763j15717J9060l40397J06035L79167R0584J1261
$$ plain form
26286 -424215 -181839 -154058 -402837 -409782 -367449 -310344 -531178 -753029 -869015 -783311 -607223
26275 -607223 -259518 71231 290466 64994 137982 188390 348820 583747 640672 194780
26265 194780 -40619 76840 54602 160660 204649 345085 300428 264868 252482 98118
26255 98118 -52836 33410 -142869 -304877 -345528 -502782 -396734 -111290 -37188 176038
26245 176038 129889 -30871 -95201 -343396 -71011 94241 84430 -49337 -229828 -113830
26235 -113830 29552 55208 1961 31785 184601 251585 237232 276798 91735 45437 37530
26224 37530 86193 74621 83006 -97106 -114545 174806 107966 -151066 -259781 -125568 217120
26213 217120 299591 365774 249011 133294 152354 -188043 -82008 297159 387743 399004
26203C99004k31232j98809L4884J14922Q0300k47078P7418Q2687k39466J64017
26193C6647J62644p7770j11172q4729r206J21040J62024j53508k76809j5985K52683
26182E859J09572l17087k37957P7635p8753J55707J22578R1228K58110L96652
26172E83544j1398l54984k26047j04875L3580J32805J61439j29126k7694P1244
26162A28488M9492l1160n1564N1964L2650k12837r4332J07770L8277k97748m0663
26151c19663K89791K78371l24481j00131J91217P9159L6532J01488Q8965n148
26141C16100L0851r596j58706k94719q7247j29764K68567n104k6525J26076Jm0800
26129a0866q6645r709M06004J4252l37171j67910k8969M4719J2724O2470J64870
$$ plain form
26203 399004 167772 -31037 3847 118769 199069 -48009 29409 112096 -127370 36647
26193 36647 199291 121521 10349 -74380 -83586 37454 199478 45970 -230839 -246824 5859
26182 5859 115431 -201656 -439613 -361978 -440731 -285024 -162446 -71218 186892 583544
26172 583544 572146 217162 -8885 -113760 -80180 52625 214064 84938 57244 128488
26162 128488 177980 146820 95256 147220 179870 -32967 -127299 -19529 18748 -279000 -319663
26151 -319663 -29872 248499 -75982 -176113 15104 94263 130795 232283 321248 316100
26141 316100 346951 337355 178649 -116070 -203317 -333081 -64514 -69618 -96143 29933 29934 -10866
26129 -10866 -97511 -107220 298784 313036 -24135 -192045 -221014 -176295 -163571 -101101 63769
26118F3769n5458R2267O6738j32375j44416m5003j74958R9795o9902J81749K54312
26107A36518k24992m13894j59649K58658J46691K25060P5285j2828Q0859k5597
26097H6111k06471l30050j86499K03378M04212K70213K3438l23973J03931J99405
26087B43695k60852l71897M7968K59383P1115J15873J7460p1280K06785j42238
26077A16012k63368j01133J8347K95128J64313L4314k64550j32349l3747K03565
26067C6532K8000j64344k03995r6957J82133j32176l4085J7773j03424L12679
26057a57864K93915K36269k07222j66551k94485o7058o6839q5009Q7844k4163
26047d51163J46485M00888K10770j24893j13119m2063k31850n4563m6666n6793
$$ plain form
26118 63769 8311 100578 167316 34941 -109475 -154478 -329436 -229641 -299543 -117794 136518
26107 136518 -88474 -502368 -662017 -403359 -256668 -31608 43677 30849 111708 86111
26097 86111 -120360 -450410 -636909 -433531 -29319 240894 264332 -59641 44290 243695
26087 243695 -17157 -389054 -341086 -81703 -10588 105285 122745 51465 258250 116012
26077 116012 -147356 -248489 -230142 64986 229299 263613 -937 -133286 -167033 36532
26067 36532 64532 -99812 -303807 -400764 -218631 -350807 -384892 -367119 -470543 -157864
26057 -157864 136051 372320 165098 -1453 -295938 -362996 -429835 -514844 -427000 -451163
26047 -451163 -304678 96210 306980 182087 68968 26905 -204945 -259508 -306174 -362967
26037c62967N5808J16679O2898K9012l9353l8743j06631N4475N4857j48310K15507
26026a06768j06867P4433K21389J71005q5640j28835j21608M8524j51477M2684
26016a43160J53085j15110N7495L3381j81696K10789K81651J89051r4234k0471
26006C70781J43071J51973N2293k26082j84402k05579J42346O6131k51549k26239
25996a67256J68403J43676j26936k2274J4911J11510l6973j9396l0099q5544J80269
25985A30291K03557j39339J4977j76731q3106p7379k54044j47241j7719J92623
25975c54111n5974J51364K71379m2753j70617j10595K74554M1782k68034r0164
25965c53169J75635R9055j62846J62920k8975N3075k26480l3917J26291m8889
$$ plain form
26037 -362967 -307159 -190480 -127582 -98570 -137923 -176666 -283297 -228822 -173965 -322275 -106768
26026 -106768 -213635 -139202 82187 253192 167552 38717 -82891 -34367 -185844 -143160
26016 -143160 9925 -105185 -47690 -14309 -196005 14784 296435 485486 391252 370781
26006 370781 513852 665825 718118 492036 307634 102055 244401 310532 58983 -167256
25996 -167256 1147 144823 17887 -4387 10524 122034 85061 65665 35566 -49978 130291
25985 130291 333848 194509 209486 32755 -50351 -127730 -381774 -529015 -546734 -354111
25975 -354111 -410085 -258721 12658 -30095 -200712 -311307 -36753 5029 -263005 -353169
25965 -353169 -177534 -78479 -241325 -78405 -107380 -54305 -280785 -314702 -188411 -237300
25955b37300J35368j66841k33507O172J11787J79293K93887J1171l3497O3114
25945A29647O2346m9966r1390k66066j62675J01867K60169l0370k60565O4060
25935b42943N2515o2878J09228j29502O8758k67221K02327K65172N2469N2365
25925A00290J10574q5237j01345K04761k08554J29207J87078P119j97362m321
25915A42210R6317M9616K16353k04366k64582N9665K36348M581k82318k10577
25905a56753j71195J30807K2410J58464L8327m68018K99162M95974j9307k322
25895C27549k56541q4446k59481p6327J15414N3594O0216K5429L7337J90785J00319
25884B33848N5216K00106K9044o1681k5601l89514l52778k05216J80125J78260
$$ plain form
25955 -237300 -101932 -268773 -502280 -496108 -384321 -205028 88859 100030 66533 129647
25945 129647 191993 142027 50637 -215429 -378104 -276237 -16068 -46438 -307003 -242943
25935 -242943 -190428 -253306 -144078 -273580 -204822 -472043 -269716 -4544 47925 100290
25925 100290 210864 125627 24282 229043 20489 149696 336774 343893 146531 142210
25915 142210 238527 288143 504496 300130 35548 95213 331561 336142 53824 -156753
25905 -156753 -327948 -197141 -174731 -16267 22060 -445958 -146796 349178 329871 327549
25895 327549 71008 -13438 -272919 -349246 -233832 -180238 -120022 -94593 -57256 133529 233848
25884 233848 289064 489170 518214 456533 430932 41418 -311360 -516576 -336451 -158191
25874a58191p4676J60360j47868j31926j38244n9085P0688O5570J95145k8296
25864b46523l1535R1627K28034k48283k78200m9412m2306J59564J77232Q7895
25854a51907L4615N03074J56259m07987j85180j12518J53700L9272m0212k13280
25844b24164O1047Q1126j12566L2046O5145j44550j76023K77362j55136o202J21643
25833a80272J61665J16611j83315J88065M1970J98604K25669q1467l41508j61166
25823a5144m8185j19172k80744N0539K21961J87418J45000k9713L01478L74536
25813G87974o9357k72417m64142k34847k1036L32778j71149k55367k01787K91359
25803b77991J72976Q4233J91178q6512j83756j42309m8844N4768l8893J7295l9975
$$ plain form
25874 -158191 -232867 -72507 -220375 -352301 -490545 -549630 -478942 -413372 -218227 -246523
25864 -246523 -278058 -186431 41603 -206680 -484880 -534292 -576598 -417034 -239802 -151907
25854 -151907 -117292 385782 542041 134054 -51126 -163644 -9944 29328 -10884 -224164
25844 -224164 -163117 -81991 -194557 -162511 -97366 -241916 -417939 -140577 -295713 -301915 -180272
25833 -180272 -18607 98004 -85311 102754 144724 343328 568997 487530 146022 -15144
25823 -15144 -63329 -182501 -463245 -412706 -190745 -3327 141673 111960 413438 787974
25813 787974 718617 446200 -17942 -252789 -273825 58953 -112196 -367563 -569350 -277991
25803 -277991 -105015 -20782 170396 83884 -99872 -242181 -291025 -236257 -275150 -257855 -297830
25792b97830O1493M81418J8746l50517j47594o1172J41010r9049J80001K85031
25782B11537K33416j10022l30125k50043J54794K45233j13609j74200j53210N3071
25772b33158o6393o4040m5352M0331j05965L3572k423r869O2733j12938K39696
25761b63806N7322j89968J24112J46861O7617K36853m6066m1084l4405k08881
25751a51445j29385J584L5967j91068K1405k3058J79980J08282K45678j02465
25741d525l7342P4999k3522q899n2723J77271J40833k50343j37975J44823J56379
25730A78976Q6176l82392L1268M7660l7757J44632j71076j05801M4445p3168k4003
25719b61040J24554R2098M9172k1371j38956k42420j08550J79765J69115M24211
$$ plain form
25792 -297830 -236337 245081 263827 -86690 -234284 -295456 -154446 -253495 -73494 211537
25782 211537 444953 334931 4806 -245237 -90443 154790 41181 -133019 -286229 -233158
25772 -233158 -299551 -363591 -408943 -368612 -474577 -441005 -443428 -453297 -390564 -503502 -263806
25761 -263806 -206484 -396452 -272340 -125479 -57862 178991 132925 91841 57436 -151445
25751 -151445 -280830 -279246 -243279 -434347 -412942 -436000 -256020 -147738 97940 -4525
25741 -4525 -41867 33132 9610 711 -52012 125259 266092 15749 -122226 22597 178976
25730 178976 265152 -117240 -85972 -38312 -76069 68563 -102513 -208314 -163869 -237037 -261040
25719 -261040 -136486 -44388 4784 -16587 -155543 -397963 -506513 -326748 -157633 266578
25709B66578j16544l49835l40960p6343L19553J99692k1272L25940K97283j91189
25699C12903k56604o2469K14720j08402j75097Q0006q9408j34643J14295J16668
25689A1969L076j39164l37038Q7537Q6706J06807k71062p0622K99746j25832l02126
25678f50003m7644K88527K41555J66653p5955L6832j43533k09906k76545k14948
25668h84967L22882J2710K13580J43930M7228J49442O4641J206k16520R2423K08121
25657A54676j60224k95478j97656L1357M34058J60937P3778K22968P0026K3699
25647E18141j76725k03691K0598k41437r5395O6529K2153k34229m7802m4463K63639
25636a52682r1674r0602q7162l6898L2066K06423r5995k30876k0613j32677P8442
$$ plain form
25709 266578 150034 -199801 -540761 -617104 -297551 -97859 -119131 206809 504092 312903
25699 312903 56299 -6170 208550 100148 -74949 5057 -84351 -218994 -104699 11969
25689 11969 15045 -124119 -461157 -373620 -286914 -180107 -451169 -521791 -222045 -347877 -650003
25678 -650003 -697647 -409120 -167565 -912 -76867 -40035 -183568 -393474 -670019 -884967
25668 -884967 -562085 -549375 -335795 -191865 -144637 4805 69446 70652 -145868 -53445 154676
25657 154676 -5548 -301026 -498682 -467325 -33267 127670 201448 424416 494442 518141
25647 518141 341416 137725 158323 -83114 -178509 -111980 -89827 -324056 -371858 -416321 -152682
25636 -152682 -244356 -334958 -422120 -459018 -426952 -220529 -316524 -547400 -568013 -700690 -622248
25625f22248L40324M90671K26633j32153J8298j47925K2882o9728j24326j14618
25615a12190o6102L265K44335p8147L8315r3034M403J46561q8652l31215r9802
25604d32263Q1846J7647J56840k1736N8443L177k25995k34388J41854L27526J43816
25593A6767j43131L20917j6027j86375L3147Q7217m4805j77711K868K55792J66043
25582C14702J11598J5286j30408l28018j67025J21023J13092j03537N7152j10151
25572a06286J26230K97393J10508l7987p693k7581M1145j67487M8798m186j53135
25561A19719j21527j22904K53753J28258j34757O2846K67556l10371k48230j71905
25551b77562o8589J36157J02069J93778L6798R2512K62601q9736m2508k02432
$$ plain form
25625 -622248 -281924 208747 435380 303227 321525 173600 196482 126754 2428 -112190
25615 -112190 -178292 -175027 69308 -8839 29476 -63558 -59155 87406 -1246 -332461 -432263
25604 -432263 -350417 -332770 -175930 -197666 -139223 -136046 -362041 -596429 -454575 -127049 16767
25593 16767 -126364 194553 178526 -7849 25298 112515 67710 -110001 -107133 148659 314702
25582 314702 426300 441586 311178 -16840 -183865 -62842 50250 -53287 3865 -106286
25572 -106286 19944 317337 427845 389858 382165 354584 395729 228242 277040 272854 119719
25561 119719 -1808 -124712 129041 257299 122542 185388 452944 142573 -105657 -277562
25551 -277562 -346151 -209994 -107925 85853 122651 215163 477764 388028 345520 143088
25541A43088l07312m39581j20449J03711K55762J14622J74187R3856M7474K09090
25531B74448r565j68654n0361J35671q1525p8427k68726o2252J48105k82886O4958
25520c79214J29989l076K24982L06665k54723K1016n1767O3890J7105j45527J40996
25509G0336N9154j47507n8088L14618k7183j23884N4443K43227o9714l3486k29061
25498E2855Q1717j00139j76123L03769n956M296j70935k58884J01144J06628j69677
25487b31305k84160K50179K05299J90047J38690n1288j31653l4934j05908r3744
25477a48777q8059j008K82388j3973L6219n7332k50175K3521O0238K53488O6203
25466A62733m4252O3052j20295K11321j8732r4971k86479j2092K06189K04815
$$ plain form
25541 143088 -164224 -603805 -724254 -620543 -364781 -250159 -75972 17884 65358 274448
25531 274448 264883 96229 45868 181539 100014 21587 -247139 -309391 -161286 -444172 -379214
25520 -379214 -249225 -252301 -27319 279346 24623 45639 -6128 57762 74867 -70660 70336
25509 70336 129490 -18017 -76105 238513 211330 87446 141889 385116 315402 281916 52855
25498 52855 134572 34433 -141690 162079 156123 160419 -10516 -269400 -168256 -61628 -231305
25487 -231305 -515465 -265286 -59987 130060 268750 217462 85809 50875 -55033 -148777
25477 -148777 -236836 -237844 44544 30571 66790 9458 -240717 -217196 -156958 96530 162733
25466 162733 118481 181533 61238 272559 253827 158856 -127623 -139715 66474 271289
25456B71289O4948k59864j27061p4925J35087J32935j43997k14926j91785J3091
25446c95208L03076O5481j59383j12405R6073N473k08776j02802O4428j54217
25436e98260p9419J15450J76579m7525n6828J32151k4259J09319j60744J34205
25426b99331K34043j91124j59211j5341K33415o958N8420J24314J40088Q2370
25416B00685j5431l9508K1122J61040j44487m11851M6926L35221L16484p2255
25406C97946m02004m16657J02399K07637p1418Q7688J5224n483k00476K9083J15876
25395a40185K5545K21493j26674Q2772L69257K25190j94615q7085K00941l2280
25385E44359P3772l20362K0783J8304l17835j00051k02196j88834O6280r4999
$$ plain form
25456 271289 336237 76373 -50688 -125613 9474 142409 -1588 -216514 -408299 -395208
25446 -395208 -92132 -26651 -186034 -298439 -202366 -196893 -405669 -508471 -444043 -598260
25436 -598260 -677679 -562229 -385650 -433175 -490003 -357852 -382111 -272792 -433536 -299331
25426 -299331 -65288 -256412 -415623 -430964 -197549 -204507 -146087 -21773 118315 200685
25416 200685 185254 145746 166868 327908 183421 -228430 -181504 153717 470201 397946
25406 397946 -4058 -420715 -318316 -110679 -182097 -94409 -79185 -84668 -285144 -256061 -140185
25395 -140185 -114640 106853 -19821 62951 432208 657398 462783 375698 576639 544359
25385 544359 618131 297769 318552 336856 19021 -81030 -283226 -472060 -405780 -500779
25375e00779R2478L85321K04328j41796Q6524Q0671k17386m1639k96808J209J27700
25364b20177P158j01545R9273j26895K9391K34545j2475O5624R6572j02284l57331
25353c88144j34571j5883m258J52046J07723j1135n4731j1714j19403Q3021j69521
25342e66570K92305q4223j6627L08848J55237L1288j3948J35421k0797M1582j2070
25331B50446q7625l01962J23350L39202j8305J98416J18202r6682j11859j11292
25321C01891l34394J36079m9279q900K30945J83844o3634k13567r2699k24342
25311a34056o6788K16493n8436j83863J53342m2362q5539L45282K65799R8204
25301E08076k8470l07093k76983k18933k73508r0698K65200L14333R0227j32072
$$ plain form
25375 -500779 -408301 -22980 181348 39552 126076 206747 -10639 -52278 -349086 -347877 -220177
25364 -220177 -213019 -314564 -215291 -342186 -312795 -78250 -90725 -25101 71471 -30813 -388144
25353 -388144 -522715 -538598 -542856 -390810 -283087 -294222 -348953 -360667 -480070 -397049 -566570
25342 -566570 -274265 -358488 -375115 -66267 88970 120258 106310 241731 220934 262516 250446
25331 250446 162821 -139141 -15791 323411 305106 503522 621724 525042 413183 301891
25321 301891 -32503 103576 54297 45397 276342 460186 396552 182985 90286 -134056
25311 -134056 -200844 15649 -42787 -226650 -73308 -115670 -201209 144073 409872 508076
25301 508076 479606 172513 -104470 -323403 -596911 -687609 -422409 -108076 -17849 -149921
25291a49921L0670R3237J98537J37511Q88q9338K42347J30815l23945j70407R0524
25280A90918j43338j06263N3539n8184O8529K74821N5397r2698j32257J7137j07513
25269B0088O4542M5079O3170K516o656j51527Q4536j88690j91031r0853J97704
25258a51122J30568K3226l06896k48486L72604M29702l8063n2901J1945n2806
25248A17771J63510n2947j2543O5074j7575Q2341l17138J7336K39583k8937l83162
25237a26687p6297J78579j52522k95356k08168K89325K78114K08826q8115k49076
25227b41377K7284O394j5121J21349J4114L0781K59297K8278j05179N5711m9601
25216A31930k38302K19344K43376O482o5821j95707J20056q210j59961p8293k58788
$$ plain form
25291 -149921 -119251 -26014 172523 310034 310922 221584 463931 594746 270801 100394 190918
25280 190918 47580 -58683 -5144 -63328 5201 280022 335419 242721 110464 127601 20088
25269 20088 84630 129709 192879 195395 188739 37212 121748 -66942 -257973 -348826 -151122
25258 -151122 -20554 2672 -304224 -552710 -180106 249596 211533 158632 170577 117771
25248 117771 281281 228334 215791 280865 263290 345631 28493 45829 285412 256475 -126687
25237 -126687 -202984 -24405 -176927 -472283 -680451 -391126 -113012 95814 7699 -241377
25227 -241377 -214093 -207699 -222820 -101471 -87357 -56576 202721 230999 125820 181531 131930
25216 131930 -106372 112972 356348 362830 297009 101302 221358 213148 53187 -25106 -283894
25205b83894j84623K09810L14011P1480O9083L836k12487n4389O1595K53903N7853
25194C06178J13919j03228n1716J01086r2777q9808K29151m4428J5441J51564
25184E35382J1670k42431m11824j92110k19686K74506K93972j86778J7545k84826
25174d04580j92400J17904K17645M03945n1382q6717p3168j56511Q6483K49966
25164A11185K54921K7142K1818r2489k57640N1265n7947j42539q9234m7352L2344
25153a88526l1934N5346J40007j40278n0018J27424l6341j98482m5254K0214p4933
25142d22775K5004J97640M11576M1453j93486j48935k0028j64371Q2705O1965
25132a29252k4214L15917K09952o7765j92648k05398M4402j33932M0948K43222
$$ plain form
25205 -283894 -468517 -258707 55304 126784 195867 199703 -12784 -67173 -5578 248325 306178
25194 306178 420097 316869 265153 366239 273462 183654 412805 368377 383818 535382
25184 535382 547052 304621 -107203 -299313 -518999 -244493 49479 -137299 -119754 -404580
25174 -404580 -596980 -479076 -261431 142514 91132 4415 -68753 -225264 -138781 111185
25164 111185 366106 393248 415066 322577 64937 116202 58255 -84284 -173518 -220870 -188526
25153 -188526 -220460 -165114 -25107 -165385 -215403 -87979 -124320 -322802 -368056 -347842 -422775
25142 -422775 -397771 -200131 211445 252898 59412 -89523 -109551 -273922 -191217 -129252
25132 -129252 -153466 162451 372403 304638 111990 -93408 -49006 -182938 -141990 101232
25122A01232q0415j53783l5150j11006L0749J96273K25907n0333r7513j9368Q6662
25111I3255J48932j40024J02394j04688l64942l47734J43445L68526L28246J92511
25101D19921J54727n6016j98344J34678j34186m13138J31697Q4181j52400r1684
25091a20564J84832L94594J86664r5111m0933l22850l91175j38979R8005J47141
25081i8376J67771j45434n7360j91476j21182R8769M7354L42705j567j10601J2607
25070e6790o5249j2693Q7739r0492r9330j44258N6500J13740p2513J85967j06688
25059b04067j65873K03295O08051l0784l5249j34249k68723q6468N31J7878j1644
25048a07302m9440j21947q0497L20140K18401J44597j55191l28071k00404K91752
$$ plain form
25122 101232 20817 -132966 -168116 -279122 -248373 -52100 173807 123474 25961 6593 93255
25111 93255 242187 102163 204557 99869 -265073 -612807 -469362 -100836 227410 419921
25101 419921 574648 518632 320288 454966 320780 -92358 39339 123520 -28880 -120564
25091 -120564 64268 458862 645526 550415 509482 186632 -204543 -343522 -245517 -98376
25081 -98376 69395 -76039 -133399 -324875 -446057 -347288 -299934 42771 41204 -69397 -56790
25070 -56790 -122039 -134732 -46993 -137485 -236815 -381073 -324573 -210833 -283346 -97379 -204067
25059 -204067 -369940 -166645 441406 410622 375373 241124 -27599 -114067 -113536 -95658 -107302
25048 -107302 -156742 -278689 -359186 -39046 179355 323952 168761 -159310 -359714 -67962
25038f7962K67322Q6813J516J69672j29666j16751r6321j68447N1638J40767J4758
25027A53339J4139m28149j85901j514J62287J72081m7537j17136O6028J45251
25017f7112R6413k8314l41893k36753K89663J83210L2944j00363q7134K93845
25007C4506J31632p0007j9221O8251k35128M892K9433J70853Q3452j49291k06737
24996a57365j69168N2400j44858n5960J81019K02454k4399J85107K9939J5223
24986A14392K17918P6767j72012m68469k26881K61598J2651m01159L2159K24470
24976c28566j15583k68654L71109J43746k03464J14808k9191J66320j51808o1629
24966c62912K85510M52329K79180k28896m98901k4844q1355J56639l1514K3410
$$ plain form
25038 -67962 199360 286173 287689 457361 327695 210944 114623 -53824 -2186 138581 153339
25027 153339 167478 -260671 -446572 -448086 -285799 -113718 -161255 -278391 -212363 -67112
25017 -67112 29301 987 -340906 -577659 -287996 -104786 -71842 -172205 -259339 34506
25007 34506 166138 96131 76910 145161 -89967 -85075 -55642 115211 198663 49372 -157365
24996 -157365 -326533 -274133 -418991 -474951 -293932 -91478 -115877 69230 99169 114392
24986 114392 332310 409077 237065 -231404 -458285 -196687 -184036 -585195 -553036 -328566
24976 -328566 -444149 -712803 -341694 -197948 -401412 -286604 -315795 -149475 -301283 -362912
24966 -362912 -77402 374927 654107 425211 -73690 -98534 -179889 -23250 -54764 -31354
24956c1354l0341K24862K34125j09718l9882J04735k4877k86853j71580K30391
24946I9508J07795j4950K20859l9220n27685k05896K83579O7472M6209o3570l28976
24935c54875J91552J68210N199m3326J68707L23955p9978k28718p175j11344j77574
24924a45367n8230J8022R337j6224J15454j63799p7948R9513N6739R5713n5929
24913a22719k0582m3125J435K95473K12381j24756o9512L30538J23391l54313
24903B28211l13845k57854J04660K86658R4573k2596l3957l7173J29789j14794
24893F3672P4503q865j64642k30398j65196J21516K34670P2716L9545p2386n1387
24882h6252J30358L9888j26227L0123j49845j78423K00275L2940L8600q4038l353
$$ plain form
24956 -31354 -61695 163167 397292 287574 247692 352427 327550 40697 -130883 99508
24946 99508 207303 192353 413212 373992 -153693 -359589 -76010 -8538 37671 -25899 -354875
24935 -354875 -163323 4887 10086 -33240 135467 459422 379444 150726 143551 32207 -145367
24924 -145367 -203597 -185575 -176238 -192462 -77008 -240807 -318755 -219242 -162503 -66790 -122719
24913 -122719 -143301 -186426 -184991 110482 322863 198107 128595 459133 582524 228211
24903 228211 -85634 -343488 -238828 47830 142403 119807 85850 48677 178466 63672
24893 63672 138175 129310 -35332 -265730 -430926 -309410 -74740 -2024 37521 -34865 -86252
24882 -86252 44106 83994 -42233 -12110 -161955 -340378 -140103 -107163 -68563 -152601 -155954
24871a55954J2486j4986q4642L7875P907R6399j5104J1576j1272j45549j41047
24860d02311L7940M9189J45605M37861o3775k07836l6574J32977K55242J47369
24850D95687k2663j54129k45890j20499j93260n0184J00774L828K18618J46386
24840A78668l85759j02664M12884K66887j49071k34566K67926o2404j99344J18186
24830A10743L0198l46518j67169j55218L47219L33064o5385j31062j10407P4813
24820g9722j29465k32689J95931J0255m7851p9686Q9832J8602J33385J27823r6456
24809i0041r3854K2537J38552K717M136N4205J01759k14J2364j7038o3723r8643
24797b7243K27987J21106l22959j44804Q3716R9011J23483K14092o7980j11640
$$ plain form
24871 -155954 -143468 -158454 -243096 -205221 -197314 -100915 -116019 -104443 -115715 -261264 -402311
24860 -402311 -364371 -315182 -169577 268284 204509 -3327 -39901 93076 348318 495687
24850 495687 473024 318895 73005 -47494 -240754 -290938 -190164 -186336 32282 178668
24840 178668 -207091 -309755 103129 370016 220945 -13621 254305 191901 -7443 110743
24830 110743 140941 -205577 -372746 -527964 -180745 152319 86934 -44128 -154535 -79722
24820 -79722 -209187 -441876 -245945 -235690 -283541 -363227 -273395 -254793 -121408 6415 -90041
24809 -90041 -183895 -161358 -22806 -20089 -15953 38252 140011 139797 152161 135123 71400 -27243
24797 -27243 200744 321850 -1109 -145913 -62197 36814 160297 374389 306409 194769
24787A94769l21403j07536k1141J26500J79706M5980n4352k6229K00853J77975
24777C95122J3397j73760j39955k12753K8848j30692k4842O5145p2138O1084K85146
24766I4602P9137P2538J71579j00710l28643j31129j34388K40070J70422j32463
24756A015k01081M606k724j23072j86394k31555K92046J78973p2338j63919J38211
24745c66232K2160J82557O1340r7069l49253J25737L30946k4087k41382o2757
24735d18040K43366k41756K35648J15812j93950J15274j6948J24605K34986j17176
24725H1821j69051l89680J97076L4394L0996k63917j52320j70623J30692J57021
24715e13591J16293k7650l9654n417M14098J09408j27180j8287M1302J82265J47601
$$ plain form
24787 194769 -126634 -234170 -255311 -128811 50895 96875 42523 16294 217147 395122
24777 395122 408519 234759 94804 -117949 -89101 -219793 -244635 -179490 -251628 -190544 94602
24766 94602 173739 246277 417856 317146 -11497 -142626 -277014 -36944 133478 1015
24756 1015 -200066 -195460 -198184 -321256 -507650 -739205 -447159 -268186 -340524 -504443 -366232
24745 -366232 -344072 -161515 -100175 -197244 -546497 -420760 -89814 -113901 -355283 -418040
24735 -418040 -174674 -416430 -180782 -64970 -258920 -143646 -160594 -35989 198997 81821
24725 81821 -87230 -476910 -279834 -245440 -214444 -478361 -630681 -801304 -670612 -513591
24715 -513591 -397298 -424948 -464602 -470019 -55921 53487 -73693 -91980 -50678 131587 279188
24704B79188O5235q399r8693j03357N7197j0543r6399l75639l58537l0979Q0921
24693f00005L43156J02441j18037k37951q2996K16449N5876j928J40671O4944
24683a17380J25615j40894J4995L21892o2361o8140L7101k86970j3475Q6184J30884
24672B7451o1270J23982J02848j80630n7830K79706j65761l45178k21143M4523
24662d53302J18557K10460q0755k89635Q4816J95990J53641L67009K89345K14492
24652H10618j96189l51830m06833J88897n5348k07699k5042J06906M9668k00992
24642b87844L421j0912M73401K46513k10242l55757j00758R905q3443L3232K45973
24631c6511L37235j12252j54132j36629m4277N5485j09701M9128k0663J31478
$$ plain form
24704 279188 344423 336024 237331 133974 191171 180628 84229 -291410 -649947 -680926 -600005
24693 -600005 -256849 -154408 -272445 -510396 -593392 -376943 -321067 -322995 -182324 -117380
24683 -117380 8235 -132659 -117664 204228 141867 73727 110828 -176142 -189617 -103433 27451
24672 27451 -33819 90163 193011 12381 -45449 234257 68496 -276682 -497825 -453302
24662 -453302 -334745 -124285 -205040 -494675 -409859 -213869 -60228 306781 596126 810618
24652 810618 614429 262599 -144234 44663 -10685 -218384 -243426 -136520 -86852 -287844
24642 -287844 -284423 -295335 178066 424579 214337 -141420 -242178 -232273 -315716 -282484 -36511
24631 -36511 300724 188472 34340 -102289 -146566 -91081 -200782 -151654 -172317 -40839
24621d0839L40632l7488j39785o8171Q1965j78836k573J56519J917k05195k11627
24610c03481J09142J83702O4957n1120P3662J76153J94994n4320q3098k9789J96128
24599D76930Q5013l52898j2790m0725k81454j18049J77150N3310O4551J67603
24589B18641J06537j16121k24571j43513J54781K00570L076j1466j04067j4053
24579F9814O8005j54290J73661N0672k1007q5171j86043q4275j43183o3506m5905
24568d21228o3414J4225J02320L27966N6858j32371k68575K9399P3824J2163L3917
24557b34916J50634O6368J58026k58016k77891J92834K115o6474p1320J27959
24547b10681K21093M5482K49530Q5805j5547o1879O9944J4954J30751k90457k33695
$$ plain form
24621 -40839 299793 262305 122520 54349 136314 -42522 -45095 111424 113341 -91854 -303481
24610 -303481 -194339 -10637 54320 3200 76862 253015 448009 393689 310591 280802 476930
24599 476930 561943 209045 196255 155530 -125924 -243973 -66823 -13513 51038 218641
24589 218641 325178 209057 -15514 -159027 -4246 196324 199400 187934 83867 69814
24579 69814 137819 -16471 157190 207862 186855 101684 -84359 -168634 -311817 -375323 -421228
24568 -421228 -484642 -470417 -368097 -40131 16727 -115644 -384219 -354820 -280996 -268833 -234916
24557 -234916 -84282 -17914 140112 -117904 -395795 -202961 -200846 -267320 -338640 -210681
24547 -210681 10412 55894 305424 391229 375682 313803 383747 398701 529452 238995 5300
24536E300k78077o2756K35537K10104k17150J11214K70531Q4395k487k37912j47132
24525b8433P7104K60064l02503q3595J36412j17589J33984R6005m2605j01061
24515B7783j16626J46205R3219M7392J4228j48707q5100m2798M0302k03904j15651
24504c43657j63439j54689J73386J76494o6678k50900J37041O8989j01768l1140
24494e56361L7937J81944J42111K85327J25962L6624j39637r3586L231K35446
24484B58998K28448M2005R1197k02258l8209M4616J66087J14292J00882k02844
24474F03214l06121j44572l47269K10279J56402J1387P6770o1413n2114J76828
24464C23391j31487j41936n2038q3677l4504m13929j70754K07974O0399o8222
$$ plain form
24536 5300 -272777 -335533 -99996 110108 -107042 4172 274703 359098 356611 118699 -28433
24525 -28433 48671 308735 6232 -77363 59049 -58540 75444 171449 128844 27783
24515 27783 -88843 57362 150581 197973 212201 63494 -21606 -64404 -24102 -228006 -343657
24504 -343657 -507096 -661785 -488399 -311905 -378583 -629483 -492442 -423453 -525221 -556361
24494 -556361 -518424 -336480 -194369 90958 216920 253544 113907 20321 23552 258998
24484 258998 487446 529451 620648 418390 380181 424797 590884 705176 806058 603214
24474 603214 297093 152521 -194748 15531 171933 183320 260090 198677 146563 323391
24464 323391 191904 49968 -2070 -85747 -120251 -534180 -704934 -496960 -436561 -504783
24454e04783J00077K47171J45821P113k46028K54846K73405l01603k81879P367
24444b98493L0764K2616Q4536J38997K8655r7063n3720o0684J24721q8372j90763
24433c58806l1055J52869r4226k92333K96608L18004K1461J07973m8528j23597
24423e1630j53795P2253J07165j70869l61302o3826L46023l043j11646L66520
24413b4150L5794j33605J98080Q600K41891k85191j65847J9595K79524J21279
24403B95970r4544J53836j46788k31306K19p1077j78623L80127N0196m4542l3424
24392H0044k98849l39565p05K88760J30200L7952K680R031Q6530j51056K6763
24381a28215J19329O1363P9860l3479R6420J48384M1209j52409j18486n2817m5807
$$ plain form
24454 -504783 -404706 -157535 -11714 -4601 -250629 4217 277622 -23981 -305860 -298493
24444 -298493 -267729 -245113 -160577 -21580 7075 -89988 -143708 -204392 -79671 -168043 -358806
24433 -358806 -389861 -236992 -331218 -623551 -326943 -8939 12522 120495 71967 -51630
24423 -51630 -205425 -133172 -26007 -196876 -558178 -622004 -275981 -279024 -390670 -24150
24413 -24150 11644 -121961 76119 84719 326610 41419 -124428 -104833 174691 295970
24403 295970 201426 355262 208474 -22832 -22613 -93690 -272313 107814 158010 113468 80044
24392 80044 -218805 -558370 -559075 -270315 -140115 -102163 -99483 -90452 -3922 -154978 -128215
24381 -128215 -8886 52477 132337 98858 195278 343662 384871 232462 113976 61159 15352
24370A5352J854r9481j5646J7783K04342J7477J8269J45559k92600L8092Q2756
24359A33757k34593O767P2676L4942L81921J25698j92353p7695q2502j44293j2549
24348A1776o6954j15478K828k16859J8927M39583Q2396k52551R3317L34705J65446
24337D97136n3443m83207k34683J66682K2514R0801M3373j62882l9942j26554
24327b80205J47116j069j4608K10839j62054L43088J49489n4520j10845m61284
24317b34053J11946M01551Q9027m6407k70516k55925p0099p3187k8342k3952j82318
24306e82275N58622L58922j1950L5017j10965m5594Q5932k27792k71163J24009
24296h7237K71590k18579q4255j37569J18961Q3613J46934j27272l2397L0896
$$ plain form
24370 15352 17206 -82275 -97921 -80138 124204 141681 159950 305509 12909 51001 133757
24359 133757 -100836 -94069 -21393 13549 395470 521168 328815 251120 168618 24325 11776
24348 11776 -55178 -170656 -167828 -384687 -365760 73823 156219 -96332 -3015 331690 497136
24337 497136 443693 -39514 -274197 -107515 -85001 5800 49173 -113709 -153651 -280205
24327 -280205 -133089 -134158 -148766 62073 -99981 243107 392596 338076 227231 -234053
24317 -234053 -122107 279444 368471 322064 51548 -204377 -274476 -347663 -376005 -399957 -582275
24306 -582275 -23653 335269 323319 358336 247371 201777 287709 59917 -211246 -87237
24296 -87237 184353 -34226 -118481 -256050 -137089 -53476 93458 -33814 -66211 -35315
24286c5315Q2267k87440O4261J77393L6097J19146m438j87636j63518J0561M12166
24275B23544J25615l34108j82042q3033J92756K43092N0235l4461O739K18884
24265D27221Q9429l01879l25871J5210K1585M9310J48276k13841j37589K35586
24255G437j19604J4309M7399l23670K1386n9759j43943M1333J85020K06104l0618
24244a54606k08048J88055J12448j39728P1373Q3416k12952k46942l925L4705
24234d76204J12824J65785J55361R9406k24239q0803K8609M6658Q4453K14007
24224A25857L9187P3169N9942j40447j17271j16989j28019k30359j39718K57939
24214c16709K93591J25094K43342R0894k59358m8214J48764j67474j83047J26733
$$ plain form
24286 -35315 46952 -240488 -176227 1166 37263 156409 151971 -35665 -199183 -188622 223544
24275 223544 349159 15051 -166991 -250024 -57268 185824 236059 201598 208337 427221
24265 427221 516650 214771 -111100 -95890 -74305 -24995 123281 -90560 -228149 7437
24255 7437 -112167 -97858 -50459 -374129 -352743 -412502 -556445 -515112 -330092 -123988 -154606
24244 -154606 -362654 -174599 -62151 -201879 -130506 -47090 -260042 -506984 -510909 -476204
24234 -476204 -363380 -197595 -42234 57172 -167067 -247870 -219261 -172603 -88150 125857
24224 125857 165044 238213 298155 157708 40437 -76552 -204571 -434930 -574648 -316709
24214 -316709 -23118 101976 345318 436212 176854 128640 277404 109930 -73117 53616
24204E3616j62982j220L06748L4601l91497J7678j52002L37224M07335Q7016j38649
24193C97868k39839j56988J4055l43537r6452J61976J83511P9446k1617p2133
24183i3710M9508j0603J3715j23089k1460P3460J16593r2664R8644J32276r2950
24172D9720K7925j07030j05657L1256R8060O2106Q656J31249K29781j45289j48992
24161A31785j54790J12817k06081L9411L18739O6421k72424l05662K30112J54085
24151A14413k20957O2562N7029L4366q9268o1785j5031j44061o3256J33324J75190
24140a7474J52822q3425k20189j62794J39162J80319J35175K80437q8220k3606
24130B92207M9104N6793j01951k5924k16833j65311J978M18596M9700k11648r8962
$$ plain form
24204 53616 -109366 -110586 196162 230763 -160734 -143056 -295058 42166 449501 536517 397868
24193 397868 158029 1041 15096 -328441 -424893 -262917 -79406 40 -21577 -93710
24183 -93710 -44202 -54805 -41090 -164179 -185639 -112179 4414 -88250 10394 142670 49720
24172 49720 77645 -29385 -135042 -103786 -5726 56380 65036 196285 426066 280777 131785
24161 131785 -23005 89812 -116269 -76858 241881 308302 35878 -269784 -39672 114413
24151 114413 -106544 -43982 13047 47413 -41855 -103640 -118671 -262732 -325988 -192664 -17474
24140 -17474 135348 51923 -168266 -331060 -191898 -11579 123596 404033 315813 292207
24130 292207 341311 398104 296153 270229 53396 -111915 -109937 308659 358359 146711 47749
24119D7749k13651J10998L01069n3207L2456k2092k25753J10616P8423J81020
24109C47628k68924k99324J64958J96944J13130j77561M546R1445j29733r399
24099C3710Q1068n8036l60837K50313L66075J11417k99070P3021p3388J41768
24089B66041K66829l1731k14568j68110j20629k00744J71001J21631M3607j13725
24079A9602l09503j89609K68814K92259O5674q0195r639j98655K0124J18051J65210
24068A62133j24296j29629j661k25745j64915O8813J72223M99978J58118l1103
24058C83916j22709L4408L3069P6658j49671m07382j20585J93704K55527J87548
24048C64483l06245j70426l1265J12901J41976L6467j61747K28423K12493r6419
$$ plain form
24119 47749 -165902 -54904 246165 192958 225414 203322 -22431 88185 166608 347628
24109 347628 78704 -220620 -55662 141282 254412 76851 81397 172842 43109 33710
24099 33710 114778 56742 -304095 -53782 312293 423710 124640 197661 124273 266041
24089 266041 532870 501139 286571 118461 -2168 -202912 -31911 89720 133327 19602
24079 19602 -289901 -479510 -210696 81563 147237 67042 57403 -141252 -121128 -3077 162133
24068 162133 37837 -91792 -93453 -319198 -484113 -415300 -243077 256901 415019 383916
24058 383916 261207 295615 328684 405342 255671 -151711 -272296 -78592 176935 364483
24048 364483 58238 -112188 -143453 -30552 111424 147891 -13856 214567 427060 330641
24038C30641J3415q6301n2681l4126J440L88751o9969m4954o1304k11515k83194
24027a09797O4675J33189j87539o7998J03861J40214J8646K22783j09406N8997
24017B67625k42265J56494K46741j42913j64034l02764J6107L95543N7673p2595
24007B15612j75244q5018P6414l21443j31081J80910J83504M394k09266j95360
23997d56578J34066K59893K17916Q1402p8450R0268J81392q7233k11444p0371
23987F0861k74897J42626J57015P2303o5742j29434N1683J75175j91719m17715
23977d19844M2536L58896k9940R836k85799k7673J49642J88393P7181k3920l85354
23966c46046K2479K91592o0292p4430p0230L35498J01734j03585j19343J07456
$$ plain form
24038 330641 344056 257755 205074 170948 172388 561139 491170 446216 384912 173397 -109797
24027 -109797 -45122 88067 -99472 -167470 -63609 76605 95251 318034 208628 267625
24017 267625 25360 181854 428595 285682 121648 -181116 -165009 230534 288207 215612
24007 215612 40368 -44650 31764 -289679 -420760 -239850 -56346 -51952 -261218 -456578
23997 -456578 -322512 -62619 155297 236699 158249 248517 429909 342676 131232 60861
23987 60861 -214036 -71410 85605 157908 92166 -37268 14415 189590 -2129 -419844
23977 -419844 -377308 -18412 -48352 -38516 -324315 -351988 -202346 -13953 63228 39308 -346046
23966 -346046 -323567 -31975 -92267 -166697 -236927 98571 200305 96720 -22623 84833
23956H4833q859k87113j71269L41542P4319J85037k9428j54438n195O7464N8417
23945A55310J17371R5430j30105J5492R6542j10520J9751J04810P3218M8839j9083
23934D67055K22713K01084k96824l53014j14544j30976R3495J2600O8438j70081
23924e4r9966J30114O2359L627p5186l7191O1909m0649j55083j25814k17784j09964
23912f03682J28093J23864P6064K04098Q9914j32708q4687j77051J64144j04403
23902c16354J0308p2506r0244r3944O9368M9215J26072K70190L4894L1260Q2349
23891A00608J2305J73278J97402j04020R096o8006l56668j83508J36121m3359
23881a26751k18728M9020J98620J51988M5302j78028j63817J68741R9218Q5615
$$ plain form
23956 84833 75974 -211139 -382408 -40866 33453 218490 189062 34624 29429 96893 155310
23945 155310 272681 368111 238006 253498 350040 239520 259271 364081 437299 486138 467055
23934 467055 689768 890852 594028 241014 126470 -4506 88989 101589 170027 -54
23924 -54 -100020 30094 92453 96080 20894 -16297 45612 4963 -150120 -275934 -493718 -603682
23912 -603682 -475589 -351725 -275661 -71563 18351 -114357 -199044 -376095 -211951 -316354
23902 -316354 -306046 -378552 -468796 -562740 -493372 -444157 -318085 -47895 -13001 18259 100608
23891 100608 112913 286191 483593 379573 388669 320663 -36005 -219513 -83392 -126751
23881 -126751 -345479 -296459 -97839 54149 99451 -78577 -242394 -73653 25565 111180
23871A11180J57219K75727J50265k26297j86174N3773m0234J77123J41075n70436
23861D3221l56532N8313L3479J46285J05732j20636J84751j4496j79788k89210
23851c88881k36924M0108O6275P6423L56811L821k11541m54776l168L39753L51132
23840f0967J33821k25263P0620M11564K39483j32355k10136o1437P8958j44827
23830I9461q9950K08988j236l44420j62717J29170K78466j42228K4381j2740L26145
23819C13320k6497n83771q2029L77237K28837l8490j34779j85094o2227L1924
23809a61569J26641K02891N4623J00287K34015l18663j82912J63214r3940k15441
23799i0854k2946J22150J53340Q7504j4860K5321N9476l3023j251j72312J32126
$$ plain form
23871 111180 268399 544126 694391 468094 281920 335693 295459 472582 613657 43221
23861 43221 -313311 -254998 -221519 -75234 30498 -90138 94613 80117 -99671 -388881
23851 -388881 -625805 -585697 -519422 -442999 -86188 -82367 -293908 -748684 -751852 -412099 -60967
23840 -60967 72854 -152409 -81789 329775 569258 436903 226767 165330 244288 99461
23830 99461 9511 218499 217263 -127157 -289874 -160704 117762 -24466 -85 -12825 313320
23819 313320 286823 -296948 -378977 -1740 227097 188607 53828 -131266 -193493 -161569
23809 -161569 -34928 167963 222586 322873 556888 238225 55313 218527 124587 -90854
23799 -90854 -113800 8350 161690 249194 234334 259655 319131 286108 284857 112545 244671
23788B44671P2573o9465j10103k79888J4205J72244N121j7997J99101K66141j00847
23777C95756k46134k71130K98255K16786l2760l46327j98837J3070J49231J83415
23767A61325j16609j90450K1610J8920J51664l3844J96898P3902K44930p9209
23757D49137J38383J05608J36302k45042l49639J73220K96962J7320r4539k6347
23747F01365k19884j86258m2266O9329J0362l42962n1715q9321j53633K91474
23737a13509K7355j46195j3735L5726M91605J23684J8894j8510j70889k1135J57857
23726C71148J30019j08831p4437m1477r4819l6726j62088j49840p2350o0374J50746
23715a49029K72156l6269j93318j37586l3534J61101k12502L8688K20937j96724
$$ plain form
23788 244671 317244 247779 137676 -142212 -128007 44237 49358 31361 230462 496603 395756
23777 395756 149622 -121508 176747 393533 360773 14446 -184391 -171321 -22090 161325
23767 161325 44716 -145734 -124124 -105204 46460 12616 209514 283416 528346 449137
23757 449137 587520 693128 829430 584388 234749 407969 704931 722251 627712 601365
23747 601365 381481 195223 152957 222286 232648 -110314 -162029 -251350 -404983 -113509
23737 -113509 -86154 -232349 -246084 -210358 281247 404931 423825 405315 234426 213291 371148
23726 371148 501167 392336 317899 276422 181603 144877 -17211 -167051 -239401 -299775 -149029
23715 -149029 123127 86858 -106460 -244046 -277580 -116479 -328981 -290293 -69356 -266080
23705b66080O1936J87379R9662l00775m8751j06768K68463J14156q494j83689
23695a82961j44528K38015K52869J14253j03493J48390J82k72078m6327J33333
23685A37655r296l526j21618j39611J91586J01314j02239r7877K12347J26426
23675B95161m0146m7096k84581j6043J26498M86705K36957m81558k96658k71570
23665b92331L9694L15861R0390r620o1704O497J07846j94507j11117k2844J09399
23654b2436j32573k89508k5257J77825J3463m1772J6555K31833J26341R014j42907
23643g9422l56387j29233J07163K84227L24461P316k42628J05710p4892M5846
23633g839K44580O4271q8186j38378j31607m427N07149K18634j75814J61515J26984
$$ plain form
23705 -266080 -204144 -16765 82897 -217878 -266629 -373397 -104934 9222 728 -182961
23695 -182961 -327489 -89474 163395 277648 174155 322545 322727 50649 4322 137655
23685 137655 128359 124833 3215 -136396 55190 156504 54265 -43612 168735 295161
23675 295161 255015 207919 -76662 -92705 33793 520498 757455 275897 -20761 -292331
23665 -292331 -252637 63224 153614 143994 82290 88787 196633 2126 -108991 -131835 -22436
23654 -22436 -155009 -444517 -469774 -291949 -278486 -320258 -303703 -71870 54471 63485 -79422
23643 -79422 -435809 -565042 -457879 -173652 150809 158125 -84503 21207 -53685 -7839
23633 -7839 236741 301012 212826 74448 -57159 -61586 445563 664197 488383 649898 776882
23622G76882j69105k62027j29392O6801Q927k18350j75484K73473K66779j10096
23612C28408j90079j1608J37083j49887R9045J45344l74564Q9487N0785j93601
23602f9587j64917J17607K99641j08377j01260M14198K47314j53681j92261R048
23592B97725o7279j52405n4942K45663j27911k20601j38008J58576J43762J3919
23582I8499k39593j15604r6212M40717J40658q8970j8416j2521j17743l1212l47232
23571c87629J2677K87139j04787o38J44712q2446k30954J03535L44648j08920
23561b2663j21439K42324K4484J3435j5928j25151j58992J57570k95596K5446
23551b76510P9325n8683J04688L41937J60345r826k73004k88830k28582K99879
$$ plain form
23622 776882 607777 345750 216358 283159 292086 73736 -101748 171725 438504 328408
23612 328408 138329 126721 263804 113917 212962 358306 -16258 73229 124014 -69587
23602 -69587 -234504 -116897 182744 74367 -26893 387305 634619 480938 288677 297725
23592 297725 230446 78041 23099 268762 140851 -79750 -217758 -59182 84580 98499
23582 98499 -141094 -256698 -352910 87807 228465 139495 121079 108558 -9185 -40397 -387629
23571 -387629 -374952 -87813 -192600 -193238 -48526 -130972 -361926 -258391 86257 -22663
23561 -22663 -144102 98222 122706 136141 120213 -4938 -163930 -6360 -301956 -276510
23551 -276510 -197185 -255868 -151180 190757 351102 341276 68272 -220558 -449140 -149261
23541a49261K23516k990J3525k14435n9358N6853j03616j04147J05418J52851
23531h1644J40909J65351l110M40609k84907n29427j63203r186J13442K61405
23521E0239k3169r0502Q5227J67057P6454k3290k34482k86354P7246J04366K10145
23510A12937K2950J6750J02580j49720k3594J79707k05782j0485K43554j17894
23500A71003p9760K10957j21555Q5671k29346l39392j22449k03420J82453R1662
23490c54176n7349L84555L11862M4616J7761j20258J9967j85853k10061k23098
23480c72034K47798K25521K5970J04610J11311L03297P089l64528k19028j47065
23470g7059j85138q6495J28956K29363J98408J62287k6403p49j90298r5587l849
$$ plain form
23541 -149261 74255 71265 84790 -129645 -189003 -132150 -235766 -339913 -234495 -81644
23531 -81644 59265 224616 221506 662115 377208 -152219 -315422 -324608 -211166 50239
23521 50239 27070 -63432 21795 188852 265306 242016 7534 -278820 -201574 -97208 112937
23510 112937 135887 152637 255217 105497 81903 261610 55828 45343 288897 171003
23500 171003 91243 302200 180645 266316 36970 -302422 -424871 -628291 -445838 -354176
23490 -354176 -411525 -26970 284892 329508 347269 227011 246978 61125 -148936 -372034
23480 -372034 -124236 101285 127255 231865 343176 646473 653562 289034 70006 -77059
23470 -77059 -262197 -348692 -219736 9627 208035 370322 343919 343170 152872 57285 53436
23459E3436L2004k779K69531L31662j83917j00255P0562L3519k35578P2317L70948
23448G11450R794l10703o9830k84491q0702J65736J57046l6166n2373j22304j70958
23437h3501J24079M5941K7733p7226o5880q902k51994k8636j88594J87538K49291
23426g0151J58615j60098k63811l19590J70057M09446J45808R5192J53019j51012
23416A67475j69572j66633P839K37191J79352k07274q9725J10245N7416j03866
23406B2448J23239j16983j05388p6678J78301N778j4624J39196k0357L9421o320
23395A68033J84295K0437M2968l2873j74641j62295O4300K38922J38227M9564
23385E36937J2078O3424k53201k87549j35892j54303Q1074J28755J96259M7648
$$ plain form
23459 53436 85440 82661 352192 683854 499937 399682 470244 503763 268185 340502 711450
23448 711450 721244 410541 340711 56220 -24482 141254 298300 262134 209761 87457 -83501
23437 -83501 40578 86519 114252 37026 -28854 -37756 -289750 -318386 -506980 -319442 -70151
23426 -70151 88464 -71634 -335445 -655035 -484978 -75532 70276 165468 318487 167475
23416 167475 -2097 -168730 -160891 76300 255652 48378 -41347 68898 126314 22448
23406 22448 145687 28704 -76684 -153362 24939 30717 16093 155289 134932 174353 168033
23395 168033 352328 372765 415733 382860 208219 45924 110224 349146 487373 536937
23385 536937 549015 612439 359238 71689 -64203 -218506 -137432 -8677 187582 235230
23375B35230K6192r2447K7302p055q8905q3172N3177m3136J03798J19084p6712
23364A73356o2937K9576J80471N19763k09474k45842j59718l95753k7105J79360
23354a8303J16453K73214o3590j71327j30399n6168O569L36077L64868j91313
23344D66081l46948p6919J9374J45852J94331M336l1374J13752k24761N6555q876
23333C11403N9173K29218N740k7591j38458l42203r4374J93508j53772l81567
23323c38923N0951L37205L00013j13973k19402l4624k67313L24039M0452M6386
23313A24811L4631j53464k00281k30324j7435J24830K57454j8664J09954Q863
23303D0375k58967p030J81918m1650j00450K80718J398j08952J28053J77257r2413
$$ plain form
23375 235230 261422 168975 196277 189222 100317 17145 70322 27186 130984 250068 173356
23364 173356 110419 139995 320466 840229 630755 384913 225195 -170558 -197663 -18303
23354 -18303 98150 371364 307774 136447 6048 -50120 -43551 292526 657394 466081
23344 466081 119133 42214 61588 207440 401771 406107 374733 488485 263724 320279 311403
23333 311403 370576 599794 605534 577943 439485 97282 2908 196416 42644 -338923
23323 -338923 -287972 49233 349246 235273 15871 -18753 -286066 37973 78425 124811
23313 124811 159442 5978 -194303 -424627 -442062 -317232 -59778 -78442 31512 40375
23303 40375 -218592 -225622 -43704 -85354 -185804 94914 96312 -12640 115413 292670 200257
23292B00257R8392Q6539K0346l02808l91870K48638J27854l400l6007o7985k24586
23281b44630p7313K85536J55165J22581j1828l16569n3494K26095j01760j26018
23271a42235k39023K03115K24743Q1076r9605L6873J83534o3160r0580K63164
23261C57902J55441K39550m18193k75954p1660J58176M215J08858o0019r5922
23251A02394r1622J50062j35955k89873n506J67102j02598k9400K29423Q4773
23241G8800k63035K63939J60508K15725J138j16543K92414l745j54063L2582K0497
23230E28217r9528L7819j9591l3958N4457k97268j19047P3067M7439J56888j76768
23219A51727k11281L4543L33493k72598L4924J97757j01138m714P7342N6297J7456
$$ plain form
23292 200257 298649 385188 405534 102726 -289144 -40506 87348 83948 47941 -20044 -244630
23281 -244630 -321943 -36407 118758 241339 229511 -87058 -140552 85543 -16217 -142235
23271 -142235 -381258 -178143 46600 127676 28071 64944 248478 185318 94738 357902
23261 357902 513343 752893 334700 58746 -12914 145262 149477 258335 198316 102394
23251 102394 10772 160834 24879 -264994 -270500 -103398 -205996 -235396 -5973 78800
23241 78800 -184235 79704 240212 455937 457075 340532 632946 629201 475138 507720 528217
23230 528217 428689 466508 446917 412959 467416 170148 51101 124168 171607 328495 151727
23219 151727 -59554 -25011 308482 35884 70808 268565 167427 162713 240055 296352 313808
23208C13808k0753M76519P5380M3151j29103j94531j4926k238n8967J21916k3050
23197E87206O1923l8750Q8986J0191j96491m70071J37795L42212J3732k91746
23187B44987k7713J85281k1596r2951k26773J1445n8214r8734L70301N01725N5983
23176H43741J31327l7485r8260j10661o3452o1263j5285j63464j76452R0341m9567
23165B89520O9374J34164j0356r1084n9791J12558R2462r3987L8107O7998j64544
23154C84421K06765m2815k92705r627J01764J8661K72876k53110k60643m859p1778
23143D8950P8734J82799M7568K155j79224k87996N9023M9301k02916J44581M6976
23132a0049j04010j383K59549L27648k17951l64492o603J69669J82074K27262
$$ plain form
23208 313808 293055 769574 844954 888105 759002 564471 549545 547307 488340 610256 587206
23197 587206 649129 610379 699365 709556 513065 42994 180789 523001 536733 244987
23187 244987 217274 402555 380959 288008 61235 72680 14466 -84268 286033 787758 843741
23176 843741 975068 937583 839323 728662 665210 603947 588662 425198 248746 339087 289520
23165 289520 358894 493058 482702 391618 331827 444385 536847 442860 480967 548965 384421
23154 384421 591186 548371 255666 246039 347803 366464 639340 386230 125587 120728 48950
23143 48950 127684 310483 358051 360206 180982 -107014 -47991 1310 -201606 -57025 -10049
23132 -10049 -114059 -115442 144107 471755 253804 -110688 -117291 52378 234452 461714
23122D61714j46224q3872J47909J57587L2118M4779L3951k43532l18142k02096
23112a15808p3021q9466m810J72068K06780K31572j42509r9923J87501L53967
23102F26351r6779j0538n15k80585m7958M0175j6055P6299L07675K78567J16144
23091I92781j36772J32874L14472J0420j41086M09542K96119K11542R0731J76456
23081B357079j6237k65260k10386K76799J39981o175k51705k36156j42809M3934
23071A689065M2318o3956k85028m3334j82043P0223K28067k16280j23003j96407
23061I19622n39p2528j87771K01561q0741k08187N5885K11497l5262R7533j33993
23050G67077J55649n0457j34086j40064j3761L5748q332Q0839n5809J75242O1078
$$ plain form
23122 461714 315490 231618 379527 537114 569232 614011 647962 404430 86288 -115808
23112 -115808 -188829 -278295 -283105 -111037 95743 327315 184806 84883 272384 626351
23102 626351 529572 519034 518519 237934 189976 230151 214096 290395 598070 876637 992781
23091 992781 856009 988883 1303355 1313775 1172689 1582231 1878350 2089892 2180623 2357079
23081 2357079 2340842 2075582 1865196 2141995 2281976 2275801 2024096 1787940 1645131 1689065
23071 1689065 1731383 1667427 1382399 1339065 1157022 1227245 1455312 1239032 1116029 919622
23061 919622 919083 846555 658784 860345 779604 571417 627302 838799 803537 901070 767077
23050 767077 922726 872269 738183 598119 584358 620106 611774 692613 636804 812046 873124
23039H73124j94847p5821k32934j00889M7711l8795J92070J09182j45671k02239
23029B30891P11j39678k04674J73854K37592M5185J33642J07970k24890m97444
23019a36841K4176R0889j27831K89070N05826K28679J08565k4046k1423J01154
23009A038218j65459m13232j91334p2074L6224m9920J72163L17946L9706n0848
22999F61390j13417k72154o8951Q9010J70417j16438k78552j6456L7424K62594
22989C54867J36121q3583q852J62891P0575k03463M7095p8180j26261k19698k28862
22978a77350j56480J67434M36909K43773j46222O0255J25707P7854J99235j70191
22968F60924p59648j37627J67269J03440O2082N00934K04117j95644j79185Q7413
$$ plain form
23039 873124 678277 602456 369522 268633 316344 277549 469619 578801 433130 230891
23029 230891 231602 91924 -112750 61104 298696 343881 477523 585493 360603 -136841
23019 -136841 -112665 -21776 -149607 139463 645289 873968 982533 958487 937064 1038218
23009 1038218 872759 459527 268193 196119 232343 182423 354586 672532 712238 661390
22999 661390 547973 275819 206868 295878 466295 349857 71305 54849 92273 354867
22989 354867 490988 407405 398553 561444 632019 428556 475651 397471 271210 51512 -177350
22978 -177350 -333830 -166396 270513 514286 368064 428319 554026 631880 831115 660924
22968 660924 -98724 -236351 -69082 34358 96440 597374 801491 605847 426662 514075
22958E14075q3438J9080J81443j63113K30069Q1798o4624o8344J00650n6460l2936
22947F58200J05519n4318m4780l43541J65R127k22159L2510L15852L21100p0406
22936G07269j64796k12104k2646k6695J734J20192J95176J24644K9920r8407l04540
22925C49747k48064R4661R9788J11511O2956j47805J18251j6613M8115j12854
22915C59693N0559K29713M7345J43186k3627K03431J25892K91176l3193l68911
22905A025264L8084j03857k23404k72914J3735m6621j1088J09030K66099J26354
22895I20682P9463L999j64382k82267M7025m3699k95144J69371K60985n1882r9969
22884E44182R7125r3067J13033J07586k25503Q2919K27294j52400m34688j6985
$$ plain form
22958 514075 430637 449717 631160 468047 698116 779914 715290 646946 747596 691136 658200
22947 658200 763719 709401 664621 321080 321245 330372 108213 140723 456575 777675 707269
22936 707269 542473 330369 307723 281028 282762 402954 598130 722774 752694 654287 349747
22925 349747 101683 196344 296132 407643 470599 322794 441045 424432 472547 359693
22915 359693 410252 639965 687310 830496 806869 1010300 1136192 1427368 1394175 1025264
22905 1025264 1063348 959491 736087 463173 476908 430287 419199 528229 794328 920682
22895 920682 1000145 1004144 839762 557495 604520 560821 265677 435048 696033 644151 544182
22884 544182 641307 548240 661273 768859 543356 626275 853569 701169 266481 249496
22874B49496L57515L00520n7886j87308l42497P1970L14728m638J10696J07348
22864I19944M54286j23008K267k32000k14632J13985N4613J64445K08553k75508
22854A072945m10380J3346K1463r6285P0590j29916J10931J34473O8097j4375
22844H40889j19795m1577N9348J90817j38912j81249J08219j40174k766J99687
22834G74487M02940j10064R2970k9397m33996n09868P9749J65737l10216K38691
22824C61033J14959R155L05870J30419K172L4552k6118j60411k47339K4276k5955
22813E22613J37140M28774K52757j4895k8287l08449m07893N6400J20518K19269
22803I77947K9262L9403j2199m4830L2957J09559K26912l16494l20887K59582
$$ plain form
22874 249496 607011 907531 849645 662337 319840 391810 706538 701900 812596 919944
22864 919944 1374230 1251222 1253489 1021489 806857 920842 975455 1139900 1348453 1072945
22854 1072945 662565 675911 697374 601089 671679 541763 652694 787167 855264 840889
22844 840889 721094 679517 738865 929682 790770 609521 717740 577566 574800 774487
22834 774487 1177427 1067363 1160333 1130936 696940 187072 266821 432558 122342 361033
22824 361033 475992 485147 791017 921436 923608 958160 932042 771631 524292 548568 522613
22813 522613 659753 1088527 1341284 1326389 1298102 989653 581760 638160 758678 977947
22803 977947 1007209 1046612 1034413 989583 1022540 1132099 1359011 1042517 721630 981212
22793I81212N33923j05689P3276k68031j87371k05709J96502J86104P016q9597
22783A121636L0474J08024J03638O9127j24499K219R3326M4656q2014l1944O9022
22772A403665j27748l40697j65313J11614O0486J49036J54275K49858K83388j09369
22762A669195J84200K11690J0610O1433j93096k293l54487j64637K42012N19068
22752B183695j06198l69058J40416J60122N9791J696o1577j98921r3615K8888
22742A745239k78323l19525m6963L76984K66744k83542k15682p0790K71628j956
22732A443814j09283K5846K50382Q137K4271K6018J05643O881k52007l7902k273
22721A489527J02278q5655j82798j37556N0541j9724l11787R9139O7687J66844
$$ plain form
22793 981212 1515135 1409446 1482722 1214691 1027320 821611 1018113 1204217 1211233 1121636
22783 1121636 1152110 1260134 1363772 1432899 1308400 1310619 1403945 1448601 1366587 1334643 1403665
22772 1403665 1275917 935220 769907 881521 942007 1091043 1245318 1495176 1778564 1669195
22762 1669195 1853395 2065085 2075695 2137128 1944032 1941739 1587252 1422615 1664627 2183695
22752 2183695 2077497 1708439 1848855 2008977 2068768 2070464 2008887 1809966 1716351 1745239
22742 1745239 1466916 1147391 1100428 1477412 1744156 1460614 1244932 1174142 1445770 1443814
22732 1443814 1334531 1360377 1610759 1618896 1643167 1669185 1774828 1781709 1529702 1491800 1489527
22721 1489527 1591805 1506150 1323352 1185796 1236337 1216613 904826 1003965 1071652 1238496
22711A238496K02921K72772J5672Q633J67142j38967R4300J09565J0572j18557
22701A862549j1195K25063O3993k7405n2202j40954O1953L06923K16726k08408
22691B297043j53890O652J14297L0192r6022j71681J57766J29270j60525j95125
22681A957977L9930j86323q1718n0027J26980l039J4730L25477N1083Q7263J48255
22670B430588k11409j1842K2962K09515k078r0350P0744P7527J85442O2166j4850
22659B728415N0986j67260k6687K53533K03831q2761N6937J21551J74620J44659
22649C457824q6586k07341K9044J86571J42518O6894p7178j17010J2816K93439
22639C700991P5416k19334L69954K36878r3717j0995R1476L0507m2248j06734
$$ plain form
22711 1238496 1441417 1714189 1729861 1738494 1905636 1766669 1860969 1970534 1981106 1862549
22701 1862549 1851354 2076417 2140410 2113005 2060803 1919849 1981802 2288725 2505451 2297043
22691 2297043 2143153 2149805 2264102 2294294 2198272 2026591 2184357 2313627 2153102 1957977
22681 1957977 1997907 1811584 1729866 1679839 1806819 1803780 1818510 2143987 2195070 2282333 2430588
22670 2430588 2219179 2207337 2230299 2439814 2437736 2347386 2418130 2495657 2681099 2743265 2728415
22659 2728415 2779401 2612141 2585454 2838987 3042818 2960057 3016994 3138545 3313165 3457824
22649 3457824 3371238 3163897 3192941 3379512 3522030 3588924 3511746 3394736 3407552 3700991
22639 3700991 3776407 3557073 3927027 4163905 4070188 4059193 4150669 4181176 4138928 4032194
22629D032194J5134R5126n9069o9076L005j46351J20776R9503J04180R0976m8697
22618D237701n2869J23750K22941j3516j5953r5856L08218J54269M9829P2472
22608D990986J49749J75318J05815L33611J03649l29439r3845J52849L38999M68235
22598F395927L16355J66956l19956k73062O7159M60158L24852M51767L31593L67284
22588H289033K68708L53886J99534J41193K20616J14278L52588L81948M04744
22579A0726528J93992R9452L00714M08918K13911n5660k446J2669M49878K03242
22569A2551198P4503K17512R1655K67633L36647L74658K85062N64626L50670J24030
22559A5238194M16675L86523K93299M73146N11978M88663M94103N88630Q45150
$$ plain form
22629 4032194 4047328 4142454 4083385 4014309 4017314 3870963 3991739 4091242 4195422 4286398 4237701
22618 4237701 4184832 4308582 4531523 4518007 4502054 4406198 4714416 4868685 4918514 4990986
22608 4990986 5140735 5316053 5421868 5755479 5859128 5529689 5435844 5588693 5927692 6395927
22598 6395927 6712282 6879238 6559282 6286220 6353379 6813537 7138389 7590156 7921749 8289033
22588 8289033 8557741 8911627 9111161 9252354 9472970 9587248 9939836 10321784 10726528
22579 10726528 10920520 11019972 11320686 11729604 11943515 11887855 11885409 11898078 12347956 12551198
22569 12551198 12625701 12843213 12934868 13202501 13539148 13913806 14198868 14763494 15114164 15238194
22559 15238194 15654869 16041392 16334691 16807837 17319815 17808478 18302581 18891211 19736361
22550A9736361R60532R75235R68516J013471P12613Q40630J091246R87309J380498
22541B8666411J550248J604192J486525J861612J930414J813041K158889K552137
22533D3623469K574376K903260L265676L225358L645147M286894M825125N345676
22525G3694981O017357O494715P266162Q287077R677050J0886891J2054189J3739937
22517A48118359J5238384J6877946J9063700K0718237K2230734K3061035K3311596
22510B88619991K3228692K2235045K0075086J6365808J2337099P086562R46476
22503C90894759m477572r845574j4556798j8609128k1988732k3798542k4510898
22496B73107515k4228486k3084917k0934102j9634110j7775049j5650897j3572673
$$ plain form
22550 19736361 20696893 21672128 22640644 23654115 24366728 25207358 26298604 27285913 28666411
22541 28666411 30216659 31820851 33307376 35168988 37099402 38912443 41071332 43623469
22533 43623469 46197845 49101105 52366781 55592139 59237286 63524180 68349305 73694981
22525 73694981 79712338 86207053 93473215 101760292 111437342 122324233 134378422 148118359
22517 148118359 163356743 180234689 199298389 220016626 242247360 265308395 288619991
22510 288619991 311848683 334083728 354158814 370524622 382861721 389948283 390894759
22503 390894759 386417187 376571613 362014815 343405687 321416955 297618413 273107515
22496 273107515 248879029 225794112 204860010 185225900 167450851 151799954 138227281
22489A38227281j2216228j1267755r866244q368584p340999o871085o086929n263570
22481G0945887n084896m649234m194679l868784l215942k955595k818816k575892
22473D1582049k105716k250910j992174j761219j549753j456715j345939j386605
22465B7733018r26639r62670j294862j107934r52908j027989p73243o89026p44678
22456A9253069o67359m74935o54234p12214o62195k97824l61153l49696m89737
22447A4583722n38424n69414n48191m77123k29044m41747j20313o7229j26691
22438A1465546m07118k86796j38196k4673j37845p8754k51779k50964j23562j39445
22428I626414m10286k85900l31810l17039k92351l26087j97800j83133k65112
$$ plain form
22489 138227281 126011053 114743298 104877054 96508470 89167471 82296386 76209457 70945887
22481 70945887 65860991 61211757 57017078 53148294 49932352 46976757 44157941 41582049
22473 41582049 39476333 37225423 35233249 33472030 31922277 30465562 29119623 27733018
22465 27733018 26806379 25843709 24548847 23440913 22488005 21460016 20686773 19997747 19253069
22456 19253069 18585710 18110775 17456541 16744327 16082132 15784308 15423155 15073459 14583722
22447 14583722 14045298 13475884 12927693 12450570 12221526 11779779 11659466 11592237 11465546
22438 11465546 11058428 10771632 10633436 10608763 10470918 10392164 10140385 9889421 9765859 9626414
22428 9626414 9216128 8930228 8598418 8281379 7989028 7662941 7465141 7282008 7016896
22419G016896j95682k14349l73018k44567j20310j16804k87415k39833J75775
22410E400693k0648m99388j07988j3978k4869j58118Q6429k89185k10930l02560
22400C859458j16524M5228q3048R6567n6502j18954j85134k72252j57616R2878
22390C104101K53840J11391l2115o1519j58842J60520j47997k79015q0503j55842
22380B714019L51818J96709M5497j65184J23626l1074k58792j14198j89838k28088
22370B444495J12317M059r3021J4693Q6439l0389j76976j4016J25578j77568k89102
22359B006509k83687l1660M3910r5920J48118q5426j3489P9843Q9556j23885k01053
22348A532816l5519J14658K06530r1564j94735J66977J3951l73147j47430l21445
$$ plain form
22419 7016896 6821214 6606865 6233847 5989280 5868970 5752166 5464751 5224918 5400693
22410 5400693 5380045 4880657 4772669 4758691 4733822 4575704 4662133 4372948 4162018 3859458
22400 3859458 3742934 3788162 3705114 3801681 3745179 3626225 3441091 3168839 3011223 3104101
22390 3104101 3357941 3469332 3437217 3375698 3216856 3377376 3229379 2950364 2869861 2714019
22380 2714019 3065837 3262546 3308043 3142859 3266485 3235411 2976619 2862421 2672583 2444495
22370 2444495 2556812 2560871 2467850 2482543 2568982 2538593 2361617 2347601 2473179 2295611 2006509
22359 2006509 1722822 1691162 1735072 1639152 1787270 1701844 1688355 1768198 1857754 1733869 1532816
22348 1532816 1497297 1611955 1818485 1726921 1532186 1699163 1713114 1339967 1192537 871092
22338H71092J02866J24365j53265j8930n0767j00236j18084k42055K97945j69115
22328E43816J42604J28158j49098k03950j64360O1665r237Q6626J18999k9990
22318E25233M6970K6095k86838q8864m702J14071J74308k1068m7741l16044j86666
22307f5246k3100j08773k3764J20574L6424J80595J20042j0780J10968n4226k05410
22296G7304K02930o656l5040o3906j20007J06113q426K96026l3700n27641j98996
22285c11999J59640M8847j9734J81494K48991j23630m6338o3210Q4554p3898j39357
22274e4640j47232J38983q3276j92805J63577M98626J88263k69175j47261j33098
22264c8038j90086k60397P4717L281J43255J75388l24731k4832K79811J2121j04391
$$ plain form
22338 871092 973958 1098323 945058 926128 875361 775125 657041 414986 712931 543816
22328 543816 686420 814578 665480 461530 297170 358835 349598 436224 555223 525233
22318 525233 572203 598298 311460 222596 217894 331965 506273 485205 437464 121420 -65246
22307 -65246 -88346 -197119 -220883 -100309 -63885 116710 236752 225972 336940 282714 77304
22296 77304 280234 273578 238538 174632 54625 160738 152312 448338 414638 -113003 -311999
22285 -311999 -152359 -103512 -123246 58248 307239 183609 137271 74061 158615 84717 -54640
22274 -54640 -201872 -62889 -146165 -338970 -175393 323233 511496 242321 95060 -38038
22264 -38038 -228124 -488521 -413804 -410523 -267268 -91880 -416611 -441443 -161632 -149511 -253902
22253b53902J76700k25584O224L14211r234J80328M07145k23531k36520m1628
22243I4209j36520M7903J23081M6829l2900J2842K04920J49403N6078k61781m15551
22232a11487R5414L9629j08714K82621O4530l04286j19576J65328P6177J8564
22222I8200j45064K28109J68151k74347l41202j85351J85782J25665K6647L52522
22212B39112L08396k34036n9504k10165j56355L0377j39415j62857R8523Q2950
22202b02974l0704k5951K32736J85460J00213j81950j60856J60056l8499k9264
22192H267P0802k1312j58318l7965P2094R3362N3688L6393k15762J39297P0502
22181A11048p2789J13224L32968M4673k39211l01252J16691J90077J8275P419
$$ plain form
22253 -253902 -77202 -302786 -296562 17649 8415 188743 595888 372357 135837 94209
22243 94209 -42311 5592 128673 175502 142602 155444 360364 509767 565845 304064 -111487
22232 -111487 -16073 23556 -85158 197463 261993 -42293 -161869 3459 79636 98200
22222 98200 -46864 181245 349396 75049 -266153 -451504 -265722 -140057 -113410 239112
22212 239112 547508 313472 253968 43803 -112552 -82175 -221590 -384447 -285924 -202974
22202 -202974 -233678 -259629 -26893 158567 258780 76830 -84026 76030 37531 8267
22192 8267 79069 57757 -100561 -138526 -66432 26930 80618 117011 -98751 40546 111048
22181 111048 38259 151483 484451 529124 289913 -11339 105352 295429 313704 321123
22171C21123j55409j66140M5761p3987k8820o7951K7977K54268j79968j21900
22161a45046R5093K05709O6813K4146M3261R5539J4383k11956l31376q3460l3215
22150b60109K17526j19973L3730Q767k41478J42608J63535K3991k80478j25923
22140d37804J31941k798K18034J87147M0593r9800k0115j21555m9161J29028o1488
22129h5978j60013K8114o9163Q1641n8266k09440R7320J36093m6143k64923p6608
22118f27366j31264O8517J94685K15582J52843K42718n0696k6423j26498l2084
22108a19986j57792j93562J71681l6127J94348L25062J23628l17322n2691K24123
22098A61362j7213k23229Q4004J89064K07882R3627j30052j51854j27479o2820
$$ plain form
22171 321123 165714 -426 45335 -28652 -57472 -125423 -97446 156822 -23146 -145046
22161 -145046 -49953 155756 222569 246715 289976 385515 399898 187942 -143434 -226894 -260109
22150 -260109 -42583 -162556 -128826 -120059 -361537 -218929 -55394 -31403 -311881 -437804
22140 -437804 -305863 -308661 -90627 96520 137113 37313 17198 -104357 -153518 -24490 -85978
22129 -85978 -245991 -217877 -287040 -205399 -263665 -473105 -375785 -239692 -285835 -550758 -627366
22118 -627366 -758630 -690113 -495428 -279846 -127003 115715 65019 38596 -87902 -119986
22108 -119986 -277778 -471340 -299659 -335786 -141438 183624 307252 -10070 -62761 161362
22098 161362 144149 -79080 4924 193988 401870 495497 365445 213591 86112 23292
22088B3292J51808n594j9850l7469l03131L29580J38579L3026Q5842k58985k42593
22077a05495o9630J08976K0261k5372l2153J55584J32338J31717L039n30787N7208
22066a54314J99021k44225j72812J06499P0924m0534j57350J55249J65550j31231
22056b03223J33264j00708K10148j67174K0215n5118J2399j58625j27068J35656
22046c00234J65101K57288j22316l60091l1683n2172J55182J23158J59744l4801
22036d0824J32378l8822k04925j68577j23445o8578J65777L73469j22094j40838
22026b36479J69621j25588N6888o5856M1378p184J06288L929J2863k50354J1819
22015b82675j08463n2466J11579Q0350j42257M9871K89800J04596L7708K5541
$$ plain form
22088 23292 175100 169506 149656 112187 -190944 138636 277215 310241 396083 137098 -105495
22077 -105495 -175125 -66149 -45888 -71260 -103413 52171 184509 316226 319265 -211522 -154314
22066 -154314 44707 -199518 -372330 -265831 -194907 -235441 -392791 -237542 -71992 -203223
22056 -203223 -69959 -170667 39481 -127693 -107478 -162596 -150197 -308822 -435890 -300234
22046 -300234 -135133 122155 -161 -360252 -391935 -444107 -288925 -165767 -6023 -40824
22036 -40824 91554 52732 -152193 -320770 -444215 -512793 -347016 26453 -95641 -236479
22026 -236479 -66858 -192446 -135558 -201414 -160036 -167220 -60932 -57003 -44140 -294494 -282675
22015 -282675 -391138 -443604 -332025 -251675 -393932 -344061 -54261 50335 88043 113584
22005A13584o233J28557l50962k54569p5610J35445J10795J69698N0120j81191
21995a60366l7514M3991J51345j87160j11002L05291J50612k7027o9102j24352
21985f5284j70214k10920J70916K9776m0250j81395r95R3015M2950K59320l01559
21974c74640o8396M67827L08462J02600o0205j80117j15442n5776m5317J1279
21964i725K29475J7736P6327o4573n2466k16826j42969K35986P8717j94295o0200
21953a02813q3454Q6515K34815K70782j23914l33043j42071J07693J13885M6618
21943G5013P3992j48731L28960q0406L103R0697O4815J99471P267o2293J25679
21932F77567M5058N8919L89208M41890K70313P7913n0279k83033p6275K72316
$$ plain form
22005 113584 107351 235908 -115054 -369623 -445233 -309788 -198993 -29295 20825 -160366
21995 -160366 -197880 -153889 -2544 -189704 -300706 4585 155197 128170 59068 -65284
21985 -65284 -235498 -446418 -275502 -245726 -285976 -467371 -468366 -375351 -332401 -73081 -374640
21974 -374640 -443036 24791 333253 435853 375648 195531 80089 24313 -21004 -9725
21964 -9725 219750 237486 313813 249240 196774 -20052 -163021 72965 151682 -42613 -102813
21953 -102813 -186267 -99752 135063 405845 281931 -51112 -193183 -85490 28395 75013
21943 75013 149005 274 329234 248828 251931 342628 407443 606914 614181 551888 677567
21932 677567 722625 781544 1170752 1612642 1882955 1960868 1910589 1627556 1551281 1823597
21922A823597K2839M2293K10920l60503k59495J1554J4529O3784k30802j34943
21912A203773K05496j71396l14275k92890l86925J73648m3034J6392J38447p7901
21902D51335j74939j01521k25879P1772m5725r8586j5092P5726j67677n5039L7563
21891b48062K08293k4755q5871k20522k6425O0514j29052r566L29008K76782M13766
21880E44110Q2816j91829j11138k20331j09465k01281J36849K02123J01958l6715
21870A97097l0052o7882N1492j97946l9372K52894P0833l731k99993m06301J05402
21859c67559Q6173J5534K45304L8724j37897J8803P8425N6840m2333n9001j66284
21848b33271l36684l0926j13701k696r1099J46501j4510k3458J71604P6065N6161
$$ plain form
21922 1823597 1846436 1888729 2099649 1739146 1479651 1491205 1505734 1569518 1338716 1203773
21912 1203773 1409269 1237873 923598 630708 243783 417431 374397 390789 529236 451335
21902 451335 276396 174875 -51004 20768 -24957 -123543 -138635 -62909 -230586 -285625 -248062
21891 -248062 -39769 -64524 -150395 -370917 -397342 -336828 -465880 -475446 -146438 130344 544110
21880 544110 626926 435097 323959 103628 -5837 -207118 -70269 131854 233812 197097
21870 197097 167045 99163 150655 -47291 -86663 166231 237064 233333 -66660 -472961 -367559
21859 -367559 -281386 -265852 -20548 18176 -119721 -100918 -22493 34347 -7986 -66987 -233271
21848 -233271 -569955 -600881 -714582 -717278 -808377 -661876 -676386 -699844 -528240 -452175 -396014
21837c96014k1585J61671k08434k01570K35323K78779J49344J64048L2605k24832
21827c0665k22434k16284o9469J20581p8766K43110J33245k4440J46439j54889
21817a53572J98782j01888L7043J10783j54946j07065L2383N7961J56160j04723
21807b9082j53365P7609L890J10906j71126k29144K27194Q2696l2031J06435k1681
21796b7699R6378k15100k34226P2056J89090R8098k02981K0066n3182j70124P8330
21785c49294j25324J71684K86405k06053p6889N00697J87711j30316j91598k44481
21775a77458L4789K11050M5624k19313k70125k1259J91502r8452M8488N2152l0341
21764b33343j14615J97018P5215p0179j5730J48799J6799k34749r8021L6170Q3105
$$ plain form
21837 -396014 -417599 -255928 -464362 -665932 -430609 -151830 -2486 161562 194167 -30665
21827 -30665 -253099 -469383 -538852 -418271 -497037 -253927 -120682 -145122 1317 -153572
21817 -153572 45210 -56678 -19635 91148 -63798 -170863 -138480 -80519 75641 -29082
21807 -29082 -182447 -104838 -100948 9958 -161168 -390312 -163118 -80422 -112453 -6018 -27699
21796 -27699 68679 -146421 -380647 -308591 -119501 -21403 -224384 -204318 -257500 -427624 -349294
21785 -349294 -474618 -302934 -16529 -222582 -299471 201226 388937 258621 67023 -177458
21775 -177458 -142669 68381 114005 -105308 -375433 -396692 -205190 -303642 -255154 -203002 -233343
21764 -233343 -347958 -150940 -75725 -145904 -161634 -12835 3964 -230785 -328806 -292636 -209531
21753b09531n1542J8905M4297r4690J76634R7040j45182r1198O8399K08690l3108
21742a1286P0900J20298k25136m5721J03850J9513J18530P8354l73275l49851
21732d93824K61565L72921K54939N5257l54491k18386K31394r6545m424k5944
21722a7538N2219J09936O1474r6708j31953j4306j30425n0999O4935Q8168P6619
21711A1422R8186j82298k57249J23077L5216J4047J33691K06845r4114j86276
21701i7453R8708O3616o0210j03808J54274q7122j0082K8327M938j23501l3139
21690a65452Q3730k11462l3217O988Q9o3346J9046K13771O7206O5323N9087J64466
21678B06229J18784k7681o4709k811j6960j96210k03483j37433j84486k79275
$$ plain form
21753 -209531 -261073 -242168 -197871 -292561 -115927 -18887 -164069 -255267 -186868 21822 -11286
21742 -11286 59614 179912 -45224 -90945 12905 32418 150948 229302 -143973 -493824
21732 -493824 -232259 140662 395601 450858 96367 -122019 109375 12830 8406 -17538
21722 -17538 34681 144617 206091 109383 -22570 -36876 -167301 -218300 -153365 -65197 11422
21711 11422 109608 -72690 -329939 -206862 -171646 -157599 -23908 182937 88823 -97453
21701 -97453 1255 64871 4661 -99147 55127 -31995 -42077 -13750 -8812 -132313 -165452
21690 -165452 -81722 -293184 -326401 -319413 -319324 -382670 -363624 -149853 -82647 -17324 41763 206229
21678 206229 325013 297332 232623 229812 212852 16642 -186841 -324274 -508760 -788035
21668g88035r9921R0574J81356K67531J64894O42p7387r5499k1480O2681J15430
21657a99214l5830M9936Q9954j30708N1608R1728L25389J83595j30283k01616
21647I4559m15260J74335K74966k9123J55355l6200k79738m4153K6788j6958j10392
21636b05821J5267p8233J64302L88900o8448k65903j68107r8414K54882L21639
21626B60064j19951m65997k39857J72784J1950j63904j2303K39999k4834q1227
21616d23276J63423J79015m9500P242j36970L102p5642K816R1996R9838K53112
21605A15156Q32o5036k06927j20797J23658Q1744J9725q1575o0548K31531J74779
21594B12542o0943j27802p6257R6616j11090l1912j09484k3150K64461J2182R0188
$$ plain form
21668 -788035 -887956 -797382 -616026 -348495 -183601 -182959 -260346 -355845 -377325 -314644 -199214
21657 -199214 -235044 -185108 -95154 -225862 -174254 -82526 242863 426458 296175 94559
21647 94559 -320701 -146366 128600 99477 254832 218632 -61106 -105259 -78471 -95429 -205821
21636 -205821 -190554 -268787 -104485 284415 215967 -49936 -218043 -316457 -61575 260064
21626 260064 140113 -325884 -565741 -392957 -381007 -544911 -557214 -317215 -342049 -423276
21616 -423276 -259853 -80838 -130338 -123096 -260066 -256964 -332606 -329790 -237794 -137956 115156
21605 115156 115988 50952 -155975 -276772 -153114 -71370 -51645 -133220 -193768 37763 212542
21594 212542 151599 23797 -52460 44156 -66934 -98846 -208330 -231480 32981 45163 135351
21583A35351K8787J66584l06943j63661J1109n3129P2892P9988R7206j7891O7930
21572A18223R4694l36719l96156k59118Q7362K29599J33559L55891m286j17835
21562i4786P2006k61718m7677Q0924J68959J9494J46297j21406k32884j90813
21552d61604J12305J88345L36583Q6196K9486N0489r7500j67085j99027j90437
21542c12249r5297K46444p3002J07016K83986j5220Q302o1812q0080q2195j5269
21531h9376j69562j08785J02026R8833J751k7591J94210K31347k72725k34860
21521b74732N9547M3537m1308J07319N044K11071J28020M91023r4625k35021l81548
21510A8327k84706J94302K43182R3976r6178j15088M841J121j86705j65706j2763
$$ plain form
21583 135351 164138 330722 23779 -139882 -128773 -181902 -109010 -29022 68184 50293 118223
21572 118223 212917 -123802 -519958 -779076 -691714 -462115 -328556 27335 23049 -94786
21562 -94786 -22780 -284498 -332175 -251251 -82292 -62798 83499 -37907 -270791 -461604
21552 -461604 -349299 -160954 175629 261825 291311 341800 244300 77215 -121812 -312249
21542 -312249 -407546 -161102 -234104 -127088 156898 141678 149980 88168 8088 -74107 -89376
21531 -89376 -258938 -367723 -265697 -166864 -165113 -192704 1506 232853 -39872 -274732
21521 -274732 -215185 -171648 -212956 -105637 -100593 110478 238498 729521 634896 399875 18327
21510 18327 -266379 -72077 171105 265081 168903 53815 58656 59777 -126928 -292634 -305397
21499c05397J27548Q9659Q8202J96754p150j08901J16735k68879n9194N4538k29244
21488c05329K73391L44389k20312p7291p4789P2193N7261k51733L5373J86347
21478C9500j90081k9450K26644j35913o6143J04834n2036j13632k10427J83222
21468b43482P4548p9397J40902j20060j33171k93259k02160J52629J61526J77674
21458c64250J01531J46145L10271q1216o7228O1374M4994k5648J2492L3215r0085
21447H1595m1245J7173R1286j9828l5174p3742M7193k34396j95667o6418o092
21436d35315J43516j5052M7782r0320k3034L36795J52430j43022j09724N3238
21426h2706P9918j01521j31565O4859J14452J78973k59040p3792K56337J82943
$$ plain form
21499 -305397 -177849 -88190 12 196766 189616 80715 197450 -71429 -130623 -76085 -305329
21488 -305329 -31938 312451 92139 14848 -59941 12252 69513 -182220 -146847 39500
21478 39500 -150581 -180031 46613 -89300 -155443 -50609 -102645 -216277 -426704 -243482
21468 -243482 -168934 -248331 -107429 -227489 -360660 -653919 -856079 -703450 -541924 -364250
21458 -364250 -262719 -116574 193697 112481 45253 106627 151621 125973 138465 171680 81595
21447 81595 40350 57523 148809 128981 93807 20065 67258 -167138 -362805 -429223 -435315
21436 -435315 -291799 -306851 -259069 -349389 -372423 -35628 116802 -26220 -135944 -82706
21426 -82706 -2788 -104309 -235874 -171015 -56563 122410 -136630 -210422 45915 228858
21416B28858m4732j75688L7769J81514K48294j9224k21922k36131j6554r2785
21406a10601j67225n3173K04310K47532J25286J22608j80347k01715Q9141J91293
21396B67109J02999j56083P0528j60751k61877l9095Q9856p1302o5373m8805K46364
21385b6430P1871j12177K71087K85400k42691j29995R4069m20K0758N7843N0920
21374C40235o7828k73891O8543N5125P502j98327j11279L4193j8798M7043K42697
21363A25215k02698l50486m6061K45110P4592o1597p265r486L52386j0124n5338
21352E4248Q5514J14531R3848j6497k67053J61995j29780m4923K43429j50580
21342A44732m12137j18165o3662J96542m9174j85153K83584L14822p9738k0016
$$ plain form
21416 228858 184126 8438 46207 227721 476015 456791 234869 -1262 -17816 -110601
21406 -110601 -277826 -330999 -126689 120843 246129 368737 188390 -13325 75816 267109
21396 267109 370108 214025 284553 123802 -138075 -177170 -87314 -158616 -223989 -272794 -26430
21385 -26430 45441 -66736 204351 489751 247060 117065 211134 210714 231472 289315 340235
21374 340235 272407 -1484 67059 122184 129686 -68641 -179920 -145727 -164525 -117482 125215
21363 125215 -77483 -427969 -474030 -228920 -154328 -215925 -223190 -232676 119710 109586 54248
21352 54248 139762 254293 348141 331644 64591 226586 96806 51883 295312 144732
21342 144732 -267405 -385570 -449232 -252690 -301864 -487017 -203433 111389 31651 11635
21332A1635K62521J02856j57024K42191R8903j1871k75009K3643J73193P2956
21322E43994n9359k25898J795j03499P2934K0446O1763p9224M5315l6494j33403
21311A08370l62315P0705k2640j16501L0647k8848n0529J85000K76118K55455
21301C45462Q478n5982r8147q8599J31855m384O5192k08867J22163L41657m4079
21290E14749r7503n098j20808k17030j94253K09351p5600J4586K10839J38784
21280C78017k05127k052J0912r9642Q2489L44594R0475J42934k40952l6775L7413
21269E02286n7591k02287j04017n4009j10663o1152l29617j80235O6495M66690
21259f4100L22964j10186n54621Q3366K77076K50287J18810j36874l3898o5355
$$ plain form
21332 11635 274156 377012 219988 462179 561082 549211 274202 297845 471038 543994
21322 543994 484635 258737 260532 157033 229967 250413 312176 232952 278267 241773 108370
21311 108370 -253945 -183240 -205880 -322381 -291734 -320582 -371111 -186111 90007 345462
21301 345462 353940 297958 199811 111212 243067 238683 303875 95008 217171 558828 514749
21290 514749 417246 412148 291340 74310 -119943 89408 13808 28394 239233 378017
21280 378017 172890 170838 181750 82108 164597 509191 599666 742600 501648 464873 502286
21269 502286 444695 242408 138391 84382 -26281 -87433 -417050 -597285 -530790 -64100
21259 -64100 258864 148678 -405943 -322577 -45501 204786 323596 186722 152824 87469
21249H7469j5935Q5486K39271N28876J9884k02755p4706K4451j26693R5108k7191
21238F33265J08080R7403K63437K21473j3073K8041o9458o3115J79075J91915
21228A577043j73873J07159j48710k64286J13954L80633K42376m3767r0259K26238
21218A926508N00493o0629m83116m24761l76159P439K84993j10051j93839j5142
21208A055736k54783o3413M8374k0733l9793o1927j12201J18426p0414j6114J95331
21197G78489J48497j94412k14356m1579k8782j43650O0816p3787m4646k0422J19178
21186C45346J07246L7412K5088N2745p9759J0896P4613j08473l76398o951N5271
21175A37036J84935n0959j42265k6554k1863J4969K15176j1965O2997P4451r4003
$$ plain form
21249 87469 71534 157020 396291 925167 945051 742296 667590 692041 565348 660456 633265
21238 633265 741345 838748 1102185 1323658 1310585 1338626 1269168 1206053 1385128 1577043
21228 1577043 1403170 1510329 1361619 1097333 1211287 1591920 1834296 1790529 1700270 1926508
21218 1926508 2427001 2366372 1883256 1458495 1082336 1089775 1374768 1264717 1070878 1055736
21208 1055736 800953 737540 785914 765181 725388 663461 551260 669686 599272 583158 778489
21197 778489 926986 732574 518218 476639 447857 304207 365023 291236 246590 226168 345346
21186 345346 452592 490004 515092 567837 488078 498974 573587 465114 88716 81765 137036
21175 137036 321971 271012 128747 102193 80330 95299 310475 298510 361507 435958 341955
21164C41955K42466R8502k37688l42567N7392J55656J86526J74507l88014j86914
21154A01821K17341L21181j60389m19115k44732J05693J59291J98862j5837j02280
21144A61836j93714Q9605J76064l77756q2805J82865Q2426l9643k5731J34997
21134A08144L83561L50889l24478l20907j09502j31481j21794K71442K02421P3985
21124C82280n5433j02419j59051k3404q9004j58944k4918L31092K10476L3897
21114C44572k24408j48773N1934j79451J48534L48552j47396J03013n433j34768
21104A56376q983J30612j19044J50110M4531j63163j43332L53900K20177j43844
21094D77340k23781k16292k08960J891K87631J42490m8737j05337p0284Q8300
$$ plain form
21164 341955 584421 682923 445235 102668 160060 315716 502242 676749 288735 101821
21154 101821 319162 640343 479954 60839 -183893 -78200 81091 279953 264116 161836
21144 161836 -31878 57727 233791 -143965 -226770 -43905 38521 -1122 -26853 108144
21134 108144 491705 842594 518116 197209 87707 -43774 -165568 105874 308295 382280
21124 382280 326847 224428 65377 41973 -47031 -205975 -230893 100199 310675 344572
21114 344572 120164 -28609 23325 -156126 -7592 340960 193564 296577 291144 156376
21104 156376 147393 278005 158961 309071 353602 190439 47107 401007 621184 477340
21094 477340 253559 37267 -171693 -169802 117829 260319 211582 106245 35961 124261
21084A24261n0131J13279J89499p7776q7940J1603p6741J52342j03223m8819m0681
21073A05673J19381j48761q8780j1605j85145l6053K13895j50199L5282R6233
21063e0079m3160R6576P5322L312k98394k65238J59005K67977J98114K67488O1715
21052D72638j15762k32287j72457J03997p244j71526k9913K29063K81619o5123
21042B93005R470M8358R0448j04634l58041j8888J60926K03330J47869J60327
21032F32170J50681j15667q1052J58885j6836k81549k09443j3627L94164Q3403
21022G01129q4241j84236J09951M54k16374M314J81619j24638j37685Q3367o793
21011C26867R358J16532K77804q0307j81482n0421j79704J51042K45560j44781
$$ plain form
21084 124261 74130 187409 376908 299132 211192 222795 146054 298396 195173 146354 105673
21073 105673 225054 76293 -12487 -24092 -209237 -245290 -31395 -181594 -146312 -50079
21063 -50079 -93239 3337 78659 81971 -216423 -481661 -322656 -54679 143435 410923 472638
21052 472638 356876 124589 -47868 56129 48885 -122641 -152554 76509 358128 293005
21042 293005 302475 350833 441281 336647 -21394 -40282 120644 323974 471843 632170
21032 632170 782851 667184 586132 745017 728181 446632 237189 223562 617726 701129
21022 701129 616888 432652 542603 543057 326683 330997 512616 387978 250293 333660 326867
21011 326867 336225 452757 730561 650254 468772 418351 238647 389689 635249 490468
21001D90468j46305J698l4333M8573R8993M10658K28905j90557k00031m9682n9274
20990E99113q1743J15715L37325J77601k28393j38294j24336j23775o8449K14404
20980F79168l4008k9407r4706J27246J24954k51346J64494M2373Q5762p4691L61246
20969A101085k5992j37001j89955k47165j42367O1722J12607k1549L17501L4130
20959H63016J9129j79802J93891j61345k76015j3245J80545k31014n7496J36370
20949D74034j04135K1754L6401j98074J45953K32076M1057l60325j85903N0963
20939A53801L28908M5963k88986j18475j9204L4749J71633J00451M18824P4211
20929I01875j79825J81001k06288m37332j66353J16384J17511K22880j95150p5776
$$ plain form
21001 490468 344163 345861 311528 360101 459094 869752 1098657 908100 708069 658387 599113
20990 599113 517370 633085 970410 1148011 919618 781324 656988 533213 464764 679168
20980 679168 645160 615753 521047 648293 773247 521901 686395 728768 814530 739839 1101085
20969 1101085 1075093 938092 748137 500972 358605 420327 532934 511385 828886 863016
20959 863016 882145 702343 896234 734889 458874 445629 626174 395160 337664 474034
20949 474034 369899 391653 428054 229980 375933 608009 649066 288741 102838 153801
20939 153801 482709 528672 239686 121211 102007 136756 308389 408840 827664 901875
20929 901875 722050 903051 696763 259431 93078 209462 326973 549853 354703 278927
20919B78927P6074J37700J16776o7664j74739P3205m9213Q2863L77397J42402
20909I93728m0027j70567r3550j94532k12715o323k6467O1457K77793J69512L56478
20898A114787L70804N7526k49897m78199m2467R7356K65225j77995j73162K21763
20888A005741M20269L513p6836l01613k8366M57138q562k45050k58666M7949J89709
20877A205226K10423J06893O8912j98888k53434J1099K33200R6786L8486p7675
20867A441028j12806K44466k3831J8787m5769j80607j88731j86023j30367l8271
20857G97876K48902J5388J52149K27933P4724M0715r8380k46343p3706M82356
20847A621614J51950j17552k38449j99060O6076P2101Q2419k2953n9313M1489
$$ plain form
20919 278927 355001 492701 609477 541813 367074 440279 391066 473929 851326 993728
20909 993728 953701 783134 689584 495052 282337 276014 249547 311004 588797 758309 1114787
20898 1114787 1485591 1543117 1293220 815021 772554 869910 1135135 957140 783978 1005741
20888 1005741 1426010 1429523 1352687 1051074 1022708 1479846 1471284 1226234 967568 1015517 1205226
20877 1205226 1415649 1522542 1591454 1392566 1139132 1150231 1383431 1480217 1518703 1441028
20867 1441028 1328222 1572688 1548857 1567644 1521875 1341268 1152537 966514 836147 797876
20857 797876 1046778 1062166 1214315 1442248 1516972 1557687 1459307 1212964 1139258 1621614
20847 1621614 1773564 1656012 1417563 1218503 1284579 1356680 1439099 1416146 1356833 1398322
20837A398322L45869l3095M688M7019k2979q0648j17510P5431K41492O9172M4703
20826A972464k31769j65189m0262k0170j70821k4158O6186K22821J01003P7178
20816A787283O4217J52469m480r6449p857l42165k16663O9434L62410L85315K24054
20805B377568K3542o0347p6094L05978J41006l52259j79691j99716j31801n8978
20795A789208K41521J86582j02171k47522q0078L6509l33024k36815K14868M76308
20785A945386l7870N0440O1362K009J78747K6832m8144j93580j43441J03048K81910
20774B226699N11197R309l34858O8991L65954L56606Q5019k05141l92622Q0039
20764B771193J23116j0465r6330M4691J2920j13089j81384L12560K58190L77567
$$ plain form
20837 1398322 1744191 1711096 1715784 1762803 1739824 1659176 1541666 1617097 1858589 1927761 1972464
20826 1972464 1740695 1575506 1535244 1515074 1344253 1320095 1386281 1609102 1710105 1787283
20816 1787283 1851500 2003969 1999489 1903040 1895183 1553018 1336355 1405789 1768199 2153514 2377568
20805 2377568 2401110 2340763 2264669 2570647 2711653 2359394 2179703 1979987 1848186 1789208
20795 1789208 2030729 2217311 2115140 1867618 1787540 1824049 1491025 1254210 1469078 1945386
20785 1945386 1907516 1957956 2019318 2021327 2200074 2226906 2178762 1985182 1841741 1944789 2226699
20774 2226699 2737896 2747205 2412347 2481338 2847292 3203898 3288917 3083776 2691154 2771193
20764 2771193 2894309 2883844 2787514 2832205 2845125 2732036 2550652 2863212 3121402 3498969
20754C498969J61243m7875k39212M3274M2956M00372L03719k50835n8059n6096
20744C798456k96993l8038k0604L3400L87955Q9599K52405p6165J04767j9748
20734D215034j7002L19784M06676j40856J28797L26595K59179m5533j4772n7105
20724E380797J88924J60600P4084m1249J68151J84283J56847L36881J39508J69633
20714F918459J9644j46561J79239K27259J38254K88426J66852K38567J73179J40828
20704H344146J5532K25646L99983K31840J56375M67643K97175p8145J34782J25862
20694A0320839K89542L65208L38665K2679J87186P17944N12536M91834P45939
20685A3992372Q31564L10464O16152P35808K29719L97773P52747O37203P70911
$$ plain form
20754 3498969 3660212 3612337 3373125 3416399 3459355 3859727 4163446 3912611 3854552 3798456
20744 3798456 3501463 3463425 3442821 3476221 3864176 3953775 4206180 4130015 4234782 4215034
20734 4215034 4198032 4517816 4924492 4783636 4912433 5239028 5498207 5452674 5437902 5380797
20724 5380797 5569721 5730321 5804405 5763156 5931307 6115590 6272437 6609318 6748826 6918459
20714 6918459 6938103 6791542 6970781 7198040 7336294 7624720 7791572 8030139 8203318 8344146
20704 8344146 8359678 8585324 8985307 9217147 9373522 9841165 10138340 10060195 10194977 10320839
20694 10320839 10610381 10975589 11314254 11336933 11524119 12242063 12754599 13246433 13992372
20685 13992372 14823936 15134400 15750552 16486360 16716079 17113852 17866599 18503802 19274713
20676A9274713R83638P75996R81657J098623J159956J043816J186703J545808
20668B8050910J576320J532161J516327J432107J483677J811605K124978K158022
20660D1686107K308649K732912K962319K965793L204171M056967M359483M411370
20652F8687771M939915N612823O287024P207281P716228Q334986R148994R849908
20644A27784930J1048067J1951314J2503649J2675271J2703997J2471612J2461287
20637B13600127J1730684J0362598Q981166P394065N840587M147942K909552K011135
20629B66977856J063651N89623K54276k27375p55707j046306j517346k684443
20621B62654229m369275o071912p427328r333829j0819221j1897018j2977532
$$ plain form
20676 19274713 20258351 21034347 22016004 23114627 24274583 25318399 26505102 28050910
20668 28050910 29627230 31159391 32675718 34107825 35591502 37403107 39528085 41686107
20660 41686107 43994756 46727668 49689987 52655780 55859951 59916918 64276401 68687771
20652 68687771 73627686 79240509 85527533 92734814 100451042 108786028 117935022 127784930
20644 127784930 138832997 150784311 163287960 175963231 188667228 201138840 213600127
20637 213600127 225330811 235693409 244674575 252068640 257909227 262057169 264966721 266977856
20629 266977856 268041507 268631130 268885406 268658031 267902324 266856018 265338672 262654229
20621 262654229 258284954 252213042 244785714 235451885 224632664 212735646 199758114
20614A99758114j3196481j3142400j2659706j1948470j1235403j0470889r629132
20607A17475633q644169q191162p354573o195382n504444n449039n246645m250649
20599F6639570l843268l672033l431241k835547k610874k583263k710041k202370
20591D2750933j996487j941847j675939j725549j684050j489256j190240j220627
20583B9826938j377332j019619j103997j503474r66987q24050o89633p33842p34782
20574B0873222q42115p73184o38746p30058o22954p33646n42085n83144o52461
20565A4754829k70071m72708o63496k99229l12305k59722j7067j59239o36519
20556A1664473p34804k32071l65857l08379j56300K9256q8725k75922k49257n61658
$$ plain form
20614 199758114 186561633 173419233 160759527 148811057 137575654 127104765 117475633
20607 117475633 108831464 100640302 93285729 87090347 81585903 76136864 70890219 66639570
20599 66639570 62796302 59124269 55693028 52857481 50246607 47663344 44953303 42750933
20591 42750933 40754446 38812599 37136660 35411111 33727061 32237805 31047565 29826938
20583 29826938 28449606 27429987 26325990 24822516 23855529 23031479 22341846 21608004 20873222
20574 20873222 20031107 19257923 18619177 17889119 17266165 16532519 15990434 15407290 14754829
20565 14754829 14484758 14012050 13348554 13049325 12737020 12477298 12460231 12300992 11664473
20556 11664473 10929669 10697598 10331741 10023362 9867062 9896318 9807593 9531671 9282414 8720756
20546H720756l64317R4444o6806l63736k06134o6072K4718k17099l72394l58774
20536F824586j39677k41572m64117P4354J60058l35226j98291M0035j0556k85482
20526E424112m19220J55460J59743j66807m64087j32833j55642J29512J75369
20517D705607M0882K3261r9824o8331j44357p3141J76632N3883k80625K311J7504
20506D353802j8319P0884k07787n23346j40793R7143J96407J5537o2821m0110
20496C740597k28765J44204j7758j12030N6170l90945m53312j2296l17338k80332
20486B128195J19355J28513K79553J38050q5970o1294Q3243l1716J30939M063
20476B832931J2065k12141l95499Q1602N6221o6608j6982P3981J90189j88800
$$ plain form
20546 8720756 8356439 8450883 8384077 8020341 7814207 7748135 7772853 7555754 7183360 6824586
20536 6824586 6684909 6443337 5979220 6053574 6213632 5878406 5680115 5720150 5709594 5424112
20526 5424112 5004892 5160352 5320095 5153288 4689201 4556368 4400726 4530238 4705607
20517 4705607 4746489 4769750 4669926 4601595 4457238 4384097 4560729 4614612 4333987 4336298 4353802
20506 4353802 4335483 4406367 4198580 3675234 3534441 3631584 3827991 3843528 3780707 3740597
20496 3740597 3511832 3656036 3638278 3526248 3582418 3191473 2738161 2725865 2408527 2128195
20486 2128195 2247550 2376063 2655616 2793666 2707696 2646402 2729645 2697929 2828868 2832931
20476 2832931 2844996 2632855 2237356 2318958 2375179 2308571 2291589 2365570 2555759 2366959
20466B366959m67176J18405O0187q6806k77505l72005K81505K22309q31j92258
20456A652784J01529M9508j61753J25923r3065m06536l9802J93892K16206J64086
20446A802772J07531j53056j77214j77322l72951k16459J69190K45028M6881j81290
20436A093110j07696j5098k9432K89723J48218j54020q1984l27284j38027Q8609
20426G66119J11037j06407k29584k02707K87007K24398j7754K12942J4769j35316
20416I24504k35273j37221J16788P2590p3510J79112n9067O7885J19905q2562
20406H93151m252J6551N9823K7276J89719N9709j84673r427k6429j563j66286
20395H53599m2509j67555j9631K86068j13893j48408k28593P2525K18446P5657
$$ plain form
20466 2366959 1899783 2018188 2078375 1991569 1714064 1342059 1623564 1845873 1845042 1652784
20456 1652784 1754313 1803821 1642068 1767991 1674926 1268390 1228588 1422480 1638686 1802772
20446 1802772 1910303 1757247 1580033 1402711 1029760 813301 982491 1227519 1274400 1093110
20436 1093110 985414 970316 940884 1230607 1378825 1224805 1142821 815537 677510 766119
20426 766119 877156 770749 541165 338458 625465 849863 832109 1045051 1059820 924504
20416 924504 689231 552010 668798 741388 667878 846990 787923 855808 975713 893151
20406 893151 888899 905450 965273 992549 1182268 1241977 1057304 1047877 1021448 1019885 853599
20395 853599 811090 643535 623904 909972 796079 647671 419078 491603 710049 785706
20385G85706K61098L3309j55086k05295J31921K87276l26443j70605k7912k11192
20375D02777J36098J20958q8143o8172M10170K87542j14699l37745j907k4230
20365G22649k8737N483K6459K4042J81090l3024K36707K57874P9408R0300j57231
20354A405020k90506k36671K17382J02360l01768J82381l9300l31888l3022J85641
20344H59629K81306R2317Q643K1990J21927k26988n04866n1041J36404o9135K30708
20333I00894k61490k08191P4575L27965M6983k01300J34887K07810J28700N7193
20323A208026j59783m0090p1761K01403k7884l44762J79419L93240l3827k37136
20313A066845j64516k57610M2249j61231J63297j61120J31475K80613J85953k8866
$$ plain form
20385 785706 1046804 1080113 925027 719732 851653 1138929 812486 641881 613969 402777
20375 402777 538875 659833 571690 503518 913688 1201230 1086531 748786 746879 722649
20365 722649 693912 699395 725854 749896 930986 897962 1134669 1392543 1471951 1562251 1405020
20354 1405020 1114514 877843 1095225 1197585 895817 1078198 1038898 707010 673988 859629
20344 859629 1140935 1233252 1241895 1263885 1385812 1158824 653958 602917 739321 670186 900894
20333 900894 639404 431213 505788 833753 880736 679436 814323 1022133 1150833 1208026
20323 1208026 1048243 1008153 936392 1137795 1109911 765149 944568 1337808 1303981 1066845
20313 1066845 902329 644719 686968 525737 689034 527914 659389 940002 1125955 1097089
20303A097089q0029j41638l07687j88482J18234P0668L68087J39390J2278K2619
20293A110529l3464J39589J98638j53515J21398J2442J16253J60363K07068j97674
20283A681627j02369j48414k28527j94260n9184K93001J02596j61736l06621o712
20273H69401K08811L66891r4779J10007Q3676j85856j40648j95519k07546q073
20263H06365K60110J42858k38523j17001K47657k55772k93625l67736L9301J56209
20253C79843j35024K66435K26280M1236j06792o9605J07553r7525J25063K19881
20243I57345k06304J94776J5681J3501J82044J8286j81716j03093j51709k01109
20233E37702j93595k51573j6081K52704J44701k3671K25707r5194k18369k06923
$$ plain form
20303 1097089 1017060 875422 567735 379253 497487 568155 936242 1075632 1087910 1110529
20293 1110529 1077065 1216654 1415292 1261777 1383175 1395617 1511870 1672233 1879301 1681627
20283 1681627 1579258 1430844 1202317 1008057 948873 1241874 1344470 1182734 876113 869401
20273 869401 1078212 1445103 1350324 1460331 1544007 1358151 1217503 1021984 814438 806365
20263 806365 1066475 1209333 970810 853809 1101466 845694 552069 184333 223634 379843
20253 379843 244819 511254 737534 778770 671978 602373 709926 612401 737464 957345
20243 957345 751041 945817 961498 974999 1157043 1175329 993613 890520 738811 537702
20233 537702 344107 92534 76453 329157 473858 450187 675894 580700 362331 155408
20223A55408J33818K0361J7110l40634J07809K71641n6953M4427j00324J55587
20213D08250P1699K19662l1828j45400j23783J31563J18903J70324J53676K3932
20203I96998L26556J34803n01430l96922n6948K07533j46692k23841j89223o5543
20193H5291L02232K22475j4090k53921N9784L60102o040j46855l04949L8446n9253
20182B83222K06841J19402n7295n7142j10086l12472J38728J68016N528r0160
20172B94582j49580Q8762L93650K41927K8581m5147j62711j53077o0404J24529
20162F01112K84786j01740M0354R6772j98156p2766J31736J39207J02687j06516
20152I17476K2960O3987q8163r1352N3456j85973N7559N2125J93483j69505O0803
$$ plain form
20223 155408 289226 309587 326697 -13937 93872 365513 308560 352987 252663 408250
20213 408250 479949 699611 667783 522383 398600 530163 649066 819390 973066 996998
20203 996998 1323554 1458357 956927 560005 503057 710590 563898 340057 150834 85291
20193 85291 387523 609998 595908 341987 401771 761873 755833 608978 304029 342475 283222
20182 283222 490063 609465 552170 495028 384942 72470 211198 379214 384742 294582
20172 294582 145002 233764 627414 869341 897922 852775 690064 536987 476583 601112
20162 601112 885898 784158 824512 921284 723128 650362 782098 921305 1023992 917476
20152 917476 940436 1004423 916260 824908 878364 692391 749950 802075 995558 826053 886856
20141H86856K1925n7661j91496Q5586Q2986J28145j55201j01458N141K98535j00529
20130I02829j09303j50070M5932K79862j74875j92254Q6905j2078j13544m8327
20120E15077k3105q8407L536J9476r4967j04079J29832m3115j99724P7293P9468
20109B71285k4158p3728J61066J51477l24782L791q6989r2631P1380J45211k07344
20098e422p1599J96622L13956j60563k54091J70364L9113q7012K21585J10354
20088D73307p9942o0657m2072L5156k68481k21602O46l0179J22088K2547L03657
20077B54468L41870O4900k06861J14571m52082q0604N47871J46580j53063j02813
20067D74837j60704q9522J06526o2583J90950J93726J60932J23466k04691r7834
$$ plain form
20141 886856 908781 851120 659624 745210 828196 956341 801140 699682 704823 1003358 902829
20130 902829 793526 643456 689388 969250 794375 602121 689026 676948 563404 515077
20120 515077 491972 403565 407101 426577 331610 227531 357363 314248 114524 191817 271285
20109 271285 247127 173399 334465 485942 161160 164951 77962 -14669 56711 201922 -5422
20098 -5422 -77021 119601 433557 272994 18903 189267 228380 141368 362953 473307
20088 473307 393365 332708 290636 325792 57311 -164291 -163645 -193824 -71736 -49189 254468
20077 254468 596338 661238 454377 568948 116866 36262 584133 730713 577650 474837
20067 474837 314133 224611 331137 268554 459504 653230 814162 937628 732937 635103
20057F35103m18507j9577J76062K8764J22125q400j43008j0035J9617J82097J63922
20046G28163K6045Q444J3981P2355p6574M0755n3333j60205J47027M65545J91366
20035A403569p4330k4869J90018K96296j40762n54297l0311J87166J88546j66506
20025A274520k49872J81287J01948L20364K54502j51296n49162j77700M66822
20016A471413J07733j85275j16943K73572l1624k28104k31292j76046M5663J30220
20006A059317R9667j35667j50559j08974M8557Q205j64275j22528K07094j16788
19996F24049J81557P9470K98045j23843m84667k50146M1410j51084j17834J31029
19986B27986j94238n6409m7198K51641L18044J71562r2738l60233n11128K12896
$$ plain form
20057 635103 216596 197019 373081 401845 523970 515570 372562 362527 382144 564241 728163
20046 728163 754208 762652 776633 848988 772414 813169 759836 599631 746658 1212203 1403569
20035 1403569 1329239 1304370 1494388 1790684 1649922 1095625 1065314 1252480 1441026 1274520
20025 1274520 1024648 1205935 1307883 1628247 1882749 1731453 1182291 1004591 1471413
20016 1471413 1579146 1393871 1276928 1550500 1518876 1290772 1059480 883434 929097 1059317
20006 1059317 1158984 1023317 872758 763784 812341 820546 656271 533743 740837 624049
19996 624049 805606 885076 1183121 1059278 574611 324465 365875 214791 96957 227986
19986 227986 33748 -22661 -69859 181782 499826 671388 578650 218417 -292711 -79815
19976g9815J98938K60028j28680q8525J4144L17404j62436n5062K66088Q3530
19966F25614j48217j15879j13627r4286J86658m678O8229j43187j17587l0034
19956A13006L2499j911r7554M51098k39426j18326j24880j51246l6212N8237K08811
19945I4096k01652l73544J03018l3202N3275n472P2151N5601J46942P8502j90009
19934b00294j4234M4414j19951K50171L4155l12345J15218J64027R5971M0608
19924I7740J01164K23286k84452j74482J77924P0034N0883j02134k33270J07412
19914C4105J52470K3332m3568J45100k47415j03788R8457K24016J31759k48688
19904A65780k75209K4350L86142p8149q6259J31829r1010J70206J80425O6837
$$ plain form
19976 -79815 119123 379151 250471 161946 176090 493494 331058 275996 542084 625614
19966 625614 477397 361518 247891 153605 340263 335585 403814 260627 143040 113006
19956 113006 145505 143594 46040 497138 257712 139386 14506 -136740 -172952 -114715 94096
19945 94096 -107556 -481100 -378082 -411284 -358009 -363481 -291330 -235729 -88787 -10285 -200294
19934 -200294 -214528 -170114 -290065 -39894 -5739 -318084 -202866 -38839 57132 97740
19924 97740 198904 422190 137738 -36744 141180 211214 262097 159963 -73307 34105
19914 34105 186575 209907 166339 311439 64024 -39764 58693 282709 414468 165780
19904 165780 -109429 -85079 301063 222914 136655 268484 177474 347680 528105 594942
19894E94942N6695J41202Q2121j52490k36325K12926K64810O0624m015k6484j9805
19883I74201R0677r6377J3622J67032j81814Q8668k64048Q257P3286k8373N3479
19872H98610p6658n8650L3483j25850K1288L14513K8662n7809j15621k5358p9443
19861G57167j21540n66j38163j53110J03519L81010K03399l87069l09713k30094
19851A04840L9958K16812K03528J63557j9888J43826J8696r9728N0542j6511N5289
19840H60921N8627J44248q9345j36215M7638k01810L9786K31750J83986j4618
19830A124968k13208k5026K21093j16578l39075j29774j2557L5820R4306J0456
19820F50425k37305j12857K74444K33890K30404j42749j63712l1964r7240M1640
$$ plain form
19894 594942 651637 792839 874960 722470 486145 699071 963881 1024505 1020490 994006 974201
19883 974201 1064878 968501 982123 1149155 967341 1056009 791961 800218 873504 845131 898610
19872 898610 821952 763302 796785 670935 692223 1006736 1035398 977589 861968 836610 757167
19861 757167 635627 635061 496898 343788 447307 828317 1031716 644647 334934 104840
19851 104840 144798 361610 565138 728695 708807 852633 871329 771601 822143 805632 860921
19840 860921 919548 1063796 974451 838236 885874 684064 723850 955600 1139586 1124968
19830 1124968 911760 886734 1107827 991249 652174 522400 509843 545663 639969 650425
19820 650425 413120 300263 574707 808597 1039001 896252 732540 700576 603336 644976
19810F44976K31300J70549l19524k98803q4454K19637J44645N8133n7391l33621
19800C75447k52758Q2188K08084J7988k52661k56879K22133N48906K95995k96325
19790F92118l60211m541n263K32723P4389L4730l473l4897l03956m2275j00052
19779A79292k21071m1153k07219p5471K54553K13676J31813k10330p1998J44191
19769I6283r3462k17216k04133J29289P6956J85517J46957J87366Q465J23609
19759D39631J1723j30558j90323k79074j19146K16876J81284J89511k29565k45527
19749a55168R0935J93281j405N318J38928R2348n2408l71643r8368N5830R9523
19738b829J32529q7302K7058m5109j53914k11694P0718J72018J84132M2086M8023
$$ plain form
19810 644976 876276 1046825 727301 428498 344044 563681 708326 766459 709068 375447
19800 375447 122689 204877 412961 430949 178288 -78591 143542 692448 988443 692118
19790 692118 331907 327366 322103 554826 629215 663945 660472 625575 321619 279344 179292
19779 179292 -41779 -82932 -290151 -365622 -111069 102607 234420 24090 -47908 96283
19769 96283 2821 -214395 -418528 -289239 -212283 -26766 120191 307557 316022 439631
19759 439631 451354 320796 130473 -148601 -267747 -50871 130413 319924 90359 -155168
19749 -155168 -64233 129048 127643 132961 271889 364237 311829 -59814 -158182 -102352 -2829
19738 -2829 129700 42398 69456 24347 -129567 -341261 -270543 -98525 85607 127693 175716
19727A75716J22413j3407K66088R663l14299p8667J5952K0297L3769J14212Q5868
19716D37605J16773p5170j06004k48914R4090Q1962O1575j57458j68153j06173
19706f9867l5512L18509J2836j64616K54107k49360q0979P0269O2611p8066m355
19695C5577n4556Q7418K57683N7081k46868l41590j26754M26929K76561j88950
19685A82531N6437j04853K15984K70764q1657k55505j87568J22708J48611J0416
19675C77868j05946Q0312l3758j84740m3060j29052k9279q1322l4484K31227K141
19664D9907N3350J64349J20226K22911P7765j00197N6064p2914n9211k12583m5484
19653B54183L8858J07337o8577J57931J33749J07742J93609k18525j32128j8638
$$ plain form
19727 175716 298129 284722 550810 560473 246174 167507 183459 203756 237525 351737 437605
19716 437605 554378 479208 373204 124290 218380 300342 361917 204459 36306 -69867
19706 -69867 -105379 213130 225966 61350 315457 66097 -14882 55387 117998 39932 35577
19695 35577 -18979 68439 326122 383203 136335 -205255 -332009 94920 371481 182531
19685 182531 238968 134115 350099 620863 539206 283701 96133 218841 367452 377868
19675 377868 271922 352234 318476 133736 90676 -38376 -67655 -148977 -183461 47766 49907
19664 49907 103257 267606 387832 610743 688508 588311 644375 571461 512250 299667 254183
19653 254183 293041 400378 331801 489732 623481 731223 924832 706307 574179 555541
19643E55541O2614J060J27193L0837J96176Q9856k45789j72355Q1482j7042J02631
19632H12204k28791k85799P844J05057K4862K03487K01833K66785n8497K58092
19622A307077K20168J30570j04166m23120r1493K59776L19194K3988r8397j10418
19612A433179k18674K01636M80462P3441p9805k88540l29646l1523K19544L77811
19602A837885p2030k30396M4018K4736k8332P3015M6490n11960m59636J47563
19592H71353K07567r4290j50963n0473J45646J74037j61816j10675N3789K23550
19582A107725J43900p2822j51625J52141Q1081p3814n3666J91777m8188J31606
19572A408115J87995M8869m5285k34225K1357J31658K26628j8063n4429L6854
$$ plain form
19643 555541 618155 619215 746408 777245 973421 1063277 817488 645133 726615 709573 812204
19632 812204 583413 297614 305458 410515 435377 638864 840697 1107482 1048985 1307077
19622 1307077 1527245 1657815 1553649 1130529 1039036 1298812 1618006 1641994 1543597 1433179
19612 1433179 1214505 1416141 1896603 1970044 1890239 1601699 1272053 1240530 1460074 1837885
19602 1837885 1765855 1535459 1579477 1604213 1575881 1648896 1695386 1183426 723790 871353
19592 871353 1078920 984630 833667 783194 928840 1102877 941061 830386 884175 1107725
19582 1107725 1251625 1178803 1027178 1179319 1260400 1186586 1132920 1324697 1276509 1408115
19572 1408115 1596110 1644979 1599694 1365469 1386826 1518484 1745112 1727049 1672620 1709474
19562A709474J83316L03829n5697j91001K39611j24720L3996P3562P2519O4972
19552B309861K80462O746j56488j00870j39371l4103J15399l15591k78678N2613
19542A739980J08332o7012l43537Q0285J7049p1872J76004J39578K41652j76828
19532A843631p3224j13696N9462J11809J25693l3886M6768J70603o5897J6051
19522B087314j36276J1754q6918j43033J93155K70095M7577l61092j5674j8662
19512A848240n3361l3058K93745o5642j05682k89383k91809j95893L86493J61050
19502A654700M680R290l1322j32326n6431J08225l2416L69701L65322l67811q3550
19491A808062J07752J15399j6412N0040j28965K11285J66674k16586N4572L09242
$$ plain form
19562 1709474 1892790 2196619 2140922 1949921 2189532 2064812 2098808 2172370 2244889 2309861
19552 2309861 2590323 2597069 2440581 2339711 2200340 2166237 2281636 1966045 1687367 1739980
19542 1739980 1848312 1781300 1437763 1518048 1535097 1463225 1639229 1778807 2020459 1843631
19532 1843631 1770407 1656711 1716173 1827982 1953675 1919789 1966557 2137160 2071263 2087314
19522 2087314 1951038 1962792 1875874 1732841 1925996 2196091 2243668 1882576 1866902 1848240
19512 1848240 1794879 1761821 2055566 1989924 1884242 1594859 1303050 1107157 1493650 1654700
19502 1654700 1659380 1668670 1637348 1505022 1448591 1556816 1524400 1894101 2259423 1891612 1808062
19491 1808062 1915814 2031213 2014801 2064841 1935876 2147161 2313835 2097249 2151821 2461063
19481B461063O2842j578P1917k17099k07186k2492J2487j37899o0141K09517K02342
19470B373773J20689L4497k58710j70262k39602Q2570K90865J33807K8110K58226
19460B653963J12817l5601l38944r8317J51136R9051L0625M9258L57079J82107
19450C163174K32926J43126k10037j7173J29358O7183P4434k4842j27095j97556
19440C233498K33912L82627L8180K6576l367J75805N66869j30380m58334k97901
19430C767485J83309K24428P7134N9396M4918L21127J218p4533l4396k73895j3977
19419D282214J96235K91534j0226M03674L41402K01598J8448K25910J18857J47095
19409F216741K06839J08129J76187j15392j12116p0810L59408M51470M83106K22009
$$ plain form
19481 2461063 2523905 2522327 2594244 2377145 2169959 2147467 2159954 2022055 1961914 2171431 2373773
19470 2373773 2494462 2528959 2270249 2099987 1860385 1942955 2233820 2367627 2395737 2653963
19460 2653963 2766780 2731179 2392235 2293918 2445054 2544105 2574730 2623988 2981067 3163174
19450 3163174 3396100 3539226 3329189 3312016 3441374 3508557 3582991 3558149 3431054 3233498
19440 3233498 3467410 3850037 3888217 3914793 3911426 4087231 4654100 4523720 4065386 3767485
19430 3767485 3950794 4175222 4252356 4311752 4356670 4677797 4679015 4604482 4570086 4296191 4282214
19419 4282214 4478449 4769983 4759757 5163431 5504833 5706431 5724879 5950789 6069646 6216741
19409 6216741 6423580 6531709 6707896 6592504 6480388 6409578 6768986 7220456 7703562 7925571
19399G925571J26086K31609K64290L13527J75865J41388M39482M73408O92612
19390A0783838L30341M74760L69076L82835M22174O17285O10730Q34138J176672
19381A6001849Q23933O10651J045974P93618R10434R40746J232529J787455J771468
19372B5918657J848763K023041K376511K764380K681536K906614L551861M247444
19364D8318807M526402M895212N562157N814984O241880O039372O403400O511027
19356I4313241O226399N729780M916121M287260L372689K335884J796647J234572
19348A24212593Q83748N08674P48846L85690J83493O0898J13406n05285j346821
19339A25245242j662249k397834l098572l916101m749713n368681n257741n123954
$$ plain form
19399 7925571 8051657 8283266 8547556 8861083 9036948 9178336 9617818 10091226 10783838
19390 10783838 11114179 11588939 11958015 12340850 12763024 13380309 13991039 14825177 16001849
19381 16001849 16825782 17436433 18482407 19276025 20186459 21127205 22359734 24147189 25918657
19372 25918657 27767420 29790461 32166972 34931352 37612888 40519502 44071363 48318807
19364 48318807 52845209 57740421 63302578 69117562 75359442 81398814 87802214 94313241
19356 94313241 100539640 106269420 111185541 115472801 118845490 121181374 122978021 124212593
19348 124212593 125096341 125605015 126353861 126739551 126923044 126983942 127097348 126592063 125245242
19339 125245242 123582993 121185159 118086587 114170486 109420773 104052092 98794351 93670397
19331I3670397n074996m845889m559328l975835l310499k557413j950932j677355
19323F5718150j130907m52047k84867K08611O57331J199764J729767K529012L009737
19314G3184551L873520M261897M710633N667858O384461P022601P751238Q215708
19306A21072467Q871834Q525708Q440026Q147694O664770N335584M332869L356235
19298A74747187K681430J946792P93978n2361j00984o9547p7548m44619p16044
19289A78708284j089088k320357l000291l929906n381521o519462p627706q246806
19281A40593147q888222r052633r257335q956079q610287p593249p081145o409058
19273G4745139n905436n463273m455360l739776l754005l324810l055292k923473
$$ plain form
19331 93670397 88595401 83749512 79190184 75214349 71903850 69346437 67395505 65718150
19323 65718150 64587243 64135196 63850329 64058940 64716271 65916035 67645802 70174814 73184551
19314 73184551 77058071 81319968 86030601 91698459 98082920 105105521 112856759 121072467
19306 121072467 129944301 138470009 146910035 155057729 161722499 167058083 171390952 174747187
19298 174747187 177428617 179375409 180169387 180117026 180016042 179946495 179868947 179424328 178708284
19289 178708284 177619196 175298839 172298548 168368642 162987121 156467659 148839953 140593147
19281 140593147 131704925 122652292 113394957 104438878 95828591 88235342 81154197 74745139
19273 74745139 68839703 63376430 58921070 55181294 51427289 48102479 45047187 42123714
19265D2123714k422779k069580k146307k051422j722514j547819j315923j675682
19257B7171688j396148j023572j026642r25172r96819p10681o22789r27874p65676
19248A8776315n42491n75696o66472n37570m35010k62802n91133o83159l49184
19239A4132798j34291j89559k28737m45393o26568n68075j69877n2910j46584
19230A1570804J19099l50538o89675n62520l03302j6768k29978l56511m7443j76257
19220H956911k15076J30610J40881q6329K0948j10390n46658j92141r1805p8480
19210G928471K7578J26022J30741q1339j46150n17298k17896k03597j37666r5779
19200F813087J77050j52466K8287n3266j45641j66047K15279J66390j1930l21128
$$ plain form
19265 42123714 39700935 37631355 35485048 33433626 31711112 30163293 28847370 27171688
19257 27171688 25775540 24751968 23725326 22800154 21803335 21092654 20469865 19541991 18776315
19248 18776315 18233824 17658128 16991656 16454086 16019076 15756274 15165141 14481982 14132798
19239 14132798 13998507 13808948 13580211 13134818 12508250 11940175 11770298 11717388 11570804
19230 11570804 11689903 11339365 10649690 10087170 9783868 9767100 9537122 9180611 9133168 8956911
19220 8956911 8741835 8872445 9013326 8926997 8947945 8837555 8290897 8098756 8006951 7928471
19210 7928471 7956049 8082071 8212812 8131473 7985323 7468025 7250129 7046532 6908866 6813087
19200 6813087 6990137 6837671 6865958 6812692 6667051 6501004 6716283 6882673 6870743 6549615
19190F549615l17936l55015m4244K94558J13814M6706J71462k01068q8360J3987
19180F183519j0229J54340L89489q2938m4753k95046m1721K56250m515O4569j0788
19169F558177n5718Q4193K85409P5548j12480n2147J72969k94631n39148l5056
19159F087116J77822o826K97989L30055L09282K069j25655q3486k0209J89645
19149G157802J56661L72851K19926L1467K14094M9078q5694r12K16551Q4248J4143
19138H430215j48442K81887L31152K42958J89132K05842J8394k60863K87290O33405
19128A0210970M76447K46477K00234L10747K70303J43655M77580J021598M56056
19119A3814067J24119L21732M41740O62760O92717P46239O72785M71096P19588
$$ plain form
19190 6549615 6231679 5876664 5832420 6126978 6240792 6287498 6458960 6257892 6169532 6183519
19180 6183519 6173290 6327630 6717119 6634181 6589428 6294382 6252661 6508911 6504396 6568965 6558177
19169 6558177 6502459 6586652 6872061 6947609 6835129 6782982 6955951 6661320 6122172 6087116
19159 6087116 6264938 6258112 6556101 6886156 7195438 7197507 7071852 6988366 6968157 7157802
19149 7157802 7314463 7687314 7907240 7938707 8152801 8201879 8116185 8115273 8331824 8416072 8430215
19138 8430215 8281773 8563660 8894812 9137770 9326902 9532744 9551138 9290275 9577565 10210970
19128 10210970 10687417 10933894 11134128 11444875 11715178 11858833 12336413 13358011 13814067
19119 13814067 13938186 14259918 14701658 15364418 16057135 16803374 17476159 17947255 18666843
19110A8666843J085213J237375J087143R06493J313716J173857J027214J389990
19102B7887844J538789J428292J880660K105043K290798K437993K904655L139024
19094D5613098L345437L747922M267721M806136N474783O270166O952163P845322
19086H8322748R016367J0197287J1575791J2185963J3155907J4079164J4870094
19079A73403321J4937392J4181678J2820781J1045822Q149510N188071J913077
19072B41639652j917160n164368q077072j0865627j2768419j3936072j4202862
19065A74708072j4034740j3439424j2228508j0963273r833909q492226p786275
19058I7929717o699003n757338n096521m360909l640143l143986k771069k426299
$$ plain form
19110 18666843 19752056 20989431 22076574 22983067 24296783 25470640 26497854 27887844
19102 27887844 29426633 30854925 32735585 34840628 37131426 39569419 42474074 45613098
19094 45613098 48958535 52706457 56974178 61780314 67255097 73525263 80477426 88322748
19086 88322748 97339115 107536402 119112193 131298156 144454063 158533227 173403321
19079 173403321 188340713 202522391 215343172 226388994 234538504 239726575 241639652
19072 241639652 239722492 234558124 226481052 215615425 202847006 188910934 174708072
19065 174708072 160673332 147233908 135005400 124042127 114208218 105715992 97929717
19058 97929717 91230714 85473376 80376855 76015946 72375803 69231817 66460748 64034449
19050F4034449j962160j561771j199856q43638n61690k82454j28938K45273M87114
19041E8226329Q31860J330483J737272K404411L207777L716648M375470N032836
19033H0863086N769495O644571P377043Q368189R004807R077368R269340R268039
19025A45641938Q520744P491977N883847L894684J731936r31210l596898n345815
19017A63291203p083671q792015r703053j0238557j0295007r843555r121849q446354
19009H9767142p607782o951145o427139n284157m820608m248911l735721l301364
19001D7390315k840407k778956k549512k335578k314458j594175j571992j980691
18993B9424546j535569j238624j234173j021257j028241r78787p73666q82950
$$ plain form
19050 64034449 62072289 60510518 59310662 58467024 57905334 57622880 57493942 57739215 58226329
19041 58226329 59058189 60388672 62125944 64530355 67738132 71454780 75830250 80863086
19033 80863086 86632581 93277152 100654195 109022384 118027191 127104559 136373899 145641938
19025 145641938 154162682 161654659 167538506 171433190 173165126 172233916 168637018 163291203
19017 163291203 156207532 147415517 137712464 127473907 117178900 107335345 98213496 89767142
19009 89767142 82159360 75208215 68781076 63496919 58676311 54427400 50691679 47390315
19001 47390315 44549908 41770952 39221440 36885862 34571404 32977229 31405237 29424546
18993 29424546 27888977 26650353 25416180 24394923 23366682 22387895 21614229 20731279
18985B0731279r03451p35903m30054p29854q75736o07379n62491n20123l33030
18976A5033258m03950j44915m44443p75034l60459k40590m16034n71671q73865
18967A0802297k04389R002R9625j23759o09143k91446j54290j00174j20117l84561
18957H923045k92169r6051m27745l03576R4046l2188N7590O713p8515k09958k21560
18946G419632l35920L2436L8613J13081l23961k98440j05492k20497l72128j98321
18936E749003k05794r1009p8892j00575l85130j45535j05163j14631K23985N2989
18926D799248R0346r3787k77473J02133R5139j64645p4748M8865l00415q4259
18916D140404j09320J50453M9913j60778L17591L2164j66388k05741k78735L9166
$$ plain form
18985 20731279 19827828 19091925 18661871 17932017 17056281 16448902 15886411 15366288 15033258
18976 15033258 14629308 14484393 14039950 13264916 12904457 12663867 12247833 11676162 10802297
18967 10802297 10597908 10606910 10706535 10582776 9973633 9682187 9527897 9427723 9307606 8923045
18957 8923045 8630876 8534825 8107080 7803504 7897550 7865362 7922952 7929665 7851150 7641192 7419632
18946 7419632 7083712 7116148 7154761 7267842 6943881 6645441 6539949 6319452 5947324 5749003
18936 5749003 5543209 5452200 5373308 5272733 4887603 4742068 4636905 4522274 4746259 4799248
18926 4799248 4889594 4795807 4518334 4620467 4715606 4550961 4476213 4525078 4224663 4140404
18916 4140404 4031084 4181537 4231450 4070672 4388263 4420427 4254039 4048298 3769563 3808729
18906C808729L08426J44881n3990k27266l04989j2190p7173l4663k70184k51727
18896C029854l6474J11651j98752R0214q1479l03244j35663O088J07119J49737
18886B739051J68515m4970k34222k61101j47152M139r6704j31784k40877Q8745
18876A843640P8886j60413k97003m0346L96148J44647K37016j51262m09208n29717
18866A112388J48012K08700J85405O9506m1330N7431K68611J03200L321j29298
18856A985946k6084K04468k15478j99687Q4629J91419M0155l05581K6108o19l42111
18845A443165j79817L91232K78596K07160j13822l31680r0524j06636o9820k38828
18835A189026O3976j12394M0729K19515K25753P7189o5137r8562r8986J07624
$$ plain form
18906 3808729 4117155 4262036 4208046 3980780 3675791 3663601 3586428 3551765 3281581 3029854
18896 3029854 2993380 3105031 2906279 2996493 2915014 2611770 2476107 2482195 2589314 2739051
18886 2739051 2907566 2862596 2628374 2367273 2220121 2224260 2127556 1995772 1754895 1843640
18876 1843640 1922526 1762113 1465110 1424764 1820912 1965559 2202575 2051313 1642105 1112388
18866 1112388 1260400 1469100 1654505 1724011 1682681 1740112 2008723 2111923 2115244 1985946
18856 1985946 1959862 2164330 1948852 1749165 1833794 2025213 2065368 1759787 1785895 1785276 1443165
18845 1443165 1263348 1654580 1933176 2140336 2026514 1694834 1604310 1497674 1427854 1189026
18835 1189026 1253002 1140608 1181337 1400852 1626605 1703794 1638657 1540095 1441109 1548733
18825A548733K920K50933K64105J10265J06052k13451j74031K31172J34038j52976
18815B107760k81245j02977L15758l6055Q956J00099J77829m2378m07348j34106
18805A706293L49268K33994j10786k18951j25849K69233K91277j55843L0074J55145
18795B423855J12715j02126k7563J2443j1365J22816j31215n88039k53393L27935
18785A886063J96281n7981j56820J4146r3531r2088R4090J60813p6430q5323K31976
18774B021196l42759j94665L45767M60420J4719P1849N954r309R8682m2539k2076
18763B407239q3788k63304j11924n5107Q6981K58685R4034N0978j31772K9188
18753B281210j02502O0434j5421l1124m235j14749k07725J64219k9555M5335k4022
$$ plain form
18825 1548733 1551653 1802586 2066691 2176956 2283008 2069557 1895526 2126698 2260736 2107760
18815 2107760 1826515 1723538 2039296 2003241 2012197 2112296 2290125 2247747 1840399 1706293
18805 1706293 2055561 2289555 2178769 1959818 1833969 2103202 2394479 2238636 2268710 2423855
18795 2423855 2536570 2434444 2406881 2419324 2407959 2530775 2399560 1811521 1558128 1886063
18785 1886063 2082344 2024363 1867543 1881689 1788158 1696070 1790160 1950973 1874543 1789220 2021196
18774 2021196 1678437 1483772 1829539 2289959 2304678 2376527 2382481 2373172 2471854 2429315 2407239
18763 2407239 2323451 2060147 1948223 1893116 1980097 2238782 2332816 2383794 2252022 2281210
18753 2281210 2178708 2239142 2223721 2192597 2188362 2073613 1865888 2030107 2000552 2045887 2021865
18742B021865k2737m1733p7075m04654k31893L05086K10897J53070J23750j25488
18732A911088j89574j65760P304J79184l1032j38094j86405l7820J13964k86359
18722A176496q3191M6993j33803O8217L0233M2733m40599m201j68183j34968M99137
18711H98864P1560n1676J18645K750J45403J60950J00066l09497j79941J39542
18701A096666K3817j83331J54061M0129P2735K41496j29805Q6220r8257j34769
18691A168962j48583P2440k48319n6487L5251n9496j874K69899P1991j37441j4342
18680I52001l69776j54044R264K2548o07J58864J01778K72798k11105r8803P0821
18669G53739R0982r6043N7626j50411p4307m4979K270J03803j73190K23323p3960
$$ plain form
18742 2021865 1999128 1957395 1880320 1475666 1243773 1548859 1759756 1912826 2036576 1911088
18732 1911088 1721514 1555754 1563058 1742242 1711210 1573116 1386711 1348891 1462855 1176496
18722 1176496 1093305 1140298 1006495 1074712 1104945 1147678 707079 702878 534695 399727 898864
18711 898864 970424 918748 1037393 1040143 1185546 1346496 1446562 1137065 957124 1096666
18701 1096666 1120483 937152 1091213 1131342 1204077 1445573 1315768 1401988 1303731 1168962
18691 1168962 1020379 1092819 844500 788013 823264 763768 761894 1031793 1103784 966343 952001
18680 952001 582225 428181 437445 459993 459386 618250 720028 992826 781721 682918 753739
18669 753739 844721 748678 806304 655893 581586 536607 538877 642680 469490 692813 618853
18658F18853l14780J84158J12986Q745o7392q2294l9451J65102J00538q2999m6632
18647E56834j86429j67226K02433J43610J21355o9936O6067m1107j2300j38262
18637D75039l28430K3715J57384J24237l8243J50607o324O1136o570P6841J48422
18626H37814q779P9231j19254j75583P2149j17641K4203j83348N1736J27310K42378
18615H30216Q5978M1269j16956o68111n2416M94361J22666k38697m4519J55907
18605F09698j1737R8405p5195l5262J03311l2780n305k10319j35191j24179L6443
18594B17889l2150R385J29898R0690J29471l3280k8242j17066m07381J23810L49723
18583D32747L67295J48273K82330p0658m7248l11248L5851l16153n4663j9452
$$ plain form
18658 618853 304073 488231 601217 609962 542570 460276 420825 585927 686465 603466 556834
18647 556834 370405 203179 405612 549222 670577 600641 666708 625601 613301 475039
18637 475039 146609 170324 327708 451945 413702 564309 557985 619121 612551 689392 837814
18626 837814 829035 908266 789012 613429 685578 567937 592140 408792 460528 587838 830216
18615 830216 916194 957463 840507 172396 119980 614341 737007 498310 453791 609698
18605 609698 597961 696366 621171 585909 689220 656440 651135 440816 305625 181446 217889
18594 217889 185739 195124 325022 415712 545183 511903 483661 366595 -40786 83024 432747
18583 432747 800042 948315 1230645 1159987 1112739 801491 837342 521189 466526 447074
18573D47074m3755J75042n9470J15407K12170j71110J16581J97748O294k3935
18563I72046j9911N5027k44773k18590L3536N580R8997N0651m6045q5599q2899
18552E18020O2564J38470M07914K28380j09950j51069j85706j47423o9125K35875
18542I27950J36500l1313K80608K82560K31424J15504j28423k9614K12253J62274
18532B159723m05250l45610n5899m7067k12053l90834j33991J15754j38444j6731
18522E29598k2508K34905J96424k91327p1777J1452J84229J71945j58634j16203
18512F68104k7678K3901J95618o371j88259K7583k87272j9975L55083p8937L4983
18501F96780j57608l8252L6698J30112J56289P9141J67301J27816J27595J20819
$$ plain form
18573 447074 403319 578361 518891 634298 846468 675358 791939 989687 995981 972046
18563 972046 952135 1007162 762389 543799 577335 582915 681912 732563 686518 600919 518020
18552 518020 580584 719054 1126968 1355348 1245398 1094329 908623 761200 692075 927950
18542 927950 1064450 1033137 1313745 1596305 1827729 1943233 1814810 1785196 1997449 2159723
18532 2159723 1754473 1408863 1352964 1305897 1093844 703010 569019 684773 546329 529598
18522 529598 507090 741995 938419 647092 575315 586767 770996 942941 784307 668104
18512 668104 640426 664327 859945 853574 665315 692898 405626 385651 740734 661797 696780
18501 696780 539172 500920 537618 667730 824019 903160 1070461 1198277 1325872 1446691
18491A446691k18804j64117k44301L18623K12160l4354k4647Q5048o3905k49755
18481A062639J20631K27884j67153P6281j00950l10299o73077j71024J08747L22706
18471D96385J39108k61413Q9889J26197J81199Q5418m5099l54982j74125O7671
18461C50248q6848j13596J38618J17262j94200Q6619R6697r0784l205J45397M4622
18450D90830o3175o7956p805L92006J319m66871j19343J86526r6565r2675j8001
18439A38290J69297K29328J9099l13250j10609L5127J56978M4793K04255J10652
18429F83960k86601J08238n569j85436p549n447q0110M750j52242k04176K182
18418a28000J39438l6526L84206K03886p3880J22610N2118Q4207j29302q9054
$$ plain form
18491 1446691 1227887 1063770 819469 1138092 1350252 1315898 1291251 1376299 1312394 1062639
18481 1062639 1183270 1411154 1244001 1320282 1219332 909033 235956 64932 173679 496385
18471 496385 635493 374080 463969 590166 771365 856783 811684 456702 282577 350248
18461 350248 263400 149804 288422 405684 211484 298103 394800 304016 300811 446208 490830
18450 490830 427655 359699 351894 743900 745219 278348 159005 345531 248966 156291 138290
18439 138290 307587 536915 556014 242764 132155 167282 324260 369053 573308 683960
18429 683960 397359 505597 500028 314592 307043 301596 221486 226236 73994 -130182 -128000
18418 -128000 11438 -25088 359118 563004 489124 611734 663852 748059 618757 529703
18408E29703Q2453R8975j43146q7300j36110j63900K76198M32882j02848j10957
18398F75950J07076j61848k72687j1025K68639P6014j04928o7189l8025J68582
18388F40559j17206j90025j18110p9921J7764K13760n5094R4807k20080o5938
18378A20516J56661K01310j4877o6553J25565m8859L4764j1111j32422r7094p322
18367B60578J37082j75242K29958L79604q3557j92848P805k8172j39726m2538
18357C52944L5678k3561O48J5164K84844Q3249k37817r2437k10387Q888L56294
18346E73507K73304Q1652K8759k41009K9781j20826K15396K69045m0044N6158
18336A125723J39424n0037j09692j08639N8502r4952k2821p9749P8023J95500
$$ plain form
18408 529703 612156 711131 567985 480685 344575 180675 456873 889755 786907 675950
18398 675950 783026 621178 348491 337466 606105 682119 577191 510002 471977 640559
18388 640559 523353 333328 215218 135297 153061 366821 311727 406534 186454 120516
18378 120516 277177 478487 463610 397057 522622 473763 508527 497416 364994 267900 260578
18367 260578 397660 222418 452376 831980 748423 555575 563380 535208 395482 352944
18357 352944 388622 365061 365709 380873 665717 748966 511149 418712 208325 217213 573507
18346 573507 846811 928463 957222 716213 745994 625168 840564 1109609 1069565 1125723
18336 1125723 1265147 1215110 1105418 996779 1055281 960329 937508 857759 935782 1131282
18326A131282j12806N7517o0206J09980R014j2998k24951j7580p976j44563L5693
18315G62406j18768k25655L94161M15281j57123j12434q4309J73254o8395n7325
18305I21093J29034j19514M1169k79764k30521Q6447N39342M06844R808j95104
18295A308834j37426J15798l3124j35266N2669L85671j53213K31198J4587P1714
18285A721442j07383k29306r9173M5020J65717J77498j3819l06568k21834m6740
18275A084854l6807J0785J95035j67124j9718J19553j26967q2380l7477k4331
18265I15423l5098j18023R8723R2812o1024l3721K1246J13031K55714r5483j99147
18254I54453J4200J55554p0128k93597l7993K18596J38438N0838n5063j90466
$$ plain form
18326 1131282 1018476 1075993 1015787 1125767 1134781 1121783 896832 879252 871276 726713 762406
18315 762406 643638 417983 812144 1227425 1070302 957868 873559 1046813 978418 921093
18305 921093 1050127 930613 971782 692018 461497 547944 1087286 1494130 1503938 1308834
18295 1308834 1171408 1287206 1254082 1118816 1171485 1557156 1403943 1635141 1649728 1721442
18285 1721442 1614059 1384753 1285580 1330600 1496317 1673815 1659996 1353428 1131594 1084854
18275 1084854 1048047 1058832 1253867 1086743 1067025 1186578 1059611 977231 939754 915423
18265 915423 880325 762302 861025 953837 892813 859092 880338 993369 1249083 1153600 954453
18254 954453 968653 1124207 1054079 760482 722489 941085 1079523 1130361 1075298 884832
18244H84832N2083J25079j3291j52229j66311K86401J66978K76790j2975l65073
18234A082284n32613r7389M96028J94092J14675Q9418j74414M6594n3060R617
18224A175232M1601j84304m7367l1840J52955Q1566k91928p7822J75727J65280
18214A159100J19820O3338o5634l25517J93207J94658J00174k10206k68406j43744
18204H16790J26271N48670K41822m3605o8429j0127J49084j56972j79397j7784
18194A406323j7364K55109K7277P2718j38832j39063l2350J22229Q8406o3780
18184A580673j68796k7777J56855K06725K65098J37412K35489J13249j28688q9173
18174B281067K07665q0468Q4611j9688L06213K79405N3855j03919j61533n2431
$$ plain form
18244 884832 936915 1061994 1048703 896474 730163 1016564 1183542 1460332 1447357 1082284
18234 1082284 549671 452282 948310 1142402 1257077 1346495 1172081 1218675 1165615 1175232
18224 1175232 1216833 1032529 985162 953322 1106277 1187843 895915 818093 993820 1159100
18214 1159100 1278920 1342258 1276624 951107 1144314 1338972 1439146 1228940 960534 816790
18204 816790 943061 1491731 1733553 1689948 1621519 1611392 1760476 1603504 1424107 1406323
18194 1406323 1388959 1644068 1671345 1744063 1605231 1466168 1433818 1556047 1644453 1580673
18184 1580673 1411877 1384100 1540955 1747680 2012778 2150190 2385679 2498928 2370240 2281067
18174 2281067 2488732 2408264 2492875 2473187 2779400 3058805 3112660 3008741 2847208 2794777
18164B794777R1871l2722K78206N52582M9286k51973p9119M07353M65628j87267
18154D088622j34388J85220K22117J47087K65340L52940L57244K84455L29345
18145F097982M36243N65265M74345K17963K32574O02170L60332M40623Q47011
18136A0274508Q51633P36768O51903P50576Q87277J141710J256043J490728J389852
18127A9430998J815703K329220K520927K589375L287112L731702M372851M812950
18119D4890838N635523O142272O586771P290517P799779Q520587Q272795O895122
18111A02034204N667914M315004K070027p08881l544957n768713p298701p981675
18103H8784222q190156q091433p539145o949274n828025n272233m488393l793794
$$ plain form
18164 2794777 2886648 2853926 3132132 3684714 3734000 3482027 3402908 3810261 4275889 4088622
18154 4088622 3954234 4139454 4361571 4508658 4773998 5126938 5484182 5768637 6097982
18145 6097982 6534225 7099490 7573835 7791798 8024372 8626542 8986874 9427497 10274508
18136 10274508 11126141 11862909 12514812 13265388 14152665 15294375 16550418 18041146 19430998
18127 19430998 21246701 23575921 26096848 28686223 31973335 35705037 40077888 44890838
18119 44890838 50526361 56668633 63255404 70545921 78345700 86866287 95139082 102034204
18111 102034204 107702118 112017122 114087149 113378268 109833311 104064598 96765897 88784222
18103 88784222 80594066 72502633 64963488 58014214 52186189 46913956 42425563 38631769
18095C8631769l483041k788161k473879k652543k153790k208329j854744j196602
18087A9820680j173461j024879q43887j093249r98794q64985o98090p36055p11229
18078A1676051n89020p46136l66084p60847r54165m07371k34615R6884J20402
18069G835099k91614m68874k54342j57218n31562n2950m7845n9003m61407m51969
18059E058315P7753k33890n7668j63067l43224j69130J1120J54492j32081j87517
18049D015103j70744N63k18679r0975j26432k57632J9096N8406j1364k40807j24805
18038B851730j19149k76156j92456J2663J68675L5999m4712j6792J5670q1162
18028B354310q5214M6547K694j57558p7209m2639m3076j76414k9291N9163K04425
$$ plain form
18095 38631769 35148728 32360567 29886688 27234145 25080355 22872026 21017282 19820680
18087 19820680 18647219 17622340 16778453 15685204 14686410 13821425 13123335 12387280 11676051
18078 11676051 11087031 10340895 9974811 9213964 8259799 7852428 7617813 7714697 7835099
18069 7835099 7543485 7074611 6820269 6663051 6131489 6078539 6030694 5971691 5510284 5058315
18059 5058315 5136068 4902178 4844510 4681443 4338219 4169089 4180209 4334701 4202620 4015103
18049 4015103 3844359 3844922 3626243 3535268 3408836 3151204 3170300 3228706 3217342 2976535 2851730
18038 2851730 2732581 2456425 2263969 2276632 2445307 2481306 2436594 2419802 2435472 2354310
18028 2354310 2269096 2315643 2318337 2160779 2083570 2040931 1997855 1821441 1792150 1851313 2055738
18017B055738K3449o3800k58735N0123Q7044m2779k08170P2085j663l3442j12283
18006A567567L5158J00333k41207j21234j14047j29742Q0229J9767L12646l3961
17996A475509O0388J8891J16450J04550J3928J04927j07287J607n7007l89130
17986A342826N5200Q691k30700j81442j01598L97405N25382o8132k77067l13645
17976A156920j95568r1496J28055J45962q425k64337K56910J79960j38598j08062
17966A061321M7581K22472j89766J52200k58299j72753j28865m7683k132k948
17956F81128m7833k6784J30948J43534O493j23479j10904k15207J70318J2200
17946F20414K9775O5037M334J0476j79550R0708j99970J47409L34961J03462j72617
$$ plain form
18017 2055738 2079187 2015387 1756652 1806775 1893819 1851040 1642870 1714955 1713292 1679850 1567567
18006 1567567 1602725 1703058 1461851 1340617 1226570 1096828 1177057 1196824 1509470 1475509
17996 1475509 1535897 1554788 1671238 1775788 1789716 1894643 1787356 1788963 1731956 1342826
17986 1342826 1398026 1406717 1176017 994575 892977 1290382 1815764 1747632 1470565 1156920
17976 1156920 961352 869856 997911 1143873 1135448 871111 1128021 1307981 1169383 1061321
17966 1061321 1108902 1331374 1141608 1293808 1035509 862756 733891 686208 684076 681128
17956 681128 633295 606511 737459 880993 887486 764007 653103 437896 608214 620414
17946 620414 650189 715226 719560 730036 550486 641194 441224 588633 923594 1027056 854439
17935H54439k31903m8891k65633k3625l4131N8480J80272r4370J05384o8353K7197
17924D58866J49095K3315j21352J16586n4189l82439R3072J39428Q6005Q512J48512
17913F65411k44364j24874J10775O6657K4023J63525k83468j83458K13102L55630
17903G62959J854r0529k67297j17656j50972l20881j27389Q3127N4611J83520
17893A1347L50836K64523n007J93457j03823l26040r6119Q3738J15608l213j48135
17882C37172j69582k07320O5207m00J93438K02987K77521K9157m0161q9454m835
17871E93730k36027k47477j79165R0162Q4685J83405K42178j844k4430R5436J79415
17860G80068j70390k21443j46538k08551o1259J38999k702R3614q0498l2648R6999
$$ plain form
17935 854439 622536 573645 308012 284387 250256 308736 489008 394638 500022 431669 458866
17924 458866 607961 631276 509924 626510 572321 189882 282954 422382 508387 516899 665411
17913 665411 421047 296173 406948 473605 497628 661153 377685 194227 407329 762959
17903 762959 764813 674284 406987 289331 138359 -182522 -309911 -226784 -172173 11347
17893 11347 362183 626706 621699 815156 711333 385293 289174 372912 488520 485307 337172
17882 337172 167590 -39730 25477 25077 218515 421502 699023 728180 688019 598565 593730
17871 593730 357703 110226 -68939 21223 105908 289313 531491 529647 505217 600653 780068
17860 780068 609678 388235 241697 33146 -28113 110886 108184 201798 121300 88652 185651
17849A85651J11657J35442J40217K55560j95449k69588j3337J6894K404N9573
17839D29024J89355O7213K6352k63021j89452J10866K18300J01785l32041O7601
17829D25982J7715K51052L5814l15925k37209J95800k33396n3468J14792P1818
17819B72975J36135J10248j17287J51112J63562N5249n8327L5020J70641m23647
17809D95681k21729J89294O2059m79131l4397J57984k34327L8816J11882m5646
17799D0486o7326J26722L44846K53535J6579r1037j53909K14840Q7500k87565
17789D84671M8498O9374o389J98415J4332k35811j17788J90503p38K453M2226
17778F89746M9558j5984J15729P7072p8637L1740q2786j18532Q7292J93357j11114
$$ plain form
17849 185651 297308 432750 572967 828527 633078 363490 350153 367047 369451 429024
17839 429024 618379 685592 711944 448923 259471 370337 588637 690422 358381 425982
17829 425982 443697 694749 730563 414638 177429 373229 139833 86365 201157 272975
17819 272975 409110 519358 402071 553183 716745 771994 713667 748687 919328 495681
17809 495681 273952 463246 525305 46174 11777 169761 -64566 -25750 86132 40486
17799 40486 -26840 99882 444728 698263 714842 623805 469896 684736 772236 484671
17789 484671 533169 602543 596154 794569 808901 573090 455302 645805 645067 647520 689746
17778 689746 739304 723320 839049 916121 837484 869224 786438 667906 755198 948555 837441
17767H37441k11479O5275j13799j01363J93680M1182J73476l2362j18446k06457
17757E27148r137j12047k32362J47083l7598k77361j43035L9797L65577K10101
17747D78166k11766j54920M8373O6861J71919K61216l5907K38761J52736l02934
17737G12505m12242k85698k00874O9813K00705J39688j2438P4040K27321q5791
17727D27029k9004K6611J97191J62235j67435j45662j95735P7827J26163K16230
17717F95450L10156q2087j48047k22295k50222j59091K51402J45676o29j18004
17707D22309Q9344p484Q6711n3957n9555N8350j64483m14862o3744K72735K48371
17696D13735k08199p5669J97258J49235R8796R5283m7833q5682m22425j76651
$$ plain form
17767 837441 625962 691237 577438 476075 669755 710937 884413 852051 733605 527148
17757 527148 518011 405964 173602 320685 283087 5726 -137309 -97512 268065 478166
17747 478166 266400 111480 159853 226714 398633 659849 623942 862703 1015439 712505
17737 712505 300263 14565 -186309 -116496 84209 223897 211459 285499 512820 427029
17727 427029 398025 424636 621827 784062 616627 470965 275230 353057 479220 695450
17717 695450 1005606 923519 775472 553177 302955 143864 395266 540942 540313 422309
17707 422309 511653 504169 590880 536923 477368 535718 371235 -43627 -107371 165364 413735
17696 413735 205536 129867 327125 476360 575156 670439 622606 536924 114499 -62152
17686f2152L15766P3346o7417j97449k2837j33000j15342k0450J05298p6742m0451
17675b41430M3407J20796J97364J59109J16946J56696N6308r9238O7238j14031
17665D63165J10461j72354k12309o558r6518j89909N8059J04077k77943J52011
17655f7818K39698L7248J96002J08967J04901j97168l38226j49991K15108O8391
17645B17112m4563J41853Q1492j79200k9855k20028m6K35486J11326J42628n4223
$$ plain form
17686 -62152 253614 326960 259543 62094 39257 -93743 -209085 -229535 -124237 -200979 -241430
17675 -241430 -198023 -77227 120137 279246 396192 552888 609196 509958 577196 463165
17665 463165 573626 401272 188963 182405 85887 -104022 -45963 58114 -219829 -67818
17655 -67818 171880 209128 405130 514097 618998 421830 83604 -66387 148721 217112
17645 217112 172549 314402 395894 216694 186839 -33189 -33235 202251 313577 456205 401982
$$ [...]
##END NTUPLES=NMR SPECTRUM
##END=
