##TITLE=Analysis number 324296
Compound Code mo 07994
Book Reference 499/158/4
Project Code adrs
Chemist Name stuartg
##JCAMPDX= 6.0         $$ Bruker NMR JCAMP-DX V2.0
##DATA TYPE= NMR SPECTRUM
##DATA CLASS= NTUPLES
##ORIGIN= Bruker BioSpin GmbH
##OWNER= nmr
$$ XWIN-NMR		Version 3.5
$$ Fri Nov 17 12:33:52 2006 GMT Standard Time (UT+0h)  MAYBRIDGE\nmr@NMR_250MHZ
##.OBSERVE FREQUENCY= 250.131544655141
##.OBSERVE NUCLEUS= ^1H
##.ACQUISITION MODE= SIMULTANEOUS (DQD)
##.ACQUISITION SCHEME= undefined
##.AVERAGES= 16
##.DIGITISER RES= 18
##SPECTROMETER/DATA SYSTEM= dpx250
##.PULSE SEQUENCE= zg30
##.SOLVENT NAME= CDCl3
##.SHIFT REFERENCE= (INTERNAL, CDCl3, 0, 16.522)
##AUDIT TRAIL= $$ (NUMBER, WHEN, WHO, WHERE, WHAT)
$$ ##TITLE= Audit trail, XWIN-NMR		Version 3.5
$$ ##JCAMPDX= 5.01
$$ ##ORIGIN= Bruker BioSpin GmbH
$$ ##OWNER= nmr
$$ C:\u/data/dgb/nmr/ADRS/590/pdata/1/auditp.txt
$$ ##AUDIT TRAIL=  $$ (NUMBER, WHEN, WHO, WHERE, WHAT)
(   1,<2006-11-17 12:33:25.04 +000>,<MAYBRIDGE\nmr>,<NMR_250MHZ>,
      <created by zg, POWCHK disabled, PULCHK disabled
       configuration hash MD5:
       49 4B E0 1D 92 C2 6B 37 9F E6 65 BC 52 41 86 1D
       data hash MD5: 64K
       9E 15 C8 59 F4 DE FD DD 3D 46 05 B4 78 70 BD B3>)
(   2,<2006-11-17 12:33:41.54 +000>,<MAYBRIDGE\nmr>,<NMR_250MHZ>,
      <Start of raw data processing
       ef LB = 0.3 FT_mod = 6 PKNL = 1 SI = 32K 
       data hash MD5: 32K
       4C C4 F0 1E AE 32 5E 92 78 A2 1A CA 0D 7D AA 66>)
(   3,<2006-11-17 12:33:43.21 +000>,<MAYBRIDGE\nmr>,<NMR_250MHZ>,
      <apk 
       data hash MD5: 32K
       17 E3 1D 40 A0 C1 EC 3E 68 56 A8 5A 38 F4 AF 4B>)
(   4,<2006-11-17 12:33:44.15 +000>,<MAYBRIDGE\nmr>,<NMR_250MHZ>,
      <abs ABSG = 5 
       data hash MD5: 32K
       9F D2 01 F4 61 F8 F6 67 33 24 AB 44 49 EB 52 17>)
$$ ##END=
$$ 
$$ hash MD5
$$ 6C CD A7 A8 19 3E 0E 72 63 E6 85 68 2C 68 6F 63
##$RELAX= 
##$RELAX= 
##$RELAX= 
##$RELAX= 
##$RELAX= 
##$RELAX= 
##$RELAX= 
$$ Bruker specific parameters
$$ --------------------------
##$DU= <C:\u>
##$EXPNO= 590
##$NAME= <ADRS>
##$PROCNO= 1
##$TYPE= <nmr>
##$USER= <dgb>
##$AMP= (0..31)
100 100 100 100 100 100 100 100 100 100 100 100 100 100 100 100 100 100 
100 100 100 100 100 100 100 100 100 100 100 100 100 100 
##$AQSEQ= 0
##$AQ_mod= 3
##$AUNM= <au_zg>
##$AUTOPOS= <29 >
##$BF1= 250.13
##$BF2= 250.13
##$BF3= 250.13
##$BF4= 250.13
##$BF5= 500.13
##$BF6= 500.13
##$BF7= 500.13
##$BF8= 500.13
##$BYTORDA= 1
##$CFDGTYP= 0
##$CFRGTYP= 5
##$CHEMSTR= <none>
##$CNST= (0..31)
1 1 145 1 1 1 1 1 1 1 1 1 1 1 1 1 1 1 1 1 1 1 1 1 1 1 1 1 1 1 1 1 
##$CPDPRG= <>
##$CPDPRG1= <>
##$CPDPRG2= <>
##$CPDPRG3= <>
##$CPDPRG4= <mlev>
##$CPDPRG5= <mlev>
##$CPDPRG6= <mlev>
##$CPDPRG7= <mlev>
##$CPDPRG8= <mlev>
##$CPDPRGB= <>
##$CPDPRGT= <>
##$D= (0..31)
0 1 0 0 0 0 0 0 0 0.06 0 0 0 0 0 0 0.0002 0 0 0 0 0 0 0 0 0 0 0 0 0 0 
0 
##$DATE= 1163766803
##$DBL= (0..7)
120 120 120 120 120 120 120 120 
##$DBP= (0..7)
150 150 150 150 150 150 150 150 
##$DBP07= 0
##$DBPNAM0= <>
##$DBPNAM1= <>
$$ [...]
##$SUBNAM7= <"">
##$SUBNAM8= <"">
##$SUBNAM9= <"">
##$SW= 20.6930455092707
##$SWIBOX= (0..15)
0 0 3 0 0 0 0 0 0 0 0 0 0 0 0 0 
##$SW_h= 5175.983436853
##$TD= 65536
##$TD0= 1
##$TE= 683.16
##$TE2= 300
##$TE3= 300
##$TEG= 300
##$TL= (0..7)
0 120 120 120 120 120 120 120 
##$TP= (0..7)
150 150 150 150 150 150 150 150 
##$TP07= 0
##$TPNAME0= <>
##$TPNAME1= <>
##$TPNAME2= <>
##$TPNAME3= <>
##$TPNAME4= <>
##$TPNAME5= <>
##$TPNAME6= <>
##$TPNAME7= <>
##$TPOAL= (0..7)
0.5 0.5 0.5 0.5 0.5 0.5 0.5 0.5 
##$TPOFFS= (0..7)
0 0 0 0 0 0 0 0 
##$TUNHIN= 0
##$TUNHOUT= 0
##$TUNXOUT= 0
##$USERA1= <user>
##$USERA2= <user>
##$USERA3= <user>
##$USERA4= <user>
##$USERA5= <user>
##$V9= 5
##$VALIST= <valist>
##$VCLIST= <CCCCCCCCCCCCCCC>
##$VD= 0
##$VDLIST= <DDDDDDDDDDDDDDD>
##$VPLIST= <PPPPPPPPPPPPPPP>
##$VTLIST= <TTTTTTTTTTTTTTT>
##$WBST= 1024
##$WBSW= 4
##$XGAIN= (0..3)
0 0 0 0 
##$XL= 0
##$YL= 0
##$YMAX_a= 424544
##$YMIN_a= -295694
##$ZGOPTNS= <>
##$ZL1= 120
##$ZL2= 120
##$ZL3= 120
##$ZL4= 120
##$ABSF1= 16.522
##$ABSF2= -4.171173
##$ABSG= 5
##$ABSL= 3
##$ALPHA= 0
##$AQORDER= 0
##$ASSFAC= 0
##$ASSFACI= 0
##$ASSFACX= 0
##$ASSWID= 0
##$AUNMP= <proc_1d>
##$AZFE= 0.1
##$AZFW= 0.1
##$BCFW= 0
##$BC_mod= 0
##$BYTORDP= 0
##$COROFFS= 0
##$CY= 12.5
##$DATMOD= 1
##$DC= 0
##$DFILT= <>
##$DTYPP= 0
##$F1P= 14.0000005364418
##$F2P= -0.99999901652339
##$FCOR= 0.5
##$FTSIZE= 32768
##$FT_mod= 6
##$GAMMA= 0
##$GB= 0
##$INTBC= 1
##$INTSCL= 1
##$ISEN= 128
##$LB= 0.3
##$LEV0= 0
##$LPBIN= 0
##$MAXI= 10000
##$MC2= 0
##$MEAN= 0
##$ME_mod= 0
##$MI= 0
##$NCOEF= 0
##$NC_proc= -4
##$NLEV= 6
##$NOISF1= 0
##$NOISF2= 0
##$NSP= 0
##$NTH_PI= 0
##$NZP= 0
##$OFFSET= 16.522
##$PC= 1
##$PHC0= -37.45114
##$PHC1= -3.466093
##$PH_mod= 1
##$PKNL= yes
##$PPARMOD= 0
##$PSCAL= 4
##$PSIGN= 0
##$REVERSE= no
##$SF= 250.13
##$SI= 32768
##$SIGF1= 0
##$SIGF2= 0
##$SINO= 400
##$SIOLD= 32768
##$SREGLST= <1H.CDCl3>
##$SSB= 0
##$STSI= 32768
##$STSR= 0
##$SW_p= 5175.98343685301
##$SYMM= 0
##$S_DEV= 0
##$TDeff= 65536
##$TDoff= 0
##$TI= <Analysis number 999999
Compound Code 99
Book Reference 9
Project Code 9>
##$TILT= no
##$TM1= 0
##$TM2= 0
##$TOPLEV= 0
##$USERP1= <user>
##$USERP2= <user>
##$USERP3= <user>
##$USERP4= <user>
##$USERP5= <user>
##$WDW= 1
##$XDIM= 32768
##$YMAX_p= 506757652
##$YMIN_p= -1054037
$$ End of Bruker specific parameters
$$ ---------------------------------
##NTUPLES= NMR SPECTRUM
##VAR_NAME=  FREQUENCY,     SPECTRUM/REAL,   SPECTRUM/IMAG
##SYMBOL=    X,             R,               I
##VAR_TYPE=  INDEPENDENT,   DEPENDENT,       DEPENDENT
##VAR_FORM=  AFFN,          ASDF,            ASDF
##VAR_DIM=   32768,         32768,           32768
##UNITS=     HZ,            ARBITRARY UNITS, ARBITRARY UNITS
##FACTOR=    0.157963299565203, 1,           1
##FIRST=     4132.6476996994, 0,             0
##LAST=      -1043.33573715361, 0,           0
##MIN=       -1043.33573715361, -1054037,    0
##MAX=       4132.6476996994, 506757652,     0
$$ Real data points
##PAGE= N=1
##DATA TABLE= (X++(R..R)), XYDATA
$$ [...]
##PAGE= N=2
##DATA TABLE= (X++(I..I)), XYDATA
25786 974531 961923 913366 833258 1207844 1267380 1218651 1305771 1553670 1776641 1688842 1438224
25775 1438224 1361305 1277929 1291875 1493231 1567469 1343774 1347397 1220969 1087070 1160563 1041920
25764 1041920 967002 1116917 1225234 1204190 1033578 1155956 1443755 1315624 1254726 1209320
25754 1209320 1281113 1450553 1320156 1195863 1206265 1022417 1259601 1430467 1243870 1267754
25744 1267754 1140757 853682 889701 1001383 1027866 1372029 1573182 1454590 1257680 1187169
25734 1187169 1220243 1331321 1218418 1181319 999912 1000400 1059766 965341 924883 851891 776375
25723 776375 898921 928851 1051812 1174045 1147851 1164524 1271150 1330160 1275673 1378552
25713 1378552 1417074 1076739 928788 1351498 1240504 1089816 1199599 1247509 968053 980102
25703 980102 1088550 1102337 1085568 1159693 1241176 1156057 1318308 1244552 1138689 1203762 1369953
25692 1369953 1183913 1025514 1065644 1077831 997701 982102 1068293 1106311 1257595 1374708
25682 1374708 1331686 1176080 1037704 826723 785555 1091725 1057984 1296299 1466644 1625800
25672 1625800 1759453 1636845 1366835 1213532 1332308 1343730 1074083 779915 1004961 1284375
25662 1284375 1430354 1281953 1235205 1096750 1198322 1244285 997959 1205630 1510091 1210098
25652 1210098 998756 1011291 858160 1067777 1295580 1599365 1644356 1425808 1672776 1829121
25642 1829121 1828058 1707585 1817405 1590834 1564117 1629141 1533958 1345675 1258604 1153588
25632 1153588 1313029 1467054 1633496 1554684 1421426 1359127 1205896 1379997 1768134 1815748
25622 1815748 1541501 1280869 1219946 1183717 1305763 1535489 1392259 1140254 1187849 1184276
25612 1184276 1177763 1280244 1271927 1182371 1182915 1195286 1219964 1024122 1079151 1126004 1120121 1315476
25600 1315476 1428285 1321670 1334007 1146906 1112641 992123 952288 1053871 1261655 1149460
25590 1149460 789644 726522 1097094 1329671 1162181 896882 603621 603316 602453 842856 950696
25579 950696 1375748 1442016 1299786 1184867 1457298 1751005 1733231 1652505 1677496 1595192
25569 1595192 1455351 1316919 1123433 912736 823615 958332 1024277 1360933 1596873 1502446
25559 1502446 1636520 1637568 1619192 1417285 1203799 1220588 1058808 1195347 1341823 1182543
25549 1182543 1194258 1357121 1563360 1600982 1514061 1888689 1863668 1678801 1969186 2070682
25539 2070682 1950183 1730950 1723955 1681833 1484938 1424419 1442961 1521468 1560237 1417683 1111128
25528 1111128 897705 1043661 1154432 1268003 1365443 1547037 1585086 1492516 1605013 1583899
25518 1583899 1544400 1635924 1743366 1737685 1510683 1248994 1149999 1383730 1442154 1728355
25508 1728355 1742948 1740140 1667849 1648429 1972770 1855877 1307399 927756 826197 1204801
25498 1204801 1623262 1392424 1235106 1534763 1424344 1132882 931348 693006 1013677
25489 1013677 1594776 1545264 1349943 1182436 981212 903897 918905 1038866 1192550 1408029
25479 1408029 1460264 1469108 1797700 1849630 1657964 1517312 1561799 1567078 1496063 1290376 1272668
25468 1272668 1387317 1525425 1272480 1207399 1089339 962549 1074902 1071097 1191155 1420139
25458 1420139 1504004 1462423 1386107 1288190 1461843 1550109 1389190 1410696 1567742 1603646 1609168
25447 1609168 1572505 1460351 1076240 783037 616652 782338 842046 905175 885004 987824
25437 987824 1121681 1197151 1362085 1519758 1457497 1618099 1794142 1768852 1599746 1313708
25427 1313708 1346445 1430624 1216099 1063819 1372397 1598525 1603134 1508733 1300860 1382465
25417 1382465 1393808 1210828 1262658 1280053 1099897 846395 835136 923135 983997 1450838
25407 1450838 1760479 1809889 1727920 1405088 1323833 1251700 1280854 1206481 1063591 1089911 1115489
25396 1115489 999735 983850 862011 726993 812118 1088764 1241671 1175080 1063229 1286298
25386 1286298 1470190 1656055 1745011 1551737 1591695 1617735 1530998 1224286 1223509 1314578 1676513
25375 1676513 1797988 1631877 1317855 1177223 1268175 1514023 1826737 1841988 1809675 1587936
25365 1587936 1315020 1547502 1470077 1463513 1545253 1745854 1722162 1504370 1450911 1331805
25355 1331805 1508020 1782606 1671112 1342512 1293108 1166377 1230900 1363410 1370770 1206156
25345 1206156 1107935 1347070 1391280 1361614 1147583 1127835 1027728 1202340 1271759 1298262
25335 1298262 1339538 1332699 1491093 1499420 1314780 1239590 1340656 1229572 1056342 1103098 971196
25324 971196 1264143 1471987 1469004 1493461 1504651 1397802 1348558 1399520 1500701 1637618 1453310
25313 1453310 992392 767317 1091967 1334273 1499172 1630025 1685414 1686887 1515851 1620842
25303 1620842 1872574 1941945 1920473 1567059 1208144 1085036 892751 1214453 1105362 928828
25293 928828 940645 852284 962290 930564 1007287 1167782 1314452 1389452 1120120 991309
25283 991309 1441915 1609250 1226477 1372148 1321279 1316441 1451626 1310144 1157806 1058015
25273 1058015 1093522 823658 914257 798790 770065 774675 893128 750949 804015 1149806
25263 1149806 1243891 1048340 1075548 1479078 1551662 1596556 1727575 1719113 1492010 1304746
25253 1304746 1291635 1263684 1394607 1550228 1445736 1458343 1352795 1104693 994794 1009669
25243 1009669 1043660 1061606 1384424 1308822 1465396 1701584 1657349 1283617 1097881 1130784
25233 1130784 1322448 1297598 1475850 1457695 1347112 1246058 799787 597976 709482 1177276
25223 1177276 1185013 970970 798346 670410 641267 896889 1081299 1134878 997728 1067558
25213 1067558 1259419 1267111 1144845 1418998 1563199 1525352 1483025 1584495 1389718 929960
25203 929960 1035236 1284689 1499355 1448463 1330281 1640010 1603085 1426084 1318849 1174267
25193 1174267 1307841 1627307 1513180 1297844 1354886 1196682 1303169 1427611 1506496 1372261
25183 1372261 1185669 1103690 1168522 747172 893944 1079313 1115671 1374378 1270230 1227925
25173 1227925 1327828 1405491 1461407 1370952 1476041 1642938 1679245 1482425 1380456 1460794
25163 1460794 1458006 1372505 1405323 1539742 1628506 1402937 1434861 1456781 1138630 1061497 1272799
25152 1272799 1516335 1644403 1620313 1558459 1496837 1327026 1264898 1314774 1355313 1428699 1357691
25141 1357691 1285825 1088057 1096542 1264308 1537571 1661204 1568644 1538115 1405660 1405182 1127707
25130 1127707 903110 1207031 1298340 1161829 1314542 1600424 1502571 1256526 1370486 1768354
25120 1768354 1699559 1360930 1337544 1531616 1420892 1483023 1554420 1562119 1407820 1468691 1478341
25109 1478341 1250759 1329441 1424117 1509278 1549180 1581583 1392969 1479086 1259398 998678
25099 998678 807582 981798 956168 1336595 1363755 1029861 1061448 1246030 1165791 965912
25089 965912 898993 692778 698727 753289 643986 658636 720959 1088196 1363938 1358584 1296194
25078 1296194 1447325 1633612 1561867 1406531 1128176 1033350 1041050 980615 1064904 1033335 1128718
25067 1128718 1306613 1502273 1432862 1368135 1430595 1425464 1310389 1385041 1497818 1450519 1529896
25056 1529896 1593839 1510274 1343198 1272896 1298696 1277552 1006901 975800 1310934 1489745
25046 1489745 1447821 1466439 1574424 1400420 1301050 1163058 1274073 1251808 983588 930721
25036 930721 1211018 1409320 1502458 1491670 1131814 731603 907601 1473884 1644962 1454981
25026 1454981 1208348 1309698 1621438 1831844 1853979 1469372 1354158 1270288 1450600 1569624
25016 1569624 1597580 1603444 1789392 1866007 1736325 1574005 1582595 1585745 1423837 1438964 1048918
25005 1048918 1003189 1188146 1249662 1085718 1110761 1456340 1632085 1370088 1265980 1143724
24995 1143724 1227475 1109197 690962 759639 1066707 1270913 1375224 1287640 1280131 1246014
24985 1246014 1023120 1060929 1214728 1121287 1057575 906955 1140703 1254999 1408493 1531322
24975 1531322 1355683 1402465 1496057 1649532 1755716 1734106 1761912 1794940 1764618 1511288
24965 1511288 1454411 1536968 1445073 1399030 1493510 1321235 1370103 1406588 1718565 1819154 1654358
24954 1654358 1491093 1366898 1341584 1278231 1182312 1456041 1640230 1455418 1369278 1425452
24944 1425452 1428903 1585533 1676735 1338473 1208314 1222418 1157320 1208061 1303122 1398672 1612204
24933 1612204 1442313 1415412 1044960 1075505 1146231 1211560 1244323 1220539 1057874 1135014 1223723
24922 1223723 1316709 1442717 1375442 1474335 1359061 996291 909873 775647 691664 748331
24912 748331 1062265 1229702 1206504 1227773 1310632 1507334 1675398 1436552 1047185 1202301
24902 1202301 1372721 1446123 1417844 1335037 1396004 1514119 1488071 1518803 1526717 1449012 1389725
24891 1389725 1270203 1393218 1587054 1567138 1644574 1788996 1793009 1740093 1570772 1397133
24881 1397133 1207765 1457028 1571370 1428279 1358112 1697145 1506739 1239354 1391790 1494014
24871 1494014 1370814 1438997 1398001 1317392 1360105 1383253 1403490 1473248 1169411 1141498 1152847
24860 1152847 949148 862251 1014154 1186607 1280872 1370390 1301742 1392896 1530486 1493312
24850 1493312 1275879 1262997 1296914 1295670 1019879 1213986 1502435 1737650 1601873 1501585
24840 1501585 1595126 1454790 1161691 1437810 1394339 1401199 1689374 1665744 1494332 1191501
24830 1191501 1260750 1305565 1408932 1562814 1702365 1369212 1121912 1267629 1520536 1468491
24820 1468491 1629982 2058794 1911406 1520070 1309529 1257347 1571743 1804135 1885603 1738308
24810 1738308 1632686 1310370 1242803 1354240 1384656 1508512 1646443 1674073 1589065 1447720
24800 1447720 1465089 1219829 1197249 1221906 1310917 1457425 1414054 1528470 1569925 1440496
24790 1440496 1350189 1425485 1420371 1519326 1398625 1438196 1562127 1546513 1396856 1397145 1450545
24779 1450545 1615304 1675096 1300080 1099635 964114 1151763 1378430 1600379 1683305 1443989
24769 1443989 1509299 1415022 1549645 1631658 1482935 1608305 1807879 1823611 1752739 1666921
24759 1666921 1473248 1231323 1150579 1123054 1494999 1644811 1712538 1490029 1290112 1385404
24749 1385404 1484490 1672235 1600201 1678405 1934926 1866738 1735765 1647980 1510021 1489777
24739 1489777 1521004 1328863 1305165 1661089 1807872 1875579 1935991 1767333 1753703 1798368
24729 1798368 1812674 1510781 1519908 1566495 1508246 1641163 1655312 1688790 1417326 1207887 1056779
24718 1056779 1154292 1473863 1674410 1699621 1554584 1463555 1496483 1781087 1758848 1550434
24708 1550434 1276499 1110615 1170945 1274048 1433961 1603747 1676012 1432800 1423997 1312189
24698 1312189 1256373 1383862 1381363 1049452 1018418 1242019 1304515 1095693 1017165 1021513 1032836
24687 1032836 1196526 1508226 1530677 1528552 1555958 1619443 1416702 1278797 1270941 1056470 940440
24676 940440 1134383 1321326 1404652 1383207 1537086 1862592 1797453 1426761 1579139 1865281
24666 1865281 1977751 1962064 1812579 1971537 1900597 1624275 1639686 1596656 1557768 1527069
24656 1527069 1345243 1192038 1322045 1577311 1617543 1383894 1365563 1507630 1445848 1539054
24646 1539054 1588926 1356473 1393633 1644823 1502353 1444825 1255465 1238355 1412594 1392139
24636 1392139 1614682 1668728 1645925 1545283 1425486 1210221 1438583 1394966 1451761 1615696
24626 1615696 1783004 1910616 1882792 1823104 1502391 1398616 1574578 1448885 1304381 1182595
24616 1182595 955594 957204 905395 1018195 1204004 1251851 1051656 1120495 1283538 1298915
24606 1298915 1131520 1322461 1611995 1657584 1612532 1461607 1595654 1699836 1819482 1880790
24596 1880790 1805502 1893320 1693581 1819180 1728552 1592056 1601399 1739415 1811311 1708832
24586 1708832 1593704 1510592 1500728 1385039 1394978 1700224 1747554 1602053 1709927 1735505 1140012
24575 1140012 847504 1045892 1409705 1676580 1582312 1479237 1461874 1618405 1772828 1590843
24565 1590843 1575961 1387486 1435152 1665253 1724459 1801605 1564560 1496222 1440122 1360501 1229256
24554 1229256 1610433 1767265 1650928 1459753 1445939 1640297 1608995 1606933 1352905 1155000
24544 1155000 1078160 993016 922379 1043800 1233021 1410870 1187428 1269885 1242730 1609397
24534 1609397 1714025 1732504 1447181 1188043 1318179 1665605 1671747 1709084 1783362 1644735
24524 1644735 1645316 1738817 1757982 1812421 1812888 1598654 1532923 1341970 958222 1346210 1267344
24513 1267344 1040579 1116296 1158914 1467963 1516477 1560844 1599779 1440863 1349418 1592515
24503 1592515 1639520 1587315 1474266 1433819 1478554 1697540 1466296 1248662 941642 913136
24493 913136 1181599 1410901 1677097 1755491 1470111 1565886 1536516 1458667 1498623 1552700 1634644
24482 1634644 1540051 1495475 1452937 1548491 1758074 1831170 1917835 1779952 1663665 1696159 1583496
24471 1583496 1663425 1768289 1861165 1635694 1519273 1478874 1615039 1849799 1713793 1601968
24461 1601968 1758306 1974734 2126920 2108378 1674061 1395929 1264754 1346556 1245885 1380445
24451 1380445 1355614 1828057 2133375 1824487 1549299 1341146 1632448 1824532 1848317 1694493
24441 1694493 1524100 1660869 1713923 1543179 1546115 1436472 1565005 1629025 1372697 1363325
24431 1363325 1336107 1385250 1792493 1925288 1656480 1372386 1578645 1550969 1448803 1251634
24421 1251634 1212302 1227869 1164933 1106953 1236728 1259824 1274850 1543239 1698464 1472841
24411 1472841 1397162 1349676 1270562 1353521 1641314 1711407 1495933 1640293 1840881 1845586 1731035
24400 1731035 1789769 2012137 2043632 1991377 1833372 1935836 2047395 2019287 1989701 2041930
24390 2041930 1911901 1819313 1718176 1556298 1490150 1440045 1387507 1476020 1277075 1174662
24380 1174662 1294691 1393585 1347557 1271004 1022906 971799 714851 843412 1127012 1544033
24370 1544033 1624961 1460875 1245762 1305883 1510275 1512705 1564087 1418002 1555006 1682023
24360 1682023 1731536 1680495 1383932 1303549 1434787 1357102 1453873 1517818 1496524 1156744 1099483
24349 1099483 1175797 1345664 1515928 1573338 1613378 1534823 1427723 1388957 1281104 1279411 1215824
24338 1215824 1055333 978190 1143416 1348467 1473948 1566360 1608897 1419919 1471989 1416370
24328 1416370 1470761 1342770 1181320 1146669 1288840 1455076 1641652 1553453 1570603 1324084
24318 1324084 1425183 1461235 1044273 1111063 1372276 1407868 1206261 1418733 1464544 1618725
24308 1618725 1486514 1436924 1458707 1406075 1391843 1662817 1766842 1851468 1881637 1735393
24298 1735393 1656942 1596778 1232850 1066518 1126770 1246845 1291677 1240604 1101375 1330581
24288 1330581 1837626 1865108 1638327 1667548 1846363 1739747 1787471 1462917 1240321 1371458
24278 1371458 1530083 1628307 1496947 1286341 1328359 1591127 1327886 1167980 1215859 1570510
24268 1570510 1581007 1324572 1469709 1692930 1776793 1808441 1924593 1730420 1385429 1277095
24258 1277095 1172969 1183148 1154364 1218751 1096141 1304453 1591084 1543053 1365512 1350078
24248 1350078 1553416 1756383 1881353 1965851 1740674 1766160 1762247 1493329 1555928 1469645
24238 1469645 1189635 1641637 2011182 2008237 1838176 1630107 1533932 1354384 1187807 1311549
24228 1311549 1395720 1302449 1142091 1367508 1311545 1536534 1473769 1234333 1220489 1331515
24218 1331515 1364159 1468879 1599903 1720583 1618169 1399383 1627511 1681962 1557139 1545552
24208 1545552 1544595 1518068 1532983 1335751 1056505 1107845 1449698 1616693 1584707 1421977 1531095
24197 1531095 1435857 1304725 1695744 1947936 2105534 1894608 1626142 1732636 1911029 1926782
24187 1926782 1971091 1966364 1610062 1530602 1334423 1313125 1212087 1262315 1655143 1581913 1458084
24176 1458084 1426626 1428100 1664725 1850271 1807110 1624264 1544425 1491926 1699621 1856796
24166 1856796 1604121 1453467 1639202 1934184 1957763 1871331 1764993 1489195 1664412 1719373
24156 1719373 1701410 1910686 2000981 1877822 1677491 1601029 1555354 1667006 1554690 1521341
24146 1521341 1333999 1210946 1168068 1336159 1464887 1648685 1575712 1712804 1623770 1275378
24136 1275378 1062129 1180704 1230881 1511056 1887844 1726882 1596092 1716778 1956303 1886465
24126 1886465 1869946 1961217 2052570 1766882 1405476 1438870 1550176 1835360 2137573 2379216
24116 2379216 2157636 1818888 2007166 2050088 1889557 1987708 2057330 2093302 2041146 1805169
24106 1805169 1731414 1718967 1493364 1221903 1463978 1782404 1581075 1444811 1512418 1705522
24096 1705522 1511092 1365779 1570465 1685632 1907501 2183336 1803065 1619868 1820519
24087 1820519 2013429 1723646 1623613 1582964 1781901 1715935 1666790 1609911 1624489 1470304
24077 1470304 1605223 1882818 1843065 1758270 1592761 1489846 1375952 1278604 1324667 1377052
24067 1377052 1365702 1557718 1627111 1756246 1766799 1912856 1769908 1716766 1614268 1497937
24057 1497937 1422270 1461477 1391639 1438915 1462212 1531380 1624972 1735629 1951687 1849676 1574956
24046 1574956 1533023 1836861 1980904 1714631 1483238 1476147 1725694 1947563 1738694 1581925
24036 1581925 1367569 1336998 1311298 1571038 1668992 1841189 2011015 1998678 1862833 1603101
24026 1603101 1373063 1566282 1668418 1696644 1657362 1837349 1853877 1651525 1307491 1028182
24016 1028182 1312126 1747749 1890274 1895070 1793475 1755811 1703347 1782224 1764861 1579115
24006 1579115 1449839 1444257 1416421 1461576 1675989 1690571 1505395 1489630 1366354 1580948
23996 1580948 1829247 1625068 1598913 1771896 1944435 1863361 1638046 1502764 1484850 1768298
23986 1768298 1946535 1859311 1905609 2084343 2261901 2214273 2168663 1787065 1691917 1741113
23976 1741113 1706402 1706678 1746410 1646509 1571519 1715646 1748993 1563804 1468864 1573135 1783212
23965 1783212 1780279 1929165 1953040 1659606 1440360 1347674 1171489 1349078 1714980 1851614
23955 1851614 1816847 1564278 1452625 1554166 1599696 1489150 1504069 1517158 1571554 1712618
23945 1712618 1817600 1764780 1985981 2137003 2107731 1867777 1729083 1785546 1757806 1670144
23935 1670144 1611874 1573944 1465679 1412150 1498614 1306213 1567157 1644645 1604516 1514139 1073637
23924 1073637 1416373 1688825 1687296 1724258 1846107 1830266 1902078 1864066 1704862 1346441
23914 1346441 1393621 1537501 1559029 1503777 1546594 1717851 1739437 1714893 1534815 1325255
23904 1325255 1294271 1212137 1496041 1640475 1445569 1341380 1146439 1200139 1361079 1341768
23894 1341768 1519567 1515524 1555531 1556300 1280345 1415619 1512065 1192114 1176329 1645574 2004331
23883 2004331 1936694 1745364 1897551 1962374 2041257 1995315 2015463 2005831 1849109 1452778 1302540
23872 1302540 1375057 1378361 1548184 1709009 1496322 1052682 1051790 1462605 1553156 1646431 1566006
23861 1566006 1746009 1584853 1750978 1717646 1669299 1578581 1458362 1651891 1796378 1830549
23851 1830549 1827852 1761083 1897875 1865821 1544230 1450693 1751920 1820988 1785561 1604932 1236632
23840 1236632 1247284 1494606 1524011 1606479 1869989 1658984 1490414 1402299 1213317 1529757
23830 1529757 1860585 1909043 1870233 1862304 1620662 1534789 1619643 1920715 2045437 1777719
23820 1777719 1372671 1235750 1579098 1882736 1847604 1647353 1548462 1429997 1133024 1094382
23810 1094382 1078286 1200901 1415258 1491457 1305047 1341655 1429851 1703063 1867978 1684753
23800 1684753 1604519 1874751 1954759 1937906 1927931 1905369 1857387 1724378 1763109 1769879 1819610
23789 1819610 1814875 1646816 1660974 1617527 1704291 1722982 1888909 1980952 2045482 2129156 1958407
23778 1958407 1992794 1791726 1658295 1662531 1891188 1858406 1686168 1643898 1668940 1618387 1538519
23767 1538519 1546715 1242362 1232548 1697791 1699112 1358168 1499835 1784993 1751746 1614091 1575281
23756 1575281 1795776 2114188 2196941 1944612 1609092 1609453 1757225 1880546 1821929 1819584 1750400
23745 1750400 1465588 1490657 1647085 2082230 1951014 2035314 2011228 1717864 1516072 1352858
23735 1352858 1328175 1476815 1557439 1581696 1646247 1452442 1374579 1462406 1623312 1869481
23725 1869481 2083574 1874427 1310517 1058110 1320557 1738628 2022347 1871857 1650943
23716 1650943 1553558 1345289 1210203 1319028 1541613 1732109 1664423 1681571 1740034 1799168
23706 1799168 1607228 1748447 1940370 2057785 1931714 1732261 1900764 1830175 1658205 1453562
23696 1453562 1366773 1338929 1571371 1785454 1894240 1970966 1872012 1547499 1342490 1413290
23686 1413290 1504902 1548220 1838071 1983882 2142327 2271547 2387733 2416032 1978775 1749247
23676 1749247 1767919 1897200 1954931 1704420 1593584 1426613 1556817 1516867 1826068 1895081
23666 1895081 1898625 2002675 2038250 1795950 1504690 1697483 1980740 2032504 1874522 1837310
23656 1837310 2150896 1869206 1704044 1711983 1664956 1641502 1586327 1465452 1489364 1491048 1501964
23645 1501964 1622287 1573525 1634317 1614785 1352683 1044276 1048849 910348 1057959 1315760
23635 1315760 1676760 1652913 1647806 1817882 2005119 1688780 1446394 1778639 1806191 1797116
23625 1797116 1866199 1782530 1705904 1907378 2144178 1995937 1690381 1618413 1830692 1912311
23615 1912311 2170530 2110621 2003256 1801116 1900254 2097248 1878643 1790353 1713271 1629358
23605 1629358 1739662 1568829 1588486 1833852 1740865 1399770 1324153 1256216 1574203 1677959
23595 1677959 1516412 1616052 1684952 1711273 1513346 1642030 1677183 1595253 1511828 1481362 1499701
23584 1499701 1328219 1161386 1048801 1261332 1300394 1251472 961049 1006604 1081254 1380577
23574 1380577 1540687 1398670 1379926 1419901 1659581 1618471 1649699 1840115 1950009 1866418
23564 1866418 1992541 2016752 2115104 2250072 2037745 1945285 1990139 1888278 1597079 1440422
23554 1440422 1101464 998698 810712 954416 1173004 1199187 1268847 1411736 1906710 1757598
23544 1757598 1483495 1505265 1670788 1645702 1685465 1659015 1722095 1366334 1413463 1617287
23534 1617287 1472866 1150559 1474330 1495295 1700894 2079045 2084051 1890206 1980798 2013757
23524 2013757 2029959 1971944 1953158 2131814 1895483 1884747 1824211 1812454 1603313 1595326 1682485
23513 1682485 2026468 2082044 2035699 1896406 1593776 1569331 1693809 1942387 1914388 1832741
23503 1832741 1709078 1953679 2135499 1877757 1854116 1576654 1214966 1272309 1334836 1393747
23493 1393747 1353144 1172784 1415155 1651045 1745707 1835510 1834118 1487873 1553629 1642175 1509892
23482 1509892 1228662 1332696 1370197 1336035 1382908 1477121 1467943 1349320 1649972 1936094
23472 1936094 2167741 2023193 1915584 1872522 1699058 1774239 1777331 1969643 2203648 2227902
23462 2227902 2029630 1938816 2071881 2001424 1932026 1722726 1689827 1962348 2090175 2106976
23452 2106976 1991632 1999540 1835537 1721488 1859622 1928244 1805484 1673677 1689617 1458429
23442 1458429 1232680 1258990 1546046 1829132 1969255 2027851 2057125 2318628 2406810 2382891
23432 2382891 2384407 2278722 2138713 1992322 1524262 1275872 1281669 1332894 1827187 1879375
23422 1879375 1763733 1743590 1968463 1771109 1611205 1806320 1739458 1683406 1845348 1862265
23412 1862265 1779013 1724670 1716595 1605653 1340062 1371456 1844930 1980631 2009909 1865919
23402 1865919 1753289 1568358 1553922 1684752 1833010 1717893 1669419 1886782 2071523 2303109
23392 2303109 2017561 1785257 1752294 1778520 2006070 1875830 1748256 1731376 1577410 1647657
23382 1647657 1870286 2200244 2450000 2060869 1988418 1975513 1729290 1523892 1469678 1545138
23372 1545138 1661013 1930053 1933274 1685599 1778255 1672979 1541384 1157597 1091896 1168257
23362 1168257 1164854 1323547 1242973 1338793 1516396 1534949 1373169 1187306 1384651 1502957
23352 1502957 1562337 1430603 1460449 1635530 1825398 1895209 1909231 1966789 1978680 1913724 1950395
23341 1950395 1896926 2027479 2088046 1870456 1985215 2009133 1897065 1881704 1668093 1722620
23331 1722620 1731817 1597694 1562441 1721023 1751257 1605862 1845344 1714301 1421569 1296667
23321 1296667 1181461 1426132 1733241 1801278 1793185 1942812 2094974 2166800 2104822 1880041
23311 1880041 1634395 1697741 1785963 1901673 1862064 1993212 1963478 1825032 1908135 1941639
23301 1941639 1884891 1825305 1684717 1598319 1694017 1469490 1315098 1479006 1482507 1809101
23291 1809101 2153940 2355580 2329458 2239053 2211515 2194772 2020270 1554233 1194213 1292387
23281 1292387 1540800 1560294 1435900 1536987 1539441 1378001 1309743 1600327 1907870 2040568
23271 2040568 2208346 2281207 1912914 1972782 2052596 2156324 1901807 2050153 2198421 2305566
23261 2305566 2256813 1959749 2075946 2193886 2045624 1809153 1819785 1971826 1968616 1926871
23251 1926871 1777130 1579160 1529564 1447593 1742826 1925888 1881755 1840664 1720091 1918938
23241 1918938 2078840 1847353 1764451 1761035 1726568 1891048 1986860 1720150 1707780 2105698
23231 2105698 2160870 2185381 2111673 1855033 1625853 1746119 1711337 1824751 1752987 1653841
23221 1653841 1889413 1721944 1646253 1620644 1869854 2053283 1748849 1419057 1455728 1635191
23211 1635191 1625653 1915290 2072565 2181940 2198114 1773057 1733495 1739838 1590040 1603923 1496911
23200 1496911 1425318 1562705 1717500 1945795 1917660 1716089 1646383 1421882 1614689 1724901
23190 1724901 1603040 1666208 1734762 1733520 1634628 1709063 1741609 1706666 1878982 1907661 1885083
23179 1885083 1906749 2086921 1914919 1828961 1747532 1729319 1727182 1894637 1771807 1747621 1560238
23168 1560238 1558942 1609687 1654878 1774935 1705092 1465419 1179272 1213615 1468702 1560289 1422280
23157 1422280 1337357 1351698 1434003 1483236 1291006 1311611 1558427 1805519 1707090 1559610
23147 1559610 1746665 2104836 2271488 2034951 1556691 1374987 1554375 1699620 1649644 1927925
23137 1927925 1963804 1620696 1439628 1546551 1677548 1757254 2038070 2072592 1899457 1531895
23127 1531895 1284224 1493820 1379518 1382232 1496169 1527251 1395561 1769438 2084775 2057226
23117 2057226 1998515 1854037 1858614 1742400 1825518 2077003 2026395 1603599 1558114 1548265 1557751
23106 1557751 1570922 1963708 2175035 1950681 1773049 1947426 2084914 2085313 2170469 2021112
23096 2021112 2035554 2068478 1944636 2279856 2349675 2242876 2142098 2053960 1943690 1964188
23086 1964188 2007201 1961545 1978387 2162506 2416352 2481725 2279724 2085298 1822521 1699484
23076 1699484 2001778 2135725 2192937 1935597 1834494 1721155 1762471 1892232 1815351 1929550
23066 1929550 1873354 1842252 2028442 2055003 2027844 2043880 2101473 2065836 1793103 1841053 1967803
23055 1967803 1901959 2026395 2039136 1896620 1965550 1938541 1774461 1667505 1761703 1874728
23045 1874728 1932973 1859347 1642878 1678343 1854310 1758970 1839416 1906829 1845241 1634497 1704251
23034 1704251 1787462 1639373 1631942 1770109 1649771 1596043 1817321 1770296 1480792 1476935 1677418
23023 1677418 1794669 1923785 1950537 2020222 2141468 2247521 2129495 1902901 1828673 1910253
23013 1910253 2042860 2218752 2039212 1872776 1802155 1806569 2059201 2363192 2213339 2074707
23003 2074707 2019701 1933139 1908801 2105896 1984057 1973640 1954092 1631457 1757227 1940663
22993 1940663 1683256 1467650 1444148 1484233 1486452 1461631 1529065 1844519 1702802 1502634
22983 1502634 1580911 1598126 1592986 1779208 1840010 2186886 2591999 2270761 2098946 2162606
22973 2162606 2139100 2059457 1973137 1808949 1576942 1676907 1673609 1681640 2071292 2177701 1918620
22962 1918620 1753779 1828934 2023757 2154592 2072364 1882944 1749023 1731133 1729922 1825553
22952 1825553 1845790 2069985 2152521 2073831 2113044 2098126 2071635 1907306 1800763 2052813
22942 2052813 2274607 2350642 2204526 2341198 2442818 2040584 1495860 1327329 1591786 1889014
22932 1889014 2001710 1919955 1728905 1788535 1822283 1741379 1787647 1662450 1537264 1783505
22922 1783505 1918412 2150781 2304974 2229476 2063573 2099646 2153437 2151334 2219502 2157674 2284022
22911 2284022 2418640 2303908 2193833 1779257 1603296 1724139 1909377 2029397 2131855
22902 2131855 2082496 2231825 2084142 1725549 1962041 1806700 1468847 1416963 1601425 1757872
22892 1757872 1860709 2114360 2092239 2072952 1885264 1590227 1812261 1979519 1940052 2171038
22882 2171038 2047191 1775893 1762712 1745219 1629073 1672413 1719917 1722334 1800803 2035132 2137445
22871 2137445 2171740 2547686 2475767 2236337 1874081 1983973 1765720 1646043 1687752 1422121
22861 1422121 1500835 1662270 1901839 1758791 1659660 1657228 1625625 1703301 1929970 2098413
22851 2098413 1838864 1694527 1816696 1673109 1841479 1933064 2311951 2446439 2318153 2369443
22841 2369443 2371822 2407093 2331500 2277899 2203867 1843461 2031697 1946061 1787442 1732792 2080202
22830 2080202 1869952 1757643 1813691 1528447 1568796 2036613 2296152 2361362 2129484 2019711
22820 2019711 2016548 1978995 1985470 2151369 2090620 1936626 1848647 1585249 1584995 1883502 1981360
22809 1981360 2354967 2345852 2315700 2155313 2154565 2273173 2166199 1888330 2031702 2219413
22799 2219413 2501690 2383333 2261618 2180086 2182652 2401698 2283465 2174047 2015226 1736925
22789 1736925 1762905 1863264 1979385 2081341 2194067 2236649 2364880 2271340 2141561 1794867
22779 1794867 1747118 1857798 1751186 1987461 2180984 1965603 1659395 1674599 1786100 2023921
22769 2023921 2013141 1868597 1848053 1790152 1887982 2022390 2093129 1858380 1891879 2006702
22759 2006702 2134569 2047030 2093047 2060299 1913253 1967704 1905155 1997887 1965030 2079426 2238961
22748 2238961 2162897 2150864 2160455 2091196 1962919 1874053 1734088 1612951 1795793 2265858
22738 2265858 2183232 2202631 2346917 2231376 2264509 1980398 1910112 1743885 1896211 1762668
22728 1762668 1674565 1901188 2031379 2002793 1842402 2196333 2150602 1944170 1841325 2028220
22718 2028220 2336926 2197165 1766492 1872084 2112522 2107389 2319447 2448347 2170716 2239539
22708 2239539 2053369 2038724 2064001 1948633 1723811 1804985 1978136 2185197 2313760 2359007
22698 2359007 2236688 1999443 2039249 2160298 2159634 1948006 2012232 2114641 2003149 1893177
22688 1893177 1886989 1795479 1555385 1588149 1909085 1931064 2191018 2529934 2427566 2377499
22678 2377499 2251721 2002686 1795374 2018575 2298270 2322860 2190430 1957875 2005118 1719116
22668 1719116 1711977 1988414 2112830 2153401 2176525 2096044 1886857 1981286 2178723 2040187
22658 2040187 1905266 1936299 1921182 2079624 2032371 2197142 2193607 2091299 2420819 2388528
22648 2388528 2164750 1890764 1584476 1357275 1744542 2214417 2161558 2347992 2574954 2567738
22638 2567738 2338214 2165171 2273920 2116214 2126631 2057361 2026495 1678694 1575717 1948836
22628 1948836 2062443 1894579 1722167 1704976 1684899 1750611 1994572 2026638 2148346 2179406
22618 2179406 2220703 2413399 2283098 2227347 2564135 2503024 2472305 2618350 2518706 2405284
22608 2405284 2255453 2256123 2501892 2356173 2087766 1934390 1684424 1907507 2172563 2097041
22598 2097041 1998877 1908831 1803143 1754373 1853777 1952539 1854869 1726219 1794316 2038440 2050688
22587 2050688 2054404 2215059 2372169 2329125 2266685 2150260 2306229 2274373 2065079 2000771
22577 2000771 1869225 1935142 2088550 2155720 2181224 2171692 2042643 1902437 2094568 2241474
22567 2241474 2199052 2282381 2163562 2050238 2133474 2330913 2348887 2240943 2055002 2134971
22557 2134971 1945840 1907622 1841210 1806616 1884202 1967738 2066261 2045149 1793724 1933187 2266780
22546 2266780 2168071 1934957 1990775 1927215 1666309 1690464 1737753 1988957 2153073 2251015
22536 2251015 2340576 2488832 2373549 2287954 2195310 2223893 2194685 2233648 2232884 2095555 1909045
22525 1909045 1977541 1914035 1992234 2048631 1985987 2184789 2482272 2614812 2676670 2402922
22515 2402922 2224103 2288425 2225929 2219105 2155268 1966018 1951994 1908737 1832603 1838675 2044808
22504 2044808 2240069 2174642 2235226 1895369 1724787 1764989 1943761 1931960 1751839 1664867
22494 1664867 1884799 1925829 1884892 1655432 1782582 2190024 2284462 2256147 2293341 2337879
22484 2337879 2542968 2734172 2830978 2649188 2308156 2299233 2527767 2546255 2468197 2363312
22474 2363312 2256411 2485263 2608945 2550665 2331794 2172739 2141832 2319202 2229784 2408163
22464 2408163 2313152 2245086 2111899 1935719 2075889 2411637 2512806 2597755 2677760 2615461
22454 2615461 2544624 2474906 2270595 2024905 2152712 2316015 2318885 2174460 2241158 2355898
22444 2355898 2457939 2430920 2540351 2556873 2519862 2336732 2328965 2297854 2182867 1911016
22434 1911016 1792755 1701907 1865624 2096820 2287967 2471099 2338217 2089674 2208359 2265062
22424 2265062 2401438 2252645 2179262 2188317 2129090 2250192 2232298 2228203 2302326 2282190 2318253
22413 2318253 2507145 2414891 2287175 2010630 2002251 2068468 2224641 2171295 2076587 2480371
22403 2480371 2680148 2540864 2611785 2678906 2905325 2846336 2395583 2465942 2581472 2640455
22393 2640455 2795158 2838407 2863955 2451699 2388910 2419506 2427673 2243371 1897026 1812897 1821748
22382 1821748 1836660 1527125 1667502 2104594 2412666 2640298 2157341 1846067 1663183 1699647
22372 1699647 2097315 2442706 2525113 2429464 2176717 2083437 2049983 2117506 2239755 2418509
22362 2418509 2180959 1881866 2049659 2283606 2000216 2017513 1817785 1717071 2005639 2253000
22352 2253000 2308489 2208334 2237644 1759572 1605825 1662759 1952128 2093889 2348518 2299792
22342 2299792 2391839 2542131 2621857 2577038 2691751 2544091 2355426 2478654 2553216 2381762
22332 2381762 2014909 1954135 2306041 2359007 2358753 2472888 2315533 2315271 2343582 2289203 2110461
22321 2110461 2396508 2781079 2963417 2745550 2609906 2489416 2374529 2146102 2181368 2502109
22311 2502109 2734117 2463240 2024020 2036210 2142428 2356816 2307098 2325381 2403115 2519784
22301 2519784 2611557 2442065 2332439 2241897 1924378 2029571 2147286 2301577 2328202 2270948
22291 2270948 2189253 1996410 1933636 2006692 2201005 2057805 1832985 2089162 2545601 2546029
22281 2546029 2482775 2367723 2312040 2446186 2382601 2444220 2453572 2430576 2399858 2326283 2307657
22270 2307657 2324877 2140672 2003850 1777715 1766054 2085711 2092926 2042702 2050027 2231541 2121701
22259 2121701 1810691 1927225 1898345 2044579 2159507 2167456 2133963 2383739 2540377 2444255
22249 2444255 2391946 2560178 2471606 2324393 2462558 2557189 2545691 2440049 2364122 2486763
22239 2486763 2094225 1721935 1803365 2259458 2281145 2406961 2258949 2171447 2272117 2334942
22229 2334942 2391532 2213187 2111474 2073759 2179503 2210117 2247848 2361777 2719883 2774656
22219 2774656 2458145 2366045 2313083 2089966 2180361 2225295 2235202 2306775 2392406 2413134 1950344
22208 1950344 1810897 1948718 1921917 1976224 1983659 2088827 2267418 2520327 2606655 2827529
22198 2827529 2739742 2467830 2427350 2709229 2798205 2665733 2507946 2309856 2289253 2378857
22188 2378857 2400247 2148135 2095023 2058858 2104807 2332140 2340471 2123323 2255308 2582825
22178 2582825 2888849 2794832 2453782 2334220 2075287 2298949 2644389 2440740 2142924 2244763
22168 2244763 2225037 2267752 2612558 2892935 2934280 2640955 2392062 2384514 2492603 2299836
22158 2299836 2232509 2519022 2745591 2436706 2531099 2442700 2027796 2116061 2308604 2522167
22148 2522167 2819938 2685525 2496931 2294778 2397363 2475811 2260298 1845681 1709337 1744019
22138 1744019 1746308 2103858 2311518 2376583 2541124 2554211 2385847 2402945 2454860 2412827 2055308
22127 2055308 2111996 2003692 1886157 1853083 1795069 1762801 1877248 2132613 2310833 2378862
22117 2378862 2048152 1889791 1934149 1939706 2219663 2506053 2363786 1995377 2003690 2103138
22107 2103138 2251515 2373484 2162249 2054987 2179742 2472310 2379065 2096293 2033019 2240831
22097 2240831 2388495 2373255 2084888 2025317 2401155 2684373 2443551 2589768 2642232 2615459
22087 2615459 2476331 2207723 2275977 2710807 3125882 2973094 2653855 2546734 2405507 2417986
22077 2417986 2265634 2153098 2057994 2178668 2359476 2496276 2329415 2408734 2418172 2561151
22067 2561151 2441878 2513248 2534585 2498553 2369306 2368479 2336314 2329296 2460867 2546887 2357429
22056 2357429 2213696 2382924 2851994 2721001 2563933 2573715 2248473 2075274 2308349 2455603
22046 2455603 2450342 2357357 2280022 2137044 2237491 2419859 2518312 2335359 2346033 2257153 2191955
22035 2191955 2367635 2652984 2587601 2622537 2479789 2229793 2223527 2271307 2308753 2217636 1894083
22024 1894083 1916565 2299557 2287982 1992707 1865139 2060912 2067220 2267923 2342359 2504101
22014 2504101 2385581 2421974 2586069 2786402 2798883 2592879 2379720 2414364 2404490 2475031
22004 2475031 2145921 1947098 2160507 2451892 2657196 2520380 2413002 2371461 2318613 2621797
21994 2621797 2854717 2810565 2871571 2905270 2828143 2668578 2521646 2317106 2255386 2296665
21984 2296665 2353635 2356468 2097332 2214231 2211969 2204287 2082057 2259053 2291733 2122366 2187187
21973 2187187 2202363 2055090 1947190 1997701 2281749 2347014 2225047 2403351 2495574 2378071
21963 2378071 2290398 2308736 2241919 2357370 2343748 2536311 2510323 2322380 2568770 2727211
21953 2727211 2490135 2415541 2243203 2270228 2201194 2365422 2486170 2509549 2546462 2875541
21943 2875541 3176652 3222972 3089873 2903396 2689395 2785121 2856323 2835173 2747383 2254239
21933 2254239 2057391 2305263 2384872 2343960 2472065 2546388 2541099 2631641 2638036 2725709 2868959
21922 2868959 3023293 2607915 2435868 2617036 2570550 2603801 2598682 2496508 2659722 2417190
21912 2417190 2223106 2371911 2499398 2452859 2580177 2880760 2711236 2634377 2567400 2309834
21902 2309834 2243251 2350733 2382246 2303311 2289260 2358270 2252438 2266999 2240176 2513434 2524036
21891 2524036 2400198 2257756 2111392 2162005 2448317 2523819 2515051 2297133 2357839 2486009
21881 2486009 2484043 2275777 2096509 2158691 2094412 2282730 2484600 2727557 2856165 2933226
21871 2933226 3038034 2767552 2467760 2345213 2236089 2244022 2323626 2169701 2171287 2328627
21861 2328627 2055705 2173195 2394480 2589771 2357832 2358511 2484422 2611628 2594358 2662703
21851 2662703 2594205 2560332 2491973 2210845 2274515 2544248 2570239 2476722 2265320 2447072
21841 2447072 2539115 2463822 2375312 2372136 2342623 2315671 2094756 1805432 1883883 2091203 2135579
21830 2135579 2371128 2694163 2585397 2328338 2448204 2907587 3190612 3039351 2912591
21821 2912591 2943017 2877190 2596141 2829405 2979672 2753415 2750607 2785511 2507286 2344402
21811 2344402 2468067 2349404 2327105 2431331 2510565 2498877 2459753 2615779 2791044 2538415
21801 2538415 2390202 2421237 2380341 2483068 2614953 2429832 2293319 2460632 2497875 2457379
21791 2457379 2306405 2375254 2467225 2513603 2335257 2269816 2682428 2605163 2697305 2701190 2890538
21780 2890538 2839970 2562748 2666955 2718601 2653406 2616453 2717229 3022286 3017615 2957592 2781555
21769 2781555 2623532 2564994 2458542 2354038 2196832 2011003 2001858 2024260 2205094 2439846
21759 2439846 2341145 2219844 2456315 2491369 2653246 2697661 2598284 2732710 2925405 2922580
21749 2922580 2718585 2581380 2700204 2863777 2752613 2805091 3141052 2854505 2185344 2184307
21739 2184307 2382256 2530675 2517606 2276392 2488950 2668264 2643026 2642412 2633096 2350650 2115231
21728 2115231 2518350 2805386 2757847 2444215 2214131 2447037 2559953 2453018 2244076 2316856
21718 2316856 2582367 2697555 2734352 2800098 2840944 2977194 3065070 2976235 2702980 2812620
21708 2812620 2939903 3151317 3306532 3048263 2775946 2770736 2827417 2939670 3033918 2876583
21698 2876583 2914048 2760462 2366415 2311025 2681019 2719854 2614914 2438381 2268470 2169072
21688 2169072 2296951 2724194 3241599 3291016 3145208 3054872 3019577 3103496 2783508 2421185
21678 2421185 2449625 2697000 2583101 2564833 2633508 2752595 2473611 2439136 2479932 2614933
21668 2614933 2749500 2974369 3277961 3198747 2962293 2874299 2924746 2592388 2298463 2163055
21658 2163055 2292326 2178289 1933131 2060004 2295602 2282306 2449125 2328005 2238758 2265573
21648 2265573 2422580 2673110 2650139 2593226 2559933 2652917 2857692 2843946 2924677 3054599
21638 3054599 2918809 2630190 2492991 2648319 2795748 2850227 2941414 2937821 3018393 2881643
21628 2881643 2771590 2744884 3063287 3124805 2840424 2816134 2906220 2807208 2610196 2306797
21618 2306797 2401618 2762212 2573313 2432819 2525739 2583175 2681179 2716031 2841174 3235442
21608 3235442 3596126 3336703 2983895 2859583 2685109 2778801 2905006 3041079 3055972 3010944
21598 3010944 2794134 2618379 2556128 3084583 3459449 3525303 3202491 2926486 2835725 3050014
21588 3050014 3025359 2804352 2738669 2961470 2886662 2763952 2665326 2635309 2604978 2850383
21578 2850383 2805049 2731281 2869639 3008168 2908472 2695418 2960813 2991837 3076563 3237084
21568 3237084 2737582 2396479 2228847 2270788 2395232 2341748 2477180 2459764 2380758 2434269
21558 2434269 2780621 2821839 2871061 3007631 3072101 2842789 2712061 2584067 2504928 2666268
21548 2666268 2912045 2868324 2912968 3025854 2884169 3052158 3326591 3246828 2981032 2865111
21538 2865111 2844637 2982506 2879567 2690737 2582299 3107539 3217721 3030337 3031757 2798567
21528 2798567 2684611 2726768 2806557 2639790 2559555 2762821 3140805 3267127 2870739 2834085
21518 2834085 2957035 3182968 2915542 2646912 2617859 2455382 2562248 2707722 2887762 2790846
21508 2790846 2755694 2655338 2653884 2572561 2483821 2448993 2589159 2617196 2491828 2616437 2860309
21497 2860309 2966069 3188845 3313917 3181076 3075959 3028743 2973681 2885014 2729298 2622474
21487 2622474 2801443 3075813 2752913 2724498 3129829 3123650 2997574 2920352 2948155 2990554
21477 2990554 2926263 2756687 2733643 2728617 2602807 2727948 2844555 2625891 2684728 2819490
21467 2819490 2986667 2830467 2786650 2641657 2649117 2715185 2737290 2674568 2543431 2571302 2742097
21456 2742097 2889485 3187075 3107924 2685464 2750959 2851045 2869049 2839047 2963898 2914891
21446 2914891 2844705 2934801 3018101 2943718 3096292 3137625 3019341 3003331 2802537 2931642
21436 2931642 3173999 3111115 2950899 2871409 2996933 3114495 3339056 3147769 3003392 3166183
21426 3166183 3414780 3275899 2630418 2356360 2518338 2780706 2686123 2650831 2651596 2640435
21416 2640435 2602322 2740328 2824993 2892745 2824592 2628353 2745932 2771467 3107737 3207070
21406 3207070 2816331 2675778 2683752 2955316 3121989 3239774 3320427 3487851 3331925 3118678
21396 3118678 2807540 2598839 2895595 2980867 3039099 3332487 3295731 3166593 2965105 2748362
21386 2748362 2740740 2601119 2468341 2745129 3175486 2959293 2727254 2685813 2857546 2626524
21376 2626524 2685900 2750058 2793156 2693544 2674449 2764097 2783478 2928391 2923638 3005005 3174677
21365 3174677 2918209 2733798 2882618 3007385 2873856 3054696 3249853 3230745 3105241 3181262
21355 3181262 3063139 3021824 2950007 2830468 2811067 3045842 3059213 2926045 2602637 2639777
21345 2639777 2628926 2893046 3125012 2861804 2949168 3113099 3080623 3138674 3075700 3104162
21335 3104162 3092336 3313344 3424357 3607644 3583258 3556508 3442691 2998686 2873068 2810307
21325 2810307 2834126 2711757 2743535 2716379 2899740 3071777 3058960 3022941 2918010 2776632
21315 2776632 2931841 2869065 2747245 2672344 2830281 3156367 3411008 3362357 3040834 2856422
21305 2856422 2870197 2977381 3266348 3343463 3242868 3342386 3124374 2834287 2729793 2742743
21295 2742743 2948692 2947860 2960738 2936500 2772647 2625660 2693183 2772424 2632473 2625615 2882518
21284 2882518 3144006 3353420 3381245 3395473 3252734 3411524 3618105 3290114 3019119 2753931
21274 2753931 2939633 3030369 3135080 3082956 3043548 3020463 3081951 2779223 2761717 2717568 2569656
21263 2569656 2758233 3168983 3260195 3278387 3311273 3058602 2782218 2726812 2994757 3084587
21253 3084587 3020383 2965616 2928000 3122861 3178588 2986691 2747823 2832349 3073431 3183249
21243 3183249 3352032 3347466 3277206 3302860 3186647 3063274 3185278 3263924 3332369 3382174 3323467
21232 3323467 3193349 2954503 3025097 3283434 3253855 3131610 3149635 3396343 3482811 3305870
21222 3305870 2873435 2732933 3086046 3145857 3124960 3161312 2952749 2855463 2807583 2999884
21212 2999884 3212462 3299982 2996835 3137581 3145998 3106460 2790320 2860982 3116803 3026097
21202 3026097 2901994 3024243 3244977 3234165 3048981 3071972 2987218 2946867 2919020 3110571
21192 3110571 3363035 3133811 3016678 2934164 3241960 3285910 3141667 3211524 3153445 3360334
21182 3360334 3610372 3708179 3680403 3479347 3194928 2979952 2943149 3332553 3515069 3520374
21172 3520374 3401370 3422427 3397159 3415873 3622190 3428306 3045976 2992052 3003279 3033224
21162 3033224 3105728 2967195 2785687 2683585 2861873 2823980 2917439 3027990 3045410 3267544
21152 3267544 3162686 3046026 3155658 3237229 3132936 3156620 3159424 3181899 3184851 3168552 3369161
21141 3369161 3453771 3426239 3454675 3356545 3227614 2941279 2850974 2871389 2936377 2983975 3162711
21130 3162711 3177121 3264696 3225328 3169144 2869977 2844193 3044263 3243548 3385948 3683947
21120 3683947 3842732 3680872 3380297 3306149 3269479 3448215 3197362 3075319 3206612 3212010
21110 3212010 3248089 3371544 3216207 2913459 2823710 2717769 2743646 3093766 3512534 3311716
21100 3311716 3100208 3191150 3191836 3316164 3522048 3678118 3633948 3398794 3381133 3533428
21090 3533428 3595938 3682943 3421419 3181881 3411591 3373991 3297201 3275322 3070875 3381712
21080 3381712 3570309 3315330 3074444 3150346 3340314 3579775 3492109 3465301 3449034 3168472
21070 3168472 2959345 2936247 2968892 2999014 2925296 3120943 3365485 3404380 3324928 3426531
21060 3426531 3372828 3340262 3403825 3463903 3686860 3900105 3620481 3249493 3273503 3534508
21050 3534508 3602522 3539412 3407179 3186790 3405373 3469526 3505570 3403098 3309709 3208345
21040 3208345 3092044 3375033 3478437 3515814 3619087 3580195 3149240 3104519 3181181 3171823
21030 3171823 3287646 3365078 3295280 3240199 3011519 2856062 3164006 3435848 3440845 3516458
21020 3516458 3386014 3177660 3262731 3386883 3518206 3542205 3423416 3398589 3325176 3480199
21010 3480199 3418490 3258181 3269920 3348393 3292096 3140274 3202555 3315224 3306346 3337066 3344639
20999 3344639 3081352 2851472 3114593 3233947 3211669 3197687 3520605 3554026 3328851 3039881
20989 3039881 2943434 3359972 3638431 3619607 3458439 3495323 3377627 3329874 3288275 3261893
20979 3261893 3355452 3209693 3290151 3258956 3504198 3634306 3540371 3403871 3233733 3074811
20969 3074811 2933222 3073974 3359183 3360116 3186604 3375721 3467479 3707408 3527965 3364552
20959 3364552 3207291 3163325 3090641 3362195 3743319 3624756 3609128 3667492 3722309 3326927
20949 3326927 3334315 3472465 3526612 3191198 3426540 3500006 3372732 3352521 3292243 3215407 3726134
20938 3726134 3981752 3813180 4094524 3987501 3898087 4236359 4246354 3814368 3506476 3667655
20928 3667655 3775434 3660258 3474503 3419529 3491952 3702148 3586556 3608746 3708452 3682460
20918 3682460 3608886 3468684 3424565 3624318 3813909 4031751 4291230 4409103 3990401 3992239
20908 3992239 3685885 3551178 3581605 3715665 3866678 4116956 4132889 3978735 3932414 3854071
20898 3854071 3685429 3653920 3433890 3241801 3464625 3794260 3941539 3787107 3656709 3596293
20888 3596293 3607930 3668630 3558515 3826011 3931021 3878413 3827813 3841160 3770256 3679946 3561830
20877 3561830 3808006 3742561 3601940 4033344 4062135 3856964 3495767 3210894 3294178 3345452
20867 3345452 3385960 3483257 3433623 3363991 3589244 3824004 3833415 3749948 3571908 3375697 3161215
20856 3161215 3189747 3201769 3380504 3486608 3653459 3603474 3449145 3666873 3765981 3885935
20846 3885935 3894346 4055319 4071025 4106060 3905728 3494748 3416837 3357452 3373608 3599433 3803652
20835 3803652 3978128 4046420 3902840 3738784 3801079 3879739 3875308 3807711 3487673 3408698 3451755
20824 3451755 3505544 3323390 3250952 3443025 3492656 3681499 3804120 3722245 3522729 3502380
20814 3502380 3432888 3243722 3069094 3401142 3634292 3444855 3343681 3239741 3705920 3599553
20804 3599553 3245754 3300535 3420235 3524779 3597041 3600418 3532334 3381750 3586179 3425183
20794 3425183 3290294 3464210 3813254 3971180 4032906 3857564 3746219 3625004 3394755 3279455
20784 3279455 3273596 3423236 3472947 3451785 3445261 3495812 3651852 3899544 4198693 4283076 4043986
20773 4043986 3891006 4037431 3947896 3809319 3681870 3772543 3866158 3770489 3954778 3962107
20763 3962107 3847499 3718475 3585162 3646381 3790379 3959382 4077835 4267144 4206918 4163875
20753 4163875 4222793 4064972 3697370 3638533 3797671 3746187 3786122 3697953 3681125 3766255 3808399
20742 3808399 3769097 3551620 3511084 3338249 3069059 3131273 3384132 3661394 3839159 3988163
20732 3988163 3912159 3810077 3973426 4228173 4162842 4141946 4036577 4289783 4023545 3670123
20722 3670123 3737792 3967418 3979527 3747266 3536345 3771460 4040040 4398473 4427031 4193726
20712 4193726 4046018 4136391 3969523 3588324 3539104 3728244 3846031 3700895 3976340 4090687
20702 4090687 3969009 3822689 3555931 3485586 3714571 3929403 3851550 3944070 3941900 3872580
20692 3872580 3828547 3953444 3938399 4107430 4192723 4193124 4186842 4381863 4184506 3978246 4154208
20681 4154208 4248550 4143724 4177368 4150673 4106562 4203629 3882825 3911091 4230802 4455799
20671 4455799 4221630 4024771 3926827 4208938 4311530 4071087 4034698 3771480 3909976 3828787
20661 3828787 4001740 4160307 3955691 3766384 3714406 3763160 3713038 3826415 4073458 4005819
20651 4005819 3918512 4145056 4088433 3864637 3848573 3994733 3776092 3651756 3997117 3833530
20641 3833530 3706409 3572952 3648496 4093704 4394527 4251868 3996274 3790768 3644351 3787581
20631 3787581 3907840 4095743 3809326 3568542 3582594 3680261 3560084 3622666 3470255 3817567
20621 3817567 4276112 4388936 4338560 4430148 4221068 4025957 4055535 3985106 3749412 3624265
20611 3624265 3621543 3964222 4218961 4182971 4182426 4132550 4396475 4272657 3873049 3775407 3541742
20600 3541742 3705716 4003650 4217912 4035677 4107726 3958559 3891434 3946257 4068454 4180582
20590 4180582 3963366 3919356 3901166 4062813 4013486 3882319 3774904 3932286 4152079 4127557
20580 4127557 4384325 4392748 4251407 4249126 4348589 4592356 4640514 4335877 3845173 3747774 3752293
20569 3752293 3657331 3689505 3896184 3964062 3870984 3874654 4110590 4396515 4299661 4284123 4159741
20558 4159741 4003470 4105378 4180110 4240739 4040704 3772589 3894218 4110253 4026505 4011169
20548 4011169 4031636 4190799 4271490 4413090 4267279 4214332 4189164 4258959 4324209 4118252
20538 4118252 4020797 4056803 4090835 3956025 3972395 4064115 4093660 4133738 4305715 4489622 4384817
20527 4384817 4443385 4037771 4083753 4254267 4356454 4307601 3893818 3890835 4256613 4092517
20517 4092517 4018738 4146821 4226966 4491265 4445515 4401635 4342926 4183223 4263249 4328231 4568605
20506 4568605 4473096 4367822 4218446 4268248 4401747 4324384 4439083 4450230 4393247 4188742
20496 4188742 4210926 4370753 4393896 4552679 4470724 4140751 4043281 4098611 4241894 4228289
20486 4228289 4210180 4233972 4051232 4097784 4359853 4183306 3850334 3644940 3618907 3933885
20476 3933885 3966947 3766304 3644032 3830022 3941892 3985765 4108637 4278242 4318536 4329986
20466 4329986 4499631 4726151 4705669 4608871 4618935 4583218 4594900 4432992 4406669 4450187 4674817
20455 4674817 4772876 4732166 4730450 4496298 4390136 4514137 4599654 4769028 4632425 4650939
20445 4650939 4483007 4209482 4133694 4175075 4155274 4203435 4436375 4694194 4614928 4638761
20435 4638761 4785643 4551372 4472933 4433384 4542354 4549272 4591764 4636869 4526319 4340274
20425 4340274 4312248 4539355 4776752 4547056 4480419 4265298 4540155 4788418 4828065 4579886
20415 4579886 4425092 4580682 4755437 4692010 4531752 4380592 4357378 4494854 4329833 4137365
20405 4137365 4161025 4323086 4250812 4267426 4276222 4427604 4580968 4902034 5277706 5011434
20395 5011434 4823528 4691978 4711109 4795802 4576692 4638347 4725699 4798299 4831482 4727050
20385 4727050 4712681 4715303 4882449 4841850 4643783 4480340 4787230 4898438 4591991 4548543
20375 4548543 4330495 4575066 4867298 4995820 4554063 4457312 4598137 4797003 4908829 4810390
20365 4810390 4773965 4628646 4520413 4733427 5052956 5260949 5279399 5333802 5063388 4868678
20355 4868678 4677047 4675527 4860751 4983388 5024751 5098561 4864940 4980882 5128654 5171978
20345 5171978 5217237 5069171 4772242 4517944 4616940 4808185 4814805 4695169 4777324 4739145
20335 4739145 4713262 4889709 4845973 4809288 4905981 4643130 4534985 4422549 4600529 4890948
20325 4890948 4963542 4976660 4748980 4496345 4453552 4643846 4866662 4934837 4950324 5062744
20315 5062744 5240430 5118719 5105834 4936867 4727299 4653727 4738349 4942789 5064782 5091956
20305 5091956 4709380 4739663 4858193 4932417 4915819 4558500 4661901 4614226 4991139 5124637
20295 5124637 4963451 4782311 4677025 4706034 4863596 4768288 4588390 4477690 4508861 4743394
20285 4743394 4692499 4887332 4953406 4535197 4574824 4684680 4610064 4515360 4392374 4418755
20275 4418755 4686234 4707393 4846953 4915553 4568164 4408953 4616475 4657216 4802470 5002195
20265 5002195 5063537 4656236 4349533 4557604 4760254 4730453 4634686 4826492 4775580 4789701
20255 4789701 4681498 4609779 4582928 4638044 5005847 5203502 5200951 5024118 4952348 5079467
20245 5079467 4731977 4673402 4854173 4863929 4866891 4672375 4361980 4447694 4651737 4733765 4805919
20234 4805919 4909418 4933412 4785793 4793820 5005857 5064353 5358361 5562564 5207041 4970032
20224 4970032 4974564 5282772 5087060 5046438 5204583 5061870 4652749 4838479 5182641 5041896
20214 5041896 4832151 4759775 5041878 5327429 5374225 5379309 5249855 5248052 5280546 5259522 5131564
20203 5131564 5339944 5502219 5392289 5178971 5255399 5389989 5578561 5503190 5373000 5122952
20193 5122952 5152957 5297126 5125969 5101032 5068452 5341043 5289847 5199932 5209685 5279135 4967171
20182 4967171 4874408 4886881 4973291 5023609 5086035 5181771 5348187 5211033 4840635 5049081
20172 5049081 5406261 5345697 5160528 5202467 5271695 5295688 5171919 5329693 5467478 5742232
20162 5742232 5437165 5332694 5248255 5117633 5284466 5412455 5404545 5512493 5680409 5263615
20152 5263615 5331597 5455330 5162247 5270896 5652425 5708258 5877680 5845474 5540516 5359825
20142 5359825 5212194 5206312 5270247 5297423 5343883 5464391 5732368 5650133 5709217 5530755 5386837
20131 5386837 5392409 5583730 5406133 5382616 5424773 5426457 5403225 5424853 5415876 5543638 5490349
20120 5490349 5740033 5844163 5891348 6076717 5909363 5707434 5542518 5683523 5612921 5336709
20110 5336709 5176110 5514241 5843324 5750870 5506308 5583608 5809254 5957091 6035099 5934538
20100 5934538 5869736 5755683 5871903 5902723 5815458 5667729 5302546 5141458 5218345 4983533
20090 4983533 4914111 5057518 5064213 4953026 4987827 5045895 5404699 5514660 5652775 5713636
20080 5713636 5712470 5631605 5681643 5682725 5626509 5670258 5489167 5497189 5547747 5668397 5929615
20069 5929615 5803493 5711567 5623653 5475359 5388876 5542003 5811680 5776182 5622500 5628926
20059 5628926 5924444 5843696 5664272 5553440 5433970 5310810 5447475 5709781 5966297 5986693
20049 5986693 5891165 6150257 5824921 5862442 5844034 5491055 5830012 5996724 5987642 6024657
20039 6024657 6189843 6320161 6506633 6322747 6096085 5724287 5517675 5540404 5535173 5576062
20029 5576062 5589489 5689026 5610451 5598616 5570693 5274172 5262457 5647928 5754945 5774785 5764077
20018 5764077 5450840 5494215 5889430 6047241 6241946 6076733 5966821 5716949 5645566 5830631
20008 5830631 6087979 5934197 5957922 6093714 5967568 5852357 5722801 5941775 6116081 5916714
19998 5916714 5825347 5853784 5912248 5796196 6066473 6310958 6442077 6424118 6251560 6230694
19988 6230694 6365136 6173100 6030196 6087551 5989926 6033525 5844059 6238110 6526521 6842874
19978 6842874 6853748 6557376 6393589 6455276 6444370 6388021 6386925 6411382 6605233 6929116 6955942
19967 6955942 6490626 6288670 6272598 6179940 6219434 6327373 6120358 6141909 6050203 5863171
19957 5863171 5911827 5975962 6113393 6016659 6137742 6443133 6300656 6142106 5881151 5878687
19947 5878687 5989360 6105385 5958362 6061880 6311604 6442455 6272350 5916520 5944295 6214270
19937 6214270 6512432 6617505 6573663 6659427 6575314 6608980 6693405 6544370 6527556 6446450 6340633
19926 6340633 6421686 6442483 6533745 6412606 6583175 6579549 6432986 6186018 6124133 6185138 6515274
19915 6515274 6350056 6179476 6315596 6089137 6078329 6096660 6115638 6191903 6154586 6092502
19905 6092502 6196553 6429706 6578960 6614120 6641802 6895482 6610389 6602041 6609864 6472038
19895 6472038 6428251 6412581 6791364 7003474 6759532 6510824 6538288 6881598 6785354 6777013
19885 6777013 6836164 6669295 6524271 6828739 6663082 6482524 6230038 6280503 6388687 6429893
19875 6429893 6529091 6634876 6596785 6556640 6716432 6873869 6795632 6791353 6858942 6977810 7073829
19864 7073829 7099423 7164852 7046497 7249042 7229730 7110477 6968676 7011296 6921290 6869832
19854 6869832 6699928 6831262 7065326 7006298 6723774 6722751 6816715 6810073 6727203 6863999 6795607
19843 6795607 6887225 7108219 7063139 6892040 6952340 6955896 6862195 6890848 7015154 7064684 7307668
19832 7307668 7301874 7228123 7224056 7160512 7241730 7516800 7625882 7402971 7253249 7025215 6994508
19821 6994508 6917086 7056411 7161369 7190363 7266149 7306732 7352363 7440032 7505321 7435749 7389838
19810 7389838 7603380 7470019 7268326 7419131 7463915 7507405 7588438 7535514 7473498 7461905
19800 7461905 7176811 7071572 7281033 7404843 7688208 7787328 7767059 7746594 7738114 7652340
19790 7652340 7499597 7264279 7520647 7859591 8011490 7696458 7610197 7648623 7795496 8073602
19780 8073602 8534989 8468688 8508117 8423011 8234919 7922184 8113075 8172057 8167497 8105552 8170339
19769 8170339 8091702 8080159 8209302 8262430 8025242 8052359 8233408 8174693 7848867 7493144
19759 7493144 7677106 7597739 7336601 7462843 7532798 7551822 7523975 7760475 7731839 7356864
19749 7356864 7309611 7451540 7439142 7466559 7511868 7603967 7773564 7700079 7644246 7728935 7812385
19738 7812385 7761681 7702527 7832979 8380898 8501333 8266381 8405325 8175972 7876953 7876469
19728 7876469 7929336 7982955 7844139 7490154 7210479 7104799 7115561 6883764 6781858 6963588
19718 6963588 7147166 7064211 7025154 7439890 7582478 7531682 7497810 7752589 7915576 7942952
19708 7942952 7804007 7743905 7693200 7575123 7712663 8042037 7872809 7551882 7265833 7280705
19698 7280705 7633584 7949514 8121589 8014031 7759107 7686691 7465431 7383609 7418581 7625846
19688 7625846 7983786 8176430 8269485 8116050 8173124 8151377 7906361 7811160 7974938 7980984
19678 7980984 8302115 8402900 8503943 8271975 8295046 8237653 8253642 8423853 8517420 8343851
19668 8343851 8058457 8259576 8282446 8311960 8073857 8298436 8628923 8591339 8736030 8867109
19658 8867109 8738101 8830160 9111825 8864015 8792853 8649695 8666655 8766802 8875292 8587126
19648 8587126 8486983 8401055 8337662 8267536 8190065 8310021 8258489 8163397 8248889 8460668 8495923
19637 8495923 8082500 8151241 8370940 8425192 8565768 8717101 8853216 8901560 8859521 8732285
19627 8732285 8873680 9045188 8955760 8657874 8773914 9007579 8938143 8726821 8516306 8573334
19617 8573334 9019214 8869958 8991250 9353776 9490995 9140864 8714312 8763201 8967243 8977490
19607 8977490 9149904 9292279 9393740 9452139 9385836 9290075 9255553 9249972 9277010 9208319 9261970
19596 9261970 9441691 9648518 9548042 9173205 9173624 9510974 9641339 9620873 9730149 9578324
19586 9578324 9318047 9676490 9834623 9629130 9661460 9688942 9684345 9288250 9324888 9592932
19576 9592932 9826195 9855411 9581302 9641906 9607582 9362910 9319139 9416868 9400696 9414921 9430953
19565 9430953 9688328 9755520 9791210 9625473 9887094 9921640 9751962 9926027 9921510 9937011
19555 9937011 10040478 10062950 9661666 9613243 9567511 9629606 9834179 10058556 10232985 9868187
19545 9868187 9699368 9492909 9319974 9387448 9277497 9352778 9828367 9885911 9797513 9794891
19535 9794891 10120882 10019356 9814170 9945992 10255320 10420049 10258225 10291978 10377563 10320526
19525 10320526 10219189 10166134 10161365 10349208 10503002 10550845 10639424 10689054 10820005 10878005
19515 10878005 10805726 10546854 10422988 10488326 10515892 10655220 10630489 10657472 10402353 10161676
19505 10161676 10182358 10281017 10401790 10554969 10415857 10724162 10832620 10868231 10977758 11052034
19495 11052034 10844386 10511826 10656329 10812902 10939124 11077426 10942660 10852878 10898689 10899399
19485 10899399 11013228 10810801 10792129 10851969 10997628 11378751 11806331 11556844 11203804 11366548
19475 11366548 11598938 11478101 11533225 11537630 11521536 11457721 11849349 11924156 11697358 11690816 11657268
19464 11657268 11557307 11445499 11625813 11809468 11786942 11837711 12059932 12050711 11987701 11834943
19454 11834943 11908760 12026792 12031239 12241732 12312902 12125269 11943332 12216407 12515463 12505166
19444 12505166 12552901 12710951 12643117 12562751 12470266 12663651 12625021 12402475 12626724 12799761
19434 12799761 12611272 12599881 12562083 12306582 12215120 12402847 12415369 12528077 12825644 13099223
19424 13099223 13286281 13143795 13165047 13095519 12932461 12907898 12758610 13006590 13109781 13468552
19414 13468552 13959473 13832275 13393300 13420527 13560142 13622799 13586735 13742884 13691834 13740820
19404 13740820 13680515 13688377 13857091 13852682 13661179 13708608 13797832 13778952 13969171 14121659 14114328
19393 14114328 14062814 14329019 14547811 14440386 14486372 14551999 14358755 14387012 14656607 14716143
19383 14716143 14479927 14424439 14567334 14518357 14594632 14683911 14931686 15233211 15109434 15083475
19373 15083475 14980356 15091471 15066215 15109596 15215457 15264242 15461699 15517018 15360489 15290241
19363 15290241 15515945 15529592 15318994 15358926 15370693 15574733 15826285 15945087 15622110 15661963
19353 15661963 15977167 16038098 16180294 16156309 16407385 16401169 16190102 16162395 16342687 16485067
19343 16485067 16305676 16642642 16740787 16491699 16670236 16908072 16993288 17193184 17043399 16991723
19333 16991723 17247750 17243802 17494908 17737860 17767087 17830620 18048038 18205953 18066226 18255037
19323 18255037 18209699 18251506 18257659 18400265 18603681 18581489 18637173 18888562 19128196 19208738
19313 19208738 19168981 19160798 19333227 19470260 19708668 19990484 20172227 20299082 20082877 19759023
19303 19759023 19700380 19872768 20017797 20260084 20425185 20504867 20528487 20712558 20739835 20707869
19293 20707869 20519103 20435263 20515010 21102987 21302731 21500438 21603814 21446501 21486796 21643007
19283 21643007 21826243 22135242 22708562 22769746 22901593 23278200 23408593 23636298 23883040
19274 23883040 24085604 24402197 24641458 24745842 24650423 24394334 24729664 25166454 25490002
19265 25490002 25446689 25582027 26214060 26721203 27031614 26737338 26892815 27301612 27653000
19256 27653000 27721948 27799548 28293307 28925815 29085536 29402777 29727505 29779501 29963134 30308250
19246 30308250 30617992 31030012 31351012 31421682 31728387 32574783 33099213 33344255 33785101
19237 33785101 34009576 34260678 34669411 35254543 36016603 36604000 37243917 37825093 38225173
19228 38225173 38660237 39264424 39834941 40623427 41448219 41897883 42126831 42590105 43278803
19219 43278803 43960551 44546344 45292192 45936219 46794981 47457668 48477629 49815352 50905716
19210 50905716 51906913 52802651 53706832 54868820 56137260 57534869 59225359 60914368
19202 60914368 63215331 65815995 68117968 70641942 73712681 76900819 80399760 84129796
19194 84129796 88401812 93258038 98493512 105033779 112792845 121299264 130025798 137911538
19186 137911538 142183837 138911052 127604312 110916310 92858695 73061394 50204965
19179 50204965 27147174 5020956 -15566919 -33287610 -48856958 -58288857 -58097681
19172 -58097681 -51844430 -43359667 -34723806 -26649380 -19131131 -11797006 -4988624 1393374
19164 1393374 7634446 14028655 20412584 26739178 33766013 41316137 49564988 58657666
19156 58657666 68570088 78968645 89388457 96695528 96498724 86583702 68836283 48940277
19148 48940277 27875998 2968656 -23246507 -48223059 -72147103 -93105589 -111507349
19141 -111507349 -125405925 -129088424 -124488282 -116754015 -108199882 -99896384 -92273687 -85724640
19133 -85724640 -80380683 -76013150 -72349713 -68680238 -65192160 -62095370 -59316130 -56556968
19125 -56556968 -53764439 -51446566 -49526434 -47992421 -46728982 -45220183 -43448187 -41867883
19117 -41867883 -40631976 -39482522 -38605839 -37942819 -36888490 -35802659 -35337748 -34619320 -33545874
19108 -33545874 -32821816 -32425963 -31614085 -30776205 -29907030 -29047894 -28318036 -27978076 -27540372
19099 -27540372 -27484411 -27065963 -26504838 -25761749 -24908710 -24276278 -23769596 -23197443 -22777897
19090 -22777897 -22637934 -22277735 -21928771 -21257419 -20623251 -20043957 -19669035 -19279354 -18989045
19081 -18989045 -18728791 -18383962 -17973046 -17999815 -17749465 -17269408 -17205702 -16826306 -16390433 -16310125
19071 -16310125 -15804765 -15322443 -15013165 -14743433 -14661068 -14446201 -13873447 -13296641 -13230050 -12916251
19061 -12916251 -12879308 -12758003 -12835248 -12677823 -12066133 -11586374 -11388513 -11100343 -11135872 -11234458
19051 -11234458 -11199925 -10900131 -10645552 -10593153 -10605842 -10392478 -10047093 -9784764 -9444990 -9526516
19041 -9526516 -9420446 -8998889 -8625829 -8458659 -8117132 -8104366 -8119213 -7758651 -7551358 -7639203
19031 -7639203 -7629503 -7691320 -7489086 -7137754 -7153788 -6701789 -6417229 -6684095 -6664359 -6328764
19021 -6328764 -6181553 -6079057 -6018175 -5924037 -5683205 -5638306 -5688112 -5604763 -5325182 -5191845
19011 -5191845 -5131428 -4755598 -4697373 -4652226 -4464460 -4073233 -3695621 -3909796 -4082943 -4115013
19001 -4115013 -4035055 -4016833 -3663002 -3313298 -3130918 -3348779 -3245104 -3166873 -3306627 -3378192
18991 -3378192 -3315543 -3131616 -3149961 -3301518 -3213017 -2912298 -2685942 -2654151 -2427563 -2153968
18981 -2153968 -1970056 -1747842 -1775765 -1824988 -1824899 -1787548 -1654407 -1640911 -1677717 -1389952 -1272285
18970 -1272285 -1027987 -1114058 -1120035 -939094 -1000119 -848001 -579274 -560361 -444895 -338206
18960 -338206 -483757 -676274 -555458 -440090 -17382 121337 218415 213752 330836 744102
18950 744102 747942 511315 510635 483975 385300 347445 709082 711121 678108 902909 962879 1168266
18938 1168266 1139512 1310421 1419165 1725703 1866569 1668663 1549662 1723137 1887470 2170864
18928 2170864 2463558 2398229 2124551 1953342 2073007 1985189 2053003 2438003 2437798 2238617
18918 2238617 2325190 2326416 2074948 1897975 1980993 2233787 2405387 2781187 2982663 3058314
18908 3058314 3003350 3017854 3146314 3073126 2837163 2888288 3173271 3412608 3539636 3484590
18898 3484590 3234940 3304536 3572700 4062119 4275760 4211990 4072115 4273023 4282969 4322764
18888 4322764 4157289 3991275 3981294 3925007 4087455 4376936 4712150 4930821 4813790 4791851
18878 4791851 4994197 4985097 4810010 4775383 5039954 5502375 5322216 5104786 5181772 5097315
18868 5097315 5298984 5322170 5349947 5424299 5510287 5364035 5686833 5829392 6040092 6284470
18858 6284470 6431225 6432763 6513791 6843111 7052902 7073577 7006696 6926002 6686279 6686735 6674873
18847 6674873 6474808 6562587 6893538 7029670 6789701 6645488 6522283 6502652 6746391 6870487
18837 6870487 6670326 6814928 7181638 7391232 7358641 7437473 7242493 7171438 6630826 6696726
18827 6696726 6920436 7073800 7257719 7312166 7294405 6948234 6738686 6549798 6649599 6795069
18817 6795069 6773011 7112056 7634566 7862524 7933715 7671313 7665352 7845186 7867888 7821650
18807 7821650 7904432 7942894 8195619 8348896 8365447 8230808 8377722 8471453 8556815 8955004
18797 8955004 8990715 8870394 8845964 9013878 9082307 9360768 9581871 9754148 9713053 9598438
18787 9598438 9533074 9798945 9935527 10336354 10571042 10769065 11011697 10960789 10735453 10503156
18777 10503156 10532228 10656551 10899772 11149677 11281029 11570603 11981979 12086593 11996943 12012695
18767 12012695 11172202 10063764 9767160 9879210 9945847 10249529 10769635 10971306 11392282
18758 11392282 11546216 11537304 11403948 11413958 11683155 11684256 11733120 11987985 12135631 12290659
18748 12290659 12233548 12372143 12536964 12634953 12654623 12837396 12989401 13172427 13553598 13441194
18738 13441194 13282110 13363669 13542876 13604888 13323948 13385832 13817453 13999037 14060746 14359607
18728 14359607 14523546 14547049 14704130 14420276 14337171 14484445 14664588 14699202 14824554 14946728
18718 14946728 15088335 15499397 16037861 16031986 15860965 15743311 15731414 15995945 16398711 16556703
18708 16556703 16379276 16637252 16983531 16997568 16882763 17065536 17236760 17493700 17626550
18699 17626550 17817812 18241430 18489957 18494132 18452832 18454743 18563499 18616832 19079204 19331473
18689 19331473 19530833 19567858 19573513 19608575 19876660 20264127 20321566 20800675 21194694 21199651
18679 21199651 21216804 21302163 21284936 21515676 21753372 22088706 22388712 22695718 22863807 22878715
18669 22878715 23156521 23665407 23731723 23718241 24066864 24726757 25107171 25220523 25300022 25455523
18659 25455523 25619771 26260444 26883466 27172580 27229673 27353166 27801788 28366778 29039457
18650 29039457 29595179 29738137 29994118 30163574 30538399 30839256 31460106 31907760 32370137
18641 32370137 32879906 33481940 33935275 34338042 34878165 35650573 35916500 36003459 36529337
18632 36529337 37328689 38432927 39103420 39193605 39705831 40398721 41318541 42153228 43182257
18623 43182257 44493133 45508067 46631476 47679107 48562231 49732836 50915907 51941097
18615 51941097 53444218 55058972 56306933 57955993 59861050 62052344 64531358 67256103
18607 67256103 70015877 72899165 75785150 78740815 82209210 86200796 91067252 97244542
18599 97244542 104462657 112900857 122161267 129606083 128099605 112906325 86976009 66739213
18591 66739213 67482351 79224810 94852491 110201666 118108310 107604660 71841757
18584 71841757 19645243 -21271219 -35645879 -27815955 -12999081 2429248 14241938
18577 14241938 15139234 649502 -25567299 -46588740 -47406937 -38712154 -28604484 -19215319
18569 -19215319 -10574480 -2015183 6922539 16199883 25564784 35833317 45437907 49201678
18561 49201678 41291301 22452743 1725676 -2229235 7041432 20646371 35409618
18554 35409618 46012109 43012942 18626712 -25609531 -67242961 -88060527 -85891799
18547 -85891799 -73908310 -60237260 -48626667 -44195604 -53274455 -75440439 -100183834
18540 -100183834 -107912914 -103178165 -95615976 -88240610 -81970366 -76503693 -72042171 -67785254
18532 -67785254 -63854473 -60746616 -57915939 -55330010 -52663617 -50514210 -48946909 -46971469
18524 -46971469 -45220665 -43678617 -42211488 -40851220 -39531784 -38292108 -36994855 -35768212
18516 -35768212 -34608868 -33460356 -32434250 -31460066 -30745760 -30038280 -29351377 -28582626 -27948787
18507 -27948787 -27337375 -26658266 -25788815 -25227502 -24561254 -24021489 -23683572 -23107579 -22377849
18498 -22377849 -21563011 -20872499 -20570577 -20206813 -19684007 -18927471 -18285509 -18018340 -17755505
18489 -17755505 -17085220 -16724558 -16353990 -16019430 -15430475 -14781887 -14370553 -14078610 -13691704
18480 -13691704 -13528877 -13293022 -12918711 -12447773 -12064377 -11697833 -11206952 -10586404 -10169360
18471 -10169360 -9889227 -9601129 -9233287 -8942813 -8746191 -8424866 -8364863 -8145522 -7964887
18462 -7964887 -7887507 -7844421 -7581368 -7353686 -7066610 -6489402 -6116030 -5914918 -5673310 -5488603
18452 -5488603 -5159081 -4703127 -4344618 -4106511 -3895639 -3594454 -3513127 -3619445 -3444903 -3290613
18442 -3290613 -3257658 -2911136 -2350424 -2203438 -2124392 -1785631 -1502026 -1443321 -1154292 -864383
18432 -864383 -769710 -542271 -210496 114650 466806 551648 705643 1078857 1143807 1147452
18422 1147452 1183228 1297349 1525388 1682532 1858282 2051300 2300738 2309046 2644242 2973314
18412 2973314 3169371 3539550 3983827 4342975 4774366 4969526 4912048 5300662 5661973 5988032
18402 5988032 6382169 6625046 6867155 7100710 7558997 7722994 8018133 7972097 8212893 8429773
18392 8429773 8746814 9007797 9312277 9329542 9729768 10075234 10415945 10794303 10898057 11183873
18382 11183873 11507473 11836943 12056176 12576242 12748072 12873213 13736625 14060173 14034415
18373 14034415 14498149 14787291 15190386 15551870 15984751 16336553 16479518 17051764 17741715
18364 17741715 18212782 18652617 18977500 18906727 19083698 19614245 20220173 20569491 21299023
18355 21299023 21715557 22014685 22430513 23020148 23625598 23959792 24786574 25563329 26582345
18346 26582345 27245568 27798045 28418668 29023389 29786017 30443277 31224030 32001242 32871168
18337 32871168 33934580 34600285 35701076 37010357 37947271 38735547 39735592 41172608
18329 41172608 42629705 44095300 45564032 47279533 48973216 50581705 52049281 53596266
18321 53596266 55742408 58135511 60845909 63404672 66062111 69048871 72523103 76415289
18313 76415289 80297172 84515659 89363759 95136594 101587015 109143345 118650192 130384967
18305 130384967 143660762 155473379 159242799 148926927 124733619 96715713 75173424
18298 75173424 53536617 40482765 47816052 58923426 58887520 44912750 21932314 3416244
18290 3416244 -14419560 -29887192 -25832102 -7844071 13210556 31454794 39108102
18283 39108102 31772754 9914804 -14783673 -33945154 -53846436 -63292645 -53777462
18276 -53777462 -44232321 -47441252 -65302089 -90841504 -112219073 -134459647 -153558793
18269 -153558793 -153931899 -143722659 -132201956 -121836936 -113080292 -105460912 -98734323 -93176891
18261 -93176891 -88627536 -84356198 -80510630 -77321023 -74428113 -71318944 -68766065 -66369073
18253 -66369073 -64025346 -61771901 -59689980 -57773818 -55785984 -53955448 -52182289 -50710633
18245 -50710633 -49435350 -47900694 -46632861 -45580825 -44475438 -43238496 -42111897 -41019488
18237 -41019488 -40363420 -39607803 -38519776 -37668661 -36838400 -36088116 -35287223 -34469179 -33754743
18228 -33754743 -33044419 -32467736 -31978663 -31211627 -30574162 -30201062 -29643775 -29018508 -28214798
18219 -28214798 -27394470 -26774658 -26436333 -25943309 -24985876 -24172613 -23659916 -23221291 -22901315
18210 -22901315 -22470095 -22116656 -21802440 -21589010 -20862968 -20099352 -19575057 -19151413 -18753782
18201 -18753782 -18462469 -18189455 -17727518 -17142975 -16902489 -16521357 -16148239 -15767252 -15340843
18192 -15340843 -14959780 -14331194 -13815317 -13256328 -12905904 -12536169 -11897808 -11307513 -10800190
18183 -10800190 -10246560 -9733389 -9459085 -9074502 -8654796 -8329034 -8019631 -7709910 -7344112
18174 -7344112 -6849303 -6140898 -5768445 -5406427 -4781134 -4118387 -3653451 -3294078 -2825922
18165 -2825922 -2225778 -1569887 -892905 -263948 394113 1115623 1557513 1959133 2358404
18156 2358404 3319179 4130237 4879461 5332644 6024589 6862848 7630427 8760290 9720902
18147 9720902 10780545 11688530 12531246 13448419 14610808 15757332 17029131 18298666 19566313
18138 19566313 21048692 22526840 24358978 26246024 27931108 30119740 32362254 34344324
18130 34344324 36765881 39530254 42439707 45954068 50070503 54602932 59772680 65123673
18122 65123673 71129387 78467101 87187618 96883064 108871598 124061164 142848417 166704728
18114 166704728 196819643 231250089 256826284 232205324 120466703 -65705082 -236318775
18107 -236318775 -274080402 -253379107 -225192486 -198573688 -176271368 -158267791 -143787076
18100 -143787076 -131782930 -121615394 -113047916 -105807819 -99749498 -94596755 -90330232 -86633830
18092 -86633830 -83434244 -80648788 -77744176 -74796338 -72023984 -69358882 -67027660 -65002032
18084 -65002032 -62934438 -61114074 -59529779 -58098109 -56630372 -54769634 -53331714 -52691254
18076 -52691254 -51835723 -50901923 -49556210 -48317741 -47671815 -46832914 -45893097 -44989997 -44449346
18067 -44449346 -43551445 -42740442 -42128304 -41710985 -41301673 -40664653 -39974176 -39613008 -39315258
18058 -39315258 -38898430 -38366466 -37935910 -37282663 -36531638 -36134583 -35840688 -35570726 -34990644
18049 -34990644 -34525062 -34017287 -33660118 -33443449 -33295880 -32936236 -32532556 -32173275 -31764313
18040 -31764313 -31394772 -31227236 -31359577 -31338616 -31200639 -31099026 -30949884 -30657846 -30371020
18031 -30371020 -30227871 -30034979 -29669177 -29291228 -29141319 -29005987 -28798640 -28517818 -28084249
18022 -28084249 -28081326 -28130552 -27581394 -27165130 -26945455 -26721423 -26431546 -26151880 -26318028 -26319303
18012 -26319303 -26021191 -25475626 -25105630 -24996568 -24844213 -24724597 -24484095 -24279709 -24366088
18003 -24366088 -24578118 -24623828 -24452208 -24562258 -24339364 -24008727 -23806855 -23647123 -23523681
17994 -23523681 -23687307 -23566508 -23488048 -23357626 -23241196 -22933039 -22660411 -22567103 -22322092 -22334622
17984 -22334622 -22075277 -22067825 -22066644 -21987555 -21844958 -21908596 -21962994 -21811608 -21598184 -21594767 -21457399
17973 -21457399 -21147209 -21016485 -21029232 -20911053 -20608764 -20588111 -20224140 -20084102 -19866507 -19792741
17963 -19792741 -19745895 -19716821 -19674804 -19468771 -19896059 -19991668 -19738342 -19664348 -19588927 -19700350
17953 -19700350 -19448921 -19054111 -18514666 -18055885 -18245107 -18649824 -18926576 -18862547 -18640263
17944 -18640263 -18464242 -18673368 -18510974 -18101170 -17899580 -17842932 -17842833 -17678947 -17683988 -17647667 -17696595
17933 -17696595 -17625896 -17728619 -17895378 -17713020 -17477332 -17344162 -17472090 -17274570 -17129291
17924 -17129291 -16933190 -16775004 -16874827 -16702324 -16671668 -16769044 -17107675 -17285047 -17188169 -17042325
17914 -17042325 -16550070 -16369911 -16496757 -16631711 -16578126 -16331311 -16416739 -16300766 -16226130 -16146856
17904 -16146856 -16069269 -16088239 -15945438 -15699251 -15656656 -15424894 -15386668 -15187995 -15444026 -15683324
17894 -15683324 -15561544 -15314803 -15109068 -15220852 -15296648 -15269828 -15098223 -14784346 -14863577 -15206861
17884 -15206861 -15467457 -15703456 -15339556 -15089428 -15194492 -15216115 -14935012 -14667708 -14697257 -14910686
17874 -14910686 -14972404 -14860723 -14381164 -13871265 -13789818 -13659920 -13569738 -13706519 -14013100 -14010596
17864 -14010596 -14048957 -13991810 -13626671 -13327817 -13507452 -13688248 -13898575 -14089703 -13942458 -14041225
17854 -14041225 -13928183 -13715102 -13664450 -13462293 -13172296 -13251476 -13307948 -13489095 -13504247 -13572119
17844 -13572119 -13406635 -13220113 -12954579 -13065017 -13011662 -12963871 -12744014 -12829643 -12951881 -13048883
17834 -13048883 -13271971 -13424900 -13640405 -13484272 -13247140 -12992166 -12917244 -12784608 -12533784
17825 -12533784 -12410121 -12652238 -12715909 -12584381 -12308052 -12082327 -12286121 -12919696 -12991830 -12782375
17815 -12782375 -12564945 -12395241 -11949104 -11953297 -11880731 -11667830 -11699851 -11893472 -11776029 -11807779
17805 -11807779 -12050234 -12027393 -12130219 -12044278 -11796213 -11702268 -11729428 -11679670 -11704981 -11750026
17795 -11750026 -12004127 -11872598 -11709835 -11749041 -11872108 -12076934 -11801469 -11661067 -11710661 -11574240
17785 -11574240 -11638571 -11817639 -11690976 -11464806 -11302796 -11098270 -11033725 -11124857 -11166182 -11353401
17775 -11353401 -11316068 -11438391 -11376590 -10984952 -11063277 -11076108 -11190171 -11112038 -10918507 -10863419
17765 -10863419 -10773903 -10781660 -10910766 -10840700 -10791997 -10347916 -10080445 -10048834 -10124436 -10259742
17755 -10259742 -10527667 -10311374 -10168554 -10127671 -10157244 -9942447 -9713166 -9726048 -10121154 -10215032
17745 -10215032 -10250385 -10361077 -10375391 -10339599 -10425462 -10748311 -10624198 -10577154 -10711867 -10575686
17735 -10575686 -10774549 -10819940 -10596745 -10400603 -10085702 -9877683 -9823235 -9656274 -9648829 -9970995
17725 -9970995 -10139343 -10068924 -10205454 -10588762 -10711918 -10663551 -10514087 -10634474 -10556016 -10862864
17715 -10862864 -11171139 -11106197 -10888545 -10753606 -10765533 -10831196 -10841684 -10673246 -10517044 -10184984
17705 -10184984 -10016570 -10241096 -10068290 -10218171 -10385424 -10526282 -10689048 -10476057 -10424759
17696 -10424759 -10533824 -10376596 -9853632 -9638824 -9669650 -9716204 -9787527 -10048545 -9918007 -9827097
17686 -9827097 -9922710 -9618528 -9469795 -9713853 -9823403 -9925240 -9976673 -9911058 -9544317 -9607380
17676 -9607380 -9553128 -9472534 -9728076 -9660814 -9568216 -9926913 -9867055 -9829283 -9896571 -9713107 -9473295
17665 -9473295 -9487721 -9417197 -9391076 -9341994 -9416870 -9412936 -9393737 -9337157 -9297160 -9330544 -9088586
17654 -9088586 -9354045 -9600566 -9746110 -9756880 -9786628 -9489685 -9579377 -9494082 -9579453 -9248740
17644 -9248740 -9072299 -9140850 -9196903 -9192513 -9206105 -9170964 -8933610 -8920096 -9046868 -9247474 -9520276
17633 -9520276 -9409027 -9228380 -9210498 -9132901 -9010060 -9008133 -8836307 -9043487 -9132192 -9010463
17623 -9010463 -9089351 -9279727 -9244277 -9053203 -8660791 -8669434 -8787915 -8800440 -8562389 -8441653
17613 -8441653 -8624027 -8732693 -8748628 -8794698 -8899175 -9160512 -9170966 -9035436 -8981410 -9148303
17603 -9148303 -9033783 -9062987 -9027301 -9035134 -9187085 -8959438 -8720279 -8611958 -8629754 -8886260
17593 -8886260 -8892933 -8804875 -8787587 -8827924 -8737802 -8480884 -8418641 -8527834 -8680835 -8562122 -8596341
17582 -8596341 -8578296 -8194915 -7840976 -8041971 -8244375 -8331870 -8554976 -8633556 -8364618 -8159242
17572 -8159242 -7944554 -7964560 -8051365 -8050710 -8250182 -8340891 -8273243 -8152027 -8203574 -8297172 -8362157
17561 -8362157 -8355659 -8088754 -7820500 -7663165 -7800278 -7922511 -8057454 -7955092 -7875211 -7695377
17551 -7695377 -7628777 -7775766 -7897225 -7962963 -8034191 -7880040 -7710169 -7859931 -8135232 -8283247
17541 -8283247 -8170679 -8117318 -7947981 -7817232 -8051153 -8060120 -7827848 -7668073 -7424744 -7505717
17531 -7505717 -7915750 -7971181 -7816790 -7633079 -7505997 -7398305 -7489789 -7689988 -7489498 -7556692
17521 -7556692 -7651427 -7762086 -7637404 -7442519 -7198958 -7182045 -7459498 -7634631 -7881591 -8151362
17511 -8151362 -8054065 -7935480 -7857101 -7667727 -7623715 -7560155 -7440668 -7639694 -7637011 -7524143
17501 -7524143 -7753302 -7853651 -7842654 -7961320 -7680765 -7312846 -7236277 -7225885 -7341601 -7451765
17491 -7451765 -7320608 -7210565 -7108184 -7122153 -7120710 -7299917 -7339538 -7383956 -7461282 -7368337 -7310453
17480 -7310453 -7328073 -7093505 -7181554 -6968559 -6718988 -6716364 -6701276 -6871641 -6729557 -6694013
17470 -6694013 -6845298 -6875381 -7096753 -7113603 -6912816 -6776114 -7082183 -7242377 -7156486 -6951588
17460 -6951588 -7008368 -7025516 -7073589 -7091015 -7088238 -6784804 -6746696 -6569844 -6559673 -6732321 -6618833
17449 -6618833 -6306206 -6117789 -5907514 -5607114 -5556850 -5543463 -6387641 -7523369 -8004339 -7970314
17439 -7970314 -7951195 -7999672 -8045634 -7791670 -7575408 -7512770 -7460312 -7410565 -7366473 -7310399 -7331434
17428 -7331434 -7308367 -7423484 -7433721 -7328427 -7318821 -7372923 -7144531 -6964188 -6928495 -7026253 -6965085
17417 -6965085 -6796361 -6781417 -6914903 -6934795 -6868517 -6773393 -6426030 -6599383 -6645259 -6656833
17407 -6656833 -6680259 -6804191 -6912279 -6718865 -6588695 -6529052 -6558743 -6830063 -7052852 -6859171
17397 -6859171 -6778480 -6985544 -6939434 -6952710 -6956295 -6858944 -6625382 -6587180 -6672732 -6663704 -6842720
17386 -6842720 -7046917 -6932057 -6959730 -7015153 -7136362 -7289742 -7344209 -7318370 -7201304 -7110287
17376 -7110287 -7130106 -7230751 -7071276 -6921436 -6853567 -6560070 -6447331 -6363367 -6278164 -6485617
17366 -6485617 -6577652 -6592009 -6587929 -6721158 -6519983 -6446568 -6393134 -6334960 -6216744 -6552449 -6900207
17355 -6900207 -7151844 -6946065 -6523692 -6647322 -6604116 -6419132 -6425318 -6644158 -6609208 -6412727
17345 -6412727 -6306896 -6392828 -6091811 -6136432 -6383258 -6609774 -6377996 -6329100 -6411607 -6282155
17335 -6282155 -6274721 -6420959 -6348250 -6145402 -6229527 -6764225 -6833194 -6745857 -6582335 -6550814 -6304915
17324 -6304915 -6418105 -6648661 -6380155 -6066783 -6161805 -6214326 -6231059 -6295753 -6054023 -5707881
17314 -5707881 -5818362 -6205826 -6215097 -6154487 -6125947 -6363169 -6412237 -6273159 -6061386 -6237689
17304 -6237689 -6414405 -6519820 -6645697 -6717932 -6715822 -6453950 -6450798 -6544775 -6376048 -6333448 -6258564
17293 -6258564 -6152166 -6118304 -5801588 -5782529 -6246858 -6356670 -5971393 -5815538 -5894792 -5928327
17283 -5928327 -5964594 -5845141 -5976251 -6111622 -5915083 -5771973 -5948863 -5782165 -5586946 -5729701
17273 -5729701 -5860212 -5802124 -5947164 -6105707 -6372249 -6286364 -6048432 -6106150 -6282745 -6082735
17263 -6082735 -5710488 -5838742 -6011217 -6307674 -6466514 -6329230 -6316346 -6323384 -6054043 -5860883
17253 -5860883 -5999921 -6179557 -5849320 -5863670 -5829211 -5650547 -5710032 -5849572 -5872265 -5948923
17243 -5948923 -6002793 -5999816 -5989434 -5938032 -5910152 -5922206 -5922472 -5811057 -5617782 -5509300 -5305992
17232 -5305992 -5260179 -5630196 -6088936 -6194479 -5986583 -5727311 -5838925 -6168351 -6106028 -5648299
17222 -5648299 -5518917 -5675569 -5753426 -5696513 -5483162 -5565154 -5811524 -6017140 -6237532 -6369035
17212 -6369035 -6444091 -6051875 -5782065 -5679289 -5521434 -5547613 -5607810 -5570904 -5502795 -5420101
17202 -5420101 -5515281 -5481550 -5610881 -5551456 -5393390 -5359286 -5353635 -5396702 -5508777 -5267880 -5377416
17191 -5377416 -5558811 -5468244 -5425503 -5315572 -5162814 -5157669 -5330113 -5334115 -5342866 -5332379 -5583133
17180 -5583133 -5533687 -5603122 -5521427 -5448485 -5667726 -5625056 -5764770 -5900919 -5850777 -5641552
17170 -5641552 -5441078 -5268395 -5604045 -5701366 -5704160 -5756400 -5577108 -5841633 -5777578 -5756891
17160 -5756891 -5656295 -5762429 -5939095 -5651984 -5701473 -5543755 -5330272 -4994689 -5064344 -5636675
17150 -5636675 -5661434 -5560701 -5434935 -5394462 -5253329 -5060624 -5156607 -5260058 -5549763 -5636611
17140 -5636611 -5438958 -5321224 -5337006 -5454332 -5321783 -5153118 -5022332 -4839943 -4819038 -5228566
17130 -5228566 -5402400 -5237343 -5043610 -5029383 -4987849 -5243245 -5407827 -5245550 -5200801 -5138963
17120 -5138963 -5039668 -5313075 -5252290 -5139817 -5189698 -5322327 -5537162 -5528335 -5191266 -5100777
17110 -5100777 -5225017 -5131929 -4949320 -5488016 -5707109 -5618881 -5358728 -5190494 -5097160 -5173564
17100 -5173564 -5116466 -5308818 -5236562 -5072524 -4920121 -4941181 -5025523 -4848157 -4804487 -5115674
17090 -5115674 -5248105 -5013607 -5244944 -5607638 -5362787 -5088362 -5294696 -5157048 -4866209
17081 -4866209 -5088848 -5253955 -5179494 -5032002 -5001188 -4927095 -5071574 -4920482 -4632201 -4581355
17071 -4581355 -4711396 -4976910 -5228388 -5133083 -4949989 -4903919 -4907752 -4928826 -4924745 -4725924 -4341105
17060 -4341105 -4282920 -4499413 -4676748 -4929707 -4955629 -5193225 -5064271 -5036340 -4747163 -4784035
17050 -4784035 -5080306 -5177230 -4863268 -4913012 -4903837 -4856721 -4948558 -4782184 -4661805 -4507055
17040 -4507055 -4714621 -5000122 -5171709 -4796477 -4727447 -4769732 -4862830 -4804075 -4733673 -4794733
17030 -4794733 -5010937 -4995182 -4761951 -4787769 -4857114 -4945441 -4873594 -4757167 -4974873 -5003963
17020 -5003963 -5199730 -5441075 -5566793 -5325563 -5147949 -5170261 -4899600 -4626044 -4789970 -5073534
17010 -5073534 -4983849 -4714428 -4729194 -4481588 -4560800 -4749904 -4736892 -4700657 -4431275 -4562316
17000 -4562316 -4672899 -4768557 -4788220 -4818498 -4443074 -4388772 -4448775 -4693431 -4635869 -4653468 -4573898
16989 -4573898 -4438094 -4420830 -4499116 -4447053 -4575804 -4445666 -4305215 -4661904 -4684517 -4626326
16979 -4626326 -4604537 -4570878 -4510712 -4316125 -4229530 -4180722 -4588557 -4849532 -4878220 -4658507
16969 -4658507 -4441502 -4609701 -4522598 -4366512 -4581160 -4616477 -4579617 -4381973 -4292591 -4421804
16959 -4421804 -4346221 -4341945 -4385629 -4470420 -4500174 -4444976 -4590358 -4763683 -4757169 -4356512 -3895222
16948 -3895222 -3964552 -4219899 -4558467 -4835587 -4727973 -4667827 -4693075 -4685238 -4492454 -4414403
16938 -4414403 -4315218 -4243319 -4557306 -4634711 -4420172 -4398445 -4456458 -4209750 -4378968 -4597339
16928 -4597339 -4716477 -4756532 -4589046 -4325701 -4237306 -4524568 -4837344 -4778673 -4461285 -4511387
16918 -4511387 -4640174 -4507270 -4314028 -4229816 -4280443 -4438582 -4348442 -4449047 -4502943 -4432389
16908 -4432389 -4474333 -4365843 -4426373 -4584615 -4751839 -4526556 -4390454 -4410130 -4429989 -4467993
16898 -4467993 -4494104 -4438274 -4259949 -4008237 -3896562 -3860287 -4250480 -4414045 -4444384 -4368085
16888 -4368085 -4365755 -4448756 -4337176 -4178156 -4145663 -4342677 -4322542 -4162749 -4217445 -4271103 -4598370
16877 -4598370 -4685912 -4673036 -4670606 -4813554 -4824827 -4703033 -4638046 -4554638 -4398996 -4244709 -4390796
16866 -4390796 -4394598 -4316769 -4356364 -4310332 -4302281 -4202184 -4119617 -4297318 -4405451 -4267811 -4560430
16855 -4560430 -4739663 -4509236 -4385978 -4357744 -4407535 -4308021 -4169348 -4009039 -3984087 -3946125
16845 -3946125 -4025261 -4223697 -4304286 -4344390 -4366667 -4422753 -4532585 -4661913 -4590326 -4593352 -4442774
16834 -4442774 -4296400 -4338696 -4380316 -4076261 -3988967 -4376811 -4572955 -4152109 -3915388 -3880969
16824 -3880969 -4054946 -4125637 -4331624 -4547159 -4694190 -4586734 -4529091 -4540085 -4319573 -4322739
16814 -4322739 -3911512 -3726935 -3825431 -3862029 -3687794 -3769029 -3787453 -3869811 -3888472 -4264654
16804 -4264654 -4438510 -4319049 -4178911 -4024996 -3987330 -4173913 -3901872 -3909458 -4090664 -4121480
16794 -4121480 -3960570 -4006357 -3920378 -4139530 -4399020 -4391277 -4204394 -4162012 -4267277 -4449815
16784 -4449815 -4344388 -4230447 -4174931 -4207042 -4422771 -4292692 -4011622 -3959856 -4085347 -4238962
16774 -4238962 -4319883 -4199699 -3985204 -3977176 -3874873 -4232615 -4553665 -4546106 -4239561 -4030192
16764 -4030192 -3988514 -4229458 -4257339 -4113679 -3925993 -3900036 -4153410 -4217027 -4132856 -4033358
16754 -4033358 -4065002 -4154972 -4440671 -4388273 -4594555 -4562972 -4404198 -4337661 -3998172 -3717045
16744 -3717045 -3738056 -3649754 -3719510 -3896882 -3707642 -3594242 -3592900 -3811702 -3918438 -3883989
16734 -3883989 -3846505 -3867963 -3829502 -3838739 -4004738 -4171838 -4154952 -4250655 -4425276 -4271892 -3968137
16723 -3968137 -4089259 -4168368 -4288862 -4299048 -3848033 -3791443 -3822941 -3861891 -4100212 -4278141
16713 -4278141 -4450776 -4425235 -4132349 -3770374 -3904245 -4228990 -4346265 -4238936 -4070451 -3915658
16703 -3915658 -3949624 -3900560 -3829075 -3835092 -3755930 -3776324 -3845919 -3850268 -3690544 -3701503 -3704855 -3348787
16691 -3348787 -3313699 -3441878 -3529523 -3601714 -3815927 -3882800 -3968104 -3956187 -4044251 -4135621 -3840138
16680 -3840138 -3643478 -3533739 -3803179 -4150582 -3869554 -3746092 -3906650 -3943499 -4200398 -4031819
16670 -4031819 -3928981 -4084035 -3918954 -3526251 -3658690 -3830895 -3547071 -3553920 -3528184 -3646016
16660 -3646016 -3430705 -3404200 -3492546 -3615407 -3824269 -4009475 -4251402 -4312201 -4318364 -4346732
16650 -4346732 -4157518 -4253767 -4160481 -4140657 -4333731 -4375082 -4052180 -3755316 -3695721 -3759677
16640 -3759677 -3815921 -3893333 -3705985 -3481232 -3381771 -3326487 -3744768 -4080170 -3978957 -3782481
16630 -3782481 -3700062 -3656515 -3678346 -3568789 -3393062 -3309982 -3288403 -3471732 -3705777 -3694084
16620 -3694084 -3752169 -3933776 -3850815 -3691046 -3750569 -3817679 -3917103 -4086986 -3924080 -3868143
16610 -3868143 -3563153 -3502235 -3466644 -3486177 -3664929 -3679171 -3281210 -3405838 -3556755 -3589600
16600 -3589600 -3603172 -3708473 -3507064 -3675586 -3520334 -3481017 -3634534 -3610424 -3440181 -3386960
16590 -3386960 -3304792 -3473185 -3713643 -3623722 -3570744 -4021518 -3956746 -3804353 -3832480 -3509259
16580 -3509259 -3396125 -3561978 -3776507 -3712303 -3388792 -3469843 -3454058 -3749186 -3779998 -3705431
16570 -3705431 -3584802 -3637353 -3638786 -3673556 -3488712 -3425445 -3614765 -3673454 -3771410 -4006952 -4030204
16559 -4030204 -3714251 -3501054 -3069995 -3122832 -3494794 -3592086 -3502042 -3352122 -3521837 -3744579
16549 -3744579 -3808678 -3826424 -3627874 -3665140 -3942395 -3943762 -3591362 -3544132 -3386849 -3117768
16539 -3117768 -3041627 -3058651 -3005311 -3250691 -3386297 -3347054 -3111247 -3022949 -3094989 -3010664 -3049396
16528 -3049396 -3138384 -3258394 -3559311 -4127361 -3958841 -3623176 -3661906 -3574188 -3407251 -3236944
16518 -3236944 -3265053 -3248452 -3238986 -3152957 -3292082 -3407154 -3367588 -3353092 -3232211 -3325014 -3277220
16507 -3277220 -3432777 -3352073 -3538935 -3590034 -3518685 -3501590 -3490327 -3249465 -3240306 -3360880 -3468097
16496 -3468097 -3249679 -3250112 -3370662 -3492738 -3648488 -3796839 -3853595 -3788992 -3720210 -3733149 -3589787
16485 -3589787 -3390625 -3391306 -3231885 -3312900 -3151099 -3068540 -3176670 -3502548 -3843655 -3928783
16475 -3928783 -3690238 -3637688 -3642204 -3514265 -3640261 -3397044 -3208462 -3261877 -3394520 -3550484
16465 -3550484 -3790245 -3600680 -3239355 -2984253 -3083271 -3045282 -2948025 -2971543 -3080790 -3212886
16455 -3212886 -3059630 -3025591 -3061164 -3216302 -3467390 -3499239 -3461957 -3146810 -2847820 -2744249
16445 -2744249 -2627672 -2836534 -3142758 -3224177 -3063836 -2869904 -2808754 -2980617 -3003570 -2951660
16435 -2951660 -3047737 -3218300 -3382147 -3520791 -3181117 -2980847 -3056264 -3073818 -3082167 -3155643
16425 -3155643 -3255174 -3280093 -3239631 -3136654 -3058567 -3253869 -3274421 -3315520 -3386650 -3391163 -3142693
16414 -3142693 -3194249 -3355959 -3393876 -3005897 -2852621 -2931899 -3002638 -2972354 -2954036 -3020620 -3212421
16403 -3212421 -3315922 -3248400 -3131142 -3230348 -3387528 -3339141 -3283650 -3272464 -3058380 -2876457
16393 -2876457 -2852095 -2663372 -2690013 -2887837 -3064845 -3116542 -3252846 -3534484 -3422224 -3015075
16383 -3015075 -3021317 -2929618 -3195296 -3617922 -3645454 -3542564 -3227404 -3375992 -3336153 -3356662
16373 -3356662 -3415349 -3193295 -3221469 -3369576 -3437489 -3378971 -3053589 -3010397 -2992401 -2905016 -2900180
16362 -2900180 -2808888 -2871746 -2692862 -2835171 -2764869 -2915814 -2908634 -2920187 -2971510 -2769942 -2829866
16351 -2829866 -2863009 -2803082 -2936868 -3006142 -3333696 -3336659 -3450391 -3372889 -3233318 -3240898 -3386571
16340 -3386571 -3647261 -3830290 -3763390 -3583515 -3794818 -3888354 -3880030 -3740233 -3584516 -3199312
16330 -3199312 -2825909 -2915029 -3152944 -3209594 -3275797 -3085157 -3168371 -3437370 -3506495 -3442266
16320 -3442266 -3253144 -3162193 -2939996 -3196636 -3393594 -3442844 -3151491 -2843371 -3082760 -3441918
16310 -3441918 -3398717 -3083694 -2939075 -2968611 -3147093 -3043977 -2830033 -2927253 -3101668 -3122780
16300 -3122780 -3239389 -3200661 -3218759 -3113694 -3009791 -3072362 -3118329 -2823009 -2750222 -2981971
16290 -2981971 -2894423 -2791373 -2744358 -3006177 -2832426 -2898998 -3028318 -3209988 -3076418 -2944190
16280 -2944190 -2908381 -3034672 -3212521 -3185205 -3251303 -3040874 -2989731 -3212809 -3182697 -3351358
16270 -3351358 -3343969 -2928557 -2645148 -2389444 -2318734 -2362205 -2675369 -2702245 -2318072 -2339152
16260 -2339152 -2572853 -2606104 -2569660 -2893198 -3149946 -3118548 -3227084 -3207129 -2811396 -2595839
16250 -2595839 -2835832 -3029411 -3143249 -3205512 -3286551 -3361330 -3256946 -3103057 -2988252 -3032678
16240 -3032678 -2758594 -2410521 -2309809 -2303178 -2537445 -2425507 -2375929 -2417248 -2481379 -2731283
16230 -2731283 -2866591 -2808549 -2786046 -2622385 -2681560 -2664254 -2682455 -2641049 -2850621 -2710688
16220 -2710688 -2712550 -2748996 -2528798 -2466777 -2896807 -3336903 -2992387 -2952344 -3140068 -2970219
16210 -2970219 -3026945 -3137745 -3268871 -3266578 -2990377 -2774285 -3044130 -3170605 -3165183 -3078788
16200 -3078788 -2980457 -2991998 -3094985 -3134164 -3182062 -3042448 -3211869 -3059542 -3005836 -3146728
16190 -3146728 -3191315 -3193417 -3073728 -3067260 -3058216 -2926628 -3087846 -3302744 -3222194 -2873570 -2800471
16179 -2800471 -2840069 -2922114 -2977120 -3102995 -3130828 -2996233 -3006447 -3091159 -3146300 -2926508 -2959764
16168 -2959764 -3075609 -2842752 -2551390 -2613397 -2721652 -2619468 -2832972 -2866534 -2858131 -3134051
16158 -3134051 -3128548 -2934719 -2774712 -2769516 -2755076 -2784586 -2658868 -2745829 -2750113 -2714243 -2760205
16147 -2760205 -2886766 -2775081 -2330098 -2285772 -2534481 -2720336 -2679827 -2643385 -2726371 -2771253
16137 -2771253 -2904454 -2986136 -3027412 -3032342 -3014136 -2687131 -2469797 -2377008 -2688131 -2821902
16127 -2821902 -2418848 -2241772 -2529127 -2692287 -2793202 -2703086 -2608096 -2480660 -2614721 -2584987
16117 -2584987 -2551911 -2624209 -2538899 -2580268 -2861439 -2965915 -2972574 -2941210 -2810811 -2696786 -2752768
16106 -2752768 -2699519 -2856668 -3100326 -2950032 -2748956 -2863956 -3021368 -3095904 -3032051 -2891778
16096 -2891778 -2847934 -3069987 -3005701 -2751614 -2687019 -2630444 -2460764 -2463569 -2396578 -2312027 -2368228
16085 -2368228 -2535222 -2560625 -2358309 -2217750 -2164124 -2421828 -2671370 -3006669 -2950076 -3061929
16075 -3061929 -3248491 -3174362 -2914595 -2912517 -2960177 -2927198 -3037625 -3142301 -3084761 -2909025
16065 -2909025 -3001643 -2990690 -3012853 -3049680 -2785049 -2649468 -2660191 -2687865 -2733627 -2707036 -2624414
16054 -2624414 -2436520 -2556005 -2606881 -2669231 -2846998 -2981661 -2714007 -2477434 -2599570 -2975977
16044 -2975977 -3169597 -3355383 -3043837 -2888584 -2699810 -2663528 -2959838 -2762374 -2856915 -3081848
16034 -3081848 -2659566 -2384145 -2543004 -2645219 -2710801 -2663633 -2586298 -2660676 -2842397 -2924962
16024 -2924962 -2864459 -3055560 -3029964 -2729882 -2672117 -2467841 -2584094 -2800916 -3026278 -3003964
16014 -3003964 -2858046 -2958053 -2983745 -2841311 -2811738 -2925751 -2761481 -2616312 -2540387 -2404749
16004 -2404749 -2494508 -2452942 -2549268 -2721972 -2655821 -2413682 -2512431 -2579939 -2566692 -2538008 -2484082
15993 -2484082 -2522888 -2725508 -2726326 -2361705 -2268746 -2370479 -2598351 -2399334 -2350966 -2464242
15983 -2464242 -2391063 -2431279 -2430441 -2546436 -2683832 -2656345 -2530285 -2375677 -2454170 -2516365 -2389024
15972 -2389024 -2289760 -2100918 -2273896 -2344321 -2215103 -2299059 -2453812 -2787283 -2824244 -2542241
15962 -2542241 -2340736 -2554470 -2370178 -2234691 -2329616 -2448021 -2545992 -2714460 -2504824 -2291362
15952 -2291362 -2553155 -2727438 -2532984 -2187829 -2158958 -2151914 -2244287 -2406797 -2401820 -2668018
15942 -2668018 -2598586 -2475453 -2493629 -2542886 -2738024 -2798988 -2895512 -2956896 -2745629 -2591798
15932 -2591798 -2777009 -2990742 -3130501 -2956554 -2568426 -2547535 -2517592 -2468096 -2557158 -2600427
15922 -2600427 -2895208 -3018460 -2777543 -2525161 -2418589 -2382007 -2274412 -2371779 -2424200 -2769318
15912 -2769318 -3043334 -2910878 -2746108 -2814757 -2736522 -2582596 -2732352 -2772685 -2741570 -2654344
15902 -2654344 -2824367 -2805322 -2562298 -2143496 -1976781 -2082368 -1989321 -2098532 -2362359 -2601366
15892 -2601366 -2841281 -2907861 -2673794 -2712175 -2593526 -2763626 -2842034 -2932961 -2759667 -2642370
15882 -2642370 -2498928 -2725886 -2767125 -2752174 -2424478 -1975138 -2070315 -2373220 -2498921 -2566911
15872 -2566911 -2676527 -2885853 -2700337 -2485287 -2471269 -2358953 -1995315 -1880732 -2053429 -2407068
15862 -2407068 -2418158 -2324618 -2340404 -2451468 -2448500 -2669332 -2682900 -2726082 -2914856 -2900915 -2745963
15851 -2745963 -2505528 -2588752 -2421426 -2296696 -2153036 -2186714 -2228095 -2082952 -2140083 -2369447
15841 -2369447 -2142696 -1994900 -1968005 -1975425 -2262431 -2504379 -2359513 -2193164 -2256092 -2159953
15831 -2159953 -2233933 -2162102 -2377741 -2474260 -2567820 -2641255 -2590449 -2770722 -2843368 -2857755 -2620765
15820 -2620765 -2455414 -2688364 -2863634 -2671320 -2717276 -2686018 -2422707 -2418761 -2510011 -2478620
15810 -2478620 -2307652 -2195510 -2524466 -2828086 -2998368 -2970004 -2600456 -2350865 -2358319 -2391751
15800 -2391751 -2304381 -2070707 -1963560 -2011949 -2254406 -2069163 -1932037 -2236998 -2737586 -2803761
15790 -2803761 -2659252 -2425817 -2246958 -2398093 -2318407 -2360983 -2549426 -2558214 -2416311 -2540345
15780 -2540345 -2593930 -2606347 -2718942 -2642907 -2694106 -2648417 -2496687 -2395096 -2468190 -2442412 -2252995
15769 -2252995 -2238225 -1981775 -2238662 -2674694 -2727488 -2846870 -2769819 -2700567 -2474552 -2630527
15759 -2630527 -2704188 -2536752 -2600082 -2614857 -2780273 -2917334 -2665739 -2547091 -2903159 -3194027
15749 -3194027 -3213317 -2769893 -2572074 -2737678 -2582106 -2560617 -2614553 -2880416 -2910590 -2731699
15739 -2731699 -2613864 -2627240 -2731054 -2654524 -2378982 -2242350 -2563627 -2428266 -1959804 -1973878
15729 -1973878 -2168103 -2285267 -2419763 -2458099 -2402029 -2560145 -2671821 -2540668 -2115816 -2128929
15719 -2128929 -2272355 -2190881 -2241378 -2068077 -1935015 -2109141 -2243074 -2210377 -2224539 -2416115
15709 -2416115 -2809788 -2739095 -2665681 -2755857 -2906761 -2934133 -2545655 -2535308 -2280604 -2167946
15699 -2167946 -2277759 -2481061 -2590730 -2794506 -2445929 -2484119 -2782228 -2431766 -2216697 -2154579
15689 -2154579 -2299699 -2523976 -2493913 -2370586 -2566339 -2407624 -2350735 -2484888 -2378738 -2422608
15679 -2422608 -2295576 -2166700 -2401698 -2674339 -2442288 -2173702 -2026685 -2193544 -2425099
15670 -2425099 -2614338 -2550302 -2263664 -2311471 -2488444 -2538888 -2295664 -2396861 -2078753 -1802053
15660 -1802053 -1939592 -1996023 -2009522 -1949469 -2113919 -2323410 -2314243 -2288134 -2503326 -2707494
15650 -2707494 -2408552 -2124763 -2237588 -2183165 -2178914 -2176591 -2176178 -2289651 -2238384 -2439959 -2507189
15639 -2507189 -2587897 -2432140 -2421730 -2516544 -2493207 -2576086 -2500396 -2331264 -2357276 -2447782 -2541901
15628 -2541901 -2581839 -2633562 -2629973 -2413011 -2199235 -1899480 -1934178 -2175362 -2298008 -2149064
15618 -2149064 -2175323 -2572324 -2662430 -2618185 -2820945 -2985523 -2654892 -2642369 -2673532 -2757490
15608 -2757490 -2758891 -2891366 -2758711 -2361837 -2183468 -2190153 -2393923 -2562875 -2659101 -2544183
15598 -2544183 -2483387 -2152288 -1956203 -1970193 -2239283 -2364032 -2407480 -2317173 -2107823 -2097824
15588 -2097824 -2589550 -2486485 -2275908 -2049829 -2060310 -2425679 -2602597 -2429729 -2113657 -2074078
15578 -2074078 -2227145 -2289360 -2424312 -2157463 -2052397 -2308220 -2456907 -2358675 -2325817 -2292882
15568 -2292882 -2322815 -2432963 -2664597 -2662673 -2503463 -2311850 -2386750 -2667910 -2813580 -3043427
15558 -3043427 -2907971 -2703818 -2542094 -2504201 -2518312 -2590045 -2405110 -2317426 -2185557 -2223302
15548 -2223302 -2540511 -2221230 -2196806 -2380363 -2181949 -2114525 -2404066 -2745693 -2822367 -2726471
15538 -2726471 -2429176 -2317483 -2283628 -2341698 -2333696 -2437588 -2601272 -2543202 -2422636 -2498569
15528 -2498569 -2435905 -2378742 -2414459 -2492060 -2401723 -2382304 -2260837 -2282135 -2352646 -2322285 -2215199
15517 -2215199 -2274108 -2365811 -2169593 -1936224 -1889731 -1929202 -1956308 -1893075 -1984275 -2025288 -1896465
15506 -1896465 -2173401 -2020290 -1777469 -1877239 -2153102 -2092761 -2147301 -2261318 -2124068 -1826990
15496 -1826990 -1849561 -2105622 -1935979 -2034578 -2160776 -2251240 -2328311 -2152917 -2058019 -2200256
15486 -2200256 -2212256 -2027122 -1942614 -2191623 -2470760 -2541254 -2453041 -2449272 -2495561 -2573358 -2393390
15475 -2393390 -2072960 -2133742 -2290209 -2165455 -2234158 -2187091 -2016848 -2125792 -2080075 -2054986
15465 -2054986 -2058549 -2448528 -2719395 -2724090 -2421137 -2344250 -2198769 -2232420 -2240306 -2567158 -2423470
15454 -2423470 -2489463 -2802461 -2451375 -2198147 -2124509 -2097788 -2205845 -2140133 -2115726 -2281600
15444 -2281600 -2148653 -1931177 -1821998 -1894428 -1666013 -1752749 -1718074 -1787100 -2081251 -2476330
15434 -2476330 -2284471 -1990319 -2042032 -2272573 -2231529 -2088473 -2092458 -2232653 -2194715 -2072900
15424 -2072900 -2261352 -2222154 -2123483 -2203687 -2239099 -2381186 -2295092 -2234173 -2158288 -2140327 -2135970
15413 -2135970 -2083527 -2117257 -2176213 -2136279 -1965700 -1970772 -2205845 -2329571 -2064270 -2030402 -2417226
15402 -2417226 -2522974 -2398152 -2056261 -1983013 -2199805 -2284641 -2231409 -2397058 -2120890 -1904732
15392 -1904732 -1543697 -1340513 -1488986 -1803608 -1915823 -2138237 -1949168 -1790821 -2074514
15383 -2074514 -2325091 -2406269 -2361624 -2251546 -2128355 -1966823 -1792075 -1889464 -1989388 -1988398 -2036671
15372 -2036671 -1965643 -1838301 -1758112 -1940908 -2002062 -2145856 -2291062 -2160931 -1891862 -1935532
15362 -1935532 -1974960 -2003600 -2039614 -2129108 -2253802 -2340001 -2206070 -1964100 -2219784 -2524678
15352 -2524678 -2484608 -2343178 -2298641 -2235690 -2194681 -2284028 -2392116 -2201121 -2173046 -2015975
15342 -2015975 -1976885 -1818888 -2066229 -2366207 -2419943 -2675874 -2547368 -2177868 -2056186 -2095037
15332 -2095037 -2255947 -2300430 -2277986 -2186668 -2118296 -1965414 -1742533 -1614019 -1722564 -1685364
15322 -1685364 -2027478 -2199102 -2197429 -2326863 -2375392 -2386426 -2249337 -2132004 -1769974 -1424545
15312 -1424545 -1851462 -2332985 -2521270 -2533610 -2587734 -2679159 -2686140 -2491127 -2429674 -2318726
15302 -2318726 -2183948 -2220787 -2067499 -1866205 -1974010 -1975633 -2266110 -2341567 -2237811 -2329144
15292 -2329144 -2369869 -2203056 -2093300 -1997970 -2093840 -2351294 -2585451 -2335597 -2324486 -2406032
15282 -2406032 -2305462 -2505490 -2387043 -2106627 -2131833 -1864388 -1938755 -1765744 -1918872 -2314508
15272 -2314508 -2374089 -2387432 -2325777 -2184647 -2061664 -1901636 -2028260 -2013707 -2038868 -1563934
15262 -1563934 -1346178 -1615040 -1806644 -1575259 -1659398 -1589857 -1851121 -2305593 -2529233 -2516086
15252 -2516086 -2026752 -1809125 -1896846 -2277407 -2318152 -2286088 -2184235 -2001028 -1797544 -1506279
15242 -1506279 -1564109 -1940028 -2293245 -2155195 -1852565 -1672722 -1719511 -1582678 -1401765 -1473822
15232 -1473822 -1650637 -1626305 -1622313 -1654050 -1751169 -2045912 -2220847 -2184088 -2310156 -2332329 -2156778
15221 -2156778 -2144083 -2152576 -2107762 -1985296 -2065169 -2123315 -2099506 -2124777 -2110640 -2037786 -2264917
15210 -2264917 -2319095 -2321854 -2251334 -2147751 -1860378 -1993428 -1864853 -1970528 -1789220 -1659607
15200 -1659607 -1745803 -1918028 -2064033 -2196408 -2023486 -1873949 -1950416 -2092738 -2215401 -2088045
15190 -2088045 -2020736 -1958492 -2099280 -2223283 -2553803 -2594167 -2545346 -2371092 -2210167 -2094330
15180 -2094330 -2149323 -2001170 -2074314 -1997343 -2021316 -2090704 -2198449 -2409037 -2429483 -2208548
15170 -2208548 -2036598 -1849450 -1984989 -2361599 -2186572 -2313333 -2314745 -2035542 -1784345 -1584155
15160 -1584155 -1390364 -1482786 -1699602 -1927624 -1953708 -1751198 -1782460 -1899941 -1929358 -2048061
15150 -2048061 -2181065 -2066309 -1870110 -1853016 -2197881 -1982722 -1891836 -1638930 -1588866 -1673900
15140 -1673900 -1823473 -1856863 -1985566 -2086871 -2272908 -2600555 -2242600 -2057529 -1993808 -2028542
15130 -2028542 -1959398 -1839731 -1828512 -2119996 -2407774 -2262581 -2078450 -2027907 -2085142 -2101101
15120 -2101101 -1895756 -1699913 -1687201 -1846786 -1612268 -1458776 -1699548 -2137038 -2207810 -2291654
15110 -2291654 -2232977 -2305377 -2151301 -2026116 -2086873 -2225405 -2358879 -2478731 -2224900 -2121548
15100 -2121548 -1907707 -1892439 -1887491 -1847648 -1743275 -1775559 -1898115 -1841348 -1734003 -1601581
15090 -1601581 -1570626 -1484678 -1476691 -1515719 -1636388 -1699114 -1889186 -2244863 -2152203 -1765396 -1526525
15079 -1526525 -1727514 -1891613 -1779645 -1897147 -1900918 -2086148 -2107359 -1969197 -1747404 -1711441
15069 -1711441 -2008143 -2197140 -2036245 -2284554 -2305728 -2071630 -2276496 -2612199 -2332152 -2021476
15059 -2021476 -1838836 -1924500 -2063893 -2129698 -2220672 -1772094 -1733748 -1700447 -1828880 -1920725
15049 -1920725 -1805853 -1911629 -2093623 -2003996 -1924741 -1830300 -1835404 -2096491 -2021930 -1906549
15039 -1906549 -1726245 -1709880 -1737498 -1919126 -2104371 -2324229 -2029504 -1419990 -1614670 -1799454
15029 -1799454 -2067698 -2227727 -2166589 -2072743 -1887352 -1972387 -2093143 -1929295 -1932137 -2148471
15019 -2148471 -2056474 -1792776 -1722793 -1722958 -1603983 -1590673 -1632962 -1580906 -1567624 -1686196 -1805134
15008 -1805134 -2006538 -1989242 -1641018 -1622309 -1523190 -1644703 -1949330 -2117585 -2052032 -1785439
14998 -1785439 -1620379 -1598623 -1804934 -1580101 -1717775 -1877520 -2105556 -2160222 -2070738 -1873749
14988 -1873749 -1617505 -1783208 -2088190 -2147963 -1814878 -1616162 -1827993 -2067272 -2035548 -2065058
14978 -2065058 -2103596 -2092428 -2077088 -2011871 -2123367 -2103320 -2389213 -2323728 -2187821 -1884088
14968 -1884088 -1840391 -2029992 -2019704 -1845926 -1854898 -1823421 -1840751 -1723976 -1755416 -1733416 -1636433
14957 -1636433 -1656734 -1719507 -1885783 -2049993 -2075092 -1983658 -1933198 -1851718 -1759002 -1618221 -1614572
14946 -1614572 -1861332 -2035318 -2030270 -2111607 -2226468 -2282863 -2306029 -1945471 -1760424 -1818669
14936 -1818669 -1946172 -1987691 -2026658 -1764831 -1665396 -1821192 -1871642 -1945216 -1888225 -1758339
14926 -1758339 -1709724 -1699309 -1849513 -1995664 -1944859 -1884297 -1999666 -2373665 -2313362 -2184306
14916 -2184306 -1997687 -1702888 -1637646 -1840001 -1793195 -1687616 -1910866 -1840817 -1728614 -1723531
14906 -1723531 -1660412 -1796373 -1886169 -2128663 -2169514 -1770694 -1743047 -1801192 -1740206 -1746286 -1613987
14895 -1613987 -1586476 -1937500 -2214019 -2127257 -1995071 -1939477 -1945877 -1966545 -1693271 -1654288 -1606477
14884 -1606477 -1785908 -1931665 -1952094 -1953437 -1923541 -1742091 -1846896 -2158237 -1988669 -1630890
14874 -1630890 -1658740 -1807306 -1891928 -1907100 -1919504 -1639760 -1497040 -1279413 -1324095 -1855897
14864 -1855897 -2125932 -1809585 -1471190 -1678369 -1912586 -1811054 -1778617 -1795499 -1857107 -1794425
14854 -1794425 -1866707 -1965437 -1896432 -1753449 -1604912 -1870282 -1926989 -1859339 -1693682 -1826828
14844 -1826828 -1785380 -1831978 -1679324 -1498745 -1395813 -1268190 -1299375 -1435134 -1565757 -1764654
14834 -1764654 -1972070 -1990868 -2003991 -2072540 -2306536 -2276504 -2143469 -2006223 -1816301 -1911685
14824 -1911685 -1871525 -1833571 -1853950 -2238166 -2352205 -2024956 -2003633 -2123552 -2102762 -1971008
14814 -1971008 -2188134 -2147597 -1920204 -1605201 -1550655 -1229810 -1046471 -1226803 -1513173 -1721567
14804 -1721567 -2091042 -2093232 -1820972 -1879397 -1758430 -1768234 -1957689 -2110030 -1900790 -1756455
14794 -1756455 -1702241 -1580409 -1714069 -1973794 -1857571 -1713620 -1623218 -1634825 -1688746 -1780449
14784 -1780449 -2160166 -2069955 -1810546 -1563918 -1455932 -1716670 -1849112 -1951131 -2008712 -1894999
14774 -1894999 -1894160 -2073482 -2008757 -1768344 -1606020 -1553295 -1627481 -1677917 -1760574 -2019909 -2021421
14763 -2021421 -1995696 -2182809 -1894417 -1521281 -1434262 -1631153 -1552656 -1566032 -1804496 -2092256
14753 -2092256 -2235123 -2166147 -1800253 -1671592 -1731798 -1819741 -1752957 -1630375 -1637103 -1841776
14743 -1841776 -1772653 -1846065 -1969710 -1866266 -1771246 -1818045 -1846316 -1861686 -1755155 -1542569
14733 -1542569 -1577056 -1696582 -1823285 -1851417 -1707078 -1948091 -2098230 -2264185 -2235581 -1990003
14723 -1990003 -1819294 -1588273 -1517232 -1499120 -1673577 -1884567 -1734861 -1622730 -1692588 -1779290
14713 -1779290 -1838703 -2012806 -2039791 -1991486 -2021041 -1903622 -1588928 -1621079 -1837085 -1766398
14703 -1766398 -1606944 -1608317 -1661103 -1682652 -1701252 -1428529 -1456732 -1836092 -1965510 -1683463
14693 -1683463 -1572046 -1404220 -1320996 -1236680 -1387475 -1510621 -1734924 -1808098 -1666601 -1738919
14683 -1738919 -1473887 -1271156 -1488670 -1546798 -1478723 -1399540 -1440983 -1647194 -1623857 -1595074
14673 -1595074 -1619902 -1608762 -1686859 -1862025 -1985982 -1872645 -1657125 -1634034 -1433911 -1462699
14663 -1462699 -1458529 -1532185 -1457455 -1416984 -1556361 -1771371 -1785623 -1895611 -1790590 -1881039 -2182327
14652 -2182327 -1967843 -1731447 -1799366 -1645758 -1793259 -2085760 -1943824 -1568401 -1393517 -1330849
14642 -1330849 -1444504 -1448960 -1260486 -1263912 -1297945 -1423078 -1533944 -1545327 -1645495 -1840436
14632 -1840436 -1786434 -1591043 -1660876 -1909560 -2019781 -2195502 -2206702 -2039082 -1970395 -1768598
14622 -1768598 -1627629 -1511665 -1410592 -1347914 -1353418 -1408325 -1275129 -1338206 -1411797 -1185213
14612 -1185213 -1079219 -1249441 -1523590 -1570171 -1417233 -1251587 -1291965 -1602947 -1496006 -1493665
14602 -1493665 -1538103 -1289657 -1311368 -1416798 -1440939 -1354075 -1198512 -1354099 -1454801 -1502929
14592 -1502929 -1612395 -1737486 -1772281 -1497334 -1510178 -1565984 -1361574 -1317264 -1230203 -1405343
14582 -1405343 -1370096 -1346034 -1396606 -1387625 -1356465 -1421555 -1649597 -1814652 -1861644 -1873671 -1753371
14571 -1753371 -1476254 -1502519 -1505299 -1487316 -1362694 -1350091 -1369936 -1441093 -1511326 -1348040 -1480264
14560 -1480264 -1647874 -1661567 -1768607 -1806186 -1857099 -1873863 -1873574 -1819835 -1687386 -1852030 -1767565
14549 -1767565 -1870988 -1882190 -1982036 -2126814 -1955695 -2006119 -1949945 -1659555 -1569668 -1792016
14539 -1792016 -2107117 -2214164 -2250541 -2165520 -1841056 -1745318 -1905241 -1944761 -1823242 -1832397
14529 -1832397 -2033140 -1960519 -1894568 -1926238 -1929460 -1859313 -1723222 -1776067 -1725095 -1835763 -1914569
14518 -1914569 -1700108 -1447620 -1278812 -1402322 -1709473 -1899773 -2033476 -2249963 -1934735
14509 -1934735 -2022271 -1919362 -2036192 -1999452 -1831912 -1760047 -1455469 -1285487 -1361427 -1588380
14499 -1588380 -1538084 -1251039 -1221943 -1536150 -1572037 -1348306 -1608026 -1768865 -1655502 -1515076
14489 -1515076 -1510333 -1635051 -1830876 -1963575 -2248655 -2077463 -1818993 -1798037 -1650927 -1441633
14479 -1441633 -1491278 -1732426 -1867837 -1782358 -1969478 -2102029 -2036906 -2168356 -1912821 -1743806
14469 -1743806 -1741854 -1590963 -1734675 -1659119 -1574812 -1369471 -1266708 -1230417 -1458221 -1440995
14459 -1440995 -1676694 -1674190 -1446705 -1536552 -1922047 -2076071 -1968715 -1712133 -1453995 -1534547
14449 -1534547 -1615270 -1488651 -1462373 -1514711 -1391221 -1403820 -1659419 -1633092 -1712538 -1746153 -1918479
14438 -1918479 -1796448 -1644181 -1700123 -1728301 -1519625 -1586518 -1678247 -1713223 -1895706 -2142380
14428 -2142380 -2316432 -2307394 -2028394 -1793635 -1814626 -2128681 -1790470 -1550528 -1614427 -1704378
14418 -1704378 -1644518 -1527424 -1401072 -1530137 -1807647 -1861901 -1958408 -1626823 -1740474 -1784183
14408 -1784183 -1703791 -1711005 -1508968 -1887323 -2139380 -1958254 -1676378 -1790536 -1843273 -1586537
14398 -1586537 -1651017 -1806417 -1825694 -1749425 -1713127 -1803300 -1843599 -1715104 -1515737 -1535485 -1524488
14387 -1524488 -1586805 -1587714 -1804331 -1788284 -1882798 -1806188 -1934818 -1801666 -1631423 -1491911 -1243703
14376 -1243703 -1274027 -1449487 -1405620 -1442694 -1605902 -1614802 -1859690 -1785672 -1315531 -1220933 -1437597
14365 -1437597 -1636079 -1763371 -1878755 -1944595 -1776897 -1652792 -1551425 -1609418 -1490930 -1576523
14355 -1576523 -1981957 -1927356 -1535649 -1608296 -1363243 -1410345 -1344840 -1527075 -1655882 -1551823
14345 -1551823 -1694401 -1985438 -2022482 -1922832 -1869408 -1837237 -1622169 -1557186 -1465828 -1392165 -1308036
14334 -1308036 -1328875 -1612591 -1592156 -1388605 -1137278 -1328343 -1675330 -1623942 -1540675 -1365805
14324 -1365805 -1443923 -1695531 -1688489 -1717170 -1873029 -1721072 -1592524 -1501980 -1273065 -1438198
14314 -1438198 -1621389 -1640888 -1537163 -1499705 -1647337 -1621390 -1651870 -1765224 -1819097 -1665738
14304 -1665738 -1732737 -1674527 -1644422 -1643270 -1819448 -1902263 -1847223 -1974376 -2060935 -1883103 -1441690
14293 -1441690 -1455168 -1525641 -1671715 -1646441 -1555911 -1621176 -1515386 -1698406 -1608509 -1585558 -1239827
14282 -1239827 -1238355 -1490917 -1566912 -1517437 -1505177 -1525848 -1649482 -1684055 -1530876 -1367531 -1491860
14271 -1491860 -1478491 -1279126 -1449792 -1479613 -1512457 -1395575 -1250547 -1159312 -1508769 -1494816
14261 -1494816 -1723969 -1848470 -1873797 -1738030 -1596623 -1755035 -1728316 -1485351 -1511306 -1617390
14251 -1617390 -1694056 -1987998 -2193425 -2060877 -1637809 -1209051 -1128895 -1610923 -1998690 -1957121
14241 -1957121 -1847492 -1636317 -1510375 -1660354 -1742300 -1608010 -1485785 -1400402 -1450721 -1511198
14231 -1511198 -1538500 -1679485 -1689368 -1698466 -1658512 -1759007 -1626447 -1445771 -1295320 -1139629
14221 -1139629 -1239735 -1251371 -1435929 -1339645 -946539 -1036042 -1099558 -993763 -886446 -905387
14211 -905387 -1306929 -1422716 -1284634 -1214750 -1065970 -1135404 -1365388 -1402853 -1562016 -1466779
14201 -1466779 -1219138 -976581 -998900 -1039414 -1348631 -1481403 -1401283 -1559337 -1659890 -1839383
14191 -1839383 -1977836 -1785707 -1454218 -1648871 -1792256 -1773385 -1737168 -1740001 -1869870 -1781845
14181 -1781845 -1609766 -1709055 -1791272 -1779022 -1677284 -1606831 -1563704 -1319928 -1275643 -1442640
14171 -1442640 -1486632 -1486316 -1278038 -1097853 -1191395 -1215836 -1229482 -1479711 -1617540 -1663895 -1365850
14160 -1365850 -1234462 -1295681 -1230996 -1163333 -1279814 -1420023 -1244948 -1350359 -1576982 -1645779
14150 -1645779 -1696525 -1525025 -1459935 -1452749 -1622842 -1642068 -1533109 -1842203 -1865078 -1997263
14140 -1997263 -2072537 -2076061 -1977416 -1803411 -1691145 -1901956 -1835826 -1903153 -1530628 -1375031
14130 -1375031 -1618310 -1937920 -1797525 -1827492 -1936374 -2062210 -1911773 -1463750 -1333242 -1379191
14120 -1379191 -1356843 -1512568 -1613704 -1416809 -1295601 -1237065 -1007643 -967423 -963705 -1062699
14110 -1062699 -1271195 -1551398 -1634303 -1718709 -1835095 -1845732 -1870485 -1794942 -1699065 -1672883 -1715194
14099 -1715194 -1702418 -1540212 -1388074 -1268215 -1472219 -1758838 -1835014 -1362118 -1348148 -1155249
14089 -1155249 -1157808 -1619945 -1570056 -1314233 -1332402 -1491364 -1575242 -1535092 -1250573 -1288897 -1468956
14078 -1468956 -1404216 -1454729 -1486856 -1475225 -1250255 -1115142 -1176002 -1345947 -1710833 -1932274
14068 -1932274 -1814843 -1803410 -1813949 -1661848 -1375561 -1088980 -1053492 -1003557 -1015583 -1132333
14058 -1132333 -1166799 -848892 -830683 -1270510 -1426194 -1228157 -1293750 -1342903 -1580976 -1741082
14048 -1741082 -1747889 -1669599 -1646755 -1423315 -1174023 -1103009 -1083060 -1018712 -1147288 -1379891 -1392657
14037 -1392657 -1512266 -1509234 -1522438 -1569971 -1787526 -1776698 -1631514 -1510514 -1530968 -1668587
14027 -1668587 -1425209 -1246831 -1510572 -1586078 -1637066 -1435849 -1196526 -1388920 -1730711 -1488572
14017 -1488572 -1239876 -1162954 -1384469 -1329086 -1111240 -1270957 -1610897 -1662601 -1553318 -1681103
14007 -1681103 -1614382 -1450659 -1397763 -1293330 -998745 -1033816 -1153950 -1280745 -1128078 -1090372
13997 -1090372 -1413334 -1535400 -1620041 -1680808 -1541728 -1273419 -1271518 -1438426 -1492214 -1817621
13987 -1817621 -1919224 -1991003 -1912563 -1773592 -1694164 -1563876 -1637203 -1869561 -1632527 -1137556
13977 -1137556 -1131298 -1326118 -1477633 -1670977 -1654295 -1824402 -1771478 -1650210 -1405385 -1452409
13967 -1452409 -1230549 -1033967 -1061672 -908396 -987078 -1134319 -1448310 -1499865 -1423597 -1510526
13957 -1510526 -1100335 -928050 -987391 -1294999 -1365659 -1510146 -1503909 -1329457 -1396965 -1557370
13947 -1557370 -1785585 -1439389 -1287577 -1305797 -1308587 -1126999 -1253379 -1572717 -1759161 -1792326
13937 -1792326 -1548179 -1504977 -1305602 -1225788 -1245390 -1208322 -919726 -795470 -863644 -1201240
13927 -1201240 -1564024 -1761317 -1600645 -1673855 -1630438 -1541885 -1489938 -1526140 -1444056 -1347128 -1086344
13916 -1086344 -1053897 -1249680 -1356562 -1414595 -1404894 -1609446 -1462519 -1080552 -1018795 -1255154
13906 -1255154 -1336838 -1715946 -1853552 -1889753 -1900578 -1841802 -1837489 -1930342 -2002911 -2003391 -1834875
13895 -1834875 -1711553 -1689770 -1666032 -1684741 -1502049 -1105810 -1052360 -1135401 -1240695 -1193567
13885 -1193567 -1185039 -1157605 -1209191 -1321260 -1364417 -1596386 -1700513 -1751675 -1669465 -1724452 -1435178
13874 -1435178 -1238331 -1218670 -1414777 -1557337 -1614490 -1687806 -1883272 -1797555 -1842870 -1858192
13864 -1858192 -1766814 -1649752 -1826538 -1900373 -1810823 -2035171 -2124005 -1704768 -1426475 -1289989
13854 -1289989 -1130128 -990800 -1328706 -1342573 -1218830 -1505438 -1535685 -1058616 -1073382 -1271558
13844 -1271558 -1515921 -1573167 -1567779 -1516567 -1562323 -1523921 -1283686 -1230306 -1198771 -1391978 -1537817
13833 -1537817 -1433479 -1129065 -1288730 -1351335 -1141502 -1075863 -1440258 -1663581 -1570662 -1383680
13823 -1383680 -1195829 -1280614 -1309596 -1196146 -1146325 -1066585 -973790 -968155 -1209484 -1488032 -1601542
13812 -1601542 -1679307 -1596504 -1627764 -1799373 -1803929 -1557100 -1558236 -1521504 -1410088 -1187727 -879665
13801 -879665 -889843 -792774 -462147 -502856 -856656 -990566 -990170 -1043495 -1120389 -1188663 -1317975
13790 -1317975 -1250932 -1472473 -1696677 -1718108 -1735952 -1884827 -1851751 -1731338 -1652618 -1515606
13780 -1515606 -1345300 -1228988 -1391847 -1379302 -1312447 -1191789 -1291774 -1293896 -1035130 -1242365
13770 -1242365 -1552388 -1793167 -1579098 -1334774 -1472024 -1556856 -1588479 -1445606 -1050700 -1088106
13760 -1088106 -1240450 -1230965 -1232853 -1388825 -1636251 -1733770 -1767177 -1412700 -1104810 -868234
13750 -868234 -934740 -1268436 -1503457 -1566155 -1654048 -1503253 -1535773 -1445325 -1227841 -1214962 -1401260
13739 -1401260 -1327934 -1406851 -1462803 -1248299 -1472296 -1482906 -1186813 -1058429 -974767 -1092933
13729 -1092933 -1029591 -1275844 -1547715 -1683634 -1779088 -1715262 -1381615 -1199064 -1121367 -1459904
13719 -1459904 -1655014 -1353561 -1109592 -1208428 -1129332 -1097981 -1272531 -1481099 -1591501 -1658888
13709 -1658888 -1628661 -1731784 -1686999 -1224841 -857210 -1164091 -1356697 -1448370 -1416055 -1459996
13699 -1459996 -1540918 -1571527 -1496872 -1136450 -1155915 -1221637 -1372741 -1327549 -1303410 -1245634 -1162306
13688 -1162306 -1157497 -1131393 -1119546 -1348256 -1464358 -1371821 -779644 -720270 -916771 -1141464
13678 -1141464 -1101714 -1060376 -1235121 -1299464 -1303022 -1269036 -1369000 -1706279 -1849057 -1753479 -1573530
13667 -1573530 -1582053 -1358747 -1566189 -1565104 -1417853 -1392579 -1180746 -863964 -855725 -797652 -925277
13656 -925277 -1001466 -1144067 -1373375 -1184140 -849340 -922499 -1298494 -1321848 -1219738 -1435389
13646 -1435389 -1317613 -1449601 -1387527 -1338962 -1374865 -1483330 -1282786 -1557805 -1724585 -1663867
13636 -1663867 -1669604 -1744001 -1756812 -1632466 -1465856 -1208119 -862088 -686893 -855713 -1086860
13626 -1086860 -1429279 -1266673 -1259090 -1246425 -1129394 -1240673 -1085534 -1091057 -1030141 -1251653
13616 -1251653 -1217691 -1142804 -963796 -871466 -1065443 -1290246 -1602296 -1530158 -1350368 -1600096
13606 -1600096 -1432136 -1449874 -1351943 -1228946 -1162867 -1253927 -1542485 -1618721 -1346236 -1340424 -1447345
13595 -1447345 -1566742 -1560643 -1394079 -1402751 -1413314 -1377939 -1373916 -1702291 -1744857 -1395902 -1226212
13584 -1226212 -1263439 -1333212 -1657932 -1733333 -1436612 -1499479 -1434536 -952058 -662688 -973167
13574 -973167 -1226690 -1508728 -1482592 -1235277 -1171298 -933426 -982521 -1243107 -1152823 -863988
13564 -863988 -696166 -833794 -877081 -759811 -994451 -996716 -1161530 -1169055 -1133397 -796992 -695842
13553 -695842 -615029 -913129 -1017387 -893354 -1058462 -979111 -1101858 -1113652 -858828 -786348
13543 -786348 -1015060 -1193581 -1421670 -1437826 -1271420 -1156301 -1168661 -1467931 -1546897 -1621363
13533 -1621363 -1465860 -1511341 -1451825 -1495340 -1647320 -1649406 -1535704 -1740279 -1642605 -1426378
13523 -1426378 -1272413 -1135964 -1195670 -1105011 -1231523 -1457925 -1512898 -1488759 -1293146 -1142984
13513 -1142984 -1299358 -1555625 -1490104 -1439741 -1341117 -1359243 -1206253 -1196112 -1193666 -959860 -1257935
13502 -1257935 -1524601 -1743205 -1790544 -1778968 -1534779 -1773664 -1853107 -1620258 -1375169 -1237095
13492 -1237095 -1105628 -1254111 -1364583 -1528669 -1407996 -1486275 -1661962 -1423120 -1304937 -1124558
13482 -1124558 -691317 -491890 -805306 -992746 -1274751 -1272010 -1221239 -1246926 -1173491 -1336625
13472 -1336625 -1380616 -1308578 -1311539 -1239248 -1094692 -966394 -1163130 -1240116 -1502535 -1504824 -1357371
13461 -1357371 -882906 -605324 -667043 -1103745 -1382684 -1155032 -1155651 -1166563 -1146145 -1174801 -1204526
13450 -1204526 -1155700 -1149864 -1129837 -1082324 -1021328 -1353440 -1545933 -1607189 -1433839 -1228191 -1307803
13439 -1307803 -1362980 -1561405 -1770770 -1503241 -1296012 -1325354 -1331388 -1372178 -1352817 -1205624
13429 -1205624 -1195940 -1352180 -1195894 -1099901 -1104229 -910405 -887595 -1034979 -1011895 -900693 -932303
13418 -932303 -992676 -941181 -718619 -984240 -1325634 -1518418 -1523224 -1410999 -1482382 -1547539 -1448945
13407 -1448945 -1664727 -1680489 -1465140 -1221518 -1048128 -1118789 -1125410 -1078000 -1152666 -1259762
13397 -1259762 -1370549 -1332334 -1130532 -1139446 -1124330 -862418 -854116 -799190 -681499 -887742 -1188814
13386 -1188814 -1334800 -1727071 -1930617 -1610532 -1366953 -1556511 -1536248 -1298147 -1243749 -1157869
13376 -1157869 -1145153 -1367168 -1323548 -1198908 -1156757 -1050269 -1017659 -1132840 -1453597 -1314297
13366 -1314297 -929289 -1053235 -1218950 -1323244 -1114770 -1057490 -969081 -600648 -700889 -743318
13356 -743318 -885742 -1080926 -1131867 -1221046 -1353820 -1470316 -1346977 -1343046 -1365336 -1037429
13346 -1037429 -1219418 -1250237 -1111310 -951671 -1059302 -1178481 -1197911 -1331450 -1456061 -1296005
13336 -1296005 -1196978 -1176271 -1080292 -1102407 -944232 -773792 -957762 -1150757 -1115331 -1049119
13326 -1049119 -574678 -691779 -912823 -1087430 -1041821 -843086 -969523 -1141337 -1240400 -1067994
13316 -1067994 -997627 -943841 -777873 -581687 -731896 -1118543 -1370638 -1153079 -933575 -948285
13306 -948285 -1147670 -1068740 -1225108 -1580901 -1698016 -1423966 -1019706 -873564 -809461 -989164
13296 -989164 -1377866 -1436952 -1423930 -1449980 -1335132 -1109959 -932556 -1182094 -1155401 -1053443
13286 -1053443 -923173 -1017952 -1078837 -900192 -772431 -963512 -1001952 -894156 -925488 -1067398
13276 -1067398 -1010109 -1026122 -1225188 -1360053 -1247068 -1230739 -1033865 -828084 -952141 -912493
13266 -912493 -864555 -694258 -804504 -1136832 -1204047 -1052113 -974268 -1207466 -1248943 -1228994
13256 -1228994 -1399203 -1450680 -1394887 -1414050 -1370871 -1660545 -1517808 -1515787 -1553931 -1406686 -1291082
13245 -1291082 -1306373 -1227430 -1320111 -1557841 -1578112 -1523774 -1368221 -1268799 -1203079 -1075172 -1226733
13234 -1226733 -952212 -670648 -845865 -888261 -1051764 -1422098 -1422730 -1243719 -1200158 -1214725
13224 -1214725 -1465335 -1468650 -1599800 -1585961 -1337813 -988305 -792207 -937733 -966351 -1097939
13214 -1097939 -1393706 -1397634 -1313797 -997765 -1208615 -1509519 -1627324 -1664565 -1504242 -1605302
13204 -1605302 -1742056 -1549250 -1340327 -1116037 -1104670 -1103506 -1103758 -1093731 -1049318 -1025911 -1008295
13193 -1008295 -1038182 -1234349 -1012368 -937611 -1037519 -1172834 -1410492 -1145985 -882621 -744952
13183 -744952 -655889 -1008662 -1107932 -983290 -932700 -772549 -829134 -1012896 -1169563 -1240951
13173 -1240951 -1267410 -1047539 -991110 -922199 -1188930 -1449859 -1379019 -1179960 -1364373 -1442255
13163 -1442255 -1256155 -1349602 -1658614 -1657806 -1311262 -1104290 -1051025 -939260 -724395 -796651
13153 -796651 -834916 -1095671 -1057953 -1044046 -1188055 -1335374 -1327254 -1133295 -1068106 -1085288 -1125186
13142 -1125186 -1260335 -1124748 -1031912 -1099066 -1127833 -1099730 -1105822 -1016490 -1262528 -1351855 -1367189
13131 -1367189 -1106985 -883152 -994661 -965645 -1199301 -1271487 -1268425 -1161623 -689382 -730645
13121 -730645 -884950 -894217 -900099 -1191150 -1142456 -993833 -1020767 -1087555 -1474500 -1474331 -1239442
13110 -1239442 -1180685 -1406746 -1536258 -1573227 -1557263 -1367214 -1168616 -1015599 -1079437 -1153283
13100 -1153283 -978632 -1013095 -1013107 -991926 -1181497 -1396199 -1365570 -1307662 -1592181 -1684966 -1741206
13089 -1741206 -1428843 -1142492 -1193263 -1391854 -1697100 -1591290 -1471139 -1326582 -1284614 -1241602
13079 -1241602 -1183918 -1199278 -1063338 -1180449 -859958 -547037 -816743 -1098558 -1110094 -1084569
13069 -1084569 -1029553 -1015185 -1013413 -1087116 -1188993 -1127027 -1024785 -948764 -795759 -878958 -1005647
13058 -1005647 -1183182 -1492166 -1312241 -1244040 -1137088 -938034 -758144 -747760 -736438 -933883
13048 -933883 -1158396 -1095547 -1384671 -1368558 -1145015 -943009 -991938 -1331278 -1525802 -1587302
13038 -1587302 -1489361 -1279007 -1026189 -1023246 -969002 -952268 -958758 -859076 -999408 -955650 -921301
13027 -921301 -1063013 -940951 -941824 -1139253 -1142056 -1214153 -1440827 -1544965 -1282482 -995828 -1144371
13016 -1144371 -1351659 -1201754 -1009574 -1183721 -1236797 -1299324 -1391943 -1290709 -1223373 -1158466
13006 -1158466 -777723 -696524 -938195 -1033115 -1144498 -1103243 -837955 -988061 -1338054 -1563721
12996 -1563721 -1431461 -1228008 -908099 -725710 -731349 -904304 -955742 -1045531 -1245620 -1285244
12986 -1285244 -942609 -887618 -937329 -1191681 -1244961 -1240350 -1480172 -1528805 -1337395 -1467409
12976 -1467409 -1301585 -954967 -1029743 -977359 -495100 -517102 -692230 -1112450 -1304813 -1290556
12966 -1290556 -1315304 -1346582 -986581 -869784 -991478 -949261 -783353 -988230 -1243972 -1061055
12956 -1061055 -893830 -715553 -917146 -1017586 -959611 -1011667 -900021 -1064841 -1369751 -1201527
12946 -1201527 -1206613 -1362653 -1108612 -1044522 -1220356 -1279671 -1129061 -1035883 -938454 -1050756
12936 -1050756 -1131681 -664924 -598818 -759648 -732534 -929472 -938706 -983933 -1232247 -1400547
12926 -1400547 -1309248 -1155499 -1175342 -799334 -571059 -665475 -939435 -967588 -846438 -645855
12916 -645855 -584165 -730287 -1028542 -1080502 -1034651 -930203 -906531 -1056882 -1267153 -1342838
12906 -1342838 -1204730 -1203360 -1248471 -1085930 -1011937 -1122605 -1173839 -1241663 -1283112 -1187878 -1317554
12895 -1317554 -1179878 -1172442 -1241694 -1094926 -963539 -1032910 -1071669 -979068 -858511 -962041
12885 -962041 -902399 -943965 -984215 -1061427 -961280 -784354 -475522 -147715 -125942 -223220 -334447
12874 -334447 -529638 -798505 -1115402 -1217163 -1164022 -1224881 -1280862 -1096276 -1164622 -940124
12864 -940124 -693259 -605695 -715160 -941758 -1165014 -1199094 -1044017 -1034721 -1198671 -1360699
12854 -1360699 -1152528 -1273800 -1485543 -1484783 -1393288 -1250946 -1149854 -1118860 -1091660 -1007027 -1195755
12843 -1195755 -1206718 -1276893 -1185322 -947712 -967269 -912699 -827965 -793070 -752883 -1018727 -776206
12832 -776206 -547102 -641585 -735007 -1030968 -915907 -742667 -469019 -397698 -967813 -1381150
12822 -1381150 -1202493 -1176541 -1270287 -1518744 -1290361 -1308168 -1401295 -1490932 -1341086 -1541467
12812 -1541467 -1399146 -1411705 -1307207 -1080612 -985171 -757528 -705082 -665250 -703402 -990799
12802 -990799 -1131021 -936993 -926926 -953244 -1173278 -1067156 -810250 -802092 -1007588 -1010702 -851056
12791 -851056 -680313 -706830 -685733 -854554 -1093873 -987543 -1087179 -813106 -668363 -916127
12781 -916127 -1170218 -1289100 -1104811 -866369 -873025 -891371 -1065541 -968809 -820904 -877552
12771 -877552 -1014514 -844816 -719483 -569168 -730770 -1021858 -1039368 -901907 -901612 -970611
12761 -970611 -1027149 -983640 -790538 -775015 -852987 -867798 -715929 -679991 -821630 -708603 -902678
12750 -902678 -866167 -990947 -885971 -898851 -971345 -672272 -488980 -514848 -414371 -409686 -984448
12739 -984448 -1278692 -1078692 -1096741 -1200759 -1197531 -1302232 -1329265 -1246151 -1101239 -1109677 -982717
12728 -982717 -655200 -726665 -627326 -559109 -587440 -956919 -1059844 -1182604 -1142045 -941619
12718 -941619 -665134 -770729 -1126800 -1328668 -1454438 -1476781 -1186505 -779813 -411012 -549999
12708 -549999 -927001 -936754 -985947 -1088771 -1180993 -1098706 -988357 -969018 -861121 -946457 -923477
12697 -923477 -1129416 -1104686 -873666 -704077 -688621 -553478 -391717 -544219 -727532 -838025
12687 -838025 -1037883 -1045844 -850941 -770462 -774332 -784319 -842080 -922035 -809910 -589160 -609381
12676 -609381 -811849 -832428 -944472 -1253642 -828124 -636056 -600877 -850464 -796779 -838345
12666 -838345 -1095831 -1006976 -1155785 -1194168 -918822 -1073996 -1089456 -833029 -758348 -795285
12656 -795285 -830232 -850072 -1056204 -941550 -1031047 -1050463 -1116711 -1095453 -963553 -1206184 -1424864
12645 -1424864 -1416655 -1374050 -1244122 -1224793 -1133682 -1001439 -988278 -1152663 -984963 -893779 -888421
12634 -888421 -1072880 -996232 -962120 -989139 -844029 -696426 -656256 -655120 -508399 -450150 -479231
12623 -479231 -539932 -668073 -910605 -977712 -844993 -1186207 -1279493 -990717 -751937 -738951
12613 -738951 -672427 -1001373 -1038427 -1073720 -1350394 -1106260 -958566 -869047 -649101 -649217 -555673
12602 -555673 -305844 -355119 -465747 -352421 -593332 -853997 -1006740 -887064 -530456 -386187
12592 -386187 -364980 -502519 -969227 -1107452 -1012945 -706270 -715023 -1121771 -1359107 -941288
12582 -941288 -773047 -778889 -986323 -865052 -805622 -738708 -668396 -623720 -890485 -1155914 -1230193
12571 -1230193 -1275585 -968916 -881110 -747384 -609491 -783790 -747369 -1050345 -973329 -667619
12561 -667619 -470497 -560550 -643730 -726026 -714858 -533484 -394587 -592027 -984043 -1058068
12551 -1058068 -1043887 -937660 -868335 -731985 -546179 -531820 -938625 -1342601 -1271900 -1001253
12541 -1001253 -917021 -910811 -1145507 -1131843 -1036468 -952892 -735895 -831252 -1000717 -975582 -908295
12530 -908295 -1156534 -1207909 -1029714 -900084 -796992 -540129 -912216 -1273681 -1245401 -1140406
12520 -1140406 -1036690 -1002176 -919890 -1025508 -801209 -775483 -952800 -889544 -927512 -882505
12510 -882505 -621275 -800062 -904060 -1050885 -1102698 -1149841 -1222895 -1213967 -1150569 -1081685 -962038
12499 -962038 -771289 -834101 -860520 -973334 -1102050 -1207525 -1080715 -935989 -863080 -783364
12489 -783364 -1068034 -1301471 -1529012 -1498480 -840541 -582465 -663917 -961001 -1197202 -1112378
12479 -1112378 -863842 -727082 -573076 -819693 -724026 -677837 -737244 -1096496 -1263570 -1095478
12469 -1095478 -980811 -1096502 -1170986 -1182536 -1125110 -1252494 -1114638 -1218726 -1435705 -1237252
12459 -1237252 -957087 -867720 -957398 -965632 -1057589 -1096985 -1150357 -1194333 -1163636 -1124288 -1090902
12448 -1090902 -1112601 -1204199 -1148205 -1178751 -1232397 -1166558 -1326851 -995145 -641946 -716027 -876398
12437 -876398 -1203751 -1461906 -1315908 -1415125 -1273958 -1146607 -1091898 -1026569 -1035560 -928425
12427 -928425 -559742 -468439 -388835 -481534 -788736 -1264173 -1305311 -1032760 -671148 -59250
12417 -59250 -267167 -806094 -871228 -1019201 -1163210 -1590073 -1424249 -1228912 -1068104 -867640
12407 -867640 -1083200 -1190494 -1157958 -1132848 -1373527 -1610969 -1099348 -1001745 -1125026 -1140772
12397 -1140772 -1091021 -835021 -779266 -1111460 -1248554 -1205422 -927966 -846883 -937347 -837378
12387 -837378 -927398 -752651 -823553 -1299958 -1415855 -1319521 -996313 -595469 -635680 -775030
12377 -775030 -829554 -921152 -818638 -834901 -976639 -1079964 -1089851 -1004748 -702317 -704528 -850411
12366 -850411 -900036 -944251 -982606 -1309361 -1149266 -1281314 -1516848 -1417396 -1291063 -1303802
12356 -1303802 -1154375 -983997 -920117 -947230 -925149 -891694 -800701 -712319 -635543 -560449 -758404
12345 -758404 -848946 -791358 -777955 -600273 -536193 -690736 -709272 -810096 -1024761 -948098 -970572
12334 -970572 -966871 -774703 -906066 -983670 -951908 -925929 -988969 -987476 -1150853 -1091087 -1399671
12323 -1399671 -1163721 -870069 -924940 -888789 -1181076 -1397753 -1086895 -619124 -596882 -607942
12313 -607942 -922298 -878542 -920881 -1161916 -1088920 -1005632 -1197775 -1313306 -840787 -423555
12303 -423555 -509706 -733038 -1076322 -1163724 -883518 -675210 -726914 -765770 -793805 -992814
12293 -992814 -1011214 -835329 -696277 -894547 -909503 -860022 -851505 -1006684 -974276 -846216 -1017177
12282 -1017177 -1124835 -1137197 -1263792 -1165473 -939174 -1070608 -1049022 -1080842 -1217907 -1188334
12272 -1188334 -1196021 -1086280 -853363 -788141 -1192384 -1322015 -1350077 -1216688 -956819 -884509
12262 -884509 -652260 -678876 -912932 -1123011 -995004 -1003618 -911615 -891820 -936805 -1100057 -1172584
12251 -1172584 -1380020 -1384726 -1166176 -1114815 -1002919 -941880 -1049837 -1493638 -1397662 -1165769
12241 -1165769 -999867 -868143 -729096 -873465 -762578 -731335 -1079933 -1153582 -975609 -783697
12231 -783697 -790352 -811703 -800913 -759381 -1051762 -1228203 -907986 -830024 -1024679 -905824 -973150
12220 -973150 -1034290 -1152183 -1104805 -830683 -886611 -738219 -863131 -1036764 -1134104 -1273925
12210 -1273925 -1344436 -1276083 -1212037 -1133794 -911326 -1181837 -1181406 -935508 -1029968 -1326837 -1357156
12199 -1357156 -1266787 -1251766 -1219487 -954623 -1106114 -1094259 -689372 -717271 -1229389 -1389860
12189 -1389860 -1319846 -1333674 -1080878 -1104600 -1043601 -891214 -711419 -703825 -759352 -558643 -544051
12178 -544051 -751681 -834401 -912264 -1148499 -1142448 -1345083 -1437167 -1345920 -1301125 -1162171 -939068
12167 -939068 -927613 -859958 -717369 -700985 -750160 -712970 -722067 -840116 -596746 -351845 -367221
12156 -367221 -691896 -690739 -680785 -764504 -909483 -985603 -965054 -809737 -640438 -734079 -772003
12145 -772003 -800072 -702476 -592411 -730159 -525240 -302210 -292128 -170676 -354447 -737951
12135 -737951 -749308 -459855 -149426 -28877 -320912 -529443 -617022 -697683 -708387 -1171576
12125 -1171576 -1727251 -1763194 -1171785 -607238 -809918 -999517 -1173430 -1166117 -1345811 -1228161
12115 -1228161 -1110299 -993180 -1005718 -886254 -931572 -1027959 -1118750 -941775 -758126 -733902
12105 -733902 -816819 -744002 -790081 -642540 -632548 -796052 -792461 -1031804 -1084828 -1088363 -914541
12094 -914541 -1024008 -942919 -885955 -733303 -868765 -985214 -768504 -979656 -1050196 -1361656
12084 -1361656 -1346995 -1043455 -959857 -1259694 -1289991 -733145 -547067 -518711 -601509 -714727
12074 -714727 -965248 -820352 -766094 -871282 -747208 -473259 -573593 -769286 -726703 -975674
12064 -975674 -1014512 -732066 -521667 -727361 -760287 -731918 -495383 -446345 -654254 -809360
12054 -809360 -953518 -957390 -989427 -988697 -830647 -808115 -847702 -970229 -1190255 -1171909 -1058606
12043 -1058606 -1126161 -842025 -729343 -1010987 -1250941 -994115 -891438 -897181 -896506 -902736 -1199771
12032 -1199771 -1093907 -1018274 -932754 -1051924 -1052696 -1096853 -1088446 -1033466 -578399 -552754 -597387
12021 -597387 -508513 -627146 -672015 -717085 -929302 -841694 -754597 -735296 -915226 -899922 -761580
12010 -761580 -765793 -914094 -1013071 -1110983 -1236132 -994145 -868292 -962155 -1221120 -1412801
12000 -1412801 -1234914 -826911 -602829 -649114 -793854 -657225 -722950 -987021 -1111811 -1163416
11990 -1163416 -1190594 -1202451 -986648 -849897 -874395 -953168 -823934 -975828 -781716 -949232
11980 -949232 -1246271 -1274796 -1085255 -1191143 -1258513 -1043687 -829626 -991166 -817494 -865519
11970 -865519 -823536 -608094 -729221 -1022204 -992399 -883640 -717094 -746096 -687201 -715143
11960 -715143 -846274 -971385 -1154815 -1079881 -993422 -915186 -968517 -943717 -812868 -951564
11950 -951564 -990519 -946285 -839356 -708405 -965413 -1213581 -1246612 -1422459 -1629492 -1574939
11940 -1574939 -1412645 -1275474 -1119127 -898831 -1057937 -1251292 -1352209 -1292291 -1324753 -1296695
11930 -1296695 -1242076 -1027532 -850631 -841483 -958827 -1266186 -1284089 -965005 -818891 -853595
11920 -853595 -649031 -588298 -988107 -1031571 -815359 -788079 -1028177 -972145 -944730 -1032444 -702919
11909 -702919 -630490 -907685 -952542 -830202 -830914 -763617 -523454 -550268 -674882 -626315 -564507
11898 -564507 -718914 -1078758 -1159718 -914591 -766276 -770559 -949225 -1088978 -787158 -593285
11888 -593285 -559713 -665528 -1005630 -858429 -628474 -720460 -1042096 -1129920 -874666 -679101
11878 -679101 -653953 -569687 -833902 -1173121 -1246360 -1558479 -1413130 -1118020 -970947 -654002
11868 -654002 -819861 -1132116 -1148897 -1136867 -1052872 -899022 -788294 -899190 -1127730 -1215724
11858 -1215724 -1276235 -982641 -698339 -690033 -656740 -919083 -1107037 -941829 -709184 -805910
11848 -805910 -398364 -477666 -882583 -1257156 -1056267 -675534 -682086 -848769 -842857 -799377 -968985
11837 -968985 -656389 -656761 -804432 -916651 -834990 -1085153 -1213659 -1162393 -931941 -1017549 -1132695
11826 -1132695 -1112658 -939400 -1163497 -1079547 -1031151 -832175 -1100052 -1246540 -1132215 -974279
11816 -974279 -1220369 -1318297 -1213387 -1127319 -1041990 -1149930 -1107221 -1245183 -1496739 -1715281
11806 -1715281 -1532283 -1272397 -1286676 -1340301 -1307853 -1362789 -1187590 -1254477 -1183794 -983992
11796 -983992 -929078 -857689 -801759 -633019 -809582 -904690 -1022139 -1103832 -1191630 -1156237 -1093891
11785 -1093891 -1100579 -1164833 -837688 -839643 -888930 -773702 -613423 -519329 -572139 -386537 -372450
11774 -372450 -623586 -709650 -497114 -573961 -857611 -934135 -883015 -796276 -943389 -738854
11764 -738854 -633737 -731399 -861271 -764540 -1061744 -970900 -750603 -839737 -944447 -706436
11754 -706436 -622313 -619400 -913586 -981926 -839235 -874493 -860287 -649837 -437016 -856966 -915968
11743 -915968 -744626 -870401 -969823 -856103 -845651 -891137 -1050248 -964205 -794502 -710386
11733 -710386 -777090 -1095977 -1316392 -1319706 -1345263 -1256021 -931317 -986708 -1031367 -724141 -526008
11722 -526008 -363946 -163948 -371233 -439195 -589512 -541176 -386679 -181572 -274756 -457631
11712 -457631 -390822 -425604 -577781 -784739 -853289 -867305 -748533 -792524 -845347 -992430 -1270813
11701 -1270813 -1244873 -964184 -780914 -909381 -906142 -836248 -884986 -875988 -1211084 -1270779 -1368881
11690 -1368881 -1124844 -1157682 -959698 -555320 -390141 -623497 -896807 -939193 -886665 -619116
11680 -619116 -627060 -497258 -495248 -429691 -504359 -825598 -987599 -1074902 -814556 -526799 -655504
11669 -655504 -789914 -848777 -928882 -868907 -876087 -1021763 -978390 -962561 -833379 -776676 -805274
11658 -805274 -888590 -980926 -1018623 -849859 -807687 -1150195 -1054371 -806780 -991078 -1024752 -1032750
11647 -1032750 -1179424 -931245 -953291 -947296 -864550 -912733 -1032085 -1043376 -914940 -936106 -1014950
11636 -1014950 -1014316 -786288 -605266 -699519 -771935 -875249 -1261473 -1318106 -1088820 -1072543 -971577
11625 -971577 -941599 -939280 -758971 -746763 -735134 -623396 -472818 -427938 -493719 -450675 -638561
11614 -638561 -692070 -726287 -579267 -570375 -494708 -506421 -478898 -826308 -1118910 -1076797 -1126372
11603 -1126372 -1027939 -983204 -798408 -629510 -774914 -626707 -733843 -940054 -961152 -698760
11593 -698760 -254192 -302383 -759466 -1193798 -1170544 -963860 -896884 -846988 -719670 -748194
11583 -748194 -889104 -865573 -840739 -759499 -811600 -944481 -770271 -597976 -696872 -944710
11573 -944710 -816025 -855592 -1102547 -1086785 -804140 -840033 -971690 -1255705 -1186571 -1091404
11563 -1091404 -1207889 -1355328 -1260790 -1179110 -1146389 -981293 -645855 -565553 -503471 -657564
11553 -657564 -691387 -350276 -389993 -447130 -428827 -326466 -211278 -144207 -282002 -377896 -536057
11542 -536057 -491542 -449273 -739837 -590622 -790314 -914588 -944022 -1062464 -894938 -891875
11532 -891875 -897571 -778886 -892759 -893686 -845020 -1173618 -1203841 -873893 -607431 -591383 -670788
11521 -670788 -626208 -553201 -310345 -292730 -399386 -541829 -616978 -699013 -651067 -440143 -463057
11510 -463057 -611848 -479440 -326329 -369826 -319259 -144605 -104031 -170213 -359755 -611666
11500 -611666 -885409 -684218 -467436 -788907 -771617 -905002 -1231052 -1265880 -1129082 -1053588
11490 -1053588 -1075480 -1024040 -929488 -984500 -884388 -836208 -980240 -636568 -465121 -772970
11480 -772970 -879298 -686244 -458480 -303027 -433304 -516202 -662364 -683521 -805402 -934215
11470 -934215 -867810 -794495 -726179 -685532 -772244 -844479 -859511 -828497 -1000981 -1154448 -1044432
11459 -1044432 -1124089 -1148686 -871717 -845908 -623705 -641036 -860630 -814065 -908410 -614742
11449 -614742 -451134 -542977 -684859 -1106916 -1309558 -1010264 -715132 -391285 -313177 -670741
11439 -670741 -998638 -807403 -716685 -702935 -761651 -742063 -688493 -720292 -660883 -1034752 -944035
11428 -944035 -823564 -778103 -442600 -435909 -322871 -305805 -206719 -46536 -311999 -723631
11418 -723631 -1015678 -1216873 -949514 -786048 -648501 -633992 -764068 -834513 -831264 -673920
11408 -673920 -628327 -817392 -922612 -855918 -976211 -821265 -620146 -775611 -856739 -875953
11398 -875953 -831750 -925441 -1296473 -1094363 -968453 -1013283 -1069544 -976591 -852303 -890159 -872054
11387 -872054 -942040 -704215 -687724 -865863 -942975 -962531 -1182533 -1081955 -1326861 -1017137
11377 -1017137 -781628 -817794 -672160 -577106 -357948 -444341 -465324 -432551 -632420 -899789
11367 -899789 -820770 -736469 -1023402 -933892 -606109 -301827 -342671 -361036 -389436 -808365 -1161213
11356 -1161213 -976204 -927360 -770096 -662595 -706274 -900499 -772344 -419630 -640633 -803756
11346 -803756 -726028 -548415 -570296 -721248 -590508 -609451 -723899 -939572 -966608 -1018084
11336 -1018084 -1053215 -943180 -868411 -869929 -578301 -724248 -733062 -855451 -933598 -1158650 -1073350
11325 -1073350 -868914 -775299 -903088 -1283098 -1074514 -955168 -1050174 -1266627 -1089740 -772292
11315 -772292 -758011 -1028988 -1078929 -898901 -1000995 -1044734 -995932 -820335 -584464 -727227
11305 -727227 -1011768 -1196995 -1408467 -1498755 -1257563 -1074911 -767563 -610881 -550836 -845963
11295 -845963 -1022254 -759428 -460610 -473632 -813751 -756134 -577352 -483246 -322645 -517510
11285 -517510 -520943 -624380 -770138 -866359 -1018215 -698803 -624599 -997155 -1314429 -1313976 -1364843
11274 -1364843 -1304751 -1195849 -960007 -662290 -480307 -362350 -539790 -823644 -1025722 -1179829
11264 -1179829 -1056363 -1158197 -859473 -616827 -414350 -490584 -669702 -696188 -701559 -867596
11254 -867596 -932875 -827909 -719326 -1064881 -1043196 -961841 -582237 -526075 -527366 -448016 -515079
11243 -515079 -403024 -438933 -703551 -811559 -890811 -900896 -969185 -598354 -70555 -330838
11233 -330838 -475888 -305618 -138410 -237048 -216875 -21708 165993 39223 -143398 -454575
11223 -454575 -791420 -837162 -830666 -494818 -570258 -663628 -660715 -700292 -872390 -767694 -451226
11212 -451226 -301405 -350464 -622265 -682483 -684428 -429095 -328212 -525659 -491770 -362149
11202 -362149 -55681 -52858 -185538 -414257 -715801 -893432 -1076839 -873037 -503132 -737238
11192 -737238 -908747 -514684 -157300 -228936 -612141 -736982 -895377 -1069178 -930314 -781978
11182 -781978 -630218 -512929 -745740 -868731 -856813 -846183 -886243 -1106361 -1170744 -980202
11172 -980202 -977832 -910808 -654684 -555099 -561465 -448837 -431653 -427783 -473275 -698257 -895957
11161 -895957 -766315 -850405 -1037345 -1009609 -1127644 -1069812 -928724 -847773 -837820 -706486 -558439
11150 -558439 -683101 -427652 -348744 -560518 -744554 -1098065 -1075702 -713201 -502518 -585178
11140 -585178 -636474 -453861 -329080 -735467 -1146836 -1247642 -1080948 -851491 -682711 -352890
11130 -352890 -80193 -216410 -592639 -904947 -763618 -549280 -627916 -665224 -795205 -934398
11120 -934398 -636194 -740756 -944937 -938876 -1052233 -1140097 -976423 -690677 -419121 -478542
11110 -478542 -720718 -681265 -394345 -337748 -571458 -722190 -628705 -393430 -476652 -504742
11100 -504742 -521925 -628295 -669083 -636070 -436096 -525999 -633470 -757462 -956269 -945390
11090 -945390 -842433 -899491 -1141443 -1005878 -810816 -782908 -693240 -572091 -454181 -418613
11080 -418613 -523609 -640244 -737384 -789258 -565958 -560565 -575357 -612058 -812390 -763664 -582397
11069 -582397 -385070 -158276 -220909 -288712 -439827 -491703 -556538 -660942 -616463 -834245
11059 -834245 -947541 -749214 -882324 -789376 -722461 -858649 -568689 -371374 -455353 -456914
11049 -456914 -700084 -757850 -776982 -639611 -575299 -477520 -419999 -377257 -721230 -883680 -769263
11038 -769263 -550776 -444094 -606637 -688631 -771140 -844344 -764763 -718135 -716709 -486895 -454119
11027 -454119 -536534 -560175 -673234 -596453 -448821 -113253 126427 -133805 -194055 -271809
11017 -271809 -525567 -537345 -512465 -406962 -545519 -504542 -561806 -843295 -936525 -855770 -763776
11006 -763776 -459376 -424820 -313040 -314321 -473422 -501241 -642952 -964930 -1036489 -1058878 -881851
10995 -881851 -576100 -482795 -367869 -694350 -664779 -531829 -528828 -480529 -536737 -531304 -367155
10984 -367155 -184649 -468715 -608275 -732640 -527445 -411207 -450612 -416693 -529966 -531571
10974 -531571 -374953 -227914 -150043 -378205 -498411 -688251 -886375 -665158 -634675 -815456
10964 -815456 -776261 -539137 -509577 -878337 -1067669 -933582 -536520 -554500 -740899 -1023984
10954 -1023984 -1022897 -726643 -389889 -262806 -279371 -592790 -575144 -832144 -656282 -600139
10944 -600139 -475545 -645126 -788903 -943753 -1005488 -899573 -1014953 -1040544 -825790 -718386
10934 -718386 -657493 -642100 -663600 -667811 -555643 -587194 -797570 -781148 -601652 -230491 -357353
10923 -357353 -423760 -812675 -958282 -794634 -961537 -925988 -1028173 -1086122 -890101 -749734
10913 -749734 -713299 -640147 -746998 -845987 -982803 -1062664 -1015453 -651192 -481915 -472907 -524147
10902 -524147 -934578 -1151346 -743068 -819642 -783757 -482294 -703855 -886477 -790642 -648124
10892 -648124 -553964 -587729 -534738 -645236 -759266 -739340 -755640 -779630 -975651 -956979 -682200
10881 -682200 -601344 -393737 -134684 -122195 -367624 -553013 -706849 -693571 -716887 -852409
10871 -852409 -827924 -533207 -422500 -734339 -804307 -533007 -438444 -547100 -650676 -469529
10861 -469529 -352488 -492490 -641160 -624144 -734479 -865917 -720842 -588965 -901097 -785720
10851 -785720 -704996 -727401 -827847 -787257 -557289 -345191 -84670 -125023 -365438 -603027
10841 -603027 -746505 -732359 -669565 -636866 -518151 -453216 -318688 -234408 -302527 -454229 -418360
10830 -418360 -363576 -306711 -515959 -646236 -601239 -733761 -786333 -884489 -965070 -980960 -982290
10819 -982290 -995832 -662870 -482045 -602424 -668376 -729114 -996968 -858934 -735949 -595056
10809 -595056 -486509 -448642 -445864 -526152 -527768 -576243 -697730 -943551 -684634 -402260 -381906
10798 -381906 -804525 -980473 -771108 -883997 -1068710 -937486 -1147908 -1061212 -853307 -769544
10788 -769544 -1066579 -1059970 -796157 -589049 -652651 -758981 -864602 -950875 -813073 -593825
10778 -593825 -545824 -530006 -592029 -665119 -704610 -512020 -499254 -645560 -487412 -561839 -539557
10767 -539557 -647065 -744047 -741168 -434651 -381715 -145678 -20217 -230737 -482366 -611490
10757 -611490 -812475 -814048 -883133 -618841 -673679 -892327 -677197 -587160 -682111 -624028 -416448
10746 -416448 -638962 -743663 -727806 -503384 -207658 -343591 -192738 -182636 -231245 -369314
10736 -369314 -633885 -657089 -645206 -617825 -915237 -917485 -775553 -732552 -623084 -665307 -656672
10725 -656672 -858223 -895406 -554165 -622223 -561852 -557643 -465049 -467276 -521872 -546010 -517656
10714 -517656 -283752 -153170 196857 253111 -43775 -370354 -753955 -793144 -710701 -528410
10704 -528410 -346898 -356592 -478974 -153254 -119987 -126879 -437940 -584534 -779518 -748810 -610382
10693 -610382 -595137 -735053 -971914 -1055420 -786286 -445470 -639863 -563484 -246904 -345288
10683 -345288 -561814 -554898 -629000 -632670 -555373 -275508 -277449 -338041 -594052 -366994 -228792
10672 -228792 -341413 -387842 -502090 -443176 -475763 -607291 -689750 -797625 -569615 -220067
10662 -220067 -204459 -370674 -559143 -735093 -762854 -602643 -399179 -304847 -258138 -337770
10652 -337770 -221165 -252278 -270553 -488968 -535058 -587366 -667501 -418401 -487717 -458730 -446651
10641 -446651 -286564 -50477 -131127 -376422 -586308 -529067 -633750 -840307 -705444 -596453
10631 -596453 -359404 32524 -91199 -311093 -563086 -533686 -622599 -511883 -553574 -648393
10621 -648393 -798292 -694161 -512843 -370485 -360153 -465923 -583366 -505002 -429689 -398101
10611 -398101 -374937 -201162 -600624 -743501 -491121 -220647 -330527 -326566 -321905 -471131
10601 -471131 -326362 -248297 -325268 -266165 -127444 -540247 -768850 -673523 -498436 -85455
10591 -85455 -205090 -507400 -718500 -688065 -353417 -349862 -518958 -612561 -747793 -964401
10581 -964401 -902769 -827049 -497247 -294667 -397342 -432469 -219463 -45807 -75931 -285104
10571 -285104 -302577 -246912 -130682 -272666 -214144 -325628 -237813 -25925 -263454 -508097
10561 -508097 -456924 -472866 -316226 -148181 -157673 -6288 112034 50131 -112764 -607786
10551 -607786 -656141 -338503 -230966 -247311 -552352 -691871 -435524 -307848 -263304 -182157
10541 -182157 -225946 -310964 -424329 -287368 -367136 -428127 -415624 -541090 -554652 -470620 -502370
10530 -502370 -376844 -62971 -228696 -177938 -68976 -142669 -333505 -366202 -138454 -52927
10520 -52927 -199882 -187859 -183816 -355148 -529051 -453508 -356218 -187767 -57194 -228732 -125537
10509 -125537 -244327 -234828 -390980 -547832 -569471 -492237 -628622 -583966 -310716 -395081 -751939
10498 -751939 -1042364 -1107707 -794421 -703208 -765002 -737801 -635379 -497827 -312158 -269044
10488 -269044 -20079 -147745 -177794 -392669 -649779 -697545 -583304 -534017 -423388 -208742
10478 -208742 -316154 -478792 -566684 -585633 -248588 73504 119154 38001 -44064 18131 -15033
10467 -15033 -439912 -433356 -279496 -223637 -373569 -321845 -78778 106791 263147 -36838
10457 -36838 -182538 -317906 -578255 -693710 -318749 -386839 -322744 -191308 -57532 -70887
10447 -70887 -181738 -329935 -117498 190385 184470 -126155 -196377 -248317 -239970 -366082 -655916
10436 -655916 -842696 -908656 -509326 -425760 -451255 -617018 -502773 -436980 -594528 -552327
10426 -552327 -543719 -340877 -348559 -96191 -141645 -427642 -132094 99023 216108 132002 -136479
10415 -136479 -204438 -420324 -324675 16278 8830 -340878 -413003 -353723 -408267 -322004 -362210
10404 -362210 -577380 -387169 -138569 -38628 -343254 -498935 -445735 -267159 -348810 -421772
10394 -421772 -150071 -255793 -314597 -306136 -471971 -436250 -541307 -502704 -515796 -633715 -649866
10383 -649866 -605751 -547473 -424823 -307313 -446056 -608920 -745154 -792614 -819723 -631317
10373 -631317 -214570 -222883 -156439 24062 -118110 -240516 -424934 -281569 -3474 -24238
10363 -24238 -355427 -455194 -454916 -308848 -299869 57666 94658 -12346 -52389 104941 231875
10352 231875 142349 89418 -42312 -173684 -162752 -39439 -32535 -191676 -391121 -270939
10342 -270939 -316097 -512926 -852417 -775698 -881992 -1159412 -1103936 -860974 -504902 -315576
10332 -315576 -590333 -771231 -478826 -166887 -378892 -572634 -442184 -343313 -461138 -660431
10322 -660431 -570699 -105551 114689 145769 76373 228154 15444 -131560 -180564 -260286
10312 -260286 -204952 -57955 -160013 -435459 -415592 -440362 -421415 -526530 -363460 -454124
10302 -454124 -660086 -655587 -505893 -419173 -323049 -453583 -105029 265222 186539 -104735
10292 -104735 -306978 -292248 -220339 -281484 -244431 -155136 -338137 -642534 -540311 -344731
10282 -344731 -476392 -507744 -500761 -489579 -515254 -625633 -761324 -911633 -855788 -657471 -484287
10271 -484287 -188729 -194980 -80162 -79109 -69827 216409 106319 -154398 -481646 -481203 -599752
10260 -599752 -474362 -346034 -337460 -329716 -281897 -200740 -271688 -249643 -214159 -156148 -147142 -367920
10248 -367920 -700080 -614857 -512544 -575991 -494960 -343019 -173807 -300882 -377577 -402043
10238 -402043 -333265 -190219 -282637 -35246 20141 -106081 -258202 -449623 -302812 -541610
$$ [...]
##END NTUPLES=NMR SPECTRUM
##END=
