##TITLE=Analysis number 324042
Compound Code mwp 00044
Project Code adrs
Chemist Name endeavour
##JCAMPDX= 6.0         $$ Bruker NMR JCAMP-DX V2.0
##DATA TYPE= NMR SPECTRUM
##DATA CLASS= NTUPLES
##ORIGIN= Bruker BioSpin GmbH
##OWNER= nmr
$$ XWIN-NMR		Version 3.5
$$ Tue Nov 14 09:39:27 2006 GMT Standard Time (UT+0h)  MAYBRIDGE\nmr@NMR_250MHZ
##.OBSERVE FREQUENCY= 250.131544655141
##.OBSERVE NUCLEUS= ^1H
##.ACQUISITION MODE= SIMULTANEOUS (DQD)
##.ACQUISITION SCHEME= undefined
##.AVERAGES= 16
##.DIGITISER RES= 18
##SPECTROMETER/DATA SYSTEM= dpx250
##.PULSE SEQUENCE= zg30
##.SOLVENT NAME= CDCl3
##.SHIFT REFERENCE= (INTERNAL, CDCl3, 0, 16.451)
##AUDIT TRAIL= $$ (NUMBER, WHEN, WHO, WHERE, WHAT)
$$ ##TITLE= Audit trail, XWIN-NMR		Version 3.5
$$ ##JCAMPDX= 5.01
$$ ##ORIGIN= Bruker BioSpin GmbH
$$ ##OWNER= nmr
$$ C:\u/data/dgb/nmr/ADRS/110/pdata/1/auditp.txt
$$ ##AUDIT TRAIL=  $$ (NUMBER, WHEN, WHO, WHERE, WHAT)
(   1,<2006-11-14 09:38:49.70 +000>,<MAYBRIDGE\nmr>,<NMR_250MHZ>,
      <created by zg, POWCHK disabled, PULCHK disabled
       configuration hash MD5:
       49 4B E0 1D 92 C2 6B 37 9F E6 65 BC 52 41 86 1D
       data hash MD5: 64K
       B3 61 DE 42 3A 54 1A FB C3 3D 0D 6E 1C E1 79 44>)
(   2,<2006-11-14 09:39:08.78 +000>,<MAYBRIDGE\nmr>,<NMR_250MHZ>,
      <Start of raw data processing
       ef LB = 0.3 FT_mod = 6 PKNL = 1 SI = 32K 
       data hash MD5: 32K
       02 B5 A9 02 EE F3 3C 62 91 9D EA EA 1C 94 B4 15>)
(   3,<2006-11-14 09:39:13.15 +000>,<MAYBRIDGE\nmr>,<NMR_250MHZ>,
      <apk 
       data hash MD5: 32K
       2A 6F AB 2A 26 4F 42 3B 92 C8 3A 02 5F 14 B6 03>)
(   4,<2006-11-14 09:39:14.67 +000>,<MAYBRIDGE\nmr>,<NMR_250MHZ>,
      <abs ABSG = 5 
       data hash MD5: 32K
       B4 F6 76 63 0E 35 07 05 39 DC E8 9D 12 C8 C5 22>)
$$ ##END=
$$ 
$$ hash MD5
$$ 97 F5 C5 75 B7 9F 84 34 2A EA EA 63 40 1D 8C 28
##$RELAX= 
##$RELAX= 
##$RELAX= 
##$RELAX= 
##$RELAX= 
##$RELAX= 
##$RELAX= 
$$ Bruker specific parameters
$$ --------------------------
##$DU= <C:\u>
##$EXPNO= 110
##$NAME= <ADRS>
##$PROCNO= 1
##$TYPE= <nmr>
##$USER= <dgb>
##$AMP= (0..31)
100 100 100 100 100 100 100 100 100 100 100 100 100 100 100 100 100 100 
100 100 100 100 100 100 100 100 100 100 100 100 100 100 
##$AQSEQ= 0
##$AQ_mod= 3
##$AUNM= <au_zg>
##$AUTOPOS= <12 >
##$BF1= 250.13
##$BF2= 250.13
##$BF3= 250.13
##$BF4= 250.13
##$BF5= 500.13
##$BF6= 500.13
##$BF7= 500.13
##$BF8= 500.13
##$BYTORDA= 1
##$CFDGTYP= 0
##$CFRGTYP= 5
##$CHEMSTR= <none>
##$CNST= (0..31)
1 1 145 1 1 1 1 1 1 1 1 1 1 1 1 1 1 1 1 1 1 1 1 1 1 1 1 1 1 1 1 1 
##$CPDPRG= <>
##$CPDPRG1= <>
##$CPDPRG2= <>
##$CPDPRG3= <>
##$CPDPRG4= <mlev>
##$CPDPRG5= <mlev>
##$CPDPRG6= <mlev>
##$CPDPRG7= <mlev>
##$CPDPRG8= <mlev>
##$CPDPRGB= <>
##$CPDPRGT= <>
##$D= (0..31)
0 1 0 0 0 0 0 0 0 0.06 0 0 0 0 0 0 0.0002 0 0 0 0 0 0 0 0 0 0 0 0 0 0 
0 
##$DATE= 1163497128
##$DBL= (0..7)
120 120 120 120 120 120 120 120 
##$DBP= (0..7)
150 150 150 150 150 150 150 150 
##$DBP07= 0
##$DBPNAM0= <>
##$DBPNAM1= <>
##$DBPNAM2= <>
$$ [...]
##$SUBNAM7= <"">
##$SUBNAM8= <"">
##$SUBNAM9= <"">
##$SW= 20.6930455092707
##$SWIBOX= (0..15)
0 0 3 0 0 0 0 0 0 0 0 0 0 0 0 0 
##$SW_h= 5175.983436853
##$TD= 65536
##$TD0= 1
##$TE= 683.16
##$TE2= 300
##$TE3= 300
##$TEG= 300
##$TL= (0..7)
0 120 120 120 120 120 120 120 
##$TP= (0..7)
150 150 150 150 150 150 150 150 
##$TP07= 0
##$TPNAME0= <>
##$TPNAME1= <>
##$TPNAME2= <>
##$TPNAME3= <>
##$TPNAME4= <>
##$TPNAME5= <>
##$TPNAME6= <>
##$TPNAME7= <>
##$TPOAL= (0..7)
0.5 0.5 0.5 0.5 0.5 0.5 0.5 0.5 
##$TPOFFS= (0..7)
0 0 0 0 0 0 0 0 
##$TUNHIN= 0
##$TUNHOUT= 0
##$TUNXOUT= 0
##$USERA1= <user>
##$USERA2= <user>
##$USERA3= <user>
##$USERA4= <user>
##$USERA5= <user>
##$V9= 5
##$VALIST= <valist>
##$VCLIST= <CCCCCCCCCCCCCCC>
##$VD= 0
##$VDLIST= <DDDDDDDDDDDDDDD>
##$VPLIST= <PPPPPPPPPPPPPPP>
##$VTLIST= <TTTTTTTTTTTTTTT>
##$WBST= 1024
##$WBSW= 4
##$XGAIN= (0..3)
0 0 0 0 
##$XL= 0
##$YL= 0
##$YMAX_a= 510266
##$YMIN_a= -256738
##$ZGOPTNS= <>
##$ZL1= 120
##$ZL2= 120
##$ZL3= 120
##$ZL4= 120
##$ABSF1= 16.45095
##$ABSF2= -4.242222
##$ABSG= 5
##$ABSL= 3
##$ALPHA= 0
##$AQORDER= 0
##$ASSFAC= 0
##$ASSFACI= 0
##$ASSFACX= 0
##$ASSWID= 0
##$AUNMP= <proc_1d>
##$AZFE= 0.1
##$AZFW= 0.1
##$BCFW= 0
##$BC_mod= 0
##$BYTORDP= 0
##$COROFFS= 0
##$CY= 12.5
##$DATMOD= 1
##$DC= 0
##$DFILT= <>
##$DTYPP= 0
##$F1P= 14.0000005364418
##$F2P= -0.99999901652339
##$FCOR= 0.5
##$FTSIZE= 32768
##$FT_mod= 6
##$GAMMA= 0
##$GB= 0
##$INTBC= 1
##$INTSCL= 1
##$ISEN= 128
##$LB= 0.3
##$LEV0= 0
##$LPBIN= 0
##$MAXI= 10000
##$MC2= 0
##$MEAN= 0
##$ME_mod= 0
##$MI= 0
##$NCOEF= 0
##$NC_proc= -4
##$NLEV= 6
##$NOISF1= 0
##$NOISF2= 0
##$NSP= 0
##$NTH_PI= 0
##$NZP= 0
##$OFFSET= 16.45095
##$PC= 1
##$PHC0= -45.25371
##$PHC1= 9.399369
##$PH_mod= 1
##$PKNL= yes
##$PPARMOD= 0
##$PSCAL= 4
##$PSIGN= 0
##$REVERSE= no
##$SF= 250.130017770987
##$SI= 32768
##$SIGF1= 0
##$SIGF2= 0
##$SINO= 400
##$SIOLD= 32768
##$SREGLST= <1H.CDCl3>
##$SSB= 0
##$STSI= 32768
##$STSR= 0
##$SW_p= 5175.98343685301
##$SYMM= 0
##$S_DEV= 0
##$TDeff= 65536
##$TDoff= 0
##$TI= <Analysis number 999999
Compound Code 99
Book Reference 9
Project Code 9>
##$TILT= no
##$TM1= 0
##$TM2= 0
##$TOPLEV= 0
##$USERP1= <user>
##$USERP2= <user>
##$USERP3= <user>
##$USERP4= <user>
##$USERP5= <user>
##$WDW= 1
##$XDIM= 32768
##$YMAX_p= 326930761
##$YMIN_p= -936790
$$ End of Bruker specific parameters
$$ ---------------------------------
##NTUPLES= NMR SPECTRUM
##VAR_NAME=  FREQUENCY,     SPECTRUM/REAL,   SPECTRUM/IMAG
##SYMBOL=    X,             R,               I
##VAR_TYPE=  INDEPENDENT,   DEPENDENT,       DEPENDENT
##VAR_FORM=  AFFN,          ASDF,            ASDF
##VAR_DIM=   32768,         32768,           32768
##UNITS=     HZ,            ARBITRARY UNITS, ARBITRARY UNITS
##FACTOR=    0.157963299565203, 1,           1
##FIRST=     4114.87657157021, 0,            0
##LAST=      -1061.1068652828, 0,            0
##MIN=       -1061.1068652828, -936790,      0
##MAX=       4114.87657157021, 326930761,    0
$$ Real data points
##PAGE= N=1
##DATA TABLE= (X++(R..R)), XYDATA
$$ [...]
23213b47999K50344K15852k31865j34255J41686J49777j68708m9188K01958p5717
$$ -247999 2345 218197 -13668 -147923 -6237 143540 -25168 -74356 127602 51885
23203E1885j46493o3962J83004j38617k2269j02982j21552K15652K63049o6579
$$ 51885 -94608 -158570 24434 -114183 -136452 -239434 -360986 -145334 117715 51136
23193E1136k52975j08500K3611L6116K21318m9689n4835J5958Q6036J25710R411
$$ 51136 -201839 -310339 -286728 -250612 -29294 -78983 -133818 -117860 -31824 93886 103297
23182A03297q8534m2121L9074J16845Q7809M0894j5942q9546j04782L5001j13437
$$ 103297 14763 -27358 11716 128561 216370 257264 241322 151776 46994 81995 -31442
23171c1442m4135M5720Q1437j38053j20709L9472j93106O0740L4184N6665R9842
$$ -31442 -75577 -29857 51580 -86473 -207182 -167710 -360816 -300076 -265892 -209227 -109385
23160a09385N0478j38917j6166R1279K74974n0887o5846J44517J75511K35821
$$ -109385 -58907 -197824 -213990 -122711 152263 101376 35530 180047 355558 591379
23150E91379j69679l2751k32834j27891J55210J5517j60708j01936J21173J12383
$$ 591379 421700 388949 156115 28224 183434 198951 38243 -63693 57480 169863
23140A69863L9826l397j03158j70122M6752j9227k7121k1533J68100l2196k34591
$$ 169863 209689 206292 103134 -66988 -20236 -39463 -66584 -88117 79983 47787 -186804
23129a86804N2213R8815K03306J72875j22113j33117j92132J456R7003j12741
$$ -186804 -134591 -35776 167530 340405 218292 85175 -106957 -105501 -8498 -121239
23119a21239K03263O4585k39640j47334J11595K2611J4004j74153j22036k313
$$ -121239 82024 146609 -93031 -240365 -128770 -106159 -92155 -266308 -388344 -390657
23109c90657M5993K65409m0612n9641J09964K94320n5424J15852o2916j27312
$$ -390657 -344664 -79255 -119867 -179508 -69544 224776 169352 285204 222288 94976
23099I4976l11882l68196J08741J46668N0127J04827o4439L7737K74537J49964
$$ 94976 -216906 -585102 -476361 -329693 -279566 -174739 -239178 -201441 73096 223060
23089B23060o3765l59196k6700L203Q8579J22220j10352L4554k4365J68231N8141
$$ 223060 159295 -199901 -226601 -223398 -134819 -12599 -122951 -88397 -112762 55469 113610
23078A13610N5868r7038J7368j10893k86989j88749K70446J11492K8341J25745
$$ 113610 169478 72440 89808 -21085 -308074 -496823 -226377 -114885 -86544 39201
23068C9201J85299J7894m00669r2737J0914K05235J04263j67263J17903q7745
$$ 39201 224500 242394 -158275 -251012 -240098 -34863 69400 -97863 20040 -67705
23058f7705k27629N0340j25419J64868K79189L9826k62629l6832K53315J68447
$$ -67705 -295334 -244994 -370413 -205545 73644 113470 -149159 -185991 67324 235771
23048B35771j15217j45267Q2143j02145l08099M1276K49232J02823k26118J84954
$$ 235771 120554 -24713 57430 -44715 -352814 -311538 -62306 40517 -185601 -647
23038f47j43745j8385k2430n0481p7878R0054K33274J61706R7244q9220k41364
$$ -647 -144392 -162777 -185207 -235688 -313566 -223512 9762 171468 268712 179492 -61872
23027f1872J19438m8204j98633Q6754J76108n2734j05242J79205P6196o8729l2887
$$ -61872 57566 9362 -189271 -102517 73591 20857 -84385 94820 171016 102287 69400
23016F9400j18157n2919R9124P1792j55101K41773N9499j75718J184p1457j51460
$$ 69400 -48757 -101676 -2552 69240 -85861 155912 215411 39693 40877 -30580 -182040
23005a82040P9899k07177q0070K11989J99137j04572j22303p6340M7603J11459
$$ -182040 -102141 -309318 -389388 -177399 21738 -82834 -205137 -281477 -233874 -122415
22995a22415J24637J4608M8017K1734q5813p7906J41058K7132P3399P4056j61595
$$ -122415 2222 16830 64847 86581 768 -77138 63920 91052 164451 238507 76912
22984G6912r7287R9280j31283Q0653K86911K03256k08379m55892k29663J03046
$$ 76912 -20375 78905 -52378 28275 315186 518442 310063 -145829 -375492 -272446
22974b72446K84962J64429L7914m2018j35090l7889q5574j31133q189J5017j9922
$$ -272446 12516 176945 214859 172841 37751 -138 -85712 -216845 -225034 -210017 -229939
22963b29939N7372p2040o7031q0357J37152M34971K66892l473j54783k0300j24425
$$ -229939 -172567 -244607 -311638 -391995 -254843 180128 447020 443547 288764 268464 144039
22952A44039j83970k81621J9827J85318P5053J23185L0986J33365K16333j69994
$$ 144039 -39931 -321552 -301725 -116407 -41354 81831 112817 246182 462515 292521
22942B92521k84695p4751L5361j01443k83849J87706K81317k1520j02658k6693
$$ 292521 7826 -66925 -31564 -133007 -416856 -229150 52167 30647 -72011 -98704
22932i8704P3j4069K53499l1938j58480J6760J8664r3851N8137j9339q8499Q6758
$$ -98704 -98631 -112700 140799 108861 -49619 -32859 -14195 -108046 -49909 -69248 -157747 -70989
22920g0989k39374J29596L15861J63958k1691m9083j62114N7169l9219j42050
$$ -70989 -310363 -180767 135094 299052 277361 228278 66164 123333 84114 -57936
22910e7936p8189j52863j87000j26906L24518L49822n7409k92763o066r165j19199
$$ -57936 -136125 -288988 -475988 -602894 -278376 71446 14037 -278726 -284792 -293957 -413156
22899d13156O0192L49819J72337L0359P8511l3406N1714r6702k44434J55032p318
$$ -413156 -352964 -3145 169192 199551 278062 244656 296370 199668 -44766 110266 102948
22888A02948J14275J64058j80844l02298n4023n0854K00440J17645p1258J3103
$$ 102948 217223 381281 200437 -101861 -155884 -206738 -6298 111347 40089 53192
22878E3192K24668k22835l41870k8578R5624L22641Q1421k51386k4089M5099J63359
$$ 53192 277860 55025 -286845 -315423 -219799 102842 184263 -67123 -91212 -46113 117246
22867A17246M3362l66207k46242K26131Q7144R3087J51664p1491j87566J66552
$$ 117246 160608 -205599 -451841 -225710 -138566 -45479 106185 34694 -152872 13680
22857A3680O0388q64L34895m8962k32295L3905M7770N1298r0910J24631j91724
$$ 13680 74068 73204 408099 359137 126842 160747 208517 259815 168905 293536 101812
22846A01812r519J23862n8524j27850J60166o9565l30062n1577r5267k6640L58016
$$ 101812 92293 216155 157631 29781 189947 120382 -209680 -261257 -356524 -383164 -25148
22835b5148K10056K3855M0776l8174l26945k23206j2103R0239R8297N76N4124
$$ -25148 184908 208763 249539 211365 -115580 -338786 -350889 -260650 -162353 -161777 -107653
22824a07653J94619Q3220R9404J67256K3371j99969r7401m423o7463o4703J95627
$$ -107653 86966 170186 269590 436846 460217 260248 162847 158424 90961 26258 221885
22813B21885J26011k40780l01741j24199j80109J37798P3130l19988J57654K12117
$$ 221885 347896 107116 -194625 -318824 -498933 -361135 -288005 -607993 -450339 -238222
22803b38222L5695J65659L6714O1722j56468J65766P8472Q1489k8242J09039M225
$$ -238222 -202527 -36868 -154 61568 -94900 70866 149338 230827 202585 311624 315849
22792C15849l5991K24303j70444k71472m1400j21709l3175J7043K30441K12100
$$ 315849 279858 504161 333717 62245 20845 -100864 -134039 -116996 113445 325545
22782C25545J89455j61255k37797k41050j22283K09683m4868m53949k138K59579
$$ 325545 515000 353745 115948 -125102 -247385 -37702 -82570 -536519 -538657 -279078
22772b79078K82145K12984j00472j52581l7078o9061J49899L04029J45053l6107
$$ -279078 3067 216051 115579 -37002 -74080 -143141 6758 310787 455840 419733
22762D19733j40623R7704k2616o4519o4473l44700O6957M5714k54749K66388L45832
$$ 419733 279110 376814 354198 289679 225206 -119494 -52537 -6823 -261572 4816 350648
22751C50648J29107m24468m91919N3806J7844J8006j55156q8285J78514K11078
$$ 350648 479755 55287 -436632 -382826 -364982 -346976 -502132 -590417 -411903 -200825
22741b00825m0961n801J73847J12850J06479Q8179l47289j68389J7003K02462
$$ -200825 -241786 -247587 -73740 39110 145589 233768 -113521 -281910 -264907 -62445
22731f2445P0418o671j0642k10171o4612K42123J00571n4114j79639j2327P9468
$$ -62445 7973 1302 -9340 -219511 -284123 -42000 58571 4457 -175182 -187509 -108041
22720a08041J00905Q7716l59765o9313N60926K10222J41743q2482k48451j65233
$$ -108041 -7136 80580 -279185 -348498 212428 422650 564393 481911 233460 68227
22710F8227j01287k19388J4074K38380J69893J19556K1668P7962o4117q6708l85734
$$ 68227 -33060 -252448 -238374 6 169899 289455 311123 389085 324968 238260 -147474
22699a47474r3807J3526J61980O734j5072L05720m8049k49136m87064K51161J50884
$$ -147474 -241281 -227755 -65775 -59041 -74113 231607 183558 -65578 -552642 -301481 -150597
22688a50597P765j26529P9291j6881m488K6260O5850j43649p3781J58119j68222
$$ -150597 -142832 -269361 -190070 -206951 -211439 -185179 -119329 -262978 -336759 -178640 -346862
22677c46862J14775M8691j35895J66751J30689k22902J785J62473L0156j63920
$$ -346862 -232087 -183396 -319291 -152540 -21851 -244753 -242968 -80495 -50339 -214259
22667b14259j22164j43287J63715K68195R3549j19445K13944J19085Q7921J27716
$$ -214259 -336423 -479710 -315995 -47800 45749 -73696 140248 259333 347254 474970
22657D74970j22631q2094j8166j811N1265p3596N3171n8507k68710J9372M6146
$$ 474970 352339 270245 252079 250268 301533 227937 281108 222601 -46109 -26737 19409
22646A9409j67635j17991j50357K7741p6946j57726n6665J51864J78401L60596
$$ 19409 -148226 -266217 -416574 -388833 -465779 -623505 -680170 -528306 -349905 10691
22636A0691L12335l3147l1675m660Q0497R6018j79906k33307j15102O1991P2387
$$ 10691 323026 289879 258204 253544 334041 430059 250153 16846 -98256 -36265 36122
22625C6122k36015j27725o1505K01753L97759j42397j11585Q5130K75375n5852
$$ 36122 -199893 -327618 -389123 -187370 210389 67992 -43593 41537 316912 261060
22615B61060j26784j23485p5129Q2450p0724j6322J80845J62817j9711k78105
$$ 261060 134276 10791 -64338 18112 -52612 -68934 111911 274728 255017 -23088
22605b3088j46080K51402j7795O8740K80728j42496k29292j2678J57012j6038
$$ -23088 -169168 82234 64439 133179 413907 271411 42119 29441 186453 170415
22595A70415j80569N3396k07565M0175K26206j8214j2693j09084K7200J75864
$$ 170415 -10154 43242 -164323 -124148 102058 83844 71151 -37933 -10733 165131
22585A65131K82633k08167k6361r2937o1333j1598j98371L5406r6030p8641N0917
$$ 165131 447764 239597 213236 120299 58966 47368 -151003 -115597 -211627 -290268 -239351
22574b39351L58400l7439m28927m0777J32755L76362L69131j39656l33916L7721
$$ -239351 119049 81610 -347317 -388094 -255339 121023 490154 350498 16582 54303
22564E4303j2539J54153K15310j64926j68824k9654N0090R9422r4825O8510J36037
$$ 54303 41764 195917 411227 246301 77477 47823 97913 197335 102510 171020 307057
22553C07057o98j84432r4077o546k07465j34622L24760L5993k18558j46095j05914
$$ 307057 306359 121927 27850 21304 -186161 -320783 3977 39970 -178588 -324683 -430597
22542d30597k09379j02544M2332R4240J43003L46554k339k68219j09608j02883
$$ -430597 -639976 -742520 -700188 -605948 -462945 -116391 -118730 -386949 -496557 -599440
22532e99440K64741O9613J58841N4644L8122k6275k85380o0824J69576J12707
$$ -599440 -334699 -265086 -106245 -51601 -13479 -39754 -325134 -385958 -216382 -103675
22522a03675j2140J27354l34512p9198P9260O3744K3750O9215P9894j29571j94330
$$ -103675 -115815 11539 -322973 -402171 -322911 -259167 -235417 -166202 -86308 -215879 -410209
22511d10209K50647M1503k66441P769K74808J50789k365R6527N3568J22529j98709
$$ -410209 -159562 -118059 -384500 -376731 -101923 48866 46501 143028 196596 319125 120416
22500A20416j05310q1811j75036N0150P8024K17823Q8148j16086k72433r6215
$$ 120416 15106 -66705 -241741 -191591 -113567 104256 192404 76318 -196115 -292330
22490b92330l0732M1203k7743O1890J83876K91632J58372o250k45068j58925Q7723
$$ -292330 -323062 -281859 -309602 -247712 -63836 227796 386168 379918 134850 -24075 63648
22479F3648L2018Q6869M194j08222j94300p3990L7916L00905J67647J40198k02054
$$ 63648 95666 182535 186729 78507 -115793 -189783 -151867 149038 316685 456883 254829
22468B54829L9359q4689j88668k307J68428O6133R9964o9814n076r6693q3594
$$ 254829 294188 209499 20831 18524 186952 253085 353049 283235 278159 181466 97872
22457I7872n9509k2953j21444O3363j88502M1126L02288K45961j98178l06147
$$ 97872 38363 15410 -106034 -42671 -231173 -190047 112241 358202 160024 -146123
22447a46123j00495K0701L6822J79848J43110p177N4883O6001j13082j78036O375
$$ -146123 -246618 -225917 -189095 -9247 133863 126686 181569 247570 134488 -43548 -37173
22436c7173K70429j10293k54212J0685J46813J5968K47320n0197k06009k01130
$$ -37173 233256 122963 -131249 -120564 26249 42217 289537 239340 33331 -167799
22426a67799K8856k8002n1021K69623J3124r3176p7100N5161R2049k8799N9456
$$ -167799 -138943 -166945 -217966 51657 64781 -28395 -105495 -50334 41715 12916 72372
22415G2372O0737k04754k33377Q6300n1094o6300J08985J62833p5751J8024K19054
$$ 72372 133109 -71645 -305022 -218722 -269816 -336116 -227131 -64298 -140049 -122025 97029
22404I7029r3580j4353r0865O1214K05537l3311k20573n5315J34134q5413J19668
$$ 97029 3449 -10904 -101769 -40555 164982 131671 -88902 -144217 -10083 -95496 24172
22393B4172j57651K1283J27706N2075R97j6940K0586J5702r2383l4942P9746j57087
$$ 24172 -133479 -112196 15510 67585 68582 51642 72228 87930 -4453 -39395 40351 -116736
22381a16736k75666Q2281J38165j1237K6043j23695j58509m8254R5913J11835
$$ -116736 -392402 -310121 -171956 -183193 -157150 -280845 -439354 -487608 -391695 -279860
22371b79860O2774K1731J87734J51507j37134k18349j04181M42542O5532J09508
$$ -279860 -217086 -195355 -7621 143886 6752 -211597 -315778 126764 192296 301804
22361C01804k42334j89510j79358L18492M5102M2649k700k080J01795Q5727l00717
$$ 301804 59470 -130040 -309398 9094 54196 96845 94145 92065 193860 279587 -21130
22350b1130l54184J02471k0024R6230K40778L4611j64406j02601O884L53436J36201
$$ -21130 -375314 -272843 -292867 -196637 44141 78752 -85654 -188255 -181371 172065 308266
22339C08266p8806j9260m05140k84515J07095K02727j69396K17237J59047l9764
$$ 308266 229460 210200 -194940 -479455 -372360 -169633 -339029 -121792 37255 -2509
22329b509k7907j69436l6237j01693J83113O4773k38164O792N9965m1169m5014
$$ -2509 -30416 -199852 -236089 -337782 -154669 -89896 -328060 -321268 -261303 -302472 -347486
22318c47486J70049L80204k8082l16405L618p6521r0426N400J62520n8865L4314
$$ -347486 -177437 202767 174685 -141720 -138102 -214623 -305049 -299649 -137129 -195994 -161680
22307a61680J10410P2867j07320j52422k00370j07514q2509K35527L88515K41576
$$ -161680 -51270 21597 -85723 -238145 -438515 -546029 -628538 -393011 -4496 237080
22297B37080r511q3751K3010n8873j20328j75058K2575J70691J65651j94k47666
$$ 237080 227569 143818 166828 107955 -12373 -187431 -164856 5835 171486 171292 -76374
22286g6374J9120j2278j83998j28444J00967L32626N6390k33575j45289o764R65
$$ -76374 -57254 -69532 -253530 -381974 -281007 51619 108009 -125566 -270855 -277619 -276654
22275b76654L8937K24811Q7915j61830l02309r904K47310K69363K5854n5698J09489
$$ -276654 -237717 -12906 75009 -86821 -389130 -399034 -151724 117639 143493 87795 197284
22264A97284L3210m1630J27914O9519k68257j64182q2482j2955R1430l3779j37240
$$ 197284 230494 188864 316778 386297 118040 -46142 -128624 -141579 -50149 -83928 -221168
22253b21168l6638o9822j99133K8702J50951J01675N6787m9593l1383K03841R3097
$$ -221168 -257806 -327628 -526761 -498059 -347108 -245433 -188646 -238239 -269622 -65781 27316
22242B7316K2035j90596K0648j79028j08162M7450J27266o7228j94399m2105J39419
$$ 27316 49351 -141245 -120597 -299625 -407787 -360337 -233071 -300299 -494698 -536803 -397384
22231c97384J34284K7505j71965J69622Q3496K8853J47181R9547r0498o3002P1370
$$ -397384 -263100 -235595 -407560 -237938 -154442 -125589 21592 121139 30641 -32361 39009
22220C9009J38221J03859k9459k09754P2054M9038m215o4504j7693j99629J62051
$$ 39009 177230 281089 251630 41876 113930 162968 158753 94249 76556 -123073 38978
22209C8978M9890n9960J90454K79260j12549j71844n0886K10548P5120j93681
$$ 38978 88868 28908 219362 498622 386073 214229 163343 373891 449011 255330
22199B55330q4836J44210k1092J67038j30919j36417j50150K2384L94501J52042
$$ 255330 170494 314704 293612 460650 329731 193314 43164 65548 460049 612091
22189F12091j75643k87234k9265K567l6499q7313m3282p9795R4836j82853K1027
$$ 612091 436448 149214 119949 122516 86017 -1296 -44578 -124373 -29537 -212390 -191363
22178a91363K12070J3390o4732L37622J30077k86233l25285j06962K99474l0826
$$ -191363 20707 34097 -30635 306987 437064 150831 -174454 -281416 18058 -12768
22168a2768n0171k726J79821R8782L4119j5717J18071p8431k86573j95860J0607
$$ -12768 -62939 -65665 114156 212938 247057 231340 349411 270980 -15593 -211453 -200846
22157b00846O4599l7270Q917O1608j2829j18630K56352M8432j3846k91185O15
$$ -200846 -136247 -173517 -164600 -102992 -115821 -234451 21901 70333 56487 -234698 -234083
22146b34083K25922o2444j80526j7446L8557J47119K04557o1342j05123m2716
$$ -234083 -8161 -70605 -251131 -268577 -230020 -82901 121656 60314 -44809 -87525
22136h7525l7177q1854j31519J12041k1540K23900L7225M862M0650K78980R047
$$ -87525 -124702 -206556 -338075 -226034 -247574 -23674 13551 18413 59063 338043 347090
22125C47090k53373k10127M3320l7479J72460J74878k51586k04399j34332j08894
$$ 347090 93717 -116410 -73090 -110569 61891 236769 -14817 -219216 -353548 -462442
22115d62442J26381N18M6522Q1911K18429R6826k6217J61096L9820l05124j93704
$$ -462442 -336061 -335543 -289021 -207110 11319 108145 81928 243024 282844 -22280 -215984
22104b15984l72309J58832J28780N3555K73625K49352J53584j54741l30911r7734
$$ -215984 -588293 -429461 -300681 -247126 26499 275851 429435 274694 -56217 -153951
22094a53951n8721m6469N6185J8415j31400J2256K01688J70004j63106k0981O9789
$$ -153951 -212672 -259141 -202956 -184541 -315941 -303685 -101997 68007 -95099 -116080 -46291
22083d6291j03243k0084L62955L01658j02980l933N9001k82169j68719k19874
$$ -46291 -149534 -169618 193337 494995 392015 388082 447083 164914 -3805 -223679
22073b23679r5148L3285P7131J08650J274q1386k9289K16797L86128J28523r8272
$$ -223679 -318827 -285542 -208411 -99761 -98487 -179873 -209162 7635 393763 522286 424014
22062D24014k23744K2614n8066K11223J06075j44024r0465m9932j9647J71729
$$ 424014 200270 222884 164818 376041 482116 338092 247627 197695 178048 349777
22052C49777j13478j99866k00684P5542J17843L7772Q7196M7576Q2969O20j69936
$$ 349777 236299 36433 -164251 -88709 29134 66906 154102 201678 284647 285267 115331
22041A15331j48757j49670L8264m4321k8426J18014k2482N3293n0155Q344N3159
$$ 115331 -33426 -183096 -144832 -189153 -217579 -99565 -122047 -68754 -118909 -110565 -57406
22030e7406J96409O5849k53975k668J39987J59053m58997j58514j20381L8069
$$ -57406 139003 204852 -49123 -51791 88196 247249 -211748 -370262 -490643 -452574
22020d52574R8606K52159N9726j06858R2626M8675J31721M7289J33040L0927j06187
$$ -452574 -353968 -101809 -42083 -148941 -56315 -7640 124081 171370 304410 335337 229150
22009B29150j48864j46429J64342J11626K2461k91098j39246m3438n267p4645
$$ 229150 80286 -66143 98199 209825 232286 -58812 -198058 -241496 -246763 -321408
21999c21408P9384K92583J76897r4021l43584J06131J65491m2633J58262M15712
$$ -321408 -242024 50559 227456 133435 -210149 -104018 61473 18840 177102 592814
21989E92814j44916k77275j16355N8089k06089K2533p6722k65592j56458J87788
$$ 592814 447898 170623 54268 112357 -93732 -71199 -147921 -413513 -569971 -382183
21979c82183K02073K22402k3257N051p8968n5207O5859Q2190r7743j13456J18321
$$ -382183 -180110 42292 19035 24086 -54882 -110089 -44230 37960 -59783 -173239 -54918
21968e4918J85816j254J13355M6109k2589j1850j11547j48342r1160l8354K3132
$$ -54918 130898 129644 242999 289108 266519 254669 143122 -5220 -96380 -134734 -111602
21957a11602L12230R3611l49880p7549J47702J62439p5327r7216K5860n670J2370
$$ -111602 200628 294239 -55641 -133190 14512 176951 101624 4408 30268 24598 36968
21946C6968j45798j95644N4735J33749p5264j86357K14374N4396K03220j59270
$$ 36968 -108830 -304474 -249739 -115990 -191254 -377611 -163237 -108841 94379 -64891
21936f4891J17557n9601L7147J66962R9647o4942j76774j92657l0072J43071K51026
$$ -64891 52666 -6935 30212 197174 296821 231879 55105 -137552 -167624 -24553 226473
21925B26473K77013l09893k29712j11494j71083K8458J79919q2648j44810J04222
$$ 226473 503486 193593 -36119 -147613 -318696 -290238 -110319 -192967 -337777 -233555
21915b33555k90160R0387J52431o3569k88396J80007L13927q1714N2413L864M8412
$$ -233555 -523715 -433328 -280897 -344466 -632862 -452855 -138928 -220642 -168229 -164365 -115953
21904a15953J28273J39685k25946p9576L43937K18880O729k10406k06532J19009
$$ -115953 12320 152005 -73941 -153517 190420 409300 416029 205623 -909 118100
21894A18100K62615J70482k53205j82031j51955k23932O3466J64710J39169k1331
$$ 118100 380715 551197 297992 115961 -35994 -259926 -196460 -31750 107419 86088
21884H6088P2355o0962j91964l49139k24199J36952Q4105K23557M6754J5146O2861
$$ 86088 158443 97481 -94483 -443622 -667821 -530869 -446764 -223207 -176453 -161307 -98446
21873i8446J52182q4204j7223j62363j19925J72542J43984r2191r9465q9963J95159
$$ -98446 53736 -30468 -47691 -210054 -329979 -157437 -13453 -105644 -205109 -295072 -99913
21862i9913n8952n0182J78822j4581j35159j06239J9458J25095J91038J08287
$$ -99913 -158865 -209047 -30225 -44806 -179965 -286204 -266746 -141651 49387 157674
21852A57674q6600j75786r0528J23831J49444n6449N3382J17179q4952q7614N7447
$$ 157674 71074 -104712 -195240 -71409 78035 21586 74968 192147 107195 19581 77028
21841G7028J18541j73093j14307P0275J77973O7486o2169O1826l2182l32980k3667
$$ 77028 195569 22476 -91831 -21556 156417 223903 161734 223560 191378 -141602 -165269
21830a65269K34024J44285l17955j69533N1526J84606J38660M2415J05126l28323
$$ -165269 68755 213040 -104915 -274448 -222922 -38316 100344 142759 247885 -80438
21820h0438j07057L90093K42116l33005j56242Q7636k7348l911j0592k95765n6912
$$ -80438 -187495 202598 444714 111709 -44533 43103 15755 11844 1252 -294513 -351425
21809c51425J49110K3822k09925j5602J37496N5545n9813k20143J1389O0423K60781
$$ -351425 -202315 -178493 -388418 -404020 -266524 -210979 -270792 -490935 -479546 -419123 -158342
21798a58342L14401j14323o0309p8312J40970J10311J3065p5162J24786K39484
$$ -158342 156059 41736 -18573 -96885 44085 154396 167461 92299 217085 456569
21788D56569L8970k36902k75016j13993K04447o0107l67293j22002O6534R2667
$$ 456569 495539 258637 -16379 -130372 74075 13968 -353325 -475327 -408793 -316126
21778c16126J52660n281J14514j62219K3513L62251j99062q3290m2754r096m6594
$$ -316126 -163466 -168747 -54233 -216452 -192939 169312 -29750 -113040 -155794 -164890 -211484
21767b11484m6279m5411r8563L6540K11246l2030j00622J4190K34117J81323j00495
$$ -211484 -257763 -303174 -401737 -365197 -153951 -185981 -286603 -272413 -38296 143027 42532
21756D2532K0339J80262j61145K2051O5121K9221N5948K9414J2201J61481n1620
$$ 42532 62871 243133 81988 104039 169160 198381 254329 283743 295944 457425 405805
21745D05805k42899k61009k89118J85729R8878K29201K8856j33217p3744q6362
$$ 405805 162906 -98103 -387221 -201492 -102614 126587 155443 22226 -51518 -137880
21735a37880j40755M4254K6734P8706Q6012k14272q5747n4038l8251r4718J92637
$$ -137880 -278635 -234381 -207647 -128941 -42929 -257201 -342948 -396986 -435237 -529955 -337318
21724c37318j30078J10400M9142L4732J30336K28135J02586P7057k26020k05864
$$ -337318 -467396 -356996 -307854 -273122 -142786 85349 187935 264992 38972 -166892
21714a66892j80266o1130J41566L2513N7086l7002p8623j0743N5837L2408N4387
$$ -166892 -347158 -408288 -266722 -234209 -177123 -214125 -292748 -303491 -247654 -215246 -160859
21703a60859N6100K18884K13983j72826r9436O9397R3806L7234k66681p2355J11586
$$ -160859 -104759 114125 328108 155282 55846 125243 219049 256283 -10398 -82753 28833
21692B8833k2510l5364J40119j225m6905J05093P8712K00052j44055l650q6772
$$ 28833 6323 -29041 111078 109853 62948 168041 246753 446805 302750 299100 212328
21681B12328j01164J7415j58964J19474K17637k60852k57781K0249L2763K00099
$$ 212328 111164 128579 -30385 89089 306726 45874 -211907 -191658 -158895 41204
21671D1204k893l26237j4360L03878J98604m6966N9784L7543J05724k80908j56830
$$ 41204 38311 -287926 -302286 1592 200196 153230 213014 250557 356281 75373 -81457
21660h1457O1849j01669J27535m0151r637J05129n3063j03760J68150J03770o8322
$$ -81457 -19608 -121277 6258 -33893 -43530 61599 8536 -95224 72926 176696 108374
21649A08374k10495m2881N7502O9192Q7636J64494K1710j8372J62743J98659M545
$$ 108374 -102121 -145002 -87500 -18308 69328 233822 255532 237160 399903 598562 603107
21638F03107K6872p722j91730r3357L6314j42813r3849j4925L7865o5770J18946
$$ 603107 629979 622257 430527 337170 373484 230671 136822 121897 159762 93992 212938
21627B12938N1525K6954n8882M4504l1243o0565L5925N9368J57987j5555l45615
$$ 212938 264463 291417 232535 277039 245796 185231 221156 280524 438511 422956 77341
21616G7341k98009J38631J34848q0883m5785K03937K25264P1975L7542j03479
$$ 77341 -220668 -82037 52811 -28072 -73857 130080 355344 427319 464861 361382
21606C61382j62200j33870r3184k47879q0818J14664l5777K25887O1550k10698
$$ 361382 199182 65312 -27872 -275751 -356569 -241905 -277682 -51795 9755 -200943
21596b00943J29057J83894J857j52148j80135J61302K11785J9843J0732L629r5670
$$ -200943 -71886 112008 113865 -38283 -218418 -57116 154669 174512 185244 188873 93203
21585I3203o5036j5465j07784j31123j15894L5412J17173M5533J93986J33178
$$ 93203 28167 12702 -95082 -226205 -342099 -306687 -189514 -143981 50005 183183
21575A83183j49023j49991N7794Q1977m5477Q065K0752M8835j14926Q4272K15952
$$ 183183 34160 -115831 -58037 23940 -21537 -13472 7280 56115 -58811 25461 241413
21564B41413o4358r2239q9172J09866j66007k10360k50969k5843K24818J08934
$$ 241413 177055 84816 -4356 105510 -60497 -270857 -521826 -547669 -322851 -213917
21554b13917L9264M663J585l6195q537j042J27940K24273Q940j0916k60352l40736
$$ -213917 -174653 -169990 -168405 -204600 -213137 -214179 -86239 138034 146974 136058 -124294 -465030
21542d65030L3387J03465K33371J78911J1748K5100l64363j3002J65792J09837
$$ -465030 -431643 -328178 -94807 84104 95852 120952 -243411 -256413 -90621 19216
21532A9216n8733k0420O0298j18368k60972L5094m3379N9371K18431p1896J29318
$$ 19216 -39517 -59937 361 -118007 -378979 -343885 -387264 -327893 -109462 -181358 -52040
21521e2040l3236P2994Q3202j19430j46972J50776O1693r6879j06643j03849n6290
$$ -52040 -85276 -12282 70920 -48510 -195482 -44706 16987 -79892 -186535 -290384 -346674
21510c46674j60129J43833o3731m1772n5762N0754K65352K70749J9420r9560j60434
$$ -346674 -506803 -362970 -426701 -468473 -524235 -473481 -208129 62620 82040 -17520 -177954
21499a77954J30498J19469j88730J01857K6665k00931J25353R9168k03053j3863
$$ -177954 -47456 72013 -116717 -14860 11805 -189126 -63773 35395 -167658 -181521
21489a81521j16461O1242J9062j22301M4214K79047K70828o8352j33030n9359
$$ -181521 -297982 -236740 -217678 -339979 -295765 -16718 254110 185758 52728 -6631
21479f631K21814K27294n0479k03007j49002J03397j5010n1870J73770j42985
$$ -6631 215183 442477 391998 188991 39989 143386 128376 76506 250276 107291
21469A07291j77385k59073O4590o116o193J16874M4682k1339r777L04101L4920
$$ 107291 -70094 -329167 -264577 -270693 -276886 -160012 -115330 -136669 -146446 157655 192575
21458A92575j51549j04481j43593K35674N30236j48210k14654p1821O9684L5637
$$ 192575 41026 -63455 -207048 28626 558862 410652 195998 124177 193861 229498
21448B29498j47368p0538l08361r2621P0543J1133Q5012j38804K01502L56922
$$ 229498 82130 11592 -296769 -389390 -318847 -307714 -222702 -361506 -160004 196918
21438A96918M9987k78495j0095j3025k1740J09861K90159r3836k25567j82244
$$ 196918 246905 -31590 -41685 -54710 -76450 33411 323570 229734 4167 -178077
21428a78077O6424J45544j46112q4886N2536j0704j15569Q0858L5122M0422N9629
$$ -178077 -111653 33891 -112221 -197107 -144571 -155275 -270844 -189986 -154864 -114442 -54813
21417e4813K23496K9248j07888m7201j67378J45558J67918J10698j31906l03552
$$ -54813 168683 197931 90043 42842 -124536 21022 188940 299638 167732 -135820
21407a35820j39148K01959L1104k9121m0743M9413J84888j34509j41842k9205
$$ -135820 -274968 -73009 -41905 -71026 -111769 -62356 122532 -11977 -153819 -183024
21397a83024K38598N4651j71691j06477K5420Q4080j64099k20401k01590P8136
$$ -183024 55574 110225 -61466 -167943 -142523 -58443 -222542 -442943 -644533 -566397
21387e66397P4999J05988M6436j09569R6616K00126K02259J53598n9916j21156
$$ -566397 -491398 -385410 -338974 -448543 -351927 -151801 50458 204056 144140 22984
21377B2984l22118p1133O1788J94729L0670n4831p5113L4040O9797J90075j49910
$$ 22984 -299134 -370267 -308479 -113750 -83080 -137911 -213024 -178984 -109187 80888 -69022
21366f9022k51712q7748P1239L54562J76401l3291O926Q0809J07322m90946K6145
$$ -69022 -320734 -408482 -337243 17319 193720 160429 167355 248164 355486 -135460 -109315
21355a09315q78J01616K49418j01720k98981m2187m837j8159J33069k09918j3224
$$ -109315 -110193 -8577 240841 139121 -159860 -202047 -206884 -225043 -91974 -301892 -315116
21344c15116J37338p9334j10124m6019J0402L59226n4869k41526J9529K85752
$$ -315116 -177778 -257112 -367236 -413255 -402853 -43627 -98496 -340022 -320493 -34741
21334c4741J43979K55123j55196j68740j74790j38854K73951K90034m956k29023
$$ -34741 109238 364361 209165 40425 -134365 -273219 732 290766 285810 56787
21324E6787L508J50032q7711M5821j50307m2127N0651J42042K0134j14547K20591
$$ 56787 60295 210327 122616 168437 18130 -23997 26654 168696 188830 74283 294874
21313B94874j87797k17708l67477Q4044L00719M0907j85671l84564N1498K28843
$$ 294874 107077 -110631 -478108 -394064 -93345 -52438 -238109 -622673 -571175 -342332
21303c42332M309K68967l7965q3263J96340J20301j58757k66760K43503R90N071
$$ -342332 -338023 -69056 -107021 -190284 6056 126357 -32400 -299160 -55657 -54667 -49596
21292d9596J96349J39611J45647j7532k30020j44033K16339k4916o4428j31143
$$ -49596 146753 286364 432011 414479 184459 40426 256765 231849 167421 36278
21282C6278k21661Q8926N8248o9565J46411Q1299Q2505O5230j23818j84274j78102
$$ 36278 -185383 -96457 -38209 -107774 38637 119936 202441 267671 143853 -40421 -218523
21271b18523p2478K46112k5929j12822j22597K66552K75832J23823l14294k55687
$$ -218523 -291001 -44889 -70818 -183640 -306237 -39685 236147 359970 45676 -210011
21261b10011j8136K01944K22472J31671J03849k40647k35816J6094j57810j10298
$$ -210011 -228147 -26203 196269 327940 431789 191142 -44674 -28580 -186390 -296688
21251b96688m7623J12834J02459J80690J61472L5778j02945J33602K50973Q2550
$$ -296688 -344311 -231477 -129018 51672 213144 248922 145977 279579 530552 613102
21241F13102j66210m89909J1703K41473j11856J64779j49991l08401K3049K79278
$$ 613102 446892 -43017 -31314 210159 98303 263082 113091 -195310 -172261 107017
21231A07017K27889n4091J97043j34615j04763L9636O9502j9722k26890k40890
$$ 107017 334906 280815 477858 343243 238480 278116 347618 327896 101006 -139884
21221a39884K11671j09584k17123j0491J72049K07875R853J4129K16018M3415
$$ -139884 71787 -37797 -254920 -265411 -93362 114513 124366 138495 354513 397928
21211C97928m724L028o5807m4176n3170j14498l73275j25091J55853L02063K3980
$$ 397928 393204 396232 330425 286249 233079 118581 -254694 -379785 -223932 78131 102111
21200A02111j13428M4839J42261L0935k10565k30496J23639J75953K56132j00945
$$ 102111 -11317 33522 175783 206718 -3847 -234343 -110704 65249 321381 220436
21190B20436J5114j1888k9012j54552P8536J68545J21653j17205k36127j24214
$$ 220436 235550 223662 194650 40098 118634 287179 408832 291627 55500 -68714
21180f8714l7347q1312j97295Q7703L21025j18778N5610N5061p3726R260P5810
$$ -68714 -106061 -187373 -384668 -296965 24060 -94718 -39108 15953 -57773 -48513 27297
21169B7297P8393R70l62666j22945M7249M8982kJ04140k0964j30566n950Q4593
$$ 27297 105690 106660 -256006 -378951 -331702 -282720 -282722 -178582 -199546 -330112 -336062 -251469
21157b51469M1105J65566k08784p6955O1065j11761K8272N7919L9710l8575O6169
$$ -251469 -210364 -44798 -253582 -330537 -269472 -381233 -352961 -295042 -255332 -293907 -227738
21146b27738l0903J11749K71968k81409j58813O6139M1415J63537J1901k05030
$$ -227738 -258641 -146892 125076 -156333 -315146 -249007 -207592 -44055 -32154 -237184
21136b37184Q1591K9889J11679k7329p9362M367j43207r3267J30632m4201J8741
$$ -237184 -155593 -125704 -14025 -41354 -120716 -116349 -259556 -352823 -222191 -266392 -247651
21125b47651J43674j2691K2364K2515K82235K5528l1205J43901n50l38371l23991
$$ -247651 -103977 -116668 -94304 -71789 210446 235974 204769 348670 348120 9749 -314242
21114c14242n4775k49586J48901K41836L13582j2120k04961M4996J04890q2729
$$ -314242 -369017 -618603 -469702 -227866 85716 73596 -131365 -86369 18521 -64208
21104f4208O8270J20154l27224k19909J46465J70813j8899K9747j9620o9844q7811
$$ -64208 4062 124216 -203008 -422917 -276452 -105639 -124538 -94791 -114411 -184255 -272066
21093b72066Q8965M0911L8759j74743J0765J25863J7865J66577K6841n8387r7025
$$ -272066 -183101 -142190 -103431 -278174 -267409 -141546 -123681 42896 69737 11350 -85675
21082h5675N252J49015j33307p3613q2137p0504n8530J18133J90004L9384O1890
$$ -85675 -80423 68592 -64715 -138328 -220465 -290969 -349499 -231366 -41362 -1978 59912
21071E9912j67010l7436P425j23690l8783j13755M08204N7318j24255q280j31803
$$ 59912 -107098 -144534 -137109 -260799 -299582 -413337 -5133 52185 -72070 -80350 -212153
21060b12153j11398j06818K67343J89297J48107j48836r1833R8788q9480k18248
$$ -212153 -323551 -430369 -163026 26271 174378 25542 -66291 32497 -56983 -275231
21050b75231N6555J39668J48187q8179r6625j7199J81521R1469k37440n7784Q0626
$$ -275231 -218676 -79008 69179 -19000 -115625 -132824 48697 140166 -97274 -155058 -74432
21039g4432L9432l7356J25035J25440j90047j80160n9542o5622K13011K77723
$$ -74432 -35000 -72356 52679 178119 -11928 -192088 -251630 -317252 -104241 173482
21029A73482K4838p7493j8525L8365j74j82972j41217n5986J47003J25383J92128
$$ 173482 198320 120827 102302 140667 140493 -42479 -183696 -239682 -92679 32704 224832
21018B24832J7093N549j25412m7743m9541k27866n5867k2659r6760j0248j09653
$$ 224832 241925 247474 122062 74319 24778 -203088 -258955 -281614 -378374 -388622 -498275
21007d98275j714K03904m6306N222J07398J46146K7340k17072M2847L659r1852
$$ -498275 -499989 -296085 -342391 -337169 -229771 -83625 -56285 -273357 -230510 -226851 -318703
20996c18703l2668J07681N1956r9062j6600j27155N2984N6496L1785M4747J55054
$$ -318703 -351371 -243690 -191734 -290796 -307396 -434551 -381567 -325071 -293286 -248539 -93485
20985i3485k0399j50879j20449K2973J91698j20809l765J22402L06517K42438
$$ -93485 -113884 -264763 -385212 -362239 -170541 -291350 -295115 -172713 133804 376242
20975C76242j21533j64566k02159O7925R925J44647j20411Q5223J49745R3143
$$ 376242 254709 90143 -112016 -44091 -34166 110481 -9930 75293 225038 318181
20965C18181N5213o774R6906m190j09608L6385o3235j08507J8035r0k2946k96705
$$ 318181 373394 366620 463526 459336 349728 386113 322878 214371 232406 232316 209370 -87335
20953h7335m7556J11876J1297o1017P2106O4678j39079Q312P8672M069J0177j06678
$$ -87335 -134891 -23015 -11718 -72735 -629 64049 -75030 -66718 11954 16023 26200 -80478
20941h0478r446j87068J96948k1234l01854J30021K14534L3451p759L1874p5133
$$ -80478 -89924 -276992 -80044 -101278 -403132 -273111 -58577 -25126 -32885 -1011 -76144
20930g6144q3785p4093M590n2516j961k3363j57116K12786K23871J41691j90995
$$ -76144 -159929 -234022 -229432 -281948 -283909 -307272 -464388 -251602 -27731 113960 -77035
20919g7035o2313j62766j44977n1289O0567N9571K25716O6591k16705k2350J47298
$$ -77035 -139348 -302114 -447091 -498380 -437813 -378242 -152526 -85935 -302640 -324990 -177692
20908a77692O4067J1284K71139p673q1413q7208J36251O0693j24824n3101k22474
$$ -177692 -113625 -102341 168798 161125 79712 -7496 128755 189448 64624 11523 -210951
20897b10951j41317R5306K26275J19601n9756j94695j01104K45032m9297l0706
$$ -210951 -352268 -256962 -30687 88914 29158 -165537 -266641 -21609 -70906 -101612
20887a01612J42604k00909k7495n7023R3021J24867j5370Q1964N5482l51560j12358
$$ -101612 40992 -159917 -187412 -244435 -151414 -26547 -41917 40047 95529 -256031 -368389
20876c68389K39854R5397j23039O4533Q8546J35467j0412l7474j73941J24116
$$ -368389 -128535 -33138 -156177 -91644 -3098 132369 121957 84483 -89458 34658
20866C4658K12515q6536m7363M2920j10084K01363l59404k36866J61832L9842
$$ 34658 247173 160637 113274 156194 46110 247473 -111931 -348797 -186965 -147123
20856a47123Q5580K54023J96453l73808j95236m578J59131J78121j41156O398
$$ -147123 -61543 192480 388933 15125 -180111 -184689 -25558 152563 11407 17805
20846A7805J3313j10618O4128K21537K1543O4081j32263J24461l14594j66682
$$ 17805 31118 -79500 -15372 206165 227708 291789 159526 283987 -30607 -197289
20836a97289N4469m8404Q1685K91249N2828P4120O304q4314o5537q3303l02434
$$ -197289 -142820 -191224 -109539 181710 234538 308658 314962 230648 165111 81808 -220626
20825b20626J1803L42447J5673n3763R6158M596j07356r3023J8157O060J35456
$$ -220626 -208823 133624 149297 95534 191692 196288 88932 -4091 14066 20126 155582
20814A55582o0942k3575q6347j46216m1291n660P3470R1053j36204j44395o6831
$$ 155582 94640 71065 -15282 -161498 -202789 -208449 -134979 -43926 -180130 -324525 -391356
20803c91356P5967K77004M45704M0429j69446j32169P0424q1332m09041p1856
$$ -391356 -315389 -38385 407319 447748 278302 146133 216557 135225 -273816 -345672
20793c45672K76565K15830P6867J7593k26071k4175K5833n4488q6924o2253K8936
$$ -345672 -69107 146723 223590 241183 15112 -9063 16770 -37718 -124642 -186895 -157959
20782a57959J76682J16274P4387k07078k54677K41211J38738j56205J17742K78936
$$ -157959 18723 134997 209384 2306 -252371 -11160 127578 -28627 89115 368051
20772C68051K2729k46794k40018m1998j14909P0358M6932q246J24439l9594L9265
$$ 368051 390780 143986 -96032 -138030 -252939 -182581 -135649 -143895 -19456 -59050 -19785
20761a9785L37806p0557j02971J23076q0125j09439j4624r8271k3625J21823J26528
$$ -19785 318021 247464 144493 267569 187444 78005 63381 -34890 -58515 63308 189836
20750A89836P5000K8593r6519m37324o4242J7913J76599N8452k731J3266j33134
$$ 189836 264836 293429 196910 -240414 -304656 -286743 -110144 -51692 -54423 -41157 -174291
20739a74291K6509O1029r2371r9476k73926N8595L12027m7300N6083m2100k2752
$$ -174291 -147782 -86753 -179124 -278600 -552526 -493931 -181904 -229204 -173121 -215221 -237973
20728b37973J23128Q3282M4195j7682o8132Q2756k89162l29718P7959J07214l1077
$$ -237973 -114845 -31563 12632 -5050 -73182 9574 -279588 -609306 -531347 -424133 -455210
20717d55210K60271n901k4155j37647L37K43498K38251O6973o6705j16202j55555
$$ -455210 -194939 -200840 -224995 -362642 -362305 -118807 119444 186417 119712 3510 -152045
20706a52045j68214r4691j94522J97171K10589n8511k70892J07130K22673R9628
$$ -152045 -320259 -414950 -609472 -412301 -201712 -260223 -531115 -423985 -201312 -101684
20696a01684J48279J51893l09550k5832K5027q1762J90713J53040q9013j54589
$$ -101684 46595 198488 -111062 -136894 -111867 -193629 -2916 150124 61111 -93478
20686i3478l66274k34425K58121M03196J81203M5461J36103j59320k20659J33330
$$ -93478 -459752 -694177 -436056 -32860 148343 193804 329907 170587 -50072 83258
20676H3258q6804L5500K32164K888k01904j63184k2313K0575J6890N6088R3864
$$ 83258 -3546 31954 264118 267006 65102 -98082 -120395 -99820 -82930 -26842 67022
20665F7022L0376k93002J3584J96755o5549n9962J00112J39523n6520r01J193
$$ 67022 97398 -195604 -182020 14735 -50814 -110776 -10664 128859 72339 71438 72631
20654G2631Q7828L1507k11216L6403J42255l5635j88363J2524l3105l38288J80550
$$ 72631 160459 191966 -19250 17153 159408 123773 -64590 -52066 -85171 -423459 -242909
20643b42909J46321L17859j09901l91386m713J05118J85378j59312m13727j78281
$$ -242909 -96588 221271 111370 -280016 -284729 -179611 5767 -153545 -567272 -745553
20633g45553K84374J23887P8151J64553J29933k3757J6929k14290j58795Q2598
$$ -745553 -461179 -337292 -259141 -94588 35345 11588 28517 -185773 -344568 -261970
20623b61970K93497J09426L604P8301L3238j36914j07089o668r627q8843O9047
$$ -261970 31527 140953 144557 222858 256096 119182 12093 5425 -4202 -93045 -23998
20612b3998J38113M6254j60778j54346J9970P0733M7512L1330J12704o073J06215
$$ -23998 114115 160369 -409 -154755 -134785 -64052 -16540 14790 127494 121421 227636
20601B27636j19385k24935k02064K73795J69967p3546l15560p1905J6334P9586
$$ 227636 108251 -116684 -318748 -44953 125014 51468 -264092 -335997 -319663 -240077
20591b40077j02396j14837K66263J98031K9702r978l5846k4727j68105r730P2305
$$ -240077 -342473 -457310 -191047 6984 36686 26708 -9138 -33865 -201970 -211700 -139395
20580a39395n4774J31625K47282k13852k34507O6433l8085J51484N7036j07361
$$ -139395 -194169 -62544 184738 -29114 -263621 -197188 -235273 -83789 -26753 -134114
20570a34114o4550M9331M2288q5800N7565k12153k30181J19678L6258J79747J03412
$$ -134114 -198664 -149333 -107045 -192845 -135280 -347433 -577614 -457936 -421678 -241931 -138519
20559a38519j2053k3470l730N2043o0127k5002J41040J9211k07902n578J16291
$$ -138519 -150572 -174042 -177772 -125729 -185856 -210858 -69818 -50607 -258509 -264087 -147796
20548a47796L9145k51787J45674o290j04939j35249p482J50567p1007J97046J57673
$$ -147796 -108651 -360438 -214764 -221054 -325993 -461242 -468724 -318157 -389164 -192118 -34445
20537c4445k3772k4919J44006P6546r094P5479o8747p7724l6263K6363n3490N205
$$ -34445 -58217 -83136 60870 137416 128322 203801 135054 57330 21067 47430 -6060 -855
20525h55k7766J21242m1685k51756k18552K3484J26859K39906J62676k6654j80560
$$ -855 -28621 92621 50936 -200820 -419372 -395888 -269029 -29123 133553 106899 -73661
20514g3661J1804j73639N9911n360m2504R5152L00617K6633N7102j27289j16808
$$ -73661 -61857 -235496 -175585 -180945 -223449 -128297 172320 198953 256055 128766 11958
20503A1958Q2501K2035J5628Q4837m8158k68783j77204q5847M07651J43689k07370
$$ 11958 94459 116494 132122 216959 168801 -99982 -277186 -363033 44618 188307 -19063
20492a9063k85308L3936L4091K42735N5790M8672m5539Q3119r9722l17422r7750
$$ -19063 -304371 -270435 -236344 6391 62181 110853 65314 148433 48711 -268711 -366461
20481c66461J7178K34880K51982Q8522j7946Q2056j08656k49816j51947J74029
$$ -366461 -349283 -114403 137579 226101 208155 290211 181555 -68261 -220208 -46179
20471d6179P2663l1900j24899L7015J1663j80806l2891L0672j10978j33227P7398
$$ -46179 26484 -5416 -130315 -93300 -81637 -262443 -295334 -264662 -375640 -508867 -431469
20460d31469L2029K35256j49481J10141j6884k37818p5677Q7857L8658J79959
$$ -431469 -399440 -164184 -313665 -203524 -220408 -458226 -533903 -446046 -407388 -227429
20450b27429J16828p8374J82289O4971p4636j51905j53625J0645K75389K99672
$$ -227429 -110601 -188975 -6686 58285 -16351 -168256 -321881 -311236 -35847 263825
20440B63825M0481J80109J04l4701j32259J1353k3930q8887j35262N7697r2188
$$ 263825 304306 484415 484519 449818 317559 328912 304982 216095 80833 138530 46342
20429D6342O2352J25703k1158p8214j20718k00277K61266J14445M0991P223l9231
$$ 46342 108694 234397 213239 135025 14307 -185970 75296 189741 230732 237955 198724
20418A98724K1158J3098j1856J00291l86229j99691J40772K58114J24813j94948
$$ 198724 219882 232980 221124 321415 -64814 -264505 -123733 134381 259194 64246
20408F4246j15825l57282r8196K02192J93301N052L1532k91096J52210l5235J77462
$$ 64246 -51579 -408861 -507057 -304865 -111564 -106512 -74980 -366076 -213866 -249101 -71639
20397g1639j48780k80801j14151K57584M64906J15745p9935j47347q8027o7755
$$ -71639 -220419 -501220 -615371 -357787 107119 222864 142929 -4418 -92445 -160200
20387a60200q7908K25105j49259k45871k2260R1044J3737l6779J64001K85629
$$ -160200 -248108 -23003 -172262 -418133 -440393 -349349 -335612 -372391 -208390 77239
20377G7239K37132j60047j14939p5698k02482L0818J00782P6434n3485R1379J49985
$$ 77239 314371 154324 39385 -36313 -238795 -207977 -107195 -30761 -84246 7133 157118
20366A57118K45901N2015k76950j41964o7575k5010P2480P7609J14190R7029J24339
$$ 157118 403019 455034 178084 36120 -31455 -56465 16015 93624 207814 304843 429182
20355D29182j1044m32586j02431j16888k279J42808P7670R8906P7347m9748l0270
$$ 429182 418138 -14448 -116879 -233767 -236046 -93238 -15568 83338 160685 110937 80667
20344H0667l1281j99230j57584K6888J76936k242j01559o4106r6940n9184M3072
$$ 80667 49386 -149844 -307428 -280540 -103604 -105846 -207405 -271511 -368451 -427635 -384563
20333c84563K73955K05342p1373l00729J31259L05792P2608j52067k24764j10403
$$ -384563 -110608 94734 23361 -277368 -146109 159683 232291 80224 -144540 -254943
20323b54943K43457J90857L9054j92351j60317J28545k22792J09921K89783M2007
$$ -254943 -11486 179371 218425 26074 -134243 -5698 -228490 -118569 171214 213221
20313B13221q8554K5708j48295j00386j75014k16929Q9970J05173J59120K0695
$$ 213221 124667 150375 2080 -98306 -273320 -490249 -400279 -295106 -135986 -115291
20303a15291K3732P0731j19433R6688j79861n1393K39035L6751j9835p4157J3628
$$ -115291 -91559 -20828 -140261 -43573 -223434 -274827 -35792 959 -18876 -93033 -79405
20292g9405J59060O3788j14204K5970k0169K5647L4878J98865m20181m873Q3602
$$ -79405 79655 143443 29239 55209 35040 60687 95565 294430 -125751 -130624 -47022
20281d7022J63369J07068n0134o2673P8898M9222J31058l44725k00893o7267J17360
$$ -47022 116347 223415 173281 110608 189506 238728 369786 25061 -175832 -243099 -125739
20270a25739j48629L2034q8911m0338j3642J55930J74513Q9762p1497q6758l2745
$$ -125739 -274368 -242334 -331245 -371583 -385225 -229295 -54782 34980 -36517 -123275 -156020
20259a56020l6613k21750J77876K22571N2715j83024J66797K18530p1274k6231
$$ -156020 -192633 -414383 -236507 -13936 38779 -144245 22552 241082 169808 143577
20249A43577j8523K8074J10479J78695N2748k24809j97108k42512M7896J59167
$$ 143577 125054 153128 263607 442302 495050 270241 73133 -169379 -121483 37684
20239C7684P5180j78207J3207L5103p8603m4744O3072O1268L2959P425M8746k24472
$$ 37684 112864 -65343 -52136 -17033 -95636 -140380 -77308 -16040 16919 24344 73090 -151382
20227a51382j07683j14492J13465j0617j37923l096L17422M31809l6717k29091
$$ -151382 -259065 -373557 -260092 -270709 -408632 -411728 -94306 337503 300786 71695
20217G1695k19389l6724J58751j15988L7653k1750j06211J604K15905Q9476J17537
$$ 71695 -147694 -184418 -25667 -141655 -104002 -125752 -231963 -230359 -14454 75022 192559
20206A92559j865j89660n821J06727J6415k66292j59038q5768J18685k5071j44567
$$ 192559 190694 1034 -4787 101940 118355 -147937 -306975 -392743 -274058 -299129 -443696
20195d43696N0242J54953L63354J59688k47471J0796j11545R7555N3774j28715
$$ -443696 -393454 -238501 124853 284541 37070 47866 -63679 33876 87650 -41065
20185d1065n1160n204l3395J89897J9896l9155K8547J21379k24938k66347l3264
$$ -41065 -92225 -97429 -130824 59073 78969 39814 68361 189740 -35198 -301545 -334809
20174c34809p1163k45523J02100J73150K12183K21107K12422k10740p9875J0698
$$ -334809 -405972 -651495 -549395 -376245 -164062 57045 269467 58727 -21148 -10450
20164a0450K01060l8181n9282P768K6091j83591N0220Q6255j76417k99951r868
$$ -10450 190610 152429 93147 100915 127006 -56585 -6365 79890 -96527 -396478 -406346
20153d06346J57394K2628j7897j71919J24006M5600K8565J734j87206l3772L08934
$$ -406346 -248952 -226324 -244221 -416140 -292134 -246534 -217969 -216235 -403441 -437213 -128279
20142a28279N9812J78275J92068m0134k75369r5361M942k02506k62172J60787
$$ -128279 -68467 109808 301876 261742 -13627 -108988 -104046 -306552 -568724 -407937
20132d07937L18856L02655Q6992j52584M4790M0237j06732J74090N4299k79167
$$ -407937 -89081 213574 300566 147982 192772 233009 126277 300367 354666 75499
20122G5499K8643j33614k8391J5956J2454q2758K1354K71895l6917k10268q9610
$$ 75499 104142 -29472 -57863 -41907 -29453 -112211 -90857 181038 144121 -66147 -155757
20111a55757N3140O0655J60463J8467P7960k76223k73580K66264J85589J35884
$$ -155757 -102617 -41962 118501 136968 214928 -61295 -334875 -68611 116978 252862
20101B52862r8747j48980j11434r3253L0352K58247J13605L7493k11268k80739
$$ 252862 154115 5135 -106299 -199552 -169200 89047 202652 240145 28877 -251862
20091b51862n711K09493l6766j95612J39594Q9985k63751l3206Q0389J03282R2348
$$ -251862 -257573 -48080 -84846 -280458 -140864 -50879 -314630 -347836 -267447 -164165 -71817
20080g1817j16200j04831Q5133O7160N2806J549l26778j85048j6383J07219J37040
$$ -71817 -188017 -292848 -207715 -140555 -87749 -86200 -412978 -598026 -614409 -507190 -370150
20069c70150p274N6846K93478J93700m1114K114k30966j51431J15617R3866j00656
$$ -370150 -377424 -320578 -27100 166600 125486 127600 -103366 -254797 -139180 -45314 -145970
20058a45970J89623J64751K35027J00339l15471j73976N7520N5383j26417k1205
$$ -145970 43653 208404 443431 543770 228299 54323 111843 167226 40809 19604
20048A9604m2474Q0327K2415p176j43203o0469q1101J4365K69946R9279P4813
$$ 19604 -22870 57457 79872 72696 -70507 -130976 -212077 -197712 72234 171513 246326
20037B46326j42413j64992M1609j57658J09768j00430J07401M6250j24803k41474
$$ 246326 103913 -61079 -19470 -177128 -67360 -167790 -60389 -14139 -138942 -380416
20027c80416M1657K06967K70188k84984O9497J20765M6883j09173n0080J25235
$$ -380416 -338759 -131792 138396 -146588 -77091 43674 90557 -18616 -68696 56539
20017E6539k11882j22123J34474l00883r5239o1313L8602K58375K29381l7423
$$ 56539 -155343 -277466 -142992 -443875 -539114 -600427 -561825 -303450 -74069 -111492
20007a11492J30550L5630j08307r3472k7938p4146k5951J7026M6729Q5430J50229
$$ -111492 19058 54688 -53619 -147091 -175029 -249175 -275126 -258100 -211371 -125941 24288
19996B4288j15050o5948M6878J91031k07541j72794p9269j36882J46277K78766
$$ 24288 -90762 -156710 -109832 81199 -126342 -299136 -378405 -515287 -369010 -90244
19986i0244P5735J01301l3969k23122M5794J23563J0640J28791p9755k42652J49542
$$ -90244 -14509 86792 52823 -170299 -124505 -942 9698 138489 58734 -183918 -34376
19975c4376J3499j66935r9014j36377J15486J04239J60215J65696J68853K46862
$$ -34376 -20877 -187812 -286826 -423203 -307717 -203478 -43263 122433 291286 538148
19965E38148N7598j87819j40826k68359p7225p2277j60083K47755J30841J36810
$$ 538148 595746 407927 267101 -1258 -78483 -150760 -310843 -63088 67753 204563
19955B04563L3114j29276k01903Q2215J63892J12362j48729k15250J42008J09538
$$ 204563 237677 108401 -93502 -11287 152605 264967 116238 -99012 42996 152534
19945A52534R5634P9915K1202L1729j96717j10039O367j17393o3073R4360j49541
$$ 152534 248168 328083 349285 381014 184297 74258 80625 -36768 -99841 -5481 -155022
19934a55022K3919j72616K53877J09338J64092m3570K27761l8270l50100l36608
$$ -155022 -131103 -303719 -49842 59496 223588 180018 407779 369509 19409 -317199
19924c17199J64450J21528n0616K62968O2951j03754p8950O9760j13575M2301
$$ -317199 -152749 -31221 -81837 181131 244082 140328 61378 131138 17563 59864
19914E9864N8859J47521K0159j93965j63813l07911n7508K00515J76267K97405
$$ 59864 118723 266244 286403 92438 -71375 -379286 -436794 -236279 -60012 237393
19904B37393q9230p7067l20742j98449J60979K02846K35966l5785j18236m1051
$$ 237393 148163 71096 -249646 -448095 -287116 -84270 151696 115911 -2325 -43376
19894d3376O7390Q0608l04171k7551n831K26410K6283j81447L2711O7292j8283
$$ -43376 24014 104622 -199549 -227100 -232931 -6521 19762 -161685 -128974 -61682 -79965
19883g9965q985r4276l35534n7643K66238J48599M0072J7032q064J40956M5093
$$ -79965 -88950 -183226 -518760 -576403 -310165 -161566 -121494 -104462 -112526 28430 73523
19872G3523j75588q6051P4810J3836j11720J02753J66418L796o3703J13585K79312
$$ 73523 -102065 -188116 -113306 -99470 -211190 -108437 57981 61777 -1926 111659 390971
19861C90971j74463n1803k35365O9699m0229J77211J48918j24080j71711j98590
$$ 390971 216508 164705 -70660 -961 -41190 136021 284939 160859 -10852 -209442
19851b09442N635K32123J33894j53755r8942J40481J61524k70793j05239j09774
$$ -209442 -203807 28316 162210 8455 -90487 49994 211518 -59275 -164514 -274288
19841b74288r3444Q5827K04624m1179l23516J01788L31532L17988k70580j18216
$$ -274288 -367732 -281905 -77281 -118460 -441976 -340188 -8656 309332 38752 -79464
19831g9464k01748K0082P5464j14739J28928L60162j15031o241P6284q8360r5685
$$ -79464 -281212 -261130 -185666 -300405 -171477 188685 73654 67413 143697 55337 -40348
19820d0348k66462k30359K2714K15642L71108J87057L2113J81090R78j51055j07672
$$ -40348 -306810 -537169 -514455 -298813 72295 259352 291465 472555 473533 322478 214806
19809B14806o198P4684q9447Q8878L982j25918l04488m3514J11781J8782J41451
$$ 214806 208608 283292 193845 282723 286705 160787 -143701 -187215 -75434 -56652 84799
19798H4799J08683L2225k75899k00722k14323M1440J09197K62J31134K42947J8271
$$ 84799 193482 225707 -50192 -250914 -465237 -423797 -314600 -314338 -183204 59743 78014
19787G8014p0319j25228J90410j00179o7319j09623R068j6446r7260J23913R8233
$$ 78014 7695 -117533 72877 -27302 -94621 -204244 -195176 -211622 -308882 -184969 -86736
19776h6736M9392M7713j95743l39074K03346L78806j03495j68608n0600K1004
$$ -86736 -37344 10369 -185374 -524448 -321102 57704 -45791 -214399 -264999 -243995
19766b43995K21208P6713K6862M4892j44147n3089K71726J45260k47860J15271
$$ -243995 -22787 53926 80788 125680 -18467 -71556 200170 345430 97570 212841
19756B12841K45464N1454j30042m0245J12776J73764N2864j98237L2938L11505
$$ 212841 458305 509759 379717 339472 452248 626012 678876 480639 513577 825082
19746H25082o4927J00534j25166q3261K50241Q8568O4043K11962j10631j58361
$$ 825082 760155 860689 735523 652262 902503 991071 1055114 1267076 1156445 998084
19736I98084Q1182J81149r9132N6837J55038J03648K7929Q3609J48904K99720
$$ 998084 1079266 1260415 1161283 1218120 1373158 1476806 1504735 1588344 1737248 2036968
19726B036968J82174p6295j74098k45183j71384O0159Q9532j35955k27649j14054
$$ 2036968 2219142 2142847 1968749 1723566 1552182 1612341 1701873 1565918 1338269 1224215
19716A224215k80457l52700l01498j92298j39047q217l0794J28120P6208J1266
$$ 1224215 943758 591058 289560 97262 -41785 -50002 -80796 47324 123532 134798
19706A34798o8426j22117m969K68952N2640p0227p9475J43800q9432k04675k1132
$$ 134798 66372 -55745 -60714 208238 260878 190651 111176 254976 165544 -39131 -60263
19695f0263K19870K79164K52518n8204j23096J15655N5680l34086j97963J32061
$$ -60263 159607 438771 691289 633085 509989 625644 681324 347238 149275 281336
19685B81336J22546l17286m6572Q9685K07627J19299p3234J74567j07152j10049
$$ 281336 403882 86596 40024 129709 337336 456635 383401 557968 450816 340767
19675C40767l29977j17264K64508K45739p0690j45052J66688Q8411j39437r1503
$$ 340767 10790 -106474 158034 403773 333083 188031 354719 443130 303693 212190
19665B12190j95199j95534K40991K01576q596N7869J38854R8228P7861j75712
$$ 212190 16991 -178543 62448 264024 255428 313297 452151 550379 628240 452528
19655D52528L7700j06115J45394J2145q0111J78719J38826J08753J14886k0031
$$ 452528 490228 384113 529507 541652 461541 640260 779086 887839 1002725 982694
19645I82694l010K81747p1891l88386l29251R0927J19915k31247O5859J81960
$$ 982694 979684 1261431 1189540 801154 471903 562830 682745 451498 517357 699317
19635F99317K62054K3195O8312O7238n408j23143k55019j67398m8105m763j76732
$$ 699317 961371 984566 1052878 1120116 1114708 991565 736546 569148 521043 516280 339548
19624C39548j35279j78351j23861L29667O9517j408N2579j6775J67095j0406j93291
$$ 339548 204269 25918 -97943 231724 301241 299833 352412 335637 502732 492326 299035
19613B99035K58252O6408j88047J9861k75079r6059m4040m8289J09577J07920
$$ 299035 557287 623695 435648 455509 180430 84371 40331 -7958 101619 209539
19603B09539Q7322J31895J89057J8472J29992M8354m8618N5120K38622P1528j57738
$$ 209539 296861 428756 617813 636285 766277 814631 766013 821133 1059755 1131283 973545
19592I73545j25350l14380J72127M03408J61673k51946j98662J75632J12398J01884
$$ 973545 848195 533815 705942 1109350 1271023 1019077 820415 996047 1108445 1210329
19582A210329j21383m44082k64700l69745Q5296m1063j4340j78801j01399j27401
$$ 1210329 1088946 644864 380164 10419 95715 54652 40312 -138489 -239888 -367289
19572c67289K56649K55944P1969J09273o2518j57633q6097J98854k4174j67462
$$ -367289 -110640 145304 217273 326546 264028 106395 20298 219152 194978 27516
19562B7516q2035K25268J42786K32986J19245j22985j84833k23373l60476K4827
$$ 27516 -54519 170749 313535 546521 665766 542781 357948 134575 -225901 -201074
19552b01074L70948J80298j60546k9481j3811r1451J435m288r2437j15432O3862
$$ -201074 169874 350172 189626 160145 146334 54883 56318 52030 -40407 -155839 -91977
19541i1977J39886l4184Q120l3711J51707o1466j36600j11949j87597j08945K94474
$$ -91977 47909 13725 21845 -11866 139841 78375 -58225 -170174 -357771 -466716 -172242
19530a72242K49000j0297J23596J44831r2831j72238K8321P3527J15675j38421
$$ -172242 76758 66461 190057 334888 242057 69819 98140 171667 287342 148921
19520A48921Q695o4003J22234j94065J99756L9884M5315k10244M4854n6291l4474
$$ 148921 157616 93613 215847 21782 221538 261422 306737 96493 141347 85056 50582
19509E0582j26677j11749J37015j9880P0047p5673K3260n9858o3969o980M5152
$$ 50582 -76095 -187844 -50829 -70709 -662 -76335 -53075 -112933 -176902 -183882 -138730
19498a38730K1676k40972N7778J18104L62110J45296j19647j44320o4641R5805
$$ -138730 -117054 -358026 -300248 -182144 179966 325262 205615 61295 -3346 92459
19488I2459k2133k57294P6573K51287L25794P1347k18073j01368J17385k63843
$$ 92459 70326 -186968 -110395 140892 466686 538033 319960 218592 335977 72134
19478G2134k75710q6529J04328m6106k3817m7399J65212p1773J02543L24544J67860
$$ 72134 -203576 -290105 -185777 -231883 -255700 -303099 -137887 -209660 -107117 217427 385287
19467C85287j01399k69527n1615J8716J62444L9666j85809l8256J45888l0889
$$ 385287 283888 14361 -37254 -18538 143906 183572 -2237 -40493 105395 74506
19457G4506j04941j03777k8779J78960J93914j6267k19907j21116J64080L36903
$$ 74506 -30435 -134212 -162991 15969 209883 193616 -26291 -147407 16673 353576
19447C53576p2433l48207j13804n9273M14311K01881j9490r5587j47703l70424
$$ 353576 281143 -67064 -180868 -240141 174170 376051 356561 260974 113271 -257153
19437b57153N256K37419Q1571J29071J23106j98111j51664M5144j26959n9541
$$ -257153 -251897 -14478 67093 196164 319270 121159 -30505 14639 -112320 -171861
19427a71861j15188J14838R0943J38432J50026J73391l46364r8782K7904k28664
$$ -171861 -287049 -172211 -81268 57164 207190 380581 34217 -64565 -36661 -265325
19417b65325J72164K68390j50569j80789q9349K2846J3443j26336N2063M0495
$$ -265325 -93161 175229 24660 -156129 -245478 -222632 -209189 -335525 -283462 -242967
19407b42967O4008J94733K21729j09073R4826J90082l277j21098j27960r9237
$$ -242967 -178959 15774 237503 128430 223256 413338 410061 288963 161003 61766
19397F1766m6585K02098o3399j35895l7780j96974r6788j58049J53363K17016
$$ 61766 15181 217279 153880 17985 -19795 -216769 -313557 -471606 -318243 -101227
19387a01227m8391j93792Q2086J11152o145o0598J44957J05221o6569L0092m2998
$$ -101227 -149618 -343410 -261324 -150172 -156317 -216915 -71958 33263 -33306 -3214 -46212
19376d6212j24709p5779J14756n8884k5044J65135l1801J0540J50950j1941l9272
$$ -46212 -170921 -246700 -131944 -190828 -215872 -50737 -82538 -71998 78952 67011 27739
19365B7739j20668n8172m8544j4591M38647j0988N7380N5774p7619j35986l02791
$$ 27739 -92929 -151101 -199645 -214236 224411 213423 270803 326577 248958 112972 -189819
19354a89819k3615K07068n4989r121Q5064Q670k16913n4567L22296j11232p6265
$$ -189819 -213434 -6366 -61355 -70476 14588 23258 -193655 -248222 74074 -37158 -113423
19343a13423K1484O8892k410N1077q6381K156p0017M4544J49829R7855l9200R6181
$$ -113423 -91939 -23047 -25457 25620 -60761 -58605 -128622 -84078 65751 163606 124406 220587
19331B20587j98926m9071J26685o6699J65067J01692K085j54631j26345p8585
$$ 220587 21661 -27410 99275 32576 197643 299335 301420 146789 20444 -58141
19321e8141J53n690m6230j7829n4828N9550L4026J29086J08071p8266j34752J39784
$$ -58141 -57988 -63678 -109908 -127737 -182565 -123015 -88989 40097 148168 69902 -64850 74934
19309G4934J84224o8065j541o9747n7816l941p0829r2464q6499O0100o0444j0839
$$ 74934 259158 191093 189552 119805 61989 58048 -12781 -105245 -191744 -131644 -192088 -202927
19297b02927R9490J62468J27290l6408m272j19858P3266k09356l4317K77837K30376
$$ -202927 -103437 59031 186321 149913 145641 25783 99049 -110307 -144624 133213 363589
19286C63589m3329l2539j09493k46524m0902j033k30100J36809K43005K5723J94873
$$ 363589 320260 287721 178228 -68296 -109198 -110231 -340331 -203522 39483 65206 260079
19275B60079J94685k12680j75528J0133M1842l1501j50372L6554K6990N5677r4375
$$ 260079 454764 242084 66556 76689 118531 87030 -63342 -26788 202 55879 -38496
19264c8496J0565p3456J39198j0784Q9152Q9930j28100p5955R6215N822Q6413
$$ -38496 -27931 -101387 37811 27027 116179 206109 78009 2054 98269 104091 190504
19253A90504j0782j56622j15201j65546n0181P9759m2565L101P0251L4066j36748
$$ 190504 179722 23100 -92101 -257647 -307828 -228069 -270634 -267533 -197282 -163216 -299964
19242b99964K2931j3345J27854K15892q8768J62416N0754j91558m2523Q6933J36988
$$ -299964 -277033 -290378 -162524 53368 -35400 127016 177770 -13788 -56311 30622 167610
19231A67610O9398k82267Q5601J92305J5219q042j328j18687r6313l30396k43425
$$ 167610 237008 -45259 40342 232647 247866 239824 238496 119809 23496 -306900 -550325
19220e50325J30402K13245J08137k9442K11817j20582k05659j6456L03095J7327
$$ -550325 -419923 -206678 -98541 -127983 83834 -36748 -242407 -258863 44232 61559
19210F1559L0189K42905j14484o1286M750m5588j39376J5523K41210n748n3040
$$ 61559 91748 334653 220169 158883 163633 118045 -21331 -5808 235402 229654 176614
19199A76614J87541m7270p6685K2653J04375Q451j31307j50319k53797n52n1067
$$ 176614 364155 316885 240200 262853 367228 375679 244372 94053 -159744 -160296 -211363
19188b11363j17789M3297N0775R2451K49463J17296K6108p7209j6458N5994o784
$$ -211363 -329152 -285855 -235080 -142629 106834 224130 250238 173029 156571 212565 205781
19177B05781J23108N3434o6913q1251j1121J0336l817j68753k20687P4775J15248
$$ 205781 328889 382323 315410 234159 223038 233374 229557 60804 -159883 -85108 30140
19166C0140R927k19058P2974J62436N7280j09036M205M7839J93871j16928n5448
$$ 30140 40067 -178991 -106017 56419 113699 4663 8868 56707 250578 133650 78202
19155G8202j44009M109K08286K17977p2177k86137j26214J78419m1442j34933
$$ 78202 -65807 -61698 146588 364565 292388 6251 -119963 58456 17014 -117919
19145a17919J41613M0881j59555k35536o5887J42530m7406j56042J78297J36932
$$ -117919 23694 64575 -94980 -330516 -396403 -253873 -301279 -457321 -279024 -142092
19135a42092J08069o2617K68708L7232k78293K7467R2049k63117r8959L64035
$$ -142092 -34023 -96640 172068 209300 -68993 -41526 50523 -212594 -311553 52482
19125E2482Q5072Q2171p6646k86699k45994J08003J32589N5027N8925k65762J83979
$$ 52482 137554 219725 143079 -143620 -389614 -281611 -149022 -93995 -35070 -300832 -116853
19114a16853K13361j24053O4515O5784r1191j40786j21916K57272Q3145j01135
$$ -116853 96508 -27545 36970 102754 11563 -129223 -251139 6133 89278 -11857
19104a1857j89696P7622J43925k01628m507n295J54240n1293j68346K75200J38666
$$ -11857 -201553 -123931 19994 -181634 -186141 -191436 -37196 -88489 -256835 18365 157031
19093A57031k17239m0731o2336j29403k0749J57935K1593L47435r5281j06609
$$ 157031 -60208 -100939 -163275 -292678 -313427 -155492 -133899 213536 118255 11646
19083A1646M9573J4985K23047l3227l26839k42773k6857j14189N0559J59085J63643
$$ 11646 61219 76204 299251 266024 -60815 -303588 -330445 -444634 -394075 -234990 -71347
19072g1347J21118J71707K8167l551J58690N6651k28133j03034M5233N3864J60696
$$ -71347 49771 221478 249645 246094 404784 461435 233302 130268 175501 229365 390061
19061C90061q9567l44306m8606j01762k6776P223q1730M2376K08415K0540l12794
$$ 390061 300494 -43812 -92418 -194180 -220956 -213733 -295463 -253087 -44672 -24132 -336926
19050c36926o5424K27518J67179r7296K202J2176J87157r0547P757J56081M7599
$$ -336926 -402350 -174832 -7653 -104949 -102747 -90571 96586 6039 13796 169877 217476
19039B17476q0739L7413j1034O7926J82003k2294k80723j81464p9217Q396L5535
$$ 217476 136737 174150 163116 231042 413045 390751 110028 -71436 -150653 -142257 -106722
19028a06722J31328L1946j68866j82672J48477M5816J95205J45018l09616n4813
$$ -106722 24606 56552 -112314 -294986 -146509 -100693 94512 239530 -70086 -124899
19018a24899K14866K49970k9597r75P500P4256l38983m93669O0861L37791J9894
$$ -124899 89967 339937 310340 309365 316865 391121 52138 -441531 -380670 -42879 -22985
19007b2985j64534L6573O2892J42180Q5k31157k32069O4509J95228L10437m6551
$$ -22985 -187519 -150946 -88054 54126 54211 -176946 -409015 -344506 -149278 161159 114608
18996A14608j80488j18183J15950q6066m3621N7252J1521J41936j7751k40843
$$ 114608 -65880 -184063 -68113 -154179 -197800 -140548 -129027 12909 -4842 -245685
18986b45685J20101M8302l44594p020M4651O7514O4685l8230n8893M4540J13980
$$ -245685 -125584 -77282 -421876 -428896 -384245 -316731 -252046 -290276 -349169 -304629 -190649
18975a90649J55734K5994l2984j93115K9358L6535k8594O9387K08779J76072o6609
$$ -190649 -34915 -8921 -41905 -235020 -205662 -169127 -197721 -128334 80445 256517 189908
18964A89908o942p1301n7452j39456M9632k9617M9421K8525L6512j22448j59523
$$ 189908 182966 111665 54213 -85243 -35611 -65228 -15807 12718 49230 -73218 -232741
18953b32741K28155J68665j92997p4462K9495J3770J27709L7906m6894J203l1306
$$ -232741 -4586 164079 -28918 -103380 -73885 -60115 67594 105500 58606 59809 28503
18942B8503R1369l7776J04893J8546k71735j17058l2307K22112J23713Q5536l8434
$$ 28503 119872 82096 186989 205535 -66200 -183258 -215565 6547 130260 215796 177362
18931A77362O4059Q5455j62637k24665m2995k24957n1968l8760K03250L0459J19175
$$ 177362 241421 326876 164239 -60426 -103421 -328378 -380346 -419106 -215856 -185397 -66222
18920f6222J20272L845J3519j1510l31804K65112J99582n7018p1303q7113P1708
$$ -66222 54050 57895 71414 59904 -271900 -6788 192794 135776 64473 -22640 49068
18909D9068J91973k1014j62980j61479K52226N07m2579J47145J44504j61083R6976
$$ 49068 241041 220027 57047 -104432 147794 148301 105722 252867 397371 236288 333264
18898C33264J22185j55131j76301j81319j03770J91444P7964k8505K19717P9032
$$ 333264 455449 300318 124017 -57302 -161072 30372 108336 79831 299548 378580
18888C78580k1759j93998j8409j8961m8577q431r3922r482j57336p263K02075
$$ 378580 356821 162823 144414 125453 76876 68445 -25477 -34959 -192295 -199558 2517
18877B517q2020J9629M1135r7008j34079j40652M2017K3024L21276K1992R716
$$ 2517 -79503 -59874 -18739 -115747 -249826 -390478 -348461 -325437 -4161 17831 27547
18866B7547r2147j04308j23459j7130l0061n5469j31454K07613K21913P116J72510
$$ 27547 -64600 -168908 -292367 -309497 -339558 -395027 -526481 -318868 -96955 -89839 82671
18855H2671o1801o7525l0755o148j2569O7771M0561L3173M4373j09807R6674J14825
$$ 82671 20870 -46655 -77410 -83558 -96127 -28356 12205 45378 89751 -20056 76618 191443
18843A91443P2626j88356k6710J75478j54927J40227R3675k10544k40539J77033
$$ 191443 264069 75713 49003 224481 69554 209781 303456 92912 -147627 29406
18833B9406J06961k01640m4379p8727j13518K22481j1308j11813R5444j22455
$$ 29406 136367 -65273 -109652 -188379 -301897 -79416 -90724 -202537 -107093 -229548
18823b29548j49253J17429J2375k93999L49358J16326m3240N8440J76180L84147
$$ -229548 -378801 -261372 -248997 -542996 -193638 -77312 -120552 -62112 114068 498215
18813D98215M7219n71499j9293p1988n9593K60977J86825j12569r2200q1174M2410
$$ 498215 545434 -26065 -45358 -117346 -176939 84038 270863 158294 66094 -15080 27330
18802B7330j50750j7164m5118J30219J0356o5762N7661j837P7696O0912l9352
$$ 27330 -123420 -140584 -185702 -55483 -45127 -110889 -53228 -55065 22631 83543 44191
18791D4191J62142J69924j19204J47488R5677k17209M7826r9024j89351k60726
$$ 44191 206333 376257 257053 404541 500218 283009 330835 231811 42460 -218266
18781b18266r6644J23076J35626K85674R4311k2891J26107K67971j4499N5856
$$ -218266 -314910 -191834 -56208 229466 323777 300886 426993 694964 680465 736321
18771G36321J71458K15390J16810M17887L07408p6815l65483j75310l72064l21290
$$ 736321 907779 1123169 1239979 1657866 1965274 1888459 1522976 1347666 975602 654312
18761F54312j69517j7281k04786l42733R9816J16754J47372j4796q8642k29592
$$ 654312 484795 467514 262728 -80005 19811 136565 283937 269141 180499 -49093
18751d9093n4284L82654k19857m28386K0527K08709J4290K8552p4179K40438L30531
$$ -49093 -103377 279277 59420 -368966 -348439 -139730 -125440 -96888 -171067 69371 399902
18740C99902P1258p6622n3041j94741j59170J26206Q9176j39106J01966p939J1018
$$ 399902 471160 394538 341497 146756 -12414 113792 202968 63862 165828 157889 168907
18729A68907N1864J20626Q323K65748Q9438l161j0435m04126k04936n4862L1832
$$ 168907 220771 341397 349720 615468 704906 701745 691310 287184 82248 27386 59218
18718E9218J77356R7330K03601M1771j26629R284j52835k17566p8491j86518J14917
$$ 59218 236574 333904 537505 579276 452647 461931 309096 91530 13039 -173479 -58562
18707e8562M6305Q8557R7270q5149k14423n4963O3474J13555P4204J83424K3393
$$ -58562 -12257 76300 173570 88421 -126002 -180965 -117491 -3936 70268 253692 277085
18696B77085j10913r7859j67985J13670k75034P0059M3619K74611J12446O5601
$$ 277085 166172 68313 -99672 13998 -261036 -190977 -147358 127253 239699 305300
18686C05300J11424j84361k6802k8084J18217O1278j10578k44107r0750K9583
$$ 305300 416724 232363 205561 177477 295694 356972 246394 2287 -88463 -58880
18676e8880K36963l4631k37329j4110J52712P8576J2233J07660L3694P4409J665
$$ -58880 178083 143452 -93877 -107987 44725 123301 135534 243194 276888 351297 352962
18665C52962k60824M5483J5748O836O3028r2364K4361L32985m5454Q201j01229
$$ 352962 92138 137621 153369 160205 223233 130869 155230 488215 442761 450962 349733
18654C49733J13262L10564K2666j56384P260J48927P9197J32354K72733L7908
$$ 349733 462995 773559 796225 639841 647101 796028 875225 1007579 1280312 1318220
18644A318220r102q9103M3540q0529o5665l72876l12323M5288m4941P0564M5062
$$ 1318220 1309118 1220015 1263555 1183026 1117361 744485 432162 477450 432509 503073 548135
18633E48135l363N6162m8899J5932P1456j39852o9916p0891J1903j32411j14147
$$ 548135 544772 600934 552035 567967 639423 499571 429655 358764 370667 238256 124109
18622A24109q5491L03207P0050k25922j40536q5370K30900L06645N4331k40663
$$ 124109 38618 341825 411875 185953 45417 -39953 190947 497592 551923 311260
18612C11260J2425j49377k21934J16931O8440l3234p4869j85158J03028J2256
$$ 311260 323685 174308 -47626 69305 137745 104511 29642 -155516 -52488 -40232
18602d0232J38428r4362L31933M07351K46687O00265K59295j7213r2455j55216
$$ -40232 98196 3834 335767 743118 989805 1590070 1849365 1832152 1739697 1584481
18592A584481k89249j48398m66524m30677k6581J83220L0806L98482j18546n06035
$$ 1584481 1295232 1146834 680310 249633 223052 406272 437078 835560 717014 210979
18582B10979k31123j4173O9617K31274J32386K62665j79643k00139N379K3550
$$ 210979 -20144 -34317 35300 266574 398960 661625 481982 281843 287222 310772
18572C10772k84372R4652K16217r0165j94813p5434l4475J1877J03354n0404j26675
$$ 310772 26400 121052 337269 247104 52291 -23143 -57618 -45741 57613 7209 -119466
18561a19466J74021J93468r557J24497L2954k37727p8610l379j8786Q2194o7536
$$ -119466 54555 248023 238466 362963 395917 158190 79580 76201 57415 139609 72073
18550G2073j34232j15242P4891K05210M8537p3274j85740O2921L29432N1605O6080
$$ 72073 -62159 -177401 -102510 102700 151237 77963 -107777 -44856 284576 336181 402261
18539D02261k18558k59379K55918M32051k86841M9214N1765j61989j50841P0180
$$ 402261 183703 -75676 180242 612293 325452 374666 426431 264442 113601 183781
18529A83781M8161j38487n3509q6977J75644K34713r3202j21905j28834j78156
$$ 183781 231942 93455 39946 -47031 128613 363326 270124 148219 19385 -158771
18519a58771k188K54103m9411k6574M9072j11201n378J01863J86333K32364k00404
$$ -158771 -160959 93144 43733 17159 66231 -44970 -50348 51515 237848 470212 269808
18508B69808k96297r7569j39184j31043L86826K05295m6874j64551j01135J63723
$$ 269808 -26489 -124058 -263242 -394285 -7459 197836 150962 -13589 -114724 48999
18498D8999J67902J99344L2162l15688p4147J02736K5812J7288J42713L003k39264
$$ 48999 216901 416245 448407 132719 58572 161308 187120 204408 347121 350124 110860
18487A10860O048J93300m6085k05577J8950O3387j87580k18691m1527J28025q8831
$$ 110860 116908 310208 264123 58546 77496 140883 -46697 -265388 -306915 -178890 -267721
18476b67721N3126Q2241m0953Q6076J2830k89607q8225M38605L74047K7464j46393
$$ -267721 -214595 -132354 -173307 -87231 -74401 -364008 -452233 -13628 360419 387883 241490
18465B41490P2198J18755j42770p4613L2070L1700J64937p5112l43105p5191J56884
$$ 241490 313688 432443 289673 215060 247130 278830 443767 368655 25550 -49641 107243
18454A07243o2282L0725o0202J41801K7884J97715J12770j03878k2265k2848J74597
$$ 107243 44961 75686 15484 157285 185169 382884 495654 391776 369511 346663 521260
18443E21260k78162n6393J17472J25913K09853j3967K38399N715M3968j1298L1823
$$ 521260 243098 186705 304177 430090 639943 625976 864375 870090 914058 902760 934583
18432I34583L0296k43003j38691j12562k98259O7258p2136q9749m5132j68652
$$ 934583 964879 721876 583185 470623 172364 239622 167486 77737 32605 -136047
18422a36047m0474J80522J64524J53936n567j49425k39662M0275J76780R4109
$$ -136047 -176521 4001 168525 322461 316894 167469 -72193 -31918 144862 238971
18412B38971J87110P139j99126P1960n5442J22329r1016J6240P9785K22661J00824
$$ 238971 426081 433220 234094 306054 250612 372941 281925 298165 377950 600611 701435
18401G01435k70412o6895J45748M59529L02708J19699K80308J39815j24114o1075
$$ 701435 431023 364128 509876 969405 1272113 1391812 1672120 1811935 1687821 1626746
18391A626746j82402n00480o2546J56087k6021j93802j6839L5970R4096K2815
$$ 1626746 1444344 943864 881318 1037405 1011384 817582 800743 836713 930809 953624
18381I53624k58224k18786j85866p5252R3204Q0387r4480p5169r490n4236Q4856
$$ 953624 695400 476614 290748 215496 308700 389087 294607 219438 209948 155712 240568
18370B40568J52135O380j42766J8407m4742P2872P2759K25105K78307J5201j10423
$$ 240568 392703 399083 256317 274724 229982 302854 375613 600718 879025 894226 783803
18359G83803j02335q1201o8259Q6129J28877j18129m7463j94424J39230J09964
$$ 783803 681468 600267 532008 618137 747014 628885 581422 386998 526228 636192
18349F36192j2055K78634L12483j35048j31847M4548J04821J38898O0227J69821
$$ 636192 624137 902771 1215254 1080206 948359 992907 1097728 1236626 1296853 1466674
18339A466674j19577j76099m07553R3733L27337K26948N1773l4574L19322K13587
$$ 1466674 1347097 1170998 763445 857178 1184515 1411463 1463236 1428662 1747984 1961571
18329A961571L7387P9997j22447l02447j14861j38827k52687j90159j64444k1894
$$ 1961571 1998958 2078955 1956508 1654061 1539200 1400373 1147686 957527 793083 771189
18319G71189p5629j21138k46599K1868J99703J5897m8295J8110J08694j08039
$$ 771189 695560 574422 327823 349691 549394 565291 516996 535106 643800 535761
18309E35761K8995J19633J04435j61927J6576J54725K49506P3872l36866k30990
$$ 535761 564756 684389 788824 626897 643473 798198 1047704 1121576 784710 553720
18299E53720N0533J46496K67543m2844j55556o8281r0090r4646j06555m6518J48553
$$ 553720 604253 750749 1018292 975448 819892 751611 661521 566875 460320 413802 562355
18288E62355K0874j53991q7431L8142L35128J93723R1492J14273K64355J28167
$$ 562355 583229 429238 341807 379949 715077 908800 1000292 1114565 1378920 1507087
18278A507087J29589k86774P3353L49758M45995L5814K6009l0360j95249k21756
$$ 1507087 1636676 1349902 1423255 1773013 2219008 2254822 2280831 2250471 2055222 1833466
18268A833466j40071k78366j65536J06926m9717j53600m1309j4902M1689O3590
$$ 1833466 1693395 1415029 1249493 1356419 1306702 1153102 1111793 1096891 1138580 1202170
18258A202170l1074k38109k08656j71946j08046J14375l9963R9601q6246J2921
$$ 1202170 1171096 932987 724331 552385 444339 558714 518751 618352 532106 545027
18248E45027P0882p7526j04578O5434m5145O4575M78876L04856Q4653J02161K13751
$$ 545027 615909 538383 433805 499239 454094 518669 997545 1302401 1387054 1489215 1702966
18237A702966L25154m8016l1099j29878j20782O8178K08536P2134J73777L11962
$$ 1702966 2028120 1980104 1949005 1819127 1698345 1766523 1975059 2047193 2220970 2532932
18227B532932r1878k07164j86879N249L56400M17294l01248k49294j96949n36289
$$ 2532932 2441054 2233890 2047011 2052260 2408660 2825954 2524706 2275412 2078463 1542174
18217A542174j06538j73553l77371m5236N4998L0002k8564j60566M02414R8301
$$ 1542174 1435636 1262083 884712 839476 894474 924476 895912 735346 1137760 1236061
18207A236061j6111K2607M7940M1474N3915J08139j47315j41190j08235m9130
$$ 1236061 1219950 1242557 1290497 1331971 1385886 1494025 1346710 1205520 1097285 1048155
18197A048155K58536L66822Q9104q4035J63134O64k06594k04351k0290J43164
$$ 1048155 1306691 1673513 1762617 1678582 1841716 1842380 1635786 1431435 1411145 1554309
18187A554309J10207J47194j53617k21558j72754l4939K7421K34810L8998J5158
$$ 1554309 1664516 1811710 1658093 1436535 1263781 1228842 1256263 1491073 1530071 1545229
18177A545229L78599K05255M5403K59397M05479K3101j04007j80844K20037M0922
$$ 1545229 1923828 2129083 2174486 2433883 2839362 2862463 2758456 2577612 2797649 2838571
18167B838571j99575m64950n6112L68188j89513l58895j90599p1153K25589Q0027
$$ 2838571 2638996 2174046 2117934 2486122 2296609 1937714 1747115 1675962 1901551 1981578
18157A981578n4078J81493J25505m4486m7399k35186j93644J89594K90717M090
$$ 1981578 1927500 2108993 2234498 2190012 2142613 1907427 1713783 1903377 2194094 2198184
18147B198184N616p4191P9555O7791J72383k910J79469J71546L7554J35228K61248
$$ 2198184 2203800 2129609 2209164 2276955 2449338 2446428 2625897 2797443 2834997 2970225 3231473
18136C231473o3480J85854K93489K85250P8764Q9648L75012L23404L04644N22731
$$ 3231473 3167993 3353847 3647336 3932586 4011350 4100998 4476010 4799414 5104058 5626789
18126E626789P66555R57415P83586J001274J401350J513819J885293K674284M328046
$$ 5626789 6393344 7350759 8134345 9135619 10536969 12050788 13936081 16610365 20938411
18117B0938411O629821J0450616J7361066K8426849M2698764N4112985N3786388
$$ 20938411 27568232 38018848 55379914 83806763 126505527 180618512 234404900
18110B34404900M3980902L5575629J2969330q4352425r5691377n5638614l0771842
$$ 234404900 278385802 313961431 326930761 242578336 146886959 91248345 60476503
18103F0476503j7001125j0117791o702605m780359l709395k595930k118237j545553
$$ 60476503 43475378 33357587 26654982 21874623 18165228 15569298 13451061 11905508
18095A1905508j048602j011867j036734r64326p32610l81945l83937m94064l72983
$$ 11905508 10856906 9845039 8808305 7843979 7111369 6729424 6345487 5851423 5478440
18086E478440m70735m82928j72265j36318l01776j85414j58202l62763M6556O4332
$$ 5478440 5007705 4524777 4352512 4216194 3914418 3729004 3570802 3208039 3254595 3318927
18076C318927r3097k08755J33775K17997j10765m23932j35970J73115l1092m00819
$$ 3318927 3225830 3017075 3150850 3368847 3258082 2834150 2698180 2871295 2840203 2439384
18066B439384l11594m1214K05453J87000k34691k86119O9886j2260j95613q0941
$$ 2439384 2127790 2086576 2292029 2479029 2244338 1958219 2028105 2015845 1820232 1739291
18056A739291m271j48186L48441J88888k09785J45480M3850l40091l83385o6182
$$ 1739291 1735020 1586834 1935275 2124163 1914378 2059858 2103708 1763617 1380232 1314050
18046A314050K28763K0084p8119L0982j06293J12888L61509K63370K40249K59721
$$ 1314050 1542813 1562897 1484778 1515760 1409467 1522355 1883864 2147234 2387483 2647204
18036B647204j0719l8314l3940k28087k21535j31724n3548M8509J43025K78948
$$ 2647204 2636485 2598171 2564231 2336144 2114609 1982885 1929337 1977846 2120871 2399819
18026B399819J10213J98576r43n4537m41268j39437k7335l4737L21496K46972
$$ 2399819 2510032 2708608 2707665 2653128 2211860 2072423 2045088 2010351 2331847 2578819
18016B578819J00341o3343j20871J08406K07823p8993p5624j70825j21536N032
$$ 2578819 2679160 2615817 2494946 2603352 2811175 2732182 2656558 2485733 2364197 2369229
18006B369229m9295K325Q2603k59876n5000K09445K13198J37609K34985j50369
$$ 2369229 2319934 2322259 2404862 2144986 2089986 2299431 2512629 2650238 2885223 2734854
17996B734854k89179j73293p7216k83731L5211R5123J41111K46312K34224L14308
$$ 2734854 2445675 2272382 2195166 1911435 1946646 2041769 2182880 2429192 2663416 2977724
17986B977724K35969O5032k65287k43791j19169j40080j21518n2450p0609q747
$$ 2977724 3213693 3278725 3013438 2769647 2650478 2510398 2388880 2336430 2265821 2257074
17976B257074P1298J45733L0149J75160r3665n6451k19139j67001k2227P5838
$$ 2257074 2328372 2474105 2504254 2679414 2585749 2529298 2310159 2143158 2120931 2196769
17966B196769k24481O6990J07719P3377N02080K05772J9202J72328O0393J74381
$$ 2196769 1972288 2039278 2146997 2220374 2722454 2928226 2947428 3119756 3180149 3354530
17956C354530J31205j20349m2465Q9813j32069m65621l50580j83603r4196l01747
$$ 3354530 3485735 3365386 3322921 3412734 3280665 2815044 2464464 2280861 2186665 1884918
17946A884918k84364j35305R8310J96418N677l04173R2507N6551k11139K76128
$$ 1884918 1600554 1465249 1563559 1759977 1765654 1461481 1553988 1610539 1399400 1675528
17936A675528N37979P9412p0298k08806O8298L40611J64760K19426M6244L12872
$$ 1675528 2213507 2292919 2222621 2013815 2082113 2422724 2587484 2806910 2853154 3166026
17926C166026J93813K25539M5174J93602K01711J81414J96245L56230M98507R14836
$$ 3166026 3359839 3585378 3630552 3824154 4025865 4207279 4403524 4759754 5258261 6173097
17916F173097P04039M35959O95028R23028N29252P23086N63131N47036J93063
$$ 6173097 6877136 7313095 8008123 8931151 9460403 10183489 10746620 11293656 11486719
17907A1486719N35932R77058J251793J455612K158404L104864M758630P417533
$$ 11486719 12022651 12999709 14251502 15707114 17865518 20970382 25729012 33146545
17899C3146545J1144021J4724900J6904058J7070648J6923510J6265356P010190
$$ 33146545 44290566 59015466 75919524 92990172 109913682 126179038 133189228
17892A33189228J77560P997030J7162312K2057788K1015417M404531j2981599
$$ 133189228 133366788 141363818 158526130 180583918 201599335 206003866 193022267
17885A93022267j6845247j8986848k3440142k5117485k5052204k1805968j5287655
$$ 193022267 176177020 157190172 133750030 108632545 83580341 61774373 46486718
17878D6486718r821327o652650m611292l277262k513418j707461j292145j057421
$$ 46486718 36665391 30012741 25401449 22124187 19610769 17903308 16611163 15553742
17870A5553742o99704o86212l37509j18884L17973O72740R35926J360588J608197
$$ 15553742 14854038 14167826 13830317 13711433 14029406 14702146 15638072 16998660 18606857
17861A8606857J765578J684600K186327L962724O294297R360301J3289812J6584138
$$ 18606857 20372435 22057035 24243362 28206086 34500383 43860684 57150496 73734634
17853G3734634J7072621J5928702J5054133P581067o472477o328716Q43036M293807
$$ 73734634 90807255 106735957 121790090 129371157 122898680 116569964 117413000 121706807
17845A21706807M057030p183219k2701954j9549808p148030L498127J1654837
$$ 121706807 125763837 118580618 95878664 76328856 69180826 72678953 84333790
17838H4333790J7626782K1122937K2093195J7598794O741966n105715j6129422
$$ 84333790 101960572 123083509 145176704 162775498 169517464 164411749 148282327
17831A48282327k3956243k7191762k5955115j9626870j3008517q582793n694167
$$ 148282327 124326084 97134322 71179207 51552337 38543820 29961027 24266860
17824B4266860m069115k782275k112457j681145j437321j187605j039780q26853
$$ 24266860 20197745 17415470 15303013 13621868 12184547 10996942 9957162 9130309
17816I130309m94937l09530m35753p54715j63835J51775J76246o0638k05596l51007
$$ 9130309 8635372 8325842 7890089 7135374 6971539 7123314 7299560 7238922 7033326 6682319
17806F682319l38941m30474n42962l90255l12230j61328j80536o7111m92441m43794
$$ 6682319 6343378 5912904 5369942 4979687 4667457 4506129 4325593 4258482 3766041 3322247
17796C322247k5985j14878j41662j70418m7879l7023k09105k00256q711j96650
$$ 3322247 3296262 3181384 3039722 2869304 2821425 2784402 2575297 2375041 2366330 2169680
17786B169680j89630O1479K14253R8119p7547j19590q3772j49313m2766k20396
$$ 2169680 1980050 2041529 2255782 2353901 2276354 2156764 2072992 1923679 1880913 1660517
17776A660517J59833N72606M1047o3823J15778l08756k89330m6300l22092j95771
$$ 1660517 1820350 2392956 2434003 2370180 2485958 2177202 1887872 1841572 1519480 1323709
17766A323709K0274O0418J02787K80324M24714j00448k15483P2171K33641l05409
$$ 1323709 1343983 1404401 1507188 1787512 2212226 2111778 1896295 1968466 2202107 1896698
17756A896698l41945j21348j15040J23396J1169j08594j13105j5055j09876J9507
$$ 1896698 1554753 1433405 1318365 1441761 1452930 1344336 1231231 1216176 1106300 1125807
17746A125807j96769j06619k68731j4682J15375j5960K32093K35191j23079r3615
$$ 1125807 929038 822419 553688 539006 654381 638421 870514 1105705 982626 889011
17736H89011L08642J65298k20038L6405J01943J62440Q0731J67153M51708L52927
$$ 889011 1197653 1362951 1142913 1179318 1281261 1443701 1524432 1691585 2143293 2496220
17726B496220j19090m2445J93146Q7082M2836p8643J49584K5221l03884j51489
$$ 2496220 2377130 2334685 2527831 2614913 2657749 2579106 2728690 2753911 2450027 2298538
17716B298538j78634M3001L5573K68743M89169L16985k2134r0524k21304k45547
$$ 2298538 2119904 2162905 2198478 2467221 2956390 3273375 3251241 3160717 2939413 2693866
17706B693866j9303r7173m50968j34632p5054m3207J05242j11539o4542L18785
$$ 2693866 2674563 2577390 2126422 1991790 1916736 1873529 1978771 1867232 1802690 2121475
17696B121475j7595k26131j22715j25600J25141K56268K90980L49059K25117J46531
$$ 2121475 2103880 1877749 1755034 1629434 1754575 2010843 2301823 2650882 2875999 3022530
17686C022530K03396K19700K268J09795K57826K47474M87763L69625L19138N96882
$$ 3022530 3225926 3445626 3447894 3557689 3815515 4062989 4550752 4920377 5239515 5836397
17676E836397Q40382M72933P17715O97718P86021J315196K158508K881871M349902
$$ 5836397 6676779 7149712 7867427 8565145 9351166 10666362 12824870 15706741 20056643
17667B0056643O572648R319646J1727198J3709694J5007694J5618325J1890608
$$ 20056643 26629291 35948937 47676135 61385829 76393523 92011848 103902456
17660A03902456M231512M175433K190872k780152r29227k041723o364232l446066
$$ 103902456 108133968 112309401 114500273 111720121 110790894 108749171 102384939 98938873
17652I8938873k878642l892990J640093P296977J1060104Q722803J022215R64568
$$ 98938873 96060231 92167241 93807334 101104311 112164415 120887218 121909433 122874001
17644A22874001n29773n308924l554757o157325j3120794j2459242j4437418j7853248
$$ 122874001 122344228 117035304 113480547 107323222 94202428 81743186 67305768 49452520
17636D9452520j3798308q852717n556028l846841k483216j556149j166001r57841
$$ 49452520 35654212 26801495 21245467 17398626 14915410 13359261 12193260 11235419
17628A1235419j126413p94570p13885p79615n01224n57087m78884l52937k26009
$$ 11235419 10109006 9314436 8600551 7820936 7319712 6762625 6283741 5930804 5704795
17619E704795l60213l92532q1844p1564R6000l4292J63085j62949j67980k5298
$$ 5704795 5344582 4952050 4870206 4798642 4894642 4860350 5023435 4860486 4692506 4667208
17609D667208r3697j64630k074j76082j07302j79641O2154J01783J42191j77614
$$ 4667208 4573511 4408881 4406807 4230725 4123423 3943782 4005936 4107719 4249910 4072296
17599D072296J82305J31786K77086j9612N4955j82635k08232n15514n00971j4465
$$ 4072296 4254601 4386387 4663473 4643861 4698816 4516181 4307949 3792435 3291464 3276999
17589C276999l14974k85688m1770Q7136j7437K03883L08481K04859L34623L90906
$$ 3276999 2962025 2676337 2634567 2721703 2704266 2908149 3216630 3421489 3756112 4147018
17579D147018K99068l0897j43327m67654n81481m40998k58570L6478N12705L59422
$$ 4147018 4446086 4415189 4271862 3804208 3222727 2781729 2523159 2559637 3072342 3431764
17569C431764L94097J47354L38017M06252K91106J10970J60044K36248L61175
$$ 3431764 3825861 3973215 4311232 4717484 5008590 5119560 5279604 5515852 5877027
17560E877027J31568l57619l59173m44042m27245l89618K01773K53583J87289
$$ 5877027 6008595 5650976 5291803 4847761 4420516 4030898 4232671 4486254 4673543
17551D673543P3441j1123O9656j3393j34373l40689k33104k49836j90657k20606
$$ 4673543 4746984 4735861 4805517 4792124 4657751 4317062 4083958 3834122 3643465 3422859
17541C422859n46469j31669K19565K58477J19277K928o6010J0748k28076n83323
$$ 3422859 2876390 2744721 2964286 3222763 3342040 3344968 3278958 3289706 3061630 2478307
17531B478307l62505K85554J71754P0534j02248j8979J36032K01665r0086J39588
$$ 2478307 2115802 2401356 2573110 2643644 2541396 2522417 2658449 2860114 2770028 2909616
17521B909616L53297L52175l95m20184m51220k82775m1538j63556j96100l29274
$$ 2909616 3262913 3615088 3614693 3194509 2743289 2460514 2418976 2255420 2059320 1730046
17511A730046k67849j44639j67889r951J90478L34803J96548r4361K8186K0056
$$ 1730046 1462197 1317558 1149669 1139718 1330196 1664999 1861547 1767186 1795372 1815428
17501A815428k5230P9559l9061l41701j31718M7178l7337o6151j72728k8843r7795
$$ 1815428 1790198 1869757 1830696 1488995 1357277 1404455 1367118 1300967 1128239 1099396 1001601
17490A001601J40849L35775j74574j18802l8932R4188M9097j3961J1709P0754
$$ 1001601 1142450 1478225 1303651 1184849 1145917 1240105 1289202 1275241 1286950 1357704
17480A357704O4735J24460K64045K91235O826l24954l81591k16168m03196k88147
$$ 1357704 1422439 1546899 1810944 2102179 2109005 1784051 1402460 1186292 783096 494949
17470D94949O0769N2201J21409L0774P564l3476J96436K01554J25160j02162n6732
$$ 494949 555718 607919 729328 760102 767666 734190 930626 1132180 1257340 1155178 1098446
17459A098446k23079M1784P7112L970j65551j50627j53432j13899m2847J9884
$$ 1098446 875367 917151 994263 998233 832682 682055 528623 414724 371877 391761
17449C91761J50309M13913N58666L20879J41587K17357J22050m124m39332q49072
$$ 391761 542070 955983 1514649 1835528 1977115 2194472 2316522 2312398 1873066 1023994
17439A023994l98274q7599j4572J28180J83208j45935j24754P0169L7260K3476
$$ 1023994 625720 538121 523549 651729 834937 689002 564248 634417 671677 695153
17429F95153j88221q3075J21223j41813n4860q0566m0606J8180J00108J768n1565
$$ 695153 506932 423857 545080 403267 348407 267841 227235 245415 345523 347291 295726
17418B95726j1052l2083p5427R6177K5185j24639R478l03056k41558K36864K60882
$$ 295726 284674 252591 177164 273341 298526 173887 183365 -119691 -361249 -124385 136497
17407A36497J69285l58354k64187L5811K64159K12666J49900r3101k54931J26428
$$ 136497 305782 -52572 -316759 -280948 -16789 195877 345777 252676 -2255 124173
17397A24173J92375J01862K6868N4619j6237k95817l1167n4690J77646j21926
$$ 124173 316548 418410 445278 499897 483660 187843 156676 101986 279632 157706
17387A57706j85470Q7403J39236j13201M7600J38821K72091K06738J25591j3742
$$ 157706 -27764 59639 198875 85674 133274 272095 544186 750924 876515 862773
17377H62773j19717J5118j60214l03079J28853L337l2567J02539k6711o5007j89789
$$ 862773 743056 758174 597960 294881 423734 427071 394504 497043 470332 405325 215536
17366B15536l9394M7185j72941K9643K30414J76425L4884J0540n4229j05228j7501
$$ 215536 176142 223327 50386 80029 310443 486868 521752 532292 478063 372835 355334
17355C55334j14208M5257O6368J25152L89301L29071J33603R2521l1093R6868
$$ 355334 241126 286383 352751 477903 867204 1196275 1329878 1422399 1391306 1488174
17345A488174j30049l84211k59060P7810K0012J52295J12663J15006K5784j50544
$$ 1488174 1358125 973914 714854 792664 812676 964971 1077634 1192640 1218424 1067880
17335A067880q3030J4297K8768k90094k7899k9358L694L6663J96099M68979L32945
$$ 1067880 984850 999147 1027915 737821 709922 680564 684258 720921 917020 1385999 1718944
17324A718944J39419J65473Q2856k53824r4533k48712j51069k5743J33149K67612
$$ 1718944 1858363 2023836 2106692 1852868 1758335 1509623 1358554 1332811 1465960 1733572
17314A733572j0386o0455m7895J00560m0328p4568j21844K74229M47208L21110
$$ 1733572 1723186 1662731 1614836 1715396 1675068 1600500 1478656 1752885 2200093 2521203
17304B521203J54639J74130K07227M5405L154J15852J76257K12094M91945L8046
$$ 2521203 2675842 2849972 3057199 3102604 3105758 3221610 3397867 3609961 4101906 4139952
17294D139952j17845K11344M51842L18352L74413N80448J072646J309260J654813
$$ 4139952 4022107 4233451 4685293 5003645 5378058 5958506 7031152 8340412 9995225
17285I995225K488043L923662O420546R631061J3747145J6565940J6524008J3596091
$$ 9995225 12483268 16406930 22827476 32458537 46205682 62771622 79295630 92891721
17277I2891721J0233027J203253k1348927k5337943j6060343q924642l922336
$$ 92891721 103124748 104328001 82979074 57641131 41580788 32656146 28733810
17270B8733810j80997L198041O732710J0671312J4050348J4381581J1759626Q594834
$$ 28733810 28552813 31750854 38483564 49154876 63205224 77586805 89346431 97941265
17262I7941265K15491k0774234k4958962j6367055r709888n863418m019216k528356
$$ 97941265 98156756 77382522 52423560 36056505 26346617 20483199 16463983 13935627
17254A3935627j630187j184669r10773p18589n52424m61695m00201m10592k53439
$$ 13935627 12305440 11120771 10209998 9491409 8938985 8477290 8077089 7666497 7413058
17245G413058m0438q7800k40846k7142J73691J91878L24938L03398O43243O75584
$$ 7413058 7372620 7284820 7043974 7016832 7190523 7382401 7707339 8010737 8653980 9329564
17235I329564Q07273J917416K756934M120422O808790J0342496J3427712J3811551
$$ 9329564 10136837 12054253 14811187 18931609 25740399 36082895 49510607 63322158
17227F3322158J2095222R793553N902795j0456238k2958259j7211621r933952
$$ 63322158 75417380 85210933 91113728 80657490 57699231 40487610 30553658
17220C0553658n026026j506630J678965M578161P995429J1362260J2336919J0511399
$$ 30553658 25527632 24021002 25699967 30278128 38273557 49635817 61972736 72484135
17212G2484135Q031694M552385j0751824k2280018j7049898j0518069o274939
$$ 72484135 80515829 85068214 74316390 52036372 34986474 24468405 18193466
17205A8193466l940235k777319k001500j199020q84961p88724n76694n53958j81529
$$ 18193466 14253231 11475912 9474412 8275392 7390431 6601707 6025013 5471055 5289526
17196E289526m25162l66130p8475M0856m65269p84022k75654J0778m544J43222
$$ 5289526 4864364 4498234 4419759 4460615 3995346 3211324 2935670 2946448 2941904 3085126
17186C085126k13250k83609l36255l97649n2786j22594r9596J57749M5607p5435
$$ 3085126 2871876 2588267 2252012 1854363 1801577 1678983 1579387 1737136 1782743 1707308
17176A707308k65350o4808k562P7211j69798j91631p2088J60558O9646j28902
$$ 1707308 1441958 1377150 1374588 1451799 1282001 1090370 1018282 1178840 1248486 1119584
17166A119584K12463o1532k21371R4428J60488j22592j06488K55431k56552j77665
$$ 1119584 1332047 1270515 1049144 1143572 1304060 1181468 1074980 1330411 1073859 896194
17156H96194K06125k4058o4276j03551k14166P4418L37517J18053o469p0561k82253
$$ 896194 1102319 1078261 1013985 910434 696268 770686 1108203 1226256 1219787 1149226 866973
17145H66973l6422J18038J80845J43530p735j25715Q0278J15221j44144j90328
$$ 866973 830551 948589 1129434 1272964 1265229 1139514 1219792 1335013 1190869 1000541
17135A000541Q9863K04193q4743k29931k18750j99782j12393j83924Q1139J16260
$$ 1000541 1090404 1294597 1209854 979923 761173 561391 448998 265074 346213 462473
17125D62473J08149N5293l4873l0370K42262N2403p2517j16718n4469j25868j77355
$$ 462473 570622 625915 591042 560672 802934 855337 782820 666102 611633 485765 308410
17114C08410R1113J7983J4011R613j56298l5188K2233P9325L3859j35614j22028
$$ 308410 399523 417506 431517 441130 284832 249644 271877 351202 385061 249447 127419
17103A27419O7010N2385J89091L58034j65300N2325J49450k11732q6957l06645
$$ 127419 194429 246814 435905 793939 628639 680964 830414 618682 531725 225080
17093B25080o1528J9223k5546L4068M5399N80J0880j19487Q227K2017J46208l8976
$$ 225080 163552 182775 157229 191297 236696 237276 248156 128669 136896 158913 305121 266145
17081B66145J49356j64801j37150q7234j09113p762O9576P6592m8627k59453O6771
$$ 266145 415501 250700 113550 26316 -82797 -90559 -20983 55609 6982 -252471 -185700
17070a85700K53791l4971R8822k25111J25264M802M0899r8495j14832J26212J15172
$$ -185700 68091 33120 131942 -93169 32095 36897 77796 -20699 -135531 -9319 105853
17059A05853J75293q5431N3343N2873l31505m21156j57546J21252M7572J43153
$$ 105853 281146 195715 249058 301931 -29574 -450730 -608276 -487024 -439452 -296299
17049b96299p1022K35320K18962k35476j01657j35208l2792J66413K60333R5074
$$ -296299 -367321 -132001 86961 -148515 -250172 -385380 -418172 -251759 8574 103648
17039A03648Q3246j63548j24250Q2826J00555K78716k4006l0402q097j35593K49303
$$ 103648 186894 23346 -100904 -18078 82477 361193 337187 306785 298688 163095 412398
17028D12398J52578j68322O1267Q9237l24150k29643N9140K60719J26675j99902
$$ 412398 564976 396654 457921 547158 223008 -6635 52505 313224 439899 239997
17018B39997J40494q4320n7947j1599K18630K05012k25337j12715O8888K18383
$$ 239997 380491 296171 238224 226625 445255 650267 424930 312215 381103 599486
17008E99486J21628o3667r3237J14863J82796K17545j30349j47871Q4636K35275
$$ 599486 721114 657447 564210 679073 861869 1079414 949065 801194 885830 1121105
16998A121105K22563L06371K94619K92175M83150k75059m58853m36841m46497
$$ 1121105 1343668 1650039 1944658 2236833 2719983 2444924 1986071 1549230 1102733
16989A102733l25853o7742K89500R0921j76069k5838l8086j69955k0074j10896
$$ 1102733 776880 709138 998638 1089559 913490 887652 849566 679611 659537 548641
16979E48641m516K85325L64606L07666K01624L90834N79663M4214o32385p22563
$$ 548641 544125 829450 1194056 1501722 1703346 2094180 2673843 2718057 2085672 1363109
16969A363109k42444Q2581P453j40451M8514k15061j66425R8105J49621Q7501
$$ 1363109 1120665 1203246 1210699 1070248 1118762 903701 737276 835381 985002 1072503
16959A072503n5192J11832J53361n4449L69369N69231M77993J08086K16689O1068
$$ 1072503 1017311 1129143 1282504 1228055 1597424 2166655 2644648 2752734 2969423 3030491
16949C030491n47349n48075l10507l56175m38823j00412K28432K68398r3424j53938
$$ 3030491 2483142 1935067 1624560 1268385 829562 729150 957582 1225980 1132556 978618
16939I78618J9879J52342J84818J09794L90327J77845K89176L85125M96064K35092
$$ 978618 998497 1150839 1335657 1445451 1835778 2013623 2302799 2687924 3183988 3419080
16929C419080K7847L4761l63098l40143k80942l75182j40190K26123J48613j1330
$$ 3419080 3446927 3481688 3118590 2778447 2497505 2122323 1982133 2208256 2356869 2345539
16919B345539R6247K05025K0182J30405k9027J62646M15104M39862L92189M28303
$$ 2345539 2441786 2646811 2666993 2797398 2768371 2931017 3346121 3785983 4178172 4606475
16909D606475Q01897J052319J250823J386781J565527J909778K681532M089871
$$ 4606475 5408372 6460691 7711514 9098295 10663822 12573600 15255132 19345003
16901A9345003O760299J1106789J7063979K3909859K8491561K9476115K6128501
$$ 19345003 26105302 37212091 54276070 78185929 106677490 136153605 162282106
16894A62282106J8459255m829447k7167002m2000821l7022664k2536523j3078772
$$ 162282106 180741361 175911914 148744912 106744091 69721427 47184904 34106132
16887C4106132p808509m805088l097369k255064j795405j603541j289930j381051
$$ 34106132 26297623 21492535 18395166 16140102 14344697 12741156 11451226 10070175
16879A0070175j138580r51623p22514n50651m41047q3558j8880l5346N0155j0115
$$ 10070175 8931595 7979972 7257458 6706807 6265760 6182202 6163322 6127976 6178131 6168016
16869F168016K37397O8162K68373O82653N53396Q15400J047773J737887J859168
$$ 6168016 6405413 6473575 6741948 7424601 7977997 8793397 9841170 11579057 13438225
16860A3438225K050683L454596N256372Q084372J3134913J9347978K4796319K6945069
$$ 13438225 15488908 18943504 24199876 32284248 45419161 64767139 89563458 116508527
16852A16508527K4984561K0581204M796473j8497028l5068775l8329485k5728566
$$ 116508527 141493088 162074292 166870765 148373737 113304962 74975477 49246911
16845D9246911j4832154q949599n372662l657067k567767j480534j200429j450865
$$ 49246911 34414757 25465158 20092496 16435429 13867662 12387128 11186699 9735834
16837I735834j344777j157679q98166p47008l50472m57932m04476k57487j98405
$$ 9735834 8391057 7233378 6335212 5588204 5237732 4779800 4375324 4117837 3919432
16828C919432n38978j35113j79295k97285j23139k49141j39738K56175O9843P4016
$$ 3919432 3380454 3245341 3066046 2768761 2645622 2396481 2256743 2512918 2582761 2656777
16818B656777o8459J36987J3554j04118m6305j56480j27248k56762k58065n1688
$$ 2656777 2588318 2725305 2738859 2634741 2588436 2431956 2304708 2047946 1789881 1738193
16808A738193L0499j40048j3680k26443l76230j7651J09433K39476J41457k28726
$$ 1738193 1768692 1628644 1614964 1388521 1012291 994640 1104073 1343549 1485006 1256280
16798A256280j31727O5628J30349m3966j76969j54577k88804j20240m3107r4708
$$ 1256280 1124553 1190181 1320530 1276564 1099595 945018 656214 535974 492867 398159
16788C98159J81616K82061j57311r7445j23560k19394n4937K50481o6574J09752
$$ 398159 579775 861836 704525 607080 483520 264126 209189 459670 393096 502848
16778E02848J15437M630O6357n8295J7672j45084l0503K51565M5628o5707P5539
$$ 502848 618285 622915 689272 630977 648649 503565 473062 724627 770255 704548 780087
16767G80087q0162M787k4642m0568n6545j61063m21669O7229M40461o3851l6817
$$ 780087 699925 704712 680070 639502 582957 421894 225 67454 507915 444064 407247
16756D07247J69659K7190j07553j23279p777o7103j70011l4803K1725K08178p0460
$$ 407247 576906 604096 496543 373264 365487 298384 128373 93570 115295 323473 253013
16745B53013j64567k53193J38483K65230j25334j59214j02918p2310l3597J71636
$$ 253013 88446 -164747 -26264 238966 113632 -45582 -148500 -220810 -254407 -82771
16735h2771P6004k01810P5294J07976j05581J03143Q7235N8443k2104o6761L2677
$$ -82771 -6767 -208577 -133283 -25307 -130888 -27745 59490 117933 95829 29068 61745
16724F1745J06956J89102P050O18J45893J17367q4481j13780l18884k51590R69
$$ 61745 168701 357803 364853 365471 511364 628731 544250 430470 111586 -140004 -139035
16713a39035J55173k75819J1041N1188J72972K55165K77360J69656j92305k15194
$$ -139035 16138 -259681 -248640 -197452 -24480 230685 508045 677701 485396 270202
16703B70202R0927j27621j70562o3087r5500l8364J2357o6152O0387J91100j15389
$$ 270202 361129 233508 62946 -141 -95641 -134005 -121648 -187800 -127413 63687 -51702
16692e1702k09357j93392j67609j00523j8967J42635L64427K09012r4047N9858
$$ -51702 -261059 -454451 -622060 -722583 -741550 -598915 -234488 -25476 -119523 -59665
16682e9665J30187O1605k79130r4292K29099n7716q4206K14370J23568l87268
$$ -59665 70522 132127 -147003 -241295 -12196 -69912 -154118 60252 183820 -203448
16672b03448M6496L05778r918q0977J6671J12911K9191j34676J48496m9094J93399
$$ -203448 -156952 148826 138908 57931 74602 187513 216704 82028 230524 181430 374829
16661C74829P0797j28101m63725l37951L08828K03920J6069J5191J1186J42094
$$ 374829 445626 317525 -146200 -484151 -175323 28597 44666 59857 71043 213137
16651B13137K21944k3150k53957r9095R2953J2282q9415m2224K57270P3752k71842
$$ 213137 435081 411931 157974 58879 151832 164114 74699 32475 289745 363497 91655
16640I1655k41759J18513N163j4952n2850N4318O3346k71751j74952K71560J85385
$$ 91655 -150104 -31591 -26428 -41380 -94230 -39912 23434 -248317 -423269 -151709 33676
16629C3676j37611j96079o5295P2010q3412K43622o1232Q0994j43863J874K2929
$$ 33676 -103935 -300014 -365309 -293299 -376711 -133089 -194321 -113327 -257190 -255316 -232387
16618b32387J919J17655L2896K56825L50846L4442l82877j31966J27207J04229
$$ -232387 -230468 -112813 -79917 176908 527754 562196 179319 47353 174560 278789
16608B78789k24405m3732J54861k6706p2018r6171J34337r2355o344O2115k9357
$$ 278789 54384 10652 165513 138807 66789 -29382 104955 12600 6256 68371 39014
16597C9014p3033p9437j44680P114N007J7248j2450o9268j54256J31K50327N2407
$$ 39014 -34019 -113456 -258136 -251022 -246015 -228767 -241217 -310485 -464741 -464610 -214283 -161876
16585a61876L01985L05381k08081j99897M9698M2890L69254J51070q3414K668
$$ -161876 140109 445490 237409 37512 87210 130100 499354 650424 567010 569678
16575E69678J62508J19621K74725J45806k71724J60356K39375K56021K0165k48964
$$ 569678 732186 851807 1126532 1272338 1000614 1160970 1400345 1656366 1676531 1427567
16565A427567M0338N5461J8440q5550k83981j9882M0840j25691k89672p025l26111
$$ 1427567 1467905 1523366 1541806 1456256 1172275 1152393 1193233 1067542 777870 770845 444734
16554D44734m23710p0179J84795L0643k22779k3545j638K4157j8103L9960K96249
$$ 444734 21024 -49155 135640 166283 -56496 -80041 -81679 -57522 -75625 -35665 260584
16543B60584J28489j29517j41520k13613m83897p4226J88234J44596N6987K46143
$$ 260584 389073 259556 118036 -95577 -579474 -653700 -465466 -320870 -263883 -17740
16533a7740J15816o5967p1387K3465j51763p0570K01578M21509r360j72270L4022
$$ -17740 98076 32109 -39278 -15813 -167576 -238146 -36568 384941 375581 203311 237333
16522B37333J79614O1575l4382M9865n6958k27329j52408n1193J27090k1803m5879
$$ 237333 416947 478522 444140 494005 437047 209718 57310 6117 133207 111404 65525
16511F5525n5524K2475j46483j3865K50909J78578k27359j72465K6555l2726m7014
$$ 65525 10001 32476 -114007 -127872 123037 301615 74256 -98209 -71654 -104380 -151394
16500a51394K04044P1828K8376k36584j11805J56524P6372k03595k6830J61455
$$ -151394 52650 124478 152854 -83730 -195535 -39011 37361 -166234 -193064 -31609
16490c1609K11520J83503j4742l12934j68861l18762J45605J05942o2076M3341
$$ -31609 179911 363414 348672 35738 -133123 -451885 -306280 -200338 -262414 -219073
16480b19073L50447q100K24246l813k32865O7244k52956j39301J39926O9576l3750
$$ -219073 131374 123274 347520 343707 110842 178086 -74870 -214171 -74245 -4669 -38419
16469c8419j36836k5046O5005o252r1118j12478K6632N1807j40170J12153M35599
$$ -38419 -175255 -200301 -135296 -141548 -232666 -345144 -318512 -266705 -406875 -294722 140877
16458A40877k43210O8018J90568j18563j61772K9639l8347K17052j09483K13341
$$ 140877 -102333 -34315 156253 37690 -124082 -94443 -132790 84262 -25221 188120
16448A88120J244k88448k47709J06403J75701k2822j51609j54612j57829O7655
$$ 188120 189364 -99084 -346793 -240390 -64689 -87511 -239120 -393732 -551561 -483906
16438d83906Q1494K0998J57078J54244j07352k20686j05600O4665J4643J32804
$$ -483906 -402412 -381414 -224336 -70092 -177444 -398130 -503730 -439065 -424422 -291618
16428b91618O7877p8724o3509j39933M4907L5732K62804L20057j44483J87631
$$ -291618 -223741 -302465 -365974 -505907 -461000 -425268 -162464 157593 13110 200741
16418B00741O378l31714m52333J92506M18293k2433j12025j78288R5830M2282
$$ 200741 207119 -124595 -576928 -384422 33871 11438 -100587 -278875 -183045 -140763
16408a40763n5950K1889J17133O862o8519p8828k7687j50742k65607J54482K86509
$$ -140763 -196713 -174824 -57691 -50829 -119348 -198176 -225863 -376605 -642212 -487730 -201221
16397b01221M20849J37921k33369j86727J6443N4029n2371k3527J16567k03830
$$ -201221 219628 357549 124180 -62547 -46104 7925 -44446 -67973 48594 -155236
16387a55236k89312q0711L50427K61213k8565m5657l0655l4142R5487l9478N3352
$$ -155236 -444548 -525259 -174832 86381 57816 12159 -18496 -52638 42849 3371 56723
16376E6723O9575j75673J35051J15073J54k49879l36099J9140O7082K27662j50560
$$ 56723 126298 -49375 85676 200749 200903 -48976 -385075 -365935 -298853 -71191 -221751
16365b21751J6427J94186R7106j96077k33196Q2719K09481M9532j7215j5223j86359
$$ -221751 -205324 -11138 85968 -110109 -343305 -260586 -51105 -1573 -18788 -34011 -220370
16354b20370J1651J85752m7614l70003J73436K31902J935j450q9846P935O8422
$$ -220370 -208719 -22967 -70581 -440584 -267148 -35246 -33311 -34761 -124607 -116672 -48250
16343d8250M355R208j59212K5334K76890j66514j68128j21318J23011K23399o070
$$ -48250 -43895 -34687 -193899 -168565 108325 -58189 -226317 -347635 -224624 -1225 -7295
16332g295j66091O8973L32274J88012l65215j76272j34452J68474N1572j99924
$$ -7295 -173386 -104413 227861 415873 50658 -125614 -260066 -91592 -40020 -239944
16322b39944L8860j22309J56097j28901J3325J27619J83460P5619j10417j20092
$$ -239944 -201084 -323393 -167296 -296197 -282872 -155253 28207 103826 -6591 -126683
16312a26683l1315J05750R0853n2476j0219J61100q4504m3177k35381r5637q7272
$$ -126683 -157998 -52248 38605 -13871 -24090 137010 52506 9329 -226052 -321689 -408961
16301d08961k08812m4145L23517J70035k2069k06383j22093N6469L80270R5232
$$ -408961 -617773 -661918 -338401 -168366 -190435 -396818 -518911 -462442 -82172 13060
16291A3060j5671j2299j05611J00436Q4231O6497j18714M4541R5342n047J32901
$$ 13060 -2611 -14910 -120521 -20085 64146 130643 11929 56470 151812 146765 279666
16280B79666J52045K1864J21569K9659Q6629j73555m0503M749k20070L1743j02718
$$ 279666 431711 453575 575144 604803 691432 517877 477374 482123 262053 293796 191078
16269A91078l30814N4104J07718j32368j78751j23845K8117L13394M96202j14724
$$ 191078 -139736 -85632 22086 -110282 -289033 -412878 -384761 -71367 424835 310111
16259C10111l57529k78213L6102K87147J07143k8135Q9316J51863l0043k61521
$$ 310111 -47418 -325631 -289529 -2382 104761 76626 165942 317805 287762 26241
16249B6241k48250J04063K15482r7829n8931J15702K40799Q8161N3539j15729
$$ 26241 -222009 -117946 97536 -293 -59224 56478 297277 385438 438977 323248
16239C23248p7513R3947K75660j04303J75899k854m8107q5101m2677j68847j13311
$$ 323248 245735 339682 615342 511039 686938 684084 635977 550876 508199 339352 226041
16228B26041J32480l159Q9121J92872l14012j21806l06738Q9815O4540m5337J8659
$$ 226041 358521 355362 444483 637355 323343 201537 -105201 -15386 49154 3817 22476
16217B2476J52732J40277n0891o3554J26326K89448p3591k94455k69753k01299
$$ 22476 175208 315485 264594 201040 327366 616814 543223 248768 -20985 -222284
16207b22284k84597Q0022K96921j26926k36395K44396K17544M43980K25887l35595
$$ -222284 -506881 -426859 -129938 -256864 -493259 -248863 -31319 412661 638548 302953
16197C02953m12328j24643n64N3557J45358Q2645j06095m1214n5386J77277p8033
$$ 302953 -109375 -234018 -234582 -181025 -35667 46978 -59117 -100331 -155717 21560 -56473
16186e6473l77359k20620P0646J02961M4486J5535j33051m2349L10945J15450
$$ -56473 -433832 -654452 -583806 -480845 -436359 -420824 -553875 -596224 -285279 -169829
16176a69829M1277R5284k0779O8043o5615r5626J44873j30653j93276o5004M1880
$$ -169829 -128552 -33268 -54047 13996 -51619 -147245 -2372 -133025 -326301 -391305 -349425
16165c49425l8522P282L94918l6638o6179J29268P0798j21366O6442j12575j34434
$$ -349425 -387947 -380665 14253 -22385 -88564 40704 111502 -9864 56578 -55997 -190431
16154a90431n8399K24891J26868m4491j48267q8641Q8562R8198k27444j63292
$$ -190431 -248830 -23939 102929 58438 -89829 -178470 -89908 8290 -219154 -382446
16144c82446o0915K98179J39262O7126r61j47069L9297M7656J26738K4807l0367
$$ -382446 -443361 -145182 -5920 61206 60245 -86824 -47527 129 126867 151674 121307
16133A21307J5057m9162j05546j94858j75733j5614K52535J56594r1924J27809
$$ 121307 136364 87202 -18344 -213202 -388935 -404549 -152014 4580 -87344 40465
16123D0465K9315j51415j53495M3247J08420j0368J54757j5116r8704j22997m3106
$$ 40465 69780 -81635 -235130 -191883 -83463 -93831 60926 45810 -52894 -175891 -218997
16112b18997j20105K43242N8859J6880O4680k9045l9044K817j19314j82220k68283
$$ -218997 -339102 -95860 -37001 -20121 44559 15514 -23530 -20713 -140027 -322247 -590530
16101e90530J66128J22719L5854R8129L5691L29411j24275k23421J783J21433
$$ -590530 -424402 -301683 -265829 -167700 -132009 197402 73127 -150294 -148511 -27078
16091b7078l3607k6019K336q4671M0360L4698K15453M9314o0769j54403n2237
$$ -27078 -60685 -86704 -84368 -169039 -128679 -93981 121472 170786 110017 -44386 -96623
16080i6623r6404j34716J83988j62542j38122j41131K19848M21932L3135p0673
$$ -96623 -193027 -327743 -143755 -306297 -444419 -585550 -365702 56230 89365 18692
16070A8692j38006j22415M4488J4759J9401K45448R403p5750q6487k9709J08185
$$ 18692 -119314 -241729 -197241 -182482 -163081 82367 91770 16020 -70467 -100176 8009
16059H009j298m7749K7454K16287K5687j18504j31994k18907m1161J4018R9549
$$ 8009 6711 -41038 -13584 202703 228390 109886 -22108 -241015 -282176 -268158 -168609
16048a68609J51591J74547k8449O85P827j13710J20054m6338N5083J53418J39557
$$ -168609 -17018 157529 129080 129765 137592 23882 143936 97598 152681 306099 445656
16037D45656o2323l12409j96009j71358M5799k0032K41924j1993l2335j33975
$$ 445656 383333 70924 -125085 -296443 -250644 -270676 -28752 -40745 -73080 -207055
16027b07055Q0269J9005j25795p1481J75631J87409R6422P8098q4737r9065j3537
$$ -207055 -126786 -107781 -233576 -305057 -129426 57983 154405 232503 147766 48701 35164
16016C5164n9616M1922r2165J06774j4783J61386J3213j47143l23301J86840J6171
$$ 35164 -24452 17470 -74695 32079 17296 178682 191895 44752 -278549 -91709 -75538
16005g5538k9565P6704j54865q0641j38921k8582Q8540J07804R754J32374j70691
$$ -75538 -105103 -28399 -183264 -263905 -402826 -431408 -342868 -235064 -225310 -92936 -263627
15994b63627j42449O2696o8062O944K24386M6251Q5794K00001j8614j03468j44792
$$ -263627 -406076 -343380 -411442 -404498 -180112 -133861 -48067 151934 133320 29852 -114940
15983a14940J1090r9577J51231O7033q6921j45349J66163J06416k88002q1584
$$ -114940 -103850 -203427 -52196 14837 -72084 -217433 -51270 55146 -232856 -314440
15973c14440K46025K7576J33671l7033O3562j41572K4604K98261j06310O9470
$$ -314440 -68415 -40839 92832 55799 119361 -22211 2393 300654 194344 263814
15963B63814J89710k28348k90863P162k17127j00222j8909J05814J66558R6545
$$ 263814 453524 225176 -65687 -58525 -275652 -375874 -394783 -288969 -122411 -25866
15953b5866K4064L8914K32037j43649m15750j84646K24198L70543J1626J7502
$$ -25866 -1802 37112 269149 125500 -290250 -474896 -250698 119845 131471 148973
15943A48973N1769n9082L1325j06714k41207q1765m2933j3746J03744l563R357
$$ 148973 200742 141660 172985 66271 -174936 -256701 -299634 -313380 -209636 -213199 -203842
15932b03842J08653K82782K17207J52681J1042o9926k87279k12519J20548K3225
$$ -203842 -95189 187593 404800 557481 568523 498597 211318 -1201 119347 142572
15922A42572p0572p2292r584j83019r8273N76226q142j82739k29492J0254q7341
$$ 142572 72000 -292 -9876 -192895 -291168 285058 276916 94177 -135315 -125061 -212402
15911b12402j59163r5503O7018J92550K91952J567q8011l3382L9055k65457N3712
$$ -212402 -371565 -467068 -400050 -207500 84452 86019 -1992 -35374 3681 -261776 -208064
15900b08064J53596k0426J15293R5912l4305J82034j17940j21703j70657R1110
$$ -208064 -54468 -74894 40399 136311 102006 284040 166100 44397 -126260 -35150
15890c5150m8773j55476j11968j37723M3425K13437n5985j07264P280K7913K37828
$$ -35150 -83923 -239399 -351367 -489090 -445665 -232228 -288213 -395477 -388197 -360284 -122456
15879a22456L33451P0420k7056L6843k6200j81801j80928O6662k40510j97028
$$ -122456 210995 281415 254359 291202 265002 83201 -97727 -31065 -271575 -468603
15869d68603K40448P4358l9072N4387M1716M3683J92950K7446K4872O6558j59469
$$ -468603 -228155 -153797 -192869 -138482 -96766 -53083 139867 167313 192185 258743 99274
15858I9274k85979j5272k7702K50658O7225o6153j70636j93797K5354k7146k9458
$$ 99274 -186705 -201977 -229679 20979 88204 22051 -148585 -342382 -317028 -344174 -373632
15847c73632L3692q997j7143K96617O6791j0145j03242j1059P0120J44568o7451
$$ -373632 -339940 -348937 -366080 -69463 -2672 -12817 -116059 -127118 -56998 87570 20119
15836B0119l133j66455r7505K19460J47640j41401j53821r7329P8150j44536J3166
$$ 20119 16986 -149469 -246974 -27514 120126 -21275 -175096 -272425 -194275 -338811 -325645
15825c25645P9391n4135Q2193J69158L9328N5078m3233J7732R7066p6723l26742
$$ -325645 -246254 -300389 -218196 -49038 -9710 45368 2135 19867 116933 40210 -286532
15814b86532o1446R5689M1787j27996K131j48545J26308K46862J53522M9054m6303
$$ -286532 -347978 -252289 -210502 -338498 -336367 -484912 -358604 -111742 41780 90834 44531
15803D4531j90621K80J0224Q7348P513K2382q6697o4175q9636J95347J63921L1806
$$ 44531 -146090 -145810 -135586 -48238 -40725 -18343 -105040 -169215 -258851 -63504 100417 132223
15791A32223j5772r632j59071k54238j44686J25460J77205l6196m3290j94058
$$ 132223 116451 106819 -52252 -306490 -451176 -325716 -148511 -184707 -227997 -422055
15781d22055M843N0050o4515K87633K71278q58k3516q4035M6879J60539j00914
$$ -422055 -417212 -367162 -431677 -144044 127234 126376 102860 18825 65704 226243 125329
15770A25329J06844K22049k90578n06176j33996K36207J24466Q9243q9310m6628
$$ 125329 232173 454222 163644 -342532 -476528 -240321 -115855 -26612 -115922 -162550
15760a62550J0475O1582n7862k013r3539J30724j22536J3159j8875J44954R6627
$$ -162550 -152075 -90493 -148355 -150368 -243907 -113183 -235719 -222560 -241435 -96481 146
15749A46j39875r8774J50159P7888Q6816p768l41484k0779R0549k55616o491J61259
$$ 146 -139729 -238503 -88344 -10456 76360 68592 -272892 -293671 -203122 -458738 -465229 -303970
15737c03970K9809j82119J9119J95039L59190M3906p8931q0258J11066L34120
$$ -303970 -274161 -456280 -437161 -242122 117068 160974 82043 1785 112851 446971
15727D46971O901k88382j43802P6296K52558J0225m2961J16321K4768k24993j59913
$$ 446971 453872 165490 21688 97984 350542 360767 317806 434127 458895 233902 73989
15716G3989j64888O800j05879p0667r6886J47316J0134q4494J80699N8151l1001
$$ 73989 -90899 -84099 -189978 -260645 -357531 -210215 -200081 -284575 -103876 -45725 -76726
15705g6726N7505j75613o6480K22937P9654o0755j17718j3477m482J8818J67415
$$ -76726 -19221 -194834 -261314 -38377 41277 -19478 -137196 -150673 -155155 -136337 31078
15694C1078J48218K1551j67514J76971q6374k43266k12350K81053p3235r8978
$$ 31078 179296 200847 33333 210304 123930 -119336 -331686 -50633 -123868 -222846
15684b22846J51642J90510o5253J38786J99242r7883j18111j12509k06760k62468
$$ -222846 -71204 119306 54053 192839 392081 294198 176087 63578 -143182 -405650
15674d05650r6635O4540K5381o098N5360J90834J53612j3209j73967r1430N3455
$$ -405650 -502285 -437745 -412364 -418462 -363102 -172268 -18656 -31865 -205832 -297262 -243807
15663b43807r6891j13299K0340j17084J18286j07955k906J10384J6132J95377
$$ -243807 -340698 -453997 -433657 -550741 -432455 -540410 -543316 -432932 -416800 -221423
15653b21423J19617r282P9013j02324j39023M7993K13002n7852k56112j19097
$$ -221423 -101806 -111088 -32075 -134399 -273422 -225429 -12427 -70279 -326391 -445488
15643d45488l2316q9061m5787M20505K18574M472J63919r0139k96443j06691k0285
$$ -445488 -477804 -566865 -612652 -192147 26427 30899 194818 104679 -191764 -298455 -318740
15632c18740J2229J31493p6307J66435K03880N901k96456j57619R3095O9556p057
$$ -318740 -306511 -175018 -251325 -84890 118990 124891 -171565 -329184 -236089 -166533 -173590
15621a73590R0590o8869m0123n1144R1461p5917k7163K14506J36742J65934m0388
$$ -173590 -83000 -151869 -191992 -243136 -151675 -227592 -254755 -40249 96493 262427 222039
15610B22039Q6357J1319r1140j13844j46482J8409o8032j93423n3007m4868J34143
$$ 222039 308396 319715 228575 114731 -31751 -13342 -81374 -274797 -327804 -372672 -238529
15599b38529k76362j31967Q9916K95904J69588J4095j23912q614n6883Q3289M882
$$ -238529 -514891 -646858 -556942 -261038 -91450 -77355 -201267 -209881 -266764 -183475 -178593
15588a78593l0650n8393m4152j16802J51318n7437k8945N5581K40614J307n8825
$$ -178593 -209243 -267636 -311788 -428590 -277272 -334709 -363654 -308073 -67459 -66152 -124977
15577a24977j01595Q5010L9840m6841J19105P1949o2222J5508L96198j44275l65855
$$ -124977 -226572 -141562 -101722 -148563 -29458 42491 -19731 -4223 391975 247700 -118155
15566a18155l824L0970r275k00550j73776J00198J82636j8225J27003p3449K70473
$$ -118155 -121979 -91009 -100284 -300834 -474610 -374412 -191776 -210001 -82998 -156447 114026
15555A14026k0855l9860P8924L6297j75675R6175K29361k04987j05605j13291
$$ 114026 93171 53311 132235 168532 -7143 89032 318393 113406 7801 -105490
15545a05490j37714j55648J41366K14819J43059j27967q9338K8887Q5571o4857
$$ -105490 -243204 -398852 -257486 -42667 100392 -27575 -116913 -88026 -2455 -67312
15535f7312j77385R9566K42550Q698n5195Q2394Q3366R7728l2706N6311j13494
$$ -67312 -244697 -145131 97419 106117 50922 133316 216682 314410 281704 338015 224521
15524B24521k93392j30635q4474p1677J06168j79245j85667M2082P3548L74147
$$ 224521 -68871 -199506 -283980 -355657 -249489 -428734 -614401 -572319 -498771 -124624
15514a24624J01623r5959L7556j34378K27368K78606j3173j06344J13300J21972
$$ -124624 -23001 -118960 -81404 -215782 11586 290192 277019 170675 283975 405947
15504D05947o6242j92337j2861J47855J20514l7770k97334j4069k2571J2493J6362
$$ 405947 339705 147368 134507 282362 402876 365106 67772 53703 31132 43625 59987
15493E9987L07591N0418j54322l39090q6446j4296k313R5525J6913m2133K46116
$$ 59987 367578 417996 263674 -75416 -161862 -176158 -178471 -82946 -66033 -108166 137950
15482A37950O8819j57843l27247j1885P8823J01116j23854J00696J92204j9303
$$ 137950 206769 48926 -278321 -290206 -211383 -110267 -234121 -133425 58779 39476
15472C9476l1125K5538M5035R7846L22863n2879j62921n1752J53031K9514o2360
$$ 39476 8351 33889 78924 176770 499633 446754 283833 232081 385112 414626 352266
15461C52266l21905N5711L14092J61900k05814l99069M1055K62234k74326j32164
$$ 352266 30361 86072 400164 562064 356250 -42819 -1764 260470 -13856 -146020
15451a46020J76724k2888k08458o5630K11989J80857k32500m8095Q5628O526p4699
$$ -146020 30704 7816 -200642 -266272 -54283 126574 -105926 -154021 -68393 -61867 -136566
15440a36566j34966P4373r0160j0051l6832J2015R5134K66224j01598Q2741J83622
$$ -136566 -271532 -197159 -287319 -297370 -334202 -322187 -227053 39171 -62427 20314 203936
15429B03936l7479M7226l47393N143L26165K15566K9329l26464m67297O9634J20239
$$ 203936 166457 213683 -133710 -128567 197598 413164 442493 116029 -351268 -281634 -161395
15418a61395j33802p7081p2414Q7286n0903q6019K13432J91602r0505J36133K05066
$$ -161395 -295197 -372278 -444692 -357406 -408309 -494328 -280896 -89294 -179799 -43666 161400
15407A61400l4293j85467l22887J33507J3294O9279J01174J31703K14700J09080
$$ 161400 127107 -58360 -381247 -247740 -234446 -165167 -63993 67710 282410 391490
15397C91490k93942l84623j35379K37268K39435k07217N6296J27413N621j69936
$$ 391490 97548 -287075 -422454 -185186 54249 -152968 -96672 30741 36362 -133574
15387a33574J5573K01600J19391n3649j69571j24246j96150J34023r9647k30826
$$ -133574 -118001 83599 202990 149341 -20230 -144476 -340626 -206603 -306250 -537076
15377e37076J92935p3535J9718J65358n568M31641L47637j37027k16321k15343
$$ -537076 -344141 -417676 -397958 -232600 -238168 193473 541110 404083 187762 -27581
15367b7581n6867n3970J06961O3904r7941l78800j20754K92151L54739M2107j52158
$$ -27581 -84448 -138418 -31457 32447 -65494 -444294 -565048 -272897 81842 123949 -28209
15356b8209J7987R4130q6741o10k14651k05950J53813J26251k21714k04159J15925
$$ -28209 -10222 83908 -2833 -3443 -218094 -424044 -270231 -143980 -365694 -569853 -453928
15345d53928J52173m037J81702J11742P5552J20096j11244L6323J29768j34591
$$ -453928 -301755 -305792 -124090 -12348 63204 183300 72056 108379 238147 103556
15335A03556m1323N9512r3371k9955J7128q2047l4239j31196j17002J17295P8276
$$ 103556 62233 121745 28374 -1581 15547 -66500 -100739 -231935 -348937 -231642 -153366
15324a53366J91621M3312j68359m05325R8258J5165J18409Q1496j70845P1190
$$ -153366 38255 81567 -86792 -492117 -393859 -378694 -260285 -178789 -349634 -278444
15314b78444J94316J65599q1545j8338R7100K25172r2404k82947j12909J67851
$$ -278444 -84128 81471 -74 -18412 78688 303860 211456 -71491 -184400 -16549
15304a6549k234o2449k83296J28890J7468M0046J30211K37491P91j95460l04269
$$ -16549 -18783 -81232 -364528 -235638 -218170 -178124 -47913 189578 190369 -5091 -309360
15293c09360l8726o81J38215K32547q8769m0805p9055J64720j165j436k34421
$$ -309360 -348086 -348767 -210552 21995 -66774 -107579 -186634 -21914 -23079 -24515 -258936
15282b58936n2454J02635O2903j05900N1103J63868J76912k630q6868k40018j24252
$$ -258936 -311390 -208755 -145852 -251752 -200649 -36781 140131 137501 50633 -189385 -313637
15271c13637J67314j27962o6260j18949P2199L5339o236J85266K67566J35481
$$ -313637 -146323 -274285 -340545 -459494 -387295 -351956 -358192 -172926 94640 230121
15261B30121j07855k5239P4386J64172P9352N3285j78429j87795l20519k11221
$$ 230121 122266 97027 171413 335585 414937 468222 289793 101998 -218521 -429742
15251d29742j49299L2907O9643M2947J99873J44540J34539k14040L6877J55472
$$ -429742 -579041 -546134 -476491 -433544 -233671 -89131 45408 -168632 -131755 23717
15241B3717J0657n3985j49254k09600J83273J49433q8395k47644O5407p3246j25110
$$ 23717 34374 -19611 -168865 -378465 -195192 -45759 -134154 -381798 -316391 -389637 -514747
15230e14747J96424L19980J76882k1982k60983M3393K66907j05759j69037p1595
$$ -514747 -318323 1657 178539 156557 -104426 -61033 205874 100115 -68922 -140517
15220a40517l8475R9484J20984M3435J46107j45200j90905J64022L5552l71306
$$ -140517 -178992 -79508 41476 84911 231018 85818 -105087 58935 94487 -276819
15210b76819J0974J65715J50079J22976k46782o9079L9205K2313j07695k19036
$$ -276819 -265845 -100130 49949 172925 -73857 -142936 -103731 -81418 -189113 -408149
15200d08149N1449J62885J45052Q0038K4581r0638J15784q4590j86070N9181J92541
$$ -408149 -356700 -193815 -48763 31275 55856 -34782 81002 -3588 -189658 -130477 62064
15189F2064J47823J16303J28254J3273j13860j53625o9857j56261L9677J95116
$$ 62064 209887 326190 454444 467717 353857 200232 130375 -25886 13791 208907
15179B08907O5914J71100j2431j67549p1904L9666P2686K09681j74159k43208
$$ 208907 274821 445921 433490 265941 194037 233703 306389 516070 341911 98703
15169I8703j56985k8383N8076J20942K84342J21796Q0152j18063j45212j45315
$$ 98703 -58282 -86665 -28589 92353 376695 498491 578643 460580 315368 170053
15159A70053K5887J18335K11970j46584K3512M9353L7868j049O1120K26772Q4294
$$ 170053 195940 314275 526245 379661 403173 452526 490394 489345 550465 777237 861531
15148H61531j42021j05087j13078j55806k3437o21j26986k07990q9707K29728
$$ 861531 719510 614423 501345 345539 322102 321481 194495 -13495 -103202 126526
15138A26526K44624l20167k97528J22171J75943n4376j48019K05170k1374M0136
$$ 126526 371150 50983 -246545 -124374 51569 -2807 -150826 54344 32970 73106
15128G3106l8011q4295N312J41297j57196J36710Q681M3308J81773K4356r658
$$ 73106 35095 -49200 -43888 97409 -59787 76923 85604 128912 310685 335041 325383
15117C25383j36323J49131j42291r1108l6202k99694n6408J79772K71029M05593
$$ 325383 189060 338191 195900 104792 68590 -231104 -287512 -107740 163289 568882
15107E68882J51273r3881L759P9007o5345k14777o8337K6375k8708O2786k49276
$$ 568882 720155 626274 630033 709040 643695 428918 360581 386956 358248 421034 171758
15096A71758r0715L3546k990o2590J41331j1475l6900j875j24278m0759j37537
$$ 171758 81043 114589 111599 49009 190340 178865 141965 140090 15812 -24947 -162484
15085a62484r6639J57006l3058m9562m0621R7260J36329P5156m7161M5661K55243
$$ -162484 -259123 -102117 -135175 -184737 -225358 -128098 8231 83387 36226 81887 337130
15074C37130k1679k9099R6955j8436P2282j2630q5240j44919O7450L2303k40346
$$ 337130 315451 286352 383307 364871 437153 424523 339283 194364 261814 294117 53771
15063E3771j10738j4221L6241J33201R1599J20696m2606j56919L045Q5496j43471
$$ 53771 -56967 -71188 -34947 98254 189853 310549 267943 111024 114069 199565 56094
15052E6094l18343P8999J76564o7969J9102Q151o1663K39064j08398q5797K36246
$$ 56094 -262249 -183250 -6686 -74655 -55553 -47402 -109065 129999 21601 -64196 172050
15041A72050P5675m9958l2004K59122J14843k7662r3639j52890j59790P4395j29189
$$ 172050 247725 197767 165763 424885 539728 512066 418427 265537 105747 180142 50953
15030E0953l58925R5688J43594n4773j21096J58815J01516L69927K0262Q2935
$$ 50953 -307972 -212284 -68690 -123463 -244559 -85744 15772 385699 405961 488896
15020D88896n9722N8596R5110J30896p7764j58379J7933M32617L24442K91056
$$ 488896 429174 487770 582880 713776 636012 477633 495566 928183 1252625 1543681
15010A543681P56010J223436J580953K045280J811508J350519J007146j246067
$$ 1543681 2299691 3523127 5104080 7149360 8960868 10311387 11318533 10072466
15002A0072466l701171k538853j184931p00542n87182l04376j39183k20113K31942
$$ 10072466 6371295 3832442 2647511 1946969 1359787 1055411 916228 696115 928057
14993I28057O2914j11451Q8153p3041k24753R3401O5405P5070R1030o9821k47901
$$ 928057 990971 879520 967673 894632 669879 763280 828685 903755 994785 924964 677063
14982F77063j455p4680k33030j10451J49580J37793R0162j10146L4226o4829q5103
$$ 677063 675608 600928 367898 257447 407027 544820 634982 524836 559062 494233 409130
14971D09130J18822J74200k007j11055j26654j82943Q6759k55558j95196J56760
$$ 409130 527952 702152 700145 589090 462436 279493 366252 110694 -84502 72258
14961G2258J40857n5422p7660j11863K4479J31496R6634P3599P9627q5557l08342
$$ 72258 213115 157693 80033 -31830 -7351 124145 220779 294378 374005 288448 -19894
14950a9894P2877O0288Q644j27799M7466p3888j4358O1922k17139N4028K53346
$$ -19894 52983 113271 121915 -5884 41582 -32306 -46664 15258 -201881 -147853 105493
14939A05493K9151j43349p5893k1006P8344Q1542J07434L64884p9726m30275j34060
$$ 105493 134644 -8705 -84598 -105604 -27260 54282 161716 526600 446874 16599 -117461
14928a17461o6587j22234n3309o9019R9982L40155j8532k63862J87367L05657
$$ -117461 -184048 -306282 -359591 -428610 -328628 11527 -7005 -270867 -83500 222157
14918B22157P7802l41219o4762K99931K90151L1374l26961r4396j47176o909m3044
$$ 222157 299959 -41260 -106022 193909 484060 515434 188473 94077 -53099 -60008 -103052
14907a03052J25039R879Q8155k40376j42450K35914j41495L4611N4034M3466j04030
$$ -103052 21987 31866 120021 -120355 -262805 -26891 -168386 -133775 -79741 -36275 -140305
14896a40305k31771q8343J73205l715j39594m6964J55803O2417L7202Q0067k24533
$$ -140305 -372076 -460419 -287214 -290929 -430523 -477487 -321684 -259267 -222065 -141998 -366531
14885c66531p2389K66300R7537J3429J98568j34094j40964q5023K2821J27423
$$ -366531 -438920 -172620 -75083 -61654 136914 2820 -138144 -223167 -200346 -72923
14875g2923m4198O1969j7309n5567q6125n6890L4874K49044n2619L5412k6755
$$ -72923 -117121 -55152 -72461 -128028 -214153 -271043 -236169 12875 -39744 -4332 -31087
14864c1087q1883k19107n8607K68803J04622k37032j15034N4163J44356L3222
$$ -31087 -112970 -332077 -390684 -121881 -17259 -254291 -369325 -315162 -170806 -137584
14854a37584J05616O8442k0236j65310K8313K0587m1283j28262J2657o9336J13554
$$ -137584 -31968 36474 16238 -149072 -120759 -100172 -141455 -269717 -257060 -326396 -212842
14843b12842K77828r2276J10003J66618m9080j7537k28455j14211j0265l1438
$$ -212842 64986 -27290 82713 249331 200251 182714 -45741 -159952 -170217 -201655
14833b01655n112j50305J15130M8177K55660l40367l26592j32300K38995J61314
$$ -201655 -206767 -357072 -241942 -193765 61895 -278472 -605064 -737364 -498369 -337055
14823c37055j14182O1669M3734K28751Q0129Q3814j05242j99696k55413J71304
$$ -337055 -451237 -389568 -345834 -117083 -36954 46860 -58382 -258078 -513491 -342187
14813c42187J45198Q8767q4808L0033j9655P5686N0135j39546L0424J14366R387
$$ -342187 -196989 -108222 -193030 -162997 -182652 -106966 -56831 -196377 -165953 -51587 -42200
14802d2200O005q5754o1053r7506m942q0334J32167P3959N246R1249l8367j14496
$$ -42200 -36195 -121949 -183002 -280508 -285450 -365784 -233617 -159658 -154412 -63163 -101530 -216026
14790b16026N3556R9354J90256J38010J03574K7520k08955l5197K23426k39580
$$ -216026 -162470 -63116 127140 265150 368724 396244 187289 152092 375518 135938
14780A35938j73268k8622K83841K24527j41517n4929k05289j53658j4457k895
$$ 135938 -37330 -65952 217889 442416 300899 245970 40681 -112977 -127434 -130329
14770a30329m9996k3810o3712J97247j0402m0492j3888k25075Q0052J65171k9571
$$ -130329 -180325 -204135 -267847 -70600 -81002 -121494 -135382 -360457 -280405 -115234 -144805
14759a44805j50116J32037M08186l5152j61763L76527M5086J6811n6995j06297
$$ -144805 -294921 -162884 245302 210150 48387 424914 470000 486811 429816 323519
14749C23519j18176j29920P6645j41668j94687j6017k5253K53168K10216P1704
$$ 323519 205343 75423 152068 10400 -184287 -200304 -225557 27611 237827 309531
14739C09531P8816p1362Q8647m8289o1815O6339k67515j51981p4903l3807J99326
$$ 309531 388347 316985 405632 357343 295528 361867 94352 -57629 -132532 -166339 32987
14728C2987r816m6334J52032j62048p6210k7204R1632Q2834J44264O5737J27435
$$ 32987 23171 -23163 128869 -33179 -109389 -136593 -44961 37873 182137 247874 375309
14717C75309q2685l22321k75451J7703p055K33010o8705j11911K4981R5360J14792
$$ 375309 292624 -29697 -305148 -287445 -294500 -61490 -130195 -242106 -217125 -121765 -6973
14706f973j13405p3763K79688K2631j30018N9523j48905j04240J39459l2885n4902
$$ -6973 -120378 -194141 85547 108178 -21840 37683 -111222 -215462 -76003 -108888 -163790
14695a63790j86233n7783m0491J52820J17072K1768M7173p5295J296O8341J42585
$$ -163790 -350023 -407806 -448297 -295477 -178405 -156637 -109464 -184759 -183463 -115122 27463
14684B7463o4804P7963P2749j07674k66092j17142j65152P1331J59649j04875
$$ 27463 -37341 40622 113371 5697 -260395 -377537 -542689 -471358 -311709 -416584
14674d16584j67965N4881K14986L32389K4871j30853m7842N5534L9038R7010m6291
$$ -416584 -584549 -529668 -314682 17707 42578 -88275 -136117 -80583 -41545 55465 9174
14663I174o3055l5319p7979Q5088P510M0328j53388j13154J18146K82073J82373
$$ 9174 -53881 -89200 -167179 -82091 -74581 -34253 -187641 -300795 -182649 99424 281797
14652B81797n4470m07464l17152K7134K66522J2919O4135N8562k764J84836k1317
$$ 281797 227327 -180137 -497289 -470155 -203633 -190714 -126579 -68017 -70781 114055 92738
14641I2738r3174p2388j93999m7665J7179n9785J26462L6141o9683j05546J34877
$$ 92738 -436 -72824 -266823 -314488 -297309 -357094 -230632 -194491 -264174 -369720 -234843
14630b34843J15274K63090j0508j18787j34928O1399p1410k84883j41008J24524
$$ -234843 -119569 143521 133013 14226 -120702 -59303 -130713 -415596 -556604 -432080
14620d32080L01808J75770Q559J20971j11726j55932k19337L8163P8943J9916
$$ -432080 -130272 45498 54057 175028 63302 -92630 -311967 -273804 -194861 -174945
14610a74945j93753P210K25414j4537j44782J33192J54721K45196q3409l06905
$$ -174945 -368698 -361488 -136074 -150611 -295393 -162201 -7480 237716 154307 -152598
14600a52598K20406K8448j69710J80593J80136K8774l12075o1577J98776J60794
$$ -152598 67808 96256 -73454 107139 287275 316049 3974 -57603 141173 301967
14590C01967k09719j37680n6142k9274M8757N0441l6735J37951J30872K9680K94529
$$ 301967 92248 -45432 -101574 -130848 -82091 -31650 -68385 69566 200438 230118 524647
14579E24647k20731p6422R9013k0893n5601r6199j90358P0377k80152j20O5368
$$ 524647 303916 227494 326507 305614 250013 153814 -36544 33833 -246319 -246439 -181071
14568a81071l4626n8182N0810Q4887j57254Q3640J22267J48942K43981L8453l2328
$$ -181071 -215697 -273879 -223069 -138182 -295436 -211796 -89529 59413 303394 341847 309519
14557C09519k63212j44771J01436L4082j7796Q6384O8959M682j52510M1391P3851
$$ 309519 46307 -98464 2972 37054 19258 105642 174601 179283 26773 68164 142015
14546A42015q2527L1494P0689K051j99785J69727p8324q9207m0224j5406j19440
$$ 142015 59488 90982 161671 163722 -36063 133664 55340 -33867 -74091 -89497 -208937
14535b08937L4551J17708J03925K4987J7160k5113k25406j43549O254L17857l7345
$$ -208937 -174386 -56678 47247 72234 89394 64281 -161125 -304674 -298420 19437 -17908
14524a7908j64071j44752j57271M8274L44323M8930n8821j0718l38015K47915
$$ -17908 -181979 -326731 -484002 -435728 -91405 -42475 -101296 -112014 -450029 -202114
14514b02114J53456k08806J44834O67q8622J61570m1176j32296J74922L1320j79500
$$ -202114 -48658 -257464 -112630 -111963 -200585 -39015 -80191 -212487 -37565 -6245 -185745
14503a85745K90994K84000k81316j74486p9595k0745k6939K02414n0755q9424
$$ -185745 105249 389249 107933 -66553 -146148 -166893 -193832 8582 -42173 -131597
14493a31597J2271k47242j0617j1136P3139L3029k7011n8498J31778j4200P2791
$$ -131597 -119326 -366568 -377185 -388321 -315182 -282153 -309164 -367662 -235884 -250084 -177293
14482a77293p4805l76925R883q1266N9502l4834M09804L01449R262n4972O8674
$$ -177293 -252098 -629023 -619140 -700406 -640904 -675738 -265934 35515 44777 -10195 58479
14471E8479j58684j10834J1350J09091J71675r6575l3927o548J5647L6275L7629
$$ 58479 -100205 -211039 -199689 -90598 81077 -15498 -49425 -55973 -40326 -4051 33578
14460C3578J06716q3640k40622l5334K05785J73424K1619K00375o4389k21111
$$ 33578 140294 56654 -183968 -219302 -13517 159907 181526 381901 317512 96401
14450I6401J87433m156J25468j90438l29314O2129R8294j72832k67880J52997
$$ 96401 283834 279678 405146 214708 -114606 -52477 45817 -127015 -394895 -241898
14440b41898L39397Q1952k79717j66769l4621J63457o0183j38402M9587N9872
$$ -241898 97499 179451 -100266 -267035 -301656 -138199 -198382 -336784 -287197 -227325
14430b27325J69961M0215l3923p2560r8760j10342O8451j07164p9191n5674n037
$$ -227325 -57364 -17149 -51072 -123632 -222392 -332734 -264283 -371447 -450638 -506312 -511349
14419e11349J35342r9486l3217P7716R0010n8608M3211J79970j7992J12501Q0964
$$ -511349 -376007 -475493 -508710 -430994 -340984 -399592 -356381 -176411 -194403 -81902 -938
14408i38P8189p4724p7007o0766R0995O6783J43664j40040Q6504M6265k31140
$$ -938 77251 2527 -74480 -135246 -44251 22532 166196 26156 112660 158925 -72215
14397g2215O5992O3608j96j4217k75907q913O3652J57459j11355j66165k0990
$$ -72215 -6223 57385 57189 42972 -232935 -241848 -178196 -20737 -132092 -298257 -319247
14386c19247R3133R5515L31497o4087k10057k48683M8285M3340p2553J02293j46918
$$ -319247 -226114 -130599 200898 136811 -73246 -321929 -273644 -230304 -302857 -200564 -347482
14375c47482p2598K63379k570k7931K33016K55347k05835k41168J01664j04647
$$ -347482 -420080 -156701 -159271 -187202 45814 301161 95326 -145842 -44178 -148825
14365a48825R1281N2537k10732P109J32446O6797L4145k0158M6315j43731k84411
$$ -148825 -57544 -5007 -215739 -208630 -76184 -9387 24758 4600 50915 -92816 -377227
14354c77227p54M09905J55228j12631l26060j89080N0192R0639K31437K9069o7542
$$ -377227 -377981 31924 187152 74521 -251539 -440619 -390427 -299788 -68351 -39282 -106824
14343a06824J98782l8952R6322J43493m3663j40229j71405l6617r0153j20944
$$ -106824 91958 53006 149328 292821 249158 108929 -62476 -99093 -189246 -310190
14333c10190J24755P521o3504J90896K20656J00337O262r1082k96084k25247N1131
$$ -310190 -185435 -177914 -241418 -50522 170134 270471 276733 185651 -110433 -335680 -284549
14322b84549l9223j6034J90679P9643N3912L33603Q1866l21664j88658J80063
$$ -284549 -323772 -339806 -149127 -69484 -15572 318031 399897 78233 -110425 69638
14312F9638k10002K8263O2683M5845j73827j824M85510J56309j74819j73274j26868
$$ 69638 -140364 -112101 -49418 -3573 -177400 -179224 306286 462595 287776 114502 -12366
14301a2366j8158P7527k09038l03246K51244L2435n5049K72318L9898j690j64195
$$ -12366 -30524 47003 -162035 -465281 -214037 -181602 -236651 35667 75565 73875 -90320
14290i0320L5701J58332J735O7926r790J1521R3378J04203j38285j54946k94133
$$ -90320 -54619 103713 105448 173374 163584 175105 268483 372686 234401 79455 -214678
14279b14678l139K05927J87821m6501K16234K01567l52119j21481J09021K83474
$$ -214678 -217817 -11890 175931 129430 345664 547231 195112 73631 182652 466126
14269D66126j20222k14128n7666k35853j14376J60844J04754p0741l52811n3821
$$ 466126 345904 131776 74110 -161743 -276119 -115275 -10521 -81262 -434073 -487894
14259d87894J65353R0700J10651J40620K42320J12713R4568o0507j37171k01251
$$ -487894 -322541 -231841 -121190 19430 261750 374463 469031 408524 271353 70102
14249G0102m2965j04859J66054k1335k33513n9929n6677l8382k31058R1272K14253
$$ 70102 27137 -77722 88332 66997 -166516 -226445 -283122 -321504 -552562 -461290 -247037
14238b47037J9267l3038N1371J55344J67247m5538j67135k1839n3430j6380L243
$$ -247037 -227770 -260808 -209437 -54093 113154 67616 -99519 -121358 -174788 -191168 -187925
14227a87925j29745N7668K45048k02487k17349O6239Q7448J83308J64650p0286
$$ -187925 -317670 -260002 -14954 -217441 -434790 -368551 -281103 -97795 66855 -3431
14217c431l7340P376Q5262K9287j04099j73769J03050r5407l21598k05381K1620
$$ -3431 -40771 -33395 51867 81154 -22945 -196714 -93664 -189071 -510669 -716050 -694430
14206f94430J32821K36597K14027O5078j72801J03278K70731k9495m49286j30579
$$ -694430 -561609 -325012 -110985 -45907 -218708 -115430 155301 125806 -323480 -454059
14196d54059L00227J23804J79829j09284j90622p0088J11949r7111j16754Q2803
$$ -454059 -153832 -30028 149801 40517 -150105 -220193 -108244 -205355 -322109 -239306
14186b39306j10973k6384L89447j07171J41J0365k6327J49379K68317Q6466j15075
$$ -239306 -350279 -376663 12784 -94387 -94246 -83881 -110208 39171 307488 393954 278879
14175B78879l3282l5953l81344l7456J84617J82500J76617j63915l21270p3436
$$ 278879 245597 209644 -171700 -209156 -24539 157961 334578 170663 -150607 -224043
14165b24043P3231L8492n0803L8434n4122K98351J18640o8207m4873J2330J5848
$$ -224043 -150812 -112320 -163123 -124689 -178811 119540 238180 169973 125100 137430 153278
14154A53278l1424k44093n0981M2255k4686L5051N5737K44236K4239k51307k1863
$$ 153278 121854 -122239 -173220 -130965 -155651 -120600 -64863 179373 203612 -47695 -69558
14143f9558k6226R8198K01463N1597J31809k26182m5971J54068Q0785k07896o9534
$$ -69558 -95784 2414 203877 255474 387283 161101 115130 269198 349983 142087 72553
14132G2553J78379M8952r3929Q8857m5108J12862P1857M7844k57003j38038J45197
$$ 72553 250932 299884 205955 294812 249704 362566 434423 482267 225264 87226 232423
14121B32423n1325n4768O6617L0125p2292j96677J61355J88197J26489k43059
$$ 232423 181098 126330 192947 223072 150780 -45897 115458 303655 430144 187085
14111A87085j0832j80912j9493j6882j362Q3489l5803J46305J20065Q0364j3440
$$ 187085 176253 -4659 -24152 -41034 -42396 41093 5290 151595 271660 352024 338584
14100C38584j24521l091J64952n5989m3046M120J74698K91511j05457k220j12161
$$ 338584 214063 210972 375924 319935 276889 281009 455707 747218 641761 639541 527380
14089E27380j28255k6725K02692l3946j00092J03155N3411P1116O550k0261J17608
$$ 527380 399125 372400 575092 541146 441054 544209 597620 668736 675286 655025 772633
14078G72633k2645j97284j71472J70286k02667n2002P469J85206R7014j32339
$$ 772633 749988 552704 381232 551518 348851 296849 304318 489524 586538 454199
14068D54199k56647M1821J74984J8353k87128j88947Q2547j31658Q4424J92151
$$ 454199 197552 239373 414357 432710 145582 -43365 39182 -92476 -8052 184099
14058A84099M3677J4090K901j12392J15804J52837j36749o0024m4853k56987k3853
$$ 184099 227776 241866 244767 132375 248179 401016 264267 204243 159390 -97597 -121450
14047a21450J09024N5333j93055O1375J21778M0301K04985K98000k56127k83204
$$ -121450 -12426 42907 -150148 -88773 33005 73306 278291 576291 320164 36960
14037C6960k0266J61974P5195J28984k18655J05068J24790K0183J98059J96516
$$ 36960 16694 178668 253863 382847 164192 269260 394050 414233 612292 808808
14027H08808k9479j11280j70539k19836K30447K2625j22632n537K87987K98408
$$ 808808 779329 668049 497510 277674 508121 530746 408114 402577 690564 988972
14017I88972k6725p4589k08067n6645J1487o9575l73701P7909K10798K35406r024
$$ 988972 962247 887658 679591 622946 634433 564858 191157 269066 479864 715270 706246
14006G06246k20330k20032K1111Q0738k0839k13164N1427J05512L57936r4450
$$ 706246 485916 265884 286995 367733 346894 133730 185157 290669 648605 554155
13996E54155j06976l1004j14155j97493J69531J28904O5165O3169m01548l11661
$$ 554155 447179 416175 302020 104527 274058 402962 468127 531296 129748 -181913
13986a81913J57120L9977J22891L805l2632j23909j46635J51483m1944q4936p035
$$ -181913 -24793 15184 138075 141880 109248 -14661 -161296 -9813 -51757 -136693 -143728
13975a43728k1870j9081K30356K69425K67936j78663q3929M3861J41693q174q0915
$$ -143728 -165598 -184679 45677 315102 583038 404375 320446 364307 506000 497826 416911
13964D16911j15563k02327j95429j2830o6730O2702j7449l0265M4245m3235Q1868
$$ 416911 301348 99021 -96408 -109238 -175968 -113266 -130715 -160980 -116735 -159970 -78102
13953g8102K69187j28727r7606R0273J51387n9876o0459p1005K10699p5413k17719
$$ -78102 191085 62358 -35248 55025 206412 146536 86077 15072 225771 150358 -67361
13942f7361L1706J94246J03702k09988k01800O8375k5438K13263M49963k3700
$$ -67361 -35655 158591 262293 52305 -149495 -81120 -106558 106705 556668 532968
13932E32968j84751k11858l7249o7485m1408q392J45243P4164n083J8545j03043
$$ 532968 348217 136359 99110 31625 -9783 -18175 127068 201232 196149 214694 111651
13921A11651j79409j17014j0621J95456J0687J6255K15937L4683N0399J50091
$$ 111651 -67758 -184772 -195393 63 10750 27005 242942 277625 328024 478115
13911D78115k23578j08532k18388m5135n5309k2057K3701J23974o1770j24217
$$ 478115 254537 146005 -72383 -117518 -172827 -194884 -171183 -47209 -108979 -233196
13901b33196J98859J03095l9837J08768o2016j22344L065J56716J46882k42771
$$ -233196 -34337 68758 28921 137689 75673 -46671 -43606 113110 259992 17221
13891A7221j60609O3399M4402J17669O9699l1442k88867J80648R9570j22514Q0621
$$ 17221 -143388 -79989 -35587 82082 151781 120339 -168528 12120 111690 -10824 69797
13880F9797k02222J9248M893M2450N4682J24978J08337L6245J4508l487j23561
$$ 69797 -132425 -113177 -108284 -65834 -11152 113826 222163 258408 272916 269429 145868
13869A45868j8837o6038q631q2758N5920r1250j1976J14621J97977o763k629J01232
$$ 145868 127031 60993 52362 -30396 25524 -65726 -77702 36919 234896 228133 225504 326736
13857C26736k25851j91109O8044J19534K6106j82002j83937P6044J77513q1681
$$ 326736 100885 -90224 -22180 97354 123460 -58542 -242479 -166435 11078 -70603
13847g0603j8837j81981K20144r2225K8252N9465j05965K54827K28725k0652j42511
$$ -70603 -89440 -271421 -51277 -143502 -115250 -55785 -161750 93077 321802 301150 158639
13836A58639j31958q8844J14811K6087j2596J38960k4597o128P3941P5265j40814
$$ 158639 26681 -62163 52648 78735 66139 205099 180502 174374 248315 323580 182766
13825A82766j6959J38019k8571L8624m7573p3101r6687j85476O1730M0267J16947
$$ 182766 165807 303826 275255 313879 266306 193205 96518 -88958 -27228 13039 129986
13814A29986J67198K32255l87286j34089j65563K50444J17200J42390j35691L3580
$$ 129986 297184 529439 142153 8064 -157499 92945 210145 352535 216844 250424
13804B50424k4580J03026m1874k09790R1255L8607j09330j502J39380j21795R9267
$$ 250424 225844 328870 286996 77206 168461 207068 97738 96236 235616 113821 213088
13793B13088j30292j20784O3613j51379J70380M5283J38014r0888J51672K6035
$$ 213088 82796 -37988 25625 -125754 44626 89909 227923 137035 288707 314742
13783C14742k70757k13885J29919K88483J26670k6586N4360N8229r7870p02k45026
$$ 314742 43985 -169900 -39981 248502 375172 348586 402946 461175 363305 362603 117577
13772A17577k29247k1865L45402J65108k21694o5887Q7167j85786k2297K1199
$$ 117577 -111670 -133535 211867 376975 155281 89394 176561 -9225 -31522 -10323
13762a0323J45099O0326K5061l9318p7722j32660n3583J71263K22604k27206M3062
$$ -10323 134776 195102 220163 180845 103123 -29537 -83120 88143 310747 83541 126603
13751A26603J69041j06234j18915l207J65933J38498M1776l28778k19401j0785
$$ 126603 295644 189410 70495 67288 233221 371719 413495 84717 -134684 -145469
13741a45469M7229L34742q1060j31157K9813K48370l430l26728j28799p1223J86187
$$ -145469 -98240 236502 155442 24285 54098 302468 299038 -27690 -156489 -227712 -41525
13730d1525J72300R3131k68253j59100P0007K47614o559n7850J76974K06241j9187
$$ -41525 130775 223906 -44347 -203447 -133440 114174 107615 49765 226739 432980 413793
13719D13793j02029j65194J44934J1027j50573L4836P7784M347J77477J35019
$$ 413793 311764 146570 291504 302531 151958 186794 264578 268925 446402 581421
13709E81421m2844j00416K6256j90064P502J68105N2370M100j24351j97563j05969
$$ 581421 538577 438161 464417 274353 281855 449960 502330 506430 382079 184516 78547
13698G8547j36332j42811J70186R5224Q0638j78620j74123K23450J29885J09835
$$ 78547 -57785 -200596 -30410 64814 145452 -33168 -207291 16159 146044 255879
13688B55879R4916j41735J06511J6133N4794K5613J70913J61973J06167l27797
$$ 255879 350795 209060 315571 331704 386498 412111 583024 744997 851164 523367
13678E23367q5126p9150J0163R3812N8101R9395m5901R8034J51537Q9347j56813
$$ 523367 438241 359091 369254 463066 521167 620562 574661 672695 824232 913579 756766
13667G56766R596p9059J07942Q3303j04159J49332M145m44237l48961J73961o6613
$$ 756766 766362 687303 795245 878548 774389 923721 927866 483629 134668 308629 242016
13656B42016j81943l4876l543l5731k0893P7409P4284o3797K76539N1616k40289
$$ 242016 60073 25197 21654 -14077 -34970 42439 116723 52926 329465 381081 140792
13645A40792j30081K04864N3729J05888j22902q8325Q6764K14641j3104k33568
$$ 140792 10711 215575 269304 375192 252290 163965 250729 465370 452266 218698
13635B18698Q69J05696j42273j02843r3601p3234J77403N08877l0783k93224n7400
$$ 218698 219567 325263 182990 80147 -13454 -86688 90715 599592 568809 275585 218185
13624B18185k8255J88917l0934L2666L06313Q1215k58206k8666K1595j27866J17286
$$ 218185 189930 378847 347913 380579 686892 768107 509901 481235 502830 374964 492250
13613D92250M9754r3015j00327J11481J32725l5643l1788J15531Q826q3163p2956
$$ 492250 542004 448989 348662 460143 592868 557225 525437 640968 649794 566631 493675
13602D93675O3919K729J02851P649R2838K3308J1976p6119j66996j85415l0551
$$ 493675 557594 560323 663174 670823 763661 786969 798945 722826 555830 370415 339864
13591C39864N4497j4578M0006o3689j18100k9709j52381n0550K84163J49799j00659
$$ 339864 394361 379783 419789 356100 238000 208291 55910 5360 289523 439322 338663
13580C38663j68980L27587L12579k22782r9186r3289K8023K32402J08494K010
$$ 338663 169683 497270 809849 587067 487881 394592 422615 655017 763511 765521
13570G65521J014Q4634j16022j72747r7240M6926m1382j22950J04563j25903o3761
$$ 765521 766535 851169 735147 562400 465160 512086 470704 347754 452317 326414 262653
13559B62653J29679J67988M3907j19495n6892k09501o8241K9721J37024J67194
$$ 262653 392332 560320 604227 484732 427840 218339 150098 179819 316843 484037
13549D84037O8859m2006k12831o3800O3324o9233Q4087J84541k50685L3047K31777
$$ 484037 552896 510890 298059 234259 297583 228350 312437 496978 246293 279340 511117
13538E11117j9217K44656o2036j52242j11111J37927l27226m3460N0135L32681
$$ 511117 491900 736556 674520 522278 411167 549094 221868 178408 228543 561224
13528E61224M5215q2935L4654m9953m1436J35701j14752K016L7294m35J79051
$$ 561224 606439 523504 558158 508205 466769 602470 487718 489734 527028 526593 705644
13517G05644j10340J67499p0327l14125j75433J27227J89306q6710r619O2992
$$ 705644 595304 762803 692476 378351 202918 330145 519451 432741 423122 486114
13507D86114j0088J62095K18193j74930k90472j63411N6040O7637p6614K83725
$$ 486114 476026 638121 856314 681384 390912 227501 283541 351178 274564 558289
13497E58289r601N8005j27316J66011K66960J93310L5562o3764j18044m3315q3894
$$ 558289 548688 606693 479377 645388 912348 1105658 1141220 1077456 959412 916097 832203
13486H32203O9772O119p1097j34548J3077J36500j85846J24458J05373R1265O7878
$$ 832203 901975 908094 836997 702449 715526 852026 666180 790638 896011 987276 1055154
13475A055154O4790L6520k4375q9127m7198K3665J95738m8888j47407n9215J55803
$$ 1055154 1119944 1156464 1132089 1042962 995764 1019429 1215167 1166279 1018872 959657 1115460
13464A115460J19712m2609P8475J25306l1515J3045k03171k28245L4123J60031
$$ 1115460 1235172 1192563 1271038 1396344 1364829 1377874 1174703 946458 980581 1140612
13454A140612j75451P0770L45485J90888j99094m19298n0552K09823K09232k2463
$$ 1140612 965161 1035931 1381416 1572304 1373210 953912 903360 1113183 1322415 1299952
13444A299952j05696J2284J146l4385l2434m8352J04173J51054L4822M1693r3998
$$ 1299952 1194256 1206540 1207686 1173301 1140867 1092515 1196688 1347742 1382564 1424257 1330259
13433A330259k11395j41198J70150J83088K14196J45674j8869j8131N7470n9603
$$ 1330259 1118864 977666 1147816 1330904 1545100 1690774 1671905 1653774 1711244 1651641
13423A651641j33612q1961q1362l08142J65143J37485r377R0006K5972J32523
$$ 1651641 1518029 1436068 1354706 1046564 1211707 1349192 1339815 1429821 1455793 1588316
13413A588316o9360J41645J22194J32800j60867j36943o7508K69614J5936j0664
$$ 1588316 1518956 1660601 1782795 1915595 1754728 1617785 1550277 1819891 1835827 1825163
13403A825163j42016j29955j14975J9343K25168K6401o7784m1359J01989L65443
$$ 1825163 1683147 1553192 1438217 1457560 1682728 1709129 1641345 1599986 1701975 2067418
13393B067418m3862K0980j21091k05686p9643J32109J1244n8400j2159R4136R4043
$$ 2067418 2023556 2044536 1923445 1717759 1638116 1770225 1781469 1723069 1710910 1805046 1899089
13382A899089N2852K43886J83378K66870q4592j76824j40687K29680J85825o0346
$$ 1899089 1951941 2195827 2379205 2646075 2561483 2384659 2243972 2473652 2659477 2599131
13372B599131J435m1852l64089m6909K12737l8247m1328Q9873N5040J43379L10920
$$ 2599131 2600566 2558714 2194625 2147716 2360453 2322206 2280878 2370751 2425791 2569170 2880090
13361B880090N7285r5460O6099j92227K5363L49227K1128j24470n5537K5893j1246
$$ 2880090 2937375 2841915 2908014 2715787 2741150 3090377 3111505 2987035 2931498 2957391 2946145
13350B946145o0251K6387M65805m0167j54633K69377J01983n137p0906m8205L13218
$$ 2946145 2885894 2912281 3378086 3337919 3183286 3452663 3554646 3549509 3478603 3430398 3743616
13339C743616J67011n4585j01308j9040j36746J30270J63769o2231N8479J66066
$$ 3743616 3910627 3856042 3754734 3735694 3598948 3729218 3892987 3830756 3889235 4055301
13329D055301M8415J25572J80397o8465n1839J47651J44438J0189k6194J21584
$$ 4055301 4103716 4229288 4409685 4341220 4289381 4437032 4581470 4591659 4565465 4687049
13319D687049J92430J34584M18551J12252k44946l7224J98510J47537K41854R6572
$$ 4687049 4879479 5014063 5432614 5544866 5299920 5262696 5461206 5608743 5850597 5947169
13309E947169j35509n8745J6585J53529N977J75033L53272J65288J77668R6610
$$ 5947169 5811660 5752915 5769500 5923029 5929006 6104039 6457311 6622599 6800267 6896877
13299F896877K40401J52371K8683Q043J95513J39631J04804J13396J17187K27474
$$ 6896877 7137278 7289649 7318332 7326375 7521888 7661519 7766323 7879719 7996906 8224380
13289H224380K01821K28438K84804K78431J2517J25728J61398J87029M66687K23172
$$ 8224380 8426201 8654639 8939443 9217874 9230391 9356119 9517517 9704546 10171233 10394405
13279A0394405J05107L19045K92344N1044K29952J73411J22351N29062O07253
$$ 10394405 10499512 10818557 11110901 11161945 11391897 11565308 11687659 12216721 12823974
13270A2823974M82548P3444n5262J38420J65471M85547M73518M00872K89904K32245
$$ 12823974 13306522 13379966 13324704 13463124 13628595 14114142 14587660 14988532 15278436 15510681
13260A5510681N92652O90194M88512M89444K68785M84427O35265L78638J53382
$$ 15510681 16103333 16793527 17282039 17771483 18040268 18524695 19159960 19538598 19691980
13251A9691980O00948J037432P84339N48913N83108N57907P03728O63279M87264
$$ 19691980 20292928 21330360 22114699 22663612 23246720 23804627 24508355 25171634 25658898
13242B5658898P06680R31285P81885J010048Q86650R16720R18826R17841J176663
$$ 25658898 26365578 27296863 28078748 29088796 29975446 30892166 31810992 32728833 33905496
13233C3905496J073126R90692J043360J107850R80991J238718J323438J139508
$$ 33905496 34978622 35969314 37012674 38120524 39101515 40340233 41663671 42803179
13225D2803179J232530J341496J178374J481487J341167J170230J342153J124170
$$ 42803179 44035709 45377205 46555579 48037066 49378233 50548463 51890616 53014786
13217E3014786J043648J036453J256098J387419J268697J054560J171267R85088
$$ 53014786 54058434 55094887 56350985 57738404 59007101 60061661 61232928 62218016
13209F2218016J274803J369731J029367Q15782P51040N66996M67769J97145Q3988
$$ 62218016 63492819 64862550 65891917 66707699 67458739 68025735 68493504 68690649 68774637
13200F8774637j60789l17419k85404k38419l10410l65141o58695o77904o53422
$$ 68774637 68613848 68296429 68011025 67772606 67462196 67097055 66438360 65760456 65107034
13191F5107034p69843o82106r10908j003425j023656j114494j190771j265028
$$ 65107034 64337191 63655085 62744177 61740752 60717096 59602602 58411831 57146803
13183E7146803j241228j222143j139164j246376j334350j342447j496345j253128
$$ 57146803 55905575 54683432 53544268 52297892 50963542 49621095 48124750 46871622
13175D6871622j268637j113221j146438j072398j045802j035240q93539r99133
$$ 46871622 45602985 44489764 43343326 42270928 41225126 40189886 39296347 38297214
13167C8297214r13177q64360p34511o94827n10460n11439m81355j80431j94298
$$ 38297214 37384037 36519677 35785166 35090339 34579879 34068440 33587085 33406654 33212356
$$ [...]
##END NTUPLES=NMR SPECTRUM
##END=
