##TITLE=Analysis number 323683
Compound Code rf 01288
Project Code adrs
Chemist Name fudan
##JCAMPDX= 6.0         $$ Bruker NMR JCAMP-DX V2.0
##DATA TYPE= NMR SPECTRUM
##DATA CLASS= NTUPLES
##ORIGIN= Bruker BioSpin GmbH
##OWNER= nmr
$$ XWIN-NMR		Version 3.5
$$ Fri Nov  3 14:59:53 2006 GMT Standard Time (UT+0h)  MAYBRIDGE\nmr@NMR_250MHZ
##.OBSERVE FREQUENCY= 250.131544655141
##.OBSERVE NUCLEUS= ^1H
##.ACQUISITION MODE= SIMULTANEOUS (DQD)
##.ACQUISITION SCHEME= undefined
##.AVERAGES= 16
##.DIGITISER RES= 18
##SPECTROMETER/DATA SYSTEM= dpx250
##.PULSE SEQUENCE= zg30
##.SOLVENT NAME= TFA
##.SHIFT REFERENCE= (INTERNAL, TFA, 0, 16.522)
##AUDIT TRAIL= $$ (NUMBER, WHEN, WHO, WHERE, WHAT)
$$ ##TITLE= Audit trail, XWIN-NMR		Version 3.5
$$ ##JCAMPDX= 5.01
$$ ##ORIGIN= Bruker BioSpin GmbH
$$ ##OWNER= nmr
$$ C:\u/data/dgb/nmr/ADRS/2190/pdata/1/auditp.txt
$$ ##AUDIT TRAIL=  $$ (NUMBER, WHEN, WHO, WHERE, WHAT)
(   1,<2006-11-03 14:59:27.76 +000>,<MAYBRIDGE\nmr>,<NMR_250MHZ>,
      <created by zg, POWCHK disabled, PULCHK disabled
       configuration hash MD5:
       49 4B E0 1D 92 C2 6B 37 9F E6 65 BC 52 41 86 1D
       data hash MD5: 64K
       83 97 A7 F0 3C 6C 55 9D 45 BE 44 6D 88 5D 79 59>)
(   2,<2006-11-03 14:59:41.62 +000>,<MAYBRIDGE\nmr>,<NMR_250MHZ>,
      <Start of raw data processing
       ef LB = 0.3 FT_mod = 6 PKNL = 1 SI = 32K 
       data hash MD5: 32K
       1C D5 D8 A0 DE 6B 18 EF 7A 52 80 AE B1 3C 65 5D>)
(   3,<2006-11-03 14:59:43.17 +000>,<MAYBRIDGE\nmr>,<NMR_250MHZ>,
      <apk 
       data hash MD5: 32K
       CD F1 B7 1A 6F 5D F8 69 8A FF 48 A7 06 66 06 85>)
(   4,<2006-11-03 14:59:44.04 +000>,<MAYBRIDGE\nmr>,<NMR_250MHZ>,
      <abs ABSG = 5 
       data hash MD5: 32K
       4F 0C F6 0E F1 19 F5 AA 38 09 40 3A C0 57 F3 91>)
$$ ##END=
$$ 
$$ hash MD5
$$ 6C A5 31 70 20 03 2D D7 DF 4C F9 AB 41 18 B8 9C
##$RELAX= 
##$RELAX= 
##$RELAX= 
##$RELAX= 
##$RELAX= 
##$RELAX= 
##$RELAX= 
$$ Bruker specific parameters
$$ --------------------------
##$DU= <C:\u>
##$EXPNO= 2190
##$NAME= <ADRS>
##$PROCNO= 1
##$TYPE= <nmr>
##$USER= <dgb>
##$AMP= (0..31)
100 100 100 100 100 100 100 100 100 100 100 100 100 100 100 100 100 100 
100 100 100 100 100 100 100 100 100 100 100 100 100 100 
##$AQSEQ= 0
##$AQ_mod= 3
##$AUNM= <au_zg>
##$AUTOPOS= <31 >
##$BF1= 250.13
##$BF2= 250.13
##$BF3= 250.13
##$BF4= 250.13
##$BF5= 500.13
##$BF6= 500.13
##$BF7= 500.13
##$BF8= 500.13
##$BYTORDA= 1
##$CFDGTYP= 0
##$CFRGTYP= 5
##$CHEMSTR= <none>
##$CNST= (0..31)
1 1 145 1 1 1 1 1 1 1 1 1 1 1 1 1 1 1 1 1 1 1 1 1 1 1 1 1 1 1 1 1 
##$CPDPRG= <>
##$CPDPRG1= <>
##$CPDPRG2= <>
##$CPDPRG3= <>
##$CPDPRG4= <mlev>
##$CPDPRG5= <mlev>
##$CPDPRG6= <mlev>
##$CPDPRG7= <mlev>
##$CPDPRG8= <mlev>
##$CPDPRGB= <>
##$CPDPRGT= <>
##$D= (0..31)
0 1 0 0 0 0 0 0 0 0.06 0 0 0 0 0 0 0.0002 0 0 0 0 0 0 0 0 0 0 0 0 0 0 
0 
##$DATE= 1162565966
##$DBL= (0..7)
120 120 120 120 120 120 120 120 
##$DBP= (0..7)
150 150 150 150 150 150 150 150 
##$DBP07= 0
##$DBPNAM0= <>
##$DBPNAM1= <>
##$DBPNAM2= <>
##$DBPNAM3= <>
$$ [...]
##$SUBNAM7= <"">
##$SUBNAM8= <"">
##$SUBNAM9= <"">
##$SW= 20.6930455092707
##$SWIBOX= (0..15)
0 0 3 0 0 0 0 0 0 0 0 0 0 0 0 0 
##$SW_h= 5175.983436853
##$TD= 65536
##$TD0= 1
##$TE= 683.16
##$TE2= 300
##$TE3= 300
##$TEG= 300
##$TL= (0..7)
0 120 120 120 120 120 120 120 
##$TP= (0..7)
150 150 150 150 150 150 150 150 
##$TP07= 0
##$TPNAME0= <>
##$TPNAME1= <>
##$TPNAME2= <>
##$TPNAME3= <>
##$TPNAME4= <>
##$TPNAME5= <>
##$TPNAME6= <>
##$TPNAME7= <>
##$TPOAL= (0..7)
0.5 0.5 0.5 0.5 0.5 0.5 0.5 0.5 
##$TPOFFS= (0..7)
0 0 0 0 0 0 0 0 
##$TUNHIN= 0
##$TUNHOUT= 0
##$TUNXOUT= 0
##$USERA1= <user>
##$USERA2= <user>
##$USERA3= <user>
##$USERA4= <user>
##$USERA5= <user>
##$V9= 5
##$VALIST= <valist>
##$VCLIST= <CCCCCCCCCCCCCCC>
##$VD= 0
##$VDLIST= <DDDDDDDDDDDDDDD>
##$VPLIST= <PPPPPPPPPPPPPPP>
##$VTLIST= <TTTTTTTTTTTTTTT>
##$WBST= 1024
##$WBSW= 4
##$XGAIN= (0..3)
0 0 0 0 
##$XL= 0
##$YL= 0
##$YMAX_a= 477082
##$YMIN_a= -433010
##$ZGOPTNS= <>
##$ZL1= 120
##$ZL2= 120
##$ZL3= 120
##$ZL4= 120
##$ABSF1= 16.522
##$ABSF2= -4.171173
##$ABSG= 5
##$ABSL= 3
##$ALPHA= 0
##$AQORDER= 0
##$ASSFAC= 0
##$ASSFACI= 0
##$ASSFACX= 0
##$ASSWID= 0
##$AUNMP= <proc_1d>
##$AZFE= 0.1
##$AZFW= 0.1
##$BCFW= 0
##$BC_mod= 0
##$BYTORDP= 0
##$COROFFS= 0
##$CY= 12.5
##$DATMOD= 1
##$DC= 0
##$DFILT= <>
##$DTYPP= 0
##$F1P= 14.0000005364418
##$F2P= -0.99999901652339
##$FCOR= 0.5
##$FTSIZE= 32768
##$FT_mod= 6
##$GAMMA= 0
##$GB= 0
##$INTBC= 1
##$INTSCL= 1
##$ISEN= 128
##$LB= 0.3
##$LEV0= 0
##$LPBIN= 0
##$MAXI= 10000
##$MC2= 0
##$MEAN= 0
##$ME_mod= 0
##$MI= 0
##$NCOEF= 0
##$NC_proc= -4
##$NLEV= 6
##$NOISF1= 0
##$NOISF2= 0
##$NSP= 0
##$NTH_PI= 0
##$NZP= 0
##$OFFSET= 16.522
##$PC= 1
##$PHC0= -37.40026
##$PHC1= 4.712985
##$PH_mod= 1
##$PKNL= yes
##$PPARMOD= 0
##$PSCAL= 4
##$PSIGN= 0
##$REVERSE= no
##$SF= 250.13
##$SI= 32768
##$SIGF1= 0
##$SIGF2= 0
##$SINO= 400
##$SIOLD= 32768
##$SREGLST= <1H.TFA>
##$SSB= 0
##$STSI= 32768
##$STSR= 0
##$SW_p= 5175.98343685301
##$SYMM= 0
##$S_DEV= 0
##$TDeff= 65536
##$TDoff= 0
##$TI= <Analysis number 999999
Compound Code 99
Book Reference 9
Project Code 9>
##$TILT= no
##$TM1= 0
##$TM2= 0
##$TOPLEV= 0
##$USERP1= <user>
##$USERP2= <user>
##$USERP3= <user>
##$USERP4= <user>
##$USERP5= <user>
##$WDW= 1
##$XDIM= 32768
##$YMAX_p= 479375724
##$YMIN_p= -692992
$$ End of Bruker specific parameters
$$ ---------------------------------
##NTUPLES= NMR SPECTRUM
##VAR_NAME=  FREQUENCY,     SPECTRUM/REAL,   SPECTRUM/IMAG
##SYMBOL=    X,             R,               I
##VAR_TYPE=  INDEPENDENT,   DEPENDENT,       DEPENDENT
##VAR_FORM=  AFFN,          ASDF,            ASDF
##VAR_DIM=   32768,         32768,           32768
##UNITS=     HZ,            ARBITRARY UNITS, ARBITRARY UNITS
##FACTOR=    0.157963299565203, 1,           1
##FIRST=     4132.6476996994, 0,             0
##LAST=      -1043.33573715361, 0,           0
##MIN=       -1043.33573715361, -692992,     0
##MAX=       4132.6476996994, 479375724,     0
$$ Real data points
##PAGE= N=1
##DATA TABLE= (X++(R..R)), XYDATA
$$ [...]
$$ plain form
30369 -12730 -70820 -50925 -17804 10461 46061 97434 67560 2762 -25357 -37016 -113659 -90086
30357 -90086 -53017 19806 133084 91110 -40734 -134336 -121620 -29232 67647 -76837 -78352
30346 -78352 146275 122073 -38404 -181124 -176746 -171393 -111273 -101390 -125920 -124366 -53151 39354
30334 39354 44166 -98004 -157886 -125023 -164710 -140570 -64058 43312 62963 182856 228780
30323 228780 251476 244662 166322 247234 256100 209077 71039 23005 -75904 -128906 -174993 -208608
30311 -208608 -196217 -90186 -145010 -234014 -162266 -158711 -112743 111259 210171 111073 38062
30300 38062 -35583 99594 -43254 -125113 -11590 235290 348701 202423 99332 258646
30290 258646 408247 340646 233438 135080 101742 188930 158017 222845 297895 267118 307967
$$ packed form
30369a2730n8090J9895L3121K8265L5600N1373k9874o4798k8119j1659p6643K3573
30357i0086L7069P2823J13278m1974j31844r3602J2716R2388R6879j44484j515
30346g8352K24627k4202j60477j42720M378N353O0120R883k4530J554P1215R2505
30334C9354M812j42170n9882L2863l9687K4140P6512J07370J9651J19893M5924
30323B28780K2696o814p8340Q0912Q866m7023j38038m8034r8909n3002m6087l3615
30311b08608J2391J06031n4824q9004P1748L555M5968K24002R8912r9098p3011
30300C8062p3645J35177j42848q1859J13523K46880J13411j46278j03091J59314
30290B58646J49601o7601j07208r8358l3338Q7188l0913O4828P5050l0777M0849
$$ plain form
30279 307967 312586 212212 182901 159966 106508 24139 -63773 -177470 -260469 -324347 -426779
30268 -426779 -397524 -267930 -96225 -75212 9413 144782 123270 -20189 -230400 -324749
30258 -324749 -320427 -277227 -211084 -135634 -141335 -46939 -44171 -91204 -134466 -17095 33892 -49263
30246 -49263 -152914 -129040 -53908 142691 273404 203324 205304 82887 -34491 -14156 -26580
30235 -26580 -65655 -64788 -13162 -34038 -52518 -80038 -147456 -80203 -45380 -74342 -118915 -17640
30223 -17640 -58687 -112076 46088 144794 114269 47131 -22398 36824 231875 240107 245011 198241
30211 198241 351902 202245 137138 17990 -11905 25509 18316 141577 248756 93544
30201 93544 50220 231206 133464 46273 -3964 103372 171788 212594 189847 62460 -163505
$$ packed form
30279C07967M619j00374k9311k2935n3458q2369q7912j13697q2999o3878j02432
30268d26779K9255J29594J71705K1013Q4625J35369k1512j43459k10211r4349
30258c24749M322M3200O6143P5450n701R4396K768m7033m3262J17371N0987q3155
30246d9263j03651K3874P5132J96599J30713p0080J980j22417j17378K0335j2424
30235b6580l9075Q67N1626k0876j8480k7520o7418O7253L4823k8962m4573J01275
30223a7640m1047n3389J58164R8706l0525o7138o9529N9222J95051Q232M904m6770
30211A98241J53661j49657o5107j19148k9895L7414p193J23261J07179j55212
30201I3544m3324J80986r7742q7191n0237J07336O8416M0806k2747j27387k25965
$$ plain form
30190 -163505 -98197 -70590 -102885 66673 203916 122164 32029 -10159 74550 4216 5999
30179 5999 -11530 -1050 -51561 -101962 -98730 -86048 45150 33707 -34985 65122 72261 29998
30167 29998 41806 -8914 115370 146069 94783 -53038 -94047 -104477 -107465 -11635 58402
30156 58402 178012 181856 34430 -85619 -15014 5838 16068 162964 173153 71393 88112
30145 88112 63218 76310 37550 -136905 -205894 -162188 -62027 -80558 -48756 -42314 -23780
30134 -23780 1575 -76042 -55130 -39813 -36798 38586 141641 198010 117251 81330 7586 -60107
30122 -60107 -148699 -63841 -157879 -85581 11687 49221 -14997 -40835 77110 267214 193774
30111 193774 55943 110286 108649 30819 16829 77740 224327 93870 -138 -96864 -241113
$$ packed form
30190a63505O5308K7607l2295J69558J37243q1752r0135m2188Q4709p0334J783
30179E999j7529J0480n0511n0401L232J2682J31198j1443o8692J00107P139m2263
30167B9998J1808n0720J24284L0699n1286j47821m1009j0430k988R5830P0037
30156E8402J19610L844j47426j20049P0605K0852J0230J46896J0189j01760J6719
30145H8112k4894J3092l8760j74455o8989M3706J00161j8531L1802O442J8534
30134b3780K5355p7617K0912J5317L015P5384J03055N6369q0759l5921p3744o7693
30122f0107q8592Q4858r4038P2298R7268L7534o4218k5838J17945J90104p3440
30111A93774j37831N4343j637p7830j3990O0911J46587j30457r4008r6726j44249
$$ plain form
30100 -241113 -122768 -86750 70028 53974 -125400 -131333 23360 12806 70567 49969 -87942
30089 -87942 -64523 -115741 -101907 -76194 -59221 28970 107540 -42720 -151951 -289882 -278447
30078 -278447 -144808 -62998 -188434 -260852 -214164 -198185 -83347 27495 166643 243084
30068 243084 95531 -15324 -98718 -98570 22077 -105302 -133138 -81400 -149703 -132147 -154365
30057 -154365 -235125 -264327 3907 49851 -34163 -27323 -33176 -28701 -9639 -12109 68135 166898
30045 166898 62821 -129102 -98258 -28078 29834 6168 -31650 41899 49649 89325 52726
30034 52726 2193 38568 96000 82159 100746 252401 194063 58951 -39790 -139206 -35172
30023 -35172 163639 114328 106919 131874 122047 98624 97937 12002 81543 193504 216294 212684
$$ packed form
30100b41113J18345L6018J56778j6054j79374n933J54693j0554N7761k0598j37911
30089h7942K3419n1218J3834K5713J6973Q8191P8570j50260j09231j37931J1435
30078b78447J33639Q1810j25436p2418M6688J5979J14838J10842J39148P6441
30068B43084j47553j10855q3394J48J20647j27379k7836N1738o8303J7556k2218
30057a54365q0760k9202K68234M5944q4014O840n853M475J9062k470Q0244R8763
30045A66898j04077j91923L0844P0180N7912k3666l7818P3549P750L9676l6599
30034E2726n0533L6375N7432j3841J8587J51655n8338j35112r8741r9416J04034
30023c5172J98811m9311p409K4955r827k3423o87q5935O9541J11961K2790l610
$$ plain form
30011 212684 82075 -30106 -78490 -97369 -19509 -64340 -106512 -81465 15922 96008 247752
30000 247752 159978 104219 100486 -92099 -83916 -15118 -2763 -98966 -64242 -69371 -47952 24507
29988 24507 2812 -20342 44441 122342 60730 94785 183003 99901 3348 -30804 -62633 -2737
29976 -2737 60832 132819 162480 133423 43103 -59988 -121791 34090 139014 214753 180870
29965 180870 41215 -16307 33242 78453 11408 3899 -91314 -45586 49574 -15979 -123458
29954 -123458 -14934 84582 53204 82220 -2654 10837 125940 110650 190123 338703 330270
29943 330270 199580 63958 53511 65646 108855 179036 47242 18100 181500 178468 95587
29932 95587 155292 174789 4060 23884 146319 143488 112358 -104899 -74911 20294 161233
$$ packed form
30011B12684j30609j12181m8384j8879P7860m4831m2172K5047R7387Q0086J51744
30000B47752q7774n5759l733j92585Q183O8798J2355r6203L4724n129K1419P2459
29988B4507k1695k3154O4783P7901o1612L4055Q8218q3102r6553l4152l1829N9896
29976b737O3569P1987K9661k9057r0320j03091o1803J55881J04924P5739l3883
29965A80870j39655n7522M9549M5211o7045p509r5213M5728R5160o5553j07479
29954a23458J08524R9516l1378K9016q4874J3491J15103j5290P9473J48580q433
29943C30270j30690j35622j0447J2135M3209P0181j31794k9142J63400l032q2881
29932I5587N9705J9497j70729J9824J22435k831l1130k17257K9988R5205J40939
$$ plain form
29921 161233 200802 95035 19675 39749 45991 103330 262394 380514 207360 107915 25565
29910 25565 -61129 -112611 -242749 -251745 -144669 -13949 58129 29783 -100495 -155666 -50543
29899 -50543 21309 16556 57747 182587 176799 113117 26447 -90041 -60403 -42015 120031
29888 120031 253289 242788 178769 95273 175009 246195 303456 312534 287757 223322 157448
29877 157448 125329 134233 58422 -28777 -98416 69457 269809 404521 334620 261305 119754
29866 119754 820 -67809 83418 177202 31148 -34625 -20981 -91394 -113713 -95594 -69345
29855 -69345 -97213 41712 183219 123564 60066 5035 -5979 -26829 -92156 -26327 43086
29844 43086 45932 90561 125899 68347 6610 -46204 -51486 -19614 -59182 -45494 -128996 -197279
$$ packed form
29921A61233L9569j05767p5360K0074O242N7339J59064J18120j73154r9445q2350
29910B5565q6694n1482j30138q996J07076J30720P2078k8346j30278n5171J05123
29899e0543P1852m753M1191J24840n788o3682q6670j16488K9638J8388J62046
29888A20031J33258j0501o4019q3496P9736P1186N7261R078k4777o4435o5874
29877A57448l2119Q904p5811q7199o9639J67873K00352J34712o9901p3315j41551
29866A19754j18934o8629J51227R3784j46054o5773J3644p0413k2319J8119K6249
29855f9345k7868J38925J41507n9655o3498n5031j1014k0850o5327O5829O9413
29844D3086K846M4629L5338n7552o1737n2814n282L1872l9568J3688q3502o8283
$$ plain form
29832 -197279 -234736 -157557 -61679 26030 29362 106937 145655 64675 87520 36260 -138300
29821 -138300 -203800 -149662 -183066 -83292 -137949 -224365 -84703 -20245 12286 39960 84996
29810 84996 129183 313971 300593 124460 16435 50736 111880 39383 126395 215552 97249
29799 97249 -19387 -85595 -153357 -91475 -39819 -151189 -44781 25433 116803 180442 223964
29788 223964 246995 161395 -85737 -150734 -5263 2212 83398 23069 -92662 -54868 20553
29777 20553 -4642 -106124 -116085 -36756 99369 129275 114008 149713 162020 227935 257310
29766 257310 117330 4614 50920 218920 465653 575453 399907 299526 202891 186695
29756 186695 282465 158739 96713 67600 -2606 -14612 -18520 -74763 92115 201545 103402
$$ packed form
29832a97279l7457P7179R5878Q7709L332P7575L8718q0980K2845n1260j74560
29821a38300o5500N4138l3404R9774n4657q6416J39662O4458L2531K7674M5036
29810H4996M4187J84788j3378j76133j08025L4301O1144p2497Q7012Q9157j18303
29799I7249j16636o6208o7762O1882N1656j11370J06408P0214R1370O3639M3522
29788B23964K3031q5600k47132o4997J45471P475Q1186o0329j15731L7794P5421
29777B0553k5195j01482r961P9329J36125K9906j5267L5705J2307O5915K9375
29766B57310j39980j12716M6306J68000K46733J09800j75546j00381r6635j6196
29756A86695R5770j23726o2026k9113p0206j2006l908n6243J66878J09430r8143
$$ plain form
29745 103402 141009 160378 169698 98508 111284 -47709 -255747 -507550 -459970 -316729 -142719
29734 -142719 -133979 -106171 -2903 -66613 -70366 59502 198597 114927 1720 19145 22547
29723 22547 112961 114582 29995 -125535 -40127 -62839 -109569 -74566 6356 15864 -59737 -31879
29711 -31879 -7391 -91631 -131921 -92600 -20386 -38619 36322 10749 -153905 -112501 -42951
29700 -42951 -69563 -108642 5683 -7245 -120304 -68865 -106 77333 66477 50888 26847
29689 26847 39406 -4915 -91975 -93481 -28843 52771 38489 -96230 -202003 -244702 -161259
29678 -161259 -75301 13913 24035 2728 55518 177600 39018 -43123 -54919 2342 -64499
29667 -64499 -36242 -39308 20405 -17055 -169342 -169066 -223392 -56145 187264 166066 31850
$$ packed form
29745A03402L7607J9369R320p1190J2776j58993k08038k51803M7580J43241J74010
29734a42719Q740K7808J03268o3710l753J29868J39095q3670j13207J7425L402
29723B2547R0414J621q4587j55530Q5408k2712m6730L5003Q0922R508p5601K7858
29711c1879K4488q4240m0290L9321P2214j8233P4941k5573j64654M1404O9550
29700d2951k6612l9079J14325j2928j13059N1439O8759P7439j0856j5589k4041
29689B6847J2559m4321q7060j506O4638Q1614j4282j34719j05773m2699Q3443
29678a61259Q5958Q9214J0122k1307N2790J22082j38582q2141j1796N7261o6841
29667f4499K8257l066N9713l7460j52287K76n4326J67247K43409k1198j34216
$$ plain form
29656 31850 -45431 -63416 -86440 7869 -91149 -211863 -195685 55537 216843 201391 52092
29645 52092 -13721 61699 63 -93838 57256 126911 112137 67245 -51834 -180538 -112106
29634 -112106 -109294 -70967 492 -3120 -200100 -137253 -112704 -223636 -313449 -278613 -251738
29623 -251738 -196514 -141508 -35454 -71399 -6878 57397 125163 113190 58868 69116 -777
29612 -777 -52229 104726 48443 -14387 24494 -14418 73255 127173 183580 184230 234919 327986
29600 327986 300455 254270 203123 166639 94013 164145 44608 -38013 67913 60213 -90882
29589 -90882 -79943 -2556 -57272 -95250 -69544 -17606 -34944 43140 46132 -164061 -229935 -83591
29577 -83591 -91296 -61533 26722 136980 238773 181709 69212 -68 142017 132831 41976
$$ packed form
29656C1850p7281j7985k3024R4309r9018j20714J6178K51222J61306j5452j49299
29645E2092o5813P5420o1636r3901J51094O9655j4774m4892j19079j28704O8432
29634a12106K812L8327P1459l612j96980O2847K4549j10932q9813L4836K6875
29623b51738N5224N5006J06054l5945O4521O4275O7766j1973n4322J0248o9893
29612g77n1452J56955n6283o2830L8881l8912Q7673N3918N6407O50N0689R3067
29600C27986k7531m6185n1147l6484p2626P0132j19537q2621J05926p700j51095
29589i0882J0939P7387n4716l7978K5706N1938j7338P8084K992k10193o5874J46344
29577h3591p705K9763Q8255J10258J01793n7064j12497o9280J42085r186r0855
$$ plain form
29566 41976 35921 73661 169065 265203 260811 170375 2541 -106452 -104394 -53114 3801 8733
29554 8733 -181609 -238644 -154046 19433 158864 103407 70809 41008 12658 59514 4792
29543 4792 25532 138457 190729 -1291 -69581 -51404 113565 176501 141859 44907 -2157
29532 -2157 -52593 -16342 -34233 44508 55168 42425 58231 94061 80155 -28587 -181862
29521 -181862 -114165 -32871 -16768 21130 109066 221677 133033 90358 67584 70951 7164
29510 7164 -24513 -99427 -108268 78167 169885 70958 11669 10032 -49514 -151668 -249123 -175324
29498 -175324 -88214 49743 21156 95324 113926 109749 25965 54787 118148 1859 -46779
29487 -46779 -21195 7210 -36343 4929 84000 71891 55590 64593 89878 -31707 -144212
$$ packed form
29566D1976o055L7740R5404R6138m392r0436j67834j08993K058N1280N6915M932
29554H733j90342n7035Q4598J73479J39431n5457l2598k9801k8350M6856n4722
29543D792K0740J12925N2272j92020o8290J8177J64969O2936l4642r6952m7064
29532b157n0436L6251j7891P8741J0660j2743J5806L5830j3906j08742j53275
29521a81862O7697Q1294J6103L7898Q7936J12611q8644m2675k2774L367o3787
29510G164l1677p4914q841J86435R1718r8927n9289j637n9546j02154r7455P3799
29498a75324Q7110J37957k8587P4168J8602m177q3784K8822O3361j16289m8638
29487d6779K5584K8405m3553M1272P9071j2109j6301R003K5285j21585j12505
$$ plain form
29476 -144212 -209216 -142579 -131460 -103336 -58124 40819 -34084 -91324 -3132 33679 114643
29465 114643 110371 106958 174958 183444 143398 136845 26888 -52239 -95622 -148582 -86240 -136965
29453 -136965 -201452 -178681 -204409 40798 207065 144150 88636 -5086 75505 87588 37897
29442 37897 -14802 52287 16562 -76513 -153374 -171652 -109365 -50061 -112083 3921 -87523
29431 -87523 -230185 -198868 -105006 -129696 -208314 -190347 -25251 72732 105238 39929 78878
29420 78878 140644 52109 20238 42099 120399 146221 165063 31401 -127166 -145795 -104989
29409 -104989 42758 91168 83602 19946 -156223 -201405 -165874 -5370 119690 276609 160501
29398 160501 36302 -21307 17240 65235 -15198 28609 -44911 102226 62990 -62825 -103847
$$ packed form
29476a44212o5004O6637J1119K8124M5212R8943p4903n7240Q8192L6811Q0964
29465A14643m272l413O8000Q486m0046o553j09957p9127m3383n2960O2342n0725
29453a36965o4487K2771k5728K45207J66267o2915n5514r3722Q0591J2083m9691
29442C7897n2699O7089l5725r3075p6861j8278O2287N9304o2022J16004r1444
29431h7523j42662L1317R3862k4690p8618J7967J65096R7983L2506o5309L8949
29420G8878O1766q8535l1871K1861P8300K5822J8842j33662j58567j8629M0806
29409a04989J47747M8410p566o3656j76169m5182L5531J60504J25060J56919j16108
29398A60501j24199n7609L8547M7995q0433M3807p3520J47137l9236j25815m1022
$$ plain form
29387 -103847 -170700 -66081 -44420 -35583 -7089 90028 214581 229015 139734 -9642 -154275
29376 -154275 -224492 -153797 -128334 -77554 -109316 -1104 -71236 -231057 -188620 -120921 -87419
29365 -87419 -71587 34131 89961 80510 21075 -8661 43618 13761 -125978 -191931 -60605
29354 -60605 -29097 -115539 -26875 81247 202379 245524 188469 87357 60486 79319 -57557
29343 -57557 -47791 -101931 -91411 -60843 -157309 -357878 -344598 -164992 -50934 -153249 -168856
29332 -168856 -50412 -64011 -111573 -70219 -5556 -38698 -81533 76444 124794 150165 175310
29321 175310 199090 194221 138617 -65218 -103698 -50677 172231 156718 143131 109999 -115249
29310 -115249 -83179 -121513 -102191 -127507 -192926 -239323 -169255 -187530 -214532 -181258 -197566
$$ packed form
29387a03847o6853J04619K1661Q837K8494R7117J24553J4434q9281j49376j44633
29376a54275p0217P0695K5463N0780l1762J08212p0132j59821M2437O7699L3502
29365h7419J5832J05718N5830r451n9435k9736N2279k9857j39739o5953J31326
29354f0605L1508q6442Q8664J08122J21132M3145n7055j01112k6871J8833j36876
29343e7557R766n4140J0520L0568r6466k00569J3280J79606J14058j02315j5607
29332a68856J18444j3599m7562M1354O4663l3142m2835J57977M8350K5371K5145
29321A75310K3780m869n5604k03835l8480N3021K22908j5513j3587l3132k25248
29310a15249L2070l8334J9322k5316o5419m6397P0068j8275k7002L3274j6308
$$ plain form
29299 -197566 -346683 -233657 10402 106614 99863 156711 79502 74822 84231 90458 97495 32680
29287 32680 58676 34513 -25013 36103 -39662 -34575 102180 282075 368269 147142 -14888
29276 -14888 -42996 80390 119117 131827 103478 131017 174468 224944 233299 205074 134661 144300
29264 144300 166327 86270 4433 -7897 -48041 -64327 -71735 33657 125397 177978 115037
29253 115037 71641 145098 13176 -193570 -272740 -267381 -208179 -106609 -146807 -157261 -242461
29242 -242461 -225981 -32469 93001 159319 171813 -37297 -16810 29106 -36902 48966 49148
29231 49148 19719 83200 -93277 -98807 6442 -16784 70286 112838 43672 -32452 -87773
29220 -87773 -79974 -23502 -73804 -61421 -106992 -131538 -87204 -67666 954 72823 15002 -174037
$$ packed form
29299a97566j49117J13026K44059R6212o751N6848p7209m680R409O227P037o4815
29287C2680K5996k4163n9526O1116p5765N087J36755J79895Q6194k21127j62030
29276a4888k8108J23386L8727J2710k8349K7539M3451N0476Q355k8225p0413R639
29264A44300K2027q0057q1837j2330m0144j6286p408J05392R1740N2581o2941
29253A15037m3396P3457j31922k06746p9170N359N9202J01570m0198j0454q5200
29242b42461J6480J93512J25470O6318J2494k09110K0487M5916o6008Q5868J82
29231D9148k9429O3481j76477n530J05249k3226Q7070M2552o9166p6124n5321
29220h7773P799N6472n0302J2383m5571k4546M4334J9538O8620P1869n7821j89039
$$ plain form
29208 -174037 -203239 -55154 -83082 -199797 -166588 -78686 -127305 3889 157203 115779 120956
29197 120956 323258 303459 87223 75836 63467 105258 115701 17864 68739 63609 85110
29186 85110 31406 110528 192200 48888 -80610 -93783 -51989 -96280 4102 -16193 -125672
29175 -125672 -35803 5118 89813 33513 39359 42639 -32339 -128106 -171040 -149006 -188666 -158197
29163 -158197 -44229 -27315 109496 70211 84148 121689 -10488 -10746 101910 242126 221407
29152 221407 216610 173209 130553 108411 93543 111135 166061 63186 -26100 -66252 -43253
29141 -43253 -51395 -45035 117331 257384 269527 167352 176195 59520 -117431 -134631 -194439
29130 -194439 -238473 -175420 -148390 -61021 -32952 48659 115530 16590 31115 -36895 12989
$$ packed form
29208a74037k9202J48085k7928j16715L3209Q7902m8619J31194J53314m1424N177
29197A20956K02302j9799k16236j1387j2369M1791J0443r7837N0875n130K1501
29186H5110n3704P9122Q1672j43312j29498j3173M1794m4291J00382k0295j09479
29175a25672Q9869M0921Q4695n6300N846L280p4978r5767m2934K2034l9660L0469
29163a58197J13968J6914J36811l9285J3937L7541j32177k58J12656J40216k0719
29152B21407m797m3401m2656k2142j4868J7592N4926j02875q9286m0152K2999
29141d3253q142O360J62366J40053J2143j02175Q843j16675j76951j7200n9808
29130a94439m4034O3053K7030Q7369K8069Q1611O6871r8940J4525o8010M9884
$$ plain form
29119 12989 99875 89750 10010 -10663 24206 -7124 -18868 -130617 -39064 -33544 79260
29108 79260 19289 33616 12191 -150381 -183950 -116727 -81395 -175083 -145284 -27506 -6747
29097 -6747 -29730 -91015 -150711 -79437 33958 46909 112284 193233 130070 -17916 64385
29086 64385 12258 62550 55676 -11694 -41738 1825 -19605 -209115 -234439 -109790 -213795
29075 -213795 -240348 -226131 -130005 -82281 -86932 -70334 64049 82968 29093 7019 -64030
29064 -64030 -4813 57757 54432 -82010 -23904 127346 66323 22803 -26050 -211803 -216089
29053 -216089 50186 204699 78868 -16681 22432 -19130 -89626 -115487 -138899 -131950 -121193
29042 -121193 -178278 -100697 -106596 -145652 -218197 -119875 -105757 -137454 -127777 -25425 89633
$$ packed form
29119A2989Q6886j0125p9740k0673L4869l1330j1744j11749R1553N520J12804
29108G9260n9971J4327k1425j62572l3569O7223L5332r3688K9799J17778K0759
29097f747k2983o1285n9696P1274J13395J2951O5375Q0949o3163j47986Q2301
29086F4385n2127N0292o874o7370l0044M3563k1430j89510k5324J24649j04005
29075b13795k6553J4217R6126M7724m651J6598J34383J8919n3875k2074p1049
29064f4030N9217O2570l325j36442N8106J51250o1023m3520m8853j85753m286
29053b16089K66275J54513j25831r5549L9113m1562p0496k5861k3412O949J0757
29042a21193n7085P7581n899l9056p2545R8322J4118l1697R677J02352J15058
$$ plain form
29031 89633 273638 212333 151660 -28648 -120056 -50216 43656 28296 -77574 -147568 -234657
29020 -234657 -220436 -197639 -8326 -80886 -157319 -132702 -331 -58486 -233562 -113416 9547
29009 9547 -40864 -173337 -290948 -114134 -106290 -125328 -101238 -130046 -172369 -40445 66825
28998 66825 111120 94643 46132 151911 266003 214203 253925 310466 271099 115367 -54859
28987 -54859 -97432 -143868 -49128 32034 -13351 -90059 -8643 43118 116134 249698 297967
28976 297967 193972 100269 23599 17333 124401 110171 28972 -54527 -38924 41128 22364
28965 22364 26071 -31287 -45570 -23321 135481 139666 121023 18259 -91463 -103274 -79973
28954 -79973 -22388 51662 130484 51714 6502 68103 113307 -107678 -69751 6406 -97465
$$ packed form
29031H9633J84005o1305o0673j80308r1408O9840R3872j5360j05870o9994q7089
29020b34657J4221K2797J89313p2560p6433K4617J32371n8155j75076J20146J22963
29009I547n0411j32473j17611J76814P844j9038K4090k8808m2323J31924J07270
28998F6825M4295j6477m8511J05779J14092n1800L9722N6541l9367j55732j70226
28987e4859m2573m6436R4740Q1162m5385p6708Q1416N1761P3016J33564M8269
28976B97967j03995r3703p6670o266J07068j4230q1199q3499J5603Q0052j8764
28965B2364L707n7358j4283K2249J58802M185j8643j02764j09722j1811K3301
28954g9973N7585P4050P8822p8770m5212O1601M5204k20985L7927P6157j03871
$$ plain form
28943 -97465 -34772 31435 70471 138335 127756 40759 -2607 31652 115216 116710 176729 115195
28931 115195 -21075 -7190 19392 -179833 -130212 -59095 25092 -61578 -113028 -180807 -305953
28920 -305953 -183114 -24674 61958 75677 134929 158156 26912 -48499 -124089 -77097 51161
28909 51161 221873 215732 132759 123721 32698 7036 -84640 -64982 -59725 12045 -68068 -44451
28897 -44451 20076 100901 69991 -19957 -6478 19524 -53125 3106 124706 123754 -13675 -56016
28885 -56016 31602 83646 205723 154517 57280 25509 65281 51490 141353 42503 9082
28874 9082 -85227 -51356 84580 181914 127457 12186 11634 187760 194308 186563 157935 111877
28862 111877 75006 -27206 -66335 -465 288 -19069 2573 22262 82764 72602 -3641 -24501
$$ packed form
28943i7465O2693O6207L9036O7864j0579q6997m3366L4259Q3564J494O0019o1534
28931A15195j36270J3885K6582j99225M9621P1117Q4187q6670n1450o7779j25146
28920c05953J22839J58440Q6632J3719N9252K3227j31244p5411p5590M6992J28258
28909E1161J70712o141q2973r038r1023k5662r1676J9658N257P1770q0113K3617
28897d4451O4527Q0825l0910q9948J3479K6002p2649N6231J21600r52j37429m2341
28885e6016Q7618N2044J22077n1206r7237l1771L9772j3791Q9863r8850l3421
28874I082r4309L3871J35936R7334n4457j15271n52J76126O548p745k8628m6058
28862A11877l6871j02212l9129O5870P53j9357K1642J9689O0502j0162p6243k0860
$$ plain form
28850 -24501 132577 271545 333404 188710 19572 12771 60637 99946 158767 159754 81819
28839 81819 14809 -51728 680 6368 53107 -55006 -132148 -153607 -228830 -243338 -151709 -157647
28827 -157647 -187857 -76615 85810 94019 91761 188820 209171 86621 46610 15401 134357
28816 134357 190583 159011 210308 177138 -22796 10581 21940 27626 51089 55713 55271 75717
28804 75717 119870 -39884 -126548 -122451 -81726 -128755 33776 39125 -125274 -33995 -24985 -52844
28792 -52844 -94882 -82063 -51905 20367 -32109 -90489 28690 176516 78037 98526 110941
28781 110941 152389 125236 79702 49618 92217 16707 64249 150163 115933 196170 126576
28770 126576 107172 13580 34318 -3239 65840 212139 107863 35026 121582 72932 -118385
$$ packed form
28850b4501J57078J38968O1859j44694j69138o801M7866L9309N8821R87p7935
28839H1819o7010o6537N2408N688M6739j08113p7142k1459p5223j4508R1629n938
28827a57647l0210J11242J62425Q209k258R7059K0351j22550m0011l1209J18956
28816A34357N6226l1572N1297l3170j99934L3377J1359N686K3463M624m42K0446
28804G5717M4153j59754q6664M097M0725m7029J62531N349j64399R1279R010k7859
28792e2844m2038J2819L0158P2272n2476n8380J19179J47826r8479K0489J2415
28781A10941M1448k7153m5534l0084M2599p5510M7542Q5914l4230Q0237o9594
28770A26576j9404r3592K0738l7557O9079J46299j04276p2837Q6556m8650j91317
$$ plain form
28759 -118385 -182518 -77632 5762 -12801 -54402 -116653 -95609 96346 -66479 -198051 -310195
28748 -310195 -280667 -237566 -272941 -271245 -56630 113403 230099 223089 182054 93563 132649
28737 132649 222239 105729 -118049 -185057 -95120 -44588 20514 25724 -26076 -64642 3482
28726 3482 155100 221658 68300 -13028 8123 14828 10497 52819 101200 -20218 -130781
28715 -130781 -103417 -24588 14496 11017 -200688 -206260 -96228 -71095 -133599 -105263 -116098
28704 -116098 -103671 -16003 -130441 -115755 -20738 75069 30519 -28866 79682 88723 140410
28693 140410 220612 168430 147007 185186 208087 200853 128638 186606 -26146 -231946 -207880
28682 -207880 -159342 -57407 -4006 51724 169651 197150 278513 125124 -85247 -164043 -86499
$$ packed form
28759a18385o4133J04886Q3394j8563m1601o2251K1044J91955j62825j31572j12144
28748c10195K9528M3101l5375J696K14615J70033J16696p010m1035q8491L9086
28737A32649Q9590j16510k23778o7008Q9937N0532O5102N210n1800l8566O8124
28726C482J51618O6558j53358q1328K1151O705m331M2322M8381j21418j10563
28715a30781K7364P8829L9084l479k11705n572J10032K5133o2504K8336j0835
28704a16098J2427Q7668j14438J4686R5017R5807m4550n9385J08548R041N1687
28693A40410Q0202n2182k1423L8179K2901p234p2215N7968k12752k05800K4066
28682b07880M8538J01935N3401N5730J17927K7499Q1363j53389k10371p8796P7544
$$ plain form
28671 -86499 -53847 -124245 -174174 -65420 25816 58830 -18498 68371 126 -26843 -7243
28660 -7243 77752 37082 -97854 -162595 -212003 -5927 94549 154650 96619 88225 180889
28649 180889 218276 37343 -29613 -791 -37302 -138614 -93482 107773 116067 -39293 -131873
28638 -131873 -161818 -169623 -101126 -69214 -210139 -241746 -230382 -210674 -11045 136119 -2102
28627 -2102 68901 -61291 -78722 -178857 -165009 -189110 -169806 -77550 -70296 -156554 -102817 628
28615 628 -7370 -44774 31935 115069 130855 53544 13805 -114914 -166031 -101438 -37274 1381
28603 1381 125051 165431 7095 30536 107014 89187 -86789 -226647 -260756 -207096 -166928
28592 -166928 9529 77977 225716 116131 -74347 -151417 -131569 -133672 -69565 79038 47821
$$ packed form
28671h6499L2652p0398m9929J08754R1236L3014p7328Q6869o8245k6969J9600
28660g243Q4995m0670j34936o4741m9408K06076J00476O0101n8031q394R2664
28649A80889L7387j80933o6956K8822l6511j01312M5132K01255Q294j55360r2580
28638a31873k9945p805O8497L1912j40925l1607J1364J9708J99629J47164j38221
28627b102P1003j30192j7431j00135J3848k4101J9304R2256P254q6258N3737J03445
28615F28p998l7404P6709Q3134J5786p7311l9739j28719n1117O4593O4164L8655
28603A381J23670M0380j58336K3441P6478j7827j75976j39858l4109N3660M0168
28592a66928J76457O8448J47739j09585j90478p7070J9848k103O4107J48603l1217
$$ plain form
28581 47821 23251 116651 224664 38349 -114188 -13281 87437 128572 140153 224154 312181
28570 312181 271021 191557 153915 107573 62595 145258 29697 -103764 -31822 144203 15530
28559 15530 -124281 -129000 -101556 35132 74607 83962 75550 179172 172065 86944 3445 -114039
28547 -114039 -153103 -249791 -194941 -126429 -49671 -82677 -96611 -10882 125362 153474 97378
28536 97378 89243 34959 26329 2885 -80257 -87417 -3022 34281 37318 -11748 -163200 -236065
28524 -236065 -277620 -123395 99805 106052 97706 203148 141440 72812 154664 297751 284192
28513 284192 220345 58126 55303 -17385 -126796 -14466 49066 -21090 -16942 -20153 -31289
28502 -31289 14161 61826 898 115124 123294 -70944 -223202 -231400 -134288 -3802 20753
$$ packed form
28581D7821k4570R3400J08013j86315j52537J00907J00718M1135J1581Q4001Q8027
28570C12181m1160p9464l7642m6342m4978Q2663j15561j33461P1942J76025j28673
28559A5530j39811m719K7444J36688L9475R355q412J03622p107q5121q3499j17484
28547a14039l9064r6688N4850O8512P6758l3006j3934Q5729J36244K8112n6096
28536I7378q135n4284q630k3444q3142p160Q4395L7303L037m9066j51452p2865
28524b36065m1555J54225K23200O247q346J05442o1708o8628Q1852J43087j3559
28513B84192o3847j62219k823p2688j09411J12330O3532p0156M148l211j1136
28502c1289M5450M7665o0928J14226Q170j94238j52258q198R7112J30486K4555
$$ plain form
28491 20753 87324 223142 261663 87433 147032 104904 133450 234639 178785 129234 126332
28480 126332 196255 167376 182269 227779 129090 122444 17958 -93160 -246284 -87848 24882
28469 24882 29507 -118658 -172743 -204581 -223911 -185882 -119431 -5557 -92758 -119426 -116614 -95218
28457 -95218 -69807 -31778 -65176 -95347 3080 118985 -71422 -215959 -270931 -266306 -135690
28446 -135690 -159815 -149499 -89695 -27938 1582 -142819 -257857 -208927 -171044 -5035 114675
28435 114675 5409 -106187 -69826 -34399 37232 -139781 -198997 -249689 -115779 -41824 -4536
28424 -4536 -130055 -47498 20128 -37714 -35470 28927 10178 80489 26900 -86817 -11408 25233
28412 25233 -62266 38839 17625 106726 131658 -115429 -208429 -198165 -158242 -52765 85198
$$ packed form
28491B0753O6571J35818L8521j74230N9599m2128K8546J01189n5854m9551k902
28480A26332O9923k8879J4893M5510r8689o646j04486j11118j53124J58436J12730
28469B4882M625j48165n4085l1838j9330L8029O6451J13874q7201k6668K812K1396
28457i5218K5411L8029l3398l0171R8427J15905j90407j44537n4972M625J30616
28446a35690k4125J0316N9804O1757K9520j44401j15038M8930L7883J66009J19710
28435A14675j09266j11596L6361L5427P1631j77013n9216n0692J33910P3955L7288
28424d536j25519Q2557O7626n7842K244O4397j8749P0311n3589j13717P5409L6641
28412B5233q7499J01105k1214Q9101K4932k47087r3000J0264L9923J05477J37963
$$ plain form
28401 85198 124522 30008 -19652 31636 202787 326146 318646 178773 77949 50627 93376
28390 93376 -6609 2870 62145 20097 26124 39203 44339 51878 -36891 -169843 -103286 -2041
28378 -2041 54517 -87659 -51970 -62065 -8255 -8552 -138853 -166249 -212031 -215046 -69638 -7706
28366 -7706 -82049 -73378 -83136 -58116 -48339 43480 -24169 17044 -64411 -79010 -86777 -94962 -146506
28353 -146506 -30752 71817 73678 217180 175615 132014 87408 -25955 36078 94020 -8648
28342 -8648 -117159 -95140 -115818 -255258 -425253 -331995 -89787 -80305 -147059 -176877 -171062
28331 -171062 -109954 -236546 -291291 -273616 -156701 -214294 -213916 -80671 -84625 -183771 -158957
28320 -158957 21704 146262 184938 -73033 -76086 -10848 27806 -54781 -113365 -138224 25668
$$ packed form
28401H5198L9324r4514m9660N1288J71151J23359p500j39873j00824k7322M2749
28390I3376r9985R479N9275m2048O027J3079N136P539q8769j32952O6557J01245
28378b041N6558j42176L5689j0095N3810k97j30301k7396m5782l015J45408O1932
28366g706p4343Q671r758K5020R777R1819o7649M1213q1455j4599p767q185n1544
28353a46506J15754J02569J861J43502m1565m3601m4606j13363O2033N7942j02668
28342h648j08511K2019k0678j39440j69995R3258K42208R482o6754k9818N815
28331a71062O1108j26592n4745J7675J16915n7593L78J33245l954r9146K4814
28320a58957J80661J24558L8676k57971l053O5238L8654q2587n8584k4859J63892
$$ plain form
28309 25668 -61860 -65678 31149 -66739 -73937 -23154 16649 49317 198939 222694 148913 92116
28297 92116 135796 -14777 -89409 -23212 -59774 -83742 -67789 123726 88979 -24400 5861
28286 5861 50227 -64241 -47219 -137772 -182306 -134473 7201 -39503 -180979 -222824 -78125
28275 -78125 38231 60985 129749 114425 -11006 3592 111803 211089 130331 24434 -61329
28264 -61329 -48031 -43208 -212940 -250624 -169284 -56068 -57312 -197377 -229748 -71986 -93705
28253 -93705 -83718 16504 -34185 -147489 -94388 -80812 -96029 5860 -22093 -60823 -164520
28242 -164520 -243896 -169780 -19030 64847 10416 131422 131386 79712 20479 83499 108541 40950
28230 40950 -42906 33096 -72412 -148553 2071 118868 99847 123332 155777 141174 134308
$$ packed form
28309B5668q7528l818R6827r7888p198N0783L9803L2668J49622K3755p3781n6797
28297I2116M3680j50573p4632O6197l6562k3968J5953J91515l4747j13379L0261
28286E861M4366j14468J7022r0553m4534M7833J41674m6704j41476m1845J44699
28275g8125J16356K2754O8764j5324j25431J4598J08211R9286q0758j05897q5763
28264f1329J3298M823j69732l7684Q1340J13216j244j40065l2371J57762k1719
28253i3705R987J00222n0689j13304N3101J3576j5217J01889k7953l8730j03697
28242a64520p9376P4116J50750Q3877n4431J21006l6n1674n9233O3020K5042o7591
28230D0950q3856P6002j05508p6141J50624J16797j9021K3485L2445j4603o866
$$ plain form
28219 134308 115886 89786 -65091 -63209 -29883 -55996 -217722 -285690 -235144 -195104 -66713
28208 -66713 -68061 -205412 -191447 19481 -32990 -87540 -92614 -73524 -22598 38141 -43741 -76764
28196 -76764 -14078 18810 62115 -13205 33566 76891 42644 284304 209161 28920 74798
28185 74798 -3616 -76244 -176981 -133097 -32368 34260 132601 43480 -31675 -47518 86389
28174 86389 85820 67454 127458 88549 -22214 -59087 121931 287440 180334 12036 30991
28163 30991 32768 -119038 -149649 -99628 -121775 -79710 -57457 -92675 -136914 -120514 -163905 -58015
28151 -58015 5226 -60676 3156 24747 19895 109254 40906 25134 -47564 -42149 -91130 -178602
28139 -178602 -68799 46556 51579 49540 137430 14015 -29620 14630 -103561 -155712 -135230
$$ packed form
28219A34308j8422k6100j54877J882L3326k6113j61726o7968N0546M0040J28391
28208f6713j348j37351J3965K10928n2471n4550n074J9090N0926O0739q1882l3023
28196g6764O2686L2888M3305p5320M6771M3325l4247K41660p5143j80241M5878
28185G4798p8414p2628j00737M3884J00729O6628R8341q9121p5155j5843J33907
28174H6389n69j8366O0004l8909j10763l6873J81018J65509j07106j68298J8955
28163C0991J777j51806l0611N0021k2147M2065K2253l5218m4239J6400m3391J05890
28151e8015O3241o5902O3832K1591m852Q9359o8348j5772p2698N415m8981q7472
28139a78602J09803J15355N023k039Q7890j23415m3635M4250j18191n2151K0482
$$ plain form
28128 -135230 -118187 -127611 -40703 49000 -17662 -107095 -235407 -240546 -150995 -171854 -143011 -141008
28116 -141008 -15218 34042 164164 142819 -5797 -30272 -7363 -7950 -25551 43450 24030
28105 24030 -10278 -6911 10984 -121702 -98502 -60761 -141854 -216190 -151402 -67007 -144686 -62714
28093 -62714 -51911 90402 183690 110246 -5900 -116266 -274276 -259453 -181217 -62311 -10692
28082 -10692 -22080 -52928 -126475 -128407 -127206 -216129 -91391 -30663 -53833 -125428 16390 133903
28070 133903 7755 -107823 -87181 -20145 82852 162960 120024 95712 -6266 -43385 -66989
28059 -66989 -163168 -179377 -4572 57868 122401 97026 -18821 -120243 -201431 -373692 -427366
28048 -427366 -275753 -211774 -120971 -59752 77348 54598 -38086 88246 36794 -93942 -111608
$$ packed form
28128a35230J7043r424Q6908Q9703o6662q9433j28312n139Q9551k0859K8843K003
28116a41008J25790M9260J30122k1345j48616k4475K2909n87j7601O9001j9420
28105B4030l4308L367J7895j32686K3200L7741q1093p4336O4788Q4395p7679Q1972
28093f2714J0803J42313R3288p3444j16146j10366j58010J4823P8236J18906N1619
28082a0692j1388l0848p3547j932J201q8923J24738O0728k3170p1595J41818J17513
28070A33903j26148j15578K0642O7036J02997Q0108m2936k4312j01978l7119k3604
28059f6989r6179j6209J74805O2440O4533k5375j15847j01422q1188j72261n3674
28048d27366J51613O3979R0803O1219J37100k2750r2684J26332n1452j30736j7666
$$ plain form
28037 -111608 3920 69111 57344 88714 181471 83590 -80430 -37072 23449 29254 114729
28026 114729 58392 -93117 -245523 -153616 -170032 -100124 -105183 -118555 51838 160608 48606
28015 48606 -18516 80574 65874 88621 182548 114818 -26153 -75016 -131873 -218081 -193827
28004 -193827 -126262 -71270 -63930 -142737 -246912 -180917 -30531 -143478 -175755 -240883 -245945
27993 -245945 -215601 -168832 -22612 -21691 -8580 8523 32022 11704 -136100 -232066 -188287
27982 -188287 -60508 -3568 96237 158658 92703 65675 46869 -36293 51094 75585 133264
27971 133264 211505 97823 32244 33437 1068 100097 92655 230954 336905 169667 -27357
27960 -27357 -16751 54739 66510 71859 101000 137113 166988 45271 -109808 -208874 -127775
$$ packed form
28037a11608J15528O5191j1767L1370R2757r7881j64020M3358O0521N805Q5475
28026A14729n6337j51509j52406R1907j6416O9908n059j3372J70393J08770j12002
28015D8606o7122R9090j4700K2747R3927o7730j40971m8863n6857q6208K4254
28004a93827O7565N4992P340p8807j04175O5995J50386j12947l2277o5128n062
27993b45945L0344M6769J46220R21J3111J7103K3499k0318j47804r5966M3779
27982a88287J27779N6940R9805O2421o5955k7028j8806q3162Q7387K4491N7679
27971A33264P8241j13682o5579J193l2369R9029p442J38299J05951j67238j97024
27960b7357J0606P1490J1771N349K9141L6113K9875j21717j55079r9066Q1099
$$ plain form
27949 -127775 -3429 -40792 -68446 -32124 -65777 77703 237746 234185 167732 -5205 2287
27938 2287 150720 283013 234652 88091 -20315 -7300 121370 170120 151537 -65849 -80232
27927 -80232 -86518 -42038 122952 305253 272871 265144 225704 244401 325076 316683 295303 48614
27915 48614 -47116 -1652 60149 79561 151602 254415 255987 177125 215083 203489 221142 270762
27903 270762 279502 171791 57190 -2606 26121 28541 33201 -48253 -198175 -173118 -122376
27892 -122376 -88307 -108906 -151950 -132221 -50883 16398 141635 101699 -51079 -105863 7426
27881 7426 -47821 -47954 -154382 -175117 -23621 53311 57095 -87279 -50781 1126 7153 72346
27869 72346 15059 -151148 -167575 -117778 -3528 45939 53314 -82852 -115755 -143517 -154618
$$ packed form
27949a27775J24346l7363k7654L6322l3653J43480J60043l561o6453j72937P492
27938B287J48433J32293m8361j46561j08406J3015J28670M8750j8583k17386j4383
27927h0232o286M4480J64990J82301l2382p727l9440J8697Q0675q393k1380k46689
27915D8614r5730M5464O1801J9412P2041J02813J572p8862L7958j1594J7653M9620
27903B70762Q740j07711j14601n9796K8727K420M660q1454j49922K5057N0742
27892a22376L4069k0599m3044J9729Q1338O7281J25237l9936j52778n4784J13289
27881G426n5247j33j06428k0735J51496P6932L784j44374L6498N1907O027O5193
27869G2346n7287j66207j6427M9797J14250M9467P375j36166l2903k7762j1101
$$ plain form
27858 -154618 22456 166832 42555 -167361 -215467 -157640 -101379 107215 84921 109827
27848 109827 205145 217161 120293 36510 2507 98644 73311 66036 28226 6171 132820
27837 132820 154087 99767 76575 83548 39412 25819 197860 242500 89837 66382 156939
27826 156939 81979 -36780 -135073 -86263 -79368 -23586 -43609 -54440 29463 108101 62113
27815 62113 -130538 -120859 -214297 -181922 -139086 -55685 -50253 -107407 -49547 61093 32680 3516
27803 3516 88083 126345 146472 108717 -17358 103475 75163 86530 126307 79738 80213 -4826
27791 -4826 -87526 -128539 -239611 -247710 -120939 57229 103413 -102095 -103460 39405 42419
27780 42419 5322 -45838 -146263 -77298 -115684 -203206 -154767 -75196 51716 66575 -29807
$$ packed form
27858a54618J77074J44376j24277k09916m8106N7827N6261K08594k2294K4906
27848A09827R5318J2016r6868q3783l4003R6137k5333p275l7810k2055J26649
27837A32820K1267n4320k3192O973m4136j3593J72041M4640j52663k3455R0557
27826A56939p4960j18759r8293M8810O895N5782k0023j0831Q3903P8638m5988
27815F2113j92651R679r3438L2375M2836Q3401N432n7154N7860J10640k8413k9164
27803C516Q4567L8262K0127l7755j26075J20833k8312J1367L9777m6569M75q5039
27791d826q2700m1013j11072q099J26771J78168M6184k05508j365J42865L014
27780D2419l7097n1160j00425O8965l8386q7522M8439P9571J26912J4859r6382
$$ plain form
27769 -29807 -186652 -199537 -159806 -105808 -235007 -311313 -169432 -106864 -99131 2551 -41233
27758 -41233 -93585 -24709 34666 -43816 -61835 -39675 7114 87208 93730 -57619 -76284 46832
27746 46832 185883 126703 25053 72147 66263 54014 120094 14107 -89619 -74187 4900
27735 4900 33107 -177256 -126847 -77140 -90521 -270239 -343685 -172675 14306 83436 125287
27724 125287 59024 -94165 -111908 -123500 -96006 -85439 -87509 13393 2974 9671 82593
27713 82593 183927 219505 77849 -26174 63886 -25116 -32597 -9384 -132751 -91552 -152616
27702 -152616 -256578 -280405 -280713 -119628 16346 108445 138336 -54347 -126262 -128192 -84106
27691 -84106 -175678 -170072 -115704 11122 49327 -116246 -212357 -77547 -15232 -28582 69792
$$ packed form
27769b9807j56845j2885L9731N3998j29199p6306J41881O2568P733J01682m3784
27758d1233n2352O8876N9375p8482j8019K2160M6789Q0094O522j51349j8665J23116
27746D6832J39051n9180j01650M7094n884j2249O6080j05987j03726J5432P9087
27735D900K8207k10363N0409M9707j3381j79718p3446J71010J86981O9130M1851
27724A25287o6263j53189j7743j1592K7494J0567k070J00902j0419O697P2922
27713H2593J01334L5578j41656j04023R0060q9002p481K3213j23367M1199o1064
27702a52616j03962k3827l08J61085J35974R2099K9891j92683p1915j930M4086
27691h4106r1572N606N4368J26826L8205j65573r6111J34810O2315j3350R8374
$$ plain form
27680 69792 -104749 -151376 -84966 54262 58711 127493 176069 169785 254936 251715 223750 150390
27668 150390 260051 274232 221988 277470 383628 304825 101477 -82303 -93787 -9172 75274
27657 75274 -81229 -283618 -235610 -125483 -73731 -6504 -124690 -165886 -99689 -173755 -315238
27646 -315238 -232561 -85372 -76587 -91066 -62498 -18361 -78012 13075 73139 -20462 -166784
27635 -166784 -217968 -198588 -175783 -289752 -222548 -105633 -58009 114102 230258 207470 195479
27624 195479 168797 127711 146341 96879 103404 176101 102036 18628 -46500 -103064 -177989 -164407
27612 -164407 -99636 -90951 -203889 -206572 -101316 -61484 -117268 -10925 21560 -59085 -70090
27601 -70090 -42846 60149 -64201 -35537 142428 212869 170578 43362 -128347 -181856 -56305
$$ packed form
27680F9792j74541m6627O6410J39228M449O8782M8576o284Q5151l221k7965p3360
27668A50390J09661J4181n2244N5482J06158p8803k03348j83780j1484Q4615Q4446
27657G5274j56503k02389M8008J10127N1752O7227j18186m1196O6197p4066j41483
27646c15238Q2677J47189Q785j4479K8568M4137n9651R1087O0064r3601j46322
27635a66784n1184J9380K2805j13969O7204J16915M7624J72111J16156k2788j1991
27624A95479k6682m1086J8630m9462O525P2697p4065q3408o5128n6564p4925J3582
27612a64407O4771Q685j12938k683J05256L9832n5784J06343L2485q0645j1005
27601g0090K7244J02995j24350K8664J77965P0441m2291j27216j71709n3509J25551
$$ plain form
27590 -56305 -61351 -130468 -185351 -148259 -160818 -257080 -266051 -164710 -109635 -80730 -163848 -227673
27578 -227673 -188674 -130454 30630 148952 217707 116877 139242 213188 192401 96741 178807
27567 178807 394711 323536 136996 29254 124998 257770 277014 249363 258706 150130 50054
27556 50054 18046 82160 16609 48032 167280 108177 -9787 -42569 -118596 -14135 81912
27545 81912 280419 402563 346878 238329 130156 179864 265575 100954 60482 66235 111932
27534 111932 193007 83511 -65309 -211958 -276454 -344539 -188170 -53512 -107498 -84646
27524 -84646 19555 54433 16963 -60760 114277 220733 206361 88382 185140 217339 281057
27513 281057 241786 45424 -185023 -141754 -204181 -249017 -91746 -46625 -45372 117588 149469
$$ packed form
27590e6305n046o9117n4883L7092j2559r6262q971J01341N5075K8905q3118o3825
27578b27673L8999N8220J61084J18322O8755j00830K2365P3946k0787r5660Q2066
27567A78807K15904p1175j86540j07742R5744J32772J9244k7651R343j08576j00076
27556E0054l2008O4114o5551L1423J19248n9103j17964l2782p6027J04461R6047
27545H1912J98507J22144n5685j08549j08173M9708Q5711j64621m0472N753M5697
27534A11932Q1075j09496j48820j46649o4496o8085J56369J34658n3986K2852
27524h4646J04201L4878l7470p7723J75037J06456j4372j17979R6758L2199O3718
27513B81057l9271j96362k30447M3269o2427m4836J57271M5121J253J62960L1881
$$ plain form
27502 149469 134370 161710 177293 102630 -36148 -7630 -89657 -63292 65470 -19272 -39845
27491 -39845 -39696 71769 52575 121199 14690 -195037 -88470 -22746 -140052 -123660 -179596
27480 -179596 -167687 -128805 -9143 168683 308505 253325 98637 21054 -78330 20642 97160
27469 97160 51051 22718 -35757 -3991 70121 187198 123280 7912 62342 86459 -41115
27458 -41115 49959 98263 118801 59570 146452 317120 289434 249001 142968 9897 104992
27447 104992 192657 42627 5304 37406 149043 131960 61550 -170853 -150269 73556 175240
27436 175240 183675 -76801 -70752 -52051 -123756 -95045 -65390 -1417 135744 128360 -59975
27425 -59975 -38988 -23856 -79231 -99426 -30035 -62964 -94328 -117270 -53820 -8587 -42510 90756
$$ packed form
27502A49469j5099K7340J5583p4663j38778K8518q2027K6365J28762q4742k0573
27491c9845J49J11465j9194O8624j06509k09727J06567O5724j17306J6392n5936
27480a79596J1909L8882J19662J77826J39822n5180j54688p7583r9384R8972P6518
27469I7160m6109k8333n8475L1766P4112J17077o3918j15368N4430K4117j27574
27458d1115R1074M8304K0538n9231Q6882J70668k7686m0433j06033j33071R5095
27447A04992Q7665j50030l7323L2102J11637j7083p0410k32403K0584K23825J01684
27436A75240Q435k60476O049J8701p1705K8711K9655O3973J37161p384j88335
27425e9975K0987J5132n5375k0195O9391l2929l1364k2942O3450M5233l3923J33266
$$ plain form
27413 90756 55257 -48037 -117271 -114118 -69097 29846 96152 66991 23102 -66886 -36210 -25994
27401 -25994 60043 67456 90643 120464 146559 118872 -6088 -114239 -173945 -216524 -144281
27390 -144281 -83836 -132797 21660 167967 96665 -25305 -55209 -85456 -194306 -130006 -173735
27379 -173735 -175690 -76833 -52607 482 27126 -120489 -193150 -68626 -40387 -16922 72817
27368 72817 81206 67086 6459 32479 -62624 -141984 -85680 -105899 -96905 11112 -4384 -83707
27356 -83707 -278676 -256577 -173846 -181747 -75095 21082 -29925 5309 121701 171431 140636
27345 140636 146281 24830 -66371 -22776 -51049 -237426 -381486 -292474 -169559 -168739 -169610 -195199
27333 -195199 -355885 -227340 -4686 16655 63853 33836 124370 86893 15752 21703 -34432
$$ packed form
27413I0756l5499j03294o9234L153M5021R8943O6306k9161m3889q9988L0676J0216
27401b5994Q6037P413K3187K9821K6095k7687j24960j08151n9706m2579P2243
27390a44281O0445m8961J54457J46307p1302j21970k9904l0247j08850O4300m3729
27379a73735j955R8857K4226N3089K6644j47615p2661J24524K8239K3465Q9739
27368G2817Q389j4120o0627K6020r5103p9360N6304k0219Q994J08017j5496p9323
27356h3707j94969K2099Q2731p901J06652R6177n1007L5234J16392M9730l0795
27345A40636N645j21451r1201M3595k8273j86377j44060Q9012J22915Q20q71k5589
27333a95199j60686J28545K22654K1341M7198l0017R0534l7477p1141N951n6135
$$ plain form
27322 -34432 -138715 -32242 -22804 -32469 101791 125914 121957 -73416 -259067 -153532 -72711
27311 -72711 -103711 -77063 -115192 -49006 -48004 1312 60952 -33406 -169370 -159855 -185399 -107718
27299 -107718 -269 3344 -28847 59027 143001 307956 282010 245943 142705 84317 234230
27288 234230 325968 383342 362120 183865 61872 46291 142402 182247 158639 134112 26968
27277 26968 -7874 -2162 -56132 -82600 123867 220898 89101 72988 68451 114318 260083
27266 260083 301118 283471 242319 290863 240135 179867 30637 -55801 45311 102650 71397
27255 71397 81429 55130 64703 -51995 -209013 -360171 -247041 -11295 97108 162068 252519
27244 252519 282646 84968 -59081 -266599 -210829 -20815 105832 177916 201441 172260
$$ packed form
27322c4432j04283J06473R438r665J34260K4123l957j95373j85651J05535Q0821
27311g2711l1000K6648l8129O6186J002M9316N9640r4358j35964R515k5544P7681
27299a07718J07449L613l2191Q7874Q3974J64955k5946l6067j03238n8388J49913
27288B34230R1738N7374k1222j78255j21993j5581R6111L9845k3608k4527j07144
27277B6968l4842N712n3970k6468K06467R7031j31797j6113m537M5867J45765
27266B60083M1035j7647m1152M8544n0728o0268j49230q6438J01112N7339l1253
27255G1397J0032k6299R573j16698j57018j51158J13130K35746J08403O4960R0451
27244B52519L0127j97678j44049k07518N5770J90014J26647P2084K3525k9181
$$ plain form
27234 172260 90583 135347 83873 -34937 -60761 -42170 16457 94182 59563 -103058 -96150
27223 -96150 -48346 60055 125592 96562 54972 132418 196871 163358 185258 218722 111036
27212 111036 -60380 -117839 -167471 -265604 -437019 -332793 -90115 10541 113878 157797
27202 157797 -83239 -63386 63618 209489 237023 176937 54973 67283 70189 3087 -54789
27191 -54789 -119941 14908 91304 -9221 -165816 -276186 -345501 -278008 -228610 -122279 -66712
27180 -66712 29945 2296 72849 85378 144173 61200 12434 112701 75252 16537 -147944
27169 -147944 -123841 -35482 -99662 -127276 -25896 66987 954 30526 15595 -4030 38409
27158 38409 90396 153049 110902 28155 -3980 65873 123813 115417 -81462 -160098 -86378 -2259
$$ packed form
27234A72260q1677M4764n1474j18810k5824J8591N8627P7725l4619j62621O908
27223i6150M7804J08401O5537k9030m1590P7446O4453l3513K1900L3464j07686
27212A11036j71416n7459m9632r8133j71415J04226K42678J00656J03337M3919
27202A57797k41036J9853J27004J45871K7534o0086j21964J2310K906o7102n7876
27191e4789o5152J34849P6396j00525j56595j10370o9315O7493M9398J06331N5567
27180f6712R6657k7649P0553J2529N8795q2973m8766J00267l7449n8715j64481
27169a47944K4103Q8359o4180k7614J01380R2883o6033K9572j4931j9625M2439
27158C8409N1987O2653m2147q2747l2135O9853N7940q396j96879p8636P3720Q4119
$$ plain form
27146 -2259 82541 150190 134086 154556 173124 246542 259723 169408 128306 119412 130855 105609
27134 105609 82201 86796 138141 159140 85662 -45519 -62808 4434 25543 -4549 24698
27123 24698 -24263 15852 51797 -45697 53810 83257 58968 -79808 -170888 -184335 -208992
27112 -208992 -140399 -37635 18241 100180 -131 -296120 -209462 -109287 -28712 47318 -46296
27101 -46296 -185808 -182648 -127039 -77586 -87528 -92812 -35990 -23333 -29035 -82937 -111099 -218395
27089 -218395 -78878 68184 -27085 38630 124747 193102 133519 22767 -65664 -99759 -49923
27078 -49923 -143576 -142545 -14759 21238 17081 -88397 -71608 -54586 -53480 -129906 5232 164104
27066 164104 113644 64779 18755 10434 -10537 12726 29132 -5288 -184045 -155838 -149720 -135768
$$ packed form
27146b259Q4800O7649j6104K0470J8568P3418J3181r0315m1102q894J1443k5246
27134A05609k3408M595N1345K0999p3478j31181j7289O7242K1109l0092K9247
27123B4698m8961M0115L5945r7494R9507K9447k4289j38776r1080j3447k4657
27112b08992O8593J02764N5876Q1939j00311k95989Q6658J00175Q0575P6030r3614
27101d6296j39512L160N5609M9453r942n284N6822J2657n702n3902k8162j07296
27089b18395J39517J47062r5269O5715Q6117O8355n9583j10752q8431l4095M9836
27078d9923r3653J031J27786L5997m157j05478J6789J7022J106p6426J35138J58872
27066A64104n0460m8865m6024q321k0971K3263J6406l4420j78757K8207O118J3952
$$ plain form
27054 -135768 -201173 -173519 -162881 -40628 129866 254088 397432 373275 220738 80646
27044 80646 -52362 78456 220767 273483 171797 66555 57012 78893 209623 251343 276037
27033 276037 239649 143067 -55335 -73225 -40720 -45705 -166117 -131690 -55524 36312 187736
27022 187736 57788 -53704 -126527 -181810 -132646 -143260 -106154 34797 88597 130055 112283
27011 112283 104209 -42263 -192609 -142500 43462 82306 68696 70433 92728 24960 -117087
27000 -117087 -167437 -115919 -87770 24210 51867 -55458 -37413 -8302 163410 167248 141441
26989 141441 256400 286420 284059 213626 63433 -75484 -20958 88886 65639 129408 101238
26978 101238 51992 138175 89509 111054 -46917 -78911 -106173 -145242 -165318 -232074 -214332
$$ packed form
27054a35768o5405K7654J0638J22253J70494J24222J43344k4157j52537j40092
27044H0646j33008J30818J42311N2716j01686j05242r543K1881J30730M1720K4694
27033B76037l6388r6582j98402j7890L2505m985j20412L4427P6166R1836J51424
27022A87736j29948j11492p2823n5283M9164j0614L7106J40951N3800M1458j7772
27011A12283q074j46472j50346N0109J85962L8844j3610J737K2295o7768j42047
27000a17087n0350N1518K8149J11980K7657j07325J8045K9111J71712L838k5807
26989A41441J14959L0020k361p0433j50193j38917N4526J09844k3247O3769k8170
26978A01238m9246Q6183m8666K1545j57971l1994k7262l9069k0076o6756J7742
$$ plain form
26967 -214332 -165069 -227038 -173516 -174470 -43544 55907 75928 -5395 -126500 -99666 -69728
26956 -69728 -34217 -107364 -115700 -77517 -84376 -31129 106012 169424 73851 -101001 -231968
26945 -231968 16576 91160 39647 -28102 -14832 89664 57955 131411 59681 -12001 -94642
26934 -94642 -31282 70355 141146 119856 5314 -5409 -53405 -21584 -27029 8339 69494
26923 69494 205218 142963 86214 55881 -6568 -12725 -66098 -53410 1901 78928 105322 125245
26911 125245 117858 216525 155318 97633 84676 -22201 -100720 -100044 -176106 -48417 35732 109014
26899 109014 3630 -65262 20169 77717 176117 148610 153600 68490 49447 -23084 8858
26888 8858 146062 195574 211203 -54919 -228485 -190550 -66742 -9347 31192 132600 132375
$$ packed form
26967b14332M9263o1969N3522r54J30926R9451K0021q1323j21105K6834K9938
26956f9728L5511p3147q336L8183o859N3247J37141O3412r5573j74852j30967
26945b31968K48544P4584n1513o7749J3270J04496l1709P3456p1730p1682q2641
26934i4642O3360J01637P0791k1290j14542j0723m7996L1821n445L5368O1155
26923F9494J35724o2255n6749l0333o2449o157n3373J2688N5311P7027K6394J9923
26911A25245p387R8667o1207n7685j2957j06877p8519O76p6062J27689Q4149P3282
26899A09014j05384o8892Q5431N7548R8400k7507M990q5110j9043p2531L1942
26888H858J37204M9512J5629k66122j73566L7935J23808N7395M0539J01408k25
$$ plain form
26877 132375 192251 142238 95922 70392 -80507 -75389 -101955 -84376 -138458 -127077 -175576
26866 -175576 -240784 -260823 -204303 -108586 66086 55110 -88933 -234577 -179123 -194275 -321373
26855 -321373 -393313 -209697 -150548 -55457 100533 96063 5195 94960 130109 126113 99311
26844 99311 -46822 -166759 -206911 -122004 -134864 -140253 -168739 -147731 -157077 -15983 204305
26833 204305 282011 172441 46870 39884 -40610 -92401 -41185 74014 109160 65652 -11829
26822 -11829 49738 55025 121243 87251 -15573 -110698 -73430 -54370 60730 -11548 65659
26811 65659 195152 206308 262232 139802 -95442 -120418 -104948 -107534 8659 74952 151200
26800 151200 103852 -56934 -101485 -47012 57623 46913 -15676 -76727 -153209 -185481 -25184
$$ packed form
26877A32375N9876n0013m6316k5530j50899N118k6566J7579n4082J1381m8499
26866a75576o5208k0039N6520R5717J74672j0976j44043j45644N5454j5152j27098
26855c21373p1940J83616N9149R5091J55990m470r0868Q9765L5149l996k6802
26844I9311j46133j19937m0152Q4907j2860n389k8486K1008r346J41094K20288
26833B04305P7706j09570j25571o986q0494n1791N1216J15199L5146m3508p7481
26822a1829O1567N287O6218l3992j02824r5125L7268J9060J15100p2278P7207
26811F5659J29493J1156N5924j22430k35244k4976J5470k586J16193O6293P6248
26800A51200m7348j60786m4551N4473J04635j0710o2589o1051p6482l2272J60297
$$ plain form
26789 -25184 41249 89410 1821 3560 79196 88628 86674 34802 -31080 -146332 -90023 26927
26777 26927 48111 -96227 -158807 -44535 -16124 -58577 30039 117199 49714 85959 -7984
26766 -7984 -61679 -91917 70213 127409 63893 91578 184271 83635 42135 89083 198116
26755 198116 93373 45580 96754 81613 28090 59948 132398 30438 -26689 8809 12456
26744 12456 -75414 -207207 -135278 -112536 144492 170670 136745 128136 24377 -57035 -141158
26733 -141158 -154410 -69278 62066 -107175 -236001 -281832 -202556 -155680 -113178 -46204 -53051
26722 -53051 85278 110602 102517 149317 27429 -25426 -133403 -144706 -76148 58990 26927
26711 26927 -59615 -14569 83593 115377 102667 1837 -230340 -239610 -259974 -261028 -216856 -224669
$$ packed form
26789b5184O6433M8161q7589J739P5636R432j954n1872o5882j15252N6309J16950
26777B6927K1184j44338o2580J14272K8411m2453Q8616Q7160o7485L6245r3943
26766g984n3695l0238J62130N7196o3516K7685R2693j00636m1500M6948J09033
26755A98116j04743m7793N1174j5141n3523L1858P2450j01960n7127L5498L647
26744A2456q7870j31793P1929K2742K57028K6178l3925q609j03759q1412q4123
26733a41158j3252Q5132J31344j69241j28826m5831P9276M6876M2502O6974o847
26722e3051J38329K5324q085M6800j21888n2855j07977j1303O8558J35138l2063
26711B6927q6542M5046R8162L1784j2710j00830k32177r270k0364j054M4172p813
$$ plain form
26699 -224669 -215855 -207667 -235955 -224662 -94666 10379 -117162 -137942 -14588 -26640 -50411
26688 -50411 -82544 -114350 -58280 -68644 -22288 8539 8823 122976 99917 -25542 -23041 -47185
26676 -47185 -120487 -303562 -439090 -325809 -328576 -144537 48425 166233 61394 48010
26666 48010 79624 4489 48519 44791 60865 161869 113691 7397 -110460 -257828 -319215
26655 -319215 -255563 -119494 -48486 -55129 -25613 -74044 -176356 -61986 19541 67210 75033
26644 75033 183198 224495 311004 275149 121671 -83915 -89971 -68171 -188499 -158766 -127906
26633 -127906 -144981 -109713 85882 78778 14941 -179146 -173144 -142174 -55295 29644 -86303
26622 -86303 8161 130176 164199 25534 19595 -94034 -209502 -204034 -285456 -272976 -241011
$$ packed form
26699b24669Q814Q188k8288J1293J29996J05045j27541k0780J23354j2052k3771
26688e0411l2133l1806N6070j0364M6356L0827K84J14153k3059j25459K501k4144
26676d7185p3302j83075j35528J13281k767J84039J92962J17808j04839j3384
26666D8010L1614p5135M4030l728J6074J01004m8178j06294j17857j47368o1387
26655c19215O3652J36069P1008o643K9516m8431j02312J14370Q1527M7669P823
26644G5033J08165M1297Q6509l5855j53478k05586o056K1800j20328K9733L0860
26633a27906j7075L5268J95595p104o3837j94087O002L0970Q6879Q4939j15947
26622h6303R4464J22015L4023j38665n939j13629j15468N468q1422J2480L1965
$$ plain form
26611 -241011 -181810 -121343 -133739 -160939 -132687 -171838 -66829 101067 68147 98529 109498
26600 109498 95808 129480 120631 66765 44717 102538 278333 393171 230279 69256 13316
26589 13316 48627 15148 -108920 1657 95442 92026 -31003 -169733 -194791 -251013 -174353
26578 -174353 -83374 9521 28746 -103176 -183488 -146596 -101236 28117 188707 178450 89997
26567 89997 -50641 33213 3551 -89522 -119969 -183007 -57905 123971 108728 37362 47564
26556 47564 73530 15987 16767 -10445 111461 194863 273651 205289 114520 -34647 -65616 -8128
26544 -8128 -24305 -202465 -241869 -48801 58889 47183 144397 150540 -17962 -209245 -195102
26533 -195102 -33808 -6155 63546 186261 84571 -66167 -53760 89273 143653 82419
$$ packed form
26611b41011N9201O0467j2396k7200K8252l9151J05009J67896l2920L0382J0969
26600A09498j3690L3672q849n3866k2048N7821J75795J14838j62892j61023n5940
26589A3316L5311l3479j24068J10577R3785l416j23029j38730k5058n6222P6660
26578a74353R0979R2895J9225j31922q0312L6892M5360J29353J60590j0257q8453
26567H9997j40638Q3854k9662r3073l0447o3038J25102J81876j5243p1366J0202
26556D7564K5966n7543P80k7212J21906Q3402P8788o8362r0769j49167l0969N7488
26544h128j6177j78160l9404J93068J07690j1706R7214O143j68502j91283J4143
26533a95102J61294K7653O9701J22715j01690j50738J2407J43033N4380o1234
$$ plain form
26523 82419 -20590 55862 119381 132355 86783 110973 43783 73132 13576 -9543 -37289
26512 -37289 -124899 -97330 34392 82264 4300 -38816 -140676 -141746 -222286 -233822 -112478
26501 -112478 -22091 -10294 -13835 -51848 -160048 -106549 -66511 71471 120187 103808 93282
26490 93282 -54110 39423 106804 106890 113205 159789 105667 1552 68953 -6022 -41038 -65598
26478 -65598 -71527 67722 219867 146049 23618 19690 55519 62244 -69190 -15090 -10982 50596
26466 50596 220532 201619 92245 -6173 -104429 -69990 -44676 -113813 -348725 -403485 -273282
26455 -273282 -237283 -245545 -360031 -382471 -247344 -263382 -278270 -243915 -171598 -52141 -12442
26444 -12442 59405 37955 89371 35090 -105054 -8138 102601 153242 65485 39031 56705
$$ packed form
26523H2419j03009P6452O3519J2974m5572K4190o7190K9349n9556k3119k7746
26512c7289q7610K7569J31722M7872p7964m3116j01860j070q0540j1536J21344
26501a12478R0387J1797l541l8013j08200N3499M0038J37982M8716j6379j0526
26490I3282j47392R3533O7381Q6O315M6584n4122j04115O7401p4975l5016k4560
26478f5598n929J39249J52145p3818j22431l928L5829O725j31434N4100M108O1578
26466E0596J69936j8913j09374r8418r8256L4439K5314o9137k34912n4760J30203
26455b73282L5999q262j14486k2440J35127j6038j4888L4355P2317J19457L9699
26444a2442P1847k1450N1416n4281j40144R6916J10739N0641q7757k6454J7674
$$ plain form
26433 56705 86999 -13697 -155719 -243425 -186155 -64226 -46570 -77083 -44833 20775 25668
26422 25668 125441 137309 31399 61151 -53758 -47828 3974 -87304 -223638 -148920 -166965
26411 -166965 -86935 9165 2855 101342 167932 201328 166325 136835 50950 177622 146947
26400 146947 66162 84998 142493 106640 91747 22509 -193721 -109924 -58259 -37213 -154557
26389 -154557 -237316 -242118 -296438 -340544 -213165 9468 137524 -14568 -35156 9444 8591
26378 8591 31656 45714 25500 -498 -73679 35620 79854 -162 -71104 -245926 -337106
26367 -337106 -236216 -38835 118494 127705 68559 152626 61308 17035 -68270 -89130 -102500
26356 -102500 -103613 -81741 -113325 -23983 -67739 -167944 -34430 167792 73780 -60673 -82585
$$ packed form
26433E6705L0294j00696j42022q7706N7270J21929J7656l0513L2250O5608M893
26422B5668R9773J1868j05910K9752j14909N930N1802r1278j36334P4718j8045
26411a66965Q0030R6100o310R8487O6590L3396l5003k9490q5885J26672l0675
26400A46947q0785J8836N7495l5853j4893o9238k16230Q3797N1665K1046j17344
26389a54557q2759m802n4320m4106J27379K22633J28056j52092k0588M4600q53
26378H591K3065J4058k0214k5998p3181J09299M4234q0016p0942j74822r1180
26367c37106J00890J97381J57329R211n9146Q4067r1318m4273q5305k0860j3370
26356a02500j113K1872l1584Q9342m3756j00205J33514K02222r4012j34453k1912
$$ plain form
26345 -82585 -32456 -51159 -153987 -234295 -117466 -118789 -261718 -443501 -255974 -81659 -68095
26334 -68095 -197710 -130166 -123724 -56266 5445 54116 134289 39693 -40816 -116837 -78034 25832
26322 25832 145681 183402 193782 224559 67583 41988 25748 116764 124775 -12804 22113
26311 22113 18853 -47101 114865 161992 184788 282661 230075 172999 143364 40334 97992
26300 97992 163098 142759 72960 8619 82285 261165 251787 44229 16932 114538 137183
26289 137183 120805 52414 147194 112421 -48746 -3545 88794 138009 167711 135799 218700
26278 218700 191574 178419 189101 129737 73477 43392 -63958 -73855 -167882 -256122 -286431
26267 -286431 -191163 -255483 -181693 49003 128255 224758 226646 112654 32055 -9215 -913
$$ packed form
26345h2585N0129j8703j02828q0308J16829j323j42929j81783J87527J74315J3564
26334f8095j29615O7544O442O7458O1711M8671Q0173r4596q0509p6021L8803J03866
26322B5832J19849L7721J0380L0777j56976k5595j6240R1016Q011j37579L4917
26311B2113l260o5954J61966M7127K2796R7873n2586n7076k9635j03030N7658
26300I7992O5106k0339o9799o4341P3666J78880r378k07558k7297R7606K2645
26289A37183j6378o8391R4780l4773j61167M5201R2339M9215K9702l1912Q2901
26278B18700k7126j3155J0682n9364n6260l0085j07350r897r4027q8240l0309
26267b86431R5268o4320P3790K30696P9252R6503J888j13992q0599m1270Q302
$$ plain form
26256 -913 81137 19909 3145 -31745 -85761 -72292 -12594 -100758 3549 -49932 -116714 -54098
26244 -54098 -38441 -96642 20065 96479 120617 103736 38900 2805 -138644 -81031 -107725
26233 -107725 -122943 90805 75771 -191566 -285090 -152944 20452 58117 -74741 25491
26223 25491 -29234 -22057 -66396 -70544 -503 51156 153794 97287 87244 91624 -28883 -90481
26211 -90481 -71134 -15094 61307 -57577 -176916 -103947 -56267 4508 99432 74280 17886
26200 17886 -80349 -226454 -153803 -37891 16904 -71400 -144550 -65151 -4046 72394 16336
26189 16336 69782 75159 -84980 -233972 -173444 -2564 -144195 -160550 -162904 -153742 -102336
26178 -102336 -221308 -266448 -131490 -42054 -80773 -173720 -333704 -283306 -178286 -168230 -156715
$$ packed form
26256i13Q2050o1228j6764l4890n4016J3469N9698q8164J04307n3481o6782O2616
26244e4098J5657n8201J16707P6414K4138j6881o4836l6095j41449N7613k6694
26233a07725j5218K13748j5034k67337r3524J32146J73396L7665j32858J00232
26223B5491n4725P177m4339m148P0041N1659J02638n6507j0043M380j20507o1598
26211i0481J9347N6040P6401j18884j19339P2969M7680O0775R4924k5152n6394
26200A7886r8235j46105P2651J15912N4795q8304p3150P9399O1105P6440n6058
26189A6336N3446N377j60139j48992O0528J70880j41631j6355k354R162N1406
26178a02336j18972m5140J34958Q9436l8719r2947j59984N0398J05020J0056J1515
$$ plain form
26167 -156715 -163912 -193166 -87533 60629 -115257 -217810 -132297 -197097 -200375 -128273 -110497
26156 -110497 -70541 -170740 -171859 -64863 76275 260059 98493 -14387 -100932 -194445
26146 -194445 -138741 -157767 -189279 -129734 -76929 12211 -24573 -64494 -15661 3714 -126118
26135 -126118 -150098 -131017 -72741 36621 158275 48481 94090 94838 73219 18746 81814
26124 81814 -80353 -214341 -25467 213 -14661 -63126 -360952 -420982 -399305 -296536 -134990
26113 -134990 -130915 -287996 -280053 -124611 -27033 -120181 84199 217754 250018 189841 199912
26102 199912 97121 -34053 -65454 2413 18192 52675 68356 -23646 -71504 -109434 -57023
26091 -57023 -86616 -320074 -378500 -116190 -87503 -12214 -18459 101674 83623 51935 -2058
$$ packed form
26167a56715p197k9254J05633J48162j75886j02553Q5513o4800l278P2102J7776
26156a10497L9956j00199j119J06996J41138J83784j61566j12880q6545r3513
26146a94445N5704j9026l1512N9545N2805Q9140l6784l9921M8833J9375j29832
26135a26118k3980J9081N8276J09362J21654j09794M5609P48k1619n4473O3068
26124H1814j62167j33988J88874K5680j4874m8465k97826o0030K1677J02769J61546
26113a34990M075j57081P943J55442R7578r3148K04380J33555L2264o0177J0071
26102A99912j02791j31174l1401O7867J5779L4483J5681r2002m7858l7930N2411
26091e7023k9593k33458n8426K62310K8687P5289o245J20133j8051l1688n3993
$$ plain form
26080 -2058 30544 196633 123596 -57939 -118510 -102459 39081 268995 295959 150368 40782
26069 40782 -77821 -48108 -87647 -99126 -27325 40872 -32075 2257 25844 -130147 -124668
26058 -124668 -124769 -82331 34402 12236 -60048 7208 59107 76354 10318 114513 155443
26047 155443 105857 185351 88571 -14985 43855 -70273 -221936 -345318 -256467 -200677 -132675
26036 -132675 -75504 71458 -2969 -21188 -32446 -92960 -131974 -17211 -5349 -46414 -158258
26025 -158258 -205069 -67539 -202 -20851 -18361 -21418 125471 33148 -23196 -7382 -72349
26014 -72349 -123736 -60051 -67699 -208800 -244901 -273155 -163528 -165436 -113183 -7733 18726
26003 18726 71063 222 -90162 -94172 -69130 -32937 -20824 -26946 -34122 20211 832 -118215
$$ packed form
26080b058L2602J66089p3037j81535o0571J6051J41540K29914K6964j45591j09586
26069D0782j18603K9713l9539j1479P1801O8197p2947L4332K3587j55991N479
26058a24668j01M2438J16733k2166p2284O7256N1899J7247o6036J04195M0930
26047A55443m9586P9494r6780j03556N8840j14128j51663j23382Q8851N5790O8002
26036a32675N7171J46962p4427j8219j1258o0514l9014J14763J1862m1065j11844
26025a58258m6811J37530O7337k0649K490l057J46889r2323n6344J5814o4967
26014g2349n1387O3685p648j41101l6101k8254J09627j908N2253J05450K6459
26003A8726N2337p0841r0384m010K5042L6193J2113o122p176N4333j9379j19047
$$ plain form
25991 -118215 -172670 -152735 -114633 -37972 85117 151990 180256 171733 128472 -32037 -198896
25980 -198896 -266558 -69947 82478 146802 280043 154099 -36198 -79329 -5595 -50843
25970 -50843 -137546 -225955 -194154 -226798 -154515 -146037 -181926 -252814 -232991 -158301 -223521 -161037
25958 -161037 -163055 -12405 63753 17764 38003 -39801 -116527 -212642 -273888 -163842 -104872
25947 -104872 -170400 -172181 -139607 -183454 -142845 -195055 -158049 -106712 11574 164642 45944
25936 45944 -7576 -34463 -28517 -56043 -66905 -73637 -128198 -164677 -130265 -68800 -105720 -212767
25924 -212767 -249679 -186032 -151901 13495 95861 -808 -31737 -139797 -305278 -272374 -146015
25913 -146015 -262320 -218254 24076 217534 302945 124566 -20040 -78957 -17494 147614
$$ packed form
25991a18215n4455J9935L8102P6661J23089O6873K8266q523m3261j60509j66859
25980a98896o7662J96611J52425O4324J33241j25944j90297m3131P3734m5248
25970e0843q6703q8409L1801l2644P2283Q478l5889p0888J9823P4690o5220O2484
25958a61037k018J50650P6158m5989K0239p7804p6726r6115o1246J10046N8970
25947a04872o5528j781L2574m3847M0609n2210L7006N1337J18286J53068j18698
25936D5944n3520k6887N946k7526j0862o732n4561l6479L4412O1465l6920j07047
25924b12767l6912O3647L4131J65396Q2366r6669l0929j08060j65481L2904J26359
25913a46015j16305M4066K42330J93458Q5411j78379j44606n8917O1463J65108
$$ plain form
25903 147614 192586 29136 -10837 123454 89201 29090 7470 -64797 -195790 -181582 -123271
25892 -123271 -18296 -89491 -303573 -254635 -182913 -174344 -8732 -20069 108720 37320 39322
25881 39322 63516 56456 62310 28459 -59223 -13574 64535 -133159 -303137 -303215 -76794 -132098
25869 -132098 -115700 -12181 21049 131021 73552 -37167 -53292 -138940 -213168 -228612 -222455
25858 -222455 -140202 6646 -16594 2025 7122 1575 -18236 -11369 34966 -54044 -31936 -36367
25846 -36367 -43410 -69378 -75077 -109378 -113988 -156486 -291455 -336926 -193183 -66096 28643 -25161
25834 -25161 -138199 -132362 -44548 -133042 -278525 -209603 -119020 -26836 73481 151832 66920
25823 66920 101227 228049 109470 -158822 -271096 -148541 45665 65520 -128160 -204966
$$ packed form
25903A47614M4972j63450l9973J34291l4253o0111k1620p2267j30993J4208N8311
25892a23271J04975p1195k14082M8938P1722Q569J65612j1337J28789p1400K002
25881C9322K4194p060N854l3851q7682M5649P8109j97694j69978p8K26421n5304
25869a32098J6398J03519L3230J09972n7469j10719j6125q5648p4228j5444O157
25858b22455Q2253J46848k3240J8619N097n547j9811O867M6335q9010K2108m431
25846c6367p043k5968n699l4301m610m2498j34969m5471J43743J27087R4739n3804
25834b5161j13038N837Q7814q8494j45483O8922R0583R2184J00317P8351q4912
25823F6920L4307J26822j18579k68292j12274J22555J94206J9855j93680p6806
$$ plain form
25813 -204966 -130965 -138669 -137642 -48718 -39231 63302 147750 65938 -2970 28098 83217 69994
25801 69994 105815 218392 125031 37207 759 -5709 28546 32016 -11019 -45699 -79600 -194961
25789 -194961 -139170 -88098 -210589 -157637 -130953 59217 294102 405675 344179 170530
25779 170530 31522 72513 87890 131552 213651 266027 195538 189141 27085 -71942 46034
25768 46034 93666 134578 156471 91291 -16017 -36717 122001 319844 252262 123459 209235
25757 209235 150240 131468 92540 -83480 10443 72450 -6225 -30044 -30974 -21996 -73223 -133406
25745 -133406 -102716 -203873 -121511 54763 40247 12428 608 -61511 93053 164470 143101
25734 143101 163284 6726 -24804 20752 60796 71159 10388 -106866 -70157 -68774 -13331
$$ packed form
25813b04966P4001p704J027Q8924R487J02533Q4448q1812o8908L1068N5119j3223
25801F9994L5821J12577r3361q7824l6448o468L4255L470m3035l4680l3901j15361
25789a94961N5791N1072j22491N2952K6684J90170K34885J11573o1496j73649
25779A70530j39008M0991J5377M3662Q2099N2376p0489o397j62056r9027J17976
25768D6034M7632M0912K1893o5180j07308k0700J58718J97843o7582j28803Q5776
25757B09235n8995j8772l8928j76020R3923O2007p8675k3819r30Q978n1227o0183
25745a33406L0690j01157Q2362J76274j4516k7819j1820o2119J54564P1417k1369
25734A43101K0183j56558l1530M5556M0044J0363o0771j17254L6709J383N5443
$$ plain form
25723 -13331 -52147 56778 130952 104273 24255 13099 -30514 -93178 -135936 -63671 -74407
25712 -74407 -22388 61342 92985 41498 64221 117188 116363 50065 -26779 -51393 7034 29432
25700 29432 -2129 -7022 6030 52914 70062 66816 112268 -78966 -282482 -313898 -258074 -324616
25688 -324616 -295509 -247913 -208563 -46235 -63720 -139875 -200136 -98400 -23285 -167210 -213554
25677 -213554 -80449 120855 40 -158667 -170058 -107705 -154461 -104676 -79070 -133084 -224701
25666 -224701 -105386 -2281 44085 -17136 -43466 9549 -37181 14840 43406 133209 156898
25655 156898 111127 112255 -4246 -39515 -77897 -110948 -49188 -5308 155126 -1777 -125697
25644 -125697 -64885 -49691 -152783 -352689 -377292 -208732 -198843 -122248 95980 236985 128275
$$ packed form
25723a3331l8816J08925P4174k6679q0018j1156m3613o2664m2758P2265j0736
25712g4407N2019Q3730L1643n1487K2723N2967q25o6298p6844k4614N8427K2398
25700B9432l1561m893J3052M6884J7148l246M5452j91234k03516l1416N5824o6542
25688c24616K9107M7596L9350J62328j7485p6155o0261J01736P5115j43925m6344
25677b13554J33105K01304j20815j58707j1391O2353m6756M9785K5606n4014r1617
25666b24701J19315J03105M6366o1221k6330N3015m6730N2021K8566Q9803K3689
25655A56898m5771J128j16501l5269l8382l3051O1760M3880J60434j56903j23920
25644a25697O0812J5194j03092j99906k4603J68560R889P6595K18228J41005j08710
$$ plain form
25633 128275 -34713 -150713 -170059 -166809 -126476 -173012 -124015 -284741 -236630 -83579 29711
25622 29711 58286 -86302 -47202 80781 44951 18110 -14823 -75511 -154032 -247210 -213960
25611 -213960 -123189 -108436 -58183 219392 274763 122618 89767 40136 18567 -75530 -220952
25600 -220952 -223003 -251018 -257543 -238978 -190735 -40677 -2001 89591 36717 -15804 93283
25589 93283 107943 -28039 -156959 -168687 -166686 -154801 -64586 36471 64747 83220 103986
25578 103986 210386 218347 283127 266834 195540 187989 152474 173568 60912 -74125 -98597
25567 -98597 -139958 -185797 -171487 -160757 -246618 -251280 -80341 138102 129097 -24631 -136793
25556 -136793 -74265 -83465 -14944 32509 201444 271090 223331 102167 -2108 -23344 65712
$$ packed form
25633A28275j62988j16000j9346L250M0333m6536M8997j60726M8111J53051J13290
25622B9711K8575j44588L9100J27983l5830k6841l2933o0688p8521r3178L3250
25611b13960R0771J4753N0253K77575N5371j52145l2851m9631k1569r4097j45422
25600b20952k051k8015o525J8565M8243J50058L8676R1592n2874n2521J09087
25589I3283J4660j35982j28920j1728K001J1885R0215J01057K8276J8473K0766
25578A03986J06400P961O4780j6293p1294p551l5515K1094j12656j35037k4472
25567i8597m1361m5839J4310J0730q5861m662J70939K18443r005j53728j12162
25556a36793O2528r200O8521M7453J68935O9646m7759j21164j04275k1236Q9056
$$ plain form
25545 65712 128390 -57781 -129829 -62008 -21870 -56608 -71165 3446 87563 41504 62571
25534 62571 145753 177737 219459 294712 238894 171248 53837 1168 -3898 -20792 -29743 -121902
25522 -121902 126646 153804 96129 192543 375495 371572 292265 390788 500122 469481 408042
25511 408042 366828 379554 377757 447698 397570 327910 174928 112510 308234 365355 308210
25500 308210 155626 34287 -11734 91516 197469 309971 236219 213183 226082 210108
25490 210108 174432 250216 342729 301229 353729 336290 370601 262394 197814 174778 322041
25479 322041 421821 401691 185925 188247 149006 142304 180059 131552 88071 64000 73532 149302
25467 149302 116758 125157 1904 -46870 2448 59567 199336 93593 -121319 -216783 -172784
$$ packed form
25545F5712O2678j86171p2048O7821M0138l4738j4557P4611Q4117m6059K1067
25534F2571Q3182L1984M1722P5253n5818o7646j17411n2669n066j6894q951r2159
25522a21902K48548K7158n7675R6414J82952l923p9307R8523J09334l0641o1439
25511D08042m1214J2726j797O9941n0128o9660j52982o2418J95724N7121n7145
25500C08210j52584j21339m6021J03250J05953J12502p3752k3036J2899j5974
25490B10108l5676P5784R2513m1500N2500j7439L4311j08207o4580k3036J47263
25479C22041R9780k0130k15766K322l9241o702L7755m8507m3481k4071R532P5770
25467A49302l2544Q399j23253m8774M9318N7119J39769j05743k14912r5464M3999
$$ plain form
25456 -172784 -114596 -66338 -23083 -32496 -36962 -100746 -82787 -51710 -137192 -218463 -156582 31138
25444 31138 192262 85997 -49408 -158563 -302781 -304450 -154859 -119786 -51275 -67657 -43781
25433 -43781 193538 149865 -122639 -276023 -294660 -220427 -80731 -78814 -83649 -118801 -100433
25422 -100433 -186048 -310238 -252866 -62595 48833 59023 45634 60498 -39965 -32971 76269
25411 76269 250483 183449 115154 162730 152462 -34398 -83490 -89148 51356 191077 130325
25400 130325 131978 183634 248761 298648 266781 235854 289267 285939 112738 26830 -13185 -24022
25388 -24022 47880 12131 44726 98410 134366 213794 266280 212271 274125 211958 209985 194485
25376 194485 221046 176618 193745 136751 101397 219370 147217 43829 -44514 53191 199256
$$ packed form
25456a72784N8188M8258M3255r413m466o3784J7959L1077q5482q1271O1881J87720
25444C1138J61124j06265j35405j09155j44218j669J49591L5073O8511j6382K3876
25433d3781K37319m3673k72504j53384j8637P4233J39696J917m835l5152J8368
25422a00433q5615j24190N7372J90271J11428J0190j3389J4864j00463O994J09240
25411G6269J74214o7034o8295M7576j0268j86860m9092n658J40504J39721o0752
25400A30325J653N1656O5127M9887l1867l0927N3413l328j73201q5908m0015j0837
25388b4022P1902l5749L2595N3684L5956P9428N2486n4009O1854o2167j973j5500
25376A94485K6561m4428J7127n6994l5354J17973p2153j03388q8343R7705J46065
$$ plain form
25365 199256 70694 30368 11627 168756 265188 257968 313638 309969 256267 253823 432392
25354 432392 607945 497437 235810 71410 -4128 -72415 -79374 -82602 -16729 -2269 -51273
25343 -51273 -64677 -65520 33423 194877 263633 173904 109471 72365 -142239 -221339 -131662 -57794
25331 -57794 28604 -47512 -188972 -146803 -42542 -59260 44117 20996 -74330 -58380 31258
25320 31258 -49835 -101289 -20285 -13961 3063 21304 77133 64919 -91487 -61443 24752 45955
25308 45955 115491 85909 15121 -102990 -154686 -65249 -71194 -132573 -170745 -159868 -202708 -69675
25296 -69675 -14645 30688 -103018 -204681 -50257 169479 169089 14324 168365 53229 -82373
25285 -82373 25250 191691 229216 242087 215320 274272 137978 7720 25094 149788 290804
$$ packed form
25365A99256j28562m0326j8741J57129R6432p220N5670l669n3702k444J78569
25354D32392J75553j10508k61627j64400p5538o8287o959l228O5873J4460m9004
25343e1273j3404q43R8943J61454O8756q9729o4433l7106k14604p9100Q9677P3868
25331e7794Q6398p6116j41460M2169J04261j6718J03377k3121r5326J5950Q9638
25320C1258q1093n1454Q1004O324J7024J8241N5829j2214j56406L0044Q6195K1203
25308D5955O9536k9582p0788j18111n1696Q9437n945o1379l8172J0877m2840J33033
25296f9675N5030M5333j33706j01663J54424K19736l90j54765J54041j15136j35602
25285h2373J07623J66441L7525J2871k6767N8952j36294j30258J7374J24694J41016
$$ plain form
25274 290804 397325 447516 315744 481113 593199 695724 596444 599085 489659 318924
25264 318924 234990 128689 102016 184375 290702 572313 776621 751198 608243 537444
25254 537444 546986 446265 348377 346453 153500 146822 174473 211459 312286 188430 140551
25243 140551 198327 232511 138537 110761 142754 172581 307669 403028 523347 589981 555116
25232 555116 403924 328988 256535 125683 -11713 -49252 -39272 64233 107757 87821 61572
25221 61572 85146 164536 269201 302222 213096 257647 146076 33046 61324 141310 123292
25210 123292 122594 154142 276647 102369 -87712 -140954 -244060 -340746 -489671 -482330 -540931
25199 -540931 -567905 -278652 -162174 -241902 -355610 -382555 -324916 -355141 -389089 -332628 -269595
$$ packed form
25274B90804J06521N0191j31772J65369J12086J02525r9280K641j09426j70735
25264C18924q3934j06301k6673Q2359J06327K81611K04308k5423j42955p0799
25254E37444R542j00721r7888j924j92953o678K7651L6986J00827j23856m7879
25243A40551N7776L4184r3974k7776L1993K9827J35088R5359J20319O6634l4865
25232E55116j51192p4936p2453j30852j37396l7539R980J03505M3524j9936k6249
25221F1572K3574P9390J04665L3021q9126M4551j11571j13030K8278P9986j8018
25210A23292o98L1548J22505j74278j90081n3242j03106r6686j48925P341n8601
25199e40931k6974K89253J16478p9728j13708k6945N7639l0225l3948N6461O3033
$$ plain form
25188 -269595 -241799 -295447 -334952 -334191 -491204 -688184 -692992 -594685 -674493 -592516 -386668
25177 -386668 -334892 -429133 -339142 -175421 -81379 34133 -41614 -242678 -251842 -202681 -250459
25166 -250459 -299109 -358549 -575271 -642970 -596373 -599690 -566535 -561025 -294564 -27906 244256
25155 244256 390022 507728 605720 680402 804290 665624 458275 364782 244715 295346
25145 295346 466140 784934 919435 896871 901462 982358 1006865 855316 812685 761928 784090
25134 784090 703254 892751 829749 852601 1008055 1082193 1024488 1061648 1349548 1551565 1452324
25123 1452324 1318623 1209381 1123352 1115724 1248435 1416478 1558905 1757442 1938310 2309974
25113 2309974 2364097 2156915 2153129 2071756 2026273 1935721 1714769 1512288 1381429 1497348
$$ packed form
25188b69595K7796n3648l9505P61j57013j96980m808R8307p9808Q1977K05848
25177c86668N1776r4241Q9991J63721R4042J15512p5747k01064r164M9161m7778
25166b50459m8650n9440k16722o7699M6597l317L3155N510K66461K66658K72162
25155B44256J45766J17706R7992P4682J23888j38666k07349r3493j20067N0631
25145B95346J70794L18794J34501k2564M591Q0896K4507j51549m2631n0757K2162
25134G84090q0836J89497o3002K2852J55454P4138n7705L7160K87900K02017r9241
25123A452324j33701j09242q6029p628J32711J68043J42427J98537J80868L71664
25113B309974N4123k07182l786q1373m5483r0552k20952k02481j30859J15919
$$ plain form
25103 1497348 1543944 1571369 1736396 1844677 2062412 2353986 2374965 2339355 2262386 2128925
25093 2128925 2221205 2275710 2244254 2296103 2162840 2033782 2076185 2139171 2003248 2030217 1980079
25082 1980079 1951155 1926816 1976886 1938535 1993921 2002915 1859083 1598963 1566661 1852877 2021817
25071 2021817 2204968 2243588 1971168 1802024 1908927 2224101 2491932 2747893 3071845 3661544
25061 3661544 4065829 4057068 3843249 3852726 4122618 4254525 4220108 4220099 4127337 4306331 4674777
25050 4674777 4872345 5164229 5857079 6719690 7441062 8116940 8610117 8992174 9509241
25041 9509241 10271204 11712463 13343387 14263326 14314064 14057081 14240769 15411610 17526702
25032 17526702 20161742 23531305 28235798 35953988 47621803 62630405 82950985 112050995
$$ packed form
25103A497348M6596K7425J65027J08281K17735K91574K0979l5610p6969j33461
25093B128925R2280N4505l1456N1849j33263j29058M2403O2986j35923K6969n0138
25082A980079k8924k4339N0070l8351N5386Q994j43832k60120l2302K86216J68940
25071B021817J83151L8620k72420j69144J06903L15174K67831K55961L23952N89699
25061C661544M04285q761k13819R477K69892J31907l4417rr2762J78994L68446
25050D674777J97568K91884O92850Q62611P21372O75878M93177L82057N17067
25041I509241P61963J441259J630924R19939N0738k56983J83688J170841K115092
25032A7526702K635040L369563M704493P718190J1667815J5008602K0320580K9100010
$$ plain form
25024 112050995 152449914 198568026 234687855 252219087 253052384 246996196 238187367
25017 238187367 228464218 222196449 221857266 226234762 233859125 242759365 254150735 268214171
25009 268214171 280364053 290416256 309940133 351058332 414762943 475103570 479375724
25002 479375724 423440115 353196472 291182139 239945873 201490498 175857278 158955257
24995 158955257 147905074 140915397 136548119 133538107 131301621 128519148 124473228 119040273
24987 119040273 112681369 106304886 99934974 92265377 84212527 76180634 68123538 60530129
24979 60530129 53737687 47460706 41427937 35927536 31457687 28011694 25352425 23047834
24971 23047834 20513384 18455507 16962902 15758194 14587768 13379764 12162366 10984759
$$ packed form
25024A12050995M0398919M6118112L6119829J7531232Q33297o056188q808829
25017B38187367r723149o267769l39183M377496P624363Q900240J1391370J4063436
25009B68214171J2149882J0052203J9523877M1118199O3704611O0340627M272154
25002D79375724n5935609p0243643o2014333n1236266l8455375k5633220j6902021
24995A58955257j1050183o989677m367278l010012k236486k782473m045920n432955
24987A19040273o358904o376483o369912p669597q052850q031893q057096p593409
24979F0530129o792442o276981o032769n500401m469849l445993k659269k304591
24971B3047834k534450k057877j492605j204708j170426j208004j217398j177607
$$ plain form
24963 10984759 10013535 9292849 8678499 8095955 7614869 7271543 6990517 6863284 6751966
24954 6751966 6646071 6462607 6066976 5491493 4905512 4357959 3905903 3509948 3249476
24945 3249476 3128346 3247011 3263742 3205628 2990379 3000920 3128583 3204758 3240684 3136242
24935 3136242 2970977 2637959 2298839 2313400 2265377 1936986 1759999 1339963 995532 931975
24925 931975 1027521 1022077 1088894 1196950 1233533 1287843 1330250 1256670 1000050 800236 619259
24914 619259 456892 468866 745053 803013 705206 812612 796832 558107 567003 800342 948794
24903 948794 870536 688258 519553 266439 119012 213749 451937 443049 435793 533847 581428
24892 581428 444363 198803 34720 12736 148930 237917 291612 418607 506817 366818
$$ packed form
24963A0984759r71224p20686o14350n82544m81086l43326k81026j27233j11318
24954F751966j05895j83464l95631n75483n85981n47553m52056l95955k60472
24945C249476j21130J18665J6731n8114k15249J0541J27663P6175L5926j04442
24935C136242j65265l33018l39120J4561m8023l28391j76987m20036l44431o3557
24925I31975R5546n444O6817J08056L6583N4310M2407p3580k56620j99814j80977
24914F19259j62367J1974K76187N7960r7807J07406j5780k38725Q896K33339J48452
24903I48794p8258j82278j68705k53114j47427R4737K38188q888p256R8054M7581
24892E81428j37065k45560j64083k1984J36194Q8987N3695J26995Q8210j39999
$$ plain form
24882 366818 270757 221624 326260 414385 353773 290370 237486 208137 168981 255825 162172
24871 162172 95668 146685 258436 355425 621777 853837 1123961 1234484 1415433 1707385
24861 1707385 1550816 1145402 936703 928034 795684 681434 560495 747320 896517 1025329
24851 1025329 1113472 1192969 1333738 1311188 1285460 1384542 1362748 1341151 1235754 1066694 1024895
24840 1024895 975272 1031127 1225325 1310304 1226343 1192149 1114975 1057311 850794 957783 969455
24829 969455 922583 1152681 1262639 1304612 1330451 1403520 1253466 1145693 1010924 830221
24819 830221 860372 798757 765056 692186 663522 771069 897074 813062 858235 875167 825736
24808 825736 696108 682053 648228 523569 494007 513666 552315 624879 650676 552432 556192
$$ packed form
24882C66818r6061m9133J04636Q8125o0612o3403n2884k9349l9156Q6844r3653
24871A62172o6504N1017J11751R6989K66352K32060K70124J10523J80949K91952
24861A707385j56569m05414k08699q669j32350j14250j20939J86825J49197J28812
24851A025329Q8143P9497J40769k2550k5728R9082k1794k1597j05397j69060m1799
24840A024895m9623N5855J94198Q4979q3961l4194p7174n7664k06517J06989J1672
24829I69455m6872K30098J09958M1973K5839P3069j50054j07773j34769j80703
24819H30221L0151o1615l3701p2870k8664J07547J26005q4012M5173J6932m9431
24808H25736j29628j4055l3825j24659k9562J9659L8649P2564K5797r8244L760
$$ plain form
24797 556192 534651 503306 371496 155405 102649 85252 -317 -49195 -110096 -121450 -153785
24786 -153785 14864 67696 336091 504447 456826 359884 288017 145849 34594 74513
24776 74513 72988 111736 28414 19121 3841 94854 92340 3564 54612 276887 425031 497620
24764 497620 588155 598201 398617 199872 179192 93451 81136 164303 134264 125433 139325
24753 139325 148152 290815 393931 388152 362730 389088 165696 22213 -105101 38268 46832
24742 46832 4200 -21934 48413 126054 194192 316205 511230 544705 534204 437602 397684
24731 397684 299161 261615 195267 245203 387275 458228 421892 370169 303839 165987 172238
24720 172238 298713 449785 486537 321368 298371 223608 138233 176206 139217 165403 150451
$$ packed form
24797E56192k1541l1345j31810k16091n2756j7397q5569m8878o0901j1354l2335
24786a53785J68649N2832K68395J68356m7621r6942p1867j42168j11255L9919
24776G4513j525L8748q3322r293j5280R1013k514q8776N1048K22275J48144P2589
24764D97620R0535J0046j99584j98745k0680q5741j2315Q3167l0039q831J3892
24753A39325Q827J42663J03116n779k5422K6358k23392j43483j27314J43369Q564
24742D6832m2632k6134P0347P7641O8138J22013J95025L3475j0501r6602l9918
24731C97684r8523l7546o6348M9936J42072P0953l6336n1723o6330j37852O251
24720A72238J26475J51072L6752j65169k2997p4763q5375L7973l6989K6186j4952
$$ plain form
24709 150451 224892 309937 365792 330019 234049 213956 142491 298267 464145 351399 67433
24698 67433 102728 166756 302007 445249 369224 493159 704776 465032 344835 351420 384197
24687 384197 325292 306392 222033 55482 -70732 3705 10380 -48989 -71894 33494 156762
24676 156762 234729 238254 90150 141137 68622 -45912 -17972 19761 62203 93031 92630 11297
24664 11297 19848 -172915 -244444 2792 122266 140401 155045 55544 109955 101743 93301 -29874
24652 -29874 -40194 -75654 -31925 -1793 35615 25154 44703 43583 101988 116490 183486 147267
24640 147267 143192 61408 5199 -33394 -88946 -152652 -78220 127731 95156 18215 -226688
24629 -226688 -396999 -505928 -402275 -274346 -215250 -98970 -135412 -203887 -27153 -17400
$$ packed form
24709A50451P4441Q5045N5855l5773r5970k0093p1465J55776J65878j12746k83966
24698F7433L5295O4028J35251J43242p6025J23935K11617k39744j20197O585L2777
24687C84197n8905j8900q4359j66551j26214P4437O675n9369k2905J05388J23268
24676A56762P7967L525j48104N0987p2515j14534K7940L7733M2442L0828m01q1333
24664A1297Q551j92763p1529K47236J19474J8135J4644r9501N4411q212q442j23175
24652b9874j0320l5460M3729L0132L7408j0461J9549j120N8405J4502O6996l6219
24640A47267m075q1784n6209l8593n5552o3706P4432K05951l2575p6941k44903
24629b26688j70311j08929J03653J27929N9096J16280l6442o8475J76734R753
$$ plain form
24619 -17400 56885 23607 -36344 78369 104458 23017 19200 -59173 -54841 17839 95336 112940
24607 112940 104665 46222 -49748 47291 -21496 -13389 -18345 18225 22059 133673 242276 202145
24595 202145 254218 257568 172523 194256 226430 226926 179756 119606 6441 -72384 137938 67748
24583 67748 -63893 -32504 54255 98036 92744 88396 124750 300301 291819 150024 94144 45740
24571 45740 -43823 -26078 50012 69189 88968 210394 234150 233045 281069 232388 218074 166280
24559 166280 111727 94233 -13772 22201 134283 247712 214057 280513 181377 168418 209819
24548 209819 150030 101141 92190 39851 32571 49464 98678 213447 225432 152724 -23725
24537 -23725 -131244 -37764 -68430 -152086 -74423 -103633 -315435 -263328 -61080 -77020 -196233
$$ packed form
24619a7400P4285l3278n9951J14713K6089q1441l817p8373M332P2680P7497J7604
24607A12940q275n8443r5970R7039o8787Q107m956L6570L834J11614J08603m0131
24595B02145N2073L350q5045K1733L2174M96m7170o0150j13165p8825K10322p0190
24583F7748j31641L1389Q6759M3781n292m348L6354J75551q482j41795n5880m8404
24571D5740q9563J7745P6090J9177J9779J21426K3756j105M8024m8681j4314n1794
24559A66280n4553j7494j08005L5973J12082J13429l3655O6456r9136j2959M1401
24548B09819n9789m8889q951n2339p280J6893M9214J14769J1985p2708j76449
24537b3725j07519R3480l0666q3656P7663k9210k11802N2107K02248j5940j19213
$$ plain form
24526 -196233 -200591 -281714 -280563 -177656 -65806 -152904 -214015 -187323 -179407 -203882 -233445 -201686
24514 -201686 -149557 -201485 -183867 -153143 -124975 -40523 28175 75491 77993 -102133 -114081
24503 -114081 58799 66615 -4771 99541 11566 -121614 -177902 -195004 -265132 -211243 -358464
24492 -358464 -535289 -439633 -256276 -175335 -225234 -276987 -220978 -185296 -16621 140310 191199
24481 191199 313644 221761 62972 3361 -146422 -181859 -17679 26465 4977 23589 34061
24470 34061 69737 97918 186532 86817 -29325 46814 217797 218761 30997 -76634 -13520
24459 -13520 -81774 -81786 25497 52026 128363 70268 -95074 -45750 -63551 -115442 -155964 -77070
24447 -77070 9539 58394 109766 46218 2050 8387 104681 97725 62165 10522 36869 146811
$$ packed form
24526a96233m358q1123J151J02907J11850q7098o1111K6692P916k4475k9563L1759
24514b01686N2129n1928J7618L0724K8168Q4452O8698M7316K502j80126j1948
24503a14081J72880P816p1386J04312q7975j33180n6288j7102p0128N3889j47221
24492c58464j76825R5656J83357Q0941m9899n1753N6009L5682J68675J56931N0889
24481A91199J22445r1883j58789n9611j49783l5437J64180M4144k1488J8612J0472
24470C4061L5676K8181Q8614r9715j16142P6139J70983R64j87764j07631O3114
24459a3520o8254j2J07283K6529P6337n8095j65342M9324j7801n1891m0522P8894
24447g7070Q6609M8855N1372o3548m4168O337R6294o956l5560n1643K6347J09942
$$ plain form
24435 146811 236816 235176 169980 199368 61896 -4482 166245 147774 140986 134786 256222
24424 256222 207871 168887 221377 235736 125381 99863 122420 -3894 113971 171510 303728
24413 303728 146955 134933 192641 111224 74359 90164 85680 44360 57923 127777 75477
24402 75477 -44539 -22453 -6557 76755 -116 -69044 -6675 -22720 -51410 -105859 -175296
24391 -175296 -46030 36425 53394 -3505 -126930 -199966 -60264 -24714 -32524 46803 -69388
24380 -69388 -92666 -86979 -20978 25900 61941 48467 -54763 -54365 -1585 -206259 -222400 -137319
24368 -137319 -89048 -16413 2493 65808 111275 110015 131194 -33279 -57207 -16051 41667
24357 41667 153159 37668 -69355 -99846 -118318 -84129 70828 114748 91611 20212 221161
$$ packed form
24435A46811R0005j640o5196K9388j37472o6378J70727j8471o788o200J21436
24424B56222m8351l8984N2490J4359j10355k5518K2557j26314J17865N7539J32218
24413C03728j56773j2022N7708q1417l6865J5805m484m1320J3563O9854n2300
24402G5477j20016K2086J5896Q3312p6871o8928O2369j6045k8690n4449o9437
24391a75296J29266Q2455J6969n6899j23425p3036J39702L5550p810P9327j16191
24380f9388k3278N687O6001M6878L6041j3474j03230L98N2780k04674j6141Q5081
24368a37319M8271P2635J8906O3315M5467j260K1179j64473k3928M1156N7718
24357D1667J11492j15491j07023l0491j8472L4189J54957M3920k3137p1399K00949
$$ plain form
24346 221161 214711 78173 -62492 26912 -30277 -18082 9925 76774 42527 -9426 58295
24335 58295 174081 82988 68535 17439 59378 -52434 -148374 -164466 -93823 44308 64951
24324 64951 92403 96447 120991 40021 84131 109572 193998 246866 324524 222185 170597 292390
24312 292390 180837 140767 38146 -3721 45676 141137 94836 67056 66759 22834 -425
24301 -425 35975 56423 22286 11425 -100837 -35387 -28679 -70867 -163360 -152472 -230246 -199170
24289 -199170 -89388 -54818 -22293 37688 -25876 -130289 -166837 -127299 -13583 38617 174081
24278 174081 101575 -66476 -184008 -153772 -38338 -91729 -124246 -261074 -200325 -101627 -119198
24267 -119198 -75794 34912 154770 209033 163357 190636 46557 33316 86639 -142642 -85676
$$ packed form
24346B21161o450j36538j40665Q9404n7189J2195K8007O6849l4247n1953O7721
24335E8295J15786r1093j4453n1096M1939j11812r5940j6092P0643J38131K0643
24324F4951K7452M044K4544q0970M4110K5441Q4426N2868P7658j02339n1588J21793
24312B92390j11553m0070j02621m1867M9397R5461m6301k7780k97m3925k3259
24301d25L6400K0448l4137j0861j12262O5450O708m2188r2493J0888p7774L1076
24289a99170J09782L4570L2525N9981o3564j04413l6548L9538J13716N2200J35464
24278A74081p2506j68051j17532L0236J15434n3391l2517j36828O0749R8698j7571
24267a19198M3404J10706J19858N4263m5676K7279j44079j3241N3323k29281N6966
$$ plain form
24256 -85676 17712 -28870 -36980 -39604 -24526 99258 130595 158025 178482 132067 124480 74118
24244 74118 -72086 -65028 -115561 -135803 -37244 -81470 -72117 -54917 -32326 -57014 93178 212534
24232 212534 215964 283824 142153 30979 -55861 -168386 -231405 -155772 -202548 -276012 -240814
24221 -240814 -226495 -126604 -58233 -105620 -21572 24323 96812 123531 130113 120443 60644 5596
24209 5596 -196381 -199405 -240441 -141138 -58705 -125486 -20566 30156 23270 36111 -20176 -112766
24197 -112766 -163727 -177866 -186118 -38292 65266 -1942 -61995 36977 31690 28117 162013
24186 162013 117699 54400 199200 230119 190878 95639 42469 -1970 81260 23027 145440
24175 145440 270554 172716 56285 49956 157005 231832 302606 327068 221793 141873 -274
$$ packed form
24256h5676J03388m6582q110k624J5078J23784L1337K7430K0457m6415p587n0362
24244G4118j46204P058n0533k0242R8559m4226R353J7200K2591k4688J50192J19356
24232B12534L430O7860j41671j11174q6840j12525o3019P5633m6776p3464L5198
24221b40814J4319R9891O8371m7387Q4048M5895P2489K6719O582r670n9799n5048
24209E596k01977l024m1036R9303Q2433o6781J04920N0722o886J2841n6287r2590
24197a12766n0961j4139q252J47826J03558o7208o0053R8972n287l573J33896
24186A62013m4314o3299J44800L0919l9241r5239n3170m4439Q3230n8233J22413
24175A45440J25114r7838j16431o329J07049P4827P0774K4462j05275p9920j42147
$$ plain form
24164 -274 -65476 -21581 -42018 10417 -53841 -54110 115109 202923 240248 260097 138411 198592
24152 198592 312380 278874 33157 -175705 -197909 -179936 -31352 46543 36929 27285 -10701
24141 -10701 -41396 -231927 -227412 -88704 -48865 -86078 69 108448 199203 83627 -83772
24130 -83772 -46548 70448 122278 81220 75479 239023 208398 69525 82491 53426 61597
24119 61597 72484 30536 46529 68895 75689 107441 12933 112099 139762 12330 63498 36764
24107 36764 24654 -92226 -214689 -91855 -23478 109823 238328 307058 242148 36383
24097 36383 -102228 -23294 -51706 -92764 -149512 -158259 -114621 27508 179450 240229 284989
24086 284989 228285 172484 127963 135700 87395 40971 -30115 70141 188838 -38 -52980
$$ packed form
24164b74o5202M3895k0437N2435o4258k69J69219Q7814L7325J9849j21686O0181
24152A98592J13788l3506k45717k08862k2204J7973J48584P7895r614r644l7986
24141a0701l0695j90531M515J38708L9839l7213Q6147J08379R0755j15576j67399
24130h3772L7224J16996N1830m1058n741J63544l0625j38873J2966k9065Q171
24119F1597J0887m1948J5993K2366O794L1752r4508R9166K7663j27432N1168k6734
24107C6764j2110j16880j22463J22834O8377J33301J28505O8730o4910k05765
24097C6383j38611P8934k8412m1058n6748q747M3638J42129J51942O0779M4760
24086B84989n6704n5801m4521P737m8305m6424p1086J00256J18697j88876n2942
$$ plain form
24075 -52980 22314 141013 60284 105667 152582 46176 -18301 41319 60931 134898 194246
24064 194246 127126 122129 139108 280806 218406 153673 -41675 60251 105778 105369 37132
24053 37132 107647 44121 -118925 -33804 10035 -9872 -56892 -231396 -212904 -105116 -81225
24042 -81225 -236531 -219013 -8282 76991 -64391 -73438 -85150 -45911 44754 -63082 -167727
24031 -167727 -4220 -1242 -67536 -68208 -24091 8169 -13438 -31489 -131470 -26551 85004
24020 85004 106475 -10372 -50234 18399 -49953 7287 160628 203485 196941 174428 84941
24009 84941 44685 12924 18199 -4144 57448 185387 229370 86455 80006 29005 -7177 -4389
23997 -4389 64551 -17498 -39517 2652 -17725 -174106 -192512 -165327 -199359 -196878 -88663 -106907
$$ packed form
24075e2980P5294J18699q0729M5383M6915j06406o4477N9620J9612P3967N9348
24064A94246o7120m997J6979J41698o2400o4733j95348J01926M5527m09o8237
24053C7132P0515o3526j63046Q5121M3839j9907m7020j74504J8492J07788K3891
24042h1225j55306J7518K10731Q5273j41382r047j1712L9239R0665j07836j04645
24031a67727J63507K978o6294o72M4117L2260k1607j8051r9981J04919J11555
24020H5004K1471j16847l9862O8633o8352N7240J53341M2857o544k2513q9487
24009H4941m0256l1761N275k2343O1592J27939M3983j42915o449n1001l6182K788
23997d389O8940q2049k2019M2169k0377j56381j8406K7185l4032K481J08215j8244
$$ plain form
23985 -106907 -48966 -12475 -59238 -122803 -61610 -123425 -125658 -204209 -257294 -160832 -92783 -140911
23973 -140911 -156376 -54546 -2483 -131967 -153650 -103293 -136024 -168675 -105881 -51670 -70252
23962 -70252 -76917 -29400 -15820 45294 34822 6509 84655 82690 115570 112576 150376 225000
23950 225000 200513 95082 -30282 -173883 -52093 50490 38647 45173 -120067 -151103
23940 -151103 -22585 13852 12830 146477 160263 196578 140442 91622 104081 145965 138496
23929 138496 102939 228675 262235 188217 230999 392505 328992 208514 163549 88250 23854
23918 23854 -13894 -26007 25517 -26771 -58689 -812 -24249 27065 114670 1122 17660
23907 17660 36722 18781 -87834 -41461 89861 94512 26409 -25466 104753 147333 36365
$$ packed form
23985a06907N7941L6491m6763o3565O1193o1815k233p8551n3085R6462O8049m8128
23973a40911j5465J01830N2063j29484k1683N0357l2731l2651O2794N4211j8582
23962g0252o665M7517J3580O1114j0472k8313P8146j965L2880k994L7800P4624
23950B25000k4487j05431j25364j43601J21790J02583j1843O526j65240l1036
23940a51103J28518L6437j022J33647J3786L6315n6136m8820J2459M1884p469
23929A38496l5557J25736L3560p4018M2782J61506o3513j20478m4965p5299o4396
23918B3854l7748j2113N1524n2288l1918N7877k3437N1314Q7605j13548J6538
23907A7660J9062j7941j06615M6373J31322M651o8103n1875J30219M2580j10968
$$ plain form
23896 36365 -55673 -120912 -127575 -69496 161159 154373 36931 -49240 -21021 93406 100726 65556
23884 65556 -49997 -229068 -254642 -221971 -155577 -107207 -179127 -116078 -121067 -145209 -105634
23873 -105634 -722 109140 267390 201965 212855 258480 115626 -61625 -66202 -14470 4108
23862 4108 73336 154165 38768 -55827 -75815 -15394 -137263 -155731 -36061 5996 1311
23851 1311 106102 256728 287380 252346 240314 241266 274564 287251 197820 98623 176188 173529
23839 173529 90952 904 -134084 -196616 -169065 -41846 69241 68810 20380 19424 24237 -53518
23827 -53518 -147564 -151635 -141520 25163 34133 35862 106983 116626 -24922 -97147 -91330 -135432
23815 -135432 -238536 -245965 -88927 -13443 182030 277421 297846 276676 219668 208635 238920
$$ packed form
23896C6365r2038o5239o663N8079K30655o786j17442q6171K8219J14427P320l5170
23884F5556j15553j79071k5574L2671O6394M8370p1920O3049m989k4142L9575
23873a05634J04912J09862J58250o5425J0890M5625j42854j77251m577N1732J8578
23862D108O9228Q0829j15397r4595j9988O0421j21869j8468J19670M2057m685
23851A311J04791J50626L0652l5034j2032R52L3298J2687q9431r9197P7565k659
23839A73529q2577r0048j34988o2532K7551J27219J11087m31m8430r56M813p7755
23827e3518r4046m071J0115J66683Q970J729P1121R643j41548p2225N817m4102
23815a35432j03104p429J57038P5484J95473R5391K0425k1170n7008j1033L0285
$$ plain form
23804 238920 149917 96034 44226 44010 102386 169520 -36152 -57382 -43843 -92256 -335191
23793 -335191 -95306 -65643 -145786 -205036 -46307 123225 169326 22903 -21138 -125828
23783 -125828 -70933 64626 165051 181932 228341 262162 200544 188331 87408 58670 30326
23772 30326 -13279 -48409 -92040 -57869 33856 -108576 -218207 -139793 -18583 50001 70968
23761 70968 108207 140402 85157 133496 137693 -98986 -119792 35067 38376 111130 36352 59438
23749 59438 235925 173329 -57215 -110673 26429 80606 77063 -44949 5039 42637 128345
23738 128345 141111 58366 -9676 -1396 -91392 -114745 149334 319936 340863 199962 92932
23727 92932 78327 70576 46932 88325 -2138 133299 31119 -53049 -130132 -206267 -26200
$$ packed form
23804B38920q9003n3883n1808k16N8376O7134k05672k1230J3539m8413k42935
23793c35191K39885K9663q0143n9250J58729J69532M6101j46423m4041j04690
23783a25828N4895J35559J00425J6881M6409L3821o1618j2213j00923k8738k8344
23772C0326m3605l5130m3631L4171R1725j42432j09631P8414J21210O8584K0967
23761G0968L7239L2195n5245M8339M197k36679k0806J54859L309P2754p4778K3086
23749E9438J76487o2596k30544n3458J37102N4177l543j22012M9988L7598Q5708
23738A28345J2766q2745o8042Q280q9996k3353K64079J70602K0927j40901j07030
23727I2932j4605p751k3644M1393r0463J35437j02180q4168p7083p6135J80067
$$ plain form
23716 -26200 127987 151820 106215 227524 269614 170207 226488 216774 4698 -78100 -115820
23705 -115820 -8164 123539 54701 -3419 64548 33009 66458 9597 -102994 -47035 22547
23694 22547 16212 -70231 -76328 12244 -8659 -48114 61799 106597 100788 176935 246954 278130
23682 278130 238499 71567 -48822 -61260 -35209 51517 207600 83895 163448 138486 10356
23671 10356 -102861 -106709 -2984 -4941 33727 57692 78456 185733 178169 188199 110953 84661
23659 84661 94648 52435 183275 389637 392543 233423 145180 131324 114299 25010 -20224
23648 -20224 38997 117266 115619 -46143 -188542 -180241 3250 39654 34307 -171184 -59515
23637 -59515 -81936 -94803 -2114 40852 134950 13972 -11221 -56403 -90456 -119596 -176334
$$ packed form
23716b6200J54187K3833m5605J21309M2090r9407N6281r714k12076q2798l7720
23705a15820J07656J31703o8838n8120O7967l1539L3449n6861j12591N5959O9582
23694B2547o335q6443o097Q8572k0903l9455J09913M4798n809P6147P0019L1176
23682B78130l9631j66932j20389j2438K6051Q6726J56083j23705P9553k4962j28130
23671A0356j13217l848J03725j957L8668K3965K0764J07277p564J0030p7246k6292
23659H4661R987m2213J30840K06362K906j59120q8243j3856j7025q9289m5234
23648b0224N9221P8269j647j61762j42399Q301J83491L6404n347k05491J11669
23637e9515k2421j2867R2689M2966R4098j20978k5193m5182l4053k9140n6738
$$ plain form
23626 -176334 -228746 -137390 -135025 -147141 -146763 -82632 6043 -51932 -136828 -133740 -5034 -39015
23614 -39015 -1155 -69864 -148691 -93217 -51789 -43530 46350 97583 104156 25540 -25508 -23459
23602 -23459 -20012 -60674 -111754 -162452 -140054 -184710 -159920 -118115 -102112 -62195 -36325 -47884
23590 -47884 -198170 -234418 -256328 -65761 -74158 -145024 -157701 -18301 23660 71756 39238
23579 39238 113190 176564 128293 105890 90990 -52717 -144105 -57717 -41913 -18915 -25401 32467
23567 32467 50115 -13066 37461 -121476 -246950 -160941 -611 -75959 -152134 -202653 -322121
23556 -322121 -155982 -12118 -159389 -378165 -362636 -230718 -147087 -88325 39413 -34898
23546 -34898 -22887 -70537 -59222 -143385 -174667 -234683 -156537 -119329 -31219 37673 -45176 -91834
$$ packed form
23626a76334n2412R1356K365j2116L78O4131Q8675n7975q4896L088J28706l3981
23614c9015L7860o8709p8827N5474M1428Q259Q9880N1233O573p8616n1048K049
23602b3459L447m0662n1080n0698K2398m4656K4790M1805J6003L9917K5870j1559
23590d7884j50286l6248k1910J90567q397p0866j2677J39400M1961M8096l2518
23579C9238P3952O3374m8271k2403j4900j43707r1388Q6388J5804K2998o486N7868
23567C2467J7648o3181N0527j58937j25474Q6009J60330p5348p6175n0519j19468
23556c22121J66139J43864j47271k18776J5529J31918Q3631N8762J27738p4311
23546c4898J2011m7650J1315q4163l1282o0016P8146L7208Q8110O8892q2849m6658
$$ plain form
23534 -91834 -116284 -200119 -84172 -37582 -14546 -29162 22816 175213 190939 193211 139088
23523 139088 125189 196494 159012 155522 165276 143564 168569 55517 -106600 -38899 45025
23512 45025 -120292 -144745 -18049 38632 -144534 -103183 27126 -107825 -214104 -100820
23502 -100820 34438 166109 256396 167266 126647 -22110 -146012 -161592 -191725 -61481
23492 -61481 -28389 28533 85493 222071 99940 -44242 -114187 -9011 26407 79060 6133
23481 6133 -147998 -160310 -152788 -69749 33090 7452 -6908 9265 -101093 -89232 -5205
23470 -5205 -37051 24998 44195 11994 -70878 -42951 -39787 -97034 -59718 -26226 -46208 -143781
23458 -143781 -288362 -372874 -325582 -217096 -100379 -40392 -35425 93583 94040 173883 253520
$$ packed form
23534i1834k4450q3835J15947M6590K3036j4616N1978J52397J5726K272n4123
23523A39088j3899P1305l7482l490R754k1712K5005j13052j62117O7701Q3924
23512D5025j65317k4453J26696N6681j83166M1351J30309j34951j06279J13284
23502a00820J35258J31671R0287q9130m0619j48757j23902j5580l0133J30244
23492f1481L3092N6922N6960J36578j22131j44182o9945J05176L5418N2653p2927
23481F133j54131j2312P522Q3039J02839k5638j4360J6173j10358J1861Q4027
23470e205l1846O2049J9197l2201q2872K7927L164n7247L7316L3492j9982r7573
23458a43781j44581q4512M7292J08486J16717N9987M967J29008M57P9843P9637
$$ plain form
23447 253520 155549 181028 226019 43030 3032 57125 75308 219696 160630 -74335 -177424
23436 -177424 -196881 -163215 -39251 -14070 -96777 821 27624 49882 11424 58980 -11850
23425 -11850 -30753 -54421 3286 52954 55193 5570 15507 44452 -27288 -87343 -188689 -129524
23413 -129524 -20546 -95277 -244230 3314 75090 -65847 -50066 -18603 -54587 54530
23403 54530 142588 44099 -21001 -58032 -156407 -18363 -1374 -91351 -77201 -35456 47863
23392 47863 15643 88618 -2700 -38987 -21981 -65295 -34050 19832 162572 168824 93794 10719
23380 10719 -65971 -52722 -92008 -8604 18211 2385 -46837 -13549 76043 79712 113785 -35241
23368 -35241 -37812 142245 136230 26508 -42224 -83861 121399 176070 165536 126250 23362
$$ packed form
23447B53520r7971K5479M4991j82989l9998N4093J8183J44388n9066k34965j03089
23436a77424j9457L3666J23964K5181q2707R7598K6803K2258l8458M7556p0830
23425a1850j8903k3668N7707M9668K239m9623R937K8945p1740o0055j01346N9165
23413a29524J08978p4731j48953K47544P1776j40937J5781L1463l5984J09117
23403E4530Q8058r8489o5100l7031r8375J38044J6989q9977J4150M1745Q3319
23392D7863l2220P2975r1318l6287J7006m3314L1245N3882J42740O252p5030q3075
23380A0719p6690J3249l9286Q3404K6815j5826m9222L3288Q9592L669L4073j49026
23368c5241k571J80057o015j09722o8732m1637K05260N4671j0534l9286j02888
$$ plain form
23357 23362 -56002 -106524 6335 62394 -17250 -68167 -100831 -143587 -185524 -237602 -138536
23346 -138536 -341926 -333516 -284496 -263375 -304232 -74374 11478 -57942 -5341 126269 193972
23335 193972 160346 168376 111724 58015 51430 64900 72757 64806 -29560 -156061 -120133 90897
23323 90897 79692 26675 -107102 -186069 -161405 -138932 -85517 -11263 -47083 -16194 104810
23312 104810 171369 212445 199953 264914 271780 122866 190847 264951 256038 150732 -26668
23301 -26668 -96738 -124851 -224719 -141968 -15626 -4695 -83439 -68353 -90006 -5748 -55884
23290 -55884 -112091 59320 315574 248057 123383 65606 117843 160915 138390 71012 58670
23279 58670 80876 108963 5732 -61537 85915 13963 -78177 -106635 -184686 -202475 -129307
$$ packed form
23357B3362p9364n0522J12859N6059p9644n0917l2664m2756m1937n2078R9066
23346a38536k03390Q410M9020K1121m0857K29858Q5852o9420N2601J31610O7703
23335A93972l3626Q030n6652n3709o585J3470P857p951r4366j26501L5928K11030
23323I0897j1205n3017j33777p8967K4664K2473N3415P4254l5820L0889J21004
23312A04810O6559M1076j2492O4961O866j48914O7981P4104q913j05306j77400
23301b6668p0070k8113r9868Q2751J26342J0931p8744J5086k1653Q4258n0136
23290e5884n6207J71411K56254o7517j24674n7777N2237M3072k2525o7378j2342
23279E8670K2206K8087j03231o7269J47452p1952r2140k8458p8051j7789P3168
$$ plain form
23268 -129307 -111227 -161413 -237923 -263355 -185046 -164936 -91510 -75052 66383 32280 -33125
23257 -33125 -130911 -235579 -197272 -169162 -142669 -36063 21772 -110260 -98486 55615 1573
23246 1573 -107235 -174921 -208916 -20737 188695 247640 80125 15257 -45998 -41720 27043
23235 27043 -57585 -109639 -93698 -43710 -92860 -145435 -153191 -53120 -29322 -84174 -112830 -154499
23223 -154499 -93203 -74976 -53304 8431 87842 -11079 -105421 -80248 -139201 -133452 -34324 66995
23211 66995 54758 -126257 -124365 -96221 -153959 65506 122607 -22784 -69794 -59187 34240
23200 34240 113549 5615 -126146 -75513 -61959 -93216 -96167 -51417 -80734 -131252 -54946
23189 -54946 68269 179691 337581 193082 135350 -4884 -126834 -74833 -58168 67268
$$ packed form
23268a29307J8080n0186p6510k5432P8309K0110P3426J6458J41435l4103o5405
23257c3125r7786j04668L8307K8110K6493J06606N7835j32032J1774J54101n4042
23246A573j08808o7686l3995J88179K09432N8945j67515o4868o1255M278O8763
23235B7043q4628n2054J5941M9988m9150n2575p756J00071K3798n4852k8656m1669
23223a54499O1296J8227K1672O1735P9411r8921r4342K5173n8953N749R9128J01319
23211F6995j2237j81015J892K8144n7738K19465N7101j45391m7010J0607R3427
23200C4240P9309j07934j31761N0633J3554l1257k951M4750k9317n0518P6306
23189e4946J23215J11422J57890j44499n7732j40234j21950N2001J6665J25436
$$ plain form
23179 67268 205701 216354 251362 144587 8977 58286 152858 -7299 -74201 -98615 -172216
23168 -172216 -80281 -132213 -163245 -184805 -84278 -115860 -77293 -35822 -25657 -121328 -196279
23157 -196279 -193553 -47198 -45727 -16011 -5657 35104 154328 119928 2790 78921 178882
23146 178882 230993 175473 -28808 -104525 -73813 -154076 -81134 1768 29533 114447 100592
23135 100592 -60845 -153897 -134793 -84061 -68538 4481 40034 64765 19810 -170248 -156534
23124 -156534 -120680 -102106 82493 148044 34061 17888 -18843 -21891 -37446 9311 92477
23113 92477 60341 -14712 -3397 99869 124123 92129 138788 101465 -130849 -260633 -202683
23102 -202683 38311 -94243 -71030 -200646 -207942 -139021 -103463 -71043 -100125 -130079 -52964
$$ packed form
23179F7268J38433J0653L5008j06775j35610M9309R4572j60157o6902k4414p3601
23168a72216R1935n1932l1032k1560J00527l1582L8567M1471J0165r5671p4951
23157a96279K726J46355J471K9716J0354M0761J19224l4400j17138P6131R9961
23146A78882N2111n5520k04281p5717L0712q0263P2942Q2902K7765Q4914j3855
23135A00592j61437r3052J9104N0732J5523P3019L5553K4731m4955j90058J3714
23124a56534L5854J8574J84599O5551j13983j6173l6731l048j5555M6757Q3166
23113I2477l2136p5053J1315J03266K4254l1994M6659l7323k32314j29784N7950
23102b02683K40994j32554K3213j29616p296O8921L5558L2420k9082k9954P7115
$$ plain form
23091 -52964 -31049 4360 10168 47147 50763 -4009 57043 5776 -45450 94633 107784 18634
23079 18634 -60643 -85193 -100165 53330 112388 90131 -12387 5134 88742 48114 7501
23068 7501 9974 -67155 -237412 -197833 -64694 -62841 -48815 -96468 -87043 -233594 -189135 -676
23056 -676 78062 -72642 -27739 146546 194273 83100 32149 28720 130984 147225 111121
23045 111121 66816 -113686 -272825 -371633 -271449 -177039 -138518 -124401 -273364 -248194 -201289
23034 -201289 -140816 -87204 19712 2370 12125 157114 94469 12461 36840 121611 111999
23023 111999 -67431 -136791 -57594 -82248 -219858 -169728 22589 120608 -36015 -60554 -195761
23012 -195761 -117117 92129 -21235 -5722 -168583 -211560 -183183 -184528 -120294 55604 -78338
$$ packed form
23091e2964K1915L5409N808L6979L616n4772O1052n1267n1226J40083J3151q9150
23079A8634p9277k4550j4972J53495N9058k2257j02518J7521Q3608m0628m0613
23068G501K473p7129j70257L9579J33139J853J4026m7653R425j46551M4459J88459
23056f76P8738j50704M4903J74285M7727j11173n0951l429J02264J6241l6104
23045A11121m4305j80502j59139r8808J00184R4410L8521J4117j48963K5170M6905
23034b01289O0473N3612J06916j7342R755J44989o2645q2008K4379Q4771r612
23023A11999j79430o9360P9197k4654j37610N0130J92317R8019j56623k4539j35207
23012a95761P8644K09246j13364J5513j62861m2977K8377j345O4234J75898j33942
$$ plain form
23001 -78338 -219147 -193441 -155360 -254917 -172927 -119833 23830 201521 141286 117329 132535
22990 132535 138092 194567 -24450 -251872 -275815 -303439 -452712 -483443 -174037 -75758 -7203
22979 -7203 -83632 -155899 -225773 -179304 -76090 -50517 -190517 -214367 -126320 -177000 -120532
22968 -120532 -104654 -190740 -211829 -19932 157478 105161 41762 149786 153446 57951 105949
22957 105949 125566 209342 254580 134516 55681 -16208 -80210 -190881 63662 173248 -49445
22946 -49445 -172914 -174709 -60726 -163322 -134924 -119569 -87595 -68460 -91183 -193522 64146
22935 64146 174704 220022 186735 102969 61311 18374 -22024 -29689 -8953 -109353 -278624
22924 -278624 -314536 -216765 -148979 -164346 -136254 -72028 50086 75909 68198 -56125 -49747
$$ packed form
23001g8338j40809K5706L8081r9557Q1990N3094J43663J77691o0235k3957J5206
22990A32535N557N6475k19017k27422k3943k7624j49273l0731L09406R8279O8555
22979g203p6429p2267o9874M6469J03214K5573j40000k3850Q8047n0680N6468
22968a20532J5878q6086k1089J91897J77410n2317o3399J08024L660r5495M7998
22957A05949J9617Q3776M5238j20064p8835p1889o4002j10671K54543J09586k22693
22946d9445j23469j795J13983j02596K8398J5355L1974J9135k2723j02339K57668
22935F4146J10558M5318l3287q3766m1658m2937m0398p665K0736j00400j69271
22924b78624l5912R7771O7786j5367K8092O4226J22114K5823p711j24323O378
$$ plain form
22913 -49747 -56404 -141325 -77707 153661 121038 -38436 -10778 7829 117141 314404 318520
22902 318520 195989 82221 -8319 42870 68300 -18608 -144690 -212419 -148630 -150628 163
22891 163 -20996 -165255 -216155 -186292 -129184 -44758 -26623 -74954 23099 110908 8042 -65686
22879 -65686 785 1181 -35053 -66981 -48598 12147 59689 87181 84175 -17240 -10434 48943
22867 48943 94137 54618 9390 -30054 -35443 30096 183869 180392 28036 -104837 -77108
22856 -77108 -165054 -161679 -269208 -329028 -301354 -163397 -23582 28535 58924 66918 -36158
22845 -36158 17040 245679 445095 343782 115682 38398 161098 35256 -126949 -145049
22835 -145049 -186050 35934 36496 16559 -35460 -173975 -223226 -88185 98194 184202 13678
$$ packed form
22913d9747o657q4921O3618K31368l2623j59474K7658J8607J09312J97263M116
22902C18520j22531j13768r0540N1189K5430q6908j26082o7729O3789j998J50791
22891A63k1159j44259n0900K9863N7108Q4426J8135m8331R8053Q7809j02866p3728
22879f5686O6471L96l6234l1928J8383O0745M7542K7492l006j01415O806N9377
22867D8943M5194l9519m5228l9444n389O5539J53773l477j52356j32873K7729
22856g7108q7946L375j07529n9820K7674J37957J39815N2117L0389P994j03076
22845c6158N3198K28639J99416j01313k28100p7284J22700j25842j62205j8100
22835a45049m1001K21984N62j9937n2019j38515m9251J35041J86379Q6008j70524
$$ plain form
22824 13678 -123778 -185778 -15440 8458 -122204 -132313 61772 273 1716 -70148 -8357
22813 -8357 105620 92115 125336 216979 153655 -15036 -68846 176477 220036 44055 66215
22802 66215 126015 113701 118812 15819 119549 243433 201195 -70292 -115183 -30256 25016
22791 25016 -868 -123329 -131777 -25209 38897 -76559 -69262 30530 8032 62320 152936
22780 152936 110223 66919 -6959 -33403 -93561 -58652 30309 -5855 -2230 46306 80561 179134
22768 179134 385424 457392 373205 351371 157594 60430 39844 46154 79319 101658 52254
22757 52254 -50115 -36238 -10464 74081 132037 -12313 11290 40752 -45720 -12595 -92181
22746 -92181 -14185 13341 -64767 -188121 -144569 -39022 -71940 -26237 -155260 -202809 -187940
$$ packed form
22824A3678j37456o2000J70338K3898j30662j0109J94085o1499J443p1864O1791
22813h357J13977j3505L3221R1643o3324j68691n3810K45323M3559j75981K2160
22802F6215N9800j2314N111j02993J03730J23884m2238k71487m4891Q4927N5272
22791B5016k5884j22461q448J06568O4106j15456P297R9792k2498N4288R0616
22780A52936m2713m3304p3878k6444o0158L4909Q8961l6164L625M8536L4255R8573
22768A79134K06290P1968q4187k1834j93777r7164k0586O310L3165K2339m9404
22757E2254j02369J3877K5774Q4545N7956j44350K3603K9462q6472L3125p9586
22746i2181P7996K7526p8108j23354M3552J05547l2918M5703j29023m7549J4869
$$ plain form
22735 -187940 -213602 -220116 -157770 -218234 -178444 -217433 -193255 -62207 85960 113519 289190
22724 289190 253687 188890 220052 104494 4342 43932 135334 -5165 11471 13379 -26093
22713 -26093 -64897 -55719 15856 86596 7649 77302 -41826 -118723 -143062 -151262 -182387 -147910
22701 -147910 -70399 60587 105091 9800 -44321 15684 -100471 -154884 -97341 33807 19824
22690 19824 82187 166054 36143 -157830 -111714 -23728 49864 115664 -5914 -80686 -114617
22679 -114617 -116348 -138169 -129605 -70455 15537 42993 -16907 -103072 -152315 -173585 -147601 -56779
22667 -56779 -122298 -131284 -29838 -4490 2101 -11433 103528 249559 235729 121823 173306
22656 173306 232193 230408 105136 21522 88088 69956 8474 50932 98380 62360 -34037
$$ packed form
22735a87940k5662o514O2346o0464L9790l8989K4178J31048J48167K7559J75671
22724B89190l5503o4797L1162j15558j00152L9590R1402j40499J6636J908l9472
22713b6093l8804R178P1575P0740p8947O9653j19128p6897k4339q200l1125L4477
22701a47910P7511J30986M4504r5291n4121O0005j16155n4413N7543J31148j3983
22690A9824O2363Q3867j29911j93973M6116Q7986P3592O5800j21578p4772l3931
22679a14617j731k1821Q564N9150Q5992K7456n9900q6165m9243k1270K5984R0822
22667e6779o5519q986J01446K5348O591j3534J14961J46031j3830j13906N1483
22656A73306N8887j785j25272q3614O6566j8132o1482M2458M7448l6020r6397
$$ plain form
22645 -34037 -119036 -75352 -30450 -31093 -28840 -71883 -158277 -185220 -234771 -188512 -156123 -132105
22633 -132105 -111726 -56443 -177709 -132416 -85734 -4745 54122 -27044 -5540 134515 131943
22622 131943 158799 121646 32911 56608 42790 -54543 -143650 -70177 52808 14145 -55400
22611 -55400 -47188 -33986 -102638 -171683 -212058 32018 102932 -40024 -187735 -141552 69110
22600 69110 119481 147852 141624 84004 41044 16175 -21940 -101693 -77839 -14097 27964 5375
22588 5375 117243 86874 42899 -5382 -59702 -65392 -6789 -57013 -166941 -302727 -356113
22577 -356113 -85692 16234 38205 125927 255363 170964 242250 191732 38408 36889 67098
22566 67098 51818 56386 -71166 -90731 -88142 -119180 -105210 -96278 -165949 -227353 -141079 -31634
$$ packed form
22645c4037q4999M3684M4902o43K253m3043q6394k6943m9551M6259L2389K4018
22633a32105K0379N5283j21266M5293M6682Q0989N8867q1166K1504J40055k572
22622A31943K6856l7153q8735K3697j3818r7333q9107P3473J22985l8663o9545
22611e5400Q212J3202o8652o9045m0375K44076P0914j42956j47711M6183K10662
22600F9110N0371K8371o228n7620m2960k4869l8115p9753K3854O3742M2061k2589
22588E375J11868l0369m3975m8281n4320n690N8603n0224j09928j35786n3386
22577c56113K70421J01926K1971Q7722J29436q4399P1286n0518j53324j519L0209
22566F7098j5280M568j27552j9565K589l1038J3970Q932o9671o1404Q6274J09445
$$ plain form
22554 -31634 -70512 -221768 -410813 -309452 -210112 -24608 48798 73923 -39676 -39221 -80411
22543 -80411 -142775 -119560 -77622 -116759 49119 49399 49587 -99347 -239627 -200938 -166535 -110934
22531 -110934 26675 66494 -57475 -154041 -101218 94271 15471 -62456 -8538 -51054 -161293
22520 -161293 -121407 -61590 -10685 -71446 -59283 46163 -7689 -20430 -12683 -152452 -165595
22509 -165595 -13772 -76963 -3339 142667 49633 -209326 -209067 -272526 -254040 -100447 -51992
22498 -51992 -20400 109006 233575 112264 -93080 -188236 -329926 -388073 -333538 -332631 -368483
22487 -368483 -282687 -279225 -365919 -303049 -188097 -115849 -81055 -17618 -90845 -157371 -189150
22476 -189150 -184313 -104974 -96299 -204786 -51697 60749 111956 167361 220707 177950 140966
$$ packed form
22554c1634l8878j51256j89045J01361R9340J85504P3406K5125j13599M55m1190
22543h0411o2364K3215M1938l9137J65878K80J88j48934j40280L8689L4403N5601
22531a10934J37609L9819j23969r6566N2823J95489p8800p7927N3918m2516j10239
22520a61293L9886N9817N0905o0761J2163J05446n3852j2741P747j39769j3143
22509a65595J51823o3191P3624J46006r3034k58959K59o3459J8486J53593M8455
22498e1992L1592J29406J24569j21311k05344r5156j41690n8147N4535R07l5852
22487c68483Q5796L462q6694O2870J14952P2248L4794O3437p3227o6526l1779
22476a89150M837P9339Q675j08487J53089J12446N1207N5405N3346m2757l6984
$$ plain form
22465 140966 240156 230150 142987 80557 -2854 -16270 -101200 -228362 -287008 -178519 -51515
22454 -51515 -19781 1152 -101112 -160064 -176261 -79773 149054 223535 75174 4809 91153
22443 91153 103449 75366 72014 36302 -8232 5349 62963 -64010 -176039 -84566 -49581
22432 -49581 -154527 -145082 -175312 -233892 -243538 -185570 -99670 -159807 -190895 -104889 -105847 -120754
22420 -120754 -183424 -93994 39434 97954 33673 33103 122594 237541 296764 213337 113509
22409 113509 39833 -23893 -35066 9948 59320 147004 19013 -30133 -34471 -128050 -101868
22398 -101868 2560 17888 -30013 -141684 -35826 185247 247118 132372 106074 153295
22388 153295 161738 170612 133602 262337 222306 116194 125575 177648 163992 115217 103825 148737
$$ packed form
22465A40966R9190j0006q7163o2430q3411j3416q4930j27162n8646J08489J27004
22454e1515L1734K0933j02264n8952j6197R6488K28827P4481j48361p0365Q6344
22443I1153J2296k8083l352l5712m4534J3581N7614j26973j12029R1473L4985
22432d9581j04946R445l0230n8580r646N7968Q5900o0137l1088Q6006r58j4907
22420a20754o2670Q9430J33428N8520o4281n70Q9491J14947N9223q3427r9828
22409A13509p3676o3726j1173M5014M9372Q7684j27991m9146m338r3579K6182
22398a01868J04428J5328m7901j11671J05858K21073O1871j14746k6298M7221
22388A53295Q443Q874l7010J28735m0031j06112R381N2073j3656m8775j1392M4912
$$ plain form
22376 148737 106852 -105127 -191587 -143960 -81864 -84554 -179089 -31835 135043 170838 107156
22365 107156 119519 38867 5635 -101682 -139625 -60733 -177400 -163844 -52785 607 -141272
22354 -141272 -181048 -101054 -111009 -99912 -167605 -125577 -94701 -141513 -271785 -228091 -200154
22343 -200154 -216112 -190202 -150581 -63838 -73197 -137280 -11029 83818 76101 123683 184991 238147
22331 238147 172165 47698 -40602 -156299 -134906 14275 -17663 -39961 -29674 -72981 -143943
22320 -143943 -154627 -82249 -183350 -347402 -256697 -92419 139942 276992 196327 119860
22310 119860 94910 22695 50547 -130488 -242176 -238994 -226446 -164210 -41634 16497 61049
22299 61049 9508 -64427 70459 193076 318321 250998 62803 69239 185568 130104 75260
$$ packed form
22376A48737m1885k11979q6460M7627O2096k690r4535J47254J66878L5795o3682
22365A07156J2363q0652l3232j07317l7943P8892j16667J3556J11059N3392j41879
22354a41272l9776P9994r955J1097o7693M2028L0876m6812j30272M3694K7937
22343b00154j5958K5910L9621Q6743r359o4083J26251R4847p717M7582O1308N3156
22331B38147o5982j24467q8300j15697K1393J49181l1938k2298J0287m3307p0962
22320a43943j0684P2378j01101j64052R0705J64278K32361J37050q0665p6467
22310A19860k4950p2215K7852j81035j11688L182J2548O2236J22576N8131M4552
22299F1049n1541p3935J34886J22617J25245o7323j88195O436J16329n5464n4844
$$ plain form
22288 75260 67871 71800 89380 -31073 -32836 -100562 -119554 -101256 -153854 -112771 -199281 -241801
22276 -241801 -266158 -357825 -215707 -61878 -64883 -111338 -124241 13840 -24279 -22953 32748
22265 32748 -77264 -54338 55872 6245 81616 121866 20693 -115896 -170479 -85721 -26051
22254 -26051 44181 6974 98541 33772 18804 17433 117998 -11507 -72039 -118781 -120074 -171571
22242 -171571 -146610 -187201 -190111 -49067 103548 23176 -112672 -297920 -353233 -205262 2679
22231 2679 -14019 -79103 -219509 -322531 -355072 -312409 -206512 -143600 -50073 -45660 -198944
22220 -198944 -240334 -25765 16936 24899 -63448 -143329 -189106 -151899 -163419 25681 -10893
22209 -10893 -16088 -110497 -129434 -77826 5624 -26002 -92125 -138237 -147960 -188764 -19730 92656
$$ packed form
22288G5260p389L929J7580j20453j763o7726j8992J8298n2598M1083q6510m2520
22276b41801k4357r1667J42118J53829l005m6455j2903J38081l8119J326N5701
22265C2748j10012K2926J10210m9627P5371M0250j01173j36589n4583Q4758N9670
22254b6051P0232l7207R1567o4769j4968j371J00565j29505o0532m6742j293n1497
22242a71571K4961m0591k910J41044J52615q0372j35848j85248n5313J47971K07941
22231B679j6698o5084j40406j03022l2541M2663J05897O2912R3527M413j53284
22220a98944m1390K14569M2701P963q8347p9881m5777L7207j1520J89100l6574
22209a0893n195r4409j8937N1608Q3450l1626o6123m6112r723m0804J69034J12386
$$ plain form
22197 92656 174986 251655 271804 180041 179091 213168 288350 283958 289287 217139 77629 36456
22185 36456 100437 93561 172033 240342 70105 75636 -38986 -92604 -10555 131557 304678
22174 304678 209128 23914 23409 9613 48420 -11058 -41904 -27619 -63222 39116 125580
22163 125580 -6505 -174544 -197299 -192653 -136667 -25676 -99872 -99167 -18638 -11666 129941
22152 129941 150892 61706 134625 167546 102993 20699 -15593 -113091 -238009 -180183 -12283
22141 -12283 73283 -20107 -26913 -26990 32818 26377 33538 9051 -194169 -167084 14330 57514
22129 57514 -62508 -52613 -88484 -257957 -190792 -35714 -106108 -57007 -9937 88844 119619
22118 119619 40658 -42989 -19697 38597 -73838 -63148 -35476 -103420 -136840 -96786 -143549
$$ packed form
22197I2656Q2330P6669K0149r1763r50L4077P5182m392N329p2148j39510m1173
22185C6456O3981o876P8472O8309j70237N531j14622n3618Q2049J42112J73121
22174C04678r5550j85214n05j3796L8807n9478l0846J4285l5603J02338Q6464
22163A25580j32085j68039k2755M646N5986J10991p4196P05Q0529O972J41607
22152A29941K0951q9186P2919L2921o4553q2294l6292r7498j24918N7826J67900
22141a2283Q5566r3390o806p7N9808o441P161k4487k03220K7085J81414M3184
22129E7514j20022R895l5871j69473O7165J55078p0394M9101M7070R8781L0775
22118A19619p8961q3647K3292N8294j12435J0690K7672o7944l3420M0054m6763
$$ plain form
22107 -143549 -256597 -302130 -299498 -309508 -273092 -274373 -155385 11231 123705 -51786 -161170
22096 -161170 -131771 -27957 -88870 -160614 -281219 -249550 -234952 -225686 -225864 -240370 -163582 -53398
22084 -53398 -56784 -50676 49040 50266 -29360 -77771 -90215 30648 228887 300976 137512 146956
22072 146956 183890 95230 -31912 48149 157700 88304 14603 -52255 -47175 -43713 -122937
22061 -122937 -164543 -138075 -92281 51256 34311 26788 52248 33424 -161435 -121593 15614
22050 15614 61173 132194 37645 -111048 -267048 -270096 -185197 -38254 -44241 -62893 -8896
22039 -8896 -56149 -209879 -163688 -41855 72045 141687 204656 13989 -38333 85415 117225
22028 117225 240534 90914 -83107 -165077 -117296 -153870 -143634 -142911 -92 90220 -7759
$$ packed form
22107a43549j13048m5533K632j0010L6416j281J18988J66616J12474j75491j09384
22096a61170K9399J03814o0913p1744j20605L1669J4598R266j78j4506P6788J10184
22084e3398l386O108R9716J226p9626m8411j2444J20863J98239P2089j63464R444
22072A46956L6934q8660j27142Q0061J09551o9396p3701o6858N080L462p9224
22061a22937m1606K6468M5794J43537j6945p523K5460j8824j94859L9842J37207
22050A5614M5559P1021r4549j48693j56000l048Q4899J46943n987j8652N3997
22039h896m7253j53730M6191J21833J13900O9642O2969j90667n2322J23748L1810
22028A17225J23309j49620j74021q1970M7781l6574J0236P23J42819R0312r7979
$$ plain form
22017 -7759 13321 72872 85786 17587 -31027 105965 122532 24835 -2679 151848 242117
22006 242117 230097 193170 164903 61178 65574 50502 -31474 -59441 -19015 -6144 67515
21995 67515 82549 27698 84046 71757 -680 -1867 51153 -44889 -25225 85542 91880 2338
21983 2338 5888 87154 -21180 -72738 15896 25346 -37671 13915 136762 182241 172449 165888
21971 165888 109565 -974 63536 99307 67625 -20601 -50871 -48036 -108848 111820 252702
21960 252702 176448 -4506 -118764 -17089 184173 119038 6294 -71367 -10076 -111640
21950 -111640 -98245 -86606 -217184 -161879 -63357 28288 69620 104323 -83332 -202599 -235332
21939 -235332 -254615 -367668 -497582 -305113 -169543 -277352 -95526 77017 16345 -68896
$$ packed form
22017g759K1080N9551J2914o8199m8614J36992J6567r7697k7514J54527R0269
22006B42117j2020l6927k8267j03725M396j5072q1976k7967M0426J2871P3659
21995F7515J5034n4851N6348j2289p2437j187N3020r6042J9664J10767O338q9542
21983B338L550Q1266j08334n1558Q8634R450o3017N1586J22847M5479r792o561
21971A65888n6323j10539O4510L5771l1682q8226l0270K835o0812K20668J40882
21960B52702p6254j80954j14258J01675K01262o5135j12744p7661O1291j01564
21950a11640J3395J1639j30578N5305R8522R1645M1332L4703j87655j19267l2733
21939b35332j9283j13053j29914J92469J35570j07809J81826J72543o0672q5241
$$ plain form
21929 -68896 -179961 -190630 -105491 -18399 -2640 96396 -26433 -66627 -24668 -35584 -178552
21918 -178552 -149275 -262507 -196910 -44873 62858 64601 -5932 78106 149764 46438 125763
21907 125763 -16232 61120 181403 57940 31380 -126923 -137466 -175923 -149833 -26712
21897 -26712 -112588 -135038 13067 150841 165003 76207 33327 72103 95091 -67348 -248530
21886 -248530 -229430 -43669 165062 41289 -13784 -22927 66869 225830 240404 264493 306076
21875 306076 289288 193127 194599 25547 -54484 82430 269421 368258 326718 181739 237742
21864 237742 241406 103829 168648 195431 129734 91181 2108 -52026 -11118 -10074 1287 -102010
21852 -102010 -130180 -156970 17521 256227 137825 -145693 -138677 -217451 -88625 -37142 -32348
$$ packed form
21929f8896j11065j0669Q5139Q7092J5759R9036j22829m0194M1959j0916j42968
21918a78552K9277j13232O5597J52037J07731J743p0533Q4038P1658j03326P9325
21907A25763j41995P7352J20283j23463k6560j58303j0543l8457K6090J23121
21897b6712q5876k2450J48105J37774J4162q8796m2880L8776K2988j62439j81182
21886b48530J9100J85761K08731j23773n5073r143Q9796J58961J4574K4089M1583
21875C06076j6788r6161J472j69052q0031J36914J86991R8837m1540j44979N6003
21864B37742L664j37577O4819K6783o5697l8553q9073n4134M0908J044J1361j03297
21852a02010k8170k6790J74491K38706j18402k83518P016p8774J28826N1483M794
$$ plain form
21841 -32348 -13635 3649 222171 172765 79220 40154 51376 15377 -69595 -47924 56331
21830 56331 -307 -44882 -9289 -66008 -106756 -79748 -213888 -276993 -184869 -140574 -206919
21819 -206919 -126620 -104868 -217895 -163527 -55184 -95490 -20915 44756 28128 -20003 -74903
21808 -74903 28498 -72647 -22790 19686 -35531 -241643 -265981 -124450 38847 -16102 -89385
21797 -89385 -212402 -397311 -384698 -175734 -106098 2838 -58453 -11800 -34516 -103399 -172668
21786 -172668 -74672 -43057 -81252 -132211 28413 72062 61887 -95811 -8986 2542 -58238
21775 -58238 -124682 -57257 -52628 -44420 -66803 -210127 -209789 -162947 -1538 36607 -86669 -135044
21763 -135044 -153298 -144797 -155516 -185303 -191570 -178061 54606 301596 120129 -40500 -14179
$$ packed form
21841c2348J8713J7284K18522m9406r3545l9066J1222l5999q4972K1671J04255
21830E6331n6638m4575L5593n6719m0748K7008j34140o3105R2124M4295o6345
21819b06919Q0299K1752j13027N4368J08343m0306P4575O5671j6628m8131n4900
21808g4903J03401j01145M9857M2476n5217k06112k4338J41531J63297n4949p3283
21797h9385j23017j84909J2613K08964O9636J08936o1291M6653k2716o8883o9269
21786a72668R7996L1615l8195n0959J60624M3649j0175j57698Q6825J1528o0780
21775e8238o6444O7425M629Q208k2383j43324L38M6842J61409L8145j23276m8375
21763a35044j8254Q501j0719k9787o267J3509K32667K46990j81467j60629K6321
$$ plain form
21752 -14179 38094 -49443 -67235 -171567 -114157 56650 19352 74326 24844 -120784 -97135
21741 -97135 -79604 -175258 -227084 -185976 11145 107715 173803 40553 -74952 -105195 21700
21730 21700 275976 320194 298160 282434 120427 40801 8343 36420 101717 101005 71096 127826
21718 127826 222429 244662 27939 -45838 -29470 17486 9279 47023 30109 -49907 -121989
21707 -121989 -30742 163946 143111 198709 296920 213435 226529 234472 100526 -35890 70330
21696 70330 122909 38415 -38860 -96037 -265691 -306809 -296633 -258465 -302627 -279915 -199864
21685 -199864 -196456 -133182 -130666 -20571 178008 178432 43132 -14463 -11955 -2452 94815 106618
21673 106618 68120 15385 -81263 -71178 -33646 -64139 -11247 -15079 75580 136907 132770 37712
$$ packed form
21752a4179N2273q7537j7792j04332N7410J70807l7298N4974m9482j45628K3649
21741i7135J7531r5654n1826M1108J97121R6570O6088j33250j15505l0243J26895
21730B1700K54276M4218k2034j5726j62007p9626l2458K8077O5297p12k9909N6730
21718A27826R4603K2233k16723p3777J6368M6956q207L7744j6914q0016p2082
21707a21989R1247J94688k0835N5598R8211q3485J3094P943j33946j36416J06220
21696G0330N2579q4494p7275n7177j69654m1118J0176L8168m4162K2712Q0051
21685a99864L408O3274K516J10095J98579M24j35300n7595K508R503R7267J1803
21673A06618l8498n2735r6648J0085L7532l0493N2892l832R0659O1327m137r5058
$$ plain form
21661 37712 -73662 -100253 -55853 -69102 15676 47615 -114016 -196253 -114654 -1114 35627
21650 35627 117020 175305 71091 150219 88920 -88712 -122094 -118413 64503 254068 274515
21639 274515 90993 -31357 16873 61218 -110025 -161957 -84879 1180 25989 22814 24710
21628 24710 4647 9935 49662 -86127 -243309 -182102 89870 192159 62743 80452 101346
21617 101346 87994 6302 -90369 -216067 -203370 -133500 -38751 27464 87164 92963 139414
21606 139414 66775 7270 -64016 -119049 14687 47120 -18111 -133300 -98406 45848 49513
21595 49513 -105675 -57598 23336 -45857 -136512 -53727 13684 -46406 81754 115329 59765
21584 59765 -33387 30684 41468 4436 -50870 -32319 18522 106446 151176 10820 32323
$$ packed form
21661C7712j11374k6591M4400j3249Q4778L1939j61631q2237Q1599J13540L6741
21650C5627Q1393N8285j04214P9128o1299j77632l3382L681J82916J89565K0447
21639B74515j83522j22350M8230M4345j71243n1932P7078Q6059K4809l175J896
21628B4710k0063N288L9727j35789j57182O1207K71972J02289j29416J7709K0894
21617A01346j3352q1692r6671j25698J2697O9870R4749O6215N9700N799M6451
21606A39414p2639n9505p1286n5033J33736L2433o5231j15189L4894J44254L665
21595D9513j55188M8077Q0934o9193r0655Q2785O7411o0090J28160L3575n5564
21584E9765r3152O4071J0784l7032n5306J8551N0841Q7924M4730j40356K1503
$$ plain form
21573 32323 -12311 63078 215022 251236 77032 -51770 -162224 -126307 -83777 -7166 46605
21562 46605 -28094 -189816 -231770 -155757 -67600 -126604 -93750 -18141 -108346 -32813 165283
21551 165283 105547 -33734 -63974 61402 106200 147773 85932 41972 -162919 -190763 44406
21540 44406 105654 133932 161715 33903 -78592 -121370 29699 -13674 -77932 -19504 45806
21529 45806 26506 44119 -25491 -64554 -128 32227 -69952 -199023 -224518 -195130 -251831
21518 -251831 -112451 -28854 -139046 -82503 -4918 3584 -49078 -58481 -104723 -96488 -91680 -73821
21506 -73821 17122 23669 89747 187688 166862 208515 287492 276053 255921 118521 15435
21495 15435 42734 36202 117155 78499 16079 47547 23304 -8569 -59278 -76607 -3085 -289
$$ packed form
21573C2323m4634P5389J51944L6214j74204j28802j10454L5917M2530P6611N3771
21562D6605p4699j61722m1954P6013Q8157n9004L2854P5609r0205P5533J98096
21551A65283n9736j39281l0240J25376M4798M1573o1841m3960k04891k7844K35169
21540D4406O1248K8278K7783j27812j12495m2778J51069m3373o4258N8428O5310
21529D5806j9300J7613o9610l9063O4426L2355j02179j29071k5495K9388n6701
21518b51831J39380Q3597j10192N6543P7585Q502n2662r403m6242Q235M808J7859
21506g3821R0943O547O6078R7941k0826M1653P8977j1439k0132j37400j03086
21495A5435K7299o532Q0953l8656o2420L1468k4243l1873n0709j7329P3522K796
$$ plain form
21483 -289 54642 169636 201756 143184 11016 44872 4184 -143008 -162004 -26529 51589
21472 51589 -59538 -21113 -164022 -132727 -44459 -118994 -95129 68480 90495 74468 90367
21461 90367 77254 59798 -13251 -17697 -96676 -168043 -175560 -299768 -299756 -188074 -73103 -98598
21449 -98598 -138456 -26794 19906 19376 -33895 -50384 13536 34910 97656 177172 128249 93199
21437 93199 150447 47464 -73429 -116424 -75663 -745 8535 33888 39387 127817 93814 33969
21425 33969 -10821 41493 88140 96243 54439 -46674 -89725 -23233 -109189 -189782 -155505 -43733
21413 -43733 -34943 -12652 -33299 12806 47785 -1313 -23196 -128949 -194795 -143284 -68004 -133130
21401 -133130 -129549 -88614 -101192 -23149 123242 128185 96747 104070 127260 -78290 -156548 -77962
$$ packed form
21483b89N4931J14994L2120n8572j32168L3856m0688j47192j8996J35475P8118
21472E1589j11127L8425j42909L1295Q8268p4535K3865J63609K2015j6027J5899
21461I0367j3113j7456p3049m446p8979p1367p517j24208J2J11682J14971k5495
21449i8598l9858J11662M6700n30n3271j6489O3920K1374O2746P9516m8923l5050
21437I3199N7248j02983j20893m2995M0761P4918R280K5353N499Q8430l4003n9845
21425C3969m4790N2314M6647Q103m1804j01113m3051O6492q5956q0593L4277J11772
21413d3733Q790K2291k0647M6105L4979m9098k1883j05753o5846N1511P5280o5126
21401a33130L581M0935j2578P8043J46391M943l1438P323K3190k05550p8258P8586
$$ plain form
21389 -77962 -39235 -26630 89557 166630 171579 160058 106149 -1006 -87919 -63490 60874
21378 60874 46092 -4201 -39160 66382 141934 105473 161306 119765 -16361 -192211 -128107
21367 -128107 -200066 -291718 -41342 -12092 -119901 -178290 -271932 -284436 -247921 -125022 -31785
21356 -31785 -66266 7797 67252 72351 26442 49103 109309 92987 23289 -144114 -252504
21345 -252504 -98367 -151900 -230025 -226315 -249914 -97271 32950 11005 -99734 -86366 -85386
21334 -85386 -155114 -170266 -182928 -163775 -148763 -184281 -80505 -14386 14320 111364 62162
21323 62162 29910 -3666 -10724 111355 64043 45558 64623 23881 156340 145388 -24453
21312 -24453 11502 60240 20186 39703 58120 -15205 -98437 -25578 7895 14264 -18828 -22165
$$ packed form
21389g7962L8727J2605J16187P7073M949j1521n3909j07155q6913K4429J24364
21378F0874j4782n0293l4959J05542P5552l6461N5833m1541j36126j75850O4104
21367a28107p1959r1652K50376K9250j07809n8389r3642j2504L6515J22899R3237
21356c1785l4481P4063N9455N099m5909K2661O0206j6322o9698j67403j08390
21345b52504J54137n3533p8125L710k3599J52643J30221k1945j10739J3368R80
21334h5386o9728j5152j2662J9153J5012l5518J03776O6119K8706R7044m9202
21323F2162l2252l3576p058J22079m7312j8485J9065m0742J32459j0952j69841
21312b4453L5955M8738m0054J9517J8417p3325q3232P2859L3473O369l3092l337
$$ plain form
21300 -22165 -129616 -141802 -132802 -188886 -49390 -37546 11301 44885 -90114 -123099 -130155
21289 -130155 -59988 -13840 -140034 -240527 -186923 -181485 -120362 -34336 14304 40516 116444
21278 116444 98571 -116300 -117997 -111736 43959 79961 34953 -6807 16691 -29524 -301105
21267 -301105 -301840 -165079 6904 142149 101971 142852 7043 -73054 88661 203576 183963
21256 183963 226505 240505 120931 -131961 -245229 -168472 -33566 91966 -45645 -150620
21246 -150620 -178316 -41594 -58143 -74610 -25634 -82819 27236 91734 94445 79931 -20310
21235 -20310 -120056 -95987 -128926 -6816 104197 102267 74504 72502 156814 118752 -1929
21224 -1929 -18649 121448 185942 75822 8001 -72552 -208661 -242591 -222880 -80684 -78711
$$ packed form
21300b2165j07451j2186R000n6084J39496J1844M8847L3584j34999l2985p056
21289a30155P0167M6148j26194j00493N3604N438O1123Q6026M8640K6212P5928
21278A16444j7873k14871j697O261J55695L6002m5008m1760K3498m6215k71581
21267c01105p35J36761J71983J35245m0178M0881j35809q0097J61715J14915j9613
21256A83963M2542J4000j19574k52892j13268P6757J34906J25532j37611j04975
21246a50620k7696J36722j6549j6467M8976n7185J10055O4498K711j4514j00241
21235b0310r9746K4069l2939J22110J11013j930k7763k002Q4312l8062j20681
21224a929j6720J40097O4494j10120o7821q0553j36109l3930J9711J42196J973
$$ plain form
21213 -78711 -202193 -158224 -141687 -100661 17290 -38003 8693 -68763 -215105 -48154 179699
21202 179699 248135 133623 -29508 -123989 -138696 -79971 128046 157438 71884 62123 64253
21191 64253 -37141 -65986 -84166 -87958 -232804 -478571 -469285 -259365 -76062 -29633 40541
21180 40541 59643 -16717 91181 80022 32221 19820 -74913 -130163 -213263 -178959 -196375
21169 -196375 -112285 -35182 -55946 -119609 16166 -118003 -339935 -331934 -236834 -75738 -93536
21158 -93536 -73561 -36270 -1906 -26831 100078 39805 2751 20134 -69797 -64728 -39261 10397
21146 10397 -3643 123879 96468 36442 -5909 -1463 -53646 -100344 -133746 -154351 -154162 -105181
21134 -105181 -44767 -80135 -58197 -51469 -54006 84191 150475 155913 227187 218432 137945 138229
$$ packed form
21213g8711j23482M3969J6537M1026J17951n5293M6696p7456j46342J66951K27853
21202A79699O8436j14512j63131r4481j4707N8725K08017K9392q5554r761K130
21191F4253j01394k8845j8180l792j44846k45767R286K09920J83303M6429P0174
21180D0541J9102p6360J07898j1159m7801j2401r4733n5250q3100L4304j7416
21169a96375Q4090P7103k0764o3663J35775j34169k21932Q001R5100J61096j7798
21158i3536J9975L7291L4364k4925J26909o0273l7054J7383q9931N069K5467M9658
21146A0397j4040J27522k7411o0026m2351M446n2183m6698l3402k0605J89M8981
21134a05181O0414l5368K1938O728k537J38197O6284N438P1274q755q0487K84
$$ plain form
21122 138229 103035 28869 123571 153037 -854 -133133 -161083 -19146 12618 -87724 -94615
21111 -94615 -61619 24150 7396 -111971 -100004 45934 215396 165794 149039 103918 14044
21100 14044 -48002 -66581 -36985 -50735 -57254 -48564 -43217 57383 71939 -29538 15496 -98267
21088 -98267 -293974 -184878 -95968 -84411 -36225 -25160 5317 -32048 -26276 24831 129450
21077 129450 38105 -17060 44172 66276 164730 18976 -23720 3803 -26159 -51092 22216
21066 22216 45620 -51816 -59214 -51246 -74750 -110801 42955 161670 139137 54867 -38792 -96149
21054 -96149 -140468 -112995 -229509 -236515 44204 229275 111848 26888 -69026 -223378 -307537
21043 -307537 -168033 -42094 89504 64470 -168580 -170260 -180733 -303508 -358814 -290111 -120477
$$ packed form
21122A38229l5194p4166R4702K9466j53891j32279k7950J41937L1764j00342o891
21111i4615L2996Q5769j6754j19367J1967J45938J69462m9602j6755m5121q9874
21100A4044o2046j8579K9596j3750o519Q690N347J00600J4556j01477M5034j13763
21088i8267j95707J09096Q8910J1557M8186J1065L0477l7365N772N1107J04619
21077A29450r1345n5165O1232K2104R8454j45754m2696K7523k9962k4933P3308
21066B2216K3404r7436p398P968k3504l6051J53756J18715k2533q4270r3659n7357
21054i6149m4319K7473j16514p006K80719J85071j17427q4960r5914j54352q4159
21043c07537J39504J25939J31598k5034k33050j680j0473j22775n5306O8703J69634
$$ plain form
21032 -120477 -98863 -168033 -241366 -102555 6862 -97041 -134727 -289338 -293892 -168810 -119075
21021 -119075 -235012 -299831 -142960 -88605 -87050 6329 57708 45425 47122 8877 -136286
21010 -136286 -337788 -371773 -264588 -258900 -126021 -232428 -325417 -132233 -125543 -101620 -5957
20999 -5957 30927 -73958 -83751 -113304 -73810 -71939 -284663 -365729 -390824 -294724 -92159 -41283
20987 -41283 44523 113521 159282 75644 16925 240402 251202 10916 -24581 -45182 -129451
20976 -129451 -24671 61200 -168816 -160951 -150293 -122755 -119720 -78579 -119807 -98638 -179023
20965 -179023 -171464 -218090 -255668 -109349 16994 -104150 -153155 -48146 -105921 -264559 -187308
20954 -187308 -68545 -86424 40588 22937 -20252 -166456 -141092 -103771 -164560 -238059 -353677
$$ packed form
21032a20477K1614o9170p3333J38811J09417j03903l7686j54611m554J25082M9735
21021a19075j15937o4819J56871N4355J555R3379N1379j2283J697l8245j45163
21010a36286k01502l3985J07185N688J32879j06407r2989J93184O690K3923R5663
20999e957L6884j04885r793k9553L9494J871k12724q1066k5095R6100K02565N0876
20987d1283Q5806O8998M5761q3638n8719K23477J0800k40286l5497k0601q4269
20976a29451J04780Q5871k30016P865J0658K7538L035M1141m1228K1169q0385
20965a79023P559m6626l7578J46319J26343j21144m9005J05009n7775j58638P7251
20954a87308J18763j7879J27012j7651m3189j46204K5364L7321o0789p3499j15618
$$ plain form
20943 -353677 -449436 -311116 -178935 -76254 -21366 -92721 -29646 -10858 -65543 -52859 -50861
20932 -50861 24271 95781 -31117 -195577 -77253 -94976 -71906 10018 36074 3252 94795
20921 94795 99160 96757 92595 62776 25183 41407 150452 90690 95096 176020 83965 52542
20909 52542 -140865 -173890 -133452 -24527 33901 28766 -67072 -109562 -85168 148365 234471
20898 234471 127148 20759 22693 -61856 -170661 -160243 -103381 32228 89336 50671 4181
20887 4181 -94185 -130981 -21759 18015 -71557 -264619 -221131 -233266 -200648 -108530 -101675 -161887
20875 -161887 -150909 -94541 -104293 -42820 -72449 -79333 30591 29626 38386 96181 77929 22713
20863 22713 -150407 -150202 -62055 -78374 -64435 -152834 -58022 79474 19141 -16344 200125
$$ packed form
20943c53677r5759J38320J32181J02681N4888p1355O3075J8788n4685J2684J998
20932e0861P5132P1510j26898j64460J18324j7723K3070Q1924K6056l2822R1543
20921I4795M365k403m162k9819l7593J6224J09045n9762M406Q0924r2055l1423
20909E2542j93407l3025M0438J08925N8428n135r5838m2490K4394K33533Q6106
20898B34471j07323j06389J934q4549j08805J0418N6862J35609N7108l8665m6490
20887D181r8366l6796J09222L9774q9572j93062M3488j2135L2618R2118O855o0212
20875a61887J0978N6368r752O1473k9629o884J09924r65Q760N7795j8252n5216
20863B2713j73120K05Q8147j6319J3939q8399R4812J37496o0333l5485K16469
$$ plain form
20852 200125 185747 -13289 -135621 -112415 -67736 21549 83535 62119 -110686 -287064 -242572
20841 -242572 -102183 -59452 38139 97504 244379 298941 56416 -106667 -83963 -83122 -92360
20830 -92360 33833 27380 -75322 -179493 -214720 -176236 -81090 -101408 -108624 -167535 -147007
20819 -147007 -72661 78079 -46431 -130106 -92557 -95913 -81935 92247 116121 -69922 -66481
20808 -66481 14494 26986 61753 36967 -103878 -137063 -98445 -77709 6155 -52620 -48033 55457
20796 55457 8690 -15848 71878 43216 82091 -35303 -41893 76609 100636 -13215 -18524
20785 -18524 52948 1010 12251 -12518 -81637 -100923 38847 44222 33118 53329 -48552
20774 -48552 68265 205253 217630 175642 140673 85790 -2901 36190 64362 39418 -29107
$$ packed form
20852B00125j4378j99036j22332K3206M4679Q9285O1986k1416j72805j76378M4492
20841b42572J40389M2731R7591N9365J46875N4562k42525j63083K2704Q41r238
20830i2360J26193o453j02702j04171l5227L8484R5146k0318p216n8911K0528
20819a47007P4346J50740j24510q3675L7549l356J3978J74182K3874j86043L441
20808f6481Q0975J2492L4767k4786j40845l3185L8618K0736Q3864n8775M587J03490
20796E5457m6767k4538Q7726k8662L8875j17394o590J18502K4027j13851n309
20785a8524P1472n1938J1241k4769o9119j9286J39770N375j1104K0211j01881
20774d8552J16817J36988J2377m1988l4969n4883q8691L9091K8172k4944o8525
$$ plain form
20763 -29107 79404 137740 142725 100680 -3126 17059 18647 -39676 -16209 -107511 -70843 -5707
20751 -5707 1855 74980 165235 124306 -33907 -45715 -31208 43750 -8400 30896 -54660 -30100
20739 -30100 22889 -204742 -297111 -321411 -274010 -139433 -14695 30442 -63617 -166471 -252411
20728 -252411 -322243 -312930 -155200 -162663 -130031 -5226 -109357 -118939 -65862 36924 51085
20717 51085 12142 -54898 -116396 -148775 -221508 -157911 65874 -31303 51453 111898 -21204
20706 -21204 -51436 -51272 -187743 -186041 49790 61345 159374 204522 211124 179136 127900 141854
20694 141854 48494 73080 189830 218680 85274 26310 -17686 -25168 -48708 40501 42072
20683 42072 -73335 -149479 -123641 -66002 -95911 -161061 -42105 60451 71809 32662 35617
$$ packed form
20763b9107J08511N8336M985m2045j03806K0185J588n8323K3467r1302L6668O5136
20751e707P562P3125R0255m0929j58213j1808J4507P4958n2150L9296q5556K4560
20739c0100N2989k27631r2369k4300M7401J34577J24738M5137r4059j02854q5940
20728b52411o9832R313J57730p463L2632J24805j04131r582N3077J02786J4161
20717E1085l8943o7040o1498l2379p2733O3597K23785r7177Q2756O0445j33102
20706b1204l0232J64j36471J702K35831J1555R8029M5148O602l1988n1236J3954
20694A41854r3360K4586J16750K8850j33406n8964m3996p482k3540Q9209J571
20683D2072j15407p6144K5838N7639k9909o5150J18956J02556J1358l9147K955
$$ plain form
20672 35617 -59132 -103492 -171370 -63005 -58379 -125904 -33741 -23804 149550 132363 63077 91869
20660 91869 163538 172577 40335 -144897 -145327 -90522 6672 176907 37291 -108610 -37653
20649 -37653 -8147 108763 125437 31233 27078 121915 271597 331480 197041 63018 120776
20638 120776 84133 -71276 -60752 -71318 -2646 -77800 -161836 -174391 -171995 -217031 -157944
20627 -157944 -162915 -158408 -82130 -49953 -5555 -3955 -135962 -276128 -158703 -55751 -167628
20616 -167628 -242534 -294787 -169909 -220603 -94610 160961 165602 79960 -36646 -8233 142808
20605 142808 10303 -56442 -93809 -81420 -67557 -128744 -12329 -32183 -55133 -91833 -123888
20594 -123888 -130612 -68191 1831 -38693 -58506 -25678 -22034 -86112 -12196 -23704 51006 -6
$$ packed form
20672C5617r4749m4360o7878J08365M626o7525R2163R937J73354j7187o9286K8792
20660I1869P1669R039j32242j85232m30N4805R7194J70235j39616j45901P0957
20649c7653K9506J16910J6674r4204m155R4837J49682N9883j34439j34023N7758
20638A20776l6643j55409J0524j0566O8672p5154q4036j2555K396m5036N9087
20627a57944m971M507P6278L2177M4398J600j32007j40166J17425J02952j11877
20616a67628p4906n2253J24878n0694J25993K55571M641q5642j16606K8413J51041
20605A42808j32505o6745l7367J2389J3863o1187J16415j9854k2950l6700l2055
20594a23888o724O2421P0022m0524j9813L2828L644o4078P3916j1508P4710n1012
$$ plain form
20582 -6 -161305 -174517 28947 42944 99920 102516 145099 161790 110126 40411 67262 62281
20570 62281 47499 -27923 24225 116042 218924 235184 297677 343504 207404 117832 37647
20559 37647 42472 5697 47056 67323 59162 69388 99393 270022 372121 352458 341028 281545
20547 281545 233804 412422 471849 373126 197333 154762 203001 160721 143915 74774 69872
20536 69872 114646 67125 58347 130497 199540 188616 232755 258310 159057 149299 233998 191776
20524 191776 174852 165148 190760 192809 181403 98535 -34682 -26293 -71333 -132142 -91615 -40097
20512 -40097 -7784 28764 -22564 17446 133297 63722 37156 30375 -45630 39082 58319 -123744
20500 -123744 -356011 -500414 -426266 -226833 -241021 -261772 -110184 -112226 -174942 -168248 -201391
$$ packed form
20582fj61299j3212K03464J3997N6976K596M2583J6691n1664o9715K6851m981
20570F2281j4782p5422N2148R1817J02882J6260O2493M5827j36100q9572q0185
20559C7647M825l6775M1359K0267q161J0226L0005J70629J02099j9663j1430n9483
20547B81545m7741J78618N9427r8723j75793m2571M8239m2280j6806o9141m902
20536F9872M4774m7521q778P2150O9043j0924M4139K5555r9253r758Q4699m2222
20524A91776j6924r704K5612K049j1406q2868j33217Q389m5040o0809M0527N1518
20512d0097L2313L6548n1328M0010J15851o9575k6566o781p6005Q4712J9237j82063
20500a23744k32267j44403P4148J99433j4188k0751J51588k042o2716O694l3143
$$ plain form
20489 -201391 -118705 -178568 -215395 -56999 -23094 -156266 -160551 -145161 -72296 49189 113563
20478 113563 112498 52792 103449 129214 8094 -32068 -22403 42915 101271 23647 -28955 -60188
20466 -60188 -1363 -35027 11020 102475 175573 110797 25510 -63424 -105014 -171437 -41530
20455 -41530 -42953 -49908 -111230 -41358 6518 -2816 29732 -124014 -224666 -209700 -101010 6326
20443 6326 120694 195027 63322 23373 10471 68164 -45386 -45891 31204 -15350 -7204 -92474
20431 -92474 -157107 -132325 123868 298601 236028 103356 31796 117138 192692 102945 -39155
20420 -39155 -126038 -166362 -75996 -27374 -14605 42765 12198 32543 11095 73390 102610 -2133
20408 -2133 -52801 -77564 -205268 -210980 -233536 -173605 -44527 82198 122387 63636 76243
$$ packed form
20489b01391Q2686n9863l6827J58396L3905j33172m285J5390P2865J21485O4374
20478A13563j065n9706N0657K5765j21120m0162R665O5318N8356p7624n2602l1233
20466f0188N8825l3664M6047R1455P3098o4776q5287q8934m1590o6423J29907
20455d1530j423o955o1322O9872M7876r334L2548j53746j00652J4966J08690J07336
20443F326J14368P4333j31705l9949j2902N7693j13550n05P7095m6554Q146q5270
20431i2474o4633K4782K56193J74733o2573j32672p1560Q5342P5554q9747j42100
20420c9155q6883m0324R0366M8622J2769N7370l0567K0345k1448O2295K9220j04743
20408b133n0668k4763j27704n712k2556N9931J29078J26725M0189n8751J2607
$$ plain form
20397 76243 114364 17352 -66855 -81628 -50209 -167307 81490 170051 155618 120546 -9561
20386 -9561 78065 124343 130047 93857 -6551 106467 149015 157013 196995 85060 -61599
20375 -61599 -37823 39173 11263 -158498 -157378 -84265 -73409 96093 202636 147966 13471
20364 13471 -63172 -90371 -78828 -102054 -158703 -200937 -58550 115642 226303 162433 206980
20353 206980 130796 81758 -130956 -226391 -138566 -63848 4030 3415 110188 154657 6967
20342 6967 8213 104882 109848 146411 235240 241087 251565 237458 140645 91726 146741 162547
20330 162547 44793 46431 4437 -114365 -33978 -88695 -148918 -148497 -4600 55312 -17489
20319 -17489 -181219 -163187 -45554 -29051 32340 74468 146829 -37601 -43581 27972 -40687
$$ packed form
20397G6243L8121r7012q4207j4773L1419j17098K48797Q8561j4433l5072j30107
20386i561Q7626M6278N704l6190j00408J13018M2548P998L9982j11935j46659
20375f1599K3776P6996k7910j69761J120P3113J0856J69502J06543n4670j34495
20364A3471p6643k7199J1543k3226n6649m2234J42387J74192J10661o3870M4547
20353B06980p6184m9038k12714r5435Q7825P4718O7878o15J06773M4469j47690
20342F967J246R6669M966L6563Q8829N847J0478j4107r6813m8919N5015J5806
20330A62547j17754J638m1994j18802Q0387n4717o0223M21J43897N9912p2801
20319a7489j63730J8032J17633J6503O1391M2128P2361j84430n980P1553o8659
$$ plain form
20308 -40687 -34468 32967 9523 -27439 16067 134075 69850 96166 79287 61866 165073
20297 165073 220170 151504 163169 175167 121045 163852 142010 77966 47860 128827 120771 -25978
20285 -25978 -159158 -226722 -238215 -113919 -107073 -113546 -108785 6908 255074 174723 37741
20274 37741 -90034 -182064 -206037 -191083 -188651 -146368 -13868 93534 -456 -242952 -360007
20263 -360007 -303227 -177714 -63031 8812 73872 100724 80613 73110 -22288 -99921 -29356
20252 -29356 -6061 20440 -95347 -184464 -21028 98394 27460 -204538 -147642 -39558 -115944
20241 -115944 -53396 95341 179300 114591 94023 104129 88370 92465 67676 108235 119420
20230 119420 54742 47728 -23466 -31586 18394 -81715 -291764 -323432 -200135 -101955 -134873
$$ packed form
20308d0687O219O7435k3444l6962M3506J18008o4225K6316j6879j7421J03207
20297A65073N5097o8666J1665J1998n4122M2807k1842o4044l0106Q0967q056j46749
20285b5978j33180o7564j1493J24296O846o473M761J15693K48166q0351j36982
20274C7741j27775r2030k3973J4954K432M2283J32500J07402r3990k42496j17055
20263c60007N6780J25513J14683P1843O5060K6852k0111p503r5398p7633P0565
20252b9356K3295K6501j15787q9117J63436J19422p0934k31998N6896J08084p6386
20241a15944O2548J48737Q3959o4709k0568J0106j5759M095k4789M0559J1185
20230A19420o4678p014p1194q120M9980j00109k10049l1668J23297R8180l2918
$$ plain form
20219 -134873 -132392 -62903 110324 153241 -4031 -90357 -168157 -249147 -179160 -53937 -51320
20208 -51320 66282 103758 108260 -37517 -103952 -125091 -61612 -91962 29981 64315 156382
20197 156382 232399 248837 130390 116291 112219 46617 26413 29365 49144 21706 -9825 -88270
20185 -88270 -196172 -119282 -34010 4389 36024 19344 41471 21165 -173614 -245120 -48317
20174 -48317 55908 71030 41881 -88787 -139320 -32366 105488 121656 187507 176195 151521
20163 151521 191038 121417 -115869 -144753 -96261 -20412 82274 244793 211019 94675 117440
20152 117440 -19367 603 231601 191799 68511 4920 98247 129939 6900 -67832 -41020
20141 -41020 -32482 -91010 -157062 -42806 -4700 26248 -59030 -149861 -215304 -247142 -166006 -25747
$$ packed form
20219a34873K481O9489J73227M2917j57272q6326p7800q0990O9987J25223K617
20208e1320J17602L7476M502j45777o6435k1139O3479l0350J21943L4334R2067
20197A56382P6017J6438j18447j4099m072o5602k0204K952J9779k7438l1531p8445
20185h8270j07902P6890Q5272L8399L1635j6680K2127k0306j94779p1506J96803
20174d8317J04225J5122k9149j30668n0533J06954J37854J6168O5851j1312k4674
20163A51521L9517o9621k37286k8884M8492P5849J02686J62519l3774j16344K2765
20152A17440j36807J9970K30998l9802j23288o3591R3327L1692j23039p4732K6812
20141d1020Q538n8528o6052J14256L8106L0948q5278r0831o5443l1838Q1136J40259
$$ plain form
20129 -25747 56217 -11025 -117308 -61863 -29672 -36790 66574 -19938 35105 39621 2186 116439
20117 116439 57561 -125252 -39113 47208 60507 19328 -169411 -227906 -208392 -88603 -7803
20106 -7803 21674 12390 89765 163000 83049 -28266 26123 -8404 -171213 -12939 139937
20095 139937 13803 22858 117998 159261 127766 233925 275050 132002 86942 188331 155740
20084 155740 140117 135294 53417 2064 -38476 57516 14219 5614 -44436 176709 296805
20073 296805 294082 102052 54570 105365 134188 60955 59566 106409 46199 5581 -4805 14943
20061 14943 -85231 -36978 31856 -24787 -73837 74902 50647 -26579 -31617 -113269 -106420 -102046
20049 -102046 -22291 49200 36256 62926 58638 138577 135833 -59078 -79114 -214431 -204134
$$ packed form
20129b5747Q1964o7242j06283N5445L2191p118J03364q6512N5043M516l7435J14253
20117A16439n8878j82813Q6139Q6321J3299m1179j88739n8495J9514J19789Q0800
20106g803K9477r284P7375P3235p9951j11315N4389l4527j62809J58274J52876
20095A39937j26134R055R5140M1263l1495J06159M1125j43048m5060J01389l2591
20084A55740j5623m823q1877n1353m0540R5992m3297q605n0050K21145J20096
20073B96805k723j92030m7482N0795K8823p3233j389M6843o0210m0618j0386J9748
20061A4943j00174M8253O8834n6643m9050J48739k4255p7226n038q1652O849M374
20049a02046P9755P1491j2944K6670m288P9939k744j94911k0036j35317J0297
$$ plain form
20038 -204134 -133515 862 62686 -8499 -145331 -325729 -359430 -208107 -137584 -131786 -3644
20027 -3644 -77493 -110522 -245070 -181845 -92333 -31034 -18711 67590 163159 137364 24500
20016 24500 -191953 -134561 35643 63301 -25987 -69597 5656 47769 -3774 -46802 -121845
20005 -121845 -82710 53250 -17781 12220 84826 98100 93376 147 47875 68555 -30319
19994 -30319 -193714 -53287 81311 132861 163702 131668 27288 -21676 -101741 -144923 -114974
19983 -114974 -114617 -82094 -32431 -2758 135078 35578 -101251 -32248 116960 279340 261028
19972 261028 7702 -40923 86955 77049 51088 42379 38647 -12564 80237 -68287 -147835
19961 -147835 -142965 -78615 -218363 -241509 -202517 -60959 72319 7825 -45682 25754 -24904
$$ packed form
20038b04134P0619J34377O1824p1185j36832j80398l3701J51323P0523N798J28142
20027c644p3849l3029j34548O3225Q9512O1299J2323Q6301R5569k5795j12864
20016B4500k16453N7392J70204K7658q9288m3610P5253M2113n1543m3028p5043
20005a21845L9135J35960p1031L0001P2606J3274m724r3229M7728K0680r8874
19994c0319j63395J40427J34598N1550L0841l2034j04380m8964q0065m3182K9949
19983a14974L57L2523M9663K9673J37836r9500j36829O9003J49208J62380j8312
19972B61028k53326m8625J27878r906k5961q709l732n1211R2801j48524p9548
19961a47835M870O4350j39748k3146L8992J41558J33278o4494n3507P1436n0658
$$ plain form
19950 -24904 -105176 -234641 -161679 -25360 6977 49727 26971 192390 181268 211896 265185
19939 265185 131994 -65017 -97148 -118968 5875 -15335 -29060 -82728 50786 75930 -33843
19928 -33843 -34738 96312 208484 206286 48859 -27357 -84219 14938 147268 239118 380490
19917 380490 329552 181577 19491 22485 123052 104013 71597 155901 129269 38754 18747
19906 18747 -96670 -130467 -85503 -62830 -94905 -121681 -42084 -68996 34088 36831 -69961
19895 -69961 -206827 -114152 54669 92805 4295 18831 -19538 -17734 79195 278835 327494
19884 327494 202748 83841 80279 122901 161194 129961 90245 130441 183155 136897 69920
19873 69920 120912 177062 140779 145490 34924 -45495 24252 106808 81201 46625 -14198 -40687
$$ packed form
19950b4904q0272j29465P2962J36319L2337M2750k2756J65419j1122L0628N3289
19939B65185j33191j97011l2131k1820J24843k1210j3725n3668J33514K5144j09773
19928c3843q95J31050J12172k198j57427p6216n6862R9157J32330R1850J41372
19917C80490n0938j47975j62086K994J00567j9039l2416Q4304k6632r0515k0007
19906A8747j15417l3797M4964K2673l2075k6776P9597k6912J03084K743j06792
19895f9961j36866R2675J68821L8136q8510J4536l8369J804R6929J99640M8659
19884C27494j24746j18907l562M2622L8293l1233l9716M0196N2714m6258o6977
19873F9920N0992N6150l6283M711j10566q0419O9747Q2556k5607l4576o0823k6489
$$ plain form
19861 -40687 10394 19091 39127 -10943 -133162 -128849 -27858 86526 51526 5813 -41577
19850 -41577 -35130 7175 48176 33065 68541 154238 156441 140481 174402 271380 282460 249121
19838 249121 294251 139525 -29223 -130937 -126175 45385 54928 65680 250229 175384 -16666
19827 -16666 -84135 -11489 -171761 -128707 -87960 -88345 -52816 101286 93481 131062 138690 179083
19815 179083 263179 295925 234475 143317 35095 -79653 -226059 -176462 -2181 -24549 -56275
19804 -56275 -43637 56148 241140 371087 320245 99376 -114171 -64338 -2116 -66714 -133619
19793 -133619 -179837 -182176 -122167 -113525 -42315 -85885 -51981 -61652 -79069 -151957 -149978 -218841
19781 -218841 -221161 -213379 -158248 34775 107433 56202 47391 106674 69893 52989 -12699 64675
$$ packed form
19861d0687N1081Q697K0036n0070j22219M313J00991J14384l5000m5713m7390
19850d1577O447M2305M1001j5111L5476Q5697K203j5960L3921R6978J1080l3339
19838B49121M5130j54726j68748j01714M762J71560R543J0752J84549p4845j92050
19827a6666o7469P2646j60272M3054M0747l85L5529J54102p805L7581P628M0393
19815A79083Q4096L2746o1450r1158j08222j14748j46406M9597J74281k2368l1726
19804e6275J2638R9785J84992J29947n0842k20869k13547M9833O2222o4598o6905
19793a33619m6218k339O0009Q642P1210m3570L3904r671j7417p2888J979o8863
19781b18841k320P782N5131J93023P2658n1231q811N9283l6781j6904o5688P7374
$$ plain form
19769 64675 100992 145875 143393 69572 118419 -25600 -35494 25785 65967 63981 -45192 -71020
19757 -71020 -103344 -36923 -3833 -132217 -181302 -131101 -16500 72610 122892 76575 118803
19746 118803 77075 18770 183524 135538 57318 109972 153966 123252 -25505 -150759 -273465
19735 -273465 -252870 -273134 -272583 -155487 -203055 -153723 -117007 -114994 -2514 148129 159768
19724 159768 216162 114440 10733 -40571 59109 166705 169601 85438 57984 12506 20680
19713 20680 93007 18207 -60833 75911 64254 40639 36436 -50965 -19430 88654 89904 206513
19701 206513 180474 36535 -147468 -315902 -319872 -222026 -71518 132221 104633 27585 -19963
19690 -19963 -67512 45657 101180 48835 -76175 -122815 -214379 -107215 -38937 68101 117387
$$ packed form
19769F4675L6317M4883k482p3821M8847j44019r894O1279M0182j986j09173k5828
19757g1020l2324O6421L3090j28384m9085N0201J14601Q9110N0282m6317M2228
19746A18803m1728n8305J64754m7986p8220N2654M3994l0714j48757j25254j22706
19735b73465K0595k0264N51J17096m7568M9332L6716K013J12480J50643J1639
19724A59768N6394j01722j03707n1304R9680J07596K896q4163k7454m5478Q174
19713B0680P2327p4800p9040J36744j1657k3615m203q7401L1535J08084J250J16609
19701B06513k6039j43939j84003j68434l970R7846J50508K03739k7588p7048m7548
19690a9963m7549J13169N5523n2345j25010m6640r1564J07164O8278J07038M9286
$$ plain form
19679 117387 74596 142403 313608 228844 112228 134490 134810 168103 158631 58194 -110608
19668 -110608 -166059 -145824 -170752 -228868 -179039 -41675 -10763 23232 -13132 61398 9427
19657 9427 79369 205167 147026 153870 232186 197833 145183 32930 -118755 -117480 -85877 129892
19645 129892 220219 157282 75668 71235 95032 203456 247068 105224 -109862 -237220 -198015
19634 -198015 -72626 58069 84800 -143054 -144096 -176121 -135814 -61318 -23148 5871 -105898
19623 -105898 -203328 -258754 -142329 -215647 -274394 -273602 -249570 -191073 -180349 -165154 -191970 -57265
19611 -57265 -551 14075 -52853 26355 115179 112966 116162 86757 137768 355798 386019 329532
$$ packed form
19679A17387m2791O7807J71205q4764j16616K2262L20L3293r472j00437j68802
19668a10608n5451K0235k4928n8116M9829J37364L0912L3995l6364P4530n1971
19657I427O9942J25798n8141O844P8316l4353n2650j12253j51685J275L1603K15769
19645A29892R0327o2937q1614m433K3797J08424M3612j41844k15086j27358L9205
19634a98015J25389J30695K6731k27854j042l2025M0307P4496L8170K9019j11769
19623a05898r7430n5426J16425p3318n8747P92K4032N8497J0724J5195k6816J34705
19611e7265N6714J4626o6928P9208Q8824k213L196k9405N1011K18030L0221n6487
$$ [...]
##END NTUPLES=NMR SPECTRUM
##END=
